
##TITLE=AC1226_COLAHDE102_6540771_dcgXNF0Grt
##JCAMPDX= 6.0         $$ Bruker NMR JCAMP-DX V2.0
##DATA TYPE= NMR SPECTRUM
##DATA CLASS= NTUPLES
##ORIGIN= BRUKER
##OWNER= Administrator
$$ 1.72 TOPSPIN		Version 2.1
$$ 2012-07-18 02:26:45.062 -0500  Administrator@TOPSPIN
$$ Compression mode = diff/dup
##.OBSERVE FREQUENCY= 400.02188249412
##.OBSERVE NUCLEUS= ^1H
##.ACQUISITION MODE= SIMULTANEOUS (DQD)
##.ACQUISITION SCHEME= undefined
##.AVERAGES= 64
##.DIGITISER RES= 22
##SPECTROMETER/DATA SYSTEM= spect
##.PULSE SEQUENCE= noesygpps1d.comp
##.SOLVENT NAME= COFFEE_meoh
##.SHIFT REFERENCE= INTERNAL, COFFEE_meoh, 1, 14.96046
##AUDIT TRAIL= $$ (NUMBER, WHEN, WHO, WHERE, PROCESS, VERSION, WHAT)
$$ ##TITLE= Audit trail, TOPSPIN		Version 2.1
$$ ##JCAMPDX= 5.01
$$ ##ORIGIN= Bruker BioSpin GmbH
$$ ##OWNER= Administrator
$$ $$ C:\Bruker\TOPSPIN/data/COFFEE/nmr/AC1226_COLAHDE102_6540771_dcgXNF0Grt/12/pdata/1/auditp.txt
$$ ##AUDIT TRAIL=  $$ (NUMBER, WHEN, WHO, WHERE, PROCESS, VERSION, WHAT)
(   1,<2012-07-18 02:26:40.406 -0500>,<Administrator>,<TOPSPIN>,<go>,<TOPSPIN 2.1>,
      <created by zg
	started at 2012-07-18 02:15:10.062 -0500,
	POWCHK enabled, PULCHK disabled,
       configuration hash MD5:
       6B 1B 68 BB D9 2E 58 E2 7F 35 AD 54 07 DF 0E 41
       data hash MD5: 64K
       3C 46 94 C0 E1 34 CA 72 8C 9F 9C 72 A4 6D D3 DD>)
(   2,<2012-07-18 02:26:43.203 -0500>,<Administrator>,<TOPSPIN>,<proc1d>,<TOPSPIN 2.1>,
      <Start of raw data processing
       efp LB = 0.3 FT_mod = 6 PKNL = 1 PHC0 = 0 PHC1 = 0 SI = 128K 
       data hash MD5: 128K
       47 43 E8 E0 2F 69 50 D5 29 80 63 D2 A4 08 02 15>)
(   3,<2012-07-18 02:26:44.328 -0500>,<Administrator>,<TOPSPIN>,<proc1d>,<TOPSPIN 2.1>,
      <pk PHC0 = 3.630981 PHC1 = 0 
       data hash MD5: 128K
       42 B0 6E 2A 1E A9 A5 9D D7 DF C2 69 68 37 F4 19>)
(   4,<2012-07-18 02:26:44.562 -0500>,<Administrator>,<TOPSPIN>,<proc1d>,<TOPSPIN 2.1>,
      <abs ABSG = 1 
       data hash MD5: 128K
       2C C6 0D B0 81 A0 45 B2 18 24 63 D5 71 D8 4F 2A>)
(   5,<2012-07-18 02:26:44.625 -0500>,<Administrator>,<TOPSPIN>,<proc1d>,<TOPSPIN 2.1>,
      <abs ABSG = 2 
       data hash MD5: 128K
       26 40 94 3A 6D 29 1B 6D 37 D9 74 50 D1 2F 86 69>)
(   6,<2012-07-18 02:26:44.750 -0500>,<Administrator>,<TOPSPIN>,<proc1d>,<TOPSPIN 2.1>,
      <abs ABSG = 3 
       data hash MD5: 128K
       6D CA B4 6D 82 CF 8B BC 3F 52 AA 7F 84 CB E5 ED>)
(   7,<2012-07-18 02:26:44.921 -0500>,<Administrator>,<TOPSPIN>,<proc1d>,<TOPSPIN 2.1>,
      <abs ABSG = 4 
       data hash MD5: 128K
       13 79 5F C5 F6 9A A4 1D 76 C2 D8 2F 7E 48 2F 5E>)
(   8,<2012-07-18 02:26:44.968 -0500>,<Administrator>,<TOPSPIN>,<proc1d>,<TOPSPIN 2.1>,
      <abs ABSG = 5 
       data hash MD5: 128K
       28 AC 80 87 95 BC A0 32 F6 64 3A BD FE 62 05 A0>)
$$ ##END=
$$ 
$$ $$ hash MD5
$$ $$ 28 75 DD 6D 4D CB 46 99 95 51 8A B0 A5 75 0D 1A
##$RELAX= 
##$RELAX= 
##$RELAX= 
##$RELAX= 
##$RELAX= 
##$RELAX= 
##$RELAX= 
##$RELAX= 
$$ Bruker specific parameters
$$ [...]
##$TP07= 0
##$TPNAME0= <>
##$TPNAME1= <>
##$TPNAME2= <>
##$TPNAME3= <>
##$TPNAME4= <>
##$TPNAME5= <>
##$TPNAME6= <>
##$TPNAME7= <>
##$TPOAL= (0..7)
0.5 0.5 0.5 0.5 0.5 0.5 0.5 0.5
##$TPOFFS= (0..7)
0 0 0 0 0 0 0 0
##$TUNHIN= 0
##$TUNHOUT= 0
##$TUNXOUT= 0
##$USERA1= <user>
##$USERA2= <user>
##$USERA3= <user>
##$USERA4= <user>
##$USERA5= <user>
##$V9= 5
##$VALIST= <valist>
##$VCLIST= <CCCCCCCCCCCCCCC>
##$VD= 0
##$VDLIST= <DDDDDDDDDDDDDDD>
##$VPLIST= <PPPPPPPPPPPPPPP>
##$VTLIST= <TTTTTTTTTTTTTTT>
##$WBST= 2048
##$WBSW= 25
##$XGAIN= (0..3)
0 0 0 0
##$XL= 0
##$YL= 0
##$YMAX_a= 11086326
##$YMIN_a= -8387936
##$ZGOPTNS= <>
##$ZL1= 120
##$ZL2= 120
##$ZL3= 120
##$ZL4= 120
##$ABSF1= 14.96046
##$ABSF2= -5.597722
##$ABSG= 5
##$ABSL= 3
##$ALPHA= 0
##$AQORDER= 0
##$ASSFAC= 0
##$ASSFACI= 0
##$ASSFACX= 0
##$ASSWID= 0
##$AUNMP= <proc_prof1d_extract.lims>
##$AXLEFT= 0
##$AXNAME= <>
##$AXNUC= <1H>
##$AXRIGHT= 0
##$AXTYPE= 0
##$AXUNIT= <>
##$AZFE= 0.1
##$AZFW= 0.1
##$BCFW= 0
##$BC_mod= 0
##$BYTORDP= 0
##$COROFFS= 0
##$CY= 15
##$DATMOD= 1
##$DC= 0
##$DFILT= <>
##$DTYPP= 0
##$F1P= 0
##$F2P= 0
##$FCOR= 0.5
##$FTSIZE= 131072
##$FT_mod= 6
##$GAMMA= 0
##$GB= 0
##$INTBC= 1
##$INTSCL= 1
##$ISEN= 128
##$LB= 0.3
##$LEV0= 0
##$LPBIN= 0
##$MAXI= 10000
##$MC2= 0
##$MEAN= 0
##$ME_mod= 0
##$MI= 0
##$NCOEF= 0
##$NC_proc= -2
##$NLEV= 6
##$NOISF1= 0
##$NOISF2= 0
##$NSP= 0
##$NTH_PI= 0
##$NZP= 0
##$OFFSET= 14.96046
##$PC= 1
##$PHC0= 3.630981
##$PHC1= 0
##$PH_mod= 1
##$PKNL= yes
##$PPARMOD= 0
##$PPDIAG= 0
##$PPIPTYP= 0
##$PPMPNUM= 2147483647
##$PPRESOL= 1
##$PSCAL= 4
##$PSIGN= 0
##$PYNMP= <proc.py>
##$REVERSE= no
##$SF= 400.020009854369
##$SI= 131072
##$SIGF1= 0
##$SIGF2= 0
##$SINO= 400
##$SIOLD= 131072
##$SPECTYP= <>
##$SREGLST= <1H.CDCl3>
##$SSB= 0
##$STSI= 131072
##$STSR= 0
##$SW_p= 8223.68421052631
##$SYMM= 0
##$S_DEV= 0
##$TDeff= 65536
##$TDoff= 0
##$TI= <>
##$TILT= no
##$TM1= 0
##$TM2= 0
##$TOPLEV= 0
##$USERP1= <user>
##$USERP2= <user>
##$USERP3= <user>
##$USERP4= <user>
##$USERP5= <user>
##$WDW= 1
##$XDIM= 131072
##$YMAX_p= 410663524
##$YMIN_p= -11888
##$CURPLOT= <Network HP LaserJet P1505>
##$CURPRIN= <$Network HP LaserJet P1505>
##$DFORMAT= <normdp>
##$LAYOUT= <+/1D_H.xwp>
##$LFORMAT= <normlp>
##$PFORMAT= <normpl>
##$SURQMSG= 1
$$ End of Bruker specific parameters
$$ ---------------------------------
##NTUPLES= NMR SPECTRUM
##VAR_NAME=  FREQUENCY,     SPECTRUM/REAL,   SPECTRUM/IMAG
##SYMBOL=    X,             R,               I
##VAR_TYPE=  INDEPENDENT,   DEPENDENT,       DEPENDENT
##VAR_FORM=  AFFN,          ASDF,            ASDF
##VAR_DIM=   131072,        131072,          131072
##UNITS=     HZ,            ARBITRARY UNITS, ARBITRARY UNITS
##FACTOR=    0.0627417313425164, 1,          1
##FIRST=     8223.62146879497, -606,         -50344
##LAST=      0,             -268,            -50733
##MIN=       0,             -11888,          0
##MAX=       8223.62146879497, 410663524,    0
$$ Real data points
##PAGE= N=1
##DATA TABLE= (X++(R..R)), XYDATA
$$ [...]
$$ plain form
61701 436792 432673 427911 423125 418791 415091 411960 409154 406317 403149 399739 396663 394482 392995 391197
61687 391197 388240 384390 380774 378182 376295 374222 371598 368899 366623 364436 361417 357156 352386 348297
61673 348297 345411 343348 341600 340134 339063 338119 336888 335450 334418 334252 334829 335811 337109 338741 340487
61658 340487 342092 343753 346003 349003 352315 355599 359177 363520 368377 372872 376390 378857 380199 380164 379026
61643 379026 377928 378005 379383 381414 383584 385703 387555 389081 390872 393699 397333 400457 402081 402527 402665
61628 402665 402680 402160 401012 399486 397351 393812 388582 382605 377284 373164 369735 366461 363568 361633 360703
61613 360703 360231 359795 359397 358897 357577 354764 350690 346224 341762 336828 330876 324078 317134 310590 304550
61598 304550 298872 293420 288291 283813 280194 277151 274198 271260 268605 266166 263498 260605 258253 257022
$$ packed form
61701D36792m119m762m786m334l700l131k806k837l168l410l076k181j487j798
61687C91197k957l850l616k592j887k073k624k699k276k187l019m261m770m089
61673C48297k886k063j748j466j071r44j231j438j032j66N77R82J298J632J746
61658C40487J605J661K250L000L312L284L578M343M857M495L518K467J342l5j138
61643C79026j098P7J378K031K170K119J852J526J791K827L634L124J624M46J38
61628D02665J5n20j148j526k135l539n230n977n321m120l429l274k893j935r30
61613C60703m72m36l98n00j320k813m074m466m462m934n952o798o944o544o040
61598C04550n678n452n129m478l619l043k953k938k655k439k668k893k352j231
$$ plain form
61584 257022 256505 255893 254942 253859 252611 251031 249452 248518 248312 248200 247608 246496 245048 243397 241767 240455
61568 240455 239511 238747 238136 237867 237973 238282 238859 240074 242027 244240 246156 247720 249258 251032 253079 255344
61552 255344 257713 260006 262040 263671 264852 265787 266896 268348 269738 270619 271279 272428 274015 274980 274559
61537 274559 273345 272523 272418 272415 272195 272340 273497 275414 277149 278040 278176 277954 277550 276934 276157 275239 273826 271469
61519 271469 268533 266355 265947 266673 266824 265486 263233 260919 258670 256499 255159 255502 257259 259292 260966
61504 260966 262586 264462 266242 267466 268189 268691 268983 269037 269268 270315 272335 274821 277155 279177 281193 283557
61488 283557 286247 288855 291022 292874 294825 296944 298832 300314 301938 304410 307716 311321 315102 319418
61474 319418 324041 327714 329308 329088 328242 327383 326148 324190 321838 319567 317410 315246 313208 311395 309535
$$ packed form
61584B57022n17o12r51j083j248j580j579r34k06j12n92j112j448j651j630j312
61568B40455r44p64o11k69J06L09N77J215J953K213J916J564J538J774K047K265
61552B55344K369K293K034J631J181R35J109J452J390Q81O60J149J587R65m21
61537B74559j214q22j05lk20J45J157J917J735Q91J36k22m04o16p77r18j413k357
61519B71469k936k178m08P26J51j338k253k314k249k171j340L43J757K033J674
61504B60966J620J876J780J224P23N02K92N4K31J047K020K486K334K022K016K364
61488B83557K690K608K167J852J951K119J888J482J624K472L306L605L781M316
61474C19418M623L673J594k20q46q59j235j958k352k271k157k164k038j813j860
$$ plain form
61459 309535 307415 305397 303973 302900 301306 298782 296015 294156 293707 294086 294148 293149 291301 289418 288052
61444 288052 287230 287087 288262 291182 295242 299223 302441 304995 307027 308471 309608 311186 313604 316429 319078
61429 319078 321604 324411 327487 330274 332218 333197 333548 333797 334243 334704 334887 334976 335466 336404 337356 338291 339824
61412 339824 342077 343933 344181 343076 341991 341696 341757 341581 341168 340544 339224 336782 333577 330439 327842 325730
61396 325730 323969 322616 321777 321486 321711 322372 323345 324538 325890 327259 328471 329556 330776 332300 333967
61381 333967 335554 337200 339369 342411 346231 350407 354542 358545 362614 366890 371089 374610 377123 378977
61367 378977 380815 382800 384390 384920 384251 382785 380971 378978 376809 374543 372348 370298 368310 366343 364666
61352 364666 363818 364236 365942 368703 372405 377056 382343 387475 391682 394794 397034 398389 398641 398080 397741
$$ packed form
61459C09535k120k018j424j073j594k524k767j859m49L79O2r99j848j883j366
61444B88052q22j43J175K920M060L981L218K554K032J444J137J578K418K825K649
61429C19078K526K807L076K787J944R79L51K49M46M61J83Q9M90R38R52R35J533
61412C39824K253J856K48j105j085k95O1j76m13o24j320k442l205l138k597k112
61396C25730j761j353q39k91K25O61R73J193J352J369J212J085J220J524J667
61381C33967J587J646K169L042L820M176M135M003M069M276M199L521K513J854
61367C78977J838J985J590N30o69j466j814j993k169k266k195k050j988j967j677
61352C64666q48M18J706K761L702M651N287N132M207L112K240J355K52n61l39
$$ plain form
61337 397741 398563 400534 402950 405289 407488 409515 411239 412768 414461 416334 417695 417699 416152 413622 410825
61322 410825 408090 405451 403117 401722 401936 403729 406164 408143 409454 410948 413705 418105 423704 429806
61308 429806 436067 442728 450369 459454 470113 482265 495639 509430 522217 532719 540697 546815 551591
61295 551591 554805 555897 554543 550777 545020 538127 530933 523523 515347 506247 496932 488153 479923 471961
61281 471961 464449 457791 451949 446695 442325 439456 438125 437673 437533 437640 438054 438711 439655 441014 442611 444073
61265 444073 445438 447165 449353 451473 453261 455403 458882 463916 469904 476150 482105 487145 490719 492858
61251 492858 494169 495236 496307 497516 498949 500388 501439 502162 503214 504969 506733 507249 505966 503448 500547
61236 500547 497600 494536 491355 488158 484859 481242 477368 473751 471144 470142 470907 473072 475920 478824
$$ packed form
61337C97741Q22J971K416K339K199K027J724J529J693J873J361Mj547k530k797
61322D10825k735k639k334j395K14J793K435J979J311J494K757M400N599O102
61308D29806O261O661P641R085J0659J2152J3374J3791J2787J0502P978O118M776
61295E51591L214J092j354l766n757o893p194p410q176r100r315q779q230p962
61281D71961p512o658n842n254m370k869j331m52j40J07M14O57R44J359J597J462
61265D44073J365J727K188K120J788K142L479N034N988O246N955N040L574K139
61251D92858J311J067J071J209J433J439J051P23J052J755J764N16j283k518k901
61236E00547k947l064l181l197l299l617l874l617k607j002P65K165K848K904
$$ plain form
61222 478824 481638 484664 488308 492711 497539 502058 505637 508368 511087 514660 519336 524818 530612 536086
61208 536086 540540 543723 546132 548381 550456 552006 553182 554612 556658 559358 563093 568540 575752 584007
61194 584007 592827 602489 613195 624429 635561 646339 656181 663667 667673 668632 667912 666247 663597 660244
61180 660244 656959 654041 651061 647706 644061 639899 634533 627818 620626 613863 607527 601196 594967 589309
61166 589309 584230 579146 573528 567278 560530 553419 546057 538452 530391 521665 512518 503726 496142 490148
61152 490148 485547 481919 478981 476669 475076 474455 475102 476815 478428 478284 475461 470299 463612 455837 447318
61137 447318 438942 431761 426109 421670 418390 416563 415994 415775 415257 414750 414946 416116 418179 421127 424912
61122 424912 429248 434030 439857 447690 457919 470012 483088 496703 511074 526633 543405 560895
$$ packed form
61222D78824K814L026L644M403M828M519L579K731K719L573M676N482N794N474
61208E36086M454L183K409K249K075J550J176J430K046K700L735N447P212Q255
61194E84007Q820R662J0706J1234J1132J0778R842P486M006R59p20j665k650l353
61180F60244l285k918k980l355l645m162n366o715p192o763o336o331o229n658
61166E89309n079n084n618o250o748p111p362p605q061q726r147q792p584n994
61152D90148m601l628k938k312j593o21O47J713J613j44k823n162o687p775q519
61137D47318q376p181n652m439l280j827n69k19n18n07J96J170K063K948L785
61122D24912M336M782N827P833J0229J2093J3076J3615J4371J5559J6772J7490
$$ plain form
61110 560895 578628 596608 614962 633256 650686 667072 683227 700023 717265 733695 747916
61099 747916 759127 767250 772627 775594 776244 774665 771294 766677 760837 753286 743808 732829 720900 708280
61085 708280 695342 682830 671179 659966 648578 637252 626866 617913 610270 603907 599171 596241
61073 596241 594838 594675 595779 598223 601956 607150 614362 624017 635909 649438 664174 680041 697189
61060 697189 715937 736665 759534 784392 811155 840086 871381 904547 938535 972538 1006372
61049 1006372 1039932 1072552 1103136 1130747 1154823 1174939 1190695 1201864 1208372 1210078 1206847 1199023
61037 1199023 1187573 1173477 1157141 1138617 1118310 1097192 1076372 1056667 1038550 1022161 1007346
61026 1007346 993942 982194 972816 966632 964307 966325 973025 984705 1001998 1026194 1059058 1102584
$$ packed form
61110E60895J7733J7980J8354J8294J7430J6386J6155J6796J7242J6430J4221
61099G47916J1211Q123N377K967O50j579l371m617n840p551r478j0979j1929j2620
61085G08280j2938j2512j1651j1213j1388j1326j0386q953p643o363m736k930
61073E96241j403j63J104K444L733N194P212R655J1892J3529J4736J5867J7148
61060F97189J8748K0728K2869K4858K6763K8931L1295L3166L3988L4003L3834
61049A006372L3560L2620L0584K7611K4076K0116J5756J1169O508J706l231p824
61037A199023j1450j4096j6336j8524k0307k1118k0820j9705j8117j6389j4815
61026A007346j3404j1748r378o184k325K018O700J1680J7293K4196L2864M3526
$$ plain form
61014 1102584 1159480 1233917 1331243 1456555 1612951 1798904 2003600 2203033 2363709 2456661
61004 2456661 2473439 2430996 2361681 2297944 2263039 2268627 2312702 2376199 2425048 2422854 2348304 2204658
60992 2204658 2014944 1808382 1608529 1428879 1274452 1145263 1038979 952231 881181 822217
60982 822217 772853 731922 698571 671211 647880 627410 609616 594291 580669 568102 556596
60971 556596 546188 536240 525854 514778 503505 492754 483239 475548 469600 464366 458744 452719 447160
60958 447160 442494 438236 433909 429771 426246 423197 420279 417719 416204 416024 416696 417522 418317 419564 421983
60943 421983 425914 430961 436301 441383 446269 451202 456074 460483 464127 466830 468282 468172 466646 464279
60929 464279 461447 458047 454049 449991 446540 443744 441114 438430 436056 434414 433539 433253 433387 433606 433380
$$ packed form
61014A102584N6896P4437R7326J25312J56396J85953K04696J99433J60676R2952
61004B456661J6778m2443o9315o3737l4905N588M4075O3497M8849k194p4550j43646
60992B204658j89714k06562j99853j79650j54427j29189j06284q6748p1050n8964
60982H22217m9364m0931l3351k7360k3331k0470j7794j5325j3622j2567j1506
60971E56596j0408r948j0386j1076j1273j0751r515p691n948n234n622o025n559
60958D47160m666m258m327m138l525l049k918k560j515j80O72Q26P95J247K419
60943D21983L931N047N340N082M886M933M872M409L644K703J452j10j526k367
60929D64279k832l400l998m058l451k796k630k684k374j642q75k86J34K19k26
$$ plain form
60914 433380 432471 431239 430165 429265 428312 427400 426860 426708 426683 426859 427713 429414 431432 433141 434499 435929 437737
60897 437737 439887 442131 444093 445393 445925 445910 445455 444123 441214 436460 430318 423616 416987 410505 403689
60882 403689 395915 387082 377945 369693 363084 357964 353531 349066 344479 340261 336949 334640 333122 332336
60868 332336 332462 333468 334837 335928 336534 336938 337575 338799 340882 343972 347946 352371 356679 360459 363668
60853 363668 366609 369608 372723 375866 379133 382792 386872 390987 394717 398008 401095 404153 407172 410029
60839 410029 412525 414376 415284 414991 413300 410194 405973 401146 396144 391303 387113 384117 382395 381294 379877
60824 379877 377536 374145 369963 365560 361557 358102 354728 350929 346741 342531 338453 334422 330399 326320
60810 326320 321855 316725 311328 306632 303220 300681 298140 295249 292486 290600 289915 290099 290377 289959 288466
$$ packed form
60914D33380r09j232j074r00r53r12n40j52k5J76Q54J701K018J709J358J430J808
60897D37737K150K244J962J300N32j5m55j332k909m754o142o702o629o482o816
60882D03689p774q833r137q252o609n120m433m465m587m218l312k309j518p86
60868C32336J26J006J369J091O06M04O37J224K083L090L974M425M308L780L209
60853C63668K941K999L115L143L267L659M080M115L730L291L087L058L019K857
60839D10029K496J851R08k93j691l106m221m827n002m841m190k996j722j101j417
60824C79877k341l391m182m403m003l455l374l799m188m210m078m031m023m079
60810C26320m465n130n397m696l412k539k541k891k763j886o85J84K78m18j493
$$ plain form
60795 288466 286213 284090 282979 283111 284011 285098 286198 287400 288692 290058 291820 294408 297764 301335 304701
60780 304701 307917 311191 314637 318450 322812 327360 331191 333788 335633 337508 339482 340979 341584 341254 339869
60765 339869 337206 333546 329860 327077 325259 323596 321238 318110 314870 312028 309276 305997 302376 299493
60751 299493 298094 297735 297424 296808 296308 296413 297248 298676 300439 302322 304364 306634 308527 308797 306806 303383
60735 303383 299862 296546 292830 288598 284596 281399 278831 276685 275327 275185 276015 277028 277492 277102 276069
60720 276069 275046 274703 275201 276259 277651 279338 281212 283151 285301 287794 290234 292065 293551 295711 298976
60705 298976 302545 305466 307813 310310 313210 316152 318882 321521 324188 326803 329213 331164 332178 331833
60691 331833 330210 327799 324923 321524 317570 313433 309701 306703 304290 302046 299637 297065 294709 293134
$$ packed form
60795B88466k253k123j111J32R00J087J100J202J292J366J762K588L356L571L366
60780C04701L216L274L446L813M362M548L831K597J845J875J974J497O05l30j385
60765C39869k663l660l686k783j818j663k358l128l240k842k752l279l621k883
60751B99493j399l59l11o16n00J05Q35J428J763J883K042K270J893K70j991l423
60735C03383l521l316l716m232m002l197k568k146j358j42Q30J013M64l90j033
60720B76069j023l43M98J058J392J687J874J939K150K493K440J831J486K160L265
60705B98976L569K921K347K497K900K942K730K639K667K615K410J951J014l45
60691C31833j623k411k876l399l954m137l732k998k413k244k409k572k356j575
$$ plain form
60677 293134 292700 293177 293886 294418 295169 296736 298760 299844 298989 296688 294190 292067 290115 288291 286867 285675
60661 285675 284107 282129 280574 280034 280089 280039 279840 279858 280185 280798 282032 284231 287140 290176 293195 296472 299997
60644 299997 303314 306061 308201 309670 310250 309896 308810 307050 304420 300926 297048 293400 290336 288058 286796
60629 286796 286534 286753 286812 286582 286420 286517 286664 286814 287495 289245 291749 293924 294873 294492 293220 291666 290565
60612 290565 290519 291344 291980 291539 290285 289224 288908 289082 289365 289707 290201 290962 292295 294505 297342 300016 301942
60595 301942 303184 304036 304523 304547 304259 303955 303722 303400 302890 302437 302571 303646 305339 306818 307739 308825 311062
60578 311062 314481 318330 322391 327468 334362 342984 352717 363088 373750 384284 394411 403992 412471
60565 412471 418752 422044 422516 420780 417146 411905 405902 400178 395160 390728 386926 384075 382300 381552 382151
$$ packed form
60677B93134m34M77P09N32P51J567K024J084q55k301k498k123j952j824j424j192
60661B85675j568j978j555n40N5n0j99J8L27O13J234K199K909L036L019L277L525
60644B99997L317K747K140J469N80l54j086j760k630l494l878l648l064k278j262
60629B86796k62K19N9k30j62R7J47J50O81J750K504K175R49l81j272j554j101
60612B90565m6Q25O36m41j254j061l16J74K83L42M94P61J333K210K837K674J926
60595C01942J242Q52M87K4k88l04k33l22n10m53J34J075J693J479R21J086K237
60578C11062L419L849M061N077O894Q622R733J0371J0662J0534J0127R581Q479
60565D12471O281L292M72j736l634n241o003n724n018m432l802k851j775p48N99
$$ plain form
60550 382151 384835 390103 397867 407840 419962 434325 450958 469735 490239 511590 532564 551917
60538 551917 568515 581242 589200 592089 590253 584313 575016 563546 551578 540598 531057 522400 513964
60525 513964 505660 497726 490170 482910 476374 471382 468151 465903 463980 462972 464091 467572 472530 478419
60511 478419 485792 495299 506762 519921 535540 554985 578942 607154 639187 674709 713060 753263
60499 753263 794741 837462 881034 923892 963682 998299 1026304 1046452 1057147 1056552 1043335 1017467
60487 1017467 980518 935362 885401 833547 781569 730475 681590 636915 597995 564708 535743
60476 535743 510176 487961 468974 452467 437808 425022 414167 404724 396157 388539 382106 376555
60464 376555 371355 366425 361962 357928 354216 351017 348383 345774 342713 339671 337569 336475 335481 333837
$$ packed form
60550C82151K684N268P764R973J2122J4363J6633J8777K0504K1351K0974J9353
60538E51917J6598J2727P958K889j836n940r297j1470j1968j0980r541q657q436
60525E13964q304p934p556p260o536m992l231k248j923j008J119L481M958N889
60511D78419P373R507J1463J3159J5619J9445K3957K8212L2033L5522L8351M0203
60499G53263M1478M2721M3572M2858L9790L4617K8005K0148J0695n95j3217k5868
60487A017467l6949m5156m9961n1854n1978n1094m8885m4675l8920l3287k8965
60476E35743k5567k2215j8987j6507j4659j2786j0855r443q567p618o433n551
60464C76555n200m930m463m034l712l199k634k609l061l042k102j094r94j644
$$ plain form
60450 333837 331498 328635 325322 321895 318918 316510 314252 311965 310050 308765 307701 306342 304817 303681
60436 303681 303157 302949 302658 302127 301439 300774 300235 299743 299176 298645 298494 298982 300019 301212 302084 302410 302524 303166
60418 303166 304722 306688 308195 308974 309483 310110 310713 311051 311245 311586 312133 312729 313191 313294 312855 312117 311910 313083
60400 313083 315725 319109 322446 325507 328421 331092 333160 334556 335750 337218 338918 340578 342241 344011
60386 344011 345479 346194 346794 348829 352963 357993 362233 365399 368430 371879 375309 378232 380777 383325 385999
60371 385999 388699 391244 393408 395099 396478 397628 398277 398274 398175 398795 400264 402083 404101 406793 410504 414993
60355 414993 419905 425184 430790 436352 441319 445187 447528 448190 447572 446365 444954 443299 441327 439076 436537
60340 436537 433870 431668 430392 429511 427842 424882 421247 417711 414449 411358 408408 405375 401959 398563
$$ packed form
60450C33837k339k863l313l427k977k408k258k287j915j285j064j359j525j136
60436C03681n24k08k91n31o88o65n39m92n67n31j51M88J037J193Q72L26J14O42
60418C03166J556J966J507P79N09O27O03L38J94L41N47N96M62J03m39p38k07J173
60400C13083K642L384L337L061K914K671K068J396J194J468J700J660J663J770
60386C44011J468P15O00K035M134N030M240L166L031L449L430K923K545K548K674
60371C85999K700K545K164J691J379J150O49lr9O20J469J819K018K692L711M489
60355D14993M912N279N606N562M967L868K341O62o18j207j411j655j972k251k539
60340D36537k667k202j276q81j669k960l635l536l262l091k950l033l416l396
$$ plain form
60326 398563 396282 395597 395645 395346 394771 394739 395498 396599 397916 400071 403701 408692 414306 419919 425699 432616
60310 432616 441534 452184 463433 474727 486690 499769 512734 523241 529680 531852 529933 523626
60298 523626 512679 497807 480716 463348 447172 432978 421048 411447 404064 398425 393807 389851
60286 389851 386939 385586 385480 385525 384913 383860 383103 382985 383307 383881 384813 386185 387737 389084 390069 390674 390666 389659
60268 389659 387563 384654 381106 376833 372053 367645 364449 362351 360520 358465 356421 354755 353552 352828
60254 352828 352621 352618 352169 351008 349670 348868 348669 348580 348359 348505 349882 352815 356495 359491 361123 362164 363799
60237 363799 366112 368180 369504 370516 371443 371628 370519 368724 367365 366787 366582 366619 367346 369056 371411 373815
60221 373815 375977 378103 380726 384235 388356 392320 395788 399278 403353 407720 411706 415436 419875 425592
$$ packed form
60326C98563k281o85M8k99n75l2P59J101J317K155L630M991N614N613N780O917
60310D32616Q918J0650J1249J1294J1963J3079J2965J0507O439K172j919o307
60298E23626j0947j4872j7091j7368j6176j4194j1930r601p383n639m618l956
60286C89851k912j353j06M5o12j053p57j18L22N74R32J372J552J347R85O05qj007
60268C89659k096k909l548m273m780m408l196k098j831k055k044j666j203p24
60254C52828k07lm49j161j338q02j99q9k21J46J377K933L680K996J632J041J635
60237C63799K313K068J324J012R27J85j109j795j359n78k05L7P27J710K355K404
60221C73815K162K126K623L509M121L964L468L490M075M367L986L730M439N717
$$ plain form
60207 425592 432068 438414 444394 450459 457066 464235 471655 478984 486054 492891 499574 506032 511955 516945
60193 516945 520840 524022 527255 531010 534949 538286 540648 542272 543343 543597 542776 541113 538982 536349 532933
60178 532933 528833 524614 520806 517486 514377 511142 507597 503787 499884 496066 492533 489514 487029 484727
60164 484727 482255 479720 477405 475132 472420 469310 466424 463989 461548 458951 456956 456231 456308 456182 455560
60149 455560 454861 454331 453945 453979 454878 456474 458022 459117 460087 461420 463256 465513 468094 470839 473638 476649
60133 476649 480107 483947 487961 492300 497372 503160 508976 513980 517712 520120 521470 522221 522741 523109 523396
60118 523396 523953 525071 526493 527739 528898 530639 533443 537215 541578 546040 549891 552584 554437 556441
60104 556441 559119 562014 564477 566434 568091 569330 569906 569942 569729 569206 568022 566069 563600 560823 557671
$$ packed form
60207D25592O476O346N980O065O607P169P420P329P070O837O683O458N923M990
60193E16945L895L182L233L755L939L337K362J624J071K54q21j663k131k633l416
60178E32933m100m219l808l320l109l235l545l810l903l818l533l019k485k302
60164D84727k472k535k315k273k712l110k886k435k441k597j995p25P7j26o22
60149D55560o99n30l86L4Q99J596J548J095R70J333J836K257K581K745K799L011
60133D76649L458L840M014M339N072N788N816N004L732K408J350P51N20L68K87
60118E23396N57J118J422J246J159J741K804L772M363M462L851K693J853K004
60104E56441K678K895K463J957J657J239N76L6k13n23j184j953k469k777l152
$$ plain form
60089 557671 554090 550430 547326 545089 543218 540721 537135 533110 529704 527192 524959 522580 520472 519200
60075 519200 518547 517728 516349 514658 512819 510388 506797 502146 497201 492519 487833 482469 476308 470021 464339
60060 464339 459336 454609 449896 445296 440973 436929 433046 429235 425589 422543 420646 420001 420124 420595 421617
60045 421617 423598 426411 429493 432558 435712 438992 442328 445960 450250 454975 459368 463086 466600 470371
60031 470371 474149 477475 480371 483013 485064 485938 485584 484484 482882 480472 476881 472126 466498 460264 453594
60016 453594 446566 439168 431452 423735 416486 409927 403871 397980 392160 386641 381768 377704 374332 371455
60002 371455 369081 367360 366175 365051 363731 362703 362760 363998 365561 366553 366896 367121 367614 368439 369688 371512
59986 371512 373731 375848 377674 379627 382240 385568 389243 392894 396275 399258 401987 404848 407932 410657
$$ packed form
60089E57671l581l660l104k237j871k497l586m025l406k512k233k379k108j272
60075E19200o53q19j379j691j839k431l591m651m945m682m686n364o161o287n682
60060D64339n003m727m713m600m323m044l883l811l646l046j897o45J23M71J022
60045D21617J981K813L082L065L154L280L336L632M290M725M393L718L514L771
60031D70371L778L326K896K642K051Q74l54j100j602k410l591m755n628o234o670
60016D53594p028p398p716p717p249o559o056n891n820n519m873m064l372k877
60002C71455k374j721j185j124j320j028N7J238J563R92L43K25M93Q25J249J824
59986C71512K219K117J826J953K613L328L675L651L381K983K729K861L084K725
$$ plain form
59972 410657 412246 412487 411728 410318 408435 406338 404268 402134 399754 397391 395536 394173 392807 391275 389961
59957 389961 389130 388741 389066 390662 393411 396293 398573 400502 402326 403445 403350 402726 402643 403087 403298 403218 403484
59940 403484 404101 404280 403781 403415 403820 404525 404666 404014 402935 401879 401346 401952 404098 407715 412562 418548 425657
59923 425657 433753 442423 450759 457369 461155 462137 461154 458826 455376 451456 448327 446857 446887 447897 449790
59908 449790 452586 455851 458948 461641 464031 466111 467718 468742 469092 468637 467461 465979 464477 462650 459976
59893 459976 456539 453208 450917 449888 449688 449989 451147 453823 458059 463006 467710 471883 475718 479388 483225
59878 483225 487988 494212 501311 507991 513548 518178 522024 524743 526191 526803 526966 526597 525672 524535 523340
59863 523340 521745 519633 517638 516397 515681 514766 513443 512202 511609 511846 512663 513505 513905 513969 514168 514497 514283
$$ packed form
59972D10657J589K41p59j410j883k097k070k134k380k363j855j363j366j532j314
59957C89961q31l89L25J596K749K882K280J929J824J119r5o24q3M44K11q0K66
59940D03484O17J79m99l66M05P05J41o52j079j056n33O06K146L617M847N986P109
59923D25657Q096Q670Q336O610L786R82r83k328l450l920l129j470L0J010J893
59908D49790K796L265L097K693K390K080J607J024L50m55j176j482j502j827k674
59893D59976l437l331k291j029k00L01J158K676M236M947M704M173L835L670L837
59878D83225M763O224P099O680N557M630L846K719J448O12J63l69r25j137j195
59863E23340j595k112j995j241p16r15j323j241n93K37Q17Q42M00O4J99L29k14
$$ plain form
59846 514283 513069 511218 509282 507247 504811 501926 498564 494407 489411 484337 480087 476704 473640 470801
59832 470801 468725 467844 468121 469322 471137 473121 475105 477595 481190 485569 489567 492285 493600 493602 492128
59817 492128 489161 485276 481406 478335 476457 475745 475869 476615 478221 480964 484396 487386 489110 489722 489919
59802 489919 490178 490627 491317 492237 493133 493610 493510 492997 492213 491015 489202 486985 485007 483741 482977 482046 480439
59785 480439 477982 474566 470201 465374 460958 457430 454478 451518 448363 445174 442111 439338 437074 435358
59771 435358 433981 433000 432987 434372 436761 439340 441843 444618 447853 451241 454491 457815 461695 466381 471652
59756 471652 476998 482106 487295 493301 500477 508412 516597 525219 534892 545773 557288 568600 578976
59743 578976 587897 595293 601665 607546 612850 617143 620450 623260 625664 627061 626965 625717 624158 622841 621746
$$ packed form
59846E14283j214j851j936k035k436k885l362m157m996n074m250l383l064k839
59832D70801k076q81K77J201J815J984J984K490L595M379L998K718J315Kj474
59817D92128k967l885l870l071j878p12J24P46J606K743L432K990J724O12J97
59802D89919K59M49O90R20Q96M77j00n13p84j198j813k217j978j266p64r31j607
59785D80439k457l416m365m827m416l528k952k960l155l189l063k773k264j716
59771D35358j377r81j3J385K389K579K503K775L235L388L250L324L880M686N271
59756D71652N346N108N189O006P176P935Q185Q622R673J0881J1515J1312J0376
59743E78976Q921P396O372N881N304M293L307K810K404J397r6j248j559j317j095
$$ plain form
59728 621746 620535 618848 616533 613778 611039 608795 607327 606477 605489 603360 599749 595412 591417 588088 585145
59713 585145 582588 580763 579573 578406 577062 576172 576380 577640 579602 582135 585108 588212 591563 596058 602448
59698 602448 610292 618395 626117 633686 641471 649667 658693 669021 680204 690581 698368 702788 704026
59685 704026 702641 699535 696051 693352 691566 689909 687601 684320 679901 674177 667317 659902 652428 644986
59671 644986 637525 630084 622634 615153 608123 602431 598278 594636 590455 586181 583335 582604 583097 583629 584143
59656 584143 585525 588483 592911 598062 603146 608000 613249 619459 626100 631845 636018 639139 641804 643679
59642 643679 644044 642783 640191 636227 630610 623488 615442 606892 597914 588564 579008 569466 560339 552214
59628 552214 545372 539536 534390 530016 526335 522536 517731 512029 506255 500657 494563 487391 479407 471295
$$ packed form
59728F21746j211j687k315k755k739k244j468q50r88k129l611m337l995l329k943
59713E85145k557j825j190j167j344q90K08J260J962K533K973L104L351M495O390
59698F02448P844Q103P722P569P785Q196R026J0328J1183J0377P787M420J238
59685G04026j385l106l484k699j786j657k308l281m419n724o860p415p474p442
59671F44986p461p441p450p481p030n692m153l642m181m274k846p31M93N32N14
59656E84143J382K958M428N151N084M854N249O210O641N745M173L121K665J875
59642F43679L65j261k592l964n617p122q046q550q978r350r556r542r127q125
59628E52214o842n836n146m374l681l799m805n702n774n598o094p172p984q112
$$ plain form
59614 471295 463522 456301 449797 444148 439527 436195 434181 432984 432027 431383 431561 432520 433412 433493 432883 432245
59598 432245 432068 432396 432934 433277 433347 433659 434814 436682 438502 439840 440992 442249 443350 443965 444276 444617 444825
59581 444825 444372 443051 441192 439349 437943 437064 436304 434943 432590 429656 427006 425131 423798 422492 421045
59566 421045 419709 418646 417503 415730 413381 411327 410406 410519 410858 410875 410680 410555 410525 410530 410729 411442 412901 415072
59548 415072 417619 420219 423141 427282 433204 440373 447827 455499 464332 475282 488983 506218 527368
59535 527368 550532 570889 583012 584232 575866 561818 546381 532685 522071 514447 509363 506749
59523 506749 506617 508444 511228 513973 515954 516831 516971 517328 518454 519623 519385 517022 513104 508628 504015
59508 504015 499014 493260 486732 479851 473239 467267 461810 456488 451130 445920 441201 437318 434555 432932
$$ packed form
59614D71295p773p221o504n649m621l332k014j197r57o44J78R59Q92Q1o10o38
59598D32245j77L28N38L43P0L12J155J868J820J338J152J257J101O15L11L41K08
59581D44825m53j321j859j843j406q79p60j361k353k934k650j875j333j306j447
59566D21045j336j063j143j773k349k054r21J13L39J7j95j25l0NJ99P13J459K171
59548D15072K547K600K922M141N922P169P454P672Q833J0950J3701J7235K1150
59535E27368K3164K0357J2123J220q366j4048j5437j3696j0614p624n084k614
59523E06749j32J827K784K745J981Q77J40L57J126J169k38k363l918m476m613
59508E04015n001n754o528o881o612n972n457n322n358n210m719l883k763j623
$$ plain form
59494 432932 432056 431374 430672 430204 430312 431040 432183 433648 435656 438498 442015 445429 447983 449810 451954 455370
59478 455370 460154 465880 472327 479421 486676 493264 498756 503378 507334 510226 511397 510690 508692 506302
59464 506302 504194 502516 500954 499206 497538 496734 497296 498834 500525 502120 504190 507368 511719 516968 522963
59449 522963 529607 536571 543487 550269 556893 562880 567400 569885 570180 568158 563725 557407 550442 543921
59435 543921 538085 532673 527564 522688 517647 511990 505821 499767 494484 490542 488586 489000 491338 494558
59421 494558 498101 502510 508831 517583 528441 540853 554800 571026 590650 614719 643949 677931
59409 677931 713506 744048 762016 763693 751539 731677 709786 689772 674841 667597 668898 677968
59397 677968 693664 713814 732854 742344 736204 715462 686966 657799 631593 609238 590919 576699
$$ packed form
59494D32932q76o82p02m68J08P28J143J465K008K842L517L414K554J827K144L416
59478D55370M784N726O447P094P255O588N492M622L956K892J171p07j998k390
59464E06302k108j678j562j748j668q04N62J538J691J595K070L178M351N249N995
59449E22963O644O964O916O782O624N987M520K485K95k022m433o318o965o521
59435E43921n836n412n109m876n041n657o169o054n283l942j956M14K338L220
59421D94558L543M409O321Q752J0858J2412J3947J6226J9624K4069K9230L3982
59409F77931L5575L0542J7968J677j2154j9862k1891k0014j4931p244J301R070
59397F77968J5696K0150J9040R490o140k0742k8496k9167k6206k2355j8319j4220
$$ plain form
59385 576699 566181 558657 553553 550434 548782 548018 547716 547781 548539 550578 554192 558969 564140 569312 574567
59370 574567 579825 584445 587612 589032 589146 588772 588555 588616 588603 588154 587324 586517 586095 586220 587119 589244 592891
59353 592891 597634 602436 606544 610258 614676 620758 628807 638680 649991 661955 673577 684486 695379
59340 695379 707146 719723 732159 743647 753984 763175 771164 778013 783750 787941 789912 789572 787530
59327 787530 784225 779456 772965 765024 756176 746841 737481 728660 720545 712710 704853 697377 690813 684877
59313 684877 678511 670751 661282 650421 638901 627521 616638 606004 595291 584566 574084 563931
59301 563931 554196 545219 537267 530115 523366 517047 511532 506986 503295 500379 498110 495899 492899 488878
59287 488878 484582 480965 478196 475690 472988 470377 468562 467944 468377 469538 471257 473477 476214 479798 484835
$$ packed form
59385E76699j0518p524n104l119j652p64l02O5P58K039L614M777N171N172N255
59370E74567N258M620L167J420J14l74k17O1j3m49q30q07m22J25Q99K125L647
59353E92891M743M802M108L714M418O082Q049R873J1311J1964J1622J0909J0893
59340F95379J1767J2577J2436J1488J0337R191P989O849N737M191J971l40k042
59327G87530l305m769o491p941q848r335r360q821q115p835p857p476o564n936
59313F84877o366p760r469j0861j1520j1380j0883j0634j0713j0725j0482j0153
59301E63931r735q977p952p152o749o319n515m546l691k916k269k211l000m021
59287D88878m296l617k769k506k702k611j815o18M33J161J719K220K737L584N037
$$ plain form
59272 484835 491600 499605 508139 517074 526690 536871 547061 556997 566852 576499 585250 592608 598752 603967
59258 603967 608091 610815 612022 611495 608800 604030 598266 592702 587544 582288 576873 571994 568361 566129
59244 566129 565112 565132 566042 567615 569517 571390 573108 575031 577710 581162 584597 587040 588029 587660 586376
59229 586376 584900 583917 583447 582843 581704 580393 579346 578350 576988 575328 573584 571403 568207 564074 559648
59214 559648 555273 550847 546441 542334 538372 533972 529027 524241 520213 516583 512453 507510 502423 498231
59200 498231 495508 494075 493314 492709 492146 491856 492176 493245 494770 496195 497371 498960 501793 505801 510124
59185 510124 514392 519274 525452 532627 540069 547673 555805 564376 572723 580395 587520 594356 600927 607085
59171 607085 612610 617237 620807 623388 625028 625556 624863 623212 621033 618600 616067 613541 610819 607419 603241
$$ packed form
59272D84835O765Q005Q534Q935R616J0181J0190R936R855R647Q751P358O144N215
59258F03967M124K724J207n27k695m770n764n564n158n256n415m879l633k232
59244E66129j017K0R10J573J902J873J718J923K679L452L435K443R89l69j284
59229E86376j476r83m70o04j139j311j047r96j362j660j744k181l196m133m426
59214E59648m375m426m406m107l962m400m945m786m028l630m130m943n087m192
59200D98231k723j433p61o05n63k90L20J069J525J425J176J589K833M008M323
59185E10124M268M882O178P175P442P604Q132Q571Q347P672P125O836O571O158
59171F07085N525M627L570K581J640N28o93j651k179k433k533k526k722l400m178
$$ plain form
59156 603241 598937 595218 592006 588645 584604 579590 573326 565829 557707 549630 541710 533874 526562 520385
59142 520385 515268 510584 506066 501931 498124 494109 489487 484267 478559 472645 467358 463606 461230 459009
59128 459009 456189 453498 452182 452458 453515 454856 456992 460635 465656 471218 476876 483081 490424 498731
59114 498731 507345 516065 525190 534648 543780 552211 560311 568435 576335 583777 591132 598762 606271 612974
59100 612974 618772 623926 628361 631842 634486 636392 637104 636171 634048 631686 629431 627067 624784 623239 622639
59085 622639 622476 622197 621542 620227 617962 614820 610969 606099 599725 592073 583976 575939 567930 560116 553058
59070 553058 547055 541834 537004 532335 527622 522859 518527 515093 512266 509263 505743 501905 497865 493698
59056 493698 489916 487096 484971 482691 479966 477221 474653 472043 469589 467978 467400 467248 466984 466631 466364
$$ packed form
59156F03241m304l719l212l361m041n014o264p497q122q077p920p836p312o177
59142E20385n117m684m518m135l807m015m622n220n708n914n287l752k376k221
59128D59009k820k691j316K76J057J341K136L643N021N562N658O205P343Q307
59114D98731Q614Q720R125R458R132Q431Q100Q124P900P442P355P630P509O703
59100F12974N798N154M435L481K644J906P12r33k123k362k255k364k283j545o00
59085F22639j63k79o55j315k265l142l851m870o374p652q097q037q009p814p058
59070E53058o003n221m830m669m713m763m332l434k827l003l520l838m040m167
59056D93698l782k820k125k280k725k745k568k610k454j611n78j52k64l53k67
$$ plain form
59041 466364 466377 467158 468985 471094 472373 472962 474128 476318 478563 480154 481679 483777 486055 488069 490347
59026 490347 493523 497271 501104 505579 511716 519628 528623 538377 549156 561064 573706 586526 598976
59013 598976 610531 620884 629882 636991 641252 642143 640146 636241 631318 626298 622051 618681 615496 612292
58999 612292 610068 609872 611499 614021 617031 620520 623936 626343 627440 627628 627116 625597 622860 619148 614832
58984 614832 610127 605170 600107 595081 590305 586045 582452 579672 578249 578919 581736 585848 590546 596131
58970 596131 603324 612157 621953 632140 642593 653389 664623 676232 687639 697781 705898 712190
58958 712190 717459 722336 727053 731534 735265 737319 736908 733761 727821 719027 707813 695389 682955 670788
58944 670788 658513 646064 633931 622605 612205 602646 593888 586010 579134 573205 567891 562958 558756
$$ packed form
59041D66364J3P81J827K109J279N89J166K190K245J591J525K098K278K014K278
59026D90347L176L748L833M475O137P912Q995R754J0779J1908J2642J2820J2450
59013E98976J1555J0353Q998P109M261Q91j997l905m923n020m247l370l185l204
58999F12292k224j96J627K522L010L489L416K407J097J88n12j519k737l712m316
58984F14832m705m957n063n026m776m260l593k780j423O70K817M112M698N585
58970E96131P193Q833R796J0187J0453J0796J1234J1609J1407J0142Q117O292
58958G12190N269M877M717M481L731K054m11l147n940q794j1214j2424j2434j2167
58944F70788j2275j2449j2133j1326j0400r559q758p878o876n929n314m933m202
$$ plain form
58931 558756 555944 554724 554743 555700 557472 559633 561551 563209 565192 567624 569840 571392 572597 573671 574189
58916 574189 574022 573983 574739 575704 575900 575440 575300 575967 577162 578728 580974 584192 588423 593712 600144 607682
58900 607682 616285 625964 636366 646581 655716 663474 670024 675712 681164 687181 694164 702049 711054 721921
58886 721921 735098 750251 766779 784058 800857 815568 827697 838285 848147 856635 862931 867560
58874 867560 871426 874160 874720 873094 870091 865915 860298 853842 847883 842989 838637 834346 830080 825616
58860 825616 820607 815312 810262 805121 798835 791015 782302 773286 763859 753723 742772 730946 718475
58847 718475 706251 695154 685071 675337 666065 658095 651675 646130 640867 635775 630529 624521 617670
58834 617670 610503 603268 595746 588040 580631 573575 566586 560027 554824 551110 547975 544937 542674 541906
$$ packed form
58931E58756k812j220J9R57J772K161J918J658J983K432K216J552J205J074N18
58916E74189j67l9P56R65J96m60j40O67J195J566K246L218M231N289O432P538
58900F07682Q603R679J0402J0215R135P758O550N688N452O017O983P885R005J0867
58886G21921J3177J5153J6528J7279J6799J4711J2129J0588R862Q488O296M629
58874H67560L866K734N60j626l003m176n617o456n959m894m352m291m266m464
58860H25616n009n295n050n141o286p820q713r016r427j0136j0951j1826j2471
58847G18475j2224j1097j0083r734r272p970o420n545n263n092n246o008o851
58834F17670p167p235p522p706p409p056o989o559n203l714l135l038k263p68
$$ plain form
58820 541906 542449 543891 546313 549701 553378 556738 560004 563675 567698 571691 575547 579291 582781 586034
58806 586034 589426 593055 596200 597922 597970 596761 594758 592272 589633 587073 584460 581439 577844 573847 569764
58791 569764 565781 561813 557675 553429 549465 546142 543618 542248 542716 545368 549755 555326 562201 570606
58777 570606 579924 589196 598369 608125 618461 628289 636413 641995 644050 641690 635293 626602 617234 607789
58763 607789 598593 590189 582504 574508 565569 556573 548923 542906 537764 532973 528633 524834 521452 518631
58749 518631 516897 516595 517479 518859 520022 520587 520621 520340 519730 518763 517997 518473 520709 524134 527823 531491 535383
58732 535383 539481 543373 546912 550600 555067 560360 565902 571159 576146 581135 585930 589773 592116 593278
58718 593278 594154 595463 597487 600330 604183 609367 616201 624562 633493 641703 648777 655430 662207 668389
$$ packed form
58820E41906N43J442K422L388L677L360L266L671M023L993L856L744L490L253
58806E86034L392L629L145J722M8j209k003k486k639k560k613l021l595l997m083
58791E69764l983l968m138m246l964l323k524j370M68K652M387N571O875Q405
58777E70606R318R272R173R756J0336R828Q124N582K055k360o397q691r368r445
58763F07789r196q404p685p996q939q996p650o017n142m791m340l799l382k821
58749E18631j734l02Q84J380J163N65L4k81o10r67p66M76K236L425L689L668L892
58732E35383M098L892L539L688M467N293N542N257M987M989M795L843K343J162
58718E93278Q76J309K024K843L853N184O834Q361Q931Q210P074O653O777O182
$$ plain form
58704 668389 672674 674527 674259 672226 668666 663919 657956 649833 638505 624179 608233 591917 575814
58691 575814 560313 545720 531867 518503 506210 496116 488499 482366 476635 471154 466362 462497 459378
58678 459378 456599 453837 451261 449522 448993 449259 449800 450840 452861 455695 458941 463001 468719 476136 484510
58663 484510 493491 503288 513762 524276 534398 543640 550538 553240 551344 546173 539091 530586 521236
58650 521236 512294 504676 498205 492352 486985 482027 477242 472781 469181 466413 463641 460299 456726 453472
58636 453472 450745 448802 448072 448464 449252 449963 450768 451772 452694 453430 454219 455067 455771 456509 457478 457993 457096 455216
58618 455216 453963 454028 454602 455214 456654 459462 462852 466000 469147 472549 475492 477369 478743 480374 482095
58603 482095 483560 485182 487271 489122 490075 490787 492383 494860 497298 499066 499898 499436 497822 496335 496377 498020
$$ packed form
58704F68389M285J853k68k033l560m747n963q123j1328j4326j5946j6316j6103
58691E75814j5501j4593j3853j3364j2293j0094p617o133n731n481m792l865l119
58678D59378k779k762k576j739n29K66N41J040K021K834L246M060N718P417Q374
58663D84510Q981R797J0474J0514J0122R242O898K702j896n171p082q505r350
58650E21236q942p618o471n853n367m958m785m461l600k768k772l342l573l254
58636D53472k727j943p30L92P88P11Q05J004R22P36P89Q48P04P38R69N15q97j880
58618D55216j253O5N74O12J440K808L390L148L147L402K943J877J374J631J721
58603D82095J465J622K089J851R53P12J596K477K438J768Q32m62j614j487M2J643
$$ plain form
58587 498020 500280 502463 504543 506688 509250 512895 518021 524353 531656 540295 550381 560912 570610 579223
58573 579223 587264 594846 601598 607498 613094 619087 626178 635010 645718 657760 670604 684284 699072
58560 699072 715192 733189 753868 777374 802820 829157 855538 880488 901698 917567 928262
58549 928262 934667 937079 935708 931582 925960 919395 912160 904919 897965 890288 880444 868054 853745 838011
58535 838011 820920 802576 783208 763085 742855 723530 705644 688965 673452 659753 648226
58524 648226 638289 629430 622059 616557 612276 608318 604666 601713 599351 597304 595661 594265 592320 589491
58510 589491 586757 585310 585204 585806 586774 587820 588333 588122 587817 587744 587376 586679 586815 588380 590090 590546 590313
58493 590313 590789 591955 592846 593473 594645 596423 598356 600778 604315 608574 612809 617471 623622 631246 639655
$$ packed form
58587D98020K260K183K080K145K562L645N126O332P303Q639J0086J0531R698Q613
58573E79223Q041P582O752N900N596N993P091Q832J0708J2042J2844J3680J4788
58560F99072J6120J7997K0679K3506K5446K6337K6381K4950K1210J5869J0695
58549I28262O405K412j371m126n622o565p235p241o954p677r844j2390j4309j5734
58535H38011j7091j8344j9368k0123k0230j9325j7886j6679j5513j3699j1527
58524F48226r937q859p371n502m281l958l652k953k362k047j643j396j945k829
58510E89491k734j447j06O02R68J046N13k11l05p3l68o97J36J565J710M56k33
58493E90313M76J166Q91O27J172J778J933K422L537M259M235M662O151P624Q409
$$ plain form
58478 639655 649136 660557 673645 687363 701747 717593 734344 749971 763079 773558 781082 784632
58466 784632 783967 780209 774543 767456 759584 752077 745682 740338 735988 732984 731568 731801 734152 739255 746939
58451 746939 756224 766305 776846 787317 796823 804576 809912 811995 810181 804591 795911 785009 773230
58438 773230 762292 753057 745035 737852 732311 728940 726524 723573 720663 719765 721681 725566 730544 736314
58424 736314 742442 748573 755226 763142 772069 781366 791225 801787 811473 817899 820334 819829 817181 812423
58410 812423 806159 799641 793277 786541 779513 773221 768246 764264 761020 758630 756875 755353 754353 754601
58396 754601 756203 758747 762064 765991 769949 773908 779074 786214 793940 800111 804365 807794 810903 813664
58382 813664 816871 821369 826323 830187 833069 836241 839790 842869 845928 850445 856491 862693 868559 874745
$$ packed form
58478F39655R481J1421J3088J3718J4384J5846J6751J5627J3108J0479P524L550
58466G84632o65l758n666p087p872p507o395n344m350l004j416K33K351N103P684
58451G46939R285J0081J0541J0471R506P753N336K083j814n590q680j0902j1779
58438G73230j0938r235q022p183n541l371k416k951k910q98J916L885M978N770
58424G36314O128O131O653P916Q927R297R859J0562R686O426K435n05k648m758
58410H12423o264o518o364o736p028o292m975l982l244k390j755j522j000K48
58396G54601J602K544L317L927L958L959N166P140P726O171M254L429L109K761
58382H13664L207M498M954L864K882L172L549L079L059M517O046O202N866O186
$$ plain form
58368 874745 881094 886630 891605 897433 904416 911598 918923 927391 936973 946559 956221 967415 980616 994760
58354 994760 1009140 1023695 1037320 1048289 1056745 1064573 1072382 1078794 1083088 1086286 1089213 1091755 1094540
58341 1094540 1099085 1105650 1113110 1121427 1132020 1145145 1159223 1173383 1188413 1204547 1220628 1236167
58329 1236167 1252019 1268312 1283972 1299012 1314956 1332139 1348751 1363367 1376277 1387596 1396443
58318 1396443 1402898 1408572 1414333 1419532 1424190 1429693 1436567 1443804 1451167 1459919 1470594 1482419 1495603
58305 1495603 1511604 1530253 1549191 1567126 1585226 1604511 1624438 1644938 1667064 1690604 1713681
58294 1713681 1735759 1758373 1781972 1804911 1826620 1848851 1872611 1896835 1921299 1947714 1976490
58283 1976490 2005475 2033526 2062442 2093799 2126788 2160701 2196525 2234440 2272744 2311008 2351376
$$ packed form
58368H74745O349N536M975N828O983P182P325Q468R582R586R662J1194J3201J4144
58354I94760J4380J4555J3625J0969Q456P828P809O412M294L198K927K542K785
58341A094540M545O565P460Q317J0593J3125J4078J4160J5030J6134J6081J5539
58329A236167J5852J6293J5660J5040J5944J7183J6612J4616J2910J1319Q847
58318A396443O455N674N761N199M658N503O874P237P363Q752J0675J1825J3184
58305A495603J6001J8649J8938J7935J8100J9285J9927K0500K2126K3540K3077
58294A713681K2078K2614K3599K2939K1709K2231K3760K4224K4464K6415K8776
58283A976490K8985K8051K8916L1357L2989L3913L5824L7915L8304L8264M0368
$$ plain form
58272 2351376 2395026 2440237 2485633 2532286 2580949 2630353 2680081 2732075 2787510 2845198 2904751
58261 2904751 2968048 3035859 3106366 3178786 3254979 3335661 3418606 3502397 3588184 3675881 3762689
58250 3762689 3847620 3933524 4022588 4113982 4208022 4308032 4415506 4528073 4644895 4769331
58240 4769331 4903388 5044538 5191295 5347027 5514740 5693004 5880672 6080672 6295341
58231 6295341 6522956 6762819 7018752 7293692 7586094 7895787 8227940 8586980 8972226
58222 8972226 9383887 9827371 10307020 10821995 11373635 11970628 12621742 13330249 14101139
58213 14101139 14946874 15880275 16909372 18045891 19311463 20729376 22319343 24108642
58205 24108642 26140908 28468039 31144866 34242177 37856288 42095901 47065590 52865365
$$ packed form
58272B351376M3650M5211M5396M6653M8663M9404M9728N1994N5435N7688N9553
58261B904751O3297O7811P0507P2420P6193Q0682Q2945Q3791Q5787Q7697Q6808
58250C762689Q4931Q5904Q9064R1394R4040J00010J07474J12567J16822J24436
58240D769331J34057J41150J46757J55732J67713J78264J87668K00000K14669
58231F295341K27615K39863K55933K74940K92402L09693L32153L59040L85246
58222H972226M11661M43484M79649N14975N51640N96993O51114P08507P70890
58213A4101139Q45735R33401J029097J136519J265572J417913J589967J789299
58205B4108642K032266K327131K676827L097311L614111M239613M969689N799775
$$ plain form
58197 52865365 59594417 67357871 76306014 86701053 98949570 113576213 131195709
58190 131195709 152507874 178233397 208914571 244595160 284376230 325833060 364589424
58183 364589424 394756171 410663524 409188035 391120273 360588975 323095708 283604536
58176 283604536 245619515 211148700 181028780 155307557 133610184 115415621 100186936
58169 100186936 87413036 76646016 67528917 59778882 53155280 47457571 42534713 38270069
58161 38270069 34558853 31309837 28456015 25945610 23727019 21753095 19991982 18420882
58153 18420882 17014117 15746863 14604131 13575619 12646313 11800776 11031382 10333604 9697638
58144 9697638 9112539 8574133 8081086 7627207 7204936 6812621 6451274 6117445 5805751
$$ packed form
58197E2865365O729052P763454Q948143J0395039J2248517J4626643J7619496
58190A31195709K1312165K5725523L0681174L5680589L9781070M1456830L8756364
58183C64589424L0166747J5907353j475489j8067762l0531298l7493267l9491172
58176B83604536l7985021l4470815l0119920k5721223k1697373j8194563j5228685
58169A00186936j2773900j0767020r117099p750035o623602n697709m922858m264644
58161C8270069l711216l249016k853822k510405k218591j973924j761113j571100
58153A8420882j406765j267254j142732j028512r29306q45537p69394o97778o35966
58144I697638n85099n38406m93047m53879m22271l92315l61347l33829l11694
$$ plain form
58135 5805751 5515140 5246384 4996479 4761430 4541603 4338649 4149968 3971633 3803931
58126 3803931 3648699 3503838 3365722 3234547 3112241 2997357 2886978 2781529 2682956 2590146
58116 2590146 2500643 2415065 2335429 2260910 2189325 2121067 2057593 1997835 1939999 1885080 1834711
58105 1834711 1787303 1740220 1694087 1651098 1610574 1570056 1529410 1490141 1451934 1413513 1375805
58094 1375805 1340707 1307702 1274960 1242838 1213177 1186189 1161046 1138372 1119018 1101437 1083390
58083 1083390 1065289 1048843 1033427 1016872 999039 981544 964657 947368 929873 913150 896618
58072 896618 878959 860794 844024 828960 814471 800341 787071 774031 760282 746718 735032
58061 735032 725027 715203 705422 696734 689053 681215 672853 664154 654307 642387 629331 617036 605935
$$ packed form
58135E805751k90611k68756k49905k35049k19827k02954j88681j78335j67702
58126C803931j55232j44861j38116j31175j22306j14884j10379j05449r8573r2810
58116B590146q9503q5578p9636p4519p1585o8258o3474n9758n7836n4919n0369
58105A834711m7408m7083m6133m2989m0524m0518m0646l9269l8207l8421l7708
58094A375805l5098l3005l2742l2122k9661k6988k5143k2674j9354j7581j8047
58083A083390j8101j6446j5416j6555j7833j7495j6887j7289j7495j6723j6532
58072H96618j7659j8165j6770j5064j4489j4130j3270j3040j3749j3564j1686
58061G35032j0005r824r781q688p681p838q362q699r847j1920j3056j2295j1101
$$ plain form
58048 605935 595305 585287 576585 568822 561183 554088 548248 542772 536230 528930 522115 515629 508540 501342
58034 501342 495291 490117 484622 479034 474444 470313 464888 457879 450558 443318 435352 426660 418307 410604
58020 410604 402971 395589 389323 383943 378235 371958 366070 361032 356548 352892 350805 349976 349147 347739 346028
58005 346028 343899 340930 337531 334501 331677 328443 325342 323613 323307 323370 323353 323570 323870 323875 324217 325898 328515
57988 328515 330688 332152 333889 336289 338632 340340 341350 341401 340367 339039 338206 337178 334676 330904 327229
57973 327229 324171 321254 318546 316677 315497 314357 313538 313780 314662 315100 315276 316288 318064 319442 320215 321206
57957 321206 322256 322055 320219 317802 315442 312649 309156 305428 301651 297769 294623 293372 293670 294077 294371
57942 294371 295630 297934 300057 301910 305204 310911 317847 324538 330908 337282 343330 348949 354768 360817
$$ packed form
58048F05935j0630j0018q702p763p639p095n840n476o542p300o815o486p089p198
58034E01342o051n174n495n588m590m131n425p009p321p240p966q692q353p703
58020D10604p633p382o266n380n708o277n888n038m484l656k087q29q29j408j711
58005C46028k129k969l399l030k824l234l101j729l06O3j7K17L00NL42J681K617
57988C28515K173J464J737K400K343J708J010N1j034j328q33j028k502l772l675
57973C27229l058k917k708j869j180j140q19K42Q82M38J76J012J776J378P73R91
57957C21206J050k01j836k417k360k793l493l728l777l882l146j251K98M07K94
57942B94371J259K304K123J853L294N707O936O691O370O374O048N619N819O049
$$ plain form
57928 360817 365883 369046 370667 371074 369446 364981 358233 350450 342293 333823 325010 315795 306386 297731
57914 297731 290828 285375 280228 275316 271824 270172 269288 268425 268209 269116 270207 270363 269732 269042 268373 267506
57898 267506 266642 265951 265069 263788 262609 262002 261706 261362 261208 261663 262817 264692 267340 270313 272767 274535
57882 274535 276368 278810 281517 284014 286323 288471 290100 290963 291232 291172 291173 292090 294523 297663 299910 300799
57866 300799 301250 301790 301872 301280 300786 300889 301166 301523 302725 304981 307275 308982 310940 313959 317400 320213
57850 320213 322349 324041 324705 323827 322133 320572 318708 315391 310591 305367 300317 295207 290036 285425 281853
57835 281853 279179 276947 274720 272265 269891 268421 268510 270184 273200 277336 282013 286304 289778 292890 296077
57820 296077 299064 301511 303703 305937 307776 308506 307923 306164 303258 299426 295295 291240 286898 281913 276662
$$ packed form
57928C60817N066L163J621M07j628m465o748p783q157q470q813r215r409q655
57914B97731o903n453n147m912l492j652q84q63k16R07J091J56o31o90o69q67
57898B67506q64o91q82j281j179o07k96l44j54M55J154J875K648K973K454J768
57882B74535J833K442K707K497K309K148J629Q63K69o0JR17K433L140K247Q89
57866C00799M51N40Q2n92m94J03K77L57J202K256K294J707J958L019L441K813
57850C20213K136J692O64q78j694j561j864l317m800n224n050n110n171m611l572
57835B81853k674k232k227k455k374j470Q9J674L016M136M677M291L474L112L187
57820B96077K987K447K192K234J839P30n83j759k906l832m131m055m342m985n251
$$ plain form
57805 276662 271724 267122 262660 258468 254595 250539 245997 241775 239189 238577 238973 239204 239005 239118 240464
57790 240464 242984 245299 245996 245285 244781 245551 247166 248790 250264 251703 253067 254737 257591 261786 266321
57775 266321 270494 274860 279800 284131 286382 286806 286851 287071 286832 285814 284493 283133 281414 279220 276855
57760 276855 274320 271142 267078 262429 257702 253554 250865 250075 250442 250720 250579 250597 250986 251307 251710 253438
57744 253438 257472 263187 268923 273518 276882 279417 281453 283226 284889 286367 287361 287678 287524 287316 287170
57729 287170 286666 285221 282648 279269 275598 272065 268914 266161 263786 262122 261750 262641 263733 263962 263499
57714 263499 263349 263918 264732 265475 266327 267196 267558 267338 267077 266945 266534 265991 266369 268279 271180 274633 279310
57697 279310 285835 293368 300359 306125 310751 313982 315358 315266 314810 314619 314498 314230 314080 314453 315450 316706
$$ packed form
57805B76662m938m602m462m192l873m056m542m222k586o12L96K31j99J13J346
57790B40464K520K315O97p11n04P70J615J624J474J439J364J670K854M195M535
57775B66321M173M366M940M331K251M24M5K20k39j018j321j360j719k194k365
57760B76855k535l178m064m649m727m148k689p90L67K78j41J8L89L21M03J728
57744B53438M034N715N736M595L364K535K036J773J663J478R94L17j54k08j46
57729B87170n04j445k573l379l671l533l151k753k375j664l72Q91J092K29m63
57714B63499j50N69Q14P43Q52Q69L62k20k61j32m11n43L78J910K901L453M677
57697B79310O525P533O991N766M626L231J376r2m56j91j21k68j50L73R97J256
$$ plain form
57681 316706 317473 317280 316863 317925 321480 326951 333442 341310 351740 365388 382452 403828 431196 465910
57667 465910 508266 557309 610012 660327 699920 720854 718525 693470 651405 600955 549843 502361
57655 502361 460076 423903 394469 371096 351953 335573 321549 309756 299828 291578 285157 280520
57643 280520 277270 275155 274129 273832 273645 273412 273586 274447 275612 276427 276475 275749 274721 274199 274572 275238 275313 274808
57625 274808 274492 274602 274488 273710 272764 272338 272375 272295 271810 271124 270574 270353 270474 270811 271181 271445 271487 271227 270781 270419
57605 270419 270184 269769 269128 268935 269989 272199 274569 276184 276906 277212 277707 278740 280175 281541 282531 283235
57589 283235 283755 283940 283797 283799 284393 285555 287222 289733 293163 296669 299292 301253 303598 306550 309049 310149
57573 310149 310250 310616 312057 314309 316404 317521 317649 317496 317643 317998 318250 318506 319093 320090 321521 323702 326773
$$ packed form
57681C16706P67j93m17J062L555N471O491P868J0430J3648J7064K1376K7368L4714
57667D65910M2356M9043N2703N0315L9593K0934k329k5055m2065n0450n1112m7482
57655E02361m2285l6173k9434k3373j9143j6380j4024j1793r928q250o421m637
57643B80520l250k115j026k97j87k33J74Q61J165Q15M8p26j028n22L73O66P5n05
57625B74808l16J10j14p78r46m26L7q0m85o86n50k21J21L37L70K64M2k60m46l62
57605B70419k35m15o41j93J054K210K370J615P22L06M95J033J435J366R90P04
57589B83235N20J85j43KN94J162J667K511L430L506K623J961K345K952K499J100
57573C10149J01L66J441K252K095J117J28j53J47L55K52K56N87R97J431K181L071
$$ plain form
57556 326773 330150 333137 335937 339410 343867 348750 353373 357266 359848 360539 359520 357734 355975 354383
57542 354383 352966 352091 352193 353391 355553 358539 362213 366354 370512 373945 376082 377317 378892 381513 384532
57527 384532 387054 389333 392239 395763 399076 401910 404801 407991 411070 413833 416529 419052 420848 421930
57513 421930 423157 425071 427181 428744 429589 429870 429796 430019 431549 434674 438467 441933 445208 449083 453707
57498 453707 458297 461980 464492 466147 467469 468877 470616 472916 476005 479743 483533 487012 490651 495150
57484 495150 500367 505433 509855 513840 517585 520950 523933 526788 529614 532424 535616 539543 543591 546572
57470 546572 548237 549509 550965 552133 552759 553768 556166 559696 563377 566817 570232 573595 576565 579120
57456 579120 581645 584532 588015 592190 596823 601441 605920 610607 615574 620234 624204 628096 632892 638777
$$ packed form
57556C26773L377K987K800L473M457M883M623L893K582O91j019j786j759j592
57542C54383j417q75J02J198K162K986L674M141M158L433K137J235J575K621L019
57527C84532K522K279K906L524L313K834K891L190L079K763K696K523J796J082
57513D21930J227J914K110J563Q45K81p4K23J530L125L793L466L275L875M624
57498D53707M590L683K512J655J322J408J739K300L089L738L790L479L639M499
57484D95150N217N066M422L985L745L365K983K855K826K810L192L927M048K981
57470E46572J665J272J456J168O26J009K398L530L681L440L415L363K970K555
57456E79120K525K887L483M175M633M618M479M687M967M660L970L892M796N885
$$ plain form
57442 638777 645091 651204 656976 662555 668188 674107 680225 686068 691324 696297 701560 707351 713564 720046
57428 720046 726583 732884 738919 745104 751770 758650 765201 771248 777008 782679 788361 794292 800800 807972
57414 807972 815494 822795 829395 835319 841223 847833 855222 862913 870619 878402 886013 892676 897916 902173
57400 902173 906244 910515 915079 920212 926263 933162 940397 947416 953903 959922 966004 972844 980723 989391
57386 989391 998653 1008730 1019813 1031493 1042882 1053198 1062205 1070312 1078298 1086698 1095451 1104360 1113648
57373 1113648 1123511 1133276 1141725 1148383 1153905 1159171 1164742 1171175 1178891 1187378 1195415 1202598 1209930 1218422
57359 1218422 1227871 1237513 1247050 1256367 1265123 1273495 1282691 1293708 1305971 1318035 1329315 1340299 1351471
57346 1351471 1362923 1374770 1387003 1399017 1410143 1420566 1430951 1441289 1450987 1460154 1469870 1480920
$$ packed form
57442F38777O314O113N772N579N633N919O118N843N256M973N263N791O213O482
57428G20046O537O301O035O185O666O880O551O047N760N671N682N931O508P172
57414H07972P522P301O600N924N904O610P389P691P706P783P611O663N240M257
57400I02173M071M271M564N133O051O899P235P019O487O019O082O840P879Q668
57386I89391R262J0077J1083J1680J1389J0316R007Q107P986Q400Q753Q909R288
57373A113648R863R765Q449O658N522N266N571O433P716Q487Q037P183P332Q492
57359A218422R449R642R537R317Q756Q372R196J1017J2263J2064J1280J0984J1172
57346A351471J1452J1847J2233J2014J1126J0423J0385J0338R698R167R716J1050
$$ plain form
57334 1480920 1492961 1505210 1517387 1529631 1542006 1554463 1566999 1579517 1591679 1603131 1613904
57323 1613904 1624562 1635928 1648503 1661989 1675610 1688993 1702506 1716543 1730848 1744866 1758488
57312 1758488 1772054 1785882 1800166 1815038 1830232 1844900 1858311 1870777 1883498 1897530 1913169
57301 1913169 1930065 1947455 1964372 1980191 1995106 2009838 2024830 2039957 2054941 2069753 2084583
57290 2084583 2099554 2114502 2129085 2143337 2158066 2174243 2191824 2209633 2226628 2242819 2258721
57279 2258721 2274545 2290389 2306632 2323446 2340263 2356380 2371842 2387184 2402624 2418138 2433999
57268 2433999 2450580 2467780 2485244 2502906 2520760 2538363 2555297 2571901 2588762 2605638 2621712
57257 2621712 2636912 2652100 2667802 2683458 2698270 2712222 2726024 2740402 2755653 2771484 2787141
$$ packed form
57334A480920J2041J2249J2177J2244J2375J2457J2536J2518J2162J1452J0773
57323A613904J0658J1366J2575J3486J3621J3383J3513J4037J4305J4018J3622
57312A758488J3566J3828J4284J4872J5194J4668J3411J2466J2721J4032J5639
57301A913169J6896J7390J6917J5819J4915J4732J4992J5127J4984J4812J4830
57290B084583J4971J4948J4583J4252J4729J6177J7581J7809J6995J6191J5902
57279B258721J5824J5844J6243J6814J6817J6117J5462J5342J5440J5514J5861
57268B433999J6581J7200J7464J7662J7854J7603J6934J6604J6861J6876J6074
57257B621712J5200J5188J5702J5656J4812J3952J3802J4378J5251J5831J5657
$$ plain form
57246 2787141 2801998 2816096 2829916 2843689 2857340 2870947 2884775 2898797 2912606 2925872 2938603
57235 2938603 2950986 2963255 2975655 2988134 3000164 3011267 3021669 3032126 3043186 3054873 3066883
57224 3066883 3078689 3089654 3099478 3108446 3116986 3125284 3133671 3142874 3153211 3163895 3173930 3183456 3193437
57211 3193437 3204218 3215258 3226226 3237438 3249116 3261019 3272969 3285059 3297188 3309118 3321146
57200 3321146 3334057 3348233 3363420 3379456 3396432 3413908 3430755 3446234 3460677 3474763 3488591
57189 3488591 3501827 3514260 3525871 3536696 3546872 3556532 3565535 3573767 3581732 3590296 3599623 3608972 3617779
57176 3617779 3626323 3635088 3644041 3652951 3661836 3670625 3678876 3686411 3693845 3701883 3710245 3717837 3724018 3729323
57162 3729323 3734864 3741188 3747763 3753508 3757822 3761044 3763896 3766718 3769537 3772602 3776275 3780348 3783939 3786244
$$ packed form
57246B787141J4857J4098J3820J3773J3651J3607J3828J4022J3809J3266J2731
57235B938603J2383J2269J2400J2479J2030J1103J0402J0457J1060J1687J2010
57224C066883J1806J0965R824Q968Q540Q298Q387R203J0337J0684J0035R526R981
57211C193437J0781J1040J0968J1212J1678J1903J1950J2090J2129J1930J2028
57200C321146J2911J4176J5187J6036J6976J7476J6847J5479J4443J4086J3828
57189C488591J3236J2433J1611J0825J0176R660R003Q232P965Q564R327R349Q807
57176C617779Q544Q765Q953Q910Q885Q789Q251P535P434Q038Q362P592O181N305
57162C729323N541O324O575N745M314L222K852K822K819L065L673M073L591K305
$$ plain form
57148 3786244 3787106 3786843 3785862 3784412 3782291 3778769 3773172 3765501 3756117 3744976 3731813 3717038 3701723 3686521
57134 3686521 3671242 3655708 3640446 3626325 3614098 3604580 3598638 3596605 3598077 3602542 3609770 3619407 3630866
57121 3630866 3644022 3659438 3677358 3696958 3717200 3738264 3761671 3789244 3822424 3862409 3910446
57110 3910446 3967904 4036383 4117849 4214581 4328980 4463500 4620881 4804844 5021077 5277645
57100 5277645 5584261 5951494 6391328 6918460 7550124 8304026 9196542 10242703 11456580
57091 11456580 12850414 14433049 16209277 18179766 20339598 22675099 25161399 27762786
57083 27762786 30433616 33114171 35719940 38132858 40207959 41799566 42794702 43135423
57075 43135423 42822086 41903089 40460007 38592603 36405805 34001071 31472554 28904996
$$ packed form
57148C786244Q62k63r81j450k121l522n597p671r384j1141j3163j4775j5315j5202
57134C686521j5279j5534j5262j4121j2227r518n942k033J472M465P228R637J1459
57121C630866J3156J5416J7920J9600K0242K1064K3407K7573L3180L9985M8037
57110C910446N7458O8479Q1466R6732J14399J34520J57381J83963K16233K56568
57100E277645L06616L67233M39834N27132O31664P53902Q92516J046161J213877
57091A1456580J393834J582635J776228J970489K159832K335501K486300K601387
57083B7762786K670830K680555K605769K412918K075101J591607R95136L40721
57075D3135423l13337r18997j443082j867404k186798k404734k528517k567558
$$ plain form
57067 28904996 26370864 23927870 21618637 19471839 17503508 15718998 14116027 12687329
57059 12687329 11421793 10305304 9322589 8458967 7700646 7034418 6448087 5931068 5474065
57050 5474065 5068483 4706643 4382265 4090196 3825892 3585553 3366428 3166423 2983395
57041 2983395 2814928 2658522 2511834 2373202 2242073 2118505 2002093 1891953 1787730
57032 1787730 1689683 1597460 1509809 1426121 1347337 1274496 1207092 1143736 1083850 1027742 975536
57021 975536 926991 882105 840949 803049 767695 734734 704373 676402 650250 625655 602658
57010 602658 581150 561021 542511 525799 510477 496059 482692 470725 459854 449424 439402
56999 439402 430308 422310 415027 408114 401450 394899 388469 382560 377533 373272 369709 367403 366930 368099
$$ packed form
57067B8904996k534132k442994k309233k146798j968331j784510j602971j428698
57059A2687329j265536j116489r82715q63622p58321o66228n86331n17019m57003
57050E474065m05582l61840l24378k92069k64304k40339k19125k00005j83028
57041B983395j68467j56406j46688j38632j31129j23568j16412j10140j04223
57032A787730r8047r2223q7651q3688p8784p2841o7404o3356n9886n6108n2206
57021I75536m8545m4886m1156l7900l5354l2961l0361k7971k6152k4595k2997
57010F02658k1508k0129j8510j6712j5322j4418j3367j1967j0871j0430j0022
56999D39402r094p998p283o913o664o551o430n909n027m261l563k306m73J169
$$ plain form
56985 368099 370581 374933 381984 391241 400727 408297 412363 411678 405687 395342 382639 369088 355349
56972 355349 342308 331312 322831 315820 309094 302807 298039 295429 294813 295901 298841 304199 312628 324428
56958 324428 339259 356358 374930 393944 411510 424909 431577 430150 420909 405653 387072 367725
56946 367725 349295 332802 319097 308684 301284 296196 293092 292024 292863 295443 300299 308520 320669
56933 320669 336352 355071 376934 402050 429263 455484 476146 486755 484929 471506 449714 423301
56921 423301 395445 368658 344507 323120 303683 285858 270376 257999 248349 240126 232312 224891
56909 224891 218524 213638 209872 206415 202939 199896 197774 196414 195364 194549 194153 194225 194915 196827 200428
56894 200428 205318 210702 216476 223258 231593 241886 254929 271563 291638 313945 337035 359294
$$ packed form
56985C68099K482M352P051R257R486P570M066o85n991j0345j2703j3551j3739
56972C55349j3041j0996q481p011o726o287m768k610o16J088K940N358Q429J1800
56958C24428J4831J7099J8572J9014J7566J3399O668j427r241j5256j8581j9347
56946C67725j8430j6493j3705j0413p400n088l104j068Q39K580M856Q221J2149
56933C20669J5683J8719K1863K5116K7213K6221K0662J0609j826j3423k1792k6413
56921D23301k7856k6787k4151k1387j9437j7825j5482j2377r650q223p814p421
56909B24891o367m886l766l457l476l043k122j360j050q15l96P2O90J912L601
56894B00428M890N384N774O782Q335J0293J3043J6634K0075K2307K3090K2259
$$ plain form
56882 359294 378237 390882 395438 392194 382804 369421 354576 340680 328900 319077 311158 306094 304933
56869 304933 307674 313625 322417 334197 349335 368526 392850 423230 460009 503244 552678 606527
56857 606527 660215 706757 738872 751483 743557 718501 682551 641989 601379 563783 531546 506087
56845 506087 487384 474567 467210 465781 471003 483279 502823 530029 565680 611040 667728 737017
56833 737017 818533 908836 1000597 1083024 1143943 1173258 1166451 1126379 1062057 984866 904532 827428
56821 827428 757345 696586 645982 604921 572501 548639 533561 526762 527413 535699 552811 579556
56809 579556 615780 661226 715816 778186 843944 905379 952784 977005 972786 941151 888670 824046
56797 824046 755076 687730 626191 572614 527272 489715 459753 437184 421177 410522 404420 402831
$$ packed form
56882C59294J8943J2645M556l244r390j3383j4845j3896j1780r823p919n064j161
56869C04933K741N951Q792J1780J5138J9191K4324L0380L6779M3235M9434N3849
56857F06527N3688M6542L2115J2611p926k5056l5950m0562m0610l7596l2237k5459
56845E06087j8703j2817p357j429N222J2276J9544K7206L5651M5360N6688O9289
56833G37017Q1516R0303R1761Q2427O0919K9315o807m0072o4322p7191q0334p7104
56821H27428p0083o0759n0604m1061l2420k3862j5078o799O51Q286J7112K6745
56809E79556L6224M5446N4590O2370O5758O1435M7405K4221m219l1635n2481o4624
56797H24046o8970o7346o1539n3577m5342l7557k9962k2569j6007j0655o102j589
$$ plain form
56785 402831 406307 415587 431081 452512 479172 510215 544006 577021 603941 619236 618928 601844
56773 601844 570479 530580 488423 447636 409008 373102 341625 315706 294248 275185 257729
56762 257729 242392 229386 218045 207674 198141 189682 182618 177097 172747 168816 164960 161426 158201
56749 158201 154659 150536 146592 143611 141291 138880 136376 134286 132567 130715 128666 126834 125355 124044
56735 124044 122921 122133 121477 120676 119956 119715 119746 119535 119218 119492 120500 121519 121916 121834 121817 122216 123045 124030 124711
56716 124711 124953 125310 126484 128348 129992 130729 130665 130262 129784 129259 128696 128268 128519 130177 133272 136581 138544
56699 138544 138801 138361 138255 138643 139324 140401 141968 143667 145072 146341 147972 150019 151937 153248 154122 155221
56683 155221 157074 159645 162372 164575 165918 166633 167369 168736 170801 172884 173968 173435 171474 168788 165990
$$ packed form
56785D02831L476R280J5494K1431K6660L1043L3791L3015K6920J5295l08j7084
56773F01844l1365l9899m2157m0787l8628l5906l1477k5919k1458j9063j7456
56762B57729j5337j3006j1341j0371r533q459p064n521m350l931l856l534l225
56749A58201l542m123l944k981k320k411k504k090j719j852k049j832j479j311
56735A24044j123p88o56q01p20k41L1k11l17K74J008J019L97q2j7L99Q29R85O81
56716A24711K42L57J174J864J644P37o4m03m78n25n63m28K51J658L095L309J963
56699A38544K57m40j06L88O81J077J567J699J405J269J631K047J918J311Q74J099
56683A55221J853K571K727K203J343P15P36J367K065K083J084n33j961k686k798
$$ plain form
56668 165990 163429 161465 160570 160865 161657 161832 160975 159902 159710 160432 161085 161027 160627 160349 159873 158699 157135
56651 157135 155955 155315 154730 153966 153283 152795 152317 151874 151791 152203 153015 154295 156104 157961 159173 159777 160503
56634 160503 161775 163399 165204 167222 169162 170595 171782 173463 175607 177276 177991 178317 178818 179385 179924
56619 179924 180649 181187 180515 178478 176357 175131 174157 172421 170157 168105 165978 162946 159162 155620 152780
56604 152780 150398 148426 147082 146212 145558 145510 146643 148591 150231 151022 151356 151605 151559 150942 149905 148898 148432
56587 148432 148856 149968 150998 151369 151318 151349 151455 151372 151205 151236 151378 151457 151755 152615 153770 154661 155253 156054 157513
56568 157513 159865 163230 167305 171320 174902 178726 183870 190884 199929 211251 224669 238887 251928
56555 251928 261953 267369 267053 261511 253301 245230 238280 231958 226042 220939 216743 213166 210242 208104
$$ packed form
56668A65990k561j964q95K95P92J75q57j073j92P22O53n8m00k78m76j174j564
56651A57135j180o40n85p64o83m88m78m43q3M12Q12J280J809J857J212O04P26
56634A60503J272J624J805K018J940J433J187J681K144J669P15L26N01N67N39
56619A79924P25N38o72k037k121j226r74j736k264k052k127l032l784l542k840
56604A52780k382j972j344q70o54m8J133J948J640P91L34K49m6o17j037j007m66
56587A48432M24J112J030L71n1L1J06q3j67L1J42P9K98Q60J155Q91N92Q01J459
56568A57513K352L365M075M015L582L824N144P014R045J1322J3418J4218J3041
56555B51928J0025N416l16n542q210q071o950o322n916n103m196l577k924k138
$$ plain form
56541 208104 206231 203939 201451 199500 198087 196672 195376 194841 194912 194620 193591 192458 191797 191647 192154 193610
56525 193610 195604 197110 197732 198084 198701 199361 199605 199170 197759 195224 192266 190152 189447 189518 189465 188977 188211
56508 188211 187418 186853 186600 186466 186398 186712 187450 187992 188035 188354 189617 190891 190604 188723 186705 185374 184285
56491 184285 183275 183183 184565 186784 188851 190336 191150 191328 191264 191359 191311 190580 189512 189010 189068 188816 188144 187999
56473 187999 188845 190042 191050 192016 192742 192424 191049 189917 190110 191347 192840 194226 195128 194959 193951 193428
56457 193428 194260 195829 197154 198168 199200 200045 200326 200135 199697 199128 199068 200675 204189 208180 210972 212293
56441 212293 212911 213333 213606 213835 214163 214517 214854 215278 215669 215723 215627 215908 216308 215709 213688 211321 209850 209332
56423 209332 209226 209516 210417 211566 212309 212464 212304 212190 212558 213658 214916 215237 214386 213368 213018 213022 212860 212856 213495
$$ packed form
56541B08104j873k292k488j951j413j415j296n35P1k92j029j133o61j50N07J456
56525A93610J994J506O22L52O17O60K44m35j411k535k958k114p05P1n3m88p66
56508A88211p93n65k53j34o8L14P38N42M3L19J263J274k87j881k018j331j089
56491A84285j010r2J382K219K067J485Q14J78o4R5m8p31j068n02N8k52o72j45
56473A87999Q46J197J008R66P26l18j375j132J93J237J493J386R02j69j008n23
56457A93428Q32J569J325J014J032Q45K81j91m38n69o0J607L514L991K792J321
56441B12293O18M22K73K29L28L54L37M24L91N4r6K81M00n99k021k367j471n18
56423B09332j06K90R01J149P43J55j60j14L68J100J258L21q51j018l50Mj62mO39
$$ plain form
56404 213495 214373 214639 214060 213072 212227 212007 212658 213737 214439 214697 215293 216493 217439 217394 216719 216038 215318 214473
56386 214473 214103 214831 216505 218652 221044 223243 224434 224438 224190 224556 225384 226301 227513 229029 230051 230080 229892
56369 229892 230428 231431 232127 232619 233592 235187 237051 239013 240858 241983 242168 242193 242893 244127 245432 246961
56353 246961 248929 250824 252226 253760 256129 258701 260182 260338 260007 259784 259666 259675 259830 259737 259117 258543 258894
56336 258894 260371 262756 266182 270749 275797 280432 284528 288396 291901 294725 297206 300034 303374 306980
56322 306980 310767 314500 317371 318745 318982 318796 318269 317252 316155 315439 314845 314093 313861 315001 317202 319430
56306 319430 321422 323752 326738 330257 334364 339140 344218 349301 354799 361017 367073 371620 374378 376093
56292 376093 377360 378443 379875 382116 384793 387249 389726 393149 397995 404185 411657 420075 428308 435324
$$ packed form
56404B13495Q78K66n79r88q45k20O51J079P02K58N96J200R46m5o75o81p20q45
56386B14473l70P28J674K147K392K199J191Mk48L66Q28R17J212J516J022K9j88
56369B29892N36J003O96M92R73J595J864J962J845J125J85K5P00J234J305J529
56353B46961J968J895J402J534K369K572J481J56l31k23j18RJ55r3o20n74L51
56336B58894J477K385L426M567N048M635M096L868L505K824K481K828L340L606
56322C06980L787L733K871J374K37j86n27j017j097p16n94p52k32J140K201K228
56306C19430J992K330K986L519M107M776N078N083N498O218O056M547K758J715
56292C76093J267J083J432K241K677K456K477L423M846O190P472Q418Q233P016
$$ plain form
56278 435324 441457 447914 455230 463111 471445 480441 489937 499577 509628 520824 533541 547745 563400
56265 563400 580210 597476 615075 634075 655415 678577 702711 728557 757971 791797 829518
56254 829518 870857 916526 967465 1024458 1088564 1160940 1242156 1332278 1431372 1539104 1654210
56243 1654210 1775200 1901256 2031616 2164430 2297002 2426606 2550150 2663694 2763415 2846659
56233 2846659 2911194 2954303 2973993 2970582 2945915 2901565 2839090 2761277 2671499 2572174 2465235
56222 2465235 2353522 2240120 2126727 2014215 1904378 1799373 1699797 1605069 1515521 1432335
56212 1432335 1355509 1283712 1216284 1153761 1096384 1043733 995902 953359 915447 880558 847963
56201 847963 818060 790754 765226 741452 720374 702237 686146 671500 658500 647120 636923
$$ packed form
56278D35324O133O457P316P881Q334Q996R496R640J0051J1196J2717J4204J5655
56265E63400J6810J7266J7599J9000K1340K3162K4134K5846K9414L3826L7721
56254H29518M1339M5669N0939N6993O4106P2376Q1216R0122R9094J07732J15106
56243A654210J20990J26056J30360J32814J32572J29604J23544J13544R9721Q3244
56233B846659O4535M3109J9690l411k4667m4350o2475p7813q9778r9325j06939
56222B465235j11713j13402j13393j12512j09837j05005r9576r4728q9548q3186
56212A432335p6826p1797o7428o2523n7377n2651m7831m2543l7912l4889l2595
56201H47963k9903k7306k5528k3774k1078j8137j6091j4646j3000j1380j0197
$$ plain form
56190 636923 627962 620509 613925 607308 601168 596823 594116 591486 588410 585961 584696 583820 582804 582085 581708
56175 581708 580992 580073 580158 581668 583687 585737 588494 592200 595970 599421 603480 608818 614752 620396 625757
56160 625757 631180 636918 643727 652648 663599 675345 687273 700150 714848 731581 750678 772905
56148 772905 798656 827963 861467 900327 945312 997291 1058317 1130357 1212776 1302679 1397570
56137 1397570 1495556 1592694 1682523 1759400 1821208 1868911 1905662 1936812 1968222 2002650 2038307
56126 2038307 2071118 2097101 2112863 2116478 2109255 2095299 2078345 2059787 2039347 2015403 1984181 1941013
56114 1941013 1883751 1813943 1734610 1648881 1561126 1476861 1400142 1332342 1273918 1225402 1185996
56103 1185996 1153371 1125934 1103678 1086158 1071666 1059313 1049968 1044132 1040672 1038536 1037859 1038489 1039288
$$ packed form
56190F36923q961p453o584o617o140m345k707k630l076k449j265q76j016p19l77
56175E81708p16r19Q5J510K019K050K757L706L770L451M059N338N934N644N361
56160F25757N423N738O809Q921J0951J1746J1928J2877J4698J6733J9097K2227
56148G72905K5751K9307L3504L8860M4985N1979O1026P2040Q2419Q9903R4891
56137A397570R7986R7138Q9829P6877O1808M7703L6751L1150L1410L4428L5657
56126B038307L2811K5983J5762L615p223j3956j6954j8558k0440k3944l1222m3168
56114A941013n7262o9808p9333q5729q7755q4265p6719o7800n8424m8516l9406
56103A185996l2625k7437k2256j7520j4492j2353r345n836l460k136o77O30P99
$$ plain form
56090 1039288 1039882 1041323 1044147 1047561 1051341 1056594 1063768 1071830 1080203 1089523 1099662 1109133 1117429 1125913
56076 1125913 1135470 1145328 1155117 1165884 1178089 1190748 1203582 1217832 1233879 1250317 1266389 1283128
56064 1283128 1301060 1319089 1336752 1355218 1375013 1395149 1415527 1437614 1461647 1485782 1509207
56053 1509207 1533337 1558754 1583847 1607865 1632376 1658170 1683710 1708258 1733512 1760408 1787303
56042 1787303 1813234 1840010 1869103 1899369 1929815 1961690 1995906 2031308 2067496 2106276 2148282
56031 2148282 2191342 2234288 2279122 2327158 2376358 2424912 2474125 2525266 2576978 2628427 2681695
56020 2681695 2738404 2797378 2858195 2923363 2994053 3067437 3141295 3217589 3298337 3381815 3466218
56009 3466218 3553271 3644723 3739106 3835567 3937027 4045782 4159944 4277993 4402778 4536984
$$ packed form
56090A039288N94J441K824L414L780N253P174Q062Q373R320J0139R471Q296Q484
56076A125913R557R858R789J0767J2205J2659J2834J4250J6047J6438J6072J6739
56064A283128J7932J8029J7663J8466J9795K0136K0378K2087K4033K4135K3425
56053A509207K4130K5417K5093K4018K4511K5794K5540K4548K5254K6896K6895
56042A787303K5931K6776K9093L0266L0446L1875L4216L5402L6188L8780M2006
56031B148282M3060M2946M4834M8036M9200M8554M9213N1141N1712N1449N3268
56020B681695N6709N8974O0817O5168P0690P3384P3858P6294Q0748Q3478Q4403
56009C466218Q7053R1452R4383R6461J01460J08755J14162J18049J24785J34206
$$ plain form
55999 4536984 4678853 4826525 4982337 5148485 5322943 5504390 5696695 5903603 6123451
55990 6123451 6354192 6599041 6861859 7141649 7437216 7752654 8092570 8456765 8845389
55981 8845389 9264251 9718975 10209422 10736310 11307630 11931763 12610435 13345957 14149184
55972 14149184 15032584 16002370 17066440 18243781 19557475 21026012 22671788 24531682
55964 24531682 26650295 29072453 31855430 35082562 38855795 43286423 48506579 54679032
55956 54679032 61983083 70608927 80793844 92868267 107269677 124543945 145352222
55949 145352222 170421264 200367405 235395616 274860322 316654528 356683661 389129126
55942 389129126 408039613 409705935 394285866 365515408 328850882 289454745 251099661
$$ packed form
55999D536984J41869J47672J55812J66148J74458J81447J92305K06908K19848
55990F123451K30741K44849K62818K79790K95567L15438L39916L64195L88624
55981H845389M18862M54724M90447N26888N71320O24133O78672P35522Q03227
55972A4149184Q83400R69786J064070J177341J313694J468537J645776J859894
55964B4531682K118613K422158K782977L227132L773233M430628N220156O172453
55956E4679032P304051Q625844J0184917J2074423J4401410J7274268K0808277
55949A45352222K5069042K9946141L5028211L9464706M1794206M0029133L2445465
55942C89129126J8910487J666322j5420069k8770458l6664526l9396137l8355084
$$ plain form
55935 251099661 216024032 185228378 158860646 136591700 117910540 102276256 89170021
55928 89170021 78132607 68793855 60860438 54084708 48259779 43228410 38869805 35077107
55920 35077107 31757512 28842558 26279604 24016210 22003910 20209848 18610958 17180991
55912 17180991 15893914 14734303 13692690 12754544 11903460 11130593 10431075 9794938 9210620
55903 9210620 8673502 8182185 7729884 7307928 6914276 6550291 6212196 5893768 5594577
55894 5594577 5317565 5060787 4819016 4591458 4380578 4185130 4001179 3828441 3668998
55885 3668998 3521134 3380677 3247247 3123250 3007865 2897754 2792704 2695039 2604277 2517491
55875 2517491 2434061 2355105 2279110 2203091 2127484 2055315 1987208 1921581 1859008 1801923 1750401
$$ packed form
55935B51099661l5075629l0795654k6367732k2268946j8681160j5634284j3106235
55928H9170021j1037414r338752p933417o775730n824929n031369m358605l792698
55920C5077107l319595k914954k562954k263394k012300j794062j598890j429967
55912A7180991j287077j159611j041613r38146q51084p72867o99518o36137n84318
55903I210620n37118m91317m52301m21956l93652l63985l38095l18428k99191
55894E594577k77012k56778k41771k27558k10880j95448j83951j72738j59443
55885C668998j47864j40457j33430j23997j15385j10111j05050r7665r0762q6786
55875B517491q3430p8956p5995p6019p5607p2169o8107o5627o2573n7085n1522
$$ plain form
55864 1750401 1702342 1657383 1616711 1579397 1542507 1504509 1465407 1424501 1381562 1339366 1301427
55853 1301427 1267746 1235928 1205515 1177780 1152118 1126310 1099856 1073768 1047730 1020780 994170
55842 994170 970189 948547 927057 905376 885034 866354 848434 831606 816787 802860 787810
55831 787810 772098 757942 745732 734173 723417 714777 707550 699335 689584 679918 670894 661253 650414
55818 650414 638970 626614 612300 596717 582146 569606 558305 547830 538590 530183 521706 513669
55806 513669 507349 502384 497305 492267 488851 487264 486241 485679 486841 489727 492626 494622 496285 497718
55792 497718 498231 498345 499955 503966 509625 516431 524674 533667 541305 545878 546869 543819 536240 524978 512187
55777 512187 499811 489403 483202 483585 491384 506085 527017 552166 575970 590750 591202 576663 549749
$$ packed form
55864A750401m8059m4959m0672l7314l6890l7998l9102m0906m2939m2196l7939
55853A301427l3681l1818l0413k7735k5662k5808k6454k6088k6038k6950k6610
55842I94170k3981k1642k1490k1681k0342j8680j7920j6828j4819j3927j5050
55831G87810j5712j4156j2210j1559j0756q640p227q215r751r666r024r641j0839
55818F50414j1444j2356j4314j5583j4571j2540j1301j0475r240q407q477q037
55806E13669o320m965n079n038l416j587j023n62J162K886K899J996J663J433
55792D97718N13J14J610M011N659O806Q243Q993P638M573R91l050p579j1262j2791
55777E12187j2376j0408o201L83P799J4701K0932K5149K3804J4780M52j4539k6914
$$ plain form
55764 549749 514981 478369 445452 418499 396735 379204 365783 355734 347615 341040 336649 333996
55752 333996 331283 327496 323099 318389 312993 307222 302159 298081 294480 291782 291247 292951 295663 298807
55738 298807 302469 305285 304581 299394 291552 283196 275088 267782 262281 258581 255325 251775 248524 245574
55724 245574 241572 235832 229483 223642 218141 213014 209573 208787 209972 212247 216051 222091 229986 238909
55710 238909 248413 257492 264006 266248 264418 259809 253570 247025 241855 238587 235677 231266 225244 218713
55696 218713 212188 205443 198621 192458 187559 184101 181886 180249 178336 175914 173459 171174 168633 165755
55682 165755 163318 162003 161639 161955 163341 166142 169693 172730 174491 175058 174982 174846 174852 174584 173511 171760 169972
55665 169972 168510 167399 166866 167155 167879 168405 168853 169853 171376 172807 174123 175855 177800 179011 179293 179470
$$ packed form
55764E49749l4768l6612l2917k6953k1764j7531j3421j0049q119o575m391k653
55752C33996k713l787m397m710n396n771n063m078l601k698n35J704K712L144
55738B98807L662K816p04n187p842q356q108p306n501l700l256l550l251k950
55724B45574m002n740o349n841n501n127l441p86J185K275L804O040P895Q923
55710B38909R504R079O514K242j830m609o239o545n170l268k910m411o022o531
55696B18713o525o745o822o163m899l458k215j637j913k422k455k285k541k878
55682A65755k437j315l64L16J386K801L551L037J761N67p6j36Ok68j073j751j788
55665A69972j462j111n33K89P24N26M48J000J523J431J316J732J945J211K82J77
$$ plain form
55649 179470 179851 179702 178712 177806 177865 178720 180059 182218 185250 188016 189142 188348 186222 183183 179272 174505
55633 174505 168992 162974 156919 151210 145765 140518 136076 133103 131259 129736 128610 128386 128355 127025 124499
55618 124499 122761 122958 123843 123684 122420 120988 119669 118148 116351 114334 112068 109970 108817 108491 107742
55603 107742 105864 103610 101753 99891 97587 95588 94698 94318 93302 91674 90368 89822 89869 90528 91795 92984
55587 92984 93277 92730 92018 91564 91630 92744 95131 98096 100837 103555 106949 110978 115050 119194 124061 129743
55571 129743 135386 140120 143795 146724 149076 150575 150534 148365 144333 139583 135179 131378 127970 124825 121719
55556 121719 118174 114040 109984 106895 105001 103853 102910 101829 100454 98805 96933 94738 92314 90390
55542 90390 89735 90043 90134 89466 88676 88360 88233 87950 87834 88137 88365 88111 87935 88621 90020 91312 92032 92200 91871
$$ packed form
55649A79470L81j49r90r06N9Q55J339K159L032K766J126p94k126l039l911m767
55633A74505n513o018o055n709n445n247m442k973j844j523j126k24l1j330k526
55618A24499j738J97Q85j59j264j432j319j521j797k017k266k098j153l26p49
55603A07742j878k254j857j862k304j999q90l80j016j628j306n46M7O59J267J189
55587I2984K93n47p12m54O6J114K387K965K741K718L394M029M072M144M867N682
55571A29743N643M734L675K929K352J499m1k169m032m750m404l801l408l145l106
55556A21719l545m134m056l089j894j148r43j081j375j649j872k195k424j924
55542I0390o55L08R1o68p90l16j27k83j16L03K28k54j76O86J399J292P20J68l29
$$ plain form
55523 91871 91198 90676 90748 91364 92175 92740 92374 90465 87392 84488 82647 81545 80573 79674 78682 76778 73536
55506 73536 69892 67174 65611 64547 63616 62903 62349 61796 61328 60920 60114 58614 56828 55251 53877 52734
55490 52734 52344 52876 53490 53354 52751 52361 52032 51293 50557 50712 51784 53002 53890 54384 54221 53286 52388 52641
55472 52641 54125 56024 57888 59740 61156 61405 60639 59909 59822 60031 60168 60348 60498 60098 58989 57775 57067
55455 57067 56843 56801 56819 56881 57001 57364 58124 58982 59414 59382 59316 59346 59121 58499 57905 57831 58341 59193 60008 60314 59840
55434 59840 58947 58357 58281 58138 57247 55640 54091 53475 54034 55096 55630 55255 54487 53856 53246 52482 52083 52711
55416 52711 54075 55055 54913 53849 52494 51451 51268 52175 53632 54636 54711 54328 54286 54915 55887 56538 56454 55959
55398 55959 55856 56407 56815 56141 54504 52913 52111 52132 52802 54038 55577 56968 57984 58713 59190 59272 58862 57986
$$ packed form
55523I1871o73n22P2O16Q11N65l66j909l073k904j841j102r72q99r92j904l242
55506G3536l644k718j563j064r31p13n54n53m68m08q06j500j786j577j374j143
55490E2734l90N32O14j36o03l90l29p39p36J55J072J218Q88M94j63r35q98K53
55472E2641J484J899J864J852J416K49p66p30q7K09J37J80J50m00j109j214p08
55455E7067k24m2J8O2J20L63P60Q58M32l2o6L0k25o22n94p4N10Q52Q15L06m74
55434E9840q93n90p6j43q91j607j549o16N59J062N34l75p68o31o10p64l99O28
55416E2711J364R80j42j064j355j043j83R07J457J004P5l83m2O29R72O51q4m95
55398E5959j03N51M08o74j637j591q02K1O70J236J539J391J016P29M77Q2m10q76
$$ plain form
55380 57986 56706 55243 54061 53491 53391 53493 53867 54659 55588 56189 56450 56712 57005 56922 56150 54767 53140 51842
55362 51842 51519 52373 53845 55216 56346 57481 58558 59227 59402 59275 58907 58295 57745 57609 57745 57725 57504 57375
55344 57375 57359 57256 57223 57639 58308 58431 57575 56186 54943 54071 53457 53004 52575 51937 51102 50571 51000 52561 54717
55325 54717 56616 57743 58251 58567 58739 58439 57641 56901 56739 57085 57594 58147 58748 59291 59794 60567 61789 63163
55307 63163 64305 65170 65788 65992 65786 65575 65591 65460 64760 63596 62226 60619 58898 57703 57473 57829 58301
55290 58301 59098 60435 61664 62031 61895 62199 62977 63363 62924 62009 60917 59609 58201 56843 55197 52890
55274 52890 50429 48810 48217 47970 47680 47617 47948 48538 49499 51075 52917 54306 55142 55901 56665 57128 57502 58338
55256 58338 59372 59625 58877 58008 57685 57676 57788 58410 59724 61225 62422 63195 63211 61954 59775 57987 57357 57213
$$ packed form
55380E7986j280j463j182n70j00J02L74P92R29O01K61K62K93q3p72j383j627j298
55362E1842l23Q54J472J371J130J135J077O69J75j27l68o12n50j36J36k0k21j29
55344E7375j6j03l3M16O69J23q56j389j243q72o14m53m29o38q35n31M29J561K156
55325E4717J899J127N08L16J72l00p98p40j62L46N09N53O01N43N03P73J222J374
55307F3163J142Q65O18K04k06k11J6j31p00j164j370j607j721j195k30L56M72
55290E8301P97J337J229L67j36L04P78L86m39r15j092j308j408j358j646k307
55274E2890k461j619n93k47k90o3L31N90R61J576J842J389Q36P59P64M63L74Q36
55256E8338J034K53p48q69l23rJ12O22J314J501J197P73J6j257k179j788o30j44
$$ plain form
55238 57213 56502 55071 53524 52484 52316 52867 53248 52661 51636 51593 52905 54399 55048 55063 54917 54528 54004 54007
55220 54007 54550 54541 53437 52310 52290 52972 53476 54101 55542 57188 57694 56914 55887 55198 54652 54450 55257 56952
55202 56952 58466 59115 59188 59000 58414 57626 57494 58466 59758 60164 59400 58207 57364 56987 56748 56472 56366 56665
55184 56665 57194 57554 57684 57905 58307 58521 58280 57793 57321 56918 56930 58133 60747 63750 65829 66782 67297 67651
55166 67651 67498 66852 66436 66747 67361 67496 66915 66033 65352 64931 64369 63299 61991 61271 61617 62506 62998 62810
55148 62810 62459 62407 62507 62377 61998 61706 61715 61803 61540 60853 60258 60290 60811 61185 61121 60945 60956 61030 61065 61295 61797 62127
55126 62127 61926 61507 61355 61323 60877 59985 59206 58971 59198 59675 60441 61678 63356 64980 65730 65149 63802 62940
55108 62940 63278 64355 65248 65499 65130 64334 63613 63775 65104 66751 67496 67007 65960 65188 65161 65990 67319 68340
$$ packed form
55238E7213p11j431j547j040j68N51L81n87j025m3J312J494O49J5j46l89n24L
55220E4007N43rj104j127k0O82N04O25J441J646N06p80j027o89n46k02Q07J695
55202E6952J514O49P3j88n86p88j32R72J292M06p64j193q43l77k39k76j06K99
55184E6665N29L60J30K21M02K14k41m87m72m03J2J203K614L003K079R53N15L54
55166F7651j53o46m16L11O14J35n81q82o81m21n62j070j308p20L46Q89M92j88
55148F2810l51n2J00j30l79k92RQ8k63o87n95L2N21L74o4j76J1P4L5K30N02L30
55126F2127k01m19j52l2m46q92p79k35K27M77P66J237J678J624P50n81j347q62
55108F2940L38J077Q93K51l69p96p21J62J329J647P45m89j047p72k7Q29J329J021
$$ plain form
55090 68340 68557 68463 68921 69964 70832 71145 71340 71742 71922 71379 70459 70070 70617 71603 72331 72707 73157 73828 74236
55071 74236 73948 73350 73170 73265 72583 70645 68509 67698 68524 70028 71278 72100 72632 72853 72696 72225 71589 70990
55053 70990 70683 70765 71032 71271 71567 72044 72472 72459 71913 71058 70134 69382 69149 69613 70525 71525 72588 73848 75116
55034 75116 75954 76116 75614 74468 72755 70839 69299 68639 69157 70756 72639 73588 72985 71375 69727 68487
55018 68487 67704 67504 67813 68020 67747 67679 68746 70615 71883 71856 71290 71180 71618 72182 72711 73187 73273 72508 70855
54999 70855 68886 67532 67601 69170 71408 73334 74771 76174 77591 78371 78046 76964 75806 74870 74047 73123
54983 73123 71959 70689 69899 70190 71439 72852 73862 74545 75024 75036 74433 73633 73120 72857 72568 72332 72400 72664
54965 72664 72771 72728 72944 73674 74772 76087 77736 79741 81625 82698 82789 82455 82317 82351 82053 81209 80138 79172
$$ packed form
55090F8340K17r4M58J043Q68L13J95M02J80n43r20l89N47R86P28L76M50O71M08
55071G4236k88n98j80R5o82j938k136q11Q26J504J250Q22N32K21j57m71o36n99
55053G0990l07Q2K67K39K96M77M28j3n46q55r24p52k33M64R12J000J063J260J268
55034G5116Q38J62n02j146j713j916j540o60N18J599J883R49o03j610j648j240
55018F8487p83k00L09K07k73o8J067J869J268k7n66j10M38N64N29M76Q6p65j653
54999G0855j969j354O9J569K238J926J437J403J417P80l25j082j158r36q23r24
54983G3123j164j270p90K91J249J413J010O83M79J2o03q00n13k63k89k36O8K64
54965G2664J07m3K16P30J098J315J649K005J884J073R1l34j38L4k98q44j071r66
$$ plain form
54947 79172 78351 77771 77785 78481 79314 79709 79746 79786 79673 78912 77542 76249 75625 75789 76699 78257 80050 81574
54929 81574 82761 83802 84475 84317 83577 83188 83483 83648 82947 81905 81724 82921 85129 87886 91017 94438
54913 94438 98151 102371 107172 112086 116491 120265 123599 126201 127286 126529 124570 122291 119873 116911 113266
54898 113266 109401 105854 102710 99771 97018 94614 92470 90179 87581 85158 83600 83019 82875 82644 82354
54883 82354 82402 83045 84118 85162 85842 86338 87264 89054 91486 94025 96500 99175 102194 105360 108602 112387
54867 112387 117350 123538 130097 135687 139255 140535 139851 137536 133759 128930 123890 119282 114938 110313
54853 110313 105434 101031 97703 95368 93529 91765 89929 88223 87073 86612 86324 85574 84475 83700 83388
54838 83388 82820 81432 79662 78387 77908 77845 77818 77828 78035 78419 78685 78512 78014 77888 78738 80188 81072 80721 79702
$$ packed form
54947G9172q21n80J4O96Q33L95L7M0j13p61j370j293o24J64R10J558J793J524
54929H1574J187J041O73j58p40l89K95J65p01j042j81J197K208K757L131L421
54913I4438L713M220M801M914M405L774L334K602J085p57j959k279k418k962l645
54898A13266l865l547l144k939k753k404k144k291k598k423j558n81j44k31k90
54883H2354M8O43J073J044O80M96R26J790K432K539K475K675L019L166L242L785
54867A12387M963O188O559N590L568J280o84k315l777m829n040m608m344m625
54853A10313m879m403l328k335j839j764j836j706j150m61k88p50j099p75l12
54838H3388n68j388j770j275m79o3k7J0K07L84K66j73m98j26Q50J450Q84l51j019
$$ plain form
54819 79702 79024 78961 79019 78809 78519 78568 79120 79978 80795 81397 81938 82665 83486 83949 83789 83234 82685 82310 82167 82500
54799 82500 83552 85077 86300 86529 85811 84934 84673 85005 85229 84912 84475 84587 85253 85964 86551 87283 88083 88307
54781 88307 87574 86303 85127 84236 83610 83514 84318 86080 88569 91435 94060 95680 96130 96275 97239 99271 101704
54764 101704 103861 105610 107203 109042 111610 115279 120010 125373 130755 135419 138572 139815 139555 138635 137455
54749 137455 135609 132424 127727 122093 116533 111941 108687 106552 104997 103437 101438 98987 96616 94996
54735 94996 94236 93813 93286 92766 92479 92253 91827 91350 91148 91126 90927 90624 90783 91774 93390 95261 97311 99680
54717 99680 102472 105753 109555 113721 117913 121878 125558 128805 131184 132266 132000 130608 128178 124628 120175
54702 120175 115547 111480 108020 104583 100819 97199 94593 93362 93052 92917 92550 92003 91460 90854 89844 88304
$$ packed form
54819G9702o78o3N8k10k90M9N52Q58Q17O02N41P27Q21M63j60n55n49l75j43L33
54799H2500J052J525J223K29p18q77k61L32K24l17m37J12O66P11N87P32Q00K24
54781H8307p33j271j176q91o26r6Q04J762K489K866K625J620M50J45R64K032K433
54764A01704K157J749J593J839K568L669M731N363N382M664L153J243k60r20j180
54749A37455j846l185m697n634n560m592l254k135j555j560j999k451k371j620
54735I4996p60m23n27n20k87k26m26m77k02k2j99l03J59R91J616J871K050K369
54717I9680K792L281L802M166M192L965L680L247K379J082k66j392k430l550m453
54702A20175m628m067l460l437l764l620k606j231l10j35l67n47n43o06j010j540
$$ plain form
54686 88304 86810 86271 86822 87421 87020 85876 85110 85095 85018 84103 82535 80943 79694 79099 79618 81192 82797
54669 82797 83372 82922 82160 81344 80188 78743 77644 77329 77594 78061 78619 79260 79885 80457 80980 81237 80887 80040
54651 80040 79377 79426 79981 80479 80771 81154 81737 82112 81855 81128 80598 80740 81401 82129 82750 83399 84087 84586 84804
54632 84804 84935 85103 85204 85266 85614 86328 86865 86673 86011 85655 85869 86182 86195 86137 86398 86899 87212 87116 86781 86495
54612 86495 86365 86214 85740 84857 83861 83196 83044 83309 83930 84955 86261 87459 88188 88406 88280 87954 87518 87055
54594 87055 86617 86197 85876 85879 86380 87236 87999 88297 88171 87996 88005 87977 87598 87099 87245 88462 90183 91362 91567 91302
54574 91302 91275 91666 92197 92610 92848 92905 92734 92362 91957 91739 91843 92268 92930 93712 94443 94880 94856 94484 94105 93949
54554 93949 93947 93953 94045 94453 95209 96043 96633 96898 97053 97422 98175 99153 100016 100586 101004 101489 102058 102597 103076 103525 103800
$$ packed form
54686H8304j494n39N51N99m01j144p66j5p7r15j568j592j249n95N19J574J605
54669H2797N75m50p62q16j156j445j099l15K65M67N58O41O25N72N23K57l50q47
54651H0040o63M9N55M98K92L83N83L75k57p27n30J42O61P28O21O49O88M99K18
54632H4804J31J68J01O2L48P14N37j92o62l56K14L13J3n8K61N01L13r6l35k86
54612H6495j30j51m74q83r96o65j52K65O21J025J306J198P29K18j26l26m36m63
54594H7055m38m20l21LN01Q56P63K98j26j75Rk8l79m99J46J217J721J179K05k65
54574I1302k7L91N31M13K38N7j71l72m05k18J04M25O62P82P31M37k4l72l79j56
54554I3949kOR2M08P56Q34N90K65J55L69P53R78Q63N70M18M85N69N39M79M49K75
$$ plain form
54533 103800 103615 102885 101900 101049 100372 99549 98406 97344 97014 97507 98079 97905 96939 95788 94911 94328 94029 94100
54515 94100 94338 94272 93855 93660 94045 94502 94304 93462 92531 91764 91083 90736 91228 92507 93851 94773 95533 96457 97261
54496 97261 97436 96982 96374 95971 95883 96212 96999 97945 98582 98839 99171 100003 101246 102480 103400 103957 104223 104351 104583
54477 104583 105120 105949 106913 107907 108900 109803 110520 111097 111609 111939 111954 111923 112371 113322 114077 114049 113526 113247 113487 114016
54457 114016 114734 115767 116958 117772 117822 117149 116000 114706 113698 113198 112882 112311 111619 111246 111143 110933 110806
54440 110806 111295 112015 111696 109898 107717 106150 104780 102954 101372 101230 102309 103224 103362 103352 103613 103685 103274
54423 103274 102885 102931 103060 102932 103027 104075 106019 107984 109145 109388 109357 109899 111144 112055 111351 109044 106638
54406 106638 105642 106265 107743 109380 110913 112221 113228 114031 114867 115888 117028 117959 118231 117735 117036 116912
$$ packed form
54533A03800j85p30r85q51o77q23j143j062l30M93N72j74r66j151q77n83k99P1
54515I4100K38o6m17j95L85M57j98q42r31p67o81l47M92J279J344R22P60R24Q04
54496I7261J75m54o08m03q8L29P87R46O37K57L32Q32J243J234R20N57K66J28K32
54477A04583N37Q29R64R94R93R03P17N77N12L30J5l1M48R51P55k8n23k79K40N29
54457A14016P18J033J191Q14N0o73j149j294j008n00l16n71o92l73j03k10j27
54440A10806M89P20l19j798k181j567j370j826j582j42J079R15J38j0K61P2m11
54423A03274l89M6J29j28R5J048J944J965J161K43l1N42J245R11p04k307k406
54406A06638r96O23J478J637J533J308J007Q03Q36J021J140R31K72m96o99j24
$$ plain form
54390 116912 117510 118282 118775 119007 118997 118494 117479 116535 116253 116571 117014 117348 117655 118001 118439 119186 120397 121817
54372 121817 123004 123878 124740 125709 126498 126906 127340 128539 130767 133461 135791 137461 138751 139797 140164 139389
54356 139389 137770 136287 135708 135975 136428 136453 135930 135236 134783 134455 133659 132065 130044 128053 125908 123143 119937
54339 119937 117118 115282 114380 114128 114224 114148 113423 112335 111813 112250 112907 112801 111796 110492 109457 108886 108698
54322 108698 108595 108293 107968 108158 108998 109973 110736 111696 113282 115030 116003 115939 115420 115032 114940 115168 115648 115869 115062
54303 115062 113067 110677 108855 107842 107291 107060 107468 108710 110275 111245 111174 110496 109933 109717 109607 109518 109708
54286 109708 110328 111172 112008 112821 113541 113924 113992 114269 115208 116486 117247 117029 116219 115575 115433 115391 114751 113382 112038
54267 112038 111611 112080 112620 112801 113138 114168 115526 116452 116870 117432 118612 120254 121890 123058 123422 123049 122570
$$ packed form
54390A16912N98P72M93K32j0n03j015r44k82L18M43L34L07L46M38P47J211J420
54372A21817J187Q74Q62R69P89M08M34J199K228K694K330J670J290J046L67p75
54356A39389j619j483n79K67M53K5n23o94m53l28p96j594k021j991k145k765l206
54339A19937k819j836r02k52R6p6p25j088n22M37O57j06j005j304j035n71j88
54322A08698j03l02l25J90Q40R75P63R60J586J748R73o4n19l88r2K28M80K21q07
54303A15062j995k390j822j013n51k31M08J242J565R70p1o78n63k16j10q9J90
54286A09708O20Q44Q36Q13P20L83O8K77R39J278P61k18q10o44j42m2o40j369j344
54267A12038m27M69N40J81L37J030J358R26M18N62J180J642J636J168L64l73m79
$$ plain form
54250 122570 122683 123454 124394 125142 125658 125898 125786 125539 125498 125493 124834 123191 121109 119407 118318 117493 116615 115728
54232 115728 115062 114740 114650 114561 114438 114622 115412 116419 116674 115628 113849 112444 111976 112245 112921 113862 114777 115149
54214 115149 114845 114494 114820 115729 116439 116431 115851 114949 113658 112002 110510 109806 110048 111035 112641 114729 116822
54197 116822 118408 119503 120538 121722 122902 123938 124670 124650 123584 122107 121328 121364 120995 119284 116931 115440
54181 115440 115330 115768 115770 115219 114835 115535 117695 120680 123265 124750 125441 125815 125697 124686 123010 121323 119922
54164 119922 118688 117614 116798 116139 115608 115599 116368 117294 117483 116982 116650 116827 116997 116821 116616 116543 116186 115377 114701
54145 114701 114671 114986 115086 114933 114754 114531 114291 114438 115166 115903 115920 115305 114752 114677 115001 115557 116107 116187 115597 114946
54125 114946 115082 116013 116937 117262 116994 116251 115157 114292 114427 115515 116665 117475 118686 120951 123516 124908
$$ packed form
54250A22570J13P71R40P48N16K40j12k47m1no59j643k082j702j089q25q78q87
54232A15728o66l22r0q9j23J84P90J007K55j046j779j405m68K69O76R41R15L72
54214A15149l04l51L26R09P10qn80r02j291j656j492p04K42R87J606K088K093
54197A16822J586J095J035J184J180J036P32k0j066j477p79L6l69j711k353j491
54181A15440j10M38Kn51l84P00K160K985K585J485O91L74j18j011j676j687j401
54164A19922j234j074q16o59n31rP69R26J89n01l32J77J70j76k05p3l57q09o76
54145A14701l0L15J00j53j79k23k40J47P28P37J7o15n53p5L24N56N50Q0n90o51
54125A14946J36R31R24L25k68p43j094q65J35J088J150Q10J211K265K565J392
$$ plain form
54109 124908 124673 123718 123087 123069 123557 124597 126265 128368 130585 132724 134740 136559 137975 138581 137920 136027
54093 136027 133833 132633 132867 133612 133534 132260 130643 129804 130128 131150 132151 132722 132850 132665 132249 131677 131079
54076 131079 130531 129993 129482 129191 129231 129319 129023 128338 127787 127916 128854 130344 131876 132843 132944 132598 132528 132821 132790
54057 132790 131942 130593 129182 127590 125637 123816 122813 122539 122372 122233 122693 124031 125857 127809 129939
54042 129939 132221 134281 135885 137267 138697 140168 141668 143354 145167 146690 147594 147898 147652 146847 145835
54027 145835 145266 145232 144975 143920 142582 141944 142226 142740 142755 142051 140830 139509 138538 138047 137764 137441 137143 136903
54009 136903 136457 135629 134642 133649 132307 130291 127946 125997 124816 124385 124669 125455 126175 126505 126906 127904 129012
53992 129012 129190 128309 127373 127203 127656 128334 129263 130492 131606 132107 131948 131394 130745 130450 131081 132875 135506
$$ packed form
54109A24908k35r55o31j8M88J040J668K103K217K139K016J819J416O06o61j893
54093A36027k194j200K34P45p8j274j617q39L24J022J001N71J28j85m16n72n98
54076A31079n48n38n11k91M0Q8k96o85n51J29R38J490J532R67J01l46p0K93l1
54057A32790q48j349j411j592j953j821j003k74j67j39M60J338J826J952K130
54042A29939K282K060J604J382J430J471J500J686J813J523R04L04k46q05j012
54027A45835n69l4k57j055j338o38K82N14J5p04j221j321r71m91k83l23k98k40
54009A36903m46q28r87r93j342k016k345j949j181m31K84P86P20L30M01R98J108
53992A29012J78q81r36j70M53O78R29J229J114N01j59n54o49k95O31J794K631
$$ plain form
53975 135506 138543 141782 145031 148013 150831 154195 158751 164312 169898 174307 176526 176084 173480 170027
53961 170027 166816 163913 160832 157531 154480 151922 149694 147792 146540 145935 145315 144120 142709 141965 142128
53946 142128 142519 142533 142466 143041 144435 146245 148249 150690 153741 157213 160953 165038 169233 172719 174845 175852
53930 175852 176366 176385 175390 173334 170944 168971 167675 167179 167779 169552 171927 173996 175224 175769 176180 176799
53914 176799 177396 177485 177056 176696 176711 176533 175527 174108 173318 173361 173342 172561 171211 169568 167357 164482 161712 159882
53896 159882 158815 157699 156256 154857 153686 152450 150967 149478 148326 147694 147650 148053 148421 148265 147590 146738
53880 146738 145722 144183 142156 140423 139777 140121 140556 140301 139331 138233 137676 137952 138811 139639 139968 139926 140119
53863 140119 140906 141823 141937 140852 139149 137707 136812 136157 135491 134856 134244 133511 132736 132280 132254 132277 131998 131608
$$ packed form
53975A35506L037L239L249K982K818L364M556N561N586M409K219m42k604l453
53961A70027l211k903l081l301l051k558k228j902j252o05o20j195j411p44J63
53946A42128L91J4o7N75J394J810K004K441L051L472L740M085M195L486K126J007
53930A75852N14J9r95k056k390j973j296m96O00J773K375K069J228N45M11O19
53914A76799N97Q9m29l60J5j78j006j419p90M3j9p81j350j643k211k875k770j830
53896A59882j067j116j443j399j171j236j483j489j152o32m4M03L68j56o75q52
53880A46738j016j539k027j733o46L44M35k55r70j098n57K76Q59Q28L29m2J93
53863A40119P87R17J14j085j703j442q95o55o66o35o12p33p75m56k6K3k79l90
$$ plain form
53845 131608 131581 132098 132938 133719 134004 133445 132234 131288 131564 133110 135051 136559 137554 138410 139294 139981 140192 139943
53827 139943 139601 139649 140298 141246 141894 141918 141608 141564 142036 142631 142744 142281 141844 142127 143195 144504 145608 146635
53809 146635 147984 149698 151380 152644 153455 153948 154199 154352 154816 155949 157482 158615 158959 159128 160008 161617
53793 161617 163181 164320 165512 167168 168838 169886 170479 171254 172258 172932 173069 173081 173131 172691 171305 169330
53777 169330 167469 165843 163934 161332 158274 155435 153370 152114 151235 150289 149292 148692 148910 149916 151147
53762 151147 151749 151101 149411 147664 146698 146383 145984 145191 144399 144015 144015 144286 145011 146420 148463 150823 153127
53745 153127 155027 156320 157044 157377 157537 157918 158995 160656 161943 162111 161793 162414 164478 167206 169859 172423
53729 172423 174787 176295 176771 177165 178458 180507 182675 184986 187842 190956 193446 194845 195349 195288 195051 195407
$$ packed form
53845A31608k7N17Q40P81K85n59j211r46K76J546J941J508R95Q56Q84O87K11k49
53827A39943l42M8O49R48O48K4l10m4M72N95J13m63m37K83J068J309J104J027
53809A46635J349J714J682J264Q11M93K51J53M64J133J533J133L44J69Q80J609
53793A61617J564J139J192J656J670J048N93P75J004O74J37J2N0m40j386j975
53777A69330j861j626j909k602l058k839k065j256q79r46r97o00K18J006J231
53762A51147O02o48j690j747r66l15l99p93p92l84%K71P25J409K043K360K304
53745A53127J900J293P24L33J60L81J077J661J287J68l18O21K064K728K653K564
53729A72423K364J508M76L94J293K049K168K311K856L114K490J399N04o1k37L56
$$ plain form
53713 195407 197107 200050 203344 206279 208834 211291 213789 216327 218805 221071 223117 225215 227563 229975
53699 229975 232189 234316 236660 239315 242250 245552 249199 252819 256043 258889 261451 263518 264932 265957
53685 265957 266745 266770 265430 262946 260047 257055 254041 251545 250152 249376 248013 245846 244116 243942 244999
53670 244999 246132 246640 246492 245871 245032 244320 243910 243695 243584 243633 243808 243988 244298 245047 246233 247478 248482 249114
53652 249114 249119 248408 247670 247963 249480 251454 253506 256181 259710 263169 265666 267703 270473 274209 278046 281207
53636 281207 283535 285114 286134 287030 288069 288940 289409 290167 292200 295336 298304 300375 302201 304774 308292
53621 308292 312420 316993 321938 326932 331642 336023 340060 343541 346471 349317 352421 355480 358137 360787
53607 360787 364155 368153 371818 374456 376263 377649 378540 378732 378463 378213 378146 378151 378225 378383 378334 377731 376707 375723
$$ packed form
53713A95407J700K943L294K935K555K457K498K538K478K266K046K098K348K412
53699B29975K214K127K344K655K935L302L647L620L224K846K562K067J414J025
53685B65957P88K5j340k484k899k992l014k496j393p76j363k167j730j74J057
53670B44999J133N08j48o21q39p12m10k15j11M9J75J80L10P49J186J245J004O32
53652B49114Np11p38K93J517J974K052K675L529L459K497K037K770L736L837L161
53636B81207K328J579J020Q96J039Q71M69P58K033L136K968K071J826K573L518
53621C08292M128M573M945M994M710M381M037L481K930K846L104L059K657K650
53607C60787L368L998L665K638J807J386Q91J92k69k50o7NP4J58m9o03j024r84
$$ plain form
53589 375723 374815 373434 371189 368336 365356 362369 359323 356468 354233 352674 351328 349641 347388 344759
53575 344759 342194 340112 338636 337580 336760 336185 335839 335443 334640 333356 331889 330753 330467 331197 332386 332998
53559 332998 332508 331557 331354 332489 334545 336683 338300 339242 339777 340405 341438 342804 344410 346535 349540 353345
53543 353345 357559 362014 366780 371794 376942 382463 388747 395745 403073 410702 418895 427443 435710 443750
53529 443750 452721 463687 476491 490271 504650 519797 535602 551445 566840 581948 597462 614235
53517 614235 632855 653292 674974 697418 720606 744604 769149 793991 819379 845651 872414
53506 872414 898658 923745 947877 971444 994314 1015997 1036281 1055478 1074150 1092766 1111519
53495 1111519 1130274 1148616 1166034 1182219 1197340 1212043 1227039 1242656 1258876 1275743 1293382
$$ packed form
53589C75723r08j381k245k853k980k987l046k855k235j559j346j687k253k629
53575C44759k565k082j476j056q20n75l46l96q03j284j467j136k86P30J189O12
53559C32998m90r51k03J135K056K138J617R42N35O28J033J366J606K125L005L805
53543C53345M214M455M766N014N148N521O284O998P328P629Q193Q548Q267Q040
53529D43750Q971J0966J2804J3780J4379J5147J5805J5843J5395J5108J5514J6773
53517F14235J8620K0437K1682K2444K3188K3998K4545K4842K5388K6272K6763
53506H72414K6244K5087K4132K3567K2870K1683K0284J9197J8672J8616J8753
53495A111519J8755J8342J7418J6185J5121J4703J4996J5617J6220J6867J7639
$$ plain form
53484 1293382 1311461 1328946 1344802 1358819 1371431 1382748 1392137 1398831 1402661 1404001 1403172 1400077 1394340
53471 1394340 1385728 1374451 1361182 1346832 1332261 1318057 1304367 1290818 1276786 1261897 1246226
53460 1246226 1229859 1212398 1193148 1171895 1149333 1126658 1104792 1083982 1063976 1044417 1025070
53449 1025070 1005867 986982 969022 953047 940091 930483 923676 918800 915320 913141 912272 912533 913526
53436 913526 914804 916154 917843 920486 924520 929868 936176 943271 951257 960365 970951 983510 998327
53423 998327 1015064 1032955 1051505 1070763 1090895 1111800 1133373 1155927 1180169 1206799 1236291
53412 1236291 1268784 1303899 1340698 1378222 1416271 1455556 1497017 1541122 1587793 1636712 1687438
53401 1687438 1739427 1792216 1845588 1899395 1953312 2007042 2060710 2114747 2169284 2223867 2277822
$$ packed form
53484A293382J8079J7485J5856J4017J2612J1317R389O694L830J340q29l095n737
53471A394340q612j1277j3269j4350j4571j4204j3690j3549j4032j4889j5671
53460A246226j6367j7461j9250k1253k2562k2675k1866k0810k0006j9559j9347
53449A025070j9203j8885j7960j5975j2956r608o807m876l480k179q69K61R93
53436I13526J278J350J689K643M034N348O308P095P986R108J0586J2559J4817
53423I98327J6737J7891J8550J9258K0132K0905K1573K2554K4242K6630K9492
53412A236291L2493L5115L6799L7524L8049L9285M1461M4105M6671M8919N0726
53401A687438N1989N2789N3372N3807N3917N3730N3668N4037N4537N4583N3955
$$ plain form
53390 2277822 2330623 2381792 2430759 2477098 2520784 2561979 2600630 2636343 2668507 2696395 2719414
53379 2719414 2737499 2751165 2760925 2766731 2768061 2764266 2754582 2738101 2714198 2682944 2644890 2600722
53367 2600722 2551549 2499230 2445739 2392085 2338306 2284443 2230931 2177949 2125233 2072950 2022218
53356 2022218 1974231 1929174 1886462 1845727 1806948 1769671 1732706 1694906 1656076 1617048 1578980
53345 1578980 1542671 1508443 1476496 1447166 1420675 1396746 1374751 1354407 1336134 1320631 1308058
53334 1308058 1297579 1287586 1276504 1263640 1249309 1234085 1218178 1201803 1185778 1171062 1157675
53323 1157675 1144722 1131717 1119272 1108269 1098878 1090850 1084302 1079686 1077179 1076503 1077196 1078775 1080873
53310 1080873 1083557 1087327 1092620 1099540 1108225 1119000 1131794 1145885 1160754 1176909 1195253 1215859
$$ packed form
53390B277822N2801N1169M8967M6339M3686M1195L8651L5713L2164K7888K3019
53379B719414J8085J3666R760N806J330l795r684j6481k3903l1254l8054m4168
53367B600722m9173n2319n3491n3654n3779n3863n3512n2982n2716n2283n0732
53356B022218m7987m5057m2712m0735l8779l7277l6965l7800l8830l9028l8068
53345A578980l6309l4228l1947k9330k6491k3929k1995k0344j8273j5503j2573
53334A308058j0479r993j1082j2864j4331j5224j5907j6375j6025j4716j3387
53323A157675j2953j3005j2445j1003r391q028o548m616k507o76O93J579K098
53310A080873K684L770N293O920Q685J0775J2794J4091J4869J6155J8344K0606
$$ plain form
53298 1215859 1237965 1261052 1285317 1311011 1337785 1364800 1391130 1416108 1439637 1462155 1483902
53287 1483902 1504250 1522107 1536921 1548870 1558098 1564329 1567354 1567369 1564548 1558676 1549517 1537328 1522764
53274 1522764 1506344 1488188 1468158 1446139 1422227 1396729 1370017 1342473 1314583 1286851 1259377
53263 1259377 1231707 1203375 1174503 1145603 1117001 1088811 1061299 1034698 1008692 982696 956814
53252 956814 931977 908757 886458 863828 840553 817589 796039 776008 756686 737346 718108
53241 718108 699679 682548 666641 651774 638195 626478 617008 609718 604090 599162 593736 587041 579204
53228 579204 570783 561860 551921 540585 528069 514860 501338 487823 474630 461861 449369 437140
53216 437140 425487 414716 404772 395364 386315 377688 369621 362073 354625 346639 337854 328845 320582 313467
$$ packed form
53298A215859K2106K3087K4265K5694K6774K7015K6330K4978K3529K2518K1747
53287A483902K0348J7857J4814J1949R228O231L025J5k821n872r159j2189j4564
53274A522764j6420j8156k0030k2019k3912k5498k6712k7544k7890k7732k7474
53263A259377k7670k8332k8872k8900k8602k8190k7512k6601k6006k5996k5882
53252I56814k4837k3220k2299k2630k3275k2964k1550k0031j9322j9340j9238
53241G18108j8429j7131j5907j4867j3579j1717r470p290n628m928n426o695p837
53228E79204q421q923r939j1336j2516j3209j3522j3515j3193j2769j2492j2229
53216D37140j1653j0771r944r408r049q627q067p548p448p986q785r009q263p115
$$ plain form
53202 313467 306975 300303 293108 285646 278521 272322 267137 262262 256764 250583 244780 240436 237560 235329
53188 235329 233118 230871 228553 225821 222477 219012 216376 215068 214570 213838 212424 210909 210074 209814 209219
53173 209219 207728 205820 204385 203638 202978 201867 200652 200299 201238 202629 203091 202292 201371 201447 202127 202090 200972
53156 200972 199797 199452 199555 199262 198516 197877 197575 197425 197453 197858 198369 198296 197472 196708 196945 198121 199176 199147 198107
53137 198107 196989 196612 197050 197911 198911 199909 200547 200341 199261 197934 197122 197212 198226 199915 201685 202837
53121 202837 203221 203452 204177 205415 206840 208415 210280 212195 213590 214160 214129 213898 213712 213517 212885 211205 208381
53104 208381 205225 202756 201111 199604 197836 196189 195072 194230 193193 192031 191221 190977 191108 191472 192143 193107
53088 193107 194100 194890 195485 195932 195974 195151 193321 191055 189383 188948 189378 189653 189126 188132 187449 187360 187433 187195 186721
$$ packed form
53202C13467o492o672p195p462p125o199n185m875n498o181n803m344k876k231
53188B35329k211k247k318k732l344l465k636j308m98p32j414j515q35k60n95
53173B09219j491j908j435p47o60j111j215l53R39J391M62p99r21P6O80l7j118
53156B00972j175l45J03k93p46o39l02j50K8M05N11p3q24p64K37J176J055k9j040
53137A98107j118l77M38Q61J000R98O38k06j080j327q12R0J014J689J770J152
53121B02837L84K31P25J238J425J575J865J915J395N70l1k31j86j95o32j680k824
53104B08381l156k469j645j507j768j647j117q42j037j162q10k44J31L64O71R64
53088A93107R93P90N95M47M2q23j830k266j672m35M30K75n27r94o83q9P3k38m74
$$ plain form
53069 186721 186472 186665 186992 186945 186332 185450 184756 184366 183940 183136 182143 181597 181946 182973 184077 184840 185268 185614
53051 185614 186162 187076 188180 188916 188762 187723 186203 184443 182470 180686 179996 180934 182813 184165 184070 182863
53035 182863 181622 181196 181704 182704 183692 184482 185056 185155 184411 183026 181907 181693 181902 181623 180905 180798 181886
53018 181886 183430 184276 184200 183908 184039 184548 184987 185036 184739 184395 184236 184203 184132 184135 184489 185146 185616 185488 184775 183690
52998 183690 182456 181535 181569 182642 183917 184539 184726 185444 187000 188578 189309 189356 189585 190419 191397 191788 191383 190639
52980 190639 190272 190800 192283 194290 196132 197379 198336 199897 202720 206494 210159 212837 214440 215455 216364
52965 216364 217285 217901 217651 216265 214241 212571 211809 211553 210991 209785 208228 206756 205511 204312 202865 201049
52949 201049 199157 197767 197248 197392 197594 197318 196398 195086 193873 193055 192401 191477 190355 189669 189777 190215 190237
$$ packed form
53069A86721k49J93L27m7o13q82o94l90m26q04r93n46L49J027J104P63M28L46
53051A85614N48R14J104P36j54j039j520j760j973j784o90R38J879J352r5j207
53035A82863j241m26N08J000R88P90N74R9p44j385j119k14K09k79p18j07J088
53018A81886J544Q46p6k92J31N09M39M9k97l44j59l3p1LL54O57M70j28p13j085
52998A83690j234r21L4J073J275O22J87P18J556J578P31M7K29Q34R78L91m05p44
52980A90639l67N28J483K007J842J247R57J561K823L774L665K678J603J015R09
52965B16364R21O16k50j386k024j670p62k56n62j206j557j472j245j199j447j816
52949B01049j892j390n19J44K02k76r20j312j213q18o54r24j122o86J08M38K2
$$ plain form
52932 190237 189630 188704 187794 187127 186906 187065 187106 186640 185972 185725 186019 186429 186671 186771 186611 185884 184642 183376
52914 183376 182451 181918 181974 182980 184734 186327 187163 187686 188577 189618 189960 189285 188074 186826 185681 184826 184576
52897 184576 184829 185009 184913 185085 185914 186785 186724 185702 184653 184278 184404 184603 184809 185058 185176 185154 185432 186349 187547
52878 187547 188462 189217 190461 192378 194393 195950 197095 198163 199278 200346 201208 201697 201877 202273 203454 205206
52862 205206 206596 207085 207134 207431 208005 208490 208811 209051 208938 208014 206176 203611 200468 197071 194188 192387 191197
52845 191197 189510 186876 183851 181111 178831 177086 176147 176020 176141 175934 175397 174880 174566 174403 174301 174203 174138
52828 174138 174301 174785 175156 174677 173226 171572 170448 169710 168856 168038 167955 168801 169861 170322 170104 169735 169694 170118
52810 170118 170938 172044 173276 174449 175464 176384 177318 178209 178749 178579 177551 175869 174024 172602 171929 171787
$$ packed form
52932A90237o07r26r10o67k21J59M1m66o68k47K94M10K42J00j60p27j242j266
52914A83376r25n33N6J006J754J593Q36N23Q91J041L42o75j211j248j145q55k50
52897A84576K53J80r6J72Q29Q71o1j022j049l75J26J99K06K49J18k2K78R17J198
52878A87547R15P55J244J917K015J557J145J068J115J068Q62M89J80L96J181J752
52862B05206J390M89M9K97N74M85L21K40j13r24j838k565l143l397k883j801j190
52845A91197j687k634l025k740k280j745r39j27J21k07n37n17l14j63j02r8o5
52828A74138J63M84L71m79j451j654j124p38q54q18q3Q46J060M61k18l69m1M24
52810A70118Q20J106J232J173J015R20R34Q91N40j70j028j682j845j422o73j42
$$ plain form
52794 171787 171587 171044 170583 170820 171700 172417 172246 171227 170016 169313 169449 170168 170726 170485 169585 168764 168472 168452
52776 168452 168325 168099 167809 167173 166116 165308 165521 166576 167494 167706 167529 167425 167390 167337 167522 168212 169253 170285
52758 170285 171156 171878 172487 173248 174654 176735 178655 179541 179598 179822 180677 181692 182437 183161 184166 185212 186085
52741 186085 187221 189058 191090 192371 192872 193581 195107 196888 198053 198483 198621 198730 198823 198956 199001 198333 196297
52724 196297 193071 189678 187091 185576 184821 184353 183755 182859 181890 181278 181179 181307 181259 180891 180431 180337 180970 182197
52706 182197 183338 183786 183699 183833 184625 185672 186223 185996 185339 184740 184404 184302 184500 185211 186411 187492 187584 186416
52688 186416 184648 183191 182362 181925 181681 181583 181448 181077 180688 180766 181399 182195 182945 183869 184987 185737 185595 184749
52670 184749 183878 183553 184168 185963 188564 190792 191579 191066 190310 189982 189993 190348 191569 193866 196535 198779 200727
$$ packed form
52794A71787k00n43m61K37Q80P17j71j019j211p03J36P19N58k41r00q21k92k0
52776A68452j27k26k90o36j057q08K13J055R18K12j77j04l5n3J85O90J041J032
52758A70285Q71P22O09P61J406K081J920Q86N7K24Q55J015P45P24J005J046Q73
52741A86085J136J837K032J281N01P09J526J781J165M30J38J09R3J33M5o68k036
52724A96297l226l393k587j515p55m68n98q96r69o12r9J28m8l68m60r4O33J227
52706A82197J141M48q7J34P92J047N51k27o57n99l36j02J98P11J200J081R2j168
52688A86416j768j457q29m37k44r8j35l71l89P8O33P96P50R24J118P50j42q46
52670A84749q71l25O15J795K601K228P87n13p56l28J1L55J221K297K669K244J948
$$ plain form
52653 200727 202941 205113 206049 205164 203288 201621 200328 198690 196318 193574 190900 188392 186183 184654 183938
52638 183938 183634 183433 183654 184726 186396 187983 189277 190557 191747 192201 191602 190622 190312 191067 192490 194025
52622 194025 195431 196706 197813 198526 198550 197907 197153 196937 197214 197248 196592 195766 195608 196186 196754 196706 196142 195431 194655
52603 194655 193718 192805 192406 192877 194120 195703 197202 198407 199283 199856 200131 200071 199670 199121 198881 199365 200452
52586 200452 201487 201921 201817 201597 201468 201425 201637 202393 203650 205021 206276 207491 208642 209481 209994 210540 211260
52569 211260 211725 211475 210571 209303 207724 205934 204502 203990 204095 203839 202691 201127 199968 199544 199637 199935 200351
52552 200351 201012 202058 203391 204664 205654 206503 207360 207922 207723 206877 206106 205907 206035 206032 205932 206092 206533 206784
52534 206784 206428 205545 204542 203661 202791 201753 200658 199839 199414 199096 198600 198109 198072 198577 199173 199351 198996 198320
$$ packed form
52653B00727K214K172R36q85j876j667j293j638k372k744k674k508k209j529p16
52638A83938l04k01K21J072J670J587J294J280J190M54n99r80l10P55J423J535
52622A94025J406J275J107P13K4o43p54k16K77L4o56q26j58N78N68m8n64p11p76
52603A94655r37r13l99M71J243J583J499J205Q76N73K75o0m01n49k40M84J087
52586B00452J035M34j04k20j29m3K12P56J257J371J255J215J151Q39N13N46P20
52569B11260M65k50r04j268j579j790j432n12J05k56j148j564j159m24R3K98M16
52552B00351O61J046J333J273R90Q49Q57N62j99q46p71j99J28lj00J60M41K51
52534B06784l56q83j003q81q70j038j095q19m25l18m96m91l7N05N96J78l55o76
$$ plain form
52516 198320 197684 197550 198316 199969 202106 204472 207295 210886 215077 219376 223498 227360 230617 232650 233176
52501 233176 232552 231234 229174 226070 222137 218255 215232 213125 211471 210040 209069 208661 208288 207249 205586
52486 205586 204225 203989 204680 205366 205443 205123 205005 205554 207064 209606 212645 215064 216109 216220 216499 217368 218242
52469 218242 218574 218659 219079 219850 220607 221342 222349 223578 224672 225744 227511 230346 233603 236271 238071 239495
52453 239495 240810 241436 240441 237546 233573 229950 227695 226728 226162 225209 223781 222239 220846 219638 218676 218076
52437 218076 217747 217331 216508 215258 213810 212470 211578 211468 212233 213547 214893 216036 217155 218465 219816 220845
52421 220845 221448 221916 222612 223715 225294 227417 230059 233156 236882 241719 247967 255370 263415 271691 279509
52406 279509 285384 287602 285656 280751 274702 268608 262772 257475 253285 250618 249338 248853 248548 248154 247872
$$ packed form
52516A98320o36j34P66J653K137K366K823L591M191M299M122L862L257K033N26
52501B33176o24j318k060l104l933l882l023k107j654j431r71m08l73j039j663
52486B05586j361k36O91O86P7l20j18N49J510K542L039K419J045J11K79Q69Q74
52469B18242L32Q5M20P71P57P35J007J229J094J072J767K835L257K668J800J424
52453B39495J315O26r95k895l973l623k255r67n66r53j428j542j393j208r62o00
52437B18076l29m16q23j250j448j340q92j10P65J314J346J143J119J310J351J029
52421B20845O03M68O96J103J579K123K642L097L726M837O248P403Q045Q276P818
52406B79509N875K218j946m905o049o094n836n297m190k667j280m85l05l94k82
$$ plain form
52391 247872 248117 249131 250824 252896 254909 256342 256949 257171 257851 259309 261060 262660 264432 266961 270195
52376 270195 273626 277222 281521 286723 292227 297327 301958 306525 311307 316399 321995 328232 334693 340400
52362 340400 344507 346937 348262 349133 350010 351383 353854 357715 362535 367492 372223 377198 383235 390814 399970
52347 399970 410568 422429 435286 448915 463381 479010 495973 513972 532380 550801 569486
52336 569486 589082 609847 631221 652379 673085 693706 714404 734786 754484 773632 792438
52325 792438 810610 827618 843352 858118 872077 885046 896774 907012 915254 920729 922817 921489
52313 921489 917400 911672 905364 898924 892162 884884 877365 869994 862740 855354 847974 841102 835019 829654
52299 829654 825128 822049 821127 822715 826714 832702 840063 848243 856900 865716 874256 882412 890887 900737
$$ packed form
52391B47872K45J014J693K072K013J433O07K22O80J458J751J600J772K529L234
52376B70195L431L596M299N202N504N100M631M567M782N092N596O237O461N707
52362C40400M107K430J325Q71Q77J373K471L861M820M957M731M975O037P579R156
52347C99970J0598J1861J2857J3629J4466J5629J6963J7999J8408J8421J8685
52336E69486J9596K0765K1374K1158K0706K0621K0698K0382J9698J9148J8806
52325G92438J8172J7008J5734J4766J3959J2969J1728J0238Q242N475K088j328
52313I21489m089n728o308o440o762p278p519p371p254p386p380o872o083n365
52299H29654m526l079r22J588L999N988P361Q180Q657Q816Q540Q156Q475R850
$$ plain form
52285 900737 912308 925033 938377 952497 967675 983513 999018 1013275 1025771 1036336 1045218 1053047
52273 1053047 1060283 1066534 1070586 1071230 1068120 1061942 1053847 1044612 1034283 1022619 1009823 996565 983307
52260 983307 969941 956254 942438 928828 915341 901594 887558 873830 861242 850403 841530 834432
52248 834432 828554 823319 818548 814360 810583 806537 801621 795998 790404 785358 780872 776965 774032 772363
52234 772363 771536 770742 769739 769093 769383 770518 772052 773820 775942 778425 781149 784203 787859 792155 796699
52219 796699 800992 804812 808375 812268 817119 823080 829598 835826 841231 845711 849305 852113 854412 856521
52205 856521 858504 860231 861696 863000 864129 865082 866194 867851 869821 871301 871867 872046 872632 873691 874544
52190 874544 874628 874144 873927 874797 876922 879636 881922 883130 883241 882568 881403 879891 877993 875524 872475 869279
$$ packed form
52285I00737J1571J2725J3344J4120J5178J5838J5505J4257J2496J0565Q882P829
52273A053047P236O251M052O44l110o178q095r235j0329j1664j2796j3258j3258
52260I83307j3366j3687j3816j3610j3487j3747j4036j3728j2588j0839q873p098
52248H34432n878n235m771m188l777m046m916n623n594n046m486l907k933j669
52234G72363q27p94j003o46K90J135J534J768K122K483K724L054L656M296M544
52219G96699M293L820L563L893M851N961O518O228N405M480L594K808K299K109
52205H56521J983J727J465J304J129R53J112J657J970J480N66J79N86J059Q53
52190H74544Q4m84k17Q70K125K714K286J208J11o73j165j512j898k469l049l196
$$ plain form
52174 869279 866479 864126 861835 859484 857402 855778 854350 853028 852415 853252 855511 858425 861406 864686 869147
52159 869147 875659 884506 895198 906824 918644 930277 941421 951760 961306 970529 980016 990229
52147 990229 1001696 1014948 1029906 1045715 1061724 1078387 1096607 1116273 1135975 1154228 1170553
52136 1170553 1185312 1199034 1212216 1225398 1238956 1252727 1266018 1278120 1288878 1298811 1308678 1318870
52124 1318870 1329286 1339709 1350110 1360391 1370057 1378435 1385212 1390483 1394239 1396018 1395200 1391577 1385557
52111 1385557 1377843 1368906 1358730 1347029 1333707 1319076 1303691 1288112 1272809 1258095 1244202 1231637
52099 1231637 1221521 1215205 1213274 1215154 1219843 1226794 1235816 1246499 1258271 1270968 1284826 1299772
52087 1299772 1314967 1329268 1341989 1353272 1363837 1374425 1385325 1396363 1407333 1418220 1428857
$$ packed form
52174H69279k800k353k291k351k082j624j428j322o13Q37K259K914K981L280M461
52159H69147O512Q847J0692J1626J1820J1633J1144J0339R546R223R487J0213
52147I90229J1467J3252J4958J5809J6009J6663J8220J9666J9702J8253J6325
52136A170553J4759J3722J3182J3182J3558J3771J3291J2102J0758R933R867J0192
52124A318870J0416J0423J0401J0281R666Q378O777N271L756J779q18l623o020
52111A385557p714q937j0176j1701j3322j4631j5385j5579j5303j4714j3893j2565
52099A231637j0116o316j931J880M689O951R022J0683J1772J2697J3858J4946
52087A299772J5195J4301J2721J1283J0565J0588J0900J1038J0970J0887J0637
$$ plain form
52076 1428857 1438637 1446924 1453652 1459172 1463521 1466162 1466470 1464159 1459141 1451341 1440811 1427876 1412989
52063 1412989 1396512 1378607 1359170 1337864 1314511 1289466 1263428 1236889 1210032 1183184 1156934
52052 1156934 1131627 1107166 1083649 1061924 1042954 1026661 1011821 997248 982787 969021 956319
52041 956319 944555 933575 923467 914185 905329 896714 889027 883411 880250 878733 877816 877259 877344 877903 878211
52026 878211 877829 876981 875805 873642 869487 863096 855307 847205 839126 830547 820854 810046 798666 787163
52012 787163 775531 763522 750933 737476 722619 705987 688014 669928 652913 637350 622902
52001 622902 609134 595960 583592 572201 561604 551296 540902 530694 521562 514334 509088 505091
51989 505091 501407 497577 493872 490987 489464 489292 489877 490313 489675 487218 482489 475426 466452 456481 446585
$$ packed form
52076A428857R780Q287O728N520M349K641L08k311n018p800j0530j2935j4887
52063A412989j6477j7905j9437k1306k3353k5045k6038k6539k6857k6848k6250
52052A156934k5307k4461k3517k1725j8970j6293j4840j4573j4461j3766j2702
52041I56319j1764j0980j0108r282q856q615p687n616l161j517r17n57Q5N59L08
52026H78211l82q48j176k163m155o391p789q102q079q579r693j0808j1380j1503
52012G87163j1632j2009j2589j3457j4857j6632j7973j8086j7015j5563j4448
52001F22902j3768j3174j2368j1391j0597j0308j0394j0208r132p228n246l997
51989E05091l684l830l705k885j523j72N85M36o38k457m729p063q974r971r896
$$ plain form
51974 446585 437435 429000 420933 413188 406102 399945 394793 390903 388794 388638 389864 391733 394155 397590
51960 397590 402301 408092 414669 421809 429084 435794 441336 445444 448056 449194 449067 448004 446186 443671
51946 443671 440828 438617 438336 441112 447463 457146 469468 484124 501752 523339 548905 576937 604997
51933 604997 630426 650390 662101 663976 656793 643281 626313 607486 587257 565999 544540 523755
51921 523755 503989 485116 467076 450063 434121 418915 404183 390248 377672 366548 356575 347792
51909 347792 340686 335400 331373 328080 325742 324866 325359 326595 328240 330628 334305 339573 346355 354125 361921
51894 361921 368773 374251 378374 381025 381790 380454 377297 372761 367158 360931 354870 349679 345539 342386
51880 342386 340523 340530 342645 346539 351690 357576 363440 368415 372162 375128 377907 380617 383100 385302 387033
$$ packed form
51974D46585r150q435q067p745p086o157n152l890k109j56J226J869K422L435
51960C97590M711N791O577P140P275O710N542M108K612J138j27j063j818k515
51946D43671k843k211k81K776O351R683J2322J4656J7628K1587K5566K8032K8060
51933F04997K5429J9964J1711J875p183j3512j6968j8827k0229k1258k1459k0785
51921E23755j9766j8873j8040j7013j5942j5206j4732j3935j2576j1124r973q783
51909C47792p106n286m027l293k338q76M93J236J645K388L677N268O782P770P796
51894C61921O852N478M123K651P65j336l157m536n603o227o061n191m140l153
51880C42386j863PK115L894N151N886N864M975L747K966K779K710K483K202J731
$$ plain form
51865 387033 387662 386676 384418 381653 378458 374217 368813 363108 357946 353399 349518 347190 347499 350462 355012
51850 355012 360049 364922 369123 372291 374558 376228 376979 375969 372931 368639 364049 359395 354374 348808
51836 348808 342817 336765 331348 327424 325274 324137 322796 320630 317966 315552 313952 313297 313327 313524 313306
51821 313306 312228 310217 307756 305679 304527 304110 303906 303758 303809 303964 303965 304077 305108 307527 311019 315100 319511
51804 319511 323691 326463 326901 325219 322346 318960 315426 312255 309865 307981 305916 303473 301041 298910
51790 298910 297009 295298 293848 292539 291240 290323 290338 291124 291907 292504 293703 296028 298794 300954 302381 303601
51774 303601 304601 304796 304146 303560 303970 305493 307804 310908 315182 320829 327625 335177 343225 351632 360142
51759 360142 368120 374621 378845 380549 379907 377022 371898 364899 356879 348582 340167 331667 323739 317414
$$ packed form
51865C87033O29r86k258k765l195m241n404n705n162m547l881k328L09K963M550
51850C55012N037M873M201L168K267J670P51j010l038m292m590m654n021n566
51836C48808n991o052n417l924k150j137j341k166k664k414j600o55L0J97k18
51821C13306j078k011k461k077j152m17k04j48N1J55JJ12J031K419L492M081M411
51804C19511M180K772M38j682k873l386l534l171k390j884k065k443k432k131
51790B98910j901j711j450j309j299r17J5P86P83N97J199K325K766K160J427J220
51774C03601J000J95o50n86M10J523K311L104M274N647O796P552Q048Q407Q510
51759C60142P978O501M224J704o42k885n124o999q020q297q415q500p928o325
$$ plain form
51745 317414 313034 309863 306996 304373 302690 302580 304245 307766 313390 321292 331073 341477 350703 357376
51731 357376 361539 364590 368009 372297 377267 382888 389108 394908 398324 397827 393415 386225 377620 368918
51717 368918 361444 356063 352635 350233 347839 344624 339921 333601 326574 320415 316159 313623 312017 311054
51703 311054 311285 313385 317209 321560 324949 326657 327065 327002 326984 327137 327607 328700 330639 333346 336329 338606
51687 338606 338908 336411 331407 325195 319269 314608 311408 309182 307248 305520 304777 305835 308545 312090 316250
51672 316250 321827 329623 339536 350966 363590 377150 390729 402798 412020 417678 419460 417315 411697
51659 411697 403669 394655 386201 379695 375639 372932 369427 363728 356339 348787 341937 335685 330060 325788
51645 325788 323458 322702 322633 322755 323002 323227 323272 323481 324493 326376 328425 330048 331351 332576 333305 332700 330400
$$ packed form
51745C17414m380l171k867k623j683j10J665L521N624P902R781J0404R226O673
51731C57376M163L051L419M288M970N621O220N800L416m97m412p190q605q702
51717C68918p474n381l428k402k394l215m703o320p027o159m256k536j606r63
51703C11054K31K100L824M351L389J708M08o3j8J53M70J093J939K707K983K277
51687C38606L02k497n004o212n926m661l200k226j934j728p43J058K710L545M160
51672C16250N577P796R913J1430J2624J3560J3579J2069R222N658J782k145n618
51659D11697q028r014q454o506m056k707l505n699p389p552o850o252n625m272
51645C25788k330p56o9J22K47K25M5K09J012J883K049J623J303J225P29o05k300
$$ plain form
51628 330400 326764 322290 317160 311428 305363 299432 294018 289226 284939 281041 277613 274904 273167 272575
51614 272575 273186 274773 276722 278409 279735 281014 282265 283005 282935 282443 282142 282316 283265 285889 291254 299543
51598 299543 309760 320360 329741 336287 338667 336500 330607 322543 313988 306318 300217 295574 292061 289765
51584 289765 288884 289011 289394 290020 291769 295277 300214 306066 313001 321525 331634 342820 354539 366200
51570 366200 377087 386964 396615 407134 418585 429791 439423 446993 452958 458538 465540 475851 490665
51557 490665 510227 534237 561957 591647 620326 644707 662671 673885 679111 679055 673911 663901
51545 663901 649947 633506 615671 596801 577262 558142 540721 525332 511410 498743 488101
51534 488101 480165 474266 468642 461820 453294 443046 431112 417944 404787 393043 383104 374027 364552
$$ packed form
51628C30400l636m474n130n732o065n931n414m792m287l898l428k709j737n92
51614B72575O11J587J949J687J326J279J251P40p0m92l01J74R49K624N365Q289
51598B99543J0217J0600R381O546K380k167n893q064q555p670o101m643l513k296
51584B89765q81J27L83O26J749L508M937N852O935Q524J0109J1186J1719J1661
51570C66200J0887R877R651J0519J1451J1206R632P570N965N580P002J0311J4814
51557D90665J9562K4010K7720K9690K8679K4381J7964J1214N226n6n144j0010
51545F63901j3954j6441j7835j8870j9539j9120j7421j5389j3922j2667j0642
51534D88101p936n899n624o822q526j0248j1934j3168j3157j1744r939r077r475
$$ plain form
51521 364552 354380 344370 335637 328673 323239 318760 314579 310125 305249 300508 296872 294969 294648 295283
51507 295283 296349 297604 298860 299772 300035 299799 299826 301015 303595 306830 309693 311783 313485 315202 316662
51492 316662 317109 316096 313983 311634 309656 307968 306125 303955 301686 299452 297030 294287 291586 289360
51478 289360 287453 285381 283185 281429 280224 278788 276297 272780 268899 265281 262488 261181 261593 262981
51464 262981 264174 264728 265110 265838 267016 268712 271118 274041 276726 278543 279518 279918 279663 278536 276711 274672
51448 274672 272807 271442 271119 272460 275787 281124 288493 297809 308490 319454 329585 338110 344728 349772
51434 349772 354207 359027 364436 369707 373791 375804 375046 371068 364054 354994 345314 336362 329067 323682
51420 323682 319733 316504 313710 311470 309639 307595 304915 301907 299240 297363 296466 296610 297471 298238 298243 297585
$$ packed form
51521C64552j0172j0010q733o964n434m479m181m454m876m741l636j903l21O35
51507B95283J066J255J256R12K63k36K7J189K580L235K863K090J702J717J460
51492C16662M47j013k113k349j978j688j843k170k269k234k422k743k701k226
51478B89360j907k072k196j756j205j436k491l517l881l618k793j307M12J388
51464B62981J193N54L82P28J178J696K406K923K685J817R75M00k55j127j825k039
51448B74672j865j365l23J341L327N337P369R316J0681J0964J0131Q525O618N044
51434C49772M435M820N409N271M084K013p58l978p014r060r680q952p295n385
51420C23682l949l229k794k240j831k044k680l008k667j877q97J44Q61P67No58
$$ plain form
51404 297585 296842 296366 296174 296247 296493 296622 296612 297139 298955 301854 304858 307513 310446 314564 320270 327546 336133
51387 336133 345340 354413 363571 374191 387548 403836 422867 445064 471038 500656 533352 568934
51375 568934 606905 644980 679435 707479 728705 744027 754024 758822 758699 753832 743710 727636
51363 727636 705892 679860 650976 619999 587325 553578 519731 486935 456358 428953 405272
51352 405272 385481 369387 356254 344875 334337 324785 317051 311486 307453 304034 300798 297741 294922
51339 294922 292526 290980 290579 291066 291844 292490 292801 292467 291176 289123 287040 285459 284105 282289 279849 277438
51323 277438 275762 274746 273682 272141 270388 268844 267496 266167 265082 264669 264861 265091 265048 264970 265033 264967 264515
51306 264515 263827 263024 261842 260169 258601 257891 258085 258758 259952 262131 265240 268391 270672 271819 272063 271853
$$ packed form
51404B97585p43m76j92P3K46J29j0N27J816K899L004K655K933M118N706P276Q587
51387C36133R207R073R158J0620J3357J6288J9031K2197K5974K9618L2696L5582
51375E68934L7971L8075L4455K8044K1226J5322R997M798j23m867j0122j6074
51363G27636k1744k6032k8884l0977l2674l3747l3847l2796l0577k7405k3681
51352D05272j9791j6094j3133j1379j0538r552p734n565m033l419l236l057k819
51339B94922k396j546m01M87P78O46L11l34j291k053k083j581j354j816k440k411
51323B77438j676j016j064j541j753j544j348j329j085m13J92K30m3p8O3o6m52
51306B64515o88q03j182j673j568p10J94O73J194K179L109L151K281J147K44k10
$$ plain form
51290 271853 271781 272247 272968 273343 273421 273988 275513 277717 280495 284448 289787 295304 299310 301425 302700 304134
51274 304134 305830 307568 309342 311086 312466 313341 314003 314747 315563 316540 318139 320624 323398 325323 325676 324595
51258 324595 322663 320343 317831 315195 312470 309631 306566 303193 299665 296385 293689 291489 289356 287060
51244 287060 284902 283368 282479 281669 280487 279301 279017 279967 281277 281666 280759 279306 278192 277686 277663 277962 278214
51227 278214 277864 276869 276001 275883 276033 275520 274347 273402 273093 272919 272613 272808 274014 275565 276386 276511 277208 279611
51209 279611 283662 288304 292266 294677 295393 294998 294377 294231 295004 296938 299826 302801 304840 305674 305882 305994
51193 305994 305804 304791 302973 301016 299561 298737 298306 298028 297772 297531 297531 298229 299923 302352 304892 307122 309013
51176 309013 310518 311317 311195 310424 309531 308787 308200 307788 307447 306651 304838 302291 300280 300069 301956 305286 309031
$$ packed form
51290B71853p2M66P21L75P8N67J525K204K778L953N339N517M006K115J275J434
51274C04134J696J738J774J744J380Q75O62P44Q16R77J599K485K774J925L53j081
51258C24595j932k320k512k636k725k839l065l373l528l280k696k200k133k296
51244B87060k158j534q89q10j182j186k84R50J310L89r07j453j114n06k3K99K52
51227B78214l50r95q68j18J50n13j173r45l09j74l06J95J206J551Q21J25O97K403
51209B79611M051M642L962K411P16l95o21j46P73J934K888K975K039Q34K08J12
51193C05994j90j013j818j957j455q24m31k78k56k41%O98J694K429K540K230J891
51176C09013J505P99j22p71q93p44n87m12l41p96j813k547k011k11J887L330L745
$$ plain form
51159 309031 312144 313804 313827 312752 311230 309427 307276 305076 303372 302266 301343 300353 299640 299637 300236 300878 301102
51142 301102 300794 300111 299459 299447 300443 302071 303418 303948 304026 304314 304814 304850 304006 302716 301733 301311 301263 301622 302821
51123 302821 305099 308053 310903 313008 314042 313979 313174 312314 311967 312093 312146 311732 311139 311152 312326 314402 316490
51106 316490 317923 318905 320201 322277 324951 327859 330881 333909 336494 338121 338815 339201 339955 341403 343564
51091 343564 346279 349210 351968 354457 356938 359576 362019 363627 364137 363941 363674 363674 363902 364169 364276 364033 363417
51074 363417 362773 362622 363232 364525 366424 369031 372340 376140 380605 386817 396227 409500 426226 445739
51060 445739 467668 491194 514022 532795 545174 551710 555695 560937 569384 580522 592547 603717
51048 603717 612658 618207 619804 617992 613868 607782 599046 587281 573762 561101 551676 546407 544465
$$ packed form
51159C09031L113J660K3j075j522j803k151k200j704j106r23r90p13lN99O42K24
51142C01102l08o83o52j2R96J628J347N30P8K88N00L6q44j290r83m22m8L59J199
51123C02821K278K954K850K105J034o3q05q60l47J26N3m14n93J3J174K076K088
51106C16490J433R82J296K076K674K908L022L028K585J627O94L86P54J448K161
51091C43564K715K931K758K489K481K638K443J608N10j96k67%K28K67J07k43o16
51074C63417o44j51O10J293J899K607L309L800M465O212R410J3273J6726J9513
51060D45739K1929K3526K2828J8773J2379O536L985N242Q447J1138J2025J1170
51048F03717Q941N549J597j812m124o086q736j1765j3519j2661r425n269j942
$$ plain form
51035 544465 543492 540239 531920 517757 499428 479882 461586 445676 432359 421697 413832 408634 405519
51022 405519 403888 403677 405266 408798 413797 419562 425786 432681 440605 449697 459791 470501 481361 491967
51008 491967 502020 511263 519435 526354 531992 536441 539835 542292 543882 544664 544805 544679 544790 545549 547101
50993 547101 549325 551992 555086 559095 564817 572741 582676 594041 606277 618640 629877 638719 644960
50980 644960 649801 654928 661435 669721 680156 693561 710924 732747 758720 788164 820812 856971
50968 856971 897007 941082 989611 1043362 1102541 1166110 1232742 1302233 1375147 1451103 1528285
50957 1528285 1604760 1679335 1750727 1816778 1875183 1924650 1964941 1996364 2019687 2036043 2046270
50946 2046270 2050626 2049544 2044167 2035422 2022855 2005093 1981501 1953178 1922649 1892932 1866358 1843478
$$ packed form
51035E44465r73l253q319j4163j8329j9546j8296j5910j3317j0662p865n198l115
51022D05519j631k11J589L532M999N765O224O895P924R092J0094J0710J0860J0606
51008D91967J0053R243Q172O919N638M449L394K457J590P82J41j26J11P59J552
50993E47101K224K667L094M009N722P924R935J1365J2236J2363J1237Q842O241
50980F44960M841N127O507Q286J0435J3405J7363K1823K5973K9444L2648L6159
50968H56971M0036M4075M8529N3751N9179O3569O6632O9491P2914P5956P7182
50957A528285P6475P4575P1392O6051N8405M9467M0291L1423K3323J6356J0227
50946B046270M356j082n377q745j2567j7762k3592k8323l0529k9717k6574k2880
$$ plain form
50934 1843478 1823090 1803604 1784152 1764095 1742203 1717154 1688518 1656473 1620812 1581059 1537434
50923 1537434 1490788 1441622 1390059 1336870 1283676 1231872 1182066 1134803 1091005 1051235 1015148
50912 1015148 982168 952319 925916 902744 881993 862882 845125 828916 814656 802497 792003
50901 792003 782377 773113 764304 756396 749880 745082 741773 739005 735760 731909 728193 725231 722979 721234
50887 721234 720186 720217 721419 723500 725955 728345 730684 733533 737354 741898 746677 751925 758481 766705 776165
50872 776165 786462 797651 809754 822692 837065 854148 874513 897325 921633 947807 976917
50861 976917 1009177 1043972 1081290 1122240 1168007 1219049 1275663 1338867 1410194 1490720 1580615
50850 1580615 1679802 1788828 1908775 2040074 2181653 2331587 2488425 2651373 2819248 2989897
$$ packed form
50934A843478k0388j9486j9452k0057k1892k5049k8636l2045l5661l9753m3625
50923A537434m6646m9166n1563n3189n3194n1804m9806m7263m3798l9770l6087
50912A015148l2980k9849k6403k3172k0751j9111j7757j6209j4260j2159j0494
50901G92003r626r264q809p908o516m798l309k768l245l851l716k962k252j745
50887G21234j048L1J202K081K455K390K339K849L821M544M779N248O556Q224R460
50872G76165J0297J1189J2103J2938J4373J7083K0365K2812K4308K6174K9110
50861I76917L2260L4795L7318M0950M5767N1042N6614O3204P1327Q0526Q9895
50850A580615R9187J09026J19947J31299J41579J49934J56838J62948J67875J70649
$$ plain form
50840 2989897 3160730 3328955 3490762 3640918 3773932 3885554 3972977 4034398 4069326 4079112
50830 4079112 4066365 4033767 3984085 3921121 3849725 3774497 3698995 3626476 3560706 3505277 3462045
50819 3462045 3430398 3407768 3390480 3374245 3354596 3327696 3291124 3243794 3185044 3114039 3030285
50808 3030285 2934392 2827764 2711664 2587345 2457361 2325971 2197559 2074868 1959142 1851485
50798 1851485 1753292 1665471 1588011 1520531 1462735 1414174 1374029 1341410 1315623 1295951 1281386
50787 1281386 1270805 1263211 1257658 1253089 1248526 1243447 1237810 1231633 1224678 1216701 1207931 1199013 1190300 1181409
50773 1181409 1171753 1161274 1150267 1138593 1125628 1111041 1095128 1078249 1060447 1041861 1023000
50762 1023000 1004251 985582 967096 949513 933680 919989 908628 899932 893922 889933 887396 886810
$$ packed form
50840B989897J70833J68225J61807J50156J33014J11622Q7423O1421L4928R786
50830D079112j2747l2598m9682o2964p1396p5228p5502p2519o5770n5429m3232
50819C462045l1647k2630j7288j6235j9649k6900l6572m7330n8750p1005q3754
50808C030285r5893j06628j16100j24319j29984j31390j28412j22691j15726j07657
50798A851485r8193q7821p7460o7480n7796m8561m0145l2619k5787j9672j4565
50787A281386j0581p594n553m569m563n079n637o177o955p977q770q918q713q891
50773A181409r656j0479j1007j1674j2965j4587j5913j6879j7802j8586j8861
50762A023000j8749j8669j8486j7583j5833j3691j1361q696o010l989k537n86
$$ plain form
50750 886810 889245 895066 903780 915065 929240 946691 967473 991579 1019107 1050037 1084373 1122569
50738 1122569 1165298 1212682 1264307 1320117 1380741 1446626 1517285 1591717 1669219 1749480 1832092
50727 1832092 1916247 2000855 2084878 2167713 2249220 2329012 2405568 2476248 2538113 2588416 2624401
50716 2624401 2643436 2643867 2625655 2590145 2539771 2478398 2411427 2344663 2282589 2227641 2180836 2142715
50704 2142715 2113573 2093134 2080325 2073568 2071227 2071607 2072402 2070391 2062084 2044828 2017290 1979118 1930602
50691 1930602 1872825 1807785 1738084 1666409 1595232 1526754 1462926 1405464 1355553 1313342 1277940
50680 1277940 1248379 1224692 1207810 1198494 1196702 1201908 1213461 1230515 1252021 1277024 1304628 1333580
50668 1333580 1362340 1389798 1415562 1439304 1460322 1478195 1493558 1507710 1521530 1535125 1548412
$$ packed form
50750H86810K435N821Q714J1285J4175J7451K0782K4106K7528L0930L4336L8196
50738A122569M2729M7384N1625N5810O0624O5885P0659P4432P7502Q0261Q2612
50727A832092Q4155Q4608Q4023Q2835Q1507P9792P6556P0680O1865N0303L5985
50716B624401J9035M31j8212l5510n0374o1373o6971o6764o2074n4948m6805l8121
50704B142715k9142k0439j2809o757k341L80P95k011q307j7256k7538l8172m8516
50691A930602n7777o5040o9701p1675p1177o8478o3828n7462m9911m2211l5402
50680A277940k9561k3687j6882r316j792N206J1553J7054K1506K5003K7604K8952
50668A333580K8760K7458K5764K3742K1018J7873J5363J4152J3820J3595J3287
$$ plain form
50657 1548412 1561655 1575339 1589779 1604999 1620946 1637829 1656207 1676610 1699130 1723649 1750541
50646 1750541 1780738 1814884 1852615 1892913 1935014 1978783 2024375 2071697 2119992 2167733 2213142
50635 2213142 2255110 2293558 2328849 2361193 2390919 2419028 2446792 2474387 2499586 2517467 2521574
50624 2521574 2506569 2471295 2420111 2361138 2302670 2250433 2207103 2173384 2149278 2134696 2129275
50613 2129275 2131933 2140981 2154864 2172439 2192161 2211258 2226239 2234220 2233438 2222673 2200825 2167256
50601 2167256 2122097 2066112 2000754 1928592 1853112 1777376 1702869 1629877 1558836 1490857 1427013
50590 1427013 1367603 1312409 1261393 1214826 1172781 1134833 1100387 1069253 1041739 1018229 998724
50579 998724 982791 969886 959692 952175 947345 945021 944878 946695 950361 955586 961882 969147 978119 989807
$$ packed form
50657A548412J3243J3684J4440J5220J5947J6883J8378K0403K2520K4519K6892
50646A750541L0197L4146L7731M0298M2101M3769M5592M7322M8295M7741M5409
50635B213142M1968L8448L5291L2344K9726K8109K7764K7595K5199J7881M107
50624B521574j5005l5274n1184n8973n8468n2237m3330l3719k4106j4582n421
50613B129275K658R048J3883J7575J9722J9097J4981P981p82j0765k1848l3569
50601B167256m5159n5985o5358p2162p5480p5736p4507p2992p1041o7979o3844
50590A427013n9410n5194n1016m6567m2045l7948l4446l1134k7514k3510j9505
50579I98724j5933j2905j0194p517m830k324j43J817L666N225O296P265Q972J1688
$$ plain form
50565 989807 1004436 1021349 1040021 1060706 1083830 1109206 1136266 1164725 1194426 1224679 1254398
50554 1254398 1283044 1311023 1339064 1367530 1396456 1425823 1455531 1485299 1514859 1544214 1573744
50543 1573744 1604335 1637413 1674475 1716368 1763228 1815254 1873191 1937765 2008985 2086460 2170260
50532 2170260 2260965 2358894 2463683 2574671 2691244 2812605 2937608 3065174 3194591 3324911
50522 3324911 3454042 3578829 3696203 3803983 3900289 3982464 4047057 4091090 4113054 4112533 4089245
50511 4089245 4042964 3974439 3885933 3780692 3662292 3534888 3403712 3274610 3152775 3042131
50501 3042131 2945909 2867335 2809325 2773493 2759619 2766076 2790722 2831419 2885681 2949759 3018120
50490 3018120 3083949 3140084 3179440 3195240 3182160 3138191 3065303 2968047 2851778 2722216 2585581
$$ packed form
50565I89807J4629J6913J8672K0685K3124K5376K7060K8459K9701L0253K9719
50554A254398K8646K7979K8041K8466K8926K9367K9708K9768K9560K9355K9530
50543A573744L0591L3078L7062M1893M6860N2026N7937O4574P1220P7475Q3800
50532B170260R0705R7929J04789J10988J16573J21361J25003J27566J29417J30320
50522C324911J29131J24787J17374J07780R6306Q2175O4593M4033K1964n21k3288
50511D089245m6281o8525q8506j05241j18400j27404j31176j29102j21835j10644
50501C042131r6222p8574n8010l5832j3874O457K4646M0697N4262O4078O8361
50490C018120O5829N6135L9356J5800j3080m3969p2888r7256j16269j29562j36635
$$ plain form
50479 2585581 2447674 2312527 2182522 2059704 1946066 1842368 1747607 1660266 1579601 1505366
50469 1505366 1436991 1373860 1315986 1263720 1216922 1175058 1137969 1105928 1078936 1056547 1038397
50458 1038397 1024406 1014423 1008132 1005357 1005999 1009574 1015310 1022816 1032273 1043875 1057628 1073908 1093720
50445 1093720 1117860 1145836 1175601 1203990 1227469 1243257 1250579 1250909 1246807 1240609 1234133 1228975 1226257
50432 1226257 1226119 1227901 1230959 1235149 1240687 1247928 1257349 1269372 1284046 1301084 1320307 1341971 1366643
50419 1366643 1394893 1427198 1464034 1505926 1553311 1606289 1664520 1727398 1794247 1864166 1935706
50408 1935706 2006982 2076264 2142346 2204372 2261628 2313703 2360499 2401657 2436015 2461823 2477311
50397 2477311 2480720 2470094 2443775 2401485 2344715 2275966 2197898 2113372 2025896 1939411 1857453
$$ packed form
50479B585581j37907j35147j30005j22818j13638j03698r4761q7341q0665p4235
50469A505366o8375o3131n7874n2266m6798m1864l7089l2041k6992k2389j8150
50458A038397j3991r983o291k775O42L575N736P506R457J1602J3753J6280J9812
50445A093720K4140K7976K9765K8389K3479J5788P322L30m102o198o476n158k718
50432A226257j38J782L058M190N538P241R421J2023J4674J7038J9223K1664K4672
50419A366643K8250L2305L6836M1892M7385N2978N8231O2878O6849O9919P1540
50408A935706P1276O9282O6082O2026N7256N2075M6796M1158L4358K5808J5488
50397B477311L409j0626k6319m2290n6770o8749p8068q4526q7476q6485q1958
$$ plain form
50386 1857453 1782586 1716517 1660379 1614762 1579782 1555497 1542263 1540387 1549298 1567242 1591913 1621159
50374 1621159 1652742 1683545 1709516 1726761 1732702 1726268 1707374 1676655 1635632 1586660 1532395 1475265
50362 1475265 1417407 1360828 1307267 1257761 1212502 1171280 1134119 1101379 1073282 1049384 1028388
50351 1028388 1008248 986587 961644 933349 903426 874206 847388 823937 804643 790047 779817
50340 779817 772869 768334 766110 766320 768717 772829 778212 784217 789863 794551 798735 803398 808800 814073
50326 814073 818142 820762 822554 824271 826229 828349 830470 832482 834217 835470 836250 836887 837716 838771 840118
50311 840118 842455 846966 854376 864384 876156 889086 902832 916835 930284 942678 954311 965991
50299 965991 978238 990825 1003251 1015625 1028688 1042710 1056832 1069985 1082235 1094588 1107721
$$ packed form
50386A857453p4867o6069n6138m5617l4980k4285j3234j876Q911J7944K4671K9246
50374A621159L1583L0803K5971J7245N941o434j8894l0719m1023m8972n4265n7130
50362A475265n7858n6579n3561m9506m5259m1222l7161l2740k8097k3898k0996
50351A028388k0140k1661k4943k8295k9923k9220k6818k3451j9294j4596j0230
50340G79817o948m535k224K10K397M112N383O005N646M688M184M663N402N273
50326H14073M069K620J792J717J958K120K121K012J735J253P80O37Q29J055J347
50311H40118K337M511P410J0008J1772J2930J3746J4003J3449J2394J1633J1680
50299I65991J2247J2587J2426J2374J3063J4022J4122J3153J2250J2353J3133
$$ plain form
50288 1107721 1121828 1137862 1158121 1185396 1221968 1268643 1322261 1372779 1404878 1405929 1374196
50277 1374196 1319234 1254665 1191025 1134026 1086259 1048410 1019574 998174 983213 974550 972245 976035
50265 976035 985238 998939 1016449 1037754 1063086 1091790 1121950 1151437 1179018 1204186 1226512 1245830
50253 1245830 1262758 1278234 1292423 1304607 1314181 1321074 1324781 1323426 1314443 1296243 1269065 1234419
50241 1234419 1194296 1151041 1107427 1066135 1028949 996602 969365 947400 930414 917165 905486
50230 905486 892705 876251 854510 827671 797717 767309 738579 712826 690741 672376 657096
50219 657096 644090 633019 623921 616639 610711 605782 601682 598110 594645 591139 587802 584841 582299 580238
50205 580238 578673 577291 575542 573131 570118 566569 562511 558257 554310 550721 547008 542902 538760 534941
$$ packed form
50288A107721J4107J6034K0259K7275L6572M6675N3618N0518L2099J051l1733
50277A374196n4962o4569o3640n6999m7767l7849k8836k1400j4961q663k305L790
50265I76035R203J3701J7510K1305K5332K8704L0160K9487K7581K5168K2326J9318
50253A245830J6928J5476J4189J2184R574O893L707j355q983j8200k7178l4646
50241A234419m0123m3255m3614m1292l7186l2347k7237k1965j6986j3249j1679
50230I05486j2781j6454k1741k6839k9954l0408k8730k5753k2085j8365j5280
50219F57096j3006j1071r098p282n928m929m100l572l465l506l337k961k542k061
50205E80238j565j382j749k411l013l549m058m254l947l589l713m106m142l819
$$ plain form
50191 534941 531177 526969 522337 517781 513622 509760 506015 502410 499085 496225 494054 492745 492229 492261 492678
50176 492678 493603 495352 498096 501607 505392 509153 513019 517201 521602 526034 530732 536284 543015 550721
50162 550721 559037 567816 577162 587436 599298 613343 629527 647295 666456 687702 712073 740158
50150 740158 771920 807034 845226 886540 931438 980382 1033069 1088150 1143589 1197073 1246315
50139 1246315 1289867 1328150 1363440 1398498 1435321 1474894 1517007 1559522 1598259 1628459 1646503
50128 1646503 1650296 1638841 1612413 1573030 1523924 1468290 1408682 1347191 1285527 1224943 1166635
50117 1166635 1112161 1062993 1019761 982511 951533 927105 908338 893148 879802 867972 858013
50106 858013 849901 843412 838822 836628 836729 838407 841105 844731 849098 853414 856482 857346 855749 852190 847535
$$ packed form
50191E34941l764m208m632m556m159l862l745l605l325k860k171j309n16L2M17
50176D92678R25J749K744L511L785L761L866M182M401M432M698N552O731P706
50162E50721Q316Q779R346J0274J1862J4045J6184J7768J9161K1246K4371K8085
50150G40158L1762L5114L8192M1314M4898M8944N2687N5081N5439N3484M9242
50139A246315M3552L8283L5290L5058L6823L9573M2113M2515L8737L0200J8044
50128A646503L793j1455k6428l9383m9106n5634n9608o1491o1664o0584n8308
50117A166635n4474m9168m3232l7250l0978k4428j8767j5190j3346j1830r959
50106H58013q112o489m590k194J01J678K698L626M367M316L068Q64j597l559m655
$$ plain form
50091 847535 842419 836953 831017 824765 818670 813010 807372 800815 792614 782981 773002 763761 755454 747442
50077 747442 739085 730375 721689 713236 705026 697295 690671 685753 682658 681063 680602 681105 682508 684793 688059
50062 688059 692468 697970 704155 710582 717140 723843 730363 736156 741128 745844 750806 755738 759795 762329
50048 762329 763247 762803 761374 759374 757134 754825 752545 750426 748572 747018 745832 745069 744587 744252 744652 747283
50032 747283 753557 763739 777193 793524 813047 836187 862929 892882 925425 959574 993977 1027180
50020 1027180 1057824 1084834 1107935 1128087 1146935 1165637 1184318 1202378 1218609 1230893 1236549
50009 1236549 1233553 1221207 1199410 1167837 1126473 1076839 1022213 966520 912985 863500 818814
49998 818814 779254 745284 717325 695177 678050 665157 655766 648555 641720 634275 626732 619933 613682
$$ packed form
50091H47535n116n466n936o252o095n660n638o557q201r633r979r241q307q012
50077G47442q357q710q686q453q210p731o624m918l095j595m61N03J403K285L266
50062F88059M409N502O185O427O558O703O520N793M972M716M962M932M057K534
50048G62329R18m44j429k000k240k309k280k119j854j554j186p63m82l35M00K631
50032G47283O274J0182J3454J6331J9523K3140K6742K9953L2543L4149L4403L3203
50020A027180L0644K7010K3101K0152J8848J8702J8681J8060J6231J2284N656
50009A236549k996j2346k1797l1573m1364m9634n4626n5693n3535m9485m4686
49998H18814l9560l3970k7959k2148j7127j2893r391p211o835p445p543o799o251
$$ plain form
49985 613682 607219 600564 594387 588684 582483 574980 566207 556482 546016 535259 524832 514793 504703
49972 504703 494821 486479 480633 476633 473123 469678 466746 464364 461909 459126 456481 454291 452224 450052
49958 450052 448340 447874 448708 450189 451784 453506 455622 458355 461965 466844 473259 481040 489643 498577 507611
49943 507611 516497 524671 531507 536924 541448 545609 549535 553219 556681 559422 559958 556550 548641 537341
49929 537341 524533 511789 500108 490124 482164 476130 471543 467773 464389 461546 459939 460091 461620 463479
49915 463479 464931 465991 466963 467969 469028 470174 471334 472533 474415 478013 483574 490008 496004 501397
49901 501397 506939 513063 519550 526285 533576 541526 549620 557122 563483 568206 570798 571175 569876 567644
49887 567644 565012 562354 559902 557352 553723 548045 540120 530403 519325 507220 494902 483781 474984
$$ packed form
49985F13682o463o655o177n703o201p503q773r725j0466j0757j0427j0039j0090
49972E04703r882q342n846m000l510l445k932k382k455k783k645k190k067k172
49958D50052j712m66Q34J481J595J722K116K733L610M879O415P781Q603Q934R034
49943E07611Q886Q174O836N417M524M161L926L684L462K741N36l408p909j1300
49929E37341j2808j2744j1681r984p960o034m587l770l384k843j607J52J529J859
49915D63479J452J060R72J006J059J146J160J199J882L598N561O434N996N393
49901E01397N542O124O487O735P291P950Q094P502O361M723K592L77j299k232
49887E67644k632k658k452k550l629n678p925r717j1078j2105j2318j1121q797
$$ plain form
49874 474984 468486 463356 458825 454926 452097 450551 450183 450891 452653 455315 458610 462396 466621 471040 475311
49859 475311 479449 483751 488109 491851 494682 497405 501167 506188 511772 517427 523364 529868 536755 543532
49845 543532 549562 553941 555872 555606 554583 554114 554112 553408 551128 547359 542620 537211 531264 525132 519437 514667
49829 514667 510821 507482 504274 501124 498097 495212 492555 490453 489284 489225 490371 492872 496641 501158 505952
49814 505952 511137 517013 523339 529655 536138 543313 550769 557052 561204 563715 565576 567132 568358 569483
49800 569483 570497 570643 569279 566909 564434 561536 556736 549087 539029 527553 515358 503088 491663
49787 491663 481788 473457 466216 459734 454024 449404 446370 445108 444950 444628 443306 441240 439304 438124 437805
49772 437805 438303 439820 442796 447413 453075 458617 463417 468196 474320 482308 491339 500125 507778 513800
$$ packed form
49874D74984o498n130m531l899k829j546l68P08J762K662L295L786M225M419M271
49859D75311M138M302M358L742K831K723L762N021N584N655N937O504O887O777
49845E43532O030M379J931k66j023m69kp04k280l769m739n409n947o132n695m770
49829E14667l846l339l208l150l027k885k657k102j169n9J146K501L769M517M794
49814E05952N185N876O326O316O483P175P456O283M152K511J861J556J226J125
49800E69483J014J46j364k370k475k898m800p649j0058j1476j2195j2270j1425
49787D91663r875q331p241o482n710m620l034j262j58l22j322k066j936j180l19
49772D37805M98J517K976M617N662N542M800M779O124P988R031Q786P653O022
$$ [...]
##END NTUPLES=NMR SPECTRUM
##END=
