
##TITLE=AC1227_VIERS11107_6524403_KjY33rWw5b
##JCAMPDX= 6.0         $$ Bruker NMR JCAMP-DX V2.0
##DATA TYPE= NMR SPECTRUM
##DATA CLASS= NTUPLES
##ORIGIN= BRUKER
##OWNER= Administrator
$$ 1.72 TOPSPIN		Version 2.1
$$ 2012-07-14 21:01:13.734 -0500  Administrator@TOPSPIN
$$ Compression mode = diff/dup
##.OBSERVE FREQUENCY= 400.02188249412
##.OBSERVE NUCLEUS= ^1H
##.ACQUISITION MODE= SIMULTANEOUS (DQD)
##.ACQUISITION SCHEME= undefined
##.AVERAGES= 8
##.DIGITISER RES= 22
##SPECTROMETER/DATA SYSTEM= spect
##.PULSE SEQUENCE= zg30
##.SOLVENT NAME= COFFEE_meoh
##.SHIFT REFERENCE= INTERNAL, COFFEE_meoh, 1, 14.98509
##AUDIT TRAIL= $$ (NUMBER, WHEN, WHO, WHERE, PROCESS, VERSION, WHAT)
$$ ##TITLE= Audit trail, TOPSPIN		Version 2.1
$$ ##JCAMPDX= 5.01
$$ ##ORIGIN= Bruker BioSpin GmbH
$$ ##OWNER= Administrator
$$ $$ C:\Bruker\TOPSPIN/data/COFFEE/nmr/AC1227_VIERS11107_6524403_KjY33rWw5b/10/pdata/1/auditp.txt
$$ ##AUDIT TRAIL=  $$ (NUMBER, WHEN, WHO, WHERE, PROCESS, VERSION, WHAT)
(   1,<2012-07-14 21:01:07.031 -0500>,<Administrator>,<TOPSPIN>,<go>,<TOPSPIN 2.1>,
      <created by zg
	started at 2012-07-14 21:00:00.390 -0500,
	POWCHK enabled, PULCHK disabled,
       configuration hash MD5:
       6B 1B 68 BB D9 2E 58 E2 7F 35 AD 54 07 DF 0E 41
       data hash MD5: 64K
       45 24 5A 3F 76 29 19 69 64 E6 1B 7B C1 1A DB D6>)
(   2,<2012-07-14 21:01:09.640 -0500>,<Administrator>,<TOPSPIN>,<proc1d>,<TOPSPIN 2.1>,
      <Start of raw data processing
       efp LB = 0 FT_mod = 6 PKNL = 1 PHC0 = 0 PHC1 = 0 SI = 32K 
       data hash MD5: 32K
       FD 7C 49 CF 80 E3 60 E8 84 62 B2 F4 0B F6 1D E8>)
(   3,<2012-07-14 21:01:10.046 -0500>,<Administrator>,<TOPSPIN>,<proc1d>,<TOPSPIN 2.1>,
      <pk PHC0 = 175.6604 PHC1 = 0 
       data hash MD5: 32K
       7B D9 7F E4 50 34 4E E4 34 19 61 1A 79 3B 0F C2>)
(   4,<2012-07-14 21:01:10.140 -0500>,<Administrator>,<TOPSPIN>,<proc1d>,<TOPSPIN 2.1>,
      <abs ABSG = 1 
       data hash MD5: 32K
       62 48 FD AC 0D 3B D9 FF B4 2E 04 8C 79 B3 DE 17>)
(   5,<2012-07-14 21:01:10.187 -0500>,<Administrator>,<TOPSPIN>,<proc1d>,<TOPSPIN 2.1>,
      <abs ABSG = 2 
       data hash MD5: 32K
       4A 36 E9 72 41 E8 8C 35 3A 61 DF 4A 2C FA 97 1D>)
(   6,<2012-07-14 21:01:10.218 -0500>,<Administrator>,<TOPSPIN>,<proc1d>,<TOPSPIN 2.1>,
      <abs ABSG = 3 
       data hash MD5: 32K
       87 C0 8D B3 D9 E2 BB 48 0F 67 B2 DA C8 B2 D7 72>)
(   7,<2012-07-14 21:01:10.250 -0500>,<Administrator>,<TOPSPIN>,<proc1d>,<TOPSPIN 2.1>,
      <abs ABSG = 4 
       data hash MD5: 32K
       AB 3D D6 6B 0A B7 FC E9 8B 81 E7 07 C2 D4 F7 03>)
(   8,<2012-07-14 21:01:10.281 -0500>,<Administrator>,<TOPSPIN>,<proc1d>,<TOPSPIN 2.1>,
      <abs ABSG = 5 
       data hash MD5: 32K
       EC 3B 41 29 37 A4 01 B3 F1 0A A1 FA 71 20 CD 3F>)
$$ ##END=
$$ 
$$ $$ hash MD5
$$ $$ 2F 1E ED 2C 32 51 E1 0C FB 05 59 60 A5 44 5A 42
##$RELAX= 
##$RELAX= 
##$RELAX= 
##$RELAX= 
##$RELAX= 
##$RELAX= 
##$RELAX= 
$$ Bruker specific parameters
$$ --------------------------
$$ [...]
150 150 150 150 150 150 150 150
##$TP07= 0
##$TPNAME0= <>
##$TPNAME1= <>
##$TPNAME2= <>
##$TPNAME3= <>
##$TPNAME4= <>
##$TPNAME5= <>
##$TPNAME6= <>
##$TPNAME7= <>
##$TPOAL= (0..7)
0.5 0.5 0.5 0.5 0.5 0.5 0.5 0.5
##$TPOFFS= (0..7)
0 0 0 0 0 0 0 0
##$TUNHIN= 0
##$TUNHOUT= 0
##$TUNXOUT= 0
##$USERA1= <user>
##$USERA2= <user>
##$USERA3= <user>
##$USERA4= <user>
##$USERA5= <user>
##$V9= 5
##$VALIST= <valist>
##$VCLIST= <CCCCCCCCCCCCCCC>
##$VD= 0
##$VDLIST= <DDDDDDDDDDDDDDD>
##$VPLIST= <PPPPPPPPPPPPPPP>
##$VTLIST= <TTTTTTTTTTTTTTT>
##$WBST= 2048
##$WBSW= 25
##$XGAIN= (0..3)
0 0 0 0
##$XL= 0
##$YL= 0
##$YMAX_a= 482503
##$YMIN_a= -603349
##$ZGOPTNS= <>
##$ZL1= 120
##$ZL2= 120
##$ZL3= 120
##$ZL4= 120
##$ABSF1= 14.98509
##$ABSF2= -5.573092
##$ABSG= 5
##$ABSL= 3
##$ALPHA= 0
##$AQORDER= 0
##$ASSFAC= 0
##$ASSFACI= 0
##$ASSFACX= 0
##$ASSWID= 0
##$AUNMP= <proc_prof1d_extract_pilot.lims>
##$AXLEFT= 0
##$AXNAME= <>
##$AXNUC= <1H>
##$AXRIGHT= 0
##$AXTYPE= 0
##$AXUNIT= <>
##$AZFE= 0.1
##$AZFW= 0.1
##$BCFW= 0
##$BC_mod= 0
##$BYTORDP= 0
##$COROFFS= 0
##$CY= 15
##$DATMOD= 1
##$DC= 0
##$DFILT= <>
##$DTYPP= 0
##$F1P= 0
##$F2P= 0
##$FCOR= 0.5
##$FTSIZE= 32768
##$FT_mod= 6
##$GAMMA= 0
##$GB= 0
##$INTBC= 1
##$INTSCL= 1
##$ISEN= 128
##$LB= 0
##$LEV0= 0
##$LPBIN= 0
##$MAXI= 10000
##$MC2= 0
##$MEAN= 0
##$ME_mod= 0
##$MI= 0
##$NCOEF= 0
##$NC_proc= -8
##$NLEV= 6
##$NOISF1= 0
##$NOISF2= 0
##$NSP= 0
##$NTH_PI= 0
##$NZP= 0
##$OFFSET= 14.98509
##$PC= 1
##$PHC0= 175.6604
##$PHC1= 0
##$PH_mod= 1
##$PKNL= yes
##$PPARMOD= 0
##$PPDIAG= 0
##$PPIPTYP= 0
##$PPMPNUM= 2147483647
##$PPRESOL= 1
##$PSCAL= 4
##$PSIGN= 0
##$PYNMP= <proc.py>
##$REVERSE= no
##$SF= 400.02
##$SI= 32768
##$SIGF1= 0
##$SIGF2= 0
##$SINO= 400
##$SIOLD= 32768
##$SPECTYP= <>
##$SREGLST= <1H.CDCl3>
##$SSB= 0
##$STSI= 32768
##$STSR= 0
##$SW_p= 8223.68421052631
##$SYMM= 0
##$S_DEV= 0
##$TDeff= 65536
##$TDoff= 0
##$TI= <>
##$TILT= no
##$TM1= 0
##$TM2= 0
##$TOPLEV= 0
##$USERP1= <user>
##$USERP2= <user>
##$USERP3= <user>
##$USERP4= <user>
##$USERP5= <user>
##$WDW= 1
##$XDIM= 32768
##$YMAX_p= 474400241
##$YMIN_p= -723081
##$CURPLOT= <Network HP LaserJet P1505>
##$CURPRIN= <$Network HP LaserJet P1505>
##$DFORMAT= <normdp>
##$LAYOUT= <+/1D_H.xwp>
##$LFORMAT= <normlp>
##$PFORMAT= <normpl>
##$SURQMSG= 1
$$ End of Bruker specific parameters
$$ ---------------------------------
##NTUPLES= NMR SPECTRUM
##VAR_NAME=  FREQUENCY,     SPECTRUM/REAL,   SPECTRUM/IMAG
##SYMBOL=    X,             R,               I
##VAR_TYPE=  INDEPENDENT,   DEPENDENT,       DEPENDENT
##VAR_FORM=  AFFN,          ASDF,            ASDF
##VAR_DIM=   32768,         32768,           32768
##UNITS=     HZ,            ARBITRARY UNITS, ARBITRARY UNITS
##FACTOR=    0.250966925370066, 1,           1
##FIRST=     8223.43324360094, 37544,        -216106
##LAST=      0,             -69183,          139766
##MIN=       0,             -723081,         0
##MAX=       8223.43324360094, 474400241,    0
$$ Real data points
##PAGE= N=1
##DATA TABLE= (X++(R..R)), XYDATA
$$ [...]
19558F21b62919a01504A04602K03879i3744a036A23583b43253C4462R5611e1518
19546a45830b6008r4060A73729F9232A6267a9839o6034L2566E7109a67295H4922
19534A34588b52045O7752e5339g282q8675j84991P9815B60755h4835k35794b6129
19522b44684P6348A81309a77327f4025K8244c681p0318C09878C874c1420j76537
19511b07957C78717I4748J6172A7363b10445F4484A1995J78688L7726c0362B6101
19499D5690b68446C89515B9140c3864B8022J48750c0397l70759a55618l8270b040
19487C17552a20629G6434b42492a0845k98666a39954A64395a91951J4964A80731
19476h9731j47145r4642P1072d011I0554a01671A64100J30449b25364k51774M9921
$$ plain form
19558 621 -262919 -101504 104602 308481 -93744 -1036 123583 -243253 34462 130073 -51518
19546 -145830 -26008 -120068 173729 69232 16267 -19839 -85873 -53307 57109 -167295 84922
19534 134588 -252045 -184293 -55339 -7282 -95957 -280948 -201133 260755 -84835 -320629 -26129
19522 -244684 -168336 181309 -177327 -64025 -35781 -3681 -73999 309878 3874 -31420 -207957
19511 -207957 378717 94748 110920 17363 -210445 64484 11995 190683 228409 -30362 26101
19499 45690 -268446 389515 29140 -33864 28022 176772 -30397 -401156 -155618 -193888 -2040
19487 317552 -120629 76434 -242492 -10845 -309511 -139954 164395 -191951 -176987 180731
19476 -89731 -236876 -331518 -260446 -4011 90554 -101671 164100 294549 -225364 -477138 -427217
19465d27217A68532a10102p0487N2024j53116A08656a11048d3590A84598e9065
19454A37258j8135a71883G574i1388j29945C5102M9389I925L13538b42601J6785
19443b25816i9826B11593c2156R220o5809j06271p5093c928A28085g3588F9900
19431b55120k6828B29649I9568d5595B80277b35885i5710l2449A45875D1903b96651
19419c0191A19097k3870a72240j73586A29614C8761h985k15406f1165B22692o0943
19408A61749a46357O7762J9308k20827B1823i174B7715b7631j50542h6264p2064
19397a58328c4956k0286q9934A51013p2264b94698a07076A51283a35490n7913
19387a93403P7658B03150a59773O7764A5625R8529a31893A049R4098C0008f0235
$$ plain form
19465 -427217 168532 -110102 -180589 -128565 -281681 108656 -111048 -43590 184598 -59065
19454 137258 119123 -171883 7574 -91388 -221333 35102 84491 9925 323463 -242601 -225816
19443 -225816 -99826 211593 -32156 -22936 -88745 -195016 -270109 -3928 128085 -73588 69900
19431 -255120 -281948 229649 99568 -45595 280277 -235885 -95710 -128159 145875 41903 -296651
19419 -30191 119097 95227 -172240 -345826 129614 38761 -8985 -224391 -61165 222692 161749
19408 161749 -146357 -78595 -59287 -280114 21823 -9174 27715 -27631 -178173 -86264 -158328
19397 -158328 -34956 -55242 -145176 151013 78749 -294698 -107076 151283 -135490 -193403
19387 -193403 -115745 203150 -159773 -92009 15625 114154 -131893 1049 95147 30008 -60235
19375A64146J1052b8799D7336a25403C52884a79396e6702A5254e4718J2894m8911
19364i0735k34120J51775j29867d9327j15701H3483b54188P0903F3092L89463
19354D52555d23945c6763J6479r1753k7739j52304a16652p8644P6172A69456a34599
19342i1017G3319C5013J3632b9118l43162N8912C02282a78497L9819j2061a5073
19330a44142r7183A4325b38654A18651f205k23073A09833g7386C5363c3087j80574
19319b13661D6932a15368L1060o4238A8005N9744K7733N3647B3304a08793C3209
19307b10198e0583D1667a5112j00539A5454J27187D1165h4457o6342A39418e46517
19295A55792N3812f9005q6791j0097j6190C7567a37224j8103j37842i9822b4262
$$ plain form
19375 164146 175198 -28799 47336 -125403 352884 -179396 -56702 15254 -54718 -41824 -90735
19364 -90735 -324855 -173080 -302947 -49327 -165028 83483 -254188 -183285 63092 452555
19354 452555 -423945 -36763 -20284 -112037 -139776 -292080 -116652 -195296 -119124 169456 -134599
19342 -91017 73319 35013 48645 -29118 -372280 -313368 302282 -178497 -138678 -150739 -15073
19330 -144142 -241325 14325 -238654 118651 -6205 -229278 109833 -77386 35363 -33087 -213661
19319 -213661 46932 -115368 -84308 -148546 18005 77749 105482 159129 23304 -108793 33209
19307 -210198 -50583 41667 -15112 -115651 15454 142641 41165 -84457 -150799 139418 -546517
19295 155792 209604 -69005 -155796 -165893 -182083 37567 -137224 -155327 -293169 -99822 -24262
19283a03186k4447f2987A52895l4872g9711j39381e0465j6799J3807k75030A9478
19271A27484b09847k39529C4466a88173I9140D5754b01557C639a08403a2926a655
19259a70557B47855a65619Q2353L6814j75928A49152c0930q8775a6273B31985
19248c00553d5967B31164b729j54257F1411a35082B21846h7595o7191e2821a6646
19236g6592j89677A50106c63035A6061b97374h3368B11760R0921i4904B00185
19225A08852d8346k5754F5227J36793k0874h3694A27260d8963B9320Q4804b50531
19213b27091B22412a59753A90672a68621C6748P6424e25934a86050P1663k0958
19203a35345O4689K6107k86198d2236q6665k25922J32372E8944a17778k9027M3218
$$ plain form
19283 -103186 -127633 -62987 152895 118023 -79711 -219092 -50465 -67264 -53457 -328487 19478
19271 127484 -209847 -449376 34466 -188173 99140 45754 -201557 3639 -108403 -12926 -1655
19259 -170557 247855 -165619 -83266 -46452 -222380 149152 -30930 -119705 -16273 231985
19248 -300553 -45967 231164 -2729 -156986 61411 -135082 221846 -87595 -154786 -52821 -16646
19236 -76592 -266269 150106 -363035 16061 -297374 -83368 211760 302681 -94904 200185
19225 108852 -48346 -74100 65227 202020 181146 -83694 127260 -48963 29320 114124 -250531
19213 -227091 222412 -159753 190672 -168621 36748 113172 -525934 -186050 -114387 -135345
19203 -135345 -70656 -44549 -330747 -42236 -128901 -354823 -222451 58944 -117778 -146805 -103587
19192a03587j4634p0713C85861C1460a08756r4656A6105d0168B39717b99519J34104
19181a65415m2171K8554f4818j14446A54932d501k9729k88906a05685l1358j12453
19170b49496Q8005N873M4129J5965M4735A68010K6002K1635c39299a35753M9944
19159h5809K0427g056l9688q1638d9353j27951n4560a03508m9701a6916A2769
19147H5674b32547F4517J27239c1039r9128J1776C01226R2980A79984e2677j77173
19136b29850J12333m735l5125A17318b02616d201k39757A48399h3329k73952j44605
19125e01886i5844A50419a53350J40n8689b8607G9140i3879k9814N6712j7001
19114h3982A18105J72838c2610C18102I2732a28135G1610k9431K7409a77791A05334
$$ plain form
19192 -103587 -118221 -188934 385861 31460 -108756 -203412 16105 -40168 239717 -299519 -165415
19181 -165415 -207586 -179032 -64818 -179264 154932 -4501 -34230 -323136 -105685 -137043 -249496
19170 -249496 -161491 -155618 -111489 -95524 -50789 168010 194012 215647 -339299 -135753 -85809
19159 -85809 -65382 -7056 -46744 -128382 -49353 -177304 -231864 -103508 -153209 -16916 12769
19147 85674 -232547 64517 191756 -31039 -130167 -118391 301226 394206 179984 -52677 -229850
19136 -229850 -117517 -122252 -157377 117318 -202616 -4201 -243958 148399 -83329 -357281 -501886
19125 -501886 -95844 150419 -153350 -153210 -211899 -28607 79140 -93879 -123693 -66981 -83982
19114 -83982 118105 290943 -32610 318102 92732 -128135 71610 42179 69588 -177791 105334
19102b08712A5430a3734C56719a19005o8758c7224j97258n2069P8313f7807r4944
19091a62751j8838m0104a8341m96878i5037m5861R909j51636A28996C7894c17228
19079A76758f6556k3934b905D0499c10318A05803G76N3680K00191e191I2534l7367
19067E5167a04406F3676b02222B42971A15607b27197h9604j0591A51676K8875
19057A80551a6407n6377H1461E565K41404b28557a06602a0587E6949J70003j03752
19046A23200a85660F8829b37196O2196A50292j5309a03991l4120I1850B6055b7111
19034b0667j12972B03950E389c01829C60406b38946H9456k6890R0005J35927b90769
19022a70455r254j46265C02586a49186J5346p973F2532c66718O6443I076J85570
$$ plain form
19102 -208712 15430 -13734 356719 -119005 -187763 -37224 -234482 -286551 -208238 -67807 -162751
19091 -162751 -181589 -221693 -18341 -515219 -95037 -140898 -130989 -282625 128996 37894 -317228
19079 176758 -66556 -90490 -2905 40499 -310318 105803 776 54456 254647 -5191 92534 55167
19067 55167 -104406 63676 -202222 242971 115607 -227197 -89604 -100195 151676 180551
19057 180551 -16407 -72784 81461 5565 246969 -228557 -106602 -10587 56949 226952 123200
19046 123200 -185660 68829 -237196 -175000 150292 134983 -103991 -138111 91850 26055 -27111
19034 -20667 -133639 203950 5389 -301829 360406 -238946 89456 62566 152571 288498 -290769
19022 -170455 -179709 -325974 302586 -149186 -133840 -141813 62532 -366718 -300275 9076 194646
19011A94646J55339g517B32853b8286l05278J8679R8662D46445a82385F5343O5249
19000A30592b40418f6703j07052a1510C6051h1009B49493B8419O3191c57138A63998
18988c8940F063i5957M0132j3819m2958b0425k41829a21887G4113J55368k5139
18977B04342R6321i8912A31417N9067a9440j76344K0952c4197J4838B06995h9836
18965h424F0932a58145j39367C22436e5235j59103e4121j05613N9937n8295g7032
18953C84606A40327b28480F5525c74691B0167J83245a56967L1227A13794J5232
18943A29026e0065j09478A36072E536c36633f8964A24398O3288c25337a45428
18932a66906e0336j05956M3866A11079a36933C36690G8259b88277a43779G0283
$$ plain form
19011 194646 349985 -7517 232853 -28286 -333564 -314885 -216223 446445 -182385 65343 130592
19000 130592 -240418 -66703 -173755 -11510 36051 -81009 249493 28419 91610 -357138 163998
18988 -38940 6063 -95957 -55825 -69644 -112602 -20425 -262254 -121887 74113 229481 204342
18977 204342 300663 -98912 131417 190484 -19440 -195784 -174832 -34197 -19359 206995 -89836
18965 -8424 60932 -158145 -297512 322436 -55235 -214338 -54121 -159734 -99797 -158092 -77032
18953 384606 140327 -228480 65525 -374691 20167 203412 -156967 -125740 113794 129026
18943 129026 -50065 -159543 136072 5536 -336633 -68964 124398 187686 -325337 -145428
18932 -166906 -50336 -156292 -112426 111079 -136933 336690 78259 -288277 -143779 70283
18921a430C9646b05881b81j37826m0336r3449i5674m9879C08184b64332D0125
18909b50912g0232G5266J31700m3257f1262j20395A31169a6291A19088n1907J80092
18898B47273a46939k7129k0643a833k60435C6670L74884c10076A44520i0323j22417
18887b12740K0844m6836c3554m4057j52571R7769C805a90092f2399j76398R0268
18876a48529p4148R5531G3424A7852J19797b04947A88754c81405I5294b04930
18865a16315Q07p9082I3675b23211f7355l2809c2678m1498n0873c0639j84756
18854b15395O4853N5834j11546f199D07002a60462A31046k6687a92233E6058K03289
18843B59347c5495j69011j53583B60217j20797E2117e08813a42985L2140p1498
$$ plain form
18921 -1430 39646 -205881 -281 -138107 -178443 -271892 -95674 -145553 308184 -264332 40125
18909 -250912 -70232 75266 206966 163709 -61262 -181657 131169 -16291 119088 67181 247273
18898 247273 -146939 -174068 -194711 -1833 -262268 36670 411554 -310076 144520 -90323 -212740
18887 -212740 -191896 -238732 -33554 -77611 -230182 -132413 3805 -190092 -62399 -238797 -148529
18876 -148529 -222677 -127146 73424 17852 137649 -204947 188754 -381405 95294 -204930
18865 -116315 -115508 -194590 93675 -223211 -67355 -100164 -32678 -74176 -125049 -30639 -215395
18854 -215395 -150542 -94708 -206254 -6199 407002 -160462 131046 104359 -192233 56058 259347
18843 259347 -35495 -204506 -358089 260217 139420 52117 -508813 -142985 -110845 -182343
18833a82343F2225b60977A22046a75985d3714A68910b30852j7804f976A06896
18822A26909F1461A2568d17201d5104A75591g1724b3705o46373A31363m5971a09861
18810a11799B8109L51222H4149O0477b18221d4951k31264E1441K45941g6195j93346
18799b69541b4921D3048J68673J50962H2529a47346d9466q5674o038A35277a50560
18787A22730b6491k31921o6984A8715J28726a57378g0440A7971J36496h6439j9353
18776a05792c6285k51449a29475n4589c1722k62479m5289e4943k49259e3933n7023
18765a10956h983B33994p5684k3419Q979b76128A2044b81549C96370j49286a18094
18753a61752A81591a56560A60906b03290f0242k58920G8459b19858E3421a74731
$$ plain form
18833 -182343 62225 -260977 122046 -175985 -43714 168910 -230852 -248656 -6976 106896
18822 126909 61461 12568 -417201 -45104 175591 -71724 -23705 -670078 131363 85392 -109861
18810 -111799 28109 379331 84149 144626 -218221 -44951 -276215 51441 297382 -76195 -269541
18799 -269541 -24921 43048 211721 362683 82529 -147346 -49466 -135140 -141178 135277 -150560
18787 122730 -26491 -258412 -325396 18715 147441 -157378 -70440 17971 154467 -86439 -105792
18776 -105792 -36285 -287734 -129475 -184064 -31722 -294201 -339490 -54943 -304202 -53933 -110956
18765 -110956 -8983 233994 158310 134891 143870 -276128 12044 -281549 396370 247084 -118094
18753 -161752 181591 -156560 160906 -203290 -60242 -319162 78459 -219858 53421 -174731
18742c43035c4408k96056b6534r8663j36468a18654k9277N6759j9627B39197l3434
18731B05763e7226j31878B01085F4002a76021O2321j68860i2235F1964b44203
18720A99293n1173a37864A21437J04671b75193B40200I8476i9413C6241c22195
18709D94460B3549P8271c62053A56116h458l71597a29311B37788D408a3869o2232
18698g6101d951m2035o4348l0318D1538a4666F029L496b61458b650F2150J04388
18686A66538D3149Q1036h1912H9406B6616g9417G3548L33360A23754h9108A21954
18674a16569F4845B8585L2348a07550j13776E787a23991a2894j28163a8110F8566
18662H3060k1745R6474a05646M6811n1662d2953j00418N8151F8254b02448K1682
$$ plain form
18742 -343035 -34408 -330464 -26534 -125197 -261665 -118654 -147931 -91172 -110799 239197 205763
18731 205763 -57226 -189104 201085 64002 -176021 -113700 -282560 -92235 61964 -244203
18720 199293 148120 -137864 121437 226108 -275193 240200 98476 -99413 36241 -322195
18709 494460 23549 101820 -362053 156116 -8458 -380055 -129311 237788 4408 -13869 -76101
18698 -76101 -4951 -46986 -111334 -141652 41538 -14666 6029 9525 -261458 -2650 62150 166538
18686 166538 43149 124185 -81912 89406 26616 -79417 73548 406908 123754 -89108 121954
18674 -116569 64845 28585 60933 -107550 -221326 5787 -123991 -12894 -141057 -18110 68566
18662 83060 61315 157789 -105646 -58835 -110497 -42953 -143371 -85220 68254 -202448 -180766
18651a80766g5092A20200c69606a50557f3295C9745c68211A21201f9836K5654
18641d4182j90937A09241E1155Q624g0350L2783j17335I3792f9116k9036p4468
18630a72620A73930J73151H7115a21488A77395F5264F022J55810D0982g3871c5798
18618g1031I4485a25666j68150J43796A14516b5655k55251a09488n0988J178o4861
18607b24159A73540a84850A11660a80072A0489L3224J39650a10906j48847d8427
18596b13223M3523F3590b28209G6015h2291L8787A86372H0323h4522I2498a72309
18584a9163k23373A46862D992L06957b13295f1236E0484K67283e9407E1850i1175
18572a0180k60372A28995A4781a24428N6738A49647J37577A13188J29179c61981
$$ plain form
18651 -180766 -75092 120200 -369606 -150557 -63295 39745 -368211 121201 -69836 -44182
18641 -44182 -235119 109241 51155 59779 -70350 -37567 -154902 93792 -69116 -98152 -172620
18630 -172620 173930 347081 87115 -121488 177395 65264 6022 161832 40982 -73871 -35798
18618 -71031 94485 -125666 -293816 -150020 114516 -25655 -280906 -109488 -160476 -159298 -224159
18607 -224159 173540 -184850 111660 -180072 10489 43713 183363 -110906 -259753 -48427
18596 -213223 -169700 63590 -228209 76015 -82291 -43504 186372 80323 -84522 92498 -172309
18584 -19163 -242536 146862 4992 311949 -213295 -61236 50484 317767 -59407 51850 -91175
18572 -10180 -270552 128995 14781 -124428 -67690 149647 287224 113188 242367 -361981
18561b79067c3275F8621C3213d856j87788j896B01039r9345a01635A03286a72720
18549d49347h1799a7217j1375B95082R704A26709J36766g0958I4123O970K8492
18538A29585g6032o5143q6663M8841B0130b51651i3746A59924n7174K8106b27853
18526b6142A41804R1232E894a46045c0092j15553K4471j65553A00919b479A59931
18514a70536l8107J03614F085a91013M4487f5099k38342A46151a39698e5324M610
18503e0714b4185m8144C3955d2191k74748O0807d6012l00290a7905C6404J84755
18492B21159a21932B2029N921b16596l6472e9760A8008K40190r2689J8735N4132
18481B38376F0752M1869f999n5302F8567c3002B58386F5896d4662E2808L9461
$$ plain form
18561 -279067 -33275 68621 33213 -4856 -192644 -194540 201039 101694 -101635 103286 -172720
18549 -449347 -81799 -17217 -28592 295082 304786 126709 263475 -70958 94123 101093 129585
18538 129585 -76032 -141175 -227838 -178997 20130 -251651 -93746 159924 102750 130856 -227853
18526 -26142 141804 233036 5894 -146045 -30092 -145645 -121174 -286727 100919 -2479 159931
18514 -170536 -208643 -105029 6085 -191013 -146526 -65099 -303441 146151 -139698 -55324 -50714
18503 -50714 -24185 -72329 33955 -42191 -316939 -256132 -46012 -346302 -17905 36404 221159
18492 221159 -121932 22029 27950 -216596 -253068 -59760 18008 258198 165509 184244 238376
18481 238376 60752 102621 -6999 -62301 68567 -33002 258386 65896 -44662 52808 92269
18470I2269g6271j10841N4477F4248a30254A21842f8743J4302k46160B09352a67817
18458F7224a95542q0536A47070b0738E8642a89587D5307d0610k41826H2082L6398
18447A18480R2035B6559f2666j49286D3343b2926o4515q529k53884j18676a31667
18435b4940l8673l24123a3927I7969f6456A3546O6691h4256a1288l19627e7675
18423D1135J3583A3894R9870d8959E9977h955B664a89702A27916a20338j29377
18412b49715A38691c67213J60803A59450b6321q1274k7257B56288J49670a03657
18401b42898H3136B3824b93115B3622i6523A68920D0632i7578k3383k08605B24684
18389a97546B00775a99352O6543r693l4202A87912k8384a00041r436L5138A46444
$$ plain form
18470 92269 -76271 -187112 -132635 64248 -130254 121842 -68743 -54441 -300601 209352 -167817
18458 67224 -195542 -276078 147070 -20738 58642 -189587 45307 -40610 -282436 82082 118480
18447 118480 210515 26559 -62666 -211952 43343 -22926 -87441 -95970 -349854 -468530 -131667
18435 -24940 -63613 -387736 -13927 97969 -66456 13546 80237 -84256 -11288 -330915 -57675
18423 41135 54718 13894 113764 -48959 59977 -8955 2664 -189702 127916 -120338 -249715
18412 -249715 138691 -367213 -206410 159450 -26321 -107595 -134852 256288 405958 -103657
18401 -242898 83136 23824 -293115 23622 -96523 168920 40632 -97578 -120961 -329566 224684
18389 -197546 200775 -199352 -132809 -142502 -176704 187912 159528 -100041 -109477 -74339 146444
18377C18798a03116A8691J39618l6516R4003h8837E5681P1722a17025J8171J21
18366i8733K0170J2870j20244D7778b7487q6220m9829o7045J14100B54261F0946
18354i6431R898k14030J05149q074B0794L7608Q6849I997i0938k59229A89691
18342A57976e8492a4629A45R3442m6115c23645C40971b8369E5930J70509a27006
18330E7820J21911e20228C4998b00383b2576A86123q4183e1349I4422f584j16692
18319a23276d070a365A20007D6175h5815A60815a5852j39486N6900B8226d04708
18307c19422A9190a20509a1092j80056M655M0491j0274H5401b7645o2790C7787
18295A6095a60130A8280Q3609l9282m322f8849j07474e1090l0966K2125E1040
$$ plain form
18377 318798 -103116 18691 158309 121793 215796 -88837 55681 127403 -117025 -98854 -98733
18366 -98733 -78563 -65693 -185937 47778 -27487 -113707 -163536 -230581 -116481 254261 60946
18354 -96431 -86533 -300563 -195414 -203488 20794 58402 145251 9997 -90938 -350167 189691
18342 157976 -58492 -14629 145 93587 47472 -323645 340971 -28369 55930 226439 -127006
18330 57820 179731 -520228 34998 -200383 -22576 186123 101940 -51349 94422 -6584 -123276
18319 -123276 -4070 -1365 120007 46175 -85815 160815 -15852 -155338 -98438 28226 -404708
18307 -319422 19190 -120509 -11092 -191148 -186493 -146002 -156276 85401 -27645 -90435 37787
18295 16095 -160130 18280 101889 62607 58285 -68849 -176323 -51090 -82056 -59931 51040
18283H7373k4475f2876j806j35519b3743A19409C4186O123C012K57286I126e8198
18270d1497A42113a01351F0959K8113b61473G7688d9352j57636A43561a31076
18259i5012G1254a31511H033J5115a32241p0926E1318J2298K7910a77024g8785
18247A89377E2815J44348r2515f28460b8495j19741j08702h9747G3607K7805B6893
18235A02457l8200A2572g2939I2634g3527A49178b48291A74901N487a08341B59956
18223d9578A21625C1944J0713f1753A04071a18696j78929a16377B2077b60514
18212c62791J66365f7730A65592e2118G2902B6144M0248J62252c30887D4354L4031
18201G8385h9626F4287J44254C7730L3863d22928h9526E1175d10863D7225f2955
$$ plain form
18283 87373 62898 -62876 -64682 -200201 -23743 119409 34186 40309 3012 260298 9126 -58198
18270 -41497 142113 -101351 60959 89072 -261473 77688 -49352 -206988 143561 -131076
18259 -95012 71254 -131511 8033 23148 -132241 -203167 51318 63616 91526 -177024 -78785
18247 189377 52815 197163 104648 -628460 -28495 -148236 -256938 -89747 73607 101412 26893
18235 102457 64257 12572 -72939 92634 -73527 149178 -248291 174901 180388 -108341 259956
18223 -49578 121625 31944 42657 -61753 104071 -118696 -297625 -116377 22077 -260514
18212 -362791 -196426 -67730 165592 -52118 72902 26144 66392 228644 -330887 44354 78385
18201 78385 -89626 64287 208541 37730 71593 -422928 -89526 51175 -410863 47225 -62955
18189A44227B0343J9337a2624D0159K88538a16184m9906K8047B20382c97111F370
18177i6096M7546D45286g9017A43117J8131E4834L4680a2153B08129g7391A9142
18165c96712J46460J14695A79571q0670K85464c0274n2598j78696d0350P5j23976
18154a64251Q011k37327I5233d5135a1665G2617J37221F6373b30464a02689M9075
18143e3614k79581c2276a5462l11174a18264G5822i6837L4549j94391J20163b1191
18131H5453b3399j15658b1687j30038c6231B93544e041l97616A54580c99764f5218
18119b90681A52017E2098b04934B64133h2138q0492d7020A37453b02974C6055
18108a06837p3079A40482e8409F7435a14951L533K3839j86964i5382j58634e3806
$$ plain form
18189 144227 20343 39680 -12624 40159 328697 -116184 -166090 -138043 220382 -397111 6370
18177 -96096 -48550 445286 -79017 143117 161248 54834 89514 -12153 208129 -77391 19142
18165 -396712 -250252 -135557 179571 98901 384365 -30274 -82872 -261568 -40350 -40275 -164251
18154 -164251 -156240 -393567 95233 -45135 -11665 72617 209838 66373 -230464 -102689 -53614
18143 -53614 -333195 -32276 -15462 -326636 -118264 75822 -96837 -62288 -256679 -136516 -21191
18131 85453 -23399 -139057 -21687 -151725 -36231 293544 -5041 -402657 154580 -399764 -65218
18119 -290681 152017 52098 -204934 264133 -82138 -162630 -47020 137453 -202974 36055
18108 -106837 -179916 140482 -58409 67435 -114951 -111418 -87579 -274543 -95382 -254016 -53806
18096b1657H3350A349a01899H8402f1156C53143C0604M2510a57078p4235A5354
18084b12156A0347f5604k6946A74495j5125a7629l68474h0059G0801M1927a57035
18072C4000c1804p8306b5597l1101A5219J22915a22588d8518j7202j09067N1649
18061a23138j47292I1780o597L10750g8228m5736C142M26513b82529a10094D953
18049a4385I5765a56414c8090k53196a11815D7039a71642A48496e3378b665A03326
18037e0550P87k3538C30555c32335J32445a2242j1495k18070J18213J3727A31103
18025I7117d15082J96380B57486a35354J699a3125m4363j98704e8195K7223k79206
18014c10178J11607B13251b69651A4453O169J08027a44783D355f1418o8002J3149
$$ plain form
18096 -21657 83350 1349 -101899 88402 -61156 353143 30604 73114 -157078 -231313 15354
18084 -212156 10347 -65604 -92550 174495 159370 -17629 -386103 -80059 70801 112728 -157035
18072 34000 -31804 -110110 -25597 -56698 15219 138134 -122588 -48518 -65720 -174787 -123138
18061 -123138 -270430 91780 85183 395933 -78228 -123964 3142 429655 -282529 -110094 4953
18049 -14385 95765 -156414 -38090 -291286 -111815 47039 -171642 148496 -53378 -2665 103326
18037 -50550 -49763 -73301 330555 -332335 -199890 -12242 -23737 -241807 -123594 -109867 131103
18025 97117 -415082 -218702 257486 -135354 -133655 -13125 -57488 -256192 -58195 -30972 -310178
18014 -310178 -198571 213251 -269651 14453 20622 128649 -144783 4355 -61418 -129420 -116271
18003a16271d0526l4377i299A27886K9103o1873J5316a45830B27698i1983a6777
17991A69681g0396A8705c780B33333j4930g8352B42919E0193a01512j27884B56156
17979g3570q59a0015B38762H494f6407i531A07726a39755j63354I3209M3948d4394
17966d9600G1902i9165D36718A54381a94783J2224A70502i3671B53831a36011
17955A68259b11790C43230a5154A34025a32861A80404M9743B7049b02301A11212
17944C3093Q086J31491b33568I1985l5774N2139J18182e8254j31306E0842b73355
17932b29136b8585j4949F0245K164j3205c0422D7864M15920h5041A46672g0905
17920b02949I2864b45544L692f9271o1883A63546g9175B32635a1050A90040a35326
$$ plain form
18003 -116271 -40526 -74903 -9299 127886 156989 95116 110432 -145830 227698 -91983 -16777
17991 169681 -70396 18705 -3780 233333 218403 -78352 242919 50193 -101512 -229396 256156
17979 -73570 -74429 -10015 238762 8494 -66407 -9531 107726 -139755 -303109 93209 137157 -44394
17966 -49600 71902 -99165 436718 154381 -194783 -182559 170502 -93671 253831 -136011
17955 168259 -211790 343230 -15154 134025 -132861 180404 230147 27049 -202301 111212
17944 33093 41179 172670 -233568 91985 56211 108350 226532 -58254 -189560 50842 -273355
17932 -229136 -28585 -43534 60245 62409 49204 -30422 47864 463784 -85041 146672 -70905
17920 -202949 92864 -245544 -241852 -69271 -131154 163546 -79175 232635 -11050 190040 -135326
17908G6358L5879K6752F9270a27641j03695o1509J07198D7836h3620H4452c8130
17896a64395B05063b34803A4028R3486a56901D7613a66526j1119E1322a51995
17885F1810L31017c02084Q4719A40081i9568j60422g3273I5349a31173H5156c61329
17873A56609p8286a49646a2635G3828L1143a85789e809D1728d0175J6575h474
17861A59388M861B8L56382g9181F0009j300J34150p9221h9454M4355e478k67918
17849b73396L7857h1614C9170L6972c984I506a71279j35976C30021j42424n9679
17838A27918m4326c29249B65628A18145D1016K5565b05013p2170A6724J79395
17828A96119O3966F8165c7794B27626I837b93153H8804g2914j30132e9337j40013
$$ plain form
17908 76358 112237 138989 69270 -127641 -231336 -292845 -185647 47836 -83620 84452 -38130
17896 -164395 205063 -234803 14028 107514 -156901 47613 -166526 -177645 51322 -151995
17885 61810 392827 -302084 -217365 140081 -99568 -259990 -73273 95349 -131173 85156 -361329
17873 156609 78323 -149646 -12635 73828 104971 -185789 -5809 41728 -40175 -23600 -8474
17861 159388 164249 28 356410 -79181 60009 58709 192859 113638 -89454 -45099 -5478 -273396
17849 -273396 -235539 -81614 39170 76142 -3984 9506 -171279 -307255 330021 187597 127918
17838 127918 83592 -329249 265628 118145 41016 66581 -205013 -277183 16724 196119
17828 196119 260085 68165 -37794 227626 9837 -293153 88804 -72914 -203046 -59337 -199350
17817a99350F5769J55992a43927B38762n5931i8187c450r3900E022b12729I6213
17805b55417C05248J5067A17361J08072g2706p2152C43201b83534A7184c5579
17794H2789K6711J02036F761a42724O1611A4349L7527F521a89874b0147A29679
17782a28472l8801B16776a6260A70401e8851A52285n6353D3099a76054M3563j18580
17771b51071A31498C9195a57048I0819a398C80176i7636A2203b30078G0494a01876
17759I4306c18100A29857J67046o1257c6003j45860g6784A81991R2344F1932d642
17747g5324P163p7441A40607C2677M9622a11298B24750A10927K9910N1905a07136
17735c43247C07872H0548e4623l3061A35985P082o2697Q4064m8544c0233k67516
$$ plain form
17817 -199350 65769 221761 -143927 238762 182831 -98187 -3450 -97350 5022 -212729 96213
17805 -255417 305248 320315 117361 225433 -72706 -144858 343201 -283534 17184 -35579
17794 82789 109500 211536 6761 -142724 -81113 14349 51876 6521 -189874 -20147 129679
17782 -128472 -167273 216776 -16260 170401 -58851 152285 95932 43099 -176054 -132491 -251071
17771 -251071 131498 39195 -157048 90819 -1398 380176 -97636 12203 -230078 70494 -101876
17759 94306 -318100 129857 296903 235646 -36003 -181863 -76784 181991 274335 61932 -4642
17747 -75324 -68161 -145602 140607 32677 82299 -111298 224750 110927 140837 192742 -107136
17735 -343247 307872 80548 -54623 -87684 135985 143067 80370 164434 115890 -30233 -297749
17724b97749a12854d1025A19823c1477m2711A60118J84996b42155a9014n089m4576
17713f8679B13786e7003I3077J9345a19486A22561o1116b5103q599A39476R962
17702A49438O7309c00747e114C38232d1842j81832A5847P179N1124J39125c4826
17690f1113D258h5017j79768A8393J62413a3013l64748i966a467A10730K9045
17679A39775a65285A13050a78311A33160C786a80937B7178K8138b3016m1346l262
17668f7624K0831k8146j5509B72413a32303A72863i5200H4143Q0568k1346L3474
17657A76839K8600F1225k2486K964b3468A80347I88J90636G4918K31895j45896
17646A60917a7623B01703j4583d4762G5509J31305n1512F5003b88438J12990j1533
$$ plain form
17724 -297749 -112854 -41025 119823 -31477 -74188 160118 345114 -242155 -19014 -24103 -68679
17713 -68679 213786 -57003 93077 112422 -119486 122561 61445 -25103 -33702 139476 149438
17702 149438 216747 -300747 -5114 338232 -41842 -223674 15847 23026 74150 213275 -34826
17690 -61113 4258 -85017 -264785 18393 180806 -13013 -377761 -9966 -1467 110730 139775
17679 139775 -165285 113050 -178311 133160 3786 -180937 27178 55316 -23016 -64362 -67624
17668 -67624 -46793 -74939 -90448 272413 -132303 172863 -95200 84143 164711 143365 176839
17657 176839 205439 61225 38739 41703 -23468 180347 988 191624 74918 306813 160917
17646 160917 -17623 201703 187120 -44762 75509 206814 155302 65003 -288438 -175448 -186981
17635a86981A38979K59139a06032C8031N2864j7204R9283p9351M301L4497i34
17623E6768M011a1707k61378C0434O6755P8885C909J07089a05163J5906o4785
17612a54042M1426D2176n754A0981J01638a97950N3191G6665b22010h0663A903
17600H748a56595E6320J27958E1745J69390G2725C3386i9865p1824A61750C3206
17588h1113j15075C56495A66202L977D9408K24583G9449K84342a05498b9463j10658
17577a40121H6986a38391E2409K93630d2772k78248B15199i0680C2497K62354
17567B94851b5066j72675B80448r8056e47972B6544M4819a2984j01549F8829h2126
17555D1403c29946G1608c3407A11263Q2610K88468A61366g0619j3268A05640E2411
$$ plain form
17635 -186981 138979 398118 -106032 38031 90895 73691 172974 93623 97924 132421 -934
17623 56768 60779 -11707 -273085 30434 97189 176074 3909 110998 -105163 -89257 -154042
17612 -154042 -112616 42176 36422 10981 112619 -197950 -144759 76665 -222010 -80663 1903
17600 8748 -156595 56320 184278 51745 221135 72725 33386 -99865 -171689 161750 33206
17588 -81113 -196188 356495 166202 170179 49408 273991 79449 363791 -105498 -29463 -140121
17577 -140121 86986 -138391 52409 346039 -42772 -321020 215199 -90680 32497 294851
17567 294851 -25066 -197741 280448 182392 -547972 26544 71363 -12984 -114533 68829 -82126
17555 41403 -329946 71608 -33407 111263 193873 482341 161366 -70619 -83887 105640 52411
17543f0465r553A13917j1543k0748h4741B71215n7816b6543G0819J65480N8657
17532B94956c18145B05945o7945b12675J7271j20842a02962I8777m690J16382
17522B10469K3148a4824B93564K8263N1872B3633P8010K7060a80946D1312b9092
17510b31386B18889a35625A19295K47032n5867G8927d1803a5906n1100k03365
17500b70371B6604J04328b0791A37168J51395I2176a44102A83489k2630p6902
17490H3957a08959C52547A73025f7798n0388A49491a14062A38489o7826e4308
17479c209A10587K3680N0876m7090k5421L51953B12339r4512N4287D691a57410
17467A5428e4808A87289o5665g7540C24737h3978D29007k10477K1965E2168L29874
$$ plain form
17543 -60465 -70018 113917 102374 81626 -84741 271215 213399 -26543 70819 236299 294956
17532 294956 -318145 205945 138000 -212675 -195404 -316246 -102962 98777 94087 210469
17522 210469 233617 -14824 293564 321827 373699 23633 101643 128703 -180946 41312 -29092
17510 -231386 218889 -135625 119295 366327 310460 78927 -41803 -15906 -67006 -270371
17500 -270371 26604 130932 -20791 137168 288563 92176 -144102 183489 160859 83957
17490 83957 -108959 352547 173025 -67798 -118186 149491 -114062 138489 70663 -54308
17479 -3209 110587 134267 185143 138053 112632 464585 212339 117827 172114 4691 -157410
17467 15428 -54808 187289 121624 -77540 324737 -83978 429007 218530 240495 52168 382042
17456C82042A54853P7872o0145Q2010J47553a52481B48996i1737A47659O6019
17446B13678J13368A61003L76725o0409j89129K4127c7845B57526m0451E1351
17435A70947D1838K083K05185m8002J14044C4977L14989D6161f7507E60474B57191
17423B10206L7208p4383H952J79368O9042K68096f1170A00731M40320G8507f1739
17411h527A59926J06964A21803J99753m3747b12550D01569j93887b3234D3282
17400B16188H2540J31107A9024K4136a09721B98341n8747Q2723a7864B28869J4192
17389B43061m2972F8477j8257h7365k5176F400J89525a38541C21963A41656J89284
17378C30940A04589a45251b8961j13685C2305K25921e8249A55767J06354K45097
$$ plain form
17456 382042 154853 232725 172580 254590 402143 -152481 248996 -91737 147659 213678
17446 213678 327046 161003 537728 477319 288190 312317 -37845 257526 217075 51351
17435 170947 41838 43921 249106 201104 315148 34977 349966 46161 -67507 560474 257191
17423 210206 247414 173031 8952 188320 257362 525458 -61170 100731 541051 78507 -61739
17411 -8527 159926 266890 121803 321556 277809 -212550 401569 207682 -23234 43282
17400 216188 82540 213647 19024 43160 -109721 298341 239594 322317 -17864 228869 243061
17389 243061 200089 68477 50220 -87365 -112541 6400 195925 -138541 321963 141656 330940
17378 330940 104589 -145251 -28961 -142646 32305 258226 -58249 155767 262121 507218
17368E07218A86085q1077g1352A97451r1995d4776A41689F5718K70091A15024
17357A13068Q2728i9904D90407A07115K4293J80589A09987k9540M05716A47980
17346C61059e9355D18825j93826a2663B46195E9136J36798Q4265H2561K14120
17336B96681O1209k8522o0121j6418a59952f5730I9714L0279E8192J57529a07989
17324a5969A06151a9493q1380j85710A46782j3248K40838H661K49251H2583k839
17313G9744o356a28812A22671m8474l6814K73490A52926m1617J7d094n576j44172
17301a53842D03867A80256J1003M4702l1713B2039J96653J20203g9854D98071
17290I0368C2291L37922j41010j7862J1210d9831B633f3855B2434R8979J7704
$$ plain form
17368 507218 186085 105008 -71352 197451 105456 -44776 141689 65718 335809 115024
17357 113068 195796 -99904 490407 107115 131408 311997 109987 80447 486163 147980
17346 361059 -59355 418825 224999 -12663 246195 59136 195934 280199 82561 296681
17336 296681 357890 329368 269247 252829 -159952 -65730 99714 129993 58192 215721 -107989
17324 -15969 106151 -19493 -100873 -286583 146782 133534 374372 8661 257912 82583 79744
17313 79744 73388 -128812 122671 74197 37383 310873 152926 111309 111326 -4094 -9670 -153842
17301 -153842 403867 180256 191259 235961 204248 22039 218692 338895 -79854 498071
17290 90368 32291 370213 229203 211341 222551 -49831 2633 -63855 22434 121413 139117
17279A39117b3704E5750J08267O05L18162e8974C67543j4895A04737J07431J6817
17268B28985G2286Q4646M48969G17Q4708C1359J97094J36025k8856c2062A91329
17256B73953a459A57504L6502l3586K10475j56699p9081J04786J29773D3737J77801
17245B21538p2113a01207C25079k3983P153n4519K00523F3954J4817b211A04317
17233b855j35185B6607J54698E1333J32673f2208B4929a53300H7765a39869b6389
17221A86090q0284K39143A21973P7928o6891C4865J60141M5018J21755j73918
17211A87861b19118I4120K73636A03660J16518f7186D24223j06175I8993K47535
17201C46528I4881J02240d3758J3969J0662B98227A33260a5986B67668j01025
$$ plain form
17279 139117 -23704 55750 164017 164622 482784 -58974 367543 352648 104737 212168 228985
17268 228985 72286 156932 605901 717 85425 31359 228453 364478 335622 -32062 191329
17256 273953 -1459 157504 194006 160420 370895 214196 135115 239901 369674 43737 221538
17245 221538 149425 -101207 325079 301096 308249 253730 454253 63954 78771 -2211 104317
17233 -2855 -138040 26607 181305 51333 184006 -62208 24929 -153300 87765 -139869 -26389
17221 186090 105806 344949 121973 199901 133010 34865 195006 240024 361779 187861
17211 187861 -219118 94120 367756 103660 220178 -67186 424223 318048 98993 346528
17201 346528 94881 197121 -43758 -29789 -19127 298227 133260 -15986 267668 166643
17191A66643N3204K55386A80246K04047j8990j67484h7278F83176b25913A80279
17180D20276j08188n9049J71168p3247E9047K31535K62977j32041J9479p1509
17170C69488j79577o6962J38804O5583j05867O4519O7604N9399j50693O2096A17684
17158A80968Q6220J5697K78395A11243m7250L41499j55075I9662L80612F663J99409
17147B06072M95249B49495m070N152n6776J71312j8203r3583J54251A80602M0498
17136B21100m6865L48760E4014M28815R5011k44914p5394K4958j18660r818J9513
17125A73525b6775B33537L3336g4397F3919J82407J40849H8161M81638K9741k32456
17114C67084P6081o7113j26211n8285J23985J01552K60888B90202j27a30925E03245
$$ plain form
17191 166643 219847 475233 180246 384293 365303 197819 -87278 683176 -225913 180279
17180 420276 312088 253039 424207 350960 59047 290582 553559 421518 440997 369488
17170 369488 189911 122949 261753 327336 221469 285988 353592 412991 262298 324394 117684
17158 180968 267188 282885 561280 111243 63993 405492 250417 99662 480274 6663 206072
17147 206072 701321 249495 245425 250577 193801 365113 346910 253327 407578 180602 221100
17136 221100 174235 522995 54014 482829 577840 332926 257532 282490 163830 154012 173525
17125 173525 -26775 233537 266873 -74397 63919 246326 387175 88161 569799 599540 367084
17114 367084 443165 376052 249841 191556 315541 417093 677981 290202 290075 -130925 503245
17102C26707A35147M04146A30618F1182J63764J96175J65366B87112R9139L32239
17092G18490B81069J47699Q473K1644j10461J22310j68534n646O2853J24263p4827
17081D08843q1654J76241Q6795k68704O9218K1232J2218j50709J05411K7697K0942
17070D27530l6645j33656n6494J67377K24387R318o0374j65028n0334J67159O3423
17059E56663K66951B80721M89238k78238J89132k25945P4234j8988j39161K31742
17049F02735j24211j05671L54965l55494L80102J59281D39884M1516q5499J37821
17039E33722j96888P9734Q9939R1664J90181o5018A43398L07732L91101C33061
17028B64161K98428j50312J64415R4199r8879K57714C58146j1162n3225K71279
$$ plain form
17102 326707 135147 539293 130618 61182 224946 421121 586487 287112 386251 718490
17092 718490 281069 428768 437241 458885 348424 470734 302200 296554 359407 483670 408843
17081 408843 327189 503430 590225 321521 390739 411971 424189 273480 378891 406588 427530
17070 427530 390885 257229 200735 368112 592499 601817 541443 376415 326081 493240 556663
17059 556663 823614 280721 769959 491721 680853 454908 529142 510154 370993 602735
17049 602735 478524 372853 727818 372324 752426 911707 439884 481400 395901 533722
17039 533722 336834 416568 506507 598171 788352 723334 143398 451130 842231 333061
17028 264161 562589 412277 576692 670891 572012 829726 358146 346984 293759 565038
17018E65038J12184j64866J3483J90753k64383O413J88240o9776j48001K80596
17008G09681O274R8936k38712N5144K972M3880k32724L47650j78879O675j92850
16997D28047K11178K54697r7341l64171M49080j34517j18029J3704R8074o5741
16987F74981J26559C80061L72417M88017m83175K60991k27479K82706l57372j07165
16977F09001r7820L47077k54657M3203J05867K11198m78995K36311j56387L35951
16967I00749j58389O6538J95294r7711j24234L93277k31815j14370L89348m6093
16957A172594E13447M06156J04677k27833l0417K7171O3306M638p802P7425k45790
16946F84978L35356R0793o242m39102N97365l02172K71656j14134L217j11374
$$ plain form
17018 565038 677222 512356 525839 716592 452209 458622 646862 577086 429085 709681
17008 709681 715955 814891 576179 631323 634295 678175 445451 793101 614222 620897 428047
16997 428047 639225 893922 796581 432410 881490 746973 628944 642648 740722 674981
16987 674981 801540 380061 752478 1240495 757320 1018311 790832 1073538 716166 609001
16977 609001 511181 858258 603601 646804 752671 963869 484874 721185 564798 900749
16967 900749 742360 808898 1004192 906481 782247 1175524 943709 829339 1218687 1172594
16957 1172594 513447 919603 1024280 796447 766030 793201 856507 861145 853343 930768 684978
16946 684978 1020334 1111127 1104885 665783 1263148 960976 1232632 1118498 1121715 1010341
16936A010341j64932P8366m6707j3535J53777j03023M05052l31399p416M45215
16926A425739O8218l28316J4248P6633k32258K28384l81171K17718J31523J11379
16916A332097N0496J8931l83024O5558j26661L80809J112O985o6888J57052j87095
16905A249372J19890K04939k02074K94491Q0689l62496L67571j77052j64206L88014
16895A799138j23678J58278l69589J59323k10734L56985j27236J64962R9585k44538
16885A662496j98837N11414j66593j64751K58404P2334l14934L31595Q2024P8360
16875B151512J79429m67926M35629j26609k22856K77827J21688K48942k99239
16866B298397J22802O7251q5410o4848k11369K40080L10128o14131M64064m7879
$$ plain form
16936 1010341 845409 923775 877068 863533 1017310 914287 1319339 987940 980524 1425739
16926 1425739 1493957 1165641 1179889 1256522 1024264 1252648 871477 1089195 1220718 1332097
16916 1332097 1382593 1401524 1018500 1084058 957397 1338206 1339318 1346303 1279415 1436467 1249372
16905 1249372 1369262 1574201 1372127 1666618 1747307 1384811 1752382 1575330 1411124 1799138
16895 1799138 1675460 1833738 1464149 1623472 1412738 1769723 1642487 1807449 1907034 1662496
16885 1662496 1463659 1975073 1808480 1643729 1902133 1974467 1659533 1991128 2073152 2151512
16875 2151512 2330941 1863015 2298644 2172035 1949179 2227006 2348694 2597636 2298397
16866 2298397 2421199 2488450 2403040 2338192 2126823 2366903 2677031 2062900 2526964 2479085
16856B479085n7908r0548J55446J16973q522J852J64264L07465l43215m6793P87270
16845C465369p74586N94928j55299Q3947q5687j80609N76973j28814L73021l89244
16835C379999R0403J01153J343M5637J75523J68565Q3692M8391j96763J53648
16825D051591K40385j16611K78277r3814P9012K78156K32850R5535K1081l20173
16815D746289M35696N3516m2071K99083l31385L20568L50407j56888K38650j94276
16805E719589N83630J45041O9515L423L99457K12857q3324P3136M35589J97888
16795G756801K19126K54238K61844L64911m69329Q04526j29995M98356K45293
16786I805771J82982K19403L46701J92143R7406M22719N30204J24847K87111O26716
$$ plain form
16856 2479085 2421177 2330629 2486075 2603048 2594526 2596378 2760642 3068107 2724892 2678099 3465369
16845 3465369 2690783 3285711 3130412 3214359 3128672 2948063 3525036 3396222 3769243 3379999
16835 3379999 3470402 3571555 3572898 3618535 3794058 3962623 4046315 4094706 3897943 4051591
16825 4051591 4291976 4175365 4453642 4359828 4438840 4716996 4949846 5045381 5066462 4746289
16815 4746289 5181985 5235501 5193430 5492513 5161128 5481696 5832103 5675215 5913865 5719589
16805 5719589 6303219 6448260 6517775 6521198 6920655 7133512 7050188 7123324 7558913 7756801
16795 7756801 7975927 8230165 8492009 8856920 8387591 9192117 9062122 9560478 9805771
16786 9805771 9988753 10208156 10554857 10747000 10844406 11267125 11797329 11922176 12209287 12836003
16776A2836003K30422O33772N6326O59941M21755P71897M50836M90720P45415
16767A7297087K92727Q55908M18737R26007R41142Q30523O71944P32924J059123
16758B4026122J024657J231811P57057J117231J529772J212834J509179K060299
16750C4468962J115379J935674K074506J773945K379057K153759K408493K855168
16742E1164943L036770K907460L727150L577413L908721M078298M690301M245130
16734H1336186N784907N627459O037999O563206O725839P313071P545976Q059722
16726A34994365Q236699Q357962Q612236P835256Q083579P270965O343995N370244
16718A95105301M374966L051555J220078J06454k026931l367733m716734o020133
$$ plain form
16776 12836003 13066425 13700197 13756523 14416464 14838219 15610116 16060952 16551672 17297087
16767 17297087 17589814 18445722 18864459 19790466 20731608 21562131 22234075 22966999 24026122
16758 24026122 25050779 26282590 27039647 28156878 29686650 30899484 32408663 34468962
16750 34468962 35584341 37520015 39594521 41368466 43747523 45901282 48309775 51164943
16742 51164943 54201713 57109173 60836323 64413736 68322457 72400755 77091056 81336186
16734 81336186 87121093 92748552 98786551 105349757 112075596 119388667 126934643 134994365
16726 134994365 143231064 151589026 160201262 168036518 176120097 183391062 189735057 195105301
16718 195105301 199480267 202531822 203751900 203858354 201831423 198463690 193746956 187726823
16710A87726823o495904p736414q257242q523363q381567q667457p916373q244322
16702A23504181p533795p034360p154145o356323n977594n738935n110883n156298
16694G3441848m075479m390454l686334l905019k837157l366115k637368k558891
16686D5985031k516729k501958j881966k262477j262338k130823j367371j510952
16678C0550417j487838j161395j512095j149121j000342j083449j049962n24999
16670B1581216j297341n97238k51384j309953o89475j38163j103215n75251p11556
16661A4907640m22238m19354l74095l99261l95249l65302o32133l00553k82784
16652A1316671m92778p5117l76491l16290m89731j31390k34803L8072n54687j07372
$$ plain form
16710 187726823 181230919 173494505 165237263 156713900 148332333 139664876 131748503 123504181
16702 123504181 115970386 108936026 101781881 95425558 89447964 83709029 78598146 73441848
16694 73441848 69366369 64975915 61289581 57384562 54547405 51181290 48543922 45985031
16686 45985031 43468302 40966344 39084378 36821901 35559563 33428740 32061369 30550417
16678 30550417 29062579 27901184 26389089 25239968 24239626 23156177 22106215 21581216
16670 21581216 20283875 19686637 19435253 18125300 17435825 17297662 16194447 15619196 14907640
16661 14907640 14485402 14066048 13691953 13292692 12897443 12532141 11900008 11599455 11316671
16652 11316671 10823893 10748776 10372285 10055995 9566264 9434874 9200071 9238143 8683456 8576084
16642H576084m86223l97231j3935n7434l62360j73072l49577K28341m04433p2696
16632F487464M9014n26974L6104J08008n50016k02245q3869j75867J72036k04546
16622E109109L11361l82746o40226O1564K95731l9156j65745O6117l37546k55598
16612D022865r2427J93127k32859j01384K83966R559l21247n11534K87893J09188
16602C647147n88874M19410n71471L44908k69621J31113k98420j68073N96976
16593C243095m61814J00403k34647k6785L20912k50444K60956j96012j65109k55255
16583B335300k9280M6541J37548j44260J30405k20199q13M9765l20993K60419
16573B244433j8724m56371J01322k8306L61598l66206n3194J26591k32941J72196
$$ plain form
16642 8576084 8089861 7692630 7678695 7621261 7258901 7085829 6736252 6964593 6560160 6487464
16632 6487464 6536478 6009504 6045608 6153616 5603600 5401355 5317486 5141619 5313655 5109109
16622 5109109 5420470 5037724 4397498 4459062 4754793 4715637 4549892 4616009 4278463 4022865
16612 4022865 3930438 4123565 3890706 3789322 4073288 4082847 3761600 3250066 3537959 3647147
16602 3647147 3058273 3477683 2906212 3251120 2981499 3112612 2814192 2646119 3243095
16593 3243095 2781281 2881684 2647037 2620252 2941164 2690720 2951676 2755664 2590555 2335300
16583 2335300 2306020 2352561 2490109 2345849 2476254 2256055 2255242 2305007 1984014 2244433
16573 2244433 2225709 1769338 1870660 1842354 2203952 1837746 1784552 1911143 1678202 1850398
16563A850398P3012j44911j2333K23831M4359l59806M88879n42848j649k66576
16553A352356M40870j68611J9550j19219l41423M07063k89584k62664P1660L51917
16543A461915J4585N2186m84681M76555j16488j45795k36049J51632J40294p4830
16533A239324j341J41718j84708N7574p3986R7185K77913r1985M0215k07134k05091
16522A089684K15701j69451p5822K1329o5659l3946J18654M40635n94539j00748
16512H45838M48853m94008R6080J10093r8621j44658L25157k25344K38464r5340
16502A006514q9459r1866M34154m15117N1356r4707L8771M7826k97327K111K72018
16491H64274k34996m8601K87881N4073l47803K39612j09736l4552M09789E00021
$$ plain form
16563 1850398 1923410 1778499 1766166 1989997 2034356 1674550 2163429 1620581 1618932 1352356
16553 1352356 1793226 1624615 1644165 1524946 1183523 1590586 1301002 1038338 1109998 1461915
16543 1461915 1476500 1528686 1044005 1520560 1404072 1258277 1022228 1173860 1314154 1239324
16533 1239324 1237983 1379701 1194993 1252567 1178581 1275766 1553679 1461694 1501909 1294775 1089684
16522 1089684 1305385 1135934 1060112 1081441 1015782 981836 1100490 1541125 946586 845838
16512 845838 1294691 800683 896763 1006856 908235 763577 1088734 863390 1101854 1006514
16502 1006514 917055 825189 1259343 844226 895582 800875 839646 887472 590145 592256 864274
16491 864274 629278 580677 868558 922631 574828 814440 704704 670152 1079941 500021
16480A088474k28636J17897D19801J32862J30475P613L62267j98704k23409J36619
16470G67524k83316J43643R5010k93707m8047M54512j06890j39474q979q8513
16460D91763K25642K08448l65736k8857J3118j89730J55560L54984k08190j53564
16450E03438J54461Q0610C42345K52103j07860p5405r0543J2011J00007R1479
16440E24137k08306R652M39182k11100j00785R6669O661q8910J99062l01065m8681
16429C16516L47623k41436J86240p5091j83419O1306q3436J2660J21557j63144
16419B99376R0651J52039B14407M7831k1335L50896k46152K1686J51380p018O6282
16408E77977B07017J78424O0236j1804J44392P7897j81285J4869A49743J83670
$$ plain form
16480 1088474 859838 977735 419801 552663 683138 690751 1053018 854314 630905 767524
16470 767524 484208 627851 722861 429154 381107 835619 728729 589255 580276 491763
16460 491763 717405 925853 560117 531260 544378 354648 510208 865192 657002 503438
16450 503438 657899 738509 342345 594448 486588 411183 320640 332651 432658 524137
16440 524137 315831 325483 764665 553565 452780 549449 556110 467200 666262 365197 316516
16429 316516 664139 422703 608943 533852 350433 411739 328303 340963 462520 299376
16419 299376 390027 542066 214407 262238 240903 591799 345647 367333 518713 511695 577977
16408 577977 207017 385441 445677 433873 578265 656162 474877 489746 149743 333413
16398C33413p6099N2622P1902n6971j42984L61527m5375j99806k157m9648O3940
16387C10364q8072P0358K15579F9604L06736o914j72052N0037R1273L8806l0899
16376C46591K32093A75754K99397b2481D01551c8478A59548J30563A34600l7242
16366I7358B5461K98347L2449N8966A48237g0271C81917J35361k47031n8818J17899
16355C29328j60081K59143j86534k2917F5647J41772O3426a26291B44850L1569
16345B76419L71770B70766J06959m4227P4031A54922J48178J37580J06134b6057
16334A88615p01a1130D91847A20518J34059J5929j2291a6227k3557C6956L02243
16323C39199L23122C20105j47353J2008M7743k7687J84557j23526J34876A56591
$$ plain form
16398 333413 257314 309936 381838 324867 181883 543410 498035 298229 296072 246424 310364
16387 310364 222292 292650 508229 69604 376340 369426 197374 247411 338684 377490 346591
16376 346591 578684 175754 475151 -22481 401551 -38478 159548 290111 134600 97358
16366 97358 25461 323808 356257 415223 148237 -70271 381917 517278 270247 211429 329328
16355 329328 169247 428390 241856 218939 65647 207419 270845 -126291 244850 276419
16345 276419 648189 270766 377725 333498 407529 154922 303100 440680 546814 -26057
16334 188615 187914 -11130 491847 120518 254577 270506 258215 -16227 -39784 36956 339199
16323 339199 662321 320105 172752 184760 232503 204816 389373 265847 400723 156591
16312F1628e9437C84104j16232h1184C55178G5239K12705a05380j18903A73847
16301c4356A52435J79726P918L21335l12560A9760J39279C2716K29858n7319K00966
16290D06221a08368F600L7631L7561J1806K15911a17054b6813B84989K74597k48078
16279C11508g9247G2773l695R2845O0354f682j5893A03175m6363O8966L35254
16268D61032n2844n5456A73811p0297a69389D61794j09513I4056a44010f9045
16257A10402L10930F3518O0748K11244d5248B63955N6731a8968E9671b18264B49344
16245B71414M2398j03250p6958O5180M925L83920k33234C1149K84746A52213J26485
16234B78698A35937c1209B38533b02737B23524P301B6501a2613B49412N6235m1568
$$ plain form
16312 61628 -59437 384104 267872 -81184 355178 75239 287944 -105380 -224283 173847
16301 -34356 152435 332161 340079 661414 348854 19760 159039 32716 262574 205255 406221
16290 406221 -108368 6600 44231 81792 93598 309509 -117054 -26813 284989 559586 311508
16279 311508 -79247 72773 69078 161923 222277 -6682 -22575 103175 56812 125778 461032
16268 461032 408188 352732 173811 103514 -169389 461794 352281 94056 -144010 -69045
16257 110402 421332 63518 124266 335510 -45248 263955 320686 -18968 59671 -218264 249344
16245 271414 313812 210562 133604 198784 203709 587629 354395 31149 315895 152213 278698
16234 278698 135937 -31209 238533 -202737 223524 230825 26501 -12613 249412 305647 264079
16223B64079J69019j00732G7369g5259F2893J4639b35068A05316b5986A87144
16212A54170j6460f1483b521A25409C7725e3355j64268h4564j86245e9280B73362
16200C8955N9997L9759N2858m4490b3511j1383A30955D5289J33956m4200k4017
16189A11028J89350A21243a10237K8388A35670a2547m8292n6107A78107J14924
16179B93031H4865J26466D0838b2476A93532a0740B11325b12420d7728o90j13526
16168a61944H7100c75708a67841D68487a99439E38250a38312F7189K07639a49897
16157B48427H471K35654q63I7444J85641A39742J72356g1587C6256d9886l3744
16146h3630C5488a65278A13130A604J17272R1839F1084a72469h5076F4108R6713
$$ plain form
16223 264079 433098 332366 77369 -75259 62893 77532 -235068 105316 -25986 187144
16212 154170 137710 -61483 -2521 125409 37725 -53355 -217623 -84564 -270809 -59280 273362
16200 38955 98952 138711 191569 147079 -23511 -34894 130955 45289 179245 135045 111028
16189 111028 300378 121243 -110237 -81849 135670 -12547 -60839 -116946 178107 293031
16179 293031 84865 211331 40838 -22476 193532 -10740 211325 -212420 -47728 -48418 -161944
16168 -161944 87100 -375708 -167841 468487 -199439 538250 -138312 67189 274828 -149897
16157 248427 8471 244125 243262 97444 283085 139742 312098 -71587 36256 -49886 -83630
16146 -83630 35488 -165278 113130 1604 118876 210715 61084 -172469 -85076 64108 160821
16135A60821p9778g7793j15978O2378K8296j39132a02814b0609m3632H6737J8859
16124A05596L15745m3576h19j66981K166g2709G2917c33657a37152A20087M9197
16113A69284g899A22702I696J2855Q7364l6021D763a20562m2161O1351D9501o210
16101D3291J62937p4966P8793c9024k02985a01821B98168g7310J0686c0357N395
16090b4962A05526a6277E1921O6514B3212L22109l8373a34808d3561C04509F4503
16078h4599a1291H2774J85857j24211h7367C5595J71262h8108b4689C7544f0348
16066b27259C2879f5266B28921n0815f3260F8045g7688b2711r0561F734f9186
16054B8566b8388R137n0501j76850A51490a29750I3477j6481J375R8004a57257
$$ plain form
16135 160821 81043 -77793 -193771 -131393 -103097 -242229 -102814 -20609 -64241 86737 105596
16124 105596 421341 377765 -819 -167800 -165634 -72709 72917 -333657 -137152 120087 169284
16113 169284 -7899 122702 9696 22551 109915 73894 4763 -120562 -162723 -101372 49501 43291
16101 43291 206228 131262 210055 -39024 -242009 -101821 298168 -77310 -66624 -30357 -24962
16090 -24962 105526 -16277 51921 118435 23212 345321 306948 -134808 -43561 304509 64503
16078 -84599 -11291 82774 268631 144420 -87367 35595 206857 -88108 -24689 37544 -60348
16066 -227259 32879 -65266 228921 178106 -63260 68045 -77688 -22711 -113272 6734 -69186
16054 28566 -28388 -19251 -69752 -246602 151490 -129750 93477 76996 78371 176375 -157257
16042a79969e4454D33758A13391D4493h8150A5734h5689M2509B27469b69723J02803
16031a66920M3583k0311B52916b0676C10739a76068l20939A33561b68346M7686
16021b20660j71338C3423P9382j4208i839A62372N9148b23291H7018l8795b2737
16009A9107a12508k55548J53841G9636N0555a40263A42105c5853j42653Q7905
15999i0601H9292a69167D7164J06712k0784b12339C9350a03106b1519i573A21347
15987b40832A22051b71373A20821P356O4060L5704J48800B7053J87876r9121c5194
15975C9027J80546g6409G1063b45384A98381O5737A7819a9052n2928A89165a63949
15963b94685a24081j1019J6229C16987E2438N1337B925N4360e0803C04470A9894
$$ plain form
16042 -179969 -54454 433758 113391 44493 -88150 15734 -85689 -43180 227469 -269723 -166920
16031 -166920 -123337 -143648 252916 -20676 310739 -176068 -497007 133561 -268346 -220660
16021 -220660 -391998 33423 112805 98597 -9839 162372 221520 -223291 87018 48223 -22737
16009 19107 -112508 -368056 -214215 79636 130191 -140263 142105 -35853 -178506 -90601
15999 -90601 89292 -169167 47164 153876 133092 -212339 39350 -103106 -21519 -9573 121347
15987 -240832 122051 -271373 120821 128177 192237 227941 376741 27053 214929 115808 -35194
15975 39027 219573 -76409 71063 -245384 198381 264118 17819 -19052 -71980 189165 -163949
15963 -294685 -124081 -135100 -118871 316987 52438 103775 2925 57285 -50803 304470 19894
15951a60098e3082r0557B75466b93722C07546J35364b50593G8243N4587b57110
15940A88637l5595i3160B2576J73557G2581M8272b52681A56321a10133C0480J19603
15929A50083N4620h4245B07997d095B7384b45820A32479D9941J04133p0480b60014
15917a49823B35379G0321K26255G5859c71859E3040a30283q370A05799A3872a15930
15905b54985h1057D8948a63064j7217N5197c9274l7397G1934h549o0926a426A14144
15892A65455E7380g9017a7631J237k26881F6661R723A32a08500a4105B07214e6870
15879A51541F2872b19849c1759A83603b44982N1853A7024J90878r4075b86195
15868c5769l98555C94559a18266l70269a15370I3969l3287b46926H134b8003A11107
$$ plain form
15951 -160098 -53082 -143639 275466 -293722 307546 442910 -250593 78243 132830 -257110
15940 188637 153042 -93160 22576 196133 72581 120853 -252681 156321 -110133 30480 150083
15929 150083 204703 -84245 207997 -4095 27384 -245820 132479 49941 154074 83594 -260014
15917 -149823 235379 70321 296576 75859 -371859 53040 -130283 -138653 105799 13872 -115930
15905 -254985 -81057 48948 -163064 -180281 -125084 -39274 -76671 71934 -8549 -69475 -1426 114144
15892 165455 57380 -79017 -17631 -16394 -243275 66661 76384 132 -108500 -14105 207214 -56870
15879 151541 62872 -219849 -31759 183603 -244982 -193129 17024 207902 113827 -286195
15868 -35769 -434324 394559 -118266 -488535 -115370 93969 60682 -246926 8134 -28003 111107
15856B6218a04082B46072f4948n5737A31557d5742l8166B09885H3068d56709i6053
15844g5191A71440a40380H7710a24399M4877l0209M9759B33404l2348k3022b22603
15832I3522K2860a9320H3643a64972h1322k28194C336a21563A81759B8932h4997
15820a02697B31178d83496E0212a17319A26308a90251p0713D6996f7353b3077
15809I4417K9934a37088K4236D9122A0330c48820B10032L3300a75043j69701A11788
15797A42694a94082j1758I0675J88382a70029M1248l05063D79770a42953c423
15786a04824M6893a1335B97420g8784g630D0544e7110A7190a90039B26038a25985
15774d3564D2127a26730o5254K0586H6821e844B76165a24912n6299Q1089C11230
$$ plain form
15856 26218 -104082 246072 -64948 -120685 131557 -45742 -83908 209885 83068 -456709 -96053
15844 -75191 171440 -140380 87710 -124399 -79522 -109731 -59972 233404 201056 178034 -222603
15832 93522 116382 -19320 83643 -164972 -81322 -309516 3336 -121563 181759 28932 -84997
15820 -102697 231178 -483496 50212 -117319 126308 -190251 -260964 46996 -67353 -23077
15809 94417 124351 -137088 -112852 49122 10330 -348820 210032 243332 -175043 -344744 111788
15797 142694 -194082 -205840 90675 279057 -170029 -128781 -433844 479770 -142953 -3423
15786 -104824 -57931 -11335 297420 -78784 -7630 40544 -57110 17190 -190039 226038 -125985
15774 -43564 42127 -126730 -191984 -171398 86821 -5844 276165 -124912 -181211 -100122 311230
15762h7726B28722H652a74583c2377p8984l17480b00437i0658P876j10628A4809
15750I7150J44164k8891m3686a5512J991E4819a78495O1205I726b83157j71938
15739d55095a7677I720a55598A15857i570A15510f2182B3710a92687E175i494
15727h1945j09632A50418a67062H2641d5992J8418A0462J45796m2297d4409m16488
15716d60897h0472A05327a06925j49960H1858C3562b08387R187d0506H386a63537
15704C6775K27511j8296A05641J75272f969E2432e5688j22787N599J5169N7791
15693i9916C5229g3755E7957c8503j24592F1777k6843c3586j80594a04453p8161
15682a82614A39516o4121R1268H254L4543j2383k8P7849m9683J8979b957o6767
$$ plain form
15762 -87726 228722 8652 -174583 -32377 -111361 -428841 -200437 -90658 -82782 -193410 14809
15750 97150 241314 212423 168737 -15512 -13521 54819 -178495 -117290 9726 -283157 -455095
15739 -455095 -17677 9720 -155598 115857 -9570 115510 -62182 23710 -192687 5175 -9494
15727 -81945 -191577 150418 -167062 82641 -45992 -27574 10462 156258 113961 -44409 -460897
15716 -460897 -80472 105327 -106925 -256885 81858 33562 -208387 -199200 -40506 8386 -163537
15704 36775 264286 245990 105641 280913 -6969 52432 -55688 -178475 -172876 -157707 -99916
15693 -99916 35229 -73755 57957 -38503 -163095 61777 34934 -33586 -214180 -104453 -182614
15682 -182614 139516 75395 166663 8254 42797 30414 30386 108235 58552 77531 -2957 -69724
15670f9724G5752p524h870m3250j45518C63026b55808E3594a04197l267j34532
15659b41996J17689m49755b61584A31662l2572B4679b85895G4101A778a45849
15648b21260C97666g8192a3472k1958l59590h4526j54364J4895i4173L3004k36967
15637b98136I4899b07511f902j10141k58739g8677J3341n5112B3197M1564a84317
15625I9062h3805A9517a93088b0948j46233N7283j0458k7339L4005A55565K2617
15614A78182a39423N8488c2872c151B26648C3433g8903d455k63350I9040a61192
15602e4135M468p2144I0506c3851m6339H357a79688A63382N4320b96828j13069
15591d09897g762G4112N2054M1515n4864a9360A10598k9359a81433o1681M7858
$$ plain form
15670 -69724 75752 68228 -8870 -52120 -197638 363026 -255808 53594 -104197 -107464 -241996
15659 -241996 -124307 -574062 -261584 131662 99090 24679 -285895 74101 1778 -145849
15648 -221260 397666 -78192 -13472 -35430 -395020 -84526 -238890 -223995 -94173 -61169 -298136
15637 -298136 94899 -207511 -6902 -117043 -375782 -78677 -65336 -120448 23197 64761 -184317
15625 99062 -83805 19517 -193088 -20948 -167181 -109898 -120356 -147695 -113690 155565 178182
15614 178182 -139423 -80935 -32872 -3151 226648 33433 -78903 -4455 -267805 99040 -161192
15602 -54135 -49667 -121811 90506 -33851 -80190 8357 -179688 163382 217702 -296828 -409897
15591 -409897 -7762 74112 126166 167681 112817 -19360 110598 81239 -181433 -243114 -195256
15580a95256l6816B083L2554M6394a80915A26555a47362j30189A30574J37655
15570B68229b95547H7294d6978j50578c3779A07665L2897a94588E4344N8481L6300
15559A49125R5354A2048f5827o1469c7857C00822A2965J74255F1035K6768a72964
15547e1524a7192m35356B58227D7361c2645j07683J9288d6142j89540d6343E1886
15535a10498B9490c4576B15139b4546l09044e563A56938n3450g8768k33870c0910
15523A44854c01956H6147e4419A2995J7779P9683B1006G807R283J98531f9299
15511d659C53519e7975b0138A28949b27213i9163B27459B432O7508a23332N7680
15500f5652n011n1566A03738C0873K15395a63911A47578a43074m7546O1373H701
$$ plain form
15580 -195256 -232072 2083 34637 81031 -180915 126555 -147362 -277551 130574 268229
15570 268229 -295547 87294 -46978 -197556 -33779 107665 140562 -194588 54344 112825 149125
15559 149125 244479 12048 -65827 -127296 -37857 300822 12965 187220 61035 87803 -172964
15547 -51524 -17192 -452548 258227 47361 -32645 -140328 -121040 -46142 -235682 -46343 51886
15535 -110498 29490 -34576 215139 -24546 -333590 -5563 156938 103488 -78768 -312638 -30910
15523 144854 -301956 86147 -54419 12995 30774 110457 21006 7807 17090 215621 -69299
15511 -4659 353519 -57975 -20138 128949 -227213 -99163 227459 2432 69940 -123332 -65652
15500 -65652 -70663 -122229 103738 30873 246268 -163911 147578 -143074 -190620 -129247 8701
15488F9390g6137n1782I0925a17420q376F6529e4307B6270Q405a39258C44189
15476D0314h2441K2294F2432c7157q0234j61635A7954a30671f3666A28371a68243
15464A04533P9209k3443A9708a4376L507j74877A71644a7704p5622D8376b8976
15452a83533A05020a3958A5314J53483E9024c7865E77736d4522j84086H1192c19497
15440a94191B06479L2945b46545d3649A03668a22071G7788a50506D52434A768
15429B40069i9052a3231A77493a77497I8573k8917a19042j3160A42332C3803b89831
15417a02956J038B75530c54763C5693N74033b79174b4637j70237r55Q6866I4076
15405d79817C805P4694A207J42020K45033j23670o8820D7014c00930o8926A89249
$$ plain form
15488 69390 -76137 -127919 90925 -117420 -125796 66529 -54307 26270 34675 -139258 344189
15476 40314 -82441 -60147 62432 -37157 -117391 -279026 17954 -130671 -63666 128371 -168243
15464 104533 183742 160299 19708 -14376 -10869 -185746 171644 -17704 -93326 48376 -28976
15452 -183533 105020 -13958 15314 168797 59024 -37865 577736 -44522 -228608 81192 -319497
15440 -194191 206479 239424 -246545 -43649 103668 -122071 77788 -150506 452434 1768
15429 240069 -99052 -13231 177493 -177497 98573 69656 -119042 -132202 142332 33803 -289831
15417 -102956 -101918 275530 -354763 35693 609726 -279174 -24637 -194874 -195829 -108963 94076
15405 -479817 3805 78499 1207 143227 388260 264590 195770 47014 -300930 -369856 189249
15393b2115k31798O5830A43955K199L19486j19133b9229E8271J39157a87688N2601
15382a35087p8574B06418H6180c36187b1993D95410A63491B3803J49088L7182
15372B10073C0917K8385i7708n832c819A97429f399j1633C066J94325a7737l32115
15360c49852J49636b6612E6789c17151D5402a60902j47065g8590B57343a91261
15349G936d13549b7301j53670A551a54172A66700c50930B77891r1907C9368A7085
15337G4044Q6940D6389N966J66383J24911A34181r113a81524g8674B131a4526
15325C08571B7587J52961c0845A41690a06346H3807K32208a50543A84582o3140
15315A21442J3335J2847J30790i9347A46722d320p1919H2627O616B60g9118A34722
$$ plain form
15393 -22115 -253913 -188083 143955 146154 465640 346507 -29229 58271 197428 -187688 -135087
15382 -135087 -213661 206418 86180 -336187 -21993 495410 163491 23803 172891 210073
15372 210073 30917 59302 -97708 -103540 -3819 197429 -6399 -18032 3066 197391 -17737 -349852
15360 -349852 -200216 -26612 56789 -317151 45402 -160902 -307967 -78590 257343 -191261
15349 7936 -413549 -27301 -180971 1551 -154172 166700 -350930 277891 185984 39368 17085
15337 74044 160984 46389 52355 218738 343649 134181 125068 -181524 -78674 2131 -14526
15325 308571 27587 180548 -30845 141690 -106346 83807 316015 -150543 184582 121442
15315 121442 134777 147624 278414 -99347 146722 -4320 -76239 82627 89243 260 -79118 134722
15302c5689j53753J9860K490A97616G5590Q5716b0369A19108a52490c5798A38281
15290c6414j28678A1886m87K28511c12312I1590K96361a83198A13263g8060B81577
15278a86695C86028a10790B79106A00405b1315A1196e0754L666H5417j0543b83336
15266A84799d9961A24017J48476c2794H5875a55866q543C80094A09578E201g5415
15254b17021I575J99713a2098A18783J31182N29034C80442M30828J643742m97009
15244A958003k4660N56624A215760E68763b7939D6689c53686b3768A86253I00
15233c5370B72679B0642a8619m80565A16722K51200D7170J55385h4002A30810
15222b38989i3652H3245j2385g6940b9119H8493J20515d079A46029A2625J48444
$$ plain form
15302 -35689 -189442 -169582 -167092 197616 75590 161306 -20369 119108 -152490 -35798 138281
15290 -36414 -165092 11886 11399 239910 -312312 91590 387951 -183198 113263 -78060 281577
15278 -186695 386028 -110790 279106 100405 -21315 11196 -50754 -47088 85417 74874 -283336
15266 184799 -49961 124017 272493 -32794 85875 -155866 -164409 380094 109578 5201 -75415
15254 -217021 9575 209288 -12098 118783 249965 778999 380442 811270 2455012 1958003
15244 1958003 1933343 2489967 1215760 568763 -27939 46689 -353686 -23768 186253 900
15233 -35370 272679 20642 -18619 -499184 116722 367922 47170 202555 -84002 130810
15222 -238989 -93652 83245 70860 -76940 -29119 88493 209008 -4079 146029 12625 161069
15211A61069J96964J14185B09149e4004A28347a3979m0877j0996D02090G4650
15200D7773g1829E0467g9477B70495j09037n7042C176J46043L3606J70817j09936
15189B43706E5601K7018J14454C3425Q9969a83698B23920L7526I2122O2901b56662
15177b17818C16029B9813b8043B7275b38363A98898J34566h3002m5234A87549
15166a20734A25312a0088k47816i8A8982K9348a08223J6764E12504B44621b4493
15154A84258H2008k0305h7261r815H1383b0896A48055B4662J39432l7487a62778
15142A07443c7935G3205i8915A63870Q81b30637O3756A4107c4121C59131o9431
15131B89700j27602K07474A48547k473f1251C6211N041L6617h92j71420D54879
$$ plain form
15211 161069 358033 472218 209149 -54004 128347 -13979 -54856 -65852 402090 74650
15200 47773 -71829 50467 -79477 270495 161458 104416 3176 149219 182825 353642 243706
15189 243706 55601 82619 197073 33425 123394 -183698 223920 261446 92122 155023 -256662
15177 -217818 316029 29813 -28043 27275 -238363 198898 333464 -83002 -128236 187549
15166 -120734 125312 -10088 -257904 -98 18982 48330 -108223 -91459 512504 244621 -24493
15154 184258 82008 61703 -87261 -97076 81383 -20896 148055 24662 164094 126607 -162778
15142 107443 -37935 73205 -98915 163870 164751 -230637 -166881 14107 -34121 359131 289700
15131 289700 162098 369572 148547 146074 -61251 36211 41252 77869 -892 -172312 454879
15119a8241A90593n6036J65346J34407A38395a6210q3231L5905l6315A90054J9152
15108B09206l9015O3458I9494O1194a430C1711c7422D10305A53783a02756C32984
15096e2736B55361o5463J84917j82651q2270Q9212d8270A87556d0858C50106H0535
15084A55383K67243A94490E462g7203i119A19603J80006j05988P8236j16647m5420
15073A09790J76157a18076E0541c872A61977n7511k0240L12747j28094e6297A26326
15061A55195Q5490J61019a39017a2176B66239j6151B8183L59624J05457e5570
15050A15573O0124a08199B5985J43781G1806L60415D5930A9701R8127O1781J32706
15039C12315j02088N9170H1693J12527a14217C26807J28136a33002B70036J2924
$$ plain form
15119 -18241 190593 134557 299903 434310 138395 -16210 -99441 -63536 -99851 190054 209206
15108 209206 170191 233649 99494 160688 -1430 31711 -37422 410305 153783 -102756 332984
15096 -52736 255361 189898 374815 192164 109894 199106 -48270 187556 -40858 350106 80535
15084 155383 422626 194490 5462 -77203 -9119 119603 299609 193621 271857 155210 109790
15073 109790 285947 -118076 50541 -3872 161977 104466 84226 396973 268879 -56297 126326
15061 155195 240685 401704 -139017 -12176 266239 250088 28183 387807 493264 -55570
15050 115573 175697 -108199 25985 169766 71806 432221 45930 19701 117828 179609 312315
15039 312315 210227 269397 81693 194220 -114217 326807 454943 -133002 270036 282960
15029B82960a49779E2990a7972B01241J96567C0353K66958A08763O5624J3937
15019A88324R2866m1216K52355k14154n1147a6230A20583J75589p0612K2335I0182
15007I7697L65015k21848J44452A5254J71541n4272b72014A10660L41010A3069
14996D34496d2094B4183J75388j2691M93345C11501N1578B5068K00633n8609K44169
14985D11261A17390M4845M4730P8235j15181a44956B62050K01119A75995E6868
14974A7381M9111J64001L6369d8979C75624j82638N5571L8349I4252M49231j17279
14963D26204j71475m7047L17143A49413G1496J86247c5060C62882j57551M55582
14953F60913C7944L90460r8585p8808J99468j64073H3692J44876J81527m596j75239
$$ plain form
15029 282960 -149779 52990 -17972 201241 397808 30353 297311 108763 174387 188324
15019 188324 281190 239974 492329 278175 227028 -16230 120583 296172 225560 247895 90182
15007 97697 462712 240864 385316 15254 186795 132523 -272014 110660 451670 13069
14996 434496 -42094 24183 199571 186880 680225 311501 363079 25068 225701 167092 411261
14985 411261 117390 162235 206965 285200 170019 -144956 262050 463169 175995 56868
14974 17381 66492 230493 266862 -48979 375624 192986 248557 286906 94252 543483 426204
14963 426204 254729 207682 524825 149413 71496 257743 -35060 362882 205331 660913
14953 660913 37944 428404 329819 251011 450479 286406 83692 228568 410095 405499 230260
14942B30260l0509M40864l04904A26402J35603R3015k6083j21531k6563J25787
14932C06630A11672L80771f2195D40704i2017C61368q9405l0298K93087Q7859
14922F22611k0545d6728J7065D52463B03406J34195j59868K23056J69187p5522
14912D94454j49235D2851J35846J92096j44451I1264J65774I9615K32367m3235
14902B88747j00482G281M42365C0130L13031A69946M08420K26145C08371j32878
14892A75493J73806J3805K06112B20519K64996j0586j08981j26857R1894h800
14881F07033I3655L56003N9250H6017K76507j6906J43331j90359L58801k18194
14871D39197q8615O620L20540C10460Q382b7601A96743J34818k3438K40068j94945
$$ plain form
14942 230260 199751 640615 335711 126402 262005 355020 328937 207406 180843 306630
14932 306630 111672 492443 -62195 440704 -92017 361368 271963 241665 534752 622611
14922 622611 602066 -46728 -29663 452463 203406 337601 177733 400789 569976 494454
14912 494454 345219 42851 178697 370793 226342 91264 257038 99615 331982 288747
14902 288747 188265 7281 449646 30130 343161 169946 578366 804511 308371 175493
14892 175493 349299 363104 569216 220519 485515 474929 365948 239091 330985 -8800
14881 607033 93655 449658 508908 86017 362524 345618 488949 298590 657391 439197
14871 439197 350582 357202 677742 310460 318842 -27601 196743 331561 308123 548191 353246
14860C53246J52468j33665A75686J95734J00405k23923L99331k85419p1688L37002
14850F27128k96251J02028j7792j51176R8067j70778K90862j07838O7577R61j68727
14839B74061Q4692P3694J23266j31696K98784l2034j87044J03615p8982p5243
14829D53113L18749k14244k3725N8949j39879j03444L68168J09461k30707K0211
14819F16652q2177J6638K66367A76162K61443m9646A69723L64399j40414j16701
14809B77007J40608j4727J51344j33147K66689m6938q0265k57872L03512B81847
14798E45896j31471j8769J70548j67432K75568j05617P3792B99586J86550l6654
14788D49482K331O2734j47898K01875B30510M38996B89234K77016K80333l19583
$$ plain form
14860 353246 505714 372049 175686 371420 471825 247902 647233 361814 290126 627128
14850 627128 330877 432905 415113 263937 362004 191226 482088 374250 441827 442788 274061
14839 274061 358753 432447 555713 424017 722801 690767 503723 607338 528356 453113
14829 453113 771862 557618 533893 592842 452963 349519 717687 827148 596441 616652
14819 616652 534475 551113 817480 176162 437605 387959 169723 534122 393708 277007
14809 277007 417615 402888 554232 421085 687774 640836 560571 302699 606211 281847
14798 545896 414425 395656 566204 398772 674340 568723 642515 299586 486136 449482
14788 449482 451813 514547 366649 568524 230510 669506 289234 566250 846583 527000
14778E27000O1361J20771q1202j51309j26793K24974K44589o8640B15426J78076
14768C93502J54151J0162j75766M0963K31806k71635K64330J23789l00827R4864
14758E65339j39114K80449j49745K62544k71946q2284L42099j32590M1985J19226
14748H35963r9381k50161M4695m8276k12733N96021p4105j77798J24947J63623
14738I02795j02713k55961K4463J19920J58387k21766J19282j12866j7641j24486
14728D89414r0259M39106J13049k64596J36416N7984J12084l0248l75363J14051
14718G01638p8700L26083J4760j34790j25503m1526j16586m3792J32712L7293
14708F71589P5942J05932J97559j67015l47883M25487p4496k40407L00682m6742
$$ plain form
14778 527000 588361 709132 627930 476621 349828 574802 819391 750751 215426 393502
14768 393502 547653 557815 382049 423012 654818 383183 647513 771302 470475 565339
14758 565339 426225 706674 556929 819473 547527 465243 807342 674752 716737 835963
14748 835963 736582 486421 531116 482840 270107 866128 792023 614225 739172 902795
14738 902795 800082 544121 568584 688504 846891 625125 744407 631541 613900 489414
14728 489414 399155 838261 951310 686714 823130 881114 993198 962950 587587 701638
14718 701638 622938 949021 963781 828991 703488 661962 545376 501584 634296 671589
14708 671589 747531 853463 1051022 884007 536124 961611 887115 646708 947390 900648
14698I00648k7735l2737Q9909L30789l75580L3056K51680l92831J2498K55997
14688A045694r6822j29897Q9246j15825J04388N6370n7762o2166J15472J30067
14678A078765o018R5041k33969J21071j2814j25079k09736L59785j51987j39886
14668G75173K08094J41936k71663J44653L41523j66295l29270J69103M34585n6368
14658A391471m78945K75781j2367m0652r8730j53774M84816n81079M72039j64569
14648A093991o7809J14053j17706K92142Q427l77177P9115j96926K46818p2633
14638A002295r2069K32473j95369O25229o9258l15190N2686l33362N34632l11759
14628A130308J13993J31639l76130K56188p617M11268n3600k87943J13197l8802
$$ plain form
14698 900648 872913 840176 930085 1260874 885294 918350 1170030 777199 789697 1045694
14688 1045694 948872 818975 908221 792396 896784 953154 895392 833226 948698 1078765
14678 1078765 1072747 1167788 933819 1054890 1042076 916997 707261 1067046 915059 775173
14668 775173 983267 1125203 853540 998193 1339716 1173421 844151 1013254 1447839 1391471
14658 1391471 912526 1188307 1175940 1135288 1036558 882784 1367600 786521 1258560 1093991
14648 1093991 1026182 1140235 1022529 1314671 1323098 945921 1025036 828110 1074928 1002295
14638 1002295 910226 1142699 947330 1572559 1503301 1188111 1240797 907435 1442067 1130308
14628 1130308 1244301 1375940 999810 1255998 1248381 1659649 1606049 1318106 1431303 1392501
14618A392501k00949M57146l65998M04759l38755J37805M4552J41379r3416j76761
14608A402263J30917k8123l82210J72889M37734k68168J34553J73784k83893K00545
14598A690291J19497M8578o1240J7637m3005o7968P8392k78055K46215R3777L23678
14587B167797n07532r3910K57223K76149n36777J58957k68426M98771Q6988J73697
14577B212937j52618k63137M44412j11088N6436l3455l80101L97736L05345j71987
14567B304480j446j24530J09592o2096K7516J36806P1635L16880k20988Q98J54323
14556B713070M81293M09231k84839K98583K61994N95884R36624K412459M079462
14547A1903761R209061J7482363M208313A9748574I022093j597571J22094C548119
$$ plain form
14618 1392501 1191552 1648698 1282700 1687459 1348704 1486509 1531061 1672440 1579024 1402263
14608 1402263 1533180 1505057 1122847 1295736 1733470 1465302 1599855 1773639 1489746 1690291
14598 1690291 1809788 1858366 1797126 1814763 1771758 1703790 1782182 1504127 1750342 1844119 2167797
14587 2167797 1660265 1566355 1823578 2099727 1562950 1721907 1453481 1952252 2039240 2212937
14577 2212937 2060319 1797182 2241594 2130506 2186942 2153487 1773386 2171122 2476467 2304480
14567 2304480 2303034 2178504 2288096 2226000 2253516 2390322 2461957 2778837 2557849 2558747 2713070
14556 2713070 3194363 3603594 3318755 3617338 3879332 4475216 5411840 7824299 11903761
14547 11903761 21112822 38595185 42803498 19748574 9022093 7424522 7546616 3548119
14538B070147j98151J0043q2445J57698p2155q612R2413L88134m79228K79812
14528B157656P9127Q933r411J79620N6889n25245K85825N8242K83749J07864l73610
14517B309639J82401k6207l56398N44831j63894L58516k76484l1704K79581O2274
14507B882555Q8560j97384M6882J47312l63642L44237l09983N00401j08629m8669
14497B981640M22N0487O9929k35411K00280k0146M43800O732j68277N676R1156
14486C426288R3240k90971K29676K97120k10494J76077k64830L29424j40352K50950
14476C896128j4085j68007K52054P49N1672M7079k04317O41106n86607L32153
14466D247925K7893O7560M1516j674K26761M5168l28419M94902p51752N43914
$$ plain form
14538 2070147 1871996 1882039 1799594 1957292 1885137 1876525 1968938 2357072 1877844 2157656
14528 2157656 2236783 2245716 2236305 2415925 2472814 1947569 2233394 2291636 2575385 2683249 2309639
14517 2309639 2492040 2465833 2109435 2654266 2490372 2848888 2572404 2540700 2820281 2882555
14507 2882555 2971115 2773731 2820613 2967925 2604283 2948520 2638537 3138938 3030309 2981640
14497 2981640 2982062 3032549 3102478 2867067 3067347 3047201 3491001 3497733 3329456 3335132 3426288
14486 3426288 3519528 3228557 3458233 3755353 3544859 3720936 3456106 3785530 3645178 3896128
14476 3896128 3882043 3714036 3966090 3966839 4018511 4065590 3861273 4502379 3915772 4247925
14466 4247925 4275818 4343378 4384894 4383220 4609981 4655149 4326730 4821632 4069880 4613794
14456D613794K04820r4874J18852L34018l94066K31306K66073K470J57440j38121
14446E301712K3576m3044L01541k4515Q6421J99720J82721m10916L66019K65186
14436F248421k05526K44036o4029k27689N27519j54612J31570j31956K12383K13739
14426F793856M8821n8209K63935N36682l10666R2030K16931j4552L22891J4846
14416G906565J70310j93364N73920k28461L60018K20534N5461l3631K61736K24754
14406I317842k34404K8799N55151J12797N510l0562N12268J6545L94924J43432
14396A0822302J01827J11355j08645K25835L94218J15966N390J06673N87326M41886
14386A2804133K32096l78843M50438L10266M13265K39547L66488M2350J14497
$$ plain form
14456 4613794 4818614 4723740 4842592 5176610 4782544 5013850 5279923 5282393 5439833 5301712
14446 5301712 5325288 5282244 5583785 5559270 5645691 5845411 6028132 5617216 5983235 6248421
14436 6248421 6042895 6286931 6222902 5995213 6522732 6368120 6499690 6367734 6580117 6793856
14426 6793856 6842677 6784468 7048403 7585085 7274419 7366449 7583380 7568828 7891719 7906565
14416 7906565 8076875 7883511 8457431 8228970 8588988 8809522 8864983 8831352 9093088 9317842
14406 9317842 9083438 9112237 9667388 9780185 9785695 9755133 10267401 10283946 10678870 10822302
14396 10822302 10924129 11035484 10926839 11152674 11546892 11662858 11668248 11774921 12362247 12804133
14386 12804133 13036229 12657386 13107824 13418090 13831355 14070902 14437390 14479740 14594237
14377A4594237J78382K36262O26857K22803J23070L19729L31662K45104M95863
14368A7373969L77628N40018K36780L32287K36798O52400L66544M83140P30342
14359B1329906L19857K86895L17729N73517P46652p3153J301624K56802P62275
14350B5822104O94862N90476P88406O97813O31264R98950M55542P79710J240335
14341C2699462Q89258O88053R52132J058618J211622Q55685P47872J445302J505909
14332D2053913J329465J227422J233057J390350J255524J923664J723921J886399
14324E4023715J739673J864886K384599K254783K036872K368621K043690L083654
14316G1800493K425311K724772L331101K892038M110892L252486L922643M172201
$$ plain form
14377 14594237 14772619 15008881 15635738 15858541 15981611 16301340 16633002 16878106 17373969
14368 17373969 17751597 18291615 18528395 18860682 19097480 19749880 20116424 20599564 21329906
14359 21329906 21649763 21936658 22254387 22827904 23574556 23501403 24803027 25059829 25822104
14350 25822104 26516966 27107442 27895848 28593661 29224925 30223875 30679417 31459127 32699462
14341 32699462 33588720 34276773 35228905 36287523 37499145 38354830 39102702 40548004 42053913
14332 42053913 43383378 44610800 45843857 47234207 48489731 50413395 52137316 54023715
14324 54023715 55763388 57628274 60012873 62267656 64304528 66673149 68716839 71800493
14316 71800493 74225804 76950576 80281677 83173715 87284607 90537093 94459736 98631937
14308I8631937M217440M423030M847669N460542N361581N909074O331181O552318
14300A41734772O663199P514739P965004Q422755R010833R031161J0354787J0552244
14292B11249494J1568222J1538560J2645213J3264279J3643661J4549656J4900559
14285C03359644J5418709J5907509J6132955J5941863J6629086J5438318J5413845
14278D14241929J4600766J3124761J1851146R904952P157934L518753m06094j815672
14270D72178475j751520k360502m621598o479175q473891j1489852j3588253j4585365
14262D08828319j5986834j6515089j6573030j6502455j6685091j6070167j5748828
14255B94746825j4935659j4755031j3561722j1385870j2364969j1897694j1192416
$$ plain form
14308 98631937 102849377 107272407 112120076 117580618 122942199 128851273 135182454 141734772
14300 141734772 148397971 155912710 163877714 172300469 181311302 190342463 200697250 211249494
14292 211249494 222817716 234356276 247001489 260265768 273909429 288459085 303359644
14285 303359644 318778353 334685862 350818817 366760680 383389766 398828084 414241929
14278 414241929 428842695 441967456 453818602 463723554 470881488 474400241 473994147 472178475
14270 472178475 470426955 468066453 463444855 456965680 448491789 437001937 423413684 408828319
14262 408828319 392841485 376326396 359753366 343250911 326565820 310495653 294746825
14255 294746825 279811166 265056135 251494413 240108543 227743574 215845880 204653464
14248B04653464j0437067j0052986r565240q114559p745469p725181p419651o906704
14240A36686607o440520n592525n581971n052975n066750m944919m605293m095026
14232I5306628l807970l063662l833452l141029l723921k720057k798848k859344
14224F9358345k514636k608023k217520j988862j868591k067710j797342j663443
14216E2632218k119013j517795j248281j169230j745879j430476j179742j161392
14208D1060410j176880o87640j034433j097015j539137o89555q86353p64191r51252
14199C2233954p65414j117879j002294k97617p74418n13294p53486q37852q57815
14190B5313885l25563o12095p27712o04705j74619q36905n46517k28611o51310
$$ plain form
14248 204653464 194216397 184163411 174598171 166483612 158738143 151012962 143593311 136686607
14240 136686607 130246087 124653562 119071591 114018616 108951866 104006947 99401654 95306628
14232 95306628 91498658 88434996 84601544 81460515 77736594 75016537 72217689 69358345
14224 69358345 66843709 64235686 62018166 60029304 58160713 56093003 54295661 52632218
14216 52632218 50513205 48995410 47747129 46577899 44832020 43401544 42221802 41060410
14208 41060410 39883530 39195890 38161457 37064442 35525305 34835750 33949397 33185206 32233954
14199 32233954 31468540 30350661 29348367 29050750 28276332 27763038 27009552 26171700 25313885
14190 25313885 24988322 24376227 23648515 23043810 22869191 22032286 21485769 21257158 20605848
14181B0605848m86696n19633j25802p68763K11653q18139k21359k98812l16207
14172A7262090m99413r8350o92463l231l41447k70216n32726m02915q7812Q2216
14162A4415733k01492m04668o78239j27793L6168j05225n69530j76717q2634k29899
14152A1875704l70003J68777k99446J02055n31973l65403j12210K15763k81650
14143A0401614j60918j90201k90726L3426l11363j16949n40968J27299N5757l86462
14133H620509L63237n84450O6089o3959q7895n96425J40714L01724j67910j72013
14123G819621m46858j53345J21742n7461l25529J33951R6872l10116k27029R0454
14113F742302k65133J32819j62456J67326l08563j90480K33569l68891J13226
$$ plain form
14181 20605848 20119152 19599519 19473717 18704954 18916607 18098468 17877109 17578297 17262090
14172 17262090 16762677 16664327 15971864 15968633 15627186 15356970 14824244 14421329 14333517 14415733
14162 14415733 14214241 13809573 13131334 13003541 13039709 12934484 12364954 12188237 12105603 11875704
14152 11875704 11505701 11674478 11375032 11477087 10945114 10579711 10467501 10683264 10401614
14143 10401614 10240696 10050495 9759769 9793195 9481832 9364883 8823915 8951214 9006971 8620509
14133 8620509 8983746 8399296 8465385 8401426 8313531 7717106 7857820 8159544 7991634 7819621
14123 7819621 7372763 7219418 7341160 7283699 6958170 7092121 7188993 6878877 6651848 6742302
14113 6742302 6477169 6609988 6447532 6614858 6306295 6115815 6349384 5980493 6093719
14104F093719j61287k3833P1325l17538l1605K8781j10657m3035k15100J77698
14094E468468q9349l31467m2121L999j19886K66905k73867j26709P6569J56041
14084D988583j14251j30547k7431r9235l3052l42279J53938j4258r9519k12400
14074D069549L79180J42485m55586P9746j78112j67833K53776k74366K09772J98758
14064D257369m26564n189j11880Q4879R8345k17520R1726m41208K98314j30553
14054C497719K41055k12977Q3089k12510K7875l02042L3675K53774l38573L32760
14044C403845o18437K51722k71186Q9175K15460j28573j37970M16813l69747j7194
14034B833908K23403k48450N8289k42378L44826k16035n6745k31387K49072J91257
$$ plain form
14104 6093719 5932432 5908599 5979924 5662386 5630781 5659562 5548905 5505870 5290770 5468468
14094 5468468 5379119 5047652 5005531 5009530 4889644 5156549 4882682 4755973 4832542 4988583
14084 4988583 4874332 4743785 4716354 4617119 4584067 4241788 4395726 4381468 4281949 4069549
14074 4069549 4448729 4591214 4135628 4215374 4037262 3869429 4123205 3848839 4058611 4257369
14064 4257369 3830805 3825616 3713736 3798615 3896960 3679440 3771166 3329958 3628272 3497719
14054 3497719 3738774 3525797 3608886 3396376 3424251 3122209 3155884 3409658 3071085 3403845
14044 3403845 2785408 3037130 2765944 2855119 3070579 2942006 2804036 3220849 2851102 2833908
14034 2833908 3057311 2808861 2867150 2624772 2969598 2753563 2696818 2465431 2714503 2905760
14024B905760j91016J44747k06488o5470K17457m90109o8964L47573l29610M23336
14014B687216l00458P9348j48429l800m832j45776K08836n5135J32476j42795
14004B306651m12252q3306K30233j44271O4892L5942O9727j34409J44756j07633
13994A970330L3924M38277j22023o4112M03686R86953L072525P915191J7906599
13985C2541350J1711207j9073587j2545259n039832k100851j221290p19173j60265
13977C392300j92063j02319l61031m6310j50506L6877j90779M668J47055k63585
13967B274307j14498k43922K32807P8154o5270p5886j61284K6992o9422K31231
13957B113209q7649k06974K03644M5802l87028L8031K80059j23475M4974j17836
$$ plain form
14024 2905760 2714744 2859491 2653003 2587533 2804990 2314881 2245917 2593490 2263880 2687216
14014 2687216 2386758 2466106 2317677 2313877 2309045 2163269 2372105 2316970 2449446 2306651
14004 2306651 1894399 1811093 2041326 1897055 1961947 1997889 2067616 1933207 2077963 1970330
13994 1970330 2004254 2442531 2320508 2256396 2660082 3647035 6719560 14634751 32541350
13985 32541350 44252557 25178970 12633711 7593879 5493028 4271738 3552565 3392300
13977 3392300 3200237 3097918 2736887 2690577 2540071 2576948 2386169 2390837 2537892 2274307
13967 2274307 2159809 1915887 2148694 2226848 2161578 2085692 1924408 1951400 1881978 2113209
13957 2113209 2025560 1818586 2022230 2068032 1681004 1719035 1999094 1875619 1920593 1802757
13947A802757j29430K13112j63150q4969K00873o7207j75135J06219P6406p0443
13937A709033j145m2962m93153K46841N40035k72440o5850K0479k45367p7936
13927A317535J0768O8149k52903J21670J85930k13455k80311P29096k14290o7268
13917A404921K22640j65051k75295J08107k43107N29553j60900k84571L86669
13908A522966m80747K03945j30889L08604m51568j27129M51783k886n5634o5161
13898A173284L729j67273L12932j83486J66709K21990j95157j46346K32568j24201
13888A294749j63300L5224J64147j15039P3499k25474K64521k28608K6757m3964
13878A082512L94748l01718k42551L10338k42012M3951q6175J7929j5965m5654
$$ plain form
13947 1802757 1673327 1886439 1723289 1638320 1839193 1771986 1596851 1703070 1779476 1709033
13937 1709033 1707888 1664926 1171773 1418614 1958649 1686209 1620359 1640838 1395471 1317535
13927 1317535 1328303 1396452 1143549 1265219 1451149 1237694 957383 1686479 1472189 1404921
13917 1404921 1627561 1462510 1187215 1295322 1052215 1581768 1420868 1136297 1522966
13908 1522966 1042219 1246164 1115275 1423879 972311 845182 1296965 1294079 1238445 1173284
13898 1173284 1177013 1009740 1322672 1139186 1305895 1527885 1332728 1186382 1418950 1294749
13888 1294749 1131449 1166673 1330820 1215781 1289280 1063806 1328327 1099719 1126476 1082512
13878 1082512 1477260 1175542 932991 1243329 1001317 1045268 959093 977022 961057 915403
13868I15403L33969l50258J82852j93629M0978j75639K50827M6876J0457r8888
13858I62948j87076J96580l0198K18835j45582k38616M6252P0417J03188K31190
13848A227938k27550k31489j88257M10547J92866l68942K46003k06575J93795
13839A048336r1337k1661p8462j06204N7106J24307P2464k19767M1538j96658
13829F29662J3963K30686J56363C88505L20658L18959N4646j98092J14996N1870
13819A051542M1918k48222Q1999k52991L23721l32126j06354J32417J08572l5211
13809G65265r9786J43889B65470P04265k18653m7746R1876r6979J20364k67636
13799E50961Q3582L82376l22453M2338B65161L43520J77067j19011J25243j30863
$$ plain form
13868 915403 1249372 899114 1081966 888337 929315 753676 1004503 1051379 1061836 962948
13858 962948 775872 972452 942254 1161089 1015507 776891 823143 893560 996748 1227938
13848 1227938 1000388 768899 580642 991189 1184055 815113 1061116 854541 1048336
13839 1048336 956999 935338 856876 750672 807778 932085 1004549 784782 826320 629662
13829 629662 643625 874311 1030674 388505 709163 1028122 1082768 884676 999672 1051542
13819 1051542 1093460 845238 927237 674246 997967 665841 559487 691904 800476 765265
13809 765265 665479 809368 265470 969735 751082 703336 795212 698233 818597 550961
13799 550961 634543 1016919 694466 736804 265161 608681 785748 666737 791980 661117
13789F61117M21291E01065R8623J77247j45840K02701o3028k19913J76880L9277
13779G67012k58058Q2917J99958j21030n2811M7977p4305M20520k80356q1740
13769F50084R6020k16748k0660J64998K08783j9251k10095m1423K82500m11949
13759D82259K09459N911J01001B67694K24672K8384j12657o6310R246J88570J72997
13748G12596l4467j54553L69399j64740l8227C38737M60267j9650C39311L78713
13738G18024C42094K70018J56438k56933k08794J96274k00480J26892m0169N1228
13728D36568j92649K76630j0415J08706B85630K39347o7192J65072p1428J11911
13718F63340B73133K97479l6773k32767L18297A65049K79265L30662l60283K00733
$$ plain form
13789 661117 1082408 501065 599688 776935 631095 833796 770768 550855 727735 767012
13779 767012 508954 591871 791829 670799 617988 665965 591660 1012180 731824 650084
13769 650084 746104 529356 508696 673694 882477 863226 653131 611708 894208 482259
13759 482259 691718 697629 798630 267694 492366 520750 408093 341783 351029 539599 712596
13748 712596 678129 523576 892975 728235 690008 338737 799004 779354 339311 718024
13738 718024 342094 612112 768550 511617 302823 499097 298617 425509 385340 436568
13728 436568 243919 520549 510134 618840 285630 524977 457785 622857 551429 663340
13718 663340 273133 570612 533839 301072 619369 165049 444314 774976 414693 615426
13708F15426J86l6709J48953k75743n7062J14816j42141J03508Q5863L1936k36302
13697C52731J34127J1654L18144A51247K19407l7735j25193M66662A87914K67332
13687D55246J0463p405k5858j27433K69989p5073j35549r6435L33293K17421l53478
13676D65181J98132L5095B76378Q4588J46825j94190K22449I0799M52392k35010
13666C08181K35741o4387L29405C73024K22691M390j03236K35040l52981L61715
13656G40643C33502J07919J27052A94826J09992n0257o7501K77348r4014I3656
13645E47684o5167j0353A11499K22001J37934D4514M71719M3438A08155J31400
13635B39555J60865K23691A89429L19090B02755J78708Q1970j94386n7208K62464
$$ plain form
13708 615426 615612 578903 727856 452113 395051 509867 367726 471234 557097 589033 352731
13697 352731 486858 498512 816656 151247 370654 332919 207726 674388 187914 455246
13687 455246 465709 458304 432446 305013 575002 499929 364380 267945 601238 818659 465181
13676 465181 663313 698408 276378 360966 507791 313601 536050 90799 543191 308181
13666 308181 543922 479535 808940 373024 595715 600105 496869 731909 378928 740643
13656 740643 333502 441421 568473 194826 304818 254561 187060 464408 370394 93656
13645 547684 482517 472164 111499 333500 471434 44514 516233 559671 108155 239555
13635 239555 400420 624111 189429 508519 202755 381463 463433 269047 211839 474303
13625D74303k04938J67696K67292C06608L0927L20633B31615r4207J66704J03441
13615D07553n9146R2583B17722J55730J54859r4280N5386J10394B96489J70686
13605D67175o5768A5831O13435E8579d5044E16600n5050A72430J41398K48240
13595E62068j43495j98393L7406K06052j37129l6675j11365C754L48033L1574
13585C83361A49524J80989j38191J61340A45760K6487J65113q5775M6106L64678
13575F62369o1570k95435J19835L7080O5268J4423E8616M50340K6494A72149j1009
13564A61140J87183M9916A49197N4375K7964D6574J43946O6912Q8655n9155R6757
13553C83689j67004J51362o1637n0612r8757J8559J74900b21530E27847k13491
$$ plain form
13625 474303 269365 437061 704353 306608 337535 658168 231615 137408 304112 407553
13615 407553 348407 440990 217722 373452 528311 434031 489417 599811 296489 467175
13605 467175 401407 15831 629266 58579 -45044 516600 461550 172430 313828 562068
13595 562068 418573 220180 257586 463638 326509 289834 178469 3754 351787 383361
13585 383361 149524 330513 192322 353662 145760 172247 337360 251585 297691 662369
13575 662369 600799 305364 425199 462279 527547 541970 58616 508956 535450 172149 161140
13564 161140 348323 398239 149197 203572 231536 46574 190520 257432 346087 286932 383689
13553 383689 216685 368047 306410 255798 157041 175600 350500 -221530 527847 314356
13543C14356N8187j62592J36980c0458B93079k9335k2676J24897B9274K66568
13533B95842F5628J99988m5276K86280j60174c41n790F4237J83014o9477K2396
13522B00170L5236K85778n5908b1366A71864C1912J65446K55069j02254A53388
13511B99304M9605M5658A22295L52125B12338E6430L64104j9244f711C68032A64060
13499A82950K13032A14067a9633B61049C6159L38925A15920K81993a14799D39869
13488B89613r024J14896r7186R1301o7904j11535N16423l31689d0040E5865c010
13476a06222C45760j70520Q9776M3511A45399A6706K2802j1857L79003o6945N970
13465C45679L9858f9202C74387k0533j1420j70791j4093a21379A27147K5355E0997
$$ plain form
13543 314356 372543 209951 346931 -30458 293079 263744 241068 365965 29274 295842
13533 295842 65628 265616 220340 506620 346446 -341 -6131 64237 247251 177774 200170
13522 200170 235406 521184 465276 -21366 171864 31912 197358 452427 350173 153388
13511 299304 348909 394567 122295 474420 212338 56430 420534 401290 -6711 368032 164060
13499 182950 395982 114067 -19633 261049 36159 375084 115920 397913 -114799 439869
13488 289613 280589 395485 298299 389600 321696 210161 726584 394895 -40040 55865 -3010
13476 -106222 345760 175240 265016 308527 145399 16706 39508 27651 406654 339709 345679
13465 345679 385537 -69202 374387 353854 342434 171643 157550 -121379 127147 152502 50997
13453C2061L976J04876K02922J87028A75040c84739C46601m5328j36948J98945
13443C63270A39501e7674H2406l3728J67812L63317B83924A33077L12320n919
13433D39478B14262R1827p4493n6015H4735J17805J3453q783J32136K44670B14942
13421A84466E6194F643K7725L67179j04536o8757Q4354j28282J1662B5049N69879
13410E94928B37494F5545B416K60206J47290j5872f4868C27176q8274J08441r0915
13399B56428C5523L30570b9169H0824B2570K03942Q1460Q4990I2089d1162D27824
13387G7378O578J59543P1123A07485R9411Q8600D8882R8652P3002L00183A60949
13375A97256J17839H7622O5548J33410B0959K78724c0118j92489A61196B4748
$$ plain form
13453 32061 36037 140913 343835 530863 175040 -384739 346601 301273 164325 363270
13443 363270 139501 -57674 82406 48678 216490 579807 283924 133077 445397 439478
13433 439478 214262 306089 231596 175581 84735 202540 215993 207210 339346 584016 214942
13421 184466 56194 6643 34368 401547 297011 228254 312608 184326 195988 25049 594928
13410 594928 237494 65545 2416 262622 409912 394040 -64868 327176 238902 347343 256428
13399 256428 35523 366093 -29169 80824 22570 226512 307972 392962 92089 -41162 427824
13387 77378 83956 243499 314622 107485 206896 295496 48882 147534 220536 520719 160949
13375 197256 315095 87622 153170 286580 20959 299683 -30118 -222607 161196 24748
13364A08147k0030K72682a94352f6300p7650N3527C12387F4940b33906A55135
13353B09610J6422D8208K19917g9286I7370k5167J80638J86601j0176d5613J6673
13342b8940A15828d3753A73187L9420H1159a52871b9328I6198M46009r7087A3196
13330e93p6906F59032E0710J89296K1608g5471G6457L18197A42548L3491K89860
13319D65899A095J41431J19428g0878k73585D1416M6282A9244L18694a00128B05685
13307A50112i4463G8779K88053A36917f8935D25665J7012A06607E0503A6083J61815
13296A77898L9123g532B44408J22996i8851C8685a9258j0944A00481P504J30R0033
13284A98148j7147J9162p5817a5141B76177E5227R3387A5562L80780A56574D4328
$$ plain form
13364 108147 88117 360799 -194352 -66300 -143950 -90423 312387 64940 -233906 155135
13353 209610 226032 48208 268125 -79286 97370 72203 252841 439442 429266 -45613 -28940
13342 -28940 115828 -43753 173187 212607 81159 -152871 -29328 96198 542207 445120 13196
13330 -593 -77499 659032 50710 240006 261614 -75471 76457 394654 142548 176039 465899
13319 465899 1095 142526 261954 -70878 -344463 41416 87698 19244 337938 -100128 205685
13307 150112 -94463 78779 366832 136917 -68935 425665 442677 106607 50503 16083 177898
13296 177898 217021 -7532 244408 367404 -98851 38685 -19258 -30202 100481 107985 108115 198148
13284 198148 181001 200163 124346 -15141 276177 55227 148614 15562 396342 156574 44328
13272G8725k8239K69205d2664H4362N21553A50798G3287J78271E3637M3045f8359
13260A72192n3163J3201a13518A13463J19761J82388A49772J05986A25965E5865
13249C61700j25532p4601K65056a54141C01592A29608E2981j3308J27366J51590
13239C18629M7733c06422c3541A84786Q2792A05308k8720O3462B8993b45519F6024
13227a09363B20961a79184q4440B51423n8086m5398e3833A09378b32311F6709
13216a77552E83235a7983B94421F4511J18770J29838F7162a41421A68807c279
13205B62180e9081A23912M8230F9084L6756N337j3842D3678Q1444a13034F299
13193A12137a9426A82115D0071c4907A96596K5541d0858k83674E7317L15766h2510
$$ plain form
13272 78725 50486 319691 -42664 84362 605915 150798 73287 251558 53637 96682 -68359
13260 172192 119029 132230 -113518 113463 233224 415612 149772 255758 125965 55865
13249 361700 236168 161567 426623 -154141 301592 129608 52981 39673 167039 318629
13239 318629 366362 -306422 -33541 184786 267578 105308 76588 140050 28993 -245519 66024
13227 -109363 220961 -179184 -263624 251423 193337 147939 -53833 109378 -232311 66709
13216 -177552 583235 -17983 294421 64511 183281 313119 67162 -141421 168807 -3279
13205 262180 -59081 123912 172142 69084 105840 111177 97335 43678 125122 -113034 6299
13193 112137 -19426 182115 40071 -34907 196596 222137 -40858 -324532 57317 373083 -82510
13181b03011a3628k2840A78831i765D13379f1702L500B31913A15162K12010H9631
13169A19546m6663b2190I7887a63582J9143A39133e2604b6054E9235L12394j63827
13158B07802a63824A49953b0227F4226a56845h232j36762A62621a6315l6928B244
13146A55637n6371D0991K62681B8150a03915G8709O0757R9216C7044K02502C6170
13134C0665b61785d4538B67868a10040D723N018a7212B66725A912J88654g3491
13122A3615b06974c6004r2528A6739J29739C7207b18807B04695a35904B9748g4912
13110A7313L01539A02767C2268M2587R1745n6926k3138a25806A14689J08015o7724
13099A54980M8901b66842I938a04260B57699d7726A41833n791c49221C54859h349
$$ plain form
13181 -203011 -13628 -36468 178831 -9765 413379 -61702 -58202 231913 115162 327172 89631
13169 119546 72883 -22190 97887 -163582 -144439 139133 -52604 -26054 59235 371629 207802
13158 207802 -163824 149953 -20227 64226 -156845 -8232 -144994 162621 -16315 -53243 2244
13146 155637 99266 40991 303672 28150 -103915 78709 139466 238682 37044 239546 36170
13134 30665 -261785 -44538 267868 -110040 4723 9741 -17212 266725 1912 190566 -73491
13122 13615 -206974 -36004 -128532 16739 146478 37207 -218807 204695 -135904 29748 -74912
13110 17313 318852 102767 32268 74855 166600 109674 86536 -125806 114689 222704 154980
13099 154980 203881 -266842 9938 -104260 257699 -47726 141833 136042 -349221 354859 -8349
13087E2214b58894C10685o2204c3361q2040A32672a16461A40637a6385A29640
13076F2296a99172m272B4250J50512a95067D9495J81994e3818B1608J54363J27946
13065C03917C8083J53454d0039A03808f2389B46757J2733q1657f5801K1009I5932
13053i4962b1024k25134B62704K265N7515A10958J81633j37438d6577A12135a55870
13041B96284A47300e8410B98838i121B18692q009a88302h01r7413m6749A57616
13029f112j4316A97157c12707A55460J43983D883K28661F9253b04951A83492L2104
13018B15596q8203h374j13594q3809A50814D1136J4191P4575J73999a90661k353
13007a93014F94J29163K0406o8613a12291A52903J97360j52452a16232A5477c52723
$$ plain form
13087 52214 -258894 310685 248481 -33361 -115401 132672 -116461 140637 -16385 129640
13076 62296 -199172 -203444 24250 174762 -195067 49495 231489 -53818 21608 175971 303917
13065 303917 38083 191537 -40039 103808 -62389 246757 259490 177833 -65801 -44792 95932
13053 -94962 -21024 -246158 262704 264969 322484 110958 292591 155153 -46577 112135 -155870
13041 296284 147300 -58410 298838 -9121 218692 210683 -188302 -801 -98214 -144963 157616
13029 -6112 -20428 197157 -312707 155460 299443 4883 233544 69253 -204951 183492 215596
13018 215596 127393 -8374 -121968 -205777 150814 41136 55327 129902 303901 -190661 -193014
13007 -193014 694 129857 150263 81650 -112291 152903 350263 197811 -116232 15477 -352723
12995g4149A68393a64463J3076Q877a6044k54953F7175b1050j03688a8637j80380
12984a99017B00770M7588a72257A53485J0507a18611E8246J71816b18496C84020
12973A38170O8999I3322b48497A272d8327B19503c3691A25039j5487m0087a18238
12961H2696A9646h7778A40818b24948B17413h7357q0245B7184a13641A38604a8675
12949C60842A72240a72942r4618B15552D1564J43K19627f2889l25554A57667a36055
12937G2591O8610K29794j63233H4612a90118A22379p852J17761a00178E1380c428
12925B01993h4026j08787A86852a70275f2442k11754A62148Q3181b68484D2683
12914D13857f6087A17360f4510B01080G8487R9432C4556g713B10797L91298c0263
$$ plain form
12995 -74149 168393 -164463 -151387 -142510 -16044 -270997 67175 -21050 -124738 -18637 -199017
12984 -199017 200770 248358 -172257 153485 163992 -118611 58246 230062 -218496 384020
12973 138170 207169 93322 -248497 1272 -48327 219503 -33691 125039 109552 69465 -118238
12961 82696 19646 -87778 140818 -224948 217413 -87357 -167602 27184 -113641 138604 -18675
12949 360842 172240 -172942 -267560 215552 41564 41707 261334 -62889 -388443 157667 -136055
12937 72591 141201 370995 207762 84612 -190118 122379 114527 232288 -100178 51380 -3428
12925 201993 -84026 -192813 186852 -170275 -62442 -274196 162148 245329 -268484 42683
12914 413857 -66087 117360 -64510 201080 78487 177919 34556 -7713 210797 602095 -30263
12902D9930R3397b19935d8698n6363B61255G1990a6021j67817A8584b08502B93715
12890D3179k1388O1110b20544B52578j06135b02704I8323c5587j22524L4163A38969
12878A17782j7240j1524d951k98482B53765j22410a54816j60903B6735K68896
12868B95631F6943a86221H8320O5605i3219F0004c6462o3472A1791g1469J3246
12857e8223B00019a43382J1252G8351h7985q376C79641b7732A39422i9562l4113
12846a33675d1614C05263b60267Q5815f2275C4623a7822G3268J78983r4222G8912
12834g1226B37817B2817J97692h0981K3157A00165J5645M8658a83599M3694l360
12823a43265A54612a2728j76684h23o2215B06940a08990d449j60936C0047R4223
$$ plain form
12902 49930 143327 -219935 -48698 -105061 261255 71990 -16021 -183838 18584 -208502 293715
12890 43179 21791 82901 -220544 252578 146443 -202704 98323 -35587 -158111 -123948 138969
12878 117782 100542 89018 -4951 -303433 253765 131355 -154816 -315719 26735 295631
12868 295631 66943 -186221 88320 153925 -93219 60004 -36462 -99934 11791 -71469 -58223
12857 -58223 200019 -143382 -132130 78351 -87985 -96361 379641 -27732 139422 -99562 -133675
12846 -133675 -41614 305263 -260267 -174452 -62275 34623 -17822 73268 252251 158029 78912
12834 -71226 237817 22817 220509 -80981 -57824 100165 115810 164468 -183599 -139905 -143265
12823 -143265 154612 -12728 -189412 -823 -63038 206940 -108990 -4449 -165385 30047 124270
12812A24270J06511j13898h0557A04524J83169a40719o8691C2832h5152F91a27970
12800a68809E4718c078j8885A65562f2973A268J11324b82429G8032b40385B39784
12788H5138L26942a82279F5933a16979j47890B8245b96733L2155A89723E7306
12777E6985Q639a83153b7848C41113m4632a28546j51643a33725C46002d2747F6170
12765B45059E3053L31273j59336c28145P1015B63035A24752a43242H7240L627
12755I0867c04912i4153B59430P8130D8590J17314M4874a62211B86870f8004E3920
12743f9849E5261a40991A00571d1488r4698p4493A89632j3944j8241e3111g023
12731B05356b88316A91264J55069n9432i3809C2753J91304D5608b7901H0063J2192
$$ plain form
12812 124270 230781 116883 -80557 104524 287693 -140719 -209410 32832 -85152 691 -127970
12800 -168809 54718 -3078 -21963 165562 -62973 1268 112592 -282429 78032 -240385 239784
12788 85138 412080 -182279 65933 -116979 -264869 28245 -296733 -264578 189723 57306
12777 56985 65624 -183153 -27848 341113 296481 -128546 -280189 -133725 346002 -42747 66170
12765 245059 53053 384326 224990 -328145 -257130 263035 124752 -143242 87240 90867
12755 90867 -304912 -94153 259430 337560 48590 165904 210778 -162211 286870 -68004 53920
12743 -69849 55261 -140991 100571 -41488 -136186 -210679 189632 175688 157447 -53111 -7023
12731 205356 -288316 191264 346333 286901 -93809 32753 224057 45608 -27901 80063 92255
12720I2255k3990L7993h543H5375j2073e7371q856P907k40926a4132A5287R4671
12708A09958d0359n635m7036j21168H854P860R5711D3556J07665K1690j8014n9584
12696I5313b12523e524E0662O4650J05075a95135l5905N9184e3734D91a3551A63634
12683C3281b66537h983B5194n880Q9323b17540M4550J2420I2706L16545k03214
12672B06037J09069m4535r3693h798j26061I9542J96973I6041k5569J09678D6906
12660b08663h6303D42741a06516c894j38405A42740D8174J03099P9295P534N310
12649B43412a03921a5685A9736a74429I0544c53904a59592J4922A85401c92425
12638B67868q9368c571H1274J68365j22065a6959E2325d3091E4319K13775b5879
$$ plain form
12720 92255 68265 106258 -8543 85375 73302 -57371 -66227 -58320 -299246 -14132 15287 109958
12708 109958 -40359 -45994 -93030 -214198 8854 16714 112425 43556 151221 172911 154897 95313
12696 95313 -212523 -5524 50662 115312 220387 -195135 -231040 -171856 -53734 491 -13551 163634
12683 33281 -266537 -8983 25194 19314 108637 -217540 -172990 -160570 92706 409251 206037
12672 206037 315106 270571 176878 -8798 -134859 99542 296515 96041 70472 180150 46906
12660 -208663 -86303 442741 -106516 -3894 -142299 142740 48174 151273 230568 238102 243412
12649 243412 -103921 -15685 19736 -174429 90544 -353904 -159592 -144670 185401 -392425
12638 267868 178500 -3571 81274 249639 127574 -16959 52325 -43091 54319 268094 -25879
12626B77859P003l4274J31208E6284K05834K84605j83793i8420B41740b19291
12615B62712a95592G4964J67460G2549a48921j47374A13350J94225O8826B0857
12604C49168A58018b39234B39155a57604A15984d1641J1570p6859C29602A60990
12593a00636d2938C17286p4182P5711b8983C42382a8749F8690K07071D8283P20
12582D9003f4149A43849b3275B50915C1532c05145P6496B6229J19455c27137a41513
12570e8345j8782B31234g4639G3779c1589n5846a9379m02847J12540i6955A36699
12558B1290b42939A47965F3022A5407L94552d7124m7582A85722i7252B14667D8007
12546a3033B14505I5912b69486A8625Q601R8798b79428J12676J8355J7539A07594
$$ plain form
12626 277859 284862 250588 381796 56284 262118 546723 362930 -98420 241740 -219291
12615 262712 -195592 74964 242424 72549 -148921 -296295 113350 307575 376401 20857
12604 349168 158018 -239234 239155 -157604 115984 -41641 -30071 -106930 329602 160990
12593 -100636 -42938 317286 243104 318815 -28983 342382 -18749 68690 275761 48283 49003
12582 49003 -64149 143849 -23275 250915 31532 -305145 -228649 26229 145684 -327137 -141513
12570 -58345 -77127 231234 -74639 73779 -31589 -87435 -19379 -422226 -309686 -96955 136699
12558 21290 -242939 147965 63022 15407 409959 -47124 -94706 185722 -97252 214667 48007
12546 -13033 214505 95912 -269486 18625 27226 126024 -279428 -166752 -148397 -130858 107594
12534b45121a19514m4973A6485d4478B78726a77712B41151P9809R4281A88737
12523c00875D3726L167d0393B12075q2963a84456c8469r4849F802M9698J11075
12512A67575L3121N9151r7230a32157H9482a68139B4386J64050b17444g1715A31544
12500C78085A70043a56608N8025K5887I034a13884a6672m6895A1095J14846F51
12488h6560c5038A94807c37697C53464C0903g9122o7815O1659B76326a81656l4015
12477b15671h6582k2412B69390a20019e4825d091B49128a12852L5421C44353d032
12465a25923m3086B19065G0892L7214a72399C76680d2028B46426b78948a36415
12454E23964q3207b39662a0447j7661A39990c11255j36572d1361k0379C70765
$$ plain form
12534 -245121 -119514 -164487 16485 -44478 278726 -177712 241151 320960 415241 188737
12523 -300875 43726 46893 -40393 212075 129112 -184456 -38469 -133318 6802 56500 167575
12512 167575 200696 259847 162617 -132157 89482 -168139 24386 188436 -217444 -71715 131544
12500 378085 170043 -156608 -98583 -72696 9034 -113884 -16672 -63567 11095 125941 651
12488 -86560 -35038 194807 -337697 353464 30903 -79122 -146937 -85278 276326 -181656 -215671
12477 -215671 -86582 -108994 269390 -120019 -54825 -4091 249128 -112852 -77431 344353 -4032
12465 -125923 -169009 219065 70892 108106 -172399 376680 -42028 246426 -278948 -136415
12454 523964 440757 -239662 -10447 -28108 139990 -311255 -447827 -41361 -61740 370765
12443a7991j52414k070N7696B4134a25789A17907d55550a1377l46047B3316J3244
12432C6560M1302d4306j85553c9169A17089b33380H8251g1926D06539B6785K64965
12421B91750r4044d4863m83910a19270p6553A1620c8409C4032c7633l60780c0365
12409a98748g4595j78145k6771a3330A8482a44503D4943K71868c675A53507l8819
12398A14688R273n9489b13778B4976b61741K7416H5404J7348c44788H5465a38439
12386i1615j53283D2215b01795E5849J3053a73581j21408J2246j42779g1044A5509
12374a13200E5369K788I377M8181N2690b22691i8880D5163a51736j3953B64577
12362a60761A78189m7009a67537G7153h8929H0949R6865h6494n4663A09511k5453
$$ plain form
12443 -17991 -170405 -172475 -114779 24134 -125789 117907 -455550 -11377 -357424 23316 36560
12432 36560 77862 -44306 -229859 -39169 117089 -233380 88251 -71926 406539 26785 291750
12421 291750 197706 -44863 -528773 -119270 -195823 11620 -38409 34032 -37633 -398413 -30365
12409 -198748 -74595 -252740 -279511 -13330 18482 -144503 44943 316811 -3675 153507 114688
12398 114688 123961 64472 -213778 24976 -261741 -234325 85404 102752 -344788 85465 -138439
12386 -91615 -244898 42215 -201795 55849 68902 -173581 -294989 -282743 -425522 -71044 15509
12374 -113200 55369 58157 9377 57558 110248 -222691 -98880 45163 -151736 -165689 264577
12362 -160761 178189 131180 -167537 77153 -88929 80949 177814 -86494 -141157 109511 84058
12351H4058B015L16648a47642A4769g4425G3093C4857a1460j3970A40504D4612
12339A69917c8278B33861b43704J7722C6592J3302Q105h9931J3826G7467J82723
12328B60190h6498A23207a03441K6471A53149a6429k3856R803j84161A861b1137
12316i1609b73A80684b1710l0076B97678I704Q0259R4357c7513C09417i6671N208
12304i1463j23637C72459b16578G9171b57073Q7060A64070k0543a08444B62572
12293C2118d1801a9363C51076i8195b9638B46585b54441A75896h7860A11467k742
12282A08725k5614K14488r9689c91545A03857L6038b30483d6337m081C40300k7939
12271C12361H3323R4908f005j51932j885A52332R9290n9229A1914J05431A0671
$$ plain form
12351 84058 2015 318663 -147642 14769 -74425 73093 34857 -11460 -25430 140504 44612
12339 169917 -38278 233861 -243704 -225982 36592 49894 57999 -89931 -76105 77467 260190
12328 260190 -86498 123207 -103441 -76970 153149 -16429 -40285 -30482 -214643 1861 -21137
12316 -91609 -273 180684 -21710 -51786 297678 9704 89963 184320 -37513 309417 -96671 -91463
12304 -91463 -215100 372459 -216578 79171 -257073 -170013 164070 143527 -108444 262572
12293 32118 -41801 -19363 351076 -98195 -29638 246585 -254441 175896 -87860 111467 108725
12282 108725 83111 297599 197910 -391545 103857 139895 -230483 -46337 -50418 340300 312361
12271 312361 83323 178231 -6005 -157937 -159822 152332 251622 192393 11914 117345 10671
12259c0715A665K58241h0406D6296c90083D32182f861D6850J2098b67162a06547
12247D36455A83321b50754A14738c97661I9607a12809J2458c0234j91082B13853
12236d81105C15081c3578l44506g6134D1655h1731b2403k8772K4995B12337D0114
12224D9568N22959A4420K82701M2630j43144O247B150L24334d08113B86011o7281
12213B18730r3088K37245i9952r7623b1080l9912j44078H5098j9294K96353j74742
12202A87415M1R7635g160A22100f5188A23361M04476A490K82419C4348e3855I508
12189A77715e3356M486B70395e1352B96673q0019c7134j27126b1193B64974d69885
12177A08498J11134c825I9444J03552I3897m716c08049D33851G567J32154E1086
$$ plain form
12259 -30715 1665 259906 -80406 46296 -390083 432182 -6861 46850 58948 -267162 -106547
12247 436455 183321 -250754 114738 -397661 99607 -112809 -100351 -30234 -221316 213853
12236 -481105 315081 -33578 -378084 -76134 41655 -81731 -22403 -51175 -26180 212337 40114
12224 49568 572527 14420 297121 339751 196607 202854 2150 326484 -408113 286011 218730
12213 218730 125642 362887 -99952 -197575 -21080 -60992 -205070 85098 65804 362157 187415
12202 187415 187456 285091 -7160 122100 -65188 123361 527837 1490 283909 34348 -53855 9508
12189 177715 -53356 -48870 270395 -51352 296673 216654 -37134 -164260 -21193 264974 -469885
12177 108498 219632 -3825 99444 202996 93897 89181 -308049 433851 7567 139721 51086
12165A68364P1623j0423l478b5802C41436A55392g8420D94350A15928B665J25861
12154A28526j9205i7310o0189B8035K3604J16263N6460b3650k07164f6439A58038
12142D37917A68655i9460B98055A35491B6420J80169R0614b02210A72573F639
12131A36792a05813q548A43526F4633i0193a5801m01561a2370G9985M4325a296
12119A06592j7856R3360B206J63957Q0906c8208B34528A9271g243B70396c9209
12107B011J33744K41847a78083N5182d0455B71517a22459A04610l6993Q6605n3255
12096A00967d9155r4502E701c1103j376j75451o8756a36542A57790a87404a1916
12084d231B3241b19763g3290A67551c86011d2422r7469c5149p9920B37532b41334
$$ plain form
12165 168364 239987 229564 226086 -25802 341436 155392 -78420 494350 115928 2665 128526
12154 128526 109321 -97310 -157499 28035 51639 167902 224362 -23650 -230814 -66439 158038
12142 437917 168655 -99460 298055 135491 26420 206589 297203 -202210 172573 6639
12131 136792 -105813 -114361 143526 64633 -90193 -15801 -417362 -12370 79985 124310 -1296
12119 106592 88736 182096 2206 166163 247069 -38208 234528 19271 -7243 270396 -39209
12107 2011 135755 377602 -178083 -122901 -40455 271517 -122459 104610 67617 154222 100967
12096 100967 -49155 -143657 5701 -31103 -32479 -207930 -276686 -136542 157790 -187404 -11916
12084 -4231 23241 -219763 -73290 167551 -386011 -42422 -139891 -35149 -115069 237532 -241334
12072B5498J359m074J90598a42375A62038c7105A80715a35597D80957b57442O3964
12061a93478A14828A4851a9899A36188F7097Q36268K80359A66916D0478b68174
12050G8143O5877f207q8265k46163a10294A46169b61733Q3842A73171D0611b64208
12038A56400M8411d5832l4905j14491R4994M0878j31232i3629G2047e481F3901
12026C4194h9142J5456A19811A0863a57974B07109K98534a68983Q1962I6772J52
12015I6924K6678f7307k35238I4849b08569a855j34308E3760b44669N7750J7501
12004a69418A00154g123A12786R8451D0354R3103f8515F6688i5513H9853d0476
11992i4979A5501a06468b8699A39324b7513B3216c14731B8513g2642B78334n7109
$$ plain form
12072 25498 26857 22783 213381 -142375 162038 -37105 180715 -135597 480957 -257442 -193478
12061 -193478 114828 14851 -19899 136188 67097 903365 1183724 166916 40478 -268174
12050 78143 144020 -6207 -94472 -340635 -110294 146169 -261733 -177891 173171 40611 -264208
12038 156400 204811 -45832 -80737 -195228 -100234 -59356 -190588 -93629 72047 -5481 63901
12026 34194 -89142 -73686 119811 10863 -157974 207109 505643 -168983 -87021 96772 96924
12015 96924 123602 -67307 -302545 94849 -208569 -1855 -136163 53760 -244669 -186919 -169418
12004 -169418 100154 -7123 112786 211237 40354 133457 -68515 66688 -95513 89853 -40476
11992 -94979 15501 -106468 -28699 139324 -27513 23216 -314731 28513 -72642 278334 221225
11981B21225c71290B75127o9191k0174a91677I5425a30777A6701J83184c4821
11970a06945F8956K30080C8106L2841d41015K16691c0861n669i71A15750a82774
11958g0556l6487K909m5760C78693a62033H7122A7788L25521A21272a68834a8539
11946f5499D8667d29655B41621b33059B05762h3199F4416c3597B07a9629l1339
11935e0968A86544b56285A50485a72261C51346r2784e9335J2940n0878j13165
11925b10438I6823b62271H9620b67409R8158J7913k01540C4712J2719b14022k5579
11914b39601b8705j03376A56977g3856B00732b094B23893f3910I8723e7782I0420
11902D6126g2368m8478l3683A12851Q2889q1101J82847a89496R3663a3743n4580
$$ plain form
11981 221225 -371290 275127 205936 185762 -191677 95425 -130777 16701 199885 -34821
11970 -106945 68956 299036 38106 70947 -441015 -224324 -30861 -36530 -971 115750 -182774
11958 -70556 -107043 -104134 -149894 378693 -162033 87122 17788 343309 121272 -168834 -18539
11946 -65499 48667 -429655 241621 -233059 205762 -83199 64416 -33597 207 -19629 -50968
11935 -50968 186544 -256285 150485 -172261 351346 258562 -59335 -46395 -97273 -210438
11925 -210438 96823 -262271 89620 -267409 -169251 -151338 -352878 34712 47431 -214022 -239601
11914 -239601 -28705 -132081 156977 -73856 200732 -2094 223893 -63910 98723 -57782 90420
11902 46126 -72368 -120846 -154529 112851 195740 114639 297486 -189496 -95833 -13743 -68323
11891f8323A70887b61862R9784l6487i1228d3309k54394g8140L8213A12451B1323
11879A84984c25457A54306d08301A39915a06399A30333j586b97684a39417a2915
11868e0826m3022j03911n096e2722m2660B02134E3261Q401a19227j07008a090
11856b53851h8422c0579H4787b3560j32615O1440a4573A77061a01582b0883k67300
11845b88183A03765b27099R3257K2753i389A01802m2200O5691d7269j70599a0699
11833G5054b95955O4345e170H8693b69482A07709R203D236a53572M969D0758J94534
11821B35292g3304o0964A84821q0450c69769a83869P9528k10649A71824E3075
11810F5040K6487c6708m19029C26320L0169c8136j5257m5812A96760b70410a00312
$$ plain form
11891 -68323 170887 -261862 -162078 -198565 -91228 -43309 -297703 -78140 -39927 112451 21323
11879 184984 -325457 154306 -408301 139915 -106399 130333 128747 -297684 -139417 -12915
11868 -50826 -93848 -197759 -202855 -52722 -95382 202134 53261 61662 -119227 -226235 -1090
11856 -253851 -88422 -30579 84787 -23560 -156175 -94735 -14573 177061 -101582 -20883 -288183
11845 -288183 103765 -227099 -133842 -111089 -9389 101802 59602 125293 -47269 -217868 -10699
11833 75054 -295955 -231610 -5170 88693 -269482 107709 116912 4236 -153572 -148603 40758 235292
11821 235292 -73304 -134268 184821 104371 -369769 -183869 -104341 -314990 171824 53075
11810 65040 91527 -36708 -455737 326320 356489 -38136 -53393 -99205 196760 -270410 -100312
11798b69651n4148c3461H804h7748b4630A28158h3837G0943i5554j59590G4302
11786A04891a31920d4071H5537a69249N3789b16j7112k83511i7479I7029b495
11774b67119J24610d3176a7883A33198a01466m9672E5943J76591d4190A48661
11763a43158k9210o4354C3825L7388a70531R954E295b00674C2222O747K01961
11752B40930a26230a0894p3666D9490q352a5543I8118b13441q5974c5512m53507
11741d89019a27016o9226B53306i6084j49844L1194b391p0792j16741N3919D9885
11729b39359a0605I7819a991A09920K33230j52025g7791C15616p9457a66723A31645
11717b19287e1185A44231f8975A10665b34471A7606g3617I814O8754b53191d7616
$$ plain form
11798 -269651 -323799 -33461 8804 -87748 -24630 128158 -83837 70943 -95554 -255144 74302
11786 104891 -131920 -44071 85537 -169249 -115460 -216 -17328 -300839 -97479 97029 -2495
11774 -267119 -142509 -43176 -17883 133198 -101466 -151138 55943 232534 -44190 148661
11763 -143158 -172368 -236722 33825 71213 -170531 -160577 5295 -200674 32222 38969 240930
11752 240930 -126230 -10894 -84560 49490 41138 -15543 98118 -213441 -299415 -35512 -489019
11741 -489019 -127016 -196242 253306 -96084 -245928 -214734 -2391 -73183 -189924 -136005 49885
11729 -239359 -10605 97819 -1991 109920 343150 191125 -77791 315616 236159 -166723 131645
11717 -219287 -51185 144231 -68975 110665 -234471 17606 -73617 9814 78568 -253191 -47616
11705A34130e38584A22359b66774D9704b91981h5976I8911a53730c2297r2314
11695a24611A16445B0600g0805G7971B7435f5489E6108J21986j3491i0619c3838
11683A13048A3969L9307a41522l6947A9435i4854A23732E4984j4172c5681A6691
11671h9710A5872Q7859a8756I8999J17773c31074A01684a71924j96426j12735
11661d81085b00291A01244c11265J49508P7589A75440J86630c98605B52290b81582
11650c1496r5123D748M7163d03796B56096d4979G3542b57325R5800e9377B23787
11638a65526j93390e3790B54756a85474k19122B7896c34843C35726j8633b38488
11627A15125c9927K717q0430B55577a42496o2202A59643a328H1604e4638I4105
$$ plain form
11705 134130 -538584 122359 -266774 49704 -291981 -85976 98911 -153730 -32297 -124611
11695 -124611 116445 20600 -70805 77971 27435 -65489 56108 178094 164603 -90619 -33838
11683 113048 13969 53276 -141522 -178469 19435 -94854 123732 54984 40812 -35681 16691
11671 -89710 15872 103731 -18756 98999 216772 -331074 101684 -171924 -368350 -481085
11661 -481085 -200291 101244 -311265 -161757 -84168 175440 362070 -398605 252290 -281582
11650 -31496 -126619 4748 51911 -403796 256096 -44979 73542 -257325 -161525 -59377 223787
11638 -165526 -358916 -53790 254756 -185474 -404596 27896 -334843 335726 317093 -238488
11627 115125 -39927 -37210 -117640 255577 -142496 -204698 159643 -1328 81604 -54638 94105
11615i7601A17734J12981d7915A73590a39717H9154A2389L34786d48202a36766
11604a84183c909D4577j2221O1531c16313A60754b5713k27475H2903a91075J3659
11593a77416P8043D2238j4904Q094a51860l5028g3367G4425J3649m0904J8474
11582F5644i4862o6230f1152m23214B68925I3975e9375K3846j86974A31555J05186
11571B36741h303r0023H0589c7091H4944J7547c9807k8011F0643a21731c0809
11559e6821j77679A5445N2119b79744H1479p896K26870g5555L4312c450E6775
11547A21998J06445j02214A4462a17314j13422K7532A14295K9161F3901a61538
11536A50076e2334j18246A34009B6658e4063B14226E9361N0493A823i322B48937
$$ plain form
11615 -97601 117734 230715 -47915 173590 -139717 89154 12389 347175 -448202 -136766
11604 -184183 -3909 44577 32356 93887 -316313 160754 -25713 -253188 82903 -191075 -177416
11593 -177416 -99373 42238 27334 35428 -151860 -186888 -73367 74425 88074 47170 65644
11582 65644 -94862 -161092 -61152 -484366 268925 93975 -59375 -35529 -222503 131555 236741
11571 236741 -8303 -98326 80589 -37091 84944 102491 -39807 -67818 60643 -121731 -30809
11559 -56821 -234500 15445 67564 -279744 81479 73583 300453 -75555 -41243 -3450 56775
11547 121998 228443 126229 14462 -117314 -230736 -203204 114295 143456 63901 -161538
11536 150076 -52334 -170580 134009 26658 -54063 214226 59361 109854 1823 -9322 248937
11524f8124C04673A52135m2771Q2753e450A55350k2649k6300b18512B2283J74761
11513A97044E6865Q5992L4030E3580L07009A28865L22562a14597A69917m8559
11503A21358D3693f8922B12720j03005J69758a38268m6450A43945o9000L12987
11493C87932j61846f0123p0755c5066B68320J8961n47C7103K99635l3829j2560
11482B90349C564d1353A25618L59612a57753O4567A06198f9898D6570A3184L90188
11471D03372A3698b57536N5489B95694E1879a0885B13956i2942C27389b70599
11460B04573l280a91376c1986D14275a20907B7929K38153n3202b04588c6640A80864
11448a56610M9980A16229d9822A61465J56251c69705b5619A72873A0920O5355
$$ plain form
11524 -68124 304673 152135 109364 192117 -5450 155350 132701 106401 -218512 22283 197044
11513 197044 56865 142857 176887 53580 360589 128865 451427 -114597 169917 121358
11503 121358 43693 -68922 212720 109715 279473 -138268 -184718 143945 74945 387932
11493 387932 226086 -60123 -130878 -35066 268320 287281 286734 37103 336738 302909 290349
11482 290349 3564 -41353 125618 485230 -157753 -93186 106198 -69898 46570 13184 403372
11471 403372 13698 -257536 -202047 295694 51879 -10885 213956 -92942 327389 -270599
11460 204573 201293 -191376 -31986 414275 -120907 27929 266082 212880 -204588 -36640 180864
11448 -156610 -106630 116229 -49822 161465 317716 -369705 -25619 172873 10920 76275
11438G6275e9960A51574C2489K9758K04085b05553e3910A48874b15687B61329
11427I7466f8638k72518a15370M1662j24199R0669O356D22478c77955C74105o9518
11416C04587A34527J23299h7280M1344a8980B07300h2760d213k88596F399J79210
11405A85609P7704p009a46676B9250b32423l658A08207a67379j15025i4243l2760
11394a27003j38175B38232b88667M056R2911E929O3830c9694G6185k0027P8027
11383A34185a9883p7060A43722h406A6867D728a170A20396A6648P5908c02310
11371A99968K28602a27966n4384A25385M3735q2885a66444p1475R9292q0615l3498
11360b52740a24873M5109j4873a0820j26207C309J68154P160r679J12335b47103
$$ plain form
11438 76275 -59960 151574 32489 62247 266332 -205553 -53910 148874 -215687 261329
11427 97466 -68638 -341156 -115370 -73708 -197907 -107238 -100882 422478 -377955 374105 304587
11416 304587 134527 257826 -87280 -45936 -18980 207300 -82760 -4213 -292809 6399 185609
11405 185609 263313 256304 -146676 29250 -232423 -236081 108207 -167379 -282404 -94243 -127003
11394 -127003 -265178 238232 -288667 -284611 -191700 5929 69759 -39694 76185 56158 134185
11383 134185 -19883 -96943 143722 -8406 16867 4728 -1170 120396 16648 92556 -302310
11371 199968 428570 -127966 -182350 125385 169120 86235 -166444 -237919 -138627 -219242 -252740
11360 -252740 -124873 -79764 -94637 -10820 -137027 3309 171463 178623 168944 281279 -247103
11348c7285C9111K3605a87424A53214a23933o0108f9110E3428b09457A92634b65440
11336h0725B59116c99060q3884f0907j14166g2181G7969c28872I7057c16876a35601
11324c2546F4686L8611a74100A78123b1341B55645j14113b22047A1308c54075
11313A29212a15866b7644l35637c1535l18538D5150K51809e3488D8625g524j84751
11302a92275b8266k25506D7038b9359C25660B0535N2304M0363c11193c6670F1867
11290I3242N5635J38756g9300k3821d8857C11148B3532c01847a48835m09236B69541
11278d19115C91980A16887h0486a9094j4272C21567a91813B07589J42824a59636
11267c18769N3914j04106c7099F2539a25279B0964a44562A47251b05408A31156
$$ plain form
11348 -37285 39111 62716 -187424 153214 -123933 -184041 -69110 53428 -209457 192634 -265440
11336 -80725 259116 -399060 -482944 -60907 -175073 -72181 77969 -328872 97057 -316876 -135601
11324 -32546 64686 103297 -174100 178123 -21341 255645 141532 -222047 11308 -354075
11313 129212 -115866 -27644 -363281 -31535 -350073 45150 296959 -53488 48625 -7524 -192275
11302 -192275 -28266 -253772 47038 -29359 325660 20535 72839 113202 -311193 -36670 61867
11290 93242 148877 287633 -79300 -103121 -48857 311148 23532 -301847 -148835 -558071 269541
11278 -419115 391980 116887 -80486 -19094 -33366 321567 -191813 207589 350413 -159636
11267 -318769 -264855 -368961 -37099 62539 -125279 20964 -144562 147251 -205408 131156
11256A66632e5368A30708n9056f3108C310a17434e563H5144a80542A30118B6328
11244E3449i9830H445g4367e125j58090L8961O251c6072j882C00839g2643k05267
11232b77910C3547a09792l9802a0943A39668c24468c2774A48698J4451C7732b64093
11220A13541d05167a08484D40934I1852a85708G0679e8733p0108A515d2145m2945
11209h5090M2067p9666j8458N2804j19841C2168g8913E7370f5339A22629D9713
11197b9016j35385k2808J7561F7839K56991b12579O0901a651m1789a4093B80583
11185e2660k30968L2663A03340J77460f0220A62926j2493A9072d0311j6295B13192
11173a10669p1340H9034a56955D9444i1177A88722D6251b58570g333A1042b75981
$$ plain form
11256 166632 -55368 130708 71652 -63108 3310 -117434 -5563 85144 -180542 130118 26328
11244 53449 -99830 8445 -74367 -5125 -163215 -124254 -118003 -36072 -37954 300839 -72643 -277910
11232 -277910 33547 -109792 -149594 -10943 139668 -324468 -32774 148698 163149 37732 -264093
11220 113541 -405167 -108484 440934 91852 -185708 70679 -58733 -128841 1515 -42145 -85090
11209 -85090 -43023 -122689 -141147 -88343 -208184 32168 -78913 57370 -65339 122629 49713
11197 -29016 -164401 -187209 -169648 67839 324830 -212579 -151678 -1651 -43440 -14093 280583
11185 -52660 -283628 -250965 103340 280800 -60220 162926 150433 19072 -40311 -56606 213192
11173 -110669 -182009 89034 -156955 49444 -91177 188722 46251 -258570 -7333 11042 -275981
11161A25814a26376b1894l70521C9394d6468E5702h8256A98706O513a30565A46898
11149a7761F4849k617Q3375B2972J82749H7282J6075K67298A28229i6469C86643
11137b44502a13332p2116h1073j00572p881r1348I8142a52689C1219N3974c25715
11125I9667g2568C04780I4012a933A87937F3344b19303A72028C5310A6382J3265
11114B9647a53882b8859j64089A7897K15825m2980a44349A77346J34111L5512
11104C46969A0785a90256p3092G1209K19848N8087A60117d7807A86660F7587A8607
11092f590B2061J39003g2525B28735b93002C48605J98616a099C01252A8433N8909
11081G7342a00397C74224l3747A52324e5790C85846J14961k41763A26246n8736
$$ plain form
11161 125814 -126376 -21894 -392415 39394 -46468 55702 -88256 198706 205219 -130565 146898
11149 -17761 64849 62232 145607 22972 205721 87282 103357 370655 128229 -96469 386643
11137 -244502 -113332 -185448 -81073 -181645 -189526 -280874 98142 -152689 31219 85193 -325715
11125 99667 -72568 304780 94012 -1933 187937 63344 -219303 172028 35310 16382 29647
11114 29647 -153882 -28859 -192948 17897 233722 190742 -144349 177346 311457 346969
11104 346969 10785 -190256 -263348 71209 291057 349144 160117 -47807 186660 67587 18607
11092 -6590 22061 161064 -72525 228735 -293002 348605 547221 -1099 301252 18433 77342
11081 77342 -100397 374224 340477 152324 -55790 385846 500807 259044 126246 67510
11071F7510P0336L21662A96226E0868L06755l65j52516K17791A96371p1229J10179
11060B35321q9327O08622k65943j92898O3729K79908j11117L10865J9178l89968
11050D68370K88729j01358J8294B24401L87595B96676O8441k0021J75996N5310
11040E76402Q0779j06721k15405J98012r4697M65308l39182J50448C33098Q3933
11030D17031M16636j48694j70290L47026J4182k22720j69284P558A37134M59378
11020E96512j43075k05110O1031J96620j73631J13684j73272J32815J48626B08300
11009F00442p8742j69761j1795P101J97667j52969Q6638J02666J25513P9319k79547
10998E06532P4597K53880k86932K8003K677F1616Q08801j61943j31633j03594
$$ plain form
11071 67510 137846 459508 196226 50868 357623 357258 204742 422533 196371 125142 235321
11060 235321 145994 754616 488673 295775 359504 639412 528295 839160 858338 468370
11050 468370 757099 655741 674035 224401 611996 296676 365117 345096 521092 576402
11040 576402 657181 550460 335055 533067 438370 903678 564496 714944 333098 417031
11030 417031 833667 684973 514683 861709 875891 653171 483887 491445 137134 596512
11020 596512 453437 248327 309358 505978 332347 446031 272759 405574 554200 208300
11009 600442 521700 351939 340144 347245 544912 391943 478581 581247 706760 786079 506532
10998 506532 581129 835009 548077 576080 578757 61616 870417 708474 576841 473247
10988D73247K83892J50824D00587J89268J84832J60021p4635K4922n5784K33404
10978A062615K20226J40672J67955K78547J3371M97714P0090K83853m83900P3002
10968B324145k23023k00818l87480k35827P0640m53282j16009M24988l63060l56037
10958D84237L67760J74656j0946j21917j76289k98210J68242k32734A11374J96280
10948C07654I1709J34854d6398C14121H8466b65967B1273a86069C06876i4959
10937c0886A87548a39548A77396a50364j1401e2558B49996J4026j28576k5059
10927A10387a78531o2500B59795g9856E4133a41609l2353A14318K41758a90472
10916a47666C3151R4817J49957q3493b30015A12006i5693j07697c8036n9770n2565
$$ plain form
10988 473247 757139 907963 400587 589855 774687 934708 860073 884995 829211 1062615
10978 1062615 1282841 1423513 1591468 1870015 1883386 2381100 2451190 2735043 2251143 2324145
10968 2324145 2101122 1900304 1512824 1276997 1347637 894355 778346 1203334 840274 484237
10958 484237 851997 1026653 1015707 893790 717501 419291 587533 354799 111374 307654
10948 307654 91709 226563 -46398 314121 88466 -265967 21273 -186069 306876 -94959
10937 -30886 187548 -139548 177396 -150364 -161765 -52558 249996 264022 135446 110387
10927 110387 -178531 -241031 259795 -79856 54133 -141609 -173962 114318 356076 -190472
10916 -147666 33151 127968 277925 194432 -230015 112006 -95693 -203390 -38036 -97806 -150371
10905a50371j90973B16267i2287G7881Q8951b6520B27388H0744d93610b6515j03074
10894a29589N9190A13070b04700F8490j0024a27324A69703R7454A7270b91426
10883D2236A5837J56704g1540q8488f1114l35290J06271E7690h1259F186i9999
10871b61019A34591Q530o2834J24612c40677B4449P3114R7184I0977C2288J13089
10860A45377f4981A97520c14014M0375F2609M31517h1953E8288f6670H0794a07796
10848a17359C25218c36758B36714a28496E0955c94716A0154d2965o2107H2269
10837a27590c2479k94832A63477d7552j13010b3935m6845c2195j69802M884A05654
10825C5027J1680J78519f4306l7090H7770g1259k05955E3015e2579B32665a41810
$$ plain form
10905 -150371 -341344 216267 -92287 77881 166832 -26520 227388 80744 -493610 -26515 -129589
10894 -129589 -70399 113070 -204700 68490 58466 -127324 169703 267157 17270 -291426
10883 42236 15837 172541 -71540 -160028 -61114 -396404 -290133 57690 -81259 6186 -99999
10871 -261019 134591 143121 80287 204899 -340677 24449 97563 194747 90977 32288 145377
10860 145377 -64981 197520 -314014 -273639 62609 494126 -81953 58288 -66670 80794 -107796
10848 -117359 325218 -336758 236714 -128496 50955 -394716 10154 -42965 -105072 82269
10837 -127590 -32479 -327311 163477 -47552 -160562 -23935 -70780 -32195 -201997 -197113 105654
10825 35027 46707 225226 -64306 -101396 87770 -71259 -277214 53015 -52579 232665 -141810
10813A8376J3407K37116H2207C8243L45070b5276o3088A25633a47136K3023a6792
10801A21219k6316k6509O0220e8148A04454A6918J08067A6880b80808A71456a40530
10789b02175b3355o7664q10c0144j6353j03699I4853J51170b39514e7730E6281
10777B989a45440c3546H9764M40283a26601n0433P8940M1398C30133b85839A05000
10765E2330J0966a03532l6844L5003F4964d3970H5466b27851B22277d8435j14023
10754a62458A07273H235a50864F223Q3511c7286A81080C0313a88723e4348l0767
10743h5115b0661A07674A7191e7455j8118H4973b09369d1924k17888g6595j67360
10732b43955a13368d2755j45876O7147C03821C2416R501a159k09209j47732j34503
$$ plain form
10813 18376 31783 268899 82207 38243 383313 -25276 -88364 125633 -147136 -124113 -16792
10801 121219 94903 68394 128614 -58148 104454 16918 124985 16880 -280808 171456 -140530
10789 -202175 -23355 -91019 -91829 -30144 -46497 -150196 94853 246023 -239514 -57730 56281
10777 2989 -145440 -33546 89764 530047 -126601 -177034 -98094 -56696 330133 -285839 105000
10765 52330 63296 -103532 -140376 -105373 64964 -43970 85466 -227851 222277 -48435 -162458
10754 -162458 107273 8235 -150864 6223 89734 -37286 181080 30313 -188723 -54348 -85115
10743 -85115 -20661 107674 17191 -57455 -75573 84973 -209369 -41924 -259812 -76595 -243955
10732 -243955 -113368 -42755 -188631 -121484 303821 32416 41917 -1159 -210368 -358100 -492603
10721d92603H7829K60942L0452a06859j47764K8158Q053A10703J01256i5051G5040
10709b39144A69630c8260o8607I5401c39565A60750l616F0268b62027K161F5165
10697a59213p589a464C9541a4849j32423j613A38663b91553o7152a04089k84950
10686c89039e6768B25531l0592a31993J2154H315b3126A01470f3514a4260j35233
10675a49493f8420m73707a66746B04444b22031h2588A08147c04142A92140i7253
10664b36784C12665a84949G2453g4677j31379D7309J53517a96064B4882J05372
10654A30254e9518H3277e2523H956O4438J03420d9436A84719b1702k77019f9861
10642B18341f3186k42196j08112A9354c97300B4462N6137J26908b88870e4408
$$ plain form
10721 -492603 87829 348771 379223 -106859 -254623 -226465 -218412 110703 211959 -95051 75040
10709 -239144 169630 -38260 -106867 95401 -339565 160750 157134 60268 -262027 -259866 65165
10697 -159213 -166802 -1464 39541 -14849 -147272 -148885 138663 -291553 -358705 -104089 -389039
10686 -389039 -56768 225531 194939 -131993 -119839 8315 -23126 101470 -63514 -14260 -149493
10675 -149493 -68420 -542127 -166746 204444 -222031 -82588 108147 -304142 192140 -97253
10664 -236784 312665 -184949 72453 -74677 -206056 47309 200826 -196064 24882 130254
10654 130254 -59518 83277 -52523 8956 73394 176814 -49436 184719 -21702 -298721 -69861
10642 218341 -63186 -305382 -413494 19354 -397300 24462 80599 207507 -288870 -54408
10631d1977C8576d53830a89925j25776J38456H1122j2074K34500A02632f002F3539
10619B14594c935B21072g9381q3723m0568A48203b74640L5529e8500A13132c70779
10607a01430A3723b23139L9756q0425E1793J49226a67225A33306J6116k0636g6811
10595A51267m8099b36435E7148h0418C9966b7701R859j28093l823A98977A6821
10583A4741P2425J10922b25886O0160A95581P5829a0422m1003G6483l5059h4276
10571a29628j03874g4916A38142n1506C5379c25538J29405d2743j97346L8976
10561b01113C01202E0254J69022c0296j566A59030a81881f5450q4131q0603A44171
10549G249b33769f2658j7527A26160d52014a03310a2077j74590B0865b12449A72117
$$ plain form
10631 -41977 38576 -453830 -189925 -315701 -177245 81122 69048 303548 102632 -6002 63539
10619 214594 -3935 221072 -79381 -163104 -203672 148203 -274640 -239111 -58500 113132 -370779
10607 -101430 13723 -223139 -183383 -263808 51793 201019 -167225 133306 149422 128786 -76811
10595 151267 103168 -236435 57148 -80418 39966 -27701 -17842 -145935 -149758 198977 16821
10583 14741 87166 198088 -225886 -165726 195581 271410 -10422 -51425 76483 41424 -84276
10571 -129628 -233502 -74916 138142 86636 35379 -325538 -196133 -42743 -240089 -201113
10561 -201113 301202 50254 219276 -30296 -31862 159030 -181881 -65450 -149581 -230184 144171
10549 7249 -233769 -62658 -80185 126160 -452014 -103310 -12077 -186667 20865 -212449 172117
10537f606j19947A65687F0655a34565A0498Q8466a52203Q519G049K84600C1085
10525D4391R7248a59888m9753E8991j1380J30905i8172B64487i2971A44136a32601
10513b3937j28920A8665a03375m68276J10249d0447l6129j22323g6166c4232A50399
10501a6643f663A31035a62349B90226b5232B8686m612L680K638J25006a50870
10489a20127H1728b84865J04319F7365c2784A30826a19050j8115A01820J01018
10479B02838h9273k019H3635d7372B62688c036E8647L3787Q3906h7442A24271
10467f7946F3892e4908m2735M6472H510a95446Q8905A31223Q6576A3074a56901
10455C8621b7576j77897O268A09842A2275a70327A68845c50757h0213j57772J13443
$$ plain form
10537 -6606 -126553 165687 60655 -134565 10498 98964 -152203 -143684 7049 291649 31085
10525 44391 141639 -159888 -209641 58991 47611 178516 -98172 264487 -92971 144136 -132601
10513 -23937 -152857 18665 -103375 -571651 -461402 -40447 -76576 -198899 -76166 -34232 150399
10501 -16643 -6663 131035 -162349 290226 -25232 28686 24074 27754 30392 155398 -150870
10489 -120127 81728 -284865 -180546 67365 -32784 130826 -119050 -137165 101820 202838
10479 202838 -89273 -91292 83635 -47372 262688 -3036 58647 92434 176340 -87442 124271
10467 -67946 63892 -54908 -97643 -51171 8510 -195446 -106541 131223 217799 13074 -156901
10455 38621 -27576 -205473 -199205 109842 12275 -170327 168845 -350757 -80213 -237985 -124542
10444a24542L2065j35811L1954c0836k06236L9603O2879c8655B26833E5079c5532
10432B12393k0740Q4512o3740k6283a13979A56238i9611p9553O6275B16033N4968
10421B71001d5904A0905c38084A66512a39390O7138c0027j43308A9146c52361
10410C1914K02810b36118H1646b0169j30183O3882o8649b3275F5314a48029C988
10398C73188a3412p8074D9774e4045C04867m9427p0510F1858J42489B8232K93308
10387C21540B1959J58052J35300A03432a13481q1072C07722F4014J87268j14991
10377A36291J8604J15204I9232g8601A85044J16839b7421A80762M87655l15558
10367C52859A45704Q46760C9015L37126A84320R478F088J70652q7550P5767k9154
$$ plain form
10444 -124542 -92477 -228288 -196334 -30836 -237072 -197469 -134590 -38655 226833 55079 -35532
10432 212393 191653 276165 212425 186142 -113979 156238 -99611 -179164 -112889 216033 271001
10421 271001 -45904 10905 -338084 166512 -139390 -72252 -30027 -173335 19146 -352361
10410 31914 234724 -236118 81646 -20169 -150352 -86470 -155119 -23275 65314 -148029 3988
10398 373188 -13412 -91486 49774 -54045 304867 255440 184930 61858 204347 28232 321540
10387 321540 21959 180011 315311 103432 -113481 -194553 307722 64014 251282 136291
10377 136291 154895 270099 99232 -78601 185044 301883 -27421 180762 668417 352859
10367 352859 145704 992464 39015 376141 184320 193798 6088 176740 89190 164957 135803
10356A35803j7413J83786b12632d1470A29695K3721J85718n8095D5851P1321J197
10345A18369b93630F8948Q7882j2759J64140A32093E2891h4754E03241A93062
10334D28707H0428L20548G7016k9464L69897j90362N5642a85155C20940J89538
10324E10478A38542b1530k6979B07269a92696B04181F5757P7861a5484k3056a8974
10312a46794O4879A06397J19331a24146d3032o8410I7900h9538r6776M4837o7767
10301b09244C8924E927b93192B66442b35278B32967N9399r7222G3766L10746G3705
10289A51850a37880F9044k2623b45788b1813D0530L40635a87071f3510E3592b30792
10277A68478a53052A7420K091b0448j28113j36216A93196b19029h3670f594A18871
$$ plain form
10356 135803 118390 302176 -212632 -41470 129695 153416 339134 281039 45851 117172 118369
10345 118369 -293630 68948 156830 144071 308211 132093 52891 -84754 503241 193062
10334 428707 80428 400976 77016 47552 417449 227087 282729 -185155 320940 510478
10324 510478 138542 -21530 -48509 207269 -192696 204181 65757 143618 -15484 -38540 -18974
10312 -146794 -81915 106397 225728 -124146 -43032 -111442 97900 -89538 -186314 -141477 -209244
10301 -209244 38924 5927 -293192 266442 -235278 232967 292366 195144 73766 384512 73705
10289 151850 -137880 69044 46421 -245788 -21813 40530 381165 -187071 -63510 53592 -230792
10277 168478 -153052 17420 19511 -20448 -148561 -284777 193196 -219029 -83670 -6594 118871
10265B38463a94797a8994A7531K2428K36023a11756G377K10499B4663J22012a1796
10253B40876B5584f5739E1613r943d8989a9410H7226d6694j20627A1010J22845
10242A33855k1779A7786a37241A4233L28235k7495A1260g1048L2122B56807a13993
10230a36657A6951a78614D4738M9414O752P0212G4303p099a148m60440C37885
10218i722n6164r7296O1667j33340A89100c17237J45956B89942a08054l9506j53734
10207c01294d0936j82347A35445K3167g0287A55837L0925h6632j24608m14611
10197f25851b51730J19919A92204d4584k71825h9466B56035a13379M2004L1092
10187d0283j01148a504A41946a09496A36443a0131j17046J4442A10833E664g7911
$$ plain form
10265 238463 -194797 -18994 17531 39959 275982 -111756 7377 217876 24663 146675 -11796
10253 240876 25584 -65739 51613 41670 -48989 -19410 87226 -46694 -167321 11010 133855
10242 133855 112076 17786 -137241 14233 342468 314973 11260 -71048 -38926 256807 -113993
10230 -136657 16951 -178614 44738 94152 100904 171116 74303 67204 -1148 -461588 337885
10218 -9722 -65886 -163182 -101515 -234855 189100 -317237 -171281 289942 -108054 -147560 -301294
10207 -301294 -40936 -223283 135445 158612 -70287 155837 186762 -86632 -211240 -625851
10197 -625851 -251730 -131811 192204 -44584 -316409 -89466 256035 -113379 -71375 -40283
10187 -40283 -141431 -1504 141946 -109496 136443 -10131 -127177 -112735 110833 5664 -77911
10175b73443I7830J57446a07088K0301m31504b6048H6740a64928j96179a07271
10164A89363R348r530m5680b12238c9151j31733L2506L4800l6538J1102E3205
10152g8430B34995h5895c3295j66483c7236A05290a8410l09091I5834b39463C45635
10140A55449a3283E4977a7077I9530J82078a10680k12938B26833E1553a47483
10129a66574f7944k44627E2998c33963B02522a99341B98332F9457J26783a23991
10118B0296b96074I7338J39533D1841a45556b2222j76551R150g8888L8712B0666
10106d10937a54323b5607j27742b6972A84811C3236a60449G6225O7951a86118
10095c37349b1529m22742K02986A23156g3632r7613A53302D2039C903b34413A43982
$$ plain form
10175 -273443 97830 255276 -107088 -86787 -518291 -26048 86740 -164928 -361107 -107271
10164 189363 198711 189181 143501 -212238 -39151 -170884 -138378 -103578 -140116 -129014 53205
10152 -78430 234995 -85895 -33295 -199778 -37236 105290 -18410 -327501 95834 -239463 345635
10140 155449 -13283 54977 -17077 99530 281608 -110680 -323618 226833 51553 -147483
10129 -166574 -67944 -312571 52998 -333963 202522 -199341 298332 69457 196240 -123991
10118 20296 -296074 97338 236871 41841 -145556 -22222 -198773 -189623 -78888 -40176 20666
10106 -410937 -154323 -25607 -153349 -26972 184811 33236 -160449 76225 144176 -186118
10095 -337349 -21529 -444271 -241285 123156 -73632 -171245 153302 42039 3903 -234413 143982
10083d21547B37046d5270n8014C3571a84102B89913b89892d4927I949a76332h5445
10071I3195p635K90896a44489A29382d3257q804l3032k06563A01475g2917j61502
10060b34419A47843e1286C03853A49037h4164A65670b80157L6428J13927n2803
10050a82605B1890c08550a31382f3013I5559R2857a2491j43154j92005a6561l40778
10039c57339Q9489a04805j20855G3781b0522j53976d903E6671g9806B62689c04157
10027B360R5047c5817a444B34967a38169H3458a82536j30600J8601C3692a11069
10015b81596b9285k81786G7809k3088c5369j35933G1815b44047P4369Q1614k58185
10004c46249J64041o748P0256A2877a2099k57982c0245A45112A3812a45071G4075
$$ plain form
10083 -421547 237046 -45270 -103284 33571 -184102 289913 -289892 -44927 9949 -176332 -85445
10071 93195 85560 376456 -144489 129382 -43257 -52061 -85093 -291656 101475 -72917 -234419
10060 -234419 147843 -51286 303853 149037 -84164 165670 -280157 -243729 -129802 -182605
10050 -182605 21890 -308550 -131382 -63013 95559 188416 -12491 -155645 -347650 -16561 -357339
10039 -357339 -267850 -104805 -225660 73781 -20522 -174498 -4903 56671 -79806 262689 -304157
10027 2360 97407 -35817 -1444 234967 -138169 83458 -182536 -313136 -294535 33692 -111069
10015 -281596 -29285 -311071 77809 54721 -35369 -171302 71815 -244047 -169678 -88064 -346249
10004 -346249 -182208 -188956 -118700 12877 -12099 -270081 -30245 145112 13812 -145071 74075
9992B53494b70622B17721a42187b6164q0626A31810m5991a07219M3954j02174
9982a65439j83015L0071h7446l44436A462e5683j03257p9685i6267A323a63663
9970a54210j33600B70844a14552C4454J45479a85249B91071g0120J6287j24126
9960a77959D41533k20573c76442D0991l047A4913b52663J10700O5027j31432A34997
9948C41683e1899C6871L63003c65381F8216b8360k62097J39138A92062c19129
9937G4566g155D4821A7056Q9316L0897n7315b26133n3057A7370B392O3178a97973
9924A63295c70442a03029e059A3925b48343o0152M0739a4020E7926a47266B42972
9912B3354a2080k79873a18686m6939D6815b50174J20486I3455b10577c2321q749
$$ plain form
9992 253494 -270622 217721 -142187 -26164 -106790 131810 85819 -107219 -63265 -165439
9982 -165439 -348454 -318383 -87446 -431882 1462 -55683 -158940 -238625 -96267 1323 -163663
9970 -154210 -287810 270844 -114552 34454 179933 -185249 291071 -70120 -53833 -177959
9960 -177959 441533 220960 -376442 40991 37944 14913 -252663 -141963 -76936 -208368 134997
9948 341683 -51899 36871 399874 -365381 68216 -28360 -290457 -151319 192062 -319129
9937 74566 -7155 44821 17056 106372 137269 79954 -226133 -279190 17370 2392 65570 -197973
9924 163295 -370442 -103029 -5059 13925 -248343 -308495 -267756 -14020 57926 -147266 242972
9912 23354 -12080 -291953 -118686 -165625 46815 -250174 -129688 93455 -210577 -32321 -41070
9901d1070k67647c3070l3188l65962a46471k45007A29990J05584f2556A19046
9890c83094a10335B5200g3457A08496g9613n9418j30875h0136b8282q4909k72881
9879c86072H4955Q1914E5912K09271A32025J5151d1819A3229L73694a81188e3812
9867B1836b4321m0043A40336a7364B70573E3018h7181B8438b6833k37247O0725
9856b03355g8382c2164B42087a17235j51115f9956F4343J66528G7805c75663A83939
9844a75485C9096O741K95884c00273a15067M2253a0852m1895m08945A08932a7012
9832C8461f0074I5661f02590H581J59042N4086a51589e6933j57928A39102J40931
9821B80033a71646j8965Q0330q8859i712l4228l41545J28626M8571A11731c54629
$$ plain form
9901 -41070 -308717 -33070 -66258 -432220 -146471 -391478 129990 235574 -62556 119046
9890 -383094 -110335 25200 -73457 108496 -79613 -139031 -269906 -80136 -28282 -113191 -386072
9879 -386072 84955 166869 55912 265183 132025 147176 -41819 13229 386923 -181188 -53812
9867 21836 -24321 -64364 140336 -17364 270573 53018 -87181 28438 -26833 -264080 -203355
9856 -203355 -78382 -32164 242087 -117235 -268350 -69956 64343 230871 77805 -375663 183939
9844 -175485 39096 45837 341721 -300273 -115067 -72814 -10852 -52747 -461692 108932 -17012
9832 38461 -60074 95661 -602590 8581 167623 221709 -151589 -56933 -214861 139102 280033
9821 280033 -171646 -190611 -110281 -199140 -9712 -43940 -385485 -256859 -208288 111731 -354629
9809a76592A19316a59605c125j1912k45807D8060Q8394J01321A04754c1970B02102
9797b40662D0452b10013h0472k10122a00101j28238b2785k2329k50550J34480
9787a61184r607p5593G170L6105a39897d3362C56941n5801I3521b2024k2992m89362
9775e34378a52032F4615b85599b2260D12249a8267j41190b2104A51818f1383o0028
9764a21411H0572g8793H9721b73259i0779j03213I256b76728C3393g0441n5604
9753a26045A60814p39J57920a55407C32478a77526j75270f9669m1903j97370C3045
9741c70717k8923C4989b00967E4383c46348C4129b28087j04145A23450a69598
9730C24312b0585l2582m5266F1819h468k6107k27533k0803c4394j60066B5452
$$ plain form
9809 -176592 119316 -159605 -3125 -15037 -260844 48060 136454 237775 104754 -31970 202102
9797 -240662 40452 -210013 -80472 -290594 -100101 -228339 -22785 -45114 -295664 -161184
9787 -161184 -170791 -246384 7170 43275 -139897 -43362 356941 301140 93521 -22024 -45016 -534378
9775 -534378 -152032 64615 -285599 -22260 412249 -18267 -159457 -22104 151818 -61383 -121411
9764 -121411 80572 -78793 89721 -273259 -90779 -193992 9256 -276728 33393 -70441 -126045
9753 -126045 160814 160075 317995 -155407 332478 -177526 -352796 -69669 -111572 -308942 33045
9741 -370717 -399640 34989 -200967 54383 -346348 34129 -228087 -332232 123450 -169598
9730 324312 -20585 -53167 -98433 61819 -8468 -34575 -262108 -282911 -34394 -194460 25452
9718C148J01163d1208p8292d667C9159a94832H9525c4903r2832k5458a8029j49410
9706a67439a7907j1941j19469B40336a91278b9687j7491k51679d2918A92492K74563
9695D67055a58824b5124k3577j09840C0680b88551E4450b00861N2549o5199k445
9684b15956j9263A2559b10459d6704F404K19349G1415a92775k99766c1647l3487
9673f5134C1270c99037M3339c898j17125b9189B25470c3429p0216b2025A17284
9661a9200C9239b50808I344L20031a73434k6386A17756g3597j32528A67265D480
9649b39011e8522j67437c0427r9714e1861A1242c94708a71762b5903A8161J44204
9638A62365b33717i3469I4617g4127D5089K4050d47948K21437J08341B2302J34361
$$ plain form
9718 3148 104311 -41208 -119500 -4667 39159 -194832 89525 -34903 -127735 -153193 -18029 -167439
9706 -167439 -17907 -29848 -149317 240336 -191278 -29687 -47178 -298857 -42918 192492 467055
9695 467055 -158824 -25124 -48701 -158541 30680 -288551 54450 -200861 -148312 -213511 -215956
9684 -215956 -235219 12559 -210459 -46704 6404 225753 71415 -192775 -492541 -31647 -65134
9673 -65134 31270 -399037 -355698 -3898 -121023 -29189 225470 -33429 -103645 -22025 117284
9661 -19200 39239 -250808 9344 329375 -173434 -199820 117756 -73597 -206125 167265 4480
9649 -239011 -58522 -225959 -30427 -130141 -51861 11242 -394708 -171762 -25903 18161 162365
9638 162365 -233717 -93469 94617 -74127 45089 69139 -447948 -226511 -118170 22302 156663
9627A56663a65972d7189I740A451c25544N7959p0453B2408O8492c01356A04547
9615D19442j74922a45514B9304g3054o6188L3846l05615c4618A1212g7369r5984
9604a73353P4426l10614b4791l39247J11266R9441k2645j54406M56a62433A70058
9592c10052A0455L7865i9524l572k92246A9180b26475j02307g1055b1330j15794
9581a37124q9270A00206h4590A64071i8329j49193N8528i485A6152b48548k4744
9570b73292k01105c6566j95235A4680b87548A24865a16329n5052D0165c2921k5447
9559e8368A09991K9757d3666a7566p6289A16052a37578K9059A54698F0155K1805
9548H1960K0646D4960e08658a56042j56545h6392a7650B39959c0263l9625G4930
$$ plain form
9627 156663 -165972 -47189 9740 1451 -325544 -267585 -338038 22408 90900 -301356 104547
9615 419442 244520 -145514 29304 -73054 -139242 -105396 -411011 -34618 11212 -77369 -173353
9604 -173353 -98927 -409541 -24791 -364038 -252772 -153331 -175976 -330382 -329926 -162433 170058
9592 -310052 10455 48320 -99524 -103096 -395342 19180 -226475 -328782 -71055 -21330 -137124
9581 -137124 -226394 100206 -84590 164071 -98329 -247522 -188994 -9485 16152 -248548 -273292
9570 -273292 -474397 -36566 -231801 14680 -287548 124865 -116329 -171381 40165 -32921 -58368
9559 -58368 109991 139748 -43666 -17566 -93855 116052 -137578 -108519 154698 60155 81960
9548 81960 102606 44960 -508658 -156042 -312587 -86392 -17650 239959 -30263 -69888 74930
9536a4675j36021I4349a7654H7685b6427I414P7738a2958F5738b92420c5145E35254
9523b13967N4229m2520i5905n1106G7026P2533a72369J5325A6571d72732C68477
9511c53781C20908h8714l08131B49460G3503P2504b17843j10067a04977G121a04358
9499B759a57115C0647a05745C4914b4891j47588A68759a73224C7772h850E2900
9487A44169a2153I9653a22536l0017q930m8559H5600a82792A35307c52911J16534
9476b36377i1927A08830B4197c51676E1719J83968D3272N8314K7313A3033c44397
9464b33037A18042a20512A1973K41556a27863G5675d21778a01829K383A26820
9453b10057B3635K44077j17829o3161a71716D9381a86390q7231i6601R974m6866
$$ plain form
9536 -14675 -150696 94349 -17654 87685 -26427 9414 87152 -12958 65738 -292420 -35145 535254
9523 -213967 -159738 -202258 -95905 -147011 77026 149559 -172369 -157044 16571 -472732 368477
9511 -353781 320908 -88714 -396845 249460 73503 146007 -217843 -327910 -104977 7121 -104358
9499 2759 -157115 30647 -105745 34914 -24891 -172479 168759 -173224 37772 -8850 52900
9487 144169 -12153 99653 -122536 -152553 -161483 -210042 85600 -182792 135307 -352911 -236377
9476 -236377 -91927 108830 24197 -351676 51719 235687 43272 101586 128899 13033 -344397
9464 -233037 118042 -120512 11973 253529 -127863 75675 -421778 -101829 -99446 126820
9453 -210057 23635 267712 149883 86722 -171716 49381 -186390 -273621 -96601 -86627 -133493
9442a33493j00093B95303e8014k12000F9797f9970k2286C5927M5670J43302i7183
9430a96943C03842j25133b25591p8473N6797A6498d72948f8157n0928e7972B80676
9418I4295L4360D6226g7083a403B48621g3I7124g1826k1848F0986e17380B16281
9405D5551l146a68475n927f1231I6838c0246p9497A16067J31346H5272f5289j89435
9393b54724c6756r1072k46598J1432K7338A99635a89862A98152a62817A44196
9382b36498a00766l43232b9818k87010A58357h8255G6148e83055H845h4706a5086
9370A93819j6359n2690l1161d4536q0155f1035J1928k09031D0612J37540a28648
9358b07294A32408b78826a23202l1213p3425j22285F262J24390J30297d4910j12715
$$ plain form
9442 -133493 -233586 295303 -58014 -270014 69797 -69970 -92256 35927 81597 224899 -97183
9430 -196943 303842 178709 -225591 -304064 -247267 16498 -472948 -68157 -119085 -57972 280676
9418 94295 128655 46226 -77083 -1403 248621 -73 97124 -71826 -93674 60986 -517380 216281
9405 45551 42405 -168475 -174402 -61231 96838 -30246 -109743 116067 247413 85272 -65289 -254724
9393 -254724 -36756 -127828 -374426 -362994 -335656 199635 -189862 198152 -162817 144196
9382 -236498 -100766 -443998 -29818 -316828 158357 -88255 76148 -583055 8845 -84706 -15086
9370 193819 177460 124770 93609 -44536 -124691 -61035 -49107 -258138 40612 178152 -128648
9358 -207294 132408 -278826 -123202 -154415 -227840 -350125 6262 130652 260949 -44910 -157625
9347a57625j2803g3801K2799k03689A3625a95258M1844C910a43700F6988i0779
9335b36955A39011a350r1172c2243k52342A62710b30672D4870g1553q2532D935
9323a13344B4910J43262D6181d56436A58716c3373o5116j90528I539e82158B33651
9311c0052A69239a86904h0308H00a6491r4369k2145j29065P4192A68380d96741
9299B44239b30669B357M6646b18695A08767j1125b09255g5055D35121b5777o1190
9288h6967H6500a18911A35539O3594a5027k13266k6038a13619r6384G3734a15920
9276A94693a32773m693J8828B74458a33891L726j72348m6540I3701J78052j32296
9265A39457Q9634c23331n4859D5346j49L2202L18023h0836I9510c27664a20671
$$ plain form
9347 -157625 -170428 -73801 -51002 -254691 13625 -195258 -153414 3910 -143700 66988 -90779
9335 -236955 139011 -1350 -92522 -32243 -284585 162710 -230672 44870 -71553 -154085 4935
9323 -113344 24910 168172 46181 -456436 158716 -33373 -98489 -289017 9539 -582158 233651
9311 -30052 169239 -186904 -80308 800 -16491 -110860 -133005 -262070 -187878 168380 -496741
9299 244239 -230669 2357 49003 -218695 108767 97642 -209255 -75055 435121 -25777 -86967
9288 -86967 86500 -118911 135539 199133 -15027 -228293 -254331 -113619 -210003 73734 -115920
9276 194693 -132773 -137466 -118638 274458 -133891 -130165 -302513 -349053 93701 271753 139457
9265 139457 229091 -323331 -378190 45346 45197 77399 395422 -80836 99510 -327664 -120671
9253A98140b71635C78449b61458A25030a29711k37582i7889h383k13436o9077
9243b90896e5768J8229A76642G6942h8475a0653m296D5653N2707f2962l27441
9232c90403J45123E6449a3287n5145A78354c02754J26371Q4913j5122I0814a01404
9220g0199j11462g0434k5033a7244A3022b3078k09055L4998D0827L17163B5130
9208b31171J8691B95631a79625g7317A88047D2651J92651n6203e5570l12940C4662
9196D6903b56814i808k5760j1062F6221a42738o4209A70590c56243P0924G2659
9184I3890l1477a9227A16708K5243F4498b22591O0130A17907O2320d7580j83833
9173b31413D6585A7004b16132q6736R7966Q8187A61295a97421A4418a63687p2843
$$ plain form
9253 198140 -271635 378449 -261458 125030 -129711 -367293 -97889 -8383 -221819 -290896
9243 -290896 -55768 -37539 176642 76942 -88475 -10653 -14949 45653 98360 -62962 -390403
9232 -390403 -245280 56449 -13287 -68432 178354 -302754 -176383 -91470 -106592 90814 -101404
9220 -70199 -181661 -70434 -95467 -17244 13022 -23078 -232133 -197135 40827 357990 25130
9208 -231171 -212480 295631 -179625 -77317 188047 42651 235302 179099 -55570 -368510 34662
9196 46903 -256814 -9808 -35568 -46630 66221 -142738 -206947 170590 -356243 -285319 72659
9184 93890 62413 -19227 116708 141951 64498 -222591 -162461 117907 180227 -47580 -231413
9173 -231413 46585 17004 -216132 -302868 -204902 -116715 161295 -197421 14418 -163687 -236530
9162b36530e5804B59293h0403D299J80944a62729k7341D54308b17925e795p3259
9151g9054A21470a74889A38382n858I520c49535a42768A41565F7688J653b21820
9139b54773A9789b01764A46532b69383a28186k27417b6983C92937A35515a59609
9128I7048c42374J48480h0071A93001B1335c10830B20701I0741a4171n7336B65738
9116B3108N732a47543j63809E516b64771M9989j48339H0281O453J88351a76622
9104H7652d6791A87198a02808D1741c46526a63453K1836D6575a54627M4521o521
9093a16627C4463b26069A49443b78450a26441A03827a07326A08843K0728l0217
9083I9354d707A84780F889b30361d801o0925J9278I929P8276O8581E7552a14810
$$ plain form
9162 -236530 -55804 259293 -80403 4299 185243 -162729 -190070 454308 -217925 -5795 -79054
9151 -79054 121470 -174889 138382 132524 9520 -349535 -142768 141565 67688 69341 -221820
9139 -254773 19789 -201764 146532 -269383 -128186 -355603 -26983 392937 135515 -159609
9128 97048 -342374 -193894 -80071 193001 21335 -310830 220701 90741 -14171 -71507 265738
9116 23108 28840 -147543 -311352 5516 -264771 -214782 -363121 80281 86734 275085 -176622
9104 87652 -46791 187198 -102808 41741 -346526 -163453 -141617 46575 -154627 -110106 -116627
9093 -116627 34463 -226069 149443 -278450 -126441 103827 -107326 108843 129571 99354
9083 99354 -4707 184780 6889 -230361 -4801 -65726 -46448 9929 88205 156786 57552 -114810
9070a73711g6257k75419A61534b48491b1695H068a75197n3479J12497L4813a9432
9058a21613e0658B57279E6906c0910A97142c25946d013j40137M164F3943b29421
9046a70274H4569a79560A5491b68527R8439A66683G4201a31143B960a31200l2219
9035a63419j92151a67009A62544a97057G3174b472A86384R5527a33007a6066j04599
9024a20665j03077f1377C9869c4770D9984J16342q0956J20228n8592a77427h4394
9012c6084j560J3531j12620A24295A9185J8920i738A09558d0551j42450D192J68538
9000A72730a58518p0945c2167j9193k7178b6250D6789b05819c7879k3316j939
8989f3134e881j40369F8670J20616F579J51757b394B14104G284P5795b53644A86371
$$ plain form
9070 -173711 -76257 -351676 161534 -248491 -21695 8068 -175197 -228676 -116179 -81366 -19432
9058 -121613 -50658 257279 56906 -30910 197142 -325946 -4013 -144150 -139986 63943 -229421
9046 -170274 84569 -179560 15491 -268527 -170088 166683 74201 -131143 2960 -131200 -163419
9035 -163419 -355570 -167009 162544 -197057 73174 -2472 186384 281911 -133007 -16066 -120665
9024 -120665 -223742 -61377 39869 -34770 49984 166326 85370 205598 147006 -177427 -84394
9012 -36084 -37644 -24113 -136733 124295 19185 38105 -9738 109558 -40551 -183001 4192 172730
9000 172730 -158518 -229463 -32167 -51360 -78538 -26250 46789 -205819 -37879 -61195 -63134
8989 -63134 -5881 -146250 68670 189286 6579 158336 -2394 214104 7284 83079 -253644 186371
8976b16213B00532b88391c9100k45918a29260L0820l9982j56589B8184a52728
8965c39565c4427r7132b34j56836J6273k18854a35561A58832i8823m46908J52402
8954c93329g3257j98304B75707A12084J2025d4643A52849E0835J72641L9832B5425
8942h5236A77923N88a50393M0169G4031M2026L2852J40022A15664a37000k50498
8931c87498g3144k55582C6118g3406K2204A49505N10723K75117J492372O982773
8921I410490o50557A861407F15145B39958N1120m4834a88296f5979A80171a99624
8910A00413b302B29047J86220j40112a06279d8500O449j46632d9570C9670a64150
8898A57742K07323c50846K0397J61790H9129R9532D9417a59831G5374h2870c8794
$$ plain form
8976 -216213 200532 -288391 -39100 -285018 -129260 -98440 -138422 -295011 28184 -152728
8965 -339565 -34427 -131559 -234 -157070 -140797 -359651 -135561 158832 -98823 -545731 -393329
8954 -393329 -73257 -271561 275707 112084 124109 -44643 152849 50835 223476 263308 25425
8942 -85236 177923 178511 -150393 -110224 74031 116057 148909 288931 115664 -137000 -387498
8931 -387498 -73144 -328726 36118 -73406 -51202 149505 660228 935345 2427717 9410490
8921 9410490 8759933 1861407 615145 239958 291078 246244 -188296 -65979 180171 -199624
8910 100413 -2302 229047 415267 275155 -106279 -48500 -42051 -188683 -49570 39670 -164150
8898 157742 365065 -350846 -330449 -168659 89129 188661 49417 -159831 75374 -82870 -38794
8886A60794a43755e6771B36331a94329h3755l5552p9558h1375b0757k44180k5407
8875b90344e4159k5540r6299l54119h5033E7346J68991n4535k3146j8666a84897
8863D8516i2934j04557k51972A98136a54017j9849A679c00925r6845J18056i5095
$$ plain form
8886 160794 -143755 -56771 236331 -194329 -83755 -119307 -198865 -81375 -20757 -264937 -290344
8875 -290344 -54159 -79699 -175998 -530117 -85033 57346 226337 171802 148656 129990 -184897
8863 48516 -92934 -197491 -449463 198136 -154017 -173866 1679 -300925 -397770 -279714 -95095
$$ [...]
##END NTUPLES=NMR SPECTRUM
##END=
