
##TITLE=AC1228_VIERSDE097_6075064_qxoipnyZqV
##JCAMPDX= 6.0         $$ Bruker NMR JCAMP-DX V2.0
##DATA TYPE= NMR SPECTRUM
##DATA CLASS= NTUPLES
##ORIGIN= BRUKER
##OWNER= Administrator
$$ 1.72 TOPSPIN		Version 2.1
$$ 2012-05-08 22:30:12.968 -0500  Administrator@TOPSPIN
$$ Compression mode = diff/dup
##.OBSERVE FREQUENCY= 400.13188235
##.OBSERVE NUCLEUS= ^1H
##.ACQUISITION MODE= SIMULTANEOUS (DQD)
##.ACQUISITION SCHEME= undefined
##.AVERAGES= 8
##.DIGITISER RES= 22
##SPECTROMETER/DATA SYSTEM= spect
##.PULSE SEQUENCE= zg30
##.SOLVENT NAME= COFFEE_meoh
##.SHIFT REFERENCE= INTERNAL, COFFEE_meoh, 1, 14.98061
##AUDIT TRAIL= $$ (NUMBER, WHEN, WHO, WHERE, PROCESS, VERSION, WHAT)
$$ ##TITLE= Audit trail, TOPSPIN		Version 2.1
$$ ##JCAMPDX= 5.01
$$ ##ORIGIN= Bruker BioSpin GmbH
$$ ##OWNER= Administrator
$$ $$ C:\Bruker\TOPSPIN/data/COFFEE/nmr/AC1228_VIERSDE097_6075064_qxoipnyZqV/20/pdata/1/auditp.txt
$$ ##AUDIT TRAIL=  $$ (NUMBER, WHEN, WHO, WHERE, PROCESS, VERSION, WHAT)
(   1,<2012-05-08 22:30:05.984 -0500>,<Administrator>,<TOPSPIN>,<go>,<TOPSPIN 2.1>,
      <created by zg
	started at 2012-05-08 22:28:59.500 -0500,
	POWCHK enabled, PULCHK disabled,
       configuration hash MD5:
       AF F2 23 6B 01 CD 40 DD E5 A1 38 A0 06 EA F7 77
       data hash MD5: 64K
       0B AF E6 AB D9 B7 F3 44 77 6D 54 EA 6B 4F 2A 1B>)
(   2,<2012-05-08 22:30:08.562 -0500>,<Administrator>,<TOPSPIN>,<proc1d>,<TOPSPIN 2.1>,
      <Start of raw data processing
       efp LB = 0 FT_mod = 6 PKNL = 1 PHC0 = 0 PHC1 = 0 SI = 32K 
       data hash MD5: 32K
       C3 BD CE 99 C5 FD 19 AA 99 10 70 C5 9F E2 B0 BF>)
(   3,<2012-05-08 22:30:09.000 -0500>,<Administrator>,<TOPSPIN>,<proc1d>,<TOPSPIN 2.1>,
      <pk PHC0 = 209.7729 PHC1 = 0 
       data hash MD5: 32K
       54 76 57 87 DD C4 13 89 46 B5 2A 5A 0E C8 7F 26>)
(   4,<2012-05-08 22:30:09.078 -0500>,<Administrator>,<TOPSPIN>,<proc1d>,<TOPSPIN 2.1>,
      <abs ABSG = 1 
       data hash MD5: 32K
       BF 4E 59 8F B3 B5 C0 B9 F8 55 8D 8E E8 63 5F B1>)
(   5,<2012-05-08 22:30:09.109 -0500>,<Administrator>,<TOPSPIN>,<proc1d>,<TOPSPIN 2.1>,
      <abs ABSG = 2 
       data hash MD5: 32K
       BC 8F E7 0E 4B 4C 85 42 91 0B DD 32 29 C8 70 62>)
(   6,<2012-05-08 22:30:09.140 -0500>,<Administrator>,<TOPSPIN>,<proc1d>,<TOPSPIN 2.1>,
      <abs ABSG = 3 
       data hash MD5: 32K
       7C 77 68 98 2D 5E 5D 56 4E 34 05 A1 49 DE 48 AD>)
(   7,<2012-05-08 22:30:09.171 -0500>,<Administrator>,<TOPSPIN>,<proc1d>,<TOPSPIN 2.1>,
      <abs ABSG = 4 
       data hash MD5: 32K
       F9 5B 83 B5 01 36 B7 9C 02 12 E4 4C D2 68 F9 F4>)
(   8,<2012-05-08 22:30:09.203 -0500>,<Administrator>,<TOPSPIN>,<proc1d>,<TOPSPIN 2.1>,
      <abs ABSG = 5 
       data hash MD5: 32K
       B8 8B B3 77 A1 2A E2 A0 5B 52 87 B0 D1 7D C4 A1>)
$$ ##END=
$$ 
$$ $$ hash MD5
$$ $$ E2 64 87 9D FA 61 D9 3D 8F 84 7F B3 23 96 D0 20
##$RELAX= 
##$RELAX= 
##$RELAX= 
##$RELAX= 
##$RELAX= 
##$RELAX= 
##$RELAX= 
$$ Bruker specific parameters
$$ --------------------------
$$ [...]
##$TP= (0..7)
150 150 150 150 150 150 150 150
##$TP07= 0
##$TPNAME0= <>
##$TPNAME1= <>
##$TPNAME2= <>
##$TPNAME3= <>
##$TPNAME4= <>
##$TPNAME5= <>
##$TPNAME6= <>
##$TPNAME7= <>
##$TPOAL= (0..7)
0.5 0.5 0.5 0.5 0.5 0.5 0.5 0.5
##$TPOFFS= (0..7)
0 0 0 0 0 0 0 0
##$TUNHIN= 0
##$TUNHOUT= 0
##$TUNXOUT= 0
##$USERA1= <user>
##$USERA2= <user>
##$USERA3= <user>
##$USERA4= <user>
##$USERA5= <user>
##$V9= 5
##$VALIST= <valist>
##$VCLIST= <CCCCCCCCCCCCCCC>
##$VD= 0
##$VDLIST= <DDDDDDDDDDDDDDD>
##$VPLIST= <PPPPPPPPPPPPPPP>
##$VTLIST= <TTTTTTTTTTTTTTT>
##$WBST= 1024
##$WBSW= 4
##$XGAIN= (0..3)
0 0 0 0
##$XL= 0
##$YL= 0
##$YMAX_a= 536712
##$YMIN_a= -656620
##$ZGOPTNS= <>
##$ZL1= 120
##$ZL2= 120
##$ZL3= 120
##$ZL4= 120
##$ABSF1= 14.98061
##$ABSF2= -5.57192
##$ABSG= 5
##$ABSL= 3
##$ALPHA= 0
##$AQORDER= 0
##$ASSFAC= 0
##$ASSFACI= 0
##$ASSFACX= 0
##$ASSWID= 0
##$AUNMP= <proc_prof1d_extract_pilot.lims>
##$AXLEFT= 0
##$AXNAME= <>
##$AXNUC= <1H>
##$AXRIGHT= 0
##$AXTYPE= 0
##$AXUNIT= <>
##$AZFE= 0.1
##$AZFW= 0.1
##$BCFW= 0
##$BC_mod= 0
##$BYTORDP= 0
##$COROFFS= 0
##$CY= 15
##$DATMOD= 1
##$DC= 0
##$DFILT= <>
##$DTYPP= 0
##$F1P= 0
##$F2P= 0
##$FCOR= 0.5
##$FTSIZE= 32768
##$FT_mod= 6
##$GAMMA= 0
##$GB= 0
##$INTBC= 1
##$INTSCL= 1
##$ISEN= 128
##$LB= 0
##$LEV0= 0
##$LPBIN= 0
##$MAXI= 10000
##$MC2= 0
##$MEAN= 0
##$ME_mod= 0
##$MI= 0
##$NCOEF= 0
##$NC_proc= -8
##$NLEV= 6
##$NOISF1= 0
##$NOISF2= 0
##$NSP= 0
##$NTH_PI= 0
##$NZP= 0
##$OFFSET= 14.98061
##$PC= 1
##$PHC0= 209.7729
##$PHC1= 0
##$PH_mod= 1
##$PKNL= yes
##$PPARMOD= 0
##$PPDIAG= 0
##$PPIPTYP= 0
##$PPMPNUM= 2147483647
##$PPRESOL= 1
##$PSCAL= 4
##$PSIGN= 0
##$PYNMP= <proc.py>
##$REVERSE= no
##$SF= 400.13
##$SI= 32768
##$SIGF1= 0
##$SIGF2= 0
##$SINO= 400
##$SIOLD= 32768
##$SPECTYP= <>
##$SREGLST= <1H.CDCl3>
##$SSB= 0
##$STSI= 32768
##$STSR= 0
##$SW_p= 8223.68421052632
##$SYMM= 0
##$S_DEV= 0
##$TDeff= 65536
##$TDoff= 0
##$TI= <>
##$TILT= no
##$TM1= 0
##$TM2= 0
##$TOPLEV= 0
##$USERP1= <user>
##$USERP2= <user>
##$USERP3= <user>
##$USERP4= <user>
##$USERP5= <user>
##$WDW= 1
##$XDIM= 32768
##$YMAX_p= 451311557
##$YMIN_p= -688375
##$CURPLOT= <Network HP LaserJet P1505>
##$CURPRIN= <$Network HP LaserJet P1505>
##$DFORMAT= <normdp>
##$LAYOUT= <+/1D_H.xwp>
##$LFORMAT= <normlp>
##$PFORMAT= <normpl>
##$SURQMSG= 1
$$ End of Bruker specific parameters
$$ ---------------------------------
##NTUPLES= NMR SPECTRUM
##VAR_NAME=  FREQUENCY,     SPECTRUM/REAL,   SPECTRUM/IMAG
##SYMBOL=    X,             R,               I
##VAR_TYPE=  INDEPENDENT,   DEPENDENT,       DEPENDENT
##VAR_FORM=  AFFN,          ASDF,            ASDF
##VAR_DIM=   32768,         32768,           32768
##UNITS=     HZ,            ARBITRARY UNITS, ARBITRARY UNITS
##FACTOR=    0.250966925370066, 1,           1
##FIRST=     8223.43324360095, -260849,      -43272
##LAST=      0,             -36703,          -168575
##MIN=       0,             -688375,         0
##MAX=       8223.43324360095, 451311557,    0
$$ Real data points
##PAGE= N=1
##DATA TABLE= (X++(R..R)), XYDATA
$$ [...]
23820 -219805 -357936 15283 18747 -62220 -23410 -303993 -572311 -53071 -287844 62899 212899
23809 212899 282415 -70535 35815 117608 -51356 -113441 45355 181396 -156411 -15748 -84088
23798 -84088 119814 150094 -344570 29888 -76151 219643 21286 -5561 -250902 -11316 -113106
23787 -113106 264581 -467353 -365165 -170394 -289015 -277730 -67068 -157669 147111 80152
23777 80152 -122019 -290467 100829 -8000 -202663 -299722 301540 -314951 -140357 -28842
23766 19621 -137426 -108747 119959 74500 33756 -153101 -254833 -492070 303182 -42430
23755 -26826 -26067 83768 -17967 457996 20339 221665 40751 -226684 -108995 112919 153926
23744 153926 -108255 -220438 -182013 228 -41409 -5705 -184990 114616 -86472 80625 8976
23732 239387 74165 -236432 -169282 18681 214066 36600 80410 -232766 42371 66716 -345145
23720 72035 29729 -355974 -229150 -268190 -35449 -180164 -15774 -141132 -164005 -363660 63650
23708 166706 321079 69907 -126665 -91667 -58619 309828 47922 36295 -68860 -92718 -126121
23697 -126121 86366 -132146 -5960 -57225 330696 56240 -61131 123508 -165729 127002 14359
23685 58970 -29443 -364660 183633 250478 -15056 -59046 -393378 122581 -167049 205408
23674 -92447 -110882 -275039 117896 45472 96215 -72859 -77343 95626 293557 273353 92616
23662 -62539 185693 6169 168903 -112494 1035 -326483 10833 -39397 95395 -123457 -205027
23651 -205027 -302540 49311 -10224 -93279 295496 -102343 -153150 100477 -44223 -51576 226834
23639 26199 232996 -132427 -22815 -238750 116498 -1988 -229544 -27828 37881 -172327 -64345
23627 -2074 7240 -11814 -206971 136154 271557 101570 -309241 -68464 -68999 78362 -426808
23615 -135760 194888 -175170 -141813 -117283 -150022 334 12931 -120885 -7995 171704 -262949
23603 -108315 -24049 272804 235563 -197213 -22023 -35506 163076 132272 183833 -52150 129244
23591 41977 387980 -76736 -44006 105648 -103005 -87422 182862 -43010 197833 181217 -5797
23579 205741 -53978 374271 90969 390945 163571 -73683 -188300 -169491 74708 -128115
23568 -190138 -282265 189668 -65919 -169751 126135 35557 -214905 -119861 13044 131737
23558 131737 -22268 -23943 184510 -196710 -4730 4300 -320781 -70947 203083 -326611 -48519
23546 47812 139939 -130215 39859 144849 -3278 58517 -91037 229066 192677 -173556 158296
23534 157092 -57059 -194308 182644 81922 -162630 -62240 250931 -215867 304723 144714
23523 117313 97092 -150833 -50147 262448 55403 -104545 -146141 -97444 259539 349086 -511571
23511 -62656 -260130 -134679 51711 -56239 -29487 23817 38968 -236471 -87160 46362 -223389
23499 305 -80661 -201240 -194526 -117752 -48052 -210843 111180 -56068 64247 504571 141466
23487 -169219 332770 -39298 4878 47732 129050 107880 211782 125235 61721 138183 -124913
23475 -254704 236233 -17833 -109029 -128077 59313 23864 -105076 26436 -300219 267565 88993
23463 131669 -79412 -256654 22957 195905 -384015 56149 -123819 -48988 66755 -64917 30755
23451 -96181 193829 -148975 -26987 -243538 -108111 -300107 151612 -136547 33481 -244634
23440 -51273 -169788 -178655 -4665 20258 182124 -103659 -77639 -61617 79042 -284361 114702
23428 -77133 -421404 80884 -126688 38413 69839 199123 -250068 155186 -78520 -117710 90965
23416 132747 233399 356579 -84722 -2317 -347564 -142945 -178638 -99330 -2415 -140418 -88050
23405 -88050 -85930 80915 167535 68665 -42111 -30833 239193 -239890 -48348 -8808 139844
23393 -56428 200565 -161361 187817 -314078 -25725 84058 -112798 -56757 -31853 -148773
23383 -148773 -69955 -116888 -127064 88754 -89477 80914 120114 -196611 -298448 -25978 -83962
23372 -83962 43763 174455 -249409 26908 33361 104925 -97230 -149456 -6090 -214182 277185
23360 475853 113623 -130514 -115957 -89011 13235 -364382 33535 -153639 66799 -106054
23349 -217479 -28973 -3001 -459720 -48834 -22918 -121828 633 126508 131477 10980 200130 -103662
23336 -224017 8446 47415 213482 -169606 -115404 111130 11822 -248559 14470 151126 -101982
23324 -156777 121114 -8150 181646 -103847 114947 75901 497819 -140109 171601 -71459
23313 -63271 281946 -76031 163102 21357 -43015 -81260 -107700 -82257 48250 -184475 -77574
23301 -125855 151459 193271 -268601 64270 -96652 58471 -361510 -54780 -212516 -6369 -199525
23290 -199525 -161398 4182 3672 79652 -145915 69305 -44041 153722 85677 184517 264440 -97939
23277 158629 -87229 39975 44297 -28968 -437772 -97848 -75986 171297 -160040 156965 -175305
23265 -427364 -15552 -247954 -232426 52801 8111 133467 -125276 84577 -165696 -149385 -184980
23254 -184980 85325 39340 -186855 138227 252226 281373 184472 -85380 -284773 112920
23243 71339 -144313 249895 -210452 -8380 227815 -193594 272014 102209 154380 -389872
23232 -164162 16037 93680 -38242 -40949 -8370 -16972 -162696 -222817 -358738 78124 186458
23221 186458 -181648 105265 -18683 -369956 31279 -152188 -365683 -204856 -110720 -85438
23211 -85438 -222579 45457 -284275 -412372 -56353 124672 -367078 -301375 56920 119144 -71352
23199 -228152 -124849 -170071 87523 361508 28710 -178760 239098 -16489 48632 -133714
23188 -111283 -142330 -184292 66675 208624 -137607 -98547 -24327 261880 129431 123169 -116720
23176 93389 56716 14886 19693 76142 -179984 -129684 109938 -332737 512557 -1665 -276879
23165 -276879 -77022 -53695 -8661 82473 -98325 -44012 -528207 -42487 291206 -226916 37100
23153 -88225 63994 -81505 112190 -154407 168389 124512 268345 252601 35409 -220900 52482
23141 -219955 -102022 207257 59996 -115672 122131 -227682 -133149 13135 -261508 -22778
23130 -31798 -218357 -264380 -80750 249256 90161 -125319 132955 98238 -43428 25819 -75276
23118 16641 -256975 2711 38574 127468 -75182 185257 -131512 205348 51621 50141 -80730
23106 251852 111574 207113 -182027 -201435 -77806 115412 -213701 -105096 -105693 -90382 119101
23094 349210 -92141 -90816 73950 61807 -170332 301578 214964 81283 -110759 213650 105967
23082 -170898 290489 -1093 156042 -25964 -162589 179677 -957 39316 -48273 -310290 -97802
23070 -173475 -64076 -68188 -153527 -70721 -38585 41846 -65796 -16999 66509 197534 -210623
23058 39689 241438 -115956 -73689 83052 211622 66875 201368 -126035 49633 -106100
23047 -402718 57964 197236 -28656 25996 -67153 -52051 -181675 41143 188374 217060 -252960
23035 -240986 19866 -7940 152158 -13463 -142770 -16638 42428 -28866 -86390 212074 23337
23023 -32787 -131700 177594 204676 -75422 49384 37003 94209 89317 -95746 55068 -12955 -223450
23011 -223450 118365 171744 52488 -174689 318304 -46254 -276580 193276 74622 -79468
23000 -213935 281741 -108154 73346 -101651 50048 -284671 -263268 -26016 -126243 -53827
22989 -141428 -94651 32629 -160705 -298388 -312719 -65299 265779 -36879 23915 -172945 133245
22977 78012 319783 -483983 340783 53728 146846 -67257 92881 -421323 95840 235691 -389114
22965 -74150 -94428 227081 331019 93276 -38604 -136946 -35304 -267770 -188228 237997 -167570
22953 256876 267797 50256 -327502 268235 -148688 -126767 -47417 83245 8003 172064 -187749
22941 78925 -155612 -5483 -124467 70765 117674 193310 118576 -291900 189709 -221291 -137216
22930 -137216 43772 -198243 -112536 -164518 -128197 196359 -179303 139450 -401491 -85071
22919 36673 198812 -89576 -120363 -119760 175661 128356 7771 -220851 81069 -95455 149032
22907 -92639 66828 50651 -88070 -370957 -65554 -27632 -82395 -282059 160092 98641 -169705
22895 -113711 -145438 -51928 21633 18626 -187711 217591 -109477 101729 -65782 -215490 -20148
22883 -291365 94410 -30869 -147055 -76960 -262255 4291 228442 23275 -132689 317255 58291
22871 -42111 151780 6408 -104412 -191835 -156146 -13194 -259968 -6690 -19386 -119812 -111615
22860 -111615 -135545 -164234 -216269 -189547 -220074 -101250 -155943 -184800 27535 49013 91042
22849 91042 24578 127955 134054 -47758 -78233 6402 -152484 -139689 101988 67979 -64150
22837 -147704 -80821 -178442 51176 123973 -33784 197108 -301157 -285524 102750 -120505 -236134
22826 -236134 -46140 65629 199801 -136759 1057 -130660 26456 -76404 -109878 -234652 -59687
22814 -412801 -229197 113355 78331 13009 196198 -21339 82514 -78704 183963 68443 335128
22803 335128 -195064 -26945 -64492 95696 -90677 114297 -316985 -81884 -44604 80125 53490
22792 53490 -63382 57815 -121958 67143 128161 -45960 71829 -4468 -110958 55414 -173947
22780 178923 -199770 44497 -136912 -62671 -243802 243882 -90909 202243 -340468 -35290
22769 216892 -185082 -23965 -16694 162810 -21582 -262818 201824 159174 -25114 307624 -171314
22757 -153575 -144635 -6714 -179605 236225 -11981 -90253 76854 110507 -26580 -424066 -22755
22745 -480702 86255 -20161 -70447 83251 -331341 -19467 -205364 -257482 566132 -160765 188951
22733 -60527 -66986 275481 -309270 -537665 41069 -340960 217376 -22247 -136113 -478079
22723 -478079 188919 290338 -203201 -432177 47925 -134978 -181821 16089 -66537 26191
22712 -356456 -95488 -2154 -86785 137425 -341593 279836 151323 -19797 22059 -207252 -7908
22700 -11266 -186580 -22959 -97013 56206 -37350 4527 -303330 -150350 -115999 -186403 9308
22688 167304 169613 -170778 -208069 38923 -305765 -78416 22178 46302 224698 69580 -69246
22676 68036 23461 14823 -106018 -119385 196221 5130 -148437 56934 83862 101358 -24434
22664 358659 -285679 120191 -72529 83394 -60372 163592 -175485 349643 68545 142256
22654 142256 -175808 -79325 -162927 -43449 123531 -240869 -170619 -75180 -9332 -75722 -92273
22643 -92273 -377 50524 12218 -59220 -204099 241537 195495 219711 -313470 2101 -82202 26751
22630 -58943 120118 -258002 14855 -354678 -150261 209037 -17473 237840 -96755 -212932
22620 -212932 73109 -468508 79987 -201750 83888 228568 -260177 -74645 -141925 -42199 -104727
22609 -104727 -56435 174239 -234675 321278 -32752 -209480 -114994 1828 192024 36201 -99369
22597 -333139 -91149 15757 -186157 244707 160093 -78861 -115168 -224406 198401 -44309 -44237
22586 -44237 -211702 -36608 110549 -177182 20109 83965 -352494 154845 -197733 -172306
22576 -172306 107638 -61968 -36795 86214 -141737 -229941 7672 -355115 -153999 66679 -277864
22564 -160774 -132740 218037 209717 54854 -113984 -146630 -107629 -92159 82771 34486 -60207
22552 -89091 293943 97587 136570 36017 88541 12625 -111283 -74355 -240929 73502 43044
22541 43044 374 -54241 -45783 194003 -23126 -200570 119523 168689 -24300 -130076 -24114
22529 -266866 -332020 278746 -157306 4625 -301281 9789 -344416 -188648 132316 29257 92663
22518 92663 -5790 -25067 75478 -89108 -98224 -14811 -113721 -15904 185919 -318419 -383 -45562
22506 -45562 67357 188063 264205 -148668 91356 -146903 3555 -125057 21189 -139583 -30788
22494 149603 67153 -78076 -235222 -345882 21976 109154 213886 251416 -196909 -372302
22484 -372302 -59679 -87904 -664974 712 68032 151388 -47148 -46007 -3505 -25531 -126652 -37865
22471 -54901 66460 -209255 -13217 213824 -41158 198787 76979 -389747 136627 -82154 19376
22459 41415 118153 -260291 -28820 -158668 -47275 79146 344750 -90808 33043 349908 -190097
22447 -109281 -440180 -29199 345505 113607 -236915 -256429 -88756 51610 -32643 -35575 -98330
22436 -98330 -221608 20855 13568 -283852 148525 -9068 160320 -351885 -78263 10700 -42961
22424 26397 194610 -160185 143228 -82806 47223 -276796 103752 -173723 -45660 -173204
22414 -173204 -143030 160245 -234561 -42347 -5203 -271025 161948 -158461 -205904 -149423 -112640
22403 -112640 273903 -98622 -83180 -124586 88494 159836 -222495 -112999 -19720 171386 33004
22391 119704 117966 -138719 110510 -38800 -56289 -442852 31302 -327826 62009 55534 -73129
22379 -87789 113754 248002 20234 -180148 27446 -204136 -31993 -14002 -204004 -259465 -33916
22367 8690 71390 -349329 129529 248872 27863 322980 148176 -225483 -228592 -384442 -317645
22356 -317645 -308238 -35567 -211386 -56159 -462381 100121 -272444 115277 249038 -127151
22345 164904 140603 -255913 104412 -158114 -30844 -182241 -41935 -30853 -8056 112379 -172833
22333 194616 30081 152562 -163156 -238768 -64142 210316 171602 358979 -221745 -498612
22323 -498612 -251692 -374499 10526 -58792 -64467 -194736 -13043 -142014 13601 216623 -206031
22311 -223002 83922 -224492 172000 -14049 -278842 54295 272732 -46447 -4320 151301 -230797
22299 -142406 52189 -222314 -146037 -157277 -164339 332458 129011 -220353 -60316 281262 -197155
22287 -75947 73775 184967 61829 -17179 -109850 -145985 -8249 -53759 -86732 314051 -43852
22275 -83337 -286930 478101 -9234 53970 -83698 -11870 -96696 26399 -18363 313705 285044
22264 285044 61058 -147672 267153 184338 32650 -154737 53500 -230183 151562 223106
22254 223106 -65628 -258297 137382 67373 -255684 -71906 -6041 63798 -28726 -137128 230639
22242 -305631 -65181 -331629 -327856 283233 139330 -135841 -1771 -68022 -34460 109485 249046
22231 249046 143586 -188563 -62723 -332722 -80702 -241915 -68697 -64013 -283166 -149486
22221 -149486 180621 -183144 -7293 29820 329469 -53429 -142109 111147 -98477 -2896 -43877
22210 -43877 -127226 63982 -51472 -79850 245316 -59442 80259 338241 -374894 -118612 231350
22198 318107 -165383 65450 104121 -228312 120679 -108044 -46629 -83076 44235 125080 -91143
22186 -46818 -199050 85448 105087 110176 -162085 150060 179524 -38257 -8564 -31029 -140408
22175 -140408 -91587 164904 38200 -44791 -15193 -152146 46775 -175727 -165409 -113372 46133
22163 -89428 -72110 -324792 -127665 -47441 -45685 -244706 10864 -280722 20326 109423 -52796
22151 79029 -100519 -52696 -147004 -45968 44982 18601 22580 -45601 -195330 86682 -148866
22139 120203 57417 205135 -45737 -24202 -97672 -66672 -108982 -96500 -257144 57070 43428
22128 43428 61557 -100691 -125554 -21722 -262951 -1189 -332040 45210 125330 -175099 229575
22116 -161623 60053 -256923 66514 94842 -118688 130639 141264 -270500 216503 -480280
22105 -359026 -119052 43565 -46337 97261 95279 -69375 203751 -34570 -149667 -81095 20766
22093 -159596 -126320 23699 -88297 -205068 90519 -64058 -277895 -238065 265131 180451 -90491
22081 130904 -243292 -74690 -346544 110323 -51727 -18208 100597 103523 -253631 -42836 183333
22069 157626 -189773 -17504 -199889 8888 101169 121970 -65936 123433 271614 -99583 -307741
22058 -307741 44764 -9065 -69831 -305246 -108724 269830 -50009 94555 207726 36127 4347
22046 -175033 187759 15875 -134252 218117 303683 214747 -24605 -28444 -10338 54933 41543
22035 41543 -240342 28072 -186173 194219 -297032 4459 -63318 -59365 347881 194151 273789
22024 273789 -64711 -189558 178338 -73148 -704 -106115 64370 232979 -258642 -311976 -266798
22013 -266798 -168447 -12496 292589 -183089 -111333 40000 116736 -195696 79194 82167 -344493
22001 -194973 -23089 107130 27203 -191077 32614 -76022 -1726 327980 -92891 -155773 44787
21989 -150769 -128779 23566 -138900 70657 329802 -194077 31807 5916 82831 -168175 133827
21977 22604 -59688 71151 -12604 63756 -292587 125262 -111907 -282786 -44552 -174158 17773
21965 -31118 94139 -154991 -41464 -72961 -322903 191246 53701 -120542 82676 -70450 -211069
21954 -211069 -311460 29444 49129 -203971 -108266 85816 190544 -79212 -98752 -70357 85589
21942 -162366 350114 227285 -99388 5437 -43190 -110504 -200018 -25053 -401454 30691 -100524
21930 -159030 -318392 -43223 12027 171976 -215149 56049 239459 -7804 -76646 163920 -209296
21918 439946 190628 -115487 -342847 97743 85847 -343929 -109160 -36922 -210955 218479
21907 310039 95226 71885 -29544 -16834 57937 37795 -255918 -118622 -49808 18686 -113038
21895 -169520 21374 100804 2092 -33485 6904 -238747 62957 393139 -129669 -427337 -207607
21883 -234915 62115 -368315 7871 39413 -264522 -229370 62918 -4279 67816 222877 -232879
21871 -1559 -141043 -386641 184227 -16270 -84993 107990 -4495 200575 -160137 52660 -99740
21859 250841 -316680 -60406 142174 -84659 75765 -166751 -103969 -73628 29126 46406 -99628
21847 -433365 175737 230534 42751 -26740 61816 -253658 218522 -64165 -315323 -242713 58747
21835 -102034 -337583 -63858 -167196 -33626 130828 206736 -268401 72562 -52465 7105 107322
21824 107322 -263143 -310192 -80535 -161108 29046 48570 -44238 -153208 -67381 -179390 124292
21812 15973 -200886 -9012 -82429 43085 -221376 -203043 41035 6419 -66986 93952 157422 -28847
21799 201874 -107566 292736 29412 -185082 -76179 -72626 91322 -115772 42382 -605240 -197570
21787 -198035 3583 -133238 -124037 169907 113238 134097 37520 92736 -332637 -81549 157040
21775 1795 71915 -106541 22485 -165404 112729 110389 -12383 -23982 -42939 -224055 272777
21763 -532913 -46966 -11530 50693 189418 196499 211645 -52791 94274 -115478 71327 254007
21752 254007 -204361 -92215 8090 33333 -107371 -105921 139536 -8863 -235558 -22277 29910
21740 -74866 178799 -2271 224068 -15949 129679 52440 105522 180339 -222441 76117 -102894
21728 -242585 84669 -183091 18418 -228395 -171541 345142 44134 13501 -93845 62202 -358348
21716 -177402 -167085 18311 100035 71121 -94542 -156468 -87719 -326036 2567 -162923 -325306
21705 -325306 -279820 -140396 42612 -71125 -350733 153611 4474 -208541 -118675 -85742 -19470
21693 41008 86928 15336 -226728 -48997 260484 220494 94330 270961 366319 12350 -80022
21681 162488 -126315 121921 -461315 160136 -366168 -222305 -278279 -130991 -57168 -105355
21671 -105355 60480 298806 -199660 -131424 47282 -246559 3155 -108020 -109880 -118451 -182210
21660 -182210 -41897 -188717 -163575 80504 -28338 -90348 40771 22046 -41243 -200052 -2728
21648 -229613 152812 208879 -177560 351368 -405473 -18665 -313523 -374630 -59345 -229967
21638 -229967 192872 -52099 4291 -222181 -76005 -71632 -181402 -80408 -316885 -3692 10463
21626 2966 77906 -166958 -199648 -97819 14912 186354 119764 147879 -174130 121640 38329
21614 -134230 302222 -144537 -166 -341567 -104748 -69625 28266 39897 116064 -43557 150799
21602 62177 133943 17952 -40631 -20144 -67401 -63365 61953 -33001 128616 -110512 -202648
21591 -202648 -188174 -3837 -435733 73075 -13201 -86504 -178184 -256477 198811 106926 132192
21580 132192 -1552 21910 -71149 -180479 -206385 -468622 75740 4550 -264697 54113 148400
21569 148400 -123607 -165908 102883 -235581 146762 255922 358364 -7895 4836 348854
21559 348854 -82794 -63670 88831 -202343 -282512 -118389 -65712 69911 49399 -352552 -283611
21548 -283611 126676 -1 3543 -50614 22626 -41303 -97232 -41405 -262893 -60316 30387 110898
21536 110898 -226994 111616 130339 78585 2161 105106 98407 -88235 -119483 -75626 -173591
21525 -173591 104101 55348 -218020 -241283 -100260 -115465 -217819 9101 57068 -77533 -169263
21514 -169263 -167154 252876 181111 -279510 -278493 -277323 -188603 -25658 -80847 -455752 -240991
21503 -240991 115932 26446 229417 -50875 154241 -96312 -90847 -12742 281929 -118007 -172353
21492 -172353 105333 117471 -43922 -80698 -214411 -331971 -208586 292353 117486 -23901
21481 -137131 -335715 -151412 -306792 135749 -22276 -16590 338892 -147100 -185942 -83239
21470 69662 -257640 -99405 -130037 -7543 244666 -180936 -46848 -94100 -173353 -45026 -99788
21459 -99788 -116670 -223601 -437218 -51010 221803 -269431 97331 129404 -512842 -142869
21448 -300292 12209 -326503 -186435 -142989 -13410 -85310 -141094 321578 -280128 -145500
21438 -145500 -235469 323507 10620 -72514 40045 157326 271892 46826 -225879 -62457 -109575
21427 -109575 -166799 -66166 273837 -54279 -18316 -205145 -367967 -203289 34487 92834 -208214
21415 159487 -216016 -177261 19317 -120169 11029 91065 -146367 -164952 48881 -408087 -66579
21403 -3710 112221 69810 -201688 -126486 1941 51899 -146259 124437 11602 139717 86356
21392 86356 112162 32719 -92316 -12394 -101638 -202287 146431 -153069 43699 -4447 -443 -65694
21380 -65694 -155256 -160432 -28661 199859 28121 68447 229233 211319 -82436 67112 -15591
21368 -4341 156768 -432073 164017 -149496 200836 18459 14636 -207690 -329471 -61852 11865
21356 -166968 -61764 -242298 -66606 -13747 -95515 -70025 -121243 128347 -284098 -216935 -330254
21345 -330254 82103 688 -122201 -75279 31930 63095 -330540 -250366 -131405 31424 -192814
21333 228405 -127843 -178262 -127792 -17031 -179169 152528 15232 112610 -62016 -189041 -100321
21322 -100321 -202138 -29833 -62974 20795 213294 -117422 -28031 51133 112957 63886 -25946
21310 40179 116443 -135214 -464419 -76991 931 -69762 -99566 -138757 219408 76729 -135139
21298 -114439 38911 -246276 -155135 -190887 -99268 -316798 -45663 -21659 170771 39992 -47650
21286 110692 209718 -127868 -227678 152465 102153 -262313 169488 -75842 37660 61062 -48928
21274 -125569 230963 138345 -135795 -23060 -21916 -270300 78021 -251898 -150049 200484
21263 134515 248449 61444 -406108 245938 109455 96350 92340 -61867 -24725 -387930 -86852
21251 231332 -43649 49774 1186 -229669 -233264 -249810 -256573 46196 -41955 -110333 40461 151162
21239 151162 -69308 -217085 -12206 58413 -185264 233689 -206883 -139017 4822 -270764 -430086
21228 -430086 -138332 301477 100950 116465 -310914 -209664 -433996 -77908 30463 -25837
21217 49291 81652 -57132 -116619 25125 60654 45911 70051 -40216 -104326 367329 -72929
21205 212788 -144242 -197550 -102104 74245 -46302 289827 -140921 -240585 -76627 -89786 -56796
21194 -56796 -41459 327431 8585 -278486 -47053 -64279 -116676 134092 -141530 -102993 -64223
21183 -64223 125399 151122 12402 8323 -63146 42035 -244964 -137109 -74158 65241 -124633
21171 -109364 44101 -143182 -53369 -96497 -29747 247949 -21633 104956 147270 275693 -59737
21159 -46820 73796 -174078 -28159 -186898 -221204 -271748 14599 -74546 -18810 210678 -71921
21147 165674 62596 -75410 -176185 -375361 306457 -70266 -157222 -15406 -178488 142667
21136 -145426 -135502 -100576 -175615 12541 -78631 -51628 61380 -18728 207552 138155 26768
21124 46710 124183 -334417 15971 -27292 51345 -182026 -386771 156600 -35586 -44743 -28090
21113 -28090 -116465 112306 208044 -113127 -206562 -174244 85071 -294312 112717 -75347 -154211
21102 -154211 -109931 -17692 44866 43509 -31199 -167173 86600 195905 -399672 -184966 113160
21090 -346321 97532 -67390 43254 -17345 -103339 -129448 214700 199875 -193009 263320 -140762
21078 -324938 26123 -181800 215621 119806 -48722 -291164 -29717 -143786 -426213 -79637
21067 454120 -138401 273648 -4823 -35686 -100305 -31496 238320 -27360 17000 -216211 275773
21055 -67636 -260527 79479 -345020 14193 -93268 -43411 -110206 -233486 -106623 29153 -117054
21043 -48341 -374171 -303319 -187589 -263567 -268781 -115272 -123173 -375290 -184487 98208 88964
21032 88964 -338458 158393 -3935 -136524 -122873 -56903 -7207 -128553 -139755 248662 -175010
21020 -71574 -60038 68153 -164138 167371 -59486 272015 50439 45593 199562 -71537 -19744
21008 -115702 -18604 -30878 -228963 278717 -241167 -35292 -191631 -116918 -127602 259531
20997 22080 201 114488 -81654 -288 -236845 -81475 326881 -59342 -107628 -134215 155655 -52107
20984 213306 -344970 30578 -6015 -288412 -163660 -37349 -16865 -3029 -265400 -45074 28601
20972 -13247 -87973 -51014 -351830 -101409 -122470 -130522 140686 -159230 54809 -6225 160877
20960 53507 416022 -286133 -316611 99666 13316 134765 -351501 -72530 23009 11981 -131692
20948 -164546 168380 -141291 -250982 51266 -29737 -131551 11431 -54814 120079 -237239
20937 6923 -84302 6659 -54087 12590 -258001 97940 76181 -128972 79198 -333077 130602
20925 348865 -354703 63720 141570 76238 72386 53083 -85428 51318 86040 -119591 -168857
20914 -168857 -127476 -137194 -156285 -180102 -170101 237215 45284 83126 80263 39125 206294
20903 206294 102077 -117404 -147601 -186357 -109113 -295262 172980 -77973 -475874 101381
20892 -241666 -268243 86698 -44428 -155710 -129198 182654 -256220 -61421 16864 36530 -1930
20880 -369522 -168040 -148379 -344606 -23048 -267921 154858 312788 226451 -99367 -201096
20870 -201096 -241278 -174166 113765 92868 -204214 3232 -88137 -148759 -298898 228695 140126
20859 140126 -5565 -84193 -224432 -292505 -7736 -218702 -151993 26375 -258027 -174608 -18300
20847 -209272 30105 -110418 -521172 -141064 104056 -164206 17391 -85630 -46743 78953
20836 -130093 -272986 115969 71973 -198221 -41064 80366 78690 -24055 -183564 -248220 65887
20824 58132 73760 -92769 498178 64533 -17106 -126281 -133469 266588 91299 -239941 -225576
20813 -225576 -357685 -71958 16184 -5771 -252984 -57190 -176878 57803 -113501 -337007 -137283
20801 215357 -105623 41103 254422 -115802 -134609 8975 150369 -223671 31758 51557 293437
20790 293437 -268561 -182537 -167587 1382 -123610 29178 112529 -42897 -98943 -78240 282785
20778 -25225 -411936 -119760 -222959 -52268 -259993 -18883 -110279 154054 -138364 -53072
20767 313151 -58784 -33605 -55273 -167187 -8808 -184650 448853 61192 -191823 117849 336567
20756 336567 37567 -128971 -287997 64636 -71152 31341 -151350 -155251 24675 -117707 140370
20744 195188 72385 -249145 35044 -406456 86301 -5034 -229482 272552 59426 -77404 -114004
20733 -114004 -38935 -86150 -236631 -26987 -181924 -43607 -74250 -20324 85855 55870 38426
20722 38426 -252642 345473 207380 -134256 -43927 -296207 -155194 -95100 30548 -464873
20711 45129 1873 -84600 -354344 -174758 -298356 -237920 -430641 -276477 27406 -347853 -171284
20699 27388 -40408 39137 376036 -359953 85345 199780 36287 -91372 144028 -132233 288948
20687 164109 14183 -182909 -206608 -369349 -245193 -179164 -440822 -209917 -272147 35827
20676 147551 87026 -145095 75618 -132543 117285 -302432 -32357 93427 -128053 23697
20665 128035 -155432 97619 -140321 -13600 -77822 -218522 -151051 -72160 -302967 97706 -23528
20653 -91445 -282037 89229 -175038 -120242 -98429 -92972 -83492 -128570 -290532 -10293 349915
20641 -50418 92840 182878 -90519 61730 60322 -64868 7409 -15636 163797 -73621 25648 158357
20629 158357 21509 189741 -89726 196817 25163 -322445 -236202 37917 -306638 258981
20618 31711 -27002 -326569 -109616 -14929 -53466 -165847 42659 -105041 272714 -161591
20607 -86865 226238 -129079 23492 59231 -381450 18519 233145 55300 -125581 -646409
20597 -646409 136290 239768 -188483 28690 -187563 -171618 60721 77363 -130819 16418
20586 36480 -200939 -287942 108807 -37234 -161267 -12618 -18593 -258570 229204 220686 -277327
20574 115797 26446 16596 10969 211927 106180 54011 -119855 -175451 -374410 -28147 84988
20562 -87983 -25159 -235917 -355295 641 -39916 88626 -169059 112913 -323810 -100371 -171560
20551 -171560 19709 -281745 43675 92757 -423576 249285 -393340 160476 -25985 -42118
20541 -42118 -185839 -66793 -257029 -97063 81992 -146421 -139329 -278714 -178803 200650 -170544
20529 47369 -157808 -1851 -183677 116190 3426 62554 -323276 -42555 -432748 26008 109430
20518 109430 -289090 405389 -189450 130950 -111221 -2849 -473010 -175674 -115629 -141047
20508 -141047 -256468 -152584 -7745 88339 -312540 56131 -69534 12108 65961 -374749 -54064
20496 150145 -206738 -165018 -307243 9188 -169818 -319218 -330420 -122065 -6948 -183283 96323
20484 218380 -29330 -64331 192372 -290474 186772 90105 -3765 42039 -42241 -6814 -48904
20473 -48904 -155788 -124357 21790 120281 -225139 67532 -76887 23611 -226892 -101477 73532
20461 -241734 -106017 -384415 -146848 -295146 251162 -92302 122376 -117791 335381 141903
20450 -118152 -83684 -25933 -150283 -20050 -174431 64662 115728 -196990 -107610 84098 101433
20439 101433 -77683 -245721 72436 42478 -213270 10184 -91199 -108368 -221008 46095 37489
20428 37489 291253 -541441 218183 -241366 -69172 -122862 -181740 112461 78852 172226 113194
20417 113194 -82303 -294183 9480 181647 -31948 55285 151734 -36438 168632 -61481 -317623
20406 -317623 -31884 -273976 -153264 -187107 190986 85680 -272121 -223691 -304421 46061 -71953
20394 -222885 117686 51349 182180 403061 -270452 100286 -271895 -99375 77139 11137
20383 134075 -19210 18852 -459716 -361771 -58827 -83521 111070 -20832 107347 16779 -77898
20371 91702 49695 371221 89190 64640 246889 39085 -232332 -289636 -270238 -78418 37733
20359 31535 32699 -169454 21439 -8011 294293 -77498 -191713 -60264 22164 100570 56833
20348 56833 29881 109447 -14666 -75545 -25443 -51001 -42337 -291853 -152991 93399 45093
20336 42204 232643 -99638 142777 -270007 -424521 244434 -164959 246501 -484996 -124206
20325 78618 -107889 -227266 -129846 -294822 -77663 -111010 105574 -274279 -159150 78241
20314 93498 -232890 18198 32103 -170420 113294 -79613 -248912 -181796 -231154 -272567 -440330
20303 -440330 -258391 -83244 8940 32832 -266177 71289 -172975 120260 -58755 -80610 -147303
20292 -147303 -105418 197688 -36171 -276292 -145092 -40593 -7749 107334 -62430 -317284 -142468
20280 106111 16391 305303 -78454 -153018 29407 417073 -85122 -205712 -224014 96313 -37678
20268 15346 -61386 -16739 -21399 39101 -211132 10690 8851 5127 94692 -70201 182455 214275
20256 214275 -105315 -345210 48433 -249114 -516835 -26232 9439 -199577 16278 -175118
20245 92709 -92405 -137435 -67561 -138022 96971 -46828 198368 21915 -271261 -355361 -175023
20233 5764 -76259 -201230 -36251 75940 33423 231107 18062 -46395 -242396 -202915 202402
20221 -171811 -60421 281662 -118128 -172509 148277 61585 -119187 -195371 -480341 -369535
20211 -369535 -74869 -77601 -31842 95156 -192739 -134293 118017 -409927 -145642 -111362 -171129
20200 -171129 80312 -127484 165739 33579 -61780 -67894 -95411 -57407 -11922 97894 -148118
20188 -65957 126278 -71126 -176373 421769 178396 157940 14666 -254297 -43037 -65792 -23508
20176 121645 -167373 -70891 286673 20193 -300188 -14649 -124000 128334 -180620 -294806
20166 -294806 151065 95228 123868 65549 28161 -201373 66596 59752 -128459 221726 224479
20155 224479 -58647 73261 -138070 -74951 139845 -52179 -240294 -47013 132898 310346
20145 310346 -395947 -185624 -122684 -170617 -221211 131796 308845 -205517 -120452 -356876
20135 -356876 -69088 401027 99692 145231 55254 284734 -223934 -138104 196446 -2716 -28687
20124 -28687 151421 114610 190696 101320 -22856 -79357 176067 21875 -178763 -10504 -267082
20113 -267082 -251695 -34772 -195419 151742 -9199 70561 65817 182437 -207356 -194101 -184638
20102 -184638 95200 -73514 -18866 -327390 -148996 -32562 6055 -437794 -371009 85712 99564
20091 99564 45445 -175648 -103867 -165695 166162 228462 27656 -183984 -75686 152934 -95826
20079 -179261 -130605 -60923 24318 -102682 -72582 210273 -102701 1759 79567 -166295 -370110
20068 -370110 33231 -36563 -313343 -49231 -153742 9594 -86283 -140816 204443 162905 -222096
20056 -97974 -13512 -216451 -182768 58095 -223594 84328 -38457 -353719 34883 125146 48702
20044 205184 63836 -316862 -113991 377012 43250 -198842 -91183 -90664 -143343 42909 122569
20033 122569 -50554 200141 68258 70962 53240 -120478 -322006 -309520 271765 -73498 -134905
20022 -134905 36603 -314135 -50845 -200307 -151520 32284 231294 198270 32939 -52508 -89238
20011 -89238 -289384 83720 -52953 -255264 -4780 -370904 -174061 187854 -20362 -30532 -268672
20000 -268672 -3194 -63539 372043 -144023 -150408 -20798 55516 112077 282695 -30978 219013
19988 -35251 -155593 -377352 87915 -152 194131 389506 108324 138795 163639 -373100 -85910
19976 -83679 56705 -132723 -305859 -201139 84154 27077 -93390 91487 -39449 -23788 -415089
19965 -415089 128225 214468 168726 -148767 -92274 81443 -61542 -146813 161280 46157 111842
19954 111842 75107 256488 21845 249145 60636 20446 -51816 -71131 32211 -100880 -193984
19943 -193984 79809 333646 -71105 50672 -250266 327232 127984 -411174 -113177 -23201
19932 -230208 36333 65990 195113 41225 -85358 65599 -74411 -50451 -119224 -198848 176180
19920 -68924 -125377 -243745 207548 -37939 -119691 -184528 -186833 -224417 35068 167338 -58321
19908 -85069 10247 58932 -292405 -91383 -137313 -5931 -153492 -126580 185236 33781 -73190
19896 97581 67848 72752 -140147 86612 -150873 45151 -812 98044 -199088 -216514 26364 141213
19884 141213 16544 -90634 173531 -182835 110240 -121796 240412 57420 -262773 194890
19873 -151513 -151931 15794 -163258 -84153 -6311 -50951 -60369 -233833 136145 -50099 -108256 -238950
19861 -238950 -305083 -194839 -190683 156936 -56269 -228771 -459104 -22983 257610 54153 -1389
19849 55569 -328796 -199562 297351 -112508 -57984 -451617 108546 -277685 30596 63421
19839 63421 159529 -50775 -100393 -44768 -359965 -104784 129275 -136874 163412 39272 78541
19828 78541 41761 233564 -293771 -262714 66471 183943 287569 -213155 106270 -154106
19817 -121561 -231456 77950 -231228 45521 -390843 -166770 -196505 -106031 -283277 -289280 40123
19805 -37432 -291968 135102 -145528 -211281 -75301 -178955 122244 -16711 -25098 85294 -19647
19793 -234494 -263307 -138558 -188225 129383 176184 180155 -60669 353963 -72588 55535 34680
19782 34680 73259 -176875 -108779 356190 -164847 -65630 2050 -104719 -124672 81016 -146071
19770 -194955 -27405 -211246 59064 336862 144346 -187704 -56383 -254418 -245476 -144289
19760 -144289 229515 200874 -215448 -414869 -50152 -252961 -188357 -203469 265969 1359 -107382
19748 -1604 -48111 186657 -70689 15242 121699 127492 -554190 -234859 286485 -79987 -250078
19737 -250078 -86263 369521 -156234 80360 -20960 -136632 155910 213209 157303 -81807 187911
19725 -194438 -207561 152337 -83791 38138 -106403 -284621 -109990 -110335 -188157 -152432 330799
19713 26366 59847 85976 1057 -287451 -222240 282883 43265 -32223 145023 49875 134337
19702 134337 -379587 114832 84872 69005 -171867 -384630 -199439 91508 -300455 -282326
19692 -282326 -71488 -383525 -48975 -75554 157203 -191896 50333 75237 213301 -286084
19681 -100752 -222016 -38914 -57385 115562 -212539 154394 -33014 -437371 9334 160425
19671 160425 -62618 53628 -245757 81760 96431 107458 -94068 142210 160133 -183331 128053
19659 79566 -198076 -317199 169467 -72219 -45193 155404 239235 -107899 -335992 -65863
19648 -374015 -126927 -232858 16779 -169311 51360 -18739 -128796 -271022 -399219 -496161
19638 -496161 110168 32285 -156005 -17394 -214382 221193 139582 -196918 156479 -34778
19627 216600 -82920 -33224 -241836 -89294 145808 188068 -19542 -293245 -293401 -130128 -160506
19616 -160506 187641 -253353 -56805 -191664 -144208 -142941 -169944 -11326 -176277 -24485 -196759
19605 -196759 -272006 183207 88679 -167699 -8968 33586 107093 178345 -55628 148374 118303
19594 118303 -68224 104337 -63596 -235113 -157175 -265892 -116998 344145 109258 -27665
19583 -301697 252922 60620 -46687 21652 -101178 -188971 6612 -367753 88738 -45953 30534
19571 -56285 -273727 -19355 93467 165220 144006 -180226 -123785 174245 -54686 85002 -39277
19559 -98410 148 -360281 100202 15473 -199113 255383 -480751 -201978 -184080 -5753 -258779
19548 -258779 -32184 5418 -191863 52862 -134266 135410 -119074 -182927 -89041 -93428 -239931
19537 -239931 -229209 142791 -29858 -118801 33469 -345540 154779 -31330 -247481 35940 -186453
19525 -12455 109618 103536 -299260 -358825 -84371 260687 43103 4079 -91459 -92979 -114836 -143348
19513 -143348 82432 -135413 247304 190692 -400130 -100304 13907 -111978 347603 20098
19502 -24072 109255 80902 117131 275815 -490987 -324413 -111010 62108 -113028 69351
19491 94130 -156473 -272078 -92010 265522 59460 2467 -284278 149254 -37470 -36782 60720
19479 -12811 -41347 166447 -84833 -65148 123089 38409 -20050 -307535 -244266 -239012 -407184
19468 -407184 282353 5802 -223558 -88981 -111759 -89531 -173462 -168567 -5643 33994 -56542 -296383
19456 -296383 -42747 -260302 -140864 -93535 -81158 -246711 -286286 13681 -317396 101915
19445 -91590 -127075 -65597 -171374 -134327 -193856 -167502 -373975 133320 1101 -68028 -139785
19434 -139785 -5176 -47429 360352 -41801 -246711 -145753 -161622 79670 41319 -364479 35154
19422 5828 -60033 -157931 179328 96405 -36478 -210839 230347 25451 47623 -433247 -22428
19410 204369 -291397 -265170 -10411 -9877 51457 -84552 -203882 292413 24382 -17041 130879
19398 -21100 114549 -320857 39446 49355 96779 -74176 144959 254771 -110341 -172815 -25625
19386 285312 -350931 -167951 -146998 51559 -68837 -88011 -257453 -297525 127601 -151022
19375 -190466 80586 112432 55576 -91197 -117606 -48702 -26610 -86942 138375 -101852 -121440
19364 -121440 -27176 6903 26080 -56385 -215725 -296580 122211 -164456 -76820 98136 -131664
19352 85002 102033 -222146 -237361 -155186 -130410 66315 -324895 -245851 -17447 -3222 82750
19340 8941 -136368 -203390 222016 -157648 -389979 -289744 -82102 139469 112409 -90629 -131020
19329 -131020 100336 -147324 -67213 -7222 22711 -336218 -44038 183296 376536 -184354
19318 -59051 -95099 102978 -221134 -302087 -81341 194588 234580 70545 -267553 -30630 -195702
19307 -195702 -69646 -271391 172097 -100267 -385309 64908 -389784 49091 -66991 -127335
19297 -127335 191333 -46453 172800 163134 288936 48697 -74868 -273573 31009 119182 66269
19286 66269 -9224 -209496 220005 -103545 201559 71274 -107204 229031 156873 -179497
19275 -97712 78691 40447 119231 -362251 -95485 -142313 -215112 -95291 -45654 -168242 -190634
19264 -190634 26219 -103020 -71124 -43651 61567 -43096 -214682 18692 -128094 -297673 -113710
19252 -125797 84032 -192422 -40049 114057 40054 -112569 183349 -17921 207821 -174477
19241 -223681 -6698 176711 -163542 -388254 -60799 -60192 -64326 105580 -225725 -248453 -100500
19229 -53103 5855 199296 -133113 23400 -347539 -34494 -80706 -146751 -106647 -186225 -243396
19218 -243396 -274703 -198095 -37912 -181880 -39081 -20053 -32950 219652 -293414 -4024 -101929
19207 -101929 -106907 75583 -85035 84883 156906 -179677 -157984 -152677 -3582 79518 -316587 81460
19194 -79943 -49378 122459 95418 -424473 193011 -122351 258277 -22334 -44853 107657
19183 -187352 -188797 -194984 -102443 -288109 192123 -82388 120453 151762 -262689 294244 398097
19172 398097 -5492 -93938 76452 112101 353550 -94361 186681 3813 150602 58245 -148158
19160 114575 -85135 206887 -15687 -156584 201819 -304077 22791 -114426 110856 205946
19150 205946 408003 -359750 42283 -340549 -41779 -63874 145386 201208 -63458 -411730
19140 -411730 398823 -211756 -290000 53995 66044 -58835 318713 -102771 -8516 -114204 -125181
19129 -125181 183129 248543 -203320 27819 -50161 -95638 -302943 70928 19018 -218989 158887
19117 77689 -223411 -363382 -141163 211894 -145426 60057 88110 291668 -210716 -135170
19107 -135170 -282531 -27243 14800 35521 197282 94601 311007 177339 -128156 -348302
19097 -348302 -246204 71289 -49931 -119084 4026 -117526 -231854 941 -202626 -87160 -389143
19086 -389143 -32448 -162469 -81280 51185 -85254 -22105 152414 1796 -268758 149624 -244771
19074 -53328 23318 326240 -148425 35929 -124098 -37656 -129179 57884 215924 -226887 -179121
19063 -179121 -349046 -6042 5688 -4903 -236225 -215063 179023 111110 -88226 132685 104530
19052 104530 -26669 6903 -14570 227525 27258 152519 -16773 -23075 178037 264653 16967
19040 429443 -309882 176517 -34671 -318455 255561 179586 -65895 85973 45973 -293041
19029 -43403 -257787 222009 302749 -126356 -99722 -154825 910 34890 -82231 -273294 38247
19017 41201 -411384 173672 -148344 -415061 -103232 -26226 -227481 125685 -81495 -100807
19007 -100807 -158734 -267097 -208476 21612 -68472 293224 -154184 -241456 -92525 236339 -52418
18995 -156867 -132946 -53693 -268527 72494 105211 -172163 95170 -49372 80633 80115 -161128
18983 132890 -134593 37391 -123699 -53546 -12529 -39186 -69203 -29406 19128 101014 -64657
18971 -88390 53770 29095 26350 123739 -160404 210461 55903 32627 66668 -220887 384907
18959 92861 130216 -48655 52572 -96694 221732 19780 -175345 86902 -474140 23266 112181
18948 112181 41100 42123 -367936 -66590 17264 33221 -285941 -83234 130285 -174784 -58027
18936 -284696 -275649 -214668 43882 133942 -245885 -87484 165497 136279 -107995 4319 210688
18925 210688 -49089 -387413 -218253 174382 61434 87203 210421 -264757 -206344 95812
18914 -106295 853 253808 113276 -58520 -211651 79998 -90223 269028 5454 -129371 -155178
18903 -155178 -232654 45341 -151966 -15264 175204 -108087 -64027 60462 -180026 -73451 208121
18891 -51180 -243660 32567 -86123 61538 132404 52089 -203817 -311824 -25222 99024 -138902
18879 205252 -61838 -25209 491088 -460115 -274527 328834 181918 68709 -46897 64327
18868 -24668 85235 -194504 154302 -176325 114710 153175 -96373 -233293 -218953 -79983 -320715
18857 -320715 -78550 -365237 -294150 -70861 18031 -379948 -9784 158320 -216356 113232 -31002
18845 -392428 130671 327859 -6657 -418711 -335993 -164457 135972 -171922 -16204 -5635 147466
18833 -83460 230391 -129824 -244800 215596 -155049 43243 -179824 31750 134112 63217
18822 -146071 86768 116855 -170614 -257184 18982 273269 -83145 81043 -251254 84498 -186875
18810 208191 285758 262105 156406 158388 -85225 75554 96109 9603 -268015 -37619 -8248 133191
18797 -153629 101658 -175176 -16730 -179748 178021 -14831 -225279 182174 -53848 210115
18786 -12869 -141503 -73496 128285 34310 -62125 -45944 7313 46481 -142294 -87248 -48904
18775 -48904 25648 326762 -62507 22289 120160 53049 208380 -57551 -45373 -8201 308880
18763 -198365 3999 -241601 105923 113187 -339899 183083 -90278 242598 15083 224954 192639
18752 192639 -243392 -208185 -119062 -328809 69891 62834 -132444 -372968 64587 -84930 -178484
18741 -178484 32398 -887 6627 85988 -186424 -46313 -267677 -51641 -217816 -145788 41890
18729 134782 33851 228865 -197594 43834 231573 37192 118895 -280039 134749 -326425
18718 380973 -131242 -10816 -205471 123710 176886 107346 -66033 -74828 -179139 65260 126375
18707 126375 -18322 -8825 -336380 -41496 28319 -350788 -25657 -177488 -21482 254442 -11612
18695 -262501 119783 -55816 -180517 -17752 -499104 -176445 48861 -54220 -2536 -43437 -73739
18684 -73739 113944 238651 -169835 -40775 -359211 -48998 105297 97220 128983 -279563 277613
18672 203486 -35965 -111979 30485 33781 140288 21271 -165518 -106085 39279 -35708 172824
18660 -113821 47610 116985 74044 -150662 -151239 -48942 -204910 2564 -203520 -129331 -204646
18649 -204646 -368604 -519462 -160894 -27422 -88962 -220769 126823 -142256 -421085 -148288
18638 -181543 -33919 -45402 -162727 194230 -30225 -58902 -395716 50313 -44666 -383561 -67556
18626 380186 -214472 1721 178009 -373579 53006 -165849 -131972 72117 -175443 -310592
18616 -310592 -308672 -138432 -116910 17454 -8544 -25967 287606 -78004 -274343 -12719 -60027
18605 -60027 -201525 32030 -110780 230220 143471 -174141 -162128 -32536 107052 226703
18595 226703 29987 103039 33804 12498 -5880 9033 233879 112810 -145921 88705 308125
18584 308125 -114334 265999 91166 -152595 -37934 -119259 -173189 -41365 234431 101701
18573 -106243 -54678 -33054 52545 -82687 -148322 -164410 -215151 -209219 19676 -154115 -116036
18562 -116036 38677 -139520 -2911 114446 -406665 -72436 -54374 -402341 109613 103040 -107999
18550 -367908 -131302 -2194 37919 -29186 -45004 344188 -132830 37342 -116612 426187 -194471
18538 -339470 -61132 -76521 169512 95625 -78103 -259905 -110601 193012 -1316 58035 226
18526 -34872 -141 -50951 -307767 -269429 -80025 118305 -220540 83782 -341369 -56650 30369
18514 84008 -204194 -118386 -435339 -66132 96749 -189015 -60200 -86970 -120054 -33980 -257003
18503 -257003 326550 193756 30074 20735 -6301 -186720 -221892 100422 56751 59233 71079
18492 71079 95202 274849 56372 42090 -460507 -448491 -30143 -37393 -336253 -234377 38536
18480 79759 -351648 -185865 -453190 -128550 -117380 -342272 85116 -115794 114208 -338068
18469 -341239 20985 -12150 138226 145668 -268420 -82950 -261466 52355 -133390 147584 55258
18457 -140100 9163 -134111 311185 -216359 238210 -65733 -200818 -142805 300697 185284
18447 185284 -156420 316537 210375 -187906 26517 133610 -16 88145 -206810 -308417 -77686
18435 -217059 -214709 144164 -291104 -122367 -36964 28884 271925 -15388 -69054 454592 67382
18423 -493083 -280646 53110 111518 -171470 -92587 -41200 -71770 127464 -4980 -187228 115566
18411 167550 -77963 185635 49792 -250286 65556 128589 27268 -230171 26613 -70635 -113406
18400 -113406 236054 146591 -21927 -63344 34985 -132795 134695 31667 281727 -212547
18389 59522 -164489 -161634 102470 -256196 -184302 -234724 114434 -36254 -185420 -34241 45566
18377 -112733 -705 -173325 -99459 -46642 77453 80526 -3210 217453 163105 222664 -126325 33169
18364 -201497 102044 -136145 -221722 210528 13571 -448218 -74774 72661 261747 54931
18353 73984 -152604 177578 271134 -409800 -151127 77244 24090 -308078 265009 -29345
18342 8631 -88911 -111505 120924 -76664 -107400 -251391 56 2474 136354 167365 -293001 63584
18329 -48702 -139656 -323660 87809 3267 -274678 120052 -122954 -56672 -203749 -67692 203756
18317 -173561 -66217 -56954 -422508 -519223 -156116 -261093 189161 -28210 -27825 -201471 199332
18305 -223541 -107830 424044 51570 27454 194635 -13024 -1210 -71203 -10343 172203 -31604
18293 17987 23608 -180262 88985 115325 -114618 -255600 87216 27484 -54101 23000 -130201
18281 169942 -621240 119376 9025 -231022 82157 -147850 -269108 63808 -82213 50386 -78778
18269 -159946 -316315 376225 75960 -36280 84249 85357 -96798 37141 -6199 66880 64085 -106779
18256 210331 10423 -216220 -69358 -363715 7692 -24216 -137425 140012 36526 -214540 11435
18244 -51133 -126661 -168803 -72965 28250 5085 -6068 -8156 -126256 -140402 243482 446 -172900
18231 42410 -147740 45968 -55936 210418 46119 73862 -350789 46746 -118167 -77468 164523
18219 -82466 281147 -485801 20101 116324 -365888 -28389 110430 -4575 -110031 -98282 53875
18207 -153612 138851 -204277 -406853 -98638 -304985 -26865 11974 84365 -6283 113534 -61268
18195 121863 -232020 -254189 -74920 79274 -41681 -201401 42650 77830 -34492 -434380 -303141
18184 -303141 -75850 -148093 20073 -52012 -167567 -338 -177594 68417 122367 113664 -155715
18172 183758 -215453 -92700 31229 -65901 46029 153759 158888 -62452 207827 8086 165633
18161 165633 -48595 -462224 -188103 -124845 -335892 86632 198156 247188 -77946 18090 196152
18150 196152 173057 -318742 -47530 -126991 -102989 -64811 -224706 -430366 174203 115862 -210450
18138 -73351 102307 -106748 101341 -171217 -19513 -25360 139948 443711 230603 -365688
18127 6686 -30174 -180261 109987 204279 150213 -41668 -155864 29279 -15837 218329 173402
18116 173402 54074 42152 -205656 -57062 -583420 -39004 48138 92683 -270510 177521 -352639
18104 -28838 -119 -136330 -168658 7342 -321496 -234103 -258952 -132217 -37613 178517 29066
18092 -3798 147084 -404845 -15390 -85237 316129 -78348 80952 -29973 -32558 -22920 -192935
18081 -192935 117 -87205 23094 144064 161740 103703 115100 53921 45306 236743 443712
18070 443712 118978 -43335 -232808 165360 162226 -470900 133670 217856 -145039 -132797
18060 -132797 26661 -336343 -162268 -57000 -422961 -54397 187163 -281554 -3922 -80312 80567
18048 260325 105948 62669 -333343 361461 -84932 -73681 -311115 -184780 300384 -114857
18037 -88565 -117698 -257304 -194647 109629 -228494 164387 -126737 -8496 122553 166930 -39724
18025 -2748 -168668 -147715 -135304 9932 91924 -326769 -27982 20744 -225932 404447 -108542
18013 -258650 -36888 -12410 11017 -194249 -230973 -89401 31599 110289 236454 37727 103220
18002 103220 -208829 177344 -97294 131245 144698 -139192 139515 -412090 138136 51201
17991 128735 176770 -115910 221962 -290579 428596 -237228 173857 108852 -96454 62326
17980 -102504 -492640 364240 -66877 175487 -326673 120778 -34918 190252 35230 73031
17970 73031 75420 314192 20357 -24787 -266328 -151944 -205133 104574 253707 -81080 -110466
17959 -110466 41532 -153733 209621 128260 -46652 226814 -73755 237844 45053 -440361
17948 -24618 -196161 208031 -31221 125589 112744 -370300 -124143 116658 87188 -45688
17937 32266 66942 -25800 227805 111921 -116227 -60455 199837 86381 50772 -193349 162271
17925 244613 -97887 -200803 11591 155128 -30194 -13569 -12703 -44557 -153093 222233 -61219
17913 -291953 -55787 -36064 -165458 -161662 -112504 -187182 32579 -268919 -206678 -177977 -21402
17901 -22733 247331 -224631 -108289 169861 77170 -64655 8338 -48163 328385 -343831 -79191
17889 168752 192799 -203110 -49525 -205385 213870 15559 176749 -112692 197678 135830
17879 135830 -104578 7116 -17345 45548 175283 48875 120518 47414 -94398 159510 -117272
17867 151372 7861 -116221 192054 -140992 108251 220367 229127 224135 -84906 -265903 304617
17855 180136 88407 -300868 132079 -12977 -178305 -76757 239247 -328491 124524 137678
17845 137678 226383 -130322 291919 -326829 88876 -168136 186378 36559 -77373 -220027
17835 -220027 351061 -135607 -215522 217725 61134 230549 128564 356415 140215 -254689
17824 -25774 103255 110357 -21210 -727 166984 358926 12989 155683 179922 227741 -7584 -156384
17812 -156384 -201387 55587 316795 -32124 31331 -32227 9214 -288715 76155 -21831 -111031
17801 -111031 94708 429946 259084 152851 127585 105155 127510 -105741 240824 131291
17791 131291 346739 369081 -88353 -77114 70687 69905 12446 -237491 -17108 -163080 231404
17779 68662 -79552 152776 210774 -239978 -30218 -175337 -15788 266798 100278 -228498
17768 25250 178504 -60077 190357 -54509 126460 151348 146705 65550 -43294 39662 -171099
17756 -16663 -33221 -392983 251181 -26035 -99388 -56874 -173922 -86732 -267654 -200613 17061
17744 258692 -138334 -107613 -331809 -279764 202385 -33966 258217 23645 48871 4196 115324
17733 115324 -160445 -72397 180821 -135969 -183223 -135588 28968 -48560 15542 265849 86666
17721 85900 115491 -41524 -173368 -34429 -14454 52860 75673 -50415 -156025 21727 -149867
17709 -139017 -212712 83928 -121192 -357655 48325 -543122 -176008 -72395 -39749 -293134
17699 -293134 113488 -83645 347455 106761 -121525 74332 209733 68346 -15755 -44101
17689 -44101 -122946 19949 -12403 -156087 -36201 141197 91569 224758 33353 81016 79445
17678 79445 181199 -166217 101404 -262747 -99412 245066 10580 -220785 -145244 117820
17667 -256952 -232331 -18025 64747 100953 117472 137145 -5893 25227 206948 -141518 -24509
17655 101132 175133 200386 242496 205110 176124 330298 11027 -202940 149191 8838 -49841
17643 -17637 -31750 65341 -99564 -275661 102060 153755 111551 413674 163692 44967 354147
17632 354147 39109 178764 -92567 77312 -63753 141136 38214 39161 81318 -242513 -102622
17620 -116442 384273 -38857 -144157 173050 308227 -260866 90481 37801 -101199 -134381
17610 -134381 175491 300423 -12799 116026 21208 115973 147563 41713 251538 94112 -121365
17598 -48833 -111931 -150488 -150947 -23592 -52831 -277108 441195 48918 -88821 44573 191871
17587 191871 98982 217437 490800 -29296 -129871 17111 119656 335072 -4165 220950
17576 19765 287690 361269 163347 -11920 119550 -260711 -168682 85893 167545 341496 -102044
17564 -45031 294528 136195 -58836 -212476 -97546 -119678 -49477 93050 -41252 55365 359852
17553 359852 411480 188350 242385 259229 -313975 111724 188023 -324113 178136 -46245
17542 171818 -130678 175275 -312996 -124588 -240276 340497 36115 -11629 486881 -159375
17531 268563 -124209 8722 7899 220522 2311 6042 374153 -156778 -342945 -172831 584572
17519 85476 -19860 68644 -18658 331411 51269 -43834 530732 -171208 316324 31504 -74660
17507 328867 110632 92869 355309 147503 212874 131968 267830 338208 81928 344209
17497 344209 171927 235229 49079 -124883 171660 348372 224184 89350 515850 254368
17486 -208184 454480 -46953 21766 475889 393533 101299 88476 109929 2132 -23628 -6575
17474 206907 342520 -100528 89432 -115491 23364 66063 367710 93080 426836 96414
17463 -481480 215711 357526 15724 296752 36421 338140 28797 153714 30450 42549
17453 42549 -4060 174442 -162783 218214 569305 148643 245932 -1258 346593 57956 254716
17442 254716 373609 122290 95691 325769 244275 -4777 180550 373046 252589 430797
17432 430797 404864 351854 153834 215248 213939 67411 -7643 486354 480046 218573 250344
17421 250344 250405 182690 624489 189838 220295 5180 230924 224011 180321 236908 67789 151003
17409 151003 446359 622861 35721 246150 469449 227611 348038 508853 248901 151935
17399 151935 267066 286876 251615 48958 -11395 153352 436394 177975 66144 65994 37915
17388 37915 -27249 27901 160623 194844 126615 138507 -296244 95575 264864 -69739 450987
17376 68394 380137 359141 -10287 247265 -11653 384269 -11916 100205 116123 287082 438770
17365 438770 135051 -248171 142686 300950 41817 -366737 182527 266945 146540 206751
17355 206751 197876 -59868 42761 339240 304275 386166 29236 383801 -61508 25537 18026
17344 18026 -206734 362816 226104 -92514 -47628 253179 191498 496796 -122829 152968
17333 106745 70209 -33827 76744 -112343 -90721 298397 111148 -159212 -149205 313403
17322 339360 -72374 21151 85544 -203077 184427 205906 -34990 185059 272897 -15313 172549
17310 80799 135758 125955 -216907 -161379 160948 -166049 333274 58445 110809 17860 -75944
17298 446373 329685 -42419 127617 48463 94011 -72224 273400 83049 122266 -235382 231734
17286 269217 82833 244501 -9124 295731 282611 50998 172082 168079 75114 337526 194958
17275 194958 -56961 -74890 -84446 416755 283905 160156 72578 165686 501398 305329 93551
17263 -61167 469395 105923 -24403 411281 156241 -160197 89916 292413 -19780 199285
17252 176386 -9753 75364 379645 357203 181557 440663 110408 165096 102212 219637 80802
17240 -61819 294124 60522 -105114 153653 39014 -37576 94224 99667 353445 -1843 10952
17228 358591 12701 321602 132391 90433 76901 -38355 321188 311828 129379 233930 185000
17217 185000 249197 140512 -147281 92307 79841 42422 235824 240094 90772 267581 239345
17206 239345 231589 254310 162039 10487 224104 247337 249899 335842 522112 -19979 44893
17194 213156 82094 -191211 260865 283268 344821 684774 293018 448030 283689 49091
17183 53408 205859 364730 156515 345738 280150 360885 242731 196848 301117 41960
17172 153249 470404 327521 96028 212100 272387 399890 234539 342450 147491 179265
17162 179265 335804 337027 91833 125884 377605 275754 302957 322436 108855 107042 241529
17151 241529 253503 39350 499315 197555 344926 263648 308895 237556 569935 446793
17141 446793 172387 44033 473653 335577 666746 368176 414759 152378 126854 390918
17131 390918 142307 136692 308811 121537 545632 205440 559364 620255 52996 406327
17121 406327 802043 221950 464049 344144 416545 620628 92557 217951 135180 605351
17111 605351 617625 88038 720436 146270 117688 434183 377042 147799 316598 366716
17101 366716 247354 247911 728051 396200 255511 353450 110140 559345 716198 318410
17090 32816 315981 141683 329570 578806 527065 396884 196307 213521 409216 600826
17080 600826 396731 434596 660271 242356 702815 406157 261065 357734 240149 676155
17070 676155 427785 534606 455551 287445 327656 47982 10727 182982 696549 591550
17060 591550 300468 476227 390199 348131 347326 369278 505815 535918 545883 276374 424614
17049 424614 405405 421169 374460 326275 331939 472033 324668 601821 354056 362603 817608
17038 817608 513420 542673 280997 354465 453884 629077 312480 532404 547347 571525
17028 571525 544385 787484 633829 371429 408229 486372 189853 340789 327687 590737
17018 590737 533483 651042 817219 296214 607066 658654 555814 761558 567811 545459
17008 545459 401010 600883 644059 778714 817919 493764 352960 569343 555053 770338
16998 770338 839346 769426 675209 558424 879182 581146 616271 741580 673127 652741 598109
16987 598109 668203 469164 918899 953979 883048 342563 775532 1065613 489481 848259
16977 848259 812592 851904 756303 777773 732168 760924 544803 788006 1048611 541508 791801
16966 791801 850691 453719 1288854 908174 815207 855509 782754 1098940 917617 910263 784814
16955 784814 860860 999309 1002541 816309 887945 1234496 716992 669465 1185967 1045799
16945 1045799 846697 1042304 800756 1046673 1049288 725437 939847 1135058 986011 986500
16935 986500 1034036 772440 1056633 1193883 1405883 1039020 1217959 1145539 1274057 1337556
16925 1337556 813517 983472 1229459 798127 1217461 1219505 1126542 1111646 1394909 1156738
16915 1156738 1263839 1255787 1444474 1137238 1520225 1535634 1251166 1684776 1618201 1400324
16905 1400324 1495530 1736884 1204315 1379451 1618846 1337142 1378240 1976266 1557655 1415684
16895 1415684 1689122 1489751 1519895 1627363 1693110 1747130 1736523 1716013 1480473 1652370
16885 1652370 1632733 1974877 1702608 2092981 1710289 2156141 1770199 1666161 2255561 2098996
16875 2098996 2130413 1840653 2031462 1891189 2070241 1921724 2348620 2276770 2365980 2130787
16865 2130787 2239854 2362059 2394720 2280673 2665825 2496658 2190410 2452206 2459044 2704187
16855 2704187 2413283 2491006 2697046 3170630 2881161 2868213 2992628 2857937 2897353 2913157
16845 2913157 3429566 3237792 3431626 3135123 3345177 3228684 3325816 3458287 3381439 3662843
16835 3662843 4103973 3702778 3596235 3871757 3925893 3909490 4363635 4090058 4737053 4181851
16825 4181851 4570950 4572888 4288103 4779556 4666213 4911078 5095678 5178978 5389770 5255277
16815 5255277 5408421 5278195 5688082 5886026 5888282 5715239 6290025 6098242 6464853 6335135
16805 6335135 6581392 6507563 6975945 7014321 7333335 7320269 7561917 7671720 7573502 7911930
16795 7911930 8392525 8448243 8817309 8945237 9107591 9616850 10216931 9992717 10223021 10145852
16785 10145852 10678664 10800604 11014642 11418478 11982032 12303848 12818888 13003687 13408092
16776 13408092 13563374 14173409 14583823 15194384 15431559 16021856 16809356 17225901 18022875
16767 18022875 18727544 18826441 19530162 20402093 21113735 21660110 22257686 23878187 24271110
16758 24271110 25348708 26101975 27347384 28506795 29621173 30494665 31562825 33340572
16750 33340572 34832523 35980342 37607240 39082774 40954840 42708661 44547006 46442213
16742 46442213 48782153 50973697 53495625 55966623 58995248 61552939 64620314 67500262
16734 67500262 71150208 74892054 78675403 82249480 86109961 90157566 94716939 99440321
16726 99440321 103962238 109006161 113748513 118993648 123637276 128473666 133806036 138544843
16718 138544843 143074063 147003399 151121730 154149130 157626699 159555812 161888131 163149002
16710 163149002 163336660 163368403 162577920 161376181 159046956 156737892 153224615 149955534
16702 149955534 145992637 141734272 137361076 132965106 128059691 123186674 118293999 113433208
16694 113433208 108674698 104158212 99819681 95569151 91098255 86975795 83062035 79620717
16686 79620717 75806113 72476993 69173126 65889414 63172331 60248856 57506690 55019394
16678 55019394 52564051 50319689 48302711 46180436 44410795 42569412 40590749 38963858
16670 38963858 37670918 35875781 34461970 33665702 32062242 30829463 29688819 28386554
16662 28386554 27891858 26536896 25583166 24773493 24105966 23362737 22414054 21689160 20904075
16653 20904075 20033010 19538289 18949530 18327385 17881749 17381977 16462699 15919771 15869976
16644 15869976 15557904 15001682 14684952 14264820 13867430 13130927 13366401 12757862 12346903
16635 12346903 11905532 11567789 11376775 11355945 11004472 10621618 10312806 10097514 9792273
16626 9792273 9225069 9206187 9154947 8849603 8578386 8316770 8189330 8005419 7777444 7675292
16616 7675292 7109682 7229855 7177535 7216840 6768923 6785787 6517270 6505848 6482764 6306582
16606 6306582 6411575 5743205 5880826 6061023 5518528 5603292 5461587 5453813 5180165 5027678
16596 5027678 4889421 4632269 4575185 4813912 4417310 4650155 4161686 4018525 4182179 4040928
16586 4040928 4150340 3991200 3960978 3976476 3937824 3765587 3794257 3492468 3681847 3621895
16576 3621895 3252827 3708991 3321047 3304890 3244191 3253098 3118444 3197991 3068265 3070253 2849363
16565 2849363 2921060 2704299 2656597 2764218 2745145 2592274 2580518 2420760 2538345 2577131
16555 2577131 2221607 2414314 2150774 2464963 2617907 2448138 2230193 2523700 2170040
16546 2170040 2116121 1786391 2512028 1905951 2166396 1957210 2191341 2025029 2213261 1714824
16536 1714824 1811180 1771721 2073496 1940619 2056615 2114771 1516839 1619594 1376097 1675622
16526 1675622 1765314 1707923 1390582 1810823 1730193 2032541 2028892 1609257 1316474 1451026
16516 1451026 1590795 1487487 1352617 1380591 1465218 1459285 1164697 1245874 1180603 1296603
16506 1296603 1467587 1604164 1390405 1237795 1307309 1191368 1584696 1271923 1277271 1342657
16496 1342657 860116 1130888 1309062 1256508 1063271 902448 1300474 986396 1068477 918413
16486 918413 1277168 1174443 1158576 925854 974648 1264463 919469 698284 1147408 1232572
16476 1232572 976625 1252331 1089842 1234824 1065749 1080957 1034825 849376 1162801 889669
16466 889669 1270190 859651 1226817 776717 1037665 953377 1154867 809279 881779 684058
16456 684058 993572 959365 1041157 652798 762212 878632 620200 981522 985029 1219946
16446 1219946 854233 871960 819057 683579 1170323 1079918 758283 1218283 796138 630306
16436 630306 905127 729824 532138 776774 775797 520119 510990 663646 838112 1068233
16426 1068233 855451 536435 926598 1144995 931915 698201 732683 1126001 989195 426583
16415 859566 836724 988101 763127 679539 944158 863641 767855 689901 856563 850846 391200
16403 906294 810430 710399 563330 533448 577070 460487 832137 521013 748754 1023111
16393 1023111 675827 516343 633989 786307 931639 964180 629715 865828 669286 793115
16383 793115 806495 443730 550878 798263 506425 969596 637459 834692 588128 635513
16373 635513 650879 432138 610627 1050966 727640 762311 878433 813730 799894 713549
16363 713549 851096 878937 736455 809332 723929 503314 593679 644517 723141 842204 801294
16352 801294 668824 680156 869898 566181 742769 599350 395058 588675 678482 325497
16341 667915 812309 415531 744422 454493 361457 397276 790728 561092 558706 463000
16331 463000 1102179 655703 565737 550576 481432 384363 751554 880605 402395 537251
16321 537251 831199 756097 696303 625011 484365 489269 873504 804191 953393 566158 757371
16310 757371 384054 776062 564130 801250 921519 507354 447813 607167 660025 314634
16299 474224 587060 670702 595704 583959 508235 514419 641522 721009 718152 274155 629164
16288 629164 671024 552623 608609 410526 338893 487184 516284 504672 520983 620784 501024
16277 501024 736798 723572 720377 535500 407628 652959 392227 337470 737854 573598
16267 573598 690637 469760 371209 408688 442204 429835 606821 776050 730536 724758 420667
16256 420667 375509 703704 551833 773242 477227 427971 892332 413531 390410 726875
16246 726875 525272 666443 431940 494154 576974 596143 512597 522677 503687 474488 739413
16235 739413 492627 726418 780998 254344 854533 444215 437075 333576 707100 581573
16225 581573 357426 455977 388943 567722 360970 476997 504804 210722 436672 296258
16215 296258 535316 333193 331210 294279 716963 405172 513364 500812 390510 145451
16204 298263 365256 474479 395770 518516 473020 553505 461397 683814 419382 105586
16193 186762 461606 409392 475340 507950 357545 662104 478551 509898 336827 579981
16183 579981 366299 566400 451246 223993 573011 382633 573375 440534 310141 339330
16173 339330 435843 463664 289218 295868 256198 459917 284210 242053 439204 306461 339441
16162 339441 542883 622448 395870 139760 375882 587548 241005 128091 218906 200079
16152 200079 232605 209338 180555 172170 342548 347345 458036 288848 210063 -289039 263585
16140 -8879 328173 104467 87348 286149 -353678 451987 73182 194592 215223 -75362 213382
16128 432967 30980 86544 435331 292264 463021 309122 541551 245812 254151 339679
16118 339679 377429 344678 264784 236081 32397 15092 -15342 124970 123091 -80189 425549
16106 358858 169045 189073 153297 308006 231401 170318 26234 255292 197416 68505 132943
16095 132943 -27252 202947 -25008 -4367 221634 52685 32731 341995 46334 175621 353437
16084 353437 31091 -30202 -7307 20019 285075 193637 395004 -187952 175590 194660 85270
16072 -91438 -91130 208278 33220 127715 -109586 30223 323038 143110 15654 49939 -5718
16060 154116 86669 162612 -4325 -27834 122796 155329 129134 74735 166722 -94608 -148120
16049 -148120 262854 55655 50077 -24509 356719 91587 140400 290084 47449 24319 -100544
16037 211589 324041 114558 14419 -124361 162869 3473 384632 800 238043 -12851 -233107
16026 -233107 148572 6324 51629 149137 211052 128577 -86089 40646 -21166 -353508 220133
16014 26353 255432 61810 16546 -321317 396413 126688 128289 1088 -26793 -190070 376645
16002 5222 198021 -245185 -38508 252612 144183 -81997 91195 -304352 41314 10340 -50424
15990 491798 -57542 -239479 102062 -286462 261827 -93374 -353224 162284 -399779 64575
15979 71727 -183369 -28387 206888 -87746 798 -123277 -102583 227094 246332 105845 -13142
15967 -15672 392841 -124940 103273 119696 313281 -47898 -37969 100861 -80573 8276 4393
15956 4393 8200 -132183 -185959 -27001 123823 -19311 61354 -23848 -164251 -244801 139202
15944 40989 51546 11663 68730 165951 -49003 97244 -3848 -172167 -164566 -127715 304807 -102672
15931 57056 166995 99337 -38816 -15294 275508 -376788 145870 -491890 -112160 -69266
15921 -69266 -199091 -2556 -238940 207296 -97099 88405 -188961 -230132 -180613 15037 -151158
15909 15416 -417930 7932 -148630 24787 -154401 -179265 7868 -85674 -29676 -206915 69910
15897 166228 245767 -250862 268945 -197358 -119902 -187751 -122777 78353 -218135 -233040 -189324
15886 -189324 23704 -61032 -36382 -329571 -97488 70070 88499 -354804 -23010 -67287 -210482
15875 -210482 -71636 68462 172042 47067 74203 156922 248304 259677 -187615 -23335 14908
15863 -226804 -74415 -9528 -160249 253823 -254151 -5641 55337 -76924 55307 6041 -132181
15851 206411 -31830 -120770 -5396 -23884 -47864 10083 -294746 8695 -210021 -85211 342955
15839 151486 -100404 -56983 -92602 60221 -24033 -215789 -108801 -70656 -43895 20731 116238
15828 116238 71049 -23232 32968 -44809 -208047 -129172 19033 -252158 550 -68191 -104563
15817 -104563 97665 -24812 -86680 -66797 238263 -123598 -151672 305314 -21181 217276 -231261
15805 -85355 -245386 -318045 143718 -262337 -93771 -116997 -319509 -32426 118713 245265
15795 245265 -76081 4451 -151731 234634 -79776 -17374 183281 29956 308698 -238142 -254401
15784 -254401 -255931 -244331 -38295 -112789 61328 144914 -125889 170214 -268246 -238230 36716
15772 146872 -220491 72514 -258289 48327 161270 46929 41961 -2060 -34019 -51938 91081
15760 -30012 -262686 225821 -146642 -352337 249916 -77014 93071 -187014 35258 -42913
15749 325657 -91486 -169224 14362 -133503 -127319 75925 -87987 -256612 53935 -63464 168309
15737 268541 153334 49844 -16840 -97201 -232004 609532 14128 74699 145973 -342272 -49181
15725 -269243 -381027 -214760 26838 -281751 -216314 -116622 -134453 -49134 -168806 32334 -233890
15713 70431 -135265 -187905 -89322 139001 180434 -216073 -303132 -199660 -76477 -131387 104796
15701 -279680 244185 -213978 27062 -138966 -276715 -135550 141365 -355429 115782 117280
15691 117280 277411 -138040 -56639 31226 23465 -192819 36661 64195 155091 -187409 50298
15679 127206 144683 -226764 -89583 -73422 -275887 344213 -55985 -83124 -23958 -13878 -43673
15668 -43673 147174 -236463 58238 -255132 -376359 127844 179288 -8721 -75328 -192294 86669
15656 -113676 -567612 118567 -191922 -89511 241571 -249156 31902 -182858 -64772 206869
15645 35666 195261 83019 123579 -45117 100366 -402184 -301382 -201650 -26029 3840 -246611
15633 159839 68776 190501 -39902 -136381 204190 -58114 32620 5679 -265113 -243903 -14714
15621 40885 -160592 6494 -79835 -282325 -251232 -100797 -411549 119377 -256949 -225831 -256916
15610 -256916 -397878 -48503 -152537 -24678 -70281 -44904 -243212 342301 -164840 -59753
15599 -323485 -522539 -135282 156233 -53880 6707 -227095 -53645 151444 -164630 -180531
15589 -180531 185795 -238102 -22645 -52269 25992 -76437 -40997 379841 -311302 -148543
15578 -10596 -25272 -91966 262805 62716 -57843 96939 -85051 54339 110157 -96923 -87323 -13840
15565 -155377 -285418 118555 85303 150168 -45533 115573 82154 14024 -41108 -171785 -96668
15554 -96668 -162132 -183139 337890 90041 -301273 56383 -21655 147058 -188236 -59835 -59913
15543 -59913 135612 982 72768 63451 -195005 -21581 -296253 125137 -74718 -503585 -60812
15531 101405 242989 -18099 88741 -10109 -224531 160146 304569 391829 291592 83663
15520 105017 -159644 -78090 54952 -75384 -95952 138638 -262360 -233577 139104 50417 -37197
15508 1349 68119 -19992 -157706 37537 -50632 -385436 3970 75318 180350 99720 185950
15497 185950 142550 10346 65803 -297872 -189463 226670 40764 -42578 -36014 -144186 8350
15485 -159706 -10004 -117524 -215194 -65958 -85529 -419625 -214983 -141843 -286926 152014
15474 55602 393943 33033 163373 430681 134390 -64619 -63733 163254 -260355 20950 -201151
15462 190624 -38304 88770 -19538 71075 -55708 208324 -34929 -195871 -33754 73117 -212977
15450 95296 -69822 129999 121784 -18160 143884 -165430 -283381 104228 220226 7601 -107762
15438 405228 14838 -49027 -10616 113147 -48060 -136525 45408 27454 190030 -157209 -328241
15427 -328241 -76452 28756 379149 -2572 87574 120552 144290 55741 -47244 -30802 -74720
15416 -74720 -49927 236228 96880 -59563 -70031 15638 76065 -75756 14694 -199691 -120908
15405 -120908 37622 82742 169352 143133 -366810 -272322 292397 71885 -207865 -234362 112068
15393 79807 -437246 45961 9088 -197706 42114 101348 56999 -100855 140058 79241 -291787
15381 -268172 -83204 -66744 81195 -16553 201480 1622 -108645 177862 12375 202099 177392
15370 177392 -10745 31956 339848 57818 238414 188011 5470 29497 -21084 -203046 -70370
15358 114974 65944 114445 -162839 433191 -408273 312532 -85694 22488 77565 -16675 162052
15346 215331 255210 -66615 -50969 -244424 58599 26615 -52916 -96732 -38279 210047 143070
15335 143070 301362 24793 -36681 144590 287450 -191268 42554 5565 191961 192736 -6556
15323 -82449 71099 130591 323774 343272 -117268 -130340 123938 100371 -111141 206495 166187
15312 166187 -312514 18066 10277 258667 261007 -145205 236484 120784 161150 -133468 64279
15300 -249727 27256 -116275 164758 -30916 88349 -166048 158859 189414 -165764 -45315
15289 134588 110458 -242838 -32872 38098 -100522 106387 42686 -97665 24917 50355 -34853
15277 93574 237523 -109545 268163 -23871 -78742 -13065 -277110 -99030 302435 -232810
15266 128628 12460 -99723 -137125 55911 -6379 -33782 133516 -212229 456333 291370 103972
15254 4701 194516 223767 -183 55388 -76961 -25721 239108 28700 1869 156970 251563 -115905
15241 114515 150706 361320 66272 -216762 199175 435965 41870 170757 88759 272649
15231 272649 182656 134509 51139 116522 46774 -94116 411412 308877 124548 -226441 43597
15219 53258 43265 -6504 95073 183879 38266 -106515 -744 149581 139249 -86147 -7081 -272993
15207 -272993 292170 -113665 -43425 233384 -4276 125414 115339 -281815 1102 210422 68713
15195 -6537 184352 79056 76228 340481 67488 522774 -135561 122734 249043 193924 -71820
15183 -211041 308234 -22703 281667 16318 170353 163588 -106651 129252 180742 245293 223326
15172 223326 260581 -151742 -47285 33127 311924 -18170 240321 327066 132808 1725 -18932
15160 17041 285804 194545 102382 273876 -129896 271126 11654 245788 199934 -72715 334238
15148 -43005 -91786 393970 98689 -103960 111821 -53569 -93651 114018 -30647 137129 18888
15136 -46880 -46380 164671 104046 449985 96206 146203 166737 -82151 106711 273415 -6882
15124 6200 203253 280136 145871 -69830 523996 169937 -454024 -81819 97792 205731 -67354
15112 70865 322195 -212363 404175 364873 157362 158086 137256 26302 54198 184827 452753
15101 452753 117714 188383 94137 -240725 225136 -21102 341361 93699 114557 -149952
15090 144844 -185713 47781 355813 145718 323713 407404 -63578 29508 61559 53046 -47641
15078 228031 111627 62998 27343 185144 78737 106796 223810 152129 158529 223109 138343
15067 138343 87952 -97234 -71353 122716 111205 180988 238723 -138343 74488 260649 -33421
15055 214983 403198 -16420 312474 114068 212924 272080 82281 145460 188741 218700 219631
15044 219631 290157 21641 66359 315735 240753 92523 327170 197246 420576 231381
15034 231381 296869 -121744 309043 51659 64080 153226 -29371 -130567 207859 225619 -47709
15022 341251 158013 85015 42453 34300 -41544 204547 40602 238829 127120 211669 181582
15011 181582 303640 148781 343242 12473 298917 11483 339525 191997 343739 287878
15001 287878 276112 -46077 240354 47444 187149 284147 293356 116640 69217 -171209 103124
14989 294233 352114 307050 492154 306529 265723 374328 364457 141513 291755 404343
14979 404343 88071 440567 378442 534033 340020 150792 396343 496904 486973 267740
14969 267740 76947 403974 637431 302585 172155 532486 336137 253471 442220 594055
14959 594055 408441 364584 550634 235849 274283 323469 57933 356058 257950 224277 231813
14948 231813 422780 220817 80676 219311 483770 294848 162360 561653 448394 250227
14938 250227 373686 204901 153572 561021 87916 411753 96711 577754 216054 336557
14928 336557 322995 111273 265844 70604 501522 237993 432046 511783 730813 213910
14917 383054 49410 429998 357671 394437 235511 260069 450367 277044 47575 247085
14907 247085 210327 502237 327942 621101 104719 589974 472327 437642 644396 377088
14897 377088 209491 772886 466881 526517 306146 486850 363440 291233 491630 408066
14887 408066 376575 297608 527700 420815 290964 205426 198524 429187 330457 527169 296632
14876 296632 409892 358539 -8226 112315 213143 145899 497055 392766 431587 700643
14866 700643 55178 488951 368322 180906 57070 165454 283975 184123 486693 196335
14855 326061 393761 536310 403476 237746 408324 555646 234428 331223 609198 291511
14844 454662 242970 464301 327570 410128 67799 432285 466416 389258 315104 608112
14834 608112 536061 551264 447518 663416 312153 650489 381466 684469 281272 511804
14824 511804 378768 176865 492114 548027 432263 386688 594086 525503 581903 377854
14814 377854 373603 398467 558646 -77 404046 294910 541188 763861 702127 471851 539764
14803 539764 512190 626803 788305 265364 663865 -18430 245725 662851 521576 708155
14793 708155 129710 420476 642522 550909 230520 262614 757487 470783 525286 363470
14783 363470 565178 720165 630975 858883 496863 676101 586410 769440 591770 673717
14773 673717 600503 610009 751250 465266 600687 404608 391836 347227 612299 687757 716091
14762 716091 305454 693130 659096 885640 670921 216974 522346 498038 780758 731122
14752 731122 487436 395527 735324 744032 427151 975616 558420 770199 974867 154898
14741 777554 599200 619007 835366 684382 825357 658492 781983 617076 644199 415427
14731 415427 812121 776348 714514 787757 559472 904905 712786 751747 541618 658349
14721 658349 762657 901700 671549 956133 616240 607664 652564 800639 715272 1108992
14711 1108992 507607 688772 885804 1110337 856303 702437 807194 907132 852944 934984
14701 934984 940457 924306 944432 1003156 863849 914603 1226806 886707 1051424 870671 826799
14690 826799 1308536 771428 660307 946624 711251 1120368 844838 919398 769210 691138
14680 691138 1073931 795983 743431 985945 726561 842592 980891 942037 1119825 1006799
14670 1006799 1112975 1022841 1137317 695252 628724 1199548 884935 1242286 623609 1187780
14660 1187780 1055926 1059035 1023970 932137 906591 1190852 1095848 1277576 1154834 990475
14650 990475 1240806 827737 1067168 1116057 1037473 885646 1330269 1169283 937178 1016332
14640 1016332 1127124 1101684 1122728 1267991 1421198 1235755 1360546 1223875 1176401 1660182
14630 1660182 1343578 804250 1293498 1059130 1514483 1438716 1344710 1284101 1642581 1232226
14620 1232226 1295155 1151767 1322723 1244554 1248179 1636424 1247525 1515885 1283803 1461708
14610 1461708 1454234 1209243 1599896 1300584 1287289 1531085 1408242 1677148 1306959 1667496
14600 1667496 1564836 1618245 1555107 1560794 1647268 1465989 1585046 1448652 1715397 1567608
14590 1567608 1547692 1620046 1440833 1820343 1717950 1561833 1733277 1606705 1689974 1586117
14580 1586117 1986525 1964590 1621917 2242197 1559089 1943475 1869114 2064563 1966564 1660659
14570 1660659 1779798 1894566 1926811 2079367 2001522 1802418 1915468 2073392 2099180 2272515
14560 2272515 2303343 2201655 2269319 2306319 2014990 2476023 2159776 2547669 2271150 2530141
14550 2530141 2733617 2658523 2558514 2758708 3031326 2964983 3491377 3608646 3875804 4071336
14540 4071336 4485932 4663104 5254305 6076788 7235526 8577455 11143671 15081219 19641912
14531 19641912 24341116 23121244 16197944 11465916 8287173 6066675 4992235 4006805
14523 4006805 3892935 3314805 2890314 2926453 2986530 2717013 2445378 2685790 2683291 2726182
14513 2726182 2566098 2826458 2908606 2288512 2758300 2767511 2491117 2490843 2906917 2461027
14503 2461027 2734968 2754978 2828492 2667851 2618984 3009949 2712427 2871138 3035696 3161507
14493 3161507 3266003 3145531 3340824 3222156 3146940 3089147 3116965 3435903 3080236 3340749
14483 3340749 3379309 3349432 3387552 3514139 3617656 3515329 3548371 3824486 3549242 3869155
14473 3869155 3959723 3897204 3981328 3737837 3913276 4001225 4095148 3986856 4167362 3883319
14463 3883319 3993647 4469756 4498483 4043481 4320035 4219843 4557111 4218260 4382613 4441850
14453 4441850 4659342 4826005 5073251 4926280 4644568 5053244 5159554 5116222 5208845 5018551
14443 5018551 5195969 5381694 5126530 5383128 5342902 5458545 5768658 5285145 5673122 5951940
14433 5951940 5741977 5986648 6048954 6036865 6069230 6108320 6489429 6318884 6520384 6556637
14423 6556637 6684562 6640911 6968159 7023426 6808382 7005852 7398105 7154244 7734184 7535412
14413 7535412 7613602 7419219 7870940 7792150 7871961 7980694 8172959 8433318 8274444 8695991
14403 8695991 8715703 8891130 8880481 9294857 9062795 8961110 9839550 9480468 9596396 9970710
14393 9970710 10077711 10122439 10565166 10944941 10786809 10679005 11228916 11280720 11372735 11653321
14383 11653321 12003974 11901071 12313897 12306167 12597331 12613712 13076142 13457733 13350124 13603828
14373 13603828 13972138 14176249 14390647 14575930 15108988 15323768 15753317 15819215 15995223
14364 15995223 16397320 16787184 16762277 17696283 17658968 18108714 18210483 18760022 19295109 19565234
14354 19565234 19838472 20462522 20663916 21312621 21809603 22186683 23164373 23205214 23673768
14345 23673768 24458078 24889692 25110789 25945205 26689281 27442142 27873350 28299090 29196586
14336 29196586 30129679 30859135 31658338 32310776 33004700 34136881 34854913 35675859 36705223
14327 36705223 37717406 38828783 39938767 41084072 42267702 43539124 44842802 45816470
14319 45816470 47545057 48954026 50710280 52238187 53696051 55896952 57292403 59201305
14311 59201305 61277838 63342755 65323744 67584873 69829132 72503773 75487765 77957809
14303 77957809 80747373 84013949 87180061 90774129 94124995 98096845 101788885 105877349
14295 105877349 110320064 115082786 120201554 125184530 130904501 136656413 142814610 149374622
14287 149374622 156159289 163448321 171281504 178942963 187702349 196746043 206042639 216076673
14279 216076673 226497007 237594453 248865488 261322145 273719464 286782486 300036323
14272 300036323 313630608 327573340 341348348 355110690 368204137 380613069 392457008
14265 392457008 402973496 413064184 422146555 430185293 437258728 443091574 447603862 450197280
14257 450197280 451311557 450945148 449430593 445131530 438840116 431005648 422044953 411789769
14249 411789769 401117742 389493512 377819575 365639467 353163416 340191528 327370561
14242 327370561 314850468 302144118 289633236 277611994 265983034 254417245 243334920
14235 243334920 232531301 222119899 211865403 202235472 192901825 184373855 175897333
14228 175897333 167601746 159054399 151761908 145024311 138368214 132272857 126344146 120811786
14220 120811786 115866598 110931841 106464806 102612501 98467718 94338428 90781552 87172160
14212 87172160 84084331 80667566 77816586 74888979 72243067 69606200 67561784 65203088
14204 65203088 63214477 60992581 59119138 57206991 55268829 53963883 52281021 50624905
14196 50624905 48895646 47609955 46105548 45082912 43776646 42727404 41015452 40089286
14188 40089286 39119646 37859826 37058910 36097589 35006943 34555448 33380457 32465239 31563925
14179 31563925 30905589 30149731 29395992 28960588 27928299 27289082 26623121 25902830 25518805
14170 25518805 24822807 24252546 23890411 23158927 23021170 21847715 21962773 21411010 20760307
14161 20760307 20532847 20138435 19692179 18940061 18748320 18400122 18231325 17701401 17434802
14152 17434802 17126130 16974092 16899546 15904932 16100653 15787322 15321468 15216349 14928891
14143 14928891 14625835 14457066 14192670 13991955 13713899 13302736 13205544 12520432 12835639
14134 12835639 12497510 12404948 11922277 11751874 11903108 11735445 11248144 11073928 11036506 10880795
14124 10880795 10806780 10713068 10413881 10102046 10186125 9707633 9602744 9571880 9398926 9351249
14114 9351249 9194549 8759099 8843453 9206832 8758158 8602676 8746097 8492679 8269426 8182145
14104 8182145 8036556 8300776 7842592 7628880 7606799 7692561 7260355 7398982 7296581 7384931
14094 7384931 6831670 6944972 6860174 6927894 6551415 6708156 6646807 6651907 6538573 6427898
14084 6427898 6469889 6244296 6012094 6298974 5917756 5894250 5784655 5670849 5448351 5453596
14074 5453596 5557307 5611117 5543805 5300363 5403054 5435930 5465687 5239651 5363593 4833347
14064 4833347 5472840 5014284 5056087 4970550 4786443 4748827 4786512 4577991 5000990 4492041
14054 4492041 4562336 4643690 4251246 4442268 4328149 4345878 4369835 4216984 4236347 3902540
14044 3902540 3877812 4147279 3804768 3815194 4162301 4036257 4090527 4100717 3825054 3834004
14034 3834004 3715030 3840983 3881522 3762968 3523881 3738088 3656513 3532470 3263269 3277495
14024 3277495 3409738 3177138 3377978 3432701 3538415 3466514 3117146 3261264 3428004 3455673
14014 3455673 3545582 2775903 3115538 2809934 2856540 3381123 3026007 3063902 3191483 3079272
14004 3079272 2837065 3130054 2811954 3060770 2653930 2576554 2569386 2810580 2483643 2501611
13994 2501611 2631801 2819972 2514788 2590124 2667465 2630598 2486269 2425111 2539321 2519134
13984 2519134 2692455 2533982 2934613 3128126 3269936 3319495 3523340 3940608 4955563
13975 4955563 6176128 8055333 11125858 16258011 22319156 23437449 19025937 13972367
13967 13972367 10574340 8606344 6779308 5942929 4918246 4730847 4234041 3840258 3839098
13958 3839098 3421331 3276872 2900626 3152133 3029322 2894606 2652740 2716838 2661953 2616268
13948 2616268 2159324 2367349 2325804 2554314 2408391 2362102 2024431 2034432 1890435 2469783
13938 2469783 2056702 2246455 2025963 2088931 1975033 1913379 2031411 1894601 1953839 1823007
13928 1823007 2099300 1980794 1701022 2062288 1685380 1909672 1843300 1601738 1532034 1972937
13918 1972937 1723480 1957555 2096702 1725268 1908387 1823702 1503492 1925895 1649050 1642228
13908 1642228 1505196 1454174 1566034 1894774 1624155 1755896 1366360 1394209 1809616 1548169
13898 1548169 1214487 1653773 1589189 1513683 1296990 1545441 1600171 1355604 1613323 1278400
13888 1278400 1237192 1299510 1326077 1288602 1326170 1386211 1335744 1493444 1711127 1198042 1398032
13877 1398032 1401922 1534736 1585239 1384368 1521312 1267495 1390016 1364394 1424814 1297087
13867 1297087 1316332 1223096 1048265 1180947 1233961 1485292 1474253 1304325 973777 1224817
13857 1224817 1392476 1100898 1429550 1120295 937252 1047373 1111080 1421186 1254624 1377875
13847 1377875 1469649 1315713 1401561 1133887 1124970 1008477 1020304 1173289 969359 1388886
13837 1388886 1141433 1099483 973751 1092497 1038409 740729 1272845 1160447 821883 943365
13827 943365 989845 1063510 862941 1050334 933331 1107206 1190251 1154656 775175 892449
13817 892449 1022697 1060333 1128905 1072882 817956 989546 1149976 1049105 735835 1100260
13807 1100260 1143847 891174 590694 1002543 971204 921253 990486 1117699 881430 948485
13797 948485 845444 993804 1107746 985213 857734 725687 953984 642921 901902 750067
13787 750067 825658 902216 1234922 648858 877022 1087253 965335 808925 714800 826828
13777 826828 835414 868492 782890 526159 811923 927992 1120479 745304 836102 961191
13767 961191 792482 612368 712299 638023 1042448 628308 473130 791879 849514 733729
13757 733729 456179 503689 735778 739477 584439 899417 994692 843440 610330 453267
13747 453267 751774 531899 571167 692197 663797 743580 1221864 687840 815445 1070099
13737 1070099 785786 577219 649039 828987 717072 479379 789694 509796 703109 688193
13727 688193 969040 446530 488786 479673 621925 663602 479928 544042 826993 229881
13716 203676 385150 850148 659898 511707 719199 824826 432151 651956 757133 652154
13706 652154 411878 166668 810131 557977 813403 753313 1046579 430476 865788 802703
13696 802703 654754 715583 516992 634860 840918 350140 804986 528763 381460 412870
13686 412870 922786 558037 605072 458364 743937 533222 868179 617721 473241 806923
13676 806923 494820 807326 468987 378303 531607 518126 837257 639592 213873 400542
13666 400542 555841 485867 662868 517970 606665 519287 582643 310162 856324 293639
13655 348838 459838 301813 638635 211929 743049 337710 702696 513393 514849 384285
13645 384285 364418 387244 513802 436571 205613 485904 391506 688195 230271 339392
13635 339392 692750 657528 500025 506491 574429 359400 384419 541201 521015 658961 268830
13623 293471 717488 522592 701622 542986 287003 369871 516847 484473 155179 391419
13613 391419 589462 447160 347039 138983 384526 133088 523889 583195 269229 250443
13603 250443 433089 675378 713017 212425 281877 459403 388583 492622 178911 708885
13593 708885 399133 391029 289022 345874 292079 448948 292842 387076 287059 521751
13583 521751 191133 391805 284805 282289 534374 273001 546838 447789 279141 400573
13573 400573 396062 661048 580845 160696 194185 362281 269134 330151 515848 366877 210918
13562 210918 201004 287454 535745 243345 713551 130436 314665 182282 178148 393650
13552 393650 379731 444755 333080 262913 477404 561338 465490 -28428 368784 438304 504330
13541 504330 311486 717825 392213 170223 360081 318389 599072 55370 208197 195042
13531 195042 298848 286089 449592 341671 488029 452366 238643 503801 321090 277092
13521 277092 255316 559621 139768 427767 275609 535115 507554 600821 651780 288272
13510 480319 177961 569800 388314 469481 239860 553031 233637 177719 565660 263143
13499 64105 243059 120842 539379 16829 272100 55089 91223 189376 191670 411158 89905
13487 112608 162549 324598 265417 313988 -64872 399196 499408 160662 482465 767743
13477 767743 199735 256369 183114 192729 394541 -1422 235906 106585 291740 223280 397608
13466 397608 49246 60148 151092 651812 -154720 460129 -33355 164682 96922 56598 432018
13455 432018 240256 -24963 20607 100820 169616 117124 73848 177167 103096 2116 330936
13444 330936 31074 33869 235086 22230 607997 -17683 110296 374336 407218 105105 157398
13433 157398 227372 639520 363709 128098 131072 62377 373470 346034 441449 258974 334996
13422 334996 355267 185545 227086 62317 122073 407163 147109 199035 418421 541233
13412 541233 172948 237947 106628 29746 186375 572192 400088 102209 396672 205781
13402 205781 280229 232766 158664 499751 307730 351970 614512 19278 133876 187094 52084
13390 -249 394480 275031 -11371 386703 397934 570530 -83052 35778 638471 381158 53977
13378 106628 -81584 202776 -47165 233703 68657 210784 126802 218204 80927 88384 264222
13367 264222 -24714 168418 493005 296512 220768 415628 -42996 201769 447330 285484
13357 285484 481887 288564 303911 423107 178310 235870 90712 105368 44933 -115972
13346 247710 93612 354277 597116 326919 237550 400901 227570 157268 151197 140661 331323
13335 331323 111626 228053 330691 323507 89424 4986 286013 178224 435762 395861 474520
13324 474520 47043 301571 453415 294807 197971 255556 242759 -81030 41095 -46388 363211
13312 226585 161760 461578 334601 191782 277155 171055 147402 47753 343449 130296
13301 377012 169221 152971 335132 -83174 5378 312110 54232 93123 20520 589066 3588
13289 -37238 176572 -47256 273158 -132803 363411 100371 220686 197658 226570 367336
13279 367336 287516 157211 185113 492820 170683 245292 -195183 117777 345555 315665
13269 315665 1794 272138 252373 174011 -33025 -218825 -61546 93726 301152 319069 290953
13258 290953 376339 219459 235589 48543 345141 -286721 -137189 79378 8920 219576 202120
13247 202120 189383 161393 222832 303021 -45489 -116454 394647 134193 359251 303749 231488
13236 231488 196420 125975 280019 10398 276556 461248 197351 414883 333129 309006
13226 309006 62924 95651 95197 158717 108581 198999 102341 -107672 194456 84050 83248 107784
13214 107784 446670 67071 35024 -107418 -222480 124232 -152234 27695 413568 40483
13203 106269 -20118 154927 209417 -75952 46834 61188 -70479 -41895 5654 255874 67865
13191 -51840 40415 -166634 185734 185576 50991 5173 194737 328471 -94099 10252 102376
13180 102376 212193 307872 -153857 227918 36325 199046 147620 163637 286304 123823
13169 117807 109255 223526 -113651 182044 63615 254158 -140483 826 -70869 -255042 178041
13157 363275 386589 33700 5085 -9863 17534 -31574 15484 -115648 306000 375496 -133384
13145 386276 52260 59526 -192450 119720 173886 140398 10465 244646 119984 -2365 -88451
13134 -88451 252462 339487 192039 162476 52434 241859 348213 -349941 -192295 -196426 194566
13122 138769 345232 319875 -42054 179003 268420 296938 -228374 -7771 243095 -35652 294805
13110 137940 -48353 123222 126435 74660 36967 -15540 421718 53696 4946 -6506 133950
13098 -240681 -23949 347858 -94595 195131 207568 39621 -33854 74440 144796 79770 66245
13087 66245 18618 -210044 349024 234449 127114 21095 -96525 379481 248531 -65982
13076 -85176 335879 -76798 102832 59868 74450 103743 370890 -84375 -51130 124311 182235
13065 182235 -42810 332870 30905 -16528 138383 46497 220706 409877 -161162 264917
13054 -126349 105988 278630 -6322 -128552 79057 -57758 314819 283619 101691 113094 91609
13043 91609 168011 262009 38848 75275 161347 135564 112040 -161623 56005 182424 225533
13032 225533 -106958 185712 -133003 -101811 313358 83371 -125587 -137415 254397 65978
13021 -104508 -22155 142062 4609 1132 92122 -11047 88857 138745 -26333 242927 464055
13010 464055 16912 93442 -117266 171082 13382 14762 212528 -86194 79807 138453 148826
12999 148826 72411 -117112 184883 -24418 -8832 -74883 -6732 379313 227196 -217376 33177
12987 115935 15291 89567 -187670 -207079 103315 112570 -45087 215599 192594 -276760 -8562
12975 99944 -48351 -45744 147825 -144828 -88388 174209 348184 -171269 326042 -61212 -245366
12964 -245366 -106569 -44197 -75164 110687 -93798 141369 311000 126764 109262 78542
12954 78542 234819 -119973 -1523 112196 5128 -35293 169456 -86083 117174 -212627 80175
12942 422341 174269 -224490 -204049 192836 -286064 191631 224497 -287827 -136561 46359
12931 149770 -205495 125885 104553 -35468 -97504 -25272 416424 111524 78393 110984 105948
12920 105948 199031 140117 -95588 -63240 76365 -71296 37457 -12491 335701 132269 66949
12909 66949 338401 -27016 147703 3383 11230 216636 112369 -65423 119869 45388 -70483
12897 -253498 -86102 21603 43395 -50721 -69356 283688 211994 408582 113030 121325 -206585
12885 -87978 164505 2462 30537 57445 -111962 16916 328838 147150 68617 -23268 -92795
12874 -92795 1506 234496 -75042 -405776 182336 187734 82771 -160256 -99802 255197 32950
12862 5140 -295416 -72292 -128826 115192 149022 226417 -116975 95927 85100 423050 67539
12850 309690 89413 33795 -41663 180802 10518 -148136 53841 -286346 -78638 -32603 66874
12838 -1176 -46576 -76043 392811 -311115 140120 285806 -129537 -36433 -124229 32072 104425
12827 104425 -6297 142904 -320082 -150984 -21054 281588 -189730 160768 -287089 -17230
12816 -154763 -59259 145322 -4693 -74207 150821 242669 -55011 341850 23943 -147504 -192053
12805 -192053 -453054 -74091 110587 -194391 9631 -15268 106960 79114 -150245 129654
12794 141571 -27289 13641 64385 31600 -77026 -67090 -122860 -116852 -127665 -27855 92973 65128
12782 65128 162106 -139220 -56951 223377 -152462 116317 126374 40825 358482 313414 -102123
12770 55417 28569 206990 -129879 296668 -100304 73693 -20146 119244 -284720 151720
12759 90698 43064 -13147 17342 -30741 18839 37342 -118440 291002 -281603 164382 249902
12748 249902 -149264 -96011 -2631 -37997 326982 110871 86045 -65048 118809 -7818 121832
12736 -199234 -62575 31360 -206497 107307 230472 165001 -30971 -19826 193055 185981 27276
12724 91261 95264 -142223 -155709 -290362 231087 152978 -37150 -144097 -5534 61412 -49074
12712 -320518 -60564 -46998 10726 -255974 291809 33169 111211 172426 -99340 -140859 111001
12700 13538 71765 -87075 -293986 -189220 291040 106622 -58020 135864 143760 14960 93560
12689 93560 -216667 183780 -83717 368665 -85198 306352 221277 62037 174918 -50810 -337476
12678 -337476 148162 8807 339185 204536 7104 70549 -49571 -179130 91858 102012 13819
12666 60102 224016 -65236 -179639 191931 122949 105010 211808 298535 164580 -261510
12655 127222 379133 -10570 184799 -9252 125868 156538 -97190 106387 397108 76192 237162
12644 237162 324642 108954 166334 51658 361076 -85009 326623 9391 69375 214508 -165681
12632 -8474 -209786 214366 129191 66915 71287 23163 267359 -128393 205007 -171203 16932
12620 -110921 314552 -102315 -131241 373367 274476 219085 28981 224804 -46127 462500
12609 -200919 -239497 200629 424454 159111 334534 403897 49662 257738 -258311 278273
12598 -570 311272 261545 303427 58122 -121089 42826 -44776 109206 -295313 292417 -58138
12586 104635 193716 365963 253089 -117214 -29765 224041 99604 133752 -229019 195795
12575 159887 303357 162651 36429 -139836 -9871 429536 -408738 177854 561553 -5304
12564 35614 84532 -242542 -50141 -98792 298102 -11100 235260 -66526 153996 152447 -51158
12552 -344810 -63857 -37627 181095 -55269 57583 -162749 84536 -131998 11014 145718 -28539
12540 380821 326782 -248551 57206 -151023 52201 -122165 162483 -181558 -213177 -189605
12530 -189605 160957 -21809 72528 -138959 -12177 -167224 -98177 -351810 64274 28997 8156
12518 -57609 -195747 371539 155946 153949 -1826 -72165 -257391 187550 293294 -137583 -37873
12506 268768 204570 160651 129530 167786 -36751 509214 -73386 115424 17971 359865 213359
12495 213359 209935 -7414 288859 260021 -39508 145442 331373 54691 70013 124057 -262853
12483 137957 -209669 230268 -262997 -22725 155644 -9642 265058 333988 17893 -195075
12472 -138688 28692 236868 -133305 105677 -172858 58648 286268 -222991 43750 122339
12462 122339 13567 -9557 62093 -171092 -136446 73050 220304 115239 199739 163524 -62460
12450 108702 300518 69218 -84945 269515 -67316 -40485 -128852 77479 141098 -324296 105118
12438 153416 -229698 226607 -124353 14295 -105047 -300894 145036 316548 119758 -38521
12427 -27500 189536 16067 -374959 181568 10408 80092 334965 -66248 121144 -65851 54843
12415 7973 -10422 -157724 -193648 -73470 -55265 -15483 -2664 311827 89387 77431 70666 -112700
12402 -262702 -207211 119743 249077 115092 -135549 279852 -48763 142831 -270324 -187494
12392 -187494 -144373 17759 593754 52704 -43050 -195632 137490 72490 -148155 83023 32473
12380 -13666 289353 147631 -39662 -145827 128301 -123175 -113912 -93637 153508 -5163 -109356
12369 -109356 22276 121074 -339676 108129 187082 -244372 -364415 -190708 -69314 205494
12358 -219542 261793 55495 -139184 197889 24657 -124631 141658 -60576 362189 -58209
12347 -80500 112547 42239 -344808 99848 -329886 48270 -225731 287951 243404 215614 -91027
12335 -250562 -74784 68292 104644 -3041 -4666 -59402 -120258 -126153 51491 -64342 -18473 -309207
12323 -309207 173275 -35872 64454 279724 -5345 276738 71237 290198 199459 -112909 -14087
12311 44578 287345 19890 184364 -84292 -3525 -113511 18316 123335 270774 141413 162932
12300 162932 259325 -121600 -107624 239989 103522 98302 271521 -82460 342867 -116231
12289 337596 -140302 -211728 -146888 24889 -40162 76462 -32086 72578 -11940 139930 -112768
12277 152042 -64448 -19071 -73846 -157717 -255746 239189 -274636 -150656 -209838 -88265 -194052
12266 -194052 -8143 -63249 -95609 328807 60161 -339706 69437 -431650 -107523 162857 117842
12255 117842 205546 17668 -95614 -119830 86308 -279481 11322 -24968 64704 8225 170758
12244 170758 88100 -57064 128171 118101 -48119 135203 283045 65512 229475 -4138 -52021
12233 -52021 13680 -4826 -12891 -202651 98779 400977 68168 1137 -2964 -8390 103824 -76000
12220 342689 89887 129416 -180829 1249 166568 36248 298455 176161 99022 159570 542437
12209 542437 187688 196341 88425 19594 269617 -148188 259165 119760 75280 -66850 116121
12197 118298 168244 89442 -125443 242331 -158169 249066 -33141 -59352 69803 367031
12187 367031 133596 327505 222043 231151 156783 402792 424417 -131493 76371 254664
12177 254664 194065 -184668 60245 118751 329464 -66747 458507 532406 -8575 96888 143819
12166 143819 146833 535058 103783 122965 150324 -141071 83398 13005 197949 -293808 -98131
12154 -194277 412185 150379 33005 -92875 -122252 117743 32674 230203 491849 127058
12143 402900 12902 -284912 -94730 -106090 -97863 400123 253969 102750 -92505 -9547 -59604
12132 -59604 141549 141493 -131366 96609 94192 121583 -154136 95347 231794 -74149 149410
12120 266783 4279 292919 79690 -17361 328280 -156223 220487 131844 70402 -58860 231208
12108 -358647 310866 -81712 409772 67059 194912 217147 450947 21980 138057 -47568
12097 -135269 -82019 145545 -320893 -125976 -120015 110197 69873 -16428 17295 151557 196886
12086 196886 -4466 145533 -34584 17106 129064 -298971 96911 -7555 81156 277912 -174952
12074 75713 173276 168635 31725 -197432 -43862 -201776 -16641 38297 93306 -65886 207715
12062 27802 -158356 188030 116588 134749 -224128 -73000 94109 3542 -52142 -171063 -152704
12051 -152704 -377580 -193417 -313944 225849 -94191 -67134 -62480 -243282 30745 24168 295673
12040 295673 209194 44469 101211 76249 7616 134110 102748 -50343 -114371 136843 13991
12028 145410 -271314 -197201 -71139 25940 32093 1404 -158763 -58047 103061 -73421 -286034
12017 -286034 -8389 77421 118181 191511 -15932 320689 201090 -23549 -68412 -65307 -138490
12006 -138490 -147259 105191 -317020 7270 -124325 100529 104601 -65519 41364 34427 129844
11995 129844 237642 -136109 143825 67352 -30670 -134443 154154 118744 342667 350256
11985 350256 -431546 220150 273751 -31774 -225117 170811 -8581 -196564 30092 185014
11975 185014 89258 73925 -224964 47668 -196667 -183418 -63018 -469707 81912 -89803 -18125
11963 -103922 -11100 156731 63547 36367 -82080 46156 31752 -23851 -122095 52130 35522
11952 35522 -103536 -162852 106879 -301697 -425144 197858 -69629 73586 -56777 -174790
11942 -174790 52085 -224758 16563 -72371 6318 -268156 -317453 11251 -109557 503554 -40872
11930 -95436 53692 260514 -130854 149365 -11867 -202798 -288398 218435 12397 -192419
11919 -24481 -36282 -360341 -58250 -136036 77585 -297863 322624 -116017 -294178 -27571 120421
11907 -181632 -101528 156088 35126 -235682 184581 -6340 109165 -51691 -10691 29490 39971
11896 39971 210386 135774 -60278 -265873 102969 -262668 -61302 -274792 3762 -240949 125458
11884 -128394 20796 -205233 -161638 55592 -140206 -93073 -295612 -26345 94013 -128210 -303758
11873 -303758 172992 -141043 -313980 -189105 71066 114938 401003 203637 51528 -5963
11862 -66932 86765 131287 -86148 -365162 -243837 -62339 -105177 8694 -12237 -333439 -245220
11851 -245220 -30645 33671 -27943 15286 -242696 88286 148330 143068 27173 -313518 -32456
11839 11463 11882 29894 -96084 -45484 -235660 -267951 43670 -24662 -1098 5873 -13505 -98665
11827 -98665 -166519 -46484 -74689 7465 -171698 151701 -123123 -216691 -307610 -200799 -4492
11815 -279865 43575 280386 -251092 202231 -451946 -199863 212135 30027 103219 -84909
11804 -309012 175146 -205527 -80468 48128 43734 359223 -13001 79096 -37800 -146961 80297
11792 133674 82987 40355 -160439 -118403 274572 243711 -22587 -205848 -79053 -7040 -199768
11781 -199768 -324825 61561 -158612 -492649 36975 -13852 -32158 -74942 -74460 -25092 -109059
11770 -109059 -225368 -93334 -136393 -82680 14759 -382005 -163369 158531 -219873 -7882 141390
11758 -134764 -223921 101621 -119499 104725 173311 -203403 69782 -155551 -236421 20492
11747 82106 105969 -24268 -178246 41060 -223941 220197 -311086 -109893 96054 -59434 37321
11735 -228133 32398 395145 106805 116370 210874 167693 -202413 32254 -430568 274491 -5092
11723 -152943 -27520 -131017 107372 30454 215221 128624 207839 -349275 -85002 70955 -116684
11711 -126333 -83072 62797 264365 -80862 -62435 -321959 61662 152686 4784 -121257 -231932
11700 -231932 1541 -121243 202943 21770 346882 -334044 -247234 -85206 -210140 153573
11689 -93727 -57456 15369 -103613 -166757 196367 -12785 -43992 12654 -118209 26177 -353549
11677 71689 -58498 258009 -1675 -31378 -224111 -145200 -155510 -10901 -132233 -190990 192819
11665 85909 10350 -321915 -372020 205053 737 -62024 -104860 -244059 36681 141402 -46651
11653 -325423 -269676 59330 67747 -84578 13163 -25039 83065 138300 -75733 4935 78649 16037
11640 -62945 132307 -151277 -75427 18663 -51225 8893 -302260 301986 -90657 117638 115006
11629 115006 -116105 -57756 -217599 198783 60368 -263064 -49189 -77240 272961 70369
11618 142301 37770 -222784 119451 94318 125360 -217750 252517 99760 -40857 -36598 -23714
11607 -23714 -39930 -113202 -128510 69890 3841 36277 -131266 -20038 -17353 -68564 83211 265620
11595 265620 204398 -113928 -91526 -87377 389295 245329 163669 -19319 138545 -468423 300837
11583 -335010 -11252 53070 -142473 108879 184239 -323866 419476 67768 -135098 78903
11572 -169691 -382803 62088 36671 310221 -130531 45512 -137763 -99274 27202 51384 -104836
11560 -315830 -271771 145813 -220806 -185479 263562 -146195 18501 -154345 -37080 -72852
11550 -72852 -161051 367679 -181688 44348 31209 -78015 121483 13687 262859 30697 47456
11539 47456 113128 171293 -193820 -271770 50463 44430 -156373 -141892 166151 115514 -43788
11527 -536568 -84071 -111745 -131159 -4551 -35667 -124323 -100874 119476 24963 192977 4092
11515 -119557 -187624 172605 -81892 -247435 374258 184283 42494 -90854 240061 139963
11505 139963 30463 -134767 -130610 -6743 296982 -61008 174388 -38079 223476 -98027 163813
11493 106367 209237 -17851 -184257 -103169 119842 212387 872 499891 -38431 269333 -165910
11481 71347 -409 447822 -133177 84656 90605 78530 300520 123569 -125979 112326 70114
11470 70114 -361424 105009 33359 365583 183531 86433 -58185 220288 111802 73594
11460 73594 -305034 -52496 236993 146108 -6067 90327 136313 266136 276417 98945 147126
11449 147126 1473 43269 -62354 181026 -96746 1170 176856 -191372 -58040 216630 -9851
11437 176526 -4822 -29133 280046 375894 450326 288012 36609 87715 23688 -311290 42096
11425 126486 300252 -193526 -86769 30192 302464 4597 -315497 58455 -58839 205587 -30533
11413 99405 1007 230553 -406885 388399 -93753 83383 15935 192044 -156540 43102 -177549
11401 38552 -90198 -312352 -206297 61877 -49393 -99039 -60692 -378060 -224886 91024 -118401
11389 -247205 -85072 -183729 -63722 19015 -285224 80802 -218125 71443 169839 -277976 137643
11377 -108461 42860 -19738 44187 5338 -43674 -238471 199608 55560 -81334 -154569 165398
11365 -140622 53156 29376 -108768 150054 -68087 65683 194969 -63367 110595 177977 -12484
11353 -45017 -100220 529743 75523 277426 7905 -470779 -39668 59477 357834 265756 -98027
11341 -257014 -145786 -127652 40987 -29113 185959 311038 21667 -379694 -97439 -219654
11331 -219654 -38273 39176 -82871 321340 -239584 -217754 388596 -440779 90924 -67980 -33116
11319 335570 -88909 -127419 -27945 -226307 -372723 2031 -117142 -114761 120810 -130813 35379
11307 -108678 -50765 267185 -33985 258440 -160326 -332308 -277680 217338 -27353 -17921 -195017
11296 -195017 123950 193296 -402789 -117483 74998 50125 98379 -112994 -196455 83734 26913
11284 43492 -112316 11396 -676 -4363 -459090 -176862 -123655 -106455 -317628 195210 -29157
11272 -67950 -192247 -217440 66346 71207 159990 197498 -310172 34773 -54324 -46588 69946 158842
11260 158842 111380 -152361 -59438 -174202 9961 -75864 -430171 -340716 60456 -58386 -141824
11249 -141824 -189826 96404 15965 -222431 141389 531826 -129363 730 117170 -185009 -120200
11238 -120200 -40364 104656 116997 -89683 123472 -11706 -362608 92860 220327 -32693 -367522
11227 -367522 -7944 -73005 123187 -42058 -141693 -107100 -232169 30293 357107 -16375 -6603
11215 89241 202995 -23499 -223799 77898 -135557 -356401 119467 27180 -72193 179905
11204 332594 29035 62292 -249850 -21353 -135520 -181708 45073 348944 -347405 -251771 -11633
11192 112061 154538 -62026 -135239 106607 -15757 -188063 -66652 -162590 -105799 -45646 -136419
11181 -136419 96231 389086 238765 -68040 -28500 -167405 -8157 -121033 183685 13099 -191603
11169 -117023 145669 18281 82362 -177444 -214911 -59582 -117793 -440560 126700 -43797 37990
11157 -202523 93614 -414706 -316518 -352486 -329324 -27133 368968 53303 -126314 -231316 277996
11145 180353 -146453 -25023 -219213 21847 -81410 -19823 217597 106640 115741 -146851 119824
11133 2859 70630 84658 214191 -27495 -66946 -48491 -68870 37088 95756 -458350 -164742
11121 70880 596 -119629 50573 -226995 196092 164032 184533 72565 -98219 66590 49494
11110 49494 214145 -69458 45384 -47812 -27973 75423 241053 17195 138784 202106 93999
11098 -39822 91126 27131 -184767 20965 203344 -34691 58408 119964 341810 85205 290271
11087 290271 26639 -11326 273840 101267 -129990 235702 892 -36283 240989 240110 160875
11076 160875 127376 84251 66205 297115 108209 374793 -129857 60389 -49130 273379
11065 131497 445885 291346 117107 181736 268965 176151 296612 233214 91018 242233
11055 242233 171815 156051 148064 447069 353759 269718 468187 526422 -98242 186765 520915
11044 520915 9049 77316 523788 707024 810480 217788 762095 587368 405771 598977
11034 598977 545207 698623 949847 729162 104739 446085 673396 763292 357407 537017
11024 537017 711577 946819 618056 788955 887271 935909 648935 424891 472568 548643
11014 548643 638145 617963 600902 461529 573765 435989 401680 565158 451548 123021
11003 268833 463690 548124 389779 470940 524966 477699 494028 516638 670723 184797 457324
10992 457324 382267 687332 504564 563328 341757 727224 548744 432923 274938 168050
10982 168050 254038 241951 649859 859881 239137 702169 503452 449017 451880 578261
10972 578261 173720 572290 905017 776494 938594 1023062 940945 789274 1153368 1014440
10962 1014440 1363722 1616506 1555888 1889772 2136806 2108497 2059341 1982570 2043638 1857733
10952 1857733 1504174 1611610 1067764 1129576 947434 755434 269412 581982 431205 302569
10942 302569 1013085 119553 577711 167534 544393 266988 74013 306431 -180620 206328
10931 418726 402744 -47996 93524 130440 -2827 134547 42713 9681 36613 229755 -27022
10919 -167548 234755 -85307 279462 265342 -7833 393117 -86372 25438 -232172 -280756 -118419
10907 -57134 -221813 -39908 -103510 -284989 -92185 143731 -59220 -282841 -337747 17529 -80416
10895 -204133 -227737 36468 85575 -231937 -405907 82050 -114518 -134490 115155 -147300
10884 129792 -63635 -42105 -206426 -89266 -51413 24443 -187340 153244 28000 10255 -112429
10872 -190999 -65621 304727 -75557 -688375 -75188 241084 -137808 106256 85482 131808
10862 131808 361288 -96648 22431 131316 133452 -140184 -39631 214208 33975 -7167 268270
10850 32252 -250534 257225 -66952 61974 -47304 -141856 42828 -429729 100526 -7436 -154749
10839 -154749 -82374 -71035 45508 49069 -27013 -214913 -167242 -122023 330041 -240070 -2812
10827 -61140 -88530 -149653 198340 138405 -81534 -143718 -37170 -3699 80330 228386 -79717
10815 278035 -262467 -62063 96368 -350340 45678 -254191 315610 45464 -112498 21307
10804 -199166 45227 -129956 -85886 190549 -297492 -96517 -22736 226830 -66483 67360 9884
10792 -290435 -466870 -75617 103238 254656 140848 -19147 -146745 -127709 62607 -194675
10781 -35568 13274 -46249 92642 143703 173922 50092 201412 122689 325852 -166997 47153
10769 -53222 -171218 -115551 -57949 -81496 -266227 -218330 -82548 -18663 74872 -267954 -63977
10757 -231082 -87212 -10108 229192 -102657 209439 215800 -33420 -74664 -142566 111620 70996
10746 70996 -14023 100789 -123561 -102210 -130683 -32870 -195207 -181799 -150973 306329 222697
10735 222697 71463 -144772 -70254 -47616 -129368 112616 -65312 -309870 123044 70399 -108197
10723 -154980 233468 -101411 36304 -90348 -174085 -35550 75134 70153 113989 -215566 -128047
10712 -128047 106850 -486035 -134590 48993 -152993 166823 -297591 -152505 -250173 -105731
10701 -121646 -136789 -222595 130487 -6820 231280 -224055 -185198 -269376 166190 163833 -284763
10689 -130899 -198686 -293912 48418 -103389 -277999 -117165 292324 -110286 19866 -11539
10678 -191648 -304077 -182045 -257209 72980 -45049 -167527 -151547 32079 -180093 240116
10667 -169207 126818 -226346 45540 -127627 -195536 -22309 -65906 -224743 -137482 -64184 339395
10655 -231025 280760 73017 356167 -164426 -16637 -347000 -126479 1021 -109793 -270954
10645 -270954 80153 64234 -71632 -22071 -214192 -168051 -205576 174847 -93359 251101 -146765
10633 -41444 77213 -16975 285725 -122419 -187583 99763 154193 -253839 -138339 52532 -120214
10621 -162902 72197 -248978 143648 18346 -66125 21117 -154028 -29162 -34716 -24962 -177525
10610 -177525 -65110 -251686 -203353 -82851 -299608 -63527 27311 -263357 -256804 -12225 -194985
10599 -194985 15768 -148653 173893 27487 347163 -277316 329313 61826 -144988 -99330
10589 -99330 160745 -24479 151950 234451 -13947 58442 77970 217146 40600 -39269 -122293
10578 -122293 -232117 -62364 46248 -226959 194915 -33116 86737 -238217 -73197 5458 -248533
10566 30919 -218 120504 -61234 -130396 208435 -3832 -165320 -46118 -251477 122863 -224877
10554 102674 -146134 -250567 -121731 -34276 -117363 -154980 -271724 128457 14423 -23942
10543 44516 -79666 -1898 -61239 30682 -240327 -3927 -65539 -54171 -15296 77487 40181 -267512
10530 349582 274060 -115519 181711 -70371 62399 -189578 206475 4959 -191385 36720 -58201
10518 205462 79592 -340379 50599 -213141 162414 -270873 31152 -288884 175558 184633
10508 184633 288470 88193 -352132 -232427 -73744 -131913 -265746 19833 -194529 104550
10497 112256 -27575 -51388 -212874 -76417 -222894 -102757 -169227 -248354 139144 6410 -348533
10485 -387020 -145877 -314979 301258 40935 59476 569451 -120331 -387038 54957 -30204
10474 -158865 54441 -70176 89190 -362381 -6955 -77191 279328 -59887 245920 -2059 -233909
10463 -233909 111744 153371 -51775 -96566 -35604 121822 -137852 22854 420027 -513573
10452 -39656 152498 -49837 -51176 198336 12168 -294668 96694 -80175 -202826 -126086 -862
10440 -146149 21834 -100135 -256692 315700 105639 -198356 175800 -11136 -281604 -156145
10430 -156145 279447 -56883 -276301 -74351 -158664 -416682 15051 -169007 106279 -73395
10419 12460 -97617 -228813 -151607 -224509 240088 -356001 110195 208715 35652 221948 -94447
10407 -259629 80561 -44355 58831 13517 -110933 -269393 -11195 68886 -204520 155457 -56599
10395 -146586 124456 -117916 -159197 260462 -142387 71834 178874 -62306 19394 201715
10385 201715 -156692 109696 -243238 -80741 -34087 255518 73465 397021 -130191 120312
10374 334587 133313 -314202 30543 40548 -94896 156252 -163274 56401 196008 475675
10364 475675 -179357 236316 30435 343301 -222558 -10192 475765 239274 140163 319815
10354 319815 296919 176663 162939 416392 252327 133604 96372 391978 127692 380254
10344 380254 386536 26903 204900 198732 -162638 448191 326170 224206 266115 202053 396720
10333 396720 109816 -13907 53109 242878 92694 44975 132289 -17155 142634 372143 170398
10321 26916 314702 243058 90049 -46559 33202 -739 104744 -92784 -79256 194834 -5251 322388
10308 -195493 43263 204492 41650 207341 -60247 115580 248042 -201517 69960 -132871
10297 92141 63240 110813 68982 -34965 -210595 -168534 -137670 -195272 -112849 -107794 -405699
10286 -405699 377430 -94556 -17057 -49797 -30184 77677 -206077 -35366 -239472 81225 -114828
10274 -13381 -252332 -239380 -74166 -104889 -49539 133578 -17321 135455 -189631 -143513 -534882
10263 -534882 -133096 -236013 -114439 150097 -45817 -123789 -111350 266322 336462 -100203
10252 -88799 13612 -324907 -370595 -2293 52830 341334 -134689 114631 -179501 115593 -49909
10240 81685 178680 299618 410209 -264925 -144102 111330 304032 20857 -81568 29660
10229 151261 25783 214563 -177990 82044 437112 -274352 84792 -53121 245585 -149163
10218 -162195 41248 67860 -143815 -163963 -72220 31617 -234673 -251379 76934 126078 55665
10206 -107226 44356 148150 -252839 155042 -207866 -225660 271377 -5199 -312458 73621
10195 -140223 -240557 -76210 267588 -78558 -202254 69702 -22612 204543 -84784 47293 -5787
10183 -116790 -28556 -128641 51819 60831 -393639 -148218 -216099 17440 187776 -76662 -177595
10172 -177595 -46695 -483896 215902 -34311 15590 -49069 -308097 83455 -43477 -87764 -194084
10161 -194084 -128666 -58159 -36996 234549 159395 194626 -182734 -86744 -205943 125290 -114242
10149 -230423 -50901 169315 -192669 27510 -149123 22133 -284376 -319122 33953 -129801
10138 82437 -247265 129424 -205769 -22628 -124162 -213798 50155 -223583 -190257 -416697
10128 -416697 -162216 -188808 -56902 43676 -91764 -160492 -68984 -85079 -308008 -10452 -77056
10117 -77056 -200066 -248988 82888 9375 -126122 9714 -156777 -138520 50180 42766 -42773 133050
10104 -205606 -78183 127059 182050 -354580 -27653 -94912 38542 -60160 7506 -164170 87792
10092 -62121 91579 96252 224709 -176262 332390 -26045 85427 4591 -91447 -232149 -30700
10080 209175 -67817 143296 -149544 -125077 20877 238914 -67897 118006 -269761 -103885
10069 -72087 -14094 69122 -57940 -189273 -88636 -13174 3640 -93761 57030 171074 -195271
10057 126177 -145798 155991 94301 -70846 -174184 -22159 225000 -197867 -108263 -282707
10047 -282707 -208409 -5715 -26831 -464965 447898 -298557 -33722 193686 -269282 -190455 289013
10035 -190337 -215034 275570 37153 104444 3574 -17938 -154232 35572 30125 23246 -192656
10023 39102 1224 -233946 29951 -256342 -222081 -17106 -150701 1818 -199637 -64971 -276 -73776
10011 -73776 169865 167152 76803 -122232 122081 -178980 -6698 -150086 224989 -118309 93347
9999 40372 33636 11027 22347 -59398 -112897 515923 -204278 63164 -109950 -244256 -329145
9988 -329145 -138035 205402 -137005 -36728 -33453 351241 -69168 -165440 174653 173074 -344585
9976 -200348 -4512 82407 -189438 -71912 -383850 67360 -253239 -279506 119326 213339 -139045
9964 65133 -39616 -107925 7901 60179 -240118 -307882 -67957 56722 -101861 -146827 157373
9952 -174182 -241535 -226093 -78176 95600 -6678 -141487 -266571 38363 -48454 59763 -72356
9940 69738 14156 -61118 93969 -261182 342576 -139206 -65493 -298624 -281467 -7482 -357382
9929 -357382 150532 -199206 37411 31919 -67470 6888 -489064 18747 354136 12242 41494
9918 41494 112241 -56565 15941 -158842 -315227 42755 256614 -304598 -339503 106534 -98634
9906 -17276 128645 124822 106233 104590 39530 48733 -63033 86195 -32058 72616 -280500 -150015
9894 -150015 194299 -180295 -157495 77668 -19114 -298942 -193561 -196257 -308200 62880 -84718
9882 -289900 -95477 -209231 173293 -58934 -87470 -103871 -48219 -195455 -185202 124610 100374
9871 100374 -191412 39865 -35903 -18135 -57604 -174152 -160701 -226136 199074 260838 226332
9860 226332 -257969 -179359 -184248 128588 -7795 -48562 -52661 -584 -122265 94439 173457 -200126
9847 92112 -84046 354802 62074 -118652 2507 36360 -113744 -382367 -443222 -57454 10325
9835 127494 -118455 -10195 64664 40092 -211660 58509 -43773 -118653 217502 -28775 131751
9823 -315365 12292 -981 -274337 59211 -333175 -89770 -119409 135767 215670 -171664 45780
9811 -114293 -175684 -296800 74540 -259510 44614 136061 -107175 -8588 -214171 -34147 41639
9799 86642 176701 7359 30963 133845 8388 -135949 -244124 -15398 -60636 -103374 -63622 -83042
9787 -83042 -332193 -128267 -30348 -48762 30696 -112042 -238529 -303340 -57379 -33906 -167856
9776 -167856 287336 -139410 -92288 -13482 -80639 -180482 -300161 -34790 209678 -17163 162650
9764 -339954 -229997 537580 -10119 44181 73281 -95257 151078 -7408 -303058 -103538 -325522
9753 -325522 136847 -137437 118202 -167930 -105942 -34999 152965 111375 -45378 -79723 -333621
9742 -333621 -271129 -25471 210552 -98590 151942 176585 74010 134569 -152279 159838 -13046
9730 76892 -78884 319262 278384 46820 -160720 90284 120 -116558 -184453 78880 -230947
9718 -313105 -71250 -65996 126962 376744 -153133 -61788 -61868 210460 92962 -191525 -234606
9707 -234606 -284082 -152612 -216451 235647 -222636 19718 27356 -151039 -218856 -91470 313551
9695 -202192 -172915 297 94104 -205057 -3014 -254729 -358605 3639 -78907 33328 53847 -6327
9682 -352826 -223024 -198435 81370 67979 172288 -189104 -339914 180007 267209 -277101
9671 -48563 -11083 -50858 644 -56546 69840 -109128 -137724 142904 321599 -104658 -293630
9660 -293630 126948 -178232 42146 79032 -211537 342948 -67916 213884 -82417 330606
9649 224406 -371632 -62698 12595 -330557 -237626 -106307 112657 36394 -283953 -126138
9638 -59699 146852 93350 10804 -248984 -198769 -134906 172637 -439626 -82853 28826 381820
9627 381820 -243681 -122116 -72082 -474297 -100530 -101142 -22740 -91777 -183883 149173 123466
9616 123466 -90529 2258 44361 -133678 -136642 -112636 -281503 210058 -301019 164542 268493
9605 268493 -297619 27068 -27744 -195508 -47862 -187299 39350 -185633 -149767 63252 -25132
9593 109902 49748 -112134 -99501 -29853 -253454 19015 63170 -225383 47355 -375508 -84218
9581 205535 155713 -139310 -190527 -170231 1310 -304511 85743 240711 -432055 -133639 -115237
9570 -115237 -98069 -186949 -200912 351895 -118738 -206948 -72847 133391 182127 92908 126189
9559 126189 -83635 91963 59115 -291909 75288 173668 -351676 -58675 62707 -162100 -226272
9548 -226272 -180858 -163660 -480586 438062 138936 -57274 -181292 -219281 99319 -189624 -293674
9537 -293674 -447808 -217487 -75027 132183 195517 -322826 -213832 174038 -327257 320312
9526 39478 -12918 -161244 190515 28780 -135004 58338 140330 344719 -27515 -182854 -323749
9515 -323749 -192749 -276491 74040 -87851 -213464 46926 -55803 205726 -119925 -202728 -137271
9504 -137271 -45146 211114 135780 605 57065 -29062 205625 -84319 -142198 -224818 108220
9492 -90173 278059 106307 -56311 37985 -43374 -134181 -141865 320207 266966 93994 -33522
9480 -40341 -324067 203547 -60026 -375490 8279 -179502 -135412 59743 -440603 11778 123009
9469 123009 -62152 8184 -55390 31528 -101223 -160024 10066 269588 -320934 -91353 127986
9457 24206 -176172 -84360 33463 -168432 -46390 -177320 11802 -161395 -151542 -358191 -58183
9445 -130666 -224037 21648 -140123 -228539 -194495 -200320 -63744 267311 49487 -54851 -246487
9434 -246487 -43554 130263 -111268 138678 237906 178105 121272 21072 63321 212086 -22704
9422 -322646 -119487 -229160 113086 -254700 12108 -212760 -123015 -110448 -23531 17502 -309122
9410 103327 -135255 32825 140496 136916 -27966 54768 -106962 -42850 115917 -55639 -205745
9399 -205745 -384646 104603 83868 -224508 106817 -132624 5297 -107803 -265807 -275083 -368031
9388 -368031 -109833 -213701 -222833 -221831 -136529 -278548 93209 -185394 153077 -160889 158096
9376 -166502 -99344 -161330 -116234 -106518 -233312 88155 295882 59244 341814 -103251 -386687
9365 -386687 231224 -118328 130289 -224428 -210835 -18323 293740 -268028 -299639 -13251
9354 -211394 -267715 -127545 -147959 -71258 -304746 -207650 213040 -85154 -101297 28732 101991
9343 101991 75652 -268612 464943 -94727 -57007 -38228 -174812 -112809 59859 -130309 -358227
9332 -358227 -47621 -120715 -126020 -233244 -297099 137966 -30200 120131 -29375 -109390 -146015
9321 -146015 -62436 -220976 80770 130382 153209 131464 -20876 38839 440682 51145 -83666
9309 64688 150013 293214 -275124 -51802 -262527 63263 -386053 203614 -265539 -318202 20634
9297 -135852 156261 283246 186857 226740 -99176 105731 -37752 41866 -285018 36818 23636
9286 23636 -485287 -75913 -217665 -48958 50641 -216584 17218 -231474 77558 42225 -408719
9274 -143450 127852 182858 -352794 -165476 52757 39494 -265303 -146440 -317043 12285
9263 -242417 -62193 28960 -54952 -77734 336800 137614 -340360 -49670 175221 -241648 -184683
9252 -184683 -13950 199585 -69279 232102 14103 56597 77859 -14196 -548841 -194327 -24388
9240 -165534 -71722 -117741 -70591 -68921 -191419 2341 -76115 -212932 -336411 78219 -269063
9228 -277568 89759 -31760 112488 139770 -144929 -55030 -419085 -158620 -301480 -42770 433400
9216 223291 126307 76317 90606 -361949 342878 -465593 130270 -408652 -74753 271147
9205 -172307 -66313 76551 63330 174057 44122 -36613 66085 73116 277817 -35722 -9056 -83927
9193 -83927 -46122 7854 -119619 -123220 -12161 -234546 -182976 15166 72077 -65081 7585 -232103
9180 -37045 -218813 80294 -46439 -159361 -313707 -262726 229154 140774 -225476 68869 -78828
9168 7556 -184313 -197655 89035 -93567 -244602 -153570 7640 -205812 269479 -119962 107654
9156 371475 -336447 -85590 -158763 17484 -116892 -56252 -167883 -75762 31517 47830 17301
9144 -88897 31313 -214809 67565 66045 -9606 -18718 71844 278279 -320674 257021 94818 116613
9132 116613 -126579 -115205 184844 -268391 -297867 -8937 -4630 177062 -443587 267915 -409219
9120 -190767 145564 158531 -151585 -119492 -283936 -163988 24122 10429 -33644 -166739 79720
9108 -456315 -213297 105137 -32608 -140925 145116 -39028 -147861 64746 -26550 -116748 30569
9096 -12768 -126492 -116614 -207498 -65436 117940 -49804 -217870 37265 255745 -130090 36962
9084 -215762 -148635 23918 -157600 49924 -276582 -175021 -2276 -43764 -460149 -102679 -324250
9073 -324250 -266818 54615 20468 -139463 -65873 62837 -181355 -394019 -129371 169677 207859
9062 207859 31798 192264 -7707 -327366 -128690 -15502 -231612 -102905 -72709 -257962 -217684
9051 -217684 11716 -38766 -180709 -117866 -194639 4679 14694 127908 140683 -123368 258602
9039 241190 -78938 21113 -149911 93181 404948 -52810 -445110 -125167 -408458 143588
9028 -75263 366525 -43190 -446573 242976 -253113 125102 14622 -79236 194185 -311174
9017 -293184 -355359 184773 241321 186639 -305372 -146933 -32041 -234847 118382 -126108
9006 252543 -12617 -121525 234690 -167054 -114 185414 -214438 46934 68344 -151042 -187086
8995 -187086 98140 -94740 119720 -379531 30534 -125489 -23414 62887 12933 16987 376908
8984 376908 -38667 214835 -64403 -49305 -111518 140082 -176312 100756 -102547 171668
8973 -50541 -204460 -359754 -242506 -231142 122470 -87043 -75952 -263574 39033 -274337 -129187
8961 26496 -425421 253424 -266442 -289474 -46134 -106813 135963 -22613 -125297 299832 -315687
8949 42892 -80592 242287 -125121 -378936 -263437 -114313 -96469 -327813 -123928 -116377 96659
8937 133058 118770 24600 -41307 -328778 -82198 140843 85432 -295984 215248 166408 -71699
8925 13436 -51365 -121402 -81992 -215969 -212476 10638 258835 314415 505375 -8441 208880
8913 -45745 345210 185841 425374 1140331 1010605 2131989 3489767 7251906 11684135
8904 11684135 5139306 2763819 1365060 1346015 668983 634689 413358 627862 292901
8894 -117129 570843 218489 324063 29141 88170 -153690 389677 -120115 53493 -172082
8883 -327391 -292115 99806 -207267 -81326 -87531 -248 -256109 -25905 113709 -88689 291058
8871 -271650 -580718 -112798 24622 129917 86209 -120924 -470183 -243538 -195653 -120060
8861 -120060 -487 -94416 -15094 -126425 96998 -384797 -107603 -225394 -128770 228720 -109213
8849 -109927 -14886 32163 -272495 -377473 -72559 82034 -103777 -113694 -111449 -37353 78043
8837 44581 18471 139031 -106599 -12751 198010 116105 258907 122970 -91417 -204749 -152266
8826 -152266 -35249 -157439 111215 -101105 110603 -25418 -115819 -173531 -209038 298856 88601
8814 -42921 322000 195512 62520 -350917 2041 113834 132100 -204629 -18772 -88297 84527
8802 67911 -120470 -28819 -308906 -120526 -65753 22030 -14757 -254460 -22219 67999 -73110
8790 -97229 -287933 -255049 12309 16396 -478077 -314523 39015 -50621 -355798 154385 -94685
8778 -115235 -87673 -32002 52042 -18060 -20091 -250531 120106 -100489 154960 -54647 -89266
8767 -89266 -54775 -75225 -215761 -89097 -163868 -19794 -138178 118170 27574 -247027 27192
8755 55672 -66306 -154749 37577 92158 35646 134299 69129 -228413 -187245 13269 -4811 -198770
8743 -198770 -29788 -34836 -20289 -108857 -55097 191923 -49359 -39528 25615 38528 204782 246008
8731 246008 -193498 -269547 105533 -258333 -22467 -122160 -2249 -12284 -78486 20078 -142284
8719 -160503 59451 122365 -251545 22874 -22552 150003 46884 -118303 -183415 -66481 161673
8707 -11085 -233317 -397015 298741 17111 -294504 -13789 -138455 -224096 59170 -239475 -169465
8696 -169465 -287092 140022 148806 -77833 -205568 57085 -51194 41384 -117727 -418844 43114
8684 -107429 -114938 14875 -47323 -215488 -86671 163789 -202938 -78196 212166 -291435 -67528
8672 5687 10957 -6189 -247301 205425 249120 80441 110586 -162312 -252235 -55671 -112609 -140555
8660 -140555 -222892 -103504 -54870 -171320 106340 24777 155156 480572 -222568 106022
8649 158713 80209 36543 9325 -107405 10154 -5974 -224499 -7549 258073 -152180 35112
8637 -64418 208905 -114351 -114750 -186515 200346 85883 -110697 -30889 -189633 120858 21338
8625 -174235 -71291 -193911 -339598 13029 -267580 -63861 76172 -28316 -59023 -15992 -190129
8614 -190129 -185918 25105 -243095 69610 -47000 -287300 -107345 -342930 315362 72579 15839
8602 -105242 227208 -98392 119130 -103450 145153 80957 126042 -312400 -118876 188082
8591 21199 -256546 239116 -192098 139799 133766 302033 -43356 -182282 -20755 63206 119775
8580 119775 -131710 -220735 -151950 -316637 137623 -238017 -16630 -196400 16027 75932 110976
8569 110976 -224923 -258518 -139054 -284459 -186972 136157 -133778 229238 -62067 39237
8558 -198242 -118804 91896 -109061 116240 -92840 -78214 132490 97195 85031 67560 64145
8547 64145 -236280 -106214 -189106 -258188 -92136 114198 94603 -522287 -173166 37447 14193
8535 -39819 -284036 113544 -82346 -166303 297946 -28133 -69444 -77893 263952 -123771 -9995
8523 -113274 213533 -182891 -203399 85701 82740 -266630 -171270 -169890 204271 -99245 -19803
8511 -35231 9434 122991 -112506 -244240 7583 -213168 -107063 162973 -114353 -122217 -54817
8499 80275 -235629 -284229 -34400 167249 220098 -561738 123786 -153883 248341 -9807 138639
8487 -270185 63655 -86031 -203990 -14839 -108865 -202177 185236 144621 22712 -46896 -333002
8476 -333002 -39962 -69023 -259409 -218067 100015 -16818 -162192 4329 -67595 67262 -7675
8464 -159949 -73272 233146 -146371 -303711 -135707 -74890 -223668 -137741 -17237 -269003
8454 -269003 40338 189781 -419999 -272603 -408976 251567 203784 -444280 -256116 -162917
8444 -162917 -193453 -144306 -27694 -94517 -188139 111397 497230 74927 -321515 -124937 -177844
8433 -177844 -228554 133253 -171013 43971 -5976 39431 -265821 -130754 -76554 -262032 -77833
8421 58798 40370 -132130 -272721 85477 -171938 124486 31496 92121 165040 119523 -188523
8409 -40926 -122545 119288 -63616 -122315 -160295 -31228 75497 192636 261976 199191 -83073
8397 103262 -21708 -107789 -350996 -318839 76483 -60174 155583 -85373 15412 -95539 185088
8385 141455 -58813 225390 15671 19741 310811 -64242 193413 192115 61922 31618 -141824
8373 241211 -119467 196222 459269 19561 -26535 79071 147837 -43206 -335085 -128058 97971
8361 -242522 -220553 72388 -26607 -179396 -50468 -373110 -172685 -39481 -62090 -110685 -56048
8350 -56048 254064 -245644 -121490 15887 360575 44437 -124846 -111324 24699 -211648 -55879
8338 39234 -353147 -138502 -48068 68835 -233202 -192963 -63054 -121515 -77645 -130048 -119785
8327 -119785 -62284 -312650 -275428 -232920 -48255 -232672 -442232 311569 67890 39296 -216575
8315 165616 28945 -103998 -72222 231549 -136334 -53912 180150 273958 -20388 300629 -144956
8303 -112007 181240 -337626 -304601 133658 -251674 164648 -86826 -114836 -99803 319519
8292 -223050 78902 -10806 -477804 154433 -3137 164267 -166795 -209557 -155450 -129646 -235689
8281 -235689 -151361 -401081 322299 -292404 -133653 78569 -326633 -582934 -115693 -124271
8271 -124271 -97586 20664 87447 -106990 183002 -22065 246373 123708 -44522 -6076 -68050
8260 -68050 -184326 -56618 -261992 -70750 6793 -32487 144124 -261711 -168854 -21233 -231628
8249 -231628 8924 -242703 -111592 -413120 -174403 161995 110936 75492 16257 18164 245982
8238 245982 -176520 41212 -128111 -14385 -214095 98669 106542 -464030 137453 -91072 99661
8226 21335 46936 -40076 -65873 -59118 -52225 -501 -461062 220801 20478 -155667 25254 -90021
8213 -7378 156244 163168 64360 -521446 69554 186375 -241744 202393 -31404 67739 -32163
8201 -1023 -379800 -221277 -58830 -106665 50860 221632 136173 -180333 217578 -25577 -52534
8190 -52534 202552 53562 -259590 1280 127878 150890 179660 203575 -20781 -10442 -22615
8179 -22615 -176577 278761 55716 139730 277646 287528 100804 -182157 -22049 84362 -105177
8167 81179 120806 127840 -240234 184648 138959 303698 343431 -17680 230985 -24965 -182594
8156 -182594 -20778 -523631 -86972 5045 176505 -127690 1159 -236638 -139120 31058 -305584
8144 484363 31363 -6448 97910 -360998 -118363 -247519 52218 -3849 -81428 -168665 -285003
8133 -285003 -115920 -140419 -102049 -112820 211628 302979 41969 191682 135221 -158362 109447
8121 105357 -94418 135110 94426 -166987 -176235 62172 -270645 -241113 -147503 -118899 -155114
8110 -155114 53567 -136224 -384120 -51497 -371244 280592 279439 -267629 -74375 -170883 108605
8098 -109756 -259683 -271253 78049 -147704 -116206 -277016 -192344 -364453 -164121 -233731 -73181
8086 -63232 -60764 118230 42726 -113317 -346765 -31027 103538 68280 185638 180369 -134766
8074 24170 -140072 77787 -180315 18692 -249960 7371 -153076 27644 -58339 108932 -22116
8062 -312633 -51110 -468287 176695 93892 -37295 6242 -24806 -195226 -44542 920 -172204
8050 -30745 -179997 144537 324339 -232505 73298 242649 -225372 180148 -200529 -297911
8040 -297911 -270289 -134309 52980 132553 -215624 302460 -182352 -445287 7554 15730 337315
8029 337315 -37635 98516 81723 -82385 123637 -48175 88992 260657 -259552 163672 -8790
8017 -273676 -30020 -178704 -120438 147575 42177 127440 -186488 -120740 -205312 -331960 62192
8005 6299 445685 52768 56894 -461391 70222 -125658 56367 51784 -12340 -145747 51763 160393
7993 160393 -71849 -114463 -163633 -1311 -128506 -224969 -278358 -194666 31082 130345 -29860 -36908
7981 -36908 61421 38908 12401 -201299 -269814 259269 -102544 161915 -119469 152251 63223
7969 143214 102964 29148 231133 -23510 -11912 -28297 78688 -167834 -27708 310418 -417327
7957 -10720 -258696 -93245 -329968 -263859 60366 -34752 -179322 70639 -75711 -202954 -56654
7945 148163 -96976 -414679 -163569 -77996 -142876 -9645 -29397 148805 -114078 131549 125000
7934 125000 -154612 -289085 217896 109260 -208542 124347 79395 -151673 95606 -19958
7923 8147 -21388 266128 23011 105315 28765 -139355 10539 198166 -307438 -85707 133123
7911 -59063 -9804 -219057 -158809 -100468 -27614 -75558 3918 188413 -95375 -208186 -181503 36851
7898 122515 132974 -201269 86588 -73148 -192876 508606 -102487 60262 -87915 41569 -356381
7886 57454 137747 -61802 52251 -49499 -26749 -95661 14754 -102539 314017 -160081 303351
7874 -25184 92661 -154547 -227697 37841 208978 -126155 23451 -170583 -30769 -186510 80055
7862 27179 483341 -49083 -23895 -60016 -148417 -378359 30291 79261 -85323 -53886 54616
7850 -398741 -63657 -35005 -91199 -16796 217123 144268 -78565 106852 31545 112992 -125344
7838 185541 115377 -79683 -120145 47039 137031 135450 -135621 7430 -38672 -26903 167142 -77581
7825 -124720 -237623 -87788 -37211 2347 -126646 149621 77171 186870 -69474 -98239 -169166
7814 -169166 -311014 146935 264545 72318 -159998 -81684 -302238 -308124 -104502 -100828 -381088
7803 -381088 113576 -176741 -135203 52208 -113260 -39305 -33935 -404724 152371 34148 -148724
7791 273187 65044 68330 -199659 -411292 25732 -469850 -136 -80512 19145 -267007 -218768
7780 -218768 -63349 165594 -36397 17242 -93026 -15828 334180 182609 -81672 -21636 215566
7768 -230104 62094 41738 -150864 -35896 -97764 94376 18436 -47612 -264061 236213 -118020
7756 218009 166060 255090 -76542 142043 -35923 -3606 295240 -83444 -224097 -146912 -175948
7745 -175948 17776 -91213 -122520 -44798 -86103 -39952 397497 -113246 -47862 -266166 -46052
7733 36001 89064 -158120 192679 -21415 -148413 -223927 -158790 49656 -328165 131899 -86761
7721 -149704 49769 119359 -150808 -126994 -282023 4624 75685 36533 -245489 -161493 -313940
7710 -313940 -104407 -137710 -341734 73940 -146625 -393913 54575 59342 63143 233683 224841
7699 224841 131350 -279152 -186177 -64758 -354459 -65430 256675 67878 -257470 -336619 -221357
7688 -221357 -314249 128295 -154154 137922 28475 -263334 -195903 39820 -80886 -29215 155195
7676 -209809 209104 336464 -115525 -63627 -67336 160232 4773 -227572 176127 -126850 116090
7664 -94666 -27271 77508 22692 -106261 -97825 33459 -134092 -158049 -176301 -83671 -161989 -204965
7652 -204965 -403898 26839 33650 42061 -189348 -102700 45370 -133816 -204123 -205370 -100235
7640 64364 -26753 -113400 41921 246960 260576 -265259 93659 -338322 -46820 -164981 -79599
7628 -170175 42563 13884 -322032 -40586 283418 -148825 -210776 130418 106072 220844 132646
7617 132646 -20908 185066 11610 -589 415599 -112916 -96225 -67189 316820 -147891 -138940
7606 -138940 -110996 141120 192973 -97673 77044 50800 62255 -126851 17299 73045 -31213
7594 -28150 -206090 -15176 182110 81022 -124419 -107542 338483 -96684 -336587 -20586 -16476
7583 -16476 299564 -150092 -119438 -45057 -68440 -136522 101567 153806 -240722 194574 116490
7572 116490 151703 55912 -193344 -319122 -145897 -159284 -395978 -289635 173002 -133127
7561 46497 -129510 -164178 132626 -166642 30982 157726 62687 75667 137600 -21784 113527
7549 -101530 -9881 60496 -229165 -162923 58300 115149 96188 -211819 184053 -7417 -7349 124242
7536 35059 331761 -92382 -10874 149740 41861 31457 13171 -114923 -16190 53165 20529
7524 65383 -56372 60158 -18602 -174685 -166356 178326 -156399 161521 316210 -292953 239981
7512 -104221 37447 -9196 -43961 5122 190793 23780 -68745 -158991 164181 -28590 -13645 -239903
7500 -239903 -428131 -419225 -29039 -224301 97940 -16785 -336108 -376131 -185978 -138179 -100372
7489 -100372 213841 -7053 184096 -9800 153966 -65340 -91448 -453421 -153111 -179880 2960
7477 -236074 211657 -30629 -298041 59096 144396 -194770 -152840 -6459 -110918 -204845 41653
7465 257903 -115578 105113 35994 15947 177277 51922 -67586 -156338 136782 -197762 25027
7453 -68277 95064 942 -192055 112861 -47841 -348449 -253492 187842 -173923 188690 -431101
7441 249348 24188 -149197 1807 -27428 -333123 -622947 104172 30346 -3031 82700 -205830
7429 -213008 219213 -46331 -312907 -54940 -327720 -78703 13363 -123390 -96750 -14809 -118837
7418 -118837 -280923 -167392 124499 6421 -389155 -141686 62393 -138345 -158471 -150152 -14301
7406 -35842 21657 -148175 -115709 -236936 126593 -295620 200324 36603 50110 -105443 -57268
7395 -57268 -247494 -87622 237560 -91369 204190 -13842 -84363 131939 -328797 89613 -114060
7383 -223310 -118598 -104855 -87269 -123309 -313116 307196 53531 411854 -154330 -4623 -109063
7372 -109063 204108 98127 -162176 -244559 -163377 -115393 43664 44775 -35788 -58232 261292
7360 484811 101095 -43892 -26760 222577 -96183 -1028 19547 245097 -398934 -33586 -164496
7349 -164496 -11062 -388321 -243834 -63626 145069 39102 41389 -47084 -86821 93651 -64112
7337 189626 -353789 76871 -11473 -159952 -103130 -39623 71917 -54504 -90603 274773 -109736
7325 -134868 239096 125723 34750 33083 -91167 285550 219527 -196635 -30450 -210841 -2467
7313 29759 -28607 254259 237078 -202903 129087 -177783 71567 -203165 -21397 -220813 -10616
7301 111174 46364 -255788 -23005 -67517 130322 -125952 208574 94176 -75782 249134 37836
7289 177986 189741 -119352 235775 4890 -55688 -77848 -68413 -81718 43605 -376348 -44847
7277 -29563 -102308 -172766 -97560 -273986 -71435 -16974 -223134 -123105 -209859 -89003 149174
7265 -375302 -114228 -149179 10666 -268861 -64567 75799 69818 -82923 -232395 120654 -31392
7253 -85722 -13418 -117654 263136 164654 102426 -184714 -10385 126085 87399 64161 38683
7242 38683 80946 22520 -9330 34654 -71575 57389 -107873 28691 119034 -63272 -481984 -191204
7229 38462 -51189 159896 -1984 -243909 -10637 -179365 37781 8954 1720 323804 -153869
7217 -171349 -19623 -215849 146314 139832 443070 -231205 -303284 -153964 224655 -22842 145852
7205 14181 432174 -168223 63862 -19341 -9985 -98635 -184170 191417 -205270 -46701 -286185
7194 -286185 -13111 -435996 -59205 -39310 -275563 -103793 -57509 -248492 -5747 232 -38268
7182 56572 44902 185529 -39759 297958 95189 -274770 -88437 -243040 -34523 -97554 95009
7170 -23605 -303297 168276 144916 30835 -322943 -139217 -198857 105209 17848 204589 -158640
7158 -36550 6956 -8750 -147577 232355 101555 52441 226683 53557 -115880 107472 91832
7147 91832 -34491 57078 1348 170304 269424 74041 -64141 -281111 288371 -146987 -167969
7136 -167969 -79393 180715 110243 -87248 -210078 -114102 -26023 199450 -204644 -22375 -95556
7125 -95556 -433951 -148875 22278 -506269 -110201 25909 76646 -151520 10616 -175917 190305
7113 62139 17298 -59381 -160706 215883 -152598 176309 48530 -65943 -71051 143607 -154072
7101 87052 86522 -165755 504008 -324906 -158528 -156204 49482 66461 -90742 -104863 944 156695
7089 156695 88346 -43481 -270218 194316 -3715 -220325 21037 137247 -155144 232673 -121642
7077 -133428 492203 -1921 -54015 115589 -215732 -99909 34481 316775 165191 199163 -253951
7065 -89863 -48661 -176638 242187 159334 -284629 -93215 -230677 227298 8924 -57282 -116686
7054 -116686 -45042 90763 -34243 139158 -81652 -212539 -199226 -53702 -135846 250982 136613
7043 136613 -149620 67679 -143729 -77385 -185475 -22783 253893 -115706 -26960 9217 132685
7032 132685 10733 148737 5564 112542 61829 -15437 -104047 -148103 -88372 -17805 -17974 -178758
7020 -178758 1660 -2321 -63888 133939 -78362 -157082 179020 -209470 91925 23732 -269746
7008 159226 13864 -114381 186297 -114222 -70543 52097 18491 -24658 173815 61112 -261350
6996 64014 -115765 174100 332799 -5747 66486 -152168 -11567 10159 -263206 261629 244623
6985 244623 -59609 1351 -57853 27468 -44211 2291 66856 121177 352321 182725 13966 30702
6973 30702 -78041 -134267 -158919 -191034 -87049 -307342 -206987 78079 19613 215672 47472
6961 -196269 -170438 366627 40986 -173764 -188137 136859 -161811 -45515 111800 -85826 -299197
6950 -299197 -260072 -208211 67519 43293 -515117 -166375 143474 -51048 319906 -247832 131395
6938 282145 -166855 -267947 -74333 -103470 95666 -418344 78365 23884 42581 -194361 157381
6926 -7640 160934 81114 -277814 6396 163611 -310898 -265865 -93346 -128030 -76462 -71004 106755
6913 -12944 -42976 169127 117270 267838 -11177 -9066 74 78243 -46598 133486 -87173 16167
6900 116329 163520 20933 -74050 -57805 -87645 106496 -104723 199907 -51552 -41146 -11233
6888 245821 22032 116603 -144926 -53700 -384132 5688 -108904 -123438 41763 -469022 -88004
6876 124982 -8877 -238739 -111950 57844 134887 208806 73237 130923 206227 -224937 154899
6864 106746 -117597 -37101 177232 198979 156269 91063 -102909 26519 41829 -50218 -319202
6853 -319202 122380 -401118 127402 -74894 -149545 373455 58837 410655 92743 322685
6843 322685 -126475 179581 -39552 20366 -160782 5463 293986 201150 -29163 248378 60106
6831 -145903 -130856 -340104 -71893 143216 49151 248751 -308820 21740 -244750 -105805
6820 21504 321252 -5021 -76516 112788 92009 -166281 289164 -252974 -210092 20868 36742
6809 36742 42557 21731 17084 16866 154811 144348 -171480 -47824 492618 235330 224831 116394
6797 116394 -36785 -16807 98895 -59619 -275682 -238405 -394703 -188740 91952 28788 296185
6786 296185 108185 -242478 128203 63274 -35244 22283 103082 436763 -261692 226150
6775 -83658 -201132 120060 25294 -344455 175674 -15092 -337450 62805 -55205 -55433 -179928
6764 -179928 135862 147238 -147630 -385034 -125119 -36659 202335 -98468 132206 386029
6754 386029 31211 424107 -16596 372822 -157681 -202710 -119368 -243581 126771 -53495 92061
6742 -75535 172794 -110833 43704 -116794 126985 62487 -108252 200009 316240 103901
6731 -141092 -222529 -104687 -335670 -119321 -205240 -34165 241558 -5024 -206360 -111070 121096
6719 61259 -149941 -39841 218096 -289130 27830 162724 -49641 -7835 5021 -277063 -64811
6707 -13068 -151231 71078 38599 -236995 -41501 13893 107259 195312 -69774 61591 95356
6696 95356 82470 116977 170107 185185 19738 184961 -126827 -46391 152607 -62084 152866
6684 -214061 72677 -229072 4634 132879 -142769 -112579 -62782 -17780 45452 -36393 -184952
6673 -184952 -129336 -122020 -41313 -79804 156567 74607 112440 -68056 -84223 51082 -208936
6661 99040 -59408 -4808 -448469 14940 -159285 8124 -146065 148526 98555 152983 154991 42838
6648 505079 88863 265162 -122231 -233091 -35023 20755 -136609 -14096 294675 -180571
6637 128200 137207 -156036 -151437 -328250 300277 -1158 18480 70945 -113811 -58412 122374
6625 -47161 -65795 16265 -199645 -466374 -146752 -151413 141828 84336 -22930 -172098 303345
6613 99662 -16265 130873 257537 141961 187518 28993 112118 -15975 234541 74445 -105188
6601 179393 -18020 38901 -47189 -35616 -20925 -263678 -7591 -174875 -36309 36473 169107
6590 169107 78387 76153 -208151 66612 107711 126674 479183 -184698 208562 -48548 196898
6578 -2773 -1382 -119500 303053 -157048 -285318 -248741 4893 82538 64852 72763 56236 -17893
6565 58304 -296481 198864 133078 80853 45249 264222 177392 -148947 146716 -13448 -77516
6554 -77516 -84510 -86244 -220449 -196822 141517 40295 -4963 -31125 70254 -95759 72814 -42046
6541 244132 -26671 97127 -107497 276958 -16646 -4727 -61372 -289040 -2757 111806 -114718
6529 172418 -176073 -354939 97260 -203193 105009 -264271 377902 204362 101972 104548
6519 104548 -55856 -34990 -53888 -46388 196640 186130 -148951 116972 65711 -216448 160013
6507 388416 -82731 -65078 -5165 -195410 -61755 -24781 125688 -10779 -14733 -151071 -192836
6496 -192836 -356758 -151881 83176 -57652 23155 -205925 -158783 3866 -297654 -387763 -156245
6484 -15205 1205 -13539 15653 -225878 -198630 -126465 185691 234029 -126919 -44431 209966
6472 -220019 -104424 165497 -1987 77939 50668 -100582 -350106 -27671 -61685 -191560 -50154
6460 64612 136215 66065 140540 -216684 27945 81582 151958 -269565 -79805 198696 -150021
6448 -189985 67805 41966 46275 -200582 -18111 -2350 184545 56203 -45223 205696 -47714
6436 398752 -111343 188377 29910 -74521 -20877 201755 147691 96191 52442 312562 25315
6424 100727 -270923 288937 -108641 -192195 -40649 -87297 7655 -145217 311423 -257258 38740
6412 -131852 -247549 -4512 -306063 109270 29194 -136288 78428 -10864 -57165 -250143 -128907
6401 -128907 87182 227631 -4941 -74627 36142 107110 360860 99950 68099 190485 75563
6389 -17151 173662 374554 108941 -267661 -7003 -123533 56068 -255211 327353 44688 -391861
6377 277606 -297537 -122848 -526183 23626 194197 -114925 -17086 259338 -45873 111182
6366 -50951 -111988 159532 -282157 176327 152675 -168355 306232 -79626 20724 143922 85595
6355 85595 100242 114995 -138368 -126296 324302 -126780 -162023 -123305 -117021 -209184 79381
6343 -295515 -78092 15306 57074 15174 -262393 -180000 -15198 42253 -292705 194212 -160295
6331 -108185 91852 -218930 -363798 -67689 81891 130896 213990 -78190 295740 -95088 48470
6319 -247256 -97359 120284 184512 -69190 33405 327208 87603 -94923 -142743 219035 -177840
6307 276105 -156492 100935 -11832 283034 -19847 12783 -114672 93866 -28823 -62386 262367
6295 -75233 -181168 -51490 -201535 -103401 85509 337229 76070 -17721 49948 -32394 -284281
6284 -284281 -83001 -140467 271296 31143 -107114 74038 -45291 338196 -147875 -64009 136378
6272 107627 71976 -112084 -53848 -6051 -150813 145034 178529 337249 -44254 -228411 170151
6260 -158199 -142297 189308 -63708 66000 -66791 -133652 315600 8616 39424 -224259 -174661
6249 -174661 128439 55558 131088 230646 137935 -265470 122905 -201538 12658 -35768 143581
6237 288473 69031 -140037 -109662 -117674 80355 -65649 278406 36987 -94651 -121471 -153579
6226 -153579 -168545 -162016 -194286 121230 224362 154859 -77364 116853 -142989 -153430 -191367
6215 -191367 266277 -52123 -113535 101025 196285 41247 26820 35680 -44911 -36519 -342381
6204 -342381 388055 -165717 192711 172728 -200357 15690 -77657 -437256 -45063 -45183 -78318
6193 -78318 386581 -36002 -99996 -372297 41660 98619 98610 28502 -99092 -141620 -30963 -183001
6181 -183001 -145775 92786 23706 40550 -235879 67728 -47445 113031 -111272 150369 -128787
6169 230911 9413 104691 -16850 -33732 224274 -56641 -274390 -60515 -132350 64861 53674
6158 53674 269003 -112644 -106969 88210 198200 35252 -298474 22277 -252791 -168132 145404
6146 -27444 -170372 155392 117286 -181762 69136 51857 -68228 -15478 -419021 -179381 204309
6134 263080 -65123 -153682 124894 -258457 31279 -218062 -116021 -163513 -231780 -183870 -12840
6122 -81633 61921 120783 433432 311286 -202223 -66176 83212 -7209 373332 293973 73992
6110 68411 -183927 68876 50061 -117587 6281 76537 227987 -57385 -214830 -37978 -221918
6099 -221918 262210 -288269 -69673 68806 -183639 -220188 -19022 -166421 -95364 -48061 145651
6087 39884 184400 -166948 -50163 -202877 186649 -502025 98773 -238605 -34125 51197 113617
6076 113617 -129928 45951 -230932 105556 -141360 -91005 105841 7656 100263 258526 204247
6065 204247 6217 18647 -9876 65171 -68970 46263 89229 270 116188 167800 -24618 -291655
6053 -291655 -69888 -133910 -1011 214045 99250 63342 -35202 23637 -15265 177180 101139
6042 101139 -214026 202478 -112668 231874 17352 63054 -56650 32826 -377564 108784
6031 -413689 73817 35914 126122 4663 -112249 -188711 -46724 121848 -99972 -37850 27088
6019 -110196 155751 26133 -6720 1031 336523 -141538 -62477 -106763 124505 -288476 -251104
6008 -251104 -243496 245940 92161 189418 18365 124388 307309 -216557 -7981 -81977 179911
5996 -52519 -172091 238637 44757 364771 186416 196265 -146609 -68033 76471 207259 -97037
5984 -113449 -149376 -134751 -12843 220048 -107164 -104743 -50398 277813 124802 296859 97016
5972 236328 75472 -117148 -316334 269951 21337 143211 161198 -185544 177420 198625
5962 198625 -96346 172644 -76631 -142832 -214303 -85275 -58190 216195 -70470 -47005 160897
5950 -156925 138155 -221638 114665 71024 117249 -111047 325607 -194620 -176329 -172901 79028
5938 187193 -110663 101894 -188857 98018 83146 -35118 -84115 -257489 -155336 -211455 49383
5926 -914 133689 -274694 -134716 140270 -232316 -347476 35651 7233 89605 151739 -33143
5914 -72114 39016 -179862 -123203 105545 17329 -14827 193884 41457 278927 -106798 288056
5902 22590 -191672 -454457 -86762 82452 -44263 51210 62398 230784 -92628 47533 90428
5891 90428 218268 -200793 215972 321100 -101318 -100772 -208054 121844 -270759 64942 90063
5880 90063 63393 26079 -19731 147713 -118967 -53232 -156653 328088 240748 11127 -1078
5868 -54360 -410650 66395 196084 -135221 149506 -357311 -287987 -33379 -119409 -191806 -83454
5856 -233167 -207845 239373 -432263 54820 -38989 -43579 46572 -323761 -78331 382103 312249
5845 312249 22998 259081 80801 117718 21305 240359 -101747 151434 -105126 48870 -144607
5833 135692 281487 130616 48322 190562 103407 109245 -6461 11997 -16400 -127642 -80747
5822 -80747 99044 207755 -210049 13880 -81281 -290950 -119852 -69425 150824 -70745 250260
5810 -5230 76377 -309746 240780 -132291 -25541 -54888 -140186 -30429 -126520 -20907 150771
5798 -259877 -264229 -136864 40923 -42049 173405 -223521 258264 -59762 -292200 136751 78240
5787 78240 256296 242341 -66677 121325 -102545 -70320 94251 -52264 28855 -62932 -66882
5776 -66882 -93139 121055 53077 -214961 -58703 -140226 -312161 83983 -76645 206140 383606
5765 383606 -276987 108076 223646 -297057 69190 60596 -150604 -94431 -214107 -153626 -30817
5753 -140570 -68108 37930 -2416 104485 275906 149935 -65007 -400626 28347 -203738 1073
5741 -412296 -142820 -35147 50630 272712 2613 -12153 -204919 188074 104456 -316157 -227557
5730 -227557 150054 76997 -72651 -9369 117275 -172750 193349 393169 60815 -377724 -237537
5719 -237537 71624 74626 39064 30908 140964 39870 -19074 12232 -281224 -38697 -24994 -232392
5707 -232392 -96141 267151 136654 115845 -90296 169658 -156619 -212575 73538 59128 -147311
5695 -292078 183423 113568 44185 267231 -143832 40276 -232325 -478033 -138663 231306
5684 91353 97056 -189676 -45796 -26315 104676 -12513 -202571 -125669 -35379 -156266 47585
5672 -93984 192081 20682 -90445 -91356 -431713 -79819 63922 -76329 170330 173683 3244 -57427
5659 -155914 -193975 86801 152551 -23858 45348 64927 3445 44995 216532 -329250 32548
5647 -209103 38729 263277 -114785 131557 66372 193709 7332 106618 -122600 144342 -99026
5635 122822 80236 -267128 92308 -181911 106015 -22440 270732 243497 -132868 -42468 65764
5623 263294 108648 48801 -37637 -14952 62830 316208 108170 61104 73002 125724 -295138
5611 99143 -79527 -41988 132635 -162412 201508 298893 -38649 111239 -236677 32223 153087
5600 153087 -396468 29351 122815 70965 -52230 -20257 -30871 58623 -59945 74717 177349
5589 177349 85203 250701 -30198 -184600 16530 -178975 -2032 155380 12016 240798 -143551
5577 -260609 202866 228562 -193686 -102839 -242746 44511 94767 -133918 40182 -87286 -195973
5566 -195973 168262 -85619 29963 55525 -230249 64532 -330826 -203811 420726 137646
5555 -47775 136626 301265 55964 -89418 235996 -143935 221002 127962 -18123 -39044 -170366
5544 -170366 -3863 -154285 69965 307800 -17548 8458 -23616 -76467 -17673 305660 -25097
5532 19556 -197638 -133463 -226395 114925 21758 15694 -429761 95780 -51824 357138 46239
5520 -175032 389529 293809 -148897 -84911 -163411 177829 178106 -18772 74243 84163 -182615
5508 -211454 64619 -172640 -182796 -159 94752 299214 172037 -41728 109544 314227 -175068
5496 315899 259827 -124037 -219843 30878 40274 -3803 66389 -44236 160082 -395590 -273291
5485 -273291 -473152 -201073 -188996 -29005 -226566 247396 191694 75753 114992 -78411 -325282
5474 -325282 220544 168591 212546 224649 74662 105151 -244960 -282427 341491 86168 -204077
5462 46180 -291140 206578 84318 156883 -28753 -182386 -43976 155074 -166509 210003 128981
5451 128981 98180 54747 186109 261605 89846 123393 137039 -141885 17901 -106202 -252922
5440 -252922 57730 -246570 132095 -13819 -276778 -269331 -98337 -259860 -84034 49487 -91006
5428 189938 44874 28059 161025 188328 441912 -98204 30307 164528 228947 -92305 -168273
5417 -168273 -162134 26350 37873 -145512 -15956 -388918 -69894 -71939 84833 -50157 -68128 -59362
5405 -59362 -369032 -78273 51476 -20382 -29028 63125 -41749 39156 -204149 -299395 -435187
5394 -435187 -40146 -278544 39944 -36763 -16973 70962 -7904 -144992 144145 70949 130537
5383 130537 389060 24689 96933 187352 50287 -228386 -1471 -36968 221246 84176 -116338
5371 -344145 113033 -325948 -85197 -229728 -128167 -152520 83419 -290850 -145849 -145783 -236539
5360 -236539 102031 -493158 4899 561 309329 2558 84042 144138 87900 210025 -254704
5348 -288373 143462 103230 -130762 12296 49055 98282 41217 -10263 -186963 250814 -5951
5336 -237140 187075 37040 -64202 -234881 75113 -155153 141031 -100033 140670 31998
5325 47230 216707 210301 65341 127309 -164096 53144 -184413 72241 319413 -125267 80406
5313 -61043 88912 158887 -75748 1235 8751 50059 -225728 180786 228720 -32756 6315 5666
5301 5666 -27600 -27177 110300 -142882 2264 36426 143885 -36464 -31532 106679 -256768 -145847
5289 -145847 -17075 -83619 -166425 199489 69652 266301 100048 -1682 -76177 -82873 183449
5277 9482 -12869 35585 -143511 86015 -6710 -298704 12629 179164 -107829 -140754 -126418
5266 -126418 5974 46938 -534 -247832 -224734 11907 -154937 231537 -130719 66005 143063
5255 143063 75115 284700 -10949 -106338 -392306 -16054 59613 33775 221670 440084 -1505
5243 60593 -106167 96470 91886 116859 -9277 135191 -183459 -309513 1767 -206106 -15094
5231 98175 150182 30182 210886 -6468 221110 -280706 205693 107623 160725 144599 -89926
5219 61820 -48359 -245075 61173 76186 255666 46697 -163399 43217 -274288 83833 -27736
5207 -45695 74173 -308249 130223 -19234 188605 202699 185025 138530 242907 15222 -129229
5195 13238 48505 -326048 57351 -40342 -210645 28944 -134216 24077 10625 104323 32953
5183 94276 81897 251615 -208140 267432 224567 -4213 -132696 -77883 267189 -102632 221358
5171 -82573 -282648 -202329 100371 87442 39956 -285340 -86934 -160043 -61378 -21468 333966
5159 -88072 247353 -112666 92968 237951 -12495 68450 -235310 -110810 -137392 99085 236704
5148 236704 1097 50719 -147330 60859 -4868 -380998 94078 -108849 -103654 -303030 54833
5136 173857 66971 125758 244648 -33536 159200 118921 -154004 153094 6310 -66908 56474
5124 141439 -37891 285846 -6026 -91141 -31584 157718 -30371 -8584 202543 -8982 106866
5112 160042 168613 -92669 27704 -65212 184529 -237244 -487935 310571 -61697 -156894 -199843
5101 -199843 -212034 129511 -144006 -124179 55055 173830 -511276 -231981 23591 147015
5091 147015 -9457 149533 -3220 107274 -201690 -29701 26097 63507 100404 -83686 -27608
5079 -126602 -232262 -97372 -179200 248139 282648 304284 -62305 -58407 151623 182530 -106415
5067 -214196 67744 292 -107501 476250 275829 175404 96688 230345 167716 406866 32011
5055 134193 139210 46632 155205 -33075 116025 -70437 207965 -62906 125212 -25115 -399263
5044 -399263 170395 6902 181716 -280671 -179298 -407595 261909 -103987 105282 -171961
5033 -412828 215970 -122279 -97276 177508 -177475 -112719 212950 -14864 22156 -24149 -276771
5022 -276771 -263140 -87221 344732 113051 17116 -12560 -100967 218351 137625 45129 -26941
5010 -22198 -25244 -303702 25697 -43000 32480 160266 334601 -52368 -53183 -512906 88394 -61371
4997 1934 345330 21031 302061 -100210 -82903 -5727 122282 -185640 -13958 -216252 -62647
4985 82874 -122945 -2619 -127817 -286894 129306 247260 -56741 8352 -133776 -194253 4501
4973 88140 -38718 -156753 103719 155785 93387 -190048 -21350 237969 47195 -166186 342663
4961 -230576 -258211 -69746 -104509 79727 -181632 -80315 -142358 -319397 46400 23901 -262760
4949 144600 -191561 -145081 71596 45932 13479 58905 244423 -224548 -40911 170469 188893
4938 188893 33654 -28509 272181 56576 143540 -70963 145568 -64115 -173459 -90029 9976
4926 -252464 193380 270528 -204144 213899 203248 600 -301314 112856 35795 -19772 45805
4914 -37565 -46387 146370 201923 -55926 -22856 50552 22987 -7672 2340 -121886 296833 105837
4901 -17111 -116980 142938 86948 -12500 -50898 4428 -22046 -89783 -253713 -120436 -362818
4890 -362818 -221292 -43749 -66293 -50146 -2105 113094 576064 8180 142541 7832 125010
4879 125010 150005 -399096 242100 -13033 -328651 -213712 149308 221246 120669 10572
4868 -76639 97872 38132 18253 -242106 28562 196698 -14316 29262 -156934 -14276 168893
4856 -56190 258068 -323452 -408590 118748 -2467 23271 43385 -15381 -181747 5718 15790
4845 15790 -147849 76593 86873 -68344 205205 185551 49373 -112627 -398620 -83727 -129102
4834 -129102 334718 -74490 -48259 -33168 -46442 39791 -17787 171843 -231008 -100949 115155
4822 -123789 255483 -98926 115677 -173690 -30041 48224 108392 -475828 -13309 457383 171906
4810 -137620 -264435 -11389 173288 350175 116499 246624 -123255 -169888 118667 177324
4800 177324 8410 1022 366644 252860 -1676 70623 -14845 -212860 58107 -124977 297518
4788 108038 189488 364265 98998 -79421 -16599 112290 -66380 -63268 152547 95490 -95235
4776 10460 -76558 27007 244219 -51494 -79856 116218 98810 -56674 143808 16242 -60660
4764 349376 118205 -145830 66221 51705 -160285 -40646 -152710 -70611 -42949 -141487 296464
4752 -229629 -154236 -129873 86329 -48439 178938 -94549 170169 -117026 -78083 31798 -101529
4740 -12278 -184498 229873 35095 -36069 567532 -297375 -39714 140548 -131078 134463
4729 507308 -396616 30125 -5831 84015 8527 -41739 3803 -85376 252779 -110959 -7124 116558
4716 58815 -44876 75058 -137939 280721 -98056 -53969 85057 -53340 32681 129290 114967
4705 114967 132561 3210 -76693 278022 -149501 36991 -32971 -182598 1134 -149537 -73698
4693 282428 9977 177155 90981 -25982 13253 -129521 -68072 -293932 18771 314257 153441
4681 37537 126930 -35543 -25791 -35441 -133535 -30273 104204 -32402 310413 -237044 -50216 285314
4668 62836 -91521 206253 176847 -30014 -204316 46552 168995 -132920 -35655 -180980 -270565
4657 -270565 349528 -11436 128285 -128856 -2464 43814 -144825 36165 -179340 -32213 104196
4645 -291002 -90475 218487 264429 81164 -575651 164144 -41871 78920 103956 135231 67109
4633 -21581 -68503 71347 75051 86920 -253782 195772 78193 -135394 61224 10814 -89772
4621 -31353 -135404 319019 -51077 95683 -86770 82215 -447913 -279359 99675 134638 -207434
4609 -155301 -310224 -176821 33636 -154155 180257 203071 184787 -274509 -14794 -172116
4599 -172116 -131212 -278689 116820 28913 104813 -328595 98273 -53824 238774 -17374 378969
4587 167399 -44189 -138126 117881 58532 -58755 64293 -198241 36848 -2973 -161058 -76419
4575 -9782 -63677 111120 182586 281057 -158883 195885 75938 -207179 -195244 184583 24134
4563 -446295 -117253 80575 141787 -64796 254275 -52524 -179367 100351 253249 -20415 47240
4551 37346 -31581 60697 85908 -26767 -145304 56969 50704 -140316 23533 -10900 124376
4539 123069 247783 46291 53299 -87512 -1427 169937 -34341 57777 -90031 59967 -18774 -216803
4527 -216803 -42106 108831 166908 -213598 -245105 95944 209848 -85420 23546 -11147 90365
4515 -12495 46008 23102 -2635 -13450 152953 -329260 440569 295209 172282 195688 -176535
4503 3587 -257436 23821 185925 136959 108488 -72661 -98920 289344 96952 -134270 -252940
4492 -252940 307824 83627 -73272 -202033 67804 351729 303621 -23462 10955 242852 83492
4480 -122975 -84063 77037 108159 -119049 -105746 -32274 -51790 -146322 492386 85014 -150651
$$ [...]
##END NTUPLES=NMR SPECTRUM
##END=
