
##TITLE=AC1228_VIERSDE097_6533939_abDH5esPlC
##JCAMPDX= 6.0         $$ Bruker NMR JCAMP-DX V2.0
##DATA TYPE= NMR SPECTRUM
##DATA CLASS= NTUPLES
##ORIGIN= BRUKER
##OWNER= Administrator
$$ 1.72 TOPSPIN		Version 2.1
$$ 2012-07-16 15:16:29.609 -0500  Administrator@TOPSPIN
$$ Compression mode = diff/dup
##.OBSERVE FREQUENCY= 400.02188249412
##.OBSERVE NUCLEUS= ^1H
##.ACQUISITION MODE= SIMULTANEOUS (DQD)
##.ACQUISITION SCHEME= undefined
##.AVERAGES= 8
##.DIGITISER RES= 22
##SPECTROMETER/DATA SYSTEM= spect
##.PULSE SEQUENCE= zg30
##.SOLVENT NAME= COFFEE_meoh
##.SHIFT REFERENCE= INTERNAL, COFFEE_meoh, 1, 14.98509
##AUDIT TRAIL= $$ (NUMBER, WHEN, WHO, WHERE, PROCESS, VERSION, WHAT)
$$ ##TITLE= Audit trail, TOPSPIN		Version 2.1
$$ ##JCAMPDX= 5.01
$$ ##ORIGIN= Bruker BioSpin GmbH
$$ ##OWNER= Administrator
$$ $$ C:\Bruker\TOPSPIN/data/COFFEE/nmr/AC1228_VIERSDE097_6533939_abDH5esPlC/10/pdata/1/auditp.txt
$$ ##AUDIT TRAIL=  $$ (NUMBER, WHEN, WHO, WHERE, PROCESS, VERSION, WHAT)
(   1,<2012-07-16 15:16:22.531 -0500>,<Administrator>,<TOPSPIN>,<go>,<TOPSPIN 2.1>,
      <created by zg
	started at 2012-07-16 15:15:15.609 -0500,
	POWCHK enabled, PULCHK disabled,
       configuration hash MD5:
       6B 1B 68 BB D9 2E 58 E2 7F 35 AD 54 07 DF 0E 41
       data hash MD5: 64K
       5D 8B 20 C2 07 BD B8 D3 D3 4C 62 7A 6C 04 53 F4>)
(   2,<2012-07-16 15:16:25.265 -0500>,<Administrator>,<TOPSPIN>,<proc1d>,<TOPSPIN 2.1>,
      <Start of raw data processing
       efp LB = 0 FT_mod = 6 PKNL = 1 PHC0 = 0 PHC1 = 0 SI = 32K 
       data hash MD5: 32K
       47 6A CE 39 AA 99 3C 3C 41 B6 27 0B EC 40 E0 71>)
(   3,<2012-07-16 15:16:25.656 -0500>,<Administrator>,<TOPSPIN>,<proc1d>,<TOPSPIN 2.1>,
      <pk PHC0 = 176.0614 PHC1 = 0 
       data hash MD5: 32K
       B8 1F 91 C2 B3 92 94 BA 74 BA 00 32 49 3B FB 53>)
(   4,<2012-07-16 15:16:25.781 -0500>,<Administrator>,<TOPSPIN>,<proc1d>,<TOPSPIN 2.1>,
      <abs ABSG = 1 
       data hash MD5: 32K
       2D B5 9E 59 45 48 88 67 38 E7 00 17 7D 28 EF BA>)
(   5,<2012-07-16 15:16:25.843 -0500>,<Administrator>,<TOPSPIN>,<proc1d>,<TOPSPIN 2.1>,
      <abs ABSG = 2 
       data hash MD5: 32K
       B3 86 D4 5C 26 FD DA 3D 38 BC 4C 62 CB 70 B5 43>)
(   6,<2012-07-16 15:16:25.890 -0500>,<Administrator>,<TOPSPIN>,<proc1d>,<TOPSPIN 2.1>,
      <abs ABSG = 3 
       data hash MD5: 32K
       60 76 E7 70 80 AC C0 E9 7C 10 6C 16 EC 36 7A B7>)
(   7,<2012-07-16 15:16:25.937 -0500>,<Administrator>,<TOPSPIN>,<proc1d>,<TOPSPIN 2.1>,
      <abs ABSG = 4 
       data hash MD5: 32K
       9E 11 35 B3 9A 93 2E A1 FC 69 92 6F 41 C6 D3 21>)
(   8,<2012-07-16 15:16:26.000 -0500>,<Administrator>,<TOPSPIN>,<proc1d>,<TOPSPIN 2.1>,
      <abs ABSG = 5 
       data hash MD5: 32K
       A4 F9 62 5A 38 22 6E B4 10 FD 26 22 61 56 2A A4>)
$$ ##END=
$$ 
$$ $$ hash MD5
$$ $$ 8C 99 E4 5C 1F 9D BF 1E BF 27 4E 4F 8A 9B A3 E2
##$RELAX= 
##$RELAX= 
##$RELAX= 
##$RELAX= 
##$RELAX= 
##$RELAX= 
##$RELAX= 
$$ Bruker specific parameters
$$ --------------------------
$$ [...]
150 150 150 150 150 150 150 150
##$TP07= 0
##$TPNAME0= <>
##$TPNAME1= <>
##$TPNAME2= <>
##$TPNAME3= <>
##$TPNAME4= <>
##$TPNAME5= <>
##$TPNAME6= <>
##$TPNAME7= <>
##$TPOAL= (0..7)
0.5 0.5 0.5 0.5 0.5 0.5 0.5 0.5
##$TPOFFS= (0..7)
0 0 0 0 0 0 0 0
##$TUNHIN= 0
##$TUNHOUT= 0
##$TUNXOUT= 0
##$USERA1= <user>
##$USERA2= <user>
##$USERA3= <user>
##$USERA4= <user>
##$USERA5= <user>
##$V9= 5
##$VALIST= <valist>
##$VCLIST= <CCCCCCCCCCCCCCC>
##$VD= 0
##$VDLIST= <DDDDDDDDDDDDDDD>
##$VPLIST= <PPPPPPPPPPPPPPP>
##$VTLIST= <TTTTTTTTTTTTTTT>
##$WBST= 2048
##$WBSW= 25
##$XGAIN= (0..3)
0 0 0 0
##$XL= 0
##$YL= 0
##$YMAX_a= 499562
##$YMIN_a= -632710
##$ZGOPTNS= <>
##$ZL1= 120
##$ZL2= 120
##$ZL3= 120
##$ZL4= 120
##$ABSF1= 14.98509
##$ABSF2= -5.573092
##$ABSG= 5
##$ABSL= 3
##$ALPHA= 0
##$AQORDER= 0
##$ASSFAC= 0
##$ASSFACI= 0
##$ASSFACX= 0
##$ASSWID= 0
##$AUNMP= <proc_prof1d_extract_pilot.lims>
##$AXLEFT= 0
##$AXNAME= <>
##$AXNUC= <1H>
##$AXRIGHT= 0
##$AXTYPE= 0
##$AXUNIT= <>
##$AZFE= 0.1
##$AZFW= 0.1
##$BCFW= 0
##$BC_mod= 0
##$BYTORDP= 0
##$COROFFS= 0
##$CY= 15
##$DATMOD= 1
##$DC= 0
##$DFILT= <>
##$DTYPP= 0
##$F1P= 0
##$F2P= 0
##$FCOR= 0.5
##$FTSIZE= 32768
##$FT_mod= 6
##$GAMMA= 0
##$GB= 0
##$INTBC= 1
##$INTSCL= 1
##$ISEN= 128
##$LB= 0
##$LEV0= 0
##$LPBIN= 0
##$MAXI= 10000
##$MC2= 0
##$MEAN= 0
##$ME_mod= 0
##$MI= 0
##$NCOEF= 0
##$NC_proc= -8
##$NLEV= 6
##$NOISF1= 0
##$NOISF2= 0
##$NSP= 0
##$NTH_PI= 0
##$NZP= 0
##$OFFSET= 14.98509
##$PC= 1
##$PHC0= 176.0614
##$PHC1= 0
##$PH_mod= 1
##$PKNL= yes
##$PPARMOD= 0
##$PPDIAG= 0
##$PPIPTYP= 0
##$PPMPNUM= 2147483647
##$PPRESOL= 1
##$PSCAL= 4
##$PSIGN= 0
##$PYNMP= <proc.py>
##$REVERSE= no
##$SF= 400.02
##$SI= 32768
##$SIGF1= 0
##$SIGF2= 0
##$SINO= 400
##$SIOLD= 32768
##$SPECTYP= <>
##$SREGLST= <1H.CDCl3>
##$SSB= 0
##$STSI= 32768
##$STSR= 0
##$SW_p= 8223.68421052631
##$SYMM= 0
##$S_DEV= 0
##$TDeff= 65536
##$TDoff= 0
##$TI= <>
##$TILT= no
##$TM1= 0
##$TM2= 0
##$TOPLEV= 0
##$USERP1= <user>
##$USERP2= <user>
##$USERP3= <user>
##$USERP4= <user>
##$USERP5= <user>
##$WDW= 1
##$XDIM= 32768
##$YMAX_p= 466302909
##$YMIN_p= -784952
##$CURPLOT= <Network HP LaserJet P1505>
##$CURPRIN= <$Network HP LaserJet P1505>
##$DFORMAT= <normdp>
##$LAYOUT= <+/1D_H.xwp>
##$LFORMAT= <normlp>
##$PFORMAT= <normpl>
##$SURQMSG= 1
$$ End of Bruker specific parameters
$$ ---------------------------------
##NTUPLES= NMR SPECTRUM
##VAR_NAME=  FREQUENCY,     SPECTRUM/REAL,   SPECTRUM/IMAG
##SYMBOL=    X,             R,               I
##VAR_TYPE=  INDEPENDENT,   DEPENDENT,       DEPENDENT
##VAR_FORM=  AFFN,          ASDF,            ASDF
##VAR_DIM=   32768,         32768,           32768
##UNITS=     HZ,            ARBITRARY UNITS, ARBITRARY UNITS
##FACTOR=    0.250966925370066, 1,           1
##FIRST=     8223.43324360094, -114036,      -110147
##LAST=      0,             -33470,          63281
##MIN=       0,             -784952,         0
##MAX=       8223.43324360094, 466302909,    0
$$ Real data points
##PAGE= N=1
##DATA TABLE= (X++(R..R)), XYDATA
$$ [...]
19551G4556a9064A53997b5905j13099j49675i3041G5431a739j89443b9751q1147
19540a10898m9639n2015h1273D1560M72a54163m421j12927h8922D785K6998M9094
19528H0877J13926a68223B8091N450a54969A72159c1640E2286L7209a89206A90841
19516A14989a15578A82316q5009a14612B62878a39669d2727L649l3642h338j07987
19505a16325A32793c7216B2705a23861f0667B39950e5784B0889H28h1866B3182
19493A39563a6630j32330O9907E9482a10951m392m7666H8199K1701b76763G2830
19481B0310L8037c07745B62107b53043A9855b57831A1245h4912j30350A0501d00084
19469d0358C08314A52274f9964B50571a98955O5852j98196G6020B4672b49659
$$ plain form
19551 74556 -19064 153997 -25905 -139004 -288679 -93041 75431 -1739 -191182 -29751 -110898
19540 -110898 -160537 -212552 -81273 41560 42032 -154163 -158584 -271511 -88922 4785 31783 80877
19528 80877 194803 -168223 28091 33541 -154969 172159 -31640 52286 89495 -189206 190841
19516 114989 -115578 182316 97307 -114612 262878 -139669 -42727 -39078 -72720 -8338 -116325
19505 -116325 132793 -37216 22705 -123861 -60667 239950 -55784 20889 828 -81866 23182
19493 139563 -16630 -148960 -79053 59482 -110951 -115343 -163009 88199 109900 -276763 72830
19481 20310 58347 -307745 262107 -253043 19855 -257831 11245 -84912 -215262 10501 -400084
19469 -40358 308314 152274 -69964 250571 -198955 -133103 -331299 76020 24672 -249659
19458A6567a54155K9405m1195a2740B8527a67986A83024D2482c32736g0585I08
19446b53289D22752c89937J77174g2015D29884f7059k25240g5452l2357B08683
19435b44242j60986e0699a7452E1700d1751B4288b22821P2082b2913l5403K3640
19424c4676q949k8097j51631h7882k8055N7520j55629Q5083D20888i0317K439
19413h7878l57293F7423J46514h7116B44899F7060a92515A82157i2561A40650
19402a63682c2571J2413l2160k28937a10146l7813F5489L2046a58199j4170J5695
19391a56674k46199a86423r4816O9265d0909A13057a27458r7450C31243a0076
19380B43359A20798d39653i698o16749a81809e3666m04585A30199j446R7953H0010
$$ plain form
19458 16567 -154155 -124750 -165945 -12740 28527 -167986 183024 42482 -332736 -70585 908
19446 -253289 422752 -389937 -212763 -72015 429884 -67059 -292299 -75452 -107809 208683
19435 -244242 -405228 -50699 -17452 51700 -41751 24288 -222821 -150739 -22913 -58316 -34676
19424 -34676 -43625 -71722 -223353 -87882 -115937 -58417 -214046 -128963 420888 -90317 -87878
19413 -87878 -445171 67423 213937 -87116 244899 67060 -192515 182157 -92561 140650
19402 -163682 -32571 -20158 -52318 -281255 -110146 -147959 65489 97535 -158199 -172369 -156674
19391 -156674 -402873 -186423 -281239 -211974 -40909 113057 -127458 -224908 331243 -10076
19380 243359 120798 -439653 -9698 -626447 -181809 -53666 -458251 130199 128753 226706 80010
19368I1431c11754a08525d6171D7695J07230b34427K8368r3256g2469k07997B7823
19356C23024a37835H8446e2707k57823J07705Q4962A03788b24040B30182i5663
19345D8994K19970c4316l85567A32878d4607k03968A05938n0228b21813g6580
19334C9084a1955I779M1473e8108E5572i4308A19027b61725N6318d9703l1611
19323h1314l8263A15031E3708b48289c6661l98268a38557e7035K2845A20605m1611
19312G8994a94309H3508J08109d65076D5798b40005j73045F7570j9511a87878
19301b22660B0831R1997a1241C5302b75108B59179e44701H660a76862f8881R807
19290e9074E5383J24538g7368B0143a11938A49817a82602C49Q2775a38974A08985
$$ plain form
19368 91431 -311754 -108525 -46171 47695 154925 -234427 -206059 -299315 -72469 -280466 27823
19356 323024 -137835 88446 -52707 -310530 -202825 -117863 103788 -224040 230182 -95663
19345 48994 268964 -34316 -419883 132878 -44607 -248575 105938 55710 -221813 -76580
19334 39084 -11955 9779 51252 -58108 55572 -94308 119027 -261725 -205407 -49703 -81314
19323 -81314 -119577 115031 53708 -248289 -36661 -434929 -138557 -57035 -34190 120605 78994
19312 78994 -194309 83508 191617 -465076 45798 -240005 -413050 67570 48059 -187878
19301 -222660 20831 112828 -11241 35302 -275108 259179 -544701 8660 -176862 -68881 -59074
19290 -59074 55383 179921 -77368 20143 -111938 149817 -182602 349 83124 -138974 108985
19278d196E3143c1623n2972o1530M9775r8458A03007N163a17232A64346c07120
19266a51594l2358D2127j0528M4165e4899j97521C6631K5406i8369l0201a926
19254a22012c7100q3922e6951E3247b45594g5391q3264G2931a26896B69342b59764
19242a21494F0919e0025B43843K2177d31792A30629a85358F761J455a17502K1890
19231i5612c8421q0128E3523a30168j04016F1504k9349n86b74830k82220f0652
19219A47020d5831j42547K2746P0925a2707A88307E1359b47513Q6967J6173f0793
19207D88b07758A34451A9439h2813p1162A53543i7340A41041b32107A60804i931
19195B37023b09511h9394j38606E1869h4136A32070R1540G312e1714B1926J67610
$$ plain form
19278 -4196 53143 -31623 -84595 -146125 -96350 -194808 103007 108170 -117232 164346 -307120
19266 -151594 -183952 42127 31599 75764 -54899 -252420 36631 62037 -98369 -128570 -1926
19254 -122012 -37100 -121022 -56951 53247 -245594 -75391 -158655 72931 -126896 269342 -259764
19242 -121494 60919 -50025 243843 266020 -431792 130629 -185358 6761 8216 -117502 -95612
19231 -95612 -38421 -118549 53523 -130168 -234184 61504 32155 31569 -274830 -557050 -60652
19219 147020 -45831 -188378 -165632 -94707 -12707 188307 51359 -247513 -160546 -144373 -60793
19207 488 -207758 134451 19439 -82813 -153975 153543 -97340 141041 -232107 160804 -9931
19195 237023 -209511 -89394 -228000 51869 -84136 132070 223610 7312 -51714 21926 189536
19184A89536b37270O8475a7370k04873d6278j36751a6563j29427d5946j76207
19174b22153E3426h8320c0654k22775B09671a61110O204A56851a49662G8412b25475
19162C0527a00824b8844B7468Q0126K14376b05410J6922D499K5392c9802C39624
19150i4895A28361l8014C7621a13388D3965P7919M9553a42928M4572k5258m1206
19139a64820A90619K676A3420O8451c22702F2819a64418D3976d0804D4914a23190
19127B31404a34378M2651l29678A1708a47012D5333e8469A11687q00I128M3371
19116E2499J66872d7341h783j17042e7959k57767N5795C6259b75855B1269f2267
19104F8243g5276A5808b6870l28048E7879D876K59523e3875n0431d0881k16548
$$ plain form
19184 189536 -237270 -168795 -17370 -222243 -46278 -183029 -16563 -145990 -45946 -222153
19174 -222153 53426 -88320 -30654 -253429 209671 -161110 -154906 156851 -149662 78412 -225475
19162 30527 -100824 -28844 27468 107594 321970 -205410 -188488 4499 29891 -39802 339624
19150 -94895 128361 90347 37621 -113388 43965 121884 171437 -142928 -98356 -123614 -164820
19139 -164820 190619 193295 13420 81871 -322702 62819 -164418 43976 -40804 44914 -123190
19127 231404 -134378 -91727 -421405 11708 -147012 45333 -58469 111687 110887 9128 52499
19116 52499 219371 -47341 -8783 -125825 -57959 -315726 -259931 36259 -275855 21269 -62267
19104 68243 -75276 15808 -26870 -354918 57879 4876 264399 -53875 -104306 -40881 -257429
19093b57429m0214C53028a2637j44536Q190F1846b18714I638c11401J14987d0072
19081h621o5465K7613n0272K9700o3536j55260Q7218Q9336j85273a0578l05092
19070c15670a23510j78196a30065O625A5384a07952B33460d00797A5529K75857
19060B91386b73779B77225F9837P3787b89145E7084i4487k2211k9427B22918a66935
19048I2766C6308K68611a48091B56893a44452d7729k16658J13735j716D0583a36020
19036A70259a23998l388d989j1846C9450K01674j16263a14438A49713a9551j27744
19025a47295k1247c5184G1824f093B59051j19315c28598B51199h225j06964l4981
19014a50170q4174j84800B16146g7172o5040l9486l34826I96L3118l169f064A92045
$$ plain form
19093 -257429 -297643 353028 -12637 -157173 -148983 61846 -218714 9638 -311401 -196414 -40072
19081 -8621 -74086 -46473 -96745 -67045 -130581 -285841 -198623 -109287 -294560 -10578 -315670
19070 -315670 -123510 -301706 -130065 -123440 15384 -107952 233460 -400797 15529 291386
19060 291386 -273779 277225 69837 143624 -289145 57084 -94487 -116698 -146125 222918 -166935
19048 92766 36308 304919 -148091 256893 -144452 -47729 -264387 -150652 -152368 40583 -136020
19036 170259 -123998 -127386 -4989 -16835 39450 241124 124861 -114438 149713 -19551 -147295
19025 -147295 -168542 -35184 71824 -6093 259051 139736 -328598 251199 -8225 -115189 -150170
19014 -150170 -234344 -419144 216146 -77172 -142212 -181698 -516524 996 34114 30945 -6064 192045
19001b11222l355e6223j12049e9703c140m7351J2529A42241f8089j23661q3868
18990b75618A38798b08133P7782N59A33277K2706q307o1815M4627b22496J05315
18979a17181j46777N8638L2397m6355B10171D8134I96N3364b35745Q2302A24926
18967d7417j87113e6152l38912A96934h6590c6690j50109I8144J06592b80357
18956c532r3757o3885j61525A79072c48576J05867b1018B45532h7140C92483a20060
18944B48302A09960a2833j77284g4256q1299C4845O8970b19842R3055j325B2369
18932a61206d6797A67276f9231A19839K14834a3465A96192b6196j64502j00918
18922b91616J15160i816n3431p8828A76911o48M0882b1267j19520o0128p1653
$$ plain form
19001 -211222 -214577 -56223 -168272 -59703 -3140 -50491 -37962 142241 -68089 -191750 -275618
18990 -275618 138798 -208133 -130351 -129792 133277 155983 147676 85861 130488 -222496 -117181
18979 -117181 -263958 -205320 -172923 -219278 210171 48134 996 54360 -235745 -153443 124926
18967 -47417 -234530 -56152 -395064 196934 -86590 -36690 -186799 98144 204736 -280357
18956 -3532 -97289 -161174 -322699 179072 -348576 -242709 -21018 245532 -87140 392483 -120060
18944 248302 109960 -12833 -190117 -74256 -155555 34845 103815 -219842 -126787 -128112 22369
18932 -161206 -46797 167276 -69231 119839 334673 -13465 196192 -26196 -190698 -291616
18922 -291616 -176456 -9816 -63247 -142075 176911 176263 217145 -21267 -140787 -200915 -272568
18911b72568C1292K62534a72780r5714a03580B30182c5657j24271H9804b58388
18900e6202A24735a53920A10709a33820b492G4415C5478N0298b36928C4692J02177
18889A36869h323I8470k548b41615J00468M6489b2532L436o5940I8545P5100a39626
18876a14490a3603H9494c57881A11040B1860c52563J61211k40611J55336A784
18865c21703K038a00896D8541g2403A9459h6024J7355m7058F5043p420a3933k349
18853a6282j59214A9696K5596b37743L832M9450F0993Q6659a63674F2213d19370
18841A19715a15281B50052a83149j90876d5391j74555f009D310c23435A71402
18830a11636m2271j35608h2373k1191M2345o2687B58516a4282D7040a26193d4245
$$ plain form
18911 -272568 31292 293826 -172780 -268494 -103580 230182 -35657 -159928 89804 -258388
18900 -56202 124735 -153920 110709 -133820 -2492 74415 35478 85776 -236928 34692 136869
18889 136869 -8323 98470 95922 -241615 -141147 -94658 -22532 -19096 -85036 98545 173645 -139626
18876 -114490 -13603 89494 -357881 111040 21860 -352563 -191352 -431963 -276627 1784
18865 -321703 -319665 -100896 48541 -72403 19459 -86024 -68669 -115727 65043 57623 -13933 -16282
18853 -16282 -175496 19696 45292 -237743 -233911 -184461 60993 147652 -163674 62213 -419370
18841 119715 -115281 250052 -183149 -374025 -45391 -219946 -6009 4310 -323435 171402
18830 -111636 -153907 -289515 -82373 -103564 -61219 -123906 258516 -14282 47040 -126193 -44245
18818B66866b89775D8945b02281B71424i4417H7524j3303a03512c0979A58132
18807e3714H9413j3469c4971C4882a29881A8841g7999A10336n4438g2173r8824
18796a70997A01293b2361B27330a0701j53682l08643C1512a19909c0354E1775
18785c62666a27477O1163m85125E2542c10124C7063e821k56634A52295B7949a03601
18773C597b0161j0142j56926h3422H8222C7250J87155A10444A8336a57021j77992
18762c35013a43481b776j12821c1351p2556d7663j29317f1099j42272G4674K66046
18751C40720a28382j01222e6573B40018a11741A1630h3759F9220b14718A4943
18740c40146Q6807A18390b19456D9149p920a34435m8811B91268b04044m49845
$$ plain form
18818 266866 -289775 48945 -202281 271424 -94417 87524 74221 -103512 -30979 158132
18807 -53714 89413 75944 -34971 34882 -129881 18841 -77999 110336 55898 -72173 -170997
18796 -170997 101293 -22361 227330 -10701 -164383 -473026 31512 -119909 -30354 51775
18785 -362666 -127477 -66314 -551439 52542 -310124 37063 -5821 -262455 152295 27949 -103601
18773 3597 -20161 -30303 -187229 -83422 88222 37250 224405 110444 18336 -157021 -335013
18762 -335013 -143481 -2776 -115597 -31351 -103907 -47663 -176980 -61099 -203371 74674 340720
18751 340720 -128382 -229604 -56573 240018 -111741 11630 -83759 69220 -214718 14943
18740 -340146 -253339 118390 -219456 49149 41229 -134435 -183246 291268 -204044 -653889
18730f53889E602K69711c7061n9990m2509A76598c50086I5894K6933d8628k12648
18719b61276G4659N6422i4536M5894E9478a54336c5833L831q9031k69117B59436
18707D1875b9961k91368J47635f0640o9713n5759J9107B61736b15142O6288A45503
18695a32810B27861b10506M3401j81961c5461A10797A4250a428l0634A1586J18163
18684A29749a34219Q60B8882L4746O7197d83165F7251i8367k30654B54435a4880
18672A71119f6305A51098o1115a87003C4304c6413A00152h9485I8536a89668I2453
18660b6757k27254C534J2496n819a80203j30824i2974F1486a25388q1250j06322
18649c12960O5840k56378c5438p352j72957F1777J16147G4877c5149n8447r2301
$$ plain form
18730 -653889 5602 275313 -37061 -97051 -139560 176598 -350086 95894 122827 -48628 -261276
18719 -261276 74659 131081 -94536 -48642 59478 -154336 -35833 -32002 -121033 -390150 259436
18707 41875 -29961 -321329 -173694 -60640 -130353 -186112 -167005 261736 -215142 -148854 145503
18695 -132810 227861 -210506 -167105 -349066 -35461 110797 14250 -1428 -32062 11586 129749
18684 129749 -134219 -133359 28882 63628 130825 -483165 67251 -98367 -329021 254435 -14880
18672 171119 -66305 151098 89983 -187003 34304 -36413 100152 -89485 98536 -189668 92453
18660 -26757 -254011 3534 16030 10211 -180203 -311027 -92974 61486 -125388 -206638 -312960
18649 -312960 -247120 -503498 -35438 -42790 -215747 61777 177924 74877 -35149 -93596 -185897
18638a85897C38826a61013c9902q9544A07766g2025p1343C8666P2293a95547A6656
18626e5463k77237a42084j69372a48009c2395j67777Q1861m7431k4708l7747Q1609
18615a46588H6287b17864E4672L5453e7672o6826H0932h9226a4303k17186A03493
18603D16017A35657a03152n7392m1824j12447G166a60160L4438A67308E5888i980
18591A7285a03344B01332a35173H1468J43554b89651C58975M6297d17212F894
18580e4094B6234N2948a14376B8542b01180B11878g8916k619B56465H272K06882
18569B15154f5171K0631m316A44270J15695g4465A55810J14659a43050D3752e6549
18557C21583b78011A80819l4164g7909A40044a4610j1397l9915C13911a45645
$$ plain form
18638 -185897 338826 -161013 -39902 -129446 107766 -72025 -143368 38666 110959 -195547 16656
18626 -55463 -332700 -142084 -311456 -148009 -32395 -200172 -118311 -165742 -190450 -228197 -146588
18615 -146588 86287 -217864 54672 90125 -57672 -124498 80932 -89226 -14303 -231489 103493
18603 416017 135657 -103152 -160544 -202368 -314815 7166 -160160 -125722 167308 55888 -9980
18591 17285 -103344 201332 -135173 81468 225022 -289651 358975 405272 -417212 6894
18580 -54094 26234 79182 -114376 28542 -201180 211878 -78916 -81535 256465 8272 215154
18569 215154 -65171 -44540 -48856 144270 259965 -74465 155810 270469 -143050 43752 -56549
18557 321583 -278011 180819 146655 -77909 140044 -14610 -26007 -65922 313911 -145645
18546i4387O617A30873a58888k91894e0648a3196j38183e0477k68745f0557r9904
18535a60461B35904o090c56017G7602b19830A04403d0671F9982L5043a65497D8084
18523f915j54311k32342a91043j9471B36022b5088p4753E0129Q2002a61154j77548
18512c38702J8119g5220k27999J00113A9001N1482b13847a05882k32283i7621
18501d7792E9859J19000a72444A3905K4621R8486f25734A13950b65480a4365k26237
18490b40602R6230C08642c75383A07134a30819a4072k20969C2844J31311a37866
18479a28314o3245D194f4364j56589P7050j32238O4079k0903A035M03403J3724
18468D18162g08j74751A32678d42263a61517P3322b8400j37944a7314p2020j12992
$$ plain form
18546 -94387 -87770 130873 -158888 -450782 -50648 -13196 -151379 -50477 -319222 -60557 -160461
18535 -160461 235904 229814 -356017 77602 -219830 104403 -40671 69982 105025 -165497 48084
18523 -6915 -161226 -393568 -191043 -210514 236022 -25088 -99841 50129 132131 -161154 -338702
18512 -338702 -320583 -75220 -303219 -203106 19001 70483 -213847 -105882 -338165 -97621
18501 -47792 59859 178859 -172444 13905 38526 137012 -625734 113950 -265480 -14365 -240602
18490 -240602 -144372 308642 -375383 107134 -130819 -14072 -235041 32844 164155 -137866
18479 -128314 -191559 4194 -64364 -220953 -143903 -276141 -212062 -232965 1035 404438 418162
18468 418162 -708 -175459 132678 -442263 -161517 -88195 -28400 -166344 -17314 -89334 -202326
18457b02326j03017g3190A83182k1217E8166J9465C2649a6360e836D7509b34276
18445B40172d5889j92031R8966B3403g6934J7946p6531j44224k75297E19168H2890
18433e8937l4553l0839E4281a77021b192k24983r1449D21696b61070A66576a31393
18421F9371O8683N6876a58647P6878q7731C12193c34830J114a27074j95625g1394
18409a77071E3819f2985L0635I2741L2186a37084G5417g3501j14812O4112b8654
18397a10154A42507b11509B6244A0167a00799B10133a38279B08583c68355h9755
18386b07412j36529O7837m6169a30012b277A30173J7656F4900a24391b1645G3592
18374d48634C1410J62199c551m7082B6278e8818H8850a8832j43701P6517B616
$$ plain form
18457 -202326 -305343 -73190 183182 161965 58166 77631 32649 -16360 -5836 47509 -234276
18445 240172 -45889 -237920 -138954 23403 -76934 -58988 -135519 -279743 -555040 519168 82890
18433 -58937 -93490 -124329 54281 -177021 -2192 -227175 -318624 421696 -261070 166576 -131393
18421 69371 138054 194930 -158647 -81769 -169500 312193 -334830 -333716 -127074 -322699 -71394
18409 -177071 53819 -62985 -32350 92741 124927 -137084 75417 -73501 -188313 -124201 -28654
18397 -110154 142507 -211509 26244 10167 -100799 210133 -138279 208583 -368355 -89755
18386 -207412 -343941 -276104 -322273 -130012 -2277 130173 147829 64900 -124391 -21645 73592
18374 -448634 31410 193609 -3551 -50633 26278 -58818 88850 -18832 -162533 -86016 2616
18362b50055A32607c918r7687D9166a07823m744G4999a24148E9472b45412c8339
18350H1522J57562j00110e53253a82423G5751K2026H223i6017M7457C8583i9483
18338H542b5542C12652e8093o9710g139B17661h1479H2043a40208A80443q5927
18327I4516o561h1048r5842j953p772D3352a22099j05911A30682H441b8243k81750
18315c09993a45694k41570f5787A69017i6641l25013E3184b53595B91730a91061
18304B79128A00545b35827K3171A29983c49151a00426j21592k75678J34974f869
18293a20777G8006b00977d1613j24147g6356C2235n451O0127b56943g9787B90644
18281a09933k6095I8440a40377j30573j1902J39546B75731e3689n5931d4798k89593
$$ plain form
18362 -250055 132607 -3918 -101605 49166 -107823 -112567 74999 -124148 59472 -245412 -38339
18350 81522 239084 138974 -553253 -182423 75751 97777 8223 -96017 -48560 38583 -99483
18338 8542 -25542 312652 -58093 -127803 -7139 217661 -81479 82043 -140208 180443 94516
18327 94516 87955 -81048 -176890 -178843 -186615 43352 -122099 -228010 130682 8441 -28243 -309993
18315 -309993 -145694 -387264 -65787 169017 -96641 -421654 53184 -253595 291730 -191061
18304 279128 100545 -235827 -212656 129983 -349151 -100426 -222018 -497696 -362722 -6869
18293 -120777 78006 -200977 -41613 -165760 -76356 32235 26784 86911 -256943 -79787 290644
18281 -109933 -136028 98440 -140377 -270950 -282852 -143306 275731 -53689 -109620 -44798 -334391
18270c34391L938B20048a23274A89399K4375b67724A97833M9530D2343f8320n5487
18259a23807F6019l449c74665A0120h3056E4912J86877H8408j6443J77707J13534
18248C63206a99543E511h0224A10788b32400B7148A3156a00704j86279B3582K11448
18237B35030f18A7692d4571m5243E978K16688A05650a51845l0260B4747j777f1593
18224A24557J28902A03633i80B65003b2780j86339E8642J17806b68835f9627q2080
18213a51707M7521b3698k17283g8215j27720H0113b38937I9511N6918g9599q1002
18202a60601l00019G0126O336L8129A4140b0017j32220M3487j00876M6265d5018
18190B25662d9130k07774d2242Q539C05783r6752a50983I7535a26788G6598C4990
$$ plain form
18270 -334391 -330453 220048 -123274 189399 213774 -267724 197833 247363 42343 -68320 -123807
18259 -123807 66019 62570 -374665 10120 -83056 54912 241789 88408 71965 249672 363206
18248 363206 -199543 5511 -80224 110788 -232400 27148 13156 -100704 -286983 23582 235030
18237 235030 -618 17692 -44571 -89814 5978 222666 105650 -151845 -182105 24747 22970 -61593
18224 124557 253459 103633 -980 265003 -22780 -209119 58642 176448 -268835 -69627 -151707
18213 -151707 -104186 -23698 -240981 -78215 -205935 80113 -238937 99511 156429 -79599 -160601
18202 -160601 -460620 70126 76462 114591 14140 -20017 -152237 -108750 -209626 -163361 -45018
18190 225662 -49130 -256904 -42242 -33703 305783 209031 -150983 97535 -126788 76598 34990
18178d5003A27693b20727c4981B5871b43189H6150q56e02243K03778a32383I3869
18166a34586G5034a00237n2046k39052a20493D5305i2191M115A17606O1103l1364
18155A47345m0289a83289F9455e6503j01309k46341f890m3068D636b66011B38989
18143b22610A35225a60058A51029a27431r1653h0290K838k12323a28001A44190
18132i2283B3124K4753P8908a4767G0407f5989E8545B5681L08379E103a26190
18120a84007f536B3410J07432h2104D9810e9320A07660j0062D394J50039p3531
18109H0902a09073i474k97579E6326a38364e4173A57845L6271N862b81867j55698
18098d37565a34970M7314A31161b7291j1421h558p7731E4508g4287B57389D6822
$$ plain form
18178 -45003 127693 -220727 -34981 25871 -243189 86150 85294 -502243 -298465 -132383 93869
18166 -134586 75034 -100237 -152283 -391335 -120493 45305 -92191 -88076 117606 178709 147345
18155 147345 107056 -183289 69455 -56503 -157812 -404153 -6890 -49958 4636 -266011 238989
18143 -222610 135225 -160058 151029 -127431 -219084 -80290 -77452 -289775 -128001 144190
18132 -92283 23124 47877 126785 -14767 70407 -65989 58545 25681 334060 5103 -126190
18120 -184007 -6536 23410 130842 -82104 49810 -59320 107660 97598 4394 154433 80902
18109 80902 -109073 -9474 -307053 56326 -138364 -54173 157845 194116 199978 -281867 -437565
18098 -437565 -134970 -87656 131161 -27291 -38712 -8558 -86289 54508 -74287 257389 46822
18086I7087d21723a11473A88176g918q1071j59248N4428h1415B72074i8738A7682
18074c49762g0589l37387a31052f4771I8189a72725H8716e670F3725a281B9020
18062B0744b78019P7590A37035L8628e697A72331M2684h7152B55973i4093j3653
18051a07746L1078E3865c7023B31367C246h6831A07753a24711A22367P3800D2187
18039b80487O3650e6625D2027L7749d5701j81397j0764j08776R6264j2307B24840
18027I9246G748f24517b70027Q3461A15077b18771L7771B8a48421B16277F8707
18015A99723E2415J42099a34879L7951B88270C6383c9559B9205L43314g094j45787
18004a52881M6648d4269m793m13655a87028j25944d294p7457o0463q8358A6202
$$ plain form
18086 97087 -421723 -111473 188176 -7918 -88989 -248237 -193809 -81415 272074 -98738 17682
18074 -349762 -70589 -407976 -131052 -64771 98189 -172725 88716 -5670 63725 -1281 29020
18062 20744 -278019 -200429 137035 175663 -5697 172331 215015 -87152 255973 -94093 -107746
18051 -107746 -76668 53865 -37023 231367 3246 -86831 107753 -124711 122367 196167 42187
18039 -280487 -216837 -56625 42027 79776 -45701 -227098 -237862 -346638 -250374 -262681 224840
18027 99246 7748 -624517 -270027 -186566 115077 -218771 -181000 28 -148421 216277 68707
18015 199723 52415 194514 -134879 -96928 288270 36383 -39559 29205 372519 -7094 -152881
18004 -152881 -106233 -44269 -49062 -462717 -187028 -312972 -4294 -81751 -142214 -230572 16202
17992E7970B2709b76640A87700a25227L6818p6810f0804B22787A06344D9896N6954
17981A06850J28561D2670O2098J9668b59879c9009k09812A43865b99037D3364
17970A95708H9315a28643B55285G1702d9953a2873F5995a5732l90845a13401r9066
17959b12467A20259b14819q6942L838a29150A22030a89999N4099K3766A08630
17948A7738d7639Q461H3543g6658c3916C32139B9311N3117R0276a33217L4718
17937i8499l84745A74459a02138d1312E6730d25706b12037C28221a40663A35474
17926H1630a19245n1215g5031r86K3621k14434C21769G7078g8541A81b2241o8701
17914i0942H7544P8771c3261B1416p645m795c08719i8746r4199A0621a14813B83203
$$ plain form
17992 57970 22709 -276640 187700 -125227 -88409 -165219 -60804 222787 106344 49896 106850
17981 106850 235411 42670 104768 124436 -259879 -39009 -248821 143865 -299037 43364
17970 195708 89315 -128643 255285 71702 -49953 -12873 65995 -15732 -406577 -113401 -212467
17959 -212467 120259 -214819 -301761 -297923 -129150 122030 -189999 -135900 -112134 108630
17948 17738 -47639 -39178 83543 -76658 -33916 332139 29311 82428 172704 -133217 -98499
17937 -98499 -483244 174459 -102138 -41312 56730 -425706 -212037 328221 -140663 135474
17926 81630 -119245 -170460 -75031 -76017 -52396 -266830 321769 77078 -78541 181 -22241 -90942
17914 -90942 87544 166315 -33261 21416 13771 8976 -308719 -98746 -192945 10621 -114813 283203
17901B19957G7688a1768m28836B39330B6545a80689A4202a41566B5830a46554
17890I9234m8232g2795A55703G4240J15744a89159H522i1785p9101a999E7806
17878A09435a00962D9537a07079a455F3223b2627C1089i9648l076A18137M7022
17867A65159g4858K0471l94502B52327m0601i6098o7264B77094E9188j8632A4524
17855F9797B6573a46684B17575F4862c07800J29353E3810d13E5037a45720B14594
17843A43893e6999l25244a63593n0364g8036C27864g5136B5536K32647a72053
17832a5123l92416J47373O0992B61620a63186A04038G17b66571a08964J3839b83
17820a5504A52853c51072J59709F5321c01947A08943C8115c96790g979A59404
$$ plain form
17901 219957 77688 -11768 -440604 239330 26545 -180689 14202 -141566 25830 -146554
17890 99234 51002 -72795 155703 74240 189984 -189159 8522 -91785 -170886 -1999 57806
17878 109435 -100962 49537 -107079 -1455 63223 -22627 31089 -99648 -102724 118137 165159
17867 165159 -74858 -54387 -448889 252327 211726 -96098 -163362 277094 59188 40556 14524
17855 69797 26573 -146684 217575 64862 -307800 -178447 53810 -413 55037 -145720 214594
17843 143893 -56999 -382243 -163593 -213957 -78036 327864 -75136 25536 258183 -172053
17832 -15123 -407539 -260166 -199174 261620 -163186 104038 717 -266571 -108964 -95125 -283
17820 -15504 152853 -351072 -191363 65321 -301947 108943 38115 -396790 -7979 159404
17809d01971a38205B23217G984b5151p8937k7795a8396F1348L2954b00174j9639
17798b19813e3742j77126H8075a97991B19675J3385c88042J28198A35560j3339
17788A22221e4348k51407j791c0532k4393A80569B8500P1835i0397j44838L1835
17777b03400f422H6809L3040a35040B54827p4849N0803a47384m6000g3611p0875
17766a44486k2884B1223p013b71583G4995b26031B8512f9002a3136k28426A56032
17754a01197b862k81612B00882I4589J5962J13411a13675A51618O1907j7470r6852
17743I9203a74323f527F0990J82654r6353b1222p323A2009i4065D0918b8708A69878
17730a04713I9986c3691j51571B6855O7986B4630M668e7366N371k465j69824A63875
$$ plain form
17809 -401971 -138205 223217 7984 -25151 -104088 -131883 -18396 61348 94302 -200174 -219813
17798 -219813 -53742 -230868 88075 -197991 219675 233060 -388042 -259844 135560 122221
17788 122221 -54348 -305755 -307546 -30532 -54925 180569 28500 100335 -90397 -235235 -203400
17777 -203400 -6422 86809 119849 -135040 254827 179978 230781 -147384 -193384 -73611 -144486
17766 -144486 -167370 21223 14210 -271583 74995 -226031 28512 -69002 -13136 -241562 156032
17754 -101197 -2862 -284474 200882 94589 110551 223962 -113675 151618 213525 196055 99203
17743 99203 -174323 -6527 60990 243644 147291 -21222 -28545 12009 -94065 40918 -28708 169878
17730 -104713 99986 -33691 -185262 26855 94841 24630 29298 -57366 -51995 -54460 -224284 163875
17717a81744e704A07098c5415F5027b8311C0738P8451a70420N2370j52641A79604
17705b95764G7031J61602b74250D08769j09524a40799B22345i5788A28035Q0934
17695B08969b4138r907D3361i5725c322G971c13859B70612a66272P4849M2253
17684d9170A25914A7027P9724k4307L2712A9174N703J26210a59579c9709A37026
17672C68520j57811f6069K1605G7939B997J07174j687b3513A9549a56857j81184
17661c38041D2114b37045a01733j92866B49970k4250h9314B13182o4394a98122
17650c61174a33730H701h2484A24733k2121b36450a0502o2884A37387a19738K9664
17639i0074M1877B6953a64796e6284b7771G6283O4983D9517J6492K77703H7897
$$ plain form
17717 -181744 -5704 107098 -35415 65027 -28311 30738 109189 -170420 -118050 -270691 179604
17705 -295764 77031 238633 -274250 408769 299245 -140799 222345 -95788 128035 208969
17695 208969 -24138 -34045 43361 -95725 -3322 7971 -313859 270612 -166272 -91423 -49170
17684 -49170 125914 17027 96751 72444 105156 19174 24877 151087 -159579 -39709 137026
17672 368520 210709 -66069 -44464 77939 2997 110171 108484 -23513 19549 -156857 -338041
17661 -338041 42114 -237045 -101733 -294599 249970 225720 -89314 213182 148788 -198122
17650 -361174 -133730 8701 -82484 124733 102612 -236450 -10502 -73386 137387 -119738 -90074
17639 -90074 -48197 26953 -164796 -56284 -27771 76283 141266 49517 66009 343712 87897
17627E1743N3947c24839I2007a10941A06654L1322D7004J34527a73817A94556
17616a94160e1613C56081j04959a80249A9601K62141a40899F2953Q9499J48277
17606C00729A38540a5851M982j8616q2158I453L33922D8638M973J79528n026J6495
17594B44608m1329b33210C73920E0597a53326l6545E9998d44240B78078E3350
17583b04472D38717B00217E879J3098c30851B16897G0737b06990A25185b97446
17572f3848E3338A6704a61191A80516g6436r7955g0018A28946o3743K87562j58439
17561A94326e5855l3970j08937D929i9640a1924o0608C02325n6340p6687F4105
17549a19757A55700c5437B40175a18601B30138b97237f8115I4306A5866b9769
$$ plain form
17627 51743 105690 -324839 92007 -110941 106654 137976 47004 181531 -173817 194556
17616 -194160 -51613 356081 251122 -180249 19601 281742 -140899 62953 152452 300729
17606 300729 138540 -15851 -10869 -29485 -111643 9453 343375 48638 53611 233139 228113 244608
17594 244608 203279 -233210 373920 50597 -153326 -189871 59998 -444240 278078 53350
17583 -204472 438717 200217 5879 18977 -330851 216897 70737 -206990 125185 -297446
17572 -63848 53338 16704 -161191 180516 -76436 -174391 -70018 128946 65203 352765 194326
17561 194326 -55855 -89825 -198762 4929 -99640 -11924 -72532 302325 245985 169298 64105
17549 -119757 155700 -35437 240175 -118601 230138 -297237 -68115 94306 15866 -29769
17538B65574l4287r9873A8408J56888a50958B02509a97949A36272a15946m04194
17528e20140A40809g9640C7480J02753J09975q1580C1090L43299A57947K73864
17518D31811a04034F5376N2626O1620c5712l6700I579K48176D9571b12574D7348
17506a71841k4285B79350E0099c6826p523J3762C24806E8760R9718b13307C63810
17494B31978o9995a23888k6409A04727K743L0652j3730a26519K2843B76036b619
17482B05030A3594K40708l3515a33027B07239a41796B06408b3757j35083D5838
17471D50205N4066e0749j24430m9114C03353e5966j40311P4329C2071R0143C1725
17459C79585j24761A09186n0797M4836i1410a3770n0082A83931n9163b09367A92452
$$ plain form
17538 265574 231287 131414 18408 175296 -150958 202509 -197949 136272 -115946 -520140
17528 -520140 140809 -79640 37480 140233 250208 168628 31090 374389 157947 431811
17518 431811 -104034 65376 118002 179622 -35712 -72412 9579 257755 49571 -212574 47348
17506 -171841 -196126 279350 50099 -36826 -44349 -30587 324806 58760 158478 -213307 363810
17494 231978 161983 -123888 -150297 104727 107470 138122 124392 -126519 -103676 276036 -2619
17482 205030 13594 254302 220787 -133027 207239 -141796 206408 -23757 -158840 45838
17471 450205 504271 -50749 -175179 -224293 303353 -55966 -196277 -121948 32071 122214 31725
17459 379585 254824 109186 58389 103225 -91410 -13770 -63852 183931 124768 -209367 192452
17447E01853J4068A51435a15090C78488c917j26224B49720j01587K49096r8300
17437B98929k147k0946M30359b29024A07866P5363L2944H2851a652D13968A79135
17425B91184J07015o8051A63022J56189e3429F09283j79407j28253M5951j41081
17415B06493i6770F3468a47796M3647c6788j38318e1429D63161G5327R7767b08122
17403f2023G2916j8470a00025B07274a73034A83411m5465j4962K4394M7619J21034
17392C16031n7398h0726k9740H6236p307M58725A21109L45020A49688m9599m3635
17381E6454e258B61578A07049J46786f4828A42503g8904b5154B61507j13067K32802
17370C81242j90043i3736k78217F4595N5634c2419B26502C7081b794B00065b97168
$$ plain form
17447 501853 515921 151435 -115090 378488 -3917 -130141 249720 148133 397229 298929
17437 298929 296782 275836 706195 -229024 107866 183229 216173 82851 -1652 413968 179135
17425 291184 398199 330148 163022 319211 -53429 609283 429876 301623 347574 206493
17415 206493 -96770 63468 -147796 -104149 -36788 -175106 -51429 463161 75327 173094 -208122
17403 -62023 72916 54446 -100025 207274 -173034 183411 137946 122984 147378 194997 316031
17392 316031 258633 -80726 -110466 86236 78929 537654 121109 466129 149688 100089 56454
17381 56454 -5258 261578 107049 253835 -64828 142503 -78904 -25154 261507 148440 381242
17370 381242 191199 -93736 -371953 64595 120229 -32419 226502 37081 -2794 200065 -297168
17358e8575B42960j00824a35506j7973B18199J05546A1705c8665p4917a6170D179
17346B84834N650J7593D856e3753F7370K32957A1710a63328B11942a21038l0394
17335a51432M4874A46809M0040R1431A19688Q8777j7946p8466P261n3991K17209
17324B82532H0090K30330b118j70159A70079M06617B49045b55344A49105K8531
17314A77636F1215f2826B13050J16234J48847j35515A11955D5328b6680C93584
17303a26805B1696Q7541J42687E6904K37062a54270L3142d6847p7824D00604f222
17291C24708j13499K80388C2583N9320L6221E2952j1476K17653a57182C19632
17280G7586J75091J12292a3610H8935L521J83524d7116C27022A31942d4559B48151
$$ plain form
17358 -58575 242960 142136 -135506 -153479 218199 323745 11705 -38665 -113582 -16170 4179
17346 284834 290484 308077 4856 -53753 67370 300327 11710 -163328 211942 -121038 -151432
17335 -151432 -106558 146809 186849 278280 119688 208465 190519 112053 119314 65323 282532
17324 282532 80090 310420 -2118 -172277 170079 576696 249045 -255344 149105 177636
17314 177636 61215 -62826 213050 329284 478131 342616 111955 45328 -26680 393584
17303 -126805 21696 109237 251924 56904 293966 -154270 -121128 -46847 -124671 400604 -6222
17291 324708 211209 491597 32583 91903 128124 52952 41476 259129 -157182 319632
17280 77586 252677 364969 -13610 88935 92456 275980 -47116 327022 131942 -44559 248151
17268h4383B91509c2372D12431a25241C2579L29337j64807k3352J8895d0178C58410
17256G3632K24433A3967K47607E5333a33420B50294j04772J38174j10465L1728
17246B04959E0081J12551N6730M0758c1270B96018A28015R4805A01596R4676k6794
17235A69478F3747c5518F8798K41714G0719P3857N8193p670j4237c8963C56420
17223A1488J12418r604j0666M14016A44516n9672O1229M23508k18111j59500p3245
17212A18725a46260N2312A49007E856g4202A05404M30654k05543I8539J71537
17202B70076J12090e5293A09014J58775j10631P5734a42566A27510H131K01668
17192B09799J01092q3016a5488I2513Q2651Q8088D5495L14728J37464F3823Q2751
$$ plain form
17268 -84383 291509 -32372 412431 -125241 32579 361916 197109 173757 192652 -40178 358410
17256 73632 298065 13967 261574 55333 -133420 250294 145522 283696 173231 204959
17246 204959 50081 162632 219362 260120 -31270 296018 128015 222820 101596 196272 169478
17235 169478 63747 -35518 68798 310512 70719 144576 202769 195099 180862 -38963 356420
17223 11488 123906 114302 103636 517652 144516 84844 146073 569581 351470 191970 118725
17212 118725 -146260 -93948 149007 5856 -74202 105404 536058 330515 98539 270076
17202 270076 382166 -55293 109014 267789 157158 232892 -142566 127510 8131 209799
17192 209799 310891 227875 -15488 92513 175164 263252 45495 360223 497687 63823 146574
17181A46574L63215k31847E8434k689L73026A62696J25028A02553J78869a3729
17170B78588j16940A6139M40388b7151B44460J31479g3537A28696K46794A50838
17159C16264l7448A23403K4155D2365J36686Q9063n6897J8646p0205a93016B39339
17147E48058j36402A78639j4634K27632p3869I5143L3137l8098M9286R644J32318
17136B81430J11167A73263N0517J9521K8056K85537d94C56391D3315K33921N3721
17125C30957E2948J89201M64047B37947M74264k04217j33973j598j3651J90249
17115E49021k48947N9468E2301k0748J5968K83568j19271F1429M40343r5507j93806
17104B12459K69649J27643A98616L51451B08982N63017C04709A38381o4850N15863
$$ plain form
17181 146574 509789 277942 58434 55745 428771 162696 287724 102553 281422 -13729
17170 278588 161648 16139 456527 -27151 244460 375939 -73537 128696 375490 150838
17159 316264 278816 123403 147558 42365 179051 268114 211217 229863 159658 -193016 239339
17147 548058 411656 178639 164005 391637 317768 95143 128280 90182 139468 149112 281430
17136 281430 392597 173263 223780 243301 271357 556894 -494 356391 43315 277236 330957
17125 330957 52948 242149 706196 237947 712211 507994 374021 372423 358772 549021
17115 549021 300074 359542 52301 31553 47521 331089 211818 61429 501772 406265 212459
17104 212459 482108 609751 198616 550067 208982 771999 304709 138381 73531 589394
17094E89394j42236k9953j95140K37082A41612J54378A25789K90562L4733B16388
17083D27238p2529o8095d645C65466A05169M24424J11329p6978k69568J4036K65804
17072E74216B66974J63085k06600l1102K90598K6030n4563J2870N9081j73227
17062C53146A69349a19045C18945g6869C29762j05968J64782K35571k93941L97788
17052G27994A98695L75212k40250J61357K98096l887C52287q5671J64956n4245
17042C77327J55422J62883C45335J62014k05077J11001H5721P58009B40153L23494
17032E63647J0509j48541R9120j85499M98916J09116C04776L04391j16211r3572
17022C99384p271M3127O4808j9685R2447P6783r6668j32984B02025L18479J78317
$$ plain form
17094 589394 447158 417205 222065 459147 141612 295990 125789 416351 451084 216388
17083 427238 354709 286614 -4645 365466 105169 529593 640922 563944 294376 308412 574216
17072 574216 266974 430059 223459 192357 482955 508985 454422 467292 526373 353146
17062 353146 169349 -119045 318945 -76869 329762 223794 388576 624147 330206 727994
17052 727994 198695 573907 333657 495014 793110 789223 352287 266616 431572 377327
17042 377327 532749 695632 345335 507349 302272 413273 85721 843730 240153 563647
17032 563647 574156 425615 524735 339236 838152 947268 304776 609167 492956 399384
17022 399384 392113 435240 500048 480363 572810 649593 552925 419941 202025 520504 698821
17011F98821j43089o5725N11694l79899l09043M35391j00255k68298M6116K14013
17001F39726J47320k52477K23479k2895j37853k21312L53740M1730k81649K65167
16991G54976j10196k15956K72139J7684L3060k80246J51957J95480Q0492k46100
16981F53290k7721J36901l69076K62064M23453m26059L4412J51842K4099L30424
16971A193629m85261R9308J29909r8699j74703O3869k35752J90632J49425l07932
16961E24425O62592k83007J24877J15537k33646l92431L44511m4415K7595k07787
16951F38251L95575k7215k27583O3387K30965l55906O2639J54166M89404n29524
16941H94159k1564M69883l55500L3798O4261L7945l39974K65033j38427J44086
$$ plain form
17011 698821 555732 490007 1001701 621802 312759 748150 647895 379597 425713 639726
17001 639726 787046 534569 758048 735153 597300 375988 729728 771458 489809 754976
16991 754976 644780 428824 700963 718647 751707 471461 623418 818898 899390 653290
16981 653290 625569 762470 393394 655458 1078911 652852 687264 839106 863205 1193629
16971 1193629 708368 807676 937585 838886 664183 728052 492300 682932 832357 524425
16961 524425 1187017 904010 1028887 1144424 910778 518347 862858 818443 846038 638251
16951 638251 1033826 1006611 779028 842415 1073380 717474 780113 934279 1423683 894159
16941 894159 872595 1342478 986978 1020776 1085037 1122982 783008 1048041 909614 1053700
16931A053700J29376L28437m69008L46066o2407J52418j84315K1273j04795J02047
16921A312792r6968K70787o3002k54230j36929M28726Q3451l07455J57266J5149
16911A409587l40001K17906L98917j61293J50860j42011l34411L97356P3027j34064
16901A535873k46083Q9871N71212n75761J94720q3352K35638o6489J29732K01561
16891A986922K1731j95975p335k51716n8946O53573k24522j07455K1239n7586
16881A779930K43400l00298J48552Q1131j05822M55225m37799L88353j84461J89419
16871B257630J9663j08824K82976J17726l36742n5760J972j39067M64802K7370
16861B531746p5548m1481K63436Q8924j22803j51315L08377P0124m3867m6694
$$ plain form
16931 1053700 1183076 1511513 1042505 1388571 1326164 1478582 1294267 1315540 1210745 1312792
16921 1312792 1215824 1486611 1423609 1169379 1032450 1461176 1544627 1237172 1394438 1409587
16911 1409587 1069586 1287492 1686409 1525116 1675976 1533965 1199554 1596910 1669937 1535873
16901 1535873 1289790 1379661 1950873 1375112 1569832 1486480 1722118 1655629 1785361 1986922
16891 1986922 2008653 1812678 1805343 1553627 1494681 2148254 1923732 1816277 1837516 1779930
16881 1779930 2023330 1723032 1871584 1952715 1846893 2302118 1864319 2252672 2068211 2257630
16871 2257630 2277293 2168469 2451445 2569171 2232429 2176669 2178641 2039574 2504376 2531746
16861 2531746 2456198 2414717 2678153 2767077 2644274 2492959 2801336 2871460 2827593 2780899
16851B780899P8247J65554J18495L09881m20195K711L56956J7864k49705J98254
16841C358961n3515K43122j06081j13116M30369m28545M67330k15484M09466n6481
16831C936026l6324M6311K11825K12624p5615N4634L34167J44113j89169M23317
16821E061909j16942J25995N4985O8593K91500J37050k07739N51817k1218O2068
16811F008018o750L13663J88497Q7280L25818O0190J82261J47652J57433M55142
16801G919204R3223L12520J34165m38865M96764P60227l72346L50838L47143L74727
16791I977600L38008K34037Q0161O67866J88622J97263M41058K33777O92542L23820
16781A3374754L9568P78688M94313L11554P23412M30089N49821K14700O36215
$$ plain form
16851 2780899 2859146 3024700 3143195 3453076 3032881 3035592 3392548 3410412 3160707 3358961
16841 3358961 3305446 3548568 3442487 3329371 3759740 3331195 3798525 3583041 3992507 3936026
16831 3936026 3899702 3946013 4157838 4370462 4294847 4349481 4683648 4827761 4638592 5061909
16821 5061909 4944967 5070962 5125947 5194540 5486040 5623090 5415351 5967168 5945950 6008018
16811 6008018 6001268 6314931 6503428 6590708 6916526 6976716 7158977 7306629 7464062 7919204
16801 7919204 8012427 8324947 8459112 8020247 8517011 9277238 8904892 9255730 9602873 9977600
16791 9977600 10315608 10549645 10629806 11297672 11486294 11683557 12124615 12358392 13050934 13374754
16781 13374754 13414322 14193010 14687323 14998877 15722289 16152378 16702199 16916899 17553114
16772A7553114P06877O64479R20426P43440O55380R99163R41419N91986J230800
16763B5007084O68054J516636J264786J191328J095974J565487J237275J957460
16755C5504084J755287J633154J967588K420930J910231K347649K456566K769540
16747E2765029L201147L288275L298781L509252M413512L998913M192012N135858
16739H3802779N406463N466176O021535O510642O948099P218584P703528Q148043
16731A37225849Q013344Q823556Q333060Q625287Q267801P767833P407633N855387
16723B00319750N018245L825240J864183O94347j074971k358823m392472n663414
16715A98232085o195342p642775q399242q038304q787790q424119r135035q088682
$$ plain form
16772 17553114 18259991 18924470 19844896 20588336 21243716 22242879 23184298 23776284 25007084
16763 25007084 25675138 27191774 28456560 29647888 30743862 32309349 33546624 35504084
16755 35504084 37259371 38892525 40860113 43281043 45191274 47538923 49995489 52765029
16747 52765029 55966176 59254451 62553232 66062484 70475996 74474909 78666921 83802779
16739 83802779 89209242 94675418 100696953 107207595 114155694 121374278 129077806 137225849
16731 137225849 145239193 154062749 162395809 171021096 179288897 187056730 194464363 200319750
16723 200319750 205337995 209163235 211027418 211721765 210646794 208287971 203895499 198232085
16715 198232085 192036743 184393968 175994726 167956422 159168632 150744513 141609478 133520796
16707A33520796q320433p614271p134040p040806o785031n946153n364869n462769
16699G9852424m689757m586938m052391l874137l464211l327597k898498k808561
16691E0150334l309565k373409k325259j873465k020886j791323k018578j302996
16683C3134853j716795j069006j621352r97743j174235j284815r86969j037555
16675B3246383j160070r15710o46832p79695j025503k17968p96067q93812m85791
16666A6324935n60993l02123q76877j7208o93258l02416n30881l81464l14350
16657A2345365o74274j30337l01056l07983l37871o06132j89680m69080q7075
16648I241877L114m63875j04113n85870J74976k86037k69817L6351m07255j87732
$$ plain form
16707 133520796 125200363 117586092 110452052 103411246 96626215 90680062 85315193 79852424
16699 79852424 75162667 70575729 66523338 62649201 59184990 55857393 52958895 50150334
16691 50150334 46840769 44467360 42142101 40268636 38247750 36456427 34437849 33134853
16683 33134853 31418058 30349052 28727700 27729957 26555722 25270907 24283938 23246383
16675 23246383 22086313 21170603 20523771 19744076 18718573 18500605 17704538 16810726 16324935
16666 16324935 15763942 15461819 14584942 14567734 13874476 13572060 13041179 12659715 12345365
16657 12345365 11671091 11540754 11239698 10931715 10593844 9987712 9798032 9328952 9241877
16648 9241877 9244991 8781116 8677003 8091133 8266109 7980072 7710255 7746606 7339351 7151619
16638G151619O9924q02994K20881j10163k12190j45995k98138K03885k66119k57466
16628E553244j80559N543n14950M21637m90425K85282l08423k03690j28618L64400
16618D803441k97003n6909m80959K44175J09155K27098n37235k61543O3830m9738
16608C764312k7275J51278k74093K2042n403j60531n0316J18899j16540k01650
16598C220723k06938K2865k36888J11003m9026r5382n2305M1691o0933K63244
16588B958054k16689k75146k5170K16427l71965P6227k26201M32955M4711l56068
16578B257135J8636j8406j78837O9632k71075J02080J30525k50597L21370l12906
16568A867557K56474l44666J68176j84166K3611K3045K02635k85454j88212Q6614
$$ plain form
16638 7151619 7221543 6418549 6639430 6529267 6317077 6171082 5872944 6076829 5810710 5553244
16628 5553244 5372685 5378228 4863278 5284915 4794490 5079772 4771349 4567659 4439041 4803441
16618 4803441 4506438 4449529 3968570 4212745 4321900 4548998 4011763 3750220 3814050 3764312
16608 3764312 3737037 3888315 3614222 3636264 3630861 3470330 3420014 3538913 3422373 3220723
16598 3220723 3013785 3036650 2799762 2910765 2861739 2766357 2714052 2755743 2694810 2958054
16588 2958054 2741365 2466219 2441049 2657476 2285511 2361738 2135537 2568492 2613203 2257135
16578 2257135 2275771 2257365 2078528 2148160 1877085 1979165 2109690 1859093 2180463 1867557
16568 1867557 2124031 1779365 1947541 1763375 1786986 1810031 2012666 1727212 1539000 1625614
16558A625614j54781J6053L29620k98500L1480J22335m55945J94009J57694j36678
16548A430901J50860k03120j43514P2828M86696o44299J32330K057J44717m23517
16538A005939M29791o1565K03296l11803o7414P1275L47237o54955N12296k52432
16528A221665k83682K17658r4060j62924K85470q2198J44640j88868j48224K02499
16518A111976R5687j90093j42683L43181l02507K26439l59241J1008M35397F09849
16507H57044n0410L18383k16462j82607K23118l9535k94649O90401m24973p6831
16497H03479R3240l82640J38180Q0930l0429J4262K01428R4989m54241K15832
16487G75030j00282J0115n7629J059k7346J90880J4262l79979J29774M08371l97692
$$ plain form
16558 1625614 1470833 1486886 1816506 1518006 1549486 1671821 1215876 1409885 1567579 1430901
16548 1430901 1581761 1378641 1235127 1307955 1794651 1150352 1282682 1284739 1429456 1005939
16538 1005939 1435730 1374165 1577461 1265658 1198244 1269519 1616756 961801 1474097 1221665
16528 1221665 937983 1155641 1061581 898657 1184127 1101929 1246569 1057701 909477 1111976
16518 1111976 1207663 1017570 874887 1218068 915561 1142000 782759 793767 1229164 609849
16507 857044 806634 1125017 908555 725948 949066 909531 614882 1305283 880310 803479
16497 803479 896719 514079 652259 733189 702760 717022 918450 1013439 559198 775030
16487 775030 674748 684863 627234 628293 600947 791827 806089 426110 555884 964255 566563
16476E66563R86K83317C87462L98623k40038K53565j02810n5067M24453l59365
16466G06823J66278j52938B09694N03187l16604L13399C38844J83895J86086M1109
16456G49934J28391C36009K60471j60809J67546n7940R5077j46211K3845J47759
16446F65747K87182m58495r005J73890j8295j27551M5907r1531n2518J25961j58482
16435C82810J50787j32747K28550C04705N17177k02879A91940M03212M6113k88399
16425C52866J65328Q9215j4003j87904K56261R2568l04086J72130A46259L16077
16415D62336B19229R3027K9721K52039B67388J41738p6193J16991k0516J80093
16405F09501L8965k78994j00069K42609r9161j70016j08941N48070j42947j01006
$$ plain form
16476 566563 567549 850866 387462 786085 546047 799612 696802 641735 1066188 706823
16466 706823 873101 720163 209694 712881 396277 709676 338844 522739 708825 749934
16456 749934 878325 336009 596480 435671 603217 545277 640354 494143 517988 665747
16446 665747 952929 494434 485429 659319 641024 513473 559380 467849 415331 541292 382810
16435 382810 533597 400850 629400 304705 821882 619003 191940 595152 641265 352866
16425 352866 518194 607409 593406 405502 661763 754331 450245 622375 146259 462336
16415 462336 219229 312256 341977 594016 267388 409126 332933 449924 429408 609501
16405 609501 648466 369472 269403 512012 412851 242835 133894 681964 539017 438011
16395D38011J80501O2055p4363j70724J19622j61305J28153A43149J30612K95507
16385E69268B38550N38359j66970B60784K6154J73273l399J94353l20946j01312
16375B28907K65506J11310k96938J43456K01296B90076m7739K7920J52906K5238
16365D48401J46648n9293n809k06237A02836M0093K55516A55708J39021q2539
16355B12190L23687A24228K29866J26258j18327k322J50975A30778J06510p3052
16345A64236O449L96504j37012J07710A18886L9073J07957M0870N37774l08549
16335E36011k26927D7593M16982j51047N4865A05410K51465J12174j31428G0946
16324D93666j7653j64128B9180L65813j31688k2686q2840E9832J78192K12973
$$ plain form
16395 438011 618512 680567 606204 435480 555102 393797 521950 143149 273761 569268
16385 569268 238550 776909 609939 260784 286938 460211 456812 651165 330219 228907
16375 228907 494413 605723 308785 452241 653537 290076 242337 270257 423163 448401
16365 448401 595049 535756 529947 323710 102836 142929 398445 155708 294729 212190
16355 212190 535877 124228 354094 480352 362025 359703 510678 130778 237288 164236
16345 164236 170685 567189 430177 537887 118886 157959 265916 306786 844560 536011
16335 536011 309084 47593 464575 313528 368393 105410 356875 469049 337621 70946
16324 493666 476013 311885 29180 394993 263305 240619 157779 59832 238024 450997
16314D50997j69073j09808C9451J52299K11096j0187J38793A11734Q2403A2943
16303B6517J93292K09056m6663F0939j6789K62688j25850O4800a8509B847L46991
16292C49838J64586g9892D86973G2405R478B6366M19969k17347J62508A66263
16281B93518G7568N12774A78457K07991M7371n5200K1865M2709a35027D5884O470
16270E2354R9667P1074p8435K02581j11797K7368j17582M65537B07995j3644J53893
16259C48244d4316B03482J3856n9516G3231L23979D1363K88498j8083I3071l5627
16248E7444K54715k9600A38151Q5662o2667L1440M9896M1082K10262k21762A5178
16236C05935J192E4736J58578E2499K26513K90950B36573J5650I9248R854K28477
$$ plain form
16314 450997 281924 172116 39451 191750 402846 392659 531452 111734 194137 12943
16303 26517 219809 428865 382202 60939 44150 306838 180988 245788 -18509 2847 349838
16292 349838 514424 -79892 486973 72405 81883 26366 446335 228988 391496 166263
16281 293518 77568 590342 178457 386448 433819 378619 400484 443193 -135027 45884 52354
16270 52354 152021 223095 144660 347241 235444 262812 145230 610767 207995 194351 348244
16259 348244 -44316 203482 217338 157822 73231 397210 41363 329861 311778 93071 57444
16248 57444 312159 282559 138151 223813 161146 192586 242482 283564 493826 272064 15178
16236 305935 307127 54736 213314 52499 279012 569962 236573 252223 99248 109102 337579
16225C37579A22016K9562C1960M35298k18307q8862k1091g3392A61313a07566
16214D13999k00636H8445A2431P2429a46808B12370l6027a91977B03998F5941
16203B14329m8587C8509K69696c54596A98686J63870E0647b7957B9034N0408h9462
16191A26021b19932E8454R9844k4495J64970A06288B294J92470i6034B24954G8297
16179A52376l521E6763c0529n2067A99786j8231K28827A01980K2016h3435I877
16167E5897M75962A37284L94883i0652A16930K62989f5707B5488K67839B3413
16156e1241C08998l1241m1289A4605a05693C80892l6343A39670J08333D0740a46429
16144I2925A8231p341a26891B27828D426J16279f0587B35786r8133e5325e518
$$ plain form
16225 337579 122016 151578 31960 467258 248951 160089 138998 -73392 161313 -107566
16214 413999 213363 88445 12431 84860 -146808 212370 176343 -191977 203998 65941
16203 214329 165742 38509 308205 -354596 198686 362556 50647 -27957 29034 79442 -89462
16191 126021 -219932 58454 158298 133803 298773 106288 2294 194764 -96034 224954 78297
16179 152376 148855 56763 -30529 -82596 199786 181555 410382 101980 123996 -83435 9877
16167 55897 531859 137284 532167 -90652 116930 379919 -65707 25488 293327 23413
16156 -51241 308998 277757 236468 14605 -105693 380892 344549 139670 248003 40740 -146429
16144 92925 18231 10890 -126891 227828 4426 120705 -60587 235786 137653 -55325 -5518
16132B00064D9082Q9233a70959e1965A0186c7800k2718C18148c60375C32157n2291
16121B79866i8266k1275B88321d4998B26667A7197K83988A2980O3789h8601F0982
16109I0588d8649E1759R6541j8896N3950m4200k6890K17618j37911G3861j2629
16098F1232A431J33225d95141f5002A37933b68280a03172b1973j6534F260a60798
16086A67976b27971R858a04545j29487J7954g6847q3835m2827A40671B565d0459
16074B9622H657J15973d67A40989E5978N7446J5109L11860a99615f0513C4273
16062F6746e5515j77801Q9964B1776J52218D1358J11023a68155c8059A00789J51504
16051B52293f6253j94088F4219h5600C6785Q970c93565a73859p6768D3683J57716
$$ plain form
16132 200064 49082 138315 -170959 -51965 10186 -37800 -60518 318148 -360375 332157 279866
16121 279866 -98266 -119541 288321 -44998 226667 17197 301185 12980 76769 -88601 60982
16109 90588 -48649 51759 148300 129404 183354 139154 112264 329882 191971 73861 61232
16098 61232 1431 134656 -495141 -65002 137933 -268280 -103172 -21973 -38507 6260 -160798
16086 167976 -227971 -218113 -104545 -234032 -216078 -76847 -160682 -203509 140671 2565 -40459
16074 29622 8657 124630 -467 140989 55978 113424 128533 440393 -199615 -60513 34273
16062 66746 -55515 -233316 -143352 21776 173994 41358 152381 -168155 -38059 100789 252293
16051 252293 -66253 -260341 64219 -85600 36785 45755 -393565 -173859 -250627 43683 201399
16040B01399k7737a08895N3037a9465j49174l157f2885j10019M3654F6866J81812
16029B48678D6666d8880C34710e0502j71793n270A53958A0449N3441a8879E4724
16017d3516D2979J47536b77764d9108m23779A56393K1706a23287F2972c78833
16006b76287A59659e2495C88763e7489A49462B1354M41674A50745a06691A75356
15995A25902i7525A0097g3238j49574Q9416A01258f3358q8224G0427i0677C180
15983F2954c07954B6187L5890J06108C1488P9102J3542a01815C6624A227J8468
15972A9695Q4052l5213L05651C9059P6015g466H3346a45280A3939k098J79719
15961A91560e7758n825P222A18054k0964b19666C24493H4347j2060a4992B3203
$$ plain form
16040 201399 173662 -108895 -55858 -19465 -168639 -171796 -62885 -172904 -129250 66866 248678
16029 248678 46666 -48880 334710 -50502 -222295 -227565 153958 10449 63890 -18879 54724
16017 -43516 42979 190515 -277764 -49108 -472887 156393 178099 -123287 62972 -378833
16006 -276287 159659 -52495 388763 -57489 149462 21354 463028 150745 -106691 175356
15995 125902 -97525 10097 -73238 -222812 -133396 101258 -63358 -151582 70427 -90677 3180
15983 62954 -307954 26187 62077 168185 31488 110590 124132 -101815 36624 1227 19695
15972 19695 103747 68534 374185 39059 115074 -7466 83346 -145280 13939 11841 191560
15961 191560 -57758 -63583 -56361 118054 97090 -219666 324493 84347 72287 -14992 23203
15949b25443a9615k01622j5190j7456B06622c44457J14985P0559B79073B3528
15938B73992I3556B6473h2039q8k27768a24640C2035g6146k7519j93168J4295
15927b82538A45852b34509i8674M2383J8376B51421b39602Q2455A37164A5251
15916G1191a82276B60833A21981c77340f330j60512F2255a69325l6192C23794
15905A8662b33154f3161l5936I8465b5071A20566g0856E5479A1387O9244B4898
15893A3096b01598k45756q0870a53934A06492a4800C15410p9075b36616j97459
15883d34075E8635K0230a20441A55578C400a45342B1924c13765N2119C7418e1466
15871a26070N2667l2537A29628O343e8634K629j84305h5137n9532L383k68218
$$ plain form
15949 -225443 -19615 -221237 -236427 -253883 206622 -344457 -229472 -158913 279073 23528
15938 273992 93556 26473 -82039 -82127 -309895 -124640 32035 -76146 -103665 -296833 -282538
15927 -282538 145852 -234509 -98674 -56291 -37915 251421 -239602 -157147 137164 15251
15916 71191 -182276 260833 121981 -377340 -6330 -166842 62255 -169325 -205517 323794
15905 18662 -233154 -63161 -99097 98465 -25071 120566 -70856 55479 11387 80631 24898
15893 13096 -201598 -447354 -528224 -153934 106492 -14800 315410 236335 -236616 -434075
15883 -434075 58635 78865 -120441 155578 3400 -145342 21924 -313765 -261646 37418 -51466
15871 -126070 -73403 -105940 129628 135971 -58634 -56005 -240310 -85137 -144669 -141286 -409504
15860d09504I7396P3485a04404n919C9505h3089e523j57213A5773b56965j8267
15849b75232B10713b05056k01821D4183c21572j6893G2694ej10679j37495B50592
15837I346a72660O4822o8914B5549J87961k0923a63437A8680J40759B6564a21403
15825a38976G0967a5572C80008a03878o5751F150b59251A64848D5046a4594l19411
15814c34005B5522a42703c0166I1836C5504g2416A05899a16112j32404A0909N4673
15803F5582f0976B27901j10399A290J86073c4936J6222A31481b46114B7684b0399
15791a16388k3595j14200j06238a15227B23777a69695I908P4229h2235j02350
15781a84585l51310b66117J31950j18903a849j73407O2701D219P9753l886i6038
$$ plain form
15860 -409504 97396 170881 -104404 -110323 39505 -83089 -5523 -162736 15773 -256965 -275232
15849 -275232 210713 -205056 -406877 44183 -321572 -338465 72694 -5 -110684 -248179 250592
15837 9346 -172660 -107838 -176752 25549 213510 192587 -163437 18680 159439 26564 -121403
15825 -138976 70967 -15572 380008 -103878 -169629 6150 -259251 164848 45046 -14594 -334005
15814 -334005 25522 -142703 -30166 91836 35504 -72416 105899 -116112 -248516 10909 65582
15803 65582 -60976 227901 117502 1290 187363 -34936 -18714 131481 -246114 27684 -20399
15791 -116388 -139983 -254183 -360421 -115227 223777 -169695 9908 84137 -82235 -184585
15781 -184585 -535895 -266117 -134167 -253070 -1849 -175256 -112555 4219 83972 80086 -96038
15769a72513k85g365l31359h4952H7795a70145A01305C8014b66022K9611A39051
15757C47063c4509j33305A8413R961b25328E5435N9350C5563J7110a2955I4361
15745a45885A03544a94012j12047j27071B3107K54958B7573a25408c4539B16408
15734A81274b14150k1755o6663F1936J98666b26521f4576o5700G5579R525q345
15723G6759b20778I7485K45349j29467a3238q5158j16452h2330E1023c3399m8250
15712h1649c9630l53145c6524k4302A2366J06401d13284a49946k04593J72011
15702a82528j08572B56475a13076M4960A77996a5091A1640b95053F4482i2213
15691B24936n5878p0361b60312k5434e8282o3665J711A61690d18535B52834p8800
$$ plain form
15769 -172513 -172798 -7365 -338724 -84952 87795 -170145 101305 38014 -266022 -236411 139051
15757 347063 -34509 -167814 18413 28374 -225328 55435 114785 35563 52673 -12955 94361
15745 -145885 103544 -194012 -306059 -433130 23107 278065 27573 -125408 -34539 216408
15734 181274 -214150 -235905 -302568 61936 260602 -226521 -64576 -130276 75579 85104 76759
15723 76759 -220778 97485 342834 213367 -13238 -98396 -214848 -82330 51023 -33399 -81649
15712 -81649 -39630 -392775 -36524 -60826 12366 118767 -413284 -149946 -354539 -182528
15702 -182528 -291100 256475 -113076 -68116 177996 -15091 11640 -295053 64482 -92213
15691 224936 169058 98697 -260312 -285746 -58282 -121947 -120236 161690 -418535 252834 174034
15680A74034G0279b0119a589j60593k91024a61533A1466Q7515a75301d2193j3766
15669e5959n2027B26554c3475H8069K05440b79867A21196e4717G9916a0016A27463
15657a88993o784M8263C1731d25868J35114J13409D2319P0350F919J03684C9068
15645C87K42420a5181C716g1397K661j20717L7325f8394A33766Q8415B1346a90072
15632b5215k89141H1814a00713B6518a96098a8201A459d74068i8631j38193h7479
15620b72336A84063m8274h0547j93170a07175A07355Q4491b7528A6496a1976k45289
15609b57265e4062n7737b5960k32293C11689A36302b86039J36681n7459d1856
15598a23847a6072p5936k10899a20221c2881j41851d3627A69253C6278b37112
$$ plain form
15680 174034 70279 -20119 -1589 -162182 -453206 -161533 11466 98981 -175301 -42193 -55959
15669 -55959 -107986 226554 -33475 88069 293509 -279867 121196 -54717 79916 -10016 127463
15657 -188993 -195777 -147514 31731 -425868 -290754 -177345 42319 112669 6919 110603 39068
15645 387 242807 -15181 3716 -71397 -68736 -189453 -152128 -68394 133766 222181 21346 -190072
15632 -25215 -314356 81814 -100713 26518 -196098 -18201 1459 -474068 -98631 -236824 -87479
15620 -272336 184063 135789 -80547 -273717 -107175 107355 191846 -27528 16496 -11976 -257265
15609 -257265 -54062 -111799 -25960 -258253 311689 136302 -286039 -149358 -206817 -41856
15598 -123847 -16072 -92008 -302907 -120221 -32881 -174732 -43627 169253 36278 -237112
15587C84467j11341G9992J05832l5393b97213F9690A9068d1499n6607I1565a90914
15575A72293a39730H511K8788K6674a64020O2233L289A6535h455l5561B47307
15563h8104K6543C4954b5381j63368c7711A8055K23351a15514D18033f1428G5039
15551A17456b10991g467C3192c02545A8608f1106n8616b3231A41651A9739h1401
15539a1920A16659b32958F1039a87152C68770a42456J4153C75978A51094b2645
15528i6052B21148f490k48583c1276D877b15188N8048j58040A80147a12940A18824
15516a01613B91641d12432B58744o7493C9748l513c06879J38676d8779C60120
15505b77749b3199j77559A6481p832a7039j1906D3858a06j58554A24828a5942
$$ plain form
15587 384467 273126 79992 185824 150431 -297213 69690 19068 -41499 -98106 91565 -190914
15575 172293 -139730 8511 37299 63973 -164020 -101787 -98498 16535 -8455 -44016 247307
15563 -88104 -61561 34954 -25381 -188749 -37711 18055 241406 -115514 418033 -61428 75039
15551 117456 -210991 -7467 33192 -302545 18608 -61106 -119722 -23231 141651 19739 -81401
15539 -11920 116659 -232958 61039 -187152 368770 -142456 -128303 375978 151094 -22645
15528 -96052 221148 -6490 -255073 -31276 4877 -215188 -157140 -315180 180147 -112940 118824
15516 -101613 291641 -412432 258744 191251 39748 36235 -306879 -168203 -48779 360120
15505 -277749 -23199 -200758 16481 8649 -17039 -28945 43858 -106 -158660 124828 -15942
15493a37872f4728B82783c2188B94377A20375c19494J50789k75625J23488g5009
15482A85844m2385d9206n9591E3002j5010b7965D9936a49920G1036L71981j15383
15471C27634a16470j26856A07810d9599j66836P3912l3916B02490j3134E1315
15460C11879j2196F657L65665j04874C0733e0223C55859b90490f6064E5744J5799
15449G1543A2534g6611C12062a18104E5704J65551G8046a23488n4027A14063A0473
15437A23829a54051A05274D2266h2811C29389b44593c0466E2492e7873j35551
15427a93424g2759F2906c64461E1967c03241b4074B16240b12603A00317b17298
15416C04821A00008l54a32598B03968F1125a76521A30070a59951d5225m0380j8378
$$ plain form
15493 -137872 -64728 282783 -32188 294377 120375 -319494 -168705 -444330 -320842 -75009
15482 185844 143459 -49206 -108797 53002 37992 -27965 49936 -149920 71036 443017 327634
15471 327634 -116470 -243326 107810 -49599 -216435 -142523 -176439 202490 189356 51315
15460 311879 299683 6657 372322 267448 30733 -50223 355859 -290490 -66064 55744 71543
15449 71543 12534 -76611 312062 -118104 55704 221255 78046 -123488 -177515 114063 10473
15437 123829 -154051 105274 42266 -82811 329389 -244593 -30466 52492 -57873 -193424
15427 -193424 -72759 62906 -364461 51967 -303241 -24074 216240 -212603 100317 -217298
15416 304821 100008 99654 -132598 203968 61125 -176521 130070 -159951 -45225 -85605 -103983
15405a03983J8248b6597A78324C8064a38845G6171d00830a88937B59729j6996
15395B42733A9599J49518J79733a51930A90544b9131k8227b7742q1015j12570
15385b21327n8765F784b29337a1642H5635a07464A7478a44277C00558r6286b01110
15373a35024a6637q8585A30730J23062E9268k2196J91996A0877A290J25755a61342
15361B4839f5349A81911d02906F2908a01750p8732l3483N8836d2847C5826c15441
15349a64214D0905a59359m1358C51723a01045k07601a36964d6756D60379m3855
15339D16524A50482a26344p4336A29766b09798G0449N4392C8021Q583e8429A10796
15327i4699A08035e539j41381N0361q629B87905b18202e1575o2064I1021k9209
$$ plain form
15405 -103983 -85735 -26597 178324 38064 -138845 76171 -400830 -188937 259729 242733
15395 242733 19599 169117 348850 -151930 190544 -29131 -57358 -27742 -108757 -221327
15385 -221327 -280092 6784 -229337 -11642 85635 -107464 17478 -144277 300558 204272 -201110
15373 -135024 -16637 -105222 130730 253792 59268 37072 229068 10877 1290 127045 -161342
15361 24839 -65349 181911 -402906 62908 -101750 -180482 -213965 -155129 -42847 35826 -315441
15349 -164214 40905 -159359 -200717 351723 -101045 -308646 -136964 -46756 460379 416524
15339 416524 150482 -126344 -200680 129766 -209798 70449 124841 38021 46604 -58429 110796
15327 -94699 108035 -5539 -146920 -96559 -105188 287905 -218202 -51575 -113639 91021 61812
15316F1812b04037E0774a04555A05423l3896b14826p6558H8942J35806d9301D39571
15304F220d2645A34025J31328b4248G8175e2613b218A10297i168j02826A02256
15292b6536A14295J38673c654A28793c9719B22569H3366J66065a58497G2623J1588
15281H4211b7108H6441k3589a13042B54311F2471J11396p6620D7452c00636C8813
15269C02447b5731B79575j00298a5284B26380G5199Q5803e7811C09795G2504c12521
15257a2034D14053d4977j3087B78300c6267A8777i6477B06236D9124J30666b3311
15245D90369a91367C5821J86026j545L1379A19678D947f6026N936l6535G2107
15233B41074N6861B9268K140a41326Q389A62677G5134K4775M01388F4751I637
$$ plain form
15316 61812 -204037 50774 -104555 105423 71527 -214826 -291384 88942 224748 -49301 439571
15304 6220 -42645 134025 265353 -24248 78175 -52613 -2218 110297 -9168 -111994 102256
15292 -26536 114295 252968 -3654 128793 -39719 222569 83366 249431 -158497 72623 84211
15281 84211 -27108 86441 62852 -113042 254311 62471 173867 97247 47452 -300636 38813
15269 302447 -25731 279575 179277 -15284 226380 75199 161002 -57811 309795 72504 -312521
15257 -12034 414053 -44977 -58064 278300 -36267 18777 -96477 206236 49124 179790 -23311
15245 490369 -191367 35821 221847 220302 251681 119678 4947 -66026 -60090 -96625 72107
15233 241074 297935 29268 31408 -141326 -132937 162677 75134 99909 501297 64751 9637
15221B8442b104l5417a1138j4036A44248b14333A40001E2351K24793C7734O7070
15210A04804L83124a05997A40016a27973j1550b5560F3185D449J60070a91384
15199A22188a57928A0807b50906B24787G8350K54348c2135R946A13910i4175D9049
15187h9134D6786J72631k4424a23627A45349p2390R713i4823I132C078K50138
15176B53216c1640r4187c665n0807C1041b1274k02298D769J73290b44632B46962
15164a86500g9386A49492J57125F2504L47703b8083l03253h9372B43720f2630
15153a3008m6901B21224E8617b09287R5481A4808g9359n0251A10461Q9047a83348
15141D8226J7585b25574C36571A8212Q7125m2409M4773K34513F3402J64556l6688
$$ plain form
15221 28442 -2104 -37521 -11138 -25174 144248 -214333 140001 52351 277144 37734 104804
15210 104804 487928 -105997 140016 -127973 -139523 -25560 63185 4449 164519 -191384
15199 122188 -157928 10807 -250906 224787 78350 332698 -32135 -22189 113910 -94175 49049
15187 -89134 46786 219417 194993 -123627 145349 72959 82672 -94823 9132 3078 253216
15176 253216 -31640 -125827 -3665 -54472 31041 -21274 -223572 4769 178059 -244632 246962
15164 -186500 -79386 149492 306617 62504 410207 -28083 -331336 -89372 243720 -62630
15153 -13008 -59909 221224 58617 -209287 -113806 14808 -79359 -129610 110461 199508 -183348
15141 48226 65811 -225574 336571 18212 105337 62928 107701 342214 63402 227958 191270
15130A91270h130j5772H4023A5822J08147N7593f9615D5686a23855A49969L6430
15119A86399A6696L5090b3305A38596K2563O660l828g4484H4065R1848b9975j95967
15107b25942D34670h2283B45492K38645C6984K28332m564a30403B14242R3277
15097C07519G0890B4132K11400K13267g4630G7718K11204a12883A37347J18172
15087B55519r1312R6834l1646K5952L04488F4489C299J11381J27508A13997K74773
15076C88770d7917C52727L31025i6421E5503L9705K6773J43408G6457J31046p6609
15065A30894L7747J5824N466G1959R0207J58267h5649b9271m662A95296a20900
15053A03650K6622J50604i318A4538M30900j74144c05057A65995a84338C05601
$$ plain form
15130 191270 -8130 -23902 84023 15822 123969 181562 -69615 45686 -123855 149969 186399
15119 186399 16696 51786 -23305 138596 161159 167819 163991 -74484 84065 175913 -29975 -225942
15107 -225942 434670 -82283 245492 484137 36984 265316 260752 -130403 214242 307519
15097 307519 70890 24132 235532 448799 -74630 77718 288922 -112883 137347 255519
15087 255519 164207 261041 229395 255347 559835 64489 3299 114680 242188 113997 388770
15076 388770 -47917 352727 683752 -96421 55503 95208 121981 265389 76457 207503 130894
15065 130894 168641 184465 189931 71959 162166 320433 -85649 -29271 -33933 195296 -120900
15053 103650 130272 280876 -9318 14538 445438 271294 -305057 165995 -184338 305601
15042D76723A08997K63301j19220a01108A42180N9711D799K54554r4712K6749
15032A91390J95a20114C465J76198H2044J91552j8305J46713k0777k178K1839
15021D00888j73007E0359J16209d4581o1598C53949j57669J07950b2951B49878
15010a3223j8075A88421J62103e3247C56360l9878o8511p4218J2662J90747A44564
14998A78764D6694h4143C60419j34859m7691a60877A55616K14079A67958R3649
14988B61607I0436J41409N5885j15234K11934Q2197A64761K52533j69210K86471
14978E34555g3894A00570m4588b9811D92888D2163J45800P0564H3466k8846J06410
14967A61030K5676Q785a8317B21331J46993E6900L37452O5815E8171L10478b4209
$$ plain form
15042 476723 108997 372298 253078 -101108 142180 201891 4799 259353 164641 191390
15032 191390 191585 -120114 3465 179663 82044 273596 255291 402004 381227 379049 400888
15021 400888 227881 50359 166568 -44581 -106179 353949 196280 304230 -22951 249878
15010 -13223 -31298 188421 350524 -53247 356360 316482 247971 173753 186415 377162 144564
14998 178764 46694 -84143 360419 225560 177869 -160877 155616 369695 167958 261607
14988 261607 90436 231845 287730 172496 384430 466627 164761 417294 248084 534555
14978 534555 -73894 100570 55982 -29811 492888 42163 187963 258527 83466 54620 161030
14967 161030 186706 195491 -18317 221331 368324 56900 394352 460167 58171 368649 -24209
14955C00147P8245a08097D00698G8193J63841o3178C1378L87027j10380M8858
14945C56883j68594N4464o7852K55580j3293B4233L7336K95622p1401K01661A99211
14933F2394A2981L85257A23568l232N2613B1324M23122G3314K93496j31155K6102
14922B61757J06239r6049K3152o1430o6861K45552n8323A58225J27415K19142
14912E04782k28790M496k3785J57485b51713B49815M0660M5616A58344L94945
14902E53289k13104A00346J82852H4113J90435j17721j8159Q9990K44207n9769
14892D13096A00745D4651J90566K2059L66942B41144O7337m5139j07198m2763
14882A13381K7916M5917j5844M92330A39113L57433j84231k2572j09485O6256
$$ plain form
14955 300147 378392 -108097 400698 78193 242034 178856 31378 418405 308025 356883
14945 356883 188289 242753 174901 430481 417188 24233 61569 357191 285790 487451 199211
14933 62394 12981 398238 123568 120336 172949 21324 444446 73314 366810 235655 261757
14922 261757 367996 271947 295099 233669 166808 412360 354037 158225 285640 504782
14912 504782 275992 280488 256703 414188 -251713 249815 290475 336091 158344 553289
14902 553289 340185 100346 283198 84113 274548 156827 138668 228658 472865 413096
14892 413096 100745 44651 235217 257276 624218 241144 308481 263342 156144 113381
14882 113381 141297 187214 171370 663700 139113 496546 312315 289743 180258 246514
14872B46514k2228L3993R3206n813A07353K01122K22010H6099L30653r8565A02070
14860D26054p4093p7885J95986J32765k67854L74776B60091o2931L61049A92102
14849D17787J90650A94455J42319J89327k04244M5036l0900L33026l01489m6850
14839C20680J12129A89234L44757O1504k86540J46984K18772q1749k36056j63206
14829A93700O9192k3929K22975P2373j16985o8400J74545L35557l14377N8907
14819F03558j73720L34780l20221k7560j46188M45132m8413A73973L4236K42351
14809D50560Q3450k53202Q8796J29042Q3873J19915C34129L70562k70533J01356
14799E35514j50856j12732M1240j48753J21685M24488k37384K73119m566B50575
$$ plain form
14872 246514 224286 258279 351485 345672 107353 308475 530485 86099 416752 318187 102070
14860 426054 351961 274076 470062 602827 334973 709749 260091 197160 558209 192102
14849 417787 608437 194455 336774 526101 321857 366893 335993 669019 367530 320680
14839 320680 432809 189234 533991 595495 308955 455939 674711 592962 356906 193700
14829 193700 262892 238963 461938 534311 417326 348926 523471 859028 544651 603558
14819 603558 429838 764618 444397 416837 270649 715781 667368 173973 208209 450560
14809 450560 534010 280808 369604 498646 582519 702434 334129 704691 434158 535514
14799 535514 384658 271926 313166 164413 286098 710586 473202 746321 741755 250575
14788E64203j41963O4582j12088K93115o4806j35562l088J37236j15824L30774
14778H16579k13584k78906k777L41737k59091j62907L63654J29179m8437j25882
14768E59565J82911k44321M03130J64808n07905j61487J31157J12593r8031R3122
14758F35542A25372K98042N03502C32848L58366K06250k16810n5506k14701M21889
14748H32336o38j68731j56973R8215n6307Q1624J04975m8011j45207J02269J85661
14737H29213o6942j93247J65399C32863N05540k25058K13733N3983p8266J075
14727H03870q3697L12198P9942j85251k25950n4584Q4519K85169m38958L2345
14717F09603K48289j8574J26629j76750j79223P5158q9480L10223k54908K47189
$$ plain form
14788 564203 422240 486822 374734 667849 603043 467481 464393 601629 485805 816579
14778 816579 602995 324089 321312 663049 403958 241051 604705 733884 685447 559565
14768 559565 742476 498155 901285 1066093 558188 396701 527858 640451 542420 635542
14758 635542 125372 423414 926916 332848 691214 897464 680654 625148 410447 832336
14748 832336 831698 662967 505994 604209 547902 629526 734501 686490 541283 643552 829213
14737 829213 762271 569024 734423 332863 838403 613345 827078 881061 802795 803870
14727 803870 720173 1032371 1112313 927062 701112 646528 731047 1016216 577258 609603
14717 609603 857892 839318 965947 789197 609974 685132 595652 905875 650967 898156
14707H98156k79900K84596k25878j29853N38099m78658K13831j84705O03649m39713
14697G99624o3192k6012J54209J38202l62773m156N13301j61763N6551M5283l21133
14686G68141R9108J75850l52601M00892k66273Q4240M10329l13529j77907J82092
14676A010342p0124j6588M1312k32169n4377L75025k3471J16844J12454l79999
14666H79249J70991J32008j71256l39485L45828j83492M48884k48045J58643j85608
14656A007717L33114o5430k35447J91357r0812q4528J46380j68905k1220J73981
14646A186207J67312j70591k67574M46531k43451P4662j48211M33519n74429L63864
14636A267839J71307l06838K54147j11956K25898m51797N4756J62826k24926J4991
$$ plain form
14707 898156 618256 902852 676974 547121 1085220 606562 820393 635688 1239337 799624
14697 799624 736432 710420 864629 1002831 640058 635902 1149203 987440 1043991 1089274 768141
14686 768141 867249 1043099 690498 1091390 825117 909357 1319686 1006157 828250 1010342
14676 1010342 940218 923630 964942 732773 678396 1053421 1029950 1146794 1259248 879249
14666 879249 1050240 1182248 1010992 671507 1017335 833843 1282727 1034682 1193325 1007717
14656 1007717 1340831 1275401 1039954 1231311 1140499 1055971 1202351 1033446 1012226 1186207
14646 1186207 1353519 1182928 915354 1361885 1118434 1193096 1044885 1478404 903975 1267839
14636 1267839 1439146 1132308 1386455 1274499 1500397 1048600 1103356 1266182 1041256 1056247
14626A056247L59327m0274Q5536J15646j29042r4417m5096O0347L5715k9069j2640
14615A362280K16869N1347k61412J10608k06738K87283j8948p2249J60986l667
14605A626359m30912K27057M14448m07145K77313l50192K45211J99089k64249
14596A536979j62549K05503J93563k01556L75147k92540K71300l8881M9168m8317
14586A887817j90561L04243k38383R7176Q1187j34395L0389J37685o044j17389
14576A851725O1061M78898k09882k7352j34306K14914j11403m7728J79217K29747
14566B484891Q7915k11695j76152L57528j64233N05902L37734m38721K55266J57594
14556C196029J07237J42691j432P95541K17802O07838J292376J899730M480839
$$ plain form
14626 1056247 1415574 1375300 1460836 1576482 1447440 1353023 1307927 1368274 1403989 1374920 1362280
14615 1362280 1579149 1630496 1369084 1479692 1272954 1560237 1541289 1469040 1630026 1626359
14605 1626359 1195447 1422504 1836952 1429807 1707120 1356928 1602139 1801228 1536979
14596 1536979 1374430 1579933 1773496 1571940 1947087 1654547 1925847 1886966 1936134 1887817
14586 1887817 1697256 2001499 1763116 1860292 1941479 1807084 1837473 1975158 1969114 1851725
14576 1851725 1912786 2391684 2181802 2154450 2020144 2235058 2123655 2075927 2255144 2484891
14566 2484891 2572806 2361111 2184959 2542487 2378254 2884156 3221890 2783169 3038435 3196029
14556 3196029 3303266 3445957 3444525 4240066 4457868 5065706 6358082 8257812 12738651
14547A2738651J0069176J3317621o71314j4793884r949671n078395j487669j187073
14539B957442k35391l46564O1337k1852m35516K76297J4294P2937q5596k53053
14529B004335J22987J72284K57523j16238J81286j02035R2963J65445l29099j15847
14519B333604K78108j84645K74883Q7301k50555K3160J41748n9016K74636K0397
14509B939621R1013K54287m01905Q6821K80025q1621n1009q0607N973Q4341r3275
14498C033664O43687l88707K45477j55073K22023l03862M21035j89654N7810K88117
14488C874517l51361M38429l49534j4783M8031J23248K35066l93955N89155l47415
14478C851398K18774j44247O9513K31805k66594K73929j56889L54245j54459J34887
$$ plain form
14547 12738651 22807827 36125448 35454134 20660250 10710579 5632184 4144515 2957442
14539 2957442 2722051 2375487 2436824 2414972 1979456 2255753 2270047 2342984 2257388 2004335
14529 2004335 2127322 2299606 2557129 2440891 2622177 2520142 2613105 2778550 2449451 2333604
14519 2333604 2611712 2427067 2701950 2789251 2538696 2561856 2703604 2644588 2919224 2939621
14509 2939621 3030634 3284921 2883016 2969837 3249862 3168241 3117232 3036625 3042598 3126939 3033664
14498 3033664 3677351 3288644 3534121 3379048 3601071 3297209 3718244 3528590 3586400 3874517
14488 3874517 3523156 3961585 3612051 3597268 3645299 3768547 4003613 3609658 4198813 3851398
14478 3851398 4070172 3925925 3995438 4227243 3960649 4234578 4077689 4431934 4277475 4412362
14468D412362M41550l81758M35089m67687M68974M9456k53452M60670N8641j59954
14458E063891J06970N7246l10219P99017j81797J39798k26455K25509j19537L36972
14448E891395Q0583N8898J18171j2493o0340K10636K46784k8935j26191J67615
14438F546123j76084N25261k47512J27949M2362M78410m71949K60302K6428J05359
14428G216649M48132j01669J73648L00457j34251L68661J08050l91991M9700J79384
14418H216770K35348O05480k10895k14140P37186j66893J2667M50027K05906j5958
14408I855498K24734r2183M73053n4803L83337j99231P9056K00213K88782J37197
14398A1295653N16061k13190M53857J05581K04567Q4125L83693m0842K21299J40499
$$ plain form
14468 4412362 4853912 4472154 4907243 4439556 4908530 4957986 4704534 5165204 5223845 5063891
14458 5063891 5170861 5228107 4917888 5716905 5535108 5674906 5448451 5673960 5554423 5891395
14448 5891395 5971978 6030876 6149047 6136554 6076214 6286850 6533634 6504699 6378508 6546123
14438 6546123 6370039 6895300 6647788 6775737 6818099 7296509 6824560 7084862 7111290 7216649
14428 7216649 7664781 7563112 7736760 8037217 7902966 8271627 8379677 7987686 8037386 8216770
14418 8216770 8452118 9057598 8846703 8632563 9369749 9202856 9215523 9665550 9871456 9855498
14408 9855498 10080232 9988049 10461102 10406299 10789636 10590405 10669461 10869674 11158456 11295653
14398 11295653 11811714 11598524 12052381 12157962 12362529 12446654 12830347 12789505 13010804 13151303
14388A3151303N88004P6534O84502J34635J31913K66505K2980L30236M50675Q6523
14378A5923810P5558P16834M00141L60032J25524M53597J85849P14316L55747
14369A9311408L32944O85201K18088L86054J72098P22994L52657N49215P02361
14360B3433020M47713K29843M95973R23125M18647Q61264P11720M68552O18661
14351B8608518P64099N19191O89589J141011Q30008P19737P72534J142413Q83321
14342C6070421J107816J111999P91564Q51907J259832R40355J403806J064756
14334D4602456J574777J442247J561207J366402J655609J540261J705885J921186
14326E7370030J783285K123759J708914K299342K336325K498242K389913K556594
$$ plain form
14388 13151303 13739307 13815841 14500343 14634978 14766891 15033396 15056376 15386612 15837287 15923810
14378 15923810 15999368 16716202 17116343 17476375 17601899 18055496 18241345 18955661 19311408
14369 19311408 19644352 20329553 20547641 20933695 21105793 21828787 22181444 22730659 23433020
14360 23433020 23880733 24110576 24606549 25529674 25948321 26809585 27521305 27989857 28608518
14351 28608518 29372617 29891808 30581397 31722408 32552416 33272153 34044687 35187100 36070421
14342 36070421 37178237 38290236 39081800 39933707 41193539 42133894 43537700 44602456
14334 44602456 46177233 47619480 49180687 50547089 52202698 53742959 55448844 57370030
14326 57370030 59153315 61277074 62985988 65285330 67621655 70119897 72509810 75066404
14318G5066404K597514L159421L091960L195704L438083L675057L703548L917523
14310A01845214L774721M594250M550280M607331N691980N448468N552452O073073
14302A42137769O520560P141225O970887P939229P952945Q945596Q571664R425439
14294B05605314J0056243J0516476J1220852J1608465J1780771J2563058J3196942
14287B86548121J3436204J3482054J4333901J4219728J4434478J4728181J4266004
14280C85448671J3700601J3181892J2339760J1336390R989616Q827628O304699
14273D61129257M136083J037569l140761m524845m254338m674523m584236p382542
14265D37741664r602981j1204243j2781972j3920731j4499825j5221096j5135510
$$ plain form
14318 75066404 77663918 80823339 83915299 87111003 90549086 94224143 97927691 101845214
14310 101845214 105619935 110214185 114764465 119371796 125063776 130512244 136064696 142137769
14302 142137769 148658329 155799554 162770441 170709670 178662615 187608211 196179875 205605314
14294 205605314 215661557 226178033 237398885 249007350 260788121 273351179 286548121
14287 286548121 299984325 313466379 327800280 342020008 356454486 371182667 385448671
14280 385448671 399149272 412331164 424670924 436007314 445996930 454824558 461129257
14273 461129257 465265340 466302909 463162148 458637303 454382965 449708442 445124206 437741664
14265 437741664 428138683 416934440 404152468 390231737 375731912 360510816 345375306
14258C45375306j5387425j4770695j4588323j3915573j3748656j2990442j2512331
14251B47461861j2011975j1271684j0865914j0160170r655941r288851q200974
14244A76006352p942999p641275p291359p355725o244980o354471n077975n648737
14236A22448831n338243m727143m904135l915823m010790l791854l628342l719726
14228H8412775l524033l003671l213461k637671k676803l066504j972422k446832
14220F5871378j642985k290016k646049j529208j750692j966580j387332j377005
14212E1281511j601526j798925j269042j434309j110879n68784j292710j515921
14204D0689415j331766j063827p02646r09061p76534j336047p11051r94629p33347
$$ plain form
14258 345375306 329987881 315217186 300628863 286713290 272964634 259974192 247461861
14251 247461861 235449886 224178202 213312288 203152118 193496177 184207326 176006352
14244 176006352 168063353 160422078 153130719 145774994 139530014 133175543 128097568 122448831
14236 122448831 117110588 112383445 107479310 103563487 99552697 95760843 92132501 88412775
14228 88412775 84888742 81885071 78671610 76033939 73357136 70290632 68318210 65871378
14220 65871378 64228393 61938377 59292328 57763120 56012428 54045848 52658516 51281511
14212 51281511 49679985 47881060 46612018 45177709 44066830 43498046 42205336 40689415
14204 40689415 39357649 38293822 37591176 36682115 35905581 34569534 33858483 32863854 32130507
14195C2130507j031601l36582p21774q01529j020673m70812m86121p82398l82938
14186B6096079q36332n73107m63545l73843n73246o15196l60697o09165j51980
14177B1538968m23622l17845k99729q54516k99534k07844o20905j04905m69176
14168A7940892m93853k81096M43976n59454q45027j41508j040p39800l12020K96686
14158A5307756l35236l01176j78591n90927p5924k65139l10890L5019n21105o2416
14148A2701371k00928k08239l29758K2908J11141m93008k70634r9755q8039l15813
14138A0829246p5595l1507o55908N04063m47652l37755K00922J1883l15479m66012
14128I216206m97l2138Q1519o1361n08708J48818o8557n64424L5886O087j05816
$$ plain form
14195 32130507 31098906 30762324 30040550 29239021 28218348 27747536 27261415 26479017 26096079
14186 26096079 25259747 24686640 24223095 23849252 23276006 22660810 22300113 21690948 21538968
14177 21538968 21115346 20797501 20497772 19643256 19343722 19135878 18514973 18410068 17940892
14168 17940892 17447039 17165943 17609919 17050465 16205438 16063930 16062890 15323090 15011070 15307756
14158 15307756 14972520 14671344 14492753 13901826 13825902 13560763 13249873 13284892 12763787 12701371
14148 12701371 12500443 12292204 11962446 11985354 12096495 11603487 11332853 11233098 11145059 10829246
14138 10829246 10753651 10722144 10066236 10570299 10122647 9784892 9985814 9997697 9682218 9216206
14128 9216206 9215709 9183571 9265090 9203729 8695021 8843839 8775282 8210858 8246744 8252831 8147015
14117H147015k91020K04566l50773M7336k01003q579j98102m3732K36744l64695
14107G177757K2134k2956l22704k39644L69933l22469j19018R8014m2692j70083
14097F428272j50763Q9092k55990J66059M2465n10088J89975o16961O07116m99283
14087E489894K91250q6503k05150J45103j39942k45918R8769k62821J66039l44352
14077D906369n5661J14204M6985j89328L40663m70915K92808m11913L886l9824
14067D537274J08000j53959N8864J3783P7744j05870k32283j56526j1734M44159
14057D579452o39484L20519j59593k43941J55959k13609J5243m5115N4404m0018
14047C783817J18881k75547L22127m11996K82085j74635j2834q923l9452l17156
$$ plain form
14117 8147015 7855995 8060561 7709788 7757124 7556121 7547542 7349440 7305708 7542452 7177757
14107 7177757 7199891 7176935 6854231 6614587 6984520 6662051 6543033 6641047 6598355 6428272
14097 6428272 6277509 6366601 6110611 6276670 6319135 5809047 5999022 5382061 5989177 5489894
14087 5489894 5781144 5694641 5489491 5634594 5494652 5248734 5347503 5084682 5250721 4906369
14077 4906369 4850708 4964912 5011897 4822569 5163232 4692317 4985125 4573212 4577098 4537274
14067 4537274 4645274 4491315 4550179 4563962 4641706 4535836 4303553 4147027 4135293 4579452
14057 4579452 3939968 4260487 4100894 3856953 4012912 3799303 3814546 3769431 3823835 3783817
14047 3783817 3902698 3627151 3949278 3537282 3819367 3644732 3631898 3622975 3583523 3266367
14037C266367j2142K65583M0638p5771m1793n5125k97993M99758l14875K74191
14027C548838l83133n0791Q9510k08736J61628j94374j37867K81747l44610J48111
14017B910323j16660N4664K47930o41301j22544M24037j91853K39269O8862P6235
14007B948962n56k54569k70604j4205J27383L3355M182J49589j77145k19190K316
13996B329518J66171N31388n51790K66182j09727M96270N37114R07993L158007
13987G731126Q937176J5370718M707817j1459566j0237733n336223k731229j314316
13979E667770r70522n23339l59328J21504q61474K87099k76731n2611j14620k30527
13969B687221J77934k92906R2168l21931K55959j87662k50863L88668n43395M68965
$$ plain form
14037 3266367 3254225 3519808 3560446 3484675 3442882 3387757 3089764 3589522 3274647 3548838
14027 3548838 3165705 3114914 3204424 2995688 3157316 2962942 2825075 3106822 2762212 2910323
14017 2910323 2793663 2848327 3096257 2454956 2332412 2756449 2564596 2803865 2872727 2948962
14007 2948962 2948406 2693837 2423233 2409028 2536411 2569766 2573948 2723537 2546392 2327202 2329518
13996 2329518 2495689 3027077 2475287 2741469 2631742 3128012 3665126 4573119 7731126
13987 7731126 16668302 32039020 36746837 25287271 15049538 9713315 6982086 5667770
13979 5667770 4697248 4173909 3814581 3936085 3074611 3361710 3084979 3032368 2917748 2687221
13969 2687221 2865155 2572249 2664417 2342486 2598445 2410783 2159920 2548588 2005193 2474158
13959B474158q2900k89324L21816l98231J95978L20816l88260O5353j89161P5357
13949B105602K58980o04794L01563j27785L70593l11212l6863K68207m58250K29713
13939A995754K29907j60949m25783J37795L41062j75634P1498m5891J48542j31491
13929A984810n09190O53545j94916k07773J7438k17511J38219j81228K19641j67737
13919A535298L30775j25675k18380j05663K21563n5063l8597j35866J41813o6604
13909A483601J70839k75230L31268r3331m4495j76722K82416k03382Q1773L9466
13899A596203j65196j682J23901j14737R6686l4881k91021M47204k98384O4923
13889A423016K61400q8079l3096k14543n7961o2153r043K70985k37716K62918
$$ plain form
13959 2474158 2391258 2101934 2423750 2025519 2221497 2542313 2154053 2219406 2030245 2105602
13949 2105602 2364582 1759788 2061351 1933566 2304159 1992947 1956084 2224291 1766041 1995754
13939 1995754 2225661 2064712 1638929 1776724 2117786 1942152 2013650 1967759 2116301 1984810
13929 1984810 1475620 2129165 1934249 1726476 1743914 1526403 1664622 1483394 1703035 1535298
13919 1535298 1866073 1740398 1522018 1416355 1637918 1582855 1544258 1408392 1550205 1483601
13909 1483601 1654440 1379210 1710478 1617147 1572652 1395930 1678346 1474964 1556737 1596203
13899 1596203 1431007 1429325 1553226 1438489 1535175 1500294 1209273 1656477 1358093 1423016
13889 1423016 1684416 1596337 1563241 1348698 1290737 1228584 1219541 1490526 1252810 1515728
13879A515728o8757l19567K2775K90884k06974m8075K32123k62049P8084O5084
13869A299256p1462L2114J77723l51069J34622o6362K1022J85809l97551M89471
13859A453573R704j48868k02173Q1765k017k37199K13851r4625M904M45698n00442
13848A024171K9707N82166m49803Q3655r6949j9706k58486J66344k20336M4181
13838H84944k24877L82275l45717N04630l06790J48109J10761l9076O5056K1134
13828A200449l52453M20862k75065L64424m24847J06276j58059N45876o84001
13819G43462J87343Q037k49199M91331j46725j34045J04410m443l14228M32794
13809A118737j17042R2723R1194m39539N92956l91436k81515K18986j96407K58386
$$ plain form
13879 1515728 1446971 1127404 1150179 1441063 1234089 1186014 1418137 1156088 1234172 1299256
13869 1299256 1227794 1259908 1437631 1086562 1221184 1154822 1175844 1361653 964102 1453573
13859 1453573 1463277 1314409 1112236 1194001 1191984 954785 1168636 1074011 1078915 1524613 1024171
13848 1024171 1053878 1636044 1186241 1269896 1172947 1153241 894755 1061099 840763 884944
13838 884944 660067 1042342 696625 1201255 894465 1042574 1153335 1114259 1179315 1200449
13828 1200449 847996 1268858 993793 1358217 933370 1039646 881587 1427463 743462
13819 743462 930805 938842 689643 1180974 1034249 900204 1004614 1000171 685943 1118737
13809 1118737 1001695 1094418 1185612 746073 1339029 947593 666078 885064 688657 947043
13799I47043q1705K20048j34655p7769J29149k68296J8226K42916j39891K43630
13789A098696n286j41535j27076L42604j56143k70095K81771j63707L380j15568
13779G47041J24573J7829n0904o9682q4197Q1530Q8642o872k39816M3530J13866
13768G65540J79442j96989n6838j6954J77643N9054o137p2203l24173N63701l26008
13757G46078j10173k8468K61726K333m15495K51004J17722n280P8514k36564n276
13746F56121L07327l74026K4847J59349L98127E24899K51004K34734k7671r2023
13736H90943l98001M11587l23961L70268L7699j26195l89555l8189N4042k4706
13726D63932K28471J04363j04590q276Q1999l65083M60370N6825l43284K38722
$$ plain form
13799 947043 865338 1085386 950731 872962 1002111 733815 752041 994957 855066 1098696
13789 1098696 1093410 951875 824799 1167403 1011260 741165 1022936 859229 862609 747041
13779 747041 871614 889443 838539 768857 684660 766190 854832 847960 608144 651674 765540
13768 765540 944982 747993 691155 674201 851844 910898 904761 832558 508385 1072086 746078
13757 746078 635905 607437 869163 871496 456001 707005 824727 819447 897961 661397 656121
13746 656121 963448 589422 614269 773618 1171745 524899 775903 1010637 982966 890943
13736 890943 492942 904529 580568 950836 988535 862340 472785 434596 488638 463932
13726 463932 692403 796766 692176 683900 765899 400816 861186 918011 574727 813449
13716H13449k50723m9391q5272o8942N11088l87236K09197r7094k12176L10728
13706F93628J40651m8478M6098k60926o8925L26322k38115j67569J48537q5464
13696D85759N59866k77901k63312J81814j17879K8667L37085l47621J10627j46068
13686E51037k3902n24r5930o6315K20694K07526m7376m5747K4392j60669K36964
13675H00150j76980r3364B24158L70715q1758K12048C59168L35699m4228j79359
13665D71280J05625M7676k68370P446O2775B02664K77404K99417j69159k94923
13655C15403L31904A90376L57376B63692O96943m62441n8793J81520j72243p0215
13645C78463L47267l47454L80018j89529M7708P4533j25916k81138J51772L29466
$$ plain form
13716 813449 562726 513335 428063 359121 870209 482973 692170 595076 382900 693628
13706 693628 834279 785801 831899 570973 502048 828370 590255 422686 571223 485759
13696 485759 1045625 767724 504412 686226 568347 597014 934099 586478 697105 551037
13686 551037 527135 526611 430681 364366 585060 792586 745210 699463 723855 563186 800150
13675 800150 623170 529806 224158 594873 513115 725163 359168 694867 650639 471280
13665 471280 576905 624581 356211 363657 426432 202664 480068 779485 610326 315403
13655 315403 647307 190376 547752 263692 960635 498194 439401 620921 448678 378463
13645 378463 725730 378276 758294 568765 616473 691006 565090 283952 435724 765190
13635G65190l73659R0195k6590N7881p5183L24648C57042M1636L70532n6754k33879
13624D78577j21423J64025k46966J5631K23663K23864B46401J57757m6721J71714
13614E29151k57408R1848k9299j9101L98363l46712K35271k00027J22577p1473
13604D53190A96207K17014N7018j72295J84983l5865j6131K34216k74724j46239
13594B44184A8161M64525p0771L39999C03072j16249o02n9807P4413K80453k00883
13583B80397M07076o8437k66828K85077j85469q3371K04143k23401j42310J33204
13573C40081q8663K79735n5175k30766L77455A09762K31303K25074k14930J55174
13563E06383o6342l8914G1896K81162L45661A52386L54156A10251J79805R0188
$$ plain form
13635 765190 391531 481726 455136 513017 437834 762482 357042 398678 769210 712456 478577
13624 478577 357154 521179 274213 289844 513507 737371 246401 404158 357437 529151
13614 529151 271743 363591 334292 315191 713554 366842 602113 402086 524663 453190
13604 453190 196207 413221 470239 297944 482927 447062 430931 665147 390423 244184
13594 244184 18161 482686 411915 751914 303072 186823 186221 126414 200827 481280 280397
13583 280397 687473 619036 352208 637285 451816 368445 572588 349187 206877 340081
13573 340081 251418 531153 475978 245212 622667 109762 341065 566139 351209 506383
13563 506383 440041 401127 71896 353058 698719 152386 506542 110251 290056 380244
13553C80244a28A32492J99627A38526K26780C4514P48976A49355L78343k61351
13543B66347q993H834N56362B73496Q94p6811J80198q9315J10884H4376K39500
13532C23876l6110k7392K63284j11956j03529K39319j38408j90472q1551J20992
13522B58053J41748L0100j33966K25159A41631L29254B09176J96166P2377j40836
13512C36883j04009j11879Q3109O7769P6114K2268a76174C57344j0518Q0786p7580
13501C50032O4465Q5709B27988N13916l23623J39330D7343M20439j46210o1501
13491B60071j20100O2872Q3469A22237L31355R4829k20678L60173k73139j30191
13481B84586K31202j20429j76956L15349j41366K653n1300j00254N2082f4812
$$ plain form
13553 380244 -128 132492 332119 138526 365306 34514 783490 149355 527698 266347
13543 266347 257354 8834 565196 273496 274390 197579 377777 288462 399346 84376 323876
13532 323876 287766 260374 523658 411702 308173 547492 409084 218612 137061 258053
13522 258053 399801 429901 295935 521094 141631 470885 209176 405342 477719 336883
13512 336883 232874 120995 204104 271873 347987 370255 -176174 357344 346826 427612 350032
13501 350032 414497 500206 227988 741904 418281 557611 47343 467782 321572 260071
13491 260071 139971 202843 286312 122237 453592 548421 327743 687916 414777 284586
13481 284586 515788 395359 218403 533752 392386 395039 343739 243485 295567 -64812
13470f7287H6014g7502C85881j33848K84501M8873A85301j9802Q509J22637K13703
13459E10348A65907K79972A46440N21656H9771g8348E67297n7360I0304F969L04698
13448C11667L07460J20775A79617J36988K07308A72715O0274q4456C2690a29886
13437A24902N7409a5850A16872K70230j80622H7055L06646j65860J53388r0722
13427B90507A04232K97098j79109M9622P5002L240L9858m2007K12184B10543J55376
13416C65919J78668B54847J01097J64849j91628j12815m8645M2098K30934A69249
13405D72719A46547a04332C89656J7588A8917M30345j44402A25200J28949r1908
13395A62241K190P4497j1200K59542A9773M4811L24585K8078J24934k33105F9707
$$ plain form
13470 -67287 86014 -77502 385881 252033 536534 585407 185301 165499 174008 296645 510348
13459 510348 165907 445879 146440 668096 89771 -78348 567297 509937 90304 6969 311667
13448 311667 619127 739902 179617 316605 523913 172715 232989 148533 32690 -129886
13437 124902 182311 -15850 116872 387102 206480 87055 393701 227841 381229 290507
13427 290507 104232 401330 222221 271843 346845 350085 389943 347936 560120 210543 365919
13416 365919 544587 254847 355944 520793 329165 216350 167705 209803 440737 169249
13405 472719 146547 -104332 389656 407244 18917 449262 304860 125200 254149 162241
13395 162241 164431 238928 227728 487270 19773 64584 389169 417247 542181 309076 69707
13383H2761K71357A66315p5290K52757P3599j68124r7503D0308K06279j3896K40927
13372D73618k32237g4052B44803A05728P8325M14093k69576n6771p2335O2918
13362B62382C1359a89061B50102K95181A20715E5782K23735c58354F67044C17986
13351E59196B53221A04707L82037g0801A27573K70660J9487P6343j71670F5111
13340A22796J57660I4491K59466l756j63995L072J4448J74613A16524K76019B8606
13328B10964R5490q574j38868M40326B18439J00441A53524J15299P1358A49653
13317A57693O6016J41311A2903J91970J33665j09817J42701J48598j47661A48172
13306I5300R7665J92833A07144a522A80994R173C6832N34813k46855b10584C14852
$$ plain form
13383 82761 354118 166315 91025 343782 417381 249257 151754 40308 246587 232691 473618
13372 473618 241381 -74052 244803 105728 184053 598146 328570 271799 199464 262382
13362 262382 31359 -189061 250102 545283 120715 55782 279517 -358354 667044 317986
13351 559196 253221 104707 486744 -70801 127573 398233 417720 494063 322393 65111
13340 122796 280456 94491 353957 350201 186206 189278 203726 378339 116524 392543 28606
13328 210964 306454 297880 159012 599338 218439 318880 153524 268823 340181 149653
13317 157693 223709 365020 12903 204873 338538 228721 371422 520020 372359 148172
13306 95300 192965 385798 107144 -1522 180994 190167 36832 571645 324790 -210584 314852
13294A37940K20307c8486D4517K34768j0147P4849M1560a03392B33475K07944
13284D41419A25865l2168K42373d0333A68519K5757J919J84899E9232L96394j82905
13273B72721L2757J7132q8036k2575C4818M32072f8151G6061A2003K56534D8776
13261D8903g4390A89260L5394R2016F6563B4147L65759e8297E60825B10235j9969
13250A90266l789k7071Q4366O7142Q6065A38652g6545B18408c7307A11044J59364
13239B70408r6720J47841j22576M2113r7003R5182A03391K73188p8413j9853B5917
13227b0190I2048K7999j9758L81858A82868I1070a41334C42593A56245a4247A83616
13215C16184G040K83661a3301j89178C88950A54514l0904a09891A27763C06P310
$$ plain form
13294 137940 358247 -38486 44517 279285 269138 343987 385547 -103392 233475 441419
13284 441419 125865 93697 336070 -40333 168519 194276 196195 381094 59232 455626 272721
13273 272721 305478 322610 234574 211999 34818 466890 -68151 76061 12003 268537 48776
13261 48903 -74390 189260 224654 316670 66563 24147 389906 -58297 560825 210235 190266
13250 190266 186477 159406 243772 310914 396979 138652 -76545 218408 -37307 111044 270408
13239 270408 173688 321529 198953 241066 144063 239245 103391 376579 298166 278313 25917
13227 -20190 92048 120047 100289 482147 182868 91070 -141334 342593 156245 -14247 183616
13215 316184 7040 290701 -13301 -202479 388950 154514 123610 -109891 127763 306 7616
13204G616M53528a4637E3632K58765q0569g6184r3590H4306j3775J25293D5344
13192H1233J6476l805J05647K00672j28233l3538j1617a59898G2659J55563D3125
13180B59349A17386b4756B5460D267L0062a8275B87643P2439P4713A94196b59854
13168i3025C56079p0575C7699J34252a85660a2322F6653K7403J13628k8890c402
13156A92047Q3338F0461L733n576K82880j11896q5091b9157M259C04739f6339
13144E9655a20185e5738C07078b74075A69069B8335K3749b91509A53815D3255
13133E46200i564A32035D2340O720K76988f1329I3870A5864f7594j10173B18706
13121A65975j3794p76D0222a6323j72506A42325J41848K3381E4109C342N7782
$$ plain form
13204 7616 461144 -14637 53632 312397 231828 -76184 -169774 84306 70531 195824 45344
13192 81233 97709 93904 199551 400223 271990 238452 226835 -159898 72659 228222 43125
13180 259349 117386 -24756 25460 4267 34329 -18275 287643 360082 434795 194196 -259854
13168 -93025 356079 285504 37699 171951 -185660 -12322 66653 94056 207684 178794 -3402
13156 192047 275385 60461 64194 58618 341498 229602 144511 -29157 -24898 304739 -66339
13144 59655 -120185 -55738 307078 -274075 169069 28335 52084 -291509 153815 43255
13133 546200 -9564 132035 42340 49060 326048 -61329 93870 15864 -67594 -177767 218706
13121 165975 152181 151405 40222 -16323 -188829 142325 284173 307554 54109 3342 61124
13110F1124L08653b10094h5103C3363f5070E3120L74463c6522A0659Q0131A451
13098A60246F9028J28419a75904E59180f7160E4673b9042J0080H2427K16449c4084
13086B90139A31921K21390A6432M244L92599a02142C12626a9413m1478H5852N3094
13075A38946J41049r2826j9501b58901B7454J33819a25845G7049O5421a41095
13064B52409J96458F3760A0194K36335H0394i6120n865A66540J71522j18174a39917
13052H9591R0720i5331B3642O2036K84483j38244b6834B55960j23275K7335d8381
13040a5932A58678M8672a90273C52003A56435p3429B5748L70580e1211G5498a99479
13028D3678K89872O5420L2913A09258D1004h3865G4921a58300F4659J09535a19539
$$ plain form
13110 61124 369777 -210094 -85103 33363 -65070 53120 427583 -36522 10659 90790 1451
13098 160246 69028 197447 -175904 559180 -67160 54673 -29042 -18962 82427 298876 -34084
13086 290139 131921 353311 16432 20676 413275 -102142 312626 -19413 -60891 85852 138946
13075 138946 279995 187169 167668 -258901 27454 161273 -125845 77049 142470 -141095
13064 252409 448867 63760 10194 246529 80394 -96120 -101985 166540 338062 219888 -139917
13052 89591 180311 -95331 23642 85678 370161 231917 -26834 255960 132685 160020 -48381
13040 -15932 158678 207350 -190273 352003 156435 83006 25748 396328 -51211 75498 -199479
13028 43678 333550 398970 431883 109258 41004 -83865 74921 -158300 64659 174194 -119539
13016b41199A99884I2163J85974j23820b23048B9367d5563A10137P9988b73820
13005D85632k11080D7834K97557j06915j08401p774K69093g8702n981F1533J03904
12994A65437K69827d06336B4837Q9968b33462B23523N0774A0714a20430f332j5115
12983b1447F239J35889o4974j1839L6299m5954J16852L4355b08A79385J9208B6945
12970C46593e3200B93669C9846N12K55452j13886j279g9044b566k95811P7634
12959b20743C20105H268A372L4333e6384j84772D11734C7196R6154j7344C5060
12947H708e8928A13811g2594L2936l7024b0817A95658c78530C39376B1385M92067
12936E13452C6935K53512i9367b8321B23270E40K56649j05182e5173j9467A97438
$$ plain form
13016 -241199 199884 92163 278137 154317 -223048 29367 -45563 110137 190125 -273820
13005 485632 274552 47834 345391 238476 130075 122301 391394 -78702 -84683 61533 165437
12994 165437 435264 -406336 24837 114805 -233462 223523 274297 10714 -120430 -6332 -21447
12983 -21447 6239 142128 77154 65315 101614 55660 172512 206867 -208 179385 198593 26945
12970 346593 -53200 293669 39846 40358 295810 181924 180645 -79044 -2566 -298377 -220743
12959 -220743 320105 8268 1372 35705 -56384 -241156 411734 37196 133350 116006 35060
12947 8708 -58928 113811 -72594 -39658 -76682 -20817 195658 -378530 339376 21385 513452
12936 513452 36935 290447 -99367 -28321 223270 540 257189 152007 -55173 -74640 197438
12924E2332b62603a14465A07593N5826l3528F2166J65022Q695k1122a49321d241
12912b03108d2347q2956B5990K26973J34807j72733I2515e1473D6288K6503J30471
12901B03262b48981g8451C11749a89393b0188l01831d9340k4720A17515o500J19328
12890B30343D7289R9534C2590a98654c1886j02896A65567B1597f783A10271f495
12878C65985E1c05090L8194C08230f853j18093A16501b3558A99778P597J07858
12867C15233E3501a36341G5841f1066A53749J68718a17871E6252q481b32187I5022
12855b9798A59430a44586A48312j0343b24183D1190j2674J67000p0080J69390
12845B94826b66141M5522i9776g399A81052a3746F7255a19155B75149a168j01017
$$ plain form
12924 52332 -262603 -114465 107593 163419 129891 62166 227188 235883 214761 -149321 -4241
12912 -203108 -42347 -125303 25990 252963 387770 215037 92515 -51473 46288 72791 203262
12901 203262 -248981 -78451 311749 -189393 -20188 -322019 -49340 -74060 117515 111015 230343
12890 230343 47289 146823 32590 -198654 -31886 -134782 165567 21597 -6783 110271 -6495
12878 365985 51 -305090 -266896 308230 -6853 -124946 116501 -23558 199778 207375 315233
12867 315233 53501 -136341 75841 -61066 153749 322467 -117871 56252 47771 -232187 95022
12855 -29798 159430 -144586 148312 137969 -224183 41190 28516 195516 125436 294826
12845 294826 -266141 -220619 -99776 -7399 181052 -13746 67255 -119155 275149 -1168 -102185
12834a02185b264B58553a02515D8456o500k490a04958J5486E93683b3089j14665
12823a37754k9676I1067d1109n8419B18381q324B720J33000R1869j6811k7479
12812A83299a91618B82254c84799B0410J91010J33369B229K19314e2929m5908
12802i8837C4082i3601p9066I5902a17895B61492D6935J97228a18684a6620A23098
12790A30899b14147B76380o0234e7607E38595A90663l8174c3417G325J04045a87555
12778B84515a04544A88759k9446a26475C9210d0375B56216M1202A971g7059F1210
12766A98805F1228J07306L1788b79161a09698B19238a55830A66902d1865A54840
12755a35411e7717B41344r094b3093k33019i4154A73743f5448A78899H2198N3929
$$ plain form
12834 -102185 -2264 258553 -102515 48456 41956 39466 -104958 -89472 593683 -23089 -137754
12823 -137754 -167430 91067 -41109 -99528 218381 210057 2720 135720 227589 210778 183299
12812 183299 -191618 282254 -384799 20410 211420 344789 2229 221543 -52929 -98837
12802 -98837 34082 -93601 -172667 95902 -117895 261492 46935 244163 -118684 -16620 123098
12790 130899 -214147 276380 216146 -57607 538595 190663 152489 -33417 7325 111370 -187555
12778 284515 -104544 188759 159313 -126475 39210 -40375 256216 297418 1971 -77059 61210
12766 198805 61228 168534 200322 -279161 -109698 219238 -155830 166902 -41865 154840
12755 -135411 -57717 241344 232250 -23093 -256112 -94154 173743 -65448 178899 82198 136127
12744A36127B9223J38611A1531b34989A61107f8456B3306b42899P7110l56024
12734e21813i3834A97288I7938M009N36125C11832A3220f8438G6833e0313j871
12723e2184B34925n6509b3509q3289j72179a9128B33029a34739a9904p9633j93554
12712b93091B09669P7492g336D20412A7739h0127L5802A13395c9485G20J35393
12701A36113i4290B62151n1286a01737H2841K51884g8900C31513b01711b2771
12690C35606E2495e0684A36954J00853A01340H631Q4213P5698B5141f8921A04333
12678g9682B95704o5414l9547b32301A72507P0664A5258P6600D4810J47226J83939
12667C75975c5544G8805K55334J36076a30127B35632A02728J9684K54165E6130
$$ plain form
12744 136127 29223 167834 11531 -234989 161107 -68456 23306 -242899 -165789 -521813
12734 -521813 -93834 197288 97938 101947 638072 311832 13220 -68438 76833 -50313 -52184
12723 -52184 234925 178416 -23509 -106798 -278977 -19128 233029 -134739 -19904 -99537 -293091
12712 -293091 209669 287161 -7336 420412 17739 -80127 -44325 113395 -39485 720 136113
12701 136113 -94290 262151 210865 -101737 82841 334725 -78900 331513 -201711 -22771
12690 335606 52495 -50684 136954 237807 101340 8631 92844 168542 25141 -68921 104333
12678 -79682 295704 230290 190743 -232301 172507 243171 15258 91858 44810 192036 375975
12667 375975 -35544 78805 334139 470215 -130127 235632 102728 122412 376577 56130
12656A21253M9144n7377D1555M39932j97518a6798B64972a3872B64624A1730b89109
12644b59929A44092a23611c3382B64821j3906e1562B58601q9495a2530F1054a1552
12632a42539D6400J37735K47735k99J8356e9495k08779B76981o5168d3741C66039
12620B53495B7613L94499j42218p0136b09867B73398b34988a09448D3629J11298
12610A54927M6777P3780a28154A00146k8666b90512B58363o4708O1535J48172
12600D03362A88647E3925K65339A27086E5951J65294n7590o7658A339O4619K1932
12589H7890n584a04380A16216a69957B7898d4998o5207C47J58872Q1702m9427
12578A91494o2493L158M9442a28393f1501A00585K69691A5143J05912a13937A56090
$$ plain form
12656 121253 170397 113020 41555 481487 283969 -16798 264972 -13872 264624 11730 -289109
12644 -259929 144092 -123611 -33382 264821 250915 -51562 258601 169106 -12530 61054 -11552
12632 -142539 46400 184135 431870 431571 449927 -59495 -268274 276981 211813 -43741 366039
12620 253495 27613 422112 279894 209758 -209867 273398 -234988 -109448 43629 154927
12610 154927 201704 275484 -128154 100146 71480 -290512 258363 193655 255190 403362
12600 403362 188647 53925 319264 127086 55951 221245 163655 95997 1339 65958 87890
12589 87890 82306 -104380 116216 -169957 27898 -44998 -110205 347 159219 240921 191494
12578 191494 129001 132159 181601 -128393 -61501 100585 370276 15143 121055 -113937 156090
12566g8466B3911M2850d102k24178d0517B54940a49072a5892l2810p621E43J71283
12554A71826g4437j42537b900D3171K3505K6584K29952A7357d9927m6457j6374
12543a12758I6643j3934J30785q7705e5754b5803j48769O9030I1863j6110O8404
12532A44157E9308R6542g3794B4593b42141e9309A04990j824l5986e5646o113
12521f1759A09745K9367o5593r292K31652p2740J1181k6346a21394G7122D873
12509c55480d6834B06506M5857c9911q7744A91362E0770P3360A0751b2505F3977
12497C196L82869j80614o0721J11945c00131B14610c04846Q1401A5022K29746
12487B44768j11541i4416B06161L3306H0448R9166C6269a81558B60974a09439
$$ plain form
12566 -78466 23911 66761 -4102 -228280 -40517 254940 -149072 -15892 -48702 -56323 543 171826
12554 171826 -74437 -216974 -2900 43171 66676 93260 323212 17357 -49927 -96384 -112758
12543 -112758 96643 82709 213494 125789 -55754 -25803 -174572 -105542 91863 75753 144157
12532 144157 59308 155850 -73794 24593 -242141 -59309 104990 103166 67180 -55646 -61759
12521 -61759 109745 139112 73519 64227 295879 223139 234320 207974 -121394 77122 4873
12509 -355480 -46834 206506 252363 -39911 -127655 191362 50770 124130 10751 -22505 63977
12497 3196 386065 205451 144730 256675 -300131 214610 -304846 -223445 15022 244768
12487 244768 133227 -94416 206161 239467 80448 179614 36269 -181558 260974 -109439
12476D014K8784h557F5534a61366F6341f0413A09419a80642O9611B51534O9808
12465C21342A59282a00145H140a25618I5949D0417J24916b37730a4095j02224
12455a16319j04529B84514a76319F8269J7352a09949G1576b97310a08351E4730
12444A16332R5688p9792K8411e1143j9000G1336L1312a43548p6927e722j1205
12433a6927q4719A64060b42799b6270q3156B00270i221A28478J29534J24378a30250
12421a57434k1106A23769b83391b4103A34628B7483a4294l50379e6471j95186
12411b51657c2009k08205a01187K714a9450B0114b02890G996J56879F7667a55083
12399B13708a39591C56544a76677A81860C4997c2704B99200c23948C87414A1d297
$$ plain form
12476 4014 32798 -8557 65534 -161366 66341 -60413 109419 -180642 -111031 251534 321342
12465 321342 159282 -100145 8140 -125618 95949 40417 165333 -237730 -14095 -116319
12455 -116319 -220848 284514 -176319 68269 85621 -109949 71576 -297310 -108351 54730
12444 116332 212020 132228 160639 -51143 -70143 71336 102648 -143548 -220475 -5722 -16927
12433 -16927 -101646 164060 -242799 -26270 -109426 200270 -9221 128478 258012 382390 -130250
12421 -157434 -178540 123769 -283391 -24103 134628 27483 -14294 -364673 -56471 -251657
12411 -251657 -32009 -240214 -101187 -98473 -19450 20114 -202890 7996 164875 67667 -155083
12399 213708 -139591 356544 -176677 181860 34997 -32704 299200 -323948 387414 11 -4297
12387B19770d4428A9622J50009g2133K6077B08740a35726D1371J8207a11537A32930
12375a83738B19798I507i0868j3019B08791j5176a9183A7510L66327A09394M4795
12364A54189C0131M1581a3251J253q2659A88738h4337A6614J05529K42373L64451
12353G28967e3382A19725L01730A66828d3056l6040m4505B2006J32220d6732p190
12342e3922D1527K62879e7909k69389c4157F677Q352K27403a50212A70191F2729
12330b30903A62157D7645J50118q636b98814a34706C05387j29542F8350e8807
12319e33813A89421n1716n3604C2267P5522l806f0953D3972O6286E1256c35328
12307B90831N8766b24515a9872j84504q3881A57716a78704j8139A66726A58a00495
$$ plain form
12387 219770 -44428 19622 169631 -72133 -46056 208740 -135726 41371 59578 -111537 132930
12375 -183738 219798 9507 -90868 -103887 208791 193615 -19183 17510 383837 109394 154189
12364 154189 30131 71712 -13251 -11998 -94657 188738 -84337 16614 122143 364516 728967
12353 728967 -53382 119725 421455 166828 -43056 -79096 -123601 22006 154226 -46732 -53922
12342 -53922 41527 304406 -57909 -327298 -34157 6677 15029 242432 -150212 170191 62729
12330 -230903 162157 47645 197763 189127 -298814 -134706 305387 175845 68350 -58807
12319 -533813 189421 137705 84101 32267 107789 103983 -60953 43972 110258 51256 -335328
12307 290831 349597 -224515 -19872 -204376 -288257 157716 -178704 -196843 166726 158 -100495
12295A65473C7816a5360A31192h6285D76072k36125a65882A17548e5463b5010
12284b48062A40924C6388J30890c3244A0835L1665L6750a51888A82072D3543O7025
12273A10568L20396A40573b2122n0406C88519G9303a00872A19692K9120C1854
12262A21936m4101j2169b13575A01350J10056c2811A67884E5848a15039A46798
12251I808K4873J33867e3411B12589l6417E8650a24179l94G0262K56042j36049
12240A90255b43363Q1855F7501b57101B40823q379g818A23398K6195P7461M03078
12229F30132B33591K7529F3399K96550H5559J38566J78980C4742O8945l0603c0009
12217B16405R9143A25872E5868a37033f090l6447d302A04714J09523J5262J63115
$$ plain form
12295 165473 37816 -15360 131192 -86285 476072 239947 -165882 117548 -55463 -25010
12284 -248062 140924 36388 167278 -33244 10835 42500 79250 -151888 182072 43543 110568
12273 110568 430964 140573 -22122 -72528 388519 79303 -100872 119692 148812 31854
12262 121936 77835 65666 -213575 101350 211406 -32811 167884 55848 -115039 146798
12251 9808 34681 168548 -53411 212589 176172 58650 -124179 -124573 70262 326304 190255
12240 190255 -243363 -161508 67501 -257101 240823 232444 -7818 123398 149593 227054 630132
12229 630132 233591 261120 63399 359949 85559 224125 403105 34742 103687 73084 -30009
12217 216405 315548 125872 55868 -137033 -6090 -42537 -4302 104714 214237 229499 392614
12206C92614A21572J63993h7408A88193D9042L19338B1056L86888f6491C4147
12195C05649l3723M8409j57337n4957b2283A4472L3698d5433A15614a50441A31898
12183e9398B57272b2755B11532f9770B21228D8967M9810i9095A25390B4019N7830
12172H1849N0058K26623a02416C92966a1917E0825M24876A0207R8309m8748Q5148
12161A44916g0406A46170a26699h264F1257a13113B88045a9566G0894L12049c9948
12149H2196a00734H2748K03810c1645C52732E3815J9194a7798j68042D22137f4172
12137C51497j47263a57243B04859a0702A36609J78818a54939C1373N4697a12453
12126G3119G008J39835F7450J2788a39511B7534a50516A04102J05900A03248a00996
$$ plain form
12206 392614 121572 285565 -87408 188193 49042 368380 21056 407944 -66491 34147
12195 305649 271926 320335 162998 108041 -22283 14472 48170 -45433 115614 -150441 131898
12183 -59398 257272 -22755 211532 -69770 221228 48967 98777 -99095 125390 24019 81849
12172 81849 131907 358530 -102416 392966 -11917 50825 475701 10207 108516 59768 144916
12161 144916 -70406 146170 -126699 -8264 61257 -113113 288045 -19566 70894 382943 -39948
12149 82196 -100734 82748 286558 -31645 352732 53815 73009 -17798 -185840 422137 -64172
12137 351497 204234 -157243 204859 -10702 136609 315427 -154939 31373 86070 -112453
12126 73119 7008 146843 67450 80238 -139511 27534 -150516 104102 210002 103248 -100996
12114c06997a27205b4166A60018n2484J53204A02142Q8818F0405D116b89204G54
12102b38063a15639D4062O7096N7712b52349A9611b87078Q7432c886B19272d5773
12090B21562p867b22356Q8673d1921q7243A21061a9519A66498c7525j42906B38668
12078D9417J23416J51360A06556b13428C8824f0155A44540a46661d8816j07550
12068a56366A2268J61402e0179A6726p52a8944o382j1675G1414N00809M84186
12057A056409l63522A06785D3027J37968E9902J36473a76907D93K8896f8804F3565
12045d8184A64701A1464a26515I535g5000C32568i9670A3789L8397J09088f9946
12033a07175b2007j35966k7016a2558F4136P2175L19617a78787C0906J57495a32847
$$ plain form
12114 -306997 -127205 -24166 160018 107534 260738 102142 190960 60405 4116 -289204 754
12102 -238063 -115639 44062 111158 168870 -252349 19611 -287078 -199646 -3886 219272 -45773
12090 221562 213695 -222356 -133683 -41921 -129164 121061 -19519 166498 -37525 -180431 238668
12078 49417 172833 324193 106556 -213428 38824 -60155 144540 -146661 -48816 -156366
12068 -156366 12268 173670 -50179 16726 15974 -18944 -25326 -37001 71414 572223 1056409
12057 1056409 692887 106785 43027 180995 59902 196375 -176907 493 29389 -68804 63565
12045 -48184 164701 11464 -126515 9535 -75000 332568 -99670 13789 52186 161274 -69946
12033 -107175 -22007 -157973 -184989 -12558 64136 136311 455928 -178787 30906 188401 -132847
12021H6049J170a98277e1671j5312A1631c57385G88c55214I8975l68q207h2813
12008a19165A15971h3065A02626K65516H5494P2926a16479K492a759D413d0305
11996A81824N9932G4810C4271a17150B04714a43939B09095J6873b15659a4486
11985B58478b04524A08339m2164a44606f0728C29441B9857b40836k5488A4739
11974A36377e8227k0254k07708B19250b37904B15029o7581g9411A1497d6277C649
11962B63358a80231m1237h9073j18774f2002B76396a30208k32859B03892l6747
11952A67145K21204A1166J05894g8646E781K1703J52358o0478a92932C440K12891
11941B16331A05885L05438A16280n1243d44k67851A63463R1573A2219K00795a09706
$$ plain form
12021 86049 87219 -198277 -51671 -66983 11631 -357385 788 -355214 98975 98607 90400 -82813
12008 -119165 115971 -83065 102626 368142 85494 158420 -116479 -113987 -1759 4413 -40305
11996 181824 241756 74810 34271 -117150 204714 -143939 209095 225968 -215659 -14486
11985 258478 -204524 108339 66175 -144606 -60728 329441 29857 -240836 -266324 14739
11974 136377 -58227 -78481 -286189 219250 -237904 215029 147448 -79411 11497 -46277 3649
11962 263358 -180231 -221468 -89073 -207847 -62002 276396 -130208 -363067 203892 167145
11952 167145 388349 11166 117060 -78646 5781 27484 179842 119364 -192932 3440 216331
11941 216331 105885 411323 116280 65037 -444 -268295 163463 255036 12219 213014 -109706
11929I0675c10937e6361j69797a507k0674B12859a08918m9997B50903i0405d0039
11917A00857a02807M1357j46118G7571l1274i0085A26895Q59J33704j22559a75190
11905A68715N592J0676q7302a95588O2437C8815J33094j2037l6775d8190B14222
11893g2591j07250H0493a5359m9955A27571J94484c2540k78484E3606K130j3027
11882D2709K3965D980f0617k35858A03715J04647I6100h687A47323c992j05882
11871a09874F102M31107b44747a04181q7700C4078J96236A986J81811c96271E0244
11859b43538c7151k26832B03007a62077B1058b52155L5411j5101c7671j03367
11849a41038C13737d20861a82794M9752p0069H2104h2995c0795D662J00432a02519
$$ plain form
11929 90675 -310937 -56361 -226158 -1507 -22181 212859 -108918 -158915 250903 -90405 -40039
11917 100857 -102807 -61450 -207568 77571 46297 -90085 126895 127754 261458 138899 -175190
11905 168715 174307 184983 97681 -195588 -133151 38815 171909 159872 123097 -48190 214222
11893 -72591 -179841 80493 -15359 -65314 127571 322055 -32540 -311024 53606 55736 42709
11882 42709 66674 4980 -60617 -296475 103715 208362 96100 -8687 147323 -3992 -109874
11871 -109874 6102 437209 -244747 -104181 -191881 34078 230314 1986 183797 -396271 50244
11859 -243538 -37151 -263983 203007 -162077 21058 -252155 -216744 -231845 -37671 -141038
11849 -141038 313737 -420861 -182794 -133042 -203111 82104 -82995 -30795 4662 105094 -102519
11837d1926k36239J1947g6533B7222K99562a47698G5807J18108b185F6748N9214
11826A25962d10796i5643E344Q9385C1718g5008j01938j43073a10189c7504j91672
11815b29176o3730g3437k16967J26670c9398r6181j4647I0770f4547B04014a12267
11803c3438A48576a73086f7577J4086o9001m9809A19640K78278d23054A27578
11792a93316D58887a90546A57357a06755d5584a9672r2743A44146o8487K6863
11782A02522O6932M799J3316a02649E6783J30167a70839r9439o9096A28920i8759
11770a56867A71266b66177b6984A2232K0764J97203a53119R46B82732j27165D8944
11758a5723C3164P958b40221A69858e144A53910J1009p3586M6467f9156j46991
$$ plain form
11837 -41926 -278165 -266218 -76533 27222 326784 -147698 75807 193915 -2185 66748 125962
11826 125962 -410796 -95643 5344 94729 31718 -75008 -176946 -320019 -110189 -37504 -229176
11815 -229176 -292906 -73437 -290404 -163734 -39398 -135579 -150226 90770 -64547 204014 -112267
11803 -33438 148576 -173086 -67577 -53491 -122492 -172301 119640 397918 -423054 127578
11792 -193316 458887 -190546 157357 -106755 -45584 -19672 -112415 144146 75659 102522
11782 102522 169454 174253 187569 -102649 56783 186950 -170839 -270278 -339374 128920 -98759
11770 -156867 171266 -266177 -26984 12232 32996 230199 -153119 -152173 282732 155567 48944
11758 -15723 33164 41122 -240221 169858 -5144 153910 164919 91333 137800 -69156 -216147
11747b16147B00085a43466E4209E312J37207e3125G2901K93715c9646j60467O6207
11736a33906d9444D5186a34985A18138b70413A56392a44119A84383n946M9037
11726B27474A886f1546E612J56649o7266g0597j1365k91862B26639j09088b85856
11714a10208c904r867A23967g7217F5074J30448G7241b02985b15j23486B0920
11702I8083c45443a00983d1438j92125B3294M33725C3650a99977a1955A50309
11691B54855a63557m4544A72894K0222J61227C5634b13795A16734d8653H2498
11680C15214a5640A12650d54763J97662r6084d9741l6615E6021j9650J74693a87548
11668B80217b22264J8444P9520L6091A656M238b45964A97944a94599D4882K1817
$$ plain form
11747 -216147 200085 -143466 54209 5312 142519 -53125 72901 366616 -39646 -200113 -133906
11736 -133906 -49444 45186 -134985 118138 -270413 156392 -144119 184383 178437 227474
11726 227474 1886 -61546 5612 162261 94995 -70597 -81962 -373824 226639 117551 -285856
11714 -110208 -3904 -13771 123967 -77217 65074 195522 77241 -202985 -215 -123701 20920
11702 98083 -345443 -100983 -41438 -233563 23294 457019 33650 -199977 -11955 150309
11691 254855 -163557 -208101 172894 193116 354343 35634 -213795 116734 -48653 82498
11680 315214 -15640 112650 -454763 -257101 -353185 -49741 -86356 56021 36371 211064 -187548
11668 280217 -222264 -203820 -124300 -88209 1656 5894 -245964 197944 -194599 44882 66699
11657F6699P6437N9600a00547I4205J43363h6243A82279C2827b34483l6663K9753
11646b41393h7435F2124a36158A4822K15127h7889B31760r2194Q574c45423A71834
11634d8626E4246b38850A25029J37792G7249g4524j18910A01167a65982C3670
11623A63269k0399F8252a44841e0554B1844J64001d650A16877J1220b91929d5174
11611a34576c9886B0289b42337E8943q057a94808C3985b11429R8910C41877j34743
11600B07134m2813h683K734n004H5874c15053G4455Q2524l9594a98952j00937
11589b99889A17667M6607c0587j74552a02284c6354r4843M9462I0824a2193j13134
11578a25327j78854b4683k69305A47111C0566K05812p543d40775c6066k51485
$$ plain form
11657 66699 143136 202736 -100547 94205 237568 -86243 182279 32827 -234483 -271146 -241393
11646 -241393 -87435 62124 -136158 14822 229949 -87889 231760 139566 148140 -345423 171834
11634 -48626 54246 -238850 125029 262821 77249 -74524 -193434 101167 -165982 33670
11623 163269 142870 68252 -144841 -50554 21844 185845 -4650 116877 128097 -291929 -45174
11611 -134576 -39886 20289 -242337 58943 50886 -194808 33985 -211429 -112519 341877 207134
11600 207134 164321 -8683 -5949 -10953 85874 -315053 74455 156979 117385 -198952 -299889
11589 -299889 117667 164274 -30587 -205139 -102284 -36354 -131197 -81735 90824 -12193 -125327
11578 -125327 -304181 -24683 -293988 147111 30566 236378 228835 -440775 -36066 -287551
11568b87551D9450h7933C05276h6200j39960D2621L863J17796b28117N5855p2915
11557b45177A48257n8813M2911c4114B95747b65307m1310g8358r4393A8023J93319
11546B11342j02068K4183l337j4906F270a26761j56334b3439A22866a03o6065
11535f6168I9194M8399G2643a55054C28053i1390D1017c431j31941F6227a60871
11523D02769d7825D9796a54299p5538A6750J9013J74709e4745m2712A02439a660
11511b1098j07684C89690a52483o8248P2888A07208a37368k59312D06445a8708
11500A78556B9531L31916a22593g596A29601a32994L282D96625A35120J5266J8337
11489A68723B7506R9076N6789a28168A39368e9599D3909B1176M4306a37680E1910
$$ plain form
11568 -287551 49450 -87933 305276 -86200 -226160 42621 46484 164280 -228117 -172262 -245177
11557 -245177 148257 89444 132355 -34114 295747 -265307 -306617 -78358 -172751 18023 211342
11546 211342 109274 133457 130120 115214 6270 -126761 -283095 -23439 122866 -103 -66168
11535 -66168 99194 147593 72643 -155054 328053 -91390 41017 -3431 -135372 66227 -160871
11523 402769 -47825 49796 -154299 -229837 16750 35763 210472 -54745 -97457 102439 -1660
11511 -21098 -128782 389690 -152483 -220731 -147843 107208 -137368 -396680 406445 -18708
11500 178556 29531 361447 -122593 -7596 129601 -132994 -129712 496625 135120 150386 168723
11489 168723 27506 126582 183371 -128168 139368 -59599 43909 21176 65482 -137680 51910
11477A11424b2846B70140G8828J59716J72821a1779B17947c1756D5260J03728
11467A48988C6218L9239C6867a99061B74165d8538A06430a77540A2974d3905A25351
11455d6608D75546a59065H4173e9079A29599a86814H4389e7685B64452a80063
11444d4082A62368j0561c48498A17279m3240P8353a9431k0749B2049a94754e8204
11432b23701F2651a22764E4757j8224b25812B7007J75651j4218J70133A00441
11421B59602D1460J36205a64918q85A580i3238q4842I1169a23448B57c6429A04950
11408d1841A89206A8525i3243E4766A6113J15006a02465j02314B5613c9511B69300
11396F1786J47379a99377h3179A21935A5388J42821g5798A01382C6117J6969k95
$$ plain form
11477 111424 -22846 270140 78828 238544 411365 -11779 217947 -31756 45260 148988
11467 148988 36218 75457 36867 -199061 274165 -48538 106430 -177540 12974 -43905 125351
11455 -46608 475546 -159065 84173 -59079 129599 -186814 84389 -57685 264452 -180063
11444 -44082 162368 151807 -348498 117279 74039 152392 -19431 -40180 22049 -194754 -58204
11432 -223701 62651 -122764 54757 36533 -225812 27007 202658 188440 358573 100441
11421 259602 41460 177665 -164918 -165803 1580 -93238 -178080 91169 -123448 257 -36429 104950
11408 -41841 189206 18525 -93243 54766 16113 131119 -102465 -204779 25613 -39511 269300
11396 61786 209165 -199377 -83179 121935 15388 158209 -75798 101382 36117 53086 52791
11385E2791a59193C3026Q0296b43570d9447k31993d352k29049C19608f9880q0333
11374a50213K6320B68455c40732i5326I6090D032J61277f2029G8322K39914j03339
11363B14897E9650d06681i0885C0863P2651a76228A6763J66583i9519A43420E8838
11351A00855a56693d5390j36599A44634G0845l220b08679K0120l4827D1170b23123
11339h8725P422C18719b7706o3158R330C3020J61588H6626a5422B95533E6810
11327A39259K14868a21163F3359K12963h6710A26109i2855j97709B2736L39910
11317C62646H9161a49124f2716j36717e705j08798n5205M4053q1900Q348f2691
11305i7003A75791a72985D3118J11618E6909P7456d2106A63500a88261B48058
$$ plain form
11385 52791 -159193 33026 113322 -243570 -49447 -281440 -4352 -233401 319608 -69880 -150213
11374 -150213 -123893 268455 -340732 -95326 96090 4032 165309 -62029 78322 318236 214897
11363 214897 59650 -406681 -90885 30863 103514 -176228 16763 183346 -99519 143420 58838
11351 100855 -156693 -45390 -181989 144634 70845 67625 -208679 -188559 -223386 41170 -223123
11339 -88725 -81303 318719 -27706 -90864 -81534 33020 194608 86626 -15422 295533 56810
11327 139259 354127 -121163 63359 276322 -86710 126109 -92855 -290564 22736 362646
11317 362646 89161 -149124 -62716 -199433 -5705 -114503 -169708 -125655 -207555 -199207 -62691
11305 -97003 175791 -172985 43118 154736 56909 134365 -42106 163500 -188261 248058
11294A65751b3137j60933A4042O7626e3558k17436C1930J64664E5688b7926l49176
11283c77102a64354N0416A48232c07961h9117R064A38531d4912j5336j04772P9620
11272h5400b7869C88427I2894a25772K7040Q448a1149k41250d1963j48733l2999
11261b23695e194B10466a98418k8094C56736c16328a11431n6251N3200H6308c3475
11249C51364p5446b31705G6180g4746F50c44223c8035j45F5669a95958l5203N6516
11237a74645G3895g4071m5883A09504b149j66160m4240K8756r5269J33814n9609
11226b04857Q7679m507D72561H5450M861m0246a45896a0865j70484d522A12355
11214B3346O7742B1793O1396B5673i5160E2495g5389A83341D587Q8617J96646
$$ plain form
11294 165751 -23137 -184070 14042 81668 -53558 -270994 31930 196594 55688 -27926 -377102
11283 -377102 -164354 -113938 148232 -307961 -89117 -80053 138531 -44912 -60248 -165020 -85400
11272 -85400 -27869 388427 92894 -125772 -98732 -90284 -11149 -252399 -41963 -190696 -223695
11261 -223695 -5194 210466 -198418 -226512 356736 -316328 -111431 -167682 -114482 86308 -33475
11249 351364 275918 -231705 76180 -74746 650 -344223 -38035 -38180 65669 -195958 -231161 -174645
11237 -174645 73895 -74071 -119954 109504 -2149 -168309 -212549 -183793 -279062 -145248 -204857
11226 -204857 -117178 -121685 472561 85450 90311 50065 -145896 -10865 -181349 -4522 112355
11214 23346 91088 21793 83189 25673 -95160 52495 -75389 183341 4587 93204 289850
11203B89850e2730A7427c76197h7786l0976A82173F6680P2802C8506K10348j3235
11192B35619b07778i7267d7222a4233q9311j54844a13678j01169h2854c0247m08227
11181d38474A98872C4523J2020a01635c6099B33434E3768J26131d3430A14594
11170d58755I8637D696L02953g4266l69414a51531P47B80297c0950A12175b55249
11158b53701C8036g6939Q335r0792B09633H0576J98946b15989l542E1976g2687
11146B90045i1001j76719a05700G2054b91305J23544A63067e2911B9987J5999
11136D5986J35284G7041b72633i3464K625C24191H9635a0083A77467C7314a33914
11124B44259a91619B61274q5261J6580H5620P2994J12157a4895B10762n5452p0922
$$ plain form
11203 289850 -52730 17427 -376197 -87786 -118762 182173 66680 139482 38506 248854 235619
11192 235619 -207778 -97267 -47222 -14233 -103544 -258388 -113678 -214847 -82854 -30247 -438474
11181 -438474 198872 34523 46543 -101635 -36099 233434 53768 179899 -43430 114594
11170 -458755 98637 4696 307649 -74266 -443680 -151531 -150784 280297 -30950 112175 -255249
11158 -253701 38036 -76939 -68604 -159396 209633 80576 279522 -215989 -219531 51976 -72687
11146 290045 -91001 -267720 -105700 72054 -291305 -167761 163067 -52911 29987 45986
11136 45986 181270 77041 -272633 -93464 -90839 324191 89635 -10083 177467 37314 -133914
11124 244259 -191619 261274 176013 192593 85620 158614 270771 -14895 210762 155310 84388
11113H4388C2206o86e1864j7165p9613D327K28251r8906g1222r7231C47321r6037
11101B51284C6870J99406e1994C72373A01353J12232A03505K68173A8721M0630
11091E9351M693L53205o8205B1882K89924J5188a33699a5867B92189n6577J96200
11080D31812F3086K03917K62831I4474K56129G0850K66963K2603p4622I2261K77611
11069C69872r1616j01319O6954L8352L5480K52181p4208r2583j20807J22548r0178
11058C14676J72682k05918J94109n0268A71352L23608J38558K14401k43596L28759
11048I33082l46277K21140Q821K8890p415j77188L84850n14153M10924k38278
11038G04396J23160j02739O70q0229J0949r6348J45527k03646q1579K7073J21478
$$ plain form
11113 84388 32206 31520 -51864 -69029 -148642 4327 232578 133672 -71222 -168453 347321 251284
11101 251284 36870 236276 -51994 372373 101353 213585 103505 371678 18721 59351
11091 59351 64044 417249 349044 21882 311806 326994 -133699 -15867 292189 235612 431812
11080 431812 63086 267003 529834 94474 350603 70850 337813 360416 285794 92261 369872
11069 369872 278256 176937 243891 282243 317723 569904 495696 403113 282306 404854 314676
11058 314676 487358 281440 475549 425281 171352 494960 633518 847919 604323 933082
11048 933082 586805 807945 816766 845656 838241 661053 1045903 531750 942674 704396
11038 704396 827556 724817 725487 645258 656207 559859 705386 501740 420161 447234 568712
11027E68712K20633j50627K71083k04121l36653K33513j84150L72216k84450k357
11017E03799O4591p3809K26063k90523q4343A70368L58443L42397l87266K47326
11007G31268A10952M90776J70890k51934j28360k4431M97085k75602K3104L9722
10997F52202q2349B27863L98314K25768C41587K73700M28442l30203j92751L81288
10987I02063j49198J97253K04r0311L04258j24859K36198j11136L40504o5540
10977A439436L86715M28112N73199n6787k02047J43481J00862l08317l82408l46121
10967A776125j05708r8539n90457L5817j9434J82176m14553k3612A51676K48048
10957C99724j85299N6141A17932J01484Q3882A13369c1131A14861C6949J57833
$$ plain form
11027 568712 789345 638718 909801 705680 369027 602540 418390 790606 506156 503799
11017 503799 568390 494581 720644 430121 345778 170368 528811 871208 483942 731268
11007 731268 110952 601728 772618 520684 392324 367893 864978 589376 612480 652202
10997 652202 569853 227863 626177 851945 341587 615287 1043729 713526 520775 902063
10987 902063 752865 950118 950322 860011 1164269 1039410 1275608 1164472 1504976 1439436
10977 1439436 1826151 2254263 2827462 2770675 2568628 2712109 2812971 2504654 2122246 1776125
10967 1776125 1670417 1571878 981421 1017238 997804 1179980 765427 741815 151676 399724
10957 399724 214425 270566 117932 219416 303298 113369 -31131 114861 36949 194782
10947A94782J30186j8137A16860d2090E3828a84476g2272l2050q0589B37882A716
10935A85910r1184a412C1908a30963d0165B15810B5535P4593a8321B40257L9739
10924B79996G1654e4091k15918h4609G3602L5183f4271j94348A33566k8882h5834
10912b08692I4175a77570j26994J17764b1184A95416C3388L47897A45104O5410
10902B10514a96849h8222A52066b4665j22822A14230k6617b09232M9707A36124
10891c9592j34047j49239a29148C6852a26122k03655A07818a91319K5294G2186
10880A07008i3955p7926B280K8766K8537a84617O1678b1429E9229j3341j2072
10869C3816a3679A35803b06702m3205m19963A70399a75284j10726Q1338b5841
$$ plain form
10947 194782 324968 306831 116860 -42090 53828 -184476 -72272 -104322 -184911 237882 1716
10935 185910 94726 -1412 31908 -130963 -40165 215810 25535 100128 -18321 240257 279996
10924 279996 71654 -54091 -270009 -84609 73602 108785 -64271 -258619 133566 104684 -85834
10912 -208692 94175 -177570 -304564 -186800 -21184 195416 33388 381285 145104 210514
10902 210514 -196849 -88222 152066 -24665 -147487 114230 87613 -209232 -159525 136124
10891 -39592 -173639 -322878 -129148 36852 -126122 -329777 107818 -191319 -166025 72186
10880 107008 -93955 -171881 2280 31046 59583 -184617 -122939 -21429 59229 45888 33816
10869 33816 -13679 135803 -206702 -249907 -669870 170399 -175284 -286010 -204672 -25841
10858B03439e7722K2483M527B33399a89330k1786A34156a45206L731d7530m3552
10847i1082j60297n2183B26521n6436c94404A83759c10940f5917B7378J51865
10837A79243b06639A11744A1747c07602A05881b08182e4107N41j217B87336d32425
10825C8206a23868C31699G4812b04519A44234k2987a24679p5563B20611k0165
10815B00446h7412b0904j45709F827b41139A8731h7819A33627B3451R0490A5277
10803c67005d6304j74853e4505n6878j62093e9662q19B05212j01646J414d0084
10791A73661J38481q4556a03701I5737l9038J59525b20433j16836B06137c73964
10780H5322a12611M3129p5875O5667C2557J21850a15926B6939a31915d3114j73004
$$ plain form
10858 203439 -57722 -35239 -30712 233399 -189330 -211116 134156 -145206 -141475 -47530 -91082
10847 -91082 -251379 -303562 226521 170085 -394404 183759 -310940 -65917 27378 179243
10837 179243 -206639 111744 11747 -307602 105881 -208182 -54107 -53566 -54783 287336 -432425
10825 38206 -123868 331699 74812 -204519 144234 121247 -124679 -200242 220611 200446
10815 200446 -87412 -20904 -166613 6827 -241139 18731 -87819 133627 23451 113941 15277
10803 -367005 -46304 -221157 -54505 -111383 -273476 -59662 -60481 205212 103566 104980 -40084
10791 173661 312142 227586 -103701 95737 56699 216224 -220433 -337269 206137 -373964
10780 85322 -112611 -69482 -145357 -79690 32557 154407 -115926 26939 -131915 -43114 -216118
10769b16118a00615A1319a89354n4276A3233L7826a16495H1298b28356B49276
10758a78404Q6333C31200j43969b10032d4746D2917a75521A93511l9830O8559
10748B22240I8364b07333B7591a95037B1028L95173i1630K7881A63878g2698q8625
10737a61323B4190K02538I9701h883j22587n7282Q8540q2764B6283L1871A8396
10725c32363f3252q3002H8863b00441F2046b5363F1878N0630J22584c78027J1938
10714c66089B06648G603J14266a79000f5109L0018N777C15329f7403j18999H9412
10702B66629a81314L7343E8289b15717A65717D9500r796d2092A4759K2400K25775
10691B62934r9710b88734i6928j53364D3746c33042A3323b39084C41884A50727
$$ plain form
10769 -216118 -100615 11319 -189354 -243630 13233 51059 -116495 81298 -228356 249276
10758 -178404 -92071 331200 187231 -210032 -44746 42917 -175521 193511 153681 222240
10748 222240 98364 -207333 27591 -195037 21028 416201 -91630 -63749 163878 -72698 -161323
10737 -161323 24190 226728 99701 -8883 -131470 -188752 -100212 -182976 26283 58154 18396
10725 -332363 -63252 -146254 88863 -200441 62046 -25363 61878 112508 235092 -378027 -366089
10714 -366089 206648 7603 121869 -179000 -65109 -35091 -29314 315329 -67403 -186402 89412
10702 266629 -181314 -143971 58289 -215717 165717 49500 39704 -42092 14759 37159 262934
10691 262934 163224 -288734 -96928 -250292 43746 -333042 13323 -239084 341884 150727
10680A10457H690b63522e1924I4194c80830A5209K56190F6586f3477D1603a23734
10668g2404B1278b54671j7087F0812l0273b63510k9709A4161c42677a44501j89837
10657c34338j17553D4605b70161A5403J34443K11278b13921a03448k21704J62333
10647a62819j07206a28206e7116b0501k0931l0572b2381N912j95921b5387B1047
10635g2917L642K2684k92955j22686A65395d72618b1867D9353g7326I4009K21676
10624C15685e1813o6117K4398R12m3850j04631o3188B12597a65195l413n9963
10613b28571R2094B0436L25774A46067g9448B0936J56871a30802D6188a17384
10602d27013a1805j22645j2475I8671b32947A27533a05459A72932d42270i8576
$$ plain form
10680 110457 8690 -263522 -51924 94194 -380830 15209 271399 66586 -63477 41603 -123734
10668 -72404 21278 -254671 -271758 60812 30539 -263510 -293219 14161 -342677 -144501 -334338
10657 -334338 -451891 44605 -270161 15403 149846 361124 -213921 -103448 -325152 -162819
10647 -162819 -270025 -128206 -57116 -20501 -41432 -72004 -22381 -16469 -212390 -25387 21047
10635 -72917 -69275 -46591 -339546 -462232 165395 -472618 -21867 49353 -77326 94009 315685
10624 315685 -51813 -117930 -93532 -92620 -136470 -241101 -304289 212597 -165195 -168608 -228571
10613 -228571 -136477 20436 346210 146067 -79448 20936 177807 -130802 46188 -117384
10602 -427013 -11805 -134450 -146925 98671 -232947 127533 -105459 172932 -442270 -98576
10591c09168K3531K9840P3452M6344o7423k4443A04653g6556C3844K6493c3030
10579d6027o0736K1037r0955B2216L19473j43189a95155a5249p2624A16263l9065
10568G7198a7166A94418l236c1931k4395k8907A7450b8779B07717b55170j63230
10557d18400F4055d2065a5578j92013a6565l41648G2393R3296d402B05129b07689
10545C9640f4330c1909k21153d5356B13318b28276J0766c7175j61524B11323o6886
10534A44437F5076J27179d3227F1137f662C71503d40239G0231K28730A19024m1249
10523G7775J49736c88405A80553m1983K5304K33496L6385f4291G3913b40166D09184
10511b53138A65191a83003F0182b53613Q9830A06138a0616j5758k71699g1256
$$ plain form
10591 -309168 -285637 -255797 -182345 -136001 -203424 -227867 104653 -76556 33844 60337 -33030
10579 -46027 -106763 -85726 -176681 22216 341689 198500 -195155 -15249 -87873 116263 77198
10568 77198 -17166 194418 191182 -31931 -56326 -85233 17450 -28779 207717 -255170 -418400
10557 -418400 64055 -42065 -15578 -207591 -16565 -358213 72393 165689 -4402 205129 -207689
10545 39640 -64330 -31909 -253062 -45356 213318 -228276 -217510 -37175 -198699 211323 144437
10534 144437 65076 192255 -43227 61137 -6662 371503 -440239 70231 298961 119024 77775
10523 77775 227511 -388405 180553 138570 163874 397370 433755 -64291 73913 -240166 409184
10511 -253138 165191 -183003 60182 -253613 -163783 106138 -10616 -26374 -298073 -71256
10500c7629k08115J10672F5605g2248A50784f5601G9632L4154a98245R4736A47123
10488c96368A82286o5426a86954l22077C60350H2346L78559d63556H4434a91340
10477A6741B650J10767P2292h6852p7476D52198f49414a54213O957j0734B1857
10465g577A01806f3721K5889C9056c19405Q043A7702b1317G8734a74574l6059
10454b10633D5675b6147k23427i5219o5869L9830C82170c76178M9732a22102B95559
10442A44886i150B29373A1032e2414B41799H9757a91528h8022H3963L4723l2605
10431H6081a67871B58797h9562K5751G2848c10924D29142c05245A06904a19423
10420b26165A52616k9274J75749H9079J63429g5304n4158K9198A51905a63990
$$ plain form
10500 -37629 -245744 -135072 65605 -72248 150784 -65601 79632 113786 -198245 -103509 147123
10488 -396368 182286 116860 -186954 -509031 360350 82346 460905 -463556 84434 -191340
10477 16741 2650 113417 185709 -86852 -164328 452198 -649414 -154213 -147256 -157990 21857
10465 -7577 101806 -63721 -37832 39056 -319405 -311362 17702 -21317 78734 -174574 -210633
10454 -210633 45675 -26147 -249574 -95219 -161088 -121258 382170 -376178 -326446 -122102 295559
10442 144886 -9150 229373 11032 -52414 241799 89757 -191528 -88022 83963 118686 86081
10431 86081 -167871 258797 -89562 -63811 72848 -310924 429142 -305245 106904 -119423
10420 -226165 152616 123342 299091 89079 252508 -75304 -129462 -100264 151905 -163990
10409a4042p2304C2123a92640c9907A7521J2850b86696d8523C46229n3027H441
10397e4717r3303B00663F1292P9023o6209K73221a85550D66675c8238j0591C5823
10385A02051h4619J3662C57447j8754g4986A4390K01540P4324g8346C5301a49390
10373a31889C88989e1741C08774K60052G4446N48688B54929M63123k42800l0755
10363D44497F8143b27474G0657J24902J68744A5120M20581a6722A17321L19791
10353D37112l5718N9346J75602n5200B22735N4189O3113E6674J19204a18365J6214
10342a02151I9403K04346r7151L2459I3723L2353l4674L40627h7789B18735c8245
10330b92757B900M0606a37314B7868L4962L38754A50086J14928p6628M8489k9482
$$ plain form
10409 -14042 -86346 32123 -192640 -39907 17521 30371 -286696 -48523 346229 293202 8441
10397 -54717 -148020 200663 61292 140315 74106 347327 -185550 466675 -38238 -48829 35823
10385 102051 -84619 -70957 357447 338693 -74986 14390 215930 290254 -78346 35301 -149390
10373 -131889 388989 -51741 308774 568826 74446 623134 254929 718052 475252 444497
10363 444497 68143 -227474 70657 195559 364303 15120 435701 -16722 117321 437112
10353 437112 401394 460740 636342 581142 222735 276924 340037 56674 175878 -118365 -102151
10342 -102151 99403 303749 206598 239057 93723 126076 91402 432029 -87789 218735 -38245
10330 -292757 2900 43506 -137314 27868 62830 401584 150086 265014 188386 236875 207393
10319B07393j7728i8295l5805B82967a59847A04100D2294L58241b25253i4159
10308b22015M1274G1729J8265L2432a1469G0731a21940r496e7390j02007l1028
10297a90425A20453b2673A12035K76197F8829K30360c29855a03980j95209e097
10286E2531f8103R662o1755c921k97269F3987l17b65484B6271c18230A69707h0785
10273B11271I388a33454k1988B84670B8119a68454j6957Q0758B65873A16885J2925
10262A29810j5145c4108B14015m9409k8437n7181a57095B20740d4727l29151I2643
10250h5456d2361o6567M5503D2265N6543a46767A26723J78897g6747A29961c16166
10238B34492e2997k96041B7946P08J26959b91850c4846m697j22986D8199a62441
$$ plain form
10319 207393 189665 -98295 -134100 282967 -159847 104100 42294 400535 -225253 -94159
10308 -222015 -180741 71729 89994 122426 -11469 70731 -121940 -131436 -57390 -159397 -190425
10297 -190425 120453 -22673 112035 388232 68829 299189 -329855 -103980 -299189 -5097
10286 52531 -68103 -58441 -120196 -3921 -301190 63987 63670 -265484 26271 -318230 169707 -80785
10273 211271 9388 -133454 -155442 284670 28119 -168454 -185411 -104653 265873 116885 129810
10262 129810 114665 -34108 214015 164606 136169 78988 -157095 220740 -44727 -373878 92643
10250 -85456 -42361 -108928 -63425 42265 98808 -146767 126723 305620 -76747 129961 -316166
10238 234492 -52997 -349038 27946 28654 155613 -291850 -34846 -39543 -162529 48199 -162441
10226a17546d6772f235C5161e2851D9682a63749P7379o2911A62495F6865c85399
10214A372L47288H5137c60990a09732e0467n5510A35527B0821a53923D3187b37419
10202H2995b14940B6253K10494A9705c2873n0697H7808k8842b1246j80346B21052
10190F3588N30Q1339E00a23881k14957C67155a53375q0298i8616A50085o7002
10179H3083L701b5861D3835J8497a74132B05760b31238F6937b44370j6353B17766
10167c80348A66458g6773L2947C75971a70691e6431C9886M0971c78572A73493
10156A25647a05748j22303h2104j59393R5502j51165J44774a4589B25951a79985
10145a83271d8421N522k71607a01283M9756A65690G9719c2122A89549e6844b0382
$$ plain form
10226 -117546 -46772 -6235 35161 -52851 49682 -163749 -86370 -149281 162495 66865 -385399
10214 1372 348660 85137 -360990 -109732 -50467 -105977 135527 20821 -153923 43187 -237419
10202 82995 -214940 26253 236747 19705 -32873 -83570 87808 58966 -21246 -201592 221052
10190 63588 64118 145457 500 -123881 -338838 367155 -153375 -233673 -98616 150085 83083
10179 83083 86784 -25861 43835 62332 -174132 205760 -231238 66937 -244370 -260723 217766
10167 -380348 166458 -76773 -43826 375971 -170691 -56431 39886 80857 -378572 173493
10156 125647 -105748 -228051 -82104 -241497 -145995 -297160 -152386 -14589 225951 -179985
10145 -183271 -48421 -42899 -314506 -101283 -51527 165690 79719 -32122 189549 -56844 -20382
10133b10799B07918c6700k37444d7290B94741b49739R1145j39833M2031C72152
10122b29215A98745b58743L977A881i0067J1843C4589J46020f3233p5286d6088
10110d07694A38342g2778A60027N1781b8859l11653d0012l36522a83216j16780
10100b99996L7834I4221b62520B70931a01114j257A4410a76829h1131A58795e23772
10088C44289b98172B9306J5498c8586j8231B83201a68600g7599k34251B5438r268
10077A6170i4955j19569D1152b36418a16629a0017C37257b14429D275a91324E5948
10065c4710l50067l65269E2135c34336F5106b8856l9653L1231E2633R401k8991
10054C3043J8420R3265D8004a62434m0953c6741k22346P4204A82737B6154a64237
$$ plain form
10133 -210799 207918 -36700 -274144 -47290 294741 -249739 -158594 -298427 -256396 372152
10122 -229215 198745 -258743 -254766 1881 -90067 -78224 34589 180609 -63233 -138519 -46088
10110 -407694 138342 -72778 160027 211808 -28859 -340512 -40012 -376534 -183216 -299996
10100 -299996 -262162 94221 -262520 270931 -101114 -102371 14410 -176829 -81131 158795 -523772
10088 344289 -298172 29306 44804 -38586 -56817 283201 -168600 -77599 -311850 25438 16170
10077 16170 -94955 -214524 41152 -236418 -116629 -10017 337257 -214429 4275 -191324 55948
10065 -34710 -384777 -750046 52135 -334336 65106 -28856 -68509 -37278 52633 62034 33043
10054 33043 51463 144728 48004 -162434 -203387 -36741 -259087 -184883 182737 26154 -164237
10042B24570r7383o0452a43832H5411J02811b94522A49877C8401J67611g4607
10031b04499c4168A2043a40281E3144N8947C761a55799B9369J3273L15762A0611
10019f0866n3503j07081K8330C11467A39086a40895r6333B7036d2848k94919g3586
10007a87190h7609J9464j15813g7103B49796a26725E6808i350l98624G6722g1854
9995H6474a72748f8741j97352a29492A94072B9282K07932A03241b74366H0064
9984b41433R0466O2543B03441C4719M0945d8848r5182A76533g4516A74163J6133
9973A90296b4714B6803J30040c9755j36292a5733k27130d1073C7966R1262b28842
9961a7879k25328P7008J710H6227a15567c8276l68080a18765C70072A03829B2498
$$ plain form
10042 224570 127187 66735 -143832 85411 188222 -294522 149877 38401 206012 -74607
10031 -204499 -34168 12043 -140281 53144 112091 3761 -155799 29369 42642 358404 10611
10019 -60866 -114369 -221450 -193120 311467 139086 -140895 -237228 27036 -42848 -337767 -73586
10007 -187190 -87609 -68145 -183958 -77103 249796 -126725 56808 -9350 -407974 76722 -71854
9995 86474 -172748 -68741 -266093 -129492 194072 29282 237214 103241 -274366 80064
9984 -241433 -150967 -88424 203441 34719 75664 -48848 -144030 176533 -74516 174163 190296
9973 190296 -24714 26803 156843 -39755 -176047 -15733 -242863 -41073 37966 129228 -228842
9961 -17879 -243207 -166199 -164489 86227 -115567 -38276 -406356 -118765 370072 103829 22498
9949h6152B72803a62938R644m2032k03110a80598A58726a19880k96952a18594
9938H2725L2039B7542J02148A6606J5692a07808d8679B58382c72957h0947j93335
9927b74282f1770E634a59050f8148E4192L1896D1912L1120N7042J17819i4965
9915c58396Q3505N7431g9258k0905K2527B04455e6641p0969q372O7743K9888D1965
9902A70659B8919b34200D7960c90046h4099C49730F475b29813A76716o76c28496
9890A87859a31753O462j1398B45840a45392B0963Q0075d61167J97454B49233p4545
9879A74688h8825j34223b7159j31102e1862h515j89346B23239m6614C0894K66849
9868B97743n9761d9681A4487a74415A06163i7731A51670f1268j34584J5532m5172
$$ plain form
9949 -86152 272803 -162938 -153294 -195326 -398436 -180598 158726 -119880 -416832 -118594
9938 82725 114764 27542 129690 16606 32298 -107808 -48679 258382 -372957 -80947 -274282
9927 -274282 -61770 5634 -159050 -68148 54192 86088 41912 73032 130074 247893 -94965
9915 -358396 -274891 -217460 -79258 -100163 -77636 204455 -56641 -127610 -135982 -68239 -38351 41965
9902 170659 28919 -234200 47960 -390046 -84099 349730 6475 -229813 176716 176040 -328496
9890 187859 -131753 -125291 -136689 245840 -145392 20963 101038 -461167 -263713 249233 174688
9879 174688 -88825 -223048 -27159 -158261 -51862 -8515 -197861 223239 176625 30894 297743
9868 297743 237982 -49681 14487 -174415 106163 -97731 151670 -61268 -195852 -180320 -225492
9857b25492i5128j84599J29657B77303b17830o1432P6496J1965Q4909j55026d7388
9845i3602H6532M6389a97492N6834j99500h914A08853D8843j2919b2842B19666
9833B29356b04197q3256M9485L7822C08885A49008b2268k16772A37240b39154
9822B2204J28518a60903b2084k33367i7542H7540N7734d9508m7550B06219o3360
9811A42859e7032k35041A99729b55808a9830A50199o1662a99460J1141E8288f3506
9799a24516H4074J0253c42477A1431K05229j04628a61378A60458b13712J05501
9789a08211l0419e4360j57983F4384i510j39189c3123l4117r5960A79932a56639
9777a05898R669m4451j01712g3870k23080L8095A33849a14842A01790a08303B21527
$$ plain form
9857 -225492 -95128 -279727 -150070 277303 -217830 -279262 -202766 -190801 -105892 -260918 -47388
9845 -93602 86532 132921 -197492 -140658 -340158 -8914 108853 48843 35924 -22842 219666
9833 229356 -204197 -287453 -237968 -200146 308885 149008 -22268 -239040 137240 -239154
9822 22204 150722 -160903 -22084 -255451 -97542 87540 145274 -49508 -97058 206219 142859
9811 142859 -57032 -292073 199729 -255808 -19830 150199 88537 -199460 -188319 58288 -63506
9799 -124516 84074 94327 -342477 11431 216660 112032 -161378 160458 -213712 -108211
9789 -108211 -138630 -54360 -212343 64384 -9510 -148699 -33123 -67240 -163200 179932 -156639
9777 -105898 -96229 -140680 -242392 -73870 -296950 -258855 133849 -114842 101790 -108303 221527
9765D956K44241i7807a7642G1014J61618h0475j87499A74101e8094p6386d8713
9753d6769G7279L4466a46138c9670C63252G705K00538a8193A26536a23102L3582
9742h9520j19952j54855a71822N9738A00651b89876A23908a2223j69377A94979
9731c8842g575H1593b4859D6172c6818A42881K5505m9297a26584C9824b6516j0012
9719c6528f386j11963A9738g0701o1047A14577b6796B68222C6383M4571b84971
9707f3979j6498g911j2293j98196E6496b30108A48479J60956b08036I587c78720
9695c26856a15083k36517a60274b6114A3228c01295m4714d2529D2794K2419b7442
9683c15537d9126j9816j10271D0030b292j4129q8548A68180a49763H1866b05k40746
$$ plain form
9765 4956 249197 -97807 -17642 71014 232632 -80475 -267974 174101 -58094 -134480 -48713
9753 -46769 77279 111745 -146138 -39670 363252 7705 208243 -18193 126536 -123102 -89520
9742 -89520 -209472 -364327 -171822 -112084 100651 -289876 123908 -12223 -181600 194979
9731 -38842 -7575 81593 -24859 46172 -36818 142881 168386 119089 -126584 39824 -26516 -36528
9719 -36528 -6386 -118349 19738 -70701 -131748 114577 -26796 268222 36383 80954 -284971
9707 -63979 -80477 -7911 -20204 -218400 56496 -230108 148479 309435 -208036 9587 -378720
9695 -326856 -115083 -351600 -160274 -26114 13228 -301295 -346009 -42529 42794 65213 -27442
9683 -315537 -49126 -68942 -179213 40030 -2292 -16421 -104969 168180 -149763 81866 -205 -240951
9671b40951B7330c91247B77175a647A2460J60166a52224O3714k22369B7370c1496
9659B27152c1587j10285G9981a16546A54817J57216C9539b3137o2410n0432E2845
9647a04269m6888m9968L0845B47415a49738j24430A009J33192a62107b0783B94127
9635F1801m578a26983B3269J13995E4364b59455m0763o9047a10831A90050a32079
9623A5313R4908f1469o313k9518G4950b64982c3479j05969k2741A54653J81950
9612C36603p8940l9947E034a77974A42266b1007m9550j07315B82178b96288F9712
9600a72804C625J10648C0476b06963C019i4623A17692b224E0579i2375p102l86
9588i9863M535a4178k0952A98628a16263j00683E2665Q9996a02276k06907Q2139
$$ plain form
9671 -240951 27330 -391247 277175 -1647 12460 172626 -152224 -88510 -310879 27370 -31496
9659 227152 -31587 -141872 79981 -116546 154817 312033 39539 -23137 -85547 -135979 52845
9647 -104269 -151157 -201125 -170280 247415 -149738 -274168 1009 134201 -162107 -20783 294127
9635 61801 57223 -126983 23269 137264 54364 -259455 -300218 -369265 -110831 190050 -132079
9623 15313 110221 -61469 -67782 -97300 74950 -264982 -33479 -139448 -162189 154653 336603
9612 336603 257663 217716 5034 -177974 142266 -21007 -70557 -177872 282178 -296288 69712
9600 -172804 3625 114273 30476 -206963 3019 -94623 117692 -2224 50579 -92375 -99477 -99863
9588 -99863 -95328 -14178 -35130 198628 -116263 -216946 52665 142661 -102276 -309183 -227044
9577b27044e6318k44078q3525A20485a51274B83845a03103c2438l16134Q9565
9567b59007J20681f8998p6830C237b26575A62300A6775a87075f9540A38469d2337
9555a32580B97579b85249A19660g5663l74209a48705k25688A39234e0152B2271
9544a37684o0921m796F8463g8499E5067a07134n6120M8006a531j53170A45392
9532e2497j29978M1549j10466J13467A2040c5476j0838I8320i0527D8746a83597
9520i2424k91426a37330M9496L8405b985j79339a145A53315a81877a8031j0221
9509b8252j81256n515F7236J1051M387b09172J3086D66719A5859i1739I1265f525
9496A02812b87000b523k06327B27286J7862b38640f8769G943O63a67284j17929
$$ plain form
9577 -227044 -56318 -300396 -383921 120485 -151274 283845 -103103 -32438 -348572 -259007
9567 -259007 -138326 -68998 -145828 3237 -226575 162300 16775 -187075 -69540 138469 -42337
9555 -132580 297579 -285249 119660 -75663 -449872 -148705 -374393 139234 -50152 22271
9544 -137684 -198605 -203401 68463 -78499 55067 -107134 -163254 -115248 -1531 -154701 145392
9532 -52497 -182475 -140926 -251392 -137925 12040 -35476 -46314 98320 -90527 48746 -183597
9520 -92424 -383850 -137330 -87834 -49429 -2985 -182324 -1145 153315 -181877 -18031 -28252
9509 -28252 -209508 -215023 67236 78287 82674 -209172 -196086 466719 15859 -91739 91265 -6525
9496 102812 -287000 -2523 -208850 227286 245148 -238640 -68769 7943 8606 -167284 -285213
9485b85213i9919o3855J6324a5489B66952a3157m4067p8912L4226E2722b10358
9473B0749a14518p3065I675b74440q4353A06624D1515a20406m1242F2496i4504
9461a07847j68887M9988A88721d33509a30138A09716C1388O2040L74121b86002
9450a13981j00159i7737j7791j04673B59564B2012b02455B66092G060M1532J27367
9439A75959l9680a61224j15588C21573a09758B14665c33072a10571A7960e866
9428a84134l3459I7570a05896B43439c18185F4377k4353g9739B336J47604c4068
9416A14402k1178K684b00177d5227F3142N1586a00593l2638j21986i4772H5349
9404A43653b48207B17038G8374N899r204c6488j1830k43488B4824b41358c1568
$$ plain form
9485 -285213 -99919 -163774 -147450 -15489 266952 -13157 -57224 -136136 -101910 52722 -210358
9473 20749 -114518 -187583 9675 -274440 -358793 106624 41515 -120406 -161648 62496 -94504
9461 -107847 -276734 -226746 188721 -433509 -130138 109716 31388 93428 467549 -286002
9450 -113981 -214140 -97737 -115528 -220201 259564 22012 -202455 266092 7060 48592 175959
9439 175959 136279 -161224 -276812 321573 -109758 214665 -333072 -110571 17960 -5866
9428 -184134 -217593 97570 -105896 243439 -318185 64377 40024 -79739 2336 149940 -34068
9416 114402 93224 95908 -200177 -45227 63142 114728 -100593 -133231 -255217 -94772 85349
9404 143653 -248207 217038 78374 84273 75069 -36488 -48318 -291806 24824 -241358 -31568
9392b52286p6513j7589E9574a66570j21486d9658A26954k6523i7043a0615j49734
9381a60349L6691G3970b39290L3099N422c0694A19449M834a37118k46023J49889
9370b33252A45425J87600A14606b06194H6317a40059K7733I1773b01390q4224
9360b85614a41057E7541c97882n1696B30831C3215g6416B8751c50722h65j60494
9349a61359g2107j62108O624b2990B22346K92344a79072A47595B668Q659L22069
9338C33396a26623M909k4509k01656F0136b609n4420a5891C6813A663J13803c34340
9325c7259B415a43627j64625A13943a8591j771n71127C66329b97653a11583r7797
9314b09380B32136j00724J24483f4650j0948j30603p0829e2457k22821C8494a24568
$$ plain form
9392 -252286 -328799 -346388 59574 -166570 -288056 -49658 126954 100431 -97043 -10615 -160349
9381 -160349 -123658 73970 -239290 -206191 -200769 -30694 119449 124283 -137118 -383141 -233252
9370 -233252 145425 333025 114606 -206194 86317 -140059 -112326 91773 -201390 -285614
9360 -285614 -141057 57541 -397882 -449578 230831 33215 -76416 28751 -350722 -865 -161359
9349 -161359 -72107 -234215 -227591 -22990 222346 514690 -179072 147595 2668 11327 333396
9338 333396 -126623 -121714 -146223 -347879 60136 -2609 -57029 -15891 36813 1663 115466 -334340
9325 -37259 2415 -143627 -308252 113943 -18591 -20362 -591489 366329 -297653 -111583 -209380
9314 -209380 232136 131412 255895 -64650 -75598 -206201 -277030 -52457 -275278 38494 -124568
9302a81306n1027C85465E8032c21120J29006d9007B36205a77380O7538A28198
9291b00545L5384k76141E6096a11996C8138j0247M71a83170n890L7385n3351K6502
9279a78524e074j10806C01249c0918l5442A98252p631H3574C092L10639h0780
9267C51331a14649C5240a38139j81454q8250c7236A4600Q9856j6210C6851J15343
9256A52194q644c323m80530B20932b02074A62215D7186b0281B38534a94674j54450
9245c49124J10184A92131g8742H4258B1940d41j76844j16898J18648d7689E0142
9233a7637B58456q3942a65821I1127b27912N1937A42206a49807j41091J5327A88021
9221c1503j95871N6417A17216J50861a98432a3871p0227d617j15847A3066c7080
$$ plain form
9302 -181306 -232333 385465 58032 -321120 -192114 -49007 236205 -177380 -109842 128198
9291 -200545 -165161 -441302 56096 -111996 38138 27891 28362 -183170 -189060 -151675 -205026 -178524
9279 -178524 -5074 -115880 301249 -30918 -66360 198252 190621 83574 3092 313731 -80780
9267 351331 -114649 35240 -138139 -319593 -407843 -37236 14600 104456 88246 36851 152194
9256 152194 143550 -3323 -483853 220932 -202074 162215 47186 -20281 238534 -194674 -349124
9245 -349124 -238940 192131 -78742 84258 21940 -441 -177285 -294183 -175535 -47689 50142
9233 -17637 258456 174514 -165821 91127 -227912 -175975 142206 -149807 -290898 -275571 188021
9221 -31503 -227374 -170957 117216 268077 -198432 -13871 -84098 -4617 -120464 13066 -37080
9209G8682a8798l7059F1977N7954h8495A22394n7004A8080L725b24408b4589A76055
9196a36508c6037C9629a72641k3948n7348B1738L986a83922R0349A10232B8542
9184e9308j4552A27621b39184G0379a45373o1601l049d7635I3336J37550C5883
9172a77757m3310a08672k46841a13599p0504Q8442n8606j47315A96197a70306
9161G9886a93234b6586B08381a03804d7190g593k5490D7796a1246q2989A8602
9149b26583I946f5883q2346A24479l198M961b70718P8191e0025k4673I3319N6342
9137A49661e49038A25449O4829b92620i5662o6592A22136l8530A5625J87691P7434
9126B80750a04021A16044E493i332F0359a80484p810L0598r6181a2338N730k37897
$$ plain form
9209 78682 -18798 -55857 61977 119931 -88495 122394 65390 18080 21805 -224408 -24589 176055
9196 -136508 -36037 39629 -172641 -196589 -253937 21738 25724 -183922 -93573 110232 28542
9184 -59308 -73860 127621 -239184 70379 -145373 -206974 -210023 -47635 93336 230886 35883
9172 -177757 -221067 -108672 -355513 -113599 -184103 -95661 -154267 -301582 196197 -170306
9161 79886 -193234 -26586 208381 -103804 -47190 -7593 -33083 47796 -11246 -94235 18602
9149 -226583 9946 -65883 -148229 124479 121281 126242 -270718 -192527 -50025 -74698 93319 149661
9137 149661 -549038 125449 190278 -292620 -95662 -162254 122136 83606 15625 203316 280750
9126 280750 -104021 116044 5493 -9332 60359 -180484 -188294 -157696 -253877 -12338 -6608 -244505
9114b44505E5939b90637A71314p1841m7554b7885A18846E5593a21640I5188b69790
9102e0802j15245G5056g5170B13322d4161B66943b88127A25595K9152B7038c7685
9090C5855b21748R6994B28265a30390m3402j81684J44774r524N63k2036C9061
9078H4790L1911g7710p3091g4414o6079A28395a60006j84592H829L547a66338
9066D8876J24455A5911h3475k87170a29166J1573q589b3448A99589a29017m77
9055a29494j21817C4584b67858O1741A0003L9925R224a79098f8906A5638c61667
9043A15722b7817f629k10749R604m3172F9855c9554k22671j01467f3297r9019
9032a62316k00690B181R1243b43110A99830a50253B44545d178k40972f4418j5786
$$ plain form
9114 -244505 55939 -290637 171314 99473 51919 -27885 118846 55593 -121640 95188 -269790
9102 -50802 -166047 75056 -75170 213322 -44161 266943 -288127 125595 154747 27038 -37685
9090 35855 -221748 -124754 228265 -130390 -173792 -355476 -210702 -220226 -219663 -241699 39061
9078 84790 116701 -77710 -150801 -74414 -140493 128395 -160006 -344598 8829 12376 -166338
9066 48876 173331 15911 -83475 -370645 -129166 -117593 -126182 -23448 199589 -129017 -129494
9055 -129494 -251311 34584 -267858 -206117 10003 49928 59152 -179098 -68906 15638 -361667
9043 115722 -27817 -6629 -217378 -207774 -250946 69855 -39554 -262225 -363692 -63297 -162316
9032 -162316 -363006 2181 93424 -243110 199830 -150253 244545 -4178 -245150 -64418 -80204
9021h0204m57094E82988a50771D3212g495D11175A05341a13625j66684I6786b05659
9009H3077J98897G3924a10124M1212q1017l1864c7492j58400A5561c2370f35A78865
8996A683J28725b35873B92640A04576f8897A58311b52836a5655j50644b9675H2378
8984b25391q0619N9466G5322A8346b06667o7291d8610j97550R3633C7069K0551
8973E7620J19268b41569i3552J2118l9296K1515j76801e4449j17281E3661j2409
8962D1252a30524j25000A0438e57781A87983F9814a42817B27232a71582h5514
8951F8487a99514D0455N6559P1089d7098F1820K5170a44037A0114d4761f194l8071
8939d4265m5192I4347a33199A50557j0840e8654I4458a90394B900b81783c0808
$$ plain form
9021 -80204 -537298 582988 -150771 43212 -7495 411175 105341 -113625 -280309 96786 -205659
9009 83077 281974 73924 -110124 -68912 -149929 -181793 -37492 -195892 15561 -32370 -635 178865
8996 1683 130408 -235873 292640 104576 -68897 158311 -252836 -15655 -166299 -29675 82378
8984 -225391 -306010 -246544 75322 18346 -206667 -273958 -48610 -246160 -152527 37069 57620
8973 57620 176888 -241569 -93552 -81434 -120730 -99215 -276016 -54449 -171730 53661 41252
8962 41252 -130524 -255524 10438 -557781 187983 69814 -142817 227232 -171582 -85514
8951 68487 -199514 40455 97014 168103 -47098 61820 86990 -144037 10114 -44761 -6194 -44265
8939 -44265 -89457 94347 -133199 150557 139717 -58654 94458 -190394 2900 -281783 -30808
8927A35981K21041A32329K36893J083773L960464J861899B821530H62164l72784
8918D89380B33134M8948A2609f5251O545B03192d2885n6135B07806J52041j27257
8907B32590J53500j14158b00570J5859B18071b46466C51099a81953B2998J46617
8897A69615b47842f2129C4772a11886D9592a68244N2994A2117f5238E8875J55863
8886B14738P2135j14942K5539m8085b09036A84588b82588j7767j68799f154B644
$$ plain form
8927 135981 357022 132329 369222 1452995 5413459 7275358 2821530 862164 489380
8918 489380 233134 282082 12609 -65251 -58706 203192 -42885 -99020 207806 359847 232590
8907 232590 386090 271932 -200570 -184711 218071 -246466 351099 -181953 22998 169615
8897 169615 -247842 -62129 34772 -111886 49592 -168244 -115250 12117 -65238 58875 214738
8886 214738 286873 171931 197470 149385 -209036 184588 -282588 -300355 -469154 -6154 2644
$$ [...]
##END NTUPLES=NMR SPECTRUM
##END=
