
##TITLE=AC1228_VIERSDE097_6533939_abDH5esPlC
##JCAMPDX= 6.0         $$ Bruker NMR JCAMP-DX V2.0
##DATA TYPE= NMR SPECTRUM
##DATA CLASS= NTUPLES
##ORIGIN= BRUKER
##OWNER= Administrator
$$ 1.72 TOPSPIN		Version 2.1
$$ 2012-07-16 15:29:54.843 -0500  Administrator@TOPSPIN
$$ Compression mode = diff/dup
##.OBSERVE FREQUENCY= 400.02188249412
##.OBSERVE NUCLEUS= ^1H
##.ACQUISITION MODE= SIMULTANEOUS (DQD)
##.ACQUISITION SCHEME= undefined
##.AVERAGES= 64
##.DIGITISER RES= 22
##SPECTROMETER/DATA SYSTEM= spect
##.PULSE SEQUENCE= noesygpps1d.comp
##.SOLVENT NAME= COFFEE_meoh
##.SHIFT REFERENCE= INTERNAL, COFFEE_meoh, 1, 14.96035
##AUDIT TRAIL= $$ (NUMBER, WHEN, WHO, WHERE, PROCESS, VERSION, WHAT)
$$ ##TITLE= Audit trail, TOPSPIN		Version 2.1
$$ ##JCAMPDX= 5.01
$$ ##ORIGIN= Bruker BioSpin GmbH
$$ ##OWNER= Administrator
$$ $$ C:\Bruker\TOPSPIN/data/COFFEE/nmr/AC1228_VIERSDE097_6533939_abDH5esPlC/12/pdata/1/auditp.txt
$$ ##AUDIT TRAIL=  $$ (NUMBER, WHEN, WHO, WHERE, PROCESS, VERSION, WHAT)
(   1,<2012-07-16 15:29:49.578 -0500>,<Administrator>,<TOPSPIN>,<go>,<TOPSPIN 2.1>,
      <created by zg
	started at 2012-07-16 15:18:19.031 -0500,
	POWCHK enabled, PULCHK disabled,
       configuration hash MD5:
       6B 1B 68 BB D9 2E 58 E2 7F 35 AD 54 07 DF 0E 41
       data hash MD5: 64K
       A5 B5 8B B9 2E 73 5F C9 11 F1 3E 12 8F 10 E0 11>)
(   2,<2012-07-16 15:29:52.593 -0500>,<Administrator>,<TOPSPIN>,<proc1d>,<TOPSPIN 2.1>,
      <Start of raw data processing
       efp LB = 0.3 FT_mod = 6 PKNL = 1 PHC0 = 0 PHC1 = 0 SI = 128K 
       data hash MD5: 128K
       28 39 97 14 FB 57 37 E8 FE 07 D3 8C CF AB 19 11>)
(   3,<2012-07-16 15:29:54.031 -0500>,<Administrator>,<TOPSPIN>,<proc1d>,<TOPSPIN 2.1>,
      <pk PHC0 = -2.312622 PHC1 = 0 
       data hash MD5: 128K
       34 53 D7 99 2E D8 4B E5 69 CE F8 88 E2 52 30 0F>)
(   4,<2012-07-16 15:29:54.312 -0500>,<Administrator>,<TOPSPIN>,<proc1d>,<TOPSPIN 2.1>,
      <abs ABSG = 1 
       data hash MD5: 128K
       AE F7 2E AC C0 13 3D B6 81 41 5F AE 4B 4E 17 31>)
(   5,<2012-07-16 15:29:54.375 -0500>,<Administrator>,<TOPSPIN>,<proc1d>,<TOPSPIN 2.1>,
      <abs ABSG = 2 
       data hash MD5: 128K
       C4 51 B2 CD FD 4C 33 79 77 04 13 83 AA A1 10 A5>)
(   6,<2012-07-16 15:29:54.484 -0500>,<Administrator>,<TOPSPIN>,<proc1d>,<TOPSPIN 2.1>,
      <abs ABSG = 3 
       data hash MD5: 128K
       EA C9 7A 21 08 A6 26 96 7A E0 A3 5F D8 3A 07 22>)
(   7,<2012-07-16 15:29:54.718 -0500>,<Administrator>,<TOPSPIN>,<proc1d>,<TOPSPIN 2.1>,
      <abs ABSG = 4 
       data hash MD5: 128K
       1E 32 3C A4 4A 42 E0 E0 09 BA 9E B6 9C 9E 47 F0>)
(   8,<2012-07-16 15:29:54.765 -0500>,<Administrator>,<TOPSPIN>,<proc1d>,<TOPSPIN 2.1>,
      <abs ABSG = 5 
       data hash MD5: 128K
       87 EC 79 CC DD EF 72 CB 59 36 52 18 E7 B7 A0 5E>)
$$ ##END=
$$ 
$$ $$ hash MD5
$$ $$ DA 0E 9C CD 77 25 0D A7 A1 D6 6F 2A 60 03 28 16
##$RELAX= 
##$RELAX= 
##$RELAX= 
##$RELAX= 
##$RELAX= 
##$RELAX= 
##$RELAX= 
##$RELAX= 
$$ Bruker specific parameters
$$ [...]
##$TP07= 0
##$TPNAME0= <>
##$TPNAME1= <>
##$TPNAME2= <>
##$TPNAME3= <>
##$TPNAME4= <>
##$TPNAME5= <>
##$TPNAME6= <>
##$TPNAME7= <>
##$TPOAL= (0..7)
0.5 0.5 0.5 0.5 0.5 0.5 0.5 0.5
##$TPOFFS= (0..7)
0 0 0 0 0 0 0 0
##$TUNHIN= 0
##$TUNHOUT= 0
##$TUNXOUT= 0
##$USERA1= <user>
##$USERA2= <user>
##$USERA3= <user>
##$USERA4= <user>
##$USERA5= <user>
##$V9= 5
##$VALIST= <valist>
##$VCLIST= <CCCCCCCCCCCCCCC>
##$VD= 0
##$VDLIST= <DDDDDDDDDDDDDDD>
##$VPLIST= <PPPPPPPPPPPPPPP>
##$VTLIST= <TTTTTTTTTTTTTTT>
##$WBST= 2048
##$WBSW= 25
##$XGAIN= (0..3)
0 0 0 0
##$XL= 0
##$YL= 0
##$YMAX_a= 9094295
##$YMIN_a= -7462479
##$ZGOPTNS= <>
##$ZL1= 120
##$ZL2= 120
##$ZL3= 120
##$ZL4= 120
##$ABSF1= 14.96035
##$ABSF2= -5.597832
##$ABSG= 5
##$ABSL= 3
##$ALPHA= 0
##$AQORDER= 0
##$ASSFAC= 0
##$ASSFACI= 0
##$ASSFACX= 0
##$ASSWID= 0
##$AUNMP= <proc_prof1d_extract.lims>
##$AXLEFT= 0
##$AXNAME= <>
##$AXNUC= <1H>
##$AXRIGHT= 0
##$AXTYPE= 0
##$AXUNIT= <>
##$AZFE= 0.1
##$AZFW= 0.1
##$BCFW= 0
##$BC_mod= 0
##$BYTORDP= 0
##$COROFFS= 0
##$CY= 15
##$DATMOD= 1
##$DC= 0
##$DFILT= <>
##$DTYPP= 0
##$F1P= 0
##$F2P= 0
##$FCOR= 0.5
##$FTSIZE= 131072
##$FT_mod= 6
##$GAMMA= 0
##$GB= 0
##$INTBC= 1
##$INTSCL= 1
##$ISEN= 128
##$LB= 0.3
##$LEV0= 0
##$LPBIN= 0
##$MAXI= 10000
##$MC2= 0
##$MEAN= 0
##$ME_mod= 0
##$MI= 0
##$NCOEF= 0
##$NC_proc= -2
##$NLEV= 6
##$NOISF1= 0
##$NOISF2= 0
##$NSP= 0
##$NTH_PI= 0
##$NZP= 0
##$OFFSET= 14.96035
##$PC= 1
##$PHC0= -2.312622
##$PHC1= 0
##$PH_mod= 1
##$PKNL= yes
##$PPARMOD= 0
##$PPDIAG= 0
##$PPIPTYP= 0
##$PPMPNUM= 2147483647
##$PPRESOL= 1
##$PSCAL= 4
##$PSIGN= 0
##$PYNMP= <proc.py>
##$REVERSE= no
##$SF= 400.020009897014
##$SI= 131072
##$SIGF1= 0
##$SIGF2= 0
##$SINO= 400
##$SIOLD= 131072
##$SPECTYP= <>
##$SREGLST= <1H.CDCl3>
##$SSB= 0
##$STSI= 131072
##$STSR= 0
##$SW_p= 8223.68421052631
##$SYMM= 0
##$S_DEV= 0
##$TDeff= 65536
##$TDoff= 0
##$TI= <>
##$TILT= no
##$TM1= 0
##$TM2= 0
##$TOPLEV= 0
##$USERP1= <user>
##$USERP2= <user>
##$USERP3= <user>
##$USERP4= <user>
##$USERP5= <user>
##$WDW= 1
##$XDIM= 131072
##$YMAX_p= 354129017
##$YMIN_p= -11533
##$CURPLOT= <Network HP LaserJet P1505>
##$CURPRIN= <$Network HP LaserJet P1505>
##$DFORMAT= <normdp>
##$LAYOUT= <+/1D_H.xwp>
##$LFORMAT= <normlp>
##$PFORMAT= <normpl>
##$SURQMSG= 1
$$ End of Bruker specific parameters
$$ ---------------------------------
##NTUPLES= NMR SPECTRUM
##VAR_NAME=  FREQUENCY,     SPECTRUM/REAL,   SPECTRUM/IMAG
##SYMBOL=    X,             R,               I
##VAR_TYPE=  INDEPENDENT,   DEPENDENT,       DEPENDENT
##VAR_FORM=  AFFN,          ASDF,            ASDF
##VAR_DIM=   131072,        131072,          131072
##UNITS=     HZ,            ARBITRARY UNITS, ARBITRARY UNITS
##FACTOR=    0.0627417313425164, 1,          1
##FIRST=     8223.62146879497, 3239,         -48700
##LAST=      0,             3737,            -48111
##MIN=       0,             -11533,          0
##MAX=       8223.62146879497, 354129017,    0
$$ Real data points
##PAGE= N=1
##DATA TABLE= (X++(R..R)), XYDATA
$$ [...]
61781C70262p022o704n287l831l380l707l923l701l307k901k452k101k031k009
61767C17906j586q16l24n07r28q01K3Q79J151J100J519K601L569L639L018K469
61751C32912K231J922J463J335J711J989J601P96J92m9j48j49M1K82L49L53O52
61734C47483J392K415L424M050M062L803M068N118O191O408N892N382N142M958
61720D09788M938N417O178O493O092N316M395L321K466K378K696K297Q64o04j429
61705D60606k352m186o198o955o403n887o274p061p421p188o589n782n031m695
61691C78584m670m418l770l254l233l282k934k543k776l444l618k861j675o40
61677C35466K79J241J897J753R75K76M8P7O9R5K74M45N01P12J346K048K081J292
$$ plain form
61781 370262 363240 356536 351249 347418 344038 340331 336408 332707 329400 326499 324047 321946 319915 317906
61767 317906 316320 315504 315180 314673 313745 312944 312967 313846 314997 316097 317616 320217 323786 327425 330443 332912
61751 332912 335143 337065 338528 339863 341574 343563 345164 345960 346152 346103 345955 345806 345847 346129 346478 346831 347483
61734 347483 348875 351290 354714 358764 362826 366629 370697 375815 382006 388414 394306 399688 404830 409788
61720 409788 414726 420143 426321 432814 438906 444222 448617 451938 454404 456782 459478 461775 462639 462035 460606
61705 460606 458254 454068 447870 440915 434512 428625 422351 415290 407869 400681 394092 388310 383279 378584
61691 378584 373914 369496 365726 362472 359239 355957 353023 350480 347704 344260 340642 337781 336106 335466
61677 335466 335745 336986 338883 340636 341611 341887 341935 342012 342081 342176 342450 342895 343396 344108 345454 347502 349583 350875
61659C50875M75M81J246J926J994J814K063K844L592L839L739L789M178M674N064
61644C92593N403N844O408P036P659Q055P862O971N756M694L768K523P04j302
61630D63974k747l209k964k797l301m338n203n437n280n162m976m204k736j081
61616D10539K95J430K444K998K599J292k51j384j919j932j538r86p09j056k009
61601D09813l300m627n643n966n594n142n267n795n896n260m590m598n002n031
61587C38102m590m313m556m976n137m941m382l443k404j749j564j478j367j572
61573B91630k247k959l240l043k461j529o57n70j366k115j971j157l57K42O26
61558B68826K90j069k526k658j244N40J575J675J113J91o33r34q67r22j112j026
$$ plain form
61659 350875 351350 351831 353077 355003 356997 358811 360874 363718 367310 371149 374888 378677 382855 387529 392593
61644 392593 397996 403840 410248 417284 424943 432998 440860 447831 453587 458281 462049 464572 465276 463974
61630 463974 461227 458018 455054 452257 448956 444618 439415 433978 428698 423536 418560 414356 411620 410539
61616 410539 410834 412264 414708 417706 420305 421597 421346 419962 418043 416111 414573 413587 412878 411822 409813
61601 409813 406513 401886 396243 390277 384683 379541 374274 368479 362583 357323 352733 348135 343133 338102
61587 338102 333512 329199 324643 319667 314530 309589 305207 301764 299360 297611 296047 294569 293202 291630
61573 291630 289383 286424 283184 280141 277680 276151 275494 274924 273558 271443 269472 268315 267958 268200 268826
61558 268826 269116 268047 265521 262863 261619 262159 263734 265409 266522 266713 266080 265146 264279 263357 262245 261219
61542B61219o68m55l98n8N32Q43Q15R97J432J333L74n82o18J01Q13J187J258R48
61524B69073K79l95q96j467k103k236j646j092j309j922k130k023k306l086l731
61509B43010l844l510k721j402K2Q18Q90Q36R94J029O61J70l6mn9l42o86q07n11
61490B34508N9M64M11Q1j83l74o87j084j337j394j372j268j034q26q00p82n76
61473B23806m11o07q94o98l4M27K45l79j071j572j518o36N74J016K87p15q97l07
61455B16616J14k06r21j325r80J02J486K512K714K141J248N25L02O10J109J291
61439B27338J020O44N08N72P06J039J664K244K408K436K949L920M489M007K864
61424B58808J965J720J946K424L090L630L542K801K130K269L196M248M879M953
$$ plain form
61542 261219 260551 260096 259698 259640 260172 261015 261830 262827 264259 265592 265966 265384 264766 264867 265680 266867 268125 269073
61524 269073 269352 268957 268061 266594 264491 262255 260609 259517 258208 256286 254156 252133 249827 246741 243010
61509 243010 239166 235656 232935 231533 231555 232373 233263 234099 235093 236122 236783 236953 236917 236913 236854 236512 235826 235019 234508
61490 234508 234567 235031 235442 235523 235340 234966 234279 233195 231858 230464 229092 227824 226790 225964 225164 224382 223806
61473 223806 223395 222788 221894 221196 221162 221589 221834 221455 220384 218812 217294 216658 217232 218248 218535 217820 216923 216616
61455 216616 216730 216524 215603 214278 213298 213400 214886 217398 220112 222253 223501 224026 224328 224938 226047 227338
61439 227338 228358 229002 229510 230082 230788 231827 233491 235735 238143 240579 243528 247448 251937 255944 258808
61424 258808 260773 262493 264439 266863 269953 273583 277125 279926 282056 284325 287521 291769 296648 301601
61410C01601M440L235J467l09j418j623j306j139j515k217k736k939l238l913
61396B88390m495m264l230k241k005k386k775k747k247j416n73r0r6m14q25j217
61380B57369j350r62j93L81M43L39N03Q40R76Q70Q00R42J253J625J891J851J528
61363B69106J214J063R17O69M64L67K95M83J391K836L819L875L864M687N859O369
61347C07278O425P078Q383R311R588J0179J1485J2321J1490R450P599O628O290
61334D23505O282O414O268N529M522L846L498K866J472n96k811m471n059m842
61320D46423m813n642o829p357o956o199n483m604l436k471k374l170m103m268
61306C78718l409k147j302q84k1J839L986N118M782L633K308P14j329l303m380
$$ plain form
61410 301601 306041 309276 310743 310434 309016 307393 306087 304948 303433 301216 298480 295541 292303 288390
61396 288390 283895 279631 276401 274160 272155 269769 266994 264247 262000 260584 260011 259921 259825 259411 258586 257369
61380 257369 256019 255057 254864 255245 255688 256027 256530 257370 258346 259216 260016 260958 262211 263836 265727 267578 269106
61363 269106 270320 271383 272300 272969 273433 273800 274095 274578 275969 278805 282624 286499 290363 295050 300909 307278
61347 307278 313703 320781 329164 338475 348063 358242 369727 382048 393538 402988 410587 417215 423505
61334 423505 429787 436201 442469 447998 452520 456366 459864 462730 464202 463606 460795 456324 451265 446423
61320 446423 441610 435968 429139 421782 414826 408627 403144 398540 395104 392633 390259 387089 382986 378718
61306 378718 375309 373162 371860 370976 370955 372794 376780 381898 386680 390313 392621 393335 392006 388703 384323
61291C84323m448m252m489m988m986m073k664j549j087j008r48q83q68o39J74
61276C47615J446K528K956L008L335M225N389O464P376Q138Q509Q236P503O841
61262D23569O522O347O171O335P259Q844J0604J2190J3414J3951J3594J2823J2453
61249E54076J2520J2057J0297P696N360L828K786J719L30j440l349m902n861o613
61235E88504p611q600q915q478q022q191q870r532r829r643q975q049p282o854
61221D69653o475n850n126m672m586m686m844n009n008m640l985l292k568j602
61207D07310m95J51j52j178k188k649k541k082j415o05L14J417K792M298N567
61192D08544O447P324Q699J0485J1992J2707J2835J2816J2574J1637J0014Q471
$$ plain form
61291 384323 379875 375623 371134 366146 361160 357087 354423 352874 351787 350779 349831 348948 348080 347441 347615
61276 347615 349061 351589 354545 357553 360888 365113 370502 376966 384342 392480 400989 409225 416728 423569
61262 423569 430091 436438 442609 448944 456203 465047 475651 487841 501255 515206 528800 541623 554076
61249 554076 566596 578653 588950 596646 602006 605834 608620 610339 610669 609229 605880 600978 595117 588504
61235 588504 580893 572293 563378 554900 546878 538687 529817 520285 510456 500813 491838 483789 476507 469653
61221 469653 463178 457328 452202 447530 442944 438258 433414 428405 423397 418757 414772 411480 408912 407310
61207 407310 406815 406966 406814 405636 403448 400799 398258 396176 394761 394156 394470 395887 398679 402977 408544
61192 408544 414991 422315 431014 441499 453491 466198 479033 491849 504423 516060 526074 534545
61180E34545P710P622P621P470P361P333P217P131P377P694P269N930M641M230
61166F31151M089L044J208j27m50p75k096l966n299n898o448p428q761j0227j1572
61151E76445j2316j2059j0939r406p691n857m164k896k094j848k557m280o131
61138D94207p123p419p977r000r633r307q511p861p248o276n033l921l119k628
61124C99151k422k259j681m85J093K863M827O704P866Q230Q690J0073J1955J3091
61110D67696J2841J1777J1042J1379J2663J4041J4713J4791J5080J5881J6431
61099F18335J5860J4228J2168R939P462M943K745P72j358l593n526p099q679j0335
61085F49862j1667j2510j3225j4121j4998j5539j5724j5643j5199j4399j3632
$$ plain form
61180 534545 542255 549877 557498 564968 572329 579662 586879 594010 601387 609081 616350 622280 626921 631151
61166 631151 635240 638284 639492 639365 638915 638140 636044 632078 626779 620881 614433 607005 598244 588017 576445
61151 576445 564129 552070 541131 531725 524034 518177 514013 511117 509023 507175 504618 500338 494207
61138 494207 487084 479665 471688 462688 453055 443748 435237 427376 420128 413852 408819 404898 401779 399151
61124 399151 396729 394470 392789 392304 393397 396260 401087 407791 415657 423887 432577 442650 454605 467696
61110 467696 480537 492314 503356 514735 527398 541439 556152 570943 586023 601904 618335
61099 618335 634195 648423 660591 670530 677992 682935 685680 686452 685094 681501 675975 668876 660197 649862
61085 649862 638195 625685 612460 598339 583341 567802 552078 536435 521236 506837 493205
61074D93205j3276j3172j2790j1939j1007j0451j0263j0115r842r485q879p622
61062C64364n707l893l040l131l391l321l107k931k485j523m14K98N50N94N02
61047C33365L05L83J152K458L731M677N412O044O510O833P229P898R015J0687
61033D05699J2667J4216J4719J4377J3903J3703J3763J4192J5287J7031J9070
61022E68627K1351K4391K8828L5014M3030N2721O3688P5707Q8846J02073J11320
61011A215596J10138R4035O4997L1476L533j2575j5996r317L496J6933K3504J6200
60999A542020o644l8964p0480r3199j04869j07315j03242r4985q4753p4323o4387
60988F98859n4966m6428l9438l3898k8707k3071j7612j3675j1713j0781r664q055
$$ plain form
61074 493205 479929 466757 453967 442028 431021 420570 410307 400192 390350 380865 371986 364364
61062 364364 358657 354764 351724 348593 345202 341881 338774 335843 333358 331835 331421 331719 332269 332863 333365
61047 333365 333670 334053 335205 337663 341394 346071 351483 357527 364037 370870 378099 385997 395012 405699
61033 405699 418366 432582 447301 461678 475581 489284 503047 517239 532526 549557 568627
61022 568627 589978 614369 643197 678211 721241 773962 837650 913357 1002203 1104276 1215596
61011 1215596 1325734 1419769 1484766 1516242 1519775 1507200 1491204 1481887 1485383 1502316 1525820 1542020
60999 1542020 1535376 1496412 1425932 1332733 1227864 1120549 1017307 922322 837569 763246 698859
60988 698859 643893 597465 558027 524129 495422 472351 454739 441064 429351 418570 408906 400851
60976D00851o476n417m894m659m427l933l177k585k540k762k604k012j614j655
60962C52096j485n07R16J986K394K202J426L97M5Q27J814J751Q50M19Q45J182
60946C67158Q42N08R05J680K075J926J455Q94P24J452K580K639J032j004k071
60931C82795k456l263m380m734m285m310n474o787p021o314n751n919o461o777
60917C08863o660o253n703m979m022l019k341k097j975j706j410j182p09K86J439
60902B68532K118K320K667L489M458N132N419N422N322N479O109O692O278M677
60888C34114L009K524L131L499K630R67j91k19J44k89j692l015l327k933k857
60873C35495l464m209m610m842n208n581n661n449n102m636m039l474l057k628
$$ plain form
60976 400851 394375 388958 384064 379405 374978 371045 367868 365283 362743 359981 357377 355365 353751 352096
60962 352096 350611 350104 351020 353006 355400 357602 359028 359425 359470 360297 362111 363862 364712 365131 365976 367158
60946 367158 368000 368508 369413 371093 373168 375094 376549 377443 378167 379619 382199 384838 385870 384866 382795
60931 382795 380339 377076 372696 367962 363677 359367 353893 347106 340085 333771 328020 322101 315640 308863
60917 308863 302203 295950 290247 285268 281246 278227 275886 273789 271814 270108 268698 267516 266807 267093 268532
60902 268532 270650 272970 275637 279126 283584 288716 294135 299557 304879 310358 316467 323159 329437 334114
60888 334114 337123 339647 342778 346277 348907 349874 349683 349464 349608 349319 347627 344612 341285 338352 335495
60873 335495 332031 327822 323212 318370 313162 307581 301920 296471 291369 286733 282694 279220 276163 273535
60859B73535k019j455j296j487j513j007j60N17P67P86R27J299J762K263L010
60844B75929M097N178N764N875O046O563O984O657N549M291L468L103K801K270
60830C44575J615J125Q37M12l66j121j215o21p2j45n58o78m57l36l91k51N4k01
60812C42206j494l264m535n100n563o303o940o980o502n945n545n304n266n491
60798B67974n749n582m739l389j983r65n20m36k73J10L08o7o87p50M3J112J674
60781B46081J491Q25P5k62K83J650L067L777L854L924M214M333M014L662L869
60766B84857M608N220N151M584M223M440M803M670M078L733L979M249L856L001
60752C45452K464K498K589K287J759J386J277J383J718K207K564K537K065J123
$$ plain form
60859 273535 271516 270061 268765 267278 265765 264758 264598 265115 265882 266668 267595 268894 270656 272919 275929
60844 275929 280026 285204 290968 296843 302889 309452 316436 323093 328642 332933 336401 339504 342305 344575
60830 344575 346190 347315 348152 348564 348198 347077 345862 345241 345169 345024 344466 343788 343331 342995 342604 342353 342407 342206
60812 342206 340712 337448 332913 327813 322250 315947 309007 302027 295525 289580 284035 278731 273465 267974
60798 267974 262225 256643 251904 248515 246532 245567 245047 244611 244338 244448 244756 244689 244002 243252 243295 244407 246081
60781 246081 247572 248397 248472 248210 248493 250143 253210 256987 260841 264765 268979 273312 277326 280988 284857
60766 284857 289465 294685 299836 304420 308643 313083 317886 322556 326634 330367 334346 338595 342451 345452
60752 345452 347916 350414 353003 355290 357049 358435 359712 361095 362813 365020 367584 370121 372186 373309
60738C73309l04j894k962l171l086l673n216o945p817p455o333n224m576m360
60724C10293m375m442m337l754k648j490q19n81j81O76J599K101K285K662L462
60709C00451M440N238N730O085O681P833R449J1078J2459J3790J5255J6589J7535
60696D32613J8534K0336K2864K5059K6137K6561K7392K8922L0474L1324L1307
60685G21523L0387K8179K4226J8546J1547L581n045j3636k1150k6964l1247l4366
60673G05581l6115l6026l4289l1900k9749k7930k6075k4036k1948j9915j7941
60662C99657j6053j4200j2199j0076q274p205o648o023n165m427l942l321k263
60649B99861j146n45m63l47J42P64J085R64N50K0n64j165j638j758j402p73l10
$$ plain form
60738 373309 373005 371111 368149 364978 361892 358219 353003 346058 338241 330786 324453 319229 314653 310293
60724 310293 305918 301476 297139 293385 290737 289247 288428 287847 287666 288342 289941 292042 294327 296989 300451
60709 300451 304891 310129 315859 321944 328625 336458 345907 356985 369444 383234 398489 415078 432613
60696 432613 451147 471483 494347 519406 545543 572104 599496 628418 658892 690216 721523
60685 721523 751910 780089 804315 822861 834408 837989 832944 819308 798158 771194 739947 705581
60673 705581 669466 633440 599151 567251 537502 509572 483497 459461 437513 417598 399657
60662 399657 383604 369404 357205 347129 338855 331650 325002 318979 313814 309387 305445 302124 299861
60649 299861 298715 298170 297707 297360 297502 298266 299351 300315 300865 300885 300321 299156 297518 295760 294358 293585 293275
60632B93275k86n16n05L7R62J859K415K611K702L001L556M030M049L716L571L880
60616C28357M155L637K262Q54J90J37j60j286k976m391m769l959k582j696j946
60601C15827k912l569l458l100l127l390l338k889k425k122j874j758j869j666
60587B78330l09J970L632L573K577K278L088M076M670N437O912Q662J0061J1340
60573C46297J3058J4945J5938J5402J3730J1669R429O648L053j028m753p389q832
60560D28167r404r215q049n989l665j520Q57M130Q185J2193J5614J8505K0802
60547D70611K1924K1389J9365J6340J2581Q176L318j741o677j0761j2927j2664
60535E28934j0749q654p210o177m983l536k222j463j394j835k396k724k650k086
$$ plain form
60632 293275 292989 292473 291968 292005 292967 294826 297241 299852 302554 305555 309111 313141 317190 320906 324477 328357
60616 328357 332512 336149 338411 339265 339455 339592 339432 338146 335170 330779 326010 322051 319469 317773 315827
60601 315827 312915 309346 305888 302788 299661 296271 292933 290044 287619 285497 283623 281865 279996 278330
60587 278330 278021 279991 283623 287196 289773 292051 295139 299215 303885 309322 316234 324896 334957 346297
60573 346297 359355 374300 390238 405640 419370 431039 440468 447116 450169 449141 444388 436999 428167
60560 428167 418763 409548 401499 395510 391845 390325 391182 395312 403497 415690 431304 449809 470611
60547 470611 492535 513924 533289 549629 562210 570386 573704 571963 565286 554525 541598 528934
60535 528934 518185 509531 502321 496144 491161 487625 485403 483940 482546 480711 478315 475591 472941 470855
60521D70855r88M69J872L002M171N788P676R265J0504J2177J5084J9188K3803
60508E82866K8449L3292L8786M5052N1653N7869O3171O7270O9542O8678O3357
60497A169985N3381L9853K4099O814j1461k9476m5396n7838o6451p1521p3339
60486I38650p2101o8188o2363n5674m9088m3145l7951l3476k9665k6285k2953
60475D37761j9609j6762j4874j3674j2454j0939r480q355p334o190n216m852m987
60462C03035n023m592m009l839m151m327l682k284r76m86p10j020j035p47j34
60447B66020P41J321R47j28q08n63j27l42r14j066q28q18j052j020q31j166j929
60430B57437k072j155j65j14o56q23n23m29p36r54p75m17j31L0M0k4J83Q02J303
$$ plain form
60521 470855 469867 470336 472208 475210 479381 485169 492845 502110 512614 524791 539875 559063 582866
60508 582866 611315 644607 683393 728445 780098 837967 901138 968408 1037950 1106628 1169985
60497 1169985 1223366 1263219 1287318 1294132 1282671 1253195 1207799 1149961 1083510 1011989 938650
60486 938650 866549 798361 735998 680324 631236 588091 550140 516664 486999 460714 437761
60475 437761 418152 401390 386516 372842 360388 349449 339969 331614 324280 318090 312874 308022 303035
60462 303035 298012 293420 289411 285572 281421 277094 273412 271128 270152 269666 268956 267936 266901 266154 266020
60447 266020 266761 268082 269029 268901 268093 267530 267403 267061 266147 265081 264253 263435 262383 261363 260532 259366 257437
60430 257437 255365 254210 254045 253931 253275 252452 251929 251500 250764 249810 249035 248618 248487 248517 248557 248533 248716 249518 250821
60411B50821J142P41J045K010K455J666L68l61m30m35n40l94P5M21K94j78n57
60394B58143m22L98J636K695L151L068K702K148J526J184J370J813K042J988J970
60379B85412K189K549K903L090K864K165J429J214J521J847J892J783J625J307
60365C13790Q50M63J20m60j142j281n89K73N32L91P19J810L005L584L431K802
60349C28298J933J193J132J883K674K492J254l1m37j56j39q66j889k570k779k705
60333C29287k341j606q37o21j038j487j449j050o48k29M32J246J944K544L301
60318C27448M231N164O264P965J0282J2722J5096J7969K1798K5914K8849K9530
60306E13232K7833K4181J9086J3062O409r31q897j6530k2168k4741k4677k3332
$$ plain form
60411 250821 251963 252704 253749 255759 258214 259880 260248 259887 259457 259022 258482 258088 258163 258584 258878 258700 258143
60394 258143 257721 258119 259755 262450 265601 268669 271371 273519 275045 276229 277599 279412 281454 283442 285412
60379 285412 287601 290150 293053 296143 299007 301172 302601 303815 305336 307183 309075 310858 312483 313790
60365 313790 314640 315103 315223 314763 313621 312340 311751 312024 312556 312947 313666 315476 318481 322065 325496 328298
60349 328298 330231 331424 332556 334439 337113 339605 340859 340828 340391 340235 340096 339230 337341 334771 331992 329287
60333 329287 326946 325340 324503 323882 322844 321357 319908 318858 318210 317981 318413 319659 321603 324147 327448
60318 327448 331679 336843 343107 351072 361354 374076 389172 407141 428939 454853 483702 513232
60306 513232 541065 565246 584332 597394 603803 602872 593975 577445 555277 530536 505859 482527
60294D82527k1777k0247j8487j6269j3720j1355r668q536p294n587l926l027k881
60281C39753k829k415j706q56J11J063J651J705J416J042O71L06o0n46j262k027
60265C36017k466k448k156j727j189p67p96j163j280q95m42l32l83l74o06j274
60249C17719j666r31N43J313O73n32j105q43k82J93M84M72K49M04J407K719L181
60232C23998K337R21j03m89n23l87r1K58N28Q28J280J642J510R39N57Q69J678
60215C35752K291K195J453N88Q4j8l9j17Q5Q10J630J870J579J439J660J677J242
60198C54181J030J648K610L057K996K996L045K717K237K276K622K260R78j05j48
60183C84400K61J37n20j108j433j571j320o33j61n19j275j500j144j012j483k027
$$ plain form
60294 482527 460750 440503 422016 405747 392027 380672 371004 362468 355174 349587 345661 342634 339753
60281 339753 336924 334509 332803 331947 332058 333121 334772 336477 337893 338935 339606 339912 339852 339306 338044 336017
60265 336017 333551 331103 328947 327220 326031 325264 324468 323305 322025 321130 320688 320356 319973 319599 318993 317719
60249 317719 316053 315122 315665 316978 317651 317119 316014 315171 314889 315082 315566 316038 316287 316691 318098 320817 323998
60232 323998 326335 327256 327153 326664 326141 325754 325663 325921 326449 327277 328557 330199 331709 332648 333205 334074 335752
60215 335752 338043 340238 341691 342279 342363 342345 342306 342189 342274 343084 344714 346584 348163 349602 351262 352939 354181
60198 354181 355211 356859 359469 362526 365522 368518 371563 374280 376517 378793 381415 383675 384653 384548 384400
60183 384400 384661 384798 384278 383170 381737 380166 378846 378213 378052 377533 376258 374758 373614 372602 371119 369092
60167C69092k051j523o70K59Q69P65O4o23p80l15O21J664K183J709N26n17p87
60150C70486k66O36J285J121L03j66M89J861L040L893M817N599N616N101M947
60135D08762N101M380K357K51p31r45j353j901j850j170n46k90j20J25K97L32
60119D12699K44j49r32j656j762j319q83p53q45j104j524j845j776j340o81K55
60103C96629J354J952J564P61O01J188J644J481J240J498K025K367K631L169L837
60088D23941M111L740K887J755M74p01j385j427j095q30q11q31o48l55k53m11
60072D28161n95p30j029j588k200k846l888n311o230n857m691m030m304m698m502
60057C75662m045l983m307m492m192l456k536j855j756k033j983j302n47l62n10
$$ plain form
60167 369092 367041 365518 364848 365107 365976 366741 366805 366182 365402 365087 365708 367372 369555 371264 371790 371273 370486
60150 370486 370220 370856 372141 373262 373565 373399 373888 375749 378789 382682 387499 393098 398714 403815 408762
60135 408762 413863 418243 420600 420851 420120 419175 417822 415921 414071 412901 412355 412065 411945 412070 412367 412699
60119 412699 412943 412794 411862 410206 408444 407125 406242 405489 404644 403540 402016 400171 398395 397055 396374 396629
60103 396629 397983 399935 401499 402260 402861 404049 405693 407174 408414 409912 411937 414304 416935 420104 423941
60088 423941 428052 431792 434679 436434 436908 436207 434822 433395 432300 431470 430659 429828 429180 428825 428572 428161
60072 428161 427566 426836 425807 424219 422019 419173 415285 409974 403744 397887 393196 389166 384862 380164 375662
60057 375662 371617 367634 363327 358835 354643 351187 348651 346796 345040 343007 341024 339722 339175 338813 338303
60042C38303k55N07R95N72m20r75n02O56J684K142K198K103J782J191P48Q74J225
60025C52828R71l1r47j117r87j475k788m242n045m910m204l720l993m578m376
60010C11386l056j658j285j652j662j048n46n77o43k57L24O23O38O82R77J588
59994C03834K397K930K733K059J709J967K234J975J494J308J334J202R95J044
59980C29215J289J462J677K172K608K339J425P58R56J583J685Q71l33j093j129
59965C45485j003j414k153k165r52N28R68L46l16n31q29j611k505l056l216k905
59949C24671j922o79j61n82r12l11O56J015Q52Q89J174J252J195J417J645J244
59933C31443M31J02L87M73L2k32J89Q41J204J444J738J673R97L13K98P55J045
$$ plain form
60042 338303 338048 338555 339550 340122 339702 338727 338225 338881 340565 342707 344905 347008 348790 349981 350729 351603 352828
60025 352828 353799 353768 352821 351704 350717 349242 346454 342212 337167 332257 328053 324333 320340 315762 311386
60010 311386 308330 306672 305387 303735 302073 301025 300479 299902 299259 299002 299326 299949 300587 301269 302246 303834
59994 303834 306231 309161 311894 313953 315662 317629 319863 321838 323332 324640 325974 327176 328171 329215
59980 329215 330504 331966 333643 335815 338423 340762 342187 342945 343901 345484 347169 348040 347707 346614 345485
59965 345485 344482 343068 340915 338750 337798 338326 339294 339640 339324 338793 337964 336353 333848 330792 327576 324671
59949 324671 322749 322070 321909 321327 320415 320104 320760 321775 322627 323516 324690 325942 327137 328554 330199 331443
59933 331443 331874 331976 332363 332836 332868 332636 332825 333666 334870 336314 338052 339725 340722 341035 341333 342088 343133
59916C43133J039J033J087J080J094J166J034O20M52R82J805K178K010J660J091
59901C61464M1j082j363n71N17J127J195R86O61M84Q53J817K903L641L910L665
59885C80248K854J828J340J793K735L408L455K960K179J485J207J164P23k81j118
59870D05980j026k98J06k08p75j115j261j361j388j483k044l097l950l951l346
59855C80783k891k770k444j603p32m42o41p87p01p36j147j704j972j773j264p82
59839C58394o33q22r74p32j89K81O31J147J780J946J366O70P16J466K028J705
59823C68780O56m76j163j274j112j283k128l171l540l047k449k416k676k591k227
59808C39883k144k328k002q28L62N84j6n32p30j251k258k821k226j199r84j546
$$ plain form
59916 343133 344172 345205 346292 347372 348466 349632 350666 351286 351738 352720 354525 356703 358713 360373 361464
59901 361464 361505 360423 359060 358489 359006 360133 361328 362314 362975 363459 364312 366129 369032 372673 376583 380248
59885 380248 383102 384930 386270 388063 390798 394206 397661 400621 402800 404285 405492 406656 407379 407098 405980
59870 405980 404954 404656 404762 404554 403779 402664 401403 400042 398654 397171 395127 392030 388080 384129 380783
59855 380783 377892 375122 372678 371075 370343 369901 369260 368473 367772 367036 365889 364185 362213 360440 359176 358394
59839 358394 357761 356939 355965 355233 355044 355325 355956 357103 358883 360829 362195 362865 363581 365047 367075 368780
59823 368780 369436 368960 367797 366523 365411 364128 362000 358829 355289 352242 349793 347377 344701 342110 339883
59808 339883 337739 335411 333409 332581 332943 333527 333511 332979 332249 330998 328740 325919 323693 322494 321510 319964
59792C19964j674q35M2m6q23j292j051n03j41j70o01j202j541j513j612k257l027
59775C01718l121k397j518j059j020j152j266j144o09J55O62O90N14N15P53R86
59759B92707R35N07m8k48J77R78J717K236K545K455J766P53L9n8K78P96J371J810
59741C10716J918J887K202K963L624L532K614J362M45K42N76Q55O96L19J13l0
59725C34034n05j266j798j842j585j205p54n16q25j395j479r32m70n83q53o83
59709C17343j49L89Q94J413J714J731J884K349K463J615M04O7Q47J767K030J922
59693C38683K114K696L199L167K469J388N19L11N60O54M27L82R28J748K218K183
59677C63646J962J768J470R19J90n64j335k178l002l531l493k888k037j426j362
$$ plain form
59792 319964 318290 317455 317497 317451 316628 315336 314285 313782 313641 313471 312870 311668 310127 308614 307002 304745 301718
59775 301718 298597 296200 294682 293623 292603 291451 290185 289041 288432 288587 289249 289939 290453 290968 291721 292707
59759 292707 293642 294149 294101 293853 294030 295008 296725 298961 301506 303961 305727 306480 306519 306461 306739 307535 308906 310716
59741 310716 312634 314521 316723 319686 323310 326842 329456 330818 331263 331505 332081 332936 333632 333951 334064 334034
59725 334034 333529 332263 330465 328623 327038 325833 325079 324563 323738 322343 320864 319932 319462 318879 318026 317343
59709 317343 317194 317583 318477 319890 321604 323335 325219 327568 330031 331646 332050 332117 332964 334731 336761 338683
59693 338683 340797 343493 346692 349859 352328 353716 354235 354546 355106 355760 356187 356569 357497 359245 361463 363646
59677 363646 365608 367376 368846 369765 369955 369391 368056 365878 362876 359345 355852 352964 350927 349501 348139
59662C48139j744k089j964j415q86p01p25o65m41q0N29J407K133K215J818J602
59646C47133J783J806J280O26M22N13L17k30o96r64j349j818j771r08R6K78m47
59629C46071j235j351q96m29k32k16l47p53j346j695j556j295j445j966k253j948
59613C27108j335q77o70n78n89p22p30k93N09J157J215P67K44o2j90k16J3N71
59595C25322J044P83j98r94q14K7N92N77M72N35L91k20q74j126j193j469j763
59578C21092j516o93P5J77m35j354k114k473k519k482k398k067j485j027r96j162
59562B98623j015l75M48J025J175J046R12Q94Q38O65P53J567K895L822L750L078
59546C20101K655K904L713M890O282P708R203J1193J4023J7214J9405J9041J5290
$$ plain form
59662 348139 346395 344306 342342 340927 340041 339340 338615 337950 337509 337429 337958 339365 341498 343713 345531 347133
59646 347133 348916 350722 352002 352628 353050 353563 353880 353650 352954 351990 350641 348823 347052 346144 346240 346518 346071
59629 346071 344836 343485 342589 342160 341928 341712 341365 340612 339266 337571 336015 334720 333275 331309 329056 327108
59613 327108 325773 324896 324226 323648 323059 322337 321607 321314 321823 322980 324195 324962 325206 325144 324954 324738 324751 325322
59595 325322 326366 327149 326951 325957 325143 325170 325762 326339 326811 327346 327737 327517 326643 325517 324324 322855 321092
59578 321092 319576 318883 318958 319135 318700 317346 315232 312759 310240 307758 305360 303293 301808 300781 299785 298623
59562 298623 297608 297233 297681 298706 299881 300927 301839 302733 303571 304236 304989 306556 309451 313273 317023 320101
59546 320101 322756 325660 329373 334263 340545 348253 357456 368649 382672 399886 419291 438332 453622
59533D53622Q687J154m991q475r604r407q584p385n996m565l092j645m27N30J463
59518D01285K411L035L109K806K226J174j84j102j292j602k850m498n331n204
59504C93983n033n262n359n018m806n253o029o467o342n756m742l423k218j563
59490C26712j480j636j630j212m66J85L94K91K78N33J009J706K505K941K686K160
59474C34976K100K547K881K847K816K872K431J159l54j263j420j225q77k25P51
59459C50016J681K053J727J305J851L819O311P800P748P055O796P056P261P146
59445D19625O889O573N935M710K958J024p37k242l653n048o214o907p133p001
59431D08779o493n643m718l890k981j908j066p68o45j47O16J325K361M416P290
$$ plain form
59533 453622 462309 463463 458472 449997 440393 430986 422402 415017 409021 404456 401364 399719 399292 399822 401285
59518 401285 403696 406731 409840 412646 414872 416046 415862 414760 413468 411866 409016 404518 399187 393983
59504 393983 388950 383688 378329 373311 368505 363252 357223 350756 344414 338658 333916 330493 328275 326712
59490 326712 325232 323596 321966 320754 320288 320473 320867 321158 321436 321969 322978 324684 327189 330130 332816 334976
59474 334976 337076 339623 342504 345351 348167 351039 353470 354629 354275 353012 351592 350367 349490 349265 350016
59459 350016 351697 353750 355477 356782 358633 362452 368763 376563 384311 391366 398162 405218 412479 419625
59445 419625 426514 433087 439022 443732 446690 447714 446977 444735 441082 436034 429820 422913 415780 408779
59431 408779 402286 396643 391925 388035 385054 383146 382080 381312 380667 380520 381136 382461 384822 389238 396528
59416C96528J0063J2455J5128J8514K2294K5881K8254K7375K1421J1389J197n675
59404E84824q849r794r330p443m460r39K928O455P584M325k896j1436j8796k3858
59390E08315k6168k5587k2927j9760j7093j4793j2509j0362q579p141o052n342
59378C32002m710l755k630j826j251l24R02J562J195M02n3q8J50P00J312J174
59362C24762m5j389j545l80J063J912K234K563L213M092M884N300N383N499N898
59347C63444O486P098P774Q473Q891Q914Q969R414R799R380Q300P568P673P808
59333D79991O912N035L151J815N55j357l965o576q410r115q877q167p380o624
59319D36988n870n269n078n267n396n056m305l524l009k774k665k465k047j601
$$ plain form
59416 396528 406591 419046 434174 452688 474982 500863 529117 556492 577913 589302 590499 584824
59404 584824 575975 566181 556851 549408 544948 544009 546937 553392 560976 565301 562405 550969 532173 508315
59390 508315 482147 456560 433633 413873 396780 381987 369478 359116 350537 343396 337344 332002
59378 332002 327292 323537 320907 319081 317830 317506 318408 319970 321165 321567 321514 321426 321576 322276 323588 324762
59362 324762 324717 323328 321783 321403 322466 324378 326612 329175 332388 336480 341364 346664 352047 357546 363444
59347 363444 369930 377028 384802 393275 402166 411080 420049 429463 439262 448642 456942 464510 472183 479991
59333 479991 486903 491938 495089 496904 497459 496102 492137 485561 477151 468036 459159 450992 443612 436988
59319 436988 431118 425849 420771 415504 410108 405052 400747 397223 394214 391440 388775 386310 384263 382662
59305C82662j491j689j567o31O89J426J255P81O02O61P32J033J878L007L722L674
59289C96744L154K632K275J958J631J443J527J678J455P72K54O27J783K827L121
59274D23881K938K918L292L869M464N030N543O044O632P195P372O992O301N597
59260D98068M789L580J908K1j706k897l389l534l952m803n553n662n182m476l713
59245D63499l059k915l422l968l739k697j518o62N8R58J937K612K773K703K976
59230D55536L759M349L787K142N70j69o54j686k937l557l695m300n520o409o367
59215D34849n990o058o488o695o444n899n265m804m727m819m499l583k617k129
59201C64832j949j695j528j929k838l517l361k491j480p03j27L73P11Q00R56J678
$$ plain form
59305 382662 381171 379482 377915 377284 377973 379399 380654 381435 382037 382698 383430 384463 386341 389348 393070 396744
59289 396744 399898 402530 404805 406763 408394 409837 411364 413042 414497 415269 415523 416150 417933 420760 423881
59274 423881 426819 429737 433029 436898 441362 446392 451935 457979 464611 471806 479178 486170 492471 498068
59260 498068 502857 506437 508345 508366 506660 503763 500374 496840 492888 488085 482532 476870 471688 467212 463499
59245 463499 460440 457525 454103 450135 446396 443699 442181 441519 441577 442535 444472 447084 449857 452560 455536
59230 455536 459295 463644 467431 469573 470143 469974 469320 467634 464697 461140 457445 453145 447625 441216 434849
59215 434849 428859 422801 416313 409618 403174 397275 392010 387206 382479 377660 373161 369578 366961 364832
59201 364832 362883 361188 359660 357731 354893 351376 348015 345524 344044 343341 343214 343587 344298 345098 346054 347732
59185C47732K908L811L735L107K932L460L945L708K950K392K481L116L770L854
59171C93901L301K819L097L784L813K899K139K719M602O741Q257Q917Q839Q220
59157D64048P277O138M860L622K674J933R86l03j582k527l225l727l757l205k540
59142D70672k274k318k339k384k596k640k100j289j002j423j900j845j321n72
59128D44669L83J412K024J896J385J210J692K615L647M638N502O066O182N996
59114D89317N987O654Q037R649J0980J1941J2675J3107J3063J2771J2734J2992
59102F19907J2881J1922J0623R971J0163J0305R445P601N602M125L143K242J185
59089G19115J41n47p25n86n24q11j420k158k906l693m638n893p589r622j1530
$$ plain form
59185 347732 350640 354451 358186 361293 364225 367685 371630 375338 378288 380680 383161 386277 390047 393901
59171 393901 397202 400021 403118 406902 410715 413614 415753 418472 423074 429815 438072 446989 455828 464048
59157 464048 471325 477463 482323 485945 488619 490552 491538 491235 489653 487126 483901 480174 476417 473212 470672
59142 470672 468398 466080 463741 461357 458761 456121 454021 452732 451730 450307 448407 446562 445241 444669
59128 444669 445052 446464 448488 450384 451769 452979 454671 457286 460933 465571 471073 477139 483321 489317
59114 489317 495304 501958 509995 519644 530624 542565 555240 568347 581410 594181 606915 619907
59102 619907 632788 644710 655333 665304 675467 685772 695217 702818 708420 712545 715688 717930 719115
59089 719115 719256 718709 717984 717398 716874 716063 714643 712485 709579 705886 701248 695355 687766 678144 666614
59074F66614j2770j3236j3306j3363j3362j3020j2235j1217j0290r767r798j0124
59062E24126j0046r031p365n968n432n386n032m142l326l254l811m219l948l274
59048D49892k799k659k489k071j605j314j128r09o56k55N64J716K546K516J933
59033D43282J568J749K277K972L806M503M690M571M896O025P427Q333Q633Q880
59019E13612R596J0742J1785J2174J1868J1363J1052J0664R631P876N857L894
59007F30114K020N43O3O00J190R03L3k47P66K574M104M696M438L783L002K037
58991F60619Q27l48j067j219j117j121j467k424m213o610q904j0422j1008j0925
58977F00601j0560j0205r843r098p678n916m448l431k480j510r10o85j27J151
$$ plain form
59074 666614 653844 640608 627302 613939 600577 587557 575322 564105 553815 544048 534250 524126
59062 524126 514080 505049 497684 491716 486284 480898 475866 471724 468398 465144 461333 457114 453166 449892
59048 449892 447093 444434 441945 439874 438269 436955 435827 434918 434262 434007 434571 436287 438833 441349 443282
59033 443282 444850 446599 448876 451848 455654 460157 464847 469418 474314 480339 487766 496099 504732 513612
59019 513612 523208 533950 545735 557909 569777 581140 592192 602856 612487 620363 626220 630114
59007 630114 632134 632677 632740 633340 634530 635433 635466 635219 635985 638559 642663 647359 651797 655580 658582 660619
58991 660619 661446 661098 660031 658812 657695 656574 655107 652683 648470 641860 632956 622534 611526 600601
58977 600601 590041 579836 569993 560895 553217 547301 542853 539422 536942 535432 534522 533837 533710 534861
58963E34861K490L150L498M404N740O481O217N712N639N531M467K358jj849l110
58948E85588m157n344o690p887q517q424p787o875n854m898m324m424n167o185
58934D99055p060p558p623p265o544n606m650l846l298l025k925k765k421k071
58920D32398j964j941j569q43m35q32j526j580p69L42J379K454L513M155M495
58905D37277N388P214Q991R425Q552P576P313P503P605P449O957N994M817M220
58891E36281M659N640O387O875P741R377J1630J4221J6881J8928J9442J8273J6488
58878F92823J5245J4446J3039J0492P320M181J125j969m868p373r710j2071j4121
58865G08559j5447j6145j6337j5685j4035j2249j1384j1188j0474r009p919p941
$$ plain form
58963 534861 537351 540501 543999 548403 554143 560624 566841 572553 578192 583723 588190 590548 590547 588698 585588
58948 585588 581431 576087 569397 561510 552993 544569 536782 529907 524053 519155 514831 510407 505240 499055
58934 499055 491995 484437 476814 469549 463005 457399 452749 448903 445605 442580 439655 436890 434469 432398
58920 432398 430434 428493 426924 426081 425646 424814 423288 421708 420939 421281 422660 425114 428627 432782 437277
58905 437277 442665 449879 458870 468295 476847 484423 491736 499239 506844 514293 521250 527244 532061 536281
58891 536281 540940 546580 552967 559842 567583 576960 588590 602811 619692 638620 658062 676335 692823
58878 692823 708068 722514 735553 746045 753365 757546 758671 756702 751834 744461 734751 722680 708559
58865 708559 693112 676967 660630 644945 630910 618661 607277 596089 585615 576606 568687 560746
58853E60746q310q071p540p674q593r554j0057j0200j0119r766r131q303p352
58840D46076o446n795n208m134k587j544j760k574k681j875j223j501k299k852
58826D03597l028l085l007k517j610p17l43o09j097j197p33j59L6m7K4L14M82
58809C86304M50O22J291K134K520K185J439Q06O01P82J112J358J333Q94J26n50
58793D03407o88k94J93M40M54L42K29M20J126J947K185J966K356L913N754O627
58777D30377O423N860N168M065K746J850J332L56j372k966l518l244k920k693
58763D41464k077r62JJ35m83j156j328j063p82p32p77o93m44j40J49M91J075K053
58745D34731L198L839L508K573J905J889K281K990M199N536O000N311M629N126
$$ plain form
58853 560746 552436 544365 536825 529151 520558 511004 500947 490747 480628 470862 461731 453428 446076
58840 446076 439630 433835 428627 424493 421906 420362 418602 416028 413347 411472 410249 408748 406449 403597
58826 403597 400569 397484 394477 391960 390350 389633 389290 388681 387584 386387 385654 385495 385531 385484 385508 385822 386304
58809 386304 386754 387376 388667 390801 393321 395506 396945 397751 398352 399134 400246 401604 402937 403831 403957 403407
58793 403407 402719 402425 402618 403058 403512 403854 404083 404503 405629 407576 409761 411727 414083 417996 423750 430377
58777 430377 436800 442660 447828 451893 454639 456489 457821 458177 456805 453839 450321 447077 444157 441464
58763 441464 439387 438425 438426 438561 438078 436922 435594 434531 433749 433017 432240 431547 431103 430963 431112 431603 432678 434731
58745 434731 437929 441768 445276 447849 449754 451643 453924 456914 461113 466649 472649 477960 482589 487715
58731D87715O411P166O900O274N931N904O092O481O793O605N878M990M194L533
58717E70867L103K951K903K944L484M671N779O039N791O009O858P612P837P699
58703F44547P130N712L566J404m91k543m950p331r443j1448j3221j4277j4640
58690E84015j4922j5240j4941j3810j2637j2009j1410j0152q557p454p048o886
58678D48949o532n773m544l163k267k030j901j381o19J10R04J781K318K313K310
58663D30475K916M001N050N782N978N259L681K056J059L97m36j168j260r96j093
58648D61701j428j144j35N34o1j516k600k625j985j511j542j656j340p49m76o35
58632D42832n92J29J147J741J735J457J180Q54K98o21j722k332j784k61J288K276
$$ plain form
58731 487715 494126 501292 508192 514466 520397 526301 532393 538874 545667 552272 558150 563140 567334 570867
58717 570867 573970 576921 579824 582768 586252 590923 596702 602741 608532 614541 621399 629011 636848 644547
58703 644547 651677 657389 660955 662359 661868 659325 654375 647044 637601 626153 612932 598655 584015
58690 584015 569093 553853 538912 525102 512465 500456 489046 478894 470337 462883 455835 448949
58678 448949 442417 436644 432100 428937 426670 424640 422739 421358 420739 420849 421753 423534 425852 428165 430475
58663 430475 433391 437392 442442 448224 454202 459461 463142 465198 466257 466654 466218 465050 463790 462794 461701
58648 461701 460273 459129 458994 459528 459467 457951 455351 452726 450741 449230 447688 446032 444692 443943 443467 442832
58632 442832 442240 442369 443516 445257 446992 448449 449629 450483 450781 450160 448438 446106 444322 444061 445349 447625
58616D47625K980L751M402M772N182N848O438O692O801O662N596L512J582Q41
58602E12684P33R9j009j653j647j630j805j849j906k355k663j848k49M99l40j603
58586D93458j863r90M00J966L407M113L891L442L497L951M462N186O270P091O780
58571E45061N338L708K915L461N119O887P621P236O995Q074J0165J1979J2838
58558F37397J3162J3660J4596J5713J6365J5863J4171J2100J0340Q566O093L163
58546G81189Q10o20j970m067o682q984j0505j1199j1127j0567j0189j0528j1364
58533F84197j1994j2039j1659j1095j0324r234p840o375n239m712m496l813k351
58520E83026q98m55p85n90O70J908J836O47l57m94k63l08n10l27M84J616K480
$$ plain form
58616 447625 450605 454356 458758 463530 468712 474560 480998 487690 494491 501153 506749 510261 511843 512684
58602 512684 513417 513516 512507 510854 509207 507577 505772 503923 502017 499662 496999 495151 494902 495401 495061 493458
58586 493458 491595 490605 491005 492971 496378 500491 504382 507824 511321 515272 519734 524920 531190 538281 545061
58571 545061 550399 554107 557022 560483 565602 572489 580110 587346 594341 602415 612580 624559 637397
58558 637397 650559 664219 678815 694528 710893 726756 740927 753027 763367 771933 778026 781189
58546 781189 781999 781379 779409 775342 768660 759676 749171 737972 726845 716278 706089 695561 684197
58533 684197 672203 660164 648505 637410 627086 617852 610012 603637 598398 593686 589190 585377 583026
58520 583026 582128 581673 580888 580298 580968 582876 584712 585359 585002 584508 584245 583937 583427 583100 583584 585200 587680
58503E87680K649K263J940K075K375K347J945J325L02j170k280k011o54K81j00
58488E98967j126j803k087k316k270j642q56n17l87K20J221J876K041K444L564
58473E97329M920N774N986N851N547N045M322L371K191R12j91r51j451j782j890
58458F34983j766j624j677j736j327l09Q63J728K543L856N386O006N197L921L350
58443F59394L266K593J276L92L92M00l69j449j942j678r84m4R51J621J967K543
58427F68329L525M306M486M540M889N116M911M873N473N969N565M899N097N792
58413G37770N571M209L001K855L302L595L543L024J796K71n02r9O97R40M96k49
58397G70220r15j061k63J345L048M282M938M965M315L427L038L284L608L668L662
$$ plain form
58503 587680 590329 592592 594532 596607 598982 601329 603274 604599 604901 603731 601451 599440 598786 599067 598967
58488 598967 597841 596038 593951 591635 589365 587723 586867 586350 585963 586183 587404 589280 591321 593765 597329
58473 597329 602249 608023 614009 619860 625407 630452 634774 638145 640336 641248 641057 640106 638655 636873 634983
58458 634983 633217 631593 629916 628180 626853 626544 627407 629135 631678 635534 640920 646926 652123 656044 659394
58443 659394 662660 665253 666529 666921 667313 667713 667344 665895 663953 662275 661291 661247 662198 663819 665786 668329
58427 668329 671854 676160 680646 685186 690075 695191 700102 704975 710448 716417 721982 726881 731978 737770
58413 737770 743341 747550 750551 753406 756708 760303 763846 766870 768666 768937 768435 768336 769033 769973 770469 770220
58397 770220 769305 768244 767981 769326 772374 776656 781594 786559 790874 794301 797339 800623 804231 807899 811561
58382H11561L603L036J869Q50P26J369K058K272J995J613J660K386L403M160M681
58367H47242N383O232O726O779O948P622Q518R233R680R899R883R773R788R891
58353I63597R901R949J0257J0534J0218R322Q398P742P261P080P483Q238Q719
58340A078699Q822R027R473R856J0227J1011J2121J2925J3330J3979J5103J6089
58328A220662J6464J6418J6180J5730J5430J5915J6920J7249J6423J5419J5230
58317A398040J5545J5488J4883J4116J3443J3054J3201J3715J3986J3852J3932
58306A553255J4580J5314J5721J6214J7285J8647J9754K0614K1510K2456K3389
58295A758739K4409K5371K5824K5769K5844K6470K7341K8031K8433K8433K7987
$$ plain form
58382 811561 815164 818200 820069 820919 821645 823014 825072 827344 829339 830952 832612 834998 838401 842561 847242
58367 847242 852625 858857 865583 872362 879310 886932 895450 904683 914363 924262 934145 943918 953706 963597
58353 963597 973498 983447 993704 1004238 1014456 1023778 1032176 1039918 1047179 1054259 1061742 1069980 1078699
58340 1078699 1087521 1096548 1106021 1115877 1126104 1137115 1149236 1162161 1175491 1189470 1204573 1220662
58328 1220662 1237126 1253544 1269724 1285454 1300884 1316799 1333719 1350968 1367391 1382810 1398040
58317 1398040 1413585 1429073 1443956 1458072 1471515 1484569 1497770 1511485 1525471 1539323 1553255
58306 1553255 1567835 1583149 1598870 1615084 1632369 1651016 1670770 1691384 1712894 1735350 1758739
58295 1758739 1783148 1808519 1834343 1860112 1885956 1912426 1939767 1967798 1996231 2024664 2052651
58284B052651K7737K8558L0159L1210L1290L1592L3146L5465L7555L9244M0830
58273B419437M2411M4356M7384N1392N5169N7987O0524O3457O6335O8681P1104
58262C048237P4208P7419Q0015Q2391Q5289Q8500R1444R4212R7088R9767J01942
58251D020512J03936J05996J07897J09992J13453J18544J23916J28664J33857
58242E066767J40739J48723J56528J64285J73005J82973J93947K06034K19005
58233F652006K31899K44566K58541K74958K92952L11538L31669L54615L79674
58224I332418M05583M33147M64369M99775N38588N80833O27485O79244P36906
58215A4298348Q02222Q76963R61982J058558J169424J297301J443922J611886
$$ plain form
58284 2052651 2080388 2108946 2139105 2170315 2201605 2233197 2266343 2301808 2339363 2378607 2419437
58273 2419437 2461848 2506204 2553588 2604980 2660149 2718136 2778660 2842117 2908452 2977133 3048237
58262 3048237 3122445 3199864 3279879 3362270 3447559 3536059 3627503 3721715 3818803 3918570 4020512
58251 4020512 4124448 4230444 4338341 4448333 4561786 4680330 4804246 4932910 5066767
58242 5066767 5207506 5356229 5512757 5677042 5850047 6033020 6226967 6433001 6652006
58233 6652006 6883905 7128471 7387012 7661970 7954922 8266460 8598129 8952744 9332418
58224 9332418 9738001 10171148 10635517 11135292 11673880 12254713 12882198 13561442 14298348
58215 14298348 15100570 15977533 16939515 17998073 19167497 20464798 21908720 23520606
58207B3520606J805976K031505K292885K593498K933769L310802L728662M214237
58199D6431940M818076N595077O588896P837825R385251J1272061J3518917J6116673
58191A21564716J9018062K2116814K5222214K8031187L0073324L0655165K8945131
58184C05626613K4317706J6817332P367366k521219j1365427j8214479k2772783
58177B99255109k5222610k5980040k5517732k4259587k2529274k0549783j8473953
58170A36722130j6411490j4440102j2611664j0958372r494420q216275p109215
58163E7480592o156347n340952m644388m047887l536820l100178k726885k405889
58155B5521246k128980j890254j683378j502208j343385j205409j085485r79725
$$ plain form
58207 23520606 25326582 27358087 29650972 32244470 35178239 38489041 42217703 46431940
58199 46431940 51250016 56845093 63433989 71271814 80657065 91929126 105448043 121564716
58191 121564716 140582778 162699592 187921806 215952993 246026317 276681482 305626613
58184 305626613 329944319 346761651 354129017 351607798 340242371 322027892 299255109
58177 299255109 274032499 248052459 222534727 198275140 175745866 155196083 136722130
58170 136722130 120310640 105870538 93258874 82300502 72806082 64589807 57480592
58163 57480592 51324245 45983293 41338905 37291018 33754198 30654020 27927135 25521246
58155 25521246 23392266 21502012 19818634 18316426 16973041 15767632 14682147 13702422
58147A3702422q85923q03533p31219o66766o09239n58916n15103m75883m40057
58138H015783m07565l78037l50645l25370l02850k82857k64285k46636k30308
58129E227230k15475k01861j89562j78890j69445j60440j51822j44083j37075
58120C678577j30020j22709j15707j09446j03895r9014r4724r0573q6196q1944
58110B644349p8310p4979p1218o7034o3117n9854n7105n4789n2943n1328m9621
58099A964051m7886m6305m4650m2686m0735l9266l8180l7121l6132l5358l4458
58088A521274l3044l1419l0164k9276k8361k7375k6440k5335k3923k2805k2650
58077A220482k3132k3311k2875k2226k1523k0607j9765j9548j9829j9869j9435
$$ plain form
58147 13702422 12816499 12012966 11281747 10614981 10005742 9446826 8931723 8455840 8015783
58138 8015783 7608218 7230181 6879536 6554166 6251316 5968459 5704174 5457538 5227230
58129 5227230 5011755 4809894 4620332 4441442 4271997 4111557 3959735 3815652 3678577
58120 3678577 3548557 3425848 3310141 3200695 3096800 2997786 2903062 2812489 2726293 2644349
58110 2644349 2566039 2491060 2419842 2352808 2289691 2229837 2172732 2117943 2065000 2013672 1964051
58099 1964051 1916165 1869860 1825210 1782524 1741789 1702523 1664343 1627222 1591090 1555732 1521274
58088 1521274 1488230 1456811 1426647 1397371 1369010 1341635 1315195 1289860 1265937 1243132 1220482
58077 1220482 1197350 1174039 1151164 1128938 1107415 1086808 1067043 1047495 1027666 1007797 988362
58066I88362j9010j8783j8264j7145j5865j4929j4265j3564j2873j2501j2619
58055H18544j3103j3569j3627j3234j2754j2348j1618j0259q754p867p527o992
58043F86892o074n522n976p102q045q341q079p581p162p043p181p269p030o528
58029E87959o199o492p364q205q460q341q493q943q950q100p034o613o851p096
58015D80818o922o396n785n445n668o171o149n291m322m031m200m087l550k982
58001D09819k567k329k553l327l935l600k632j948j740j496j187j250j474j023
57987C78758J71J081R99M09P7P0Q3O8M0j27l78m24k66k75m93m93j02L07N14O63
57967C80682N95j79j363j663m16J229J595M68r46j629j512r68m38n52j724l428
$$ plain form
58066 988362 969352 950569 932305 915160 899295 884366 870101 856537 843664 831163 818544
58055 818544 805441 791872 778245 765011 752257 739909 728291 718032 709278 701411 693884 686892
58043 686892 680818 675296 669320 662218 654173 645832 637753 630172 623010 615967 608786 601517 594487 587959
58029 587959 581760 575268 567904 559699 551239 542898 534405 525462 516512 508412 501378 494765 487914 480818
58015 480818 473896 467500 461715 456270 450602 444431 438282 432991 428669 424638 420438 416351 412801 409819
58001 409819 407252 404923 402370 399043 395108 391508 388876 386928 385188 383692 382505 381255 379781 378758
57987 378758 378929 380010 381009 381418 381495 381565 381648 381716 381756 381629 381251 380827 380561 380286 379793 379300 379198 379505 380019 380682
57967 380682 381277 381098 379735 378072 377656 378885 380480 380948 380002 378373 376861 375893 375455 374903 373179 369751
57951C69751m497m400l733l340l391l589l806m058m108l556k392j135k74J85N37
57936C28194R53J490K306L506M759N555N842O034O239O030N160M061L212K495
57922C85836J642Q12K09m59j454k370k722k832l363m257m974n524o274o913o757
57907C40600o013n605n667n432m790m627n204n536n077m727n287n987n599m247
57893B66802k989k324k108k355k972l133k101n04K17m30j525j937j265K08J736
57878B45320K463K274K067K508K900K141N04o39p19n32q53j636k621l707m422
57863B45048m068k890k086k198k344j633n02K08O85J683L072L947M088M288N067
57848B52365N874N978N506N043M634L805K520J450J063R08K30j016k208k995l572
$$ plain form
57951 369751 365254 360854 357121 353781 350390 346801 342995 338937 334829 331273 328881 327746 327472 327657 328194
57936 328194 329147 330637 332943 336449 341208 346763 352605 358639 364878 370908 376068 380129 383341 385836
57922 385836 387478 388290 388499 388040 386586 384216 381494 378662 375299 371042 366068 360544 354270 347357 340600
57907 340600 334587 328982 323315 317883 313093 308466 303262 297726 292649 287922 282635 276648 271049 266802
57893 266802 263813 261489 259381 257026 254054 250921 248820 248316 248533 248103 246578 244641 243376 243584 245320
57878 245320 247783 250057 252124 254632 257532 259673 260177 259538 258819 258287 257434 255798 253177 249470 245048
57863 245048 240980 238090 236004 233806 231462 229829 229327 229535 230220 231903 234975 238922 243010 247298 252365
57848 252365 258239 264217 269723 274766 279400 283205 285725 287175 288238 289146 289376 288360 286152 283157 279585
57833B79585m083m319m326m586n227n560n003m033l495l351k855j844r55n97m20
57818B28931l4M76R19J298J501J278Q08O66R13P39n14k393l876m513m574m329
57802B17296l736k827j979j657j995k660l043k727j822p82R5Q01J312J535J589
57787A99400J742J939J815J340R95R95Q69J97o41j000r38r73j049m97Q49K168
57771B07211K589K212J883K189K968L616L616K824J485j3j491k975m365n319n655
57756B10775n724o032o532o612n882m656l544k751k188j958k284k924l141k519
57742A54028j448o75n43q73j266j328p93J87J048J331J128Q42O98O62O72O39M62
57725A54771K20J21O4l73j143j426o81M16P94N04M71R14J074O51M71J173K101
$$ plain form
57833 279585 275502 271183 266857 262271 257044 251484 246481 242448 238953 235602 232747 230903 229948 229351 228931
57818 228931 228897 229373 230292 231590 233091 234369 235177 235843 236756 237495 236981 234588 230712 226199 221625 217296
57802 217296 213560 210733 208754 207097 205102 202442 199399 196672 194850 194068 194163 194964 196276 197811 199400
57787 199400 201142 203081 204896 206236 207231 208226 209095 209292 208651 207651 206713 205740 204691 204194 205043 207211
57771 207211 209800 212012 213895 216084 219052 222668 226284 229108 230593 230580 229089 226114 221749 216430 210775
57756 210775 205051 199019 192487 185875 179993 175337 171793 169042 166854 164896 162612 159688 156547 154028
57742 154028 152580 151905 151362 150489 149223 147895 147102 147289 148337 149668 150796 151638 152336 152998 153670 154309 154771
57725 154771 154991 155112 155176 154803 153660 152234 151553 151969 152763 153267 153738 154652 155726 156377 156848 158021 160122
57708A60122K207J571J295K082L513M631M848M349L922M330N631P132P976P650
57694B21259O000L303L89j841l253m418n558o079n546m516l893l781l482k478
57680A86106r82L27R33J035J689M000P943J2343J6304K0173K4725K9986L5425
57667C40007M0732M5464M8105M6230L8050K3772N925j1476k4808l2796l6688l8217
57655D44300l7839l5374l1577k7861k4791k1864j8790j5950j3504j1107q722o910
57643A90011n904n189m313l469k968k674k360k111j991j794j357p75j30N09P40
57628A56225J77p69j147p99o11j059j435j005j59L83P72J455J994J563L32p16
57612A55201j200j532j742j229pQ57N85k50o07l62j49k81m81n29m70k63K42Q55
$$ plain form
57708 160122 162329 163900 165195 167277 170790 175421 180269 184618 188540 192870 198501 205633 213609 221259
57694 221259 227259 230562 230951 229110 225857 221439 215881 209802 204256 199740 195847 192066 188584 186106
57680 186106 185124 185451 186384 187419 189108 193108 201051 213394 229698 249871 274596 304582 340007
57667 340007 380739 426203 474308 520538 558588 582360 588285 576809 552001 519205 482517 444300
57655 444300 406461 371087 339510 311649 286858 264994 246204 230254 216750 205643 196921 190011
57643 190011 184107 178918 174605 171136 168168 165494 163134 161023 159032 157238 155881 155106 154976 155485 156225
57628 156225 156402 155633 154486 153687 153076 152017 150582 149577 149418 149801 150573 152028 154022 155585 155917 155201
57612 155201 154001 152469 150727 149498 149491 150348 150933 150683 150076 149714 149565 149284 148803 148274 147804 147541 147783 148638
57594A48638J100Q34M73M05M78L19q1m02m50k83QL60O40P45P81Q47O94mr74j436
57574A52692j029k43K80M47M19J84j32l6O31J169R21M12P32J900K791K654J879
57557A65671J072M20J90R00K370L415L121J925Q35J78k48m11k09j2k19n74n45
57540A77879j94K2J04L83Q09J029J035J043Q78K66l35j26P60J265Q52K12J80O81
57522A86743J139J287J136O40j22p42r37q82q41o63o8Q62J743K288K441K307K128
57505A98459K066J932J438Q30P91J454K014J761J070Q67J371J955K099J923J799
57490B21829J886K196K729L399L966M201M028L623L398L721M431M827M398L465
57476B72097K851K979L530L869L576K629J432N96M21N49M02r8m68k61M76J393
$$ plain form
57594 148638 149738 150572 151045 151450 151928 152247 152166 151764 151314 151031 151039 151399 152039 152784 153565 154412 155106 155102 154128 152692
57574 152692 151663 151420 151700 152147 152566 152750 152618 152582 153213 154382 155303 155715 156447 158347 161138 163792 165671
57557 165671 166743 167163 167353 168253 170623 174038 177159 179084 179919 180097 179849 179438 179229 179217 178998 178424 177879
57540 177879 177685 177707 177811 178194 179003 180032 181067 182110 182988 183254 182919 182793 183553 184818 185670 185882 186062 186743
57522 186743 187882 189169 190305 190945 190823 190081 189144 188262 187421 186758 186690 187552 189295 191583 194024 196331 198459
57505 198459 200525 202457 203895 204725 205516 206970 208984 210745 211815 212682 214053 216008 218107 220030 221829
57490 221829 223715 225911 228640 232039 236005 240206 244234 247857 251255 254976 259407 264234 268632 272097
57476 272097 274948 277927 281457 285326 288902 291531 292963 293559 293980 294529 294931 294833 294365 294104 294580 295973
57460B95973K155K544K526K321K261K498K944L393L549L090K045J054Q66J529
57446C28748K350K710K581K224J861J723K072K820L435L513L246L058L110L317
57432C66768L609L854L779L372L125L452M002M052L471K827K560K549K611K889
57418D12920L444L903L848L401L059L162L680M454N303N954O139N819N292M997
57404D75375N183N605N563M607L197K427K836L776M327M438M739N371N774N629
57390E38847N404N573N888N861N651N851O544P130P176O903O672O389N799N121
57376F24809M917N330N790N625M827M027L808M148M568M730M780N048N493N599
57362F93499N030M209M046M989O511P705Q212Q388Q582Q609Q120P324P062P940
$$ plain form
57460 295973 298128 300672 303198 305519 307780 310278 313222 316615 320164 323254 325299 326353 327219 328748
57446 328748 331098 333808 336389 338613 340474 342197 344269 347089 350524 354037 357283 360341 363451 366768
57432 366768 370377 374231 378010 381382 384507 387959 391961 396013 399484 402311 404871 407420 410031 412920
57418 412920 416364 420267 424115 427516 430575 433737 437417 441871 447174 453128 459267 465086 470378 475375
57404 475375 480558 486163 491726 496333 499530 501957 504793 508569 512896 517334 522073 527444 533218 538847
57390 538847 544251 549824 555712 561573 567224 573075 579619 586749 593925 600828 607500 613889 619688 624809
57376 624809 629726 635056 640846 646471 651298 655325 659133 663281 667849 672579 677359 682407 687900 693499
57362 693499 698529 702738 706784 711773 718284 725989 734201 742589 751171 759780 767900 775224 782286 790226
57348G90226R510J0495J0022Q582P609Q044R415J0432J0362R637R208R543J0295
57335I13380J0798J0698J0186R660R311R099R089R441R981J0107R528Q830Q762
57322A038870R144R140Q625Q473R192J0122J0492J0549J0885J1267J1099J0709
57310A158567J1038J2066J2608J1960J0855J0339J0496J0796J1085J1596J2369
57299A283775J3193J3876J4147J3694J2774J2353J3031J4071J4190J3205J2179
57288A430488J2012J2479J2830J2758J2530J2532J2971J3718J4316J4286J3612
57277A574532J2802J2412J2619J3161J3525J3321J2742J2578J3332J4458J4918
57266A720400J4521J4143J4486J5194J5571J5606J5771J6016J5746J4777J3839
$$ plain form
57348 790226 799736 810231 820253 828835 836444 844488 853903 864335 874697 884334 893542 903085 913380
57335 913380 924178 934876 945062 954722 964033 973132 982221 991662 1001643 1011750 1021278 1030108 1038870
57322 1038870 1048014 1057154 1065779 1074252 1083444 1093566 1104058 1114607 1125492 1136759 1147858 1158567
57310 1158567 1169605 1181671 1194279 1206239 1217094 1227433 1237929 1248725 1259810 1271406 1283775
57299 1283775 1296968 1310844 1324991 1338685 1351459 1363812 1376843 1390914 1405104 1418309 1430488
57288 1430488 1442500 1454979 1467809 1480567 1493097 1505629 1518600 1532318 1546634 1560920 1574532
57277 1574532 1587334 1599746 1612365 1625526 1639051 1652372 1665114 1677692 1691024 1705482 1720400
57266 1720400 1734921 1749064 1763550 1778744 1794315 1809921 1825692 1841708 1857454 1872231 1886070
57255A886070J3800J4696J5739J6153J5832J5222J4735J4434J4219J4049J3877
57244B048826J3503J2812J2120J1954J2363J2768J2691J2392J2466J3017J3575
57233B188487J3765J3681J3563J3421J3133J2689J2175J1643J1203J1020J1137
57222B325917J1348J1449J1500J1674J1892J1871J1485J0900J0298R698R111Q663
57210B455806Q418Q213P919P656P628P782P955Q205Q687R229R515R712J0406J1662
57196B578793J2621J2557J1992J2123J3245J4334J4308J3205J1844J0856J0406
57185B716284J0467J0857J1100J0736R852R019Q661Q661Q635Q287P497O357N264
57172B831677M681M535M100K811J087r4l62k49k41r7N08J115R41L0p12p19m54
$$ plain form
57255 1886070 1899870 1914566 1930305 1946458 1962290 1977512 1992247 2006681 2020900 2034949 2048826
57244 2048826 2062329 2075141 2087261 2099215 2111578 2124346 2137037 2149429 2161895 2174912 2188487
57233 2188487 2202252 2215933 2229496 2242917 2256050 2268739 2280914 2292557 2303760 2314780 2325917
57222 2325917 2337265 2348714 2360214 2371888 2383780 2395651 2407136 2418036 2428334 2438032 2447143 2455806
57210 2455806 2464224 2472437 2480356 2488012 2495640 2503422 2511377 2519582 2528269 2537498 2547013 2556725 2567131 2578793
57196 2578793 2591414 2603971 2615963 2628086 2641331 2655665 2669973 2683178 2695022 2705878 2716284
57185 2716284 2726751 2737608 2748708 2759444 2769296 2778315 2786976 2795637 2804272 2812559 2820056 2826413 2831677
57172 2831677 2836358 2840893 2844993 2847804 2848891 2848797 2848435 2848186 2847945 2847848 2848356 2849471 2850412 2850442 2849730 2849011 2848557
57155B848557o43j325j961k103j539j87J634L049L309K742K405K770L149K714
57141B862571J612O88K31m25j954m033n689o605p558r315j1462j2814j2914j2429
57127B779904j1943j1076r181o443l598r39J694M145N938P129Q528J0846J4059
57114B789063J7757K1645K5611K9783L4750M1289M9680N9628P1035Q4442J00566
57103C325249J19855J42795J70203K03033K42328K89634L46901M15516M95784
57094E751298N87589O90770Q04010R23684J044465J160715J266559J355145J419314
57085A5003549J453707J455726J424088J356687J249744J098712R00485O56733
57077B4599431L76830P7919k18713m92732p28721r18192j059884j158245j220373
$$ plain form
57155 2848557 2847914 2846589 2844628 2842525 2840986 2840799 2842433 2845482 2848791 2851533 2853938 2856708 2859857 2862571
57141 2862571 2864183 2864871 2865102 2864677 2862723 2858690 2853001 2846396 2838838 2829523 2818061 2805247 2792333 2779904
57127 2779904 2767961 2756885 2747704 2741261 2737663 2736724 2738418 2742563 2748501 2755630 2764158 2775004 2789063
57114 2789063 2806820 2828465 2854076 2883859 2918609 2959898 3009578 3069206 3140241 3224683 3325249
57103 3325249 3445104 3587899 3758102 3961135 4203463 4493097 4839998 5255514 5751298
57094 5751298 6338887 7029657 7833667 8757351 9801816 10962531 12229090 13584235 15003549
57085 15003549 16457256 17912982 19337070 20693757 21943501 23042213 23942698 24599431
57077 24599431 24976261 25054180 24835467 24342735 23614014 22695822 21635938 20477693 19257320
57068A9257320j253139j262035j251409j224627j184028j131407j068958r99585
57060I882132r26193q51011p75731p02095o31961n66803n07228m53117m04154
57051D063839l60131l20771k85516k53806k25513k00825j79614j61180j44757
57042A931726j30050j17024j05448r4925q5334p6834o9533o3309n7999n3458m9406
57031A028406m5475m1544l7827l4622l2071l0181k8792k7460k5767k3831k2278
57020F78558k1443k0892k0059j9028j8297j7884j7263j6197j5118j4401j3799
57009D84177j2910j1929j1416j1414j1226j0227q592p156o618o971p575p786p517
56996C62840p153o874o368n403m376l872l788l454k596j654r23l5J312K518K666
$$ plain form
57068 19257320 18004181 16742146 15490737 14266110 13082082 11950675 10881717 9882132
57060 9882132 8955939 8104928 7329197 6627102 5995141 5428338 4921110 4467993 4063839
57051 4063839 3703708 3382937 3097421 2843615 2618102 2417277 2237663 2076483 1931726
57042 1931726 1801676 1684652 1579204 1484279 1398945 1322111 1252578 1189269 1131270 1077812 1028406
57031 1028406 982931 941387 903560 868938 836867 806686 777894 750434 724667 700836 678558
57020 678558 657115 636223 616164 597136 578839 560955 543692 527495 512377 497976 484177
57009 484177 471267 459338 447922 436508 425282 415055 406463 399307 392689 385718 378143 370357 362840
56996 362840 355687 348813 342445 337042 332666 328794 325006 321552 318956 317302 316379 316344 317656 320174 322840
56981C22840J649K20j073k354l855n424o794p837q352q047p083o202n864n532
56967B56292m399k609j132l68M36K117M463O607Q161R398J0426J0809J0122Q417
56953C18740N883K504j561n496q219r307r241q694p917o908n794m712l510j906
56939B53862J0J748K989L983N322P421J0275J3451J6104J7218J6194J3259R151
56926C70987M431o02n498r588j2538j4565j5822j5992j4860j3037j1484j0467
56914B50965r516q437p648p359p033o127m861l811l074k398j858j832k278k563
56900A82170k132j013L51J482K077K196K295K884M146N966Q124J0183J1507J1889
56886B42125J1984J2538J3169J2575J0107O537L031mk680m771n757n561m733l879
$$ plain form
56981 322840 324489 324709 323636 321282 317427 312003 305209 297372 289020 280973 273890 267688 261824 256292
56967 256292 251893 249284 248152 247784 248220 250337 254800 261407 269568 278966 289392 300201 310323 318740
56953 318740 324623 327127 325566 320070 311851 302544 293303 284609 276692 269784 263990 259278 255768 253862
56939 253862 253872 255620 258609 262592 267914 275335 285610 299061 315165 332383 348577 361836 370987
56926 370987 375418 374816 369318 359730 347192 332627 316805 300813 285953 272916 261432 250965
56914 250965 241449 233012 225364 218005 210972 204845 199984 196173 193099 190701 188843 187011 184733 182170
56900 182170 180038 179025 179376 180858 182935 185131 187426 190310 194456 200422 208546 218729 230236 242125
56886 242125 254109 266647 279816 292391 302498 309035 312066 312062 309382 304611 298854 293293 288560 284681
56872B84681l151k218n87J918M883P654J0009J2281J4781J7534K0587K4071K7587
56859D20030L0033L0422K8506K4278J7483Q374j422r633j4977j7664j8488j8044
56847D78898j6717j4704j1913q318m380n09L786R459J6443K3451K9490L4881M0305
56834E80172M5450M9088M9935M6938L9308K7124J1900m005j8469l0001l7647m1316
56822G18477m1996m0953l8692l5108l0377k5006j9095j2525n883k66M296R313
56810D82185J5998K3467K9560L3056L4163L2973K8530K0024Q326m209j5314k3937
56798F64822k9983l3545l4655l3599l1151k8221k5253k2108j8628j5050j1716
56787C80913q499m917p20L854Q358J2321J5116J6093J5032J2283Q241L016l179
$$ plain form
56872 284681 281530 279312 278725 280643 285526 293180 303189 315470 330251 347785 368372 392443 420030
56859 420030 450063 480485 508991 533269 550752 559126 557704 548071 533094 515430 496942 478898
56847 478898 462181 447477 435564 427246 422866 422357 426143 435602 452045 475496 504986 539867 580172
56834 580172 625622 674710 724645 771583 810891 838015 849915 845910 827441 797440 759793 718477
56822 718477 676481 635528 596836 561728 531351 506345 487250 474725 468842 468576 472872 482185
56810 482185 498183 521650 551210 584266 618429 651402 679932 699956 708282 704073 688759 664822
56798 664822 634839 601294 566639 533040 501889 473668 448415 426307 407679 392629 380913
56787 380913 372414 367497 366777 370631 378989 391310 406426 422519 437551 449834 458075 461091 457912
56774D57912r579j5130j9129k1515k2650k2979k2698k1623j9619j7169j5146j3804
56762B36871j2506j0791r209q440q064p129n711m916n136n296m300k530j236r44
56748A50663j151j292j325j344j239r39o40o01q11r68q00l11K27N76O78N38J17
56731A41378m79q34o25p8K99L73L81L67J09k61k33L37R38J170J287J666K128K214
56713A50137J728P13p38k223k960k484j158K80J355J739J121k65j405j513r69
56698A43358o37o56o07n90j064j818j970j215k41K60K91Q2k89n71l21M39J045
56681A35496J029O07J68j96l93k18J53J15m43p30p8J075J809J900J769J594J214
56664A44871P61O56Q67Q31L50P1P10K072L181L333K783K274K108J815Q53o18j861
$$ plain form
56774 457912 448333 433203 414074 392559 369909 346930 324232 302609 282990 265821 250675 236871
56762 236871 224365 213574 204365 195925 187861 180732 175021 170105 164969 159673 155373 152843 151607 150663
56748 150663 149512 148220 146895 145551 144312 143373 142733 142132 141321 140353 139553 139242 139469 140045 140723 141261 141378
56731 141378 140899 140065 139440 139362 139661 140034 140415 140782 140891 140630 140397 140734 141672 142842 144129 145795 147923 150137
56713 150137 151865 152578 151840 149617 146657 144173 143015 143295 144650 146389 147510 147245 145840 144327 143358
56698 143358 142721 142065 141458 140868 139804 137986 136016 134801 134560 134820 135111 135193 134904 134333 134012 134451 135496
56681 135496 136525 137132 137300 137104 136711 136493 136646 136761 136318 135588 135510 136585 138394 140294 142063 143657 144871
56664 144871 145632 146288 147155 147986 148336 148407 149117 151189 154370 157703 160486 162760 164868 166683 167536 166918 165057
56647A65057k424k543k676k913l014k780k248j721j671k336l207l332k393j232
56633A30567q81j304j585j252p77o69o38p8R54J712J683J113N91M26O24J187K049
56616A33722K820K920K172J019J13k56k67l24p36j404j771j347l86K76K55M9J30
56599A36985Q1p50k054k724k242j183k57M88J257J846J877J382P63L60K68M18
56583A36515O25O73N07K88J63J44K29L50K59j85n55j50J029K061K197J830J912
56566A47892K661L350L395L163L402M224M999N307N535O188O864O559N076L448
56552B12063K547J927P54o24j114o67m75j192k045k186j900j825j828j484j103
56537B00848j285j853k058j663j065n55j66j74q44j749k057j671j366j616j946
$$ plain form
56647 165057 162633 160090 157414 154501 151487 148707 146459 144738 143067 140731 137524 134192 131799 130567
56633 130567 129686 128382 126797 125545 124768 124099 123461 123383 124337 126049 127732 128845 129436 129862 130486 131673 133722
56616 133722 136542 139462 141634 142653 142766 142510 142243 141919 141183 139779 138008 136661 136275 136551 136806 136855 136985
56599 136985 137066 136316 134262 131538 129296 128113 127856 128344 129601 131447 133324 134706 135469 135829 136097 136515
56583 136515 137140 137813 138320 138608 138771 138915 139144 139494 139753 139568 139013 138863 139892 141953 144150 145980 147892
56566 147892 150553 153903 157298 160461 163863 168087 173086 178393 183928 190116 196980 203539 208615 212063
56552 212063 214610 216537 217291 216667 215553 214886 214411 213219 211174 208988 207088 205263 203435 201951 200848
56537 200848 199563 197710 195652 193989 192924 192369 192203 192029 191185 189436 187379 185708 184342 182726 180780
56522A80780j781j335j223j599k114k431k405j915j012j13K75P0l42n78n06j23
56506A63648M60Q44N31m12j140q82J28Q99Q21P5r65k089k834k477r94N50J194
56489A57357J219J392J544R21k95r64n97L5J82O1J10K56M03Q50J574J800J008
56472A66856j71p33m90O5N79Q90P70L09J20N14R02P57N93J129J944K021J361R42
56454A78358J157J397J234J030J056J034Q22P90J073J174P71L11L13N54M48o3
56438A91459n52p72q61r11o86O8J124J749J320R4r60j207r25o15k45L36O54J87
56420A89257n30l22R90K236K419J821J277J062J029J191J536J683J336Q49P91
56405B06625J072J020L11o21j149j156j004j013j119j035o43p5N58J302K063K437
$$ plain form
56522 180780 178999 177664 176441 174842 172728 170297 167892 165977 164965 164852 165127 165197 164855 164277 163771 163648
56506 163648 164108 164952 165483 165071 163931 163049 163177 164076 164897 164972 164007 161918 159084 156607 155613 156163 157357
56489 157357 158576 159968 161512 162433 162138 161174 160577 160612 160794 160855 160965 161221 161624 162474 164048 165848 166856
56472 166856 166685 165952 165462 165527 166106 166996 167766 168075 168195 168709 169611 170368 170961 172090 174034 176055 177416 178358
56454 178358 179515 180912 182146 183176 184232 185266 186088 186878 187951 189125 189896 190207 190520 191074 191522 191459
56438 191459 190907 190135 189274 188363 187677 187745 188869 190618 191938 192032 191072 189865 188940 188325 188080 188416 189070 189257
56420 189257 188727 188405 189395 191631 194050 195871 197148 198210 199239 200430 201966 203649 204985 205834 206625
56405 206625 207697 208717 209028 208407 207258 206102 205098 204085 202966 201931 201288 201213 201771 203073 205136 207573
56389B07573K098J289O12L98N51Q55J068Q24p4j209j824j674j222q66m14M96J741
56372B10222K782L194K953K330J665J183R27Q58R42J134J352J602J868J862J299
56357B36173N85O45J578K107J070q23j762j108k0L31M3k15k53k30j38nq5l58l43
56338B37192K09Q42J087J202J740K686L512L854L735L278K621K060J963K438L088
56323B71507L164K149M74o04k90P45J199P43O3n22j426k551k883j879m47K83M13
56306B70138P37J342J633J422J096Q88O53L14l4l11l39J79J130J735J474R70J249
56289B84276K282K968K496J180o7n07N5J181K062K319K406K835L293L112K415
56274C12306J977J995J860J293Q68J090J593J690J278P90O94J293K621M121M814
$$ plain form
56389 207573 209671 210960 211572 211970 212521 213376 214444 215268 215194 213985 212161 210487 209265 208399 207985 208481 210222
56372 210222 213004 216198 219151 221481 223146 224329 225256 226114 227056 228190 229542 231144 233012 234874 236173
56357 236173 236758 237403 238981 241088 242158 241335 239573 238465 238445 238776 238819 238604 238351 238121 237983 237978 237893 237535 237192
56338 237192 237401 238243 239330 240532 242272 244958 248470 252324 256059 259337 261958 264018 265981 268419 271507
56323 271507 274671 276820 277294 276690 276400 277145 278344 279087 279150 278628 277202 274651 271768 269889 269442 269725 270138
56306 270138 270875 272217 273850 275272 276368 277256 277909 278223 278189 277878 277539 277718 278848 280583 282057 283027 284276
56289 284276 286558 289526 292022 293202 293135 292628 292683 293864 295926 298245 300651 303486 306779 309891 312306
56274 312306 314283 316278 318138 319431 320299 321389 322982 324672 325950 326740 327434 328727 331348 335469 340283
56259C40283M241L023K189K152K610L124L407L247K744K519L203M604N822O250
56245C89418O166O115O235O446O916P783Q592Q655Q009P474P548P771P480O729
56231D91337N909M958L635K299J660J684J468M08j075k192k691k860l029l290
56217D98221l419k972j889r78j223k491l562l623l016k249j228OO59K26m88l54
56201D71620N16J112J133J163J443J584J540J802K386K568K023J417J431J847
56187D93585K155K407K916L506L727L527L211K888K445J957J722J868K233K653
56173E30800L137L703M265M668M760M440L813L259L230L855M817N667O246O788
56159E93448P493Q135Q299Q066Q140R026J0315J1198J1495J1802J2587J3770J5276
$$ plain form
56259 340283 344524 347547 349736 351888 354498 357622 361029 364276 367020 369539 372742 377346 383168 389418
56245 389418 395584 401699 407934 414380 421296 429079 437671 446326 454335 461809 469357 477128 484608 491337
56231 491337 497246 502204 505839 508138 509798 511482 512950 513358 512283 510091 507400 504540 501511 498221
56217 498221 494802 491830 489941 488963 487740 485249 481687 478064 475048 472799 471571 471577 472236 472462 471974 471620
56201 471620 472136 473248 474381 475544 476987 478571 480111 481913 484299 486867 488890 490307 491738 493585
56187 493585 495740 498147 501063 504569 508296 511823 515034 517922 520367 522324 524046 525914 528147 530800
56173 530800 533937 537640 541905 546573 551333 555773 559586 562845 566075 569930 574747 580414 586660 593448
56159 593448 600941 609076 617375 625441 633581 642607 652922 664120 675615 687417 700004 713774 729050
56146G29050J7458K0577K4278K8070L2047L6692M2128M8169N4978O2990P1989
56135A168426Q0715Q7702R2068R3246R0539Q3738P4062O3845N5103M8645M4365
56124A982454M1614L9070L4987K8218J9040Q807q15q266j2518j4003j4985j8276
56112B085327k5363l5813m8129o0566p1275p8540q1469q0288p5941o9525o2040
56101A396378n4190m6331l8719l1821k6014k1095j6441j1712p130l125m4J922
56089A141678K935L638M616N789O658P065P350P816Q550R620J0937J2036J2571
56076A241259J2910J3609J4453J4801J4804J5315J6513J7544J7827J7809J8053
56065A414897J8376J8334J7931J7415J7012J7136J8197J9888K1264K2028K2943
$$ plain form
56146 729050 746508 767085 791363 819433 851480 888172 930300 978469 1033447 1096437 1168426
56135 1168426 1249141 1336843 1428911 1522157 1612696 1696434 1770496 1834341 1889444 1938089 1982454
56124 1982454 2024068 2063138 2098125 2126343 2145383 2154190 2153375 2145109 2132591 2118588 2103603 2085327
56112 2085327 2059964 2024151 1976022 1915456 1844181 1765641 1684172 1603884 1527943 1458418 1396378
56101 1396378 1342188 1295857 1257138 1225317 1199303 1178208 1161767 1150055 1142925 1139800 1139756 1141678
56089 1141678 1144613 1148251 1152867 1158656 1165314 1172379 1179729 1187545 1196095 1205715 1216652 1228688 1241259
56076 1241259 1254169 1267778 1282231 1297032 1311836 1327151 1343664 1361208 1379035 1396844 1414897
56065 1414897 1433273 1451607 1469538 1486953 1503965 1521101 1539298 1559186 1580450 1602478 1625421
56054A625421K4633K6580K7886K8415K8637K8908K9312K9861L0384L0675L0936
56043A941648L1539L2214L2213L1599L1482L2576L4289L5775L7061L8629M0611
56032B319636M2930M5598M8325N0607N2561N4938N7876O0504O2353O4164O6683
56021B926175O9553P2136P4550P7206Q0074Q3053Q6266Q9430R1888R3850R6582
56010C840763J00714J05436J10000J14744J19918J24882J29516J35050J42374
56001D923397J50661J58811J67106J76325J86391J96935K08051K19472K30412
55992F617561K41179K53374K67440K81962K96698L14074L35898L60724L86524
55983I355434M13848M44088M76792N11458N49956N94336O43945O97749P57623
$$ plain form
56054 1625421 1650054 1676634 1704520 1732935 1761572 1790480 1819792 1849653 1880037 1910712 1941648
56043 1941648 1973187 2005401 2037614 2069213 2100695 2133271 2167560 2203335 2240396 2279025 2319636
56032 2319636 2362566 2408164 2456489 2507096 2559657 2614595 2672471 2732975 2795328 2859492 2926175
56021 2926175 2995728 3067864 3142414 3219620 3299694 3382747 3469013 3558443 3650331 3744181 3840763
56010 3840763 3941477 4046913 4156913 4271657 4391575 4516457 4645973 4781023 4923397
56001 4923397 5074058 5232869 5399975 5576300 5762691 5959626 6167677 6387149 6617561
55992 6617561 6858740 7112114 7379554 7661516 7958214 8272288 8608186 8968910 9355434
55983 9355434 9769282 10213370 10690162 11201620 11751576 12345912 12989857 13687606 14445229
55974A4445229Q26224R03425R88429J083751J193505J319403J462484J627385
55966B3849835J820889K047717K312252K623430K994235L438361L972642M621863
55958D7681224N417275O392967P588933R053601J0833584J2957066J5424239J8198638
55950A33547527K1187330K4217442K7011967K9139898K9955692K8655979K4583432
55943C18299267J7677340Q722335q74373r655065j6624466k1412597k4132341
55936B72000100k5150633k4913412k3836848k2248647k0379210j8387137j6385663
55929A20698550j4455199j2650843j1009327r549894q272434p163015o204749
55922E1393089n382361m679496m078271l563118l122067k744170k418847k137977
$$ plain form
55974 14445229 15271453 16174878 17163307 18247058 19440563 20759966 22222450 23849835
55966 23849835 25670724 27718441 30030693 32654123 35648358 39086719 43059361 47681224
55958 47681224 53098499 59491466 67080399 76134000 86967584 99924650 115348889 133547527
55950 133547527 154734857 178952299 205964266 235104164 265059856 293715835 318299267
55943 318299267 335976607 344698942 343824569 334169504 317545038 296132441 272000100
55936 272000100 246849467 221936055 198099207 175850560 155471350 137084213 120698550
55929 120698550 106243351 93592508 82583181 73033287 64760853 57597838 51393089
55922 51393089 46010728 41331232 37252961 33689843 30567776 27823606 25404759 23266782
55914B3266782j895772j686239j503065j341937j200743j077365r69059q73848
55906A2718754p90619p17841o53603n96624n46063n00815m60208m24454l93092
55897G635435l64094l35990l09665k86262k64550k42460k20121j98974j78654
55888E234665j57349j34928j13105r2440p1746n1083l3334k1985j8834k4315l8173
55877D477373n8729q2625j06408j27970j46116j59676j67746j70289j68085j62285
55867C127444j54069j44288j33338j21764j10714j01264r3333q5958p8578p1560
55857B032578o5568o0842n7076n3611m9958m6386m3664m1920m0319l8331l6656
55846A498247l6136l6353l6168l5233l4013l2684l0990k9098k7633k6802k6192
$$ plain form
55914 23266782 21371010 19684771 18181706 16839769 15639026 14561661 13592602 12718754
55906 12718754 11928135 11210294 10556691 9960067 9414004 8913189 8452981 8028527 7635435
55897 7635435 7271341 6935351 6625686 6339424 6074874 5832414 5612293 5413319 5234665
55888 5234665 5077316 4942388 4829283 4736843 4665097 4614014 4580680 4558695 4539861 4515546 4477373
55877 4477373 4418644 4336019 4229611 4101641 3955525 3795849 3628103 3457814 3289729 3127444
55867 3127444 2973375 2829087 2695749 2573985 2463271 2362007 2268674 2182716 2104138 2032578
55857 2032578 1967010 1906168 1849092 1795481 1745523 1699137 1655473 1613553 1573234 1534903 1498247
55846 1498247 1462111 1425758 1389590 1354357 1320344 1287660 1256670 1227572 1199939 1173137 1146945
55835A146945k5472k4666k3784k2746k1621k0548j9483j8472j7806j7487j6886
55824I17974j5561j4068j3330j3516j4064j4529j4662j4148j3038j2137j2100
55813G66821j2339j1636r770p760o582o341o657p164p602p918q221q336p691o168
55799F52636m577l676l106k097p51K15O34Q50Q83P20J199L294O448Q704Q679O486
55783F76541K690k350p841j2409j5300j6990j8124j8558j8027j6977j6066j5291
55771E21298j4255j2990j1996j1571j1521j1471j1159j0560r808q957p886o538
55759C92586n128l856k594j307n22q42k028l217m008m762n690o374o384n916n465
55744C34493n312n482n871o160n981n329m563l900l262k642k284k341k598k721
$$ plain form
55835 1146945 1121473 1096807 1073023 1050277 1028656 1008108 988625 970153 952347 934860 917974
55824 917974 902413 888345 875015 861499 847435 832906 818244 804096 791058 778921 766821
55813 766821 754482 742846 733076 725316 718734 712393 705736 698572 690970 683052 674831 666495 658804 652636
55799 652636 648059 644383 641277 639180 638429 638644 639278 640128 641011 641731 642930 646224 652672 661376 670055 676541
55783 676541 679231 676881 669040 656631 641331 624341 606217 587659 569632 552655 536589 521298
55771 521298 507043 494053 482057 470486 458965 447494 436335 425775 415967 407010 399124 392586
55759 392586 387458 383602 381008 379701 379179 378337 376309 373092 369084 364322 358632 352258 345874 339958 334493
55744 334493 329181 323699 317828 311668 305687 300358 295795 291895 288633 285991 283707 281366 278768 276047
55730B76047k463j755r04o52j507k987m004m119l911l993m223m144l723l268k945
55715B31449k706k456k057j357m64K11L69J69L6K57Q26J483J822J547P02m05j541
55698B27885k640l690m655n503o052n932n004l781l106l321l950m188l617k452
55684A69994j353q82j045j315j195n59M84J640K294J916R37N51J127J481M28j485
55668A73018k734k875k789l056l247k970k485k056j508q16l39j76K4L07J82m91
55652A47989j079j108r70j167j404r96N1R98J213P47K01K13R03J752K154K123
55636A51620K088K063J560M24p76j382j264p27k70m65j450k460k513j714j205
55621A43529j597k266k491k442k493k417j994j787k334l028k751j498m89n63j230
$$ plain form
55730 276047 273584 271829 270925 270273 268766 265779 261775 257656 253745 249752 245529 241385 237662 234394 231449
55715 231449 228743 226287 224230 222873 222409 222620 222989 223158 223194 223451 224277 225760 227582 229129 229831 229426 227885
55698 227885 225245 221555 216900 211397 205345 199413 194409 190628 187522 184201 180251 176063 172446 169994
55684 169994 168641 167759 166714 165399 164204 163645 164129 165769 168063 169979 170916 171467 172594 174075 174503 173018
55668 173018 170284 167409 164620 161564 158317 155347 152862 150806 149298 148482 148143 147967 147991 148298 148480 147989
55652 147989 146910 145802 144832 143665 142261 141265 141316 142314 143527 144274 144475 144688 145591 147343 149497 151620
55636 151620 153708 155771 157331 157755 156979 155597 154333 153606 153336 152871 151421 148961 146448 144734 143529
55621 143529 141932 139666 137175 134733 132240 129823 127829 126042 123708 120680 117929 116431 115942 115379 114149
55606A14149j546j319j112j244j328q45L5N16J50n79r48r04q42p44k60L90M80
55589A04049o3l53K38J235J875K163K599L350M221N045N734O284P073Q686J0986
55574A63122J2886J3434J2723J1273R093O007K397j017l897o246p951q959r573
55561A93292j0073j0265r976r576r487r436q875p828o731n687m516l392k785k811
55547I1854l116l238k751j428K12R56J58j280j894j359n42j60j75l66o54q85r70
55530G4362j179j701k107j991j827k264k864k580j457o99q80j250j151r49j025
55515E0438q80J9J246K040K294K244J715M75r56j618j159j30O23N86k08j157j507
55498E4065j043k29M69J020J389J233M41m25p30n81n61q80j202j164p21k8O50
$$ plain form
55606 114149 112603 111284 110172 108928 107600 106755 106790 107306 107456 106877 105929 105025 104183 103439 103179 103569 104049
55589 104049 103986 103633 103871 105106 106981 109144 111743 115093 119314 124359 130093 136377 143450 152136 163122
55574 163122 176008 189442 202165 213438 222531 228538 230935 229918 226021 219775 211824 202865 193292
55561 193292 183219 172954 162978 153402 143915 134479 125604 117776 111045 105358 100842 97450 94665 91854
55547 91854 88738 85500 82749 81321 81533 82489 82647 81367 79473 78114 77572 77412 77237 76871 76217 75332 74362
55530 74362 73183 71482 69375 67384 65557 63293 60429 57849 56392 55693 54813 53563 52412 51463 50438
55515 50438 49558 49577 50823 52863 55157 57401 59116 59591 58635 57017 55858 55728 56351 56937 56729 55572 54065
55498 54065 53022 52793 53262 54282 55671 56904 57345 56920 56190 55609 55048 54168 52966 51802 51081 51053 51703
55481E1703J008R77Q29P63N85J22k80q4O49J236J158N71n4m77p45q61o78j61M05
55462E6666N80J96n19j217j651j521m84J306K850L036J789J62p79q06l33J24J81
55445E9580k34p19q02n92o02q29o12L13J219J274N74j29l56p6N83J259J260K73
55427F1384j002j481r50j78J85J93J28o0m91r51j032o23k1L77M75M62M46K38k71
55408E6828p18o32k07j68o45q18n6J088J560J095K87l51p25p91n52l14l24k14
55390E4343N28J569J908J140n5q27r81p20k54O8k01r78j493j201n14k39n44q54
55372E0695o38P2Q05J092Q25L52N8j11m94j015j074l51O28J060P68K56N0K75O94
55353E3947R32P47L21Q5J48J03l50q68q67k36O05J209J328R05J96k75k71k14n60
$$ plain form
55481 51703 52711 53688 54517 55280 55865 55987 55707 55623 56272 57508 58666 59237 59183 58706 57961 57100 56422 56261 56666
55462 56666 57246 57442 56923 55706 54055 52534 52050 53356 56206 59242 61031 61193 60414 59608 59275 59399 59580
55445 59580 59346 58627 57825 57233 56631 55802 55190 55503 56722 57996 58570 58441 58085 58009 58592 59851 61111 61384
55427 61384 60382 58901 57951 57773 57958 58151 58279 58219 57728 56777 55745 55122 55101 55478 55953 56415 56861 57099 56828
55408 56828 56110 55478 55271 55103 54458 53640 53584 54672 56232 57327 57614 57263 56538 55747 55195 54881 54557 54343
55390 54343 54871 56440 58348 59488 59433 58606 57625 56905 56651 56719 56518 55540 54047 52846 52332 52093 51549 50695
55372 50695 50057 50129 50934 52026 52851 53203 53261 53150 52656 51641 50567 50216 50844 51904 52672 52928 52978 53253 53947
55353 53947 54879 55626 55947 56032 56180 56283 55933 55065 54198 53962 54567 55776 57104 58009 58205 57930 57659 57445 56885
55334E6885j011q80j57L69J86l44o71q13r92j030n84J36M92K53m6K08R69J622
55316E4592J683J196M90j68n91n60QQ27J397J491J261Q39J37p11j095n90L33P04
55298F1243J40q45j510j485p00O03J679J697P62J9K47Q04N12o38j475j232m41
55281E9380n9l15p37r30q25m73m6J07k44p89q62j81P89J336J202P48M47M04L78
55262E9330J97rm3nk11p48j234j179n40J64L41p7n88o79l89k10l89n74l12K64
55242E3109N68L26j09k27J32Q14J550J942J652Q06J0l01k81k29j47l5k12p54r61
55223E7653j89R89J357Q28N98J200J517N02j028j458p02j77n83j003n18L87P10
55206F0083L92J16J19J7l34n48l02J89M56K35l30p93q14n57n44q48q06O7J132
$$ plain form
55334 56885 55874 54994 54837 55206 55392 55048 54377 53564 52572 51542 50958 51094 51586 51839 51793 52001 52970 54592
55316 54592 56275 57471 57961 57793 57202 56642 56650 57477 58874 60365 61626 62465 62602 61891 60796 60206 60539 61243
55298 61243 61383 60538 59028 57543 56843 57446 59125 60822 61584 61603 61850 62654 63166 62528 61053 59821 59380
55281 59380 59321 59006 58269 57339 56514 56041 55995 56102 55858 55069 54207 54026 54815 56151 57353 58101 58548 58952 59330
55262 59330 59527 59518 59475 59470 59259 58511 57277 56098 55558 55722 56063 55986 55398 54719 54330 54120 53731 53157 52845 53109
55242 53109 53677 54003 53894 53667 53799 54613 56163 58105 59757 60563 60573 60272 59991 59762 59615 59580 59368 58614 57653
55223 57653 57464 58453 59810 60638 61236 62436 63953 64455 63427 61969 61267 61090 60507 59504 58986 59373 60083
55206 60083 60475 60591 60710 60727 60393 59845 59543 59732 60188 60423 60093 59300 58486 57929 57385 56537 55731 55798 56930
55187E6930J239K34p74q20j47M43P42J047J264Q30l85j607j903j209l48r8m23
55170E5015o94m98q0R7K0J02N26Q56O46J69K34J156K211K385J547N35M8j58o88
55151F3429j392j455n92M01O67L91L39O20O16J36j75O9K08n84j970k702k131q87
55133E4988L8M22P06J102J215O57k72p37k87N87R85O47J64J04K72J39k68l39K58
55114F0381J063J315P65j00n45k96K76N56L46k3j93j89j83j11J72N25O61N85M95
55095F5500L43j33q15j111o78J04N93O45O04O97P57N76L47N14J145J586J002n94
55077G1082k054k207j099J19M88L0o52j026q45k28K69Q9o01j046q95n49l11J52
55059F0716R69J407Q36j09k11N65J013L68o84j069n80K02P42Q47N57J62P4L74
$$ plain form
55187 56930 58169 58403 57629 56809 56662 57105 57847 58894 60158 60988 60603 58996 57093 55884 55536 55438 55015
55170 55015 54321 53823 53743 53840 53860 53962 54488 55344 55990 56159 56393 57549 59760 62145 63692 64227 64275 64117 63429
55151 63429 62037 60582 59990 60391 61058 61449 61788 62408 63024 63160 62985 63054 63262 62678 60708 58006 55875 54988
55133 54988 55026 55448 56154 57256 58471 59128 58856 58119 57832 58419 59404 60051 60215 60319 60591 60730 60462 60123 60381
55114 60381 61444 62759 63524 63424 62879 62583 62859 63415 63761 63738 63545 63356 63173 63062 63234 63759 64420 65005 65500
55095 65500 65843 65710 64895 63784 63106 63210 63803 64448 65052 65749 66506 67082 67429 67943 69088 70674 71676 71082
55077 71082 69028 66821 65722 65841 66329 66359 65707 64681 63836 63608 63877 63966 63365 62319 61424 60875 60564 60716
55059 60716 61685 63092 63928 63819 63608 64173 65186 65554 64870 63801 63221 63423 64165 65012 65569 65731 65805 66179
55041F6179O60N65J76k00m19m54k80o8j77o84j127j018l59N28J341J744J384L75
55023F8166n60q74q16q40p46j04P95J158Q76N95N56K06p06j431j218m05J41K06
55005F4999K08K81J76JK84J121J825J768J128N39K37m6m57o76l11M99J105J003
54987G3684M03o2j30j54m65q02o62k2P13J290J714J854J438O14l2j54q3k26m71
54968G8447m14R8Q96J676J976J331q2j282j420p23q6O9j2j26l60o00n15j61J2
54949G8724j19j68nJ6j47O4P83J102K87r59j301o20r5m73j197j417j025l21O25
54930G3754J700K351K046R75j41q21j067j018o74l5P58J447J773J690J504J671
54914H5913K288K995L481L846M316M852N240N393N279M772L763K340O34j320l313
$$ plain form
55041 66179 66839 67404 67580 67380 66961 66507 66227 66159 65982 65298 64171 63153 62794 63322 64663 66407 67791 68166
55023 68166 67606 66732 65916 65076 64330 64226 65021 66179 67055 67650 68206 68412 67706 66275 65057 64652 64793 64999
55005 64999 65207 65488 65664 65665 65949 67070 68895 70663 71791 72330 72567 72521 72064 71388 71077 71576 72681 73684
54987 73684 74087 74025 73895 73741 73276 72474 71812 71790 72503 73793 75507 77361 78799 79413 79381 79227 79144 78918 78447
54968 78447 78033 78131 79027 80703 82679 84010 83928 82646 81226 80503 80417 80486 80474 80348 79988 79388 78873 78712 78724
54949 78724 78605 78437 78432 78448 78301 78365 79148 80250 80537 79578 78277 77657 77562 77089 75892 74475 73450 73129 73754
54930 73754 75454 77805 79851 80826 80685 79864 78797 77779 77105 77070 77828 79275 81048 82738 84242 85913
54914 85913 88201 91196 94677 98523 102839 107691 112931 118324 123603 128375 132138 134478 135112 133792 130479
54899A30479m807n387n247m883m421l647k596j627r72o05n54r02j368j465j155
54884I0843r64j180j417j240p24p4Q22J909K453J834O80M12J476K747L031K569
54868A03177K507L283M259M829N175N635N845N025K965L86j726k913l341l442
54854A31664l591l972m553n122n434n302m601l431k238j608j670j935j890j569
54840H4748j279j028o25k20j76l65k49K13L14l67j199j310p23j14K90P84J325
54823H0019J401Q99M50N03O45K15o90j339j285p36j59J87K77J76K0jK14N25N74
54804H1895J45m55n80nO43O03J1k55J86P04N69o7n43o04m92l84k05qrk68n62o16
54782G9703k42N47J344J438O37k02jJ171K102J936J071L88J88L22Q72J924K955
$$ plain form
54899 130479 125672 120285 115038 110155 105734 102087 99491 97864 96892 96287 95733 94831 93463 91998 90843
54884 90843 89879 88699 87282 86042 85318 85244 86066 87975 90428 92262 92942 93354 94830 97577 100608 103177
54868 103177 105684 108967 113226 118055 123230 128865 134710 139735 142700 143086 141360 138447 135106 131664
54854 131664 128073 124101 119548 114426 108992 103690 99089 95658 93420 91812 90142 88207 86317 84748
54840 84748 83469 82441 81816 81596 81420 81055 80806 81019 81333 80966 79767 78457 77734 77620 77910 78694 80019
54823 80019 81420 82319 82769 83272 83917 84132 83442 82103 80818 80082 79923 80110 80387 80563 80583 80582 80796 81321 81895
54804 81895 82040 81585 81005 81000 81643 82246 82257 82002 82188 82892 83461 83394 82851 82247 81755 81371 81166 81158 81149 80881 80319 79703
54782 79703 79461 80008 81352 82790 83427 83225 83224 84395 86497 88433 89504 89892 90080 90402 91274 93198 96153
54765I6153L079K159J070P31J160J811K377K937L444L606L410L356L837M455M278
54750A37863K890R13o51j423j798k229k650k740k519k459k946l781m349m231l526
54735A06364k574j631q95o40r75j493j620j289r61q90p20j36N38P55N35M07O96
54718I5471J250J848K473L172L936M746N476N767N300M224L025K008J157M37j69
54703A40121q73j933l174m090m467m574m585m289l585k812k310j974j572j189
54689I8694j032j039j007r39r25r19q82r19r74o57K40J209J523J103N37K39R8
54672I4350q3k59m11p43j342j867j847j206l55K39M65N66P39Q34O04J88M4K45
54654I0161K49l32j041j101m75R3R7j67k22o1J1o1o2J63N40Q64R59Q18O04M24
$$ plain form
54765 96153 99232 101391 102461 103192 104352 106163 108540 111477 114921 118527 121937 125293 129130 133585 137863
54750 137863 140753 141666 141015 139592 137794 135565 132915 130175 127656 125197 122251 118470 114121 109890 106364
54735 106364 103790 102159 101264 100624 99649 98156 96536 95247 94286 93396 92676 92540 93078 93833 94368 94775 95471
54718 95471 96721 98569 101042 104214 108150 112896 118372 124139 129439 133663 136688 138696 139853 140290 140121
54703 140121 139248 137315 134141 130051 125584 121010 116425 112136 108551 105739 103429 101455 99883 98694
54689 98694 97662 96623 95616 94677 93752 92833 91951 91032 90058 89401 89641 90850 92373 93476 94013 94252 94350
54672 94350 94267 94008 93597 92854 91512 89645 87798 86592 86237 86476 86941 87507 88246 89080 89684 89872 89916 90161
54654 90161 90410 90078 89037 87936 87461 87554 87651 87484 87262 87201 87212 87151 87089 87252 87792 88656 89615 90433 91037 91461
54634I1461J77j49j82L63R58O42o41j680j457m60N4j81k77L41J104J203O79J59
54616I2114k1N8L66R65J618J844J428O60ml02j95J25K99Q9k78l02J70P12Q03L70
54596A00519j98l91J08J141K006J985J126K67P1L48N22M21K32Ml07n04l70p8Q4
54577A06986K81Q88J670J931J509J024R22R14O46L11K03K07J12J09M33Q36Q82
54560A19864N28N0l53m68K2J050J854J740R69M10L96N03L38k2l59m98j68P75J946
54541A28577K653K733K611K514K147J367O41M86Q04J103J127R93R03R73J188J320
54525A52140J083M94l8j60J6P9k28p59j128j126j086j612k670l207k262m10O76
54508A39802K54o56q31m40l96p21o31J7M40K83K88J072K033K149J438Q33P55O18
$$ plain form
54634 91461 91638 91489 91307 91670 92628 93270 92629 90949 89492 89032 89086 88905 88628 88969 90073 91276 91955 92114
54616 92114 92093 92151 92517 93482 95100 96944 98372 99032 99028 98726 98531 98656 98955 99044 98766 98464 98634 99346 100149 100519
54596 100519 100321 99930 100038 101179 103185 105170 106296 106563 106634 106982 107504 107925 108157 108161 107854 107350 106980 106902 106986
54577 106986 107267 108155 109825 111756 113265 114289 115211 116125 116771 117082 117285 117492 117604 117713 118146 118982 119864
54560 119864 120392 120442 120089 119621 119643 120693 122547 124287 125256 125666 126062 126565 126903 126881 126522 126024 125856 126631 128577
54541 128577 131230 133963 136574 139088 141235 142602 143243 143729 144533 145636 146763 147756 148659 149632 150820 152140
54525 152140 153223 153717 153679 153519 153535 153614 153386 152627 151499 150373 149287 147675 145005 141798 139536 139126 139802
54508 139802 140056 139400 138569 138129 137733 137012 136381 136398 136838 137121 137409 138481 140514 142663 144101 144934 145689 146307
54490A46307q9r22j022j66J168K464L455L898L620K869K227J988J939J833J785
54475A71354J969K262K442K510K573K551K334K092K111K350K431K086J459R43
54461B01467P87Q38O30l7o30l79O41J343R44o3p18r24j306j948k226j900j568
54444A94951j727k059j982j466r19o44p64j341k202k845k884k497k207k235k222
54429A66957j598k79R91J177Q6j192j447p07j0R6M1K05J72m77j333j648j286o65
54411A59083o9M33O25K60l96o27l5R66J513J115J65m00m5Q15J382J437J315J079
54393A68616M39m27p04n3P20O60j35q52j107j132j099r69q25p63n54L6O66P58
54375A63275M01K48N32P41N09K14L63Q55J218J277J139P40r4j128j703j492r93
$$ plain form
54490 146307 146218 145296 144274 144108 145276 147740 151195 155093 158713 161582 163809 165797 167736 169569 171354
54475 171354 173323 175585 178027 180537 183110 185661 187995 190087 192198 194548 196979 199065 200524 201467
54461 201467 202254 203092 203722 203685 203055 202676 203317 204660 205604 205541 204823 203899 202593 200645 198419 196519 194951
54444 194951 193224 191165 189183 187717 186798 186154 185390 184049 181847 179002 176118 173621 171414 169179 166957
54429 166957 165359 165080 166071 167248 167334 166142 164695 163988 163978 164074 164115 164320 164492 164015 162682 161034 159748 159083
54411 159083 159014 159447 160072 160332 159936 159309 159274 160240 161753 162868 163033 162633 162588 163403 164785 166222 167537 168616
54393 168616 169055 168628 167924 167871 168591 169251 169116 168264 167157 166025 164926 163957 163132 162369 161815 161851 162517 163275
54375 163275 163676 163924 164456 165197 165706 165920 166283 167138 168356 169633 170772 171512 171418 170290 168587 167095 166102
54358A66102r61j469j852j630j144r96j262j602j944k454k967k997k500k046j983
54343A38295j960j568j009p23o69m23J63P69R69N85j45o44n37k50o02j596k175
54326A28480j574l44M89P57R05Q74J78r89j686j418o71q3L14P33J083J128R17
54309A29093O59M40K46J36K03M22O63P90P29N32L41J99k6m36r59j462j833j882
54291A27855j442p52m34q24j562k169k611k990l004k292j093l2O43J113J416J350
54275A13172R30M39O9j73k27p2M7o5j97n0J65l0o61j252j439j155m27N06J016
54256A10596O70n7l00L3K77J03j04l4J17J97L61N70M81J00q5J15K49K1j83O4M91
54235A13682M84j38r94j571j533r29k55l3k06k73o8Q8P6K16O25Q64N96P5k85m50
$$ plain form
54358 166102 165141 163672 161820 160190 159046 158050 156788 155186 153242 150788 147821 144824 142324 140278 138295
54343 138295 136335 134767 133758 133035 132366 131943 132106 132875 133844 134429 134284 133640 133103 132853 132251 130655 128480
54326 128480 126906 126562 127051 127808 128713 129587 129765 128776 127090 125672 125001 124918 125232 125965 127048 128176 129093
54309 129093 129752 130192 130438 130574 130777 131199 131862 132652 133381 133913 134254 134453 134427 133991 133032 131570 129737 127855
54291 127855 126413 125661 125227 124403 122841 120672 118061 115071 112067 109775 108682 108650 109293 110406 111822 113172
54275 113172 114102 114541 114610 114437 114210 114138 114185 114120 113923 113873 114038 114008 113347 112095 110656 109501 109074 109580 110596
54256 110596 111266 111209 110909 110942 111219 111322 111218 111184 111301 111498 111859 112429 112910 113010 112925 113040 113289 113310 113127 113191 113682
54235 113682 114166 114028 113034 111463 109930 109001 108746 108713 108507 108234 108166 108254 108330 108546 109171 110035 110631 110706 110421 109971
54215A09971n58n57l80j73n6L4J21Q5p4k29m22p80j047q10k49j9k03j05O16J326
54195A06491J344Q06J46n72j248j328n46M06O77L49Q3J7j71m55m47j59k8k06l55
54176A04804k04J34L93L93J42j00k7K00oq32j658j842j538j262j063p50m97n82
54158I5705p42n21j6L08M55P54J059Q34J21l62j71L14M81J56l60n88j55P79J417
54139I9468J068l4j027j369j086k72R10J847J894J220O44N03M37K89M22Q33Q03
54122A06550k7r53j171q66o91o16j24O70R81M55l16o54n97n12l66J38Q84J281
54104A04066J035N66M15M90L22r9k54jN5n97j522j840j340o07j56N9K64M95P37
54085A02088J036J318J393J243J078J004Q54N26K29J80K14m9o19r84o48K17Q70
$$ plain form
54215 109971 109413 108856 108476 108303 108247 108281 108402 108487 108413 108184 107762 106982 105935 105125 104876 104857 104654 104549 105165 106491
54195 106491 107835 108641 108787 108215 106967 105639 105093 105499 106176 106525 106608 106625 106454 105999 105552 105393 105365 105159 104804
54176 104804 104600 104734 105127 105520 105662 105562 105535 105735 105729 104897 103239 101397 99859 98597 97534 96784 96287 95705
54158 95705 94963 94442 94426 94734 95189 95943 97002 97836 97957 97595 97424 97738 98219 98375 98015 97427 97272 98051 99468
54139 99468 100536 100502 99475 98106 97020 96748 97658 99505 101399 102619 103263 103766 104203 104492 104914 105747 106550
54122 106550 106523 105570 104399 103533 102842 102226 102102 102772 103753 104208 103892 103238 102641 102129 101763 101901 102785 104066
54104 104066 105101 105667 106082 106572 106894 106795 106541 106540 106595 105998 104476 102636 101296 100689 100533 100592 100856 101351 102088
54085 102088 103124 104442 105835 107078 108156 109160 110014 110540 110769 110949 111163 111114 110495 109511 108863 109080 109950
54068A09950Q40M45K80L55K06k20m02j04J33k26r22j332j292j004m81K82Q57P42
54050A08107Q3m61n02q5P26J764K431K135J095J30k85j94M09J509K416K170Q67
54033A22315k29l06M9j4l45l24m4q1m50n78k67M2K2j02l8P5p0m85q95j081j039
54012A16155p63j40P73J422J112j12j233j265l59M83O16K23l21q84j284j197o35
53995A12591j03N4R6L93Q50J055Q18K63l39o11k61N04J035R37N10K86L41L17m0
53976A18696n32o43N9J441K709L126K853K716L137L799M438N291O513P700Q398
53961A69701Q543P990O235L174k36k803m295n252n911o005n465m681m000l486
53947A53509l155l028k953k714k290j728r79j65L30M08N44J030J353J055P47J326
$$ plain form
54068 109950 110790 111235 111515 111870 112076 111856 111454 111350 111483 111257 110335 109003 107711 106707 106226 106508 107365 108107
54050 108107 108190 107729 107227 107142 107868 109632 112063 114198 115293 115423 115138 114944 115353 116862 119278 121448 122315
54033 122315 122086 121780 121829 121815 121470 121146 121102 121021 120571 119993 119726 119768 119790 119688 119650 119725 119655 119170 118275 117194 116155
54012 116155 115392 115252 116025 117447 118559 118447 117214 115949 115590 116073 116689 116912 116591 115707 114423 113226 112591
53995 112591 112488 112542 112638 113031 113881 114936 115754 116017 115678 115067 114806 115310 116345 117282 117792 118078 118419 118736 118696
53976 118696 118164 117521 117580 119021 121730 124856 127709 130425 133562 137361 141799 147090 153603 161303 169701
53961 169701 178244 186234 192469 195643 195407 192604 188309 183057 177146 171141 165676 160995 156995 153509
53947 153509 150354 147326 144373 141659 139369 137641 136662 136497 136827 137235 137779 138809 140162 141217 141964 143290
53931A43290K415K729J964J141R10P06P2l82j50O2n64j475j486n91R7L7k20k05
53913A48350j80l65m47k33j14l55n39k35J89Oq88j884k440k522k325k001j644
53896A32373j314j000p66p84j102j396j251o24J39O60P58M83J39J72P21J399J732
53879A30339J737J673J433O84l75r87p52j10L61N54N06k0j055j916j873j136n95
53862A28468o46q41o94k78J49N00P11O53L99L17O15J059J311J268R96N72K09J93
53844A34961N42R17J040R30O17o4j098k025k356k055j406o19J05L99M1o41j048
53827A28240r39n73k42k9Q0J07J76L82O29Q34J176J855K529K480J484K02n24m82
53809A37385j6N76J226J847K352K891L717M724N464N757O029O772P787Q192P217
$$ plain form
53931 143290 145705 148434 150398 151539 152449 153155 153227 152845 152695 152757 152193 150718 149232 148641 148738 148775 148555 148350
53913 148350 148170 147805 147358 147125 147011 146656 146117 145882 146071 146077 145189 143305 140865 138343 136018 134017 132373
53896 132373 131059 130059 129293 128509 127407 126011 124760 124136 124275 124935 125693 126176 126315 126487 127208 128607 130339
53879 130339 132076 133749 135182 135866 135491 134504 133752 133642 134003 134557 135063 135043 133988 132072 130199 129063 128468
53862 128468 127822 126981 126287 126009 126158 126658 127369 128022 128421 128738 129353 130412 131723 132991 133987 134559 134768 134961
53844 134961 135503 136420 137460 138390 139007 138943 137845 135820 133464 131409 130003 129384 129489 129888 129929 129288 128240
53827 128240 127301 126728 126486 126457 126537 126644 126820 127202 127831 128665 129841 131696 134225 136705 138189 138391 137867 137385
53809 137385 137369 137945 139171 141018 143370 146261 149978 154702 160166 165923 171952 178724 186511 194703 201920
53794B01920M824J681j308l474m641n081n123m857m270l564l085k921k810k544
53780A64747k195j872j483r63m83k60k78m29p42j243j713j825j459p71k3M37L05
53763A49750l53j000j098o01K06J017J438R72l77j701j989j330o86n79o28m81
53747A42560m29o87p91k41O38J104J016R06J084J269J156R34R97J381J685J584
53731A54166J228J056J269J618J835K070K667L537M047L685K656J737J517J862
53717A84950K066J614P75K17P2k04q50j215o80L02P63N79M29N61N23J76O2M20
53699A90560P51P12P43J221J752J823J594J470J440J423J691K234K268J256k6
53684B10912l35L42Q36M26m44j064j203q65j32N53O10J25j41K19O82N79n8p50
$$ plain form
53794 201920 206744 208425 207117 203643 199002 193921 188798 183941 179671 176107 173022 170101 167291 164747
53780 164747 162552 160680 159197 158234 157751 157491 157213 156784 156042 154799 153086 151261 149802 149031 149008 149445 149750
53763 149750 149397 148397 147299 146698 146904 147921 149359 150331 149954 148253 146264 144934 144248 143669 143041 142560
53747 142560 142131 141444 140653 140412 141050 142154 143170 144076 145160 146429 147585 148519 149516 150897 152582 154166
53731 154166 155394 156450 157719 159337 161172 163242 165909 169446 173493 177178 179834 181571 183088 184950
53717 184950 187016 188630 189405 189622 189694 189490 188640 187425 186745 187047 187810 188389 188818 189379 189902 190078 190140 190560
53699 190560 191311 192023 192766 193987 195739 197562 199156 200626 202066 203489 205180 207414 209682 210938 210912
53684 210912 210577 210919 211755 212181 211737 210673 209470 208605 208473 209026 209636 209761 209620 209839 210521 211100 211042 210292
53666B10292j260j603j670j328p78m87o68r87q81j46Q21J330J048K42n82j098
53650B02245j188q41l22j80o99j374j375n73K59L66p4k02M82J485J820J140K33
53633B01202J52R42J654J615J230J206J575J914K117K335K412K054J433J062J096
53618B23999J303J650K296L054L434L339L148L071K959K806K773K621J826N43
53604B58822k73j33K23r8q33r75k40O11Q19L84k20o17o63m53l25n92j145j498
53586B52794j358r61p54r04j211j377j202o89p7K36J0n67r83q82m04oL0j08MN97
53566B42188J460K079K041J388O37L69P59J479K055K203J973J669J647J991K402
53551B66340K547K450K385K472K670L067L869N007O098O905P471P813P850P822
$$ plain form
53666 210292 209032 207429 205759 204431 203653 203166 202498 201511 200630 200484 201305 202635 203683 203925 203343 202245
53650 202245 201057 200216 199894 199714 199015 197641 196266 195693 195952 196318 196244 196042 196524 198009 199829 200969 201202
53633 201202 201354 202296 203950 205565 206795 208001 209576 211490 213607 215942 218354 220408 221841 222903 223999
53618 223999 225302 226952 229248 232302 235736 239075 242223 245294 248253 251059 253832 256453 258279 258822
53604 258822 258549 258416 258639 258541 257708 256733 256493 257104 257923 258307 258087 257470 256807 256354 256029 255437 254292 252794
53586 252794 251436 250475 249721 248817 247606 246229 245027 244338 244261 244497 244507 243940 242957 242075 241671 241665 241695 241587 241591 242188
53566 242188 243648 245727 247768 249156 249793 250162 250921 252400 254455 256658 258631 260300 261947 263938 266340
53551 266340 268887 271337 273722 276194 278864 281931 285800 290807 296905 303810 311281 319094 326944 334766
53537C34766Q264R324J0513J1339J1825J2112J2027J1503J1032J1248J2184J3289
53525D69426J4031J4229J4174J4600J6121J8347K0062K0669K0916K1706K2776
53514F67057K3325K3351K3433K3610K3499K3310K3627K4203K4108K3246K2677
53503I25446K3084K3887K4292K4386K4600K4767K4377K3331K1880K0248J8743
53492A179041J7924J8082J8675J8759J7931J6581J5360J4560J3950J3054J1643
53481A355560R973Q473P231N932M254K036q00m147p574j0596j3082j5067j6412
53468A325781j7084j7609j8671k0292k1951k3424k4866k6118k6704k6655k6596
53457A075811k6796k6723k5909k4664k3628k3047k2744k2433k1824k0811j9667
$$ plain form
53537 334766 343030 352354 362867 374206 386031 398143 410170 421673 432705 443953 456137 469426
53525 469426 483457 497686 511860 526460 542581 560928 580990 601659 622575 644281 667057
53514 667057 690382 713733 737166 760776 784275 807585 831212 855415 879523 902769 925446
53503 925446 948530 972417 996709 1021095 1045695 1070462 1094839 1118170 1140050 1160298 1179041
53492 1179041 1196965 1215047 1233722 1252481 1270412 1286993 1302353 1316913 1330863 1343917 1355560
53481 1355560 1365533 1374006 1381237 1387169 1391423 1393459 1392659 1388512 1380938 1370342 1357260 1342193 1325781
53468 1325781 1308697 1291088 1272417 1252125 1230174 1206750 1181884 1155766 1129062 1102407 1075811
53457 1075811 1049015 1022292 996383 971719 948091 925044 902300 879867 858043 837232 817565
53446H17565j8612j7235j4930j2034r746q636p890o374l889j047J566L726N584
53433G28048P560R804J1707J2600J2969J4099J6321J8547J9914K0891K2219K3800
53421I18479K5330K7079K9162L0886L1768L2535L4090L6117L7743L9053M0808
53410A283050M3079M5314M7538N0277N3427N6219N8362O0188O1597O1956O1203
53399A882210O0207N9698N9609N9638N9774N9900N9490N8098N5737N2683M9231
53388B516275M5779M2634L9593L6118L2061K7857K3958K0452J7220J3995J0259
53377B826201N547o2o188j2854k0487k9111l7996m6312n3667n9861o4573o7647
53365B432990o9386p0359p0959p1273p1204p0652o9642o8296o6697o4932o3309
$$ plain form
53446 817565 798953 781718 766788 754754 745008 736372 728482 722108 718219 717172 718738 722464 728048
53433 728048 735608 745412 757119 769719 782688 796787 813108 831655 851569 872460 894679 918479
53421 918479 943809 970888 1000050 1030936 1062704 1095239 1129329 1165446 1203189 1242242 1283050
53410 1283050 1326129 1371443 1418981 1469258 1522685 1578904 1637266 1697454 1759051 1821007 1882210
53399 1882210 1942417 2002115 2061724 2121362 2181136 2241036 2300526 2358624 2414361 2467044 2516275
53388 2516275 2562054 2604688 2644281 2680399 2712460 2740317 2764275 2784727 2801947 2815942 2826201
53377 2826201 2831748 2831686 2825498 2812644 2792157 2763046 2725050 2678738 2625071 2565210 2500637 2432990
53365 2432990 2363604 2293245 2222286 2151013 2079809 2009157 1939515 1871219 1804522 1739590 1676281
53354A676281o2185o1339o0028n7990n5992n4806n4003n2428m9710m6521m3468
53343A077811m0517l7606l5039l2911l0656k7645k3946k0282j7371j5381j3880
53332G82577j2234j0284q496p272o326n052l352j633j25J307K762M173N570P033
53318G48648Q373R304R894J0521J1432J2712J4421J6319J7700J8221J8661K0155
53306I16361K2718K5316K7370K9244L1132L2441L2729L2545L2734L3402L4050
53295A250042L4255L3811L2555L0532K8185K6056K4330K2787K1015J8683J5840
53284A538091J2879R945O613K632j278m088n926q004j0976j4197j6906j9283k1850
53271A467652k4628k7440l0406l3457l5838l6889l7017l7265l8078l9093l9885
$$ plain form
53354 1676281 1614096 1552757 1492729 1434739 1378747 1323941 1269938 1217510 1167800 1121279 1077811
53343 1077811 1037294 999688 964649 931738 901082 873437 849491 829209 811838 796457 782577
53332 782577 770343 760059 751563 744291 737965 732913 729561 727928 727803 729110 731872 736045 741615 748648
53318 748648 757021 766325 776219 786740 798172 810884 825305 841624 859324 877545 896206 916361
53306 916361 939079 964395 991765 1021009 1052141 1084582 1117311 1149856 1182590 1215992 1250042
53295 1250042 1284297 1318108 1350663 1381195 1409380 1435436 1459766 1482553 1503568 1522251 1538091
53284 1538091 1550970 1560915 1567528 1570160 1568882 1564794 1558868 1550864 1539888 1525691 1508785 1489502 1467652
53271 1467652 1443024 1415584 1385178 1351721 1315883 1278994 1241977 1204712 1166634 1127541 1087656
53260A087656m0383m0591m0323l9372l7708l5626l3753l2640l2145l1557l0534
53249F93024k9567k9288k9610k9938k9813k9006k7291k4711k1877j9568j7973
53238D04382j6681j5276j3689j2092j0745r841r278q650p673o499n518m973m905
53225B78562n194n519n521n181m764m290l449k296j550j818k747l443l461l058
53211B26271k635k309j995j560r61l89j66l73p56j127j549j993k121j750j213
53196B05374r46r81j102j241j357j254q64m56k73j90j47n10j549k735l178k652
53180A85939j697p95K8P15Q76K15r71j977k253j794j042m59j07K29N63O01J91
53163A78262m13r21j334j660j596r14L4O24O33L80K51L63N74O27L56J3J50R70
$$ plain form
53260 1087656 1047273 1006682 966359 926987 889279 853653 819900 787260 755115 723558 693024
53249 693024 663457 634169 604559 574621 544808 515802 488511 463800 441923 422355 404382
53238 404382 387701 372425 358736 346644 335899 326058 316780 308130 300457 293958 288440 283467 278562
53225 278562 273368 267849 262328 257147 252383 248093 244644 242348 240798 238980 236233 232790 229329 226271
53211 226271 223636 221327 219332 217772 216811 216422 216256 215883 215127 214000 212451 210458 208337 206587 205374
53196 205374 204428 203447 202345 201104 199747 198493 197629 197173 196900 196710 196563 196053 194504 191769 188591 185939
53180 185939 184242 183447 183475 184190 185066 185281 184310 182333 180080 178286 177244 176785 176678 176907 177470 178071 178262
53163 178262 177849 176928 175594 173934 172338 171424 171458 172082 172715 173095 173346 173709 174283 174910 175266 175279 175429 176399
53145A76399J921K195J554M93k10r2O56J240J015K19l52n03p83j394j687j256
53129A79415p56r27j424j451j086j024j299j291q24l91k63k03j34k02j86L04R76
53112A69234J006K61m60o55p06r44r71m70K4j68q75j420j544j464j322j099q62
53095A57565o55l20J91N08K74k91o56o57n72n39l68L3L61K69r3j28N10J353J577
53076A58362J005L23J03J5n09j240j441j013n85m33j51M47Q69O82Q4o44j453k003
53058A52418j596k88O55K93n75m81O01J302Q69N7j76N4N5l83r00j205j275j208
53040A48217j122j110j060p16j02L92M50J81j66o09j239j790j781j097j83M57
53024A38722P74R92J067O49k54r71q74k63ll22n00k2N99O40K96J99J99m40j636
$$ plain form
53145 176399 178320 180515 182069 182562 182352 182260 182916 184156 185171 185390 185038 184535 183752 182358 180671 179415
53129 179415 178659 177732 176308 174857 173771 172747 171448 170157 169333 168942 168679 168476 168342 168140 167954 168258 169234
53112 169234 170240 170501 170041 169386 168680 167736 166765 166295 166319 166151 165276 163856 162312 160848 159526 158427 157565
53095 157565 156910 156590 156781 157289 157563 157272 156616 155959 155387 154848 154480 154513 154874 155143 155050 154922 155432 156785 158362
53076 158362 159367 159690 159793 159808 159299 158059 156618 155605 155020 154587 154436 154883 155752 156434 156518 155874 154421 152418
53058 152418 150822 150534 151189 151482 150907 150426 151027 152329 153198 153255 153079 153133 153188 152805 151905 150700 149425 148217
53040 148217 147095 145985 144925 144209 144107 144499 144949 145130 144964 144355 143116 141326 139545 138448 138265 138722
53024 138722 139496 140488 141555 142204 141950 140979 140105 139842 139839 139517 139017 138995 139594 140234 140530 140729 140928 140488 138852
53005A38852k267j677n70Q5L14O29Q85N38k61p18n13q7K29N91R92J025O38L92
52987A39077N79O65K02l02j61K65N2p57j114n16K64L68J4n8K82N63M88J85r9o5
52967A39932N42J483J864J069l11j080q80m63m02k79N11J683K310J901Q67p6o20
52950A48051r68j371j751j826j622j574j900k123j660p71l25n93r14p85o13q88
52934A28367j188p37L22J020Q85M28J95L5m09r70j131o94N0O66Q28M71j19n14
52916A27505o06o75q97j020p97m51l77n86p12m51K59J277K152K237J418N19M45
52899A29240R73J063L97j82LM46L77m3j17J74K32j04k94kM44O00M27J06j89k43
52879A33308P5M50M43J72K10O37P99L10l29m93l13k24r9N01J436K003J826J245
$$ plain form
53005 138852 136585 134908 134338 134423 134737 135366 136251 136789 136528 135810 135297 135210 135439 136030 137022 138047 138685 139077
52987 139077 139656 140321 140523 140221 140060 140325 140377 139620 138506 137990 138254 138622 138636 138578 138860 139423 139911 140096 139997 139932
52967 139932 140474 141957 143821 144890 144579 143499 142619 142156 141754 141475 141986 143669 145979 147880 148747 148671 148051
52950 148051 147083 145712 143961 142135 140513 138939 137039 134916 133256 132485 132160 131567 130653 129868 129255 128367
52934 128367 127179 126442 126764 127784 128669 129097 129292 129327 128918 127948 126817 126123 126173 126839 127667 128138 128019 127505
52916 127505 126899 126224 125327 124307 123510 123059 122682 122096 121384 120933 121192 122469 124621 126858 128276 128795 129240
52899 129240 130213 131276 131673 131491 131494 131940 132317 132274 132157 132331 132563 132459 132165 132163 132607 133207 133634 133740 133551 133308
52879 133308 133383 133833 134276 134448 134658 135295 136094 136404 136075 135582 135269 135045 134946 135447 136883 138886 140712 141957
52861A41957P61N38M95M18k6j031k207k720k166j090m24n06q65q74m98k03k58
52844A31301k96J71R97J495J297P90N09M50K24k92q09r77o71m7N36P34N93M74
52826A36479M93K80m40j308j676j379q16m37m35p13r05n77K41R51J072Q30P49
52809A32409R45J245J671K199K324J577L81l65n23q20j629k382k481k107j789
52794A30655j640j469j181p92k98J95M51M27L70M08L86K08j6k34n01o65m73j43
52776A25688k45p59q30K9J091J306O65N9j7Q2q4m30n97m41r5J81J75p7k90k96
52756A25115l20o13r58q44j31P16J172J149R05O39L81J65R5J96K86J56j01q2M82
52737A28408J426K322K828K727J923P38J5L72J363J801J036m13j560j857j370
$$ plain form
52861 141957 142718 143256 143751 144169 144143 143112 140905 138185 136019 134929 134505 133999 133134 132260 131762 131559 131301
52844 131301 131005 131176 132173 133668 134965 135755 136264 136714 136938 136646 135837 134860 134189 134142 134678 135412 136005 136479
52826 136479 136972 137252 136812 135504 133828 132449 131633 131196 130761 130048 129143 128566 128807 129758 130830 131660 132409
52809 132409 133354 134599 136270 138469 140793 142370 142751 142386 141863 141043 139414 137032 134551 132444 130655
52794 130655 129015 127546 126365 125573 125275 125470 125921 126348 126718 127126 127512 127720 127704 127470 126969 126304 125831 125688
52776 125688 125443 124684 123854 123883 124974 126280 126945 127004 126987 127069 126985 126555 125958 125517 125422 125603 125778 125701 125411 125115
52756 125115 124795 124182 123224 122380 122249 122965 124137 125286 126191 126830 127211 127376 127471 127667 127953 128109 128008 127926 128408
52737 128408 129834 132156 134984 137711 139634 140372 140387 140759 142122 143923 144959 144546 142986 141129 139759
52722A39759n63r4l97j170j601j288o37k10j36l89j090k113k750k392j317l81
52706A23231n2j25k38k24n6K26M94O76Q46R77Q22K41m81q68p06j15O29J174J248
52687A27699R85Q32R53R92O69K30Lj52m51o50l83J48L12j56r19j456j412p78j3
52668A26453K70J04K56J043J599J010j32l17R14K483L350L580L626L435K778J808
52652A52260P90k55j242j812j830j674j669j584j155o94o90j043j271j313j531
52637A35287j973k093j415j60R90J527J407Q64J81l48m08J27R52J428J169M61
52621A37996n2q8O9N0j13j12J93N98P98P59P57R36R27K48r24j715j547q15j77
52602A37788L30R18J195N76n44r34j69P29O76p1m50n1O22R84Q63L57k62n68l44
$$ plain form
52722 139759 139196 139102 138705 137535 135934 134646 134009 133799 133663 133274 132184 130071 127321 124929 123612 123231
52706 123231 123179 123054 122816 122592 122536 122762 123256 123932 124778 125755 126577 126818 126337 125469 124763 124648 125277 126451 127699
52687 127699 128684 129516 130469 131461 132130 132360 132363 132211 131760 131110 130727 130875 131187 131031 130112 128656 127244 126466 126453
52668 126453 126723 126827 127083 128126 129725 130735 130603 130286 131200 133683 137033 140613 144239 147674 150452 152260
52652 152260 153050 152795 151553 149741 147911 146237 144568 142984 141829 141135 140445 139402 138131 136818 135287
52637 135287 133314 131221 129806 129646 130636 132163 133570 134434 134615 134267 133859 133986 134938 136366 137535 137996
52621 137996 137944 137856 137925 137975 137862 137750 137943 138541 139339 140098 140855 141791 142718 142966 142042 140327 138780 137965 137788
52602 137788 138118 139036 140231 140807 140263 139329 139160 139889 140565 140494 140044 139993 140615 141599 142462 142819 142557 141989 141645
52583A41645N9J13j98m00k26J14L59N24O52O43M25J26j43m39p81r13n66J44P21
52564A41859Q19N49K37Pk10m10m88m69m34k21M75J490K076J758J070R10J317J407
52546A51742O05o33j458j554j222q61p27q44r58p28k20N4k15o89q12m39J48O32
52528A41821P74M84J02K81J181J952J602K84q47j074q04o57m55L25J486K109J735
52511A50299J008Q39J217J241L99o35p01M41J786K209J651R81Q87J196J295R26
52495A65039L95M8j68n30j052j409j353j011o14j92K84O34O07K81j0j10j54k23
52477A60462k11p6N2J31L02O33R52J065R21N43K9l58m24m46q94j619j734o48J124
52458A59804K549L160L181K851K163J154Rj122k125k751k769k250j526q99o06
$$ plain form
52583 141645 141704 141817 141619 141219 140993 141107 141466 141990 142642 143285 143710 143836 143693 143254 142473 141560 140994 141138 141859
52564 141859 142678 143227 143464 143471 143261 142851 142363 141894 141460 141239 141714 143204 145280 147038 148108 149018 150335 151742
52546 151742 152347 151714 150256 148702 147480 146619 145892 145048 144090 143362 143142 143196 142981 142292 141480 141041 141189 141821
52528 141821 142595 143079 143181 143462 144643 146595 148197 148481 147634 146560 145756 145099 144644 144969 146455 148564 150299
52511 150299 151307 152146 153363 154604 155003 154368 153667 154108 155894 158103 159754 160735 161622 162818 164113 165039
52495 165039 165434 165482 165314 164784 163732 162323 160970 159959 159345 159153 159437 160071 160678 160959 160949 160839 160685 160462
52477 160462 160251 160175 160227 160358 160660 161293 162245 163310 164231 164774 164803 164445 164021 163575 162681 161062 159328 158680 159804
52458 159804 162353 165513 168694 171545 173708 174862 174871 173749 171624 168873 166104 163854 162328 161429 160823
52443A60823p93j267j427r25k37j44p17j278j323j039p43m11M3M09M36K42J84
52426A51833M44R15J348J504J348J168J314J832K449L046L739M546N217N574N653
52411A91930N363M381K661P20r28k313l593m421m247l220k165j692j697j861k082
52396A76836k237k008j314o32m29n11l65K0J70k4QO63J488J741J406J136J224
52379A77172J159M41n44q89k93N68R22P94P82J177J681J972K186K552K863K661
52363A95204J919J135O48K40l63r42j098q86o60m29P2O71P79L48J63P94J714K039
52345B01348J774J671K028K407K485K546K875L310L664M023M301M024L061K172
52331B41689K247L218M267M888N195N263M898M148L472L196L214L411L844M227
$$ plain form
52443 160823 160030 158763 157336 156411 156174 156030 155313 154035 152712 151673 150930 150519 150562 150971 151407 151649 151833
52426 151833 152277 153192 154540 156044 157392 158560 159874 161706 164155 167201 170940 175486 180703 186277 191930
52411 191930 197293 201674 204335 205055 204127 201814 198221 193800 189553 186333 184168 182476 180779 178918 176836
52396 176836 174599 172591 171277 170645 170216 169705 169340 169360 169530 169506 169514 170177 171665 173406 174812 175948 177172
52379 177172 178331 178772 178228 177339 177046 177614 178536 179330 180112 181289 182970 184942 187128 189680 192543 195204
52363 195204 197123 198258 198906 199146 198783 197841 196743 195857 195197 194768 194840 195511 196290 196638 196801 197595 199309 201348
52345 201348 203122 204793 206821 209228 211713 214259 217134 220444 224108 228131 232432 236456 239517 241689
52331 241689 243936 247154 251421 256309 261504 266767 271665 275813 279285 282481 285695 289106 292950 297177
52317B97177L854K502J046N18Q27J019O86K91J38k42j232k301k632k211j663j188
52301B96589l33J044K192K286J524R46J219J996K546K694K752K744K268J317P11
52286C22495J187K250K714K352K253L147M191M125L088K269K019J496M20n3J115
52271C55068L203M489M209K948J442k2j062j138l46M22N92O13J117J889K249K113
52255C77786K038K366K914L504M170M778M961M653M280M160M083L790L447L278
52241D30208L059K485J849J784K395L125L535L619L345K530J451R49J440K303
52227D64077K758K965L581M524M977M575L887L566L649L901M247M544M425L783
52213E19459L056K696K668K775L078L539L570K580Q91m06o31j55J97R3j56j69
$$ plain form
52317 297177 301031 303533 304579 305097 305924 306943 307629 307920 308058 307816 306584 304283 301651 299440 297777 296589
52301 296589 296256 297300 299492 301778 303302 304248 305467 307463 310009 312703 315455 318199 320467 321784 322495
52286 322495 323682 325932 328646 330998 333251 336398 340589 344714 347802 350071 352090 353586 354006 353953 355068
52271 355068 358271 362760 366969 369917 371359 371337 370275 369137 368791 369213 369805 370418 371535 373424 375673 377786
52255 377786 379824 382190 385104 388608 392778 397556 402517 407170 411450 415610 419693 423483 426930 430208
52241 430208 433267 435752 437601 439385 441780 444905 448440 452059 455404 457934 459385 460334 461774 464077
52227 464077 466835 469800 473381 477905 482882 487457 491344 494910 498559 502460 506707 511251 515676 519459
52213 519459 522515 525211 527879 530654 533732 537271 540841 543421 544312 543906 543275 543120 543317 543410 543254 543085
52197E43085j6j47q09j650k095k101k210k687l006k520j433n88m25o03o49n36
52181E21610m94o36q70j007q29l78j46o95j895k879k933k242j574j443j755k090
52165D99744k142j931j680j527j312q32j86L02M87M99M33K26q6l36n25q31j198
52148D89105j234p51q1L70N78P10P94R12J359K129K596K235J503J368K063K930
52132E06586L480L915M373M386L593K573K391L472N240O740P371P192O871P169
52118E75352Q131Q924Q724P689O657O018N369M275K935J857J174N67k93j402k480
52103F33497l221l558l688l739l487k618j208K97J639K885L988M598M642M698
52089F34725N358O335O696O000M759L655K642J178q30k634l351k914k149j893
$$ plain form
52197 543085 543069 542922 542113 540463 538368 536267 534057 531370 528364 525844 524411 523823 523398 522795 522146 521610
52181 521610 521116 520480 519610 518603 517774 517396 517250 516555 514660 511781 508848 506606 505032 503589 501834 499744
52165 499744 497602 495671 493991 492464 491152 490320 490134 490436 490923 491422 491855 492081 491995 491659 491134 490303 489105
52148 489105 487871 487120 487039 487409 487987 488697 489491 490403 491762 493891 496487 498722 500225 501593 503656 506586
52132 506586 510066 513981 518354 522740 526333 528906 531297 534769 540009 546749 554120 561312 568183 575352
52118 575352 583483 592407 601131 608820 615477 621495 626864 631139 634074 635931 637105 637672 637379 635977 633497
52103 633497 630276 626718 623030 619291 615804 613186 611978 612275 613914 616799 620787 625385 630027 634725
52089 634725 640083 646418 653114 659114 663873 667528 670170 671348 670518 667884 664533 661619 659470 657577
52075F57577k221k606k700k642k709l013l585m464n395n844n565m993m822n306
52061F01712o141o847o982o301n085m126l978m366m638m529m104l188j653l8Q26
52046E40562Q74P63P66N49J72L19J100J597J240Q11J199J916J929J474J823L361
52030E60455N062N991O250O188N650M523L248K206J157k51j774k916l517l628
52016E88644l184k375j977k682m265n940p387q841j0241j1016j0894j0303r699
52003D99840q975p962p105p049p682q197q082p641p363p320p395p689q202q411
51989C90767p728o326m975l999k962j614m98k29n83q46q49j068j842k959m065
51974C50224m976n544n649n476n424n601n681n328m462l048j067J121K777L508
$$ plain form
52075 657577 655356 652750 650050 647408 644699 641686 638101 633637 628242 622398 616833 611840 607018 601712
52061 601712 595571 588724 581742 575441 570356 566230 562252 557886 553248 548719 544615 541427 539774 539736 540562
52046 540562 541436 542199 542965 543514 543686 544005 545105 546702 547942 548753 549952 551868 553797 555271 557094 560455
52030 560455 565517 571508 577758 583946 589596 594119 597367 599573 600730 600479 598705 595789 592272 588644
52016 588644 585460 583085 581108 578426 574161 568221 560834 551993 541752 530736 519842 509539 499840
52003 499840 490865 482903 475798 468749 461067 452870 444788 437147 429784 422464 415069 407380 399178 390767
51989 390767 383039 376713 371738 367739 364777 363163 362665 362436 361853 361007 360158 359090 357248 354289 350224
51974 350224 345248 339704 334055 328579 323155 317554 311873 306545 302083 299035 297968 299089 301866 305374
51960C05374L767M320N339O329O839O891O742O504O143N655N066M248K975J299
51946C77491k10q66o08p8K03N06J422K976M628O035P214Q041Q179P668O959O089
51930D35649M427J748j024k725l327l801m799o116p380q573r703j0527j0887j0919
51916C62043j0777j0386r707q949q262p466o314m943l745k963k518k235k018j764
51902B79996j249k45J209K673L624M048M580N834P615R011R372Q850P860O328
51888C49506L915Q91j693k908k843k374k197k245k020j255j70Q06J444J804K048
51873C42709K331K872L983N753P725R196R965J0529J1338J2029J1818J0522Q777
51860D49547P080N096K136j916o374j0330j3123j4507j4628j3898j2677j1120
$$ plain form
51960 305374 309141 313461 318800 325129 331968 338859 345601 352105 358248 363903 368969 373217 376192 377491
51946 377491 377281 376415 375807 375729 375932 376438 377860 380836 385464 391499 398713 406754 414933 422601 429560 435649
51930 435649 440076 441824 440800 438075 434748 430947 426148 420032 412652 404079 394376 383849 372962 362043
51916 362043 351266 340880 331173 322224 313962 306496 300182 295239 291494 288531 286013 283778 281760 279996
51902 279996 278747 278502 279711 282384 286008 290056 294636 300470 308085 317096 326468 335318 343178 349506
51888 349506 353421 354312 352619 349711 346868 344494 342297 340052 338032 336777 336607 337413 338857 340661 342709
51873 342709 345040 347912 351895 357648 365373 374569 384534 395063 406401 418430 430248 440770 449547
51860 449547 456627 461723 463859 461943 455569 445239 432116 417609 402981 389083 376406 365286
51848C65286r419p934o901o201n562m902m215l434k697k462k928l570l731l451
51834B97879l214l043k567j833j316j088p12j29K22L37Q29J773K239J635P19M37
51818B92168M29l21j753k695k422j333j03J034K024K740L257L791M304M550M504
51803C10174M273L679K528J164O9j006k683m699n926n888n352n113n031m760m473
51788B76956m269l650k414j333j108j208p14J93O73P56J200J888J752N42n38n25
51772B68201j8m6m82m70J11O34R39J619K915M161M634M510M589N276O201O669
51756C09443O302N227L807K284O61j128l016m809o299p216p213o123m263k294
51742B85363o71O60K007L549N287P185Q981J0033R731Q301O916O721P820R499
$$ plain form
51848 365286 355867 347933 341032 334831 329269 324367 320152 316718 314021 311559 308631 305061 301330 297879
51834 297879 294665 291622 289055 287222 285906 284818 284106 283977 284199 284536 285365 287138 289377 291012 291731 292168
51818 292168 292597 292276 290523 287828 285406 284073 283970 285004 287028 289768 293025 296816 301120 305670 310174
51803 310174 314447 318126 320654 321818 321887 320881 318198 313499 307573 301685 296333 291220 286189 281429 276956
51788 276956 272687 269037 266623 265290 264182 262974 262260 262453 263126 263882 265082 266970 268722 269264 268726 268201
51772 268201 268183 268137 267655 267185 267296 267930 268869 270488 273403 277564 282198 286708 291297 296573 302774 309443
51756 309443 315745 320972 324779 327063 327724 326596 323580 318771 312472 305256 298043 291920 287657 285363
51742 285363 284692 285352 287359 290908 296195 303380 312361 322394 332125 340426 347342 354063 361883 371382
51728C71382J1188J2786J3815J2978R151K851l724q365j0315j0126q654o631m972
51715C81364m706o127q254r608r615q936q414q032p196n704l957k234l43J751
51701B99989L403L857L191K227J589J228R79J042J691K759L713M067L531J965
51687C35231l92k739m101m163l579l295l517l544k653j073K43Q34J401K920N400
51672C16973Q022J0459J3208J6392J8897J9423J7954J5384J1919O871L35n852
51660D49985r627j0848j1248j2263j3568j3973j3186j2129j1622j1389j0599q997
51648C10536p042n174l505k256j808k092k416k378k400k851l129k481j459j553
51634B69992l238n227n997n294l872k454j473j243j703k316k746l200l722l663
$$ plain form
51728 371382 382570 395356 409171 422149 431300 434151 430427 422062 411747 401621 392967 386336 381364
51715 381364 376658 370531 362277 352669 343054 334118 325704 317672 310476 304772 300815 298581 298238 299989
51701 299989 303392 307249 310440 312667 314256 315484 316463 317505 319196 321955 325668 329735 333266 335231
51687 335231 334839 332100 327999 323836 320257 316962 313445 309901 307248 306175 306418 307252 308653 311573 316973
51672 316973 324995 335454 348662 365054 383951 403374 421328 436712 448631 455502 455837 449985
51660 449985 440358 429510 418262 405999 392431 378458 365272 353143 341521 330132 319533 310536
51648 310536 303494 298320 294815 292559 290751 288659 286243 283865 281465 278614 275485 273004 271545 269992
51634 269992 266754 261527 255530 250236 246364 243910 242437 241194 239491 237175 234429 231229 227507 223844
51620B23844k524r30j0kj93m4L56Q42J389J762J663J394J664K580L447L741L749
51603B42728L967M459N069N707O088N625M028J716o02k423l410l292k220q40K40
51588B66840Q38R40N41NoO70J424J794K139K934L903M591N390P142R817J2274
51572C21236J3444J3286J2585J2218J2570J3163J2961J1452R387Q089Q214R667
51560D58272J2360J6337K1199K6158L0730L4665L7123L6818L3386K7981K2072
51549G57101J6124R859L258l318r697j5957k1942k7118l0934l3126l3839l3557
51537E76854l2805l1693k9941k7419k4390k1133j7734j4474j2026j0794j0271
51526C44174r476p950o034m374l420l237l470l645l662l849m292m503m114l510
$$ plain form
51620 223844 221320 220390 220380 220378 220185 220141 220497 221339 222728 224490 226153 227547 229211 231791 235238 238979 242728
51603 242728 246695 251154 256223 261930 268018 273643 277671 279387 278785 276362 272952 269660 267440 266600 266840
51588 266840 267678 268618 269159 269164 269158 269828 271252 273046 275185 278119 282022 286613 292003 299145 308962 321236
51572 321236 334680 347966 360551 372769 385339 398502 411463 422915 432302 440391 448605 458272
51560 458272 470632 486969 508168 534326 565056 599721 636844 673662 707048 735029 757101
51549 757101 773225 783084 786342 783024 773327 757370 735428 708310 677376 644250 610411 576854
51537 576854 544049 512356 482415 454996 430606 409473 391739 377265 365239 354445 344174
51526 344174 334698 326748 320714 316340 312920 309683 306213 302568 298906 295057 290765 286262 282148 278638
51512B78638l217k953k019m88P16R97O70K40k29p20r44p92p01j101j750k108k056
51495B62183j903j862j866j819j673j373r85o76l65L23J402K086J610K57r66j639
51479B52734k228k960l223k530j450r36j064j183j159j580k541k997k015j66J078
51464B27780J226J283K141L267L515K764J967J769J908K022K245K651K847K620
51450B60005K467K816L207K967K384K370L143M154N200O606Q079Q441P078M882
51436C23799L151K209J720J660K044K181J143j031l365n119o291o981p017o344
51422C01759n293m279l538l202l169l029k452j597p74N4R23J369J027N03P31J488
51406B80521J579O97k2L63J307J725J403Q00J69m15p00o30n85o82k62J162K933
$$ plain form
51512 278638 275421 272468 270449 269961 270677 271674 272344 272584 272355 271635 270691 269899 269198 268097 266347 264239 262183
51495 262183 260280 258418 256552 254733 253060 251687 250702 250026 249661 249984 251386 253472 255082 255339 254373 252734
51479 252734 250506 247546 244323 241793 240343 239407 238343 237160 236001 234421 231880 228883 226868 226702 227780
51464 227780 229006 230289 232430 235697 239212 241976 243943 245712 247620 249642 251887 254538 257385 260005
51450 260005 262472 265288 268495 271462 273846 276216 279359 283513 288713 295319 303398 311839 318917 323799
51436 323799 326950 329159 330879 332539 334583 336764 337907 336876 333511 328392 322101 315120 308103 301759
51422 301759 296466 292187 288649 285447 282278 279249 276797 275200 274426 274480 275403 276772 277799 278302 279033 280521
51406 280521 282100 282797 282775 283138 284445 286170 287573 288373 288542 288127 287427 286797 286212 285530 285268 286430 289363
51389B89363M008M329M716N709P272R391J2065J4864J7304J9692K2840K6906L1102
51376D69561L4544L6822L7823L7730L7143L6457L5078L1933K6831K0639J4098
51365H18659P196j47p650j5082k2407k9128l4313l7555l9319l9944l9074l6580
51353E24656l3351l0464k7958k5134k1727j8196j5034j2413j0450r257q635q130
51341C03907p452o775o512o808p246p073o006m660l880l689l396k643j791j159
51327B34817o21j61j61o71j021o89l2K91J87p9m39p91p21j20K95j70j114j544
51309B27256j203o00lP79J643K075J931J631J451J258J007R31J058J042N90l30
51293B40516j638k968l515k721j204j90kJ17N76P95L81k2K85J007J475J691J948
$$ plain form
51389 289363 293371 297700 302416 308125 315397 324788 336853 351717 369021 388713 411553 438459 469561
51376 469561 504105 540927 578750 616480 653623 690080 725158 757091 783922 804561 818659
51365 818659 825855 825708 818058 802976 780569 751441 717128 679573 640254 600310 561236 524656
51353 524656 491305 460841 432883 407749 386022 367826 352792 340379 329929 320672 312037 303907
51341 303907 296455 289680 283168 276360 269114 262041 256035 251375 247495 243806 240410 237767 235976 234817
51327 234817 234196 234035 233874 233203 232182 231493 231461 231752 231939 231860 231421 230630 229909 229789 230084 229914 228800 227256
51309 227256 226053 225453 225450 226229 227872 229947 231878 233509 234960 236218 237225 238156 239214 240256 240846 240516
51293 240516 238878 235910 232395 229674 228470 228280 228278 228395 228971 229766 230147 230125 230410 231417 232892 234583 236531
51276B36531J913J056j98p10o4R43J409J373J576K544M082N376N571M551L108
51261B69061K104J522O79p22k165k999l134k971k933l214l659l758l079j833p98
51246B42101n26q43j186j248j149j153j430j961k514k758k514j856j021l01J10
51231B21751L14P31J549K218J932O91m67o19N4P06R43J077J478K154K881L361
51215B40754L264K503J510Q43N23J28m18o17j57O09J135J299J198P58K2m63j47
51198B52744P22J332J333J135J040P09k12j324j823j409m60N32J293J588J241
51183B58441M83m8K6L84M37J07k22l40m95q55j108p93P2R75J421J294P90K42m5
51164B60766J7K34M22O38Q63O78k87j634k467k543k535k894l090k506j553j159
$$ plain form
51276 236531 238444 239500 239302 238592 238528 239471 240880 242253 243829 246373 250455 255831 261402 265953 269061
51261 269061 271165 272687 273366 272644 270479 267480 264346 261375 258442 255228 251569 247811 244732 242899 242101
51246 242101 241575 240732 239546 238298 237149 235996 234566 232605 230091 227333 224819 222963 221942 221641 221751
51231 221751 222065 222796 224345 226563 228495 229186 228719 228100 228154 228860 229803 230880 232358 234512 237393 240754
51215 240754 244018 246521 248031 248874 249397 249525 249107 248490 248333 248942 250077 251376 252574 253332 253354 252891 252744
51198 252744 253466 254798 256131 257266 258306 259015 258803 257479 255656 254247 253787 254319 255612 257200 258441
51183 258441 258924 258876 258902 259286 259723 259830 259608 259268 258773 257918 256810 256017 256089 257064 258485 259779 260569 260811 260766
51164 260766 260783 261017 261439 262077 262940 263618 263331 261697 259230 256687 254152 251258 248168 245662 244109 242950
51148B42950j398j489j041n37m15m38k41P6K77M65P87R88P20Q2m52n70l00K04
51130B39668Q42J556K227K620K467J772R34L48k7l56l60L68J469J901J241K33
51114B56903j94N4O42J520K677L582L720L329L008K831K489K071J870J603O69
51099B86774p44j652j615j335j600k184k282j575m98K83M02N6l5P46K114K995
51083B79850K688J630Q21P66J181J488J312P07J35M4K89K83j64m16K55J795L512
51066B96176M817N570N939O308P050P989Q219O979M679K657J943K623M254O286
51052C71489Q008Q724Q429P951P991Q281Q039P033N777M746L958L390L247L520
51038D60583L572K593L67k667n953r107j1770j3672j4864j5617j5863j5171j3479
$$ plain form
51148 242950 241552 240063 239022 238485 238070 237632 237391 237467 237744 238209 238996 239984 240704 240786 240334 239764 239464 239668
51130 239668 240510 242066 244293 246913 249380 251152 252086 252434 252407 252051 251691 252059 253528 255429 256670 256903
51114 256903 256709 256763 257405 258925 261602 265184 268904 272233 275241 278072 280561 282632 284502 286105 286774
51099 286774 286030 284378 282763 281428 279828 277644 275362 273787 273289 273572 273974 274030 273995 274741 276855 279850
51083 279850 282538 284168 284989 285755 286936 288424 289736 290443 290578 290622 290911 291194 291030 290614 290869 292664 296176
51066 296176 300993 306563 312502 318810 325860 333849 342068 349047 353726 356383 358326 360949 365203 371489
51052 371489 379497 388221 396650 404601 412592 420873 428912 435945 441722 446468 450426 453816 457063 460583
51038 460583 464155 466748 467115 464448 458495 449388 437618 423946 409082 393465 377602 362431 348952
51025C48952j1506j0059r103p880n946l722j994j132q78o87j88O05J452K237L025
51010C03176L746M100M034M076M727N655N993N504M946N096N808O316O255O023
50996C75455O268P202Q433R317R578R541R688J0003R925Q968P233N231L455K085
50982D82382Q93m88k003k938k705j807j541k554m197n523o360p068p709q034p944
50967D22404p465o507n134l874l190k714j608L68K619M547O106P382Q221Q527
50953D29682Q686R369J0992J3354J5796J7781J9575K2100K5621K8739K9298K6467
50941F57460K1439J6014J1225P578N679N633O242N836M055K106J055N68l75k127
50927G42388m340o760r411j2031j4072j5385j6324j6963j6772j5540j4133j3609
$$ plain form
51025 348952 337446 327387 318284 310404 304458 300736 298742 297610 296732 296045 295857 296462 297914 300151 303176
51010 303176 306922 311022 315056 319132 323859 329514 335507 341011 345957 351053 356861 363177 369432 375455
50996 375455 381723 388925 397358 406675 416253 425794 435482 445485 455410 464378 471611 476842 480297 482382
50982 482382 483275 482787 480784 477846 475141 473334 471793 469239 465042 459519 453159 446091 438382 430348 422404
50967 422404 414939 408432 403298 399424 396234 393520 391912 392280 394899 399446 405552 412934 421155 429682
50953 429682 438368 447737 458729 472083 487879 505660 525235 547335 572956 601695 630993 657460
50941 657460 678899 694913 706138 713716 719395 725028 731270 737106 741161 743267 744322 744890 744515 742388
50927 742388 738048 731288 721877 709846 695774 680389 664065 647102 630330 614790 600657 587048
50915E87048j3805j3535j2268j0730r605q500o842n154m414m508m344l545k975
50902D86823l295l863l727l005k588k820l241l436l442l374l211l058l093l166
50888D41504k925k382j980j936j942j743j578j728j970j833j253o08j90N0K55
50873D19741M10L87J02m07r27j140q01J15J459K939M126M655M554M190L749L027
50857D46179J993J298J748L295N073O520P914R570J0963J1216J0346R518R864
50844E35497J1376J3111J4268J4832J5276J5878J6461J6682J6457J6168J6473
50833G02479J7825K0019K2265K3856K4831K5894K7673L0183L3002L5754L8284
50822A002065M0574M2565M4023M4439M3298M0542L6565L1639K5697J8909J2059
$$ plain form
50915 587048 573243 559708 547440 536710 527105 518605 511763 506609 502195 497687 493343 489798 486823
50902 486823 483528 479665 475938 472933 470345 467525 464284 460848 457406 454032 450821 447763 444670 441504
50888 441504 438579 436197 434217 432281 430339 428596 427018 425290 423320 421487 420234 419626 419436 419486 419741
50873 419741 420151 420538 420640 420233 419306 418166 417365 417480 418939 421878 426004 430659 435213 439403 443152 446179
50857 446179 448172 449470 451218 454513 459586 466106 474020 483590 494553 505769 516115 525633 535497
50844 535497 546873 559984 574252 589084 604360 620238 636699 653381 669838 686006 702479
50833 702479 720304 740323 762588 786444 811275 837169 864842 895025 928027 963781 1002065
50822 1002065 1042639 1085204 1129227 1173666 1216964 1257506 1294071 1325710 1351407 1370316 1382375
50811A382375N873J99n549j1274j6195j9891k2715k4969k6319k6356k5235k3366
50799A186578k0895j7814j4301j0560o611k495J654N875J0339J4616J7613J8716
50787A182715J8599J8312J7941J6794J4651J2026R382O834M608K969J546n60l715
50774A302102p404j1138j5121j9542k3804k7057k9331l1560l4473l7667l9945
50763A025060m0374l9033l6762l4332l1991k9778k7848k6155k4138k1293j7956
50752F95400j5043j3026j1567j0142q525o587m213j631N76K055K955L551L976
50739F37779M474N427O887Q422R656J0637J1565J2515J3513J4467J4899J4332
50727G64573J3194J2714J3451J4492J4642J3911J3200J2857J2338J1145R468P793
$$ plain form
50811 1382375 1388248 1388447 1382898 1371624 1355429 1335538 1312823 1287854 1261535 1235179 1209944 1186578
50799 1186578 1165683 1147869 1133568 1123008 1116397 1113902 1115556 1121431 1131770 1146386 1163999 1182715
50787 1182715 1201314 1219626 1237567 1254361 1269012 1281038 1290420 1297254 1301862 1304831 1306377 1305817 1302102
50774 1302102 1294698 1283560 1268439 1248897 1225093 1198036 1168705 1137145 1102672 1065005 1025060
50763 1025060 984686 945653 908891 874559 842568 812790 784942 758787 734649 713356 695400
50752 695400 680357 667331 655764 645622 637097 630510 626297 624666 625242 627297 630252 633803 637779
50739 637779 642253 647680 654567 662989 672645 683282 694847 707362 720875 735342 750241 764573
50727 764573 777767 790481 803932 818424 833066 846977 860177 873034 885372 896517 905985 913778
50715I13778O402N359M591L951L570M109O311J0075J4299J7786K0183K2003K3851
50702A056268K5744K7146K7590K7188K6404K5377K3704K1020J7593J4250J1840
50691A304124J0775J0812J1279J1709J2323J3620J5484J7125J8002J8410J8998
50680A462661K0088K1683K3848K6828L1033L6855M3993N1057N6412N9576O1116
50669A895150O1170N9148N5248N1101M8017M5478M2336L8753L5781L3581L1274
50658B397037K8358K5041K1280J6669J1462O683K958K8k346l722l480j551J601
50645B500018N329R185J3277J8001K3056K7170K9392L0117K9989K8563K5241K1006
50633B760344J7546J4911J1720P630L457j644j0904k6217m4987o2008p3590p8928
$$ plain form
50715 913778 920180 925539 930130 934081 937651 941760 948071 958146 972445 990231 1010414 1032417 1056268
50702 1056268 1082012 1109158 1136748 1163936 1190340 1215717 1239421 1260441 1278034 1292284 1304124
50691 1304124 1314899 1325711 1336990 1348699 1361022 1374642 1390126 1407251 1425253 1443663 1462661
50680 1462661 1482749 1504432 1528280 1555108 1586141 1622996 1666989 1718046 1774458 1834034 1895150
50669 1895150 1956320 2015468 2070716 2121817 2169834 2215312 2257648 2296401 2332182 2365763 2397037
50658 2397037 2425395 2450436 2471716 2488385 2499847 2506530 2509488 2509516 2507170 2503448 2499968 2498417 2500018
50645 2500018 2505347 2514532 2527809 2545810 2568866 2596036 2625428 2655545 2685534 2714097 2739338 2760344
50633 2760344 2777890 2792801 2804521 2812151 2815608 2813964 2803060 2776843 2731856 2669848 2596258 2517330
50621B517330p8676p3974o6317n6834m5740l3286k0782r662l7Q620J5759J9872
50609B176273K0267J7603J2820O555n56q145j6733k6983l8078m7915n5152o0244
50597A979712o4107o6780o7885o7620o6562o4874o2260n8556n3970m8952m4016
50586A314130l9483l5241l0924k6365k1637j6770j1754o879k583J063M362P486
50574A135405J0316J2791J4889J6241J6333J5295J3938J2839J1842J0740R961
50563A280590J0172J1575J3989J7341K1713K6987L2804L8807M4751N0391N5404
50552A604524N9407O2079O3330O3301O2158O0078N7636N5907N5760N7186N9691
50541B261057O3126O7537P2360P6581P9826Q2688Q5790Q9260R3321R8596J05237
$$ plain form
50621 2517330 2438654 2364680 2298363 2241529 2195789 2162503 2141721 2132059 2132022 2140642 2156401 2176273
50609 2176273 2196540 2214143 2226963 2233518 2232962 2224817 2208084 2181101 2143023 2095108 2039956 1979712
50597 1979712 1915605 1848825 1780940 1713320 1646758 1581884 1519624 1461068 1407098 1358146 1314130
50586 1314130 1274647 1239406 1208482 1182117 1160480 1143710 1131956 1125077 1122494 1123557 1127919 1135405
50574 1135405 1145721 1158512 1173401 1189642 1205975 1221270 1235208 1248047 1259889 1270629 1280590
50563 1280590 1290762 1302337 1316326 1333667 1355380 1382367 1415171 1453978 1498729 1549120 1604524
50552 1604524 1663931 1726010 1789340 1852641 1914799 1974877 2032513 2088420 2144180 2201366 2261057
50541 2261057 2324183 2391720 2464080 2540661 2620487 2703175 2788965 2878225 2971546 3070142 3175379
50530C175379J12347J18824J24347J29134J33157J36094J37522J36631J32199
50521D335634J23604J11519R6954P9839N9347L5428R302j7579m4287p0128r4324
50510D625309j16089j34504j48202j55930j57586j54180j46543j34736j18908
50501C358631j00026p9171n6778l3286j0130J0675K7862M1167N0230N3935N1114
50490C314223M1621K6443P080j4916l7948o0290q0296r6765j09258j18040j23670
50479B748184j26519j26656j24209j19826j14621j09460j04307r8514r1910q5290
50469A646872p9547p4520o9291o3483n7689n2447m7498m2450l7611l3533l0068
50458A058735k6586k2984j9799j7335j5342j3640j2364j1361r988q012o205n458
$$ plain form
50530 3175379 3287726 3406550 3530897 3660031 3793188 3929282 4066804 4203435 4335634
50521 4335634 4459238 4570757 4667711 4747550 4806897 4842325 4851627 4834048 4789761 4719633 4625309
50510 4625309 4509220 4374716 4226514 4070584 3912998 3758818 3612275 3477539 3358631
50501 3358631 3258605 3179434 3122656 3089370 3079240 3089915 3117777 3158944 3209174 3263109 3314223
50490 3314223 3355844 3382287 3389367 3374451 3336503 3276213 3195917 3099152 2989894 2871854 2748184
50479 2748184 2621665 2495009 2370800 2250974 2136353 2026893 1922586 1824072 1732162 1646872
50469 1646872 1567325 1492805 1423514 1360031 1302342 1249895 1202397 1159947 1122336 1088803 1058735
50458 1058735 1032149 1009165 989366 972031 956689 943049 930685 919324 909336 901324 895119 889661
50446H89661n589n536m581k818n87J889M236N989P313R201J2395J6318J9586K1622
50432I69099K3311K5774K8962L1807L3682L5112L6939L9277M1714M4200M7105
50421A356982N0397N3498N6217N9296O3524O8619P3511P7550Q0915Q3783Q5821
50410B110113Q6601Q6163Q4714Q2101P8003P2551O6291N9428N1364M1219K8772
50399B847320J4551r24j7619l5288n2579o7498p8982q7465r3535r6606r5622r0785
50387B144968q3712p5804o7142n7193m5899l3723k1240r195J458J0042J6392K0253
50375A799205K0865J7721J1485L476n535j5418k5655l5025m2551m8260n2683n6064
50363A571561n8328n9541n9967n9739n8714n6716n3790n0251m6524m2876l9346
$$ plain form
50446 889661 884072 878536 873955 871137 870550 872439 876675 882664 889977 899178 911573 927891 947477 969099
50432 969099 992410 1018184 1047146 1078953 1112635 1147747 1184686 1223963 1265677 1309877 1356982
50421 1356982 1407379 1460877 1517094 1576390 1639914 1708533 1782044 1859594 1940509 2024292 2110113
50410 2110113 2196714 2282877 2367591 2449692 2527695 2600246 2666537 2725965 2777329 2818548 2847320
50399 2847320 2861871 2860947 2843328 2808040 2755461 2687963 2608981 2521516 2427981 2331375 2235753 2144968
50387 2144968 2061256 1985452 1918310 1861117 1815218 1781495 1760255 1751060 1752518 1762560 1778952 1799205
50375 1799205 1820070 1837791 1849276 1852752 1847217 1831799 1806144 1771119 1728568 1680308 1627625 1571561
50363 1571561 1513233 1453692 1393725 1333986 1275272 1218556 1164766 1114515 1067991 1025115 985769
50352I85769l5994l3044l0543k8091k5278k2283j9673j7593j5640j3640j1957
50341G32033j0747r484p706n885m928n011n418n604n807o451p318p682p054n623
50327F37315m055l043k882l324l788l819l284k221p09J050K691L993N153O528
50313F29605Q094R414J0238J0853J1644J2476J2845J2610J2142J1671J0882R506
50301G61980P947O914O549O362N976N416M710L735K669K041J976J846J106K6q95
50286H18358j918l790o585r444j1534j2658j2882j2055j0022o857k689K250P433
50273G37607J2382J7376K2907K7812K8751K2807J0688l334j4753k1632k4470k4517
50261G91624k2911k0633j8360j6172j3872j1559r641q302p241o036m579l166k213
$$ plain form
50352 985769 949775 916731 886188 858097 832819 810536 790863 773270 757630 743990 732033
50341 732033 721286 711802 704096 698211 693283 688272 682854 677250 671443 664992 657674 649992 642938 637315
50327 637315 633260 630217 627335 624011 620223 616404 613120 610899 610190 611240 613931 617924 623077 629605
50313 629605 637699 647113 657351 668204 679848 692324 705169 717779 729921 741592 752474 761980
50301 761980 769927 776841 783390 789752 795728 801144 805854 809589 812258 814299 816275 818121 819227 819253 818358
50286 818358 816440 812650 806065 796621 785087 772429 759547 747492 737470 730613 727924 730174 737607
50273 737607 749989 767365 790272 818084 846835 869642 880330 876996 862243 840611 816141 791624
50261 791624 768713 748080 729720 713548 699676 688117 678476 670174 662933 656897 652318 649152 646939
50248F46939j905k059k336k539k629k523k100j463r42p37p44q85j314k114k989
50233F19660l539l734l840l987m037l871l563l258l044k888k572j757l51J200
50219E80419K309K942L704N135P149R341J1623J4302J7589K1305K5284K9886L5677
50206G66665M2464M9068N4352N8270O1349O3311O2949N9612N4123M7866M1557
50195A361586L5481L0363K7071K5558K4792K3710K1591J7584J0708P05j1564k4694
50183A542891l7398m8625n7651o4265o8447o9807o7957o3500n7958n2362m6522
50172I08399m0050l3378k7208k1539j6057j1203q093p303q235r658j0504j0326
50160G04845r383q340p508o450m607k194o2J250J997K752L641M182L765K335O78
$$ plain form
50248 646939 645034 642975 640639 638100 635471 632948 630848 629385 628443 627706 626962 626077 624763 622649 619660
50233 619660 616121 612387 608547 604560 600523 596652 593089 589831 586787 583899 581327 579570 579219 580419
50219 580419 582728 585670 589374 594509 601658 610999 622622 636924 654513 675818 701102 730988 766665
50206 766665 809129 858197 912549 970819 1032168 1095479 1158428 1218040 1272163 1320029 1361586
50195 1361586 1397067 1427430 1454501 1480059 1504851 1528561 1550152 1567736 1578444 1579149 1567585 1542891
50183 1542891 1505493 1456868 1399217 1334952 1266505 1196698 1128741 1065241 1007283 954921 908399
50172 908399 868349 834971 807763 786224 770167 758964 750871 743568 735333 725675 715171 704845
50160 704845 695462 687122 679614 673164 668557 666363 666301 667551 669548 672300 675941 680123 683888 686223 686901
50145F86901k94n89j177k758m814o154o101m832k922r76N41J611K631L761M565
50130F69393M614M137L654L394L525M367N653O133M959L169K639L615M544M473
50116G28269M276M988O101O466O063N878O465P535Q717R915J0992J1754J2337
50103H29756J3123J4251J5529J6814J8222J9965K2153K4750K7682L1114L5618
50092A068977M1717M9295N7805O7038P7118Q7542R6888J03823J07793J08416J05026
50081A971438R7717Q8354P9599P2998O8577O5869O4332O2838N9738N3761M4303
50070B729524L0839J2981q439l1047n2229p0550q5731r7813j06842j12964j16301
50059B091428j16800j14540j10144j04567r8528r2228q5525p8205p0211o1862
$$ plain form
50145 686901 686607 686018 684841 682083 677269 671115 665014 660182 657260 656284 656825 658436 661067 664828 669393
50130 669393 674007 678144 681798 685192 688717 693084 698737 704870 709829 712998 715637 719252 723796 728269
50116 728269 732545 737533 743634 750100 756163 762041 768506 776041 784758 794673 805665 817419 829756
50103 829756 842879 857130 872659 889473 907695 927660 949813 974563 1002245 1033359 1068977
50092 1068977 1110694 1159989 1217794 1284832 1361950 1449492 1546380 1650203 1757996 1866412 1971438
50081 1971438 2069155 2157509 2237108 2310106 2378683 2444552 2508884 2571722 2631460 2685221 2729524
50070 2729524 2760363 2773344 2764905 2733858 2681629 2611079 2525348 2427535 2320693 2207729 2091428
50059 2091428 1974628 1860088 1749944 1645377 1546849 1454621 1369096 1290891 1220680 1158818
50049A158818n3806m6643m0628l5709l1682k8281k5310k2813k0937j9518j8058
50038H15433j6288j4546j3302j2449j1370r731p910o548n838n406m823m102l623
50025F99497l613l818l778l377k960k911l210l546l673l670l809m260m877n340
50011F46655n531n768o449p490q308q518q409q525q858q707p419n162k818j203
49997E53490l74L09J535L477N717P624Q744R038Q869Q678Q556Q179P335O398O035
49982F43610O388O875O864O349N829N815O622Q457J1341J5079J9453K4405K9867
49969G96954L5669M1816M8616N5981O2673O6811O7377O4894O0578N5249M9322
49958A405940M3359L8084L4024L1490L0643L1084L1401K9678K4628J6020M204
$$ plain form
50049 1158818 1105012 1058369 1017741 982032 950350 922069 896759 873946 853009 833491 815433
50038 815433 799145 784599 771297 758848 747478 737747 729837 723289 717451 712045 707222 703120 699497
50025 699497 695884 692066 688288 684911 681951 679040 675830 672284 668611 664941 661132 656872 651995 646655
50011 646655 641124 635356 628907 621417 613109 604591 596182 587657 578799 570092 562673 557511 554693 553490
49997 553490 553116 553425 554960 558437 564154 571778 580522 589560 598429 607107 615663 623842 631177 637575 643610
49982 643610 649998 656873 663737 670086 675915 681730 688352 696809 708150 723229 742682 767087 796954
49969 796954 832623 874439 923055 979036 1041709 1108520 1175897 1240791 1301369 1356618 1405940
49958 1405940 1449299 1487383 1521407 1552897 1583540 1614624 1646025 1675703 1700331 1716351 1720555
49947A720555j0161k5785m0718n3227o2538o8661p1815p2346p0849o7862o3524
49936A113069n7975n2058m7131m4036m2463m1381l9910l7746l5039l2069k8986
49925F54275k5775k2517j9557j7219j5332j3339j0929q405o367n193m890n144
49913D99608n341m815l397j681n01q0J20P11J644K276K090J347R65J783L841O317
49897E04887Q171Q925Q932Q870Q930Q536P000M490K080P54N32O83N57j25j522
49882E71700l718o509r454j2165j4277j5239j4678j3031j1368j0345r695q938
49870D42283q065p211o128m545k881j917j802j819j255j25J066J960K556L059
49856D15176L655M342M947N339N745O600Q022R487J0202R839Q779P660O782O066
$$ plain form
49947 1720555 1710394 1684609 1643891 1590664 1528126 1459465 1387650 1315304 1244455 1176593 1113069
49936 1113069 1055094 1003036 955905 911869 869406 828025 788115 750369 715330 683261 654275
49925 654275 628500 605983 586426 569207 553875 540536 529607 521202 514835 509642 504752 499608
49913 499608 494267 489452 486055 484374 483873 483793 483913 484624 486268 488544 490634 491981 492946 494729 498570 504887
49897 504887 513058 521983 530915 539785 548715 557251 564251 568741 570821 571575 572107 572790 573347 573222 571700
49882 571700 567982 561473 552019 539854 525577 510338 495660 482629 471261 460916 451221 442283
49870 442283 434218 427007 420879 416334 413453 411536 409734 407915 406660 406535 407601 409561 412117 415176
49856 415176 418831 423173 428120 433459 439204 445804 453826 463313 473515 483354 492133 499793 506575 512641
49842E12641N446M965M437L384J715K06k63J0k93j898m035n498o119o601p246
49827E00851p560p081n984m726l544k525j805j465j301q53L12K218M262N599N960
49812D82358N910O095O493O805P198P975Q650Q166O246L867K091R85N3q08j406
49797E50678j938k953m642o603q361r797j1045j2142j2806j2547j1177r277p843
49784D39547p247o817n780m327l336l170l265k927k102j160l30M62J297K071K639
49769D05555L063L714M880O276P150P197P070P568Q455Q729Q039P189O934O895
49755D98714O255N026L911L058J770m14k944m950o189o974p465p537p195o634
49741D68432n874m696l152j803j221j357j569j252l74O02J155J121P23K73k7q6
$$ plain form
49842 512641 518087 523052 527489 530873 532588 532794 532531 532541 532248 530350 526315 520817 514698 508097 500851
49827 500851 493291 486210 480226 475500 471956 469431 467626 466161 464860 464007 464319 466537 470799 476398 482358
49812 482358 488268 494363 500856 507661 514859 522834 531484 539650 545896 549763 551854 552839 552892 552084 550678
49797 550678 548740 545787 541145 534542 526181 516384 505339 493197 480391 467844 456667 447390 439547
49784 439547 432300 425483 419703 415376 412040 408870 405605 402678 400576 399416 399086 399548 400845 402916 405555
49769 405555 408618 412332 417212 423488 430638 437835 444905 452473 460928 469657 477696 484885 491819 498714
49755 498714 504969 509995 513906 516964 518734 518320 515376 510426 504237 497263 489798 482261 475066 468432
49741 468432 462558 457862 454710 452907 451686 450329 448760 447508 447134 447736 448891 450012 450735 451008 450981 450895
49725D50895J37M91O40N19P73K286N106Q122J0145J1018J1339J1313J0419Q282
49711E31485N362K591N71o41j194j228r09m81j95k02l94m02n3R5r29l344o009
$$ plain form
49725 450895 451032 451523 452163 452682 453455 455741 460847 468969 479114 490132 501471 512784 523203 531485
49711 531485 536847 539438 540009 539368 538174 536946 536037 535556 535361 535159 534765 534363 534310 534405 533476 530132 524123
$$ [...]
##END NTUPLES=NMR SPECTRUM
##END=
