
##TITLE=AC1229_PANAH12122_6524299_wY3hrqstTx
##JCAMPDX= 6.0         $$ Bruker NMR JCAMP-DX V2.0
##DATA TYPE= NMR SPECTRUM
##DATA CLASS= NTUPLES
##ORIGIN= BRUKER
##OWNER= Administrator
$$ 1.72 TOPSPIN		Version 2.1
$$ 2012-07-14 20:00:58.000 -0500  Administrator@TOPSPIN
$$ Compression mode = diff/dup
##.OBSERVE FREQUENCY= 400.02188249412
##.OBSERVE NUCLEUS= ^1H
##.ACQUISITION MODE= SIMULTANEOUS (DQD)
##.ACQUISITION SCHEME= undefined
##.AVERAGES= 64
##.DIGITISER RES= 22
##SPECTROMETER/DATA SYSTEM= spect
##.PULSE SEQUENCE= noesygpps1d.comp
##.SOLVENT NAME= COFFEE_meoh
##.SHIFT REFERENCE= INTERNAL, COFFEE_meoh, 1, 14.96097
##AUDIT TRAIL= $$ (NUMBER, WHEN, WHO, WHERE, PROCESS, VERSION, WHAT)
$$ ##TITLE= Audit trail, TOPSPIN		Version 2.1
$$ ##JCAMPDX= 5.01
$$ ##ORIGIN= Bruker BioSpin GmbH
$$ ##OWNER= Administrator
$$ $$ C:\Bruker\TOPSPIN/data/COFFEE/nmr/AC1229_PANAH12122_6524299_wY3hrqstTx/12/pdata/1/auditp.txt
$$ ##AUDIT TRAIL=  $$ (NUMBER, WHEN, WHO, WHERE, PROCESS, VERSION, WHAT)
(   1,<2012-07-14 20:00:53.328 -0500>,<Administrator>,<TOPSPIN>,<go>,<TOPSPIN 2.1>,
      <created by zg
	started at 2012-07-14 19:49:22.984 -0500,
	POWCHK enabled, PULCHK disabled,
       configuration hash MD5:
       6B 1B 68 BB D9 2E 58 E2 7F 35 AD 54 07 DF 0E 41
       data hash MD5: 64K
       79 CF 5A 14 E9 62 33 AA 38 91 ED 50 4F A4 BC 47>)
(   2,<2012-07-14 20:00:56.140 -0500>,<Administrator>,<TOPSPIN>,<proc1d>,<TOPSPIN 2.1>,
      <Start of raw data processing
       efp LB = 0.3 FT_mod = 6 PKNL = 1 PHC0 = 0 PHC1 = 0 SI = 128K 
       data hash MD5: 128K
       78 0B 94 D9 F5 F4 6F B0 03 1E 07 84 90 F5 83 08>)
(   3,<2012-07-14 20:00:57.281 -0500>,<Administrator>,<TOPSPIN>,<proc1d>,<TOPSPIN 2.1>,
      <pk PHC0 = 0.269165 PHC1 = 0 
       data hash MD5: 128K
       16 03 6D EF 39 19 47 75 EA 9C 09 A0 47 5B 5C 8A>)
(   4,<2012-07-14 20:00:57.515 -0500>,<Administrator>,<TOPSPIN>,<proc1d>,<TOPSPIN 2.1>,
      <abs ABSG = 1 
       data hash MD5: 128K
       B7 9D 23 82 42 64 29 0F 9F 27 94 BA 8F 07 61 D7>)
(   5,<2012-07-14 20:00:57.578 -0500>,<Administrator>,<TOPSPIN>,<proc1d>,<TOPSPIN 2.1>,
      <abs ABSG = 2 
       data hash MD5: 128K
       FC AE 34 87 37 9B 92 71 94 FE 9B 11 3A DC 02 52>)
(   6,<2012-07-14 20:00:57.640 -0500>,<Administrator>,<TOPSPIN>,<proc1d>,<TOPSPIN 2.1>,
      <abs ABSG = 3 
       data hash MD5: 128K
       DD 59 0A B2 44 A0 6A CC 60 CD 4B E8 8A 07 C4 B3>)
(   7,<2012-07-14 20:00:57.843 -0500>,<Administrator>,<TOPSPIN>,<proc1d>,<TOPSPIN 2.1>,
      <abs ABSG = 4 
       data hash MD5: 128K
       69 31 79 59 A8 93 D6 D7 78 D5 95 68 A6 4F 5B 26>)
(   8,<2012-07-14 20:00:57.906 -0500>,<Administrator>,<TOPSPIN>,<proc1d>,<TOPSPIN 2.1>,
      <abs ABSG = 5 
       data hash MD5: 128K
       10 81 AD 5D D6 CF 4A 5D AF A8 ED 7F AC AD EA CE>)
$$ ##END=
$$ 
$$ $$ hash MD5
$$ $$ B1 68 0E F5 2E F9 18 F8 10 C2 75 73 BF E8 D8 21
##$RELAX= 
##$RELAX= 
##$RELAX= 
##$RELAX= 
##$RELAX= 
##$RELAX= 
##$RELAX= 
##$RELAX= 
$$ Bruker specific parameters
$$ [...]
##$TP07= 0
##$TPNAME0= <>
##$TPNAME1= <>
##$TPNAME2= <>
##$TPNAME3= <>
##$TPNAME4= <>
##$TPNAME5= <>
##$TPNAME6= <>
##$TPNAME7= <>
##$TPOAL= (0..7)
0.5 0.5 0.5 0.5 0.5 0.5 0.5 0.5
##$TPOFFS= (0..7)
0 0 0 0 0 0 0 0
##$TUNHIN= 0
##$TUNHOUT= 0
##$TUNXOUT= 0
##$USERA1= <user>
##$USERA2= <user>
##$USERA3= <user>
##$USERA4= <user>
##$USERA5= <user>
##$V9= 5
##$VALIST= <valist>
##$VCLIST= <CCCCCCCCCCCCCCC>
##$VD= 0
##$VDLIST= <DDDDDDDDDDDDDDD>
##$VPLIST= <PPPPPPPPPPPPPPP>
##$VTLIST= <TTTTTTTTTTTTTTT>
##$WBST= 2048
##$WBSW= 25
##$XGAIN= (0..3)
0 0 0 0
##$XL= 0
##$YL= 0
##$YMAX_a= 10065434
##$YMIN_a= -7817398
##$ZGOPTNS= <>
##$ZL1= 120
##$ZL2= 120
##$ZL3= 120
##$ZL4= 120
##$ABSF1= 14.96097
##$ABSF2= -5.597212
##$ABSG= 5
##$ABSL= 3
##$ALPHA= 0
##$AQORDER= 0
##$ASSFAC= 0
##$ASSFACI= 0
##$ASSFACX= 0
##$ASSWID= 0
##$AUNMP= <proc_prof1d_extract.lims>
##$AXLEFT= 0
##$AXNAME= <>
##$AXNUC= <1H>
##$AXRIGHT= 0
##$AXTYPE= 0
##$AXUNIT= <>
##$AZFE= 0.1
##$AZFW= 0.1
##$BCFW= 0
##$BC_mod= 0
##$BYTORDP= 0
##$COROFFS= 0
##$CY= 15
##$DATMOD= 1
##$DC= 0
##$DFILT= <>
##$DTYPP= 0
##$F1P= 0
##$F2P= 0
##$FCOR= 0.5
##$FTSIZE= 131072
##$FT_mod= 6
##$GAMMA= 0
##$GB= 0
##$INTBC= 1
##$INTSCL= 1
##$ISEN= 128
##$LB= 0.3
##$LEV0= 0
##$LPBIN= 0
##$MAXI= 10000
##$MC2= 0
##$MEAN= 0
##$ME_mod= 0
##$MI= 0
##$NCOEF= 0
##$NC_proc= -2
##$NLEV= 6
##$NOISF1= 0
##$NOISF2= 0
##$NSP= 0
##$NTH_PI= 0
##$NZP= 0
##$OFFSET= 14.96097
##$PC= 1
##$PHC0= 0.269165
##$PHC1= 0
##$PH_mod= 1
##$PKNL= yes
##$PPARMOD= 0
##$PPDIAG= 0
##$PPIPTYP= 0
##$PPMPNUM= 2147483647
##$PPRESOL= 1
##$PSCAL= 4
##$PSIGN= 0
##$PYNMP= <proc.py>
##$REVERSE= no
##$SF= 400.020009649478
##$SI= 131072
##$SIGF1= 0
##$SIGF2= 0
##$SINO= 400
##$SIOLD= 131072
##$SPECTYP= <>
##$SREGLST= <1H.CDCl3>
##$SSB= 0
##$STSI= 131072
##$STSR= 0
##$SW_p= 8223.68421052631
##$SYMM= 0
##$S_DEV= 0
##$TDeff= 65536
##$TDoff= 0
##$TI= <>
##$TILT= no
##$TM1= 0
##$TM2= 0
##$TOPLEV= 0
##$USERP1= <user>
##$USERP2= <user>
##$USERP3= <user>
##$USERP4= <user>
##$USERP5= <user>
##$WDW= 1
##$XDIM= 131072
##$YMAX_p= 351590365
##$YMIN_p= -13495
##$CURPLOT= <Network HP LaserJet P1505>
##$CURPRIN= <$Network HP LaserJet P1505>
##$DFORMAT= <normdp>
##$LAYOUT= <+/1D_H.xwp>
##$LFORMAT= <normlp>
##$PFORMAT= <normpl>
##$SURQMSG= 1
$$ End of Bruker specific parameters
$$ ---------------------------------
##NTUPLES= NMR SPECTRUM
##VAR_NAME=  FREQUENCY,     SPECTRUM/REAL,   SPECTRUM/IMAG
##SYMBOL=    X,             R,               I
##VAR_TYPE=  INDEPENDENT,   DEPENDENT,       DEPENDENT
##VAR_FORM=  AFFN,          ASDF,            ASDF
##VAR_DIM=   131072,        131072,          131072
##UNITS=     HZ,            ARBITRARY UNITS, ARBITRARY UNITS
##FACTOR=    0.0627417313425164, 1,          1
##FIRST=     8223.62146879497, 4000,         -52826
##LAST=      0,             5606,            -52091
##MIN=       0,             -13495,          0
##MAX=       8223.62146879497, 351590365,    0
$$ Real data points
##PAGE= N=1
##DATA TABLE= (X++(R..R)), XYDATA
$$ [...]
63952F04768L5427M0665M6701N3394O1040P0117Q0563R1687J03017J14775J27227
$$ 604768 640195 680860 727561 780955 841995 912112 992675 1084362 1187379 1302154 1429381
63941A429381J39862J51645J61888J70457J77303J82140J84533J83935J79739
$$ 1429381 1569243 1720888 1882776 2053233 2230536 2412676 2597209 2781144 2960883
63932B960883J71659J60023J45276J27284J05637Q0666N3665K5937j960k9820
$$ 2960883 3132542 3292565 3437841 3565125 3670762 3751428 3805093 3831030 3829070 3799250
63922C799250n7023q2520j05473j25650j43237j58307j70395j78654j82566j82414
$$ 3799250 3742227 3659707 3554234 3428584 3285347 3127040 2956645 2777991 2595425 2413011
63912B413011j78912j72611j64007j54000j43503j32621j20799j08060r5428q3852
$$ 2413011 2234099 2061488 1897481 1743481 1599978 1467357 1346558 1238498 1143070 1059218
63902A059218p3277o3230n3808m5520l8533l2643k7772k3886k0654j7696j5129
$$ 1059218 985941 922711 868903 823383 784850 752207 724435 700549 679895 662199 647070
63891F47070j3252j1860j0462r178q647q865q771p421n151l109j999j582j140
$$ 647070 633818 621958 611496 602318 593671 584806 576035 568614 563463 560354 558355 556773 555633
63878E55633M9K422N757R138J1705J3580J5654J8501K1835K5106K8083L0640L2377
$$ 555633 555682 558104 563861 572999 584704 598284 613938 632439 654274 679380 707463 738103 770480
63865G70480L3059L3227L3851L5287L6866L7654L7246L5752L3313K9983K5923
$$ 770480 803539 836766 870617 905904 942770 980424 1017670 1053422 1086735 1116718 1142641
63854A142641K1402J6550J1323N732m7n768j1231j6307k0916k4936k8158l0443
$$ 1142641 1164043 1180593 1191916 1197648 1197601 1191833 1180602 1164295 1143379 1118443 1090285 1059842
63842A059842l1995l3282l4594l5854l6950l7908l8535l8305l7116l5802l5273
$$ 1059842 1027847 994565 959971 924117 887167 849259 810724 772419 735303 699501 664228
63831F64228l5237l4441l2211k9119k6070k3470k1478k0230j9369j8039j5967
$$ 664228 628991 594550 562339 533220 507150 483680 462202 441972 422603 404564 388597
63820C88597j4027j3030j2529j1597j0308r520r360r011q068p080o490n916n004
$$ 388597 374570 361540 349011 337414 327106 317586 308226 299215 291147 284067 277577 271661 266657
63807B66657m202m047m180l731k523j333r98j583k423k727k293j730j773k351
$$ 266657 262455 258408 254228 250497 247974 246641 245643 244060 241637 238910 236617 234887 233114 230763
63793B30763k599k059j368j394k036k358j811q10j59k29p52j165j115p89o96j032
$$ 230763 228164 226105 224737 223343 221307 218949 217138 216328 216169 215940 215188 214023 212908 212119 211423 210391
63777B10391j489j761j885j883j499p33k12m40r75r95n37l72p61j082q42k88K18
$$ 210391 208902 207141 205256 203373 201874 201141 200929 200489 199514 198519 197982 197610 196849 195767 194925 194637 194855
63760A94855O67R96Q86L95J42L93N72J88l96o43o96q07n12O01J722J553J75q93
$$ 194855 195522 196518 197404 197799 197941 198334 198906 199094 198698 198055 197359 196552 196040 196641 198363 199916 200091 199198
63742A99198o30L82J048J091R15R14J334K148K744K421J534J336K229L021K668
$$ 199198 198568 198950 199998 201089 202004 202918 204252 206400 209144 211565 213099 214435 216664 219685 222353
63727B22353J869J919K621K708K008J805K856M315N004M821M342L816L192K583
$$ 222353 224222 226141 228762 231470 233478 235283 238139 242454 247458 252279 256621 260437 263629 266212
63713B66212K137J818J642J695J638P64r71k561l137l020k980k991k554j866j650
$$ 266212 268349 270167 271809 273504 275142 275906 274935 272374 269237 266217 263237 260246 257692 255826 254176
63698B54176j943j960j280l05O17J706L017L904L797L061K641L036L942M656M632
$$ 254176 252233 250273 248993 248688 249305 251011 254028 257932 261729 264790 267431 270467 274409 279065 283697
63683B83697L911L216L310M050M515M139L295K473J576M79k63o4O83J023P27L83
$$ 283697 287608 290824 294134 298184 302699 306838 310133 312606 314182 314661 314398 314334 315017 316040 316767 317150
63667C17150L44L12N2k41n01r72j599j928j991k551l907n026m723l333k405k793
$$ 317150 317494 317806 317858 317617 317116 316144 314545 312617 310626 308075 304168 299142 294419 291086 288681 285888
63651B85888l848m517m516m107l433k570j877j685j726j379m80M81J040J384J990
$$ 285888 282040 277523 273007 268900 265467 262897 261020 259335 257609 256230 255750 256231 257271 258655 260645
63636B60645K920L763M229M485M794N118N315N536O011O540O618O208O011O625
$$ 260645 263565 267328 271557 276042 280836 285954 291269 296805 302816 309356 315974 322182 328193 334818
63622C34818P741Q580Q915R241R980J1022J2107J3248J4503J5775J7162J9183
$$ 334818 342559 351139 360054 369295 379275 390297 402404 415652 430155 445930 463092 482275
63610D82275K2212K5747K8695L0400L1155L1595L1934L1819L0823K8842K6116
$$ 482275 504487 530234 558929 589329 620484 652079 684013 715832 746655 775497 801613
63599H01613K2929J9291J5011J0156N332J219k082m955p526r475j0733j1909j3603
$$ 801613 824542 843833 858844 869000 874332 875551 873469 868514 860988 851513 840780 828871 815268
63586H15268j5588j7232j8506j9995k1878k3585k4667k5409k6120k6254k4944
$$ 815268 799680 782448 763942 743947 722069 698484 673817 648408 622288 596034 571090
63575E71090k2229j9162j6651j4646j2613j0331p925n530l240j267L11J824L708
$$ 571090 548861 529699 513048 498402 485789 475458 467533 462003 458763 457496 457807 459631 463339
63562D63339N856P601Q503Q945R703J0963J2078J2465J2525J3336J5461J8336
$$ 463339 469195 476796 485299 494244 503947 514910 526988 539453 551978 565314 580775 599111
63550E99111K1054K3464K6186K9640L3477L6938L9333M0121L9048L6533L3545
$$ 599111 620165 643629 669815 699455 732932 769870 809203 849324 888372 924905 958450
63539I58450L0568K6863K1218J3480M964k680q652j3038j6035j7532j7366j5924
$$ 958450 989018 1015881 1037099 1050579 1055543 1052863 1044211 1031173 1015138 997606 980240 964316
63527I64316j4369j4111j5779j8675k1484k3559k5371k7681l0589l3438l5349
$$ 964316 949947 935836 920057 901382 879898 856339 830968 803287 772698 739260 703911
63516G03911l5760l4691l2801l0878k9138k7108k4458k1575j9094j7090j5208
$$ 703911 668151 633460 600659 569781 540643 513535 489077 467502 448408 431318 416110
63505D16110j3437j2179j1484j0737r380p614o126n283m903m705m646m740m736
$$ 416110 402673 390494 379010 368273 358893 351279 345153 339870 334967 330262 325616 320876 316140
63492C16140m186k914j340j87J59j04n38q28p31NJ270K430K915K960L209L738
$$ 316140 311954 309040 307700 307513 307672 307568 307030 306202 305471 305476 306746 309176 312091 315051 318260 321998
63476C21998L988L758L545L632L529K804J879J344R61J13j028j656j558j376j496
$$ 321998 325986 329744 333289 336921 340450 343254 345133 346477 347438 347551 346523 344867 343309 341933 340437
63461C40437j536j256j197j858k821l241k921k313j749j137l86M40J437K843M618
$$ 340437 338901 337645 336448 334590 331769 328528 325607 323294 321545 320408 320022 320462 321899 324742 329360
63446C29360O212P037P092P088P829R415J1158J2477J3688J5606J8376K1329K3937
$$ 329360 335572 342609 349701 356789 364618 374033 385191 397668 411356 426962 445338 466667 490604
63433D90604K6342K8585L0026L0099K9143K7806K5937K2817J8374J3522R295O267
$$ 490604 516946 545531 575557 605656 634799 662605 688542 711359 729733 743255 752550 758817
63421G58817M833N317P606J1043J4962J9104K3455K7943L2189L5321L6271L4742
$$ 758817 763650 768967 776573 787616 802578 821682 845137 873080 905269 940590 976861 1011603
63409A011603L1693K8246K4299J8960J2251N503q8m421p807j0249j1982j3882
$$ 1011603 1043296 1071542 1095841 1114801 1127052 1132555 1132467 1128046 1120239 1109990 1098008 1084126
63397A084126j6603j9679k2172k3899k5579k8009l1413l5252l8301l9438l8741
$$ 1084126 1067523 1047844 1025672 1001773 976194 948185 916772 881520 843219 803781 765040
63386G65040l7390l6138l4459l1623k7946k4285k0914j7771j5221j3564j2140
$$ 765040 727650 691512 657053 625430 597484 573199 552285 534514 519293 505729 493589
63375D93589r944o998m141j596J182M176O513P766Q660J0048J1918J3891J5981
$$ 493589 483645 476647 472506 470910 472092 476268 482781 490547 499207 509255 521173 535064 551045
63362E51045J8399K1022K3560K5955K8373L1001L4001L7264M0106M1645M1595
$$ 551045 569444 590466 614026 639981 668354 699355 733356 770620 810726 852371 893966
63351H93966M0289L7982L4637L0448K5944K1314J6232J0597M889l90n022q697
$$ 893966 934255 972237 1006874 1037322 1063266 1084580 1100812 1111409 1116298 1115908 1110886 1102189
63339A102189j1098j2639j4422j6996j9771k2067k4025k5963k7634k8810k9963
$$ 1102189 1091091 1078452 1064030 1047034 1027263 1005196 981171 955208 927574 898764 868801
63328H68801l1508l2889l3227l2474l1065k8787k5047k0118j5194j1179q276o726
$$ 868801 837293 804404 771177 738703 707638 678851 653804 633686 618492 607313 599037 592311
63316E92311o895q355r793j0426j0944j2563j5525j8859k1261k1879k0615j8213
$$ 592311 585416 577061 567268 556842 545898 533335 517810 498951 477690 455811 435196 416983
63304D16983j5890j4445j3621j2584j0941r158p946p449p133o425n299m203l494
$$ 416983 401093 386648 373027 360443 349502 340344 332398 324949 317816 311391 306092 301889 298395
63291B98395l136k930k797k701k550k253j798j201n98m13j032k200l095l171k628
$$ 298395 295259 292329 289532 286831 284281 282028 280230 279029 278431 278018 276986 274786 271691 268520 265892
63276B65892j839q89P8N54L15n3J24O44P79L83NO8N27J267K127K651K429J793
$$ 265892 264053 263164 263242 263796 264111 264058 264182 264826 265605 265988 265993 266061 266588 267855 269982 272633 275062 276855
63258B76855J556J976K488K553K257J993K028K378K769K761K406K556L882N710
$$ 276855 278411 280387 282875 285428 287685 289678 291706 294084 296853 299614 302020 304576 308458 314168
63244C14168O668O499O300O846P646Q072Q452R393J0738J1900J2758J3537J4203
$$ 314168 320836 327335 333635 340481 348127 356199 364651 374044 384782 396682 409440 422977 437180
63231D37180J4503J4377J3869J3068J2481J2920J4447J5885J6084J5287J4639
$$ 437180 451683 466060 479929 492997 505478 518398 532845 548730 564814 580101 594740
63220E94740J4666J4997J5230J5277J4964J4101J2987J2090J1138R263O159K532
$$ 594740 609406 624403 639633 654910 669874 683975 696962 709052 720190 729453 735612 738144
63208G38144q28l912p099j0432j3585j6232j8179j9309j9711j9641j9224j8315
$$ 738144 737316 733404 726305 715873 702288 686056 667877 648568 628857 609216 589992 571677
63196E71677j6768j4682j2288r703o970m174j548N64J898K646L467M942O959Q904
$$ 571677 554909 540227 527939 518236 511266 507092 505544 506108 508006 510652 514119 519061 526020 534924
63182E34924J0329J1238J1806J2220J2750J3561J4342J4504J3905J3024J2285
$$ 534924 545253 556491 568297 580517 593267 606828 621170 635674 649579 662603 674888
63171F74888J1513J0342Q798P208N718M206K501L87k369n716r084j1834j3901
$$ 674888 686401 696743 705541 712749 718467 722673 725174 725561 723192 717476 708392 696558 682657
63158F82657j5704j7499j9132k0453k1502k2157k2055k1154k0024j9185j8332
$$ 682657 666953 649454 630322 609869 588367 566210 544155 523001 502977 483792 465460
63147D65460j6722j4262j1720r826q603p737p096o632o176n666n187m521l138
$$ 465460 448738 434476 422756 412930 404327 396590 389494 382862 376686 371020 365833 361312 358174
63134C58174j094M92N78m52j264j248p94j47R75K365L071K696K138K317K948L266
$$ 358174 357080 357572 358150 357698 356434 355186 354392 354245 355220 357585 360656 363352 365490 367807 370755 374021
63118C74021L354L779M445M735M591M488M519M384M184M247M216L340J900J273
$$ 374021 377375 381154 385599 390334 394925 399413 403932 408316 412500 416747 420963 424303 426203 427476
63104D27476K156L508L889L141K239J932K184K555K583K132J716K144L352M125
$$ 427476 429632 433140 437029 440170 442409 444341 446525 449080 451663 453795 455511 457655 461007 465132
63090D65132L487K010J042R44Q92K66o37j323j779k109k209k049j852j613r37
$$ 465132 468619 470629 471671 472615 473507 473773 473136 471813 470034 467925 465716 463667 461815 460202 459265
63075D59265K79J456K066K438L265M510N449N779O085O966Q179R051R468J0046
$$ 459265 459544 461000 463066 465504 468769 473279 478728 484507 490592 497558 505737 514788 524256 534302
63061E34302J1374J3392J5550J7352J8680J9799K1179K3161K5662K8188L0233
$$ 534302 545676 559068 574618 591970 610650 630449 651628 674789 700451 728639 758872
63050G58872L1681L2800L3919L5155L6464L7760L8931L9716L9859L9496L9285
$$ 758872 790553 823353 857272 892427 928891 966651 1005582 1045298 1085157 1124653 1163938
63039A163938L9858M1065M2040M2147M1574M0737L9463L7237L4041L0352K6253
$$ 1163938 1203796 1244861 1286901 1329048 1370622 1411359 1450822 1488059 1522100 1552452 1578705
63028A578705K1206J4937P957Q27o562j4459k2431k9655l5818m1065m5235m7817
$$ 1578705 1599911 1614848 1622805 1623632 1617070 1602611 1580180 1550525 1514707 1473642 1428407 1380590
63016A380590m8694m8270m6805m4220m0716l6927l3147k8965k3984j8489j2963
$$ 1380590 1331896 1283626 1236821 1192601 1151885 1114958 1081811 1052846 1028862 1010373 997410
63005I97410p423j803L344P235R903J2234J4822J7319J9133K0273K1154K1828
$$ 997410 989987 988184 991528 998763 1008666 1020900 1035722 1053041 1072174 1092447 1113601 1135429
62993A135429K1924K1324K0493J9912J9393J8294J6380J4159J2208J0340P761
$$ 1135429 1157353 1178677 1199170 1219082 1238475 1256769 1273149 1287308 1299516 1309856 1317617
62982A317617L997n93n339j0034j4972k0322k5694l0363l3867l6351l8231l9623
$$ 1317617 1321614 1321021 1315682 1305648 1290676 1270354 1244660 1214297 1180430 1144079 1105848 1066225
62970A066225m0210l9778l8663l7360l5836l3625l0614k7417k4678k2369k0077
$$ 1066225 1026015 986237 947574 910214 874378 840753 810139 782722 758044 735675 715598
62959G15598j7760j5809j4449j3433j2464j1596j1026j0700j0351r956r879j0407
$$ 715598 697838 682029 667580 654147 641683 630087 619061 608361 598010 588054 578175 567768
62947E67768j1217j1548j0999r979r212q982r029q988q633p801o590n593n485
$$ 567768 556551 545003 534004 524025 514813 505831 496802 487814 479181 471380 464790 459197 453712
62934D53712o169o782o736o309n892n205l830k195j220j115j174q36l18%K55P32
$$ 453712 447543 440761 434025 427716 421824 416619 412789 410594 409374 408259 407085 406249 405931 405931 406186 406918
62918D06918J224J177L88p17j356r16M57J660J449j95j802k012j107m21m88n66
$$ 406918 408142 409319 409707 408990 407634 406718 407175 408835 410284 410089 408287 406275 405168 404747 404259 403693
62902D03693q0L82n2j210k066j980j196l05L07N22N30P64J362J815J550Q57N57
$$ 403693 403613 403995 403943 402733 400667 398687 397491 397186 397493 398015 398545 399309 400671 402486 404036 404893 405450
62885D05450P36N50m23j403j475q27k21K02P68J191P08o48j822k023j576j189
$$ 405450 406186 406736 406313 404910 403435 402608 402387 402589 403357 404548 405256 404608 402786 400763 399187 397998
62869C97998j010q74q49j104j525j866k098k236k139j706j064l22N15J186J169
$$ 397998 396988 396114 395265 394161 392636 390770 388672 386436 384297 382591 381527 381205 381720 382906 384075
62854C84075M43j44J98J206J962K067J769J222L08p51j257q08J67Q91R93O86M07
$$ 384075 384518 384374 384572 385778 387740 389807 391576 392798 393106 392355 391098 390290 390457 391348 392341 393027 393434
62837C93434L90M42J43o30j544k268k818l107k574r01J080J989J469N28K15N52
$$ 393434 393824 394266 394409 393779 392235 389967 387149 384042 381468 380567 381647 383636 385105 385633 385848 386400
62821C86400J009J351J565J553J384J507K217L060L254K611J753J522K282L634
$$ 386400 387409 388760 390325 391878 393262 394769 396986 400046 403300 405911 407664 409186 411468 415102
62807D15102M658M724M202M107M859N761N962N497N088N264O027P132Q204Q876
$$ 415102 419760 424484 428686 432793 437652 443413 449375 454872 459960 465224 471251 478383 486587 495463
62793D95463R232R860J1145J2727J4131J5533J7425J9796K2375K5388K9313L3821
$$ 495463 504695 514555 525700 538427 552558 568091 585516 605312 627687 653075 682388 716209
62781G16209L7832M0855M3639M7161N1501N5968N9827O2540O3674O3038O0776
$$ 716209 754041 794896 838535 885696 937197 993165 1052992 1115532 1179206 1242244 1303020
62770A303020N7109N2117M5844L8414K9853K0159R655r56j1046k0366k8879l6541
$$ 1303020 1360129 1412246 1458090 1496504 1526357 1546516 1556171 1555215 1544169 1523803 1494924 1458383
62758A458383m3350m9208n3716n6457n7669n8116n8188n7557n5960n3709n1126
$$ 1458383 1415033 1365825 1312109 1255652 1197983 1139867 1081679 1024122 968162 914453 863327
62747H63327m8004m4176m0125l6489l3318l0352k7690k5493k3322k0525j7282
$$ 863327 815323 771147 731022 694533 661215 630863 603173 577680 554358 533833 516551
62736E16551j4567j3008j2263j1553j0332q483o436n088m995n455n046l243j075
$$ 516551 501984 488976 476713 465160 454828 446345 439909 434821 429826 424371 419325 416082 415007
62723D15007R4j6o39q91l60Q49K271L474M539N891P505Q731R164R355J0210J1941
$$ 415007 415101 415085 414446 413555 413195 414044 416315 419789 424328 430219 437724 446455 455619 464974 475184 487125
62707D87125J4056J6208J8515K1114K3797K6320K8806L1584L4696L7692M0047
$$ 487125 501181 517389 535904 557018 580815 607135 635941 667525 702221 739913 779960
62696G79960M1831M3722M6152M8538M9764M9339M7670M5170M1642L6803L0922
$$ 779960 821791 865513 911665 960203 1009967 1059306 1106976 1152146 1193788 1230591 1261513
62685A261513K4471J7501R802J463p092j5545k3714l1286l7864m3167m7031m9284
$$ 1261513 1285984 1303485 1313287 1314750 1307658 1292113 1268399 1237113 1199249 1156082 1109051 1059767
62673A059767n0023m9767m9012m7725m5659m3028m0440l8142l5729l2693k9064
$$ 1059767 1009744 959977 910965 863240 817581 774553 734113 695971 660242 627549 598485
62662E98485k5440k2562k0743j9511j7949j5651j3230j1515j0485r435q050o756
$$ 598485 573045 550483 529740 510229 492280 476629 463399 451884 441399 431964 423914 417158
62650D17158n938n448n120n191n811o444o299n317m316m106m546m686l854k459
$$ 417158 411220 405772 400652 395461 389650 383206 376907 371590 367274 363168 358622 353936 350082 347623
62636C47623j542j475j451n39J030K086J932J033K59l2L9L41Q00J189J241R60
$$ 347623 346081 344606 343155 342616 343646 345732 347664 348697 348956 348924 348963 349304 350104 351293 352534 353494
62620C53494O79P44J169J566J544J207J115J529J978J953J756K168L344M724N989
$$ 353494 354173 354917 356086 357652 359196 360403 361518 363047 365025 366978 368734 370902 374246 378970 384959
62605C84959P415Q989J0019J0108R950J0522J1901J3498J5199J7455K0299K2997
$$ 384959 392374 401363 411382 421490 431440 441962 453863 467361 482560 500015 520314 543311
62593E43311K4950K6344K7621K8678K9022K8521K7541K6305K4458K1476J7284
$$ 543311 568261 594605 622226 650904 679926 708447 735988 762293 786751 808227 825511
62582H25511J2244O709R61m501r129j3040j7019k1413k5366k7712k8343k8077
$$ 825511 837755 844464 845425 840924 831795 818755 801736 780323 754957 727245 698902 670825
62570F70825k7427k6346k5053k4125k3530k2452k0561j8641j7387j6273j4390
$$ 670825 643398 617052 591999 567874 544344 521892 501331 482690 465303 449030 434640
62559D34640j1872r691q310p330o312n262m365l758l566l680l609k997k137j554
$$ 434640 422768 413077 404767 397437 391125 385863 381498 377740 374174 370494 366885 363888 361751 360197
62545C60197j244q63m26k25j86K4K86J77j34J20J168K253K597K311J956J711J417
$$ 360197 358953 358090 357664 357439 357253 357277 357563 357740 357606 357726 358894 361147 363744 366055 368011 369722 371139
62528C71139J118J092J538K476L845N478P145Q733J0276J1697J2796J3639J4711
$$ 371139 372257 373349 374887 377363 381208 386686 393831 402564 412840 424537 437333 450972 465683
62515D65683J6461J8810K1268K3406K5129K6602K7992K9170K9634K8853K6693
$$ 465683 482144 500954 522222 545628 570757 597359 625351 654521 684155 713008 739701
62504G39701K3454J9630J5789J2389R332N828J318l531p305r455j0847j2477j4220
$$ 739701 763155 782785 798574 810963 820295 826123 827441 823910 816605 807150 796303 783826 769606
62491G69606j5249j5239j4635j3903j2939j1157q005l608R87M568O957R157J2016
$$ 769606 754357 739118 724483 710580 697641 686484 678479 674871 675858 680426 687383 696540 708556
62478G08556J5206J7871J9821K1429K2584K2571K1096J8809J6522J4221J1160
$$ 708556 723762 741633 761454 782883 805467 828038 849134 867943 884465 898686 909846
62467I09846O802J468l956q802j3124j7370k1693k5726k9031l1448l2915l3377
$$ 909846 916648 918116 914160 905358 892234 874864 853171 827445 798414 766966 734051 700674
62455G00674l3054l2458l1707l0209k7486k4121k1187j8915j6565j3732j0976
$$ 700674 667620 635162 603455 573246 545760 521639 500452 481537 464972 451240 440264
62444D40264q873p061m837k273j92R19J351J593J757J756J694J790K039K172J956
$$ 440264 431391 424330 419493 417220 417028 417947 419298 420891 422648 424404 426098 427888 429927 432099 434055
62429D34055J434Q17K15n16j652l294n165o720p511p539p198o813o321n530m688
$$ 434055 435489 436306 436521 436005 434353 431059 425894 419174 411663 404124 396926 390113 383792 378262 373574
62414C73574m438m999n657n487m484l483k924k287j099K1L9j032k040k136j642
$$ 373574 369136 364137 358480 352993 348509 345026 342102 339815 338716 338737 338776 337744 335704 333568 331926
62399C31926j204p86N5J210K022K154J885J571J294J162J447K223L061L369K931
$$ 331926 330722 329936 329991 331201 333223 335377 337262 338833 340127 341289 342736 344959 348020 351389 354320
62384C54320K019J181R87J715L093M486N429N910O162O391O764P376Q156R090
$$ 354320 356339 357520 358507 360222 363315 367801 373230 379140 385302 391693 398457 405833 413989 423079
62370D23079J0462J2440J4402J5324J5145J5167J6638J9365K2304K5075K8094
$$ 423079 433541 445981 460383 475707 490852 506019 522657 542022 564326 589401 617495
62359F17495L1535L5005L8330M1942M6186N0714N4696N7326N8180N7443N5747
$$ 617495 649030 684035 722365 764307 810493 861207 915903 973229 1031409 1088852 1144599
62348A144599N3324M9452M3349L5469K7169J9109J0783J912o757j4510k1685k8878
$$ 1144599 1197923 1247375 1290724 1326193 1353362 1372471 1383254 1385166 1378409 1363899 1342214 1313336
62336A313336l5664m0963m4391m6482m7735m8109m7436m5719m2957l9150l4663
$$ 1313336 1277672 1236709 1192318 1145836 1098101 1049992 1002556 956837 913880 874730 840067
62325H40067l0273k6621k3728k1152j8524j6095j4630j4635j5670j6705j7241
$$ 840067 809794 783173 759445 738293 719769 703674 689044 674409 658739 642034 624793
62314F24793j7599j8036j8203j7812j7277j7083j6907j6031j4408j2681j1291
$$ 624793 607194 589158 570955 553143 535866 518783 501876 485845 471437 458756 447465
62303D47465j0140r096q246p545o677n461m090k929k232j962j629o33R76K263
$$ 447465 437325 428229 419983 412438 405761 400300 396210 393281 391049 389087 387458 386825 387801 390064
62289C90064K463J978J840K325K794K828K816L281M139M903N198M958M466M234
$$ 390064 392527 394505 396345 398670 401464 404292 407108 410389 414528 419431 424629 429587 434053 438287
62275D38287M493M862M912M909N415O347P124P726Q710J0073J1096J1732J3138
$$ 438287 442780 447642 452554 457463 462878 469225 476349 484075 492785 502858 513954 525686 538824
62262E38824J6181K0194K4009K7621L1899L6989M2031M6367N0216N4029N7733
$$ 538824 555005 575199 599208 626829 658728 695717 737748 784115 834331 888360 946093
62251I46093O0811O2612O2486O0094N5743N0183M3921L6858K8631J9127Q700j930
$$ 946093 1006904 1069516 1132002 1192096 1247839 1298022 1341943 1378801 1407432 1426559 1435259 1433329
62239A433329j2017k1147k9242l6270m2209m7307n1939n5954n8611n9492n9010
$$ 1433329 1421312 1400165 1370923 1334653 1292444 1245137 1193198 1137244 1078633 1019141 960131
62228I60131n7666n5320n1739m7409m3016l8515l3616k8904k5404k3016k0509
$$ 960131 902465 847145 795406 747997 704981 666466 632850 603946 578542 555526 535017
62217E35017j7353j4545j3108j2653j2095j1033r769q459p094n988n501n479n507
$$ 535017 517664 503119 490011 477358 465263 454230 444461 436002 428908 422920 417419 411940 406433
62204D06433n420n050l891j821J50P53J14l79R9R99J649K306L509N040O314P247
$$ 406433 401013 395963 392072 390251 390401 391154 391268 390889 390988 391987 393636 395942 399451 404491 410805 418052
62188D18052Q112Q826R135R334J0122J1611J3025J3546J3131J2387J1886J1709
$$ 418052 426164 434990 444125 453459 463581 475192 488217 501763 514894 527281 539167 550876
62176E50876J1564J1240J1017J1461J2742J4375J6014J8102K1345K5621L0027
$$ 550876 562440 573680 584697 596158 608900 623275 639289 657391 678736 704357 734384
62165G34384L4034L7887M1718M4949M7081M8555N0042N1116N0360M6883M1185
$$ 734384 768418 806305 848023 892972 940053 988608 1038650 1089766 1140126 1187009 1228194
62154A228194L4358K6978J9039J0595J936o728j5302k3429l0388l5621l9299m2201
$$ 1228194 1262552 1289530 1308569 1319164 1321100 1314372 1299070 1275641 1245253 1209632 1170333 1128132
62142A128132m4914m7211m8258m7477m5122m1951l8445l4579l0274k5802k1524
$$ 1128132 1083218 1036007 987749 940272 895150 853199 814754 780175 749901 724099 702575
62131G02575j7472j3524r901p112n326m079k790j361o6R70J848K606L133L383
$$ 702575 685103 671579 661678 654566 649240 645161 642371 641010 640944 641914 643762 646368 649501 652884
62117F52884L413L130K351J172Pq45j491k160k897l707m673n749o657p308p962
$$ 652884 656297 659427 661778 662950 662957 662112 660621 658461 655564 651857 647184 641435 634778 627470 619508
62102F19508q688r014q560p711p088o539n363l475j570k7J532L281M598M971M914
$$ 619508 610820 601806 593246 585535 578447 571908 566545 563070 561500 561473 563005 566286 570884 575855 580769
62087E80769N317O291P263P953Q595R310R945J0508J1249J2238J3272J4294J5522
$$ 580769 586086 592377 599640 607593 616188 625498 635443 645951 657200 669438 682710 697004 712526
62074G12526J7122J9004K0932K2598K3666K4160K4684K5810K7321K8538K9344
$$ 712526 729648 748652 769584 792182 815848 840008 864692 890502 917823 946361 975705
62063I75705L0296L1601L2636L2809L2374L1882L1228K9705K6863K2800J7784
$$ 975705 1006001 1037602 1070238 1103047 1135421 1167303 1198531 1228236 1255099 1277899 1295683
62052A295683J1971N582j032p538j3667j9089k3549k7210l0632l4262l7968m1269
$$ 1295683 1307654 1313236 1312204 1304666 1290999 1271910 1248361 1221151 1190519 1156257 1118289 1077020
62040A077020m3827m5536m6198m5511m3567m1084l8754l6437l3480k9799k6187
$$ 1077020 1033193 987657 941459 895948 852381 811297 772543 736106 702626 672827 646640
62029F46640k3293k0864j8392j6051j4388j3322j2189j0673r116p909p153o968
$$ 646640 623347 602483 584091 568040 553652 540330 528141 517468 508352 500443 493290 486322
62017D86322p394p870p548o406n424n262n357m848l772k754j930r20L56J559K561
$$ 486322 478928 471058 463510 457104 451680 446418 441061 436213 432441 429687 427757 426837 427193 428752 431313
62002D31313L587M756N941P046P916Q084P168N562M171L343K610J491O7j413k906
$$ 431313 434900 439656 445597 452643 460559 468643 475811 481373 485544 488887 491497 492988 493055 491642 488736
61987D88736m280n225n828o679p978q972q887q024p316o996o513n682n117n259
$$ 488736 484456 479231 473403 466724 458746 449774 440887 432863 425547 418551 412038 406356 401239 395980
61973C95980n668n678n335n111m996m486l384k150j386j261j561j922j981j559
$$ 395980 390312 384634 379299 374188 369192 364706 361322 359172 357786 356525 354964 353042 351061 349502
61959C49502r51p26r94j060k02J306K356K311J762J777K617L612M158M498N267
$$ 349502 348551 347825 346831 345771 345569 346875 349231 351542 353304 355081 357698 361310 365468 369966 375233
61944C75233O639Q171R372J0181J0886J1766J2915J4228J5495J6577J7472J8149
$$ 375233 381872 390043 399415 409596 420482 432248 445163 459391 474886 491463 508935 527084
61932E27084J8417J8133J7512J6894J6208J5085J3585J2286J1348J0063P859N322
$$ 527084 545501 563634 581146 598040 614248 629333 642918 655204 666552 676615 684474 689796
61920F89796L410J941j33k911n045n474m793m267m161l766k587p43J551M125O615
$$ 689796 693206 695147 695014 692103 687058 681584 676791 672524 668363 664597 662010 661267 662818 666943 673558
61905F73558Q693J0424J1924J2878J2914J2219J1070R096N839J902j466l983o559
$$ 673558 682251 692675 704599 717477 730391 742610 753680 762776 768615 770517 769051 765068 758509
61892G58509r652j2408j3945j4645j5478j6618j7417j7414j6745j5772j4840j4133
$$ 758509 748857 736449 722504 707859 692381 675763 658346 640932 624187 608415 593575 579442
61880E79442j3480j2472j1095r897r246q813q172p457o908o225m991l449k179
$$ 579442 565962 553490 542395 532498 523252 514439 506267 498810 491902 485677 480686 477237 475058
61867D75058j221j85R04J617J981K638L962N549O818P675Q414R314J0577J2275
$$ 475058 473837 473652 474556 476173 478154 480792 484754 490303 497121 504796 513210 522524 533101 545376
61853E45376J4226J6151J8063K0275K2830K5258K7011K7979K8350K8177K7302
$$ 545376 559602 575753 593816 614091 636921 662179 689190 717169 745519 773696 800998
61842H00998K5592K3160K0342J7528J4850J2015Q539M203o74n394r250j1856j3257
$$ 800998 826590 849750 870092 887620 902470 914485 923024 927227 926553 921159 911909 900053 886796
61829H86796j3687j3261j1893r547o413k771J124M874P903R764J0396R970Q724
$$ 886796 873109 859848 847955 838408 831995 829224 830348 835222 843125 852889 863285 873255 881979
61816H81979O926M706J709k611q074j3554j8123k1988k5743k9024l0745l0614
$$ 881979 888905 893611 895320 892709 884635 871081 852958 830970 805227 776203 745458 714844
61804G14844k9645k8953k8589k7856k6272k3946k1281j8631j6114j3665j1344
$$ 714844 685199 656246 627657 599801 573529 549583 528302 509671 493557 479892 468548
61793D68548r489q319p472o338m849l514k671k188j948k077k457k461j627k96
$$ 468548 459059 450740 443268 436930 432081 428567 425896 423708 421760 419683 417226 414765 413138 412842
61779D12842P40J110J133J306J727K037J856J304R12R46R99O26J07O4M08L92j63
$$ 412842 413582 414692 415825 417131 418858 420895 422751 424055 424967 425913 426912 427538 427645 427709 428117 428509 428346
61762D28346m52J33J025J250P70L90N07O57L68l7J39J039K021K380K140J862J800
$$ 428346 427894 428027 429052 430302 431072 431462 431969 432626 432994 432957 433096 434135 436156 438536 440676 442538 444338
61745D44338J512N76o38j371j497j610k070k480k347j794j305j140j290j650j934
$$ 444338 445850 446426 445788 444417 442920 441310 439240 436760 434413 432619 431314 430174 428884 427234 425300
61730D25300j672o77N38J169Q82R7m57l62J47M87M73O42J496K576K866K184J484
$$ 425300 423628 422951 423489 424658 425540 425637 425180 424818 424965 425452 425925 426567 428063 430639 433505 435689 437173
61713D37173J544K004K066J547P15l88j738k778k852k119j511j725k623l584m107
$$ 437173 438717 440721 442787 444334 445049 444661 442923 440145 437293 435174 433663 431938 429315 425731 421624
61698D21624m147m100m378m767m544l472k339k062k544k990l002k826k659k403
$$ 421624 417477 413377 408999 404232 399688 396216 393877 391815 389271 386281 383279 380453 377794 375391
61684C75391k106k074k365k602k377j618n91K02K91k26o22l74J75M04L54M91P89
$$ 375391 373285 371211 368846 366244 363867 362249 361658 361860 362151 361925 361303 360929 361104 361508 361862 362353 363142
61667C63142Q09N14K24j70r95j777j420J78J643J754Q94K91L92O33M33k17r27
$$ 363142 363951 364465 364689 364519 363524 361747 360327 360505 362148 363902 364796 365087 365479 366112 366545 366328 365401
61650C65401j170n74O60J796K314K401K472K567K566K646K965L260L202K955K841
$$ 365401 364231 363657 364317 366113 368427 370828 373300 375867 378433 381079 384044 387304 390506 393461 396302
61635C96302K632J803M56o05q35n76n90j269k378l256l288k525j884k277l443
$$ 396302 398934 400737 401193 400588 399753 399177 398587 397318 394940 391684 388396 385871 383987 381710 378267
61620C78267m080l383k096j538j924k141j290J48R30N21m67j183j458j731k377
$$ 378267 374187 370804 368708 367170 365246 363105 361815 361963 362893 363414 362947 361764 360306 358575 356198
61605C56198l281l952l999l592l441m071n071n432m788l903l645l865l823l368
$$ 356198 352917 348965 344966 341374 337933 333862 328791 323359 318571 314668 311023 307158 303335 299967
61591B99967l012k972k840k382k063k431l357m112m034l024j660p81p25r64r38
$$ 299967 296955 293983 291143 288761 286698 284267 280910 276798 272764 269740 268080 267299 266574 265610 264672
61576B64672r56j750l144l978l511k267j180o31n62q63j180r56k30J48l91j264
$$ 264672 263716 261966 258822 254844 251333 249066 247886 247255 246693 245830 244650 243694 243464 243612 243221 241957
61560B41957j520j028l54R2J85j54o84o98J10R97J099O71O27J130J517J473J336
$$ 241957 240437 239409 239055 239147 239332 239178 238494 237796 237906 238903 240002 240673 241300 242430 243947 245420 246756
61543B46756J296J170J046J293J825K093J917J668J481J112O43N58Q19P10r1r20
$$ 246756 248052 249222 250268 251561 253386 255479 257396 259064 260545 261657 262300 262858 263677 264387 264296 263376
61527B63376j034n30K9L28K90r4n89p94p52r50j501j885j818j724j927k018j564
$$ 263376 262342 261812 261841 262169 262459 262365 261776 260982 260230 259280 257779 255894 254076 252352 250425 248407 246843
61510B46843q93n43m52k37J11M50Q80J367J303K83r65j267n14K01k2r34j664j682
$$ 246843 245950 245407 244955 244718 244829 245279 246159 247526 248829 249112 248147 246880 246366 246567 246545 245611 243947 242265
61492B42265j184q07j052j726k058j598p59j75J57O18J185J498J529J539J481
$$ 242265 241081 240274 239222 237496 235438 233840 233081 232906 233063 233681 234866 236364 237893 239432 240913
61477B40913J105O47O82J207J517J216P98R41J599K132K044J307K62o43j086j048
$$ 240913 242018 242665 243347 244554 246071 247287 248085 249026 250625 252757 254801 256108 256370 255727 254641 253593
61461B53593p00k11K12K80p9m43l56L6J82J7J21Q53J791K240K038J549J080O15
$$ 253593 252893 252682 252894 253174 253095 252652 252296 252332 252514 252531 252652 253505 255296 257536 259574 261123 262203 262818
61443B62818M2n13p38n25j92j20j39L27J353K188K200J768J732K275K927L408
$$ 262818 262860 262347 261609 261084 260892 260772 260633 260960 262313 264501 266701 268469 270201 272476 275403 278811
61427B78811L773L829L168J924Q14L07K17K40L32N04P14J101J795K425K401J765
$$ 278811 282584 286413 289581 291505 292319 292626 292843 293083 293415 293919 294633 295734 297529 299954 302355 304120
61411C04120J211J140J283J319J214Q29n1j088j557j371j209j394j454j217j274
$$ 304120 305331 306471 307754 309073 310287 311116 311065 309977 308420 307049 305840 304446 302992 301775 300501
61396C00501j819j948j063o8k04j231j903j776j490j391j058l09L39M13R5j94
$$ 300501 298682 296734 295671 295603 295399 294168 292265 290489 288999 287608 286550 286241 286580 286993 287088 286894
61380B86894k75j89m0O5J91N79J113J199N87N1M80J601K334K259J941J790J584
$$ 286894 286619 286430 286390 286455 286646 287225 288338 289537 290124 290175 290655 292256 294590 296849 298790 300580 302164
61363C02164J228J173J670K291K554K569K657K767K657K403K400K940L916M873
$$ 302164 303392 304565 306235 308526 311080 313649 316306 319073 321730 324133 326533 329473 333389 338262
61349C38262N386N590O046O929P571P320O460N740N294M821M527M883N432N091
$$ 338262 343648 349238 355284 362213 369784 377104 383564 389304 394598 399419 403946 408829 414261 419352
61335D19352L869L150L690M401L879K301Q71J9p21j438j611j214j079j780k789
$$ 419352 423221 426371 430061 434462 438341 440642 441513 441532 440811 439373 437762 436548 435469 433689 430900
61320D30900l087k295r24K39P04M26l02r44q71L10K293M129N029N167N432O325
$$ 430900 427813 425518 424594 424833 425537 425963 425661 424717 423846 424156 426449 430578 435607 440774 446206 452531
61304D52531P500Q414R006R482R866J0037R994R733R065P852O228M383K312J2
$$ 452531 460031 468445 477451 486933 496799 506836 516830 526563 535628 543480 549708 554091 556403 556415
61290E56415k274m202n646o643p196p337p178o851o409n967n664n430n041m424
$$ 556415 554141 549939 544293 537650 530454 523117 515939 509088 502679 496712 491048 485618 480577 476153
61276D76153l687k854j938j239j030r33k02J144K244K663L013L801M518M586M510
$$ 476153 472466 469612 467674 466435 465405 464472 464270 465414 467658 470321 473334 477135 481653 486239 490749
61261D90749N098N995O118N353M757N053N888O690P337P694P403O506N622N064
$$ 490749 495847 501842 507960 513313 518070 523123 529011 535701 543038 550732 558135 564641 570263 575327
61247E75327M344L048J621P84N36L14k05r21j795k921m163n168n779o166o447
$$ 575327 579671 582719 584340 585124 585660 585974 585769 584848 583053 580132 575969 570801 565022 558856 552409
61232E52409o403n744m534l238k368k092k130k016j410k12J386K922L949M521
$$ 552409 546006 540262 535728 532490 530122 528030 525900 523884 522474 522262 523648 526570 530519 535040
61218E35040N186O209P031O905N953N115M969N153N111M861M705M590M286L893
$$ 535040 540226 546435 553466 560371 566324 571439 576408 581561 586672 591533 596238 600828 605114 609007
61204F09007L679L526L102K566K534L244M182M847N461O549Q110R719J1275J3055
$$ 609007 612686 616212 619314 621880 624414 627658 631840 636687 642148 648697 656807 666526 677801 690856
61190F90856J4961J6266J6432J5705J4598J3168J1345R620Q686Q310P382N350
$$ 690856 705817 722083 738515 754220 768818 781986 793331 802951 811637 819947 827329 832679
61178H32679L082J802J583J378M17r79j958k260k526l597n474p189p878p841q018
$$ 832679 835761 837563 839146 840524 840941 839962 838004 835744 833218 829621 824147 816958 809080 801239 793221
61163G93221q635r070r204r907j1583j3122j3329j2753j2938j4034j4534j3514
$$ 793221 784586 775516 766312 756405 744822 731700 718371 705618 692680 678646 664112 650598
61151F50598j1859j0806j0317r664q771q051p443o542n458m781m714m913n126
$$ 650598 638739 627933 617616 607952 599181 591130 583687 577145 571687 566906 562192 557279 552153
61138E52153n432n800o020o134o440o872o815n811m139k422r47M23J789K992L874
$$ 552153 546721 540921 534901 528767 522327 515455 508640 502829 498690 496268 495321 495744 497533 500525 504399
61123E04399M600N603P149Q960J0419J1350J2464J4623J7649K0346K1939K3048
$$ 504399 508999 514602 521751 530711 541130 552480 564944 579567 597216 617562 639501 662549
61111F62549K4717K6750K7829K7370K6469K6565K7573K8045K6959K4832K2853
$$ 662549 687266 714016 741845 769215 795684 822249 849822 877867 904826 929658 952511
61100I52511K1426J9864J7303J3743J0019O831L901L66l962q152j1242j3412j5553
$$ 952511 973937 993801 1011104 1024847 1034866 1041697 1045598 1045964 1042002 1033850 1022608 1009196 993643
61087I93643j7956k0185k2005k3572k4671k4712k3896k3482k4182k5092k4863
$$ 993643 975687 955502 933497 909925 885254 860542 836646 813164 788982 763890 739027
61076G39027k3451k1806k0322j8604j6583j4823j3607j2535j1231r787q331o793
$$ 739027 715576 693770 673448 654844 638261 623438 609831 597296 586065 576278 567947 561154
61064E61154n305m222l527k772j861j233r55k75J360L323M571N101N892P375Q773
$$ 561154 555849 551627 548100 545328 543467 542234 541279 541004 542364 545687 550258 555359 561251 568626 577399
61049E77399R191Q855Q810R619J0895J2127J3447J5339J7820K0385K2647K4650
$$ 577399 586590 595445 604255 613874 624769 636896 650343 665682 683502 703887 726534 751184
61037G51184K6568K8499L0630L3140L5795L8048L9713M1118M2407M3284M3802
$$ 751184 777752 806251 836881 870021 905816 943864 983577 1024695 1067102 1110386 1154188
61026A154188M4721M6540M8761N0821N3203N6747O1334O6290P1906P9488Q9956
$$ 1154188 1198909 1245449 1294210 1345031 1398234 1454981 1516315 1582605 1654511 1733999 1823955
61015A823955J03497J20743J43433J73733K13661K65163L29815M08439N01749
$$ 1823955 1927452 2048195 2191628 2365361 2579022 2844185 3174000 3582439 4084188
61006D084188O10776P34828Q68446J000942J117935J201727J233691J205065J130016
$$ 4084188 4694964 5429792 6298238 7299180 8417115 9618842 10852533 12057598 13187614
60997A3187614J041154R61084Q76709P50248N61457L34861J19796n2779j86371
$$ 13187614 14228768 15189852 16066561 16816809 17378266 17713127 17832923 17780144 17593773
60988A7593773k95494l81300m41116m95374n88075p50287r65219j173988j315396
$$ 17593773 17298279 16916979 16475863 15980489 15392414 14642127 13676908 12502920 11187524
60979A1187524j360108j314520j204163j058110r01647p52782o20540n07157m12530
$$ 11187524 9827416 8512896 7308733 6250623 5348976 4596194 3975654 3468497 3055967
60970C055967l36289k76776k30509j93747j63962j39773j20368j05232r3610q4035
$$ 3055967 2719678 2442902 2212393 2018646 1854684 1714911 1594543 1489311 1395701 1311666
60960A311666p5018o6269n8554n2228m6690m1393l6544l2439k8842k5538k2917
$$ 1311666 1236648 1170379 1111825 1059597 1012907 971514 934970 902531 873689 848151 825234
60949H25234k1441k0796k0073j8760j7162j5874j5001j3986j2220r845p834p004
$$ 825234 803793 782997 762924 744164 727002 711128 696127 682141 669921 660076 652242 645238
60937F45238p111p174o682o084o100o927q248r683j0923j1644j1595j0845r813
$$ 645238 638127 630953 624271 618187 612087 605160 596912 587229 576306 564662 553067 542222 532409
60924E32409q984q540q272p889p389o931o465n756m790l846l041k195j288o48
$$ 532409 523425 514885 506613 498724 491335 484404 477939 472183 467393 463547 460506 458311 457023 456375
60910D56375m86n96p64j001j185r81m53j87l26j89N40R96L80n87n80L35Q55M08
$$ 456375 455889 455293 454529 453528 452343 451362 450909 450722 450396 450207 450747 451743 452123 451536 450956 451291 452146 452554
60892D52554k81o29r22j364j580j535j895k937l906m126l922l843l751l333k932
$$ 452554 452273 451644 450722 449358 447778 446243 444348 441411 437505 433379 429457 425614 421863 418530 415598
60877D15598l062l547l808l636l072j994m80Q10J310J378J836K874M096N302O505
$$ 415598 412536 408989 405181 401545 398473 396479 395999 396809 398119 399497 401333 404207 408303 413605 420110
60862D20110P342P335O784O605P036P211O386N091M492M897N418N164M328L795
$$ 420110 427452 434787 441571 448176 455212 462423 468809 473900 478392 483289 488707 493871 498199 501994
60848E01994L919M155L961L593L592L824L653L030K627K741K719J862M00q21j276
$$ 501994 505913 510068 514029 517622 521214 525038 528691 531721 534348 537089 539808 541670 542070 541249 539973
60833E39973r52o8R59J624J915K502L803N268O126O603P618R511J1760J3939J6208
$$ 539973 539021 538953 539912 541536 543451 545953 549756 555024 561150 567753 575371 584882 596642 610581 626789
60818F26789J8721K1117K2918K3964K4447K4858K5908K7896L0044L1052L0497
$$ 626789 645510 666627 689545 713509 737956 762814 788722 816618 846662 877714 908211
60807I08211K9215K8106K7106K5655K3500K0601J6697J1677O099P53m160q947
$$ 908211 937426 965532 992638 1018293 1041793 1062394 1079091 1090768 1096867 1097620 1093460 1084513
60795A084513j3595j7630k0770k3258k5440k7299k8579k9046k8607k7489k6306
$$ 1084513 1070918 1053288 1032518 1009260 983820 956521 927942 898896 870289 842800 816494
60784H16494k5631k5333k4704k3345k1585j9851j8104j6229j4578j3559j2940
$$ 816494 790863 765530 740826 717481 695896 676045 657941 641712 627134 613575 600635
60773F00635j2145j1146j0463j0203r757q656p258o264n952o199o808p454p677
$$ 600635 588490 577344 566881 556678 546921 538265 531007 524743 518791 512592 505784 498330 490653
60760D90653p423p276p695q271q271p728p357p441p512p188o743o481o184n510
$$ 490653 483230 475954 468259 459988 451717 443989 436632 429191 421679 414491 407748 401267 395083 389573
60746C89573m673m192m147m017l325k189j239r84j341j764j881j815j840j999
$$ 389573 384900 380708 376561 372544 369219 367030 365791 364807 363466 361702 359821 358006 356166 354167
60732C54167k290k923l919m624m163k439k72J450K336K354J707R54O64P76P53
$$ 354167 351877 348954 345035 340411 336248 333809 333537 334987 337323 339677 341384 342338 343002 343778 344531
60717C44531M50K56L28L71K85K83J53p15k153l017k758k373k857l587l313k249
$$ 344531 344981 345237 345565 345936 346221 346504 346657 345942 343789 340772 338014 335641 332784 329197 325884 323635
60701C23635j830k611l596l761l245k706k463k550k929l198k778j670n82m6J51
$$ 323635 321805 319194 315598 311837 308592 305886 303423 300873 297944 294746 291968 290298 289716 289670 289821
60686B89821M06O90Q01P66O98N76N19Q41J591K268K359J967J600J572J795K066
$$ 289821 290227 290917 291718 292484 293182 293758 294277 295118 296709 298977 301336 303303 304903 306475 308270 310336
60670C10336K308K546K738K689K211J443Q36N83L19k57p35m69M44J311J832K278
$$ 310336 312644 315190 317928 320617 322828 324271 325107 325690 326009 325752 325017 324548 324992 326303 328135 330413
60654C30413K626K436J869J910L040M365M808M554M592N160N571N363M809M185
$$ 330413 333039 335475 337344 339254 342294 346659 351467 356021 360613 365773 371344 376707 381516 385701
60640C85701L262J857L29p80j273j310j199j374k216l600m787n146m850m594m591
$$ 385701 388963 390820 391149 390369 389096 387786 386587 385213 382997 379397 374610 369464 364614 360020 355429
60625C55429m272l181j873j420k056k775k545j520o30l56m43o93j274k072k458
$$ 355429 351157 347976 346103 344683 342627 339852 337307 335787 335157 334801 334358 333665 332391 330319 327861
60610C27861k003j028j25N01Q26O85N4n99p61m97j99K7L03N07M21K25L14O73Q65
$$ 327861 325858 324830 324705 325206 326032 326717 326771 326172 325411 324914 324715 324742 325045 325552 325973 326198 326512 327185 328050
60591C28050P05M30J58l23j035j524j386p88j71K82O41Q48P45M49M64J196K467
$$ 328050 328755 329185 329343 329020 327985 326461 325075 324287 324116 324398 325039 325887 326632 327081 327545 328741 331208
60574C31208L656M338M695N178N908O658P351Q174R054R449Q961P913O848N704
$$ 331208 334864 339202 343897 349075 354983 361641 368992 377166 386220 395669 404630 412543 419391 425095
60560D25095M003J801j58j351k141l199m536n381n024l598k056j270j151p64N16
$$ 425095 429098 430899 430741 429390 427249 424050 419514 414133 409109 405511 403455 402185 401034 400270 400786
60545D00786K220L436M026M706N949P301P995P861P426P317P710Q127P759O214
$$ 400786 403006 406442 410468 415174 421123 428424 436419 444280 451706 459023 466733 474860 482619 488833
60531D88833L986J975N11p40k019l123l844m273m358l769k531j358r25j095j335
$$ 488833 492819 494794 495305 494565 492546 489423 485579 481306 476948 473179 470648 469290 468365 467270 465935
60516D65935j480j710j918j685q27M18J630K440K685K702L230M728O890R138J1344
$$ 465935 464455 462745 460827 459142 458315 458733 460363 462803 465488 468190 471420 476148 483038 492176 503520
60501E03520J3700J6159J8545K1006K3826K6817K9407L1248L2233L2033L0224
$$ 503520 517220 533379 551924 572930 596756 623573 652980 684228 716461 748494 778718
60490G78718K6959K2872J8211J2586N776j734r267j6478k3046k8327l1765l3498
$$ 778718 805677 828549 846760 859346 865122 863388 854121 837643 814597 786270 754505 721007
60478G21007l4174l4266l3714l2133k9339k5798k2504k0090j8151j5864j3240
$$ 721007 686833 652567 618853 586720 557381 531583 509079 488989 470838 454974 441734
60467D41734j1158j0067r289p993o230m631l552k990k887k990k862k445k310k793
$$ 441734 430576 420509 411220 403227 396997 392366 388814 385824 382937 379947 377085 374640 372330 369537
60453C69537l282l050k355j992k038j954j746k021k720k885k079j219j305k034
$$ 369537 366255 363205 360850 358858 356820 354866 353120 351099 348379 345494 343415 342196 340891 338857
60439C38857k345j905j288q42k84N26J094R32K95j48k11l20p91j346j459j035
$$ 338857 336512 334607 333319 332477 332193 332719 333813 334745 335040 334892 334681 334361 333570 332224 330765 329730
60423C29730m53m5K75P47J354J739J563R03L36M57J233J896J777J068N27N01P13
$$ 329730 329277 329232 329507 330254 331608 333347 334910 335813 336149 336606 337839 339735 341512 342580 343107 343608 344321
60406C44321R81J519K290K620K010R11K58L68P85R58P41L09J7K05Q03J357J593
$$ 344321 345302 346821 349111 351731 353741 354652 354910 355278 356063 357021 357762 358071 358088 358293 359096 360453 362046
60389C62046J713J809J460N06k70M0J137J855J738J519J922K698L065K589J458
$$ 362046 363759 365568 367028 367534 367264 367304 368441 370296 372034 373553 375475 378173 381238 383827 385285
60374C85285L91K21J071J949J753P02K4K86Q70J172J385J703J744J316J017J424
$$ 385285 385676 385897 386968 388917 390670 391372 391396 391682 392552 393724 395109 396812 398556 399872 400889 402313
60358D02313K195K626K640K752L324M352N526O281O254N973O470P791Q583P787
$$ 402313 404508 407134 409774 412526 415850 420202 425728 432009 438263 444236 450706 458497 467080 474867
60344D74867O003M520L584K550J190j31j292k513l752m802n794o823p349o760
$$ 474867 480870 485390 488974 491524 492714 492583 491291 488778 485026 480224 474430 467607 460258 453498
60330D53498n441m368l738k934j837j171j328j748j795j504j121o17k4K91J34
$$ 453498 448057 443689 439951 437017 435180 434009 432681 430933 429138 427634 426513 425896 425872 426163 426297
60315D26297k37n85r81j243p45Q03K754M282N399O671Q185R400J0016J0439J1170
$$ 426297 426060 425475 424494 423251 422506 423309 426063 430345 435744 442415 450600 460000 470016 480455 491625
60300D91625J2061J2410J1705R998P668N062K474J57k017m637p965j1037j2376
$$ 491625 503686 516096 527801 537799 545467 550529 553003 553160 551143 546506 538541 527504 515128
60287E15128j1797j0772j0500j0369r140o977n222m442l940l166k393j844j220
$$ 515128 503331 492559 482059 471690 462550 455573 450351 445909 441969 438803 436410 434566 433346
60274D33346n97o76j606k407k284j741j677k057k326k596l298m029l827k665j705
$$ 433346 432749 432073 430467 428060 425776 424035 422358 420301 417975 415379 412081 408052 404225 401560 399855
60259C99855j809k548l044l096k984k617j664l80L55J9q01j055l86N77J070R98
$$ 399855 398046 395498 392454 389358 386374 383757 382093 381713 382068 382087 381286 380231 379845 380422 381492 382490
60243C82490P76O71O25N60N61P12R05R08N38j57p96r38n59j19J9J9K15N79Q78
$$ 382490 383266 383937 384562 385122 385683 386395 387300 388208 388746 388589 387793 386855 386296 386177 386196 386215 386430 387009 387887
60224C87887J151J605K175K543K533K201J702J363J643K609L663M270M670N238
$$ 387887 389038 390643 392818 395361 397894 400095 401797 403160 404803 407412 411075 415345 420015 425253
60210D25253N542M900L761L475M514N814O241N914N666N867O277O532O379N857
$$ 425253 430795 435695 439456 442931 447445 453259 459500 465414 471080 476947 483224 489756 496135 501992
60196E01992N488N760O257N924M515L028K244J693O25p00j538j879k260k700k710
$$ 501992 507480 513240 519497 525421 529936 532964 535208 536901 537526 536826 535288 533409 531149 528449 525739
60181E25739k318k267l113m610o078o986p232p130p088p108o810o045n121m240
$$ 525739 523421 521154 518041 513431 507353 500367 493135 486005 478917 471809 464999 458954 453833 449593
60167D49593l193j949j012p42p65n55j70O3J33J00j97o30n20L55J053O73k20l79
$$ 449593 446400 444451 443439 442697 441932 441377 441207 441270 441403 441503 441306 440676 440156 440511 441564 442237 442017 441638
60149D41638L27R49J107J370J946K219J946J869K635L877M872N476N968O475O912
$$ 441638 441965 442914 444021 445391 447337 449556 451502 453371 456006 459883 464755 470231 476199 482674 489586
60134D89586P113O774N725M442L825M141M706M780M368L801L116K195J231N91
$$ 489586 496699 503473 509198 513640 517465 521606 526312 531092 535460 539261 542377 544572 545803 546394
60120E46394M36P16J303J979K461K631K553K296J924J626J516J324P71J26r1j4
$$ 546394 546830 547546 548849 550828 553289 555920 558473 560769 562693 564319 565835 567159 567930 568056 567965 567951
60104E67951l60j327k201k330j903j471j276j414k152l509m859n483n301m728
$$ 567951 567591 566264 564063 561733 559830 558359 557083 555669 553517 550008 545149 539666 534365 529637
60090E29637m049l252k329j386n66n4O1R1O01J669K663L022L031L377M144M597
$$ 529637 525588 522336 520007 518621 518055 518001 518062 518153 518754 520423 523086 526108 529139 532516 536660 541257
60074E41257L965K298N06l87k69k01j317l479n408o302o676p369q359r040r186
$$ 541257 545222 547520 548026 547639 547370 547169 545852 542373 536965 530663 523987 516618 508259 499219 490033
60059D90033q951q322p221n968n029m362l629k906k537k331j625l38P41R94Q22
$$ 490033 481082 472760 465539 459571 454542 450180 446551 443645 441108 438777 437152 436814 437555 438549 439371
60044D39371J047J859K823L591M170M542M592M453M585N232N977O084N306M135
$$ 439371 440418 442277 445100 448691 452861 457403 461995 466448 471033 476265 482242 488326 493632 497767
60030D97767L240K828K570K067J161m5j387k810m419o261p991q978q965q462q166
$$ 497767 501007 503835 506405 508472 509633 509588 508201 505391 500972 494711 486720 477742 468777 460315 452149
60015D52149q149p967p442o843o298n643m969m673m709m293k941j316m45l84k73
$$ 452149 444000 436033 428591 421748 415450 409807 404838 400165 395456 391163 388222 386906 386461 386077 385804
60000C85804L33Q99Q06K19k39l58m34o05m21O39K313L554L585K782K198K268K506
$$ 385804 386137 387036 387842 388061 387822 387464 387030 386425 386004 386643 388956 392510 396095 398877 401075 403343 405849
59983D05849K500K556K990L352L025K268J863J879J550N27m82o79k37Q7K4j06
$$ 405849 408349 410905 413895 417247 420272 422540 424403 426282 427832 428359 427877 427198 426961 427048 427072 426966
59967D26966j64n06j374k323k557j734k99R44J482J368J027Q95J149J654K079
$$ 426966 426802 426296 424922 422599 420042 418308 418009 418953 420435 421803 422830 423725 424874 426528 428607
59952D28607K155J850J337Q00L04j56o00j045j480j784j773j382q03l63l11o81
$$ 428607 430762 432612 433949 434749 435053 434897 434297 433252 431772 429988 428215 426833 426030 425667 425356 424675
59936D24675j332k087k809l327l406k993k473k359k591k489j679p41m94q87j149
$$ 424675 423343 421256 418447 415120 411714 408721 406248 403889 401298 398809 397130 396389 395895 395008 393859
59921C93859q72l55P7M30O76P30R38J832L153L938L882L838M413M975M838M645
$$ 393859 392987 392632 392709 393139 393815 394545 395483 397315 400468 404406 408288 412126 416539 421514 426352 430997
59905D30997N388O533O503N010L579L425L901L725K810K028J673J103j01j392
$$ 430997 436385 442918 449421 454431 458010 461435 465336 469061 471871 473899 475572 476675 476574 475182
59891D75182j881j369m68J53M70R40J804K727L258L371L382L472L601L740L902
$$ 475182 473301 471932 471464 471617 472087 473027 474831 477558 480816 484187 487569 491041 494642 498382 502284
59876E02284L973L869L783L933M036L489K175P20k79j007k148l952n744o467n710
$$ 502284 506257 510126 513909 517842 521878 525367 527542 528262 527983 526976 524828 520876 515132 508665 502955
59861E02955m232l190k818k137l53J850K994K629J822J736K394L018L121K866
$$ 502955 498723 495533 492715 490578 490225 492075 495069 497698 499520 501256 503650 506668 509789 512655
59847E12655K666K750K931K705J790N70l65j057k050l365m249m239l833l739l993
$$ 512655 515321 518071 521002 523707 525497 526067 525702 524645 522595 519230 514981 510742 506909 503170 499177
59832D99177m308m756n429n795n182l803k611k073j713r74l2M79J99o83j709k496
$$ 499177 494869 490113 484684 478889 473707 469904 467293 465220 463507 462533 462501 462980 463179 462496 460787 458291
59816D58291k937l131l184l109k910k627k174j408m92J13K21J72L11M64L50Q8
$$ 458291 455354 452223 449039 445930 443020 440393 438219 436811 436319 436432 436653 436825 437136 437600 437950 438038
59800D38038p1k53o54j007j047j233k206l601m236l701k961l046l825m506m710
$$ 438038 437967 437714 437060 436053 435006 433773 431567 427966 423730 420029 417068 414022 410197 405691 400981
59785D00981m525m024l305k740k584k593k435k222k170k014j379m88O2J90L30
$$ 400981 396456 392432 389127 386387 383803 381210 378775 376553 374383 372369 370990 370502 370564 370754 371084
59770C71084O43P92O26M41L98L10K14O06J642K615K748K209J762J628J328O82
$$ 371084 371727 372519 373145 373586 373984 374294 374508 375114 376756 379371 382119 384328 386090 387718 389046 389728
59754C89728L06Q57K166L447M094M054L615L151K965L120L333L328L227L418L955
$$ 389728 390034 390891 393057 396504 400598 404652 408267 411418 414383 417503 420836 424164 427391 430809 434764
59739D34764M402M366L975L560L066K139P85m24r27p39k74J39L95L96M9n80j280
$$ 434764 439166 443532 447507 451067 454133 456272 457057 456633 455706 454967 454693 454832 455227 455623 455672 455092 453812
59722D53812j898k306k257j550l83O99J331J575J565J175L47m85p25l53J3n8k82
$$ 453812 451914 449608 447351 445801 445418 446117 447448 449023 450588 451763 452110 451625 450900 450547 450560 450502 450220
59705D50220j61K64N61O22P79J088J026K32p73j097n70J39N02P36J249J954K421
$$ 450220 450059 450323 450884 451506 452285 453373 454399 454631 453858 452761 452191 452330 452832 453568 454817 456771 459192
59688D59192K408J882Q68m11j400j694j496j191p21J47J076J382J090R70J328
$$ 459192 461600 463482 464350 463939 462539 460845 459349 458158 457437 457584 458660 460042 461132 462102 463430
59673D63430J380L75j211k219k222j830j813k389l295m098m390m106l588l092
$$ 463430 464810 465185 463974 461755 459533 457703 455890 453501 450206 446108 441718 437612 434024 430932
59659D30932k388j179J96R83R32N77N93J151J973K598K657K282K141K655L258
$$ 430932 428544 427365 427561 428544 429476 430053 430646 431797 433770 436368 439025 441307 443448 446103 449361
59644D49361L001J864Q16M18J57m82j068r68m69l52p06q83n40K4N22R33J096O93
$$ 449361 452362 454226 455042 455460 455617 455135 454067 453099 452630 452278 451572 450689 450149 450173 450695 451628 452724 453417
59626D53417q3m17J54J101J570J350Q15J89o53j721k674l163l159k897k630k517
$$ 453417 453334 452917 453071 454172 455742 457092 457907 458096 457443 455722 453048 449885 446726 443829 441199 438682
59610D38682k547k524k206j559p56K0O31Q71N54j10n60m53j02J9n4P6L94M35Q8
$$ 438682 436135 433611 431405 429846 429090 429110 429741 430612 431166 431056 430496 430043 429941 429960 429906 429982 430376 430811 430899
59591D30899j68n8l6m96r41o20K75P86M78j91q09j508k293k662k362j893j774
$$ 430899 430731 430673 430637 430141 429200 428580 428855 429641 430119 429928 429119 427611 425318 422656 420294 418401 416627
59574D16627j760j405r60j026j517j657j024q4L54q5j079j754j322O7J213J074
$$ 416627 414867 413462 412502 411476 409959 408302 407278 407194 407548 407463 406384 404630 403308 403375 404588 405662
59558D05662Np59o20k6N55J198J873K048J473P48N86Q82J111J270J824K933M377
$$ 405662 405667 404908 404288 404262 404817 406015 407888 409936 411409 412157 412743 413625 414736 416006 417830 420763 425140
59541D25140O157Q440J0812J2270J2292J1471J0734J0307R856R338Q966Q360O399
$$ 425140 431297 439737 450549 462819 475111 486582 497316 507623 517479 526817 535783 544143 550542
59528E50542K433k543o416p722o733m789k895j138P32K535L631L574K665J777
$$ 550542 552975 550432 544016 536294 529561 524772 521877 520739 521471 524006 527637 531211 533876 535653
59514E35653J544J740J541M34j271k898m202n457o761p666p663o908o156n966
$$ 535653 537197 538937 540478 540912 539641 536743 532541 527084 520323 512657 504994 498086 491930 485964
59500D85964o226o538o778o997o928o101m545k985k023j479q82k96j30k41L9R10
$$ 485964 479738 473200 466422 459425 452497 446396 441851 438866 436843 435364 434482 434186 434056 433815 433854 434764
59484D34764J735J992K006K365L012L451L533L530L669M024M693N566O088N824
$$ 434764 436499 438491 440497 442862 445874 449325 452858 456388 460057 464081 468774 474340 480428 486252
59470D86252N168M938N203N118M085K552J366P82M63J63J3K54R79K123L438M551
$$ 486252 491420 496358 501561 506679 510764 513316 514682 515464 515927 516090 516103 516357 517336 519459 522897 527448
59454E27448N199N463N704O239P195Q554J0191J1690J2303J1384R155O830N482
$$ 527448 532647 538110 543814 550053 557248 565802 575993 587683 599986 611370 620525 627355 632837
59441F32837M750L152j25m180p469r438j0570j1277j1508j1302j0913j0286r151
$$ 632837 637587 640739 640614 636434 628965 619527 608957 597680 586172 574870 563957 553671 544520
59428E44520p793p030p077p011n794l494r87J212L403O065R171J2196J4681J6714
$$ 544520 536727 529697 522620 515609 509815 506321 505334 506546 509949 516014 525185 537381 552062 568776
59414E68776J8848K1379K3847K5359K5276K3409J9931J5564J1480Q241M941L13
$$ 568776 587624 609003 632850 658209 683485 706894 726825 742389 753869 762110 767051 767364
59402G67364n259r743j1665j1399j0085q431p134p164q538r749r736r733j1801
$$ 767364 762105 752362 740697 729298 719213 710782 703648 696484 687946 678197 668461 658728 646927
59389F46927j5886j9818k2026k2748k2406k0503j6938j3061j0433r131q191p101
$$ 646927 631041 611223 589197 566449 544043 523540 506602 493541 483108 473977 465786 458685
59377D58685o053n128m125l038k058j101M3J198J913K147K344K796L272L430L263
$$ 458685 452632 447504 443379 440341 438283 437182 437225 438423 440336 442483 444827 447623 450895 454325 457588
59362D57588L041L003L262L817M506N060N333N526O016O902P840Q507R109J0158
$$ 457588 460629 463632 466894 470711 475217 480277 485610 491136 497152 504054 511894 520401 529510 539668
59348E39668J1675J3031J3752J4130J4693J5430J6011J6476J7054J7390J6750
$$ 539668 551343 564374 578126 592256 606949 622379 638390 654866 671920 689310 706060
59337G06060J5067J3140J1615J0333Q854O983M554J356k336n722q365j0585j2597
$$ 706060 721127 734267 745882 756215 765069 772052 776606 777962 775626 769904 761539 750954 738357
59324G38357j3956j4441j4767j5623j6496j6382j5302j4156j3286j2136j0378
$$ 738357 724401 709960 695193 679570 663074 646692 631390 617234 603948 591812 581434
59313E81434q382o455m472k436o52R07K633M436N570N675N327N092M728L787K471
$$ 581434 573052 566597 562125 559689 559037 559944 562577 567013 572583 578258 583585 588677 593405 597192 599663
59298E99663J252L6j713m248p214r828j1169j0722q999p185n880m663l130j687
$$ 599663 600915 600951 599238 594990 587776 577948 566779 556057 547058 539873 533993 529330 526200 524513
59284E24513p89j50N70R78P07L95Q61J735K039J926K513M090N656O521P101P807
$$ 524513 523724 523574 524144 525122 525829 526224 527085 528820 530859 532785 535298 539388 545044 551565 558666 566473
59268E66473Q332Q605R311J0662J1564J0924R136P425O170M834L097J159r59l519
$$ 566473 574805 583410 592721 603383 614947 625871 635007 642432 648602 653436 656533 657692 656733 653214
59254F53214o372q824j0314j0867j0863j0701j0558j0249r472q372p531p099o433
$$ 653214 646842 638018 627704 616837 605974 595273 584715 574466 564994 556622 549091 541992 535559
59241E35559n023l291j894p00P94K389L428L882M303M829N067M965M886M721L895
$$ 535559 530536 527245 525351 524651 525445 527834 531262 535144 539447 544276 549343 554308 559194 563915 567810
59226E67810K388R26j02j104k281l092l232l389m357n914p182p720p715p475p259
$$ 567810 570198 571124 571022 569918 567637 564545 561313 557924 553567 547653 540471 532751 525036 517561 510302
59211E10302p277p415p173o296n136m110l182k214j358o33L54J690K627K474J699
$$ 510302 503025 495610 488437 482141 477005 472895 469713 467499 466141 465508 465862 467552 470179 472653 474352
59196D74352J348J680K121K391K712L002K735J838R43N23M45N95J258K478L640
$$ 474352 475700 477380 479501 481892 484604 487606 490341 492179 493122 493645 494090 494685 495943 498421 502061
59181E02061M137M043L760L429L064K844K804K628K200K081K868M312N584O278
$$ 502061 506198 510241 514001 517430 520494 523338 526142 528770 530970 533051 535919 540231 545815 552093
59167E52093O613O767O612O185N895N951O036N789N295M837M407L801L037K278
$$ 552093 558706 565473 572085 578270 584165 590116 596152 601941 607236 612073 616480 620281 623318 625596
59153F25596J442J96j562l480n124o365p314q041q533q826r003r004q602p645
$$ 625596 627038 627234 625672 622192 617068 610703 603389 595348 586815 577989 568986 559982 551380 543735
59139E43735o322n112m434m316m365m119l450k630j950j434r35m21m2J20J98L79
$$ 543735 537413 532301 527867 523551 519186 515067 511617 508987 507037 505603 504668 504247 504205 504325 504523 504902
59123E04902P53J299J984K739L454M061M642N368O287P175P684P660P350P232
$$ 504902 505655 506954 508938 511677 515131 519192 523834 529202 535489 542664 550348 558008 565358 572590
59109E72590P530P958P989P360O282N194M356L718L088K436J948J744J568R63
$$ 572590 580120 588078 596067 603427 609709 614903 619259 622977 626065 628501 630449 632193 633761 634724
59095F34724j29j128j391r42m95p10j561k437k760k523k300k627l376l886l804
$$ 634724 634595 633467 632076 631134 630639 629929 628368 625931 623171 620648 618348 615721 612345 608459 604655
59080F04655l520l566l938m345m866n812p066q061q472q398p905o937n791n077
$$ 604655 601135 597569 593631 589286 584420 578608 571542 563481 555009 546611 538706 531769 525978 520901
59066E20901m918m761m303l988m145m168l262j695n32k81m54m77l38j87K3K32
$$ 520901 515983 511222 506919 502931 498786 494618 491356 489661 489129 488848 488394 487917 487579 487392 487415 487647
59050D87647M4o84j437j579j145o74l97m2N79J095R88K23o47r55m60M74J135J008
$$ 487647 487691 487007 485570 483991 482846 482172 481775 481733 482312 483407 484395 484618 483971 483016 482556 483030 484165 485173
59032D85173K83l04k19L59Q94J253J776K665L678M489N091N672O357P189Q120
$$ 485173 485456 485152 484933 485292 486186 487439 489215 491880 495558 500047 505138 510810 517167 524356 532476
59017E32476Q847R029Q817Q770R009Q918Q038O777N668M378K281k94k227k949
$$ 532476 541323 550352 559169 567939 576948 585866 593904 600681 606349 610727 613008 612714 610487 607538
59003F07538k859k386j474j84J011J821K483L235L993M732N572O299O418N920
$$ 607538 604679 602293 600819 600635 601646 603467 605950 609185 613178 617910 623482 629781 636199 642119
58989F42119N335M827L971K688J573R29K69p52j729k336k872l396l275k331j530
$$ 642119 647454 652281 656252 658940 660513 661442 661711 660959 659230 656894 654022 650626 647351 645020 643490
58974F43490j528j402n4J940L203L763M794O539Q032Q895R806J0970J1652J1638
$$ 643490 641962 640560 640506 642446 645649 649412 654206 660745 668777 677672 687478 698448 710100 721738
58960G21738J1777J2411J2511J1237R315P926O916N144K124j455m616o862q310
$$ 721738 733515 745926 758437 769674 778989 786915 793831 798975 801099 799644 795028 788166 779856
58947G79856r569j1243j3214j4613j4823j4171j3333j2541j1670j0715r705q564
$$ 779856 770287 759044 745830 731217 716394 702223 688890 676349 664679 653964 644259 635695
58935F35695p442o841o972p329p316o915o330n400l929k327j251q06o14n82r03
$$ 635695 628253 621412 614440 607111 599795 592880 586550 581150 577221 574894 573643 572837 572223 571641 570738
58920E70738j427j619j325r85q90p18j14N97P69L54J50R13K483L955M750N179
$$ 570738 569311 567692 566367 565382 564492 563774 563660 564257 565026 565380 565530 566443 568926 572881 577631 582810
58904E82810N943P264Q844J0417J1932J3201J3866J3847J3507J3156J2728J2144
$$ 582810 588753 596017 604861 615278 627210 640411 654277 668124 681631 694787 707515 719659
58892G19659J1707J1824J2474J3237J3757J4098J4722J6084J8109K0004K0902
$$ 719659 731366 743190 755664 768901 782658 796756 811478 827562 845671 865675 886577
58881H86577K0764K0274J9782J8774J6583J3196Q999M222r18n754r498j2016j3909
$$ 886577 907341 927615 947397 966171 982754 995950 1004949 1009171 1008253 1002499 993001 980985 967076
58868I67076j5805j7789j9478k0325j9932j8460j6682j5370j4534j3559j2132
$$ 967076 951271 933482 914004 893679 873747 855287 838605 823235 808701 795142 783010
58857G83010j0712r944r901j0070j0069j0058j0429j1181j1831j1953j1627j1243
$$ 783010 772298 762354 752453 742383 732314 722256 711827 700646 688815 676862 665235 653992
58845F53992j0932j0437r550q420p378o616o155n965n999o189o450o596o312n475
$$ 653992 643060 632623 623073 614653 607275 600659 594504 588539 582540 576351 569901 563305 556993 551518
58831E51518m454l835l774l926m037m184m262l687k083m4J316J524J148J031J425
$$ 551518 547064 543229 539455 535529 531492 527308 523046 519359 517276 517232 518548 520072 521220 522251 523676
58816E23676K014K484K863L325L903M421M701M658M258L515K654K079J994K074
$$ 523676 525690 528174 531037 534362 538265 542686 547387 552045 556303 559818 562472 564551 566545 568619
58802E68619J822J136L29l60r64j513j938k305k870l688m456m884n011m978m695
$$ 568619 570441 571577 571906 571546 570582 569069 567131 564826 561956 558268 553812 548928 543917 538939 534244
58787E34244l996k987k059j515j232p11M50K077L536M466N103N653N726M885L540
$$ 534244 530248 527261 525202 523687 522455 521744 522194 524271 527807 532273 537376 543029 548755 553640 557180
58772E57180K570K149J618N82o55j943l691n987p949q643q175p292o381n429m654
$$ 557180 559750 561899 563517 564099 563444 561501 557810 551823 543874 535231 527056 519764 513383 507954 503300
58757E03300m353m298l859k798j492l70M52J038J524K117K882L567L877L907L975
$$ 503300 498947 494649 490790 487992 486500 486130 486582 487620 489144 491261 494143 497710 501587 505494 509469
58742E09469M197M489M847N278N547N384M899M506M454M728N320O236P212P778
$$ 509469 513666 518155 523002 528280 533827 539211 544110 548616 553070 557798 563118 569354 576566 584344
58728E84344P657O995O122N346M857M682M653M588M460M358M395M684N231N765
$$ 584344 592001 598996 605118 610464 615321 620003 624656 629244 633704 638062 642457 647141 652372 658137
58714F58137N927N795N904O514P190P386P167O914O621N982M942L654K000k86
$$ 658137 664064 669859 675763 682277 689467 696853 704020 710934 717555 723537 728479 732133 734133 733847
58700G33847k996n498p517r455j1722j4163j6326j7917j8782j8751j7811j6308
$$ 733847 730851 725353 717836 708381 696659 682496 666170 648253 629471 610720 592909 576601
58688E76601j4666j2969j1094r278q229q350q927q587o808m667l590l601l511
$$ 576601 561935 548966 537872 528594 520365 512015 503088 494501 487693 483026 479436 475835 472324
58675D72324k788k339k923l672l136j301M72J451K368L991N847P031P608Q393
$$ 472324 469536 467197 464274 460602 457466 456165 456637 458088 460456 464447 470294 477325 484933 493326
58661D93326R596J0484J0407R554Q416P030N107K651M4k330m237n441n895o014
$$ 493326 502922 513406 523813 533367 541783 548813 553920 556571 556615 554285 550048 544607 538712 532698
58647E32698o354o824o768o039n397n378n372m535l228k544k605k424j542o83
$$ 532698 526344 519520 512752 506713 501316 495938 490566 486031 482803 480259 477654 475230 473688 473005
58633D73005l36J98J600L205L840L491L147L266L272K588J438N04K97R12J960
$$ 473005 472669 472867 474467 477672 481512 485003 488150 491416 494688 497276 498714 499218 499515 500427 502387
58618E02387K750K916K835L101L770M522N326O368P370P658P060O197N650N267
$$ 502387 505137 508053 510888 513989 517759 522281 527607 533975 541345 549003 556063 562260 567910 573177
58604E73177M524L234J686K56q06j443j840k391l383m606n373n142m166l353l247
$$ 573177 577701 580935 582621 582877 582071 580628 578788 576397 573014 568408 563035 557893 553727 550374 547127
58589E47127l321k629j060N35J513K184L180M530N784O738P596Q514R362R829
$$ 547127 543806 541177 540117 540652 542165 544349 547529 552059 557843 564581 572177 580691 590053 599882
58575E99882R685R022Q333Q078Q144Q018P564P243P460Q200R448J1397J3882J6161
$$ 599882 609567 618589 626922 635000 643144 651162 658726 665969 673429 681629 691077 702474 716356 732517
58561G32517J7726J8956K0552K2614K4540K5549K5104K3307K1002J8975J6876
$$ 732517 750243 769199 789751 812365 836905 862454 887558 910865 931867 950842 967718
58550I67718J3671R384N450K817P00k003m966p149q501r786j1154j2089j2540
$$ 967718 981389 990773 996223 999040 999740 997737 992771 985622 977121 967335 956181 944092 931552
58537I31552j3066j3919j4884j5958j7337j8811j9882k0327k0057j8778j6559
$$ 931552 918486 904567 889683 873725 856388 837577 817695 797368 777311 758533 741974
58526G41974j4297j2717j1287r095o470m511l341k106o28K71K12j94m63p17q34
$$ 741974 727677 714960 703673 694578 688108 683597 680256 678150 677522 677793 678005 677811 677348 676631 675797
58511F75797l22N95Q50Qj086j609j777k073k369k412k423k586k596k263j972j995
$$ 675797 675475 676070 676920 676928 675842 674233 672456 670383 668014 665602 663179 660593 657997 655734 653762 651767
58495F51767j982j635j333j488j782j670j241r89r73p79j49P78J821L007M438
$$ 651767 649785 648150 646817 645329 643547 641877 640636 639647 638674 637895 637746 638524 640345 643352 647790
58480F47790O111P773R032R711J0086J0587J1316J2006J2335J2063J1075R549
$$ 647790 653901 661674 670706 680417 690503 701090 712406 724412 736747 748810 759885 769434
58468G69434P862O053L653M48k919n498o913p297o845n937n199m742l864k109
$$ 769434 777296 783349 787002 787450 784531 779033 772120 764823 757978 752041 746842 742100 738236 736127
58454G36127o4J683L611O202Q539R341Q909Q572Q503P635N602L135N31k633n986
$$ 736127 736063 737746 741357 747559 756098 765439 774348 782920 791423 799058 804660 807795 808326 805693 799707
58439G99707q252r019r173r179q476p040n960n654m999l132q30Q45K142L811N724
$$ 799707 791455 782436 773263 764084 755608 748568 742608 736954 731955 728823 727993 728838 730980 734791 740515
58424G40515P288Q435R317R679R413R023Q901Q708Q074P172O098M439K030n41
$$ 740515 747803 756238 765555 775234 784647 793670 802571 811279 819353 826525 832623 837062 839092 838551
58410H38551k757m665o205o892o711o434o558o767o875p214p641p377o405n778
$$ 838551 835794 831129 824924 818032 811321 804887 798329 791562 784687 777473 769832 762455 756050 750272
58396G50272n777n058k672K55K009K455K575K764K804K808K961K872K231J566
$$ 750272 744495 739437 736765 737020 739029 741484 744059 746823 749627 752435 755396 758268 760499 762065
58382G62065J473J588J285Q16Q70J498K240K876L332L366L062L008L518M221M858
$$ 762065 763538 765126 766411 767227 768097 769595 771835 774711 778043 781409 784471 787479 790997 795218 800076
58367H00076N612O273O187N598N840P403R148J0174J1116J2532J3516J3253J2642
$$ 800076 805688 811961 818148 823746 829586 836989 846137 856311 867427 879959 893475 906728 919370
58354I19370J2785J3049J2201J0525R088P822O012M020K759K068J237N55P82J608
$$ 919370 932155 945204 957405 967930 977018 984840 990852 994872 997631 999699 1000936 1001491 1002273 1003881
58340A003881K239K989M672O865Q528R882J1925J4368J5838J6067J6185J6799
$$ 1003881 1006120 1009109 1013781 1020646 1029174 1039056 1050981 1065349 1081187 1097254 1113439 1130238
58328A130238J7275J7010J6081J4647J3005J1988J2029J1983J0365P536N242M095
$$ 1130238 1147513 1164523 1180604 1195251 1208256 1220244 1232273 1244256 1254621 1262157 1267399 1271494
58316A271494L214K266K076K959L999M564N174O324P558Q307Q793R601J0987J2783
$$ 1271494 1274708 1276974 1279050 1282009 1286008 1290572 1295746 1302070 1309628 1317935 1326728 1336329 1347316 1360099
58302A360099J4512J5626J6108J6616J7454J7923J7480J6933J7406J8594J9242
$$ 1360099 1374611 1390237 1406345 1422961 1440415 1458338 1475818 1492751 1510157 1528751 1547993
58291A547993J9022J8758J9002J9518K0054K0609K1151K1891K3411K5638K7303
$$ 1547993 1567015 1585773 1604775 1624293 1644347 1664956 1686107 1707998 1731409 1757047 1784350
58280A784350K7496K7122K7607K8817K9613K9914L0685L2258L4072L5888L7923
$$ 1784350 1811846 1838968 1866575 1895392 1925005 1954919 1985604 2017862 2051934 2087822 2125745
58269B125745L9989M1633M2933M4212M5356M6352M7801M9957N2119N3907N6101
$$ 2125745 2165734 2207367 2250300 2294512 2339868 2386220 2434021 2483978 2536097 2590004 2646105
58258B646105N9065O1687O3201O4666O6981O9013O9643P0188P2411P5500P7588
$$ 2646105 2705170 2766857 2830058 2894724 2961705 3030718 3100361 3170549 3242960 3318460 3396048
58247C396048P9102Q1906Q5977Q9814R3485R8398J04525J10564J16552J23690
$$ 3396048 3475150 3557056 3643033 3732847 3826332 3924730 4029255 4139819 4256371 4380061
58237D380061J31987J40528J49593J59902J70501J80150J90140K02769K17544
$$ 4380061 4512048 4652576 4802169 4962071 5132572 5312722 5502862 5705631 5923175
58228E923175K32017K45969K61541K79556K98985L19973L44073L71562M01487
$$ 5923175 6155192 6401161 6662702 6942258 7241243 7561216 7905289 8276851 8678338
58219H678338M34337M71739N13857N60010O11394O70099P36196Q08946Q90045
$$ 8678338 9112675 9584414 10098271 10658281 11269675 11939774 12675970 13484916 14374961
58210A4374961R82381J086909J204637J340367J500662J689923J913375K182658
$$ 14374961 15357342 16444251 17648888 18989255 20489917 22179840 24093215 26275873
58202B6275873K514141K924940L437811M089561M927816N997976P335191Q964640
$$ 26275873 28790014 31714954 35152765 39242326 44170142 50168118 57503309 66467949
58194F6467949J0902736J3157436J5723235J8554723K1520460K4373913K6765255
$$ 66467949 77370685 90528121 106251356 124806079 146326539 170700452 197465707
58187A97465707K8273261K8458259K6998708K3901868J9581802J4595274R187150
$$ 197465707 225738968 254197227 281195935 305097803 324679605 339274879 348462029
58180C48462029L128336l889326j1652770j9243195k5458553k9431450l0941275
$$ 348462029 351590365 347701039 336048269 316805074 291346521 261915071 230973796
58173B30973796l0318546k8172787k5156409k1817723j8534751j5524210j2891731
$$ 230973796 200655250 172482463 147326054 125508331 106973580 91449370 78557639
58166G8557639j0671406q843434p355133o149065n175906m390024l749127l222184
$$ 78557639 67886233 59042799 51687666 45538601 40362695 35972671 32223544 29001360
58158B9001360k789356k432525k132916j877678j660677j475429j313462j170036
$$ 29001360 26212004 23779479 21646563 19768885 18108208 16632779 15319317 14149281
58150A4149281j044914r36392q39971p53517o78362o14351n58424n08746m65731
$$ 14149281 13104367 12167975 11328004 10574487 9896125 9281774 8723350 8214604 7748873
58141G748873m28463l94330l62932l36292l14489k94690k75091k56419k39096
$$ 7748873 7320410 6926080 6563148 6226856 5912367 5617677 5342586 5086167 4847071
58132D847071k22267k06185j92367j80774j69665j58593j48808j40462j32167
$$ 4847071 4624804 4418619 4226252 4045478 3875813 3717220 3568412 3427950 3295783
58123C295783j23655j16151j09865j03652r7415r2315q8330q4074p9271p5139
$$ 3295783 3172128 3055977 2946112 2842460 2745045 2652730 2564400 2480326 2401055 2325916
58113B325916p2041o9049o5931o3364o1112n8237n5130n3069n1734m9533m6435
$$ 2325916 2253875 2184826 2118895 2055531 1994419 1936182 1881052 1827983 1776249 1726716 1680281
58102A680281m4057m2847m1579l9912l8880l8464l7158l4602l2330l1213l0291
$$ 1680281 1636224 1593377 1551798 1511886 1473006 1434542 1397384 1362782 1330452 1299239 1268948
58091A268948k8807k7342k6128k4317k1802j9932j9495j9610j9383j9108j9026
$$ 1268948 1240141 1212799 1186671 1162354 1140552 1120620 1101125 1081515 1062132 1043024 1023998
58080A023998j8483j7249j6242j6135j6437j6593j6745j6834j6244j5008j4157
$$ 1023998 1005515 988266 972024 955889 939452 922859 906114 889280 873036 858028 843871
58069H43871j4249j4632j4603j4197j3495j2372j1317j1208j1853j2006j1176
$$ 843871 829622 814990 800387 786190 772695 760323 749006 737798 725945 713939 702763
58058G02763j0160r434q545p597p709r230j0780j1019j0275r574r137q638q037
$$ 702763 692603 683169 674624 667027 659318 650088 639308 628289 618014 608440 599303 590665 582628
58045E82628p388o611o007o126o654o390m994l691l601m304m814m978n180n436
$$ 582628 575240 568629 562622 556496 549842 543452 538458 534767 531166 526862 522048 517070 511890 506454
58031E06454n623n975o565o881o566o078o076o575p165p545p470o814n994n748
$$ 506454 500831 494856 488291 481410 474844 468766 462690 456115 448950 441405 433935 427121 421127 415379
58017D15379o137o452o327o142o063n591m501l316k429j562o59l64r74j722j863
$$ 415379 409242 402790 396463 390321 384258 378667 374166 370850 368421 366859 366200 365836 364862 363140 361277
58002C61277j722j970k507k806k823k844k889k889k973l078k736j839j026p65
$$ 361277 359555 357585 355078 352272 349449 346605 343716 340827 337854 334776 332040 330201 329175 328410
57988C28410o59k35J29j08n59l34O98J756K113J676P83p1m59l97k72k79k90m45
$$ 328410 327751 327516 327645 327537 326978 326644 327342 329098 331211 332887 333670 333599 333140 332743 332471 332192 331902 331457
57970C31457j218k400k847j911n89l71j275j877j143N66K199L036K921K122J131
$$ 331457 330239 327839 324992 323081 322492 322121 320846 318969 317826 318392 320591 323627 326548 328670 329801
57955C29801K99l85r30j075p16l79o55j309j509r80l23o3J41R39K332L623M317
$$ 329801 330100 329715 328785 327710 326994 326615 325960 324651 323142 322162 321839 321776 321917 322856 325188 328811 333128
57938C33128M647N078N573N712N511N598O315P096P200O755O370N906M480J886
$$ 333128 337775 342853 348426 354138 359649 365247 371562 378658 385858 392613 398983 404889 409369 411255
57924D11255q15k534l356m053m948n854o743p822r037j0016j0454j0249r416q096
$$ 411255 410440 407906 404550 400497 395549 389695 382952 375130 366093 356077 345623 335374 325958 317862
57910C17862o622n289m118l077k295j900j772j706j641j531j183m84L25Q28Q29
$$ 317862 311240 305951 301833 298756 296461 294561 292789 291083 289442 287911 286728 286244 286569 287397 288226
57895B88226M42l8k69r2K72M54M31N03P19P14L27o9k00l87r27j376j083l37k80
$$ 288226 288668 288630 288361 288269 288541 288995 289426 289929 290648 291362 291689 291620 291420 291033 290106 288730 287647 287310 287030
57876B87030j490l254m463m822m814m775m564m074l604l478l530l295k609j760
$$ 287030 285540 282286 277823 273001 268187 263412 258848 254774 251170 247692 244162 240867 238258 236498
57862B36498j112q07q90j280j518q91Q18K822L942L724K800K182K351K954L239
$$ 236498 235386 234579 233689 232409 230891 230000 230818 233640 237582 241306 244106 246288 248639 251593 254832
57847B54832K781J855R63J94o65j450j666j310j007j047j003o88p36j499k092
$$ 254832 257613 259468 260431 260625 259960 258510 256844 255534 254527 253480 252477 251789 251053 249554 247462
57832B47462j562m65j24p04j153r34n16r5Q55K372L535L739L609M044N029N883
$$ 247462 245900 245435 245311 244607 243454 242520 242004 241909 242764 245136 248671 252410 256019 260063 265092 270975
57816B70975O052N244L444J228m96j491k377l585m830n889p028q121q241o954
$$ 270975 277027 282271 285715 286943 286447 284956 282579 278994 274164 268275 261247 253126 244885 237931
57802B37931n256m436m498m583m435m422m478m009k916j888j469j428j216o30
$$ 237931 232675 228239 223741 219158 214723 210301 205823 201814 198898 197010 195541 194113 192897 192267
57788A92267R1N80O66N08L88L72L94O79J609L048M280M904N270N722N972N727
$$ 192267 192358 192938 193604 194112 194500 194872 195266 195945 197554 200602 204882 209786 215056 220778 226750 232477
57772B32477N369N427N717N632M939L823K459J073R0l84r41k116l542m441m678
$$ 232477 237846 243273 248990 254622 259561 263384 265843 266916 267006 266622 265681 263565 260023 255582 250904
57757B50904m703m711m602m557m851n168m799l614k266j394j233j837k990l866
$$ 250904 246201 241490 236888 232331 227480 222312 217513 213899 211633 210239 209006 207169 204179 200313
57743B00313l550k168q50l65l68k58j27m10j007j346j141p17n76q82j388j716
$$ 200313 196763 194595 193745 193380 193012 192754 192627 192217 191210 189864 188723 188006 187430 186548 185160 183444
57727A83444j690j388r21l17L05O48N85M49O11Q74O92o1q78j237j106p63m25k86
$$ 183444 181754 180366 179445 179128 179433 180081 180666 181115 181726 182600 183292 183231 182353 181116 180010 179247 178822 178536
57709A78536n84j354k163k373j833j155j146j836k421k234j526r09m03L15R61
$$ 178536 177952 176598 174435 172062 170229 169074 167928 166092 163671 161437 159911 159002 158599 158914 159875
57694A59875Q51J55j3P29J272N94o76j221r63q87j306j445p72L58J558K972M719
$$ 159875 160726 160881 160868 161597 162869 163463 162787 161566 160603 159716 158410 156965 156193 156551 158109 161081 165800
57677A65800O557Q419J0683J3639J7217K1395K6337L1793L6922M0944M3445M3974
$$ 165800 172357 180776 191459 205098 222315 243710 270047 301840 338762 379706 423151 467125
57665D67125M1951L7434L1381K4649J7089P985k944j5180k7601l8601m6428m9944
$$ 467125 509076 546510 577891 602540 619629 627614 624670 609490 581889 543288 496860 446916
57653D46916m9134m4868l8517l1779k6195k2233j9158j6122j3057j0281p759n368
$$ 446916 397782 352914 314397 282618 256423 234190 215032 198910 185853 175572 167813 162445
57641A62445l436k374j970j588r81l71J00M12L57j98p90p46j85J17j02l03k63
$$ 162445 159009 156635 154665 153077 152096 151725 151825 152237 152594 152396 151606 150860 150675 150792 150690 150387 150124
57624A50124o38j822k912k680j262k7J33l69p71r15r38p56m01l82j065j933k057
$$ 150124 149486 147664 144752 142072 140810 140783 140916 140547 139776 138861 137923 137167 136766 136384 135319 133386 131329
57607A31329j304m96l41o32p12l14L04P20O70J33o01j142j366j489j688j900k064
$$ 131329 130025 129529 129188 128556 127844 127530 127834 128554 129224 129357 128756 127614 126248 124759 123071 121171 119107
57590A19107k315k656k712k109j069l03l05q71j356j313q93o86j057j644j766
$$ 119107 116792 114136 111424 109315 108246 107943 107638 106767 105411 104098 103205 102519 101462 99818 98052
57575I8052j343j076j486k172k448k387k578l023k982k123j104o58n71j74N49
$$ 98052 96709 95633 94147 91975 89527 87140 84562 81539 78557 76434 75330 74672 74101 73927 74476
57560G4476R79R33R48J301J402O71l88o35K57J358J650J076K51m23r13j168j070
$$ 74476 75455 76388 77336 78637 80039 80710 80322 79687 79944 81302 82952 84028 84279 83856 82943 81775 80705
57543H0705p29m70m98p91j177j345j011l81j24m67o44J17J299J621P68k12l94
$$ 80705 79976 79506 79008 78217 77040 75695 74684 74303 74179 73712 73068 73185 74484 76105 76873 76661 76267
57526G6267KL57N51P09O87M64L96O44P53L92m5o9J26J38J28N10J230J927K432
$$ 76267 76269 76626 77177 77886 78573 79037 79433 80077 80830 81222 81177 81108 81234 81372 81500 82010 83240 85167 87599
57507H7599K558J914O33k44k8M75R0q30r18k3M78j68r70q53k66l48j241k190k783
$$ 87599 90157 92071 92704 92460 92432 92907 92997 92167 91249 91226 91704 91536 90566 89713 89447 89099 87858 85668 82885
57488H2885l151l225k633j456m45k28n97q28n40n3J24o4k49k48k37k48M8O27P39
$$ 82885 79734 76509 73876 72420 71975 71747 71150 70322 69782 69729 69853 69789 69540 69292 69055 68807 68855 69482 70221
57469G0221k25j748k774k995k798k171p23J107J951J122m01j171q44j46K19J9
$$ 70221 69996 68248 65474 62479 59681 57510 56787 57894 59845 60967 60566 59395 58551 58405 58624 58643
57453E8643n99j099q02L19J339J377N98j88n76p08o80m88l23l63k77L90J370J788
$$ 58643 58044 56945 56143 56462 57801 59178 59776 59588 59012 58304 57624 57136 56813 56450 56173 56563 57933 59721
57435E9721J313O32M76O81N59m4n76n87k70j13k88n96q05p91m60J16N56M78M6
$$ 59721 61034 61666 62142 62823 63382 63338 62762 62175 61905 61792 61504 60908 60103 59312 58852 58968 59524 60002 60048
57416F0048r3L69R59J047O23J46o9L2M70J071J326R25L16K04N59P24M67K38K89
$$ 60048 59955 60324 61283 62330 62953 63099 63030 63062 63532 64603 65929 66854 67170 67374 67933 68657 69124 69362 69651
57397F9651K03l71j117j490j392j074p20l77kN83J500K402K685K230J579J200
$$ 69651 69854 69483 68366 66876 65484 64410 63690 63313 63311 63894 65394 67796 70481 72711 74290 75490
57381G5490J015Q44Q03R78J096Q88M38q6o92j271j462j183r13j065j389j388r85
$$ 75490 76505 77349 78152 79130 80226 81114 81552 81466 80774 79503 78041 76858 75945 74880 73491 72103 71118
57364G1118m84j04N5j08m59n57k08J42J3l30j82O36J492J656R53j59q83n97O13
$$ 71118 70634 70530 70585 70477 70018 69461 69253 69395 69408 69078 68896 69532 71024 72680 73633 73474 72591 71994 72607
57345G2607J929K450J876O13n84r80l71O12J043P35L27K10k5p35j415j418j003
$$ 72607 74536 76986 78862 79475 78891 77911 77540 78152 79195 79930 80257 80467 80442 79707 78292 76874 75871
57328G5871r52j408j784j676j232p07k42k4j35k39P8O51Q93N98K05J95O06J079
$$ 75871 74919 73511 71727 70051 68819 68112 67870 67846 67711 67472 67550 68201 69094 69692 69897 70092 70698 71777
57310G1777J075K44j058j791j316k57K23p1l41j18J90K01J48K31J47k42l19N01
$$ 71777 72852 73096 72038 70247 68931 68674 68897 68826 68485 68367 68557 68758 68906 69137 69284 69042 68723 69224
57292F9224J741K312J895J212R39Q84N63P7K0N45J054R33L62J01N94J544K334
$$ 69224 70965 73277 75172 76384 77323 78207 78770 78847 78867 79412 80466 81399 81761 81862 82456 84000 86334
57275H6334K575K252J614J005N75J59l64o50k47O41J334J673K177K949L195K388
$$ 86334 88909 91161 92775 93780 94355 94514 94150 93500 93253 93894 95228 96901 99078 102027 105222 107610
57259A07610J253Q08R09O61nj90N37J483J865J770J689J638J225L33n65p64%J153
$$ 107610 108863 109671 110580 111241 111236 111046 111583 113066 114931 116701 118390 120028 121253 121586 121021 120257 120257 121410
57241A21410J716J400J009J358K078K071J108J60N6N41R17J065J342J889K419
$$ 121410 123126 124526 125535 126893 128971 131042 132150 132310 132366 132907 133824 134889 136231 138120 140539
57226A40539K618K400J983J748J899K172K113J703J454J763K470L151L581L790
$$ 140539 143157 145557 147540 149288 151187 153359 155472 157175 158629 160392 162862 166013 169594 173384
57212A73384L928M159M511M751M632M248L882L617L326L071L137L609M291M988
$$ 173384 177312 181471 185982 190733 195365 199613 203495 207112 210438 213509 216646 220255 224546 229534
57198B29534N590N940N944N805N823N996O198O540P077P329O916O476P116Q718
$$ 229534 235124 241064 247008 252813 258636 264632 270830 277370 284447 291776 298692 305168 312284 321002
57184C21002R782R338Q218P821Q349R016R479J0140J1207J2253J2807J2924J3023
$$ 321002 330784 340122 348340 356161 364510 373526 383005 393145 404352 416605 429412 442336 455359
57171D55359J3468J4307J5264J6136J7282J9401K2515K5555K7406K8123K8622
$$ 455359 468827 483134 498398 514534 531816 551217 573732 599287 626693 654816 683438
57160F83438K9405L0122L0279K9773K8711K7254K5834K5065K5149K5642K6012
$$ 683438 712843 742965 773244 803017 831728 858982 884816 909881 935030 960672 986684
57149I86684K6217K6545K7019K7254K6824K5634K3981K2339K1140K0580K0593
$$ 986684 1012901 1039446 1066465 1093719 1120543 1146177 1170158 1192497 1213637 1234217 1254810
57138A254810K0984K1638K2582K3851K5349K6916K8520L0250L2065L3689L4798
$$ 1254810 1275794 1297432 1320014 1343865 1369214 1396130 1424650 1454900 1486965 1520654 1555452
57127A555452L5339L5529L5614L5648L5403L4590L3256L2059L1812L2756L4472
$$ 1555452 1590791 1626320 1661934 1697582 1732985 1767575 1800831 1832890 1864702 1897458 1931930
57116A931930L6673L9622M3454M7425N0361N1827N2533N3734N6479O1296O8162
$$ 1931930 1968603 2008225 2051679 2099104 2149465 2201292 2253825 2307559 2364038 2425334 2493496
57105B493496P6671Q6486R7720J11004J27454J48654J76220K11263K54731L08426
$$ 2493496 2570167 2656653 2754373 2865377 2992831 3141485 3317705 3528968 3783699 4092125
57095D092125L74919M55882N50682O56539P69016Q82122R89430J086064J168438
$$ 4092125 4467044 4922926 5473608 6130147 6899163 7781285 8770715 9856779 11025217
57086A1025217J231397J267936J273968J251740J206408J142338J068365J005139
$$ 11025217 12256614 13524550 14798518 16050258 17256666 18399004 19467369 20472508
57078B0472508R77180R89188J010780R89569Q82044O74729L83239L9254l21726
$$ 20472508 21449688 22438876 23449656 24439225 25321269 25995998 26379237 26418491 26096765
57069B6096765o68729r80221j243924j452423j600029j683799j705436j671020
$$ 26096765 25428036 24447815 23203891 21751468 20151439 18467640 16762204 15091184
57061A5091184j589912j474483j339014j196601j056652r25112q05807p00664
$$ 15091184 13501272 12026789 10687775 9491174 8434522 7509410 6703603 6002939
57053F002939o09549n31253m64669m08674l61532l21263k86471k56371k30174
$$ 6002939 5393390 4862137 4397468 3988794 3627262 3305999 3019528 2763157 2532983
57044B532983k06869j85403j64955j45298j26956j10521r5624q1128o6544n2660
$$ 2532983 2326114 2140711 1975756 1830458 1703502 1592981 1497357 1416229 1349685 1297025
57034A297025m0472l0182k1646j5192j1196r165p983p183p756j1664k0294l2864
$$ 1297025 1256553 1226371 1204725 1189533 1178337 1169172 1161189 1154006 1146250 1134586 1114292 1081428
57022A081428m6131n6255o1333o1997n9683n5231m9336m3227l7923l3370k9186
$$ 1081428 1035297 979042 917709 855712 796029 740798 691462 648235 610312 576942 547756
57011E47756k5803k3852k2708k0807j7562j4071j1671j0525j0026r833r862r739
$$ 547756 521953 498101 475393 454586 437024 422953 411282 400757 390731 380898 371036 361297
56999C61297q955p538o073m947l934k699j363l95N8L64R18J630K166K580L364
$$ 361297 352342 344804 338731 333784 329850 327151 325788 325393 325451 325815 326733 328363 330529 333109 336473
56984C36473M679N891O139N302M045K877J508n60l099n258o678p988r802j1511
$$ 336473 341152 347043 353182 358484 362529 365406 366914 366354 363255 357997 351319 343331 333529 322018
56970C22018j1779j0227p986o284n029l345j004J370L346N161P011Q576R472R741
$$ 322018 310239 300012 292026 285742 280713 277368 276364 277734 281080 286241 293252 301828 311300 321041
56956C21041R650R390R121Q869Q115N975K192k351o529r961j2710j4413j4454
$$ 321041 330691 340081 349202 358071 366186 372161 374353 372002 365473 355512 342802 328389 313935
56943C13935j2968j0906q913o711l927r68J477L533O032R283J2550J4954J6390
$$ 313935 300967 290061 281148 274437 270510 269542 271019 274552 280584 289867 302417 317371 333761
56930C33761J7118J6944J5421J2713R536O142J989l316r183j4509j8533k0961
$$ 333761 350879 367823 383244 395957 405493 411635 413624 410308 401125 386616 368083 347122
56918C47122k1640k0737j8952j7107j5507j3966j2262j0327q284o602n786n586
$$ 347122 325482 304745 285793 268686 253179 239213 226951 216624 208340 201738 195952 190366
56906A90366m943l306j563r13j167j143m34K41N23J053K246L461L967M049M543
$$ 190366 185423 182117 180554 179641 178474 177331 176897 177138 177661 178714 180960 184421 188388 192437 196980
56891A96980N737P311Q920J0347J1384J1996J2371J2531J2141J0978R266P303
$$ 196980 202717 210028 218948 229295 240679 252675 265046 277577 289718 300696 309962 317265
56879C17265N059K406n49l532o148p802q053p198n977m432j740K493P442J1988
$$ 317265 322324 324730 324181 320649 314501 306699 298646 291448 285471 281039 279299 281792 289234 301222
56865C01222J5909J9631K3389K7241L1300L5192L7674L7588L5023L0941K5911
$$ 301222 317131 336762 360151 387392 418692 453884 491558 529146 564169 595110 621021
56854F21021J9840J2625M389m722j4126k2295k7448k8913k7338k3698j8675j2828
$$ 621021 640861 653486 657875 653153 639027 616732 589284 560371 533033 509335 490660 477832
56842D77832o508N09Q666J7710K6726L5123M2933M9891N4981N7256N6576N3184
$$ 477832 471324 471833 480499 498209 524935 560058 602991 652882 707863 765119 821695 874879
56830H74879M7170L8760K8664J7392M478j0776k7608m3340n4922o0856o1578n8355
$$ 874879 922049 960809 989473 1006865 1011343 1000567 972959 929619 874697 813841 752263 693908
56818F93908n2204m3830l4121k4174j4768n941K727J1444J9865K7313L3236L7422
$$ 693908 641704 597874 563753 539579 524811 518870 521597 533041 552906 580219 613455 650877
56806F50877L9687L9465L6030K9440K0948J1961K605q101k0469l3014m3317m9578
$$ 650877 690564 730029 766059 795499 816447 828408 831013 822912 802443 769429 726112 676534
56794F76534n1331m9243m4666l8894l2401k5064j7269j0170m479L50N128R735
$$ 676534 625203 575960 531294 492400 459999 434935 417666 407496 403017 403367 408495 418230
56782D18230J3607J6721J9116J9884J7898J3559Q654M241m21o489j3798k0930
$$ 418230 431837 448558 467674 487558 505456 519015 527669 531910 531489 525000 511202 490272
56770D90272k6470k9835l1279l1363l0299k7824k4051k0178j7565j6141j4531
$$ 490272 463802 433967 402688 371325 341026 313202 289151 268973 251408 235267 220736
56759B20736j1968r210p299o245n503m999m951n153n168m922m508l658k160o07
$$ 220736 208768 199558 192259 186014 180511 175512 170561 165408 160240 155318 150810 147152 144992 144385
56745A44385l8p23j838k392k103j338o35m48r04j618j998j924j821j904j664n86
$$ 144385 144347 143624 141786 139394 137291 135953 135318 134870 133966 132348 130350 128426 126605 124701 123037 122451
56729A22451Q87J613J128J74k93k00MK40P14J148J012N59P05J610K188J586L73
$$ 122451 123338 124951 126079 126253 125960 125760 125764 126004 126718 127866 128878 129437 130142 131752 133940 135526 135899
56712A35899m15p23j103j420j044j50L46K16J95O22P37q7j236j604r79q8M26N04
$$ 135899 135484 134761 133658 132238 131194 131044 131390 131606 131801 132423 133160 133073 131837 130233 129254 129166 129592 130096
56694A30096L59J78J26L46P60J096J130R57R07J163J453J350R39P51R36R49M45
$$ 130096 130455 130633 130759 131105 131865 132961 134091 135048 135955 137118 138571 139921 140860 141611 142547 143496 143941
56677A43941qK13O89N22k42o58k80L15N01K88q5m80o31l58j70q03j929k213j031
$$ 143941 143933 144146 144835 145357 145115 144457 144177 144492 144993 145281 145196 144716 144085 143727 143557 142754 140825 138612 137581
56658A37581O32J478J307P15J14k71m0R91K364L446L994L934L110J731N98L70
$$ 137581 138213 139691 140998 141713 141827 141556 141516 142507 144871 148317 152311 156245 159355 161086 161684 162054
56642A62054Q83J530J873J655P95j79m12J76O69M93K09L42L23m99j472j413l84
$$ 162054 162937 164467 166340 167995 168790 168611 168199 168375 169044 169537 169746 170088 170411 169912 168440 167027 166643
56625A66643M31L65j56n54o47l19L98Q95N08n00j184j192j015r77q37m99l34n25
$$ 166643 167074 167439 167283 166729 166082 165763 166161 167056 167564 167064 165880 164688 163673 162696 161859 161360 161026 160501
56607A60501p42p56p94r98j151j118j086j117r51n19j78j84l34l65l71n18p01
$$ 160501 159759 159003 158209 157211 156060 154942 153856 152739 151788 151269 151091 150907 150573 150208 149837 149319 148618
56590A48618p16n20j65K47M54J65n37j140j183o15K97J098J265O27k54n26l5N61
$$ 148618 147902 147382 147217 147464 147918 148083 147546 146406 145223 144608 144905 146003 147268 147895 147641 147115 147080 147641
56572A47641P94J066J971L297M172M112L567L312L547L822L753L636M081N138
$$ 147641 148435 149501 151472 154769 158941 163053 166620 169932 173479 177301 181054 184690 188771 193909
56558A93909O144O535O450O299O128N709N021M151L005J546K12m92o79q91j272
$$ 193909 200053 206588 213038 219337 225465 231174 236195 240346 243351 244897 245109 244617 243938 243047 241775
56543B41775j471j394j430j837k400k883l308l602l431k708j892j462j318j009
$$ 241775 240304 238910 237480 235643 233243 230360 227052 223450 220019 217311 215419 213957 212639 211630
56529B11630m28j9l35j451k677k959j866j91P53N13k40p51r99j216j199o86n7
$$ 211630 211202 211183 210848 209397 206720 203761 201895 201704 202457 202970 202730 201979 200980 199764 198565 197879 197822
56512A97822k4o20j080q35j91K43L48L75K84k01r54j385j280j170j456j665j143
$$ 197822 197798 197178 196098 195263 195072 195315 195663 196038 196322 196121 195167 193782 192502 191332 189876 188211 187068
56495A87068k10J58k88p75p62o45q83j171j045o96n57m74m4N33O82L83K24M75
$$ 187068 186858 187016 186728 185953 185191 184546 183663 182492 181447 180751 180194 179720 179676 180209 180891 181274 181498 181973
56477A81973O94M06k30n72j53P99J466J223M57K28R47J809J878J242O56M69M92
$$ 181973 182667 183073 182843 182271 182118 182917 184383 185606 186063 186291 187238 189047 190925 192167 192823 193292 193784
56460A93784N90P16O52K57k04m83p87j277j471r02j2L97L49N23J061J407J280
$$ 193784 194374 195090 195742 195999 195795 195312 194525 193248 191777 190875 190863 191260 191609 192132 193193 194600 195880
56443A95880J043J044J261J587J840J613P90K6%L69K96k07l95p1K65M83R13J342
$$ 195880 196923 197967 199228 200815 202655 204268 205058 205084 205084 205453 205749 205542 205147 205076 205341 205824 206737 208079
56425B08079J043R4m83j60L86L67k11r97j704j832r95K09O35J77j33J08P4o60
$$ 208079 209122 209216 208733 208573 208959 209326 209115 208118 206414 204582 203587 203796 204431 204608 204475 204583 204657 203997
56407B03997j172p12L0P9l38m12q1K46N35P86N68j96o27j9J037J549J541J616
$$ 203997 202825 202113 202143 202222 201884 201472 201391 201637 202172 202958 203526 203330 202703 202684 203721 205270 206811 208427
56389B08427J752J618J574K156K947L090K673K497K654K536K115K037K360K328
$$ 208427 210179 211797 213371 215527 218474 221564 224237 226734 229388 231924 234039 236076 238436 240764
56375B40764J662J004P97O45K35Q6P25J728K185J830J186P41M25n7p18j209j276
$$ 240764 242426 243430 244227 244872 245107 245193 245918 247646 249831 251661 252847 253588 254013 253956 253238 252029 250753
56358B50753j090r85r58o87q5N04Q03R29J060J114J009R01R46J118J437J983K491
$$ 250753 249663 248678 247720 247033 246948 247452 248255 249184 250244 251358 252367 253268 254214 255332 256769 258752 261243
56341B61243K379J520N11r6l85n74n19q3M42Q69J504K544L511L838L641L366L095
$$ 261243 263622 265142 265653 265557 265172 264598 264079 263996 264438 265307 266811 269355 272866 276704 280345 283711 286806
56324B86806K728K435K348K222J871J561J427J075L22k72k78j85n11p52j58R03
$$ 286806 289534 291969 294317 296539 298410 299971 301398 302473 302795 302523 302245 302060 301549 300797 300639 301542
56308C01542J448J324J167J177J015P43Q37J328J869K469L239L680L284K614K610
$$ 301542 302990 304314 305481 306658 307673 308416 309253 310581 312450 314919 318158 321838 325122 327736 330346
56293C30346L019K821K141K237L330M070L638K992L170L702L688L447L857M835
$$ 330346 333365 336186 338327 340564 343894 347964 351602 354594 357764 361466 365154 368601 372458 377293
56279C77293N579N923O423P302Q165Q660Q722Q369P910Q100R415J1261J2599J3276
$$ 377293 382872 388795 395218 402520 410685 419345 428067 436436 444346 452446 461861 473122 485721 498997
56265D98997J4090J5499J7033J8211J9386K1215K3664K6118K8348L0908L4437
$$ 498997 513087 528586 545619 563830 583216 604431 628095 654213 682561 713469 747906
56254G47906L8928M3891M9049N4605O0868O7860P5293Q2814R0193R7437J04646
$$ 747906 786834 830725 879774 934379 995247 1063107 1138400 1221214 1311407 1408844 1513490
56243A513490J11558J17282J20845J21999J21163J18493J13430J05435R4765Q2176
$$ 1513490 1625048 1742330 1863175 1985174 2106337 2224830 2338260 2443695 2538460 2620636
56233B620636O8034N2062L3883J3706p352k7588m5698o1518p5509q7546r6845
$$ 2620636 2688670 2740732 2774615 2788321 2780969 2753381 2707683 2646165 2570656 2483110 2386265
56222B386265j03185j07410j10208j11163j09601j05910j01207r6149r0748q5079
$$ 2386265 2283080 2175670 2065462 1954299 1844698 1738788 1637581 1541432 1450684 1365605
56212A365605p9402p3700o7774o1771n6068n0776m5836m1451l7879l4866l1774
$$ 1365605 1286203 1212503 1144729 1082958 1026890 976114 930278 888827 850948 816082 784308
56201G84308k8297k4684k1377j8715j6779j5265j3721j2143j0980j0328r607q382
$$ 784308 756011 731327 709950 691235 674456 659191 645470 633327 622347 612019 602412 594030
56189E94030o986n905n115m492m216m217l880k996k281k203k074j245m42p11j617
$$ 594030 587044 581139 576024 571532 567316 563099 559219 556223 553942 551739 549665 548420 547978 547267 545650
56174E45650j805r87j0P52J713K788L232K884K465K396K385K297K528L248M142
$$ 545650 543845 542858 542848 543600 545313 548101 551333 554217 556682 559078 561463 563760 566288 569536 573678
56159E73678N059O128P206P971Q558R324J0149J0779J1665J3450J5845J8106K0402
$$ 573678 578737 584865 592071 600042 608600 617924 628073 638852 650517 663967 679812 697918 718320
56146G18320K3517K7346L1076L4817L9607M5622N1841N7766O3950P0367P5699
$$ 718320 741837 769183 800259 835076 874683 920305 972146 1029912 1093862 1164229 1239928
56135A239928P8921Q0327Q0374P8755P5431P1275O6786O1181N3824M5695L8356
$$ 1239928 1318849 1399176 1479550 1558305 1633736 1705011 1771797 1832978 1886802 1932497 1970853
56124A970853L2123K6241K0341J4698R350L826k374r594j8039k7401l6683m4777
$$ 1970853 2002976 2029217 2049558 2064256 2073606 2077432 2075058 2065464 2047425 2020024 1983341 1938564
56112A938564n1294n6661o1630o6721p1663p5303p6448p4954p1514o6555o0005
$$ 1938564 1887270 1830609 1768979 1702258 1630595 1555292 1478844 1403890 1332376 1265821 1205816
56101A205816n2155m3965l6259k9201k2813j7332j2887r289o395m187k516j197
$$ 1205816 1153661 1109696 1073437 1044236 1021423 1004091 991204 981915 975520 971333 968817 967620
56089I67620l02J90Q18J997L213L722L772M215N027N401N216N271N858O323O306
$$ 967620 967318 967508 968326 970323 973536 977258 981030 985245 990272 995673 1000889 1006160 1012018 1018341 1024647
56074A024647O374P011P931Q727R459J0291J1194J2140J2998J3300J2839J2318
$$ 1024647 1031021 1038032 1045963 1054690 1064149 1074440 1085634 1097774 1110772 1124072 1136911 1149229
56062A149229J2646J3808J5265J6895J8584J9461J8986J8312J8971K0554K1378
$$ 1149229 1161875 1175683 1190948 1207843 1226427 1245888 1264874 1283186 1302157 1322711 1344089
56051A344089K1141K1039K1399K1226K0251J9478J9348J9293J9386K0502K2393
$$ 1344089 1365230 1386269 1407668 1428894 1449145 1468623 1487971 1507264 1526650 1547152 1569545
56040A569545K3532K3486K3582K4628K5764K6249K6602K7293K7988K8797L0551
$$ 1569545 1593077 1616563 1640145 1664773 1690537 1716786 1743388 1770681 1798669 1827466 1858017
56029A858017L3234L5670L7437L9361M1642M3265M3855M4383M5490M6840M8496
$$ 1858017 1891251 1926921 1964358 2003719 2045361 2088626 2132481 2176864 2222354 2269194 2317690
56018B317690N0966N3587N4958N5487N7214O0633O4086O6843P0117P4275P7837
$$ 2317690 2368656 2422243 2477201 2532688 2589902 2650535 2714621 2781464 2851581 2925856 3003693
56007C003693Q0401Q3825Q9125R4696R9007J02739J06981J11572J16473J22501
$$ 3003693 3084094 3167919 3257044 3351740 3450747 3553486 3660467 3772039 3888512 4011013
55997D011013J29523J36350J43241J51956J62406J72298J81149J91354K04045
$$ 4011013 4140536 4276886 4420127 4572083 4734489 4906787 5087936 5279290 5483335
55988E483335K17322K30158K44515K61793K80630L00200L22205L47642L75129
$$ 5483335 5700657 5930815 6175330 6437123 6717753 7017953 7340158 7687800 8062929
55979H062929M04405M37794M76176N17481N61419O11547O70119P35361Q06616
$$ 8062929 8467334 8905128 9381304 9898785 10460204 11071751 11741870 12477231 13283847
55970A3283847Q87896R83387J093911J221127J370746J548634J758771K008791
$$ 13283847 14171743 15155130 16249041 17470168 18840914 20389548 22148319 24157110
55962B4157110K313267K689152L154785L738228M481171N428920O618529Q076612
$$ 24157110 26470377 29159529 32314314 36052542 40533713 45962633 52581162 60657774
55954F0657774R820882J1859146J4186741J6771863J9516480K2217165K4568506
$$ 60657774 70478656 82337802 96524543 113296406 132812886 155030051 179598557
55947A79598557K6203563K6735000K5824929K3342762J9521121J4870155R794653
$$ 179598557 205802120 232537120 258362049 281704811 301225932 316096087 325890740
55940C25890740M268472k010581r063317j6246629k2465558k6767184k8771120
$$ 325890740 330159212 328148631 319085314 302838685 280373127 253605943 224834823
55933B24834823k8674379k7001589k4361699k1297390j8205104j5320935j2763448
$$ 224834823 196160444 169158855 144797156 123499766 105294662 89973727 77210279
55926G7210279j0582014q775115p300692o102329n131813m348074l710285l184362
$$ 77210279 66628265 57853150 50552458 44450129 39318316 34970242 31259957 28075595
55918B8075595k749579k390823k090423j833428j613722j427910j268391j127773
$$ 28075595 25326016 22935193 20844770 19011342 17397620 15969710 14701319 13573546
55910A3573546j004497q98407q05513p22024o48909n87482n34537m86388m43784
$$ 13573546 12569049 11670642 10865129 10143105 9494196 8906714 8372177 7885789 7442005
55901G442005m08407l78063l49573l23216l00313k79355k58364k38405k21177
$$ 7442005 7033598 6655535 6305962 5982746 5682433 5403078 5144714 4906309 4685132
55892D685132k05540j89698j74566j61850j50961j40626j31430j24082j17240
$$ 4685132 4479592 4289894 4115328 3953478 3802517 3661891 3530461 3406379 3289139
55883C289139j09704j02792r8057r4490r0275q5512q1047p6524p1780o8324o7205
$$ 3289139 3179435 3076643 2978586 2884096 2793821 2708309 2627262 2550738 2478958 2410634 2343429
55872B343429o7129o6615o6340o7340o8710o9077o8740o8397o7323o4718o1421
$$ 2343429 2276300 2209685 2143345 2076005 2007295 1938218 1869478 1801081 1733758 1669040 1607619
55861A607619n8449n5242n1063m6697m3099l9736l5967l2594l0467k8869k6885
$$ 1607619 1549170 1493928 1442865 1396168 1353069 1313333 1277366 1244772 1214305 1185436 1158551
55850A158551k5060k4138k3456k2166k0860k0494k0820k1193k1762k2599k2911
$$ 1158551 1133491 1109353 1085897 1063731 1042871 1022377 1001557 980364 958602 936003 913092
55839I13092k2303k1578k1132k0028j7799j5710j4883j4695j4228j3770j3437
$$ 913092 890789 869211 848079 828051 810252 794542 779659 764964 750736 736966 723529
55828G23529j2082r209o557n931o819p716q485r631j0547j0447j0054j0490j1341
$$ 723529 711447 702238 695681 689750 682931 675215 666730 657099 646552 636105 626051 615561 604220
55815F04220j1485j1115j1137j1377j0993j0080r263q297o633m805l837l642l365
$$ 604220 592735 581620 570483 559106 548113 538033 528770 520473 513840 509035 505198 501556 498191
55802D98191k824k433k134j603r88m18O87K661M581N277M901M494M522M740M944
$$ 498191 495367 492934 490800 489197 488209 487791 488478 491139 495720 500997 505898 510392 514914 519654 524598
55787E24598M978M564L810L206K519P09k301m993o396p693j0403j3999j6667j7626
$$ 524598 529576 534140 537950 541156 543675 544384 542083 537090 530694 523001 512598 498599 481932 464306
55773D64306j7223j5591j2654r111o092m092l042k889l293l462l192l338m418
$$ 464306 447083 431492 418838 409727 403635 399543 396501 393612 390319 386857 383665 380327 375909
55760C75909n588n915n630n265m588l568l212m085n003m640l613l440m282n180
$$ 375909 370321 364406 358776 353511 348923 345355 342143 338058 333055 328415 324802 321362 317080 311900
55746C11900n813o475o864o431n515m771m033l004k374k802l376k758j320o34
$$ 311900 306087 299612 292748 286317 280802 276031 271998 268994 266620 263818 260442 257684 256364 255730
55732B55730j156k008k705l471m045l764k843k251k310k575k949l638m271m256
$$ 255730 254574 252566 249861 246390 242345 238581 235738 233487 231177 228602 225653 222015 217744 213488
55718B13488l876l778l644k630r78J71M88P12J304J992K629L273L469K706J497
$$ 213488 209612 205834 202190 199560 198582 198753 199241 199953 201257 203249 205878 209151 212620 215326 216823
55703B16823R10J013Q42q6j316k329k908k835k305k363l754n602o387n959n248
$$ 216823 217733 218746 219588 219502 218186 215857 212949 210114 207809 205446 201692 196090 189703 183744 178496
55688A78496m388k792q62J42J04K07P64O09p21j830j409r8N75K30k78k91pl9p34
$$ 178496 174108 171316 170454 170596 170700 170907 171671 172280 171559 169729 168320 168222 168797 169027 168749 168458 168451 168412 167678
55669A67678j763k309k016j536j636k054j966j337q48o89m45j14r5j85L34J429
$$ 167678 165915 163606 161590 160054 158418 156364 154398 153061 152213 151524 151079 150965 150870 150685 151019 152448
55653A52448K224K318K183K119J872J516J598K105K302J957J760K102K361J891
$$ 152448 154672 156990 159173 161292 163164 164680 166278 168383 170685 172642 174402 176504 178865 180756
55639A80756Q84j68j154k039k583k789l008l340l496l471l649m020m036l511k870
$$ 180756 181640 181472 180318 178279 175696 172907 169899 166559 163063 159592 155943 151923 147887 144376 141506
55624A41506k344j651p82l08n31j019j320j450j437j122p04p81j426j957j951
$$ 141506 139162 137511 136729 136421 135890 134871 133551 132101 130664 129542 128838 128057 126631 124674 122723
55609A22723j791j837j846j660j700k182k472j959j079p89j210j462p73O19J717
$$ 122723 120932 119095 117249 115589 113889 111707 109235 107276 106197 105408 104198 102736 101963 102582 104299
55594A04299J721P10n31j358j719j686j067N9Q63N72l60p69l01K96M29L35M39
$$ 104299 106020 106730 106199 104841 103122 101436 100369 100428 101291 101863 101503 100734 100433 100729 101158 101493 101932
55577A01932Q08J397K084K396J926J249J545L025M488M786M100L386L151L108
$$ 101932 102740 104137 106221 108617 110543 111792 113337 116362 120850 125636 129736 133122 136273 139381
55563A39381K637J317o66k495l516l898m147m197l725l085k929l027k518j483
$$ 139381 142018 143335 142669 140174 136658 132760 128613 124416 120691 117606 114677 111650 109132 107649
55549A07649j092j905l015l358k960k353j686r37l69j48q6q8l21n93l29M99J179
$$ 107649 106557 104652 101637 98279 95319 92966 91280 90343 89974 89826 89740 89652 89331 88738 88409 88908 90087
55532I0087J278J145J058P86L34K34M76J31j243k618k829k102j409r18j91N46
$$ 90087 91365 92510 93568 94354 94688 94922 95398 95529 94286 91668 88839 86737 85328 84410 84219 84765
55516H4765M48o13j694j831r37L69J288J310N90j22k04K51P70J083J069N17n30
$$ 84765 85213 84600 82906 81075 80138 80507 81795 83105 83695 83573 83369 83620 84390 85473 86542 87059 86529
55499H6529j387j231l2J330J926J564P94L12K80K11l44j178j692j714j561j373
$$ 86529 85142 83911 83879 85209 87135 88699 89493 89805 90085 90296 89952 88774 87082 85368 83807 82434
55483H2434q65Q1J088J680J639R45j91j157j350r18n59n77o57o68q79j237j155
$$ 82434 81569 81650 82738 84418 86057 87002 86811 85654 84304 83386 82827 82250 81593 80925 80046 78809 77654
55466G7654m52K14K50j47n39q92j228j168m28O57J510J851J557N51p75j553j418
$$ 77654 77202 77416 77666 77519 76980 76088 74860 73692 73264 73921 75431 77282 78839 79390 78615 77062 75644
55449G5644r86q85q07j19R80J629J464Q75K74l41r85j345j072k97L50L00l18p28
$$ 75644 74658 73773 72966 72847 73827 75456 76920 77795 78069 77728 76743 75398 74326 74029 74379 74679 74361 73633
55431G3633m02K82O11N07M23N14M96K93J38J8k59m36l7P20J021P05M90O97O93
$$ 73633 73231 73513 74124 74631 75054 75568 76064 76357 76495 76513 76254 75818 75781 76501 77522 78227 78717 79414 80107
55412H0107K5p20q49n68m92o50n89r6O26J111Q48j61r54n40O32J068L41l08N1
$$ 80107 80132 79412 78563 77995 77503 76853 76264 76168 76794 77905 78753 78592 77638 77098 77730 78798 79139 78831 78882
55393G8882P40Q06N22N19N03m8o12l81L15M68q5o50q60q36n05K00P11M06l13m85
$$ 78882 79622 80428 80950 81469 81972 81924 81312 80931 81246 81714 81629 80979 80119 79283 78778 78978 79689 80095 79782 79297
55373G9297j7K91L8l58n61p76j129j331j115n38K61J151J912K374K584K456J630
$$ 79297 79280 79571 79609 79251 78690 77914 76785 75454 74339 73801 74062 75213 77125 79499 82083 84539 86169
55356H6169J38j161j463j084r81j428j847j843j656j536j291o18M62J483J770
$$ 86169 86307 85146 83683 82599 81618 80190 78343 76500 74844 73308 72017 71399 71861 73344 75114
55341G5114J075J70K73J472K314J589j8q83n78j65n06j354k032k226j951j374
$$ 75114 76189 76359 76632 78104 80418 82007 81989 81106 80528 80363 79857 78503 76471 74245 72294 70920
55325G0920q47n97l60K41J018J375J086M77k0j29K65R14J211Q23J52k97o11j070
$$ 70920 70073 69476 69116 69357 70375 71750 72836 73313 73293 73164 73429 74343 75554 76377 76529 76232 75621 74551
55307G4551j450j314p10KO97J249J210M98n4L69J296J572R35J66k02l46l90j20
$$ 74551 73101 71787 71077 71079 71776 73025 74235 74733 74679 75048 76344 77916 78851 79017 78815 78469 78079 77959
55289G7959M40Q97J059R89O60J38n4M34R41N31n83j267j159j071j538j947j563
$$ 77959 78399 79296 80355 81344 82004 82142 82088 82522 83463 83994 83411 82144 80985 79914 78376 76429 74866
55272G4866o03J91M61K91j31n56o53k83M19J185J668J549J011Q04J334J961J820
$$ 74866 74263 74454 74915 75206 75075 74519 73866 73583 74002 75187 76855 78404 79415 80219 81553 83514 85334
55255H5334J053M82L31J84JJ20L46M4p38j204j084r31j048j013o63m89o84o99
$$ 85334 86387 86869 87200 87384 87385 87505 87851 87895 87157 85953 84869 83938 82890 81877 81214 80725 80041 79342
55237G9342k33J73Lm76q16j040j134o69M71J511J642J032M79M02O94J142J431
$$ 79342 79109 79282 79285 78809 77993 76953 75819 75150 75621 77132 78774 79806 80285 80687 81381 82523 83954
55220H3954J122K49l60M4J050J451O97m86j060q34m58m74o82n46J03R79J770K193
$$ 83954 85076 85325 84965 85009 86059 87510 88207 87721 86661 85827 85369 84895 84213 83667 83770 84749 86519 88712
55202H8712J756K26j540k033q81N21P77J20m34p87j451k159k091j285n93l31j10
$$ 88712 90468 90694 89154 87121 86240 86761 87538 87658 87224 86437 84986 82827 80736 79451 78858 78527 78417
55185G8417O4k05n94k64O73J141P78M18N72O58J88m90j003j420j461n26R45J444
$$ 78417 78481 78276 77682 77418 78091 79232 80010 80428 81000 81658 81846 81356 80353 78933 77472 76946 77891 79335
55167G9335M49o48n02M69J183J608K204K656K388J691J168O94p3p15o72l45m82
$$ 79335 79784 79136 78634 79103 80286 81894 84098 86754 89142 90833 92001 92695 92622 91907 91235 90890 90408
55150I0408r23r52n82l42k18J82O07M08k93p09n63k91n7M34J073J174M42n25r39
$$ 90408 89485 88533 87951 87609 87391 87573 88180 88588 88295 87586 87023 86732 86675 87109 88182 89356 89798 89273 88334
55131H8334n52L42J170J344P51J7j72Q0J44j70l89j28M55R29R59M39l91r80r24
$$ 88334 87782 88124 89294 90638 91389 91406 91234 91314 91458 91288 90899 90771 91226 92155 93114 93553 93162 92182 91258
55112I1258k99N10J122J090R5j434k380k098j174m84k0O74J405J530J057O41N68
$$ 91258 90959 91469 92591 93681 93776 92342 89962 87864 86690 86206 86186 86860 88265 89795 90852 91493 92061
55095I2061N01L05L07O13P89M79r1m38l55n2Q8q0j78K95J136J453Q15j03n48p25
$$ 92061 92562 92867 93174 93787 94576 95055 94964 94526 94171 94119 94207 94127 93949 94244 95380 96833 97648 97545 96997 96272
55075I6272j100j255m53Q98J452O69n39j080q03k07K52L90K88K55L94L21k09o26
$$ 96272 95172 93917 93464 94362 95814 96483 95944 94864 94061 93854 94106 94496 94784 95039 95433 95754 95545 94919
55057I4919k59N05O94K61Q8L68J83r10j943j867j011m11l42l49k81m01o54n91
$$ 94919 94660 95165 95859 96120 96208 96576 96759 95849 93906 92039 91028 90617 90275 89926 89645 89244 88590 87999
55039H7999o9M99O70M30Q4p2M7K74L64K39K3j51j82L5M58P40N63R4k31l22m31
$$ 87999 87930 88429 89099 89529 89613 89541 89588 89862 90226 90465 90488 90337 90155 90190 90648 91388 91951 92045 91814 91492 91061
55018I1061n45l73K2J17k60n87l84K00Q33J479K039K041J258K07m67p81j040j017
$$ 91061 90516 90143 90165 90282 90022 89435 89051 89251 90084 91563 93602 95643 96901 97108 96641 95860 94820 93803
55000I3803l07P03J000K57o79q66l38K19M85P38J243J762J794J143J91m18l36
$$ 93803 93496 94199 95199 95456 94777 93911 93573 93792 94277 95015 96258 98020 99814 100957 101148 100730 100394
54983A00394K27P93J084J086Q29L22k80o38n69k68j32l32o34o17j19N59Q72N73
$$ 100394 100621 101414 102498 103584 104413 104735 104455 103817 103248 102980 102848 102516 101882 101265 101146 101705 102577 103150
54965A03150kk36J05N79N70K6m04j10P14J252R95K84j98k26q1NR5K07J99J19K78
$$ 103150 103148 102912 103017 103596 104166 104192 103788 103678 104392 105644 106639 106923 106725 106499 106418 106423 106518 106725 106924 107043 107321
54944A07321O90P36o8j165j398m91N18O20J39Q3N69O91j5p26m60N06R94N50m6
$$ 107321 108011 108747 108679 107514 106116 105625 106143 106763 106902 106985 107554 108245 108230 107504 107044 107550 108544 109094 109048
54925A09048O0P00J146J318J913L337M921N538M867L753L202L330L534L459L316
$$ 109048 109108 109808 110954 112272 114185 117522 122443 127981 132848 136601 139803 143133 146667 150126 153442
54910A53442L260L013K390J730J401J129L36j116k911m753o353p104o534n121
$$ 153442 156702 159715 162105 163835 165236 166365 166701 165585 162674 157921 151568 144464 137930 132809
54896A32809l974l573l372k826k141j718j460j128q89r69j065o53K40J033J307
$$ 132809 128835 125262 121890 119064 116923 115205 113745 112617 111728 110759 109694 109041 109281 110314 111621
54881A11621J176J017J123J607K419L348M137M538M426M028L928M440M986M602
$$ 111621 112797 113814 114937 116544 118963 122311 126448 130986 135412 139440 143368 147808 152794 157396
54867A57396L212J863J459J721J725R61m78k304m036n045n156n017n261n600n295
$$ 157396 160608 162471 163930 165651 167376 168337 167859 165555 161519 156474 151318 146301 141040 135440 130145
54852A30145m318l401k935k525j760q92m79o89j186j534j579j507j544j679j707
$$ 130145 125827 122426 119491 116966 115206 114314 113835 113146 111960 110426 108847 107340 105796 104117 102410
54837A02410j550j286q36o9O90P73J09m47k01M04M74o8n31n31k82j2K47K81j51
$$ 102410 100860 99574 98738 98669 99359 100132 100241 99794 99593 99997 100471 100403 99872 99341 99059 99047 99294 99575 99424
54818I9424p29p64j31N22O63M35K26J11or4r5p7j13j64j37L6L77P25P90N36L50
$$ 99424 98695 97931 97800 98322 98985 99420 99646 99757 99751 99657 99562 99485 99372 99208 99071 99107 99484 100209 100999 101535 101885
54797A01885M95O52M04l4j09K05L83J26l10o39q03p48l91J20N52R90J589K065
$$ 101885 102380 103032 103436 103402 103293 103498 103881 104007 103697 103058 102255 101507 101116 101236 101788 102778 104367 106432
54779A06432J947J379R60Q57O77L26K29M88O57O39R96J969K883L094K935L068
$$ 106432 108379 109758 110718 111575 112252 112578 112807 113295 113952 114591 115587 117556 120439 123533 126468 129536
54763A29536L456L669L819M353N129N500N252M819M469L930K977J841P50n18k220
$$ 129536 132992 136661 140480 144833 149962 155462 160714 165533 170002 173932 176909 178750 179500 178982 176762
54748A76762m007n183n490n347n149m761l918k926k464k673k900k583k010j833
$$ 176762 172755 167572 162082 156735 151586 146825 142907 139981 137517 134844 131944 129361 127351 125518
54734A25518k104k207j686p05K20O61N37K56M45J222J912J950J806K399L667M547
$$ 125518 123414 121207 119521 118816 119036 119697 120234 120490 120935 122157 124069 126019 127825 130224 133891 138438
54718A38438M418L828L524L474L315L100L030K854K165J081Q8p15j678k976m294
$$ 138438 142856 146684 150208 153682 156997 160097 163127 165981 168146 169227 169315 168600 166922 163946 159652
54703A59652n221n634n647n366m824m080l280k616k124j643r96k46L63N97L00
$$ 159652 154431 148797 143150 137784 132960 128880 125600 122984 120860 119217 118221 117975 118338 118935 119235
54688A19235n82j738k437k101j006j19j26p89j299j100l82J21p2n79n50J60O85
$$ 119235 118653 116915 114478 112377 111371 111252 111126 110337 109038 107938 107556 107677 107605 107026 106476 106636 107321
54671A07321L77j71j0P09R72M34k31m81m05o3P03J469J308J54p97o81j70l08r00
$$ 107321 107698 107527 107517 108226 109198 109632 109401 108920 108515 108452 109155 110624 111932 112086 111289 110608 110438 110130 109230
54652A09230r75l84Q2K6o5K40O31N73J11j76J12P09R62O37K83N18J108J238O64
$$ 109230 108255 107871 107953 107979 107914 108154 108785 109358 109469 109293 109405 110114 111076 111713 111996 112514 113622 114860 115524
54633A15524J1k11k24l57n07n76q15j217j202m97K40K83j24k94j69j57k79k65
$$ 115524 115535 115324 115100 114743 114236 113660 112845 111628 110426 109929 110169 110452 110328 110034 109865 109708 109429 109164
54615A09164j95k74k69N3J56n35j361r98N86J803J473K59m49l56k15n17r24r08
$$ 109164 108969 108695 108426 108479 108635 108100 106739 105741 106327 108130 109603 109862 109413 109057 108842 108325 107401 106493
54597A06493l85K84O56O05M56O16R77R64L47l04k74L40P16L22m78r33p60l24n1
$$ 106493 106108 106392 107048 107653 108109 108725 109702 110666 111013 110709 110435 110775 111491 111813 111335 110402 109642 109318 109267
54578A09267M2J77L95N03L78J23j15j92K4M95Q01M51m31j109j022l47M67J272
$$ 109267 109309 109486 109881 110384 110762 110885 110770 110578 110602 111097 111898 112349 111918 110809 109787 109440 109907 111179
54560A11179K017K319J774O50k48m73l94o47j342j901j675o95K47M33N4l7N46
$$ 111179 113196 115515 117289 117939 117691 117218 116824 116177 114835 112934 111259 110564 110811 111244 111298 111261 111807
54543A11807J275J527J407J391J561J595J357R72N25L8l18l45j42j1j08l26m46
$$ 111807 113082 114609 116016 117407 118968 120563 121920 122892 123417 123455 123137 122792 122650 122639 122531 122205 121759
54526A21759k28M19J146J363R39M10K67L48K86J30M7j81p69j347j384j043r49
$$ 121759 121531 121950 123096 124459 125398 125808 126075 126423 126709 126839 126886 126705 125936 124589 123205 122162 121213
54509A21213j231j376j042m73p7n2l65o86n22J49N62Q9p12o73M61J806K546K600
$$ 121213 119982 118606 117564 117091 117014 116962 116597 115911 115389 115538 116100 116189 115477 114804 115265 117071 119617 122217
54491A22217K008P12q24j645j428q75n90k94L16P32M12j59r5M81N49k49r38m28
$$ 122217 124225 124937 124113 122468 121040 120165 119575 119281 119597 120329 120741 120582 120487 120968 121517 121268 120330 119902
54473A19902J109K394K357J157r9m51K3M65L22RL04J246J970J716P64Q2J09K12
$$ 119902 121011 123405 125762 126919 126820 126369 126392 126857 127179 127188 127492 128738 130708 132424 133188 133270 133379 133591
54455A33591m08j490j902j088J99Q65P45M11J10m32j233j829j895j528q04L34
$$ 133591 133183 131693 129791 128703 128902 129767 130512 130923 131033 130601 129368 127539 125644 124116 123312 123646
54439A23646J535J955J165j72r22o11K85R37Q19N8o51o24Q8P58Q35N23L05K36
$$ 123646 125181 127136 128301 128129 127207 126596 126881 127818 128637 128695 128044 127420 127508 128266 129101 129624 129929 130165
54421A30165K9l80o90o21k47J21K83L68O09R20R18N67L92O61P10j80j393j487
$$ 130165 130194 129814 129124 128503 128256 128377 128660 129028 129637 130557 131475 132042 132434 133095 133805 133625 132232 130745
54403A30745j69J108R98j91j236j477q66N23K103K594J346m57j058l45L02K05
$$ 130745 130576 131684 132682 132491 131255 129778 128912 129435 131538 134132 135478 135021 133963 133618 133920 134125
54387A34125Q5M31N84M7m96l09J03j33p70q26j80K76K3m37m62p3L23N02M65L04
$$ 134125 134210 134641 135225 135272 134776 134467 134570 134437 133667 132841 132661 132937 132960 132523 132061 131988 132311 132813 133278 133582
54367A33582K02K99M71N07N36Q44J326J546J416J275J199Q06L9m68k89M0k65j063
$$ 133582 133784 134083 134554 135061 135597 136441 137767 139313 140729 142004 143203 144009 144048 143580 143291 143331 143066 142003
54349A42003j435q97J06Q71J087Q38L80L3J6L50J038K088L104L296K420J416J369
$$ 142003 140568 139671 139777 140648 141735 142573 142953 142986 143002 143352 144390 146478 149582 152878 155298 156714 158083
54332A58083K032K196J463O63M49M96M24M95Q12P51o6j020j453j758k541l365
$$ 158083 160115 162311 163774 164437 164886 165382 165806 166301 167113 167864 167798 166778 165325 163567 161026 157661
54316A57661l343k584j953j675j295q86j131j986k406j809q67m53n51o92q07j072
$$ 157661 154318 151734 149781 148106 146811 145925 144794 142808 140402 138593 137726 137273 136722 136030 135223 134151
54300A34151j429j625j484q28L23J311J213P4q62o71J34N39M34L45K69k16q36
$$ 134151 132722 131097 129613 128785 129108 130419 131632 131706 130844 130173 130307 130846 131280 131625 131894 131678 130842
54283A30842o95M01J468J546P58j25o31o88k54O29J542J913J517N55o35j675k089
$$ 130842 130147 130548 132016 133562 134320 134195 133564 132876 132622 133251 134793 136706 138223 138778 138143 136468 134379
54266A34379j571m47M79O90M07J57J52K79N09R50J553K053K187J848J053N0o57
$$ 134379 132808 132361 132840 133530 133937 134094 134246 134525 135034 135984 137537 139590 141777 143625 144678 144728 144071
54249A44071p54n77o37q05m82L22P26J78p24j098r18p00n65l72m15j032j639j189
$$ 144071 143317 142740 142103 141298 140816 141138 141864 142042 141318 140220 139302 138602 138037 137665 137250 136218 134579 133390
54231A33390K81J408J135j32j292j796j751j328o17J69Q09J176J112N25k56o32
$$ 133390 133671 135079 136214 136082 134790 132994 131243 129915 129298 129467 130276 131452 132564 133089 132833 132201
54215A32201m43j53q6K3M54R18R99P69N31K95l4k67k34k42o23j023p07M11J523
$$ 132201 131758 131605 131519 131542 131996 132914 133913 134682 135213 135508 135474 135207 134973 134731 134108 133085 132378 132789 134312
54196A34312J822J296N51K09N35J314J953J891J087M1p28j090j202j200j113r46
$$ 134312 136134 137430 137981 138190 138725 140039 141992 143883 144970 145011 144283 143193 141991 140791 139678 138732
54180A38732p77o85p05q24j034j284j381j072l95J93L12J39J40L40L45J07J31
$$ 138732 137955 137270 136565 135741 134707 133423 132042 130970 130575 130768 131080 131219 131359 131699 132044 132151 132282
54163A32282O88J223J015J87m61n04l41n01q74q56k14M86M45l93j158j039k42
$$ 132282 132970 134193 135208 135395 134934 134430 134089 133588 132714 131858 131644 132130 132575 132182 131024 129985 129743
54146A29743L86N17O18J002J275J067P00O11N19r2r44j132m31L29M10J17K30Q74
$$ 129743 130129 130646 131264 132266 133541 134608 135308 135919 136438 136346 135402 134270 133839 134168 134578 134695 134925 135799
54128A35799J441J457J007M29l5k22r7O3j36o23p39m7R93J521J342J035J013J013
$$ 135799 137240 138697 139704 140133 140098 139876 139779 139842 139706 139083 138344 138297 139290 140811 142153 143188 144201 145214
54110A45214O51N2m04n77m96j51L35N95M50J98R3r8o22j166j255r80p26m99j15
$$ 145214 145865 145917 145513 144936 144440 144289 144624 145219 145669 145867 145960 145862 145240 144074 142819 141839 141113 140614 140499
54091A40499J65j4k71J32J071J604J301P22L78J13k03k57J0K3n11r85p22P6P51
$$ 140499 140664 140650 140379 140511 141582 143186 144487 145209 145587 145700 145497 145240 145250 145273 144762 143777 143055 143131 143882
54072A43882J089J258J282J142J042J091J030O77L10J93J65O4J09M29O45M39J24
$$ 143882 144971 146229 147511 148653 149695 150786 151816 152493 152803 152996 153161 153225 153334 153763 154408 154847 154971
54055A54971J55M77Q41J241J592J477Q41L88O04R77R43J018J945L204L565K896
$$ 154971 155126 155603 156444 157685 159277 160754 161595 161983 162587 163564 164507 165525 167470 170674 174239 177135
54039A77135K309K507L137L823M645N315N098M060L491M377O116P372P667P519
$$ 177135 179444 181951 185088 188911 193556 198871 203969 208029 211520 215897 222013 229385 237052 244571
54025B44571P440P433P305O947O379N771N343N036M444L186J189j431m443p364
$$ 244571 252011 259444 266749 273696 280075 285846 291189 296225 300669 303855 305044 303613 299170 291806
54011B91806r609j0944j1540j1534j0888r759q557p398n975m286l002k674k863
$$ 291806 282197 271253 259713 248179 237291 227532 218975 211577 205602 201316 198314 195640 192777
53998A92777k674j987j578j894k309j989j072m66n48p07l65M8k55j144j636j258
$$ 192777 190103 188116 186538 184644 182335 180346 179274 178808 178260 177553 177188 177236 176981 175837 174201 172943
53982A72943o17m21n63o41p41j112j446j190l97L07M96K29k70p25p55k87J91K68
$$ 172943 172326 171905 171342 170701 169960 168848 167402 166212 165815 166122 166618 166847 166577 165852 165097 164810 165001 165269
53964A65269K95P49J247J023K40j22K42O29O84J070K206L236L050J797O89N29
$$ 165269 165564 166313 167560 168583 168823 168701 168943 169572 170256 171326 173532 176768 179818 181615 182304 182833
53948A82833J117J795K116K050J906J966K008J561Q11O95J672K919L391L232L352
$$ 182833 183950 185745 187861 189911 191817 193783 195791 197352 198163 198858 200530 203449 206840 210072 213424
53933B13424L933M258L991L692L813M016L913L776L915L875L007J617Q11J147
$$ 213424 217357 221615 225606 229298 233111 237127 241040 244816 248731 252606 255613 257230 258041 259188
53919B59188K054K708K905K868K729K611K866L642M413M409L566K587K058J871
$$ 259188 261242 263950 266855 269723 272452 275063 277929 281571 285984 290393 293959 296546 298604 300475
53905C00475J565Q72k05j406k222k211j537r01q13j212j905k919m162n125n344
$$ 300475 302040 302912 302707 301301 299079 296868 295331 294430 293617 292405 290500 287581 283419 278294 272950
53890B72950m940m380l919l555l306l219l247l299l253k865j992j021n76o20l23
$$ 272950 268010 263630 259711 256156 252850 249631 246384 243085 239832 236967 234975 233954 233378 232758 232435
53875B32435Q44K381L510M099M469M807N297O288P696Q738Q825Q283P588O425
$$ 232435 233279 235660 239170 243269 247738 252545 257842 264130 271826 280564 289389 297672 305260 311685
53861C11685M388J937k75k552n552q866j1334j2626j3274j3313j2151r945p846
$$ 311685 316073 318010 317735 315183 309631 300765 289431 276805 263531 250218 238067 228122 220276
53848B20276o533n563m487l634l354l382l333l112k578j577n47j86l21o6O65Q59
$$ 220276 213743 208180 203693 200059 196705 193323 189990 186878 184300 182723 182176 181990 181669 181603 182268 183127
53832A83127K3r72j268j172j299j438j093m31Q6L83M77J74l06j96P04J453J280
$$ 183127 183150 182178 180910 179738 178439 177001 175908 175477 175563 175946 176423 176597 176291 176095 176799 178252 179532
53815A79532P32P16J111J247J136J222J434J420J355J625K058K299K588L263L897
$$ 179532 180264 180980 182091 183338 184474 185696 187130 188550 189905 191530 193588 195887 198475 201738 205635
53800B05635L854L415L361L694L714L233K753K530K296J881J363P08L4j05N45
$$ 205635 209489 212904 216265 219959 223673 226906 229659 232189 234485 236366 237729 238437 238471 238366 238911
53785B38911J137O89l86q09l80j82p61j411j595j805k429k841k497j999k214k947
$$ 238911 240048 240737 240351 239542 239162 238980 238219 236808 235213 233408 230979 228138 225641 223642 221428 218481
53769B18481l347l201k916k584j955j279j260j985k532k118j157p63j352k194
$$ 218481 215134 211933 209017 206433 204478 203199 201939 199954 197422 195304 194147 193384 192032 189838
53755A89838k375j824j152p82o28m68k03J98O20O05j74j189j454q82m81q56j242
$$ 189838 187463 185639 184487 183705 183077 182609 182406 182604 183224 183829 183655 182466 181012 180130 179649 178793 177551
53738A77551o88N02J359J699J969K118J730J090R72J356J450J131J254K223L225
$$ 177551 176863 177365 178724 180423 182392 184510 186240 187330 188302 189658 191108 192239 193493 195716 198941
53723A98941L334K586J569O68J80L89J019J284R28O31R02J289J253J144J488J892
$$ 198941 202275 204861 206430 207098 207278 207667 208686 209970 210898 211529 212431 213720 214973 216117 217605 219497
53707B19497J578P24L30Q01J550K020K335K738L047L051K960L063L270L320L215
$$ 219497 221075 221799 222129 222930 224480 226500 228835 231573 234620 237671 240631 243694 246964 250284 253499
53692B53499L107K910K417J716J113N86k06j153j455o87K11j54j721k826k299
$$ 253499 256606 259516 261933 263649 264762 265348 265142 263989 262534 261847 262058 261904 260183 257357 255058
53677B55058r41k58m98q42r61j266j715j654j051p26r16o54O88K096K066O25p73
$$ 255058 254117 253859 253361 252519 251558 250292 248577 246923 245872 245146 244230 243576 244264 246360 248426 249051 248278
53660B48278j096p09m19l67j84K70O61O38K51j22k34k07k43k08K02R48J630K011
$$ 248278 247182 246473 246054 245687 245503 245773 246434 247072 247323 247201 246967 246760 246517 246309 246511 247459 249089 251100
53642B51100K160K041J444N36J1K95R79J338J164P71M54L50N08P83Q82Q85J347
$$ 251100 253260 255301 256745 257281 257292 257587 258566 259904 261068 261839 262293 262643 263151 263934 264816 265701 267048
53625B67048K456L450L459K705K186K314K594K610K594K747K764K462K348L011
$$ 267048 269504 272954 276413 279118 281304 283618 286212 288822 291416 294163 296927 299389 301737 304748
53611C04748M240N179N289M762M112L693L512L313K787K019J539J733K269K437
$$ 304748 308988 314167 319456 324218 328330 332023 335535 338848 341635 343654 345193 346926 349195 351632
53597C51632J967J216M80l34j256j873j785j204p38p61j277k179l083l125j686
$$ 351632 353599 354815 355295 354961 353705 351832 350047 348843 348105 347344 346067 343888 340805 337680 335994
53582C35994M83J610Q18p68j357n93L32M10j12m30k62J39N68J002J360J431J066
$$ 335994 336477 338087 338905 338137 336780 336187 336519 336929 336817 336387 336125 336264 336832 337834 339194 340625 341691
53565C41691L13n84j224j252o48J79O33L14p14j873k441k189j564j111q03k22
$$ 341691 342004 341420 340196 338944 338296 338475 339108 339422 338708 336835 334394 332205 330641 329530 328727 328505
53549C28505P27J664K240K427K305J972J715J874K378K813L094L695M962O579
$$ 328505 329232 330896 333136 335563 337868 339840 341555 343429 345807 348620 351714 355409 360371 366950
53535C66950P889Q518Q528Q287Q382R217J0438J1086J0800J0450J1132J2740J4139
$$ 366950 374839 383357 391885 400172 408554 417771 428209 439295 450095 460545 471677 484417 498556
53522D98556J4623J4633J4922J5598J6264J6780J7482J8703K0345K1973K3223
$$ 498556 513179 527812 542734 558332 574596 591376 608858 627561 647906 669879 693102
53511F93102K3962K4171K3886K3409K3371K4178K5434K6233K6133K5470K4686
$$ 693102 717064 741235 765121 788530 811901 836079 861513 887746 913879 939349 964035
53500I64035K3849K3066K2746K2977K2998K2018K0350J9120J8861J9016J8920
$$ 964035 987884 1010950 1033696 1056673 1079671 1101689 1122039 1141159 1160020 1179036 1197956
53489A197956J8641J8583J8775J8951J9001J8953J8662J7896J6693J5413J4369
$$ 1197956 1216597 1235180 1253955 1272906 1291907 1310860 1329522 1347418 1364111 1379524 1393893
53478A393893J3560J2712J1472R574O962L794M07k710n039o425p349q633j0697
$$ 1393893 1407453 1420165 1431637 1441211 1448173 1451967 1452374 1449664 1444625 1438200 1430851 1422218 1411521
53465A411521j3267j5784j7887j9432k0341k0670k0712k0800k1070k1483k1990
$$ 1411521 1398254 1382470 1364583 1345151 1324810 1304140 1283428 1262628 1241558 1220075 1198085
53454A198085k2483k2832k3053k3268k3367k2999k2157k1398k1005k0307j8480
$$ 1198085 1175602 1152770 1129717 1106449 1083082 1060083 1037926 1016528 995523 975216 956736
53443I56736j5902j3856j2819j1838j0049p933o406n273l565j119J078K237K700
$$ 956736 940834 926978 914159 902321 892272 884339 877933 872660 869095 867976 869054 871291 873991
53430H73991L317M479O005P526Q761R675J0619J1996J3794J5664J7414J9013K0237
$$ 873991 877308 881787 887792 895318 904079 913754 924373 936369 950163 965827 983241 1002254 1022491
53417A022491K0921K1594K3116K5499K7797K9430L0876L2645L4356L5521L6562
$$ 1022491 1043412 1065006 1088122 1113621 1141418 1170848 1201724 1234369 1268725 1304246 1340808
53406A340808L8258M0593M2954M5142M7427M9798N1989N3965N5713N6761N6821
$$ 1340808 1379066 1419659 1462613 1507755 1555182 1604980 1656969 1710934 1766647 1823408 1880229
53395A880229N6678N7467N9012N9952N9627N8805N8203N7391N5745N3593N1555
$$ 1880229 1936907 1994374 2053386 2113338 2172965 2231770 2289973 2347364 2403109 2456702 2508257
53384B508257M9385M6346M2446L8455L4837L1280K7341K2972J8328J3433Q201
$$ 2508257 2557642 2603988 2646434 2684889 2719726 2751006 2778347 2801319 2819647 2833080 2841281
53373B841281K623l151q899j4512k0105k5821l1598l7282m2870m8332n3282n7281
$$ 2841281 2843904 2840753 2831854 2817342 2797237 2771416 2739818 2702536 2659666 2611334 2558052 2500771
53361B500771o0408o2986o4716o4813o3311o1505o0530o0049n9001n7160n5215
$$ 2500771 2440363 2377377 2312661 2247848 2184537 2123032 2062502 2002453 1943452 1886292 1831077
53350A831077n3545n1779m9625m7438m5703m4427m3271m2040m0736l9341l7686
$$ 1831077 1777532 1725753 1676128 1628690 1582987 1538560 1495289 1453249 1412513 1373172 1335486
53339A335486l5527l2752k9579k6506k3938k1902k0206j8754j7516j6313j4881
$$ 1335486 1299959 1267207 1237628 1211122 1187184 1165282 1145076 1126322 1108806 1092493 1077612
53328A077612j3165j1415r981r017q414p937p519p316p346p207o405m948l314
$$ 1077612 1064447 1053032 1043051 1034034 1025620 1017683 1010164 1002848 995502 988295 981890 976942 973628
53315I73628j832m62P92J794K757M273O465Q585R860J0459J1158J2367J3926J5614
$$ 973628 971796 971334 972126 973920 976677 980950 987415 996000 1005860 1016319 1027477 1039844 1053770 1069384
53301A069384J7297J8746J9884K1178K3199K5737K7863K8993K9519L0159L0991
$$ 1069384 1086681 1105427 1125311 1146489 1169688 1195425 1223288 1252281 1281800 1311959 1342950
53290A342950L1420L0951K9747K8362K7009K5314K2906K0117J7640J5478J2801
$$ 1342950 1374370 1405321 1435068 1463430 1490439 1515753 1538659 1558776 1576416 1591894 1604695
53279A604695R136N230K126k83l028o600j0396j3657j6241j8314j9961k1435k3249
$$ 1604695 1613831 1619061 1621187 1620904 1617876 1611276 1600880 1587223 1570982 1552668 1532707 1511272 1488023
53266A488023k5489k7461k8510k8952k9668l0960l2285l3064l3210l2874l2225
$$ 1488023 1462534 1435073 1406563 1377611 1347943 1316983 1284698 1251634 1218424 1185550 1153325
53255A153325l1701l1909l2768l3225l2382l0705k9417k8793k7934k6340k4835
$$ 1153325 1121624 1089715 1056947 1023722 991340 960635 931218 902425 874491 848151 823316
53244H23316k4379k4681k4776k4356k3703k2686k0956j8927j7460j6454j4860
$$ 823316 798937 774256 749480 725124 701421 678735 657779 638852 621392 604938 590078
53233E90078j2360j0013q768q286p785p139o542n931n512o072p752r233r232q298
$$ 590078 577718 567705 558937 550651 542866 535727 529185 523254 517742 511670 503918 494685 485453 477155
53219D77155q048q916r847j0042r797r564r234q729q326q103p743p131o539o036
$$ 477155 469107 460191 450344 440302 430505 420941 411707 402978 394652 386549 378806 371675 365136 359100
53205C59100n389m719m486m581m278l485l266m456o341p376o896n583m453l924
$$ 359100 353711 348992 344506 339925 335647 332162 328896 324440 318099 310723 303827 298244 293791 289867
53191B89867l779l631l322l025k892k769k457k158k145k111j507o33n23j412k166
$$ 289867 286088 282457 279135 276110 273218 270449 267992 265834 263689 261578 260071 259438 258915 257503 255337
53176B55337j790q37m72p02n57K10P09L50k66k82K49O20M86O7l97q90j327j465
$$ 255337 253547 252710 252238 251536 250979 251189 251898 252248 251982 251700 251949 252569 253055 253122 252725 251835 250508 249043
53158B49043j184p12m30n11q14j037r84p15n11o02r35j284j542j800k072k103
$$ 249043 247859 247147 246717 246206 245392 244355 243371 242656 242145 241543 240608 239324 237782 235982 233910 231807
53142B31807j663r17k75P0K25K63J46J4J18L96M23N1l21l48k77m72p84q58p62
$$ 231807 230144 229227 228952 229022 229247 229510 229656 229670 229788 230184 230607 230658 230337 229989 229712 229240 228456 227598 226836
53123B26836p96r06q71q61j156j378p55P04J971K172J507P49L30K02J66Pm12r34
$$ 226836 226040 225134 224263 223402 222246 220868 220113 220817 222788 224960 226467 227216 227546 227748 227914 227921 227509 226575
53105B26575j218j224j250j311r76j57M10o8j338k275k152j335o85n77p23p78
$$ 226575 225357 224133 222883 221572 220596 220439 220849 220781 219443 217168 215016 213681 212996 212419 211696 210918
53089B10918q34j135j524j494r39m00k79k50J43O30O74M82P05J169R92J44j87
$$ 210918 210084 208949 207425 205931 204992 204592 204313 204063 204206 204836 205510 205992 206697 207866 208858 209002 208815
53072B08815O96J826J904J109N74O37O00R9l53l19o6J8K1J52K57N3m27r21j286
$$ 208815 209511 211337 213241 214350 214924 215561 216161 216260 215907 215588 215522 215540 215561 215713 215970 216023 215596 214675 213389
53053B13389j503j435q77J42J153J525J003n1j013j590j917k102j986j464q18
$$ 213389 211886 210451 209574 209716 210869 212394 213397 213346 212333 210743 208826 206724 204738 203274 202456
53038B02456m62m96o98p91o66m57m90r92j688k002j764j408j272j094n29K02O32
$$ 202456 201994 201498 200800 200009 199343 198886 198396 197404 195716 193714 191950 190542 189270 188176 187647 187849 188481
53021A88481Q23J194J707J789J180L68n2r4j68l80m19j21K03J58r5LN49Q27K13
$$ 188481 189304 190498 192205 193994 195174 195542 195490 195396 195228 194848 194429 194308 194511 194669 194574 194577 195126 195953 196166
53002A96166q06j162o88l58p73j218q06P7L31j68l66M53J716K385K099J257M33
$$ 196166 195360 194198 193510 193152 192379 191161 190355 190432 190763 190595 190229 190682 192398 194783 196882 198139 198572
52985A98572k6o5N0k9l35o23p82q87q14j96R81K088K486K215J816J622J530J368
$$ 198572 198546 198481 198531 198502 198167 197544 196762 195875 195061 194865 195846 197934 200420 202635 204451 206073 207603 208971
52967B08971J152R42P04L99J62K68Q36J628K154K134J727J246O39m69k128l638
$$ 208971 210123 211065 211769 212168 212330 212598 213434 215062 217216 219350 221077 222323 222962 222493 220365 216727
52951B16727m010k933j191n5j89j153j959k062j693j328j098q23m04O2M06M54
$$ 216727 212717 209784 208593 208538 208349 207196 205237 203175 201482 200154 199056 198233 197829 197891 198297 198751
52935A98751P2n78r28n00N15J336J379P66M3l41k77O8L92M98M85N69O86M77k10
$$ 198751 198823 198245 197317 196817 197332 198668 200047 200813 200856 200515 200238 200306 200698 201196 201681 202250 202936 203413 203203
52916B03203r82j273r61m59k35l60n69n48k31J69L45J88j24l54m90o92r42r38
$$ 203203 202221 200948 199987 199528 199293 198933 198364 197816 197585 197754 198099 198287 198163 197809 197319 196627 195685 194747
52898A94747m59K33N20O4p97j331j032k9J062J589J357P72L98L45K40j09k70K17
$$ 194747 194288 194521 195041 195105 194308 192977 191945 191916 192978 194567 195924 196696 197094 197439 197679 197570 197300 197517
52880A97517J041J324O43m44j043p60J02R71J371J168O27K04K00O25J277J808
$$ 197517 198558 199882 200525 200081 199038 198278 198380 199351 200722 201890 202517 202721 202921 203546 204823 206631
52864B06631J858J431J036J063J218J025P74J177K066K309J339mp20r56j371j820
$$ 206631 208489 209920 210956 212019 213237 214262 215036 216213 218279 220588 221927 221923 221203 220247 218876 217056
52848B17056j643q85k90k45n48j122k024k770k607j626q32p90r47o74j87m9k52
$$ 217056 215413 214528 214238 213993 213445 212323 210299 207529 204922 203296 202464 201674 200727 200053 199866 199817 199565
52831A99565l63j43L54R12J071L73q96j681j349n03o9o3O0K23j35q46r43m4R72
$$ 199565 199202 199059 199413 200325 201396 201769 200873 199192 197843 197340 197271 197208 197268 197491 197356 196510 195567 195523 196495
52812A96495J145O54L63N97R88J259J521J793J806J427R40O42M36J4p51j726k656
$$ 196495 197640 198294 198657 199254 200242 201501 203022 204815 206621 208048 208988 209630 210066 210080 209329 207603 204947
52795B04947l217l090k275j274p47r42j557k077k106j532o91k49n77j206j291
$$ 204947 201730 198640 196365 195091 194344 193402 191845 189768 187662 186130 185439 185190 184613 183407 182116
52780A82116o76q7o8k18J74J075J795J904J490O78m76j502j628o97M39Q47N51
$$ 182116 181440 181353 181285 181067 181241 182316 184111 186015 187505 188183 187707 186205 184577 183880 184319 185166 185717
52763A85717K60L13M13L71M56P90Q57J46r29j275m97M79M42o67j770j936j224
$$ 185717 185977 186290 186703 187074 187530 188320 189177 189323 188394 187119 186622 187101 187543 186876 185106 183170 181946
52746A81946k71M79R10J031J006J133J484J691J394Q12N75J024J850K447K376
$$ 181946 181675 182154 183064 184095 185101 186234 187718 189409 190803 191615 192190 193214 195064 197511 199887
52731A99887J632O15j05k30N9L96O21P11N47Mp58j385j696j721j468r76n62o39
$$ 199887 201519 202134 202029 201799 201858 202254 202875 203586 204133 204137 203379 201994 200298 198577 197109 196133 195571 194932
52713A94932j191j654j527r13l49k47n33p80o19j15K91K73m4l05l91m15l74j40
$$ 194932 193741 192087 190560 189647 189298 189051 188518 187738 187119 187004 187295 187568 187524 187219 186828 186413 186039 185899
52695A85899K23M52M96O18R56J210J026N58L57P22J248J216M02n95r25l50N77
$$ 185899 186122 186574 187070 187688 188644 189854 190880 191438 191795 192517 193765 194981 195383 194788 193863 193513 194090
52678A94090J179J259J030P36N39N15N53M17J15m2N8Q6k30n67m72m9K52L91P08
$$ 194090 195269 196528 197558 198294 198833 199348 199901 200318 200433 200391 200449 200535 200305 199738 199266 199217 199469 199860 200568
52659B00568J250J714K009K291K389J880Q90K38M31J031J319J230J196J414J588
$$ 200568 201818 203532 205541 207832 210221 212101 212991 213229 213660 214691 216010 217240 218436 219850 221438
52644B21438J239R0j610k929k894j569j82K76J94N85J460J774J028K45Q07K675
$$ 221438 222677 222767 221157 218228 215334 213765 213583 213859 214053 214638 216098 217872 218900 219145 219952 222627
52628B22627M370M740M223M037M414M357L161J563Q25J032R42m37k688m504m980
$$ 222627 226997 231737 235960 239997 244411 248768 251929 253492 254317 255349 256291 255854 253166 248662 243682
52613B43682m240l153k578k661k727k149j247r06j276j452o70O51J487J411Q62
$$ 243682 239442 236289 233711 231050 228323 226174 224927 224021 222745 221293 220623 221274 222761 224172 225034
52598B25034M36L30L68K45j89p42j066j050q38m79P9N42L97l29q59n80K53J069
$$ 225034 225470 225800 226168 226413 226224 225482 224416 223366 222528 222049 222128 222670 223067 222738 221879 221299 221552 222621
52580B22621J758K440K854K587J677M96p28j780k120j413k58K99l9o67j087j380
$$ 222621 224379 226819 229673 232260 233937 234433 233705 231925 229805 228392 228134 228433 228394 227727 226640 225260
52564B25260j602j483r57m60k87j64K56Q13J164J276J244R81M59K8k1qm14j063
$$ 225260 223658 222175 221218 220758 220471 220307 220563 221376 222540 223816 225060 226041 226500 226528 226507 226499 226085 225022
52546B25022j277r15o36q79j168p92J37Q49R07N27m0p83j459j433l81J095K068
$$ 225022 223745 222830 222194 221315 220147 219355 219492 220341 221248 221775 221735 220952 219493 218060 217679 218774 220842
52529B20842K231J947J486P89l6n28m05M4L40L51K68J94J5l00m59qJ127K326K804
$$ 220842 223073 225020 226506 227295 227259 226731 226326 226370 226710 227061 227329 227523 227538 227238 226779 226771 227898 230224 233028
52510B33028K560K467L086L746L393K137J176J153J444J339J038R53O88m89k355
$$ 233028 235588 238055 241141 244887 248280 250417 251593 252746 254190 255529 256567 257520 258208 257719 255364
52495B55364l711l647k447j237r61j621k280k017j060n91j165j807j284J23R65
$$ 255364 251653 248006 245559 244322 243361 241740 239460 237443 236383 235792 234627 232820 231536 231659 232624
52480B32624N83r0P1R21J462J210O45M59Q20J439J986K288K254J917J597J706
$$ 232624 233207 233117 233188 234109 235571 236781 237426 237885 238705 240144 242130 244418 246672 248589 250186 251892
52464B51892K207K399J727O76L48J088K069K466K350K038J262l17k116l097l061
$$ 251892 254099 256498 258225 258901 259249 260337 262406 264872 267222 269260 270522 270205 268089 264992 261931
52449B61931k765k792k966k993k947k893k604j927j137o83q02j416k157k461k039
$$ 261931 259166 256374 253408 250415 247468 244575 241971 240044 238907 238224 237422 236006 233849 231388 229349
52434B29349j295r55j182j449j293p62r4O31J300J669J678J580J572J557J405
$$ 229349 228054 227099 225917 224468 223175 222413 222319 222950 224250 225919 227597 229177 230749 232306 233711
52419B33711J139P58J82m13n31J91J618L281M701N527N710N712O159P118P970
$$ 233711 234850 235608 235790 235377 234846 235037 236655 239936 244637 250164 255874 261586 267745 274863 282833
52404B82833Q114P550O580N365L961K513J018q66l414o248q392q936p708n448
$$ 282833 290947 298497 305077 310442 314403 316916 317934 317068 313654 307406 299014 290078 282370 276922
52390B76922l399k423k378k504k341k015j646j018r2O59Q34P15Q51J217J295R70
$$ 276922 273523 271100 268722 266218 263877 261862 260216 259198 259106 259765 260599 261314 262165 263382 264677 265647
52374B65647Q74J673L211M593N050M661M186M198M501M454L775K795J900J115
$$ 265647 266521 268194 271405 275998 281048 285709 289895 294093 298594 303048 306823 309618 311518 312633
52360C12633K80n78j241j550j533j376j288j286j183r03o54m83K3J161K349K650
$$ 312633 312913 312335 311094 309544 308011 306635 305347 304061 302878 301975 301321 300838 300861 302022 304371 307021
52344C07021K121J878K654L896M719N033N216N309N214N274N864O714P330P894
$$ 307021 309142 311020 313674 317570 322289 327322 332538 337847 343061 348335 354199 360913 368243 376137
52330C76137Q961J0380J1359J1648J1913J2766J4055J5353J6491J7296J7371J6629
$$ 376137 385098 395478 406837 418485 430398 443164 457219 472572 489063 506359 523730 540359
52318E40359J5641J4994J4576J3889J2857J1826J0937R956Q811P865P462P420
$$ 540359 556000 570994 585570 599459 612316 624142 635079 645035 653846 661711 669173 676593
52306F76593P184O445N416M464L649K766J813J176J181J628J964J880J451P54
$$ 676593 683777 690222 695638 700102 703751 706517 708330 709506 710687 712315 714279 716159 717610 718364
52292G18364l38j839l382m531n256n864o450o701o339n552m758m002k878j200
$$ 718364 718026 716187 712805 708274 703018 697154 690704 684003 677664 672112 667354 663352 660474 659274
52278F59274N99J985L114M639O763Q886J0330J1011J1180J0971J0554J0394J0796
$$ 659274 659873 661858 664972 669611 676374 685260 695590 706601 717781 728752 739306 749700 760496
52265G60496J1354J1402J0863J0183R456Q330O824N535M745L933K694J584J418
$$ 760496 771850 783252 794115 804298 813754 822084 828908 834443 839188 843121 845815 847399 848817
52252H48817K005K257J548L56n06q39j122k004l854o442q882j0213j0284r836
$$ 848817 850822 853079 854627 854983 854477 853638 852516 850512 846658 840216 831334 821121 810837 801001
52238H01001r599r557r380r208r402r741r405p985o070m601l856l398k731j771
$$ 801001 791402 781845 772465 763257 753855 744114 734709 726724 720654 716053 712197 708799 706068 704297
52224G04297p31J10N12M21P0k10k57p8L78J198K244L172L828M411N034N398N079
$$ 704297 703566 703676 704188 704609 704679 704469 704212 704134 704512 705710 707954 711126 714954 719365 724399 729797 734876
52207G34876M125L117K671K950L595L986L686K893K336K512L043L049K266J396
$$ 734876 739001 742118 744789 747739 751334 755320 759006 761899 764235 766747 769790 772839 775105 776501
52193G76501J246J806K459K840L092L387L561L373K803K065J467J282J488J554
$$ 776501 777747 779553 782012 784852 787944 791331 794892 798265 801068 803133 804600 805882 807370 808924
52179H08924Q43o71k333l655m872o289p473p655o774n589m700m010l219k306j283
$$ 808924 809767 809096 806763 803108 798236 791947 784474 776819 770045 764456 759756 755746 752527 750221 748938
52164G48938j4J359K241K308K091K321K944L310L228L240L760M377M313L310J837
$$ 748938 748924 750283 752524 754832 756923 759244 762188 765498 768726 771966 775726 780103 784416 787726 789563
52149G89563N18m89j417k264k455j478K01J417J727J974K990M248M544L718K884
$$ 789563 790081 789592 788175 785911 783456 781978 782179 783596 785323 787297 790287 794535 799079 802797 805681
52134H05681K960L847N028O301P583Q755R930J1357J2845J3908J4698J6095J8535
$$ 805681 808641 812488 817516 823817 831400 840155 850085 861442 874287 888195 902893 918988 937523
52121I37523K1308K3491K4844K5434K5073K3855K2636K2080K1649K0285J7807
$$ 937523 958831 982322 1007166 1032600 1057673 1081528 1104164 1126244 1147893 1168178 1185985
52110A185985J4810J1544P788L825N50j552k908m205n767p541r120r807r326q470
$$ 1185985 1200795 1212339 1220127 1223952 1224502 1222950 1220042 1215837 1210070 1202529 1193409 1183602 1174276 1165806
52096A165806q245q398p697n888m322m167m936n511n855o698p995q836q752q229
$$ 1165806 1157561 1149163 1141466 1135578 1131256 1127089 1122153 1116642 1110787 1104089 1096094 1087258 1078506 1070277
52082A070277p695o821n138k873p25R40K305L703N196O577P617Q287Q818R509
$$ 1070277 1062582 1055761 1050623 1047750 1047025 1047965 1050270 1053973 1059169 1065746 1073363 1081650 1090468 1099977
52068A099977J0520J1713J2657J2801J1805R869P622N653M159L058K227J548Q17
$$ 1099977 1110497 1122210 1134867 1147668 1159473 1169342 1176964 1182617 1186776 1189834 1192061 1193609 1194426
52055A194426j91j537l022m278n052n556o400p914r612j0698j1106j1594j2652
$$ 1194426 1194235 1192698 1189676 1185398 1180346 1174790 1168390 1160476 1150864 1140166 1129060 1117466 1104814
52042A104814j3845j4576j4946j5374j5692j5386j4524j3710j3056j1950j0109
$$ 1104814 1090969 1076393 1061447 1046073 1030381 1014995 1000471 986761 973705 961755 951646
52031I51646q142o660n337l569j627m53l89q30j292k060l386m579m637l667k975
$$ 951646 943504 936844 931507 927938 926311 925858 925469 924639 923347 921287 917901 913322 908685 905018 902043
52016I02043l581n057o183o408o222o294o715p184p545p848q145q464q956r807
$$ 902043 898462 893405 887222 880814 874592 868298 861583 854399 846854 839006 830861 822397 813441 803634
52002H03634j0912j1887j2443j2716j3049j3462j3561j2966j1835j0700r897r304
$$ 803634 792722 780835 768392 755676 742627 729165 715604 702638 690803 680103 670206 660902
51990F60902q690q002p207o119m714l460k934l175l712m241m920n952p250q639
$$ 660902 652212 644210 637003 630884 626170 622710 619776 616601 612889 608648 603728 597776 590526 581887
51976E81887j0010j1085j1394j0799r792r010q622q369q011p391o334m853l250
$$ 581887 571877 560792 549398 538599 528807 519797 511175 502806 494795 487404 481070 476217 472967
51963D72967j707P6K368M683O118O417O186O032N964N772N474N029M089K507O91
$$ 472967 471260 471336 473704 478387 484505 490922 497108 503140 509104 514876 520350 525379 529468 531975 532666
51948E32666q77k283l849n283n749m833l032j082Q18K889N110P125Q689R879J0754
$$ 532666 531789 529506 525657 520374 514625 509792 506760 505678 506496 509385 514495 521620 530309 540188 550942
$$ [...]
##END NTUPLES=NMR SPECTRUM
##END=
