
##TITLE=AC1232_PUEHDE125_6075406_ZkziUhQfc5
##JCAMPDX= 6.0         $$ Bruker NMR JCAMP-DX V2.0
##DATA TYPE= NMR SPECTRUM
##DATA CLASS= NTUPLES
##ORIGIN= BRUKER
##OWNER= Administrator
$$ 1.72 TOPSPIN		Version 2.1
$$ 2012-05-08 01:35:09.375 -0500  Administrator@TOPSPIN
$$ Compression mode = diff/dup
##.OBSERVE FREQUENCY= 400.13188235
##.OBSERVE NUCLEUS= ^1H
##.ACQUISITION MODE= SIMULTANEOUS (DQD)
##.ACQUISITION SCHEME= undefined
##.AVERAGES= 8
##.DIGITISER RES= 22
##SPECTROMETER/DATA SYSTEM= spect
##.PULSE SEQUENCE= zg30
##.SOLVENT NAME= COFFEE_meoh
##.SHIFT REFERENCE= INTERNAL, COFFEE_meoh, 1, 14.98061
##AUDIT TRAIL= $$ (NUMBER, WHEN, WHO, WHERE, PROCESS, VERSION, WHAT)
$$ ##TITLE= Audit trail, TOPSPIN		Version 2.1
$$ ##JCAMPDX= 5.01
$$ ##ORIGIN= Bruker BioSpin GmbH
$$ ##OWNER= Administrator
$$ $$ C:\Bruker\TOPSPIN/data/COFFEE/nmr/AC1232_PUEHDE125_6075406_ZkziUhQfc5/10/pdata/1/auditp.txt
$$ ##AUDIT TRAIL=  $$ (NUMBER, WHEN, WHO, WHERE, PROCESS, VERSION, WHAT)
(   1,<2012-05-08 01:35:01.453 -0500>,<Administrator>,<TOPSPIN>,<go>,<TOPSPIN 2.1>,
      <created by zg
	started at 2012-05-08 01:33:54.609 -0500,
	POWCHK enabled, PULCHK disabled,
       configuration hash MD5:
       AF F2 23 6B 01 CD 40 DD E5 A1 38 A0 06 EA F7 77
       data hash MD5: 64K
       50 47 34 F1 F7 0C 9A 93 20 BC CD 0E E3 B3 01 E8>)
(   2,<2012-05-08 01:35:05.031 -0500>,<Administrator>,<TOPSPIN>,<proc1d>,<TOPSPIN 2.1>,
      <Start of raw data processing
       efp LB = 0 FT_mod = 6 PKNL = 1 PHC0 = 0 PHC1 = 0 SI = 32K 
       data hash MD5: 32K
       0F 55 1A 4F E6 04 D0 BB FF 78 A7 55 D7 0E 7B 0D>)
(   3,<2012-05-08 01:35:05.390 -0500>,<Administrator>,<TOPSPIN>,<proc1d>,<TOPSPIN 2.1>,
      <pk PHC0 = 210.6409 PHC1 = 0 
       data hash MD5: 32K
       4F 00 5B EF D2 90 0F A8 BF 30 8E 57 16 35 4D 20>)
(   4,<2012-05-08 01:35:05.468 -0500>,<Administrator>,<TOPSPIN>,<proc1d>,<TOPSPIN 2.1>,
      <abs ABSG = 1 
       data hash MD5: 32K
       4B EC 2B CB 99 E4 31 95 54 C8 84 CF CC D6 74 30>)
(   5,<2012-05-08 01:35:05.500 -0500>,<Administrator>,<TOPSPIN>,<proc1d>,<TOPSPIN 2.1>,
      <abs ABSG = 2 
       data hash MD5: 32K
       B9 E6 41 62 1C C9 32 5A C6 54 54 58 E4 F7 14 66>)
(   6,<2012-05-08 01:35:05.531 -0500>,<Administrator>,<TOPSPIN>,<proc1d>,<TOPSPIN 2.1>,
      <abs ABSG = 3 
       data hash MD5: 32K
       5B 28 99 C8 3E F4 8E 0F 51 B6 DF 15 95 2F 80 22>)
(   7,<2012-05-08 01:35:05.562 -0500>,<Administrator>,<TOPSPIN>,<proc1d>,<TOPSPIN 2.1>,
      <abs ABSG = 4 
       data hash MD5: 32K
       3C E5 9A 03 0B FE 55 86 FE B5 80 95 BC F4 CB F7>)
(   8,<2012-05-08 01:35:05.578 -0500>,<Administrator>,<TOPSPIN>,<proc1d>,<TOPSPIN 2.1>,
      <abs ABSG = 5 
       data hash MD5: 32K
       A2 F4 96 C5 AF 76 7D 8D 0A 9F 18 03 9A 65 9F EE>)
$$ ##END=
$$ 
$$ $$ hash MD5
$$ $$ E6 BC BC 21 00 A8 FF C2 C2 29 BC F6 2A 5C C5 BC
##$RELAX= 
##$RELAX= 
##$RELAX= 
##$RELAX= 
##$RELAX= 
##$RELAX= 
##$RELAX= 
$$ Bruker specific parameters
$$ --------------------------
$$ [...]
##$TP= (0..7)
150 150 150 150 150 150 150 150
##$TP07= 0
##$TPNAME0= <>
##$TPNAME1= <>
##$TPNAME2= <>
##$TPNAME3= <>
##$TPNAME4= <>
##$TPNAME5= <>
##$TPNAME6= <>
##$TPNAME7= <>
##$TPOAL= (0..7)
0.5 0.5 0.5 0.5 0.5 0.5 0.5 0.5
##$TPOFFS= (0..7)
0 0 0 0 0 0 0 0
##$TUNHIN= 0
##$TUNHOUT= 0
##$TUNXOUT= 0
##$USERA1= <user>
##$USERA2= <user>
##$USERA3= <user>
##$USERA4= <user>
##$USERA5= <user>
##$V9= 5
##$VALIST= <valist>
##$VCLIST= <CCCCCCCCCCCCCCC>
##$VD= 0
##$VDLIST= <DDDDDDDDDDDDDDD>
##$VPLIST= <PPPPPPPPPPPPPPP>
##$VTLIST= <TTTTTTTTTTTTTTT>
##$WBST= 1024
##$WBSW= 4
##$XGAIN= (0..3)
0 0 0 0
##$XL= 0
##$YL= 0
##$YMAX_a= 531600
##$YMIN_a= -640866
##$ZGOPTNS= <>
##$ZL1= 120
##$ZL2= 120
##$ZL3= 120
##$ZL4= 120
##$ABSF1= 14.98061
##$ABSF2= -5.57192
##$ABSG= 5
##$ABSL= 3
##$ALPHA= 0
##$AQORDER= 0
##$ASSFAC= 0
##$ASSFACI= 0
##$ASSFACX= 0
##$ASSWID= 0
##$AUNMP= <proc_prof1d_extract_pilot.lims>
##$AXLEFT= 0
##$AXNAME= <>
##$AXNUC= <1H>
##$AXRIGHT= 0
##$AXTYPE= 0
##$AXUNIT= <>
##$AZFE= 0.1
##$AZFW= 0.1
##$BCFW= 0
##$BC_mod= 0
##$BYTORDP= 0
##$COROFFS= 0
##$CY= 15
##$DATMOD= 1
##$DC= 0
##$DFILT= <>
##$DTYPP= 0
##$F1P= 0
##$F2P= 0
##$FCOR= 0.5
##$FTSIZE= 32768
##$FT_mod= 6
##$GAMMA= 0
##$GB= 0
##$INTBC= 1
##$INTSCL= 1
##$ISEN= 128
##$LB= 0
##$LEV0= 0
##$LPBIN= 0
##$MAXI= 10000
##$MC2= 0
##$MEAN= 0
##$ME_mod= 0
##$MI= 0
##$NCOEF= 0
##$NC_proc= -8
##$NLEV= 6
##$NOISF1= 0
##$NOISF2= 0
##$NSP= 0
##$NTH_PI= 0
##$NZP= 0
##$OFFSET= 14.98061
##$PC= 1
##$PHC0= 210.6409
##$PHC1= 0
##$PH_mod= 1
##$PKNL= yes
##$PPARMOD= 0
##$PPDIAG= 0
##$PPIPTYP= 0
##$PPMPNUM= 2147483647
##$PPRESOL= 1
##$PSCAL= 4
##$PSIGN= 0
##$PYNMP= <proc.py>
##$REVERSE= no
##$SF= 400.13
##$SI= 32768
##$SIGF1= 0
##$SIGF2= 0
##$SINO= 400
##$SIOLD= 32768
##$SPECTYP= <>
##$SREGLST= <1H.CDCl3>
##$SSB= 0
##$STSI= 32768
##$STSR= 0
##$SW_p= 8223.68421052632
##$SYMM= 0
##$S_DEV= 0
##$TDeff= 65536
##$TDoff= 0
##$TI= <>
##$TILT= no
##$TM1= 0
##$TM2= 0
##$TOPLEV= 0
##$USERP1= <user>
##$USERP2= <user>
##$USERP3= <user>
##$USERP4= <user>
##$USERP5= <user>
##$WDW= 1
##$XDIM= 32768
##$YMAX_p= 466927769
##$YMIN_p= -777148
##$CURPLOT= <Network HP LaserJet P1505>
##$CURPRIN= <$Network HP LaserJet P1505>
##$DFORMAT= <normdp>
##$LAYOUT= <+/1D_H.xwp>
##$LFORMAT= <normlp>
##$PFORMAT= <normpl>
##$SURQMSG= 1
$$ End of Bruker specific parameters
$$ ---------------------------------
##NTUPLES= NMR SPECTRUM
##VAR_NAME=  FREQUENCY,     SPECTRUM/REAL,   SPECTRUM/IMAG
##SYMBOL=    X,             R,               I
##VAR_TYPE=  INDEPENDENT,   DEPENDENT,       DEPENDENT
##VAR_FORM=  AFFN,          ASDF,            ASDF
##VAR_DIM=   32768,         32768,           32768
##UNITS=     HZ,            ARBITRARY UNITS, ARBITRARY UNITS
##FACTOR=    0.250966925370066, 1,           1
##FIRST=     8223.43324360095, 62295,        14051
##LAST=      0,             137119,          -236922
##MIN=       0,             -777148,         0
##MAX=       8223.43324360095, 466927769,    0
$$ Real data points
##PAGE= N=1
##DATA TABLE= (X++(R..R)), XYDATA
$$ [...]
19546A95555a15895K1833A58638d6839B03652i4118c1073A21025A903M15748A22702
19534a50153b3862B588L8279f1626a6923j86014N7538B40222d4567B75887F1120
19522D9316J2635c27701f4449L0532k02195Q1542k4673d9852B24790a36823A57925
19510d93472a14275A840i1780M1036j75396L3129b0091j44341A56922k8820D5420
19498G7828l3331f6171P919j17676q6945C26340a71254e9294j51474R4144j23852
19487b40476d9207r537l25001C41513q4042b06007j02293D47341A12613A919R2922
19476I4841B6145g3259k62211a7711D7268b27978A98021c41730G5560b34432N554
19465b28878j8674F773b2408k02982Q8414e4669k23223A52405b19841m0093j13334
$$ plain form
19546 195555 -115895 -94062 158638 -46839 203652 -94118 -31073 121025 1903 417651 122702
19534 -150153 -23862 2588 40867 -61626 -16923 -202937 -145399 240222 -44567 275887 61120
19522 49316 61951 -327701 -64449 -33917 -236112 -154570 -179243 -49852 224790 -136823 157925
19510 -493472 -114275 1840 -91780 -50744 -226140 -193011 -20091 -164432 156922 128102 45420
19498 77828 44497 -66171 -58252 -175928 -262873 326340 -171254 -59294 -210768 -116624 -240476
19487 -240476 -49207 -58744 -383745 341513 257471 -206007 -308300 447341 112613 1919 94841
19476 94841 26145 -73259 -335470 -17711 47268 -227978 198021 -341730 75560 -234432 -228878
19465 -228878 -247552 6773 -22408 -225390 -136976 -54669 -277892 152405 -219841 -259934 -373268
19454c73268d2541C8626b3864j36983O9809r15C19141A36500J72867A1161Q7801
19443I8962K713F401a23287L3202D8762d3162G1026b42835h4354E7058J71876
19432B28934e3098B4054J86298P8195a2896j14771A06725c89091G444b14111A8635
19420I3125a04993l6816f883l3127A09804G494a4173o3462A85467d4522A28860
19408D8396a93755B68000G401K92950b70163a21291E2026a13468D5194a50664
19397A69358c5723G1174b22838j2874J00857d0810l51414h1714A16047R2448c82339
19385b05852B2103J9990a85941j15487B62489a44435A59564a68530E5073b62280
19374A10028l7744K08355l3091D1615b5373j77307F1745a74735e1898o5372M6427
$$ plain form
19454 -373268 -42541 38626 -23864 -160847 -91038 -91953 319141 136500 309367 11161 98962
19443 98962 101675 6401 -123287 -90085 48762 -43162 71026 -242835 -84354 57058 228934
19432 228934 -53098 24054 210352 288547 -12896 -127667 106725 -389091 7444 -214111 18635
19420 93125 -104993 -141809 -6883 -40010 109804 7494 -14173 -77635 185467 -44522 128860
19408 48396 -193755 268000 7401 300351 -270163 -121291 52026 -113468 45194 -150664
19397 169358 -35723 71174 -222838 -235712 -134855 -40810 -392224 -81714 116047 208495 -382339
19385 -205852 22103 42093 -185941 -301428 262489 -144435 159564 -168530 55073 -262280
19374 110028 72284 280639 247548 41615 -25373 -202680 61745 -174735 -51898 -117270 -70843
19363g0843k31472H9418a00458a1693C0625b95670P5383m0328D6823c64699J78543
19352a86156H6128h4194E0083a17554H4684a25911c6690B54297a43633q5674R7794
19341a31513J387j46780C11394A35288g9617A54790i752l01593a12787G1116k5640
19330D5476c16914E4866g0004A02337a9670l9299A09354a52493A35307c9924A06099
19318E2723b09622B2983i1222K3352A39359o135n0512a78803B9924e0049J9348
19307c0701j55269f9717Q599j39339B4744f020m0473j95723N6377D1437J10730
19296A52167c52047J70007B01954b2904k29426B4402b00591A13584a23212D3719
19285d1059q4055A15277g7484K1724A25942d39360C00950a78559q4874g0477Q415
$$ plain form
19363 -70843 -302315 89418 -100458 -11693 30625 -295670 -220287 -260615 46823 -364699 -186156
19352 -186156 86128 -84194 50083 -117554 84684 -125911 -36690 254297 -143633 -229307 -131513
19341 -131513 -130126 -276906 311394 135288 -79617 154790 -9752 -311345 -112787 71116 45476
19330 45476 -316914 54866 -70004 102337 -19670 -58969 109354 -152493 135307 -39924 106099
19318 52723 -209622 22983 -91222 -67870 139359 133224 82712 -178803 29924 -50049 -30701
19307 -30701 -185970 -69717 -61118 -200457 24744 -6020 -46493 -242216 -185839 41437 152167
19296 152167 -352047 -182040 201954 -22904 -252330 24402 -200591 113584 -123212 43719
19285 -41059 -125114 115277 -77484 -55760 125942 -439360 300950 -178559 -263433 -70477 -62062
19274f2062I4473a3081o8131J2270n6586e01D14651A71676b54355f0855i410A6045
19261b8971D2595b17467A3736g4100p5021j75678A07939j8700a98010R3062A74319
19249a15007p7617c2292H0284a0684k52666B03903q0977a23650A46557a6738r4561
19238a11299c1093m9834j08079Q6383j16540i8932j56549J19706j5501D6551J92697
19227B39248f0285k0287a6582A36566l6187f8280j83651c0139A26571c7246k14227
19216b51473J23468a1490o8042A35308b10652a1597G3867c2730B11413i381A41889
19204a72192m4893g0876l63394K09416H7960l3579L6927J56132i6647G4389M4623
19193A19012N4831a63174b4693r3173B1922P9704b3878D5594a70956A42410b31642
$$ plain form
19274 -62062 94473 -13081 -81212 -68942 -125528 -501 414651 171676 -254355 -60855 -9410 16045
19261 -28971 42595 -217467 13736 -74100 -149121 -324799 107939 89239 -198010 -104948 174319
19249 -115007 -192624 -32292 80284 -10684 -263350 203903 122926 -123650 146557 -16738 -111299
19238 -111299 -31093 -80927 -189006 -102623 -219163 -98932 -255481 -135775 -151276 46551 239248
19227 239248 -60285 -80572 -16582 136566 100379 -68280 -251931 -30139 126571 -37246 -251473
19216 -251473 -128005 -11490 -79532 135308 -210652 -11597 73867 -32730 211413 -9381 141889
19204 -172192 -217085 -70876 -434270 -224854 87960 54381 91308 247440 -96647 74389 119012
19193 119012 173843 -163174 -24693 -117866 21922 101626 -23878 45594 -170956 142410 -231642
19181a45984f0241m62973F5428a12933k147L6009K2786m2910B7875N653a5595
19169B12711b4405l20492D0928b05331B72344A15994R450a79858j0585c6743j26614
19158a63357c8635E0418b01199A69120l1494j9529B311h1547c9466j46013A0147
19146b93838B71715d515D4031L8562a99797B6276b44083M9122j45053e861B2217
19134g7768A80062c05899j2168K5014A28236B6869J63912a62138j66535C8428
19123B32917a48604L4356J256B0915c40720P7398B5669A2307k249N6315a18641
19111a32388M92p2584l8502Q1119c9412O454J6115k83332g6220A45738b82146
19099e971j21621j31221J21334J1411O0773j12639n8801B14624b34660a06734
$$ plain form
19181 -145984 -60241 -523214 65428 -112933 -115080 -79071 -56285 -99195 27875 33528 -15595
19169 212711 -24405 -344897 40928 -205331 272344 115994 125444 -179858 -190443 -36743 -163357
19158 -163357 -38635 50418 -201199 169120 137626 118097 2311 -81547 -39466 -185479 10147
19146 -293838 271715 -4515 44031 82593 -199797 26276 -244083 -194961 -340014 -5861 22217
19134 -77768 180062 -305899 -318067 -293053 128236 26869 190781 -162138 -328673 38428
19123 232917 -148604 -114248 -112992 20915 -340720 -263322 25669 12307 10058 66373 -118641
19111 -132388 -131896 -204480 -242982 -161863 -39412 -32958 -16843 -300175 -76220 145738 -282146
19099 -5971 -127592 -258813 -137479 -126068 -65295 -177934 -236735 214624 -234660 -106734
19088b42685g1590B3785K48288j0839b83263j48730a6419q6731m2129M1354K495
19077a01430p6034K8395c9168j79718A52313f2143G7638c2458A04333b35948a06284
19065A49501i2917q5023A32266a19341M8714A79069J94223A456c6660o5323c72
19053D8219j3475o817a96933b9908A38360E6979d08259D5674K67806c58801a15538
19041b56148P0037F0778i9122E3690b90855a32730C1517b61497J04105A18628
19030b15323E2608d8090B74008F1211b66279a13927j9306M3880A06680A5229h2039
19018c1443A67162b9278m877n7390B68110j30527a41927H1520k9004L0J8196a41922
19005A4378K1603R1574c11641B81593a47313r1837J02414b1247C17549f5641C9826
$$ plain form
19088 -242685 -71590 23785 272073 261234 -283263 -431993 -16419 -103150 -145279 -103925 -101430
19077 -101430 -177464 -149069 -39168 -218886 152313 -62143 77638 -32458 104333 -235948 -106284
19065 149501 -92917 -177940 132266 -119341 -70627 179069 373292 1456 -36660 -101983 -372
19053 48219 34744 27927 -196933 -29908 138360 56979 -408259 45674 313480 -358801 -115538
19041 -256148 -186111 60778 -99122 53690 -290855 -132730 31517 -261497 -157392 118628
19030 -215323 52608 -48090 274008 61211 -266279 -113927 -133233 -89353 106680 15229 -82039
19018 -31443 167162 -29278 -34155 -91545 268110 137583 -141927 81520 52516 52546 70742 -141922
19005 14378 35981 127555 -311641 281593 -147313 -239150 -136736 -21247 317549 -65641 39826
18993c77534b7413A10878c0687n3211c8574B36900b22717a08797C9884f2856Q469
18982e4387j42388R70B1106b96657J40726P4986G4169q916b51139c0493j28449
18971a58942c8633A32534j7250b66568F5538h032l11076B38301i7963l0284k50256
18960c78503g1936A18146J23096h0695E3039K0196l4611a10479H7811b6254B24626
18948F7934d34439D4225M6931a40197B0577J12123P1267D8352f0554j35714a4783
18936B6311i3434j04600L7337j34203i0876l8820q4257c6152i034e04D8631a65695
18923e5952B8531J0646K23692i0010p1697H2198b97921q8926k4476a18828B67979
18911A34747B8351i6372j69533J04321K3220M562n1023o1416k25787J92172Q5752
$$ plain form
18993 -377534 -27413 110878 -30687 -83898 -38574 236900 -222717 -108797 39884 -62856 -54387
18982 -54387 -196775 -195805 21106 -296657 -155931 -80945 74169 65253 -251139 -30493 -158942
18971 -158942 -38633 132534 115284 -266568 65538 -8032 -319108 238301 -97963 -128247 -378503
18960 -378503 -71936 118146 241242 -80695 53039 73235 38624 -110479 87811 -26254 224626
18948 67934 -434439 44225 91156 -140197 20577 132700 203967 48352 -60554 -196268 -14783
18936 26311 -93434 -198034 -160697 -294900 -90876 -129696 -213953 -36152 -9034 -504 48631 -165695
18923 -55952 28531 39177 262869 -90010 -161707 82198 -297921 -386847 -411323 -118828 267979
18911 134747 28351 -96372 -265905 -161584 -138364 -133802 -184825 -246241 -472028 -279856 -194104
18900a94104a8310m28638b02856g8687j40624K470F3538N9881a35743A30737E5871
18888A7791J23244D853J80336b31724a05288j1752j21924F7007d35987f0565n1074
18877a11639M4703A78000e6343H1584b04131A83542c5263A25966D4065J4842a53150
18865a57182b7137j57472k11045J65670A05574d3976k7364m8574A94098e3911
18854i1429B77659c3877l85656A41058J5318a74285k65495K03334c316A0555c51408
18842b87824L6383C83923d4282k11633A34833b89418B0895P4382l7845f2006A96738
18830B4364a41290C23838j37517p4540f3263j0775n9383B0738b50330C08449A0107
18818b17109j7577A42763F4094M191j1802b9670B24815A1323b71145B75784b98855
$$ plain form
18900 -194104 -18310 -446948 -202856 -78687 -219311 -216841 63538 123419 -135743 130737 55871
18888 17791 141035 4853 185189 -231724 -105288 -117040 -238964 67007 -435987 -60565 -111639
18877 -111639 -66936 178000 -56343 81584 -204131 183542 -35263 125966 44065 58907 -153150
18865 -157182 -27137 -184609 -395654 -229984 105574 -43976 -71340 -119914 194098 -53911
18854 -91429 277659 -33877 -419533 141058 156376 -174285 -439780 -236446 -3316 10555 -351408
18842 -287824 -251441 383923 -44282 -255915 134833 -289418 20895 95277 57432 -62006 196738
18830 24364 -141290 323838 186321 111781 -63263 -74038 -133421 20738 -250330 308449 10107
18818 -217109 -234686 142763 64094 68285 56483 -29670 224815 11323 -271145 275784 -298855
18806b08640L7770g1912B40283g4940A26822f1517B61863h2893j10435j39261
18796c32589R1727E2673L72059A82078H5437c00115j23624a34654A58306a91118
18785A61347a09104D53766b70698a31346B2095m816L7970R5950A0303c12544K8705
18774b83839i5240p3783c6698A43504D0606F213d2896H2532p759J9022e2480j28186
18762a80666O1492G8091C7746j1743c9776B15664j00265A7382c0645D6919h9202
18750d56231B31914a17656C86949d79876A02491J5229R0234L35548j65594j59315
18740B18593a68918c6213A24005o0283a72946A6044p121J72592B5478a77938A10043
18728g5711H2476b64836C726a71063E6781b42326J19359i246A09328a18271j93000
$$ plain form
18806 -208640 -170870 -71912 240283 -74940 126822 -61517 261863 -82893 -193328 -332589
18796 -332589 -240862 52673 424732 182078 85437 -300115 -423739 -134654 158306 -191118
18785 161347 -109104 453766 -270698 -131346 22095 17279 55249 151199 10303 -312544 -283839
18774 -283839 -95240 -169023 -36698 143504 40606 6213 -42896 82532 74773 93795 -52480 -180666
18762 -180666 -119174 78091 37746 26003 -39776 215664 115399 17382 -30645 46919 -89202
18750 -456231 231914 -117656 386949 -479876 102491 117720 207954 543502 377908 218593
18740 218593 -168918 -36213 124005 63722 -172946 16044 8923 181515 25478 -177938 110043
18728 -75711 82476 -264836 3726 -171063 56781 -242326 -122967 -9246 109328 -118271 -311271
18717c11271J10164L9851I5303a13663A87321c66411E7507b44689R1225B8710
18706i66A52361a92456e2464A75570a19887J7395k6847j23629a3728A52651a42938
18694i6836j49760j3560D0578O7995a10572F0365K69532D6140a42372f7921k14689
18683b82610f2337A74442a96191k9018B1825g5884k46789g1838n624j66435A09186
18671c8527B2253H500J58010a47085G9954d5796J6674A6322e6464B2157a90181
18659a05745B10114d1642A01524b23186Q9525A56172b99316A16708b21147F8170
18648C6208a64010p8144B14421b74948P2097d6031o3007L2568A31566g2893q3134
18637a56027a6549o0391A14184J31747a35873A33396b23657P7417l2687h6539
$$ plain form
18717 -311271 -201107 -161256 95303 -113663 187321 -366411 57507 -244689 -153464 28710
18706 -966 152361 -192456 -52464 175570 -119887 -102492 -129339 -252968 -13728 152651 -142938
18694 -96836 -246596 -260156 40578 108573 -110572 60365 329897 46140 -142372 -67921 -282610
18683 -282610 -62337 174442 -196191 -225209 21825 -75884 -322673 -71838 -77462 -243897 109186
18671 -38527 22253 8500 166510 -147085 79954 -45796 -29122 16322 -56464 22157 -190181
18659 -105745 210114 -41642 101524 -223186 -133661 156172 -299316 116708 -221147 68170
18648 36208 -164010 -242154 214421 -274948 -202851 -46031 -109038 -76470 131566 -72893 -156027
18637 -156027 -16549 -76940 114184 245931 -135873 133396 -223657 -146240 -178927 -86539
18626c83919A34263B7810i0171q1207G0829i8011k2402j54361A32199g7268l131
18615h0399l01737a05638b3394k19260B54043J432a44174A32013a89360F7941
18604f19093b76840g4627E9910O6887a94047G8888e7175C43185A0450J17297J1031
18593A38778D4132B1148d9078A44636a31526L1008j34240r2654C06565B4063b63657
18581b43559Q2833P0068b5594F2716h3792j02205C81664G8904a06107K7458c1844
18569b7429A95857q2197a73267A43141O7491p7410a08329A07528a852A41950N019
18558A46969b44313H7969b037p4247j46633M6072l35820B19496b3934F6073j2680
18547E3393a9444A0779b1223G3933J38999A01953a05741k95717a87465A9897O4624
$$ plain form
18626 -383919 134263 27810 -90171 -171378 70829 -98011 -120413 -274774 132199 -77268 -80399
18615 -80399 -382136 -105638 -23394 -242654 254043 255475 -144174 132013 -189360 67941
18604 -619093 -276840 -74627 59910 126797 -194047 78888 -57175 343185 10450 127747 138778
18593 138778 44132 21148 -49078 144636 -131526 -100518 -234758 -327412 306565 24063 -263657
18581 -243559 -160726 -90658 -25594 62716 -83792 -185997 381664 78904 -106107 -78649 -31844
18569 -27429 195857 113660 -173267 143141 210632 133222 -108329 107528 -1852 141950 146969
18558 146969 -244313 87969 -2037 -76284 -222917 -176845 -512665 219496 -23934 66073 53393
18547 53393 -19444 10779 -21223 73933 212932 101953 -105741 -401458 -187465 19897 84521
18536H4521b03531C2472b37581I8828c92782a31570M9038j45147D4267J53214
18526A97481G3634b43475J07092D94402a02029j31778O4488I114a60167E2763
18515B584a71781e3658A47683F6520d0373C7845b98310b1528B13963G8660k5095
18504E3565d4110J211D5416K9883a98408H1165c2088E255J37635l8649a54649
18492A97306g5239p5566E837Q6502b14576d4841q2614H4829J55266a22054A8069
18480a71351g3903l54766a81560j5607m0789j17657I7833e3389A11265K61166
18470C72431f1928b0329K188r6402e4306A53709b22216J02601n0917B51896F1616
18458a43097F1980b04392j59598a75059a0502n3886A59808j2206g834A13153a1765
$$ plain form
18536 84521 -203531 32472 -237581 98828 -392782 -131570 -82532 -227679 44267 197481
18526 197481 73634 -243475 -136383 494402 -102029 -233807 -169319 9114 -160167 52763
18515 2584 -171781 -53658 147683 66520 -40373 37845 -298310 -21528 213963 78660 53565
18504 53565 -44110 -42899 45416 75299 -198408 81165 -32088 5255 142890 104241 -154649
18492 197306 -75239 -150805 5837 92339 -214576 -44841 -127455 84829 240095 -122054 18069
18480 -171351 -73903 -428669 -181560 -197167 -237956 -355613 97833 -53389 111265 372431
18470 372431 -61928 -20329 -18141 -114543 -54306 153709 -222216 -119615 -170532 251896 61616
18458 -143097 61980 -204392 -363990 -175059 -10502 -64388 159808 147602 -7834 113153 -11765
18446i1104c0949m4688B58295a95960C0090e6910E3056j4034L0948h3359e003
18434b60115Q4994o443G1590O6985N4126a07680H0258L350a17466N1676j71050
18423b36840C6619J44961h4804B7773b16265A73924b1622n8333j991c0409P954
18412b2455k14058A60207c8585A64711a98017D9778k0406b67759e6930n2853B16764
18400c8723k22582C5720b65804A6774c7956A09139J49667a40946e3116A50150
18389a96409b1007A5873c9386F914R3457C6036b9256o5678I1517f6747j14559
18378a81306q1799a17589A9698b75714D746f6091I0213b08549b9687m1191p4913
18367a45791n9583l8512e5935l5484I8738J80022a74929p3672F2172a25716A06400
$$ plain form
18446 -91104 -30949 -75637 258295 -195960 30090 -56910 53056 39022 69970 -83359 -5003
18434 -260115 -175121 -181564 71590 138575 192701 -107680 80258 83608 -117466 -65790 -236840
18423 -236840 36619 181580 -84804 27773 -216265 173924 -21622 -79955 -81946 -30409 -22455
18412 -22455 -236513 160207 -38585 164711 -198017 49778 29372 -267759 -56930 -109783 216764
18400 -38723 -261305 35720 -265804 16774 -37956 109139 258806 -140946 -53116 150150
18389 -196409 -21007 15873 -39386 6914 100371 36036 -29256 -94934 91517 -66747 -181306
18378 -181306 -263105 -117589 19698 -275714 4746 -66091 90213 -208549 -29687 -70878 -145791
18367 -145791 -205374 -243886 -55935 -91419 98738 278760 -174929 -248601 62172 -125716 106400
18355D4063R5099a17765B65199b73206F4048a45426E0443a94062a0452m53523
18345d63975J43995J18115e0464B0599b7839j42254r5153Q2687j2237B67840E8570
18333h1259k05603D2294b79951B89545c45464B34a33716p6852e6076p4598N0747
18322g9927b8416j21912J8384j5481B79804D9500f6207F71430c4600j9859B16784
18310a27985c1677B0122i9487G7280e1731J4635q4488a8734k49683g1493H1642
18298D975b1197B18265r720a18929A23444g0487A48283G0488i4878o8130A45641
18286a70926c7603J6978B24895b7391A99150g0659a7676m06673J97221j32873
18276c60001A75276L748G0167c16080a25704e6883l3739L0608A34937b90648e3020
$$ plain form
18355 44063 139162 -117765 265199 -273206 64048 -145426 50443 -194062 -10452 -463975
18345 -463975 -319980 -201865 -50464 20599 -27839 -170093 -265246 -182559 -194796 267840 58570
18333 -81259 -286862 42294 -279951 289545 -345464 234 -133716 -210568 -56076 -130674 -79927
18322 -79927 -28416 -150328 -131944 -147425 279804 49500 -66207 671430 -34600 -54459 216784
18310 -127985 -31677 20122 -99487 77280 -51731 -37096 -121584 -18734 -268417 -71493 81642
18298 4975 -21197 218265 208545 -118929 123444 -70487 148283 70488 -94878 -163008 145641
18286 -170926 -37603 -20625 224895 -27391 199150 -70659 -17676 -424349 -227128 -360001
18276 -360001 175276 179024 70167 -316080 -125704 -56883 -90622 -60014 134937 -290648 -53020
18264c63492J06239f0647m4486J0892M0748B96357b90773a946l4188J2207J1320
18253a2607k2110I9487a16965A16023E7202a8063B76258M4403i2159k4003L686
18242a12476k00892a02700j44585D3650J25796a62709r2115d03B9461c9845l62179
18231d02024A09259b5800H6099C3570K00670a96662L6197j27812b566k9776H1949
18219A0596J10170i5673m5875j26641C22749o0134a49541B5714K62913B4218L1462
18208E5680c42602D01973b19108G0389a27017k44211J72005j28409h5888L5003
18198e0885j67519N7169j19222A44817a39131b2984G0282M4426a6787F1698a46432
18186B92441e1309B72860b32944A27599b14387D8961b9766k12617A49343f2125
$$ plain form
18264 -363492 -257253 -60647 -105133 -94241 -53493 296357 -290773 -1946 -36134 -23927 -12607
18253 -12607 -34717 99487 -116965 116023 57202 -18063 276258 320661 -92159 -116162 -112476
18242 -112476 -313368 -102700 -247285 43650 169446 -162709 -254824 -403 29461 -39845 -402024
18231 -402024 109259 -25800 86099 33570 234240 -196662 -160465 -288277 -2566 -32342 81949
18219 10596 120766 -95673 -141548 -268189 322749 262615 -149541 25714 288627 24218 55680
18208 55680 -342602 401973 -219108 70389 -127017 -371228 -199223 -327632 -85888 -50885
18198 -50885 -218404 -161235 -280457 144817 -139131 -22984 70282 114708 -16787 61698 -146432
18186 292441 -51309 272860 -232944 127599 -214387 48961 -29766 -242383 149343 -62125
18175a45519r6806l1468I5492J43693c8105H2729c3743j68530A93644Q7853a63230
18163b54249h0295A3149g1306G950J90325b13589a8942j82572c4954k8863m0306
18152a04123l5145l65709f9115J6182A99368l7909b6270G3388a77438P2130n720
18141a11028C30610A29283J74713A26921d01132b708D9621g8524J9262B62131
18130d13506e3363A82503a30593B6594J99111a15284o5220e550m29288P1278G6022
18118A00913b00411B8069g2332C9002L8459a03642l219j57422B20585a60692M9472
18107a11220j18392K9560C03131b44646k12400R9349e3738j17578L4332B36813
18096e1454j05087D3593a37124e4935D934j076g0689k1070A21196D162J80756
$$ plain form
18175 -145519 -242325 -273793 95492 239185 -38105 82729 -33743 -202273 193644 281497 -163230
18163 -254249 -80295 13149 -71306 7950 198275 -213589 -18942 -201514 -34954 -63817 -104123
18152 -104123 -139268 -504977 -69115 -52933 199368 161459 -26270 73388 -177438 -105308 -111028
18141 -111028 330610 129283 303996 126921 -401132 -2708 49621 -78524 -59262 262131
18130 -413506 -53363 182503 -130593 26594 225705 -115284 -180504 -5550 -434838 -363560 76022
18118 100913 -200411 28069 -72332 39002 77461 -103642 -106861 -264283 220585 -160692 -111220
18107 -111220 -229612 -200052 303131 -244646 -457046 -357697 -53738 -171316 -136984 236813
18096 -51454 -156541 43593 -137124 -54935 4934 3858 -70689 -91759 121196 4162 184918
18085A84918b49435R747A37385M5408J62583d48320E3394a45808G4178J04133
18075A78311f4563j01980c8481H1869h3803q3789M6071M2157A1737c35567a6429
18063b43327m1608C9447f306j54785H5013f001A45437a78793G4895a38116A88748
18051A73510J19171D6445h8531k62861a04027k16700a58541B738N5043B7759J44666
18040A72425b32505c5545n3131B31043h3574A6859J01103J03600k1063b26612
18029A95554b22082B54281g3283A9645M7732r360b9742O104j32250C1348b33752
18017B5316N7786J65953l9974K77054G7068b38823A67008a23861F3071f3071K6888
18006c6183C37356c36218H0784K56992e2174p4549M1856a3744C776g5975I6136
$$ plain form
18085 184918 -249435 -239688 137385 182793 345376 -448320 53394 -145808 74178 178311
18075 178311 -64563 -166543 -38481 81869 -83803 -167592 -121521 -79364 11737 -335567 -16429
18063 -243327 -284935 39447 -6306 -161091 85013 -6001 145437 -178793 74895 -138116 188748
18051 173510 292681 46445 -88531 -351392 -104027 -320727 -158541 2738 57781 27759 172425
18040 172425 -232505 -35545 -88676 231043 -83574 16859 117962 221562 200499 -226612
18029 195554 -222082 254281 -73283 19645 67377 58017 -29742 -23638 -155888 31348 -233752
18017 25316 83102 249055 209081 486135 77068 -238823 167008 -123861 63071 -63071 -36183
18006 -36183 337356 -336218 80784 337776 -52174 -126723 -84867 -13744 3776 -75975 96136
17994A4593K10988a5569k9216A18512J42053A10643j2988a39764k04791G052a66779
17982A01106h5988C9065K53057E3990a02471D64J66045G883O9174J3428J86194
17971B76679b91920b6575j44685O613M6905B37799a07298j46479q4094a63464
17960E3819J89911b22493H5440J2243a49218j36820D6478P5618a30138E883h8801
17948A01709b18282i5633r3058M7560H8817a8911B008a37062c2671E0152a40496
17936c04014G501e479k27780D9917b2340j56761B25097d08905d4527J2824l79353
17925d11056C2744c6468E4545B3855b010q4164F6881a15218j05890d0449G3711
17913a35036B85048E2759J13105a22215e7489R88l0572k39269C88380b825r3705
$$ plain form
17994 14593 225581 -15569 -44785 118512 260565 110643 97655 -139764 -344555 7052 -166779
17982 101106 -85988 39065 292122 53990 -102471 464 166509 7883 77057 90485 276679
17971 276679 -291920 -26575 -171260 -164647 -117742 237799 -107298 -253777 -337871 -163464
17960 53819 243730 -222493 85440 97683 -149218 -286038 46478 122096 -130138 5883 -88801
17948 101709 -218282 -95633 -188691 -141131 88817 -18911 2008 -137062 -32671 50152 -140496
17936 -304014 7501 -5479 -233259 49917 -22340 -179101 225097 -408905 -44527 -31703 -411056
17925 -411056 32744 -36468 54545 23855 -2010 -86174 66881 -115218 -221108 -40449 73711
17913 -135036 285048 52759 165864 -122215 -57489 -56501 -87073 -326342 388380 -2825 -96530
17902i6530M6205j42626C7433a621k50153c4581G6376k131b1704n9992a0189I5592
17889b43493e5056I7179h4207N104j40514o3271h5203j49460f4370A0856b73358
17877a80940C79J54064a98282g1313K6507C701K3619e3004k78340B80842j35301
17866A45541N4084a85495B27320L859F3008a37021K1916B58040b50436k94600
17856e45036H1962b29499j09811a47506E2305M7189m5888J61494p3192a40078
17845d8760q3208A60408A4287K38720j8024K2076H3032K5615D6785a64105n757
17834a69862f95E8696a39344F9934K6030a72170r940j64525a12583J7401B90776
17822A57961J8813j1567D3452a02095D0107Q1403f4685D1118c62886A0727J26349
$$ plain form
17902 -96530 -50325 -192951 37433 -1621 -251774 -34581 76376 74245 -21704 -81696 -10189 95592
17889 -243493 -55056 97179 -84207 -79103 -219617 -282888 -85203 -234663 -64370 10856 -273358
17877 -180940 379 154443 -198282 -71313 -44806 3701 27320 -53004 -331344 280842 145541
17866 145541 199625 -185495 227320 231179 63008 -137021 -115105 258040 -250436 -545036
17856 -545036 81962 -229499 -339310 -147506 52305 99494 53606 215100 141908 -140078
17845 -48760 -131968 160408 14287 253007 234983 257059 83032 108647 46785 -164105 -169862
17834 -169862 -695 58696 -139344 69934 95964 -172170 -182110 -346635 -112583 -95182 290776
17822 157961 176774 165207 43452 -102095 40107 121510 -64685 41118 -362886 10727 137076
17811A37076L3539E0860i9867b3687r7775N335A28061a1845j07450I0446g3322
17799H2541a17335A35843d4770p4975I4205A6461J66935b13323l83280a15944
17788A22739i9425R335I0441a66965C16257I0551g4101E4515a63434l75300B77897
17776e2357j97101A65453g1090a8651I6208O1223J05898b9342B7370J67611B8230
17764b50071e1282H4941c20283J41746j34259a9654B3103c27318E7977d7468j6990
17753f4458j15568f4904I2992M7704K37378h3760j1888j25082C04034j47905A9095
17741e9418A33789D6568J28482h0851k64118A83178n8496D6998N5466b029F2382
17729c01494j32707j21274I4228g2481m10169A83384O3954B1996b25932A42784
$$ plain form
17811 137076 170615 50860 -99867 -23687 -121462 -116127 128061 -11845 -119295 90446 -73322
17799 82541 -117335 135843 -44770 -119745 94205 16461 183396 -213323 -596603 -115944
17788 122739 -99425 -90090 90441 -166965 316257 90551 -74101 54515 -163434 -538734 277897
17776 -52357 -249458 165453 -71090 -18651 96208 157431 263329 -29342 27370 194981 28230
17764 -250071 -51282 84941 -320283 -178537 -312796 -19654 23103 -327318 57977 -47468 -64458
17753 -64458 -180026 -64904 92992 140696 378074 -83760 -95648 -220730 304034 156129 19095
17741 -59418 133789 46568 175050 -80851 -344969 183178 124682 46998 102464 -2029 62382
17729 -301494 -434201 -555475 94228 -72481 -482650 183384 247338 21996 -225932 142784
17718d4830H6004Q7967E5649A5272F061K18030a84338A11382J5378m142N1792
17707A74410J2069o4770M7984a9651A30767d5856j2938K1583k9179j84856A11440
17695B51588j12641J89466b42A28796M9291g4481A23114a01452A8080b7363A01658
17683b43573B98126a01522j41134f0107j82168H9166a9142A41251A3741J22828
17673A36569L4862L1698r5670k5403a06926E8586J35583a6220A15515b2783H3821
17661c79308B00265E1621P5563n6104b05115c9345k80040a52346e1683n204A33642
17649g7871B85368b37241b4632i657k52265C8550J237J36146c49883a73147A2721
17637A43952F1147a00235K7614J7196n5112A28099C458M9951d9736k93679D9373
$$ plain form
17718 -44830 86004 173971 55649 15272 6061 224091 -184338 111382 126760 122618 174410
17707 174410 186479 121709 169693 -19651 130767 -45856 -58794 -37211 -66390 -251246 111440
17695 251588 138947 328413 -242 128796 178087 -74481 123114 -101452 18080 -27363 101658
17683 -243573 298126 -101522 -242656 -60107 -242275 89166 -19142 141251 13741 136569
17673 136569 171431 203129 107459 82056 -106926 58586 194169 -16220 115515 -22783 83821
17661 -379308 200265 51621 127184 71080 -205115 -39345 -319385 -152346 -51683 -56887 133642
17649 -77871 285368 -237241 -24632 -9657 -261922 38550 39787 175933 -349883 -173147 12721
17637 143952 61147 -100235 -72621 -55425 -110537 128099 3458 53409 -49736 -343415 49373
17625A7140J80630J87708j65011l7302f3174C32672a4816F813a94048P7096j3395
17614a30347A21598Q4163m4193H322a394A61671a80911G2207L33286A36282N0515
17603A86797c4125A00472a80077Q0365c4060A01502C7060a82895K2541A8383e2960
17591A11058J36567Q5018n8466q9515k1778a25283G8824P5560K92321a828q4734
17580h6562j51786A63316c90320b7982B44937G2176P646B4669J17101o0095g4623
17568G0753d4222I5444a00277A78677d718n495k7291h621A28168J36187b9184
17556c81554D2242c3375l4792k3347b6503B146J14471h9259C35561H7926J89687
17545B77613j38593k3837j2173m6072K04906b66631B7280b43767l5176a18744
$$ plain form
17625 17140 197770 385478 220467 183165 -63174 332672 -14816 6813 -194048 -116952 -130347
17614 -130347 121598 205761 161568 8322 -1394 161671 -180911 72207 405493 136282 186797
17603 186797 -34125 100472 -180077 -99712 -34060 101502 37060 -182895 -160354 18383 -52960
17591 111058 247625 332643 274177 184662 162884 -125283 78824 154384 446705 -1828 -86562
17580 -86562 -238348 163316 -390320 -27982 244937 72176 79822 24669 141770 81675 -74623
17568 70753 -44222 95444 -100277 178677 -4718 -10213 -37504 -8621 128168 264355 -29184
17556 -381554 42242 -33375 -68167 -91514 -26503 2146 116617 -89259 335561 87926 277613
17545 277613 139020 115183 103010 56938 261844 -266631 27280 -243767 -278943 -118744
17534B01104J15486j48573a8604C30860a74286j97387C2247L8304J13641J72814
17524C57006D0858e3407D4247P3943J71714o0164l2153k0095K6035j8925m1590
17513A43012J75249A6038a27032f1970C7692g3228K6292j69081a05427M4941G4294
17501F5268K7419a2284A29700h4172A03635o782m425d1463j21555I6269M9415
17490A45684F7189A4266M4823a35649B12964d2713B41626A7956J31274L772N4897
17479B07899D4843L43061j27851q9745o6934K98743P4894F0670C464K17344a31731
17467A58354B790N0004I516O7110a97865A76347N4370J577q579c50685B97063
17455B05811J58148A50577N7462B0544a94191h8174A60161O2751b9411G3863K59818
$$ plain form
17534 201104 316590 168017 -18604 330860 -174286 -371673 32247 70551 184192 357006
17524 357006 40858 -53407 44247 118190 289904 229740 197587 177492 203527 184602 143012
17513 143012 318261 16038 -127032 -61970 37692 -73228 -46936 -216017 -105427 -60486 74294
17501 65268 92687 -12284 129700 -84172 103635 96853 92428 -41463 -163018 96269 145684
17490 145684 67189 14266 59089 -135649 212964 -42713 241626 17956 149230 153002 207899
17479 207899 44843 387904 260053 170308 103374 402117 477011 60670 3464 220808 -131731
17467 158354 2790 52794 9516 76626 -197865 176347 230717 232294 223715 -350685 297063
17455 205811 363959 150577 208039 20544 -194191 -88174 160161 222912 -29411 73863 333681
17444C33681J5371m1895h6131I5376b03722f204F2320K25052K98798B11555k0068
17433A91487C472L11862d4556B60695e9696A77656J49851A22524Q3368O8744G0986
17421C50350G0558K12743a327A18232a16832L8457E7433K45661j02551K53561
17411D54104B07134n8831B6713K34389G5161K79451m8930h9761C99843A39482
17400C06907l5291c66924B87130I6952a21843C59873G6050K61400A0416J98773
17390B09189J50824A69121j8140R7536C9495i025D9599a58650D52064A23283n9476
17379F3807P635J48336a13829B75407F2241J15857L00452m6700A60678a01599
17368b4836A11448p7J8881C4351o752K16040l1908q637K57448e39B83066I9808
$$ plain form
17444 333681 349052 307157 -86131 95376 -203722 -6204 62320 287372 586170 211555 191487
17433 191487 3472 315334 -44556 260695 -59696 177656 327507 122524 205892 274636 70986
17421 350350 70558 283301 -1327 118232 -116832 -78375 57433 303094 200543 454104
17411 454104 207134 148303 26713 261102 75161 354612 305682 -89761 399843 139482
17400 306907 271616 -366924 287130 96952 -121843 359873 76050 337450 10416 209189
17390 209189 360013 169121 150981 248517 39495 -9025 49599 -158650 452064 123283 63807
17379 63807 71442 219778 -113829 275407 62241 178098 478550 431850 160678 -101599
17368 -24836 111448 111371 130252 34351 27599 243639 211731 203094 460542 -539 283066 99808
17355H8246k9865j5309K21348i036A41051c93153F1631a61206C74636I7119K81213
17344C78332j16261A10887J1901B089K44337k4498F4125i0225A8580K71151n7525
17333B32206j12081m5072J65131H876a54998B27354o237p5518G1939I844c5040
17321C98823p8351K3942j12163F9125M2023d53853B15075r4621J95941J41912
17311D58307l8661A72009o8507O4128B6676Q2621N7374j0725a25102E7272a3586
17299b05211B91837m685j15207J34390a01185K2362q0898C77038A7472J21504
17289A38976f9068n1457K7483H2155R262K16506I1067L4603d3695B82842M072
17278B86914A19437J59812C5618b63522C00342c47705A60849m0477J49161j24629
$$ plain form
17355 88246 58381 43072 264420 -9036 141051 -393153 61631 -161206 374636 97119 378332
17344 378332 262071 110887 122788 2089 246426 221928 64125 -90225 18580 289731 232206
17333 232206 120125 75053 240184 8876 -154998 227354 221117 145599 71939 9844 -35040
17321 398823 320472 344414 232251 69125 111148 -453853 215075 120454 316395 458307
17311 458307 419646 172009 103502 167630 26676 109297 166671 155946 -125102 57272 -13586
17299 -205211 291837 287152 171945 306335 -101185 -78823 -159721 377038 17472 138976
17289 138976 -69068 -120525 -93042 82155 91417 307923 91067 125670 -43695 282842 286914
17278 286914 119437 279249 35618 -263522 300342 -347705 160849 120372 269533 144904
17268A44904N1858L5810a68058A17296K43376j43187b01650C21482n2833d6441
17257a04241A03049P318j1070M5596L64968r3038A55748O3295C1904J06307C1454
17245D62580H9776R0718P1639j12395I80O9284P7231J20021a38701j85916A85639
17233H3050d9729B00861k7128c41764i6108D984J61782j5586L1088L4095n8118
17222A58245b28350G8955K39639N6407A53215J2881L6228o9860F4105M53252a32218
17210D29937j98166H4706J92682A8404K61593J57460B04108n1267J24347J03340
17200C80528j46900a70703B37203D4087N5281l1965k4192L32716a07562F9121
17189H290Q1200O3025K39456c843l7402A23481J42128J54042A70499M5052j7700
$$ plain form
17268 144904 196762 232572 -168058 117296 360672 217485 -201650 321482 268649 -46441
17257 -104241 103049 110367 99297 144893 509861 416823 155748 219043 31904 138211 31454
17245 462580 89776 180494 252133 139738 980 70264 147495 267516 -138701 -324617 185639
17233 83050 -49729 200861 173733 -341764 -96108 4984 166766 151180 182268 216363 158245
17222 158245 -228350 78955 318594 375001 153215 166096 202324 132464 64105 517357 -132218
17210 429937 231771 84706 277388 18404 279997 437457 204108 152841 277188 380528
17200 380528 233628 -170703 237203 44087 99368 67403 43211 375927 -107562 69121
17189 8290 89490 152515 391971 -3843 -41245 123481 265609 419651 170499 215551 197851
17178A97851R8318O2378J32121A22114K3965k744J57681A20997J02540a00574
17167D13235j82607N909O4473D2252A4024J87480Q56L11528B40110J49415d8050
17155B78171K60289a20694D2399p160b1281r6442B10402b30034A26898d6006A77270
17143F33135j64555e6085D3642h189A25358l2310J27152J41768m2277K33644k66986
17132B86349R9223G846N84058C4118J95448p1984J73792o8422j0797E8524J46436
17121B04960J70447J54029A30479K99730J76118j60980k03023l7064K61558j92510
17111B74308L09111B83502o2296l3497M4105j474K8098A13255J57930J27905p2868
17100C26222q0023N7493K83754r9017j38944a5125B72676o0326K86588A33390
$$ plain form
17178 197851 296169 358547 490668 122114 146079 143335 301016 120997 223537 -100574
17167 413235 230628 236537 301010 42252 14024 201504 202360 513888 240110 389525 -48050
17155 278171 538460 -120694 42399 35239 -21281 -117723 210402 -230034 126898 -46006 177270
17143 633135 468580 -56085 43642 -8189 125358 93048 220200 361968 319691 553335 286349
17132 286349 385572 7846 591904 34118 229566 157582 331374 262952 252155 58524 204960
17121 204960 375407 529436 130479 430209 606327 445347 242324 205260 466818 274308
17111 274308 583419 283502 221206 187709 231814 230340 258438 113255 271185 399090 326222
17100 326222 246199 303692 587446 488429 349485 -15125 272676 212350 498938 133390
17089F90847k44769J05896k43429K14103B13907O09734B59759K78529j32382A77489
17078C9794J57931J38293M6972J00215J5219A56763Q5929L49277j74532G3786
17067B61834L11568B7019M13583p8326J39744M8118o9925R0953A62398L74785
17057E37183B05314N3889j24917K04666p6036K67321A40056J55068p1179R6608
17047C20553J99202p8541q0499K57642k0417Q6431j83363C0749M97747O1282j46069
17036D43709k03953R8663j68194O36816l03738Q0135k50872O4051m7597A22629
17025C98840L21110q3462j29069B33478L22445o2169K18232k80232J80678o2393
17015E50039k32620p0577J46047j14471M31203k04553J69427C30846O20148A81991
$$ plain form
17089 690847 446078 551974 308545 522648 213907 823641 259759 538288 405906 177489
17078 39794 197725 336018 382990 483205 498424 156763 242692 591969 417437 73786
17067 261834 573402 27019 440602 362276 502020 550138 480213 571166 162398 537183
17057 537183 205314 259203 134286 338952 262916 530237 140056 295124 223945 320553
17047 320553 519755 441214 360715 618357 597940 684371 501008 30749 528496 589778 443709
17036 443709 239756 338419 170225 807041 503303 583438 332566 396617 349020 122629
17025 398840 719950 636488 507419 233478 555923 493754 711986 431754 612432 550039
17015 550039 317419 246842 392889 278418 709621 505068 674495 330846 950994 181991
17004G52254C35929L98034K16491D56700P4874J94483l4504B81489P12922D18001
16993H33976l46543j80287M72888j31442j14171M70898D15865R1650L43629k32611
16983F18533m6037L54032j33742j20469J06364l56723J98738r9114L02392r0461
16973G33513M7375k74148L14593q9360M26254m11592N01160k16214k73890N8006
16963H15697K3748R0531l5906r565l7597o9566j16008n0531K42918p5469J76202
16952I54454J56300j98423k51630K27371N380J01441r7553l41238N26555j37627
16942I45030k63546J92132K2216k87405M02768k86140K67252J0769j90826J11114
16932I23364L08823j77776p2234k04299L26684j24772r440M58227n82123K83143
$$ plain form
17004 752254 335929 733963 950454 456700 531574 726057 691553 281489 994411 418001
16993 833976 487433 307146 780034 648592 534421 1005319 415865 507515 851144 618533
16983 618533 572496 926528 792786 672317 778681 421958 620696 521582 823974 733513
16973 733513 780888 506740 821333 731973 1158227 746635 1247795 1031581 757691 815697
16963 815697 839445 929976 894070 884505 846908 777342 661334 610803 853721 778252 954454
16952 954454 1110754 912331 660701 888072 893452 994893 897340 556102 1082657 945030
16942 945030 681484 873616 895832 608427 1011195 725055 992307 1003076 812250 923364
16932 923364 1232187 1054411 982177 777878 1104562 979790 970350 1428577 846454 1129597
16922A129597M4124j56716j19669L75086j37064K46251l65496m903r794K9615
16912A031031j7142n3095K00838o7991j3019L38085k95434J91890J82950K24279
16902A722392k82749m44977N82127j87858J06348k21338J57025r5407J96617n1800
16892A480380k25592L09414j84633L82275l3222k18977K15056k91961J78790K63713
16882A875243j74387q3895j65571K91775j63570M40294k35342k17523L59977l01982
16872A625019J74123m9952J73071q5869R7981J99447p8556m4057K04270j21718
16862B093759J4410l057j2475j05512N40769k78886K35387j42932J28192j71859
16852B297796Q6707k02093N08547K3653k00730j76590O09531m83264K51927J03957
$$ plain form
16922 1129597 1173721 1017005 897336 1272422 1135358 1381609 1016113 1011210 1001416 1031031
16912 1031031 1013889 960794 1161632 1093641 1080622 1418707 1123273 1315163 1498113 1722392
16902 1722392 1439643 994666 1576793 1388935 1495283 1273945 1430970 1335563 1532180 1480380
16892 1480380 1254788 1564202 1379569 1761844 1728622 1509645 1724701 1432740 1611530 1875243
16882 1875243 1700856 1616961 1451390 1743165 1579595 2019889 1784547 1567024 1927001 1625019
16872 1625019 1799142 1749190 1922261 1836392 1934373 2133820 2055264 2011207 2215477 2093759
16862 2093759 2108169 2105112 2092637 1987125 2527894 2249008 2484395 2341463 2469655 2297796
16852 2297796 2384503 2182410 2690957 2714610 2513880 2337290 2946821 2463557 2715484 2819441
16842B819441L711L15099l33914J82416O2359n2585L56305m66150M35009K0783
16832C342474J2739j70281M8272K90174R8426K80358k59905o7886p964K71643
16822C838050L33702Q581k54514M29315l51114J68537L44950k0346k7503M05905
16812D875563j78456K05982O2420L552J82673j1749r2395M36266k51766L58301
16802E590391K98121q7768K32872o1981R6393L24047J86786j33936K64179j64042
16792F545062O66360K86978P2876k98318N25974L35088J31759J7065K64200J56558
16782H703602N6462J93465L99128M7691L70918K78027L82327L61884j36882O18249
16772A1274871J09686N11306J42659L84232N55380P06652M2837K87118O32106
$$ plain form
16842 2819441 2823152 3138251 2804337 2986753 3049112 2996527 3352832 2886682 3321691 3342474
16832 3342474 3355213 3184932 3233204 3523378 3621804 3902162 3642257 3574371 3566407 3838050
16822 3838050 4171752 4180333 3925819 4355134 4004020 4172557 4517507 4497161 4469658 4875563
16812 4875563 4697107 4903089 4965509 4969061 5151734 5139985 5047590 5483856 5232090 5590391
16802 5590391 5888512 5800744 6033616 5971635 6068028 6392075 6578861 6444925 6709104 6545062
16792 6545062 7211422 7498400 7571276 7272958 7798932 8134020 8265779 8282844 8547044 8703602
16782 8703602 8760064 8953529 9352657 9400348 9771266 10049293 10431620 10793504 10656622 11274871
16772 11274871 11384557 11895863 12038522 12422754 12978134 13684786 13727623 14014741 14646847
16763A4646847K49761Q21589R6515Q91706M00263N23855P81785M62667O19021
16754A9494009J106569Q7855J119611J034507M22496Q82558J181626Q77554J195401
16745B7402186Q45504J784932Q40100J717964J125800J430985K016095J398976
16737C8562542J824573J952610K099238K149914K497132K268434K374612L432203
16729E7161258K585668L656577L441201L842149M128036M506380M572913M856798
16721H8750980N045965N749188N977353O086966O375793P063411O609148P108596
16713A38767400P126909P477268O890058P015767O532679N945322N247805M402759
16705A89405967K980655K297469J092399l38936j820284k649226l899486m823471
$$ plain form
16763 14646847 14896608 15718197 15814712 16706418 17106681 17630536 18412321 18874988 19494009
16754 19494009 20600578 20688433 21808044 22842551 23265047 24147605 25329231 26206785 27402186
16745 27402186 28247690 30032622 30872722 32590686 33716486 35147471 37163566 38562542
16737 38562542 40387115 42339725 44438963 46588877 49086009 51354443 53729055 57161258
16729 57161258 59746926 63403503 66844704 70686853 74814889 79321269 83894182 88750980
16721 88750980 93796945 99546133 105523486 111610452 117986245 125049656 131658804 138767400
16713 138767400 145894309 153371577 160261635 167277402 173810081 179755403 185003208 189405967
16705 189405967 192386622 194684091 195776490 195437554 193617270 190968044 187068558 182245087
16697A82245087n673736o510481o939994o918263p539269p541935p394483p294639
16689A26432287o931033p077223o228617o140768o238576n189247n310384n078505
16681G8237934m478168l993231m179544l744805l600077k925731l180595l005268
16673D9130515k342603k396333k280424k095589j791017j754700j795413j634949
16665C3039487j351753j806866j001418j218052j148091j266428j157388o24860
16657B3464631r66637j196220p34776o96956r58210l83334p57925l46148j058664
16648A6365761J06717j165371k73361p89685r9653l89554n25600k06469p19737
16639A2303048n46641j3570j06515n67992n5796p45754r2269m69731k7290l13970
$$ plain form
16697 182245087 176571351 170060870 163120876 156202613 148663344 141121409 133726926 126432287
16689 126432287 119501254 112424031 106195414 100054646 93816070 88626823 83316439 78237934
16681 78237934 73759766 69766535 65586991 61842186 58242109 55316378 52135783 49130515
16673 49130515 46787912 44391579 42111155 40015566 38224549 36469849 34674436 33039487
16665 33039487 31687734 29880868 28879450 27661398 26513307 25246879 24089491 23464631
16657 23464631 22497994 21301774 20566998 19870042 18911832 18528498 17770573 17424425 16365761
16648 16365761 16472478 15307107 15033746 14244061 14144408 13754854 13229254 13022785 12303048
16639 12303048 11756407 11742837 11636322 11068330 11012534 10266780 10174511 9704780 9677490 9363520
16629I363520l73988m8392l46984k31838m16751q8307K58248m84232l14988j91151
16619G125137j68190k33468k141k50539Q4412n70495J59394l97532r4480J10734
16609E762832j67609j65077m1079j60401J12190M6728o87558n1980j567r195j5118
16598D622166m34152M2643J63444j67336l06399P9148j23209j26808K12805m81874
16588C480428J33930k4092P6909j2288l72993o1942O1398j89884K60143j25346
16578C226263n3947J19081m28621K77643l43309j89065J1328q249l0575o5390
16568B515159K53098q2652k06764O33l12106P6256P1462J54184Q2742j05068j34908
16557B312036l53461M71502m09410L06813m39289J08459p7573Q7456R711J14769
$$ plain form
16629 9363520 8989532 8941140 8594156 8362318 7945567 7857260 8115508 7631276 7316288 7125137
16619 7125137 6956947 6723479 6721338 6470799 6555211 5984716 6144110 5746578 5652098 5762832
16609 5762832 5595223 5430146 5389067 5228666 5340856 5387584 4700026 4648046 4646479 4637284 4622166
16598 4622166 4188014 4230657 4394101 4226765 3920366 3999514 3876305 3749497 3962302 3480428
16588 3480428 3614358 3590266 3667175 3654887 3281894 3219952 3281350 3091466 3351609 3226263
16578 3226263 3172316 3291397 2862776 3140419 2797110 2608045 2619373 2611124 2580549 2515159
16568 2515159 2768257 2685605 2478841 2479474 2167368 2243624 2315086 2469270 2552012 2446944 2312036
16557 2312036 1958575 2430077 2020667 2327480 1888191 1996650 1919077 2006533 2016244 2131013
16547B131013n7288j33430k71350L6831M44206n42867P6748L37038m04317K56741
16537A873325r4206M7244k68739L1431j53579J60296K96538k60425p983m13417
16527A210485K39914J87988n4400j76908k69465K88550p3015J5352R107J33821
16517A511429l55086p816K02045k73885j24106O11073n89073L53896r4919k34893
16507I98665j78115Q6958J40664K11329J72297k48467j60144k231k26889L23346
16497A117413j51115J01106j04824R3526l00125N04632r7709k4012q1597q3239
16487I74056Q1926r9907J00335j72317M6562k53605J35862M34244K37281n54683
16477I29754o7680R2551P0292k62714K0767p7571j04901j5751K93275j15444p4943
$$ plain form
16547 2131013 2073725 1940295 1668945 1705776 2149982 1607115 1683863 2020901 1616584 1873325
16537 1873325 1779119 1826363 1557624 1589055 1435476 1595772 1892310 1631885 1623902 1210485
16527 1210485 1450399 1638387 1583987 1407079 1137614 1426164 1353149 1368501 1377608 1511429
16517 1511429 1156343 1148527 1350572 1076687 952581 1563654 974581 1328477 1233558 998665
16507 998665 820550 907508 1048172 1259501 1431798 1183331 1023187 1020956 794067 1117413
16497 1117413 966298 1067404 962580 1056106 755981 1260613 1162904 1138892 1057295 974056
16487 974056 1055982 956075 1056410 884093 930655 677050 812912 1247156 1484437 929754
16477 929754 862074 954625 1024917 762203 782970 705399 600498 584747 878022 762578 687635
16466F87635j24887K70963j59224L63639k81896k48609J53299o3166J83475j76407
16456F04822J6511J16808j6493q4519j0853k19460K69131l6156M17496m27026
16446F30261o7717J2405R1720K08153C96081N48897A99123O36901J02072j63893
16436G74203N9325j23151j46756L3143k69003R7410J95598O4890J94669l60503
16426E19825L1107k27501J93879J66994B27424K53184O804K89173j32231k6044
16416F18310P2708k81843J37533j23566M6621A20018J74753M24613C49592K54563
16406F04155q0445m7551m9553A58509N60616B06465M89732k54287J61891B26979
16395G99868l11282n5549K31250j24120B60977l182O5385A42956K98143L98280
$$ plain form
16466 687635 562748 833711 674487 1038126 756230 507621 660920 597754 781229 604822
16456 604822 621333 738141 721648 637129 626276 406816 675947 639791 1057287 630261
16446 630261 562544 574949 666669 874822 396081 944978 199123 836024 938096 774203
16436 774203 833528 710377 563621 596764 327761 425171 620769 685659 880328 519825
16426 519825 550932 323431 517310 684304 227424 480608 487412 776585 644354 618310
16416 618310 691018 409175 546708 423142 469763 120018 294771 719384 349592 604155
16406 604155 523710 476159 426606 158509 719125 206465 696197 441910 603801 226979
16395 799868 488586 433037 664287 540167 260977 257795 323180 142956 441099 839379
16385H39379C93238L40764B96051K59663j87471J11934j25823j66724K93131o6103
16375D14658J68163n7529j86037K82807B61515K44009p9446J92603j53831B19141
16364A98818L13844B55052K82429O0365B12959M0380L29382B69748J59262A07907
16353A76829O5709e4993F81465B80727m276J17466K29986C06781a6831A74376
16342F25100A85493A3355O02463k59642r4819j2304q342L5716m6717j5470E6788
16330D18425A73707K64233r3736R8969m3049r9457n0013o0818P250R6448j33753
16319A59781J47333j1015O179A10155n308J97364A47954K38345R4489C7632J44746
16308A82378k4145L55135A29537J69766n0611R6068o0439L4380G437K46425q6089
$$ plain form
16385 839379 393238 734002 296051 555714 368243 480177 354354 187630 480761 414658
16375 414658 582821 525292 339255 622062 261515 505524 426078 618681 464850 219141
16364 198818 512662 255052 537481 597846 212959 253339 582721 269748 429010 107907
16353 176829 242538 -54993 681465 280727 276451 393917 623903 306781 -16831 174376
16342 625100 185493 13355 615818 356176 261357 249053 240711 276427 229710 214240 56788
16330 418425 173707 437940 344204 443173 400124 300667 250654 189836 197086 293534 159781
16319 159781 307114 296099 302278 110155 104847 302211 147954 386299 480788 37632 182378
16308 182378 158233 513368 129537 299303 248692 344760 284321 318701 7437 253862 167773
16297A67773J95915a88606K8933B27048D3794a09557B98238A5309J61444K52441
16287D29194j99759J57792f702C39325D8096J36339K78272N945j27724A2002M19130
16276D31132A80549o1071J02002d8452B61614A0968M9061J14689g1681K9136B08850
16264B63385n6399q2625P8813j0768A6272M35406a9605C45206A40400J0606J36164
16253B87170L9712e0635a104D98081j96892B1495L00511j56066J561F2552r150
16242E3402b0950A75553J88536j77685n7468f1985C76342F5977K08805n5290K3861
16231B43353Q5742A04151J6616c61898A77233M5624I8768D2908M71147B52403
16220A64329f3411A13953l3131M3544K83J2285E127R5777O7082l6059J00194K7304
$$ plain form
16297 167773 363688 -188606 -159673 227048 43794 -109557 298238 15309 176753 429194
16287 429194 229435 387227 -6702 339325 48096 184435 462707 468652 340928 12002 431132
16276 431132 180549 119478 221480 -48452 261614 10968 60029 174718 -71681 -42545 208850
16264 263385 206986 124361 203174 192406 16272 451678 -19605 345206 140400 151006 287170
16253 287170 326882 -50635 -1104 498081 301189 21495 322006 165940 167501 62552 53402
16242 53402 -20950 175553 364089 186404 128936 -61985 376342 65977 274782 219492 243353
16231 243353 329095 104151 120767 -361898 177233 222857 98768 42908 514055 252403
16220 164329 -63411 113953 80822 124366 124649 136934 5127 100904 167986 131927 232121 259425
16208B59425o63A18161a5811j59710A20574J66421i7913E7767J73829C5341L56754
16197C92095A18161d0377E5168M78658H4179e2959A83509q248f0263j97187G8295
16185a65033b1712I2493a03313B0893O7012J00485e3308B58144d0158j46994L6770
16174a50382e2660A68209A2454J77792j6857K946o2494J77950r3023a68945d5764
16162a84483C08632B7969J16719k7979R4033F3731K5802J30309a11992D8116R3804
16151A41920C7308L9075Q4524J8584n256a42938C95983i4848c522j9504n4323
16140g7349B05778J28030k1620E1988a72402H4890L12854a44697A53681D6291
16129c20640D93617A57984a71047r2629D4109K91886F1351j5586c6126j54757
$$ plain form
16208 259425 258762 118161 -15811 -175521 120574 286995 -97913 57767 231596 35341 392095
16197 392095 118161 -40377 55168 533826 84179 -52959 183509 175261 -60263 -257450 78295
16185 -165033 -21712 92493 -103313 20893 87905 188390 -53308 258144 -40158 -187152 -150382
16174 -150382 -52660 168209 12454 190246 173389 176335 113841 291791 198768 -168945 -45764
16162 -184483 308632 27969 144688 116709 210742 63731 89533 219842 -111992 48116 141920
16151 141920 37308 76383 160907 179491 174235 -142938 395983 -94848 -3522 -23026 -77349
16140 -77349 205778 333808 312188 51988 -172402 84890 397744 -144697 153681 46291
16129 -320640 493617 157984 -171047 -263676 44109 335995 61351 45765 -36126 -190883
16119a90883A13613f4060C777i6055k3994B51618B1376J2788b72437L9434g5190
16107B13882b33427A27665b10459d885A60117Q8139A21082A4741P1792h2139k26854
16096c08993R7706C58205b50169a11058E24175a35389A99497M9595A07115K2387
16086A29502n7116L79964b2084q8311A63303C4618K53985a63157A84524C5936
16075i1922o4896F7536P5982B7120J01389B3852a33492D3698J63254b73859b2314
16063A6856k228i1023B5493g6603D29896A15338b7326G6099L5572b83274C08290
16051C9283H733g4675A410O7511R1057O88n5446b56473D9880c4322j03906j29290
16039b67518b4094m7459l67025a43375f6130B7686e9346B37602a43431A05161
$$ plain form
16119 -190883 113613 -64060 3777 -96055 -120049 251618 21376 34164 -272437 -233003 -75190
16107 213882 -233427 127665 -210459 -4885 160117 248256 121082 14741 86533 -82139 -308993
16096 -308993 -211287 358205 -250169 -111058 524175 -135389 199497 249092 107115 129502
16086 129502 72386 452350 -22084 -110395 163303 34618 288603 -163157 184524 35936
16075 -91922 -156818 67536 143518 27120 128509 23852 -133492 43698 206952 -273859 -22314
16063 16856 14628 -91023 25493 -76603 429896 115338 -27326 76099 111671 -283274 308290
16051 39283 8733 -74675 1410 68921 159978 160666 105220 -256473 49880 -34322 -138228 -267518
16039 -267518 -24094 -71553 -438578 -143375 -66130 27686 -59346 237602 -143431 105161
16028B84068A35503f149G3483e0807D6233a797A71437d7907k2238P531a4765K191
16016a2574k75398I0478f3349F4527j1025P5472b06830b6227j31210B21715j02565
16005A19150h219q6034p8721A00175a81917e8808D8783b2272P709j02838m5414
15994a62815E622g7284J4131A12255O0541b29473c240k05105C97026g1478a3956
15982g5495A0344f1179A1447a67799D5542Q6038A792h5279c291D2334e2381E4926
15969A37455K5523A8189M73368A73655L86062B15166H1870j5589K24175l0283
15959B60173j28787r23B1258L12712j23647b4295E9911d18074A10136b0827j3910
15948c4737q0625L0087d0605m2228j09603N9574o7762i670B90827b22596E8999
$$ plain form
16028 284068 135503 -6149 73483 -50807 46233 -1797 171437 -47907 -70145 -62614 -14765 -12574
16016 -12574 -287972 90478 -63349 64527 53502 128974 -206830 -26227 -157437 221715 119150
16005 119150 -8219 -94253 -172974 100175 -181917 -58808 48783 -22272 -14563 -117401 -162815
15994 -162815 5622 -77284 -63153 112255 172796 -229473 -3240 -208345 397026 -71478 -13956
15982 -75495 10344 -61179 11447 -167799 45542 131580 1792 -85279 -3291 42334 -52381 54926
15969 137455 162978 18189 491557 173655 559717 215166 81870 66281 290456 260173
15959 260173 131386 130463 21258 333970 210323 -24295 59911 -418074 110136 -20827 -34737
15948 -34737 -115362 -85275 -40605 -82833 -192436 -132862 -200624 -9670 290827 -222596 58999
15936f0657A17118D7677O2106a24177j57808a28724B0812a72621K4631L6714H4941
15924a17330p8302A15583A5972b52124C3203K49901i3726D69490c04063J35869
15914a68194g2418C2171J14759K2145N596a58853B0750b44632b580j53357D2509
15902A19645a39935A21131h1207r708k11416D6966b1029A00924B4827a92441A44826
15890c39038a33564q6399a3372A04755c01269P4240j75106A13134l2951k8751
15880E1432J2693Q0731B6929G192J68148a56705r3309A6184L6646b02328A03954
15868d1764A6099c1868k55453i10H4a92329p8247k5272A34203b740e82k16860
15856b17442A01697a01863n0458j36301G7632a39518a0044p2134L84H398h3427
$$ plain form
15936 -60657 117118 47677 109783 -124177 -281985 -128724 20812 -172621 -147990 -111276 84941
15924 -117330 -195632 115583 15972 -252124 33203 283104 -93726 469490 -304063 -168194
15914 -168194 -72418 32171 146930 169075 174671 -158853 20750 -244632 -2580 -155937 42509
15902 119645 -139935 121131 -81207 -90915 -302331 46966 -21029 100924 24827 -192441 144826
15890 -339038 -133564 -219963 -13372 104755 -301269 -227029 -402135 113134 80183 51432
15880 51432 64125 144856 26929 7192 175340 -156705 -250014 16184 52830 -202328 103954
15868 -41764 16099 -31868 -287321 -910 84 -192329 -270576 -295848 134203 -2740 -582 -217442
15856 -217442 101697 -101863 -152321 -288622 77632 -139518 -10044 -82178 -81794 8398 -83427
15844a4075j04625M5629j23189I3739j4621N5108j9293L583N9460a55488r8603
15833b54091G3244g2602B05751b64429O5192j66008B5114a72964q3583A28437
15822d5499o9190n2641M6828A9018K34005a29230A41610d07190h0119n800c5283
15810a37843l17026a34061A23926a93476c8757o9360A0002K03023d59453B46162
15799I1627b77044f7808r377a463j02277n6155A42353K25268A42662b80772I267
15787b06084B9550b56807A40103E211a0649F8296N3143a16620B4626i6566K7079
15776f9487J6812l03716a72980e4643j09858f4989l3057p6485O9107k19125B0078
15764b24983j09320A54424J0061a18638A19399E0264f176k1565j20659e3088j86367
$$ plain form
15844 -14075 -118700 -73071 -196260 93739 79118 134226 114933 118516 177976 -155488 -254091
15833 -254091 73244 -72602 205751 -264429 -199237 -365245 25114 -172964 -256547 128437
15822 -45499 -114689 -167330 -120502 19018 253023 -129230 141610 -407190 -80119 -85919 -35283
15810 -137843 -454869 -134061 123926 -193476 -38757 -108117 10002 213025 -459453 246162
15799 91627 -277044 -67808 -77185 -1463 -103740 -159895 142353 367621 142662 -280772 9267
15787 -206084 29550 -256807 140103 5211 -10649 68296 121439 -116620 24626 -96566 -69487
15776 -69487 -52675 -356391 -172980 -54643 -164501 -64989 -98046 -174531 -105424 -324549 20078
15764 -224983 -334303 154424 164485 -118638 119399 50264 -6176 -27741 -148400 -53088 -239455
15753b39455a17897A64526J3294m0689h6221G8363l2991b36753J11270C7620L09870
15742C47490j44211a05771m5845R877q6833p498k27030h8284f649A17085L1424
15731A48509c39051a05419B10417i1973A55946b40685P3760q6722a10939m30425
15721e41364f3928o9791B92737A44892m1290a2482k4785E573J17626a1878k21300
15710b33178O1434C07299r904I2911C5731d58824a7573k15949g2656p4200e983
15698e9427A60166m5762h4589R248F3420L09502i5534j26236M8247J2504g8198
15686c9042A93453e1635j04868p4924G9350e5643k66317F72g1029c564B52919
15674a28341b4854j86362B2316g8427k14810a8704A88626c75086b5913m5817B24582
$$ plain form
15753 -239455 -117897 164526 177820 137131 -86221 78363 45372 -236753 -125483 37620 347490
15742 347490 203279 -105771 -151616 -141739 -228572 -236070 -463100 -88284 -6649 117085 148509
15731 148509 -339051 -105419 210417 -91973 155946 -240685 -166925 -253647 -110939 -541364
15721 -541364 -63928 -133719 292737 144892 103602 -12482 -37267 5573 123199 -11878 -233178
15710 -233178 -171744 307299 297395 92911 35731 -458824 -17573 -233522 -72656 -146856 -5983
15698 -59427 160166 114404 -84589 -75341 63420 372922 -95534 -221770 -173523 -161019 -78198
15686 -39042 193453 -51635 -156503 -231427 79350 -55643 -321960 672 -71029 -3564 252919
15674 -128341 -24854 -211216 22316 -78427 -293237 -18704 188626 -375086 -25913 -71730 224582
15662D6893a43994J9011j3072C5471J04036o15c4170k10759A00798e0631j92849
15651b43480J11105O072j50188J22482b0070o3840B0154a95854F1787a4876E081
15639D1850L22735a06217k8508k10375c9228I8754a73510j26541F0769a73286
15628D2499j3991M4077h7335p6480A72880K9442a26175a6752o0118q5371L9851
15617a22390M8704A04076A6992D323d68528F617b4442C01806c64500B39810E4356
15605A38513A2611L69483a60016A19246j9585b02286N1212c5198k85582a04957
15594i8395B87118j22695c6708G4599P0356b75990h0907c4282G2657C2285d8520
15582a55377N0746B27749a41643B00180C4278e6718E3291J86941P1156A50277
$$ plain form
15662 46893 -143994 -124983 -138055 35471 139507 138892 -34170 -244929 100798 -50631 -243480
15651 -243480 -132375 -126303 -276491 -154009 -20070 -83910 20154 -195854 61787 -14876 5081
15639 41850 364585 -106217 -134725 -345100 -39228 98754 -173510 -300051 60769 -173286
15628 42499 28508 72585 -87335 -163815 172880 202322 -126175 -16752 -76870 -162241 -122390
15617 -122390 -73686 104076 16992 4323 -468528 6617 -24442 301806 -364500 239810 54356
15605 138513 12611 382094 -160016 119246 99661 -202286 -151074 -35198 -320780 -104957
15594 -98395 287118 164423 -36708 74599 144955 -275990 -80907 -34282 72657 32285 -48520
15582 -155377 -104631 227749 -141643 200180 34278 -56718 53291 240232 311388 150277
15571a40702C5248c98066f8186Q588K5371B17974a11456A41399D373L1094j5608
15560A9859e2848q8376B24014a02841A78871F9295c17199G1153a15725d9180I4308
15548H5333P6002F2389J05895a06102b0672m0596n3728l6279a4430A02939b37060
15536G6730R1642a45850A0516b8695j254B60060D3014A9153L872a60641O0351
15525a00290C3274a14941j08768A18575J18546a20913H004L38018b25295I2181
15514D449b94718A5482c76112a75424Q3798D188b97968B17672q7522A2290a9119
15502A02959e5192A65909J80794a83401C2411K3388P030e353k16510B32241o8183
15491A64058H0734c34129J47347E9655h837l00255I5670N0346a39565j50242L2932
$$ plain form
15571 -140702 35248 -398066 -68186 -59598 -34227 217974 -111456 141399 4373 35467 19859
15560 19859 -52848 -141224 224014 -102841 178871 69295 -317199 71153 -115725 -49180 94308
15548 85333 161335 62389 168284 -106102 -20672 -61268 -114996 -151275 -14430 102939 -237060
15536 76730 168372 -145850 10516 -28695 -29949 260060 43014 19153 23025 -160641 -100290
15525 -100290 33274 -114941 -223709 118575 237121 -120913 8004 346022 -225295 92181
15514 4449 -294718 15482 -376112 -175424 -91626 4188 -297968 217672 130150 12290 -19119
15502 102959 -55192 165909 346703 -183401 32411 55799 62829 -5353 -221863 232241 164058
15491 164058 80734 -334129 -186782 59655 -8837 -309092 95670 146016 -139565 -289807 -256875
15480b56875e3176A90565O3746a8634B9569a06799C53390a57152b3454j27217
15470a50671j7787B26520d6763j10066B05403c15708A69913i5464A35736h0940
15459A26337d0433C4203L7600c82965E0201b04354C0973a04797n61n144r2291
15448b02793A9141c20031i1682j60808e5254m733I6128b9474r17B19983j01816
15437A18167l9034a184A44756G1735h9858C917a94716M8574C7192J34215a88116
15425I543J73595j0243N8246F0333J11747a23794B04996r2335i0574G72c0220
15413f0804l79860a49449a2049I5634K9714a21373C21909a53900A23404n7463
15403F5941d16258f4524j9074B73081o3735b8470C89372b32515L5810j18356L6700
$$ plain form
15480 -256875 -53176 190565 254311 -18634 29569 -106799 353390 -157152 -23454 -150671
15470 -150671 -168458 226520 -46763 -156829 205403 -315708 169913 -95464 135736 -80940
15459 126337 -40433 34203 71803 -382965 50201 -204354 30973 -104797 -105358 -110502 -202793
15448 -202793 19141 -320031 -91682 -252490 -55254 -59987 96128 -29474 -30391 219983 118167
15437 118167 79133 -1184 144756 71735 -89858 3917 -194716 -146142 37192 171407 -188116
15425 9543 183138 172895 231141 60333 172080 -123794 204996 112661 -90574 772 -30220
15413 -60804 -440664 -149449 -12049 95634 125348 -121373 321909 -153900 123404 65941
15403 65941 -416258 -64524 -83598 273081 209346 -28470 389372 -232515 -196705 -315061 -278361
15392b78361i4756A60022N8512p8167g712C1166d7667l7185k91279I3837a15m3908
15380d4023A85878c1807D0434a4974B3827o253L12333f1593n6199E7742C553P9584
15368H3137b4919o5446L0955B94842B4687J4759b25741b0686c799F1731e0342
15356A49463l4709b73288J09443B17374a39784G5426b20604A97679h0734l1938
15346a12672m6585f1437N210A82420E3866a95128A60500n1613c93032E53092a98349
15334G8905b1336o9213C6383h4203j33969g1120B1378b1570C941b3046j17276
15323a40322A66036a54197M17P151e7916A31475A8584J10462P225a5423k335m2414
15311f0172K2242j1776A08565b6241A58746b22942N3266H4346a01540H0402l4144
$$ plain form
15392 -278361 -94756 160022 218534 140367 -7712 31166 -47667 -84852 -376131 93837 -115 -44023
15380 -44023 185878 -31807 40434 -14974 23827 17574 329907 -61593 -117792 57742 3553 83137
15368 83137 -24919 -90365 -59410 294842 24687 39446 -225741 -20686 -3799 61731 -50342
15356 149463 114754 -273288 -163845 217374 -139784 75426 -220604 197679 -80734 -112672
15346 -112672 -159257 -61437 -56227 182420 53866 -195128 160500 108887 -393032 553092 -198349
15334 78905 -21336 -90549 36383 -84203 -218172 -71120 21378 -21570 3941 -23046 -140322
15323 -140322 166036 -154197 -153780 -146629 -57916 131475 18584 129046 136271 -15423 -17758 -60172
15311 -60172 -37930 -49706 108565 -26241 158746 -222942 -169676 84346 -101540 80402 46258
15300D6258h4547A58327R0594b07628f1435H9158k5113c18705O7393j0165b1965
15288a29695k89861b9917j3709I0382L3900J64026A19885O7719h1574I8153J69195
15277B67348m9879b06969B7428B481K7637L3371a14116c0809A62984M8566c83663
15265a76077M9038A08169a9325A60002D9825b56421B82791a76208C5931b47681
15254G1839J94831I3746C2337c02932i9955B22150O8183a49876G7609c66485A41816
15242D5553c29971D85275h3056j76875B74688B8680o127p056J40663J13686e2834
15230A54599L72216A29405b01033C4651a11271H177J70662l3848P2550G8720K22389
15219C01109a10828k76233D19082A54188a29989c7286j41374k4567O7971B32182
$$ plain form
15300 46258 -84547 158327 248921 -207628 -61435 89158 64045 -318705 -251312 -261477 -21965
15288 -129695 -419556 -29917 -43626 90382 124282 288308 119885 187604 -81574 98153 267348
15277 267348 217469 -206969 27428 2481 30118 63489 -114116 -30809 162984 211550 -383663
15265 -176077 -127039 108169 -19325 160002 49825 -256421 282791 -176208 35931 -247681
15254 71839 266670 93746 32337 -302932 -99955 222150 290333 -149876 77609 -366485 141816
15242 45553 -329971 485275 -83056 -259931 274688 28680 22553 15497 156160 269846 -52834
15230 154599 526815 129405 -201033 34651 -111271 8177 178839 144991 217541 78720 301109
15219 301109 -110828 -387061 419082 154188 -129989 -37286 -178660 -203227 -135256 232182
15208h6189K8423h779A78912J510R3341d12374a73696h1795D27589b4659l6838
15197f1497K8172j84893h8592A17829b34747b8052k78841A0103M57004h9621B18207
15185H3280J55106a91207C26395b5867D3509a23181N8434j05831H6433J73812
15175B60245A09886b47898A63477i3129q696B21092a91490C19927F8035M9129
15165A17164L3515g1282l34669F2963J31560A1301K19634D3746i7448o642j16944
15154b21034F5614e8617C468J28164K0447e6711A04104a03895a399A15088e0354
15142A2360K12821L0432b04482E3365O7358L9347B0991J00967C9063J70914f0216
15130A13962J72301B3452K06173a22659N9764b715B42867f9817A73583G7790d4349
$$ plain form
15208 -86189 -57766 -8779 178912 180422 273763 -412374 -173696 -81795 427589 -24659 -61497
15197 -61497 -33325 -218218 -88592 117829 -234747 -28052 -306893 10103 467107 -89621 218207
15185 83280 238386 -191207 326395 -25867 43509 -123181 -64747 -170578 86433 260245
15175 260245 109886 -247898 163477 -93129 -101825 221092 -191490 319927 68035 117164
15165 117164 150679 -71282 -405951 62963 194523 11301 230935 43746 -97448 -104090 -221034
15154 -221034 65614 -58617 3468 131632 152079 -56711 104104 -103895 -1399 115088 -50354
15142 12360 225181 255613 -204482 53365 120723 160070 20991 121958 39063 209977 -60216
15130 113962 286263 23452 229625 -122659 -62895 -2715 242867 -69817 173583 77790 -44349
15118d3901J3532C33363G6870J69587I3500D1683M1161J50568b3308k1281A70303
15106A75271L4767c7764A11607D3172J59437B5015N295J20417p103K04346h5212
15094A68784J25167j41432O095n3684o810L33716A18181e8520C9096b49515B06336
15082C8908J57202a84503d864A72779q0365J85073o6695O9440B2870P8190A689
15070b63487A73904J90933a93336C50886J00629l2691B01636b09479K1848A4995
15059D10054C6353a11046H7110h4434c4145C88503G6528j2045j830O03775A09311
15047A37331B1074P3310J03816G0846B1752b31887D77061A53736a47655f3817
15036H6667C2479f6215C92256h0611B49380j08941l909m2671K9292K62703A26949
$$ plain form
15118 -43901 -30369 333363 76870 246457 93500 41683 82844 233412 -23308 -44589 170303
15106 175271 210038 -37764 111607 43172 202609 25015 30310 150727 143624 347970 -85212
15094 168784 293951 152519 158614 104930 98120 431836 118181 -58520 39096 -249515 206336
15082 38908 196110 -184503 -4864 172779 92414 277487 210792 280232 22870 101060 1689
15070 -263487 173904 364837 -193336 350886 451515 418824 201636 -209479 -187631 14995
15059 410054 36353 -111046 87110 -84434 -34145 388503 76528 64483 62653 666428 109311
15047 137331 21074 94384 198200 70846 21752 -231887 477061 153736 -147655 -63817
15036 86667 32479 -66215 392256 -80611 249380 140439 136530 93859 123151 385854 126949
15024B22730B1252J03866C0971K7347J64702G856K20658J34213a18582A44912
15013D0275J66610E5683e5471B05809f5573B45967g8589C36008j33722L16790
15003E19076C1788K98526j30843O5316I775P9101C2458K57246j44545A8545K8709
14992D7254R7230L0513a4645E3371a27842A32714J17921A21123n125K5157d2193
14980B20491L4253K0185p3454K81555k32715f4757C00185K5259D0691J18493A8501
14968A35797K93454A42168K25406A17599L76586j81502h3013A08538A5321J20387
14958A35708B3577J75592J73349e3723B57435F2121J55088F1110L61574d9695
14947A87176r367b50874D1499K54768h3558D11530a109A95061K62884H6961J17850
$$ plain form
15024 222730 21252 125118 30971 58318 223020 7856 228514 362727 -118582 144912
15013 40275 206885 55683 -55471 205809 -65573 245967 -78589 336008 202286 519076
15003 519076 31788 330314 199471 264787 9775 88876 32458 289704 145159 18545 47254
14992 47254 144484 174997 -14645 53371 -127842 132714 250635 121123 115998 141155 -42193
14980 220491 254744 274929 201475 483030 250315 -64757 300185 325444 40691 159184 18501
14968 135797 429251 142168 367574 117599 494185 312683 -83013 108538 15321 135708
14958 135708 23577 199169 372518 -53723 257435 62121 217209 61110 422684 -49695
14947 187176 177809 -250874 41499 296267 -83558 411530 -1109 195061 457945 86961 204811
14936B04811D7256K94100n7712A905K82769G4113e848A4629N3865J84972K26697
14925D80163A53013J39893j34513J93454j09479m2261K50778p2821Q1635A32228
14914A07416J93727k2965L33518k50913K69434j07253B10007l3698J51979K1411
14904C49699I51L72182p9899J2501K93754B42244M3116K72834I8430K02894H1590
14892B61961A25334L91525A68712a67854B34630L01537A935N02239q1138D1834
14881A80315J70833A60941J90238J3785j37996i0170D34503K4884j29718A42279
14870E06423o9942p9700n870q595J24179k20592J18022J74241j56475K1651j58506
14859B44836B4411p099N48323E5296K65075I2422M15209j97148k1440A43808N32654
$$ plain form
14936 204811 47256 341356 283644 1905 284674 74113 -5848 14629 68494 253466 480163
14925 480163 153013 292906 158393 351847 242368 200107 450885 378064 459699 132228
14914 107416 301143 278178 611696 360783 630217 522964 210007 176309 328288 349699
14904 349699 951 373133 293234 305735 599489 242244 285360 558194 98430 301324 81590
14892 261961 125334 516859 168712 -167854 234630 536167 1935 504174 423036 41834
14881 180315 351148 160941 351179 364964 226968 -90170 434503 459387 329669 142279
14870 506423 436481 356781 350911 342316 466495 245903 363925 538166 381691 403342 244836
14859 244836 24411 17312 565635 55296 320371 92422 507631 310483 289043 143808 676462
14848F76462j21399r9431R6934j4454L0529A97606o4499L81869B40912J99392
14838D40304k18829j7478O6271k2402N7294A42920Q4181K6374K7008L63637q6104
14827E58016q6796M6147j62054Q9419Q8717q5846o1087p9603r3319R882n3648
14816A69828L62824B36823q8608L93918J60943J77549k67844l03376J41367j49408
14806C01364q0517K99689o4759K11129j77322m4736q240j18186O1074r2207J34732
14795D22021K7503K26780k59403j38903J50988r6479M58959l54547j146Q5336
14785E21109K0932L8280j07968K54704k00007j53258J94715n3163k5465N6115
14775E45994k62543L11335J9458j44726j52973L28902L7968k39067l0044l6858
$$ plain form
14848 676462 555063 455632 552566 538112 568641 197606 133107 514976 240912 440304
14838 440304 221475 203997 270268 247866 305160 142920 227101 253475 280483 644120 558016
14827 558016 471220 517367 355313 444732 533449 447603 386516 306913 213594 223476 169828
14816 169828 532652 236823 148215 542133 703076 880625 612781 309405 450772 301364
14806 301364 220847 520536 455777 666906 489584 444848 436608 318422 379496 287289 422021
14795 422021 449524 676304 416901 277998 428986 332507 791466 436919 435773 521109
14785 521109 542041 580321 472353 727057 527050 373792 568507 515344 489879 545994
14775 545994 283451 594786 614244 469518 316545 645447 683415 444348 414304 377446
14765C77446L24343l01378N96982l04191L66748n26853m4033J25594B96063J8252
14755C14315L67018L8134j7995k868J26059k40933j95612Q3998j12357J76651
14745E36410k07511L91827R3319j129l46322J90290k29691J13647Q1498B47048
14734G56418J57668m06128L26403l21206L6732J5261j0047O8066K23632k74400
14724E72399M62177E12536J09944M4504J11071k04281j4886L41826j63869J56408
14714H93253k57002k00325K99916k8414j63319L40732j12931K28015m63640k2411
14704E13874L58031l32721J63613K84438j16356J25265j02534j35620R7445J03004
14694I58439k70033q6644L13053j53363J88333l9583j36399J16378O2067m8944
$$ plain form
14765 377446 701789 400411 997393 693202 1059950 533097 489064 614658 296063 314315
14755 314315 681333 719467 701472 698604 824663 583730 388118 472116 359759 536410
14745 536410 328899 720726 814045 812916 466594 656884 427193 540840 622338 247048
14734 756418 914086 507958 834361 513155 549887 565148 555101 623167 846799 572399
14724 572399 1034576 512536 622480 666984 778055 573774 558888 900714 736845 893253
14714 893253 636251 435926 735842 707428 544109 884841 771910 999925 536285 513874
14704 513874 871905 539184 702797 987235 870879 996144 893610 757990 855435 958439
14694 958439 688406 601762 914815 761452 949785 910202 773803 890181 952248 903304
14684I03304j15579L49998m79697M47877j84138j996M4706q3765j22407K59916
14674A018219k91371M84092k30806k61066J73571J15643j86777o6554j34593L14704
14664I35062k40897K08752j03183J32159l8360k4726k05839K38503N6305q0500
14654H77276L28703n57320M58903j96080J45769J82851j5817l89905L02977k41059
14644H96298R2166j19178K0730K65499K24544j86442m18990K29375R9191K46335
14634A349528k50884j16094K76426k3279l21866M61686j95920J84754J7586l70878
14624A011059L54970p0414j86830J85897N9827j39810k75559M59747j65540j43836
14614A089511M80295l91870L45619L8346j58150k68406J21912N0818J83988K49728
$$ plain form
14684 903304 787725 1137723 658026 1105903 921765 919769 964475 880710 758303 1018219
14674 1018219 726848 1210940 980134 719068 892639 1008282 821505 754951 620358 935062
14664 935062 694165 902917 799734 931893 893533 868807 662968 901471 957776 877276
14654 877276 1205979 648659 1107562 911482 1057251 1240102 1224285 834380 1137357 896298
14644 896298 988464 869286 890016 1155515 1380059 1193617 774627 1004002 1103193 1349528
14634 1349528 1098644 982550 1258976 1235697 913831 1375517 1179597 1364351 1381937 1011059
14624 1011059 1366029 1295615 1108785 1294682 1354509 1214699 939140 1398887 1233347 1089511
14614 1089511 1569806 1177936 1523555 1561901 1403751 1135345 1257257 1308075 1492063 1741791
14604A741791j58821J9614q871j76776K68852l93821m558J96036j9981K19417
14594A682882p3573P5344J06743n23287M49181l28400l4673O10944k2814o2782
14584A879565k50614K50778l25191J62394k15524J28337k39363K44729J16493
14575A751604J3001P7888q3612q4J52461j5707j24904J44234k32463M06229j95458
14564A893189K12306k50783K54327k75948k79599M53650M94961o39466L70827
14555B233464N0860J11138j77929L3099o9584K09426J92806p4625R9431J89438
14545B797524L30954j23746L39919M2152K36605L61995K48934M34257O30538J118177
14535F417309J126230K051607L477243N121511P984589M020669j0692814p416035
$$ plain form
14604 1741791 1582970 1602584 1593713 1416937 1685789 1291968 1287410 1483446 1463465 1682882
14594 1682882 1609309 1684653 1791396 1268109 1717290 1388890 1354217 1965161 1942347 1879565
14584 1879565 1628951 1879729 1554538 1716932 1501408 1629745 1390382 1635111 1751604
14575 1751604 1764605 1842493 1758881 1758797 1911258 1895551 1770647 1914881 1682418 2088647 1893189
14564 1893189 2105495 1854712 2109039 1833091 1553492 2007142 2502103 1862637 2233464
14555 2233464 2284324 2395462 2217533 2250632 2181048 2390474 2583280 2508655 2608086 2797524
14545 2797524 3128478 3004732 3344651 3386803 3623408 3985403 4234337 4668594 5299132 6417309
14535 6417309 7543539 9595146 13072389 18193900 26178489 30199158 19506344 12090309
14527A2090309m425961k119903j250100p65905l04039k82045k15570j17006j00339
14518B509441o6277K45193k72286j50870M21658k17134l44956J47056L3067M8176
14508B353068Q3193k12077J01177L41213j55461Q1061J32898j14443j0595M5078
14498B645112O4364K70420j83551k67653N87330m39333K90451R2228j00554K35794
14488C194608J55606o0445l06514K75033J48372j65954j39728M68164j17130j46866
14478C305146L54779r9125r2962J16978j7635p5861l161J57986L34515j14247
14468C866413k92402L91660r7323J12034Q6381j11720n8466L41064Q9729j14374
14458D212996J9290J35549p384O8606M15956m22282L11142j56846L64665j51793
$$ plain form
14527 12090309 7664348 5544445 4294345 3528440 3224401 2942356 2726786 2609780 2509441
14518 2509441 2443164 2688357 2416071 2265201 2686859 2469725 2124769 2271825 2304892 2353068
14508 2353068 2436261 2224184 2325361 2666574 2511113 2592174 2725072 2610629 2600034 2645112
14498 2645112 2709476 2979896 2796345 2528692 3116022 2676689 2967140 3059368 2958814 3194608
14488 3194608 3350214 3289769 2983255 3258288 3406660 3240706 3100978 3569142 3452012 3305146
14478 3305146 3659925 3560800 3467838 3584816 3567181 3491320 3488159 3646145 3980660 3866413
14468 3866413 3574011 3965671 3868348 3980382 4066763 3955043 3896577 4237641 4327370 4212996
14458 4212996 4232286 4367835 4360451 4429057 4845013 4422731 4733873 4577027 4941692 4789899
14448D789899J51027k2128L9781j10408k17701K09332J70543K4240K75539q0654
14438E229470J97314j60070M56877n9884k35323L64352J49141k51524k57847O82966
14428F115472k71106L69116J29784l48444K00900K53812M4230J35044q2236K8448
14418F575020L41469K66870j17971p4797N06873J57462k02548J9722J34752M97524
14408H104376r1239K57981l68487L38766K13026J96926L32962n045l70072J70865
14398H780059J00850L35249p4101K99152L04864P3706l9835k9177O33045J10369
14388A0494181J93784J64330j02563L08165J91735R9599j8143N50787R9517K31317
14378A2212709K88284K26366L20625K2932m6532L72260M85502J87627L19305L81065
$$ plain form
14448 4789899 4940926 4918798 4958579 4848171 4630470 4839802 5010345 5034585 5310124 5229470
14438 5229470 5426784 5266714 5723591 5663707 5428384 5792736 5941877 5690353 5432506 6115472
14428 6115472 5844366 6213482 6343266 5994822 6195722 6449534 6493764 6628808 6546572 6575020
14418 6575020 6916489 7183359 7065388 6990591 7497464 7654926 7452378 7472100 7606852 8104376
14408 8104376 8013137 8271118 7902631 8241397 8454423 8651349 8984311 8979266 8609194 8780059
14398 8780059 8880909 9216158 9142057 9441209 9746073 9819779 9779944 9750767 10383812 10494181
14388 10494181 10687965 10852295 10749732 11057897 11249632 11349231 11331088 11881875 11981392 12212709
14378 12212709 12500993 12727359 13047984 13070916 13024384 13396644 13882146 14069773 14389078 14770143
14368A4770143K95124M3178K46012M35280M33953k97043O97589J69260L28813
14359A7122309O60325J70416q160N39344P08355Q1803O47569O26871K912L35428
14349B0887172N45536O26361K06210Q88392M47881L53105P97535K65183P17598
14340B5734973P74039K45828P50187Q55186K80225Q18579Q77673Q84068N78826
14331C1799584J390228K05637R37175J222012R04149P57376J127917R71299J288856
14322D0604233J103874J595860Q66967J362378J419566J326672J710057J587836
14314E1577443J641450J858758J611384J719687K108698J996473K199408K091082
14306F6804383K304557K475548K906188K622980K980472K962113K920850L735723
$$ plain form
14368 14770143 15065267 15108445 15354457 15789737 16223690 15926647 16624236 16793496 17122309
14359 17122309 17782634 17953050 17944890 18484234 19192589 19274392 19921961 20548832 20551744 20887172
14349 20887172 21432708 22059069 22265279 23153671 23601552 23954657 24752192 25017375 25734973
14340 25734973 26509012 26754840 27505027 28360213 28640438 29459017 30336690 31220758 31799584
14331 31799584 33189812 33395449 34332624 35554636 36458785 37216161 38344078 39315377 40604233
14322 40604233 41708107 43303967 44170934 45533312 46952878 48279550 49989607 51577443
14314 51577443 53218893 55077651 56689035 58408722 60517420 62513893 64713301 66804383
14306 66804383 69108940 71584488 74490676 77113656 80094128 83056241 85977091 89712814
14298H9712814L469431L626885M048966M068347M404749M668912M499787N285949
14290A23785840N328176N763211O024504O409417O756570P492703P807494Q080825
14282A77448740Q042802R483544R757244R572024J1013505J1335898J1846296
14275B48500053J2514172J3152392J3277734J3810267J4448412J4869060J4789487
14268C45361577J4550575J4123563J3921935J3156653J2486148J1786438J0523698
14261D35910587R147152Q092366O881471L914282J645214Q13223N23474j458939
14253D65468830p544996p826264r301321j0955796j0985248j2470414j3542772
14246C92842019j3873509j4099479j4698941j4630570j4204507j4670072j3787332
$$ plain form
14298 89712814 93182245 96809130 100858096 104926443 109331192 114000104 118499891 123785840
14290 123785840 129114016 134877227 140901731 147311148 154067718 161560421 169367915 177448740
14282 177448740 185491542 194975086 204732330 214304354 225317859 236653757 248500053
14275 248500053 261014225 274166617 287444351 301254618 315703030 330572090 345361577
14268 345361577 359912152 374035715 387957650 401114303 413600451 425386889 435910587
14261 435910587 445057739 453150105 460031576 463945858 465591072 466404295 466927769 465468830
14253 465468830 457923834 450097570 440796249 429840453 418855205 406384791 392842019
14246 392842019 378968510 364869031 350170090 335539520 321335013 306664941 292877609
14239B92877609j3989880j3329263j3002265j2799197j2428102j1528448j1515366
14232B04285088j0990588r630058r269720q268795q152890p993167p386622o344216
14224A36249032o224049n870501n278701n372525n108981m628379m271427l946461
14216I5548008l605430l666627l511903l235790l327895k700877l101752k441091
14208F9956643k754950k200306j934626k228453j720065k088447j975207j710501
14200E3344088j682534j474048j606668j351288j428780j515877r97828j222903
14192D2064162j107665j024845j552088j019927r12599o20852j287931o75396
14184C3862859n33335j383482o00627q10344p98377j117815l41560o06336o38016
$$ plain form
14239 292877609 278887729 265558466 252556201 239757004 227328902 215800454 204285088
14232 204285088 193294500 183664442 174394722 166125927 157973037 149979870 142593248 136249032
14224 136249032 130024983 124154482 118875781 113503256 108394275 103765896 99494469 95548008
14216 95548008 91942578 88275951 84764048 81528258 78200363 75499486 72397734 69956643
14208 69956643 67201693 65001387 63066761 60838308 59118243 57029796 55054589 53344088
14200 53344088 51661554 50187506 48580838 47229550 45800770 44284893 43287065 42064162
14192 42064162 40956497 39931652 38379564 37359637 36447038 35826186 34538255 33862859
14184 33862859 33329524 31946042 31345415 30535071 29736694 28618879 28277319 27670983 27032967
14175B7032967p92535n95178o58514n24636m26533o18870p21573l53691o04122
14166B1737315n45279j49060n82747n16722m52243j17045n95751j08903o80484
14157A7989081l18273k04049o57861j54062l62495j23527l11867j42479q11247
14148A4903221J61115q4110q32033J47547j05097m09706l635m16735m22757J356
14138A2939166l34786k51184J8900m48421j56262J94845o34527k16170j93208
14129A0918353j25692j28573j38462J22213l18643k47303j06482o28150N48862
14120I896123k99165L2316l52480p5436o9783l96445J00595k75929j7565k69385
14110H272846L773r5125j43255R9575k79519k42852P7886J1668j29887k10650
$$ plain form
14175 27032967 26240432 25645254 24986740 24462104 24035571 23416701 22695128 22341437 21737315
14166 21737315 21192036 21042976 20460229 19943507 19491264 19374219 18778468 18669565 17989081
14157 17989081 17670808 17466759 16808898 16654836 16292341 16168814 15856947 15714468 14903221
14148 14903221 15064336 14980226 14148193 14295740 14190643 13780937 13777302 13360567 12937810 12939166
14138 12939166 12604380 12353196 12372096 11923675 11767413 11962258 11327731 11111561 10918353
14129 10918353 10792661 10664088 10525626 10647839 10329196 10081893 9975411 9347261 9896123
14120 9896123 9596958 9629274 9276794 9201358 9131575 8735130 8835725 8559796 8542231 8272846
14110 8272846 8276619 8181494 8038239 8137814 7858295 7615443 7693329 7704997 7575110 7364460
14100G364460J6011j16312j20593Q0848k22294m32644K76350j47352k18191J56017
14090F636300j250m09378M5584J01832k81572l68512P4957k14770K46995q3220
14080E746966q9424J05816R7781k70438P0222n92630M21370k52332J7547j55129
14070E099749K9428k78613l9489k80232J99076q8224P2783J78313j97530j224
14060D694037j43380N8488k69940K14058l8449N060o7612l4488k60665J98024
14050D355133l56576L93779j32541r8220l11312K05768j54730K31351j15384o28398
14040C388870L06754k26066L83865q3764j8589J70094n40894J17010k39775P3204
14030C330709O5845k7511k2409k70224L45366j99123R5455l74388L2943j40640
$$ plain form
14100 7364460 7380471 7264159 7143566 7224414 7002120 6569476 6845826 6698474 6480283 6636300
14090 6636300 6635050 6225672 6271256 6373088 6091516 5723004 5797961 5583191 5830186 5746966
14080 5746966 5657542 5763358 5861139 5590701 5660923 5068293 5489663 5237331 5254878 5099749
14070 5099749 5129177 4850564 4811075 4530843 4729919 4641695 4714478 4892791 4695261 4694037
14060 4694037 4550657 4609145 4339205 4553263 4514814 4519874 4452262 4417774 4157109 4355133
14050 4355133 3998557 4392336 4259795 4161575 3850263 4056031 3901301 4132652 4017268 3388870
14040 3388870 3695624 3469558 3853423 3769659 3751070 3921164 3380270 3497280 3257505 3330709
14030 3330709 3396554 3369043 3346634 3076410 3421776 3222653 3318108 2943720 2976663 2836023
14020B836023J05003M06574j50891k25932K71183k0701l71304R9570l26276N11519
14010C134768J15487l82880l92565L44998K03006m07379L61170l2267m36271j1468
14000B496599O752j14192M96956l57079J43435k88060L19153j87764K23645j10999
13990B628446k45096j58183J91947K84945K2615o91869N47703J9144K52721l76137
13980B476236M06553k67014K37757M69139P81122P01963J687809K894178N137587
13971A4525330Q304386P287972p549549p414663m894763k353097j477856j026923
13963E400837j052852r4259n61033m24545K37751l07442M5445l10439n50582o447
13953B376434L99622n71094K25854J52612k47278k28397K0181k876p4128K05617
$$ plain form
14020 2836023 2941026 3347600 3196709 2970777 3241960 3221259 2849955 2949525 2623249 3134768
14010 3134768 3250255 2867375 2474810 2819808 3022814 2615435 2976605 2944338 2508067 2496599
14000 2496599 2503351 2389159 2886115 2529036 2672471 2384411 2703564 2515800 2739445 2628446
13990 2628446 2383350 2225167 2417114 2702059 2724674 2032805 2580508 2599652 2852373 2476236
13980 2476236 2882789 2615775 2853532 3322671 4103793 4805756 6493565 9387743 14525330
13971 14525330 22829716 30117688 22568139 15153476 10258713 7905616 6427760 5400837
13963 5400837 4347985 4253726 3692693 3268148 3505899 3198457 3243902 2933463 2382881 2376434
13953 2376434 2776056 2204962 2430816 2583428 2336150 2107753 2127934 2125058 2050930 2256547
13943B256547o0462m74753J81298P3423J26294j67523K99170m20900J42365J1868
13933A967327N7215k29152L13202k16678M1863j80228J784j04487K42884n04776
13923A388954N64606k67816N3814J11227p9448k5981J06820m39420L95975j25700
13913A683031k20969M5785M00571j76327l34407K30927k21622K31829k10548L22756
13903A751026j50323j43020l5232K45247k57930j52957J50066L7128K41375k23806
13893A461574k0622K95362n48529K81469l335l17390L00200p6635j94626K69751
13883A447219m38656K81056j4980L6094j19995q2512J61734J81525l14411O5257
13873A202331J51029l1581L0312j17676K16466j17493k21131O51853n28649l87214
$$ plain form
13943 2256547 2196085 1721332 1902630 1976053 2102347 1934824 2233994 1813094 1955459 1967327
13933 1967327 2024542 1795390 2108592 1891914 1933777 1753549 1755333 1650846 1893730 1388954
13923 1388954 1953560 1685744 1739558 1850785 1771337 1745356 1852176 1412756 1808731 1683031
13913 1683031 1462062 1507847 1908418 1732091 1397684 1628611 1406989 1638818 1428270 1751026
13903 1751026 1600703 1457683 1422451 1667698 1409768 1256811 1406877 1444005 1685380 1461574
13893 1461574 1440952 1736314 1187785 1469254 1465919 1148529 1448729 1372094 1177468 1447219
13883 1447219 1008563 1289619 1274639 1310733 1190738 1108226 1269960 1451485 1137074 1202331
13873 1202331 1353360 1321779 1352091 1234415 1450881 1333388 1112257 1764110 1235461 848247
13863H48247N57440j38516j01818j48021K59054k16272J85443k46535j0871L01666
13853A289817j19539P9399j59387K73816K3790l23023L70708m23473J27699j40882
13843I98925q1344M2013k69360J64517J66256o4259m9527K86946j12687O3859
13833A145339j76467K26419q1967k60070R1959K26395l44805r369J56422j27198
13823H46658K55293l53532o6810j8548N2896J69003J30087J76954j25999O160
13813A072162P0349k96844J55790L3487k8610J64422j10158m06030J30740L77965
13803A163273n33772M39680J5879l82698J73550j58849J38239k28982L47802J00099
13793A074221L4446k80453L9652L82605l76646j66571K65276j21312O1554k66075
$$ plain form
13863 848247 1405687 1267171 1165353 1017332 1276386 1060114 1245557 999022 988151 1289817
13853 1289817 1170278 1249677 1090290 1364106 1387896 1064873 1435581 1012108 1139807 998925
13843 998925 917581 959594 690234 854751 1021007 956748 907221 1194167 1081480 1145339
13833 1145339 968872 1195291 1113324 853254 945213 1171608 826803 817434 973856 846658
13823 846658 1101951 748419 681609 663061 715957 884960 1015047 1192001 1066002 1072162
13813 1072162 1142511 845667 1001457 1034944 1006334 1170756 1060598 654568 785308 1163273
13803 1163273 629501 1069181 1085060 702362 875912 717063 855302 626320 974122 1074221
13793 1074221 1108667 828214 867866 1250471 873825 707254 972530 851218 912772 646697
13783F46697K33487j50439r3659N45012l95003K3714k04533J20557o8642J78985
13773H36176k46337M7586J41293K12695j7621k53924k70405P6144L07270j01412
13763G31465N1455J7214j09174L5825Q7159l00871K17818r0396L17258D70571
13752I61583j86111q3188k37585M09146j02578q5785j61448J92303j06425K46410
13742H46322C43824M46748j35798k44832J91452j34320K65865k15961J32768L61113
13732A010859O2232n36036K47823A24575M59419M6875k09510L77805l00032K62580
13722G61712C44802K74191R4956k05161L62993j43493j6882j7946j07823j22874
13712D62763J13821B67376L74365j19381J27127K27321k17674q8285r3433l5837
$$ plain form
13783 646697 880184 729745 636086 1181098 786095 809809 605276 725833 657191 836176
13773 836176 589839 637425 778718 991413 973792 719868 449463 525607 832877 731465
13763 731465 782920 800134 690960 726785 813944 513073 730891 640495 957753 470571
13752 961583 775472 692284 454699 863845 761267 675482 514034 706337 599912 846322
13742 846322 343824 790572 654774 409942 601394 467074 732939 516978 649746 1010859
13732 1010859 1073091 537055 784878 124575 583994 630869 421359 799164 499132 761712
13722 761712 344802 618993 713949 508788 871781 728288 711406 693460 585637 462763
13712 462763 576584 267376 641741 522360 649487 876808 659134 570849 477416 441579
13702D41579J64555J15920r9050j54813K50121o5110O1593B87333L58802B73005
13691G96191r5383l4420k85324J76025m4309J80899k80811k2488j2122l907L19350
13680F93701L7303n0955j40770q7441r232J23637j02691A5592M11992k5786N1342
13669D53140r7269K06095J70476K2829l71725J38336A84840N99206l02563J05628
13659E87111B48351K25972A46632O18932l10709J23032k32928K5548L37296o3774
13649F44029N67B39040J23412J82658K74753l30423q3463K20157k7519M1118l4473
13638F05260A60860K48610j54669N4892J9540J92006A85877J42769j31232K50500
13628D47914J54615p4454A93240J34870K15348j47012j17354Q3199k1576L6780
$$ plain form
13702 441579 606134 722054 623004 468191 718312 653202 714795 287333 646135 273005
13691 796191 700808 666388 381064 557089 512780 693679 412868 390380 378258 374351 693701
13680 693701 731004 680049 539279 451838 442606 566243 463552 15592 427584 401798 453140
13669 453140 355871 561966 732442 755271 383546 521882 184840 784046 481483 587111
13659 587111 248351 474323 146632 765564 454855 577887 344959 370507 707803 644029
13649 644029 644596 239040 362452 545110 819863 489440 405977 626134 598615 639733 605260
13638 605260 160860 409470 254801 309693 329233 521239 185877 328646 197414 447914
13628 447914 602529 528075 193240 328110 543458 396446 279092 362291 340715 377495
13618C77495l1217K86776n9506k31757K51448j11878j99405A24367J84332K30397
13608E39096B66418K18450p8361q645J47471j13701N9094J94859A50377M68853
13598F19230B16390r9052M21757j60031M1069n0686J86649j23318B07635J38394
13588C46029L12321B13190M2216L91684p2558j47546q3091L56825l45865r5123
13578B59732L12800k75800J24773K09703A87413L44161j97887N445L86331k79203
13568D46260M3202L8411A0919J65788N06892j91803A84657L51348j60601M4617
13558D20021J33524k11691K32465A09128M54154B38411A08753L09432J12400p1741
13548D58844K36327B58722A10581N38491k61826H8633J6412J15186J18087J32927
$$ plain form
13618 377495 346278 633054 573548 341791 593239 481361 281956 124367 308699 539096
13608 539096 266418 484868 406507 397862 545333 431632 490726 685585 150377 619230
13598 619230 216390 117338 539095 379064 420133 369447 556096 432778 207635 346029
13588 346029 658350 213190 255406 647090 574532 426986 343895 700720 354855 259732
13578 259732 572532 296732 421505 631208 187413 531574 333687 339132 725463 446260
13568 446260 489462 527873 10919 176707 683599 491796 184657 536005 375404 420021
13558 420021 553545 341854 574319 109128 563282 238411 108753 418185 530585 458844
13548 458844 695171 258722 110581 649072 387246 88633 105045 220231 338318 471245
13538D71245N4778A90934L18044j42619L14346J5948B0547L12313A29866M77541
13528F07407B04443L0205P0810c0960B7563K55898F9151J35159D0402L42775n8413
13517C24764A57860m3610K261M98036j89586J81454k19149L17090B89708j06470
13507A83238C4570P0956M23653l6268k42326A18782R4930J07069o6506k8363O8684
13496B94596E9246K9381L76716r8206r6325K61686j94295J5022m7558K71106B27317
13484G68743l23200j47585J23142j76633K14457O2725j95853A31509J37512P6115
13474C45136J11750M8919k42470J15501G4332A4678J44574M10407j95285j67893
13464B06481l6725q1600K32455j44366m3148J75416G4951N31L2200K07710J4116
$$ plain form
13538 471245 526023 190934 508978 366359 680705 696653 20547 332860 129866 607407
13528 607407 204443 234648 305458 -30960 27563 283461 69151 204310 40402 383177 324764
13517 324764 157860 114250 116511 614547 424961 606415 387266 704356 289708 183238
13507 183238 34570 105526 529179 492911 250585 118782 213712 320781 254275 225912 294596
13496 294596 59246 88627 465343 367137 270812 532498 338203 353225 305667 576773 227317
13484 768743 445543 297958 421100 244467 458924 521649 325796 131509 269021 345136
13474 345136 456886 505805 263335 378836 74332 14678 159252 569659 374374 206481
13464 206481 169756 88156 320611 176245 133097 308513 74951 75482 107682 315392 329508
13453C29508J98986A98087B7854N1498K45837p9240C3458K22040i3392B66301
13442A26652J31068j14324O9426K38024q8975m1060n6699j8139k9475F1362J7808
13431G9170L0613m2044L94773k8841m9542r5433q1815N5931C5279J91512m5719
13420A81072A5936J16876J43563p0858I2053J17964F561J32138n9509K47549k1198
13409C05541k2640G9359K75423A00906L21441A96032e6880E96378F5063K16220
13399B81283r1112E6959J13892R8407A02818j410E0061J28054o8989K39553J87971
13388E36650i851j4174A97383O71D9931Q2596L1709N7066L6850A20026k8618b9509
13375E6601J36871J56780j39484H1618Q1647o5559A2172K53171c1969C86067B8003
$$ plain form
13453 329508 528494 198087 27854 79352 325189 245949 33458 255498 -93392 266301
13442 126652 257720 143396 212822 450846 361871 320811 264112 245973 216498 61362 79170
13431 79170 109783 67739 462512 433671 384129 288696 206881 262812 35279 226791 181072
13420 181072 15936 132812 276375 205517 92053 210017 6561 138699 79190 326739 305541
13409 305541 282901 79359 354782 100906 422347 196032 -56880 596378 65063 281283
13399 281283 190171 56959 170851 269258 102818 101408 50061 178115 109126 348679 536650
13388 536650 -9851 -24025 197383 198054 49931 132527 164236 221302 258152 120026 91408 -29509
13375 56601 193472 350252 210768 81618 163265 97706 12172 265343 -31969 386067 28003
13363g6649A04507M34943j00231J5062A79651L53947k43621O7909O1002a06076
13352C11686j46039m6179L435L7925l0777k5757b0220A97149o2707J53625A13523
13340F97729l47046K6213m1757j55341J09492O1508k3429K63503I9910K41722
13330C41632k6768q1139l3215j7565K88896M398j50124b10615B75895o99J446
13319B76642D0361J14611L6085K57920A74049C27L56090E8553K38490M5219J68147
13308E10409A67338b0479A74037J73683H9724L02855J03766B38863F6842M35791
13298E02633D4919M01463A823a4574A12642C2561L24951j45020a2665m5604K3905
13287c4364I1584a08729l7675D4288J96043p2506p8801a33137m5336e1471B82224
$$ plain form
13363 -76649 104507 539450 439219 454281 179651 533598 289977 357886 418888 -106076
13352 311686 165647 119468 122903 160828 130051 104294 -20220 197149 134442 288067 113523
13340 697729 350683 376896 335139 179798 289290 350798 327369 590872 99910 341632
13330 341632 314864 233725 200510 182945 471841 476239 326115 -210615 275895 275196 276642
13319 276642 40361 154972 191057 448977 174049 327 356417 58553 297043 342262 510409
13308 510409 167338 -20479 174037 347720 89724 392579 496345 238863 66842 502633
13298 502633 44919 446382 1823 -14574 112642 32561 357512 212492 -12665 -58269 -34364
13287 -34364 91584 -108729 -146404 44288 240331 167825 89024 -133137 -178473 -51471 282224
13275B47028L3888A21627n6613M2015J42379q3620a2403B30199J15276j47729
13265A97746D5001L98612f6278B60994K92633A69352F4958a27067G627f0587B07067
13253C88644j25380C5734J97283B1874J80348D9087L8368R6053n62K18750F3869
13241A2849J50775O4005o5825P1402i768l5251B4174K59711J6148A03731L80449
13230D84180A77934K7178a7747j01539D56440j81860G9275K20772j28801d0792
13219B7094O1223M9284o0483i1440K8363C09092A16938h6145A3554O1155a93658
13207c06680A3934M2870c9264C28270j1940A12846J51626F1522g0670D4435e1342
13195B55068k9029J66756j96206R94o4G6228L22470F6782J6955C3345J78489J32415
$$ plain form
13275 247028 280916 121627 65014 107029 249408 165788 -12403 230199 345475 197746
13265 197746 45001 443613 -66278 260994 553627 169352 64958 -127067 7627 -60587 207067
13253 388644 263264 35734 233017 21874 202222 49087 87455 183508 182946 401696 63869
13241 12849 163624 227629 161804 233206 -9768 -45019 24174 283885 300033 103731 484180
13230 484180 177934 205112 -17747 -119286 456440 274580 79275 300047 171246 -40792
13219 27094 88317 137601 77118 -91440 -63077 309092 116938 -86145 13554 74709 -193658
13207 -306680 13934 56804 -39264 328270 316330 112846 264472 61522 -70670 44435 -51342
13195 255068 226039 392795 196589 197583 197519 76228 398698 66782 83737 33345 211834 344249
13183C44249L1006C4749e7318B05939r2759P3483e7377k42498A72304a46838f9568
13171A67630J47246r3227b5301H9955L5624m9103J43714c0044j1321B04263R5022
13160B99285c4236A41830F9702J40938k8760L0123F7903a89799A38007b38755
13149f0287k44692A13377a56374B47210P2876a07239C06275l9340C324O2191J0945
13138G6460J47174A05568D0848f00A1451h2911A29019b5306G7703f3061B04140
13126e1620B70229a22310c7534a3001E45399B5116b37837A51264E779a2750C00624
13114i1926A27736m5281c04724B320L51320c9404m2549b0390E2876M2586A6376
13102C545Q0639a9752A02732A5521K08002b50775D8847K51722c52j83208A6563
$$ plain form
13183 344249 375255 34749 -57318 205939 113180 186663 -57377 -299875 172304 -146838 -69568
13171 167630 314876 221649 -25301 89955 125579 76476 220190 -30044 -41365 204263 299285
13160 299285 -34236 141830 69702 210640 181880 212003 67903 -189799 138007 -238755
13149 -60287 -304979 113377 -156374 247210 320086 -107239 306275 266935 3324 65515 76460
13138 76460 223634 105568 40848 -600 11451 -82911 129019 -25306 77703 -63061 204140
13126 -51620 270229 -122310 -37534 -13001 545399 25116 -237837 151264 5779 -12750 300624
13114 -91926 127736 82455 -304724 2320 353640 -39404 -81953 -20390 52876 95462 16376
13102 3545 84184 -19752 102732 15521 223523 -250775 48847 300569 -352 -183560 16563
13090B30600b31880o3697A65181k294a55163A16906c21119d9698F2200a02263
13079C1318J42707K35405j38860G8984M0016n5900d9776A47938c7793D8684f48
13067b130A86455a12008D3358A4340K2036b4088p9730A21639L4126K28279j66453
13056B17591m1343K21807D9220J64023a06148C62101b4614B87423M8679b46015
13045A05037N0469J60602j5500A46954i6726A79664m5746J65376A48661N9234
13035B07895J86542j92227r7634M2487E0227J46439E0666b2586A45987k0379B9666
13023A05312O0223J15792m4087a84612A55938J39940M7682a91212H7802D3870
13012b6158C50534g2547j38558C474b2982B05225J09461A16186a21256B12156
$$ plain form
13090 230600 -231880 -295577 165181 162887 -155163 116906 -321119 -49698 62200 -102263
13079 31318 174025 409430 270570 78984 119000 63100 -49776 147938 -37793 48684 -648
13067 -2130 186455 -112008 43358 14340 36376 -24088 -103818 121639 155765 384044 217591
13056 217591 176248 398055 49220 213243 -106148 362101 -24614 287423 336102 -246015
13045 105037 155506 316108 300608 146954 -96726 179664 133918 299294 148661 207895
13035 207895 394437 202210 104576 147063 50227 196666 50666 -22586 145987 125608 29666
13023 105312 165535 281327 237240 -184612 155938 295878 343560 -191212 87802 43870
13012 -26158 350534 -72547 -211105 3474 -22982 205225 314686 116186 -121256 212156
13001H1464a9253f088A39735a03352H0873d8501n3900A05469f9253C5265r978
12990B5287b46513D61259a40068A86373k9992b14653O5035B35533g54B24351F5515
12978I9813g105A48967a82327o5C14212a38840B04886K37093A99107a73492c4149
12966d5944H4863O304a21433C29292E6514P1510P8074a3418j47521A21039h0812
12954E1885J1102J39114H2940b5293l02875H6454N1543i595A60569b02919C3046
12942D16306a64925A5889M6207l760A4054O5364L8826K33839A7606d8000n4252
12931a02252j69587D18302A1024g2517A49807a81786F2943L07810o7606b60842
12920a61166A7269K53686h9885K942n7261B16489g8571k25269A42693O8809Q6397
$$ plain form
13001 81464 -19253 -6088 139735 -103352 80873 -48501 -102401 105469 -69253 35265 25287
12990 25287 -246513 461259 -140068 186373 156381 -214653 -149618 235533 -754 224351 65515
12978 99813 -7105 148967 -182327 -182392 314212 -138840 204886 441979 199107 -173492 -34149
12966 -45944 84863 91167 -121433 329292 56514 128024 206098 -13418 -160939 121039 -80812
12954 51885 62987 202101 82940 -25293 -328168 86454 137997 -9595 160569 -202919 33046
12942 416306 -164925 15889 62096 58336 14054 79418 118244 352083 17606 -48000 -102252
12931 -102252 -271839 418302 11024 -72517 149807 -181786 62943 370753 303147 -260842
12920 -161166 17269 270955 -89885 -86943 -144204 216489 -78571 -303840 142693 211502 297899
12909B97899a93438Q2033F3971N577l2839J34214c9326D00158I0633Q1994H0812
12897E5060J69722b21374H3742M3312c28762d3468q0886B5315C667b120I9603
12885a04423B9889J1067O9398P5016a23401A32525b773k16136A41828a01831d2638
12873d62161H8011q755B7327a56858e8050B46746p8661m1537J10880g1730B2424
12861a41952A91892A5057a5035A94378b63025A21145a22140l7774H1359a06752
12850A81229D0860K92596d54322a64084B41500A02674a78720n6494E2749R1069
12840A43818e1166p4230L0016B81972p1177Q623H1941G922K54167b57760i2729
12828B82667e2388G4222J51076a82121A01031R6927e6413A03555B0710a01332
$$ plain form
12909 297899 -193438 -111405 63971 69548 36709 170923 -39326 400158 90633 172627 80812
12897 55060 224782 -221374 83742 127054 -328762 -43468 -124354 25315 3667 -2120 99603
12885 -104423 29889 40956 110354 185370 -123401 132525 -2773 -218909 141828 -101831 -42638
12873 -462161 88011 79256 27327 -156858 -58050 246746 168085 126548 237428 -71730 22424
12861 -141952 191892 15057 -15035 194378 -263025 121145 -122140 -159914 81359 -106752
12850 181229 40860 333456 -454322 -164084 241500 102674 -178720 -235214 52749 143818
12840 143818 -51166 -125396 -95380 281972 210795 219418 81941 7922 262089 -257760 -92729
12828 282667 -52388 74222 225298 -182121 101031 197958 -56413 103555 20710 -101332
12817E4958A4271J54394b23959D3505L21108F5641M7987k2518a28940B6309h8128
12805a01278A75965c9347j15779L0284E0010A5548a63476P8340p9669A96873d2016
12793b00844A29980g1252B09670b6414A58873p0830N8989M3165a07988k27253
12783c35241H9796a83912L4700B16458i2670A78842a94772C38517C0397K8358
12773E8755N389M49000j54006g7744k29621D44679f5049C12240a72328E4338K2847
12762G7185O9924e0583r7284j8027e1285k64431C14998A4501J37630a3218A20135
12750a00471c1021B50145g708I1885b10163A19159a8586l4382B89271K82647f2730
12738A97430a65828m4530H7418a60851A70744C3964a32178N0657k28777N7875
$$ plain form
12817 54958 14271 168665 -223959 43505 364613 65641 113628 91110 -128940 26309 -88128
12805 -101278 175965 -39347 -155126 -124842 50010 15548 -163476 -85136 -164805 196873 -42016
12793 -200844 129980 -71252 209670 -26414 158873 88043 147032 190197 -107988 -335241
12783 -335241 89796 -183912 -149212 216458 -92670 178842 -194772 338517 30397 58755
12773 58755 64144 513144 359138 -77744 -307365 444679 -65049 312240 -172328 54338 77185
12762 77185 147109 -50583 -147867 -165894 -51285 -315716 314998 14501 152131 -13218 120135
12750 -100471 -31021 250145 -7708 91885 -210163 119159 -18586 -52968 289271 571918 -62730
12738 197430 -165828 -210358 87418 -160851 170744 33964 -132178 -81521 -310298 -252423
12728b52423B21711a59251o4358B4812J53196m5368d0845F6099J50469J16103
12718C32671A39764L3372O0310J20430A25921b9178l1402G0647R6630n2656c0200
12706b39312B13701C1240J62153b75150b8622A91055r3641H756K93650k4831M3332
12695C20907A03268L8459J21955R0945j47553n8052h6156I6151K38962J8476i8518
12683a91972C13535E9723a03459h484A07033M0735m48K5624a22666N8381A03276
12671a39135F4413c6870E6835J53903J87108A74867J56972b9207D5964J41852
12661A87816f8899C54742i5216n8741A83292p7073b02963F3789a36647b612A78699
12649A18023j0068l6940J73357l7252e6959n566F1045P289a4131q0898B35118
$$ plain form
12728 -252423 221711 -159251 -223609 24812 178008 132640 -40845 66099 216568 332671
12718 332671 139764 173136 233446 353876 125921 -29178 -60580 70647 167277 114621 -30200
12706 -239312 213701 31240 193393 -275150 -28622 191055 97414 8756 302406 277575 320907
12695 320907 103268 141727 263682 354627 207074 149022 -86156 96151 335113 353589 -98518
12683 -191972 313535 59723 -103459 -8484 107033 147768 147320 172944 -122666 -64285 103276
12671 -139135 64413 -36870 56835 210738 397846 174867 331839 -29207 45964 187816
12661 187816 -68899 354742 -95216 -153957 183292 106219 -202963 63789 -136647 -2612 178699
12649 118023 107955 71015 244372 207120 -56959 -62525 61045 68334 -14131 -95029 235118
12637A11005a22250d6685D5391L47503a398B66616g9799J6770D5130c6531C1401
12625f3572R735M564k4877B24610G822C796J63021M052J94256n4953A42492R6500
12613B38992b6564D5247K61857j51317A997b61542A31988n6529K80228a23965
12602A74072J41411a14224k1969A39664J74049A46660l9504N205c4323B8924h5271
12590g9028H2814K39250j19306J6379J71360I96L47351D514J23956a76305k13508
12579c89813a64953k0922B36497A01725J17309A3089K65597j18821a54619b8964
12568b66926I5297b41608I6997d162j8235C0642j881a03367A25697K55595A50004
12556C51009H005b06891c0181B86743G6483R5238L4409B0718a87768Q0113D38037
$$ plain form
12637 111005 -122250 -46685 45391 392894 -1398 266616 -79799 -63029 45130 -36531 31401
12625 -63572 -53837 -49273 -74150 224610 7822 3796 166817 170869 365125 310172 142492 238992
12613 238992 -26564 45247 307104 155787 1997 -261542 131988 75459 355687 -123965
12602 174072 315483 -114224 -136193 139664 313713 146660 107156 112361 -34323 28924 -85271
12590 -79028 82814 322064 202758 219137 390497 996 348347 4514 128470 -176305 -389813
12579 -389813 -164953 -185875 236497 101725 219034 13089 278686 159865 -154619 -28964
12568 -266926 95297 -241608 96997 -4162 -22397 30642 28761 -103367 125697 381292 150004
12556 351009 8005 -206891 -30181 286743 76483 171721 206130 20718 -187768 -107655 438037
12544d5343j45236Q4733d4011I5865C3724a68432B04149b61674J12070J535m13196
12533e61265C29617D2202a36916A87112r2886a55211e3171A67548g7487B89209
12522a62281B52591i2379H0207b75118A20977g3281K3656J8685A52217C0397M4257
12511G4654A4819b496G341b31292G2011b0984A06844a01081b7369I1338d1107
12499b59459E0686b44063b4990j2130o4215A1902d745p4895a9518l8875G0770
12487b152k67106C34334A48741c96688d6670B8541d2588A80018M2009f9774A83975
12475A20543a13838D30010E3045c9643C195P4714J21903b55612P3089A47641b0117
12463b47084A23006h1409l10412d209n4063n0223A28331E7282N9155a65222A7243
$$ plain form
12544 -45343 -190579 -105846 -44011 95865 33724 -168432 204149 -261674 -149604 -148069 -561265
12533 -561265 329617 42202 -136916 187112 94226 -155211 -53171 167548 -77487 289209
12522 -162281 252591 -92379 80207 -275118 120977 -73281 -49625 -30940 152217 30397 74654
12511 74654 14819 -2496 7341 -231292 72011 -20984 106844 -101081 -27369 91338 -41107
12499 -259459 50686 -244063 -24990 -37120 -101335 11902 -4745 -79640 -19518 -58393 70770
12487 -2152 -269258 334334 148741 -396688 -46670 28541 -42588 180018 222027 -69774 183975
12475 120543 -113838 430010 53045 -39643 3195 77909 199812 -255612 -182523 147641 -20117
12463 -247084 123006 -81409 -391821 -4209 -58272 -108495 128331 57282 116437 -165222 17243
12451e2501E1569J79616b9812p3149A85260c4216k2886A97791a47416O9300r8193
12440a76309I600a46775A33975o5185b03296j10005C12119b63064A57097j833
12430A55264L5134a10206B9041Q3835b06590Q9340K2335H1690C4166N5562J50820
12419B40548q2200n4574b24845Q7324F5016P6882a46883e2528G0879a3952K526
12408a1426l41710J69768H9076a7468k65375A00956C7490h5463j37119N4490O2126
12397a05966K3727A36332J30099o8920E8175j6886K4552b68659f3389j56194C1696
12385C239a23015b0246l19297f1536m3335F5382e8212p134C6518J25543a10118
12373b84279G6710Q6192J51563j321a74532G5579O996B5597e1898A31331K9183
$$ plain form
12451 -52501 51569 231185 -29812 -102961 185260 -34216 -57102 197791 -147416 -78116 -176309
12440 -176309 9600 -146775 133975 68790 -203296 -313301 312119 -263064 157097 155264
12430 155264 190398 -110206 29041 112876 -206590 -117250 -94915 81690 34166 89728 240548
12419 240548 158348 103774 -224845 -137521 65016 141898 -146883 -52528 70879 -13952 -11426
12408 -11426 -353136 -183368 89076 -17468 -282843 100956 37490 -85463 -222582 -168092 -105966
12397 -105966 -82239 136332 266431 197511 58175 41289 65841 -268659 -63389 -219583 31696
12385 3239 -123015 -20246 -339543 -61536 -104871 65382 -58212 -65346 36518 162061 -110118
12373 -284279 76710 162902 314465 313144 -174532 75579 82575 25597 -51898 131331 160514
12362A60514g7694F9182g1371A02626E875K95116b95127A30732B5370L03769c5209
12350H7379b72745B28212c01888A00339L42617B4304c23595P3555E81K38222H1119
12338d0293G3986J20980c57482A11663E5430f1504M118n6561D69751a24861d0600
12326B1423b3926B13103l648C2848Q3072a67647f6311C01774g862E8214a6178
12314B21356h4615A38631k699F2659e65853a61003q7072J09052B64554F3046K84370
12303C47416H0268d412j08651B5076g2254n1158G7524K56415a58040B01791D3204
12291B69564C5687a6543B68043k6767d74907K03164J33275p3450d9090q775H0755
12279E8682a34126H3912l4072Q4612M15559k41709h7491k82530A67021f457B8334
$$ plain form
12362 160514 -77694 69182 -71371 102626 5875 300991 -295127 130732 25370 329139 -35209
12350 87379 -272745 228212 -301888 100339 442956 24304 -323595 -250040 581 238803 81119
12338 -40293 73986 194966 -357482 111663 55430 -61504 -57386 -113947 469751 -124861 -40600
12326 21423 -23926 213103 209455 32848 115920 -167647 -66311 301774 -7862 58214 -16178
12314 221356 -84615 138631 135932 62659 -565853 -161003 -248075 -139023 264554 63046 347416
12303 347416 80268 -4412 -113063 25076 -72254 -123412 77524 333939 -158040 201791 43204
12291 269564 35687 -16543 268043 241276 -474907 -271743 -138468 -211918 -49090 -57865 80755
12279 58682 -134126 83912 49840 134452 550011 308302 -87491 -370021 167021 -6457 28334
12267d7281j25158O3330k06919D6810J91174C268N9911L59612Q565j96329b51130
12255f9667K1324H9445L11110D3331a21377F6599A6796g7101D74518J22312b0567
12243a35603a1678C84913c5523C62320A33390E4420A7461J71298E2256L8909K52845
12232C44010A52818M880A9117L07461f861B80827G4017K0039j7500M3735J38961
12221B59252B1232c43696A8616R7305e9693A43284J85983K63284i8809A86943
12210b7514D21101A7439N9334L92020k12613r8389o4799N10454A80165j2306R4463
12199B62322D763Q051M43988I3101J80454a51751B12443k6666M09912c10155i477
12187i3560D5778K63716I8452N4316D7688K24076M8379F9869J74018a7689B51259
$$ plain form
12267 -47281 -172439 -109109 -316028 46810 237984 3268 63179 422791 431356 235027 -251130
12255 -69667 -48343 89445 400555 43331 -121377 66599 16796 -77101 474518 596830 -20567
12243 -135603 -11678 384913 -35523 362320 133390 54420 17461 188759 52256 91165 344010
12232 344010 152818 157698 19117 326578 -6861 280827 74017 94056 76556 120291 259252
12221 259252 21232 -343696 18616 115921 -59693 143284 329267 592551 -98809 186943
12210 -27514 421101 17439 76773 468793 256180 157791 92992 603446 180165 167859 262322
12199 262322 4763 12814 456802 93101 273555 -151751 212443 185777 595689 -310155 -9477
12187 -93560 45778 309494 98452 152768 47688 271764 320143 69869 243887 -17689 251259
12175C06182j36869j7035K24582c4006A63087D2401L6279J36547G2737J91865
12165B64602J6957q2227F2689J09692L25300D1746N27695A36601B3290g8441A72226
12153A40513j8194n5923i8746C8452d165j15840A18973l3843P7515d8014E6280
12141a08153d1248k07482G7308l6915R2334C309R5746l4691a95978A40300b48041
12129g6853L3596G0266e7766m1751B14680c2321B05491o1308L5687n2394i3924
12117A81459a98314C6168g775j88131g8898l2818r5080b5440I2445i236A76636
12105b420l20452a36998d7207j07336F6692L5102R020a81375B07265k7782E8595
12093C4493a33064A50949g2183c272H6376J82321C65K6600M5774C3920M4358q138
$$ plain form
12175 306182 169313 152278 376860 -34006 163087 42401 78680 215227 72737 264602
12165 264602 281559 199332 62689 172381 497681 41746 569441 136601 23290 -78441 172226
12153 140513 122319 66396 -98746 38452 -4165 -120005 118973 85130 162645 -48014 56280
12141 -108153 -41248 -248730 77308 40393 132727 3309 99055 64364 -195978 140300 -248041
12129 -76853 -43257 70266 -57766 -99517 214680 -32321 205491 144183 179870 127476 -93924
12117 181459 -198314 36168 -7775 -195906 -78898 -111716 -206796 -25440 92445 -9236 176636
12105 -2420 -322872 -136998 -47207 -154543 66692 101794 110814 -181375 207265 179483 58595
12093 34493 -133064 150949 -72183 -3272 86376 268697 365 26965 72739 33920 78278 70140
12081G0140c15351D2415K30986n7305p0599c04385J46544B8696J12434a12749
12070B97947A7912J58758d4302l27497f4411L460j07381A17195J6571a11130k50443
12059c61573B48389I4467J36468O11266J66202j94901H9576J47751b1907F8873
12048a26726c2365C89499d1838p7502L283J0829E6539i178o3343k8486b8271F9863
12035B05050D6273c2810r3265L3475k43236J67656q8490B83228f4801j47767F4760
12023b38707N0591F1440d21452f4890A16147J51501I8138J56850b63742e5992
12012B05993B7039L8628c11448J05671A98341g6028A33547K9277F0410a91434
12001b49494A2524O5302B4779a79317A62570a61180B33445d2645m9169d0966K0421
$$ plain form
12081 70140 -315351 42415 273401 216096 145497 -304385 -157841 28696 141130 -112749
12070 297947 17912 176670 -44302 -371799 -64411 -60951 -168332 117195 133766 -111130 -361573
12059 -361573 248389 94467 230935 842201 1008403 813502 89576 237327 -21907 68873
12048 -126726 -32365 389499 -41838 -119340 -116057 -105228 56539 -9178 -72521 -101007 -28271 69863
12035 205050 46273 -32810 -126075 -92600 -335836 -168180 -256670 283228 -64801 -212568 64760
12023 -238707 -188116 61440 -421452 -64890 116147 267648 98138 254988 -263742 -55992
12012 205993 27039 65667 -311448 -205777 198341 -76028 133547 162824 60410 -191434
12001 -249494 12524 77826 24779 -179317 162570 -161180 233445 -42645 -91814 -40966 -20545
11990b0545I5576e845C46679b29401d1255k7212j19318B77283B6929K387K15255
11979B44571a14337B95964i2639J3141a8270C80880a81073A5810M6900g9726k2843
11968a02569G794a45806I2372b580C8910M0266a2539A1269P1073K6138j3943b14512
11955a4279m7583B47786c7584A03723a95271Q6199k8317f2791k73409A83036H6890
11943C25K3591a89017b9339G0840A5732c11654G210L24871a41400A37088a28950
11931d4527j06098O2535k42149A63797a40452A2461a25538F1211k3238b19859
11920a10216G6386m464k9801J01205a29802B39059J18141b4537j44622B23913
11909C31045d18324a59733H8945a1582C8714O1126a60942A28585c32175A24604
$$ plain form
11990 -20545 95576 -5845 346679 -229401 -41255 -68467 -187785 277283 26929 29316 244571
11979 244571 -114337 295964 -92639 -79498 -18270 380880 -181073 15810 62710 -79726 -102569
11968 -102569 7794 -145806 92372 -2580 38910 79176 -12539 11269 82342 108480 94537 -214512
11955 -14279 -61862 247786 -37584 103723 -195271 -109072 -137389 -62791 -336200 183036 86890
11943 325 23916 -189017 -29339 70840 15732 -311654 7210 332081 -141400 137088 -128950
11931 -44527 -150625 -88090 -330239 163797 -140452 12461 -125538 61211 37973 -219859
11920 -110216 76386 71922 42121 143326 -129802 239059 357200 -24537 -169159 223913
11909 331045 -418324 -159733 88945 -11582 38714 99840 -160942 128585 -332175 124604
11898G1253R69d8005j0648j36796p712A72174M6707A1075a23529B54643b59369
11886a06778B08378C5120Q862a1239G8620Q0506g0270K802B30964H5411b13588
11874c63354L4038B15426o9019a2148r918E8653a1292D13550c6062n8713J6600
11863g8175A90440A4414b7007A00635a35828N118G0696a0804r8341A9948c09090
11851b5282A82726b1818r4095H5682e0467j07044F5620b21612A18240e6520A00891
11839A33438P757c15902j91382e4573A85565a6787j19779e3206B14780e1091A75598
11827A81558q4435c13758F6546a90936G8959c03094D553a43790D5547K2274l0110
11816C7711a82137H3079a99007C3604b0986k6805C7000a3233A88571C094d02559
$$ plain form
11898 71253 72222 -48005 -58653 -195449 -203161 172174 218881 11075 -123529 254643 -259369
11886 -106778 208378 35120 43982 -11239 78620 159126 -70270 -67468 230964 85411 -213588
11874 -363354 -329316 215426 146407 -12148 -22066 58653 -11292 413550 -36062 -94775 -78175
11863 -78175 190440 14414 -27007 100635 -135828 -130710 70696 -10804 -109145 19948 -309090
11851 -25282 182726 -21818 -115913 85682 -50467 -157511 65620 -221612 118240 -56520 100891
11839 133438 141195 -315902 -507284 -54573 185565 -16787 -136566 -53206 214780 -51091 175598
11827 181558 97123 -313758 66546 -190936 78959 -303094 4553 -143790 45547 67821 37711
11816 37711 -182137 83079 -199007 33604 -20986 -47791 37000 -13233 188571 3094 -402559
11804A35803b67980I2615a84427M4494m1091B36343G883b22234g6294n2926M6888
11793h2332a9063D4257j0718f5962k19027g3188l06981D8736a19606A7255a22787
11781c22050d5632B44407n9809r1177b76427N4380B34537a76261c5756j18331
11771a54087a2510F2826J26776i1869J3018n5588N7411H8270a74187A06085J38955
11760B45040k0839a78522a921C97286A11032D1191a07730j7535A55254a36111
11749a3197C7523J4766N7302b9153j13813M4550l3712E3191J77338c20982C46110
11737g8426B57945d5412j49089G1737a53751a4283p0919F0461J09429i242F9756
11725b64481a08816E4436c02068B42265c62880a08567j5152A74999d1658r9844
$$ plain form
11804 135803 -267980 92615 -184427 -139933 -181024 236343 7883 -222234 -76294 -129220 -82332
11793 -82332 -19063 44257 33539 -65962 -284989 -73188 -380169 48736 -119606 17255 -122787
11781 -322050 -45632 244407 184598 93421 -276427 -222047 234537 -176261 -35756 -154087
11771 -154087 -12510 62826 189602 -91869 -78851 -134439 -77028 88270 -174187 106085 245040
11760 245040 224201 -178522 -1921 397286 111032 41191 -107730 -125265 155254 -136111
11749 -13197 37523 52289 109591 -29153 -142966 -98416 -132128 53191 230529 -320982 346110
11737 -78426 257945 -45412 -194501 71737 -153751 -14283 -85202 60461 169890 -9242 69756
11725 -264481 -108816 54436 -302068 242265 -362880 -108567 -123719 174999 -41658 -141502
11715a41502C51053A56784b17354f821A71907P6039c3215A31921b03223B5060
11704e8719F5246b20865O9965f8174p8506B71160C20c77158f735E9490J12598
11693A72088F1059J2491L4446H168a28127J0514I6952b23353O9562B31618q7545
11682A44073b5913D09295F9438R5179K52407A72425P1577b41350E5971L720B3888
11670c07678a24097H5885J30314p5828a16961A8637J23723K5241a20128B19984
11659D3328J39351c3991m0615A91957F7039a34042B53748a71173P0537I1737b2102
11647D3032a20295A43213A6144b59219A43472L45738A35514P1480Q6221b48486
11636a3798D026J20537a00053B1456M1548L37374B3479L11603E5347L6818a11486
$$ plain form
11715 -141502 351053 156784 -217354 -6821 171907 247946 -33215 131921 -203223 25060
11704 -58719 65246 -220865 -150900 -68174 -146680 271160 320 -377158 -6735 59490 172088
11693 172088 61059 73550 107996 8168 -128127 -117613 96952 -223353 -153791 231618 144073
11682 144073 -25913 409295 69438 164617 417024 172425 244002 -241350 55971 59691 23888
11670 -307678 -124097 85885 216199 140371 -116961 18637 142360 167601 -120128 219984
11659 43328 182679 -33991 -74606 191957 67039 -134042 253748 -171173 -100636 91737 -22102
11647 43032 -120295 143213 16144 -259219 143472 489210 135514 206994 293215 -248486
11636 -13798 4026 124563 -100053 21456 63004 400378 23479 335082 55347 92165 -111486
11624A24497e4759p905l3999K7062B43272j3417e807j1700C29282C9068J44892
11613A83960J78454d8314A144b7295H637L15548A26043C3708C84J34401C1873
11601A45413J61491C1658J04255a82339F6051A610Q7906B8836L47800A34256M3753
11590A78009C4148K53349a0206q3721B93919e8646H1112a78388C6981K43421A20445
11578c6095C728d5504r0271a4197F4448J91027A16295B7118a90618c0607D6092
11566B39562c1142p7847l9187B46843B8226a89193B38201I9326l0338b30015A2438
11554a64341A17865d5061C9880a78134e6228m6106A64487p6232b65412h9698o9640
11543a59338j4856L4123m0j8665B5518c0299A79973E4298P6478h32H865J19710
$$ plain form
11624 124497 -54759 -62664 -96663 -69601 243272 229855 -5807 -17507 329282 39068 183960
11613 183960 362414 -48314 1144 -27295 8637 324185 126043 33708 384 134785 31873
11601 145413 306904 31658 135913 -182339 66051 1610 89516 28836 376636 134256 178009
11590 178009 34148 287497 -10206 -93927 293919 -58646 81112 -178388 36981 280402 120445
11578 -36095 3728 -45504 -135775 -14197 64448 255475 116295 27118 -190618 -30607 46092
11566 239562 -31142 -108989 -148176 246843 28226 -189193 238201 99326 68988 -230015 12438
11554 -164341 117865 -45061 39880 -178134 -56228 -102334 164487 88255 -265412 -89698 -159338
11543 -159338 -174194 -140071 -140111 -158776 25518 -30299 179973 54298 130776 -832 8865 128575
11531A28575J20494a28272L7637A24519B0191N5500k6006K7002A839J58787e9910
11519A7333g0884A18982M3594e8231C4079a29302M9493A63797a81407C80165k7391
11508C52774a75942A27832J96684A04847F978i422l7081B79854f1000L0225A82593
11496F1091J37224L74292k27355H452P3355J53911g4041k0023L3778D80996c6139
11484B14374a2076G6569J34473L5034b4303k4335C97570A91800c0450I2496L3818
11473A26314M8718A6970L48451B3537K53847A16734f9615n0598C29932l6956o7179
11462B25797b28534k9904A00504B477J29275C3638J42412n5181E812d0858A2503
11450A78736G4021a56555B24890J80648B433a12226A46693R7575B812L5081c5459
$$ plain form
11531 128575 249069 -128272 -90635 124519 20191 75691 49685 76687 1839 160626 -59910
11519 17333 -70884 118982 162576 -58231 34079 -129302 -79809 163797 -181407 380165 352774
11508 352774 -175942 127832 324516 104847 6978 -9422 -46503 279854 -61000 -30775 182593
11496 61091 198315 572607 345252 8452 81807 235718 -74041 -94064 -60286 480996 -36139
11484 214374 -12076 76569 211042 246076 -24303 -48638 397570 191800 -30450 92496 126314
11473 126314 175032 16970 365421 23537 277384 116734 -69615 -120213 329932 292976 225797
11462 225797 -228534 -258438 100504 2477 131752 33638 176050 120869 5812 -40858 12503
11450 178736 74021 -156555 224890 405538 2433 -112226 146693 244268 2812 37893 -35459
11438C04264h2409B65332A13511h8736A10510R1258o2147O0235B3352J85257q0897
11427A27712m7662R650R0452d5903A65988k9849c27142A9008h2633a3908B3802
11415B44479c80206g2048I9593b00671C14667A11522A3176O5426J42222r6983
11405A23841b2435I6626R3457R9560a53672A55293L3079b9610k43687B8949R6568
11394A25517j7002g6638A91372a43445A30987n6896a58106E7826J20449d2020
11383H1683F335M0079K27340E1249N9841Q1623k8486B3555K35817j00198b71702
11371a23100e1222B8669M9223a75268j05845e0960B1935J69754G6589R2436c55696
11359F004O2992C1620J79506r5218b8728l1149j12332P8974C0641L9090J8713
$$ plain form
11438 304264 -82409 265332 113511 -88736 110510 201768 139621 199856 23352 208609 127712
11427 127712 80050 89700 180152 -45903 165988 136139 -327142 19008 -82633 -13908 23802
11415 244479 -380206 -72048 99593 -200671 314667 111522 13176 78602 220824 123841
11405 123841 -22435 96626 190083 289643 -153672 155293 188372 -29610 -273297 28949 125517
11394 125517 108515 -76638 191372 -143445 130987 74091 -158106 57826 178275 -42020
11383 81683 6335 46414 273754 51249 111090 192713 164227 23555 259372 159174 -271702
11371 -123100 -51222 28669 77892 -175268 -281113 -50960 21935 191689 76589 169025 -355696
11359 6004 68996 31620 211126 115908 -28728 -59877 -172209 -93235 30641 69731 88444
11348H8444a38122j54124a38570d91A99706c26238B54034a91845E4901j0971O1193
11337A05123k9672J72080c9458A97312a31271A91533M6494o7060l8523K02971
11327C35415b32788a8145p2924A64613e3942A7486J11559E4561l484L51214A8852
11315B4828a58188d7229G4619A2344R1646L9189d1998m47647D8640j6633J59114
11304A91121c04896E2876A9509b01128B77461l9398b7936k08660a15856B73106
11293a80765f999j66006q7592l8627b5837k93636a22543j47983B12646d8808j48327
11282a97135e2283l1844E2040D132L15319c44219k1154p820R7971i8051c1398
11270B89499F805P3417a1192E7854g1641A66495O3212F4915i6349l74733A25090
$$ plain form
11348 88444 -138122 -292246 -138570 -491 199706 -326238 254034 -191845 54901 43930 105123
11337 105123 75451 247531 -39458 197312 -131271 191533 238027 170967 132444 335415
11327 335415 -232788 -18145 -91069 164613 -53942 17486 129045 54561 51077 402291 18852
11315 24828 -158188 -47229 74619 12344 103990 143179 -41998 -489645 48640 32007 191121
11304 191121 -304896 52876 19509 -201128 277461 238063 -27936 -236596 -115856 273106
11293 -180765 -6999 -173005 -260597 -299224 -25837 -319473 -122543 -270526 212646 -48808 -197135
11282 -197135 -52283 -84127 52040 4132 319451 -344219 -365373 -373193 -275222 -98051 -31398
11270 289499 6805 80222 -11192 57854 -71641 166495 229707 64915 -96349 -471082 125090
11258D68216h4432H3220J1362b9745r7402m6571A01356e7545B70641B9969f4598
11246A15596C7633a86165O9528j9438p5760H159P6062J06694a59115A31748J29534
11235B61282i7867C45943i435b249l57822f0923k0563D8102B3441b25912f4464
11223a58038c6154A73504Q1524b9792m28487K26072A0031M0371K8119e7253o0339
11212a17592o016K0824B63953c2671L694j45169d3753A87485J64046A40357F3552
11200G2378e8378l84451e9773m9277G1609b02208B629a9613D4498f3229n841l2590
11188a01660k21380E1929J34583c01710H5181R369e227a063l3634B6393D21a25591
11175A37069D4168h6701C126c79903A3469c68850C38239a18307A2687b1259A13834
$$ plain form
11258 468216 -84432 83220 94582 -29745 -127147 -173718 101356 -57545 270641 29969 -64598
11246 115596 37633 -186165 -116637 -136075 -211835 8159 84221 190915 -159115 131748 261282
11235 261282 -97867 345943 -9435 -2249 -360071 -60923 -81486 48102 23441 -225912 -64464
11223 -158038 -36154 173504 255028 -29792 -458279 -232207 10031 50402 78521 -57253 -117592
11212 -117592 -123608 -102784 263953 -32671 -28977 -174146 -43753 187485 351531 140357 63552
11200 72378 -58378 -442829 -59773 -109050 71609 -202208 2629 -19613 44498 -63229 -69070 -101660
11188 -101660 -323040 51929 186512 -301710 85181 94550 -5227 -1063 -34697 26393 421 -125591
11175 137069 44168 -86701 3126 -379903 13469 -368850 338239 -118307 12687 -21259 113834
11163b7976A63293b79497P369A06979d9065k83695E8608O6433L05884c38226A7575
11151c3500j60008B0288q640O0103a87398B0707b89370c0905A03939e206q8003
11140i3209j09283A5769d6169F1930b59903B96451b38071C29988j33903k0592
11130A75493a22860E3016K40482g2465L6215E9022K39905B8728J6391L5683L5926
11119A16728c79708A18213Q513d7320k4634A27773K8842F8720a86822A21089J3635
11108A34724P0022O1469E9640J7447J65289a64287A79938f8019j43368F5149A3960
11096B19714m2664O452K5716J03962F0183J49474G040b17799C1852Q7885a4445
11084A82221q0736K14050j50882J53412q7424P8823Q719b643A59257K14989l7615
$$ plain form
11163 -27976 163293 -279497 -272128 106979 -49065 -332760 58608 125041 430925 -338226 17575
11151 -33500 -193508 20288 11648 71751 -187398 20707 -289370 -30905 103939 -5206 -93209
11140 -93209 -202492 15769 -46169 61930 -259903 296451 -238071 329988 196085 175493
11130 175493 -122860 53016 293498 -72465 -36250 59022 298927 28728 45119 80802 116728
11119 116728 -379708 118213 126726 -47320 -71954 127773 156615 68720 -186822 121089 134724
11108 134724 204746 266215 59640 77087 242376 -164287 179938 -68019 -211387 65149 13960
11096 219714 177050 183502 209218 313180 60183 209657 7040 -217799 31852 119737 -14445
11084 182221 101485 315535 164653 318065 230641 309464 318183 -2643 159257 374246 336631
11073C36631A60974K2256p5832J15161E2252K67106k0581A17389J72908l9724
11063B50573J67416A61231O5850H0888N20859k76675j17626o6424J21399Q2523
11053C44944j71328K74194m7054J2274N18226C70531J48777j52402N16797k80077
11043F03626P7799j44361L9577k36647L41632j90444J43602K76320l84840j7687
11033E08577N04158k94444J18418r1884j69362O6291j77321K14540j29188K28378
11023G78163k03105K14506C72289L60652O1107L1809p1269L990Q85N228k89077
11012D75614K64538J23781l82119L4566J05826L0411l698C15260N71850k49064
11002F38046j20082K27338q2763M6967n2967j95849L93472C41726M18914j82239
$$ plain form
11073 336631 160974 183230 107398 222559 52252 319358 298777 117389 290297 250573
11063 250573 417989 161231 227081 80888 601747 325072 207446 141022 262421 344944
11053 344944 173616 447810 400756 413030 931256 370531 519308 366906 883703 603626
11043 603626 681425 537064 576641 339994 681626 491182 634784 911104 526264 508577
11033 508577 1012735 718291 836709 744825 575463 641754 464433 678973 549785 778163
11023 778163 575058 789564 372289 732941 794048 825857 754588 758578 759463 764691 475614
11012 475614 740152 863933 481814 516380 622206 652617 648919 315260 887110 638046
11002 638046 517964 745302 662539 709506 656539 460690 854162 341726 760640 578401
10992E78401j00731R2799j03694L93032K1879r3327j23204N5630C28842K04087
10982E32929K17625j27488j74685K90112N9429k72017L00779J30585N9042l80971
10972F35340K25157K81032j19496L16371m31883J86746J51386K77618j5042K91454
10962A798683j75084N74711J51296J51738L9715J42505n232m10295J70970M0327
10952B479334o60398N6365m3258k76699Q929l0949J38515m29741J64812r9610
10942A307300L36241m21184q3330r0596j02362l96047J99963J11326J3623C12404
10931C37812K31276k15782A70361k8994J70940Q2794A82610I0783a60933c661
10920B48462q4377e1144A99163k527r5406b1487M920j1267B6104c6308B87015
$$ plain form
10992 578401 477670 570469 466775 859807 881686 788359 665155 720785 328842 532929
10982 532929 750554 623066 448381 738493 797922 525905 826684 957269 1016311 635340
10972 635340 860497 1141529 1022033 1338404 906521 1093267 1244653 1522271 1507229 1798683
10962 1798683 1623599 2198310 2349606 2501344 2541059 2683564 2678332 2268037 2439007 2479334
10952 2479334 1818936 1875301 1832043 1555344 1564273 1533324 1671839 1242098 1406910 1307300
10942 1307300 1643541 1222357 1139027 1048431 946069 550022 749985 861311 874934 312404
10931 337812 569088 353306 170361 141367 312307 395101 182610 90783 -160933 -3661
10920 248462 164085 -51144 199163 196636 101230 -21487 -16567 -27834 26104 -36308 287015
10908G7627b05991B28406c2801B04435h7730e735B23169J7191b022A95362Q4367
10897B79729A32043d6095E1843j2309h3610F7627h2825j49997B22561b267j61854
10886a64121b0793H9164m3871p133L603K36696r8500b5049j44001a0608H9608
10874c1158D5655J7096a66976m6133B35403g2115j54028C9966a12179l02100F4052
10862A28374D1286c88658d2707n8319G697O4957a18291N250n9334A9172L3239
10851E2411O7619a31774q4219b2202j35222n1274Q3977d4066B53555b3936k35311
10840b59247g4068K124B03337b3995A69393b9352F376b25208B32243a65561A285
10828B00447a67805k4487h0145j39618A58805a07948K5575B033J01844d3997E4208
$$ plain form
10908 77627 -205991 228406 -32801 204435 -87730 -5735 223169 240360 -2022 195362 279729
10897 279729 132043 -46095 51843 39534 -83610 67627 -82825 -232822 222561 -2267 -164121
10886 -164121 -20793 89164 45293 38160 41763 278459 179959 -25049 -169050 -10608 89608
10874 -31158 45655 62751 -166976 -213109 235403 -72115 -226143 39966 -112179 -414279 64052
10862 128374 41286 -388658 -42707 -101026 7697 72654 -118291 -113041 -172375 19172 52411
10851 52411 120030 -131774 -215993 -22202 -157424 -208698 -124721 -44066 253555 -23936 -259247
10840 -259247 -74068 -71944 203337 -23995 169393 -29352 6376 -225208 232243 -165561 1285
10828 200447 -167805 -192292 -80145 -219763 158805 -107948 -82373 2033 103877 -43997 54208
10816h5693k56402d0102A40444l6145O216c7597k70809c2435k399D7660a33881
10804c50853B00518e60308a08797A03077q201b13051H3050g501l35597a2514D3327
10792I4856D2380b3164j45455m31476B00235a01066p7713C6562g0251j38584D6434
10780C65044A0345b81628B3372N6662L3912b09780k27969E0402J25672M2120d22026
10768b84285f9931C0414g8847c8754k44822h4248G1302b6944a225j09107j58151
10757b68483e7147n5417C61830E4595r54c6093k34250B5874a43333m7921I8532
10745E3980a98334A14052J2126a97751K4619O2111M243B86531A25433a03242C81636
10733A28698M2636a2304H5029b92855A62362J9620g9557B19551b57631j10828
$$ plain form
10816 -85693 -342095 -40102 140444 104299 110515 -37597 -308406 -32435 -34834 47660 -133881
10804 -350853 200518 -560308 -108797 103077 94876 -213051 83050 -7501 -343098 -12514 43327
10792 94856 42380 -23164 -168619 -600095 200235 -101066 -178779 36562 -70251 -208835 46434
10780 365044 10345 -281628 23372 80034 113946 -209780 -437749 50402 176074 218194 -422026
10768 -284285 -69931 30414 -78847 -38754 -283576 -84248 71302 -26944 -1225 -110332 -268483
10757 -268483 -57147 -112564 361830 54595 53641 -36093 -270343 25874 -143333 -191254 98532
10745 53980 -198334 114052 126178 -197751 -173132 -111021 -106778 286531 125433 -103242 381636
10733 128698 171334 -12304 85029 -292855 162362 181982 -79557 219551 -257631 -368459
10723c68459m1530B49580A5146g115A1693O1861B0617a18416O698r4621j72338
10712c78677a33345A62661p801d8195I3251a9850j89482H9501b17118A79211a87303
10700a61571c8921A2727a69101M9487B6535d2155p3097e6943J8209B33919j05526
10689A28393k0385a88410Q1159j82962k58803G2798a87398D9023b679A86499b78929
10677a70344B45186d95927a71055L281r1987o9140j53716H3237M0934a9251D5037
10665a6498A38280J11789G6093a58428j56681h6779J9400C5414f8212A55191a02833
10653A15618l3327J570k3350K698a00850a191j79767Q8176l19419A8473R033j1640
10641A5866P3145e8380k57233a6427k40842d4003j89297O9289I423b95640a05577
$$ plain form
10723 -368459 -409989 249580 15146 -7115 11693 73554 20617 -118416 -111718 -206339 -378677
10712 -378677 -133345 162661 154860 -48195 93251 -19850 -209332 89501 -217118 179211 -187303
10700 -161571 -38921 12727 -169101 -119614 26535 -42155 -115252 -56943 -38734 233919 128393
10689 128393 108008 -188410 -107251 -290213 -549016 72798 -187398 49023 -2679 186499 -278929
10677 -170344 245186 -495927 -171055 -167774 -259761 -328901 -482617 83237 124171 -19251 45037
10665 -16498 138280 250069 76093 -158428 -315109 -86779 -67379 35414 -68212 155191 -102833
10653 115618 82291 83861 60511 63209 -100850 -1191 -180958 -92782 -412201 18473 27506 15866
10641 15866 89011 -58380 -315613 -16427 -257269 -44003 -233300 -164011 9423 -295640 -105577
10629F9484a47545h923B38022B6437K2540J9025c11029q00J10960k7762A62508
10617a27650j97134A36274k3881j2502M9914b92578h5052k42408k56981i5596
10606A25984b8241l22202a22481C0014e6378B95586a40244H4765K67426E2152
10595b51771g8234A30957N1933o9246b00563G2189C0425E495a08212l4317b6273
10583h1665q9172E5112c69233J62588A07100m0791b79610g8734E6113N9828A547
10571g5611k95331g4326a3300C1203i3582k57368e7913C5325M8961a05265o1682
10560a66947e2998a8813l86017N3482a63954d0399A75286b97580B5984g2486j87760
10549b60246h0026A38860j2429K22774h1601I2196K10482j24374a09575B09310
$$ plain form
10629 69484 -147545 -8923 238022 26437 48977 68002 -311029 -311829 -200869 -228631 162508
10617 -127650 -324784 136274 112393 99891 149805 -292578 -85052 -327460 -584441 -95596
10606 125984 -28241 -350443 -122481 30014 -56378 295586 -140244 84765 352191 52152
10595 -251771 -78234 130957 182890 113644 -200563 72189 30425 5495 -108212 -142529 -26273
10583 -81665 -170837 55112 -369233 -206645 107100 66309 -279610 -78734 56113 115941 1547
10571 -75611 -370942 -74326 -13300 31203 -93582 -350950 -57913 35325 84286 -105265 -166947
10560 -166947 -52998 -18813 -404830 -351348 -163954 -40399 175286 -297580 25984 -72486 -260246
10549 -260246 -80026 138860 126431 349205 -81601 92196 302678 178304 -109575 209310
10538g9650k2887j2882K8992K7027B12711g4904r1105l43449d6924I0934K1188
10527A12122P8826i7882M840B5090K28783J83269E3016J05430a25504E7012p486
10516D9526J18115b90390A07525M3156b7336B92815G9614J94331c54071A74086
10505a05213k47816J19945A58459J25458A24967j2968d0301B68921B9303J53692
10495A82995d0015a059j66096j3336j65294J49406M3199j25906h1567p0326j72546
10484c24439J04503C2311J826L11606i3016C65502j18483b26187A95182L7165
10474B32347b38595A46263a48427A52941j9834a3167B61268j7375A10639K8147
10464A38786o6590L5260n0953a46499A67314c4583j87161C79473b60701a08174
$$ plain form
10538 -79650 -102537 -115419 -86427 -59400 212711 -74904 -166009 -509458 -46924 90934 112122
10527 112122 190948 -97882 -93042 25090 253873 437142 53016 158446 -125504 57012 49526
10516 49526 167641 -290390 107525 150681 -27336 292815 79614 273945 -354071 174086
10505 -105213 -353029 -233084 158459 283917 124967 111999 -40301 268921 29303 182995
10495 182995 -40015 -1059 -167155 -180491 -345785 -196379 -153180 -279086 -81567 -151893 -324439
10484 -324439 -219936 32311 34137 345743 -93016 365502 247019 -226187 195182 232347
10474 232347 -238595 146263 -148427 152941 133107 -13167 261268 243893 110639 138786
10464 138786 72196 107456 56503 -146499 167314 -34583 -221744 379473 -260701 -108174
10453g233k09141A10273M9812b17962o905F2216g5150A48679h2338A23802d2682
10441A19167h3104A53842b12604A55770a23860k13719J22732B39911q1815a51716
10430A48954o2419P2283a14934j60712B7647L3125a9222j44921n0720B5237J09071
10419A34308K81240b87010a15307A61960f4132j41649A07854e4845A20454J03110
10409B23564B6631c3028G4794b7787A95020q4444a19286m0329j10646C8690a34899
10397b08412A09632k5262e3834j34988k48544A41224l664b5458m9828l06946a51240
10385G5142c0142j59387d8693b654I1983c7613k57908B6080e517A36255L8786
10374A75041m1875B2455J31061E1960J53695F9755j0367a8699o0919B19474c5333
$$ plain form
10453 -7233 -216374 110273 160085 -217962 -224867 62216 -75150 148679 -82338 123802 -42682
10441 119167 -83104 153842 -212604 155770 -123860 -337579 -214847 239911 158096 -151716
10430 148954 86535 158818 -114934 -275646 27647 60772 -19222 -164143 -214863 25237 134308
10419 134308 415548 -287010 -115307 161960 -64132 -205781 107854 -54845 120454 223564
10409 223564 26631 -33028 74794 -27787 195020 110576 -119286 -159615 -270261 38690 -134899
10397 -208412 109632 84370 -53834 -188822 -437366 141224 137560 -25458 -75286 -382232 -151240
10385 75142 -30142 -189529 -48693 -2654 91983 -37613 -295521 26080 -5517 136255 175041
10374 175041 133166 22455 153516 51960 205655 69755 59388 -18699 -79618 219474 -35333
10362e8971o9581A96937k1705J28122a04398C55763O6273L537p8213J66451k55271
10351B58540J62864A61053l8439J14671P7524A25166f6326A15938Q7201r4483
10341A08656P631K02547k8429j23550J23516K02384J45044j95831n2572A37267
10330B96606j07304Q0362J10235j21160I0956J37564K26607j54286H5572k9065
10320E6507J58988J91164o8922j64511L16829b5400A489Q7068C8212L73550h2198
10308D11505b2230D02632c01041B35308i3785A06386J1731J9850g9102C3326a68699
10296G7305L7545g2265A57367a06775F4163f1042A66396E1832a41829A54460h5466
10284i305c693C81688I3646n913a00198j85992h6138q3759C695a02329B51315
$$ plain form
10362 -58971 -128552 196937 175232 303354 -104398 355763 422036 425573 347360 513811 258540
10351 258540 421404 161053 122614 237285 314809 125166 -66326 115938 203139 108656
10341 108656 116287 318834 290405 166855 290371 492755 637799 441968 389396 137267
10330 296606 189302 269664 379899 258739 90956 228520 455127 300841 85572 56507
10320 56507 215495 406659 337737 173226 490055 -25400 1489 88557 38212 411762 -82198
10308 411505 -22230 402632 -301041 235308 -93785 106386 118117 137967 -79102 33326 -168699
10296 77305 114850 -72265 157367 -106775 64163 -61042 166396 51832 -141829 154460 -85466
10284 -9305 -3693 381688 93646 87733 -100198 -286190 -86138 -169897 3695 -102329 251315
10272d7529k42902P6174o1815a19463m9364C90607b08058A66506b62225C42625
10261f1723j4551E4724K08754D180e7900B73735a51801F984L63447a861B43086
10249A6679L19738K4284B0413L24097j43882N1800I2139K22312q1397a25354I2104
10237A2798J6901a50287c9164F7113A0853e4333F7727b32199D0377a60211K5816
10226a34395l08777B38429a87847q0506A98990a66602J2961b7796A87244b69497
10215a42532C68267a86159I0918d0126A6085b39860M9017B8568a02097N0194r3349
10204a45252H2931e6966j13758A7080K53621c30660A35264R6548a9875B06229
10193a91032B12459a15266p1959A35158E2248L45199A78940a23389A54299l4592
$$ plain form
10272 -47529 -290431 -214257 -276072 -119463 -168827 390607 -208058 166506 -262225 342625
10261 -61723 -76274 54724 263478 4180 -57900 273735 -151801 6984 370431 -1861 243086
10249 16679 336417 360701 20413 344510 200628 252428 92139 314451 233054 -125354 92104
10237 12798 29699 -150287 -39164 67113 10853 -54333 67727 -232199 40377 -160211 -134395
10226 -134395 -443172 238429 -187847 -268353 198990 -166602 -153641 -27796 187244 -269497
10215 -142532 368267 -186159 90918 -40126 16085 -239860 -190843 28568 -102097 -51903 -145252
10204 -145252 82931 -56966 -170724 17080 270701 -330660 135264 231812 -19875 206229
10193 -191032 212459 -115266 -187225 135158 52248 397447 178940 -123389 154299 119707
10183A19707b97978P5654b9033q6847A81674g4619b0020B82621c63326B002i9294
10171h5097A55712g475C77598c63862E1663j353a67003O9097n9978B67781d1236
10159a51337d7924a4891o7400m6940k8322A11593h9800d0437k11286C16144b23372
10147A7284a24036I0052i6583G834h0034a5302G5006b2223m3810j07678m7302
10136b21013N9676j71580F5822l0686A6856a46356A3242b3295I4546a26766H5136
10124E5030c26821I1513B1441K4266b79351a28200b4044k09597b8565D8785a33376
10112I8088C4157g6443L6038k40831A00628e6542l3290j02394D9509d13422A61261
10100h325l87522B04738B685a81666r8262M3807G7852J49346d07796a78125A33493
$$ plain form
10183 119707 -297978 -222324 -29033 -115880 181674 -74619 -20020 282621 -363326 2002 -99294
10171 -85097 155712 -7475 377598 -363862 51663 50310 -167003 -97906 -157884 267781 -41236
10159 -151337 -47924 -14891 -82291 -129231 -157553 111593 -89800 -40437 -251723 316144 -223372
10147 17284 -124036 90052 -96583 7834 -80034 -15302 75006 -22223 -66033 -173711 -221013
10136 -221013 -161337 -332917 65822 35136 16856 -146356 13242 -23295 94546 -126766 85136
10124 55030 -326821 91513 21441 45707 -279351 -128200 -24044 -233641 -28565 48785 -133376
10112 98088 34157 -76443 -40405 -281236 100628 -56542 -89832 -192226 49509 -413422 161261
10100 -8325 -395847 204738 2685 -181666 -279928 -236121 77852 227198 -407796 -178125 133493
10088F2306a78972b5517G6881l7718A8977J66328a7231A18287a21512E7279a19833
10076a55420j47203A17842i5120c9707a8206k78211a00773M9743F2119b50026
10065B22224i2158m495C89742a78260e1696j72903a8038D3111c06373F6184e8442
10053A04997M0198b56301H2908J80105E905K33542b09258P0913F6690a67902f4718
10041c23088g5294H2863k4793g0708k18867L6211O2481h3962E5056a4551n828
10030b0379f986H1721b78707j32415q8790d1308D5641E132a22409A3689J01467
10019A15156c07963A20150b55663i0726A30514J69307a39509D0953O6305b71152
10008a26261N8041A64214a6233j31013H5470a75955I1706b19758g0521A74102
$$ plain form
10088 62306 -178972 -25517 76881 39163 18977 185305 -17231 118287 -121512 57279 -119833
10076 -155420 -302623 117842 -95120 -39707 -18206 -296417 -100773 -51030 62119 -250026
10065 222224 -92158 -96653 389742 -178260 -51696 -224599 -18038 43111 -306373 66184 -58442
10053 104997 145195 -256301 82908 263013 5905 239447 -209258 -138345 66690 -167902 -64718
10041 -323088 -75294 82863 58070 -70708 -289575 -253364 -190883 -83962 55056 -14551 -20379
10030 -20379 -6986 81721 -278707 -411122 -499912 -41308 45641 5132 -122409 13689 115156
10019 115156 -307963 120150 -255663 -90726 130514 299821 -139509 40953 107258 -271152
10008 -126261 -68220 164214 -16233 -147246 85470 -175955 91706 -219758 -70521 174102
9997g2624n8373A16662a35181C04501b84815a31066j0320A47994a64586k62274
9987d26860F0065K1636M161m1285a80408h6166c3850l03599Q2906I4826O1638
9976A56464a33207e4637j71336f9907k60182e9896b5686C54811A9587a9854p2632
9965i2486o2610L7697k4732A64213h5301K0111A61651e5118k72784N2419H271
9953b82069a32215N7624q5238l9660d9182k23933g3755K6028j05669J2840j26312
9942b66868D0289J79O6637J75322H9448J2143a6725j56895k71366J58532a27302
9930b59064e8124k7676A12683c32804A39996B2952F974a2787r6403K2197b3729
9918A69057J05860F3500c48838a58427d711j94999R0954A24601C5740h070o8049
$$ plain form
9997 -72624 -130997 116662 -135181 304501 -284815 -131066 -141386 147994 -164586 -426860
9987 -426860 60065 81701 85862 44577 -180408 -86166 -33850 -337449 -254543 94826 156464
9976 156464 -133207 -54637 -225973 -69907 -330089 -59896 -25686 354811 19587 -19854 -92486
9965 -92486 -155096 -117399 -142131 164213 -85301 -65190 161651 -55118 -327902 -275483 8271
9953 -282069 -132215 -74591 -159829 -199489 -49182 -273115 -73755 -47727 -153396 -140556 -266868
9942 -266868 40289 40468 107105 282427 89448 101591 -16725 -173620 -444986 -286454 -127302
9930 -259064 -58124 -85800 112683 -332804 139996 22952 6974 -12787 -109190 -86993 -23729
9918 169057 274917 63500 -348838 -158427 -4711 -199710 -108756 124601 35740 -8070 -76119
9907g6119o2003D09014b50363C4726G971g6305B09718H1397d23924b01607A25038
9895a7639K315M054A05205a16130j49066e063B8204a38797D0485a65034F1784
9883a56455k766N5539B34335b69302F6826l3154K415e11823K26664g6101m5052
9872a21153B4800a73865n9653n4901P6355j04628a41700e4479p2416J7221B86020
9860b26297j12594A16086a98753A81093b80488g030A6902J01695a62373A18761
9849C1702d4014k29124A03547a79217c2837B05844c04732e8198A06096J07255
9839B13351g2984k1285B59269i0720A15302a26509M8997b2987j59269F8697b11715
9827A01010a10633B76232b3003m319Q795D5986R5277o8114b24486P8972k21885
$$ plain form
9907 -76119 -138122 409014 -250363 34726 7971 -76305 209718 81397 -423924 -201607 125038
9895 -17639 -15324 -11270 105205 -116130 -265196 -5063 28204 -138797 40485 -165034 61784
9883 -156455 -159221 -103682 234335 -269302 66826 33672 36087 -511823 -285159 -76101 -121153
9872 -121153 24800 -173865 -233518 -288419 -212064 -316692 -141700 -54479 -126895 -109674 286020
9860 -226297 -338891 116086 -198753 181093 -280488 -7030 16902 118597 -162373 118761
9849 31702 -44014 -273138 103547 -179217 -32837 205844 -304732 -58198 106096 213351
9839 213351 -72984 -94269 259269 -90720 115302 -126509 -77512 -22987 -182256 68697 -211715
9827 101010 -110633 276232 -23003 -27322 -18527 45986 141263 73149 -224486 -145514 -367399
9816c67399a48149k17603d9441a576l0566B9955d3101I7914a31988j5737G4282
9804a49123k6336r9162N0132j53832J00557C7312b83745O6581k9446A30950n6199
9793G4751J53755i6685a9160j08474l0577D4390b27730A3338M5714P993K45581
9782C12626C4685P4290c70856J19416C20001I4318c6560j39735L994O7349a2464
9770A93144b70058C1925g6318A39553L8276m5062D3768b1224A31966d0275l6615
9759g6890E303b07843F8091a0208k29434P1471F4453a16224A45879a08089q6172
9748a94261m3059h0124k0586L5933B2507a08335r330L0887J8662J8249C98372
9736A9173b84508d2697A9056b41833j6020P0097K7258I442h6448j66943P8647
$$ plain form
9816 -367399 -148149 -365752 -49441 -1576 -32142 29955 -43101 97914 -131988 -147725 74282
9804 -149123 -175459 -274621 -224489 -378321 -277764 37312 -283745 -217164 -246610 130950 74751
9793 74751 228506 -96685 -19160 -127634 -158211 44390 -227730 13338 59052 67045 312626
9782 312626 34685 108975 -370856 -251440 320001 94318 -36560 -176295 -172301 -104952 -12464
9770 193144 -270058 31925 -76318 139553 177829 132767 43768 -21224 131966 -40275 -76890
9759 -76890 5303 -207843 68091 -10208 -239642 -168171 64453 -116224 145879 -108089 -194261
9748 -194261 -237320 -80124 -100710 -64777 22507 -108335 -117665 -86778 -68116 -49867 398372
9736 19173 -284508 -42697 19056 -241833 -257853 -187756 -160498 9442 -86448 -253391 -174744
9725a74744M2405e4610j57948m2764k74150A6407a12249A49842b92289o0192R0875
9714b61606j41990C4466J20348e5756n7754B64733a63801D6984a64938B37782
9703A16990D7364J2402P1058j0584A4441d07177A72879b0951j8629o8057j05781
9692b13418A88998e1344F0754b47849h7649F3349b996r9138F9593f4933c0157
9680a45044b6785r0633j95256a8868p3561L6763J028k57135N1696n334B2435a64495
9667b04837i0293A25207L4470K04829b09115R4004j6693j9422k02159A20290a08752
9655b0403m6905J6637A34869a83888B17183b62387e1370N843j15597k73104O7186
9644c67042F7381G671J8907J35558K49393i7719j71709A60274i7309B40974b70809
$$ plain form
9725 -174744 -132339 -54610 -212558 -255322 -529472 16407 -112249 149842 -292289 -352481 -261606
9714 -261606 -403596 34466 154814 -55756 -113510 264733 -163801 46984 -164938 237782
9703 116990 47364 59766 130824 120240 14441 -407177 172879 -20951 -39580 -107637 -213418
9692 -213418 188998 -51344 60754 -247849 -87649 63349 -2996 -102134 69593 -64933 -30157
9680 -145044 -26785 -117418 -312674 -18868 -92429 -55666 -54638 -311773 -260077 -265411 22435 -164495
9667 -204837 -90293 125207 159677 364506 -209115 -115111 -131804 -151226 -353385 120290 -108752
9655 -20403 -67308 -50671 134869 -183888 217183 -262387 -51370 -45527 -161124 -434228 -367042
9644 -367042 67381 7671 26578 162136 411529 -97719 -269428 160274 -97309 240974 -270809
9632f7499l04312a42256C4795b1282r5288A22752m7139a2054A35184J40755E6992
9620A9240O0530d6328r3729O0189k6063M5535j12405A60964E8554a83l15222C04238
9607A54772E5976a12987A65244l0557D9271a1094j00271j05891b534q4569n5484
9596a42587C15024F8241B4337l100a34290E7334J88747H187b21351C13489A43395
9584d1429J1839A20881A1399f7314K189F4369A8948J20129a80265Q6786j10728
9573b04207q9587A06045h1594j37294a01106A32776j4726a25963j64146O8759
9563b21350B14111c26688f4328B08246J77893a55863N2889I0680a11470k5575
9553a37045c4790A32363c97842D9211a95741n4587M3796D6071A0372a84555A20025
$$ plain form
9632 -67499 -371811 -142256 34795 -21282 -116570 122752 75613 -12054 135184 275939 56992
9620 19240 79770 -46328 -140057 -79868 -105931 -60396 -172801 160964 58554 -183 -315405 304238
9607 154772 55976 -112987 165244 134687 49271 -11094 -111365 -217256 -2534 -87103 -142587
9596 -142587 315024 68241 24337 21237 -134290 57334 246081 8187 -221351 313489 143395
9584 -41429 -29590 120881 11399 -67314 -65125 64369 18948 139077 -180265 -93479 -204207
9573 -204207 -293794 106045 -81594 -218888 -101106 132776 118050 -125963 -290109 -221350
9563 -221350 214111 -326688 -64328 208246 386139 -155863 -102974 90680 -111470 -137045
9553 -137045 -34790 132363 -397842 49211 -195741 -250328 -206532 46071 10372 -184555 120025
9541b49371Q2558f4636J5599p157b3257j51021J2243M6230K4112a2807k22070
9530b34877B04507r2861g5399F0616Q4722N7735a08959m5641A10053J36723c31866
9518B41704a22745A39996D2346g9948j06343C90354h5576q4732P1907C32130a54736
9506a59555b456k77412B78515H7680a26281A3911N6131B9052a60562O1738k3320
9495a22144E9686a22630a7792I5596b73135A00320d4120D15774c81533N6107B3360
9483b6536A31044i9931A00465b57182c6886L815A23777l8422b21594C9534J26572
9472A66106c9348j29283n7857c9638l5456m2103H4796a02072j31166j25993C53098
9460c48146B2920L3755b1130j22411H6656a52846f0465A58883a46527L9981E3463
$$ plain form
9541 -249371 -166813 -64636 -49037 -56194 -23257 -174278 -162035 -115805 -91693 -12807 -234877
9530 -234877 204507 111646 -75399 60616 145338 203073 -108959 -154600 110053 246776 -331866
9518 241704 -122745 139996 42346 -79948 -186291 390354 -85576 -170308 -98401 332130 -154736
9506 -159555 -2456 -279868 278515 87680 -126281 13911 70042 29052 -160562 -98824 -122144
9495 -122144 59686 -122630 -17792 95596 -273135 100320 -44120 415774 -381533 -325426 23360
9483 -26536 131044 -99931 100465 -257182 -36886 -33071 123777 85355 -221594 39534 166106
9472 166106 -39348 -168631 -226488 -39638 -75094 -117197 84796 -102072 -233238 -359231 353098
9460 -348146 22920 56675 -21130 -143541 86656 -152846 -60465 158883 -146527 -106546 53463
9448b7514A09800c44430a00863k31497Q632B34427a61455N2510l4750k9488A00301
9436a23230M9013A04422e5220C02210a27795I1628b27123i3223n4089C60983a76851
9424a12442e4714j14559j17160L8641a09536o1665j59854a58625d1578E9045d67022
9412b52422o8670b5212j50507A05429b2100j5150l16636J74112O6893j17581l8699
9401b69161b2386F7919c81785J26024A06915e2796j10829j14459c3321A40774
9390A38988m5396b76875e5713J0053D0634N6221a91889L9024j70440d9976j28153
9379a78129H7872a20221e0858j56926K4030j7608K6356P7296K3371J2500K5960
9368c5879D10714A45789A7416Q273h1060E6812a40705L7272j50196H7637d49558
$$ plain form
9448 -27514 109800 -344430 -100863 -332360 -323728 234427 -161455 -108945 -143695 -173183 100301
9436 -123230 -74217 104422 -55220 302210 -127795 91628 -227123 -93223 -147312 360983 -176851
9424 -112442 -54714 -169273 -286433 -247792 -109536 -171201 -331055 -158625 -41578 59045 -467022
9412 -252422 -321092 -25212 -175719 105429 -22100 -37250 -353886 -179774 -112881 -230462 -269161
9401 -269161 -22386 67919 -381785 -255761 106915 -52796 -163625 -278084 -33321 140774
9390 138988 93592 -276875 -55713 -45660 40634 96855 -191889 -152865 -323305 -49976 -178129
9379 -178129 87872 -120221 -50858 -207784 -183754 -201362 -175006 -97710 -74339 -61839 -35879
9368 -35879 410714 145789 17416 25689 -81060 56812 -140705 -103433 -253629 87637 -449558
9356A09852k0413B1638M05935A75283a70768j84743a60340e8192o2037q912A23672
9344A07324m3595A9448d4396j83775p020a1126C4425J80520m4019f7031l0006
9333i7037r3657E1634K55287H1991g5685j05617Q7771M3784l5608K8304j53669
9322b10720E3425K251a07814E9790a4358F7032a5113B4761e5774k31011G6874
9310A0913J99511o2249M3115f9829F8218e81362K28248A257b95829q5902B2259
9298a5515p1950d609A08871a97967C6930a34604m8715C909g8339A724b90289R5667
9286a94622P288A29289b84382B01750B292Q0817a07738j09363f6922b864B7127
9274a05028p9963b7441A3428b98633a26250M8948j24160P6728A09547h5676L8976
$$ plain form
9356 109852 89439 21638 427573 175283 -170768 -355511 -160340 -58192 -120229 -129141 123672
9344 107324 63729 19448 -44396 -228171 -235191 -11126 34425 214945 170926 -67031 -97037
9333 -97037 -190694 51634 306921 81991 -75685 -181302 -93531 -49747 -85355 -57051 -210720
9322 -210720 53425 55676 -107814 59790 -14358 67032 -15113 24761 -55774 -286785 76874
9310 10913 210424 148175 191290 -69829 68218 -581362 -353114 1257 -295829 -381731 22259
9298 -15515 -87465 -4609 108871 -197967 36930 -134604 -183319 3909 -78339 1724 -290289 -194622
9286 -194622 -187334 129289 -284382 201750 2292 83109 -107738 -217101 -66922 -2864 27127
9274 -105028 -184991 -27441 13428 -298633 -126250 -77302 -201462 -124734 109547 -85676 -46700
9263d6700C6206i4013k08953P8550B81584d41813b09003B13072n4967e2066A0023
9251d2755j21866C16504a5064k1176p811B63697e9362r8300M7371j57180J08198
9240a59273f2981j57540d6598C00239b3826C42411I979N6118b56983E1470a263
9228b08973i0388k59100A02737a5467j11621H7122K90032A19574a53467G6038
9217a01506a5709A8275b80355a03039j1649j2748F8483c57544A65628a17182B5851
9205D93740b66500B80543M4619a51264D00811a22526j74750C31657a75824k3809
9195a99633r3262A5163K6969g5325K7485j09975D29114c74821A33415b05484J01384
9184a04100j15843A2125P2222c35023e6615k73129c9521C6908a99664P6461D6636
$$ plain form
9263 -46700 36206 -94013 -302966 -224416 281584 -441813 -209003 213072 158105 -52066 10023
9251 -42755 -164621 316504 -15064 -36240 -44051 263697 -59362 -157662 -110291 -267471 -159273
9240 -159273 -62981 -220521 -46598 300239 -23826 342411 9979 66097 -256983 51470 -1263
9228 -208973 -90388 -349488 102737 -15467 -127088 87122 377154 119574 -153467 76038
9217 -101506 -15709 18275 -280355 -103039 -114688 -127436 68483 -357544 165628 -117182 25851
9205 493740 -266500 280543 325162 -151264 400811 -122526 -297276 331657 -175824 -199633
9195 -199633 -292895 15163 42132 -75325 -47840 -157815 429114 -374821 133415 -205484 -104100
9184 -104100 -219943 12125 84347 -335023 -56615 -329744 -39521 36908 -199664 -123203 46636
9172a45342m8029F3687a16427A19578n6564J03662b44476F3596i713m9809A15999
9160a23367A03361f3366p0492M8409C590A096b58201f301l03143j16467d9783
9148a33031m8011A50307J3134c60624A48257b6828H3778J55437B0897b53516A69759
9136a96490C7927P4372i7065k5254j97209e8480C5749J89801a78270J9312N2926
9125a06032D294J26978a14963q1355j88541A5948a84071C01427D4877a92799F0469
9113a0514j10251K8052b3097A54176M1874a10170A29591a90332b1747o1269o6470
9102a49486B66341E929J60474j9443a67683c3214k2566d633A74252i2045A45804
9090a58578d070k07625a05567A83470a97100A06363N8340b54491Q9253d3624j22095
$$ plain form
9172 -145342 -193371 63687 -116427 119578 63014 166676 -244476 63596 -9713 -59522 115999
9160 -123367 103361 -63366 -133858 -85449 3590 1096 -258201 -6301 -309444 -425911 -49783
9148 -133031 -181042 150307 163441 -360624 148257 -26828 83778 239215 20897 -253516 169759
9136 -196490 37927 112299 -97065 -122319 -319528 -58480 35749 225550 -178270 -158958 -106032
9125 -106032 4294 131272 -114963 -196318 -384859 15948 -184071 301427 44877 -192799 60469
9113 -10514 -120765 -92713 -23097 154176 196050 -110170 129591 -190332 -21747 -83016 -149486
9102 -149486 266341 5929 166403 146960 -167683 -33214 -55780 -4633 174252 -92045 145804
9090 -158578 -4070 -211695 -105567 183470 -197100 106363 164703 -254491 -165238 -43624 -165719
9079a65719o0014Q1378p4250N2449B0538b18910A07516b77091a3112a945p1655
9068g3600K1771j28792M4110B9693c27501J54084A08281l6004b29833a09554B92555
9056E4317g54k27876A04307c8201G3344j8267a45280g0003j18587B16522R1897
9045C08419j28000J7357C3153K89255g8171C4516f2155J3739p5900j01824e0362
9033a79085c316p2890a8672A97177a97185N3006q0678G2817n013e3322H6853d4089
9020a01955j94111O8462A34376n5282G918d31524F8744h0756F1213c31463I5020
9008f1578K2831j30631k7156B05727a90690j62007J66787C027K16192c94202J77466
8997b16736C05675o4736H1934A5199e171k49671e2270A04778P0684P6268A3144
$$ plain form
9079 -165719 -225733 -144355 -218605 -166156 20538 -218910 107516 -277091 -13112 -1945 -73600
9068 -73600 -51829 -180621 -136511 29693 -327501 -173417 108281 72277 -229833 -109554 292555
9056 54317 -754 -228630 104307 -38201 73344 55077 -145280 -70003 -188590 216522 308419
9045 308419 180419 197776 33153 322408 -78171 34516 -62155 -48416 -124316 -226140 -50362
9033 -179085 -3316 -76206 -18672 197177 -197185 -144179 -224857 72817 67804 -53322 86853 -44089
9020 -101955 -296066 -227604 134376 79094 7918 -431524 68744 -80756 61213 -331463 95020
9008 -61578 -38747 -169378 -196534 205727 -190690 -352697 -185910 3027 219219 -394202 -216736
8997 -216736 305675 240939 81934 15199 -5171 -254842 -52270 104778 175462 251730 13144
8985a40149A45453i0048M3944j61898a02971k61098a78504A75007K65464i3204
8974a54814A11681e0840j86898A57607i4193I4798A3447L221a38033C7005b3851
8962I7823k383D6962a95050A02207b09223j34733a02383G4603P2017J45560j018
8951B91162c62301a47396J7807B2406g0805q8481k3103A79971n3482l383g7855
8939C28164a98728A68950A5347J27058f1201k73371J38666a8455E4060b17861
8928a8383p2879m2673j17555a15441k1734l28862A40743M7297b07151D3001J49315
8917A92316a37982b7900d615j09651N1596B18712f3802P584B95309K05609Q02990
8906A303908P28342A014787D82125k37146a09808B07335j9643e1066r7518A17086
$$ plain form
8985 -140149 145453 -90048 -46104 -208002 -102971 -364069 -178504 175007 440471 -93204
8974 -154814 111681 -50840 -237738 157607 -94193 94798 13447 16668 -138033 37005 -23851
8962 97823 95440 46962 -195050 102207 -209223 -343956 -102383 74603 146620 292180 291162
8951 291162 -362301 -147396 -129589 22406 -70805 -159286 -182389 179971 126489 123106 -77855
8939 328164 -198728 168950 15347 142405 -61201 -334572 -195906 -18455 54060 -217861
8928 -18383 -91262 -133935 -251490 -115441 -137175 -466037 140743 188040 -207151 43001 192316
8917 192316 -137982 -27900 -4615 -114266 -62670 218712 -63802 -56218 295309 500918 1303908
8906 1303908 2032250 1014787 482125 244979 -109808 207335 187692 -51066 -148584 117086
8895b5924l3391F4588a8361j71800C89817a80941B38808a64871A18233c86030
8884G2584C1748a50551A67625a84018j00716g5589j1184l1437j4518A2707d461
8872A24933J14724m7820D482J24773c98975a87184j88807i726D09465i9289m2435
8861a41724q7417k24490A54989b79996D0467b0940j47642A01040J53890b19494
8850C8165b20045j097k24104a83823j96269l5860a53341K1039C48812a93774E9610
$$ plain form
8895 -25924 -59315 64588 -18361 -190161 389817 -180941 238808 -164871 118233 -386030
8884 72584 31748 -150551 167625 -184018 -284734 -75589 -86773 -118210 -132728 12707 -4461
8872 124933 239657 191837 4482 129255 -398975 -187184 -375991 -9726 409465 -99289 -141724
8861 -141724 -229141 -453631 154989 -279996 40467 -20940 -168582 101040 254930 -219494
8850 38165 -220045 -221142 -445246 -183823 -380092 -415952 -153341 -132302 348812 -193774 59610
$$ [...]
##END NTUPLES=NMR SPECTRUM
##END=
