
##TITLE=AC1232_PUEHDE125_6075406_ZkziUhQfc5
##JCAMPDX= 6.0         $$ Bruker NMR JCAMP-DX V2.0
##DATA TYPE= NMR SPECTRUM
##DATA CLASS= NTUPLES
##ORIGIN= BRUKER
##OWNER= Administrator
$$ 1.72 TOPSPIN		Version 2.1
$$ 2012-05-08 01:48:13.296 -0500  Administrator@TOPSPIN
$$ Compression mode = diff/dup
##.OBSERVE FREQUENCY= 400.13188235
##.OBSERVE NUCLEUS= ^1H
##.ACQUISITION MODE= SIMULTANEOUS (DQD)
##.ACQUISITION SCHEME= undefined
##.AVERAGES= 64
##.DIGITISER RES= 22
##SPECTROMETER/DATA SYSTEM= spect
##.PULSE SEQUENCE= noesygpps1d.comp
##.SOLVENT NAME= COFFEE_meoh
##.SHIFT REFERENCE= INTERNAL, COFFEE_meoh, 1, 14.96656
##AUDIT TRAIL= $$ (NUMBER, WHEN, WHO, WHERE, PROCESS, VERSION, WHAT)
$$ ##TITLE= Audit trail, TOPSPIN		Version 2.1
$$ ##JCAMPDX= 5.01
$$ ##ORIGIN= Bruker BioSpin GmbH
$$ ##OWNER= Administrator
$$ $$ C:\Bruker\TOPSPIN/data/COFFEE/nmr/AC1232_PUEHDE125_6075406_ZkziUhQfc5/12/pdata/1/auditp.txt
$$ ##AUDIT TRAIL=  $$ (NUMBER, WHEN, WHO, WHERE, PROCESS, VERSION, WHAT)
(   1,<2012-05-08 01:48:07.890 -0500>,<Administrator>,<TOPSPIN>,<go>,<TOPSPIN 2.1>,
      <created by zg
	started at 2012-05-08 01:36:37.484 -0500,
	POWCHK enabled, PULCHK disabled,
       configuration hash MD5:
       AF F2 23 6B 01 CD 40 DD E5 A1 38 A0 06 EA F7 77
       data hash MD5: 64K
       2D 58 04 9C C8 A1 0C B3 DF 41 DE 47 2B 77 EA CB>)
(   2,<2012-05-08 01:48:11.171 -0500>,<Administrator>,<TOPSPIN>,<proc1d>,<TOPSPIN 2.1>,
      <Start of raw data processing
       efp LB = 0.3 FT_mod = 6 PKNL = 1 PHC0 = 0 PHC1 = 0 SI = 128K 
       data hash MD5: 128K
       0E EB 65 72 C5 A7 81 F7 66 8A E8 7E 76 A4 C5 71>)
(   3,<2012-05-08 01:48:12.296 -0500>,<Administrator>,<TOPSPIN>,<proc1d>,<TOPSPIN 2.1>,
      <pk PHC0 = 32.98645 PHC1 = 0 
       data hash MD5: 128K
       18 DF 38 A2 EA 4F 93 82 DC 4B 48 CE 8D 33 97 E0>)
(   4,<2012-05-08 01:48:12.984 -0500>,<Administrator>,<TOPSPIN>,<proc1d>,<TOPSPIN 2.1>,
      <abs ABSG = 1 
       data hash MD5: 128K
       DE D8 D4 FA AB CB 09 8F 35 01 31 B5 43 62 DC A4>)
(   5,<2012-05-08 01:48:13.062 -0500>,<Administrator>,<TOPSPIN>,<proc1d>,<TOPSPIN 2.1>,
      <abs ABSG = 2 
       data hash MD5: 128K
       C9 97 0C 59 FE 41 4D C0 8A C4 43 4F 34 92 1C E0>)
(   6,<2012-05-08 01:48:13.109 -0500>,<Administrator>,<TOPSPIN>,<proc1d>,<TOPSPIN 2.1>,
      <abs ABSG = 3 
       data hash MD5: 128K
       D3 B9 3E 8A 33 EA 65 B6 92 D9 C3 0D AF 4A 0E 29>)
(   7,<2012-05-08 01:48:13.156 -0500>,<Administrator>,<TOPSPIN>,<proc1d>,<TOPSPIN 2.1>,
      <abs ABSG = 4 
       data hash MD5: 128K
       3B 3C 91 D9 C4 5E 2C 77 18 81 22 81 96 AC 36 BB>)
(   8,<2012-05-08 01:48:13.203 -0500>,<Administrator>,<TOPSPIN>,<proc1d>,<TOPSPIN 2.1>,
      <abs ABSG = 5 
       data hash MD5: 128K
       52 DA 72 64 D8 3B F6 85 F6 6F 6E 28 B5 68 3C CB>)
$$ ##END=
$$ 
$$ $$ hash MD5
$$ $$ 24 26 01 F8 5A 42 5E 80 5A 6D A3 EC 79 6E F7 CD
##$RELAX= 
##$RELAX= 
##$RELAX= 
##$RELAX= 
##$RELAX= 
##$RELAX= 
##$RELAX= 
##$RELAX= 
$$ Bruker specific parameters
$$ [...]
##$TP07= 0
##$TPNAME0= <>
##$TPNAME1= <>
##$TPNAME2= <>
##$TPNAME3= <>
##$TPNAME4= <>
##$TPNAME5= <>
##$TPNAME6= <>
##$TPNAME7= <>
##$TPOAL= (0..7)
0.5 0.5 0.5 0.5 0.5 0.5 0.5 0.5
##$TPOFFS= (0..7)
0 0 0 0 0 0 0 0
##$TUNHIN= 0
##$TUNHOUT= 0
##$TUNXOUT= 0
##$USERA1= <user>
##$USERA2= <user>
##$USERA3= <user>
##$USERA4= <user>
##$USERA5= <user>
##$V9= 5
##$VALIST= <valist>
##$VCLIST= <CCCCCCCCCCCCCCC>
##$VD= 0
##$VDLIST= <DDDDDDDDDDDDDDD>
##$VPLIST= <PPPPPPPPPPPPPPP>
##$VTLIST= <TTTTTTTTTTTTTTT>
##$WBST= 1024
##$WBSW= 4
##$XGAIN= (0..3)
0 0 0 0
##$XL= 0
##$YL= 0
##$YMAX_a= 10488219
##$YMIN_a= -5831769
##$ZGOPTNS= <>
##$ZL1= 120
##$ZL2= 120
##$ZL3= 120
##$ZL4= 120
##$ABSF1= 14.96656
##$ABSF2= -5.58597
##$ABSG= 5
##$ABSL= 3
##$ALPHA= 0
##$AQORDER= 0
##$ASSFAC= 0
##$ASSFACI= 0
##$ASSFACX= 0
##$ASSWID= 0
##$AUNMP= <proc_prof1d_extract.lims>
##$AXLEFT= 0
##$AXNAME= <>
##$AXNUC= <1H>
##$AXRIGHT= 0
##$AXTYPE= 0
##$AXUNIT= <>
##$AZFE= 0.1
##$AZFW= 0.1
##$BCFW= 0
##$BC_mod= 0
##$BYTORDP= 0
##$COROFFS= 0
##$CY= 15
##$DATMOD= 1
##$DC= 0
##$DFILT= <>
##$DTYPP= 0
##$F1P= 0
##$F2P= 0
##$FCOR= 0.5
##$FTSIZE= 131072
##$FT_mod= 6
##$GAMMA= 0
##$GB= 0
##$INTBC= 1
##$INTSCL= 1
##$ISEN= 128
##$LB= 0.3
##$LEV0= 0
##$LPBIN= 0
##$MAXI= 10000
##$MC2= 0
##$MEAN= 0
##$ME_mod= 0
##$MI= 0
##$NCOEF= 0
##$NC_proc= -3
##$NLEV= 6
##$NOISF1= 0
##$NOISF2= 0
##$NSP= 0
##$NTH_PI= 0
##$NZP= 0
##$OFFSET= 14.96656
##$PC= 1
##$PHC0= 32.98645
##$PHC1= 0
##$PH_mod= 1
##$PKNL= yes
##$PPARMOD= 0
##$PPDIAG= 0
##$PPIPTYP= 0
##$PPMPNUM= 2147483647
##$PPRESOL= 1
##$PSCAL= 4
##$PSIGN= 0
##$PYNMP= <proc.py>
##$REVERSE= no
##$SF= 400.130005622368
##$SI= 131072
##$SIGF1= 0
##$SIGF2= 0
##$SINO= 400
##$SIOLD= 131072
##$SPECTYP= <>
##$SREGLST= <1H.CDCl3>
##$SSB= 0
##$STSI= 131072
##$STSR= 0
##$SW_p= 8223.68421052632
##$SYMM= 0
##$S_DEV= 0
##$TDeff= 65536
##$TDoff= 0
##$TI= <>
##$TILT= no
##$TM1= 0
##$TM2= 0
##$TOPLEV= 0
##$USERP1= <user>
##$USERP2= <user>
##$USERP3= <user>
##$USERP4= <user>
##$USERP5= <user>
##$WDW= 1
##$XDIM= 131072
##$YMAX_p= 388573863
##$YMIN_p= -42884863
##$CURPLOT= <Network HP LaserJet P1505>
##$CURPRIN= <$Network HP LaserJet P1505>
##$DFORMAT= <normdp>
##$LAYOUT= <+/1D_H.xwp>
##$LFORMAT= <normlp>
##$PFORMAT= <normpl>
##$SURQMSG= 1
$$ End of Bruker specific parameters
$$ ---------------------------------
##NTUPLES= NMR SPECTRUM
##VAR_NAME=  FREQUENCY,     SPECTRUM/REAL,   SPECTRUM/IMAG
##SYMBOL=    X,             R,               I
##VAR_TYPE=  INDEPENDENT,   DEPENDENT,       DEPENDENT
##VAR_FORM=  AFFN,          ASDF,            ASDF
##VAR_DIM=   131072,        131072,          131072
##UNITS=     HZ,            ARBITRARY UNITS, ARBITRARY UNITS
##FACTOR=    0.0627417313425165, 1,          1
##FIRST=     8223.62146879498, -4775,        -94741
##LAST=      0,             -2840,           -96871
##MIN=       0,             -42884863,       0
##MAX=       8223.62146879498, 388573863,    0
$$ Real data points
##PAGE= N=1
##DATA TABLE= (X++(R..R)), XYDATA
$$ [...]
61430D30297M424L485L065L567M679N801O069M765K254Kr19q60o27k36M85Q06
61414D67057j16j564j801n23N83J88q90j051j75N76O50O90J271K011K053R04j250
61397D68613l493m447l278p02J507K223J749R01qq72j238p33L13J337K288L291
61381D67451L915L724L258L374L618K692Q04P4J635L737M112L129K884L742L939
61366E12088K581J095J063K241L471M120L848K441R24J345M006O075M717Q44k043
61351E48816k205r86j15J52o8j080k419k645j434n74j610l662m802m576l676k094
61335E17022M38K580K188o10k980k873j445r30j496j733j299j171j464r31Q98
61320E06194K593K687J644R86J366K478M155O197P454O611M130K239K445L873
$$ y = [430297, 434721, 438206, 441271, 444838, 449517, 455318, 461387, 466152, 468406, 468408, 467489, 466629, 466002, 465766, 466251, 467057, 466941, 465377, 463576, 463053, 463636, 463824, 462934, 461883, 461708, 462284, 462934, 463624, 464895, 466906, 468959, 469863, 468613, 465120, 460673, 457395, 456693, 458200, 460423, 462172, 463073, 463065, 462193, 460955, 460222, 460535, 461872, 464160, 467451, 471366, 475090, 478348, 481722, 485340, 488032, 488836, 488910, 490545, 494282, 498394, 501523, 504407, 508149, 512088, 514669, 515764, 516827, 519068, 522539, 526659, 530507, 532948, 533872, 535217, 539223, 545298, 550015, 550859, 548816, 546611, 545625, 545510, 545662, 545594, 544514, 542095, 539450, 538016, 537442, 535832, 532170, 527368, 522792, 519116, 517022, 517460, 520040, 522228, 521618, 518638, 515765, 514320, 513390, 511894, 510161, 508862, 507691, 506227, 505296, 506194, 508787, 511474, 513118, 514104, 515470, 517948, 522103, 528300, 535754, 542365, 546495, 548734, 551179, 555052]
61306E55052M525L585J936R13J157K326L507M053M252M852N959O921P459Q057
61292F14554Q914R306Q703P723P238P000O164M730L493K799K396K410L354M984
61278F93768O144O106N351M638M030L293K631K383K259J512j05j839k580k007
61264G25584r87o39j036j160l39R10J792K360K984L370L135K951L765N108N659
61249G53457N616O687R189J0976J0488R193R198R670P906L572o08k639l513m865
61235H24327o363o877o738p063p701p641p015o924p365p110n931n249n870o564
61221G29916n863m091k479j233J30J313J691J827K958M943O322O548O730P641
61207G56353Q358P661N839M312M175N714Q558J1610J3512J3785J3055J1776R616
$$ y = [555052, 559577, 563162, 565098, 566011, 567168, 569494, 573001, 577054, 581306, 586158, 592117, 599038, 606497, 614554, 623468, 632774, 641477, 649200, 656438, 663438, 669602, 674332, 677825, 680624, 683020, 685430, 688784, 693768, 699912, 706018, 711369, 716007, 720037, 723330, 725961, 728344, 730603, 732115, 732010, 730171, 727591, 725584, 724597, 723958, 722922, 721762, 721423, 722333, 724125, 726485, 729469, 732839, 735974, 738925, 742690, 747798, 753457, 759073, 765760, 774949, 785925, 796413, 805606, 814804, 824474, 832380, 835952, 835344, 832705, 829192, 824327, 817964, 811087, 804349, 797286, 789585, 781944, 774929, 768005, 760640, 753530, 747599, 742350, 736480, 729916, 724053, 719962, 717483, 716250, 716380, 717693, 719384, 721211, 724169, 729112, 735434, 741982, 748712, 756353, 764711, 772372, 778211, 782523, 786698, 792412, 800970, 812580, 826092, 839877, 852932, 864708, 874324]
61194H74324O604L850K344J966K426M044O554Q166P429N316M051M241M608M070
61180I39993K616M75k002l735l858l289l857n682o930o405m935l866l567l859
61166H91099m504m798m056k895k717l517l785l133l109m427n191l495m09J409
61152H46472J159K67m6K14Q27J728K277J652K06n79K15K045L785M908N704O853
61136H77687Q828J1301J3273J4016J3603J2311J0141P352M676K470L80j489k092
61123I72457j153m19j668m001m874l589k156k356l579m211m011m169n579p798
61109I22894r429r253p225m606k887k610l375m649o007o918p077o826o654o391
61095H38987n641m774m582m898m527k779m06J257J481L89j472l606o034r151j2699
$$ y = [874324, 880928, 884778, 887122, 889088, 891514, 895558, 902112, 910278, 917707, 923023, 927074, 931315, 935923, 939993, 942609, 943084, 941082, 937347, 933489, 930200, 926343, 920661, 913731, 907326, 902391, 898525, 894958, 891099, 886595, 881797, 877741, 874846, 872129, 868612, 864827, 861694, 858585, 854158, 848967, 845472, 845063, 846472, 847631, 847898, 847852, 848066, 848893, 850621, 852898, 854550, 854756, 854177, 854392, 856437, 860222, 865130, 870834, 877687, 886515, 897816, 911089, 925105, 938708, 951019, 961160, 968512, 973188, 975658, 976038, 974549, 972457, 971304, 970885, 969217, 965216, 960342, 956753, 954597, 952241, 948662, 944451, 940440, 936271, 930692, 922894, 913465, 904212, 896987, 892381, 889494, 886884, 883509, 878860, 872853, 865935, 858858, 852032, 845378, 838987, 833346, 828572, 823990, 819092, 814565, 811786, 811380, 812637, 814118, 814507, 813035, 809429, 803395, 794244, 781545]
61080G81545j5203j5245j3084j0250p750n685m319m231n131n768n400m315k693
61067F82471k41K528L928L040J189O32K281N282Q179R920J0409J0709J2116J4445
61053G66888J5998J5910J5559J6702J8954K0288J9633J7774J6001J4942J4692
61042I53341J4843J4242J1638P041J896k303n171p177q817j0228j1334j2135j2922
61029I32914j3980j5007j5315j4953j5057j6338j7751j7657j6099j4802j4828
61018G61127j5355j5091j3963j2758j1830j0945j0051r475r454r899j0519j0810
61006F20977j0144q219n474k799r58k97o56j194p60R74K836L306K451K017L259
60991F05319N341O513O432O360P174Q245Q729R113J0651J3528J6338J7454J6539
$$ y = [781545, 766342, 751097, 738013, 727763, 720013, 714328, 710009, 705778, 700647, 694879, 689479, 685164, 682471, 682230, 684758, 688686, 691726, 692915, 693547, 695828, 701110, 709289, 719209, 729618, 740327, 752443, 766888, 782886, 798796, 814355, 831057, 850011, 870299, 889932, 907706, 923707, 938649, 953341, 968184, 982426, 994064, 1001105, 1003001, 1000698, 995527, 988350, 979533, 969305, 957971, 945836, 932914, 918934, 903927, 888612, 873659, 858602, 842264, 824513, 806856, 790757, 775955, 761127, 745772, 730681, 716718, 703960, 692130, 681185, 671134, 661659, 652205, 642306, 631787, 620977, 610833, 602614, 597140, 594341, 593383, 593086, 592430, 591236, 590476, 591450, 594286, 597592, 600043, 602060, 605319, 610660, 617173, 623605, 629965, 637139, 645384, 654113, 663226, 673877, 687405, 703743, 721197, 737736]
60978G37736J4849J4404J6507K0367K3412K3730K2238K1626K3112K5225K6187
60967I69393K6443K8033L2081L7760M3578M8868N4000N9700O6373P4039Q2890
60956A523158R3510J05499J15369J16709J04041P7381M3264J1377j0325j8833
60946B161150j6181p055L510J0300P287j0171m0599p4957j02141j16491j19488
60935A695164j15345j07072r6564q5839p6398o8253o0650n3257m6215l9773l4474
60924I11324l0978k9036k7225k4243k0137j5954j2782j1304j1450j2111j1974
60913G04130j0999j0176r559p934n152l278m016o069o726n362l678k892k503j788
60899F23998q43J61J342K321K349J627J455K627M511O096P038P522P995R175J1219
$$ y = [737736, 752585, 766989, 783496, 803863, 827275, 851005, 873243, 894869, 917981, 943206, 969393, 995836, 1023869, 1055950, 1093710, 1137288, 1186156, 1240156, 1299856, 1366229, 1440268, 1523158, 1616668, 1722167, 1837536, 1954245, 2058286, 2135667, 2178931, 2190308, 2179983, 2161150, 2144969, 2137914, 2141424, 2151724, 2159011, 2148840, 2108241, 2033284, 1931143, 1814652, 1695164, 1579819, 1472747, 1376183, 1290344, 1213946, 1145693, 1085043, 1031786, 985571, 945798, 911324, 880346, 851310, 824085, 799842, 779705, 763751, 750969, 739665, 728215, 716104, 704130, 693131, 682955, 673396, 665462, 660310, 657032, 653016, 646947, 640221, 634859, 631181, 628289, 625786, 623998, 623155, 623316, 624658, 626979, 629328, 630955, 632410, 635037, 639548, 645644, 652682, 660204, 668199, 677374, 688593]
60884F88593J2751J2117R887Q594R386J0656J0822J0668J1348J1750J0105P250
60872H13927N789O254O373M523J827J33l02j09O77K176L617M073L733L536L978
60857H60205N177P563J1376J5616J8585J9708K0142K1288K3311K5376K6857K7949
60845A083153K9387L1887L5611L9703M2438M2375L9645L5880L2686L0183K7185
60834A470133K2578J6230Q724P32p151j4419k0797k6208l0406l2994l4014l4219
60822A318189l4379l4643l4831l4871l4450l2807k9663k6084k3513k2034k0490
60811I90424j8348j6427j5528j5331j5169j5058j5217j5240j4519j3272j2415
60800H23900j2575j3562j4589j4716j3457j1510j0479j1218j2646j2816j1048
$$ y = [688593, 701344, 713461, 723348, 731942, 741328, 751984, 762806, 773474, 784822, 796572, 806677, 813927, 819716, 825970, 832343, 836866, 838693, 838826, 838524, 838415, 839092, 841268, 844885, 848958, 852691, 856227, 860205, 865382, 872945, 884321, 899937, 918522, 938230, 958372, 979660, 1002971, 1028347, 1055204, 1083153, 1112540, 1144427, 1180038, 1219741, 1262179, 1304554, 1344199, 1380079, 1412765, 1442948, 1470133, 1492711, 1508941, 1517665, 1518397, 1511246, 1496827, 1476030, 1449822, 1419416, 1386422, 1352408, 1318189, 1283810, 1249167, 1214336, 1179465, 1145015, 1112208, 1082545, 1056461, 1032948, 1010914, 990424, 972076, 955649, 940121, 924790, 909621, 894563, 879346, 864106, 849587, 836315, 823900, 811325, 797763, 783174, 768458, 755001, 743491, 733012, 721794, 709148, 696332, 685284]
60789F85284q510o762o377o965p869q540q553p713o173m547l667l974m891n306
60775E95437m880m482m849n468n501n351o056p223o986m626k033j442k402k357
60761E31781r2K714L760K891J784J665K364L407M765O166O662N736M329L881M533
60746E86346N082M625L478K343J467R55J162K084K853K451P57j387k848k762j106
60731F05500Q03J070p85l084m111m389n556p413p779n718l263k858m173m838l781
60716E49625k391k320l532m988o216p302p848p045m926k825k101k704l399l295
60702D88733k649k127j756j089j32N67R13J653L239M695M527K814J486K057L811
60687E06742N098N726O887Q793R943R162P156N182L358J340l04r26j379l029n404
$$ y = [685284, 676774, 670012, 663635, 656670, 648801, 640261, 631708, 623995, 617822, 613275, 609608, 605634, 600743, 595437, 590557, 586075, 581226, 575758, 570257, 564906, 558850, 551627, 544641, 540015, 537982, 536540, 534138, 531781, 531689, 534403, 538163, 541054, 542838, 544503, 546867, 550274, 555039, 561205, 567867, 573603, 577932, 581813, 586346, 591428, 596053, 599531, 601874, 603341, 604296, 605458, 607542, 610395, 612846, 613603, 612216, 609368, 606606, 605500, 606303, 607373, 606588, 603504, 599393, 595004, 589448, 582035, 574256, 568538, 565275, 562417, 558244, 553406, 549625, 547234, 544914, 541382, 536394, 530178, 522876, 515028, 507983, 503057, 500232, 498131, 495427, 492028, 488733, 486084, 483957, 482201, 481112, 480980, 481547, 482460, 484113, 487352, 492047, 496574, 499388, 500874, 502931, 506742, 511840, 517566, 524453, 533246, 543189, 552351, 559507, 564689, 568047, 569387, 569083, 568157, 566778, 563749, 558345]
60672E58345o527n813m864m996n633n907o271p307q272q122p162o369n852n227
60658D70023m710m542l931k145k85k88k262m253m815m473m264m084l106j068J329
60643D27126K891K709J012p69j424j220j124j130m69P80J569J458J142J183J363
60628D35097J488J759K037J943J969L216N479O833N934L731K104J695J930K393
60614D77608L117M009M794N249N091M194L219L243M258M884M242L190K929L194
60600E33221K875J765O66J59J83M70N72j65j797l292l584k862k113j900k300l438
60584E18460n100o216n899m743m092m187m073l232k219j678j690k228l302m443
60570D65358m838m265l268k348j551r57q61j295j861k141j923j157j16O39R52
$$ y = [558345, 551818, 546005, 541141, 536145, 530512, 524605, 518334, 511027, 502755, 494633, 487471, 481102, 475250, 470023, 465313, 460771, 456840, 454695, 454410, 454122, 451860, 447607, 442792, 438319, 434055, 429971, 426865, 425797, 427126, 430017, 432726, 433738, 432969, 431545, 430325, 429201, 428071, 427602, 428382, 429951, 431409, 432551, 433734, 435097, 436585, 438344, 440381, 442324, 444293, 447509, 452988, 459821, 465755, 469486, 471590, 473285, 475215, 477608, 480725, 484734, 489528, 494777, 499868, 504062, 507281, 510524, 514782, 519666, 523908, 527098, 530027, 533221, 536096, 537861, 538527, 538686, 538869, 539339, 539911, 539746, 537949, 534657, 531073, 528211, 526098, 524198, 521898, 518460, 513360, 507144, 501245, 496502, 492410, 488223, 484150, 480918, 478699, 477021, 475331, 473103, 469801, 465358, 460520, 456255, 452987, 450639, 449088, 448131, 447270, 445975, 444114, 441973, 440050, 438893, 438777, 439416, 440368]
60555D40368J399K229K473J171q85j862j215m9Q14J703K730L131K588J985K024
60540D58604K202J978J834K134K017P12q13j003m7M28j82o95k4J525L126M485
60524D76281N431N525M785M103M198M696M999N540P234R827J1792J2051J1120
60511E67582J0246R999R995R504P906N045J735m33n07P10J546J458J395K140L231
60496F31552L974M713O250Q577J1105J3817J7065K0242K1884K1516K0409J9783
60484H00887J9042J6733J2784Q503M512Kn387j0104j2203j1791j0811j0446r977
60471G91744q541o905o411o803o349m194j572k08j73O9J721M292O220O606O287
60456G75783P116J0132J4537J8631K1581K3971K6816L0569L5091L9904M4203M7062
$$ y = [440368, 441767, 443996, 446469, 447640, 446755, 444893, 443678, 443629, 444443, 446146, 448876, 452007, 454595, 456580, 458604, 460806, 462784, 464618, 466752, 468769, 469481, 468668, 467665, 467618, 468046, 467864, 467169, 467145, 468670, 471796, 476281, 481712, 487237, 492022, 496125, 500323, 505019, 510018, 515558, 522792, 532619, 544411, 556462, 567582, 577828, 587827, 597822, 607326, 615232, 620277, 622012, 621579, 621072, 621782, 623328, 624786, 626181, 628321, 631552, 635526, 640239, 646489, 655066, 666171, 679988, 697053, 717295, 739179, 760695, 781104, 800887, 819929, 836662, 849446, 857949, 862461, 862463, 857076, 846972, 834769, 822978, 812167, 801721, 791744, 783203, 776298, 769887, 763084, 756735, 752541, 750969, 750761, 750588, 750657, 752378, 756670, 762890, 769496, 775783, 782899, 793031, 807568, 826199, 847780, 871751, 898567, 929136, 964227, 1004131, 1048334, 1095396]
60444A095396M8040M7525M6337M5155M4117M2451L8593L1335K1032R157l397j6753
60432A448988l0570m3126n2542n8343o1090o1149n8665n4461m9919m5872m2170
60421H91081l8390l4539l1011k8187k6040k4033k1605j8850j6387j4471j2801
60410F24767j1369j0699j0823j0803r894q552p537o760n918n591o481p832p942
60397E14566o390m701m382n074n117l586j393k98q77j739j209L71R76l92k541
60382D78214m052m955n536n059l215j582j659k364j646O7N04o33j172j19Q58M37
60366D48088k90j31Lr46j773o41J851L280K597J040P2o4K89R28J560J739J403
60349D59005J001R16J070J119Q53N42Q87K238L783M147L024J628J195J677K248
$$ y = [1095396, 1143436, 1190961, 1237298, 1282453, 1326570, 1369021, 1407614, 1438949, 1459981, 1469138, 1465741, 1448988, 1418418, 1375292, 1322750, 1264407, 1203317, 1142168, 1083503, 1029042, 979123, 933251, 891081, 852691, 818152, 787141, 758954, 732914, 708881, 687276, 668426, 652039, 637568, 624767, 613398, 602699, 591876, 581073, 571179, 562627, 555090, 548330, 542412, 536821, 530340, 522508, 514566, 508176, 503475, 499093, 494019, 488902, 485316, 483923, 483625, 482748, 481009, 479800, 480171, 481147, 480755, 478214, 474162, 469207, 463671, 458612, 455397, 453815, 452156, 449792, 448146, 448213, 448717, 448084, 446912, 446793, 447651, 448088, 447798, 447667, 447670, 446724, 444951, 444310, 446161, 449441, 452038, 453078, 453150, 453086, 453375, 454303, 455863, 457602, 459005, 460006, 460922, 461992, 463111, 463964, 464506, 465393, 467631, 471414, 475561, 478585, 480213, 481408, 483085, 485333]
60334D85333K481K551K801L532M790N990O257N390L997K585J236L08M64J634K890
60319E32239L705M372M860M471L171K049J738J634J354J612K653L338L074L110
60305E73380M258M850L143N41j19J107J454n7j162j07J707K056J028K80N70J405
60289E94334K219K527J666l30k040k052q41k43j162k580k998k098p50J37M58P39
60273E86986J330J869J606L30j209j909j356l09R3l37m78O96K575L507L007K472
60257E98873L254N049O967R137J2015J4787J6094J6155J6465J7261J6902J4350
60245G47309J0798P862N209J214m557j0673j5437j8333j9744j9923j8597j5602
60233F49526j1781q897q142q765q804p342n428m486m475m240l211k057j714k375
$$ y = [485333, 487814, 490365, 493166, 496698, 501488, 507478, 513735, 519125, 523122, 525707, 526943, 527251, 527715, 529349, 532239, 535944, 540316, 545176, 549647, 552818, 554867, 556605, 558239, 559593, 561205, 563858, 567196, 570270, 573380, 577638, 582488, 585631, 586172, 586053, 587160, 588614, 588557, 587395, 587288, 588995, 591051, 592079, 592359, 592929, 594334, 596553, 599080, 600746, 600416, 598376, 596324, 595483, 595240, 594078, 591498, 588500, 586402, 585652, 585789, 586247, 586986, 588316, 590185, 591791, 592121, 590912, 589003, 587647, 587338, 587431, 587094, 586616, 587312, 589887, 593394, 596401, 598873, 602127, 607176, 614143, 623280, 635295, 650082, 666176, 682331, 698796, 716057, 732959, 747309, 758107, 765969, 771178, 772392, 767835, 757162, 741725, 723392, 703648, 683725, 665128, 649526, 637745, 628848, 620706, 611941, 603137, 595795, 590367, 585881, 581406, 577166, 573955, 571898, 570184, 567809]
60219E67809l534m566n041m659l273j157Q59J809J417L69l59l90mL60K92o92k819
60202E46421n432p095o695m464j837k93j40m41j80N45Q88O83P42J495K115J665
60186E27977M83l69n45m15j5R39K079K463J817R05N98J150K326L493L639K217
60170E48742J62q52k90P66J262J453K208L682N146N860N835N766O087O075M593
60155E96495K174J224L130O068P272O779O881Q248R109Q555Q083Q789R288Q039
60141F90134N913M770M796M972N065N439N750N511N222N425N390M342L189L272
60127G59190M012L764K570K044K655L146K781K210J764Q88l32q81p29j224k769
60112G79089l849l466k831l312m118l678k159r54m60k43p09k523m489m154j204
$$ y = [567809, 564275, 559709, 554668, 550009, 546736, 545579, 546438, 548247, 549664, 550033, 549674, 549284, 549280, 549640, 549932, 549240, 546421, 540989, 533894, 527199, 522735, 520898, 520605, 520465, 520024, 519844, 520389, 521277, 521960, 522702, 524197, 526312, 527977, 528460, 528091, 527546, 527131, 527116, 528055, 530134, 532597, 534414, 535319, 535917, 537067, 539393, 542886, 546525, 548742, 548904, 548052, 547762, 548528, 549790, 551243, 553451, 557133, 562279, 568139, 573974, 579740, 585827, 591902, 596495, 598669, 599893, 603023, 609091, 616363, 623142, 630023, 638271, 647380, 655935, 664018, 672807, 682095, 690134, 696047, 700817, 705613, 710585, 715650, 721089, 726839, 732350, 737572, 742997, 748387, 752729, 755918, 759190, 763202, 766966, 769536, 771580, 774235, 777381, 780162, 782372, 784136, 785024, 784692, 783811, 783082, 781858, 779089, 775240, 771774, 768943, 765631, 761513, 757835, 755676, 754722, 754262, 754019, 753310, 750787, 746298, 742144, 740940]
60097G40940J586J620n06k404l061l217l270k448l16K204L834M240L847K974J774
60082G47797O69J11J1k8k2L58J131J986K916M139N172M862K905Q20N31K166L924
60065G79448M090K608P53k32J4R60J789K093K073J989J826J655J932K825L655
60050H07478L687L247L141L144K251O96L85K498N572P051O162M178K297O23p05
60035H51705q67M69K204K897K247Q57q14k384k949j867k94n41l285o353p188n780
60019H28057m167l540l229k447j635j568k202l096m242n729p185q270r246j0320
60005G61181j0858j0072q221o335m983l997l309l165l501l840l893l728l337k745
59991F89197k467l121m507n662n893n125l412r81J259K418K959M042N269M677
$$ y = [740940, 742526, 744146, 743640, 741236, 738175, 734958, 731688, 729240, 728924, 731128, 734962, 739202, 743049, 746023, 747797, 748466, 748577, 748588, 748560, 748538, 748896, 750027, 752013, 754929, 759068, 764240, 769102, 772007, 772827, 773358, 775524, 779448, 783538, 786146, 786899, 786667, 786681, 787641, 789430, 791523, 793596, 795585, 797411, 799066, 800998, 803823, 807478, 811165, 814412, 817553, 820697, 822948, 823644, 824029, 826527, 832099, 839150, 845312, 849490, 851787, 852410, 851705, 850838, 851307, 853511, 856408, 858655, 859512, 858698, 856314, 853365, 851498, 851204, 850663, 847378, 841025, 833837, 828057, 823890, 820350, 817121, 814674, 813039, 811471, 809269, 806173, 801931, 796202, 789017, 780747, 771501, 761181, 750323, 740251, 732030, 725695, 720712, 716715, 713406, 710241, 706740, 702900, 699007, 695279, 691942, 689197, 686730, 683609, 679102, 673440, 667547, 662422, 659010, 658029, 659288, 661706, 664665, 668707, 673976, 678653]
59977F78653J836o67l97J469J831J73q96K59J896J592m12j963k054j531j174o92
59961F77923J35N55k51j963l429l855l374k647k330k802l916m923n036m352l989
59946F35746m963o973q603q764p648o132m678l154j568m20k01p39j186p56N25
59931E80486J782K158J733J318J273J114O08O15K039M234N519N310M725M764M985
59916F22663M557L645K836J983P69j60l0L26q12l340m797l409m77J259R09%J98
59899F26120J525K803L005K081R44O84J416K116J899J024J93n11j173j156R6J679
59883F42745K085J430J392K633L780L597K732K367K413K258K205K782L330K900
59869F78649K004J918K657L213L625M892O743P516O932O995R058J1552J2229J1387
$$ y = [678653, 680489, 679822, 679425, 680894, 682725, 682898, 682002, 682261, 684157, 685749, 685337, 683374, 681320, 679789, 678615, 677923, 678058, 678613, 678362, 676399, 672970, 669115, 665741, 663094, 660764, 657962, 654046, 649123, 644087, 639735, 635746, 630783, 623810, 615207, 606443, 598795, 592663, 587985, 584831, 583263, 582843, 582642, 581903, 580717, 579961, 580486, 582268, 584426, 586159, 587477, 588750, 589864, 590472, 591087, 593126, 597360, 602879, 608189, 612914, 617678, 622663, 627220, 630865, 633701, 635684, 636453, 636293, 636263, 636589, 635777, 632437, 627640, 624231, 623754, 625013, 625922, 625922, 626120, 627645, 630448, 633453, 635534, 636478, 637162, 638578, 640694, 642593, 643617, 643810, 643299, 642126, 640970, 641066, 642745, 644830, 646260, 647652, 650285, 654065, 657662, 660394, 662761, 665174, 667432, 669637, 672419, 675749, 678649, 680653, 682571, 685228, 688441, 692066, 696958, 703701, 711217, 718149, 725144, 734202, 745754, 757983, 769370]
59855G69370J1115J2061J2858J2544J1727J1161J0633R721Q458O761M273J357
59843H82039p36j428j706k728m181m943m823m588m517m089l249k971m000n652
59829H32428o414n512l431j251J62N44L84P23K303M687O534O939O242N271M273
59814H53882L080J998J718K134K139J155K26P01K150K640J169j151k691l213l561
59799H62376m140m649m883m948m790m345m085m514n059m417k504j204k385n494
59785H04959p930p783n606l503l016m129n840p135p415o513m711k843j849j956
59771G34730k378k155j165l5P25J011P68J1p30o91J64J056J469J708K115K589
59755G39192L301M941P443R337R407Q316P414O525M418J166j568k814l236l494
$$ y = [769370, 780485, 792546, 805404, 817948, 829675, 840836, 851469, 861190, 869648, 876409, 880682, 882039, 881303, 879875, 878169, 875441, 871260, 866317, 861494, 856906, 852389, 848300, 845051, 842080, 838080, 832428, 826014, 820502, 817071, 815820, 815982, 816526, 816910, 817633, 819936, 824623, 831157, 838096, 844338, 849609, 853882, 856962, 858960, 860678, 862812, 864951, 866106, 866332, 867033, 869183, 871823, 872992, 871841, 869150, 865937, 862376, 858236, 853587, 848704, 843756, 838966, 834621, 830536, 826022, 820963, 816546, 814042, 812838, 810453, 804959, 797029, 789246, 783640, 780137, 777121, 772992, 767152, 760017, 752602, 746089, 741378, 738535, 736686, 734730, 732352, 730197, 729032, 728997, 729722, 730733, 731501, 731512, 730782, 730091, 730255, 731311, 732780, 734488, 736603, 739192, 742493, 747434, 754877, 764214, 773621, 781937, 789351, 795876, 800294, 801460, 799892, 797078, 793842, 790348]
59741G90348l209k240j501j517j476r38j272l785p097q180n883k048Q71J945J481
59726G55499M5j634k735l056l114l248l142k461j328J5J331J964J215m16j178
59711G37757J01K651M776N723N803N293M275L446L986O198Q760R843Q873P102
59697H14587O422P588R474J0194R045P143O109O500P636Q562Q723Q057O954O001
59683I22995N393M755L774K679J757Q95J33J13J094J977J413l45j793k337k717
59668I39786l265l353l041l548n018n460l489q36j98j422j985r51q6p12j667j332
59652I03423P9J374K128K406J973J181J512L749O326P165O612O809Q412R768R672
59637I72589R093R383J0165J0210R455Q901Q845Q463P143N277L522K022P47N2
$$ y = [790348, 787139, 784899, 783398, 781881, 780405, 779467, 778195, 774410, 767313, 759133, 753250, 751202, 752073, 754018, 755499, 755544, 753910, 751175, 748119, 745005, 741757, 738615, 736154, 734826, 734841, 736172, 738136, 739351, 738935, 737757, 737858, 740509, 745285, 751008, 756811, 762104, 766379, 769825, 773811, 780009, 788769, 798612, 807485, 814587, 821009, 828597, 838071, 848265, 857310, 864453, 870562, 877062, 884698, 893260, 901983, 910040, 916994, 922995, 928388, 933143, 936917, 939596, 941353, 942248, 942381, 942494, 943588, 945565, 946978, 946633, 944840, 942503, 939786, 936521, 933168, 930127, 926579, 921561, 916101, 912612, 911776, 911578, 910156, 908171, 907220, 907134, 906422, 904755, 903423, 903502, 904876, 907004, 909410, 911383, 912564, 914076, 917825, 924151, 931316, 937928, 944737, 953149, 962917, 972589, 981682, 991065, 1001230, 1011440, 1020895, 1029796, 1038641, 1047104, 1054247, 1059524, 1063046, 1065068, 1065815, 1065867]
59623A065867J39J90j116l807n978n648l181j105j467l961o747q348q385p258
59609A009195n874n161n232n314m897m347l916k968j151M50O33J45R73L638O566
59594I82740Q258Q808Q904Q669Q068P487P096O349M729K492L50j195k129l003
59580A047623m673p205r344j0090j0471j2213j4772j5698j4337j3036j3608j4664
59568I07512j4082j2350j1429j1514j1158r925q768q099p504p337q601j1036j2969
59555G72740j3456j3121j2507j1049q350n332l383l058l969n232n790n040l494
59542F78959k295j975k205k554k638j826P5J953K358J397M31n3q57k139k747k115
59526F63769j368j654k564l144l306l300k789j613o82r33j951k690l014l499m210
$$ y = [1065867, 1066006, 1066196, 1065080, 1061273, 1055295, 1049647, 1046466, 1045361, 1043894, 1039933, 1033186, 1024838, 1016453, 1009195, 1003321, 998160, 992928, 987614, 982717, 978370, 974454, 971486, 970335, 970785, 971418, 971563, 972536, 976174, 982740, 990998, 999806, 1008710, 1017379, 1025447, 1032934, 1040030, 1046379, 1051108, 1053600, 1053950, 1052755, 1050626, 1047623, 1042950, 1035745, 1026401, 1016311, 1005840, 993627, 978855, 963157, 948820, 935784, 922176, 907512, 893430, 881080, 869651, 858137, 846979, 837054, 828286, 820187, 812683, 805346, 796745, 785709, 772740, 759284, 746163, 733656, 722607, 714257, 708925, 705542, 702484, 698515, 693283, 687493, 682453, 678959, 676664, 674689, 672484, 669930, 667292, 665466, 665541, 667494, 669852, 671249, 671680, 671627, 670770, 668631, 665884, 663769, 662401, 660747, 658183, 655039, 651733, 648433, 645644, 644031, 643349, 642416, 640465, 637775, 634761, 631262, 627052]
59511F27052m694m852m818m273k876j163j08O0r5j38J14R71K334L094K193M17
59495F13218j46J348L467M484M434M591N578O787P511Q000R267J1878J4992J6921
59481G12330J7099J7180J9287K2950K4709K1442J3541M271l487q945j2264j3184
59469H14929j1536q300n193l158j842o08N33J220J441J433J104Q1j591l186l985
59454G81342m043m147m952o278p258p267o609o097o016n892n427n107n481o240
59440G00528o585o271n558m422k609n68N22Q1j106j735j223J06J506K256K136
59425F77058J816K323L822N367O106O187O181O244O437P226Q786J0090R610P033
59411G64286L683J124k19r15j520k021k130j872j693j915k185j745l09J631L423
$$ y = [627052, 622358, 617506, 612688, 608415, 605539, 604376, 604268, 604328, 604233, 604095, 604209, 605180, 607514, 610608, 612801, 613218, 613072, 614420, 617887, 622371, 626805, 631396, 636974, 643761, 651272, 659272, 668539, 680417, 695409, 712330, 729429, 746609, 765896, 788846, 813555, 834997, 848538, 852809, 849322, 840377, 828113, 814929, 803393, 795093, 789900, 786742, 784900, 784292, 784825, 786045, 787486, 788919, 790023, 790104, 788513, 785327, 781342, 777299, 773152, 768200, 761922, 754664, 747397, 740788, 734691, 728675, 722783, 717356, 712249, 706768, 700528, 693943, 687672, 682114, 677692, 675083, 674515, 675037, 675118, 674012, 672277, 671054, 671160, 672666, 674922, 677058, 678874, 681197, 685019, 690386, 696492, 702679, 708860, 715104, 721541, 728767, 737553, 747643, 757253, 764286, 767969, 769093, 768874, 767959, 766439, 764418, 762288, 760416, 758723, 756808, 754623, 752878, 752569, 754200, 757623]
59396G57623M853N975O722P003O969O822O477N605M039K130P47O51J528J940Q60
59381H19944r84k130k566l689n975q003q417p609o595n435l968l045l451m194
59367G53883l529j381P55K180L642N534P203Q481J0362J3317J6167J7621J8152
59354H52387J9564K3114K8381L3019L3242K6099J2742j249j0191j2926j2490j1835
59342I79857j1028q326k732M583J0400J0951M634o262j7105k4553k8249k9199
59330H82971k7897k4681k0710j7427j5274j3728j2244j0492q071m893j822j21
59318G25611j13q61j290j033k48P91J805K635L418M212M600M283L958M651O066
59303G58485O667N870N052N641P112P908P636P217P381Q190R694J1761J3464J3948
$$ y = [757623, 762476, 768451, 775173, 782176, 789145, 795967, 802444, 808049, 812088, 814218, 814965, 815616, 817144, 819084, 819944, 818960, 816830, 814264, 810575, 804600, 796597, 788180, 780571, 773976, 768541, 764573, 761528, 758077, 753883, 750354, 748973, 749728, 751908, 755550, 761084, 768287, 776768, 787130, 800447, 816614, 834235, 852387, 871951, 895065, 923446, 956465, 989707, 1015806, 1028548, 1027299, 1017108, 1004182, 991692, 979857, 968829, 960503, 957771, 962354, 972754, 983705, 988339, 982077, 964972, 940419, 912170, 882971, 855074, 830393, 809683, 792256, 776982, 763254, 751010, 740518, 732447, 727554, 725732, 725611, 725498, 724637, 723347, 722314, 722066, 722857, 724662, 727297, 730715, 734927, 739527, 743810, 747768, 752419, 758485, 765152, 771022, 776074, 781715, 788827, 796735, 804371, 811588, 818969, 827159, 836853, 848614, 862078, 876026]
59289H76026J3954J5175J7817K0092K0485J9414J8202J7570J7651J8361J9011
59278A073758J8548J6945J5448J4760J4039J2525J0878R795Q443N891L121J667
59266A205818P38k066p010j1151j1881j0019q470q922j0838j2858j4093j4449
59254A094799j4469j4758j5113j4541j2570j0197r011r557j0922j1768j1537j0740
59242I49616j0294j0428j0265q809o347m216l120k399j330l96m62j257j583r23
59228H87787J24R69J757K677L274L076K416K077K334K847L336L788M063L913L628
59213I28066M063N586P316P908O967N338M183M127N142O569P292O431M123J279
59199A004390j436l873n764o569o402o307p091q296r009r180r392r624r163p847
$$ y = [876026, 889980, 905155, 922972, 943064, 963549, 982963, 1001165, 1018735, 1036386, 1054747, 1073758, 1092306, 1109251, 1124699, 1139459, 1153498, 1166023, 1176901, 1186696, 1195139, 1201030, 1204151, 1205818, 1206556, 1204490, 1197480, 1186329, 1174448, 1164429, 1155959, 1147037, 1136199, 1123341, 1109248, 1094799, 1080330, 1065572, 1050459, 1035918, 1023348, 1013151, 1004140, 994583, 983661, 971893, 960356, 949616, 939322, 928894, 918629, 909820, 903473, 899257, 896137, 893738, 892408, 892012, 891550, 890293, 888710, 887787, 887911, 888880, 890637, 893314, 896588, 899664, 902080, 904157, 906491, 909338, 912674, 916462, 920525, 924438, 928066, 932129, 937715, 945031, 952939, 959906, 965244, 969427, 973554, 978696, 985265, 992557, 998988, 1003111, 1004390, 1002954, 999081, 993317, 986748, 980346, 974039, 966948, 958652, 949643, 940463, 931071, 921447, 912284, 904437]
59185I04437o634o505p245p763p529p180p474p982p448n627l971l791m301l720
59171H17267k103j470k739m138l671j914r52j505k663l876n424p021p575o698
59157G65518n244m027l076k372k170k222j749o90Oj54l91P6Q62J246J458K235
59141G49306L581M731N175N044M674M331M295M753N678O912Q195R044R027Q482
59127H33228Q457R575J1224J2264J2286J1810J1479J1400J1171J0320Q828P309
59115I59351O486O434O555O344N827N140M140K704J116j05o69p81j064k066l532
59100I95880m381l920k792k133k047j842j593k226l754m719m084k660j823j697
59086I56209j610j634k400l639m059k901r03M97M47q03k215k711j951m50J099
$$ y = [904437, 897803, 891298, 884053, 876290, 868761, 861581, 854107, 846125, 838677, 833050, 829079, 825288, 820987, 817267, 815164, 813694, 810955, 806817, 803146, 801232, 800280, 798775, 796112, 792236, 786812, 779791, 772216, 765518, 760274, 756247, 753171, 750799, 748629, 746407, 744658, 743968, 743974, 743820, 743429, 743505, 744367, 745613, 747071, 749306, 752887, 757618, 762793, 767837, 772511, 776842, 781137, 785890, 791568, 798480, 806675, 815719, 824746, 833228, 841685, 851260, 862484, 874748, 887034, 898844, 910323, 921723, 932894, 943214, 952042, 959351, 965837, 972271, 978826, 985170, 990997, 996137, 1000277, 1002981, 1004097, 1003992, 1003323, 1002542, 1001478, 999412, 995880, 991499, 987579, 984787, 982654, 980607, 978765, 977172, 974946, 971192, 966473, 962389, 959729, 957906, 956209, 954599, 952965, 950565, 946926, 942867, 939966, 939063, 939560, 940007, 939204, 936989, 934278, 932327, 931877, 932976]
59071I32976K381L302L838M218M777N272M901L484K029J692K612M301O445Q633
59057I90861J0026J0193R782R473Q935P879P362Q425R925R704P964P396R193J0911
59043A118029R623N810K490J419J862K564L148L398K636N44k241m779o544p287
59029A130672o881n584m031k717j817j535j977k704l138l644n336q316j1008j2006
59015A059978j1898j2319j3606j4464j3831j2027j0017q500p841q069q521q234
59003I30651p018n666m898m744m971n317n042l395j091j77j582l608l929k393
58989H76820p39j10k04m60p16o24J88J150J111N9n28M51K304L499L484K999L022
58972H91706L775M668N125N552P067R806J2129J2413J1219J0435J0617J0604R868
$$ y = [932976, 935357, 938659, 942497, 946715, 951492, 956764, 961665, 965149, 967178, 968870, 971482, 975783, 982228, 990861, 1000887, 1011080, 1020862, 1030335, 1039270, 1047149, 1054511, 1062936, 1072861, 1082565, 1090529, 1097925, 1107118, 1118029, 1127652, 1133462, 1135952, 1137371, 1139233, 1141797, 1144945, 1148343, 1150979, 1151523, 1149282, 1144503, 1137959, 1130672, 1123791, 1118207, 1114176, 1111459, 1109642, 1108107, 1106130, 1103426, 1100288, 1096644, 1091308, 1082992, 1071984, 1059978, 1048080, 1035761, 1022155, 1007691, 993860, 981833, 971816, 963316, 955475, 947406, 938885, 930651, 923633, 917967, 913069, 908325, 903354, 898037, 892995, 889600, 888509, 888332, 886750, 883142, 879213, 876820, 876081, 875971, 875767, 875307, 874591, 873967, 874155, 875305, 876416, 876475, 875947, 876398, 878702, 882201, 885685, 888684, 891706, 895481, 900149, 905274, 910826, 917893, 927699, 939828, 952241, 963460, 973895, 984512, 995116, 1004984]
58959A004984R540J0581J2436J4207J5797J7025J6955J5282J3350J2392J1630
58948A154179R414N727K139l50k078l469m282m274l647k606j194L03J334J550
58934A152746R57l33k043l635m675n128n034m399l766m263o200q175q490p135
58920A090427n480m289l168j852q21l74m7O21J428K002K458L208M463O019P299
58905A101894P562O564N037M101M163M689M929M454L125J230m23j184j427k156
58891A142558l676n308o580p945r863j1710j2300j1336r752q566p817o921n867
58878A034917n477o328p733q331p559o060m655l597k890k592k402j616p7J377
58864I76977J976K075K529L349L635K823J502J076K647N796Q340Q118N470L207
$$ y = [1004984, 1014524, 1025105, 1037541, 1051748, 1067545, 1084570, 1101525, 1116807, 1130157, 1142549, 1154179, 1163593, 1169320, 1171459, 1171109, 1169031, 1165562, 1161280, 1157006, 1153359, 1150753, 1149559, 1149862, 1151196, 1152746, 1153703, 1153370, 1151327, 1147692, 1143017, 1137889, 1132855, 1128456, 1124690, 1120427, 1114227, 1106052, 1097562, 1090427, 1084947, 1080658, 1077490, 1075638, 1074817, 1074443, 1074396, 1075017, 1076445, 1078447, 1080905, 1084113, 1088576, 1094595, 1101894, 1109456, 1116020, 1121057, 1125158, 1129321, 1134010, 1138939, 1143393, 1146518, 1147748, 1147325, 1146141, 1144714, 1142558, 1138882, 1133574, 1126994, 1119049, 1109186, 1097476, 1085176, 1073840, 1064088, 1055522, 1047705, 1040784, 1034917, 1029440, 1023112, 1015379, 1007048, 999489, 993429, 988774, 985177, 982287, 979695, 977293, 975677, 975600, 976977, 978953, 981028, 983557, 986906, 990541, 993364, 994866, 995942, 998589, 1004385, 1012725, 1020843, 1026313, 1029520]
58850A029520L545N779P663Q159P881P591P592Q092Q852Q732O879M291K903L152
58836A120631L602L088K114J822K561L876N234O539Q314J1146J4442J6319J5760
58823A215448J4336J4465J6208J7316J6386J4350J2628J1406J0291R167P700N200
58811A364901J760j476l814n818q081j0266j1897j3099j3788j3356j1933j0960
58799A262173j1460j2601j2925j2348j1991j2632j4173j6093j7597j7805j6576
58788A105972j4847j3626j3107j3025j3172j3049j2009j0333r256r227r163q278
58776I66880p530q105r383r851r283q624q243p766p287p384q008q475q417p825
58762H50699o546m719l295k906k794k033j234j458j958r92J275K667K126J026
$$ y = [1029520, 1033065, 1038844, 1046507, 1054666, 1062547, 1070138, 1077730, 1085822, 1094674, 1103406, 1110285, 1114576, 1117479, 1120631, 1124233, 1127321, 1129435, 1131257, 1133818, 1137694, 1142928, 1149467, 1157781, 1168927, 1183369, 1199688, 1215448, 1229784, 1244249, 1260457, 1277773, 1294159, 1308509, 1321137, 1332543, 1342834, 1352001, 1359701, 1364901, 1366661, 1365185, 1361371, 1355553, 1347472, 1337206, 1325309, 1312210, 1298422, 1285066, 1273133, 1262173, 1250713, 1238112, 1225187, 1212839, 1200848, 1188216, 1174043, 1157950, 1140353, 1122548, 1105972, 1091125, 1077499, 1064392, 1051367, 1038195, 1025146, 1013137, 1002804, 993548, 984321, 975158, 966880, 959350, 951245, 941862, 932011, 922728, 914104, 905861, 898095, 890808, 883424, 875416, 866941, 858524, 850699, 844153, 839434, 836139, 833233, 830439, 828406, 827172, 825714, 823756, 822764, 824039, 826706, 828832, 829858]
58748H29858Q51J374J876K472L121K778Q53j485k554k031p60M75J181J044N21
58733H39574P10J780K379J481o0q57r18r89p95M44K321L604M137M953O557Q397
58717H72718R941J0909J0588Q517N969N167O479P730O860M030N96k503m562m801
58703I37638l512k527l246m884n805n822n962o477o543n577l709j249J073J757
58689H85155j2k570l078r48J494K183J672J605K222K648K660K875L567M396N096
58674I08965N596N657N115M437M288M738N474O485P838Q836Q341O175L594J949
58660I87488J291O65m76j587j898j491j139j096p23L39J258J056J31l41l95j326
58644I81756l448n233n468n059n647p304q801r498r753r879j0018j0714j2355
$$ y = [829858, 830709, 832083, 833959, 836431, 839552, 842330, 843183, 841698, 839144, 837113, 836353, 836828, 838009, 839053, 839574, 840284, 842064, 844443, 845924, 845864, 845007, 844089, 843100, 842305, 842749, 845070, 848674, 852811, 857764, 864321, 872718, 882659, 893568, 904156, 912673, 918642, 923809, 930288, 938018, 944878, 948908, 949504, 947001, 942439, 937638, 934126, 931599, 928353, 923469, 917664, 911842, 905880, 899403, 892860, 887283, 883574, 882325, 883398, 885155, 885143, 882573, 879495, 878547, 880041, 882224, 883896, 885501, 887723, 890371, 893031, 895906, 899473, 903869, 908965, 914561, 920218, 925333, 929770, 934058, 938796, 944270, 950755, 958593, 967429, 975770, 981945, 985539, 987488, 988779, 989444, 988968, 987381, 985483, 983992, 982853, 981757, 981034, 981373, 982631, 983687, 983818, 983477, 983082, 981756, 978308, 973075, 967607, 962548, 956901, 949597, 940796, 931298, 921545, 911666, 901648, 890934, 878579]
58631H78579j4155j4943j4885j5117j5635j4999j2574r776q276p891p166n453
58619G37709l575k617k714l022k679j697q09l86J71J540L352M724N548O453P494
58604G49492Q011P778P327O804N621L658J910J286J436J369O88l65j542k656l443
58589G87374l832m089m357m468m458m670m989m643l292j744j024j197j702k253
58575G40656k659k321q97P63J252K12j484l020m152m413l042m05J466Q87j276
58560G21567k601k241j779k499l148j603J949N060O079N651N004M414M023M581
58546G44457O124P073O109M096K811K552K513K761L954N503O002N402M891M653
58532H08901L797K690L057N005O255N399M030M233N816P516R303J1492J2941J2355
$$ y = [878579, 864424, 849481, 834596, 819479, 803844, 788845, 776271, 766495, 758219, 750328, 743162, 737709, 734134, 731517, 728803, 725781, 723102, 721405, 720596, 720210, 720381, 721921, 725273, 729997, 735545, 741998, 749492, 757503, 765281, 772608, 779412, 785033, 788691, 790601, 791887, 793323, 794692, 795380, 795015, 793473, 790817, 787374, 783542, 779453, 775096, 770628, 766170, 761500, 756511, 751868, 748576, 746832, 745808, 744611, 742909, 740656, 737997, 735676, 734779, 735542, 736794, 737006, 735522, 732502, 728350, 723937, 720895, 720490, 721956, 722843, 721567, 718966, 716725, 714946, 712447, 709299, 707696, 709645, 714705, 720784, 726435, 731439, 735853, 739876, 744457, 750581, 757654, 763763, 767859, 770670, 773222, 775735, 778496, 782450, 787953, 793955, 799357, 804248, 808901, 812698, 815388, 818445, 823450, 829705, 835104, 839134, 843367, 849183, 856699, 866002, 877494, 890435, 902790]
58518I02790J0683J0063J0839J1521J1459J1582J2315J2639J1829J0742J0563
58507A027025J1203J1605J1077R954R294J0126J2585J5823J8988K1921K4422K5401
58495A209424K3908K0727J7805J5956J4200J1627Q834O907N767M392K329J43j646
58482A340373l478o261j0087j3824j6160j6893j6935j7244j8048j9080j9923k0155
58470A162285j9686j9095j8999j8950j7713j5032j2248j0610r657q017n301k483
58458A004494p21n05j520k837l524l518l463l359k265K0J963K075R64L30N20N33
58442I89187J16J80R55J305M10r99j812j871j531p50N63J922K906L997N926Q269
58426A008773R553R026P710P285Q276R772J0754J1117J1258J1335J1456J2172
$$ y = [902790, 913473, 923536, 934375, 945896, 957355, 968937, 981252, 993891, 1005720, 1016462, 1027025, 1038228, 1049833, 1060910, 1070864, 1080158, 1090284, 1102869, 1118692, 1137680, 1159601, 1184023, 1209424, 1233332, 1254059, 1271864, 1287820, 1302020, 1313647, 1322481, 1329388, 1335155, 1339547, 1341876, 1342019, 1340373, 1336895, 1330634, 1320547, 1306723, 1290563, 1273670, 1256735, 1239491, 1221443, 1202363, 1182440, 1162285, 1142599, 1123504, 1104505, 1085555, 1067842, 1052810, 1040562, 1029952, 1020295, 1012278, 1006977, 1004494, 1003773, 1003268, 1001748, 998911, 995387, 991869, 988406, 985047, 982782, 982802, 984765, 986840, 987804, 988134, 988654, 989187, 989303, 989483, 990438, 991743, 992153, 991154, 989342, 987471, 985940, 985190, 985753, 987675, 990581, 994578, 1000504, 1008773, 1018326, 1027352, 1035062, 1042347, 1050623, 1060395, 1071149, 1082266, 1093524, 1104859, 1116315, 1128487]
58414A128487J3908J5911J6525J4882J1890R290Q081P885P389N332J599k422m999
58401A233758n644n162m400l678l262l205k671o31K322M193M147L601L947M557
58387A227872M141K844J687Q06k68j358k113l173n249p301p326m997k130l45N67
58372A203657J608L071M571N720O255O042N388M984N339O401P800R181J0334J1116
58358A291467J1282J0513Q974P649P416P704O937M534J635l77j083n65R00K187
58344A359173J860J97o61L46J685J891K051L876O559P873P566P413Q271R211R488
58329A426799R452R414R277R375J0099J0794J0551R952J0242J0945J0286Q201
58317A545387O810P295Q192P711O222N283N375N816O200O886Q252J0076J1591
$$ y = [1128487, 1142395, 1158306, 1174831, 1189713, 1201603, 1210893, 1218974, 1226859, 1234248, 1239580, 1241179, 1238757, 1233758, 1228114, 1222952, 1218552, 1214874, 1211612, 1208407, 1205736, 1205105, 1207427, 1211620, 1215767, 1219368, 1223315, 1227872, 1232013, 1234857, 1236544, 1237350, 1237082, 1235724, 1233611, 1230438, 1225189, 1217888, 1210562, 1205565, 1203435, 1203090, 1203657, 1205265, 1208336, 1212907, 1218627, 1224882, 1230924, 1236312, 1241296, 1246635, 1253036, 1260836, 1270017, 1280351, 1291467, 1302749, 1313262, 1322236, 1329885, 1337301, 1345005, 1351942, 1356476, 1358111, 1357734, 1356651, 1356086, 1356986, 1359173, 1361033, 1361230, 1360569, 1360915, 1362600, 1364491, 1366542, 1370418, 1376977, 1384850, 1392416, 1399829, 1408100, 1417311, 1426799, 1436251, 1445665, 1454942, 1464317, 1474416, 1485210, 1495761, 1505713, 1515955, 1526900, 1537186, 1545387, 1552197, 1559492, 1567684, 1575395, 1581617, 1586900, 1592275, 1598091, 1604291, 1611177, 1619429, 1629505, 1641096]
58304A641096J2058J1586J1263J2071J3861J5787J7235J7795J7077J5572J4916
58293A800317J6105J7941J8568J8022J7721J7997J7913J7379J7453J8358J8977
58282A996751J8765J8535J8867J9198J9180J9575K1070K3097K4603K5224K5315
58271B230180K5345K5629K6084K6239K5967K5917K6534K7022K6256K4384K2699
58260B512256K2148K2914K4768K6845K7700K6908K5986K6395K7430K7751K8135
58249B799236L0508L4572L7746L8576L8264L8500L9545M0825M1853M2288M2246
58238C224159M2634M4004M5487M6158M6807M8606N0746N1585N1609N2842N5550
58227C760187N8003N9551O1431O4225O6900O8812P0615P2717P4824P7258Q0835
$$ y = [1641096, 1653154, 1664740, 1676003, 1688074, 1701935, 1717722, 1734957, 1752752, 1769829, 1785401, 1800317, 1816422, 1834363, 1852931, 1870953, 1888674, 1906671, 1924584, 1941963, 1959416, 1977774, 1996751, 2015516, 2034051, 2052918, 2072116, 2091296, 2110871, 2131941, 2155038, 2179641, 2204865, 2230180, 2255525, 2281154, 2307238, 2333477, 2359444, 2385361, 2411895, 2438917, 2465173, 2489557, 2512256, 2534404, 2557318, 2582086, 2608931, 2636631, 2663539, 2689525, 2715920, 2743350, 2771101, 2799236, 2829744, 2864316, 2902062, 2940638, 2978902, 3017402, 3056947, 3097772, 3139625, 3181913, 3224159, 3266793, 3310797, 3356284, 3402442, 3449249, 3497855, 3548601, 3600186, 3651795, 3704637, 3760187, 3818190, 3877741, 3939172, 4003397, 4070297, 4139109, 4209724, 4282441, 4357265, 4434523, 4515358]
58216D515358Q5266Q9519R3702R8568J03401J06763J09162J12425J16537J19920
58206E550621J22837J27401J33809J39605J43592J47598J53477J60842J68740
58197F848522J77114J85706J93668K01101K09095K17850K26811K36575K48349
58188H744791K61549K74454K87147L01144L16439L31903L48234L67221L88367
58179A1621249M09773M31906M56777M83846N11001N39132N70966O05493O38809
58170A6268952O70775P05421P44187P84423Q25607Q71288R23461R80721J043472
58161B3818307J115144J196439J284122J377293J479042J590383J708904J835155
58153C5404789J973553K124930K285363K454668K638705K841559L064697L317168
$$ y = [4515358, 4600624, 4690143, 4783845, 4882413, 4985814, 5092577, 5201739, 5314164, 5430701, 5550621, 5673458, 5800859, 5934668, 6074273, 6217865, 6365463, 6518940, 6679782, 6848522, 7025636, 7211342, 7405010, 7606111, 7815206, 8033056, 8259867, 8496442, 8744791, 9006340, 9280794, 9567941, 9869085, 10185524, 10517427, 10865661, 11232882, 11621249, 12031022, 12462928, 12919705, 13403551, 13914552, 14453684, 15024650, 15630143, 16268952, 16939727, 17645148, 18389335, 19173758, 19999365, 20870653, 21794114, 22774835, 23818307, 24933451, 26129890, 27414012, 28791305, 30270347, 31860730, 33569634, 35404789, 37378342, 39503272, 41788635, 44243303, 46882008, 49723567, 52788264, 56105432]
58145E6105432L616318L971967M377618M823908N315674N872975O522862P292344
58137I7899098Q198803R241869J0411960J1707557J3132770J4678481J6323211
58130A81593749J8056379J9884197K1805056K3766600K5564672K6654136K6046596
58123C43371385K2616592J5837784O406640l889837j3057481j9815257k3887263
58116C27582563k5678053k5811238k4868457k3311322k1464293j9528371j7625610
58109A69295219j5834174j4192539j2704542j1363543j0167884r111793q177460
58102H7743284p345220o602618n939126n342231m804186m324425l900728l524867
58094D5959883l189647k892902k631946k401100k196915k018818j862512j719707
$$ y = [56105432, 59721750, 63693717, 68071335, 72895243, 78210917, 84083892, 90606754, 97899098, 106097901, 115339770, 125751730, 137459287, 150592057, 165270538, 181593749, 199650128, 219534325, 241339381, 265105981, 290670653, 317324789, 343371385, 365987977, 381825761, 388232401, 384342564, 371285083, 351469826, 327582563, 301904510, 276093272, 251224815, 227913493, 206449200, 186920829, 169295219, 153461045, 139268506, 126563964, 115200421, 105032537, 95920744, 87743284, 80398064, 73795446, 67856320, 62514089, 57709903, 53385478, 49484750, 45959883, 42770236, 39877334, 37245388, 34844288, 32647373, 30628555, 28766043, 27046336]
58086B7046336j586556j465726j358164j259666j167751j084957j012262r45608
58078A7165646q82104q24001p73134p26631o81521o39096o01415n67364n35222
58069A0935158n05558m78925m53767m28943m05452l83968l63437l43442l24928
58060G246738l07464k89264k70964k55812k44684k34509k23085k11897k02575
58051E006484j94032j85006j76282j68552j60832j52691j45378j39298j33007
58042C551406j25926j19298j13331j06361r8141r0928q5860q1129p5283o9500
58032B585649o5040o1161n7123n3697n1115m8156m4614m2130m1084l9538l6769
58021B045222l5004l5660l6633l5549l3372l2459l2984l3474l3203l2138l0113
$$ y = [27046336, 25459780, 23994054, 22635890, 21376224, 20208473, 19123516, 18111254, 17165646, 16283542, 15459541, 14686407, 13959776, 13278255, 12639159, 12037744, 11470380, 10935158, 10429600, 9950675, 9496908, 9067965, 8662513, 8278545, 7915108, 7571666, 7246738, 6939274, 6650010, 6379046, 6123234, 5878550, 5644041, 5420956, 5209059, 5006484, 4812452, 4627446, 4451164, 4282612, 4121780, 3969089, 3823711, 3684413, 3551406, 3425480, 3306182, 3192851, 3086490, 2988349, 2897421, 2811561, 2730432, 2655149, 2585649, 2520609, 2459448, 2402325, 2348628, 2297513, 2249357, 2204743, 2162613, 2121529, 2081991, 2045222, 2010218, 1974558, 1937925, 1902376, 1869004, 1836545, 1803561, 1770087, 1736884, 1704746, 1674633]
58010A674633k7818k7005k8044k8771k7327k4576k2359k1060k0344k0488k1311
57999A405530k1365j9865j8035j7154j6791j6278j6252j7126j7647j6687j5156
57988A213174j4541j4841j5247j5568j5661j4840j3206j2157j2278j2266j1286
57977A061283j0624j1391j2275j1598j0112r585r822r336q202p924q821r526r117
57964I32950q185p682p845q361q701q396p414o132m774l520l128m246n895o123
57950H42548m735l780m583n997o474o196n867n134l755k846l245l890l481k701
57936G79864k919l762l843l201l002l209k445j46K650M651N352M898M024L912
57922G82824M998O089N564L254M50j515k006j009N95J253J81j678k886l130k919
$$ y = [1674633, 1646815, 1619810, 1591766, 1562995, 1535668, 1511092, 1488733, 1467673, 1447329, 1426841, 1405530, 1384165, 1364300, 1346265, 1329111, 1312320, 1296042, 1279790, 1262664, 1245017, 1228330, 1213174, 1198633, 1183792, 1168545, 1152977, 1137316, 1122476, 1109270, 1097113, 1084835, 1072569, 1061283, 1050659, 1039268, 1026993, 1015395, 1005283, 995698, 985876, 976540, 968338, 960414, 951593, 942067, 932950, 924765, 917083, 909238, 900877, 892176, 883780, 876366, 870234, 865460, 861940, 858812, 854566, 848671, 842548, 837813, 834033, 829450, 823453, 816979, 810783, 804916, 799782, 796027, 793181, 789936, 786046, 782565, 779864, 776945, 773183, 769340, 766139, 763137, 759928, 757483, 757337, 759987, 764638, 769990, 774888, 778912, 782824, 787822, 793911, 799475, 802729, 803179, 801664, 799658, 798649, 799244, 800497, 800678, 799000, 796114, 792984, 790065]
57907G90065k352j279q8P04J243J816K042J513P40M36L18m01j646k638l031k962
57891G84480k321r73M83J179J044O29R7p47j562j568n21J111K967N038P078Q442
57875H04856Q734Q286P755P445P087O247M964L828L284L040K554J749P53p06k756
57860H67120m531m909m081l310l093k793k172j922k285k395j675p75n42r58j562
57845H30117k119k371k136j865k154k573k190j351j387k261k307r35K33j74j329
57830H05198j834j651j283n29N23P55k63j068k87J244J847J478J372K051L060
57815H10613L903M038K850P73n47l95r8p19j117O7J832K321J834K099L287M064
57799H34805M201M796N845N903M473K918K456K727K871K755K513J884N47j326
$$ y = [790065, 787713, 786434, 786346, 787050, 788293, 790109, 792151, 793664, 794404, 794840, 795158, 794757, 793111, 790473, 787442, 784480, 782159, 781186, 781669, 782848, 783892, 784521, 784618, 783871, 782309, 780741, 780220, 781331, 784298, 789336, 796414, 804856, 813590, 821876, 829631, 837076, 844163, 850410, 855374, 859202, 862486, 865526, 868080, 869829, 870582, 869876, 867120, 862589, 857680, 853599, 850289, 847196, 844403, 842231, 840309, 838024, 835629, 833954, 833179, 832637, 831679, 830117, 827998, 825627, 823491, 821626, 819472, 816899, 814709, 813358, 811971, 809710, 807403, 806468, 806701, 806527, 805198, 803364, 801713, 800430, 799901, 800424, 801179, 800916, 799848, 799561, 800805, 802652, 804130, 805502, 807553, 810613, 814516, 818554, 821404, 822177, 821630, 821235, 821137, 820418, 819301, 819368, 821200, 823521, 825355, 827454, 830741, 834805, 839006, 843802, 849647, 855550, 860023, 862941, 865397, 868124, 870995, 873750, 876263, 878147, 878694, 877368]
57785H77368l115m078l858l023k662l048l463l669m511o180p194o300m304k710
57771H19253j571k52P81P71M57J164K564L211K803K128J253k40j516j128O11J927
57755H32216K261K593K994K164R3j070j3J581J319o33j946j143R79K743L367L209
57739H50714K809K276J718J811L092M804N632N813P011R364J0421Q542N770N231
57725I25008O828P958P819Q218J0057J1659J1382R763Q109O542M582K507J065
57712A021497M83L94K74k18r51j459j826k872m722n992n517m130l271k635j001
57697I88054J149J955J013j04k66J30O22J416K376K985L513M621N859O174N820
57682A025317N827N812M629L125L477N351N583K788m22j188M0J319K271L344L884
$$ y = [877368, 874253, 870175, 866317, 863294, 860632, 857584, 854121, 850452, 845941, 839761, 832567, 826267, 821963, 819253, 817682, 817430, 818211, 818982, 819439, 820603, 823167, 826378, 829181, 831309, 832562, 832322, 830806, 829678, 830289, 832216, 834477, 837070, 840064, 842228, 842321, 841251, 841238, 842819, 844138, 843505, 841559, 840416, 841395, 844138, 847505, 850714, 853523, 855799, 857517, 859328, 862420, 867224, 872856, 878669, 885680, 895044, 905465, 914007, 919777, 925008, 931836, 939794, 947613, 955831, 965888, 977547, 988929, 998692, 1006801, 1013343, 1017925, 1020432, 1021497, 1021980, 1022374, 1022648, 1022430, 1021479, 1020020, 1018194, 1015322, 1010600, 1004608, 999091, 994961, 991690, 989055, 988054, 989203, 991158, 992171, 992067, 991801, 991931, 992553, 993969, 996345, 999330, 1002843, 1007464, 1013323, 1019497, 1025317, 1031144, 1036956, 1041585, 1044710, 1048187, 1053538, 1059121, 1061909, 1061487, 1060299, 1060339, 1061658, 1063929, 1067273, 1071157]
57667A071157L124J856J287J265J242J799L477N118N184M058L387L677L985L545
57653A114161K410R86N2O32K738M760N249M625M133L936L519L342M443O655Q529
57638A170170Q989Q166O718N290M502M582N039N231N064M758M343L993M287N539
57624A246671P234Q695R872J0983J2051J3215J4808J6604J7839J8646K0507K4400
57612A421525K9315L3631L7252M1293M6115N0575N2752N0475M1924K7064Q626
57601A840547r163k3002l1565l5107l4948l2983l0635k8179k5313k1949j8185
57590A549518j4234j0827q841p946o552l856r83Q29K057L656M922M339K168N36
57576A514786Q46K397L695M042L659L212L600N367P900R635R398P467N311M298
$$ y = [1071157, 1074281, 1076137, 1077424, 1078689, 1079931, 1081730, 1085207, 1090325, 1095509, 1099567, 1102954, 1106631, 1110616, 1114161, 1116571, 1117557, 1117609, 1118241, 1120979, 1125739, 1130988, 1135613, 1139746, 1143682, 1147201, 1150543, 1154986, 1161641, 1170170, 1179159, 1187325, 1194043, 1199333, 1203835, 1208417, 1213456, 1218687, 1223751, 1228509, 1232852, 1236845, 1241132, 1246671, 1253905, 1262600, 1272472, 1283455, 1295506, 1308721, 1323529, 1340133, 1357972, 1376618, 1397125, 1421525, 1450840, 1484471, 1521723, 1563016, 1609131, 1659706, 1712458, 1762933, 1804857, 1831921, 1840547, 1831384, 1808382, 1776817, 1741710, 1706762, 1673779, 1643144, 1614965, 1589652, 1567703, 1549518, 1535284, 1524457, 1515616, 1507670, 1501118, 1497262, 1496279, 1497108, 1499165, 1502821, 1507743, 1512082, 1514250, 1514786, 1515632, 1518029, 1521724, 1525766, 1529425, 1532637, 1536237, 1541604, 1549504, 1559139, 1568537, 1576004, 1581315, 1585613]
57562A585613M427M429L538K951M525P851J0030R083O336M440M127M326M512N203
57548A661391O444P493Q098Q777R605R797Q820P170N811N425O225P867R442J0131
57534A772496R907R336Q903Q888R459J0361J0835J0480R969J0261J1382J2445
57522A894722J2601J1641J0034Q767Q554Q881Q548P557P449R022J0833J1044R969
57509B019622R446J0218J1304J1664J1269J0618J0148J0123J0407J0566J0616
57498B136001J1076J1847J1996J1430J1581J3263J5060J5288J4463J4059J3828
57487B279892J2523J0569R671J0002J0182J0052J1040J3302J4787J4051J2187
57476B408258J1012J0987J1702J2907J4047J4133J3067J1997J1639J1382J0818
$$ y = [1585613, 1590040, 1594469, 1598007, 1600958, 1605483, 1613334, 1623364, 1632447, 1638783, 1643223, 1647350, 1651676, 1656188, 1661391, 1667835, 1675328, 1683426, 1692203, 1701808, 1711605, 1720425, 1727595, 1733406, 1738831, 1745056, 1752923, 1762365, 1772496, 1782403, 1791739, 1800642, 1809530, 1818989, 1829350, 1840185, 1850665, 1860634, 1870895, 1882277, 1894722, 1907323, 1918964, 1928998, 1937765, 1946319, 1955200, 1963748, 1971305, 1978754, 1987776, 1998609, 2009653, 2019622, 2029068, 2039286, 2050590, 2062254, 2073523, 2084141, 2094289, 2104412, 2114819, 2125385, 2136001, 2147077, 2158924, 2170920, 2182350, 2193931, 2207194, 2222254, 2237542, 2252005, 2266064, 2279892, 2292415, 2302984, 2312655, 2322657, 2332839, 2342891, 2353931, 2367233, 2382020, 2396071, 2408258, 2419270, 2430257, 2441959, 2454866, 2468913, 2483046, 2496113, 2508110, 2519749, 2531131, 2541949]
57465B541949J0785J1938J3448J4152J4104J3992J3933J3806J3908J4331J4457
57454B690803J3949J3501J3658J3672J2641J1126J0581J1547J3311J4980J6083
57443B835852J6498J6646J7344J8727J9765J9603J8823J8545J8786J8766J8364
57432C037719J8133J8058J7628J7081J7406J8795K0107K0295J9553J8639J7847
57421C241261J7189J6942J7321J7939J8151J7770J7041J6247J5685J5811J6729
57410C428086J7679J7719J6925J6286J6244J6196J5803J5875J7068J8421J8455
57399C614757J7516J7633J9822K2732K4388K4264K3064K1586K0600K0760K1669
57388C848791K1850K0701J9576J9775K0378J9715J8303J8326K0323K2319K2595
$$ y = [2541949, 2552734, 2564672, 2578120, 2592272, 2606376, 2620368, 2634301, 2648107, 2662015, 2676346, 2690803, 2704752, 2718253, 2731911, 2745583, 2758224, 2769350, 2779931, 2791478, 2804789, 2819769, 2835852, 2852350, 2868996, 2886340, 2905067, 2924832, 2944435, 2963258, 2981803, 3000589, 3019355, 3037719, 3055852, 3073910, 3091538, 3108619, 3126025, 3144820, 3164927, 3185222, 3204775, 3223414, 3241261, 3258450, 3275392, 3292713, 3310652, 3328803, 3346573, 3363614, 3379861, 3395546, 3411357, 3428086, 3445765, 3463484, 3480409, 3496695, 3512939, 3529135, 3544938, 3560813, 3577881, 3596302, 3614757, 3632273, 3649906, 3669728, 3692460, 3716848, 3741112, 3764176, 3785762, 3806362, 3827122, 3848791, 3870641, 3891342, 3910918, 3930693, 3951071, 3970786, 3989089, 4007415, 4027738, 4050057, 4072652]
57377D072652K1586K0444J9409J8491J8401J9620K1436K2858K3867K4936K5925
57366D309625K6233K5641K4364K2807K1661K1696K2770K3700K3726K3444K3588
57355D569255K3642K2691K1211K0804K2103K4030K5268K5622K5484K4787K3266
57344D828163K1529K0932K1972K3260K2952K1144K0014K1137K3474K4912K5040
57333E074529K5104K5561K5393K4192K3203K3341K3495K2174K0017J9157K0372
57322E326538K2295K3455K3853K4116K4135K3416K2216K1488K1575K1617K0639
57311E575343J9082J8595K0070K2336K3402K2804K1879K1674K1604K0685J9289
57300E806763J8716J9417K0612K1517K2053K2213K1680K0625K0126K0964K2298
$$ y = [4072652, 4094238, 4114682, 4134091, 4152582, 4170983, 4190603, 4212039, 4234897, 4258764, 4283700, 4309625, 4335858, 4361499, 4385863, 4408670, 4430331, 4452027, 4474797, 4498497, 4522223, 4545667, 4569255, 4592897, 4615588, 4636799, 4657603, 4679706, 4703736, 4729004, 4754626, 4780110, 4804897, 4828163, 4849692, 4870624, 4892596, 4915856, 4938808, 4959952, 4979966, 5001103, 5024577, 5049489, 5074529, 5099633, 5125194, 5150587, 5174779, 5197982, 5221323, 5244818, 5266992, 5287009, 5306166, 5326538, 5348833, 5372288, 5396141, 5420257, 5444392, 5467808, 5490024, 5511512, 5533087, 5554704, 5575343, 5594425, 5613020, 5633090, 5655426, 5678828, 5701632, 5723511, 5745185, 5766789, 5787474, 5806763, 5825479, 5844896, 5865508, 5887025, 5909078, 5931291, 5952971, 5973596, 5993722, 6014686, 6036984]
57289F036984K2435K1042J9775K0213K1817K2719K2162K1206K0962K1211K1175
57278F271701K0791K0469K0241J9984K0053K0813K1752K1949K1477K1469K2724
57267F503423K4756K6443K7171K7139K6883K6637K6090K4944K3640K3026K3124
57256F783276K3041K2490K2412K3308K3884K2703K0493J9303J9769K0713K1239
57245G022631K1608K1958K1799K1186K0893K0945K0340J8865J7883J8528K0038
57234G246674K0662J9461J6777J3762J1843J1801J2813J3216J2504J1735J1854
57223G403102J2646J3701J5088J6631J7635J7883J7854J7638J6841J5942J6219
57212G581180J7779J9284K0226K1724K4127K5748K5342K4028K3220K2296K0156
$$ y = [6036984, 6059419, 6080461, 6100236, 6120449, 6142266, 6164985, 6187147, 6208353, 6229315, 6250526, 6271701, 6292492, 6312961, 6333202, 6353186, 6373239, 6394052, 6415804, 6437753, 6459230, 6480699, 6503423, 6528179, 6554622, 6581793, 6608932, 6635815, 6662452, 6688542, 6713486, 6737126, 6760152, 6783276, 6806317, 6828807, 6851219, 6874527, 6898411, 6921114, 6941607, 6960910, 6980679, 7001392, 7022631, 7044239, 7066197, 7087996, 7109182, 7130075, 7151020, 7171360, 7190225, 7208108, 7226636, 7246674, 7267336, 7286797, 7303574, 7317336, 7329179, 7340980, 7353793, 7367009, 7379513, 7391248, 7403102, 7415748, 7429449, 7444537, 7461168, 7478803, 7496686, 7514540, 7532178, 7549019, 7564961, 7581180, 7598959, 7618243, 7638469, 7660193, 7684320, 7710068, 7735410, 7759438, 7782658, 7804954, 7825110]
57201G825110J7521J5592J3632J0273O288L736K931K549K203K638L626M094M431
57188G914624O205R428J2274J4034J6099J9310K2469K4539K6459K9486L3189L6432
57176H164548L9160M1863M4146M5176M5136M5121M5827M6994M7849M7590M5845
57165H659255M3164M0624L8729L7165L5830L5230L5329L4885L2866L0087K8473
57154I051637K8769K9684K9499K8054K6805K6987K7989K7947K6025K3505K2174
57143I349075K2086K1763K0220J7813J5135J2237R231O653M750L073J230o06k284
57130I480376m113o259q346j0257j2789j6904k2666k9368l6307m2988m8939n3954
57118I187486n8303o2322o5859o8530p0234p0963p0278o7534o2757n6855n0679
$$ y = [7825110, 7842631, 7858223, 7871855, 7882128, 7888416, 7892152, 7895083, 7897632, 7899835, 7902473, 7906099, 7910193, 7914624, 7920829, 7930257, 7942531, 7956565, 7972664, 7991974, 8014443, 8038982, 8065441, 8094927, 8128116, 8164548, 8203708, 8245571, 8289717, 8334893, 8380029, 8425150, 8470977, 8517971, 8565820, 8613410, 8659255, 8702419, 8743043, 8781772, 8818937, 8854767, 8889997, 8925326, 8960211, 8993077, 9023164, 9051637, 9080406, 9110090, 9139589, 9167643, 9194448, 9221435, 9249424, 9277371, 9303396, 9326901, 9349075, 9371161, 9392924, 9413144, 9430957, 9446092, 9458329, 9467560, 9474213, 9478963, 9482036, 9483266, 9482660, 9480376, 9476263, 9470004, 9461658, 9451401, 9438612, 9421708, 9399042, 9369674, 9333367, 9290379, 9241440, 9187486, 9129183, 9066861, 9001002, 8932472, 8862238, 8791275, 8720997, 8653463, 8590706, 8533851, 8483172]
57107H483172m4164l6765k8696k1303j5741j1526p053j895J947J656l648j2156
57095H303828k1256k9642l7583m5528n2869n8133o0329n9824n7699n4517n0432
57084G776016m6323m3730m3169m3412m3187m2780m3129m4083m4894m6130m9645
57073G285534n6398o5173p3860q1352q8092r5354j04337j15639j29300j45086
57063F330943j62360j79628j95225k08975k22552k37532k53814k70682k88421
57054D311754l07831l28937l51542l76433m04535m35283m67292n00398n35475
57045F04028C1735e77204o43190o73054o96430p11936p20358p24174p26172p30477
57035f202995p44765p79128q41559r34698j055616j196946j349478j505450j656395
$$ y = [8483172, 8439008, 8402243, 8373547, 8352244, 8336503, 8324977, 8317924, 8316029, 8317976, 8319632, 8315984, 8303828, 8282572, 8252930, 8215347, 8169819, 8116950, 8058817, 7998488, 7938664, 7880965, 7826448, 7776016, 7729693, 7685963, 7642794, 7599382, 7556195, 7513415, 7470286, 7426203, 7381309, 7335179, 7285534, 7229136, 7163963, 7090103, 7008751, 6920659, 6825305, 6720968, 6605329, 6476029, 6330943, 6168583, 5988955, 5793730, 5584755, 5362203, 5124671, 4870857, 4600175, 4311754, 4003923, 3674986, 3323444, 2947011, 2542476, 2107193, 1639901, 1139503, 604028, 31735, -577204, -1220394, -1893448, -2589878, -3301814, -4022172, -4746346, -5472518, -6202995, -6947760, -7726888, -8568447, -9503145, -10558761, -11755707, -13105185, -14610635, -16267030]
57026a6267030j784328j862721j883697j892431j979819k214379k564404k886306
57018c3335115k997063k770834k187744j317860k76247Q12688J833229K690084
57010c7548862L320541L701666L846081L789367L578570L266208K905415K541864
57002a0599150K206078J912258J663354J456359J284886i35354H1258R06134Q05138
56993A792530P11320O24573N45816M75213M11992L55349L04293K56810K10759
56984E688655J65907J24001Q6718N4745K8695R139m987j6592k8033l9390m9634
56973F019224n8388o5840p1918p6755q1137q5585q9660r3196r7614j04610j13654
56962E080867j22087j27926j31647j34816j37926j40308j41643j42562j43650
$$ y = [-16267030, -18051358, -19914079, -21797776, -23690207, -25670026, -27884405, -30448809, -33335115, -36332178, -39103012, -41290756, -42608616, -42884863, -42072175, -40238946, -37548862, -34228321, -30526655, -26680574, -22891207, -19312637, -16046429, -13141014, -10599150, -8393072, -6480814, -4817460, -3361101, -2076215, -935354, 81258, 987392, 1792530, 2503850, 3128423, 3674239, 4149452, 4561444, 4916793, 5221086, 5477896, 5688655, 5854562, 5978563, 6065281, 6120026, 6148721, 6157860, 6152873, 6136281, 6108248, 6068858, 6019224, 5960836, 5894996, 5823078, 5746323, 5665186, 5579601, 5489941, 5396745, 5299131, 5194521, 5080867, 4958780, 4830854, 4699207, 4564391, 4426465, 4286157, 4144514, 4001952, 3858302]
56953C858302j44521j44364j43142j41883j41812j43478j46511j49899j52457
56944B550235j53596j53657j53081j51251j46885j39851j31832j24673j18530
56935A276879j12184j04636r5779q6102p6606o8583o2566n7585n2164m5915l9625
56924D75134l4068k9471k5885k3305k1662k1159k2122k3839k4344k2561k0021
56913B06697j8963j9195j8540j6157j3418j1344r259o665m419k936r87K262N490
56900I2566P090P646Q813J0558J1395J0898J0049R080O741K350k714o327p700
56887A60445p697p596p920q097p118m766k081k61P29J850L525N278O832Q694J1279
56872A53096J4084J6170J7029J6654J5098J2327Q408L657j294n651q971j1535
$$ y = [3858302, 3713781, 3569417, 3426275, 3284392, 3142580, 2999102, 2852591, 2702692, 2550235, 2396639, 2242982, 2089901, 1938650, 1791765, 1651914, 1520082, 1395409, 1276879, 1164695, 1060059, 964280, 878178, 801572, 732989, 670423, 612838, 560674, 514759, 475134, 441066, 411595, 385710, 362405, 340743, 319584, 297462, 273623, 249279, 226718, 206697, 187734, 168539, 149999, 133842, 120424, 109080, 99821, 93156, 88737, 85801, 84814, 87076, 92566, 99656, 107302, 116115, 126673, 138068, 148966, 159015, 168095, 174836, 177186, 174472, 168145, 160445, 152748, 145152, 137232, 129135, 122017, 117251, 115170, 114909, 115638, 117488, 121013, 126291, 133123, 141817, 153096, 167180, 183350, 200379, 217033, 232131, 244458, 252866, 256523, 255229, 249578, 240607, 229072]
56860B29072j3888j5932j6888j6273j4551j2700j1458j1087j1404j1778j1506
56849H1607j0547r623r205q736p320n048k938j600o10N66J637K018J914K153L073
56834C7341M223N206O171P180P766P655P474Q104R558J1153J2558J3922J4957
56821A53268J4704J2605R326O130L802K308J278N51M45J480L609N939P783R694
56807B32922J2622J6125J8673K0004K1747K4921K8139K9602K9844L0762L2375
56796D97736L2296K8472K1076J1576J542p359j3573j6778j7778j6977j4031r456
56784D96746n063j886J047M870R089J3008J7672K4397L2092L8162M1944M5072
56772G17150M8159M9132M5610L7304K5227J0254o053k0559l0430l5527l7737l8243
$$ y = [229072, 215184, 199252, 182364, 166091, 151540, 138840, 127382, 116295, 104891, 93113, 81607, 71060, 61437, 52232, 43496, 36176, 31128, 28190, 26590, 25980, 26546, 28183, 30201, 32115, 34268, 37341, 41564, 46770, 52941, 60121, 67887, 75542, 83016, 91120, 100678, 111831, 124389, 138311, 153268, 167972, 180577, 189903, 196033, 199835, 202143, 203421, 203972, 204417, 205897, 209506, 215445, 223228, 232922, 245544, 261669, 280342, 300346, 322093, 347014, 375153, 404755, 434599, 465361, 497736, 530032, 558504, 579580, 591156, 592698, 585339, 571766, 554988, 537210, 520233, 506202, 496746, 491683, 489797, 490844, 495714, 504803, 517811, 535483, 559880, 591972, 630134, 672078, 717150, 765309, 814441, 860051, 897355, 922582, 932836, 926783, 906224, 875794, 840267, 802530, 764287]
56760G64287l6752l3054k7943k2434j7196j2811r588o765k866K641Q769J4358
56748F20646J9197K3275K5748K5496K2413J7354J0835K500p756j8583k7583l3144
56736F80398l5583l6225l5571l2987k8324k2962j8601j5558j3019j0526q163n565
56724D17314k011K303O177Q943J1016J2547J2563J0208N923O61n236j1526j7151
56711D51731k0961k2958k3908k4065k3161k1390j9342j7235j5099j3509j3020
56700B37083j2883j1507q531n605m615n766p615q454p451n100k949k417l448m527
56686A46215m194k346j85P74j99k351l906l777k670j972j852j494r20j196k551
56671A17376l580l056j469n3Q22J439J808J865J998K376K293J126m91j423j567
$$ y = [764287, 727535, 694481, 666538, 644104, 626908, 614097, 604509, 597744, 594878, 597519, 606288, 620646, 639843, 663118, 688866, 714362, 736775, 754129, 764964, 767464, 759708, 741125, 713542, 680398, 644815, 608590, 573019, 540032, 511708, 488746, 470145, 454587, 441568, 431042, 422879, 417314, 415303, 417606, 423783, 432726, 443742, 456289, 468852, 479060, 484983, 485644, 480408, 468882, 451731, 430770, 407812, 383904, 359839, 336678, 315288, 295946, 278711, 263612, 250103, 237083, 224200, 212693, 204162, 198557, 193942, 188176, 180561, 172107, 164656, 159556, 156607, 154190, 150742, 146215, 142021, 139675, 139490, 140264, 140065, 137714, 133808, 130031, 127361, 125389, 123537, 122043, 121123, 119927, 117376, 113796, 110740, 109271, 109218, 110040, 111479, 113287, 115152, 117150, 119526, 121819, 122945, 122454, 121031, 119464]
56656A19464j628j704j252l20L51N48R32J858K726K728J687M5j284j172O57K758
56640A26394L256K109J101J178J189k9j614j966j178o43q17q75n15n00j033j008
56624A25049L43K033K506J629O02K50K62J31m6N6L45N13O08R96J751K373K297
56607A41698J527N44l40j194j935j949p35J250K843L336L001K408J711P62m44
56592A52483j677k523k454j248M59J538J582J335J648K473L278L749L648K698
56578A66989J410J221K636L828K646j95j663m66J209Q81q90j677o51P45J099N38
56562A77660q9k96L1P24J214Q76k07j305j865j845j314l57N35O22k14j253j734
56545A71183j511p98K38J332J925J609O60j30k88j23k54p08q38k90K91P7o83r59
$$ y = [119464, 117836, 116132, 114880, 114560, 114911, 115459, 116391, 118249, 120975, 123703, 125390, 125435, 124151, 122979, 123636, 126394, 129650, 131759, 132860, 134038, 135227, 135198, 133584, 131618, 130440, 129797, 128980, 128105, 127590, 127090, 126057, 125049, 125392, 127425, 129931, 131560, 132162, 132412, 132674, 132805, 132759, 132815, 133160, 133673, 134281, 135277, 137028, 139401, 141698, 143225, 143769, 143429, 142235, 140300, 138351, 137616, 138866, 141709, 145045, 148046, 150454, 152165, 152927, 152483, 150806, 148283, 145829, 144581, 145040, 146578, 148160, 149495, 151143, 153616, 156894, 160643, 164291, 166989, 168399, 169620, 172256, 176084, 178730, 178535, 176872, 176406, 177615, 178496, 177606, 175929, 175278, 176023, 177122, 177660, 177571, 177275, 177306, 178030, 179244, 180120, 179913, 178608, 176743, 174898, 173584, 173227, 173762, 174384, 174170, 172917, 171183, 169672, 168874, 169112, 170444, 172369, 173978, 174638, 174508, 174220, 174097, 173843, 173135, 172297, 172007, 172298, 172375, 171692, 170733]
56527A70733m43J22K77M19O57L34m76k79J674L547L061R36K38K203M578M664K440
56510A94685mq65L75L055N547O218N202M487N552P609Q971R281R369R525R129
56495B78136P728N494K795K80r46k76J202J460k22k488l620l377k832k936l684
56480B76714m376m199k734l33J872K586J323j096l114l685l012k012j300r42r68
56465B54724j512k358k878k763k427k395k551k320j387PJ308K012J938J259K29
56450B40886j040k262k712j869l17O78O32K41J78K62K87P50K058L477L778K749
56434B47776J414Q02J021J427J270K65j122j986j864j206q61j294k377l487l685
56419B36093k332m4J525J351J34p48q23m87M8P82J221P20l67q10j46O66O08j9
$$ y = [170733, 170290, 170412, 170689, 171108, 171765, 172099, 171623, 171344, 173018, 176565, 179626, 180562, 180800, 183003, 187581, 192245, 194685, 194681, 193816, 194191, 197246, 202793, 209011, 214213, 218700, 224252, 231861, 240832, 250113, 259482, 269007, 278136, 285864, 291358, 294153, 294433, 293487, 293211, 294413, 295873, 295651, 293163, 289543, 286166, 283334, 280398, 276714, 272338, 268139, 265405, 265072, 266944, 269530, 270853, 269757, 266643, 262958, 259946, 257934, 256634, 255692, 254724, 253212, 250854, 247976, 245213, 242786, 240391, 237840, 235520, 234133, 234140, 235448, 237460, 239398, 240657, 240886, 239846, 237584, 234872, 233003, 232686, 233364, 233996, 234237, 234415, 234677, 234964, 235714, 237772, 241249, 245027, 247776, 249190, 249992, 251013, 252440, 253710, 253975, 252853, 250867, 249003, 247797, 246936, 245642, 243265, 239778, 236093, 233761, 233717, 235242, 236593, 236727, 235979, 235156, 234669, 234717, 235499, 236720, 237440, 237073, 236263, 236117, 236783, 237391, 237372]
56401B37372k27J24K41k52o73l89J41P0m28l75M41J032P87M86R43J602J611J557
56383B44063K545L848L378Q06j485j377M76J967K114J402O09L60J005J953J925
56368B63589P49n5N49J415J030k9q6Q50J143N3j482k505k929k605j120J143K925
56351B62635L498L242K642J694N12m40r19r56l84P69J605J236K98L00J407K197
56335B79336J870J292J378J722J515P19k98j314j807r89R64K536K486J092o96
56320B89806k353l424l102j250Q93K074K576L415M593N173M820M134L583L070
56306C14008K577K424K648K885K959L052L121K763J949J447J959K983L007J153
56292C48935j525k752j294J672L683L408J666L02N04K161M133M943L689Q52j893
$$ y = [237372, 237145, 237269, 237510, 237258, 236585, 236196, 236337, 236407, 235979, 235604, 236045, 237077, 237864, 238350, 239293, 240895, 242506, 244063, 246608, 250456, 253834, 254640, 253155, 251778, 252254, 254221, 256335, 257737, 258346, 258706, 259711, 261664, 263589, 264338, 264283, 264832, 266247, 267277, 267248, 267162, 268012, 269155, 269208, 267726, 265221, 262292, 259687, 258567, 259710, 262635, 266133, 269375, 272017, 273711, 274223, 273783, 272864, 271908, 271524, 272293, 273898, 275134, 275432, 275732, 277139, 279336, 281206, 282498, 283876, 285598, 287113, 287832, 287534, 286220, 284413, 283424, 284388, 286924, 289410, 290502, 289806, 287453, 284029, 280927, 279677, 280570, 282644, 285220, 288635, 293228, 298401, 303221, 307355, 310938, 314008, 316585, 319009, 321657, 324542, 327501, 330553, 333674, 336437, 338386, 339833, 341792, 344775, 347782, 348935, 347410, 344658, 343364, 345036, 348719, 352127, 353793, 354095, 354599, 356760, 360893, 365836, 369525, 370377, 368484]
56277C68484k930j852M94K815M238M707M759M922N274N590N696N523N030M272
56263D17022L339K135N54r15j336m63Q16J662K269K966L093J872M4o52M33K287
56247D35126L745M622N269N943O786P636P789O737N185M543N339O797P818P652
56233E20987N945L257J230J164K430L474M059N064O336O681O119O240P694R166
56219E89846R586R588R856R695Q568P678Q534J0887J3256J4747J5398J5627J6165
56206G39431J7677J9629K0639K0690K1645K4481K7535K8904K9177L0120L1869
56195A011797L3533L5567L9210M3899M7549M9596N1778N5511O0127O4304O7795
56184A560666P1120P4427P7315P9024P8570P5446P0413O4881N9248N2450M3374
$$ y = [368484, 365554, 363702, 364196, 367011, 371249, 375956, 380715, 385637, 390911, 396501, 402197, 407720, 412750, 417022, 420361, 422496, 423050, 422135, 420799, 420336, 421152, 422814, 425083, 428049, 431142, 433014, 433058, 432406, 432839, 435126, 438871, 443493, 448762, 454705, 461491, 469127, 476916, 483653, 488838, 493381, 498720, 505517, 513335, 520987, 526932, 530189, 531419, 532583, 535013, 538487, 542546, 547610, 553946, 560627, 566746, 572986, 580680, 589846, 599432, 609020, 618876, 628571, 637139, 644817, 653351, 664238, 677494, 692241, 707639, 723266, 739431, 757108, 776737, 797376, 818066, 839711, 864192, 891727, 920631, 949808, 979928, 1011797, 1045330, 1080897, 1120107, 1164006, 1211555, 1261151, 1312929, 1368440, 1428567, 1492871, 1560666, 1631786, 1706213, 1783528, 1862552, 1941122, 2016568, 2086981, 2151862, 2211110, 2263560, 2306934]
56173B306934L2130J9854P720l704j4449k4581l3564m0637m6052n1205n6844o1786
56161B033816o4356o4505o3488o1891n9371n6255n3869n2833n2019m9967m6659
56150A408603m3355m0981l9307l7553l5383l2964l0233k6697k2385j8534j6408
56139A064803j5506j4025j1310q662p370p060o711o088n418m630l908l859m175
56126I66081l286p15J481J336J05O81L372N514N370M231M097N056N995O615P580
56111A013513R256J1196J2743J3675J4290J5017J5947J6876J7861J9159K0483
56100A180016K1160K1480K2883K6019K9528L1817L3210L5145L8078M1707M6493
56089A527536N3105O0630O7271P3142Q0655R1514J04415J16294J24785J29141
$$ y = [2306934, 2339064, 2358918, 2366638, 2362934, 2348485, 2323904, 2290340, 2249703, 2203651, 2152446, 2095602, 2033816, 1969460, 1904955, 1841467, 1779576, 1720205, 1663950, 1610081, 1557248, 1505229, 1455262, 1408603, 1365248, 1324267, 1284960, 1247407, 1212024, 1179060, 1148827, 1122130, 1099745, 1081211, 1064803, 1049297, 1035272, 1023962, 1015300, 1007930, 1000870, 994159, 988071, 982653, 978023, 974115, 970256, 966081, 962795, 962080, 963561, 964897, 965002, 965683, 969055, 974569, 979939, 984170, 988267, 993323, 999318, 1005933, 1013513, 1022769, 1033965, 1046708, 1060383, 1074673, 1089690, 1105637, 1122513, 1140374, 1159533, 1180016, 1201176, 1222656, 1245539, 1271558, 1301086, 1332903, 1366113, 1401258, 1439336, 1481043, 1527536, 1580641, 1641271, 1708542, 1781684, 1862339, 1953853, 2058268, 2174562, 2299347, 2428488]
56079B428488J29537J26177J18774J06896R1220P4254N9257M8508M2758M1364
56069C267233M2029M1261L6515K8016J7788P584j524q718j4315k0561k9867m2455
56057C322986n6881p2084q7160r9759j07024j08365j05455r9448r0065p7776o4908
56046B354061n3712m4602l6865l0048k4144j9424j6367j4901j3824j1965r678
56035B078531p939o399l926q60J231K074L185N401P735R221J0314J1755J3334
56022B123657J4484J5137J5614J6457J8275K0814K2574K2766K3107K5828L0195
56011B348908L3189L3608L3232L3576L3991L3798L4023L5677L8031L9844M1064
56000B738941M2301M3701M5144M6540M7498M7689M7845M9167N1549N3687N5063
$$ y = [2428488, 2558025, 2684202, 2802976, 2909872, 3001092, 3075346, 3134603, 3183111, 3225869, 3267233, 3309262, 3350523, 3387038, 3415054, 3432842, 3440426, 3438902, 3430184, 3415869, 3395308, 3365441, 3322986, 3266105, 3194021, 3106861, 3007102, 2900078, 2791713, 2686258, 2586810, 2496745, 2418969, 2354061, 2300349, 2255747, 2218882, 2188834, 2164690, 2145266, 2128899, 2113998, 2100174, 2088209, 2078531, 2070592, 2064193, 2060267, 2059407, 2060638, 2062712, 2065897, 2071298, 2079033, 2088254, 2098568, 2110323, 2123657, 2138141, 2153278, 2168892, 2185349, 2203624, 2224438, 2247012, 2269778, 2292885, 2318713, 2348908, 2382097, 2415705, 2448937, 2482513, 2516504, 2550302, 2584325, 2620002, 2658033, 2697877, 2738941, 2781242, 2824943, 2870087, 2916627, 2964125, 3011814, 3059659, 3108826, 3160375, 3214062, 3269125]
55989C269125N6412N8149N9828O1216O2342O2663O1970O1949O4638O9328P3240
55978C960860P5435P7622Q0844Q4103Q6923R0576R5635J00669J04561J08056J11892
55967D977176J15336J17684J19542J21766J24677J28775J34533J41170J47554
55958F128213J54254J62505J71339J78612J84827J92725K02864K13137K23195
55949G811671K35446K50539K65767K79463K93369L08900L24708L39930L56427
55940A0466220L75545L95903M16566M39321M65416M92990N20092N47713N77659
55931A4697425O09961O44047O79972P17066P54316P93320Q37655Q88258R43118
55922B1565138J002394J069415J145325J227681J316063J413841J522295J638352
$$ y = [3269125, 3325537, 3383686, 3443514, 3504730, 3567072, 3629735, 3691705, 3753654, 3818292, 3887620, 3960860, 4036295, 4113917, 4194761, 4278864, 4365787, 4456363, 4551998, 4652667, 4757228, 4865284, 4977176, 5092512, 5210196, 5329738, 5451504, 5576181, 5704956, 5839489, 5980659, 6128213, 6282467, 6444972, 6616311, 6794923, 6979750, 7172475, 7375339, 7588476, 7811671, 8047117, 8297656, 8563423, 8842886, 9136255, 9445155, 9769863, 10109793, 10466220, 10841765, 11237668, 11654234, 12093555, 12558971, 13051961, 13572053, 14119766, 14697425, 15307386, 15951433, 16631405, 17348471, 18102787, 18896107, 19733762, 20622020, 21565138, 22567532, 23636947, 24782272, 26009953, 27326016, 28739857, 30262152, 31900504]
55914C1900504J760486J891267K031732K179462K335370K506362K698250K912555
55906E0215988L153619L431890L756927M134934M576860N099774N715094O423945
55898H6509031P228465Q137472R156489J0285630J1535594J2933705J4505857
55891A60292243J6262746J8203282K0302823K2476266K4552792K6251251K7088132
55884C15429535K6281153K2911562J6476266P475347k562091j1767747j8803956
55877C55440069k3252961k5404379k5828187k5092011k3661307k1873959j9947049
55870A90380216j8016337j6173647j4473201j2931566j1546960j0317720r238136
55863I7682649q289790p449583o701246o033179n433099m892190m408526l980287
$$ y = [31900504, 33660990, 35552257, 37583989, 39763451, 42098821, 44605183, 47303433, 50215988, 53369607, 56801497, 60558424, 64693358, 69270218, 74369992, 80085086, 86509031, 93737496, 101874968, 111031457, 121317087, 132852681, 145786386, 160292243, 176554989, 194758271, 215061094, 237537360, 262090152, 288341403, 315429535, 341710688, 364622250, 381098516, 388573863, 386011772, 374244025, 355440069, 332187108, 306782729, 280954542, 255862531, 232201224, 210327265, 190380216, 172363879, 156190232, 141717031, 128785465, 117238505, 106920785, 97682649, 89392859, 81943276, 75242030, 69208851, 63775752, 58883562, 54475036, 50494749]
55855E0494749l600309l261225k960182k694544k458687k248644k064174j902864
55847B9304120j757761j624158j502896j393950j292785j196751j109168j032823
55839A8393828r64701r01117q43036p91958p45227o99874o57145o18974n83682
55830A1588114n49225n17197m89586m64642m39750m15509l93313l71817l49437
55821G597638l27783l08969k91979k75098k59664k47935k39234k31429k24391
55812E191156k18840k13459k06239j97371j88208j78818j68840j59080j50046
55803C510255j40580j30210j20977j14655j10023j05083j00012r5550r0599q4104
55793B418462p7424p2123o7185o1191n5532n2422n1238m9773m7809m6461m5227
$$ y = [50494749, 46894440, 43633215, 40673033, 37978489, 35519802, 33271158, 31206984, 29304120, 27546359, 25922201, 24419305, 23025355, 21732570, 20535819, 19426651, 18393828, 17429127, 16528010, 15684974, 14893016, 14147789, 13447915, 12790770, 12171796, 11588114, 11038889, 10521692, 10032106, 9567464, 9127714, 8712205, 8318892, 7947075, 7597638, 7269855, 6960886, 6668907, 6393809, 6134145, 5886210, 5646976, 5415547, 5191156, 4972316, 4758857, 4552618, 4355247, 4167039, 3988221, 3819381, 3660301, 3510255, 3369675, 3239465, 3118488, 3003833, 2893810, 2788727, 2688715, 2593165, 2502566, 2418462, 2341038, 2268915, 2201730, 2140539, 2085007, 2032585, 1981347, 1931574, 1883765, 1837304, 1792077]
55782A792077m2838m0118l8886l8730l7850l6443l6124l6455l5267l2481l0502
55771A386383l0327l0093k8188k5404k3232k2020k1576k1766k1814k0711j9001
55760A122251j8477j9441j9953j8727j7163j7124j7968j7434j5039j2846j2612
55749I35467j3440j3119j1184r489r601j0673j0673r081p224o152n495m587l658
55736H21091l341l779m598n112m492k610p82n13j297r19J528M138M331J606k494
55721H02757o148q319q873q378p453o204m698l666l525l098j054J355R17l626
55707G39987j0051j5490j9003k0657k0304j8473j6773j5939j4807j2384r571p740
55695E58795p028p120q128r461r538q026o798p160p686o652m940m458m889m295
$$ y = [1792077, 1749239, 1709121, 1670235, 1631505, 1593655, 1557212, 1521088, 1484633, 1449366, 1416885, 1386383, 1356056, 1325963, 1297775, 1272371, 1249139, 1227119, 1205543, 1183777, 1161963, 1141252, 1122251, 1103774, 1084333, 1064380, 1045653, 1028490, 1011366, 993398, 975964, 960925, 948079, 935467, 922027, 908908, 897724, 888235, 878634, 867961, 857288, 848207, 840983, 834831, 829336, 824749, 821091, 817750, 813971, 809373, 804261, 799769, 797159, 796377, 795864, 794567, 793648, 795176, 799314, 803645, 805251, 802757, 796609, 788290, 779417, 771039, 763586, 757382, 752684, 749018, 745493, 742395, 741341, 742696, 743613, 739987, 729936, 714446, 695443, 674786, 654482, 636009, 619236, 603297, 588490, 576106, 566535, 558795, 551767, 544647, 536519, 527058, 517520, 509494, 502696, 495536, 487850, 481198, 476258, 471800, 466911, 462616]
55681D62616k235j27R65J081K83j411l320m732n917p305q349q374p803p136n741
55666D02495l245j282j843m430o597p051o492n707m618l226k037j258n53M31J928
55651C56515L864N145M086N19l492o067p453q347p919n421k458j294j724j891
55637C24063j553k128l863n395o109o722p444p546o884n972m558k035P57K105
55623B66716J942J771K060J761P60N21J679K958L258L071L036K758J889R86M91
55608B95657O2m26n13k24l21r61j379j352j577k202k376j816j378j494j456q44
55592B77400l02j28M03J496K054J385N13O38J382J638J200M67o59k409m202n120
55576B75756n055m697m725n401o439o939o171m731m135m777n288m531l249k834
$$ y = [462616, 460381, 460254, 461219, 462300, 462583, 461172, 457852, 453120, 447203, 439898, 431549, 423175, 415372, 408236, 402495, 399250, 397968, 396125, 391695, 385098, 378047, 371555, 365848, 361230, 358004, 355967, 354709, 354156, 354587, 356515, 360379, 365524, 369610, 370129, 366637, 360570, 353117, 344770, 336851, 331430, 328972, 327678, 325954, 324063, 322510, 320382, 316519, 311124, 305015, 298293, 290849, 283303, 276419, 270447, 265889, 263854, 264611, 266716, 268658, 270429, 272489, 274250, 275010, 275531, 277210, 280168, 283426, 286497, 289533, 292291, 294180, 295166, 295657, 295719, 295293, 294780, 294556, 294235, 293274, 291895, 290543, 288966, 286764, 284388, 282572, 281194, 279700, 278244, 277400, 277098, 276970, 277373, 278869, 280923, 282308, 282821, 283459, 284841, 286479, 287679, 288146, 287487, 285078, 280876, 275756, 270701, 266004, 261279, 255878, 249439, 242500, 236329, 231598, 227463, 222686, 217398, 212867, 209618, 206784]
55562B06784l340l728l529l140k828k414j870j376p98J09R35P33p10k129j976
55547A80723l46P87j96k553m084l918l199k838k128n00Q53O41k33J35J664K492
55531A67300J889J043Q93J086J315J930K601K146L87j178j196K37K479N049O916
55516A92897O722M699K958K994L979M347L776K750J439O0q05j248k325m312n803
55501B12128n734n126n493o492o655n733m817m485m286l794l044k076j037n16
55487A52840q85j582j849j845k128k517k415j980j887k055j712o61M06R42J148
55472A33820J400J790K304K898L184K595J059p06j755j635o51M34J046J182J088
55457A48053P58J81j46K67P68j11k723n361n965m334k153j121j562k597l197l112
$$ y = [206784, 203444, 199716, 196187, 193047, 190219, 187805, 185935, 184559, 183761, 183870, 184805, 185538, 184828, 182699, 180723, 180377, 181164, 180968, 178415, 174331, 170413, 167214, 164376, 162248, 161748, 162601, 163242, 163009, 163144, 164808, 167300, 169189, 170232, 171125, 172211, 173526, 175456, 178057, 180203, 180590, 179412, 178216, 178453, 180932, 185981, 192897, 199619, 204318, 207276, 210270, 214249, 218596, 222372, 225122, 226561, 226621, 225816, 224568, 222243, 217931, 212128, 206394, 201268, 195775, 189283, 182628, 176895, 172078, 167593, 163307, 159513, 156469, 154393, 153356, 152840, 151955, 150373, 148524, 146679, 144551, 142034, 139619, 137639, 135752, 133697, 131985, 131324, 131730, 132672, 133820, 135220, 137010, 139314, 142212, 145396, 147991, 149050, 148344, 146589, 144954, 144303, 144737, 145783, 146965, 148053, 148811, 148992, 148846, 149113, 149881, 149770, 147047, 141686, 135721, 131387, 129234, 128113, 126551, 123954, 120757, 117645]
55441A17645k866k831k666k096j796k558l728l714k218p64n58j075j354j482j889
55426H6050k174j730q56k54P8N38R07N90l38j010o94N57J847J905K08k080k974
55409H0570j860j33O82O10N49Q93J421J774J387j36j972k404j082J20m53j909
55393G8057k307j538j165j767k136j280J61R43P54K52N4J79K99L58O87J358J696
55376G4605J062l1m68j52o0n38p86l44J34K26M91J273K029K481L092L549K415
55359H8978n57l241l663k393j041J16J280J439k22k224k442j175m19n83k35J070
55343G4688K066J925J183K97q79j925j871o77O29J397J650J158j51j124n38Q13
55327G8641J003q2p72n61p33j727k285j940j919k556k074M49K920K887R71k38
$$ y = [117645, 114779, 111948, 109282, 107186, 105390, 102832, 99104, 95390, 93172, 92408, 91850, 90775, 89421, 87939, 86050, 83876, 82146, 81290, 81036, 81114, 81652, 82559, 83149, 82811, 81801, 81107, 81664, 83511, 85416, 85624, 83544, 80570, 78710, 78577, 79259, 79869, 80418, 81311, 82732, 84506, 85893, 85757, 83785, 81381, 80299, 80419, 79966, 78057, 75750, 74212, 73047, 71280, 69144, 67864, 68025, 68968, 69722, 69974, 70028, 70207, 70506, 70864, 71551, 72909, 74605, 75667, 75636, 75168, 75016, 74956, 74418, 73632, 73288, 73422, 73648, 74139, 75412, 77441, 79922, 83014, 86563, 88978, 88421, 85180, 81517, 79124, 78083, 78199, 79479, 80918, 80696, 78472, 76030, 74855, 74436, 73853, 73618, 74688, 76754, 78679, 79862, 80159, 79280, 77355, 75484, 74807, 75436, 76833, 78483, 79641, 79490, 78366, 77828, 78641, 79644, 79562, 78790, 78229, 77496, 75769, 73484, 71544, 69625, 67069, 64995, 65444, 68364, 71251, 72222, 71984]
55311G1984K80J286J430N00j157k979l998l442j631K67J395J727J759J992K425
55296G1838K433J595O01N95J505J952J138j41p93q39r28j288j705j986j937j394
55280G0646n36K74J004J564J249k74j605q91J288K220Q70o21l26N09j93j663j381
55263G2134Q58K414J506n06j257k65J129J769J598R81O0r99j662j402m36M69J101
55246G7492J982K977K577j21l300m039k029Q7M19k8K74Q45N56K4P20K491L690
55229H4617L356J871p7j790k312j380m02r48k455k938j908r16q98p32P06K465
55213G6259K717J256l07m96O57J955K082N57j629k485r09J778K900J364j117k171
55197H2411j536q68j165j643j304l65N20J384K307K496J287m39j274j268j472
$$ y = [71984, 72264, 73550, 74980, 75480, 74323, 71344, 67346, 63904, 62273, 62540, 63935, 65662, 67421, 69413, 71838, 74271, 75866, 76467, 77062, 78567, 80519, 81657, 81516, 80723, 79884, 78956, 77668, 75963, 73977, 72040, 70646, 70110, 70384, 71388, 72952, 74201, 73927, 72322, 71431, 72719, 74939, 75809, 75188, 74862, 75371, 75178, 73515, 72134, 72992, 75406, 76912, 76406, 75149, 74884, 76013, 77782, 79380, 80361, 80421, 79422, 77760, 76358, 75922, 76391, 77492, 79474, 82451, 85028, 84907, 81607, 77568, 75539, 75626, 76045, 76017, 76291, 77136, 77692, 77716, 78436, 80927, 84617, 87973, 89844, 89767, 87977, 85665, 84285, 83883, 82935, 80480, 77542, 75634, 74718, 73820, 73088, 73794, 76259, 78976, 80232, 79925, 79429, 80086, 82041, 84123, 84680, 83051, 80566, 79657, 81435, 84335, 85699, 84582, 82411, 80875, 80007, 78842, 77199, 75895, 75530, 76050, 77434, 79741, 82237, 83524, 83085, 81811, 80543, 79071]
55182G9071j775r59R27K026J169n14j328j099o83m82m21n34o81m45J00J76n31
55165G4017j286j426j106m52Q55K444K987K032J008J300K320K680K246J882J915
55150I1416K039J989J267p65l409m425k744k91N20J5J00Q80Q03l31j004o56m58
55133H4946j085j703j670j470j435j139o13o21j169j105J77J757K482K158J133
55118H0643j56r77p93k47l89q28j21J730K896K304R42n7r39j994k380j472j01
55101G8061P79J396J994J690Qj611j435J09J221J266J028Q74M20k26l90p7R0K02
55083H5399J059K580L445K826J474N67J58o37k288m184n166m542k646m69J237
55068G8813K297K646K187J376J171J660J529j10j895j623O19K252J508l84j109
$$ y = [79071, 77296, 76337, 77264, 79290, 80459, 79945, 78617, 77518, 76835, 76353, 75932, 75398, 74717, 74272, 74372, 74548, 74017, 72731, 71305, 70199, 69747, 70602, 73046, 76033, 78065, 79073, 80373, 82693, 85373, 87619, 89501, 91416, 93455, 95444, 96711, 95946, 92537, 88112, 85368, 85077, 85597, 85612, 85712, 86592, 87395, 87064, 86060, 85404, 84946, 83861, 82158, 80488, 79018, 77583, 76444, 75831, 75210, 74041, 72936, 73113, 74870, 77352, 79510, 80643, 80487, 79510, 78717, 78470, 78081, 77253, 77132, 78862, 81758, 84062, 85004, 84947, 84008, 82014, 79634, 78162, 78061, 78840, 80236, 82230, 83920, 83928, 82317, 80882, 80991, 82212, 83478, 84506, 85380, 85800, 85574, 85184, 85107, 85197, 85399, 86458, 89038, 92483, 95309, 96783, 97350, 97508, 96871, 94583, 90399, 85233, 80691, 78045, 77576, 78813, 81110, 83756, 85943, 87319, 88490, 90150, 91679, 91569, 89674, 88051, 88670, 90922, 92430, 92046, 90937]
55053I0937k93N44M22j3J97J003J703J879J531Q03%m22l83m61j118j780j325M23
55035I3647K364L440L684L530K892J602K79k66l23q81j932k240j216j0kr18j301
55018A02349m85Q05J618J670R78n14k429l605l023j117L77K37r31j528q97J64
55002I3669P85J116J640K061J648M40o40q06k1J267K415K650J573k71j728j992
54986A03806j058N02J686J457j38j463r38R12J978J190m93j702k042j545j41J589
54970A03600K207R35j187k350j730O3J600J477m96k535k494o24N27l64j625j449
54954I5555q32j724l456l376p11K461M180M560M428L826K681J590J014O36K33
54939A11065L61J356K333J995K03j746k300j010J026K001J100o49j555j133k72
$$ y = [90937, 90644, 91188, 91610, 91597, 91794, 92797, 94500, 96379, 97910, 98713, 98713, 98291, 97908, 97447, 96329, 94549, 93224, 93647, 96011, 99451, 103135, 106665, 109557, 111159, 111438, 111172, 110849, 109968, 108036, 105796, 104580, 104570, 104568, 103650, 102349, 101864, 102669, 104287, 105957, 106935, 106421, 103992, 100387, 97364, 96247, 96624, 96861, 95930, 94402, 93505, 93669, 94454, 95570, 97210, 99271, 100919, 101359, 100719, 99913, 99892, 101159, 103574, 106224, 107797, 107526, 105798, 103806, 102748, 103250, 104936, 106393, 106255, 104792, 103854, 104766, 106744, 107934, 107441, 105739, 103697, 102152, 102011, 103600, 105807, 106742, 105555, 103205, 101475, 101538, 103138, 104615, 104119, 101584, 99090, 98466, 98993, 98629, 97004, 95555, 94723, 92999, 89543, 86167, 85456, 87917, 92097, 96657, 101085, 104911, 107592, 109182, 110196, 110832, 111065, 111426, 112782, 115115, 117110, 117313, 115567, 113267, 112257, 113283, 115284, 116384, 115735, 114180, 113047, 112775]
54924A12775K34M47O12O27M60L81N07O98R81J531K158K442K298J793O05j295k640
54907A24614k010j91K53j478k858j340J937L439J714j047j950n64J305K003J485
54892A25312P96O13N38j26j085j185K3J473J890J343Q30O89L68m83j456j899j408
54875A26233Q6J958K868J933M6q63j06J033J183O26M95J007J419J352J227J332
54859A41829J324R85Q50J637L336N244O681P345P250O727O347O287N811L988J049
54844B06690j594k981l630m412n151n171m664m416m371l758k712k413l066l136
54830A55215j538M48P32p32j988j730n93K07L36J45m4M5O14J486K219K735L312
54813A60869L875M044L972M248M804M871M537N175P298Q976P845M256Q77q42k225
$$ y = [112775, 113009, 113456, 114068, 114695, 115155, 115536, 116043, 116741, 117722, 119253, 121411, 123853, 126151, 127944, 128549, 127254, 124614, 122604, 122413, 122666, 121188, 118330, 116990, 118927, 122366, 124080, 123033, 121083, 120519, 121824, 123827, 125312, 126108, 126721, 127259, 127133, 126048, 124863, 124886, 126359, 128249, 129592, 130422, 131111, 131479, 130996, 129540, 127641, 126233, 126319, 128277, 131145, 133078, 133124, 132261, 132155, 133188, 134371, 134997, 135492, 136499, 137918, 139270, 140497, 141829, 143153, 144138, 144988, 146625, 149961, 155205, 161886, 169231, 176481, 183208, 189555, 195842, 201653, 205641, 206690, 205096, 202115, 198485, 194073, 188922, 183751, 179087, 174671, 170300, 166542, 163830, 161417, 158351, 155215, 153677, 154125, 154857, 154125, 152137, 150407, 149814, 150021, 150357, 150502, 150458, 150503, 151117, 152603, 154822, 157557, 160869, 164744, 168788, 172760, 177008, 181812, 186683, 191220, 196395, 203693, 212669, 220514, 224770, 225647, 224805, 222580]
54798B22580m837p808q878p478n464m875n814o736o273m549l021l078m571n730
54784A43468m938k542n22k95j280j878j401o81q81k108l255l175j981j002j227
54769A16302k009j880n41P11P97K00qL48Q14J386K180K483J540J29OJ425K558
54752A26441J898J63q34k93J287K949L609K506K52j376j635j863l058l600j324
54737A25122K698M782L265L79j121j179j183j352j071o75r51j424q26P41J707
54722A28912J319O61Q96J588J539O71J50P85J978K492J966J272J378K105K445
54707A50157J999J563K056L335M491M932M733M273M027M542N913P327P649O614
54693B13611M946L340J769Nj718k903l501m023m877n787o053n467m732m712n392
$$ y = [222580, 217743, 209935, 201057, 193579, 188115, 183240, 177426, 170690, 164417, 159868, 156847, 153769, 149198, 143468, 138530, 135988, 135466, 135171, 133891, 132013, 130612, 129931, 129050, 126942, 123687, 120512, 118531, 117529, 116302, 114293, 112413, 111872, 112583, 113380, 113580, 113572, 113920, 114734, 116120, 118300, 120783, 122323, 122452, 122458, 123883, 126441, 128339, 128502, 127668, 127375, 128662, 131611, 135220, 137726, 137978, 136602, 134967, 133104, 130046, 126446, 125122, 127820, 132602, 135867, 136246, 135125, 133946, 132763, 131411, 130340, 129665, 128714, 127290, 126464, 127205, 128912, 130231, 130892, 131788, 133376, 134915, 135586, 135736, 136521, 138499, 140991, 142957, 144229, 145607, 147712, 150157, 152156, 153719, 155775, 159110, 163601, 168533, 173266, 177539, 181566, 186108, 192021, 199348, 206997, 213611, 218557, 221897, 223666, 223671, 221953, 219050, 215549, 211526, 206649, 200862, 194809, 189342, 184610, 179898, 174506]
54678A74506n940n831n312m718l970l043k244j512j41K039L799L712J962Q3q15
54663A52575o67L29J901L156L119K251K321M135O388P398P255P376Q344R109Q236
54648B23226N510K182k20j325k163l802o050p919q998r481r108p348m809l168
54634A66527l097l381k794j747j239j206j113j230k038l008l329l316l676l832
54620A31521k580k87J191R83J42j68NK76P24J227J237Q65R57J382O40j777l947
54603A32391l899k432j844k511k601j046J032K172K277J842R38k26p99m02J43
54588A25035P9K7R97K628L624L579L151K593J470%o38R9J274J787J596J013q4
54571A48230j483k047j250m86j376l207l709k269o60l05n08o8R08J646J988K007
$$ y = [174506, 168566, 162735, 157423, 152705, 148735, 145692, 143448, 141936, 141795, 143834, 147633, 151345, 153307, 153390, 152575, 151908, 152237, 154138, 157294, 160413, 162664, 164985, 169120, 175508, 182906, 190161, 197537, 205881, 214990, 223226, 228736, 230918, 230698, 229373, 227210, 223408, 217358, 209439, 200441, 190960, 181852, 174504, 169695, 166527, 163430, 160049, 157255, 155508, 154269, 153063, 151950, 150720, 148682, 145674, 142345, 139029, 135353, 131521, 128941, 128654, 129845, 130828, 130970, 130802, 130807, 131083, 131807, 133034, 134271, 135136, 136093, 137475, 138115, 136338, 132391, 128492, 126060, 124216, 121705, 119104, 118058, 119090, 121262, 123539, 125381, 126319, 126093, 125294, 124892, 125035, 125114, 125141, 126138, 128766, 132390, 135969, 139120, 141713, 143183, 143183, 142545, 142644, 143918, 145705, 147301, 148314, 148230, 146747, 144700, 143450, 142964, 141588, 138381, 134672, 132403, 131743, 131438, 130930, 130862, 131770, 133416, 135404, 137411]
54555A37411J447M09k95l78o83j521j643j87J337Q93r37j538J63K492L360K286
54539A42616M2k091k584q79J352J754M35j08J327K864K348K49j419j673q32N18
54523A43919J551J270j31r92m52J97k22m92J052L346L800K138N39O5n57k105l232
54506A49694k711j362n01K7R18J779J768J050L75q7n08o61m86o33j373j702p19
54489A44868Q15J621J961K917M108L979K425J193J292J722J512J279J729K070
54475A73491J360L18K45Q96R67J88o41j339k399l463l353j923l94M44R80J410
54459A66787J221N67N35J178R03r12k284j283R07J568J91j395k115k464k518j516
54443A59370J01N96l10n86J060L145L734L153K710K120L73j694j967j80J478J352
$$ y = [137411, 138858, 139267, 138972, 138594, 137911, 136390, 134747, 134560, 135897, 136790, 135853, 134315, 134478, 136970, 140330, 142616, 142658, 140567, 137983, 137104, 138456, 140210, 140645, 140537, 141864, 144728, 147076, 147325, 145906, 144233, 143401, 143919, 145470, 146740, 146609, 145617, 145165, 145362, 145140, 144648, 145700, 149046, 152846, 154984, 155523, 155588, 155031, 152926, 149694, 146983, 145621, 145120, 145147, 146065, 147844, 149612, 150662, 151037, 150950, 150442, 149781, 149295, 148662, 147289, 145587, 144868, 145683, 147304, 149265, 152182, 156290, 160269, 162694, 163887, 165179, 166901, 168413, 169692, 171421, 173491, 174851, 175169, 175414, 176310, 177277, 177465, 176824, 175485, 173086, 169623, 166270, 164347, 163953, 164397, 165377, 166787, 168008, 168575, 169110, 170288, 171191, 170279, 167995, 166712, 167619, 169187, 169378, 167983, 165868, 163404, 160886, 159370, 159471, 160067, 159757, 159171, 160231, 163376, 167110, 170263, 172973, 175093, 175466, 173772, 171805, 171625, 173103, 174455]
54427A74455M42P63K567M064L558J315n96l11J935M033M212K718J067K45K32P03
54411B01402J337J658J398R80R81J292J394J250J180J014L12o41r66l92L90P44
54395B13333P39N84J71n48j203j374j050o15o71j555k681k702j096P05P79p96
54379B02020k050j794r34p23r75p86j03M94R14J478K026K017J456J002J119J554
54363B06715J685J139J03p57r17o48o74j116j307j008j035k071l352l403j777
54348A91577O90L092M958N667M569K096n0n58J57Q14R62J161J686J939J316J08
54332B20184q41r89m09M84J179J261O45l05j163j762k021j686o74M71R00L57n74
54315B15057j180j269j170j325j874k241j451N75K359K372J072L19O90Q48Rn70
$$ y = [174455, 174897, 175660, 178227, 182291, 185849, 187164, 186568, 186257, 188192, 192225, 196437, 199155, 200222, 200467, 200699, 201402, 202739, 204397, 205795, 206775, 207756, 209048, 210442, 211692, 212872, 213886, 214198, 213557, 212591, 212199, 212589, 213333, 214072, 214656, 214827, 214279, 213076, 211702, 210652, 210037, 209366, 207811, 205130, 202428, 201332, 202037, 202816, 202020, 199970, 198176, 197242, 196519, 195544, 194758, 194655, 195149, 196063, 197541, 199567, 201584, 203040, 204042, 205161, 206715, 208400, 209539, 209642, 208885, 207968, 207320, 206646, 205530, 204223, 203215, 202180, 200109, 196757, 193354, 191577, 192267, 195359, 200317, 205984, 210553, 212649, 212599, 212041, 212198, 213012, 213974, 215135, 216821, 218760, 220076, 220184, 219343, 218354, 217945, 218429, 219608, 220869, 221514, 221209, 220046, 218284, 216263, 214577, 213903, 214374, 215274, 215631, 215057, 213877, 212608, 211438, 210113, 208239, 205998, 204547, 205122, 207481, 209853, 210925, 211244, 211934, 212782, 212791, 212221]
54299B12221L03J625J681P47N12J331J893J402M74k32p46r09l11N63M37r87k491
54282B17513k942k401j368j96L61o49k948m863n246m561l622k454j073j87k46
54267A85118o99r32r82p51K93J759K072N96j127j414o12l2J06K31N0p38j256o70
54249A81012J57km89K30J850K524J653L82n13j242j570q81O5l32j866k514j585
54232A76879o88p47m11J164K202Q00j891l061j834L28J976K681K286R37l25n13
54216A79783p1j02n54n17k4K4m12l93K23M20p8mJ586L717M622L693J661m61j729
54197A91384j274R27L400M209K868P02p16j032q96q77j004j182j506j961k019
54182A91023j027P75J868P34k274m705m254j240J640K199R71O6L69P99L32m10
$$ y = [212221, 212524, 214149, 215830, 216577, 217089, 218420, 220313, 221715, 222189, 221957, 221211, 220302, 219991, 220554, 220991, 220004, 217513, 214571, 212170, 210802, 210606, 210967, 210318, 207370, 202507, 197261, 192700, 189078, 186624, 185551, 185364, 185118, 184419, 183487, 182505, 181754, 182047, 183806, 185878, 186474, 185347, 183933, 183321, 183289, 183395, 183626, 183676, 182938, 181682, 181012, 181169, 181167, 180678, 180908, 182758, 185282, 186935, 187317, 186804, 185562, 183992, 183111, 183176, 182844, 180978, 178464, 176879, 176191, 175444, 175033, 176197, 178399, 179199, 177308, 174247, 172413, 172741, 174717, 177398, 179684, 180621, 180296, 179783, 179712, 179610, 179056, 178539, 178515, 178539, 178127, 177734, 177957, 178377, 178299, 178295, 179881, 183598, 188220, 191913, 193574, 193113, 191384, 190110, 191037, 194437, 198646, 201514, 202216, 201500, 200468, 199572, 198695, 197691, 196509, 195003, 193042, 191023, 189996, 190771, 192639, 193373, 191099, 186394, 182140, 180900, 182540, 184739, 185710, 185776, 186145, 186944, 187276, 186866]
54166A86866l13L33K50p97j664j675j625k352l289l338k526j711r98K59J785K067
54150A71272M43j329r01J544L187K038n52j655m82R74Q72k74q95o80m43n01n29
54133A72089o25j084j227l1J791K030J8k057k032o52p7n80n80L84Q58l5j073p07
54115A66410Q13K085K477K556K926L469L600K914J625M99M5k05j102k494l224
54100A82394k716j803j455j482j128l64J76J67k54r73j795k227k020j596j232
54085A63692k78J740L687L839K270Q45O00O41P6n22n21n80j303j759j038k87j124
54068A69978k564j923R87K998J914l34n23J370K530J399o24j626j507j199r04
54053A69972j07J194K184K215J698J769K960M329M297K561O39N7M70L00j053k582
$$ y = [186866, 186553, 186886, 187136, 186339, 184675, 183000, 181375, 179023, 175734, 172396, 169870, 168159, 167161, 167420, 169205, 171272, 171715, 170386, 169485, 171029, 174216, 176254, 175702, 174047, 173565, 174539, 175411, 175137, 174242, 173562, 173119, 172618, 172089, 171464, 170380, 169153, 169122, 170913, 172943, 172961, 170904, 168872, 168220, 168143, 167563, 166983, 167367, 168225, 168190, 167117, 166410, 167223, 169308, 171785, 174341, 177267, 180736, 184336, 187250, 188875, 189374, 189419, 189214, 188112, 185618, 182394, 179678, 177875, 176420, 174938, 173810, 173446, 173622, 173789, 173535, 172562, 170767, 168540, 166520, 164924, 163692, 163414, 165154, 168841, 172680, 174950, 175795, 176395, 177036, 177112, 176590, 176069, 175489, 174186, 172427, 171389, 171102, 169978, 167414, 165491, 166478, 169476, 171390, 171056, 170533, 171903, 174433, 175832, 175208, 173582, 172075, 170876, 169972, 169865, 171059, 173243, 175458, 177156, 178925, 181885, 186214, 190511, 193072, 193711, 193768, 194238, 194538, 193485, 190903]
54037A90903l182k934k568k369j941p58J194L030L450K161M90j81k35r56k065
54022A84039j796K78K194K279J367J048J037J80r27m82J539K975K442R85K37N38
54006A97933J636L700O348P766O393L137N73m7Q4o61k197l062k415j103p11j750
53990B15624l012k957j591m07l82p04p9J329K170J860J204J014R80M39m07o92
53974B14389m5R57J439J127O39R03K058L056K729J309J66j37p27k667n029n772
53958B14395m293k026m55L26P72P63J12o11p73p74j503k814l454k557n70J380
53942A97918K419K190R58l72r31q54r44j282r90K22J192P91l75p90k13J62l62
53925A98739j018q84j51M63Q92J547K399L022L244L202K806J864Q07N88J526K640
$$ y = [190903, 187721, 184787, 182219, 179850, 177909, 177151, 178345, 181375, 184825, 186986, 187476, 187295, 187060, 186104, 184039, 182243, 182521, 184715, 186994, 188361, 189409, 190446, 190626, 189699, 189217, 190756, 193731, 196173, 197158, 197395, 197933, 199569, 203269, 209617, 217383, 223776, 226913, 227486, 227439, 227523, 226862, 224665, 221603, 219188, 218085, 217374, 215624, 212612, 209655, 208064, 207657, 207275, 206571, 206492, 207821, 209991, 211851, 213055, 214069, 215049, 215488, 215081, 214389, 214344, 215301, 216740, 217867, 218506, 219409, 221467, 224523, 227252, 228561, 228727, 228590, 227863, 225196, 220167, 214395, 210102, 208076, 207621, 207947, 208719, 209482, 209594, 208983, 208210, 207436, 205933, 203119, 199665, 197108, 196538, 197918, 200337, 202527, 203485, 203113, 202182, 201328, 200384, 199102, 198112, 198334, 199526, 200317, 199942, 199152, 198939, 199101, 198739, 197721, 196837, 196686, 197149, 198041, 199588, 201987, 205009, 208253, 211455, 214261, 216125, 216932, 217520, 219046, 221686]
53909B21686K535Q29j535l240l552k529p56R30J733J378L92k09K87J706L149L718
53893B26522L157J856M37n94q61j61J231K522K979K711K547L061M048N059N978
53878B60492O665O566N480M462M929O633P452N868K927J013J142K333L268L499
53864C22729K997J768L96JQ11J300k93l715o746p541o394n017m604m905m869l932
53848B81986k643k149k949m223m591l586k135j425j521j445m99P64J068k15k384
53833B54053m117m729m554m171l665k832j864j310j365j571j399q17j58K87L97
53818B22185J74j09l4M86R90R24K03q75j917k446j952m90J029J655J356O42m39
53801B21382k143l932m576l628j958n25N40J156P39o14j318K6K451L570K591J085
$$ y = [221686, 224221, 225050, 223515, 220275, 216723, 214194, 213438, 214368, 216101, 217479, 217871, 217662, 217949, 219655, 222804, 226522, 229679, 231535, 231972, 231378, 230517, 230356, 231587, 234109, 237088, 239799, 242346, 245407, 249455, 254514, 260492, 267157, 273723, 279203, 283665, 288594, 295227, 302679, 308547, 311474, 312487, 313629, 315962, 319230, 322729, 325726, 327494, 327890, 327891, 328702, 330002, 329709, 325994, 319248, 311707, 305313, 300296, 295692, 290787, 285918, 281986, 279343, 277194, 274245, 270022, 265431, 261845, 259710, 258285, 256764, 255319, 254820, 255584, 256652, 256437, 254053, 249936, 245207, 240653, 236482, 232817, 229985, 228121, 226811, 225446, 223875, 222476, 221659, 221501, 221788, 222185, 222359, 222250, 222216, 222702, 223692, 224616, 224819, 223944, 222027, 219581, 217629, 217139, 218168, 219823, 221179, 221821, 221382, 219239, 215307, 210731, 207103, 205145, 204620, 205160, 206316, 207055, 206441, 205123, 205149, 207600, 211170, 213761, 214846]
53785B14846N74P21N15n5m48p43j183j130J80K016K568J316j71l61K06j24j615
53768B17112k713k143n35N46N99N38J265K495L109K300L01j653k070l77K328L984
53752B25086L408J363l29n04O77K351L736M355L957K524N12j015q89R35K825L033
53736B52025J847J221J953K562J761P14J187K496K328L64j190r54j52k30n39K55
53720B65648J828K699K224P51j390l737n096m518k695j315j179j810k591l281
53706B45538l614l371k735j848l75J627K943K435Q40J5N03J094R18N85R59J928
53690B47442K880L377K898R60j833l707l389j352J011K785L654L463K516J850
53676B62555K309L480M117L627K665K247K546K729J999P58L53J362K611K547J360
$$ y = [214846, 215420, 216141, 216656, 216601, 216153, 215410, 214227, 213097, 213277, 215293, 217861, 219177, 219006, 218645, 218851, 218727, 217112, 214399, 212256, 211721, 212267, 212866, 213404, 214669, 217164, 220273, 222573, 222874, 221221, 219151, 218774, 221102, 225086, 228494, 229857, 229528, 229024, 229701, 232052, 235788, 240143, 244100, 246624, 247136, 246121, 245232, 246167, 248992, 252025, 253872, 255093, 257046, 259608, 261369, 262083, 263270, 265766, 268094, 268458, 267268, 266314, 266162, 265932, 265393, 265648, 267476, 270175, 272399, 273150, 271760, 268023, 262927, 258409, 255714, 254399, 253220, 251410, 248819, 245538, 241924, 238553, 235818, 233970, 233595, 235222, 238165, 240600, 241440, 241455, 241958, 243052, 243970, 244555, 245514, 247442, 250322, 253699, 256597, 257557, 255724, 252017, 248628, 247276, 248287, 251072, 254726, 258189, 260705, 262555, 264864, 268344, 272461, 276088, 278753, 281000, 283546, 286275, 288274, 289032, 289385, 290747, 293358, 295905, 297265]
53661B97265P42J616L129M121M572M987N304N174M792M730N223O045O734O694
53647C61128N603M042L139L207L416L148K910L314L904L910L557L671M209M142
53633D13300K842R71j59K13J575K531K197J316J382K485L015J934L68k8O20R12
53617D35474L68k35m35o48j173j736k200k705k991k510j411o21p25j450k269k788
53601D11945k575j499m01m02j330j682n50J266K442K653K447K283K232K183J879
53586D20891J180N04N27J153J513J271J258K309M024N266N407M622L421K534K624
53571D58504L499L977L317K527L360N964Q348Q470O456M390M154N785P864R179
53557E35794R649R699R247P927O124N030N266O026O021N030L995L797M338M913
$$ y = [297265, 298007, 299623, 302752, 306873, 311445, 316432, 321736, 326910, 331702, 336432, 341655, 347700, 354434, 361128, 366731, 370773, 373912, 377119, 380535, 383683, 386593, 389907, 393811, 397721, 401278, 404949, 409158, 413300, 416142, 417113, 416954, 417167, 418742, 421273, 423470, 424786, 426168, 428653, 431668, 433602, 433970, 433942, 434562, 435474, 435842, 435607, 435172, 434524, 433351, 431615, 429415, 426710, 423719, 421209, 419798, 419177, 418452, 417002, 414733, 411945, 409370, 407871, 407470, 407068, 405738, 404056, 403506, 404772, 407214, 409867, 412314, 414597, 416829, 419012, 420891, 422071, 422575, 423102, 424255, 425768, 427039, 428297, 430606, 434630, 439896, 445303, 449925, 453346, 455880, 458504, 462003, 465980, 469297, 471824, 475184, 481148, 489496, 497966, 504422, 508812, 512966, 518751, 526615, 535794, 545443, 555142, 564389, 572316, 578440, 583470, 588736, 594762, 600783, 605813, 609808, 613605, 617943, 622856]
53543F22856N003M603L897L002K058J389J204J163O43l67j240j779k629l961m567
53528F31275l370j375o57j482k032j253l51p09j771k100j465n73K97J092J112
53513F16638j43j599j523J84J798J924Q61j57o8J519L901N270M352K210J382K787
53497F39336M667N038M158L773M724O215P036O735N818N329O090P922R819J1131
53483G27791J2228J3636J4962J5294J4548J3806J4191J5662J7043J7232J6397
53472H92790J5936J7042J9379K1532K2735K3625K5117K7148K8969L0189L0969
53461A155431L1477L1813L2547L4608L8258M2323M4895M5108M4104M3924M5239
53450A589727M6572M6171M4227M2540M2015M1676M0522L9312L9529M1079M2152
$$ y = [622856, 627859, 632462, 636359, 639361, 641419, 642808, 644012, 645175, 645818, 645451, 644211, 642432, 639803, 635842, 631275, 627905, 626530, 625873, 624391, 622359, 621106, 620755, 620046, 618275, 616175, 614710, 614137, 614434, 615526, 616638, 616495, 614896, 613373, 613557, 615355, 617279, 618140, 617983, 617915, 619434, 623335, 628605, 632957, 635167, 636549, 639336, 644003, 649041, 653199, 656972, 661696, 667911, 674947, 681682, 687500, 692829, 698919, 706841, 716660, 727791, 740019, 753655, 768617, 783911, 798459, 812265, 826456, 842118, 859161, 876393, 892790, 908726, 925768, 945147, 966679, 989414, 1013039, 1038156, 1065304, 1094273, 1124462, 1155431, 1186908, 1218721, 1251268, 1285876, 1324134, 1366457, 1411352, 1456460, 1500564, 1544488, 1589727, 1636299, 1682470, 1726697, 1769237, 1811252, 1852928, 1893450, 1932762, 1972291, 2013370, 2055522]
53439B055522M1375L9315L7639L7381L8131L8447L6970L3701L0396K9128L0060
53428B448065L1011K9733K6318K2903K1143K0580J9624J7497J4773J2260R925
53417B673832P130L512o30m730q432j1717j4714j7558k0332k2960k5197k6763
53405B531441k7618k8173k9079l0645l2470l3887l4773l5572l6428l6748l6009
53394B170039l4627l3446l2561l1321k9560k7992k7039k5893k3446j9829j6304
53383A868021j3697j1558r116o436m138k266q3K924O354R432J1859J3851J5743
53370A880890J7985K1040K4584K7136K7665K7591K9756L4860M0177M2937M3813
53359B218434M5577M9030N2298N4044N5407N8024O1795O5527O8689P1493P4103
$$ y = [2055522, 2096897, 2136212, 2173851, 2211232, 2249363, 2287810, 2324780, 2358481, 2388877, 2418005, 2448065, 2479076, 2508809, 2535127, 2558030, 2579173, 2599753, 2619377, 2636874, 2651647, 2663907, 2673832, 2680962, 2684474, 2683844, 2679114, 2670682, 2658965, 2644251, 2626693, 2606361, 2583401, 2558204, 2531441, 2503823, 2475650, 2446571, 2415926, 2383456, 2349569, 2314796, 2279224, 2242796, 2206048, 2170039, 2135412, 2101966, 2069405, 2038084, 2008524, 1980532, 1953493, 1927600, 1904154, 1884325, 1868021, 1854324, 1842766, 1833650, 1827214, 1823076, 1820810, 1820727, 1823651, 1830005, 1839437, 1851296, 1865147, 1880890, 1898875, 1919915, 1944499, 1971635, 1999300, 2026891, 2056647, 2091507, 2131684, 2174621, 2218434, 2264011, 2313041, 2365339, 2419383, 2474790, 2532814, 2594609, 2660136, 2728825, 2800318, 2874421]
53348B874421P6772Q0109Q4286Q8439R1643R4011R6078R7675R8285R8089R7761
53337C877569R7448R6794R5717R4392R2786R0866Q9016Q7314Q4748Q0147P3756
53326D860553O6981O0637N4475M8322M2443L6518K9463K0848J1694L293m194j1506
53314E219527j9313k7962l7610m8029n8575o8635p7780q5383r0722r3868r5888
53303D515762r7717r9378j00672j01803j02538j01447r7326r1329q6512q4812
53293C552228q5185q5205q3778q1680p9794p7848p5084p1514o7911o4772o1773
53282B717684n8303n4136m9597m5365m2086l9745l7292l3545k8875k5341k4493
53271B278906k5401k5631k3916k1096j8561j6778j5563j4813j4291j3200j0651
$$ y = [2874421, 2951193, 3031302, 3115588, 3204027, 3295670, 3389681, 3485759, 3583434, 3681719, 3779808, 3877569, 3975017, 4071811, 4167528, 4261920, 4354706, 4445572, 4534588, 4621902, 4706650, 4786797, 4860553, 4927534, 4988171, 5042646, 5090968, 5133411, 5169929, 5199392, 5220240, 5231934, 5235227, 5231033, 5219527, 5200214, 5172252, 5134642, 5086613, 5028038, 4959403, 4881623, 4796240, 4705518, 4611650, 4515762, 4418045, 4318667, 4217995, 4116192, 4013654, 3912207, 3814881, 3723552, 3637040, 3552228, 3467043, 3381838, 3298060, 3216380, 3136586, 3058738, 2983654, 2912140, 2844229, 2779457, 2717684, 2659381, 2605245, 2555648, 2510283, 2468197, 2428452, 2391160, 2357615, 2328740, 2303399, 2278906, 2253505, 2227874, 2203958, 2182862, 2164301, 2147523, 2131960, 2117147, 2102856, 2089656, 2079005]
53260B079005o665k448M43J407J552K835O032R785J2222J3280J4533J6939J9913
53247B168833K2775K5832K9319L2362L3969L4488L5144L6577L8551M0778M3141
53236B541769M5248M6576M6939M6276M4248M0815L7004L4155L2226K9714K5575
53225B970545K0468J5620J1068N878j85o048j0626j4176j7843k2179k6751l1110
53213B894661l5339l9375m2506m4224m5171m6473m8397n0429n2439n4784n7245
53202B378279n8904n9314n9015n8588n8086n7600n7424n7239n6015n3382n0242
53191A752470m7615m5633m4190m3558m3676m3771m3442m3123m2681m0857l7222
53180A276702l3421l0988k9068k6202k3251k2184k2459k1360j8208j5750j6493
$$ y = [2079005, 2072340, 2069892, 2070335, 2071742, 2073294, 2076129, 2082161, 2091946, 2104168, 2117448, 2131981, 2148920, 2168833, 2191608, 2217440, 2246759, 2279121, 2313090, 2347578, 2382722, 2419299, 2457850, 2498628, 2541769, 2587017, 2633593, 2680532, 2726808, 2771056, 2811871, 2848875, 2883030, 2915256, 2944970, 2970545, 2991013, 3006633, 3017701, 3023579, 3023394, 3017346, 3006720, 2992544, 2974701, 2952522, 2925771, 2894661, 2859322, 2819947, 2777441, 2733217, 2688046, 2641573, 2593176, 2542747, 2490308, 2435524, 2378279, 2319375, 2260061, 2201046, 2142458, 2084372, 2026772, 1969348, 1912109, 1856094, 1802712, 1752470, 1704855, 1659222, 1615032, 1571474, 1527798, 1484027, 1440585, 1397462, 1354781, 1313924, 1276702, 1243281, 1212293, 1183225, 1157023, 1133772, 1111588, 1089129, 1067769, 1049561, 1033811, 1017318]
53169A017318j9627k2555k3725k3041k1177j9657k0066k1916k2645k1090j9453
53158G82366k0079k1673k0946j7408j4030j3136j3862j4277j4077j4111j4526
53147F04241j4716j4370j3574j2371j1020j0358j0970j2136j2397j1240r565q355
53135D63169p573o741o035o105o966p746p731p095o388n765n082m380l738k976
53121C78848j995j257j300j933k508k858l271l559l028j592j47M89L42k91j350
53106C54590k449k667j696o26p33j815k608k584k367k411k287j552n77r9l72j137
53090C28610k068k830k945k077m91R63J496R62j29j036j189l58J217K717L009
53075C25851J639m49j556r35M16R89N87M05J306K538K587J107n93j109n19J01
$$ y = [1017318, 997691, 975136, 951411, 928370, 907193, 887536, 867470, 845554, 822909, 801819, 782366, 762287, 740614, 719668, 702260, 688230, 675094, 661232, 646955, 632878, 618767, 604241, 589525, 575155, 561581, 549210, 538190, 527832, 516862, 504726, 492329, 481089, 471524, 463169, 455596, 448855, 442820, 436715, 429749, 422003, 414272, 407177, 400789, 395024, 389942, 385562, 381824, 378848, 376853, 375596, 374296, 372363, 369855, 366997, 363726, 360167, 357139, 355547, 355400, 355889, 356231, 355940, 354590, 352141, 349474, 347778, 347152, 346419, 344604, 341996, 339412, 337045, 334634, 332347, 330795, 330218, 330119, 329747, 328610, 326542, 323712, 320767, 318690, 318199, 319162, 320658, 321620, 321491, 320455, 319266, 318908, 320125, 322842, 325851, 327490, 327041, 325485, 324550, 324966, 325955, 326542, 326947, 328253, 330791, 333378, 334485, 333892, 332783, 332264, 332365]
53059C32365L36P32J400J407K25j018p90P11J804J551O06k03r83k021k998l630
53043C29494m260n043n134l690j381m7o73k284l026k075l78M57j33j227j720j605
53027B97275j512j401n91J058K880M275M924M149J373k328m439l571r96J054J674
53012C03824J238J96j004j632j474j263j367r21O06J754O39k241m359m230k713
52997B87053j237j56P70J544K044K284K175J638J008P35P93Q94R77Q44j72k104
52981B99090l443k684m64J182J461J207Q88J22p11l69J084J959J522J152J840
52966C03836K325J177o74j321p01l17p34j063p12j2P09J394J514L66j607k761
52950C01419k020j32J125P47n74j155j37J406J670N52j59N54J318N46r16r59N94
$$ y = [332365, 332701, 333433, 334833, 336240, 336465, 335447, 334657, 335368, 337172, 338723, 339329, 339126, 338143, 336122, 333124, 329494, 325234, 320191, 315057, 311367, 309986, 309939, 309266, 306982, 303956, 301881, 301503, 301960, 301827, 300600, 298880, 297275, 295763, 294362, 293771, 294829, 297709, 301984, 306908, 311057, 312430, 310102, 305663, 302092, 301096, 302150, 303824, 305062, 305258, 304254, 302622, 301148, 299885, 298518, 297597, 298203, 299957, 300596, 298355, 293996, 289766, 287053, 285816, 285660, 286430, 287974, 290018, 292302, 294477, 296115, 297123, 297858, 298651, 299545, 300522, 301366, 301194, 299090, 295647, 292963, 292499, 293681, 295142, 296349, 297237, 297359, 296648, 296279, 297363, 299322, 300844, 301996, 303836, 306161, 307338, 306664, 305343, 304642, 304325, 303591, 302528, 301816, 301804, 302513, 303907, 305421, 305787, 304180, 301419, 299399, 299267, 300392, 301139, 300565, 299410, 299273, 300679, 302349, 302901, 302742, 303296, 304614, 305160, 304244, 303285, 303879]
52933C03879J860J860J625K055K408J871J097J020J202P34J0J98J234J681P84
52918C23518m99r56o81n50p22m67O20K005K877L020K798K696L020L693M082L434
52902C47888J868N11J41L2j076l071m447m274l242k385j691o65L87M62q80k993
52886C26565m749n332m637l360k473k286k179j508n23Kk14p38q92k34J152K415
52870C01009K405Q45j098j980j598r14p34q69o47J79J004P31j081l344m131k724
52854B87053n16O09M26K71J150K565L279K713J506Q18J026J234N67k86J62J730
52838C04307K248N31j692k032o61K88k08j313k160k721k822k051q64k87k69L01
52822B90595J626K578K620K574K865K483P58j117j381K34K548M181M071J893j085
$$ y = [303879, 305739, 307599, 309224, 311279, 313687, 315558, 316655, 317675, 318877, 319611, 319621, 319819, 321053, 322734, 323518, 323019, 322063, 321382, 320832, 320110, 319643, 320263, 322268, 325145, 328165, 330963, 333659, 336679, 340372, 344454, 347888, 349756, 350267, 350408, 350440, 349364, 346293, 341846, 337572, 334330, 331945, 330254, 329589, 329976, 330438, 329558, 326565, 321816, 316484, 311847, 308487, 306014, 303728, 301549, 300041, 299518, 299520, 299306, 298568, 297676, 297442, 298594, 301009, 303414, 304259, 303161, 301181, 299583, 298669, 297935, 297066, 296419, 296598, 297602, 298333, 297252, 293908, 289777, 287053, 286537, 287146, 287572, 287843, 288993, 291558, 294837, 297550, 299056, 299874, 300900, 302134, 302701, 302415, 302577, 304307, 306555, 307086, 305394, 303362, 302701, 302989, 302781, 301468, 299308, 296587, 293765, 291714, 290850, 290563, 290294, 290595, 292221, 294799, 297419, 299993, 302858, 305341, 306099, 304982, 303601, 303835, 306383, 310564, 314635, 316528, 315443]
52807C15443k565j710k94k96j310j633j110j107k004k493j704o33p48k047l154
52792B92635k880j387L6J33j081k349k582j966j305p87m3Q79J445J513J468J430
52776B85159J011J54m72l47P5j50j241k256k069p12M61K06j096j859j280l06k64
52759B75014j175j929j664l67J492L115L509K287L53r28j178j052r78o16L26J510
52743B77719K411K845K792K114P30j070k593l072k296j128q75j705k149r53J069
52728B73839J926R99m00r67p86n46l96j93j07m19j100j913k532k402j294j28l24
52711B63257j804k565j035J722L117J991l88k142k583k096r90Q01L027M575M125
52696B69012J578j433k891k289o89Q97K451M026M860M194K570J370J281J769K033
$$ y = [315443, 312878, 311168, 310874, 310578, 309268, 307635, 306525, 305418, 303414, 300921, 299217, 298584, 297836, 295789, 292635, 289755, 288368, 288404, 288537, 287456, 285107, 282525, 280559, 279254, 278467, 278424, 279303, 280748, 282261, 283729, 285159, 286170, 286324, 285852, 285505, 285580, 285430, 284189, 281933, 279864, 279152, 279613, 279819, 278723, 276864, 275584, 275278, 275014, 273839, 271910, 270246, 269879, 271371, 274486, 277995, 280282, 280635, 279707, 278529, 277477, 276499, 275883, 276209, 277719, 280130, 282975, 285767, 287881, 288611, 287541, 284948, 281876, 279580, 278452, 277577, 275872, 273723, 272770, 273839, 275765, 276764, 276364, 275397, 274611, 274065, 273669, 273476, 273369, 272950, 271850, 269937, 267405, 265003, 263709, 263581, 263257, 261453, 258888, 257853, 259575, 262692, 264683, 264295, 262153, 259570, 257474, 256484, 257285, 260312, 264887, 269012, 270590, 269157, 266266, 263977, 263288, 264185, 266636, 270662, 275522, 279716, 282286, 283656, 284937, 286706, 288739]
52681B88739J904J785K181L347M970O152O059M782L256K217J500N71n11j031o26
52666C25295k9l69j701k735k342r11J74Q5r91k472l652l622k033mP46p8j163j555
52648C02643j658j933j902j250o20m19M8J156J863J288L16P7r6j277k450j833
52632B93953k47l35k271l056j126J131R47q74j725j186q47j223j320q55o13n87
52616B79766J89J621K233J399L44J40K00k97p47j61J027J519J105Q11J197J720
52600B92066J953K345L312M265M344L621K935K636K233J314K10n53r33j218j523
52585C17007j850k266k588k243j070Oj15j236k120k185j972j836j283j12Q71J131
52569B98139J491K870M582M990L613J588K14o3N67J453J608O05o74j041o47n77
$$ y = [288739, 290643, 292428, 294609, 297956, 302926, 309078, 315137, 319919, 323175, 325392, 326892, 327463, 326952, 325921, 325295, 325266, 324897, 323196, 320461, 318119, 317208, 317382, 317467, 316476, 314004, 310352, 306730, 304697, 304693, 305439, 305361, 304198, 302643, 300985, 299052, 297150, 295900, 295280, 294861, 294909, 296065, 297928, 299216, 299532, 299609, 299513, 298236, 295786, 293953, 293706, 293371, 291100, 288044, 286918, 288049, 288996, 288122, 286397, 285211, 284364, 283141, 281821, 280966, 280353, 279766, 279955, 281576, 283809, 285208, 285552, 285692, 285892, 285595, 284848, 284687, 285714, 287233, 288338, 289149, 290346, 292066, 294019, 296364, 299676, 303941, 308285, 311906, 314841, 317477, 319710, 321024, 321234, 320681, 319748, 318530, 317007, 315157, 312891, 310303, 308060, 306990, 306996, 306881, 305645, 303525, 301340, 299368, 297532, 296249, 296137, 297008, 298139, 299630, 302500, 307082, 312072, 315685, 317273, 317487, 317424, 317991, 319444, 321052, 321657, 320983, 319942, 319295, 318718]
52553C18718r60p88J93Q12K46p88j258j223j136p08N15K047K862K559J478J74
52537C22743o43l70N53P11l88j295o63M72N3j819k882k041p49n71r28m07R48J893
52519C14617J830J241O97M08N02Q50Q37K5j084j635j613j616j629r55M56J461
52503C14392J020n49k029k610k298j418l06O03R94J052J231J512J292J83j358
52488C11711k490k845k535j591l6J403J494n3j766j824j64J541J966J489J250
52473C07550J612K031K031J627J054N01P3l24r14j619j936j562r36p01q80j011
52457C06596q49m46K94J484K742L421L484L525L832L973L474K453J278J55o93
52442C34723q73k83N99J128R68O1j413k897l698l632l021j974l30J485K383K000
$$ y = [318718, 317758, 316970, 317163, 317975, 318221, 317433, 316175, 314952, 313816, 313108, 313623, 315670, 318532, 321091, 322569, 322743, 322100, 321730, 322283, 322994, 322606, 321311, 320648, 321120, 321173, 319354, 316472, 314431, 313682, 313111, 312183, 311776, 312724, 314617, 316447, 317688, 318385, 318793, 319295, 320145, 320982, 321007, 319923, 318288, 316675, 315059, 313430, 312475, 312931, 314392, 315412, 314863, 312834, 310224, 307926, 306508, 306202, 306805, 307799, 308851, 310082, 311594, 312886, 313069, 311711, 309221, 306376, 303841, 302250, 302214, 303617, 305111, 305058, 303292, 301468, 301304, 302845, 304811, 306300, 307550, 309162, 311193, 313224, 314851, 315905, 316406, 316479, 316155, 315241, 313622, 311686, 310124, 309188, 308487, 307607, 306596, 305747, 305301, 305595, 307079, 309821, 313242, 316726, 320251, 324083, 328056, 331530, 333983, 335261, 335416, 334723, 333850, 333567, 334166, 335294, 336262, 336323, 334910, 332013, 328315, 324683, 321662, 319688, 319358, 320843, 323226, 325226]
52426C25226J350J385J608J068Q4k18K45M38l2l15K13J062J562J683J445M99r33
52409C36370j526k57K039L324K573P55l30J91J647K696K707K280K272K594K473
52394C59808J719R70N85O0j039k269k868k560j541k24O50L76p62j621j694j730
52378C47860k337k908k741k281k241k187j264K26J225J596K086K814L113K882
52364C45843K890L561M436M944M856L962K300P52M28J364K743M311O357Q260Q469
52349D05476O445L480J181J2l81n11j062k416l747l712k367j252j174j216n06
52334C98250M97J173J774K425K464J810J600K369K974K620K553M112O308P248
52320D38177O911O654O712O261N405N069N318N698O801R274J1640J1534R290P881
$$ y = [325226, 326576, 327961, 329569, 330637, 330721, 330503, 330748, 331186, 331154, 330839, 331052, 332114, 333676, 335359, 336804, 337303, 336370, 334844, 334587, 336626, 339950, 342523, 343278, 342948, 343139, 344786, 347482, 350189, 352469, 354741, 357335, 359808, 361527, 362497, 363082, 363142, 362103, 359834, 356966, 354406, 352865, 352641, 353291, 353667, 352905, 351284, 349590, 347860, 345523, 342615, 339874, 337593, 335352, 333165, 331901, 332127, 333352, 334948, 337034, 339848, 342961, 345843, 348733, 352294, 356730, 361674, 366530, 370492, 372792, 373544, 373972, 375336, 378079, 382390, 388747, 397007, 405476, 411921, 415401, 416582, 416594, 416213, 415702, 414640, 412224, 408477, 404765, 402398, 401146, 399972, 398756, 398250, 398747, 399920, 401694, 404119, 406583, 408393, 409993, 412362, 415336, 417956, 420509, 424621, 430929, 438177, 445088, 451742, 458454, 464715, 470120, 475189, 480507, 486205, 493006, 502280, 513920, 525454, 534744, 542625]
52306E42625Q800J0357J0678J0083R513Q814P973Q159R874J1639J2111J2120J2976
52293F75722J4070J4057J3556J4478J7056J9499K0638K1165K2073K3302K4417
52282H80033K5383K6178K6512K6446K6713K7928K9843L1632L2588L2457L1436
52271A197149K9999K8557K7199K5904K4776K3810K2638K0821J8352J5652J3257
52260A448114J1590J0630R649P749M976K445Q96k91k047m073n189n041m584m868
52246A469956n922o934p045n790l301l43K059L285L555L756M835P067R881J2492
52232A487551J4641J6341J7178J6636J5159J4029J3868J4168J4590J5633J7301
52221A657095J8289J7565J5957J4820J3827J1522P780M127J530o72l294o044q265
$$ y = [542625, 551425, 561782, 572460, 582543, 592056, 600870, 608843, 617002, 626876, 638515, 650626, 662746, 675722, 689792, 703849, 717405, 731883, 748939, 768438, 789076, 810241, 832314, 855616, 880033, 905416, 931594, 958106, 984552, 1011265, 1039193, 1069036, 1100668, 1133256, 1165713, 1197149, 1227148, 1255705, 1282904, 1308808, 1333584, 1357394, 1380032, 1400853, 1419205, 1434857, 1448114, 1459704, 1470334, 1479983, 1487732, 1492708, 1495153, 1496049, 1495758, 1493711, 1489638, 1484449, 1479408, 1474824, 1469956, 1464034, 1457100, 1450055, 1444265, 1440964, 1440621, 1442680, 1445965, 1449520, 1453276, 1458111, 1465178, 1475059, 1487551, 1502192, 1518533, 1535711, 1552347, 1567506, 1581535, 1595403, 1609571, 1624161, 1639794, 1657095, 1675384, 1692949, 1708906, 1723726, 1737553, 1749075, 1756855, 1760982, 1762512, 1761840, 1758546, 1752502, 1744237]
52208A744237r926j1335j2491j3333j4074j4947j6005j7253j8497j8982j8086
52197A579308j6511j5953j7085j8490j8096j5278j1211p571n322m368l906l195
52185A442322k223j533j446j706j742j058M66K163K891K324J617K014L234M246
52171A451569N112O549P922P683O146N700P313Q796Q032O209N869P069P790P485
52157A549244P662R042J0437J0962J1258J1717J1307R315O857N342M484L217J818
52144A652662J545K507L287K870J766R31N44L90O40J493K369K317J217k7o88j038
52128A672785j593k002j439j9J048R22N0p77j534k480l129k703j394k89j23q38
52112A656485k173l651m116k575J68J994K085J864K585L425L248L131N236R628
$$ y = [1744237, 1734311, 1722976, 1710485, 1697152, 1683078, 1668131, 1652126, 1634873, 1616376, 1597394, 1579308, 1562797, 1546844, 1529759, 1511269, 1493173, 1477895, 1466684, 1459113, 1453791, 1449423, 1445517, 1442322, 1440099, 1438566, 1437120, 1435414, 1433672, 1432614, 1433080, 1435243, 1438134, 1440458, 1442075, 1444089, 1447323, 1451569, 1456681, 1463230, 1471152, 1478835, 1484981, 1490681, 1497994, 1506790, 1514822, 1521031, 1526900, 1533969, 1541759, 1549244, 1556906, 1565948, 1576385, 1587347, 1598605, 1610322, 1621629, 1630944, 1637801, 1643143, 1647627, 1650844, 1652662, 1654207, 1656714, 1660001, 1662871, 1664637, 1665568, 1666112, 1666502, 1667142, 1668635, 1671004, 1673321, 1674538, 1674511, 1673823, 1672785, 1671192, 1669190, 1667751, 1667732, 1668780, 1669702, 1669752, 1668975, 1667441, 1664961, 1661832, 1659129, 1657735, 1657446, 1657323, 1656485, 1654312, 1650661, 1646545, 1643970, 1644138, 1646132, 1648217, 1650081, 1652666, 1656091, 1659339, 1662470, 1667706, 1677334]
52098A677334J3949J6301J6930J6921J6838J7005J7614J7895J6633J4410J3867
52087A855697J6366J9637K0459J8857J7750J8744K0349K0734K0294K0439K1250
52076B070576K1646K1095J9936J8475J6830J5435J4724J4328J3424J1986J0934
52065B249389J0874J1341J1482J0954R791P955N493K950J145M20L45K02l83j269
52051B320689k130k844l491m102m605n065n790o909p922p944o595m446k466j023
52037B255357N06L029O718J0733J4026J6278J7865J9125K0000K0439K0671K0846
52025B425593K0610J9421J7170J4378J1925J0597J0562J0991J0510Q376M987J093
52013B566213l011p078j0409j2599j4440j6998j9963k2016k3003k4454k7469l1156
$$ y = [1677334, 1691283, 1707584, 1724514, 1741435, 1758273, 1775278, 1792892, 1810787, 1827420, 1841830, 1855697, 1872063, 1891700, 1912159, 1931016, 1948766, 1967510, 1987859, 2008593, 2028887, 2049326, 2070576, 2092222, 2113317, 2133253, 2151728, 2168558, 2183993, 2198717, 2213045, 2226469, 2238455, 2249389, 2260263, 2271604, 2283086, 2294040, 2303831, 2311786, 2317279, 2320229, 2321374, 2321794, 2322139, 2322341, 2321958, 2320689, 2318559, 2315715, 2312224, 2308122, 2303517, 2298452, 2292662, 2285753, 2277831, 2269887, 2263292, 2258846, 2256380, 2255357, 2255863, 2258892, 2265610, 2276343, 2290369, 2306647, 2324512, 2343637, 2363637, 2384076, 2404747, 2425593, 2446203, 2465624, 2482794, 2497172, 2509097, 2519694, 2530256, 2541247, 2551757, 2560133, 2565120, 2566213, 2563202, 2556124, 2545715, 2533116, 2518676, 2501678, 2481715, 2459699, 2436696, 2412242, 2384773, 2353617]
52001B353617l3968l5680l6928l7620l7192l6190l6112l7356l8473l7948l5866
51990A950284l3231l0485k7484k4428k1849j9820j7930j6132j4965j4716j4864
51979A714380j4619j3797j2851j2146j1496j0483r086p806p028o379n185l588
51967A599916k672l054l913m245m683o896j0989j4789j6358j6208j6052j6360
51955A483697j6555j6962j8703k1535k3604k4122k4755k7194l0444l1962l0944
51944A216917k9051k8008k7740k7185k5892k4367k3336k2998k2726k1486j9006
51933I45122j6451j5267j5412j5391j4141j2080j0099q425p052o523p341q830
51921H08110r451q397o497n373n983p878r739j0521j0216r551r024q441p445o069
$$ y = [2353617, 2319649, 2283969, 2247041, 2209421, 2172229, 2136039, 2099927, 2062571, 2024098, 1986150, 1950284, 1917053, 1886568, 1859084, 1834656, 1812807, 1792987, 1775057, 1758925, 1743960, 1729244, 1714380, 1699761, 1685964, 1673113, 1660967, 1649471, 1638988, 1629902, 1622096, 1615068, 1608689, 1603504, 1599916, 1597244, 1594190, 1590277, 1586032, 1581349, 1574453, 1563464, 1548675, 1532317, 1516109, 1500057, 1483697, 1467142, 1450180, 1431477, 1409942, 1386338, 1362216, 1337461, 1310267, 1279823, 1247861, 1216917, 1187866, 1159858, 1132118, 1104933, 1079041, 1054674, 1031338, 1008340, 985614, 964128, 945122, 928671, 913404, 897992, 882601, 868460, 856380, 846281, 837856, 830804, 824281, 816940, 808110, 798659, 790262, 783765, 778392, 772409, 764531, 754792, 744271, 734055, 724504, 715480, 707039, 699594, 693525]
51907F93525m666l502k708k415k564k647j920q5K320M219M813M316L768L928M400
51892G00782M182L048J967J931K780L405K845R46j602l485l352p95L046O273P797
51877G29768Q104Q502R741J1302J1937J0933Q800O666N061L655K174R76L33m47
51863H17505k409n513q365r625r255q174p014n644l840j932m88L49J038K256M589
51848G63478Q342J2891J6023J4835Q313j065r087j3430j4986j5675j5933j5008
51836G38698j2922j0948j0054r680q517o287m245l903n407p425q569q610q180
51823F33951p665o925n849m502k703j98K552M390M678L959L095K287J452R34J123
51808F30579J674J837J458J092J051Q72j36k100m404o182p067p435p737p652o484
$$ y = [693525, 688859, 685357, 682649, 680234, 677670, 675023, 673103, 673018, 675338, 679557, 684370, 688686, 692454, 696382, 700782, 704964, 708012, 709979, 711910, 714690, 718095, 720940, 721886, 720284, 716799, 713447, 712652, 715698, 721971, 729768, 737872, 746374, 756115, 767417, 779354, 790287, 799087, 805753, 810814, 814469, 816643, 817619, 817952, 817505, 815096, 809583, 801218, 791593, 782338, 774164, 767150, 761506, 757666, 755734, 755246, 755595, 756633, 758889, 763478, 771820, 784711, 800734, 815569, 823882, 822817, 813730, 800300, 785314, 769639, 753706, 738698, 725776, 714828, 704774, 695094, 686577, 680290, 676045, 672142, 666735, 659310, 650741, 642131, 633951, 626286, 619361, 613512, 609010, 606307, 606109, 608661, 613051, 617729, 621688, 624783, 627070, 628522, 629456, 630579, 632253, 634090, 635548, 636640, 637691, 638563, 638427, 636327, 631923, 625741, 618674, 611239, 603502, 595850, 589366]
51793E89366m462k818k176j707n14Q76J451J439J802K283J452j123l944n355n264
51778E71306m642m170l992m090m314m348m172m098m163l859k874j565l76O58J465
51763E26766J645J183P45O47J14j505l294l573k087l16M25K23k42p25j086p80
51747E18140M40J804K189J442M28q4j28k24q66k254m003n081m665l162k002k093
51731D99881k945l566l628l391k966k299j607j081l62R70K428K893J988N69l35
51716D86549m04K20J313K380K870K987L605M828N542N048M389M963O427P211O842
51701E44770O475P017P952Q312P835O656M718K079p39l105m664n242m970m634
51687E72460n095o015n971m378k483j643j356j9K712N463P120Q171R595J1163
$$ y = [589366, 584904, 582086, 579910, 578203, 577689, 578565, 580016, 581455, 583257, 585540, 586992, 585869, 581925, 576570, 571306, 566664, 562494, 558502, 554412, 550098, 545750, 541578, 537480, 533317, 529458, 526584, 525019, 524643, 525301, 526766, 528411, 529594, 530339, 530986, 531100, 529595, 526301, 522728, 520641, 520325, 520750, 520973, 520731, 520006, 518920, 518140, 518580, 520384, 522573, 524015, 524443, 524359, 524231, 524007, 523141, 520887, 516884, 511803, 507138, 503976, 501974, 499881, 496936, 493370, 489742, 486351, 483385, 481086, 479479, 478398, 478036, 479006, 481434, 484327, 486315, 486884, 486549, 486145, 486365, 487678, 490058, 492928, 495915, 499520, 504348, 509890, 514938, 519327, 524290, 530717, 537928, 544770, 551245, 558262, 566214, 574526, 582361, 589017, 593735, 595814, 595075, 591970, 587306, 582064, 577094, 572460, 567365, 561350, 555379, 551001, 548518, 546875, 545519, 545500, 548212, 553675, 560795, 568966, 578561, 589724]
51673E89724J1643J0468Q543P215O930P303Q205R937J1961J2246Q835K085n363
51660F89732j0957j3866j4346j2726r699o831n613o118p163p705p589p166o847
51647E73106o871o966o341m501j982K50J820K706K319l8l516n731n154k853j004
51632E35244k38O07K291L891M055K648N96j348k947l872l657k434j052j18O05
51617E34271J534K486L085L578M597O297Q345J0628J3185J5440J6350J5664J4263
51604F49723J2755J0413O147R7o338j1635j4679j4761j2146q743p091q094j0170
51591E85478j1046j0074q392p160o295n103l628k740k891l403l487l445m009m701
51577E09104m126k278j253k602m912n436l715j963j854k571k607k000j682j575
$$ y = [589724, 601367, 611835, 620378, 627593, 634523, 641826, 650031, 659968, 671929, 684175, 693010, 695095, 689732, 678775, 664909, 650563, 637837, 628138, 621307, 615694, 609576, 602413, 594708, 587119, 579953, 573106, 566235, 559269, 552928, 548427, 546445, 546695, 548515, 551221, 553540, 553502, 549986, 544255, 539101, 536248, 535244, 535006, 535613, 537904, 541795, 545850, 548498, 549094, 547746, 544799, 540927, 537270, 534836, 533784, 533666, 534271, 535805, 538291, 541376, 544954, 549551, 555848, 564193, 574821, 588006, 603446, 619796, 635460, 649723, 662478, 672891, 679038, 679135, 672797, 661162, 646483, 631722, 619576, 610833, 603742, 595648, 585478, 574432, 564358, 555966, 548806, 542511, 537408, 533780, 531040, 528149, 524746, 521259, 517814, 513805, 509104, 504978, 502700, 501447, 498845, 493933, 488497, 484782, 482819, 480965, 478394, 475787, 473787, 472105, 470530]
51563D70530o62J236K872K909J312o98j726j343l28L00N96J570L536N302N645
51548D91051N029M928N693O164N463M172L412L525M145M948N726O062N432L554
51534E59304N11l089n989o939o047m904m821n237m668k837r55J04Q96K292M105
51519E21726N493O243O994Q344J0293J2455J4342J5438J5500J4897J4418J4615
51507F60758J5404J6133J5864J3877J0550P619O964Q818J1736J4487J7322K0826
51495H20358K4263K6034K5687K4241K2360J9270J4228Q201K967j143n436j0769
51483I70261j6325k0797k3732k5173k4981k3461k2084k2177k3140k3090k1415
51472G23886j9530j8737j8499j7514j5726j4195j3486j3021j1946r920p174m434
$$ y = [470530, 469868, 471104, 473976, 476885, 478197, 477499, 475773, 474430, 474102, 474402, 474998, 476568, 480104, 485406, 491051, 496080, 501008, 506701, 512865, 518328, 522500, 525912, 529437, 533582, 538530, 544256, 550318, 555750, 559304, 559815, 556726, 550737, 543798, 537751, 532847, 528026, 522789, 518121, 515284, 514329, 514433, 515329, 517621, 521726, 527219, 533462, 540456, 548800, 559093, 571548, 585890, 601328, 616828, 631725, 646143, 660758, 676162, 692295, 708159, 722036, 732586, 740205, 747169, 755987, 767723, 782210, 799532, 820358, 844621, 870655, 896342, 920583, 942943, 962213, 976441, 984642, 987609, 986466, 981030, 970261, 953936, 933139, 909407, 884234, 859253, 835792, 813708, 791531, 768391, 745301, 723886, 704356, 685619, 667120, 649606, 633880, 619685, 606199, 593178, 581232, 571312, 564138, 559704]
51460E59704k756k759l853m700m540l654k581j420j03J168K120K834L621M517
51446E47598N083M806L657K187J026L02k80q73j378j812k360k873k942k703l054
51431E46384m592o750q436q976q168o211m189l708n001o223n741m378l919m174
51417D65918l618k526k917m903n813m147k116k417m140m208j859O76J604J505
51403D31039J618K056K363K665L406M525N282M754K616j97j954j811o81J79P96
51388D56656J822K943L300L205L889N575P126P882Q478R417R961R137O984M327
51374E40702K068R78J347K378K691J808L63j284l595o460q461q379o691m815l509
51359E09141k776k563k651k337j227N4O67P62J133K014K935L440L270K246P74
$$ y = [559704, 556948, 554189, 550336, 545636, 541096, 537442, 534861, 533441, 533338, 534506, 536626, 539460, 543081, 547598, 552681, 557487, 561144, 563331, 564357, 564659, 564379, 563506, 562128, 560316, 557956, 555083, 552141, 549438, 546384, 541792, 535042, 526606, 517630, 509462, 503251, 499062, 495354, 490353, 484130, 478389, 474011, 470092, 465918, 462300, 459774, 456857, 451954, 446141, 441994, 439878, 437461, 433321, 429113, 427254, 427930, 429534, 431039, 432657, 434713, 437076, 439741, 443147, 447672, 452954, 457708, 460324, 460127, 458173, 456362, 455681, 455860, 456656, 458478, 461421, 464721, 467926, 471815, 477390, 484516, 492398, 500876, 510293, 520254, 529391, 536375, 540702, 542770, 543748, 545095, 547473, 550164, 551972, 552335, 551051, 547456, 540996, 532535, 524156, 517465, 512650, 509141, 506365, 503802, 501151, 498814, 497587, 497641, 498308, 499070, 500203, 502217, 505152, 508592, 511862, 514108, 514882]
51344E14882j9M19R83K92j087j029J319M255N558M845L363K270J980K664M373
51329E45068O507P938Q200Q341J0085J3938J8326K1013K1328K0676K0869K2543
51317G24832K5269K8422L1283L2769L2017K9217K5410K1469J7688J4029J0238
51306I92643N887R10m107q692j3305j8592k4121k8735l2017l4390l5758l5344
51294G64379l3172l0547k8354k5957k2620j9096j6613j4979j2991j0513q765q405
51282E32367q526q050p231p001p465p855p765p598p722p826p511o922o302n225
51268D29368l136o77M85l31j767k213k003k569l779l725j569R28J703R64L48L62
51252D12389K61k1M43J770K663K229J265R78J244J017Pq97p65M06J868K776K678
$$ y = [514882, 514863, 515282, 516265, 516557, 515470, 514441, 515760, 520015, 525573, 530418, 533781, 536051, 538031, 540695, 545068, 551575, 559513, 567713, 576054, 586139, 600077, 618403, 639416, 660744, 681420, 702289, 724832, 750101, 778523, 809806, 842575, 874592, 903809, 929219, 950688, 968376, 982405, 992643, 998530, 999440, 995333, 986641, 973336, 954744, 930623, 901888, 869871, 835481, 799723, 764379, 731207, 700660, 672306, 646349, 623729, 604633, 588020, 573041, 560050, 549537, 540772, 532367, 523841, 515791, 508560, 501559, 494094, 486239, 478474, 470876, 463154, 455328, 447817, 440895, 434593, 429368, 426232, 425555, 426040, 425709, 423942, 421729, 419726, 417157, 413378, 409653, 408084, 409012, 410715, 411679, 412027, 412389, 412650, 412629, 413072, 414842, 417505, 419734, 420999, 421977, 423221, 424238, 424245, 423348, 422583, 422989, 424857, 427633, 430311]
51235D30311J673K30j197k362l133l411l224k663j694l23J118K191K959L891N041
51220D29407N661N033L402J799J091J362J976K103J407L61k50j45M58J473K886
51205D58024M061L975K619J359J311J971K154J576O17q32l052n194n721m420k942
51190D55506k822l760m333l736k277p46J65J41m41o53M6J082J367N03q43j781
51174D37418k059k056k107k167k177k350k759k786j636L89J877J939J275R97J016
51159D24814N23m31r72p88l26L84J888M025N662O084N587M459K549L79o58j02
51143D53077P44P84Q35J997L412L281J721O03N59L8j975l950l696j432L93J52
51127D56543j204j756j154p46j366k057j572l92l0n74m36J026K249J823P47P94
$$ y = [430311, 431984, 432214, 431017, 428655, 425522, 422111, 418887, 416224, 414530, 414207, 415325, 417516, 420475, 424366, 429407, 435068, 440101, 443503, 445302, 446393, 447755, 449731, 451834, 453241, 453602, 453352, 453207, 453665, 455138, 458024, 462085, 466060, 468679, 470038, 471349, 473320, 475474, 477050, 477667, 476835, 473783, 468589, 462868, 458448, 455506, 452684, 448924, 444591, 440855, 438578, 437832, 437997, 438138, 437697, 437044, 437090, 438172, 439539, 440042, 439199, 437418, 435359, 433303, 431196, 429029, 426852, 424502, 421743, 418957, 417321, 417710, 419587, 421526, 422801, 423798, 424814, 425337, 424906, 423934, 423146, 422820, 423204, 425092, 429117, 434779, 440863, 446450, 450909, 453458, 453837, 453179, 453077, 453821, 454605, 455440, 457437, 460849, 464130, 465851, 466454, 467013, 467051, 465076, 461126, 457430, 455998, 456391, 456543, 455339, 453583, 452429, 451683, 450317, 448260, 446688, 446296, 446266, 445692, 445256, 446282, 448531, 450354, 451101, 451895]
51111D51895J634J540N34N65K362M145M248L359K960L039K677K003J888K138J584
51096D86571K1j227j104k36K0p11j611j875j498r27m09J46R23J957K931L080J715
51079D87766p44k565k354q57k79j515k994k859j388k38N6M09J289J965J849J387
51063D78928J177J124J017J085J452J688J523J404J761K262K338K072K047K470
51049E02348K994L216L098L016L413M187M501L724K466J882J966J646P52N58J627
51034E41394K522J857O91J219L572N568N646M520L564L011K393J730J336J067
51020E80090O20K07K33N47O12M56P88K002L407L865L027J824J563K724M730O723
51004F13418Q367R878J1613J3741J6075J7895J8182J6412J3147R763P586P277
$$ y = [451895, 453529, 455069, 455603, 456168, 458530, 462675, 466923, 470282, 473242, 476281, 478958, 480961, 482849, 484987, 486571, 486592, 485365, 484261, 484025, 484045, 483334, 481723, 479848, 478350, 477423, 477014, 477160, 478083, 480040, 482971, 486051, 487766, 487022, 484457, 482103, 481246, 480967, 479452, 476458, 473599, 472211, 471973, 472029, 472438, 473727, 475692, 477541, 478928, 480105, 481229, 482246, 483331, 484783, 486471, 487994, 489398, 491159, 493421, 495759, 497831, 499878, 502348, 505342, 508558, 511656, 514672, 518085, 522272, 526773, 530497, 532963, 534845, 536811, 538457, 539209, 539767, 541394, 543916, 545773, 546464, 547683, 551255, 556823, 562469, 566989, 570553, 573564, 575957, 577687, 579023, 580090, 580710, 580917, 581150, 581697, 582309, 582765, 583553, 585555, 588962, 592827, 595854, 597678, 599241, 601965, 606695, 613418, 621785, 631663, 643276, 657017, 673092, 690987, 709169, 725581, 738728, 748491, 756077, 763354]
50992G63354Q790J1461J4146J5561J4945J2521R430O970N549M297J957j743n724
50979H61514q507r361q621p470p394r213j2212j4650j5507j5362j5227j5068j4078
50966G08844j1933r071o010l172j185m11r8J077L332N509O769P715R106J0328
50952G20800J0308R564J0011J2360J4819J5067J2963J0558R822J1063J3364J5555
50940H66254J6774J6905J6920J8108K0504K2591K2982K1896K0469J9267J8159
50929A080829J7242J6887J7015J7137J7019J6542J5210J2812J0526J0196J2212
50918A243627J5119J7759K0686K4872K9947L4604L8193M1222M4728M9676N6411
50907A616844O3947P0398P4823P8254Q2193Q6586R0095R1959R2562R2471R1925
$$ y = [763354, 772144, 783605, 797751, 813312, 828257, 840778, 850208, 857178, 862727, 867024, 868981, 867238, 861514, 853007, 843646, 835025, 827555, 820161, 810948, 798736, 784086, 768579, 753217, 737990, 722922, 708844, 696911, 687840, 681830, 678658, 677473, 677062, 676964, 678041, 681373, 686882, 693651, 701366, 710472, 720800, 731108, 740672, 750683, 763043, 777862, 792929, 805892, 816450, 826272, 837335, 850699, 866254, 883028, 899933, 916853, 934961, 955465, 978056, 1001038, 1022934, 1043403, 1062670, 1080829, 1098071, 1114958, 1131973, 1149110, 1166129, 1182671, 1197881, 1210693, 1221219, 1231415, 1243627, 1258746, 1276505, 1297191, 1322063, 1352010, 1386614, 1424807, 1466029, 1510757, 1560433, 1616844, 1680791, 1751189, 1826012, 1904266, 1986459, 2073045, 2163140, 2255099, 2347661, 2440132, 2532057]
50896B532057R1356R1181R0662Q7744Q0866P0754N9984N0734M3166L6015K8430
50885C262949K0980J4748R902N585R11m466j0486j6543k1208k3224k3078k2811
50873C193259k3882k6072k8784l2251l6743m1653m6425n1528n7498o3657o8915
50862B715851p3162p6848p9748q1362q1924q1697p9844p5532o9810o4771o0954
50851A890199n7097n2475m7816m3676l9561l5203l1285k8213k5399k2426j9854
50840A487194j8148j6809j5265j3696j2299j0689q785p405p088o984n845l597
50828A360584j230M41J300J718K470M285O857Q794R223Q969R530J1312J3601J5779
50814A453633J7832J9923K2191K4767K7445K9640L1246L3170L6305M0299M4079
$$ y = [2532057, 2623413, 2714594, 2805256, 2893000, 2973866, 3044620, 3104604, 3155338, 3198504, 3234519, 3262949, 3283929, 3298677, 3308579, 3314164, 3315075, 3310609, 3300123, 3283580, 3262372, 3239148, 3216070, 3193259, 3169377, 3143305, 3114521, 3082270, 3045527, 3003874, 2957449, 2905921, 2848423, 2784766, 2715851, 2642689, 2565841, 2486093, 2404731, 2322807, 2241110, 2161266, 2085734, 2015924, 1951153, 1890199, 1833102, 1780627, 1732811, 1689135, 1649574, 1614371, 1583086, 1554873, 1529474, 1507048, 1487194, 1469046, 1452237, 1436972, 1423276, 1410977, 1400288, 1391503, 1384098, 1377010, 1370026, 1364181, 1360584, 1359354, 1359795, 1361095, 1362813, 1365283, 1369568, 1376425, 1385219, 1394442, 1403411, 1412941, 1424253, 1437854, 1453633, 1471465, 1491388, 1513579, 1538346, 1565791, 1595431, 1626677, 1659847, 1696152, 1736451, 1780530]
50803A780530M7459N1366N6418O2059O7427P2610P8605Q6020R4151J01706J08649
50792B607000J16831J28047J41579J54669J65621J75268J84855J93760K00556
50783D068186K05370K09582K13375K15154K13361K07508J97209J81815J61806
50774E873366J39309J16229R2578O7789M2913K0297J319j4296k6849l5752m0654
50763F236249m2415m1977l9159l3665k6864k1377j8941j9861k4566l4138m8565
50752E884721o5628q2771r9419j16475j33998j50649j65004j76337j84138j88098
50742D522204j88604j86243j80857j72286j61922j51837j41969j29889j14472
50733C094125r8334q5095p5116o5688n5070m4704l7061l2601k9524k5952k1701
$$ y = [1780530, 1827989, 1879355, 1935773, 1997832, 2065259, 2137869, 2216474, 2302494, 2396645, 2498351, 2607000, 2723831, 2851878, 2993457, 3148126, 3313747, 3489015, 3673870, 3867630, 4068186, 4273556, 4483138, 4696513, 4911667, 5125028, 5332536, 5529745, 5711560, 5873366, 6012675, 6128904, 6221482, 6289271, 6332184, 6352481, 6353800, 6339504, 6312655, 6276903, 6236249, 6193834, 6151857, 6112698, 6079033, 6052169, 6030792, 6011851, 5991990, 5967424, 5933286, 5884721, 5819093, 5736322, 5636903, 5520428, 5386430, 5235781, 5070777, 4894440, 4710302, 4522204, 4333600, 4147357, 3966500, 3794214, 3632292, 3480455, 3338486, 3208597, 3094125, 2995791, 2910696, 2835580, 2769892, 2714822, 2670118, 2633057, 2600456, 2570932, 2544980, 2523279]
50722B523279j8144j6611j7145j8739k0479k1857k2260k1198j9506j9317k1848
50711B306175k5820k9021l0968l2906l5466l7683l8521l8215l7481l6299l4161
50700A929634l1142k8036k5474k3337k1105j8437j5380j2094q590m820q92L028
50688A743355P011J1317J5991K0886K5998L1338L6391M0426M3786M8134N4694
50677B079327O2591O9740P5184P9800Q4767R0204R5534J00401J04761J08463J11234
50666C062006J12958J13642J13110J11003J07103J01587R4746Q6506P6404O4099
50656D043164M9701L3471J5760k260j8183k9781l6862m0890m2662m1430l6712
50645C893316k9884k3017j6976j1588p006l791k212k575n870j2778k2244l2438
$$ y = [2523279, 2505135, 2488524, 2471379, 2452640, 2432161, 2410304, 2388044, 2366846, 2347340, 2328023, 2306175, 2280355, 2251334, 2220366, 2187460, 2151994, 2114311, 2075790, 2037575, 2000094, 1963795, 1929634, 1898492, 1870456, 1844982, 1821645, 1800540, 1782103, 1766723, 1754629, 1746039, 1741219, 1740327, 1743355, 1750366, 1761683, 1777674, 1798560, 1824558, 1855896, 1892287, 1932713, 1976499, 2024633, 2079327, 2141918, 2211658, 2286842, 2366642, 2451409, 2541613, 2637147, 2737548, 2842309, 2950772, 3062006, 3174964, 3288606, 3401716, 3512719, 3619822, 3721409, 3816155, 3902661, 3979065, 4043164, 4092865, 4126336, 4142096, 4139836, 4121653, 4091872, 4055010, 4014120, 3971458, 3930028, 3893316, 3863432, 3840415, 3823439, 3811851, 3804845, 3801054, 3798842, 3796267, 3790397, 3777619, 3755375, 3722937]
50633C722937m3119n5494o9271q1378q8621r0706q9626q6878q2584p6863p0462
50622B887935o3534n5079m4485l2941k2327j2919l358P019J6939K5052L1987L9192
50610B773481M6234N0784N1584N0056M8393M7204M5795M3686M0881L7530L4391
50599C270019L2966L3880L5608L6098L5332L4980L5691L6314L6027L5893L7573
50588C660381M1366M6171N0745N4555N7844O1288O5196O8952P1632P3128P3876
50577D325134P3542P0914O5436N7977M9638M0624L0920K1382J3169O248r83j0597
50565D743404k3778m0073n7327p2446q2731q6847q4923p8172o8465n7628m6706
50554D044308l5889k5184j4891n522K229P374R041P244K835l562j2138k3247l6581
$$ y = [3722937, 3679818, 3624324, 3555053, 3473675, 3385054, 3294348, 3204722, 3117844, 3035260, 2958397, 2887935, 2824401, 2769322, 2724837, 2691896, 2669569, 2656650, 2653292, 2660311, 2677250, 2702302, 2734289, 2773481, 2819715, 2870499, 2922083, 2972139, 3020532, 3067736, 3113531, 3157217, 3198098, 3235628, 3270019, 3302985, 3336865, 3372473, 3408571, 3443903, 3478883, 3514574, 3550888, 3586915, 3622808, 3660381, 3701747, 3747918, 3798663, 3853218, 3911062, 3972350, 4037546, 4106498, 4178130, 4251258, 4325134, 4398676, 4469590, 4535026, 4593003, 4642641, 4683265, 4714185, 4735567, 4748736, 4754984, 4754001, 4743404, 4719626, 4679553, 4622226, 4549780, 4467049, 4380202, 4295279, 4217107, 4148642, 4091014, 4044308, 4008419, 3983235, 3968344, 3962822, 3965051, 3972425, 3981466, 3988710, 3991545, 3987983, 3975845, 3952598, 3916017]
50541C916017n1229o6032p9653r0806r8936j04434j07867j09310j08780j06816
50531B992154j04056j00392r5115q7973p9765p1804o4958n9193n3936m8799m3938
50520B182225l9622l5646l1396k6465k0960j5267r837n134j358J736M460O722
50508B009458Q564J0968J5224K1211K7142L1569L4950L8611M2815M6722M9999
50497B337233N3420N7770O2818O7693P1810P5164P7936Q0030Q1058Q0792P9805
50486C125529P9404Q0569Q3013Q5724Q8507R2497R8892J07395J16478J25006J33251
50475D216265J42180J52205J62979J74056J85183J95935K05558K13408K19271
50466E867040K23133K24894K24486K21910K16903K08818J96965J80897J60335
$$ y = [3916017, 3864788, 3798756, 3719103, 3628297, 3529361, 3424927, 3317060, 3207750, 3098970, 2992154, 2888098, 2787706, 2692591, 2604618, 2524853, 2453049, 2388091, 2328898, 2274962, 2226163, 2182225, 2142603, 2106957, 2075561, 2049096, 2028136, 2012869, 2003032, 1997898, 1996540, 1998276, 2002736, 2009458, 2018022, 2028990, 2044214, 2065425, 2092567, 2124136, 2159086, 2197697, 2240512, 2287234, 2337233, 2390653, 2448423, 2511241, 2578934, 2650744, 2725908, 2803844, 2883874, 2964932, 3045724, 3125529, 3204933, 3285502, 3368515, 3454239, 3542746, 3635243, 3734135, 3841530, 3958008, 4083014, 4216265, 4358445, 4510650, 4673629, 4847685, 5032868, 5228803, 5434361, 5647769, 5867040, 6090173, 6315067, 6539553, 6761463, 6978366, 7187184, 7384149, 7565046, 7725381]
50457G725381J35204J06067P4073M0281N354k9901o4355r7187j27985j55620j77735
50446G433577j92260j99066j99458j94445j84402j69898j51692j30058j05192
50437E907106p8384n1766k6779l673J7227L4473M5808M9058M2980K8060O337k0227
50425E950220n0782q4154j17125j45903j69113j87615k01418k08974k10126k07543
50415D367467k03859j98956j91403j81209j69563j57089j44091j31757j21295
50406B868245j12255j03216r3872q5033p6902o8856o0773n3158m5837l8020k9949
50395B100374k2997j7753j3235q728n214l930m193l848j649J728N064Q104J1101
50382B044824J3426J3632J1220P772N644N668O823Q133R989J3301J8069K3378
$$ y = [7725381, 7860585, 7966652, 8040725, 8081006, 8086360, 8056459, 7992104, 7894917, 7766932, 7611312, 7433577, 7241317, 7042251, 6842793, 6648348, 6463946, 6294048, 6142356, 6012298, 5907106, 5828722, 5776956, 5750177, 5746504, 5763731, 5798204, 5844012, 5893070, 5936050, 5964110, 5970447, 5950220, 5899438, 5815284, 5698159, 5552256, 5383143, 5195528, 4994110, 4785136, 4575010, 4367467, 4163608, 3964652, 3773249, 3592040, 3422477, 3265388, 3121297, 2989540, 2868245, 2755990, 2652774, 2558902, 2473869, 2396967, 2328111, 2267338, 2214180, 2168343, 2130323, 2100374, 2077377, 2059624, 2046389, 2037661, 2032447, 2028517, 2024324, 2020476, 2018827, 2020555, 2025619, 2033723, 2044824, 2058250, 2071882, 2083102, 2090874, 2096518, 2102186, 2109009, 2117142, 2127131, 2140432, 2158501, 2181879]
50370B181879K8279L2287L5536L8930M3582M9477N5199N9610O3281O7562P2700
50359B728322P7701Q1790Q5218Q8910R3939J00927J09060J15957J19640J20579
50349C722043J20867J21368J20730J17319J11039J02809R3177Q2134O9624N5570
50339D716680L9619K1524J704j8831l9147n8808p7719r5539j11206j23160j30198
50328D124919j32040j29019j21596j10560r7404q3842p0843n8291m5450l1683
50318C244191j7162l383P439J4107J7374J8566J7560J2831L396j0060k5868m2413
50306C236578n8231p1944q2643r0208r5068r7722r8407r7040r3779q9812q6895
50295B274829q5456q3679p9510p3193o6696o0871n4686m7520m0697l5766l2288
$$ y = [2181879, 2210158, 2242445, 2277981, 2316911, 2360493, 2409970, 2465169, 2524779, 2588060, 2655622, 2728322, 2806023, 2887813, 2973031, 3061941, 3155880, 3256807, 3365867, 3481824, 3601464, 3722043, 3842910, 3964278, 4085008, 4202327, 4313366, 4416175, 4509352, 4591486, 4661110, 4716680, 4756299, 4777823, 4779527, 4760696, 4721549, 4662741, 4585022, 4489483, 4378277, 4255117, 4124919, 3992879, 3863860, 3742264, 3631704, 3534300, 3450458, 3379615, 3321324, 3275874, 3244191, 3227029, 3223646, 3231085, 3245192, 3262566, 3281132, 3298692, 3311523, 3314919, 3304859, 3278991, 3236578, 3178347, 3106403, 3023760, 2933552, 2838484, 2740762, 2642355, 2545315, 2451536, 2361724, 2274829, 2189373, 2105694, 2026184, 1952991, 1886295, 1825424, 1770738, 1723218, 1682521, 1646755, 1614467]
50284A614467k8408k3168j7401j2556r307p177n038k072J441M432O276P334P962
50271A536785P588N330J290l335p271r867j0936j0583r309p864o691n590l994
50258A475553j594J331M126O372Q209J0033J2009J4087J6258J8325J9643J9807
50246A604159J9627K0458K2178K2662K0235J6073J3057J2379J2451J1370R293
50235A783942P662O989O393N010K854L89j853l182l058j824m85N46J922M452Q283
50220A818040J3138J8543K3665K8117L3470M1986N2013N5910M5622K1209p782
50209B143931l0089m0847m2251l8892l4041k9065k4191j9485j5594j3067j0940
50198A845469p260j830K961N112N635O798Q996J1137J3215J6385K0674K4691K7729
$$ y = [1614467, 1586059, 1562891, 1545490, 1532934, 1523627, 1516450, 1511412, 1509340, 1510781, 1515213, 1521489, 1528823, 1536785, 1544373, 1549703, 1550993, 1547658, 1540387, 1530520, 1519584, 1509001, 1499692, 1491828, 1485137, 1479547, 1475553, 1473959, 1475290, 1479416, 1485788, 1493997, 1504030, 1516039, 1530126, 1546384, 1564709, 1584352, 1604159, 1623786, 1644244, 1666422, 1689084, 1709319, 1725392, 1738449, 1750828, 1763279, 1774649, 1783942, 1791604, 1798593, 1804986, 1809996, 1812850, 1813239, 1811386, 1808204, 1805146, 1803322, 1802837, 1803383, 1805305, 1809757, 1818040, 1831178, 1849721, 1873386, 1901503, 1934973, 1976959, 2028972, 2084882, 2130504, 2151713, 2143931, 2113842, 2072995, 2030744, 1991852, 1957811, 1928746, 1904555, 1885070, 1869476, 1856409, 1845469, 1838209, 1836379, 1839340, 1844452, 1850087, 1856885, 1865881, 1877018, 1890233, 1906618, 1927292, 1951983, 1979712]
50185A979712L0544L3774L7083M0113M2906M4877M4610M1373L6017L0124K4975
50174B386108K1326J9271J7988J6383J3923J0167M000n263j6404k7462l8242m9841
50162B351954o1587p0636p5315p6958p7442p6603p3309o7649o0593n2774m4988
50151A614100l8943l5956l5482l6084l7131l8385l8829l7498l5065l3032l1582
50140A216113k9590k6615k3614k1484k0089j8845j7450j5860j4256j3123j2703
50129A002484j2472j1764j0739r957r285q216p134p086p999q254o612l766j346
50116H97854M0J073K307L439M033M293M651M975M804M365M704O436Q928J1153
50102I63055J3031J5072J7075J8179J8291J8431J9414K1078K3102K5531K7966
$$ y = [1979712, 2010256, 2044030, 2081113, 2121226, 2164132, 2209009, 2253619, 2294992, 2331009, 2361133, 2386108, 2407434, 2426705, 2444693, 2461076, 2474999, 2485166, 2489166, 2483903, 2467499, 2440037, 2401795, 2351954, 2290367, 2219731, 2144416, 2067458, 1990016, 1913413, 1840104, 1772455, 1711862, 1659088, 1614100, 1575157, 1539201, 1503719, 1467635, 1430504, 1392119, 1353290, 1315792, 1280727, 1247695, 1216113, 1186523, 1159908, 1136294, 1114810, 1094721, 1075876, 1058426, 1042566, 1028310, 1015187, 1002484, 990012, 978248, 967509, 957552, 948267, 940051, 932917, 925831, 917832, 909578, 902966, 899200, 897854, 897894, 898967, 901274, 904713, 908746, 913039, 917690, 922665, 927469, 931834, 936538, 942974, 951902, 963055, 976086, 991158, 1008233, 1026412, 1044703, 1063134, 1082548, 1103626, 1126728, 1152259, 1180225]
50091A180225K9295K9105K8523K8711K9274K9229K8932K9661L1448L2732L2394
50080A509529L1222L0986L2777L6580M1740M7416N2887N7949O3006O8680P5396
50069B048168Q3215R1776J00273J07670J13123J16283J17227J15993J12280J05999
50059C112007R8347R1752Q7933Q6253Q4688Q2035P8066P1735O0897M4460K3520
50048C921693j24k5219n0012p1447q7162r7667j05247j11012j14243j14256j11730
50037C033574j08070j04293j00469r5831q9759q3088p7752p4523p1927o8246o3680
50026B095936n9429n5565n1363m7100m3869m1774l9773l7241l4449l1662k8962
50015A624749k6659k4658k1934j8126j5058j4674j5746j4908j1137o951m701l990
$$ y = [1180225, 1209520, 1238625, 1267148, 1295859, 1325133, 1354362, 1383294, 1412955, 1444403, 1477135, 1509529, 1540751, 1571737, 1604514, 1641094, 1682834, 1730250, 1783137, 1841086, 1904092, 1972772, 2048168, 2131383, 2223159, 2323432, 2431102, 2544225, 2660508, 2777735, 2893728, 3006008, 3112007, 3210354, 3302106, 3390039, 3476292, 3560980, 3643015, 3721081, 3792816, 3853713, 3898173, 3921693, 3921569, 3896350, 3846338, 3774891, 3687729, 3590062, 3484815, 3373803, 3259560, 3145304, 3033574, 2925504, 2821211, 2720742, 2624911, 2535152, 2452064, 2374312, 2299789, 2227862, 2159616, 2095936, 2036507, 1980942, 1929579, 1882479, 1838610, 1796836, 1757063, 1719822, 1685373, 1653711, 1624749, 1598090, 1573432, 1551498, 1533372, 1518314, 1503640, 1487894, 1472986, 1461849, 1454898, 1450197, 1446207]
50003A446207l495k961k070M32M510P382O397K425j367l337m248n097n989o888
49989A431901p799q151p456o569o945q568r918j0178j0226j1013j2065j2139j0656
49976A310218p998n018k651j487j213q32L08K019L868N816P891R760J1132J2384
$$ y = [1446207, 1442712, 1439751, 1437681, 1438113, 1442623, 1450005, 1456402, 1458827, 1457460, 1454123, 1449875, 1444778, 1438789, 1431901, 1424102, 1415951, 1408495, 1401926, 1394981, 1386413, 1376495, 1366317, 1356091, 1345078, 1333013, 1320874, 1310218, 1302220, 1297202, 1294551, 1293064, 1291851, 1291019, 1291327, 1293346, 1297214, 1303030, 1310921, 1320681, 1331813, 1344197]
$$ [...]
##END NTUPLES=NMR SPECTRUM
##END=
