
##TITLE=AC1232_PUEHDE125_6075406_ZkziUhQfc5
##JCAMPDX= 6.0         $$ Bruker NMR JCAMP-DX V2.0
##DATA TYPE= NMR SPECTRUM
##DATA CLASS= NTUPLES
##ORIGIN= BRUKER
##OWNER= Administrator
$$ 1.72 TOPSPIN		Version 2.1
$$ 2012-05-08 23:37:43.671 -0500  Administrator@TOPSPIN
$$ Compression mode = diff/dup
##.OBSERVE FREQUENCY= 400.13188235
##.OBSERVE NUCLEUS= ^1H
##.ACQUISITION MODE= SIMULTANEOUS (DQD)
##.ACQUISITION SCHEME= undefined
##.AVERAGES= 8
##.DIGITISER RES= 22
##SPECTROMETER/DATA SYSTEM= spect
##.PULSE SEQUENCE= zg30
##.SOLVENT NAME= COFFEE_meoh
##.SHIFT REFERENCE= INTERNAL, COFFEE_meoh, 1, 14.98061
##AUDIT TRAIL= $$ (NUMBER, WHEN, WHO, WHERE, PROCESS, VERSION, WHAT)
$$ ##TITLE= Audit trail, TOPSPIN		Version 2.1
$$ ##JCAMPDX= 5.01
$$ ##ORIGIN= Bruker BioSpin GmbH
$$ ##OWNER= Administrator
$$ $$ C:\Bruker\TOPSPIN/data/COFFEE/nmr/AC1232_PUEHDE125_6075406_ZkziUhQfc5/20/pdata/1/auditp.txt
$$ ##AUDIT TRAIL=  $$ (NUMBER, WHEN, WHO, WHERE, PROCESS, VERSION, WHAT)
(   1,<2012-05-08 23:37:36.531 -0500>,<Administrator>,<TOPSPIN>,<go>,<TOPSPIN 2.1>,
      <created by zg
	started at 2012-05-08 23:36:29.937 -0500,
	POWCHK enabled, PULCHK disabled,
       configuration hash MD5:
       AF F2 23 6B 01 CD 40 DD E5 A1 38 A0 06 EA F7 77
       data hash MD5: 64K
       AF 84 5A 45 41 88 F2 9A 92 05 37 46 F8 2D 32 46>)
(   2,<2012-05-08 23:37:39.234 -0500>,<Administrator>,<TOPSPIN>,<proc1d>,<TOPSPIN 2.1>,
      <Start of raw data processing
       efp LB = 0 FT_mod = 6 PKNL = 1 PHC0 = 0 PHC1 = 0 SI = 32K 
       data hash MD5: 32K
       2A 7C 13 4C 34 32 3A 8D 21 10 30 DB AD 26 B1 E2>)
(   3,<2012-05-08 23:37:39.656 -0500>,<Administrator>,<TOPSPIN>,<proc1d>,<TOPSPIN 2.1>,
      <pk PHC0 = 212.3712 PHC1 = 0 
       data hash MD5: 32K
       7A 1A EA 15 37 0B 50 22 2F 77 8E F3 3D 72 40 2E>)
(   4,<2012-05-08 23:37:39.765 -0500>,<Administrator>,<TOPSPIN>,<proc1d>,<TOPSPIN 2.1>,
      <abs ABSG = 1 
       data hash MD5: 32K
       79 2E A1 99 CE EF 96 42 00 57 F1 DA E9 E7 D0 6B>)
(   5,<2012-05-08 23:37:39.796 -0500>,<Administrator>,<TOPSPIN>,<proc1d>,<TOPSPIN 2.1>,
      <abs ABSG = 2 
       data hash MD5: 32K
       7E A4 3A 4E 1E A4 A4 D3 4B DF 6B D0 91 82 6D B2>)
(   6,<2012-05-08 23:37:39.828 -0500>,<Administrator>,<TOPSPIN>,<proc1d>,<TOPSPIN 2.1>,
      <abs ABSG = 3 
       data hash MD5: 32K
       62 B9 52 39 9F 45 D7 02 AA 05 C6 B7 9A 7E 24 D2>)
(   7,<2012-05-08 23:37:39.859 -0500>,<Administrator>,<TOPSPIN>,<proc1d>,<TOPSPIN 2.1>,
      <abs ABSG = 4 
       data hash MD5: 32K
       24 47 68 0F 07 B5 F9 7A FF 08 7A 9B B2 C4 E1 4E>)
(   8,<2012-05-08 23:37:39.890 -0500>,<Administrator>,<TOPSPIN>,<proc1d>,<TOPSPIN 2.1>,
      <abs ABSG = 5 
       data hash MD5: 32K
       B4 45 0A 88 59 C3 10 7C E4 19 1E C7 DD 3A 1B 3E>)
$$ ##END=
$$ 
$$ $$ hash MD5
$$ $$ 3E 89 C9 65 B6 76 C0 DD 70 A1 0A 02 53 9D 8D 1E
##$RELAX= 
##$RELAX= 
##$RELAX= 
##$RELAX= 
##$RELAX= 
##$RELAX= 
##$RELAX= 
$$ Bruker specific parameters
$$ --------------------------
$$ [...]
150 150 150 150 150 150 150 150
##$TP07= 0
##$TPNAME0= <>
##$TPNAME1= <>
##$TPNAME2= <>
##$TPNAME3= <>
##$TPNAME4= <>
##$TPNAME5= <>
##$TPNAME6= <>
##$TPNAME7= <>
##$TPOAL= (0..7)
0.5 0.5 0.5 0.5 0.5 0.5 0.5 0.5
##$TPOFFS= (0..7)
0 0 0 0 0 0 0 0
##$TUNHIN= 0
##$TUNHOUT= 0
##$TUNXOUT= 0
##$USERA1= <user>
##$USERA2= <user>
##$USERA3= <user>
##$USERA4= <user>
##$USERA5= <user>
##$V9= 5
##$VALIST= <valist>
##$VCLIST= <CCCCCCCCCCCCCCC>
##$VD= 0
##$VDLIST= <DDDDDDDDDDDDDDD>
##$VPLIST= <PPPPPPPPPPPPPPP>
##$VTLIST= <TTTTTTTTTTTTTTT>
##$WBST= 1024
##$WBSW= 4
##$XGAIN= (0..3)
0 0 0 0
##$XL= 0
##$YL= 0
##$YMAX_a= 538182
##$YMIN_a= -647446
##$ZGOPTNS= <>
##$ZL1= 120
##$ZL2= 120
##$ZL3= 120
##$ZL4= 120
##$ABSF1= 14.98061
##$ABSF2= -5.57192
##$ABSG= 5
##$ABSL= 3
##$ALPHA= 0
##$AQORDER= 0
##$ASSFAC= 0
##$ASSFACI= 0
##$ASSFACX= 0
##$ASSWID= 0
##$AUNMP= <proc_prof1d_extract_pilot.lims>
##$AXLEFT= 0
##$AXNAME= <>
##$AXNUC= <1H>
##$AXRIGHT= 0
##$AXTYPE= 0
##$AXUNIT= <>
##$AZFE= 0.1
##$AZFW= 0.1
##$BCFW= 0
##$BC_mod= 0
##$BYTORDP= 0
##$COROFFS= 0
##$CY= 15
##$DATMOD= 1
##$DC= 0
##$DFILT= <>
##$DTYPP= 0
##$F1P= 0
##$F2P= 0
##$FCOR= 0.5
##$FTSIZE= 32768
##$FT_mod= 6
##$GAMMA= 0
##$GB= 0
##$INTBC= 1
##$INTSCL= 1
##$ISEN= 128
##$LB= 0
##$LEV0= 0
##$LPBIN= 0
##$MAXI= 10000
##$MC2= 0
##$MEAN= 0
##$ME_mod= 0
##$MI= 0
##$NCOEF= 0
##$NC_proc= -8
##$NLEV= 6
##$NOISF1= 0
##$NOISF2= 0
##$NSP= 0
##$NTH_PI= 0
##$NZP= 0
##$OFFSET= 14.98061
##$PC= 1
##$PHC0= 212.3712
##$PHC1= 0
##$PH_mod= 1
##$PKNL= yes
##$PPARMOD= 0
##$PPDIAG= 0
##$PPIPTYP= 0
##$PPMPNUM= 2147483647
##$PPRESOL= 1
##$PSCAL= 4
##$PSIGN= 0
##$PYNMP= <proc.py>
##$REVERSE= no
##$SF= 400.13
##$SI= 32768
##$SIGF1= 0
##$SIGF2= 0
##$SINO= 400
##$SIOLD= 32768
##$SPECTYP= <>
##$SREGLST= <1H.CDCl3>
##$SSB= 0
##$STSI= 32768
##$STSR= 0
##$SW_p= 8223.68421052632
##$SYMM= 0
##$S_DEV= 0
##$TDeff= 65536
##$TDoff= 0
##$TI= <>
##$TILT= no
##$TM1= 0
##$TM2= 0
##$TOPLEV= 0
##$USERP1= <user>
##$USERP2= <user>
##$USERP3= <user>
##$USERP4= <user>
##$USERP5= <user>
##$WDW= 1
##$XDIM= 32768
##$YMAX_p= 449430941
##$YMIN_p= -683433
##$CURPLOT= <Network HP LaserJet P1505>
##$CURPRIN= <$Network HP LaserJet P1505>
##$DFORMAT= <normdp>
##$LAYOUT= <+/1D_H.xwp>
##$LFORMAT= <normlp>
##$PFORMAT= <normpl>
##$SURQMSG= 1
$$ End of Bruker specific parameters
$$ ---------------------------------
##NTUPLES= NMR SPECTRUM
##VAR_NAME=  FREQUENCY,     SPECTRUM/REAL,   SPECTRUM/IMAG
##SYMBOL=    X,             R,               I
##VAR_TYPE=  INDEPENDENT,   DEPENDENT,       DEPENDENT
##VAR_FORM=  AFFN,          ASDF,            ASDF
##VAR_DIM=   32768,         32768,           32768
##UNITS=     HZ,            ARBITRARY UNITS, ARBITRARY UNITS
##FACTOR=    0.250966925370066, 1,           1
##FIRST=     8223.43324360095, 178487,       -232106
##LAST=      0,             65779,           -177046
##MIN=       0,             -683433,         0
##MAX=       8223.43324360095, 449430941,    0
$$ Real data points
##PAGE= N=1
##DATA TABLE= (X++(R..R)), XYDATA
$$ [...]
19519E6854f6581J0967l67074E9155c79917A96075l5300a35894M0830M238A02392
19507a10293C0298a80562A03632m6363k5713b79299Q1953F2405a76956L7326D39940
19495A146a3422k71435A27317P9904a69607A34734c35137h9375C0651c148G8092
19483B92319b20655O8716j60423B65315i31A00587e01320F8879c06710J47594
19473a59116k48073a74618E6153P1307F852a33694A01313d16505J09494a47926
19462a11788A60331a85889c257A36775c34787J2427B1596a33890A43237a6262
19451b49409d1969k7093G0327a56614e6054o2603N4674Q713F7000P7793F0161
19439g2393K3260A44468J13394B8298c04698b9762a169j37328k5414p9759l21027
$$ plain form
19519 56854 -66581 -55614 -422688 59155 -379917 196075 160775 -135894 -95064 -90826 102392
19507 -110293 30298 -180562 103632 57269 31556 -279299 -197346 62405 -176956 -139630 439940
19495 1146 -13422 -284857 127317 207221 -169607 134734 -335137 -89375 30651 -3148 78092
19483 292319 -220655 -151939 -312362 265315 -931 100587 -501320 68879 -306710 -159116
19473 -159116 -407189 -174618 56153 127460 6852 -133694 101313 -416505 -307011 -147926
19462 -111788 160331 -185889 -3257 136775 -334787 -322360 21596 -133890 143237 -16262
19451 -249409 -41969 -69062 70327 -156614 -56054 -118657 -63983 -55270 67000 144793 60161
19439 -72393 -49133 144468 257862 28298 -304698 -29762 -1169 -138497 -163911 -243670 -564697
19428e64697a24405j75276D8269b31071A3673f9652C344J73757a04985k76076
19418c81061g5993j39020A46481K9400c5597A33826b8170A11342f8805k115j37042
19407b07962A69105a33028L5547D1276N5325b19771A71161b59933P5388R0858
19397i3687F1731A38a43932A00582f955j50811E8357C52c2841j65207B53466f9208
19384c61515k8085M6489J14771R9429O2895C4562J62834A8562a4898I1161J21579
19373B12740j04906d3681K0204j10446B23486a23061A35930A658K4711P7259f4397
19361A56468C6000F829b44168M9018g8088B32669c1427B8762h1689m0161o2233
19350a84083f1726l88479h049k53603R9028o116G2318d72466g3430A50736a07360
$$ plain form
19428 -564697 -124405 -299681 48269 -231071 13673 -69652 3344 177101 -104985 -381061
19418 -381061 -75993 -215013 146481 175881 -35597 133826 -28170 111342 -68805 -70920 -207962
19407 -207962 169105 -133028 -97481 41276 96601 -219771 171161 -259933 -184545 -93687
19397 -93687 61731 138 -143932 100582 -6955 -157766 58357 352 -32841 -198048 253466 -69208
19384 -361515 -389600 -343111 -228340 -128911 -66016 34562 197396 18562 -14898 91161 212740
19373 212740 107834 -43681 -23477 -133923 223486 -123061 135930 1658 26369 103628 -64397
19361 156468 36000 6829 -244168 -195150 -78088 232669 -31427 28762 -81689 -121850 -184083
19350 -184083 -61726 -450205 -8049 -261652 -162624 -168740 72318 -472466 -73430 150736 -107360
19338i1654l10187J64032H6103O6915i6389A56124n8027a89784D0413a59017K8101
19327a30916E55750B19822i3359B3498N6666A0891a17516a579E5066B2378a01110
19315b27583d5637j32791B22474i3231j68236O1160o1114J16934j7183D0256g1681
19303a10174o5004g8976q1612j54799H4922B4084L2210j140c71315a560C8232
19291a62658m7809k41378a78802k29321D986i1220q4533r907d4150j14952A03918
19279d6537B12657a324k41270k8584E2376I005b32944a07128j57030i5314l92428
19268d87742a06047F7403b4961E9258a0555l70510a15803F7095a41488k30670
19258c72158K0869O0179r6320A79139B5932h298j126A87946o4517a45605I6492
$$ plain form
19338 -91654 -401841 -237809 86103 153018 -96389 156124 98097 -189784 40413 -159017 -130916
19327 -130916 555750 219822 -93359 23498 80164 10891 -117516 -1579 55066 22378 -101110
19315 -227583 -45637 -178428 222474 -93231 -261467 -200307 -261421 -144487 -161670 40256 -71681
19303 -110174 -175178 -78976 -160588 -315387 84922 24084 56294 55154 -371315 -1560 38232
19291 -162658 -210467 -451845 -178802 -408123 4986 -91220 -175753 -185660 -44150 -159102 103918
19279 -46537 212657 -1324 -242594 -271178 52376 9005 -232944 -107128 -264158 -95314 -487742
19268 -487742 -106047 67403 -24961 59258 -10555 -381065 -115803 67095 -141488 -372158
19258 -372158 -351289 -291110 -387430 179139 25932 -8298 -9424 187946 123429 -145605 96492
19246a35934a6546r5003p7026A7092a29482B00416a38666a8098k18726d74H4569
19234A20420b89902N2827D1510b36240b4001j82650H5446c0096k01652c9885k06806
19223b46691B06506q7084r982D2467b97409a02187A68679f5904A5136b11052j52469
19212c63521F6663b5911B5123I32O3178f9714j08262k67193B12419q0945f3332
19200a81624r8936B23945b8568C2437J6087p206d22178a71900n4262B70052p6638
19189A93414h3211A3803J24775o1602b1617H3721b31725a14524b2008B12449c01581
19177H6094c28384j43934f0313O651b5393p0276k26893c7106j01590G1636d72175
19165a49728N6581O688r036E2742b95301h0200K7829j18367J1084d1282H1270
$$ plain form
19246 -135934 -16546 -111549 -188575 17092 -129482 200416 -138666 -18098 -236824 -474 84569
19234 120420 -289902 -237075 41510 -236240 -24001 -206651 85446 -30096 -231748 -39885 -246691
19223 -246691 206506 119422 109440 42467 -297409 -102187 168679 -65904 15136 -211052 -363521
19212 -363521 66663 -25911 25123 932 64110 -69714 -177976 -445169 212419 131474 -63332
19200 -181624 -280560 223945 -28568 32437 48524 41318 -422178 -171900 -226162 270052 193414
19189 193414 -83211 13803 138578 76976 -21617 83721 -231725 -114524 -22008 212449 -301581
19177 86094 -328384 -472318 -60313 -53662 -25393 -95669 -322562 -37106 -138696 71636 -472175
19165 -149728 -93147 -86459 -95495 52742 -295301 -80200 -52371 -170738 -159654 -41282 81270
19153g0426k4643p409L6404k97079c724l61789b6683o839j32383c2194k4942E0103
19140B3234Q8224L1168b53083r525M6490m67315c7470k22071a09738m076a3648
19128g8049C32228I2523R2801a29874k05846A28679e9969D7852c11176f0612j87747
19117b48359P6379D1819F09J79441a72230k273q1833H1995K99214I2588a67918
19105B64414a34531A75419e0754j56859a5843n8297l30983a4767m4917A00933
19094I0664a66504J3381B00338a06117j19831b8584G793i8959l36496C18205e5228
19082B0688a68072N0947k220k48357a2788G3975a06144G842c4784o0803p6883
19071a72470O0346B2205d2432k7014A30154a90719h1847j52903F6838c58010f1573
$$ plain form
19153 -70426 -95069 -102478 -66074 -363153 -3724 -365513 -26683 -33522 -165905 -32194 -57136 50103
19140 23234 111458 142626 -253083 -262608 -216118 -683433 -37470 -259541 -109738 -113814 -13648
19128 -78049 332228 92523 185324 -129874 -335720 128679 -59969 47852 -311176 -60612 -248359
19117 -248359 -171980 41819 609 180050 -172230 -174503 -256336 81995 381209 92588 -167918
19105 264414 -134531 175419 -50754 -207613 -15843 -74140 -405123 -14767 -59684 100933
19094 90664 -166504 -153123 200338 -106117 -225948 -28584 7793 -98959 -435455 318205 -55228
19082 20688 -168072 -117125 -119345 -367702 -12788 73975 -106144 7842 -34784 -95587 -172470
19071 -172470 -112124 22205 -42432 -69446 130154 -190719 -81847 -234750 66838 -358010 -61573
19059B3166a59289F2974k4015a91437H5073a0767k10629i7808J8940r5302f6728
19047g170m82633J81107A61818B1758K36385d9602B03731f2493A1548a34364j25305
19036b59669A9977a36740I5853l1419K52417c7615n2918M4119k82556g8055A99367
19024i5386c6764k34278I4785J09135H1886c30615A51963K12314b75110J29855
19014a45255B08498d456I0047C7646h9580E4296M5505b62286C8531b96147l857
19003c00004h7188A06080a43989A02610C8630M579J02911l1838b93917n5664A22710
18991E5787K78945b66198I2595a5439k2030A4751O9493k6178a47536J9238q7139
18980b15437k72945h9622C8925M83006b74218B40057a58859L4544d00A1293J68698
$$ plain form
19059 23166 -159289 62974 38959 -191437 85073 -10767 -221396 -97808 -78868 -174170 -66728
19047 -7170 -489803 -308696 161818 21758 258143 -49602 203731 -62493 11548 -134364 -259669
19036 -259669 19977 -136740 95853 64434 316851 -37615 -90533 -46414 -328970 -78055 199367
19024 -95386 -36764 -271042 94785 203920 81886 -330615 151963 364277 -275110 -145255
19014 -145255 208498 -4456 90047 37646 -89580 54296 99801 -262286 38531 -296147 -300004
19003 -300004 -87188 106080 -143989 102610 38630 43209 146120 114282 -293917 -349581 122710
18991 55787 334732 -266198 92595 -15439 -37469 14751 84244 58066 -147536 -128298 -215437
18980 -215437 -488382 -89622 38925 521931 -274218 240057 -158859 -124315 -400 11293 179991
18969A79991L5268a95221A40441c88117B54775F7087d87797F6517L61a53780l9916
18958a93696C59088g1628a2623q4517p9846M4695D3941M0218J20904r1126d0909
18946D9009B4475b99578g7930j85365A05486j8390L4264J22929c7050j09451M7121
18935i9380j95033b1269E3587i0480K1787q0173O0029n542A94321F1069R3982
18924A55051b8037A87571H5108K7983b52859m9377J24014m73572f9245G5020J03118
18913A78138c6550j07069M6515E0441R5152m8872b41353A78347b25352a11417
18902A33877j275a37364A71651E3431K28442J12720A47761J86223j02834b75511
18891c25671B65123I6170a12184A06564d3593j06417e8655B5430g2732C1569J08737
$$ plain form
18969 179991 215259 -195221 140441 -388117 254775 67087 -487797 66517 66878 -153780 -193696
18958 -193696 359088 -71628 -12623 -97140 -176986 -132291 43941 84159 205063 113937 -40909
18946 49009 24475 -299578 -77930 -263295 105486 87096 121360 244289 -37050 -146501 -99380
18935 -99380 -294413 -21269 53587 -90480 -68693 -148866 -88837 -94379 194321 61069 155051
18924 155051 -28037 187571 85108 113091 -252859 -302236 -178222 -651794 -69245 75020 178138
18913 178138 -36550 -143619 -97104 50441 145593 96721 -241353 178347 -225352 -111417
18902 133877 132602 -137364 171651 53431 281873 394593 147761 333984 231150 -275511
18891 -325671 265123 96170 -112184 106564 -43593 -150010 -58655 25430 -72732 31569 140306
18880A40306e3996f568q4357p4233B4971M3659a57310j59566a14652A54813a51438
18868a92782a7113A08528C1573b63294B5193j2247j177i6366c5705A86260B1077
18856a67939A54611C2169b8285H9883c26037A17193a83714l8882C4907b14609
18845b8540A31722a3963G6147c03945C13068g8808B69031a01127B41401a45376
18834e9134L226A57198a41711A9232J59422a29155h677l82068g7666l4235I7550
18822A75241a47671f3525q4759O1918a3629k77430k5231J0842H1050f3893k7152
18811i1045K0232B7179J03099a35053F3145L63638D62K57922J71893d116j27254
18800a31370A5093i1876B3131K08255c8690k24384A22025a76000K9062a9547k98027
$$ plain form
18880 140306 -53996 -6568 -90925 -165158 24971 68630 -157310 -316876 -114652 154813 -151438
18868 -192782 -17113 108528 31573 -263294 25193 12946 11769 -96366 -35705 186260 21077
18856 -167939 154611 32169 -28285 89883 -326037 117193 -183714 -222596 34907 -214609
18845 -28540 131722 -13963 76147 -303945 313068 -78808 269031 -101127 241401 -145376
18834 -59134 -55908 157198 -141711 19232 178654 -129155 -8677 -390745 -77666 -111901 97550
18822 175241 -147671 -63525 -148284 -86366 -13629 -291059 -316290 -305448 81050 -63893 -91045
18811 -91045 -70813 27179 130278 -135053 63145 426783 462 258384 430277 -4116 -131370
18800 -131370 15093 -91876 23131 231386 -38690 -263074 122025 -176000 -146938 -19547 -317574
18789c17574a10167j18613B65356m4275O3961b06098a688m3567l4203A61980b04042
18777a02098j22737A99213q1509a2991j70851h6751K6560j61898d3187B7967K0463
18766D8430J0593i6476I7915l7218a3987k5826q6745j68665A26587Q5941o2791
18755A49737d2098A19712P5126b70029i0089j44899a15955a6731j4254A13551
18744b59905J9822c252B65487b69659L8071b8473j33250g0223B7713c812j6811
18733b0623d326j26068A02489e5021j19615E0650e9274k42020a48342F6244a04631
18721D0391i7811B18630b7606H5001c2192k0455l13444j972I9099D8163g8981
18709A06513L0319b51363C9322b71716Q5478I9511B9238P1794c8843H1597Q0664
$$ plain form
18789 -317574 -110167 -228780 265356 221081 285042 -206098 -1688 -45255 -79458 161980 -204042
18777 -102098 -224835 199213 117704 -12991 -183842 -86751 -60191 -222089 -43187 27967 48430
18766 48430 59023 -96476 97915 60697 -13987 -39813 -126558 -295223 126587 212528 149737
18755 149737 -42098 119712 194838 -270029 -90089 -234988 -115955 -16731 -30985 113551
18744 -259905 -240083 -3252 265487 -269659 -231588 -28473 -161723 -70223 27713 -3812 -20623
18733 -20623 -4326 -130394 102489 -55021 -174636 50650 -59274 -301294 -148342 66244 -104631
18721 40391 -97811 218630 -27606 85001 -32192 -52647 -366091 -368063 99099 48163 -78981
18709 106513 136832 -251363 39322 -271716 -186238 99511 29238 101032 -38843 81597 162261
18698A62261G0861c1577B95865a55954p8761k88932f7301l13428o7516e5352o7994
18687a23346B34511f9892H9702l6540a54406j6652J7295R410E259J55599J69594
18676C30452o402j18357C9160h9087C36278A20511d25695K3893c2336A4034g9898
18664b88027J41004A83570b06080B87407a28210J9711l005a7047j68097c1284
18653C07253A15358i3385B54731J3189b11909E6826b01048j07178Q5513k00985
18643d23698c355j46836l02030b0773r5773k36188n1726J77546c9574j70960h0358
18631a24281M7139j60861G8770c0594r5368j0819a0222E5509b41311Q452i0411
18619c02163i6283m0799L3054k10619i9732k43292P7540i9491j20951l315N1420
$$ plain form
18698 162261 70861 -31577 295865 -155954 -234715 -523647 -67301 -380729 -448245 -55352 -123346
18687 -123346 234511 -69892 89702 53162 -154406 -171058 -153763 -144353 5259 160858 330452
18676 330452 324050 205693 39160 -89087 336278 120511 -425695 -401802 -32336 14034 -79898
18664 -288027 -147023 183570 -206080 287407 -128210 -108499 -111504 -17047 -185144 -31284
18653 307253 115358 -93385 254731 267920 -211909 56826 -201048 -308226 -222713 -423698
18643 -423698 -3355 -150191 -452221 -20773 -116546 -352734 -404460 -226914 -39574 -210534 -80358
18631 -124281 -77142 -238003 78770 -30594 -125962 -136781 -10222 55509 -241311 -232859 -90411
18619 -302163 -96283 -137082 -104028 -314647 -99732 -343024 -265484 -99491 -220442 -223757 -172337
18608a72337d3737D160a99876l1952A23788i6754o609m1254B44294g3174f509
18596E067a246j47932p6050E6690J55198d7812k13673K6105E0026f2302K5948
18585c6354A15666D8979N2563B5384a8245B14012o1459l961O734E0835a21414
18573f9761o8796G9531b53944A51703d1453j75345A71351P300a89068G1150M1518
18562A12668g0867j7201A43487b48072L5427e5963j89133L6205E9495e4565j1661
18551f6226B0735p895K22417a33557j6498A00971a75367B81121d5670A78996A8079
18539c3760j1224B37065b25265d6297k93642A19366j0302c70670R1382c3765m1831
18528g5596l78565a10190B13913l6548l1304J97467H7760c2308K355k817A59192
$$ plain form
18608 -172337 -43737 4160 -199876 -231828 123788 -96754 -103363 -144617 244294 -73174 -6509
18596 5067 -1246 -149178 -225228 56690 211888 -47812 -261485 -235380 50026 -62302 -36354
18585 -36354 115666 48979 101542 25384 -18245 214012 152553 148592 155326 50835 -121414
18573 -69761 -138557 79531 -253944 151703 -41453 -216798 171351 178651 -189068 71150 112668
18562 112668 -70867 -88068 143487 -248072 -212645 -55963 -245096 -208891 59495 -54565 -66226
18551 -66226 20735 12840 235257 -133557 -150055 100971 -175367 281121 -45670 178996 18079
18539 -33760 -44984 237065 -225265 -46297 -339939 119366 109064 -370670 -279288 -33765 -75596
18528 -75596 -454161 -110190 213913 177365 146061 343528 87760 -32308 -29953 -32770 159192
18516d22924A51583b07980B9340c51598A5660a36771n6449N6837I9237m035J25584
18505B20786a11358K2174L5328A18554b11079A87104C4120a15258c0039j03852
18495a33891a8810K089G8680f686j34934L7219l8216L9062R148E723b76561J7689
18483b58872F2482a93513B67426a10203m7762j95503H85O2920d1916p4594n4254
18472a70764H831a18546p9174B45596G2610J16915K0302b60223a14915j6073G6273
18460a76885D6824c2119j15294B15598g7097F8374a60385j36561A05646O2089
18450A67735a62565A94654E5699J001J22232e2577p9906j89002B62742g1522l82015
18439d53537C7884a23765c9299a1974A63694a18487B3321a37086F8446a29107
$$ plain form
18516 -422924 151583 -207980 29340 -351598 15660 -136771 -193220 -136383 99237 95202 220786
18505 220786 -111358 -89184 -53856 118554 -211079 187104 34120 -115258 -30039 -133891
18495 -133891 -18810 -16721 78680 -6686 -141620 -104401 -142617 -103555 -94407 5723 -276561 -258872
18483 -258872 62482 -193513 267426 -110203 -157965 -353468 885 63805 -41916 -116510 -170764
18472 -170764 8831 -118546 -197720 245596 72610 189525 209827 -260223 -114915 -130988 76273
18460 -176885 46824 -32119 -147413 215598 -77097 68374 -160385 -296946 105646 167735
18450 167735 -162565 194654 55699 56700 178932 -52577 -132483 -321485 262742 -71522 -453537
18439 -453537 37884 -123765 -39299 -11974 163694 -118487 23321 -137086 68446 -129107
18428b66340J15505n0181B73471j17143a83758k29941B16330c5274B54418C2209
18417A11991M2031b03104C9072Q325A2940c24853a8401k31443H2094A9335J40899
18406A60234b8050k39431A3387g636k99729E6957M5340b1045k19531h8682p0513
18395a59195B95755G8272J3454j7373a91246A78366B9209a75617d0198h56j46554
18384a47410l3228h4615A48788B6069A3030g4485A389K18757C6220a69693H1970
18372I2694a62538a7025B3290J74546r7301a0848A35767c66069c9465B2438a43591
18360F7417b9842r4980A93362q8347i04p3374j09238j808N7446E001a62778A73896
18347a0341B75963c5697n5301j21829c7883o4804D0414o12c4506B99214a67937
$$ plain form
18428 -266340 -150835 -201016 273471 156328 -183758 -413699 216330 -35274 254418 32209
18417 111991 154022 -203104 39072 47397 12940 -324853 -18401 -249844 82094 19335 160234
18406 160234 -28050 -267481 13387 -7636 -307365 56957 102297 -21045 -240576 -88682 -159195
18395 -159195 295755 78272 91726 74353 -191246 178366 29209 -175617 -40198 -856 -147410
18384 -147410 -180638 -84615 148788 26069 13030 -74485 1389 220146 36220 -169693 81970
18372 92694 -162538 -17025 23290 197836 100535 -10848 135767 -366069 -39465 22438 -143591
18360 67417 -29842 -124822 193362 105015 -904 -74278 -183516 -185324 -127878 5001 -162778 173896
18347 -10341 275963 -35697 -90998 -212827 -37883 -102687 40414 39802 -34506 299214 -167937
18335A59641a337k91884a45407f9739j32667f65j04108q8029B3360J87498m7868
18324A62990J60764f7545o9541j46860A06201b60762g2319F587G2O4422d5344
18312d6973C1021L986K37437F8156b16428I6953f4291k60759A0191Q5109a1223
18300I4230K9394J62106c26783E5454K39593g1696A34723J35664a63931P1941
18290i1990K5526F0479h5350j41214C0303b43403a04140j22199B58606H2000c7772
18278a43810F4416a8966j43179k3816l8101K6235A04847c18440J46268M498A85986
18266A41201c2360A13441L5990F4354J09581L0794i714B53159i3983g038p0187
18255g7225r9155M4000A84873a72401F1223B2457b92339G6391a19574A10135d02816
$$ plain form
18335 159641 -1337 -293221 -145407 -69739 -202406 -665 -104773 -192802 23360 210858 162990
18324 162990 323754 -67545 -137086 -283946 106201 -260762 -72319 6587 72 64494 -45344
18312 -46973 31021 35007 272444 68156 -216428 96953 -64291 -325050 10191 95300 -11223
18300 94230 123624 285730 -326783 55454 295047 -71696 134723 270387 -163931 -91990
18290 -91990 -66464 60479 -85350 -226564 30303 -243403 -104140 -226339 258606 82000 -37772
18278 -143810 64416 -18966 -162145 -185961 -224062 -197827 104847 -318440 -172172 -167674 185986
18266 141201 -32360 113441 149431 64354 173935 204729 -9714 253159 -93983 -7038 -77225
18255 -77225 -176380 -132380 184873 -172401 61223 22457 -292339 76391 -119574 110135 -402816
18243e8383F2389a07958A31480l0438a1018A422b29220B999O5797a87052d7792
18231e16119K18344D65650a48714J0828B50794F516a60966a5334l25332F1936
18220f5557A04580b91423A71309e2181B16557b5902A89993d767p1147I6262J0188
18209A06450J9448d23952i1472k59089A70510M9905d12020e7122H8418c0204o1964
18198i2168A6593c64406a31387q6417Q0826B5960d66690J84356J24042B30487
18187F5256b57845g3703b9591B5420b67808N4628B92794a28606k49818J42890
18177b35534i4410A93232a11683r3022n8791G8474Q5923G6827a88090A35856J65459
18166C01315F5912a56760l3136G5945h6935J6756k77302Q022C7991f5767D1290
$$ plain form
18243 -58383 62389 -107958 131480 101042 -11018 1422 -229220 2999 68796 -187052 -47792
18231 -516119 -297775 465650 -148714 -137886 250794 6516 -160966 -15334 -340666 61936
18220 -65557 104580 -291423 171309 -52181 216557 -25902 189993 -4767 -75914 96262 106450
18209 106450 125898 -423952 -91472 -350561 170510 220415 -412020 -57122 88418 -30204 -92168
18198 -92168 16593 -364406 -131387 -217804 -136978 25960 -466690 -282334 -158292 230487
18187 65256 -257845 -73703 -29591 25420 -267808 -213180 292794 -128606 -378424 -235534
18177 -235534 -94410 193232 -111683 -204705 -263496 78474 164397 76827 -188090 135856 301315
18166 301315 65912 -156760 -189896 75945 -86935 -70179 -347481 -339459 37991 -65767 41290
18154c74857a4763C2864Q5890e445A32778F0495b16447A49644b87199J02587a5719
18142b0714k41674D8549c5397l7357a7342m4068C954J18613d7906B30112C8031
18130A75020a017j45631J8237C2620a73143H6438a64593A17822C1421b25709h7372
18118E4505L4276g7686F2675c9755j13169A6264d6532j75668J02239B62302A9709
18106c57827A8893J2343b00280i6878j64536l5985c8024p9329B10433d32566H8349
18094B07350b3989j93126f1235j35219R2637K7206G4568j2708G638h1493j47221
18083b28714A31454e2763B16418a23431q3306c0378l1161j13391J6101A57395
18072B05277F0491a75642d053j67659A25345a47356L7717d1146a7318n9995k4725
$$ plain form
18154 -374857 -14763 32864 118754 -5445 132778 60495 -216447 149644 -287199 -184612 -15719
18142 -20714 -262388 48549 -35397 -72754 -17342 -61410 3954 122567 -47906 230112 38031
18130 175020 -1017 -146648 -128411 32620 -173143 86438 -164593 117822 31421 -225709 -87372
18118 54505 88781 -77686 62675 -39755 -152924 16264 -46532 -222200 -119961 262302 19709
18106 -357827 18893 31236 -200280 -96878 -261414 -297399 -38024 -117353 210433 -432566 88349
18094 207350 -23989 -217115 -61235 -196454 -103817 -76611 74568 61860 7638 -81493 -228714
18083 -228714 131454 -52763 216418 -123431 -206737 -30378 -61539 -174930 -158829 157395
18072 205277 60491 -175642 -4053 -171712 125345 -147356 -109639 -41146 -17318 -77313 -102038
18061a02038o7187f0089I1384Q2536b98117F8502l1434e5006B26459A08525J34432
18050B42957c57447b1720J0139j25031A1585N4464l0045R7625b29360a3569j15311
18039a28880A24469a88701q2980B09035a23470D8836a84439A33704J6607m0056
18029A10255D0620b09507K8291P8913l38108A2709K00598b04440R0006e3685l2094
18018h5779L8721A19881d67166I301h9814K4974B97007c17481A28645R7483a84544
18006b29481P9648F1378K7365O9371d6380B0040f6468k698A02950a83139f0841
17994H2068c395A10600a01798l6081C67483f7999m0387A23942g718r3694o4658
17983a66070O663L3843G352L10739f8830A22699d718k10014B3639a43986r4103
$$ plain form
18061 -102038 -169225 -60089 91384 173920 -298117 68502 37068 -55006 226459 108525 242957
18050 242957 -357447 -21720 -11581 -136612 11585 66049 36004 133629 -229360 -13569 -128880
18039 -128880 124469 -188701 -271681 209035 -123470 48836 -184439 133704 150311 110255
18029 110255 40620 -209507 -181216 -102303 -440411 12709 213307 -204440 -114434 -53685 -85779
18018 -85779 -47058 119881 -467166 9301 -89814 -64840 297007 -317481 128645 226128 -184544
18006 -229481 -149833 61378 88743 158114 -46380 20040 -66468 -69166 102950 -183139 -60841
17994 82068 -3395 110600 -101798 -137879 367483 -67999 -108386 123942 -7718 -101412 -166070
17983 -166070 -159407 -125564 7352 318091 -68830 122699 -4718 -214732 23639 -143986 -238089
17972b38089A35407a03304B14002Q4535j47769m3302K12468j37452k743q6291
17962I3448a54199J3240C1546h1090q0012A90781A7377K27995p8089a07889C8165
17950i4390E5593G865e6261b5007j24999A68959E3385i8764C8574g533m9594k90658
17938c47785A03734k8928a08351n2344p0616C7422c9301A69009h5557l03251a78719
17926B60297C7702c7492F0278K84489a49341k268f7528k70911a5471k46818A822
17914c1664A42306c53754g8695b5462B31009P9499F0864a27758N22A37842a65378
17902a10643j42909e0667E7390L090J28887m9020e16373A37118E7793N6710J77722
17891B92225b06766C4307e7333q1639I3610B8614J8233a0111k79078a29745a9474
$$ plain form
17972 -238089 135407 -103304 214002 298537 150768 107466 319934 182482 179739 93448
17962 93448 -154199 -140959 31546 -81090 -161102 190781 17377 245372 167283 -107889 38165
17950 -94390 55593 7865 -56261 -25007 -150006 168959 53385 -98764 38574 -7533 -57127 -347785
17938 -347785 103734 74806 -108351 -160695 -231311 37422 -39301 169009 -85557 -388808 -178719
17926 260297 37702 -37492 60278 344767 -149341 -151609 -67528 -338439 -15471 -262289 1822
17914 -31664 142306 -353754 -78695 -25462 231009 310508 60864 -127758 -127236 137842 -165378
17902 -110643 -253552 -50667 57390 60480 189367 140347 -516373 137118 57793 114503 292225
17891 292225 -206766 34307 -57333 -138972 93610 28614 46847 -10111 -289189 -129745 -19474
17879a07379j26930f5825G7260J66788b44613C2131g2070B7191C287i548o930
17868a6478C19969a32005A15729d0689b0021n8634A10995b06497P4460A0944M21640
17857D32584g478j6779j25216K620d0047Q302A65182a69343A68710L26365h4038
17845b6666j62610H5733J18373J13397o8687q0695f2202J169G8982a49729M6648
17834a03081j77849J27163f8885m9384m47474h7139C8184j1616J7718c44982A68650
17822A11183b02722A3858f8324p8883A55689J04513E6564a56964E3146C031K514
17811E545e1238n0535I783J85767b4423r1490j4644r1038c0793j3252B17385A00748
17798A48350R7207E8346J34130a25287C6857A505J77901b94531G9881J52996p6530
$$ plain form
17879 -107379 -234309 -65825 77260 244048 -244613 32131 -72070 27191 3287 -9548 -16478
17868 -16478 319969 -132005 115729 -40689 -20021 -78655 110995 -206497 -132037 10944 432584
17857 432584 -7478 -24257 -149473 -146853 -40047 -31745 165182 -169343 168710 495075 -84038
17845 -26666 -189276 85733 204106 317503 248816 168121 -62202 -61033 78982 -149729 -103081
17834 -103081 -280930 -153767 -68885 -118269 -565743 -87139 38184 26568 44286 -344982 168650
17822 111183 -202722 13858 -68324 -147207 155689 260202 56564 -156964 53146 3031 5545
17811 5545 -51238 -101773 9783 195550 -24423 -115913 -130557 -221595 -30793 -44045 217385 100748
17798 148350 245557 58346 192476 -125287 36857 1505 179406 -294531 79881 232877 156347
17787A56347f9601G314Q4429K5346J09230D7368j5601P2745d6309F6726a70356
17775A59293D9051e09983C9906A7596J66118c8624A8596b22620A54791a86361
17764d4840B72728m5554C3956K9743J37587d41001A86776f9329n2648m0762k87268
17753d50007q618D0282J62579k2336C2369b25021A3328J18414R7396a08767A51664
17741g8912j6133L998l2139q9821C2031K7966K52768a47596E5566J09503C313
17729c13767C05950b67430A34017B0650b12304M8269b3567C11991q6064a24212
17718h0250a2308B25535J36903A31865J34712a31940f4744A36020K6699C8595
17707D3555a1238H7822J65125b22360R2159k16358a08602A09037a2531A12663
$$ plain form
17787 156347 -69601 7314 91743 117089 226319 47368 31767 104512 -46309 66726 -170356
17775 159293 49051 -509983 39906 17596 183714 -38624 18596 -222620 154791 -186361
17764 -44840 272728 227174 33956 63699 201286 -441001 186776 -69329 -121977 -162739 -450007
17753 -450007 -458625 40282 202861 180525 32369 -225021 13328 131742 229138 -108767 151664
17741 -78912 -95045 -91047 -123186 -213007 32031 59997 312765 -147596 55566 165069 3313
17729 -313767 305950 -267430 134017 20650 -212304 -164035 -23567 311991 225927 -124212
17718 -80250 -12308 225535 362438 131865 266577 -131940 -64744 136020 162719 38595
17707 43555 -11238 87822 252947 -222360 -130201 -346559 -108602 109037 -12531 112663
17696b04164C45817A5184J67445a64062A04110b8453a1837m49894B02355E7900
17685E5003R8908b3726D8858a00584F4650c55769a6991A99977r6635a81324E2413
17673F801L59869H5429k3827b24538A73251O1882M9384a41252G6903M7584h789
17661a68976j07060A249f7541m3177A5380L5226a33559j38592B05348e6683C06724
17649G274J00275m0180d14825a41807B10225i9342D430J30632e4159H6573J39476
17638B26049b41675K0357A26731c73600B29522C7556K23866I2721J27274q8252
17628A31743b5439j53834D1474J2501J32795N1874A11585O9802q5118K20740k924
17617C14085c20248a4346C68516a646D1178J49047m0414a8375A79996i4120k03582
$$ plain form
17696 -204164 345817 15184 182629 -164062 104110 -28453 -11837 -461731 202355 57900
17685 55003 153911 -23726 48858 -100584 64650 -355769 -16991 199977 103342 -181324 52413
17673 6801 366670 85429 61602 -224538 173251 235133 284517 -141252 76903 124487 -8789
17661 -168976 -276036 1249 -67541 -110718 15380 50606 -133559 -272151 205348 -56683 306724
17649 7274 107549 67369 -414825 -141807 210225 -99342 4430 135062 -54159 86573 226049
17638 226049 -241675 -221318 126731 -373600 229522 37556 261422 92721 219995 131743
17628 131743 -25439 -179273 41474 53975 186770 238644 111585 181387 96269 317009 314085
17617 314085 -320248 -14346 368516 -1646 41178 190225 149811 -18375 179996 -94120 -297702
17606b97702F6102K17893m2711g641B95220F5854g1776B14017b76692B24904n228
17595B19676q1262d4495A36488a96753B9866J30187K9475i8140A12125b36255
17584I3626J10128C9018K39003r5998B7407c0542o5942B20122a35604e1265E4621
17572b86813B67327A21120k8887J00182D817P565J13041Q115C2481J22716B1903
17560A85749b15397L8602B23343D1714J51511H890M22540a45389E4567Q5822L37004
17549D77393a04388f177o2033B52142k4016B5840J41910J64672B3690b04253a2906
17537A76866b57328B40605a11927F4986B8655J05047L02F3364a20052A59017d72
17525H8754J82492j0015A19304Q4700M8711l3903a72291d4098j79829B91488r1477
$$ plain form
17606 -297702 66102 283995 241284 -7641 295220 65854 -71776 214017 -276692 224904 219676
17595 219676 138414 -44495 136488 -196753 29866 160053 189528 -98140 112125 -236255
17584 93626 203754 39018 278021 182023 27407 -30542 -96484 220122 -135604 -51265 54621
17572 -286813 267327 121120 92233 192415 4817 12382 125423 133538 32481 155197 21903
17560 185749 -215397 -176795 223343 41714 193225 8890 431430 -145389 54567 140389 477393
17549 477393 -104388 -6177 -68210 252142 228126 25840 167750 332422 23690 -204253 -12906
17537 176866 -257328 240605 -111927 64986 28655 133702 134004 63364 -120052 159017 -472
17525 88754 271246 261231 119304 204004 252715 218812 -172291 -44098 -223927 291488 200011
17514B00011b4371C93410h9013A68321p4664c1768o3636C30664C646J29188J69765
17503C02599F3719L70326B07209O2742K09408j66066d0283A72940a65174a6669
17492D70905j27719n004J50633L0808P9915h7336B95847D8584j108L60610g0912
17480E2248d6046A86847k2453N2821Q3207I9870J51693a01547B57449a2077C37377
17468A65498l7512J37987I5052o746L32151F7812N9902J46063g8395E73491E5003
17456a08636F6605A2364K49367K01560a70843h482A78501h9503A69061o6884N5533
17445A57710E9398J54847l9399G748J42155M7409r0405K64767j31639J01661o9661
17434B72035A4174K16231n312L17272A89455p5582N655d5459l8621D54308l0910
$$ plain form
17514 200011 -24371 393410 -89013 168321 93657 -31768 -95404 330664 3646 132834 302599
17503 302599 63719 434045 207209 269951 479359 313293 -40283 172940 -165174 -16669
17492 470905 343186 338182 488815 519623 599538 -87336 295847 48584 47476 408086 -70912
17480 52248 -46046 186847 164394 217215 300422 99870 251563 -101547 257449 -12077 337377
17468 165498 127986 265973 95052 88306 420457 67812 127714 273777 -78395 573491 55003
17456 -108636 66605 12364 261731 463291 -170843 -8482 178501 -89503 169061 102177 157710
17445 157710 59398 214245 174846 7748 149903 197312 106907 371674 240035 341696 272035
17434 272035 14174 230405 225093 542365 189455 113873 119528 -45459 -84080 454308 423398
17423D23398A57435n5405K88888A37675N7966r877K37005j20890I4302J80231
17413B74533J94112j55714i0395A02230J19766m3322R9015p7843j1529E472O48494
17402F53966C02732l2504h8317E995J76907K24286A31919O280J83640F3442L9336
17391A02778j2195J11590l2626j7798B7751P0953d31363C55194l0112D3967a40584
17379a4261A46418P5700K9629b3525F8512a81016C0271J10588A1519a81217A28570
17367A50562R5208C1902q527J53681H7609r136n239h1332B55104I3331c1900A22925
17354C16731k2745n5946j0062P372j14769G905K58730J32977j88386a54614G8806
17342A96371N069d8786g053k9597B50811F6428C0621K2954J84495R2673F7193
$$ plain form
17423 423398 157435 102030 390918 137675 195641 185764 422769 301879 94302 274533
17413 274533 468645 312931 -90395 102230 221996 178674 277689 199846 188317 5472 653966
17402 653966 302732 270228 -88317 5995 182902 407188 131919 138199 321839 63442 102778
17391 102778 90583 202173 169547 151749 27751 98704 -431363 355194 325082 43967 -140584
17379 -14261 146418 222118 251747 -23525 68512 -181016 30271 140859 11519 -181217 128570
17367 150562 245770 31902 23375 177056 87609 78473 73234 -81332 255104 93331 -31900 122925
17354 316731 293986 238040 227978 235350 120581 7905 266635 399612 211226 -154614 78806
17342 196371 201440 -48786 -7053 -36650 250811 66428 30621 53575 238070 330743 67193
17330A02982j3766J42537G1561b1144A97260e2587B41135K84412B22471B4288
17319D05849j31873n8290g5911B54249a123A59060D1500J30588F6734K53428c9343
17307B31651K9840A15227J1967J37014a076A27535K25374j35930R4561r7545A9156
17295A69485k2080m1041a98994B25844J34559A10027J95584H5700h6949A99455
17284A9664g74B39821A16537B8204a12868n6313A26531R1240g210I0837J40832
17273B31669b11810h9250r8444A32284J25208o2625h210E35285r3662g7642A44468
17261C73972j2314j55953D9658J49864q0036n4295e1023A1143K94395a1922B07951
17249a01183A97563R6146j07734J85068R7912B2649c33058C48666e9429C09492
$$ plain form
17330 102982 89216 231753 71561 -21144 197260 -52587 241135 525547 222471 24288
17319 405849 273976 215686 -75911 254249 -1123 159060 41500 172088 66734 320162 -39343
17307 231651 261491 115227 127194 264208 -1076 127535 352909 216979 311540 213995 19156
17295 169485 147405 106364 -198994 225844 360403 110027 305611 85700 -86949 199455
17284 19664 -774 239821 116537 28204 -112868 -169181 126531 217771 -7210 90837 231669
17273 231669 -211810 -89250 -187694 132284 257492 194867 -8210 535285 441623 -77642 144468
17261 373972 361658 205705 49658 199522 119486 65191 -51023 11143 305538 -11922 207951
17249 -101183 197563 293709 185975 371043 468955 22649 -333058 348666 -59429 309492
17238b11894A32478L17880r4516j70996H8993b26272g6368B74489A28630K04776
17228C33406m9811A9083J98870a67196H9300n538K65030A53259J21287J33427
17218D07973M3828A03274L20924e9178j15107E8688K90947p3715B1354a50218
17207B99834K61030I5540L87042C1224K21166J58579A78957J87344p1336a4749
17196A03364N6867C8148N22895m8901j34032k6509A17485P4886m334C2695L70686
17185D03381p2637H1125M4331K86207j8667E3042K53913L22181f4537A90953n5104
17174A35849L66772D8448K92609a04569G03005D8158K25515j18909J85249J62587
17164E02600j59029O1044j68240j6408J73051j64940l2252K32675l3886l8483
$$ plain form
17238 -211894 132478 450358 355842 184846 88993 -226272 -76368 274489 128630 333406
17228 333406 283595 19083 217953 -167196 89300 83762 348792 153259 274546 407973
17218 407973 451801 103274 424198 -59178 -174285 58688 349635 275920 21354 -150218
17207 299834 560864 95540 482582 31224 252390 410969 178957 366301 294965 -14749
17196 103364 160231 38148 561043 512142 378110 351601 117485 192371 188037 32695 403381
17185 403381 330744 81125 125456 411663 392996 53042 306955 629136 -64537 190953 135849
17174 135849 502621 48448 341057 -104569 703005 48158 273673 154764 340013 502600
17164 502600 343571 404615 236375 219967 393018 228078 195826 428501 394615 356132
17154C56132r0874N683M7587a8018B88714k7236P5726j21711K35625j82543E4873
17142A90468K27192A4875R3743J98289q8848E8252J6608J74809j06299L04661
17132D48031B13385r9620J08804J20635m5372J06461P5344j51435A31170L1957
17122A63127O7736A10726L57000B02933i5625a6508C15703j04047K22679A1452
17111C26637I0612J06471D0552J70979k3538M4433p2175Q4014K05413A91070P9593
17100B70663J22753R0719L9564A60765K77983j06888J13810J2144j36308J29950
17090D51456R3518d0484D88326B28468J87326A45785J64453O2867K3922K00263
17080E97290k55062G2907N08816k53955O4322m5335K96417k21243j00153L03846
$$ plain form
17154 356132 265258 270941 318528 -18018 288714 261478 337204 215493 451118 268575 54873
17142 190468 417660 14875 108618 306907 218059 58252 74860 249669 143370 448031
17132 448031 213385 113765 222569 343204 297832 404293 479637 328202 131170 163127
17122 163127 230863 110726 467726 202933 -95625 -16508 315703 211656 434335 11452
17111 326637 90612 197083 40552 211531 187993 232426 160251 244265 449678 191070 270663
17100 270663 393416 484135 523699 160765 438748 331860 445670 457814 321506 451456
17090 451456 544974 -40484 488326 228468 415794 145785 310238 373105 397027 597290
17080 597290 342228 72907 581723 327768 392090 346755 643172 421929 321776 625622
17070F25622p8599k37010P4774j08156A9506R9928L88038l7126j57331G9933N99293
17059F79226j82807j80632J52847p7980J16907B16692J33302m0996N5434j8038
17049C46394P4711J3879P4467k12006k1812M55501p2012j76658j89638K57347
17039E50173K0228j41039k04454J86632j6776J33274k61427L78532l00854L24306
17029F68595j23829J14226C09982K38821p550K43546k58856K3528k21830L86374
17019G14015C08391J29746K13923B20141J33898K8280J54938J18960C15718K02230
17009E17948k06850J88532O2496O0115B81354J56905K45156j06328N5346j4439
16999F17994p7372K93182k16849J62052l13877K52955K60575m15474n6189J65460
$$ plain form
17070 625622 547023 310013 384787 276631 19506 119434 507472 470346 313015 79933 679226
17059 679226 496419 315787 468634 390654 507561 216692 349994 308998 364432 346394
17049 346394 421105 434984 509451 297445 275633 731134 659122 482464 292826 550173
17039 550173 570401 429362 224908 411540 394764 528038 266611 645143 344289 668595
17029 668595 544766 658992 309982 548803 541253 784799 525943 549471 327641 714015
17019 714015 308391 438137 652060 220141 354039 382319 537257 656217 315718 517948
17009 517948 311098 499630 562126 622241 281354 438259 683415 577087 632433 617994
16999 617994 540622 833804 616955 779007 465130 718085 978660 563186 506997 672457
16989F72457B64578M55904k77995L24477J45835J841l54275p1884L54109k45549
16979E97041K36974N027l26742p2846L50147J03070j34898M0961j83405J28006
16969G43335J17511l4976k57448M58387l66573M0299L21502l56198M20135k84604
16959H01370j00657p116M46765l09153k49603L43132j98666O3667R3268Q3802
16949I66809k69718M28532o0465j61892l15583L94369j00995o9425K00291J50455
16939A162378j04996j5905R953P1918j37315j4376Q2831k59875M26234k09695
16929A011152K31203k47796J24260K8225m12984L67315K7997N2971N79837o44835
16919A117345L19753o29754M59985j71972J9021j24479K58929J57463R176J4699
$$ plain form
16989 672457 264578 720482 442487 766964 912799 914640 560365 488481 842590 597041
16979 597041 834015 839042 512300 439454 789601 892671 757773 798734 615329 743335
16969 743335 860846 825870 568422 1026809 660236 700535 1022037 665839 1085974 801370
16959 801370 700713 693597 1140362 831209 581606 924738 726072 789739 883007 966809
16949 966809 697091 1125623 1065158 903266 587683 982052 881057 811632 1011923 1162378
16939 1162378 1057382 1041477 1051430 1123348 986033 971657 1054488 794613 1220847 1011152
16929 1011152 1242355 994559 1118819 1147044 734060 1101375 1129372 1182343 1762180 1117345
16919 1117345 1437098 807344 1267329 1095357 1114378 989899 1248828 1406291 1415467 1430166
16909A430166M0589m07059K8252J52152K34677k45518r8450L28908r7130K52134
16899A618721J9225R8267m56280J51410Q0597l9330J1285P0914l3586N0264o9725
16888A501762L91110k80201O2522L6948m1426j60375k7299M3605K16590M36314
16878B179550n15659J10882L14011M9414j41527k32207n2970N17179r74970O58755
16868A912458J29192J35433J61961j14639K91517q9924l30030L49324j75115K39305
16858B509482k2346o1305N4911J04535k55127Q5245O8127O35912m13545j24120
16848B581769K88275L1515r7054K38850j01659J23199j68041L05266l18779K79965
16838C163306L03982k37836J39128J1310k53810M84170J75098j77185M87L44495
$$ plain form
16909 1430166 1470755 1063696 1091948 1244100 1478777 1233259 1134809 1463717 1366587 1618721
16899 1618721 1637946 1736213 1279933 1431343 1511940 1472610 1483895 1554809 1521223 1571487 1501762
16888 1501762 1892872 1612671 1675193 1712141 1670715 1510340 1483041 1526646 1743236 2179550
16878 2179550 1663891 1774773 2088784 2138198 1996671 1764464 1711494 2228673 1253703 1912458
16868 1912458 2041650 2177083 2339044 2224405 2515922 2425998 2095968 2445292 2270177 2509482
16858 2509482 2487136 2425831 2480742 2585277 2330150 2415395 2483522 3119434 2705889 2581769
16848 2581769 2870044 2901559 2804505 3043355 2941696 3064895 2896854 3202120 2883341 3163306
16838 3163306 3467288 3229452 3368580 3379890 3126080 3610250 3785348 3608163 3608650 3953145
16828C953145l15566M03430n4927K13945j23177K93286J63339j45141N7094R3647
16818D539075j33323K54086K99828j59691J47461J94134K30635k9946J28184j36456
16808E333987L87128j07175J44021J38175M11493r6036K37933K97962k96623K85293
16798F736158J31844N21816q6973K1708M09424Q9592q232J57944N07198K28200
16788H708679J90132J22082L93887q6666M98325K31013M23374L96062J88755L01466
16778A1367109K21428M21804M27987P3297Q84504L9935J106954l02521L06555
16769A4547052P56867M04601K39728Q48092N61349N69646M90849Q29941M88832
16760A9736957Q73824Q70200L14676J362966P98018P80970R11647R39251J035202
$$ plain form
16828 3953145 3637579 4041009 3986082 4200027 4076850 4370136 4533475 4388334 4445428 4539075
16818 4539075 4405752 4659838 4959666 4799975 4947436 5141570 5372205 5342259 5470443 5333987
16808 5333987 5721115 5613940 5757961 5896136 6307629 6211593 6449526 6747488 6450865 6736158
16798 6736158 6868002 7389818 7302845 7324553 7733977 7823569 7815337 7973281 8480479 8708679
16788 8708679 8898811 9020893 9414780 9328114 9826439 10057452 10480826 10876888 11065643 11367109
16778 11367109 11588537 12010341 12438328 12511625 13396129 13436064 14543018 14240497 14547052
16769 14547052 15303919 15708520 15948248 16796340 17357689 17927335 18418184 19248125 19736957
16760 19736957 20610781 21480981 21795657 23158623 23956641 24737611 25649258 26588509 27623711
16751B7623711J079157P30845J698949J463157J166537J376317J825170J439683
16743C8403526K009851J345433K214144K052682K123002K289120K580203K180110
16735E5198071L332382K657130K958941L575485L345195L444467M297102L920423
16727H2729196M055719M523700M927593N135275M701741M994494N244076N790253
16719A22102047N371478N303993N386196N735733M759942N010044M226687M259351
16711A62155471L216697K829756K418625J118725P74307j89713j150960j638320
16703A69534588k350984l479937l694163l715163m996450n177106n279463n409430
16695A35431892n364384n440360n712624n158416n181269n412025m719657m716324
$$ plain form
16751 27623711 28702868 29433713 31132662 32595819 33762356 35138673 36963843 38403526
16743 38403526 40413377 41758810 43972954 46025636 48148638 50437758 53017961 55198071
16735 55198071 58530453 61187583 64146524 67722009 71067204 74511671 78808773 82729196
16727 82729196 86784915 91308615 96236208 101371483 106073224 111067718 116311794 122102047
16719 122102047 127473525 132777518 138163714 143899447 148659389 153669433 157896120 162155471
16711 162155471 165372168 168201924 170620549 171739274 172513581 172323868 171172908 169534588
16703 169534588 167183604 163703667 160009504 156294341 151297891 146120785 140841322 135431892
16695 135431892 130067508 124627148 118914524 113756108 108574839 103162814 98443157 93726833
16687I3726833m712819m176983m195723m153607l768743l588420l116827l296573
16679F2717138k791125k941646k615056k824943k231680j844429k403604j982934
16671D3081721j734797j796126j801104j738601j443926j101013j453643r41688
16663C1070823j505595j071237r73931j151468r97917q24152r41292j007972q05424
16654B1791835n95052o81512p82772o45151o05225n58324n91110q98915N8924
16645A6492698o16976o23105k57344p70526q3329n38617n64037j41869m97380
16636A2399515k84361l16886m32982k56975K02528p32465l76230r9035k86497
16627I816612k08563j95413l31312n9984n36876P2539l22111k25073j46511j68951
$$ plain form
16687 93726833 89014014 84837031 80641308 76487701 72718958 69130538 66013711 62717138
16679 62717138 59926013 56984367 54369311 51544368 49312688 47468259 45064655 43081721
16671 43081721 41346924 39550798 37749694 36011093 34567167 33466154 32012511 31070823
16663 31070823 29565228 28493991 27520060 26368592 25370675 24546523 23605231 22597259 21791835
16654 21791835 21196783 20515271 19732499 19087348 18482123 17923799 17332689 16433774 16492698
16645 16492698 15875722 15252617 14995273 14224747 14141418 13602801 13038764 12896895 12399515
16636 12399515 12115154 11798268 11365286 11108311 11310839 10578374 10202144 10103109 9816612
16627 9816612 9608049 9412636 9081324 9021340 8484464 8557003 8234892 8009819 7863308 7694357
16617G694357j77105m68797K45155l90374m2149l12250l83767Q3637l0289j56687
16607F061731j28969k49513Q3401k95268j4295J51953l05926L4143Q7314m36688
16597D987883l68387l26751M89727l34759j64429O69828k78227m58765K06262
16588D422382n27741q5957L78n0657j03365k87021J33370K77888n44581K97913
16578C532609j73611K4233j35425K2583m24699L97649p1717j72925L8370j47235
16568B889832j23717n0458P0765j78721q4740M7560j65868K94228L04304o08914
16558B394271k00029L94355j56382K2837k24672r9344J01892N4481j6684k6656
16548B244069m27815R0425J30760k925k37401j43943J73494J17965Q2503J67626
$$ plain form
16617 7694357 7517252 7048455 7293610 6903236 6861087 6548837 6165070 6248707 6218418 6061731
16607 6061731 5932762 5683249 5766650 5471382 5457087 5609040 5303114 5337257 5424571 4987883
16597 4987883 4619496 4292745 4782472 4447713 4283284 4953112 4674885 4216120 4422382
16588 4422382 3894641 3808684 3809062 3758405 3655040 3368019 3501389 3779277 3234696 3532609
16578 3532609 3358998 3383231 3247806 3270389 2845690 3243339 3171622 2998697 3037067 2889832
16568 2889832 2766115 2715657 2786422 2607701 2522961 2570521 2404653 2698881 3003185 2394271
16558 2394271 2194242 2588597 2432215 2455052 2230380 2131036 2232928 2287409 2270725 2244069
16548 2244069 1816254 1906679 2037439 2034514 1797113 1653170 1826664 1944629 2027132 2194758
16538B194758n31151L65726l05197r869k80510M54456j33578o7757K39759k25343
16528A701294J39110k33768l51228N05466j34695k27398l51425M97628o0891K00922
16518A685015k71100J93663l06433J21205J31345j97586j36365Q1246j39199j50296
16508A011495J41109M40444l09968j51131K73120m35173K91904j50800J29848
16499A240848k33739J01966L2469j14874r5484K61441j69902j70989L232N383
16489H60351J75596J28294l21019J1041L14814E14158N48396l9291J2689m46561
16479E89391N55343l5000j28673O9531k75310L62M35973k14322j86609J22616
16469I33302J21067j02685k99304O9699K34571j77265Q2626o7687L21621m43849
$$ plain form
16538 2194758 1663607 2029333 1724136 1714267 1433757 1888213 1754635 1686878 1926637 1701294
16528 1701294 1840404 1606636 1255408 1760874 1626179 1398781 1047356 1544984 1484093 1685015
16518 1685015 1413915 1607578 1301145 1422350 1553695 1356109 1219744 1300990 1161791 1011495
16508 1011495 1152604 1593048 1283080 1131949 1405069 969896 1261800 1111000 1240848
16499 1240848 1007109 1109075 1141544 1026670 931186 1192627 1022725 851736 854968 860351
16489 860351 1035947 1164241 843222 854263 1169077 514158 1062554 1023263 1035952 589391
16479 589391 1144734 1109734 981061 1050592 775282 775644 1211617 997295 810686 933302
16469 933302 1054369 951684 652380 722079 956650 779385 862011 794324 1115945 672096
16459F72096M61513j83110n9877J96811l67152J99372j26653j16526O4501J91171
16449I32146l19083l914n7002O5181M5641j311J0063R2266J64235k90460K04183
16438H41945j10297k97847L05446R4635j26059j21546J46060k10634K87944j50400
16428F59247j58422K65536J21334k85800B05366M65881J14446M2510K8230l42332
16418E14101q5949J34111M54263k96856n427l55830M45220l58638Q3757K61080
16408G89832j98144J00909j6462j16717A52615P03896l20291N3392j35025O3965
16398E18552K54328j14220k12566l2284A93894P56499l86649K19880n9560O8647
16388G92711j26993J34776r9798C43253M43122k31838j94579Q3539J95682l7503
$$ plain form
16459 672096 1133609 950499 890622 1087433 720281 919653 793000 676474 740975 932146
16449 932146 613063 609149 552147 617328 662969 661658 671721 763987 928222 637762 841945
16438 841945 731648 433801 739247 833882 707823 586277 732337 521703 809647 659247
16428 659247 500825 766361 887695 601895 205366 671247 785693 828203 856433 514101
16418 514101 428152 562263 1016526 719670 714243 358413 803633 444995 528752 789832
16408 789832 591688 692597 676135 559418 152615 856511 536220 589612 454587 518552
16398 518552 772880 658660 446094 413810 193894 950393 563744 783624 724064 792711
16388 792711 665718 800494 700696 343253 786375 554537 359958 443497 639179 601676
16378F01676J9174k74214M67822l70582J65112J65164k26053H1667P27606j67230
16368F42043j19013M6738k20816L34039k58286j84440K93795L91684m22088K35081
16358G38737k03360N9498j09671J90288j19807B28210L56566k01099K14050R4154
16348F91881k15552j01749G1639L38844J38104J15585p5287Q0275o4832J96532
16338H00860k22367o138j42719J15909L80598o4637l45351K1293j81967J4436
16328C69917J1898A39940L73512B04992M15012K8116N0485j03715J83716l19387
16318D59219J21256J42658C31488K14287J40887l39449K16112R3156j1035K29921
16308H75367D19170M533K2040J91643j19251J0032k19859L38446k02148O2192
$$ plain form
16378 601676 620850 346636 814458 443876 608988 774152 548099 81667 809273 642043
16368 642043 523030 569768 348952 682991 424705 240265 534060 925744 503656 738737
16358 738737 535377 594875 485204 675492 555685 228210 584776 383677 597727 691881
16348 691881 476329 374580 71639 410483 548587 664172 588885 669160 604328 800860
16338 800860 578493 572355 429636 545545 926143 861506 516155 537448 355481 369917
16328 369917 381815 139940 513452 204992 620004 648120 698605 594890 778606 459219
16318 459219 580475 723133 331488 545775 686662 347213 563325 656481 645446 875367
16308 875367 419170 423703 445743 637386 518135 528167 308308 646754 444606 506798
16298E06798P4873L9492A57922M96437k58097J61045j46749q3495J12469K10832
16288F50364J21211j78683k83944M10510B35320J57274J18340n561J44979J10751
16278G61103l74426j89322M77141k48999K56253M7988j77161m5303J87347C32892
16267B71596J41227K46906C03026L33293N1641o9568B82294L99796k88718k6182
16257C67190K59706J48343l42603J45634j37600O3416A71918Q2053P7583Q0777
16247D12331Q2030o2756J51218k82144K58193j87069L87935l05231j61277L76236
16237F69466j43411k10274A07036Q1166K25481q4465o3944o8403J64855J60598
16227E22324J70436l13929J77529k22451k9252L47351B72145J38215r4964F346
$$ plain form
16298 506798 581671 621163 157922 654359 396262 557307 410558 327063 439532 650364
16288 650364 771575 592892 308948 719458 235320 392594 510934 505373 650352 761103
16278 761103 386677 197355 674496 425497 681750 729738 552577 507274 694621 332892
16267 271596 412823 659729 303026 636319 687960 618392 282294 682090 393372 367190
16257 367190 626896 775239 432636 578270 440670 504086 171918 253971 331554 412331
16247 412331 494361 431605 582823 300679 558872 371803 759738 454507 293230 669466
16237 669466 526055 315781 107036 188202 413683 329218 265274 196871 361726 522324
16227 522324 692760 378831 556360 333909 304657 652008 272145 410360 315396 6346
16216C64607J12455K94847l69249j59723M042Q3920P8630N4423j18845L33663
16206F78770A81173J13705P2552J713A72456L62051j65638L942r6834O9835Q0907
16195D26719M4582A33348N22757C21253J58140m5407B06587R9545j35685K56936
16185D27383K283R7644A03595P8961L94615A33679K72843A92577F7810L85814
16175D53624j55008a62547A79357l6272M82230a33890D69656A0089L98348A44522
16164A16516L53943R7484p7297k20113J01074C4477M95749j60346n8229n8535
16154B53116m3612j3612J6354K68038F1543K14987A15266K5247J59760B8849R0092
16143A18941l1689K73272K0216O6350A46446D8667f1630j2961H1661K97280N6968
$$ plain form
16216 364607 477062 771909 402660 242937 246979 330899 409529 463952 345107 678770
16206 678770 181173 294878 367430 369143 172456 534507 368869 372811 275977 345812 426719
16195 426719 471301 133348 656105 321253 479393 433986 206587 306132 170447 427383
16185 427383 429666 527310 103595 182556 577171 133679 406522 192577 67810 453624
16175 453624 298616 -162547 179357 143085 625315 -133890 469656 10089 408437 144522
16164 116516 470459 567943 490646 270533 371607 34477 530226 369880 311651 253116
16154 253116 209504 195892 212246 480284 61543 276530 115266 140513 300273 28849 118941
16143 118941 87252 360524 380740 447090 146446 48667 -61630 -74591 81661 378941 435909
16132D35909i4130I3276M07083m3245B17985A3971J64465C4149L98465A14493
16121A00441L02335A8468L16454j29128l0373M479c9145B95267q7064J28121g2719
16109F1118L16342a60817c1386L954Q474C53148A07248e3971C05977j16981m7582
16098A41414M2065a06342A38551g929J432C180R4058P1637R679b8750B64023B1666
16085D20349E9826J56495g5413j05454a2887A39714b25469A13961L3264D9371
16074A27337g8843C9791b12763j07133A67161a13154E7616b34712G1075B7655
16063A39303n4801A5574a81506B43923g9805b3058F2691k1810c3403A56883a92573
16051F1227P7605c3083n5747j14121h1486G0524P7585n5203b3584A25904a53364
$$ plain form
16132 435909 -94130 93276 500359 457114 217985 13971 178436 34149 432614 114493
16121 100441 402776 18468 334922 205794 175421 179900 -39145 295267 208203 336324 -72719
16109 61118 377460 -160817 -31386 -27432 -18958 353148 107248 -53971 305977 188996 141414
16098 141414 183479 -106342 138551 -7929 -6497 3180 97238 168875 178554 -28750 264023 21666
16085 420349 59826 216321 -75413 -180867 -12887 139714 -225469 113961 147225 49371
16074 127337 -78843 39791 -212763 -319896 167161 -113154 57616 -234712 71075 27655
16063 139303 84502 15574 -181506 243923 -79805 -23058 62691 40881 -33403 156883 -192573
16051 61227 138832 -33083 -88830 -202951 -81486 70524 148109 92906 -23584 125904 -153364
16039B88036j43347n8703e3206B30022m7825c55306H3580b40115b1453B14004
16028D889M2198a14846r844e4360o8391L3585b2715B110L19151E2327J7719J23552
16016A93598m2953a69117g4513c1210C8550a52807A64190o1106J01970a57461
16005d0405H1563K85081A18343D5885a84444k18842A96706F0731A8740J41910
15995A60650b0518l676k33952I4969a78653B01186p2883B9034R8208A4253f6368
15983a14709j3574b5148k3917j68378f0339j77638R2153F4355c0144E8164R0112
15972A48276P6768j8960K83903J2895r2402j91655Q3872J22872A76183e9919F1537
15960A69148G0513a65596C74033c53013J7309B816R1028b2132j33151k9540K9517
$$ plain form
16039 288036 144689 85986 -53206 230022 182197 -355306 83580 -240115 -21453 214004
16028 4889 47087 -114846 -124690 -54360 -122751 -89166 -22715 2110 321261 52327 70046 193598
16016 193598 150645 -169117 -74513 -31210 38550 -152807 164190 103084 205054 -157461
16005 -40405 81563 366644 118343 45885 -184444 -403286 196706 60731 18740 160650
15995 160650 -20518 -24194 -258146 94969 -178653 201186 128303 29034 127242 14253 -66368
15983 -114709 -128283 -25148 -49065 -217443 -60339 -237977 -145824 64355 -30144 58164 148276
15972 148276 225044 206084 489987 502882 410480 218825 302697 425569 176183 -59919 61537
15960 169148 70513 -165596 374033 -353013 -335704 2816 93844 -22132 -155283 -184823 -155306
15949a55306A98348b09464P6149n452j10480A05000i596j10454A08474g8191F391
15937I7923m0156c9644F4411g9009O40C4760J24675K2246b208B6279K21309d90424
15924A19618f1423j72094A42416a39229k65383a11529k55990A93969G74b91582
15913b95682L4425R6342D448e6370B5515J19697a47352C25638D680a36486R174
15902a27312e9379E9503e14366G0400d0772A16400a77033A1087J73131J24447
15892C08665i2368M2517a2060A23735a97042A09465e7295G9635i9841A48634A3291
15880a2658n2222J2197j54469A8426b01363m8366A35100a59731J8128H9295a0547
15868d11015J36121E6505d20553J56716J13865L1200A30199e3588k4660G793K53727
$$ plain form
15949 -155306 198348 -209464 -133315 -138767 -249247 105000 -9596 -120050 108474 -78191 6391
15937 97923 57767 -39644 64411 -79009 -78369 34760 159435 181681 -2208 26279 247588 -490424
15924 119618 -61423 -233517 142416 -139229 -404612 -111529 -367519 193969 774 -291582
15913 -295682 -261257 -164915 4448 -56370 25515 145212 -147352 325638 4680 -136486 -127312
15902 -127312 -59379 59503 -514366 70400 -40772 116400 -177033 11087 184218 308665
15892 308665 -92368 -49851 -12060 123735 -197042 109465 -57295 79635 -99841 148634 13291
15880 -12658 -64880 -52683 -207152 18426 -201363 -249729 135100 -159731 -141603 89295 -10547
15868 -411015 -274894 56505 -420553 -263837 -149972 -118772 130199 -53588 -78248 7793 261520
15857B61520b15546J3104a1544k56050M3106A40715a1116A442J52144B2981R0754
15846A13735c1627A41234b48369k8275Q2808A45056a65081F1558K7923c8033A17652
15834b6814j29119a6003C1747A0025j609P2174c1863B91092A10695a19953q4123
15823b04076O49F9644N2427E5752d78624a632k19592Q4563m5353C18505i1110
15811B6254a9376j79636K6013A87328c12878J32095D4162J34465E3523a11329
15800b61654A75678o1371B0928a34308C4461d5269A11687a78991B05322F3432
15789A59600b14617F2667J97818b11503P94j96066A22722a56549p7047a4658A18292
15777d1685J4299r9898A17853a86978b2429j03674O1185C8286L52690j74437g8664
$$ plain form
15857 261520 -215546 -202442 -11544 -267594 -224488 140715 -11116 1442 153586 22981 113735
15846 113735 -31627 141234 -248369 -276644 -193836 145056 -165081 61558 89481 -38033 117652
15834 -26814 -155933 -16003 31747 10025 8416 80590 -31863 291092 110695 -119953 -204076
15823 -204076 -203427 69644 122071 55752 -478624 -1632 -221224 -136661 -182014 318505 -91110
15811 26254 -19376 -199012 -172999 187328 -312878 -180783 44162 178627 53523 -111329
15800 -261654 175678 114307 20928 -134308 34461 -45269 111687 -178991 205322 63432
15789 159600 -214617 62667 260485 -211503 -210709 -406775 122722 -156549 -233596 -14658 118292
15777 -41685 -27386 -127284 117853 -186978 -22429 -126103 -64918 38286 390976 216539 -78664
15765A0455J74580C0378b59812f3461A78474D589d377A18611A2952K545B327a750
15752b37319J13922B22365c6609r8304k0136m877F6517a78738h5854r7393h473
15740b48143P5620j7735g1383C3256Q4645c08989i579B52512q6781P0944n2856
15729A83819b44456F6279a13633H3297h4287D6930c30071J27713c1086C6118a45091
15717a57360E5580b41257A61503a28121L1251O640E6368J65231a89921d7283n7387
15706a04670N1645k20289Q8552O4523B83120A4007g7843k4894m7340A4899a2484
15694D2733b07849N7193c6170m2629A93568h2469A20423K0388J5842b29473a6842
15682I8479J0227R2927c39429J65908f0393B63414a18429N0270B5527Q0329h4826
$$ plain form
15765 10455 185035 30378 -259812 -63461 178474 4589 -4377 118611 12952 15497 2327 -1750
15752 -237319 -123397 222365 -36609 -134913 -155049 -159926 66517 -178738 -85854 -183247 -8473
15740 -248143 -172523 -190258 -71383 33256 117901 -308989 -9579 252512 165731 236675 183819
15729 183819 -244456 66279 -113633 83297 -84287 46930 -330071 -202358 -31086 36118 -145091
15717 -157360 55580 -241257 161503 -128121 -96870 -90230 56368 221599 -189921 -47283 -104670
15706 -104670 -53025 -273314 -184762 -120239 283120 14007 -77843 -102737 -150077 14899 -12484
15694 42733 -207849 -150656 -36170 -78799 193568 -82469 120423 140811 156653 -229473 -16842
15682 98479 108706 201633 -339429 -173521 -60393 263414 -118429 -68159 25527 105856 -84826
15670f1562j05530q2788J15694j57949e4183j2265j14255H4487l6618b70187B65864
15658h9402b4822k34818A7195c1439B25467c53637A09037b32558i8707m77903
15648e76610A38700a306m0372j18978C9550a46750A14428N8530b32500A1465b4502
15636A87604b272p5408A2883i1310E5004b7081o9645k4480B2764Q7149O4098a51239
15623d52677K11595c3513j7535j08599M3047j07807A9879J39735b58563I334b85003
15611c0772j44523J8962h615H1923C6291a25005F929M0435e6290F2389d18769
15599a7742n5955j07448C1595b14170D0771a88786L5495J8847m1719G7123a20864
15587a23232k49347a15693B43573c09050a48955A71796a62068b9703j19626A6868
$$ plain form
15670 -61562 -167092 -249880 -134186 -292135 -54183 -66448 -180703 84487 47869 -270187 265864
15658 -89402 -24822 -259640 17195 -31439 225467 -353637 109037 -232558 -98707 -576610
15648 -576610 138700 -1306 -41678 -160656 39550 -146750 114428 172958 -232500 11465 -24502
15636 187604 -2272 -77680 12883 -91310 55004 -27081 -96726 -121206 22764 109913 174011 -151239
15623 -452677 -241082 -33513 -51048 -159647 -116600 -224407 19879 159614 -258563 9334 -285003
15611 -30772 -175295 -156333 -8615 81923 36291 -125005 6929 47364 -56290 62389 -418769
15599 -17742 -73697 -181145 31595 -214170 40771 -188786 -153291 -134444 -176163 77123 -120864
15587 -123232 -372579 -115693 243573 -309050 -148955 171796 -162068 -29703 -149329 16868
15576B71476b06733N0069b0145A32532d7524A5707J76289b48999h6409o7838j82918
15565c37165A43015J66164e1962k26719J32814M9599A15202b89326G381P5692
15555H3073b12146H3433a74677C0060b09287D5895Q8039n1019h957k01455j32408
15544c42820D5585i4365M525H4274O426a02356A42379m3194h328j02137A9885
15532E4644a4627A77561B4422a06394H4602K38298a75396n1060g5186r1484d2787
15520B5288b6661I5052a27788O3565A6841J24790n4010J73195e2275a8184A94254
15508A76884A2867J09190A4228b6685j23744K2181i935A76870f4197B89153b85101
15496A53357f1437n722A58968e5482l6788D1295a94484A99702F3165K35988H1028
$$ plain form
15576 271476 -206733 -156664 -20145 132532 -47524 15707 191996 -248999 -86409 -154247 -337165
15565 -337165 143015 309179 -51962 -278681 -145867 -96268 115202 -289326 7381 83073
15555 83073 -212146 83433 -174677 30060 -209287 45895 133934 82915 -8957 -210412 -342820
15544 -342820 45585 -94365 -89840 84274 90700 -102356 142379 99185 -8328 -110465 19885
15532 54644 -14627 177561 24422 -106394 84602 322900 -175396 -226456 -75186 -166670 -42787
15520 25288 -26661 95052 -127788 -64223 16841 141631 87621 260816 -52275 -18184 194254
15508 176884 12867 122057 14228 -26685 -150429 -128248 -9935 176870 -64197 289153 -285101
15496 153357 -61437 -67159 158968 -55482 -92270 41295 -194484 199702 63165 299153 81028
15484B08916m2379a03134C6651b11791g0558A99150k597h6993q2240P4438a1430
15472D1718i1461l79553i4655j20059h267A37135b32826J03137j37007A59152
15461A44090C9236J18774G0092a01565G8336J31223F5324a78312B75506a33866
15450A71161E477J10263j6000K0195g6874q9430D0033a48354m29624B98083l1482
15439B66601E6462a65539j07174H0362H667a90076L2157H561j160O0108e7562
15427a58751B28989i3305K5341j940C40393A63719K14740f8390H3950L8139b4032
15415b09933d4305k30260a4890k72889b3853j14007A70605q1637c18218a20571
15404c63733B04111o22R0680j4076A30923b02817j41882i2149a262E0141g8712
$$ plain form
15484 208916 166537 -103134 36651 -211791 -70558 199150 196553 -86993 -169233 -94795 -11430
15472 41718 -91461 -471014 -94655 -214714 -8267 137135 -232826 -129689 -266696 159152
15461 144090 39236 158010 70092 -101565 78336 209559 65324 -178312 275506 -133866
15450 171161 5477 115740 99740 119935 -76874 -166304 40033 -148354 -577978 298083 266601
15439 266601 56462 -165539 -272713 80362 8667 -190076 -157919 8561 7401 67509 -57562
15427 -158751 228989 -93305 -67964 -69904 340393 163719 378459 -68390 83950 122089 -24032
15415 -209933 -44305 -274565 -14890 -287779 -23853 -137860 170605 88968 -318218 -120571
15404 -363733 204111 203489 294169 280093 130923 -202817 -344699 -92149 -1262 50141 -78712
15392b66122J25951B6246a74748A01397a37862i701D9407g6835C6403d06021J89819
15381b16202j23226A34000C6727b75464b3498k29502b4624j42362L2529A09862
15370B45109c5700j57527G1210q791b30794A95007i8321j88943A8549M8325g8277
15358b29014a2640q9742M7112B79895D8115B119J14710L2550e9822b0583D02970
15346F4607f6627E6141d0028C1905L36297A36627b94125C6461a18358r8550A63759
15334A30344J09985D1358N4652L11755C2432N18025A35531g1398E5034a09097
15323a54870B8074g3160j38849j04180A18951i0807C60014G6559c8016B01377
15312A33203A3514P7440L5769a39093E6710L08433a71654C47962A8034P2551a36830
$$ plain form
15392 -266122 -140171 26246 -174748 101397 -137862 -9701 49407 -76835 36403 -406021 -216202
15381 -216202 -339428 134000 36727 -275464 -23498 -253000 -24624 -166986 -134457 109862
15370 245109 -35700 -193227 71210 62419 -230794 195007 -98321 -287264 18549 66874 -78277
15358 -229014 -12640 -102382 -55270 279895 48115 2119 116829 149379 -59822 -20583 402970
15346 64607 -66627 56141 -40028 31905 368202 136627 -294125 36461 -118358 -216908 163759
15334 130344 240329 41358 96010 407765 32432 550457 135531 -71398 55034 -109097
15323 -154870 28074 -73160 -212009 -316189 118951 -90807 360014 76559 -38016 201377
15312 133203 13514 90954 126723 -139093 56710 365143 -171654 347962 18034 90585 -136830
15300A982a22906A05406m8155B1066g6089a3341A05994a61346H396a11684C07174
15288B32980c2695j91291b866j21138k07589r2971A004b07249D078L8123M279
15277D6480J43551a80034H5101e0905C49090b2583K775A8935J06657a14269A83644
15265G0258R2781a90096A80026f7534J4349A64987a9425B72228a6236A47515a09627
15253B4142L03755g2759j38191g0952o2274A16916i1596I90L8613a81745c0347
15241h0703J3972r7743A06463J12680d4691l6479A88050g6966A30454i9518B33524
15229f6767l3629J4510c4405F5340K51785A19664a81709k3461J2888A02495h2036
15217A01632b16967f1108H2431O5889J9496d50422b2100l05650A45930B2955K36127
$$ plain form
15300 1982 -122906 105406 57251 21066 -76089 -13341 105994 -161346 8396 -111684 307174
15288 232980 -32695 -223986 -2866 -124004 -331593 -424564 1004 -207249 4078 42201 46480
15277 46480 190031 -180034 85101 -50905 349090 -22583 -19808 18935 125592 -114269 183644
15265 70258 163039 -190096 180026 -67534 -53185 164987 -19425 272228 -16236 147515 -109627
15253 24142 327897 -72759 -210950 -70952 -133226 116916 -91596 990 39603 -181745 -30347
15241 -80703 -66731 -164474 106463 219143 -44691 -81170 188050 -76966 130454 -99518 233524
15229 -66767 -100396 -85886 -34405 65340 317125 119664 -181709 -205170 -192282 102495 -82036
15217 101632 -216967 -61108 82431 148320 167816 -450422 -22100 -327750 145930 22955 259082
15206B59082F1699A9082r015L09815j2446k6162a02515L8612B17118b8290k3480
15195e1770A57878h4930r6977C5529a69742F4344c6726E9313c8306B13077E2152
15183A78509E4105a15749F7837e0273A67324J8497n0121a50578P5157m0155E2437
15171H1140c3799A9539K07792I4457g76A67145c6242A19557a32040l0538C64222
15159B0247R6861a49841A63229d1117C19618C7954J41693g9426n2480C79041J07737
15148D86778C7521a51756E2144J56179D6716K29093q8231k5908L7426G3391a27385
15136i0392I4479a27238p1858B47844a22051C43247A48686a98009B94005B4569
15125E007b5473B06475b9344B60238B4595L6332f0376A20229n6036R1215m6992
$$ plain form
15206 259082 61699 19082 10067 319882 307436 281274 -102515 -63903 217118 -28290 -51770
15195 -51770 157878 -84930 -181907 35529 -169742 64344 -36726 59313 -38306 213077 52152
15183 178509 54105 -115749 67837 -50273 167324 185821 135700 -150578 -75421 -115576 52437
15171 81140 -33799 19539 227331 94457 -776 167145 -36242 119557 -132040 -162578 364222
15159 20247 117108 -149841 163229 -41117 319618 37954 179647 -79426 -131906 379041 486778
15148 486778 37521 -151756 52144 208323 46716 275809 187578 161670 199096 73391 -127385
15136 -90392 94479 -127238 -199096 247844 -122051 343247 148686 -198009 294005 24569
15125 5007 -25473 206475 -29344 260238 24595 60927 -60376 120229 64193 155408 108416
15114A08416l8362f3507j06687H2479J3033L6644k998a03994C79927j06946b04471
15102a57827A13756h4998A60773J27474F7985A9625J04003A4983K90309L6352
15092C41644F7968J70659a85851C10754A16474E3803O9646f9299C58999c8858
15081i129A90171g06A84990E9031M91275E2349M6196J16936F404J98158J37120
15070C41682j61456a82958f3790H7984K5963K65125e7700n6680B35273n9381k676
15059A73216a17815B82112H5371J34788b7400C1250M12074j98432J68819A96179
15048B30323E4504L934A1149K49910q3185m7110J21795E0328Q9329J26148j2579
15037B53226l7925Q0224J39856A00014J27290D455K98337J5364b03906C44091
$$ plain form
15114 108416 70054 -63507 -170194 82479 95512 132156 129158 -103994 379927 272981 -204471
15102 -157827 113756 -84998 160773 288247 67985 19625 123628 14983 305292 341644
15092 341644 67968 238627 -185851 310754 116474 53803 123449 -69299 358999 -38858
15081 -9129 190171 -706 184990 59031 550306 52349 98545 215481 6404 204562 341682
15070 341682 180226 -182958 -63790 87984 113947 379072 -57700 -114380 235273 175892 173216
15059 173216 -117815 282112 85371 220159 -27400 31250 443324 244892 413711 196179
15048 230323 54504 58438 11149 261059 177874 130764 252559 50328 139657 265805 253226
15037 253226 215301 295525 435381 100014 227304 4455 302792 318156 -203906 344091
15026A62752J5644n5827K14149n0548k8648A12344P1959g3137a7723C459L39061
15015C42520j47451p6994L63265j89160J12928a450k7518B57383K00729I8266
15004H37716A51418L771m5212M3867J59372J31297H0441L32340L7007A3851M43460
14993D57311D9935J8280A2165O5911Q9781J75921k8822B7031L64564G5883B8137
14981B48219P5885j7334m7289J22558e3924C51272J39637H0124Q9308K16534H549
14969B77363A28372L75732q1191j08431J21596j83795G9069M39710k00120L2574
14959C51233R5119p9903j44714K57630A34986J07866J1238K66972B17282m6517
14949A70765J00089o1858P2990K93879H8283J6713K60766j58932q4388L35238
$$ plain form
15026 162752 178396 122569 336718 286170 257522 112344 184303 -73137 -17723 3459 342520
15015 342520 195069 118075 481340 292180 405108 -1450 -28968 257383 458112 98266
15004 837716 151418 155189 109977 153844 313216 444513 80441 412781 449788 13851 457311
14993 457311 49935 68215 12165 78076 167857 343778 314956 27031 391595 75883 28137
14981 248219 324104 306770 259481 382039 -53924 351272 490909 80124 169432 385966 8549
14969 277363 128372 504104 422913 314482 436078 252283 79069 518779 318659 351233
14959 351233 446352 366449 221735 479365 134986 242852 254090 521062 217282 170765
14949 170765 270854 208996 281986 575865 88283 104996 365762 206830 122442 457680
14939D57680A67443J38955J9962P605A46007J24076R2209q3852g943C03505m2506
14928B60999J52002J18494k44887A33267p722P7821J40200b0793C00035k2535
14918B77500n1980O599J81109J51182k25000Q5643R231J06462j6985j17821K9409
14907D35349J76605L5302J43L8790l15893q3133J81923l3290K76771r9522r3728
14896E19317j5966L00856K3346m08230J80337j41873K23043J15158l27732k20629
14886B47627K71621j05228J2624J40171o5528j11276M7247K9079k5218m4121J28071
14875E25069A33645K71314j85270l0268M38562j42319L79814j82970j93110D3412
14864D79300j24562p3242M44801k73065j57278J24437J37012j15531J52812B04919
$$ plain form
14939 457680 167443 306398 326360 333965 146007 270083 362292 278440 -7943 303505 260999
14928 260999 413001 531495 286608 133267 125545 203366 343566 -20793 300035 277500
14918 277500 225520 232119 413228 564410 339410 425053 434284 540746 523761 405940 435349
14907 435349 611954 647256 647399 686189 370296 287163 469086 435796 712567 613045 519317
14896 519317 503351 804207 827553 419323 599660 457787 680830 795988 468256 247627
14886 247627 519248 414020 426644 566815 501287 390011 437258 466337 441119 396998 525069
14875 525069 133645 404959 219689 189421 627983 485664 865478 682508 489398 43412
14864 479300 354738 281496 726297 453232 295954 420391 557403 441872 594684 204919
14853D50403J23821o5994j23123J11116R0550B62393J16199N1378A88817j9944
14843A68873K31762q7297P4603A08055m4446J7292L95882k08079j20269O64676
14833H13111l56529Q671B30226N7573K01911B33223K95889k192A84864L37851
14823E22715O5014J3216j46885r0684J4660K28982J70192j76569n7139J26981
14813F70483J04332j84368J30970p6502B12524K74953M9794j64150j16657M61758
14803G18222l5573k60832J25666B63126L94416j65298K18468k25332A69161L36744
14793E05905K87207C70981K7287j21629M49161A50351L93674j2321L8494k55180
14783C15018J37520J35077k2155n2215M11454A10614O42489j12613q9887J3529
$$ plain form
14853 450403 574224 508230 385107 496223 586773 262393 378592 429970 188817 168873
14843 168873 400635 313338 387941 108055 63609 80901 476783 268704 148435 813111
14833 813111 456582 465253 230226 287799 489710 233223 529112 526920 184864 522715
14823 522715 587729 600945 454060 363376 378036 607018 777210 600641 543502 670483
14813 670483 774815 590447 721417 644915 212524 487477 537271 373121 256464 718222
14803 718222 682649 421817 547483 263126 657542 492244 710712 485380 169161 505905
14793 505905 793112 370981 398268 276639 725800 150351 544025 531704 570198 315018
14783 315018 452538 587615 565460 513245 924699 110614 753103 640490 550603 564132
14773E64132N2279C06873N56479k42510j62309j7902K14702k75590J78616J99718
14763G58077l2377O5020j54215N1294k91135L71858J47201k22016j28458k26891
14753C38358L40617M7927j08019J66480k84305L20189l95903l8709n9947L77765
14743G04453R3685k06935q3206J58591j20947j48906J86548K07762k74794J58296
14733F74547M4860J4729k14157L70792j99502L0410j12529J19726k27688K86934
14723G88122J35079R3665m94057J73798K53956j74882k11810L36748q9706P9603
14713H90516P0656j35229j6145j52003L73993J4301k10154l6307L13840k98953
14703H14515J48137J0673l27817M0277M02155l94823J72857r049k3754K57461
$$ plain form
14773 564132 616411 306873 863352 620842 458533 440631 655333 379743 558359 758077
14763 758077 725700 790720 636505 687799 396664 768522 915723 693707 565249 338358
14753 338358 678975 726902 618883 785363 501058 821247 425344 386635 326688 704453
14743 704453 798138 591203 507997 666588 545641 396735 583283 791045 516251 674547
14733 674547 719407 734136 519979 890771 691269 721679 609150 728876 501188 788122
14723 788122 923201 1016866 522809 696607 950563 775681 563871 900619 810913 890516
14713 890516 961172 825943 809798 657795 1031788 1046089 835935 799628 1113468 814515
14703 814515 962652 973325 645508 685785 1087940 693117 865974 856925 833171 1090632
14693A090632l14552p7441R6673N8070K1245J02072k46610K4429N4694J27638
14683I36850N012J9863m7127J37674j51768l9283N4954R595M01349n20196J98200
14672A005123q1499l02593J65315J39605K17951j17233J2965l27161J38630J03083
14662I54186j40553L1958o7579L10631k85526J01051K92584j51985K4743J72612
14652A242122j93680J36051j3878p1524n2677K88586l10012j79089k8118K50672
14642A068453l4610L41265j63338j14454J27707M8400K18518n91268Q6252J80391
14632A167316p2082j18553M23586n09450J51496L16713j61582k75238M80471l04449
14622A098228K01002j81213K63348k44798L37600j77601M2355P8018l58706K30249
$$ plain form
14693 1090632 776080 698639 795312 853382 874627 976699 730089 754518 809212 936850
14683 936850 941862 961725 914598 1052272 900504 861221 916175 925770 1327119 806923 1005123
14672 1005123 923624 621031 786346 925951 1143902 1026669 1039634 712473 851103 954186
14662 954186 813633 845591 778012 1088643 803117 904168 1196752 1044767 1069510 1242122
14652 1242122 1048442 1184493 1170615 1099091 1046414 1335000 1024988 845899 817781 1068453
14642 1068453 1033843 1375108 1211770 1097316 1225023 1273423 1491941 900673 986925 1167316
14632 1167316 1095234 976681 1400267 890817 1042313 1359026 1197444 922206 1402677 1098228
14622 1098228 1299230 1118017 1381365 1136567 1474167 1296566 1338921 1416939 1058233 1288482
14612A288482j49785L19786O513p2823O9647J22127k69336K4866j89137M81171
14602A631511L5457k36431j79019K05609Q6180K5213j48746L3934J04743j53217
14592A405234n8982L6649M78526j98670m08954M80781k62617L48975l59354j3613
14582A447975M09541r8550O3259q5255k08166K40474j05147J26925K81761k28398
14572A844419L60637n00688K54J00969K2285o556L23855k33079L59018m17398
14562A853716L39222r4600L9684j47599J52171K19004O0317r5049L1480J55780
14552B514126n0857J03982Q2608j59642L9212O43191j99917K55100L6714K76050
14542C540567J35610N19136J21783L44640O09443O60794J362809J816939K450719
$$ plain form
14612 1288482 1138697 1458483 1464996 1392173 1461820 1583947 1314611 1339477 1150340 1631511
14602 1631511 1666968 1430537 1251518 1457127 1543307 1568520 1419774 1453708 1558451 1405234
14592 1405234 1346252 1382901 1861427 1662757 1253803 1734584 1471967 1820942 1461588 1447975
14582 1447975 1857516 1758966 1822225 1736970 1528804 1769278 1664131 1791056 2072817 1844419
14572 1844419 2205056 1704368 1704622 1805591 1827876 1821320 2145175 1912096 2271114 1853716
14562 1853716 2192938 2098338 2138022 1990423 2142594 2361598 2421915 2326866 2358346 2514126
14552 2514126 2463269 2567251 2649859 2490217 2529429 3172620 2972703 3227803 3264517 3540567
14542 3540567 3676177 4195313 4317096 4661736 5271179 5931973 7294782 9111721 11562440
14533A1562440L747586M741686M549773j201381o639129n953592l364874k171164
14525E271345r98285o04969l09522k29464m39887m5885J90006j46942j28689M3675
14515B601383k74702l5199J62709j80192J76833J65726R4817k92861L07626l82365
14505B343775M38302Q4598l2207l15061L06932J02848k1913J61478k14672o9155
14495B784925O951L67639j07247P9406K39995k17459N9721l55016M17598Q5862
14485C362375J54176k32537j42274L90375p3826k58907J25496J77616J63570l192
14475C662872R5507j872r1459j8711L9676J72467j25535L76745J58157q7205l8104
14464D142538m6336l18366N25971o8263j00285M2531J89362J59996n9776J03416
$$ plain form
14533 11562440 15310026 20051712 24601485 23400104 16760975 10807383 7442509 5271345
14525 5271345 4273060 3668091 3358569 3129105 2689218 2643333 2833339 2686397 2557708 2601383
14515 2601383 2326681 2291482 2454191 2273999 2450832 2616558 2711375 2418514 2726140 2343775
14505 2343775 2782077 2866675 2834468 2519407 2826339 2929187 2907274 3068752 2854080 2784925
14495 2784925 2791876 3159515 3052268 3131674 3371669 3154210 3213931 2858915 3276513 3362375
14485 3362375 3516551 3284014 3141740 3532115 3458289 3199382 3324878 3502494 3666064 3662872
14475 3662872 3758379 3756507 3665048 3646337 3686013 3858480 3732945 4109690 4267847 4180642 4142538
14464 4142538 4096202 3777836 4303807 4235544 4135259 4177790 4367152 4527148 4467372 4570788
14454D570788L9528J26169p605j81911M11405k39939L30569o1628l32245L57785
14444E012916M2313q9626J79835K6402L99575r1370k61124L22316j15046K86715
14434E712906M7631J29010m2785k4141r0145L55899q4957J34775L97152j30348
14424F404997L300j09793O73899p2856o3911n9564M66945l5770k6347J16097J36293
14413G433290J82219k58972M49635J45389K0230j38728L16216K64518j45488L53728
14403H622037O4190J36224J22142M58015K78668p63423K70498O22720j81587P11618
14393A0341102n03587O66262j89084M19473l71133L16789M30648o6912L15637
14384A1359195m403M25030J43781J14448J02198J93386O34543k39339M22002P9945
$$ plain form
14454 4570788 4610316 4736485 4728880 4546969 4958374 4718435 5049004 4987376 4655131 5012916
14444 5012916 5055229 4965603 5145438 5171840 5571415 5480045 5218921 5541237 5426191 5712906
14434 5712906 5760537 5889547 5846762 5822621 5732476 6088375 6003418 6138193 6535345 6404997
14424 6404997 6408297 6298504 6972403 6899547 6835636 6776072 7243017 7207247 7180900 7296997 7433290
14413 7433290 7615509 7356537 7806172 7951561 7971791 7833063 8149279 8413797 8268309 8622037
14403 8622037 8686227 8822451 8944593 9402608 9681276 8917853 9188351 9811071 9629484 10341102
14393 10341102 9837515 10503777 10314693 10734166 10363033 10679822 11110470 11043558 11359195
14384 11359195 11354792 11779822 11923603 12038051 12140249 12333635 12968178 12728839 13150841 13230786
14374A3230786N82811j10783K65439P56772Q425K5481L49775M63931M63994l85782
14364A5650849J106060l21351P04229J28804M15058K42242J71007P81445j5074
14355A8863269J076855O6049N36483L72479K22088K71031P29256N4004R82122
14346B3173636O03489O45059o3999P93440P92109O83092M46687M35854Q44956
14337B8354323N46627J007318R33230K97463R14582J003727J027010L28374J341957
14328C5754611Q76192J325286J084407O73015J373690J031931J271138J014261
14320D4404531J775747J218690J296819J576043J368986J848716J775918J747822
14312E7013272J706638J909569K008293K286634K175052K735167K633686K243174
$$ plain form
14374 13230786 13813597 13702814 13968253 14725025 14733450 14758931 15108706 15572637 16036631 15650849
14364 15650849 16756909 16435558 17139787 17268591 17683649 17925891 18096898 18878343 18863269
14355 18863269 19940124 20006173 20542656 20915135 21137223 21408254 22137510 22191514 23173636
14346 23173636 23777125 24422184 24358185 25151625 25943734 26626826 27073513 27509367 28354323
14337 28354323 28900950 29908268 30841498 31138961 32053543 33057270 34084280 34412654 35754611
14328 35754611 36630803 37956089 39040496 39713511 41087201 42119132 43390270 44404531
14320 44404531 46180278 47398968 48695787 50271830 51640816 53489532 55265450 57013272
14312 57013272 58719910 60629479 62637772 64924406 67099458 69834625 72468311 74711485
14304G4711485K555655L201034K998667L678793K863297L460160L541214L934638
14296A00944943M309444M485436M479851M867532N302173N489284N525319O088745
14288A41492727O338020P019998O696147P877837P708923Q523562Q846021R292102
14280B03795337R561364J0085313J1043682J1436737J1317425J2359521J2933673
14273B82533052J2872462J3190049J2977633J2897814J2966133J2714406J2313828
14266C72465377J1797866J1158359J0247784J0073152Q641239Q053852O580646
14259D39018275N077640K435080J572454Q67049M60443k162731m923636o462130
14251D35882444p642591q991562j0099282j1422638j2228073j2773424j2987985
$$ plain form
14304 74711485 77267140 80468174 83466841 87145634 90008931 93469091 97010305 100944943
14296 100944943 105254387 109739823 114219674 119087206 124389379 129878663 135403982 141492727
14288 141492727 147830747 154850745 161546892 169424729 177133652 185657214 194503235 203795337
14280 203795337 213356701 223442014 234485696 245922433 257239858 269599379 282533052
14273 282533052 295405514 308595563 321573196 334471010 347437143 360151549 372465377
14266 372465377 384263243 395421602 405669386 415742538 424383777 432437629 439018275
14259 439018275 444095915 446530995 448103449 448970498 449430941 447268210 442344574 435882444
14251 435882444 428239853 419248291 409149009 397726371 385498298 372724874 359736889
14244C59736889j3513762j3359535j3344987j2869457j3037826j2968373j2429969
14237B68212980j2194645j1658160j1277390j0999861j0817150j0044656r835595
14230A91385523q988663q964169p674141q108480p183558o530397o473393n724327
14222A31738395n811853n426102n266279m584924m501299m088700l930020l982416
14214I4146802l542364l466905l204516l093862k731327l342107k607031k268760
14206F9889930k362261k326385k107276j988215j983387k026677j696817j554698
14198E3844214j317680k005484j465918j686094r71774j073377j278619j346726
14190D2698542j600333o33669j245220q35803j267117p61373r92245r49957j043321
$$ plain form
14244 359736889 346223127 332863592 319518605 306649148 293611322 280642949 268212980
14237 268212980 256018335 244360175 233082785 222082924 211265774 201221118 191385523
14230 191385523 182396860 173432691 165758550 157650070 150466512 143936115 137462722 131738395
14222 131738395 125926542 120500440 115234161 110649237 106147938 102059238 98129218 94146802
14214 94146802 90604438 87137533 83933017 80839155 78107828 74765721 72158690 69889930
14206 69889930 67527669 65201284 63094008 61105793 59122406 57095729 55398912 53844214
14198 53844214 52526534 50521050 49055132 47369038 46397264 45323887 44045268 42698542
14190 42698542 41098209 40464540 39219320 38383517 37116400 36355027 35362782 34412825 33369504
14181C3369504q77354p95341p13271p94407n79949o76696r00178q40392m11437
14172B6780479m66572m99742p41497m59034o09956l87747o42587o50028p46384
14163B1576932M5729o41680l92940l62630n17176k21947k08260r02441m1560n37370
14153A7796657l97361m085n97230n09237k74810K23537p33539m0031l86952p4095
14143A5002854l45155n7420m53739j38202m21744j2136n12143K614k56838M2245
14133A2850336m56309m19673j2002Q2864j57903k26195l96775k55880j43011r761
14123A0855691n15699L80187m19746r8648j30769q5980l08673j98948L2773j76959
14113I333229k22359L2067n51303L98349j62587k27526j29336k15660J99786j83926
$$ plain form
14181 33369504 32492150 31696809 30983538 30189131 29609182 28932486 28032308 27191916 26780479
14172 26780479 26313907 25814165 25072668 24613634 24003678 23615931 22973344 22323316 21576932
14163 21576932 21622661 20980981 20588041 20225411 19708235 19486288 19278028 18375587 18334027 17796657
14153 17796657 17399296 17395211 16797981 16288744 16013934 16237471 15503932 15463901 15076949 15002854
14143 15002854 14657699 14600279 14146540 14008338 13586594 13574458 13062315 13064929 12808091 12850336
14133 12850336 12394027 11974354 11962352 12045216 11887313 11661118 11264343 11008463 10865452 10855691
14123 10855691 10339992 10720179 10300433 10201785 10071016 9985036 9676363 9477415 9510188 9333229
14113 9333229 9110870 9142937 8591634 8989983 8827396 8599870 8470534 8254874 8454660 8270734
14103H270734l15433J64904m46491j69683J41136K04580n26004J59704l87608
14094G095839L52368l57932J8924j39076l68742K65519m9056j14924J07038k20333
14084F589625m35116j6311l80494M15859k72176q4092J34928n02743J96451J9271
14074E665202J65336k56834j58446j00552J14356k72804K0543N14230p95661K13529
14064E108899K3858p3723j85981j96206L8873J27031J2098l72659Q3377j14353
14054D451214K40108n19814R9130N25399m01199M2613r5070K46756l75807K55082
14044D468412j04382l84680O5589P2114K17252n79885k8976L04833O8603n40248
14034C558632J36983J10747l34521K72228m9215j56987J87587o6301J46123j31780
$$ plain form
14103 8270734 7955301 8120205 7673714 7504031 7645167 7849747 7323743 7483447 7095839
14094 7095839 7448207 7090275 7109199 6970123 6601381 6866900 6817844 6702920 6809958 6589625
14084 6589625 6154509 6138198 5757704 6173563 5901387 5817295 5952223 5449480 5645931 5665202
14074 5665202 5830538 5573704 5415258 5314706 5429062 5156258 5176801 5691031 4895370 5108899
14064 5108899 5132757 5059034 4873053 4676847 4715720 4842751 4854849 4482190 4565567 4451214
14054 4451214 4691322 4171508 4270638 4796037 4394838 4437451 4342381 4589137 4213330 4468412
14044 4468412 4364030 3979350 4044939 4117053 4334305 3754420 3725444 4030277 4098880 3558632
14034 3558632 3695615 3806362 3471841 3744069 3694854 3537867 3725454 3659153 3805276 3673496
14024C673496m40312N01652l49080m1733l32161L22473L0859m9173J19726j01468
14014C334279k99812N2941m105n569K18454M8181l84095j6184M4511k37468O639
14003B757772M65089m89916j23904M6397k9847J87727k51018J3704M43111n3185
13993B965930m3970l81100J62068j98632K63164k86211l144K35445n0414n4327
13983B608809K78854k14936M33715K30996J58978M35951L04478J046606J182112
13974F465563K301092K875588N221492O269447J094157m871236n389218l523690
13966A0443195k562484j241316r83087j146808j30521k96574l37394n72355L53925
13957C526581l53628k05652M6595k82090K63350l86051r9777j18441L2292R839
$$ plain form
14024 3673496 3233184 3734836 3385756 3344023 3011862 3334335 3365194 3316021 3435747 3334279
14014 3334279 3034467 3087408 3083303 3077734 3296188 3344369 2960274 2944090 2988601 2751133 2757772
14003 2757772 3222861 2732945 2609041 2655438 2625591 2813318 2562300 2576004 3019115 2965930
13993 2965930 2921960 2540860 2702928 2504296 2767460 2481249 2478105 2713550 2663136 2608809
13983 2608809 2887663 2672727 3106442 3337438 3496416 3932367 4236845 5283451 6465563
13974 6465563 8766655 11642243 16863735 23133182 24227339 19356103 13966885 10443195
13966 10443195 7880711 6639395 5656308 4509500 4378979 4082405 3745011 3172656 3526581
13957 3526581 3172953 2967301 3013896 2731806 2995156 2609105 2509328 2390887 2423179 2433018
13947B433018j44136l24732M74270K18963m46774K76720n70113K23795Q1651n572
13937B217090j8086L3466j95648K8709J64477k02439j50531J73593j03497n4935
13927A892199J8630j28435K08998k70379l8855o2019K59975l11824J19571P8031
13917A765892j5926k2868L6238R344J84579m92791L13936J5853k0259j8422K19886
13906A975462j95909k12758J40788m2096k10207k80573K89266j60457p5913K61651
13896A489254K6555R1958k43579J50395N6300M9709j22071K23052j59651k76645
13886A285277K7005R9499j05293J13934m6609k72694K84057j9249P5068j80641
13876A260354K78398P3602K2979l53135Q1859O4942j82541K8583k06896M40524
$$ plain form
13947 2433018 2288882 1964150 2438420 2657383 2210609 2487329 1917216 2141011 2222662 2217090
13937 2217090 2199004 2232470 2036822 2065531 2230008 2027569 1877038 2050631 1947134 1892199
13927 1892199 1910829 1782394 1991392 1721013 1682158 1620139 1880114 1568290 1687861 1765892
13917 1765892 1749966 1727098 1763336 1772680 1957259 1464468 1778404 1794257 1773998 1755576 1975462
13906 1975462 1779553 1566795 1707583 1665487 1455280 1174707 1463973 1303516 1227603 1489254
13896 1489254 1515809 1607767 1364188 1514583 1570883 1620592 1498521 1721573 1561922 1285277
13886 1285277 1312282 1411781 1306488 1420422 1373813 1101119 1385176 1365927 1440995 1260354
13876 1260354 1538752 1612354 1635333 1282198 1364057 1428999 1246458 1275041 1068145 1508669
13866A508669k87334k05013L42487M749k6469L04366n16511N2245K2262J69420
13856A368871k36230P758k9843L8388K9135j43097q8857M51750l42121L5916j3411
13845A078259J91866J26940n043k01907n5485k0178n2789L15039k91863l54187
13835G30652N27613k87519M0090L85354m2961m77212K78047J90907P1945o02390
13825H14526N40395k78638J04510O4122j68777N9743N0726j19718p0642k58045
13815G38202L18526R2413m61724J86059K39719r3744j72177K7689K63067k54707
13805H83323L29528k75933K54764j67349j81438J06693l7264M6530M5577j18039
13795H86392l304L5500J71503j12301J09615m35928O33314j72152k54789L8548
$$ plain form
13866 1508669 1221335 1016322 1358809 1363558 1337089 1641455 1124944 1177189 1199451 1368871
13856 1368871 1132641 1140399 1110556 1148944 1178079 1034982 946125 1397875 1055754 1091670 1078259
13845 1078259 1270125 1397065 1392022 1190115 1134630 1114452 1061663 1376702 1084839 730652
13835 730652 1258265 970746 1010836 1396190 1353229 876017 1154064 1344971 1416916 814526
13825 814526 1354921 1076283 1180793 1244915 1076138 1135881 1186607 1066889 996247 738202
13815 738202 1056728 1149141 687417 873476 1113195 1019451 847274 874963 1138030 883323
13805 883323 1212851 936918 1191682 1024333 842895 949588 912324 958854 1004431 886392
13795 886392 883088 918588 1090091 977790 1087405 651477 1284791 1112639 857850 896398
13785H96398J9903n3207J20912j3433j59541K20780j02784J0785J13374q5763
13775I67424n817j8381J1682j54614p5406J40775K09529j81536J80869k00580
13765H73945j44205k00459J90744J04068j49628L64819m13664J47882J26960r5149
13755H05313j12975L69473l46000j9087k9767R4718k33384K48428k67264L38194
13745H47649l79265R7713L25650r8489k09784l1897J73564L253P471M3099j92711
13734E86253j35722J55807M5216L25441l48426J70471r792B24091K88997K11380
13724G24468k62929L27493j18064r8381J33360j26956K68374B54169J20922N30800
13714I05891k98021J44544n6778p3033K95642k44392l4399p328J57885k24702
$$ plain form
13785 896398 916301 863094 984006 970573 811032 1031812 929028 939813 1053187 967424
13775 967424 961607 943226 954908 800294 724888 865663 1075192 893656 1074525 873945
13765 873945 729740 529281 720025 824093 674465 1039284 625620 773502 900462 805313
13755 805313 692338 1061811 715811 696724 666957 761675 528291 776719 509455 847649
13745 847649 468384 566097 891747 793258 583474 551577 725141 728394 735865 778964 586253
13734 586253 450531 606338 651554 976995 628569 799040 789248 224091 513088 724468
13724 724468 461539 789032 670968 572587 705947 578991 847365 254169 375091 905891
13714 905891 607870 752414 695636 622603 918245 673853 639454 632126 790011 565309
13704E65309K24851l10377n8623K539K75157l47043K24927J66671k28763j10788
13694D03860L52942l57726M17510k61873O9186j73240J44531j87554K35149B96953
13683B02864M28250B56328K13983O9056l0950K18050k47416j28346N3015J33816
13673E37536J9486J33434o8068J18656l39572K86841j78042J05880j79804q6689
13663C49658J55345N138K29758k01170k29894K34052J9153K15993k73325m2796
13653D61912K09475J64878l67840J76325p388n2403k6175k1547j64941R4454J06868
13642E73618J34124j88342J43760k73516J74887j84835L41447C32593K5822O9654
13632D28069A68517J16391j16199J46500K57576B03454L58180n3345K6000j54184
$$ plain form
13704 565309 790160 479783 421160 423699 698856 351813 576740 743411 514648 403860
13694 403860 756802 399076 816586 554713 623899 450659 595190 407636 642785 296953
13683 202864 631114 256328 470311 539367 508417 726467 479051 350705 403720 537536
13673 537536 557022 690456 622388 741044 401472 688313 510271 616151 436347 349658
13663 349658 505003 510141 739899 538729 308835 542887 562040 778033 504708 461912
13653 461912 671387 836265 468425 644750 637362 584959 558784 537237 372296 466750 573618
13642 573618 707742 519400 663160 389644 564531 379696 721143 332593 358415 428069
13632 428069 168517 284908 168709 315209 572785 203454 561634 508289 534289 380105
13622C80105j39019L13952J91363B94844M4420j09851I6956L37707m4041N70471
13612I61093k94490B18113L62046j02755k34601J49587L69M68441C87564J93760
13602E81324B66963L2424l0605J95421p7576L20654j88030K14649j55259B47981
13591F58411j65921J8021K3573k18949J93733o4063n6700M3849J2756N3825p4323
13580D24212A32313K23803o2949J9466R5743j72773O4638o3807J32699j74661
13570A94472J85612J36863C5901N15815m3164B5701M20463K3279n2455J21479
13560E38467l1783k19335L12987q9665j79927A45863K05191K48764j79133Q4338
13550E05023j31682J10482k21566B9913K74251j39855K56546r4450j16240J88973
$$ plain form
13622 380105 241086 555038 746401 294844 339264 229413 96956 434663 390622 961093
13612 961093 666603 218113 580159 477404 242803 392390 392759 861200 387564 581324
13602 581324 266963 299387 268782 464203 386627 707281 519251 733900 578641 247981
13591 658411 492490 510511 534084 315135 508868 444805 388105 431954 444710 498535 424212
13580 424212 132313 356116 293167 312633 408376 235603 300241 236434 369133 194472
13570 194472 380084 516947 35901 551716 508552 25701 446164 469443 416988 538467
13560 538467 506684 287349 600336 510671 330744 145863 351054 599818 420685 505023
13550 505023 373341 483823 262257 29913 304164 164309 420855 326405 210165 399138
13540C99138p6290K1359J28578j73526K10008k3744o6855l6501j8360P7284p6199
13529C64892M4125I1396J46179K77772A52966R5512K28290O1494j34396j9325
13519C84541j70784O9979L84497k58962j8864j3552J39792A90526O8561J79707
13509D38794m0829J43141A16089L58416j59258J91243k12710b30565C64889j2410
13499C52479P3474g4883A71570j2046O9411R0934j31020N5907N1878G4181M85413
13488E59594A68440J69234C8681K9017M59919B33517J52113j70873J4384J80539
13478D09680n7163J37256A89113K04645j11271r7953j8461K21441j92406n8132
13468A36976J29747j6625J16749D3719k697J97321J54932M4718k14327k5968p4618
$$ plain form
13540 399138 322848 344207 472785 299259 509267 485523 418668 382167 363807 441091 364892
13529 364892 409017 91396 237575 515347 152966 248478 476768 538262 403866 384541
13519 384541 213757 283736 668233 409271 390407 376855 516647 190526 259087 438794
13509 438794 397965 541106 116089 474505 315247 506490 293780 -230565 364889 352479
13499 352479 425953 -74883 171570 159524 228935 319869 188849 244756 296634 74181 559594
13488 559594 168440 337674 38681 67698 527617 233517 385630 214757 229141 409680
13478 409680 352517 489773 189113 393758 282487 184534 166073 387514 195108 136976
13468 136976 266723 250098 366847 43719 41022 238343 393275 437993 223666 197698 123080
13457A23080Q8621H6022K09604b4239C03558j22840K35533b22983B22331J13614
13447C35945j41282p8774L2640M5199H8881R3482K46190M8705a33543F66740j74462
13436D92278j34641j25916R7225n3592q2742G6947M5871J09064R8906j18737J7573
13425B29624L00870n570e0979C13604C1560a49920J956D72120A72535L24413j18252
13414C78696j46497m8841m8124K83070I5478K8280J31641I9411J29719o7848J8240
13403A79522L30842J8210r7161J07712A93642K50541j19719k3887J73316B06225
13392b6995B04879o6452O1531a5575B92805C0770K39581J48316D3748J80940n0065
13381A74623k3401R2192E0769a81841D6260L65193I2850J94802n2307L47205B79026
$$ plain form
13457 123080 211701 86022 295626 -24239 303558 180718 416251 -222983 222331 335945
13447 335945 194663 115889 148529 193728 88881 182363 428553 477258 -133543 666740 492278
13436 492278 357637 231721 328946 275354 192612 76947 122818 231882 330788 212051 229624
13425 229624 530494 524924 -50979 313604 31560 -149920 -147964 472120 172535 496948 378696
13414 378696 232199 183358 135234 418304 95478 123758 255399 99411 229130 161282 179522
13403 179522 510364 528574 431413 539125 193642 444183 324464 300577 473893 206225
13392 -26995 204879 138427 199958 -15575 292805 30770 270351 418667 43748 224688 174623
13381 174623 151222 243414 50769 -181841 46260 411453 92850 287652 235345 582550 279026
13369A46802N6403A398L25838L9471J88260k68022J21043j26685a45515D2917
13358b6893E1350K71920R0450j40837K52011B46335G4188Q9491J20357b66852
13347A23173a5933B00165J66483A26076d0992C57780J99167b0347C97383j85425
13337B11958r5859O0051Q2256A13061C3100L71445J7411A51972Q8045K07650K2546
13326D70213j81197J78684K5403B37536L026K15965m0917m9079A66971l8370J59346
13315B87947L8426L8582q260j59465R9896J57337j40493Q9371A80226J97964d5413
13303A75936k7632k7397l1069J99015k9608L28923B16770K26943o4589K95014
13293F74138b0549C09561A44277K9265J10919B4234K61131J19540k01076l0209
$$ plain form
13369 146802 203205 1398 327236 366707 554967 286945 407988 281303 -145515 42917
13358 -26893 51350 323270 413720 272883 524894 246335 74188 163679 284036 -266852
13347 123173 -15933 200165 366648 126076 -40992 357780 556947 -20347 397383 211958
13337 211958 116099 176150 258406 113061 33100 404545 421956 151972 240017 447667 470213
13326 470213 289016 467700 493103 237536 240562 456527 415610 366531 166971 128601 287947
13315 287947 326373 364955 356695 197230 297126 454463 313970 403341 180226 378190 -45413
13303 175936 148304 120907 89838 288853 259245 588168 216770 443713 379124 674138
13293 674138 -20549 309561 144277 173542 284461 24234 285365 404905 203829 173620
13283A73620q4608d0234j14776f1769A19461K26671I1282K42350A29203b86991
13272I0164J13868M6085p3858a00563D32664I974L6814J00567G605c6737j76121
13261b12858B22485b64978A53272K23676q8229R6157C0837K62408o1702c04517
13250D33850A40037d2363B40010j13411g5468c3602C22957m5339g7649C20223
13239D5089J5357J83218q1835K08874l2746e0481n8314a9176F0803R6637C9734
13227B37561a7682j4194A20292R2609c288r6528G1649J85002l4704K6860j24136
13216A24671o0064g4195A61173K01254p1686J02197A55024L89034B50122a06971
13205d2358a3864E58523H5822J44930b73364C31595j25331q0748O8971d0875j15865
$$ plain form
13283 173620 89012 -40234 -155010 -61769 119461 346132 91282 333632 129203 -286991
13272 90164 204032 250117 176259 -100563 432664 9974 46788 147355 7605 -36737 -212858
13261 -212858 222485 -264978 153272 376948 288719 384876 30837 293245 231543 -304517
13250 433850 140037 -42363 240010 126599 -75468 -33602 322957 277618 -77649 320223
13239 45089 60446 243664 161829 370703 337957 -50481 -108795 -19176 60803 157440 39734
13227 237561 -17682 -31876 120292 212901 -3288 -99816 71649 256651 221947 248807 124671
13216 124671 64607 -74195 161173 362427 290741 392938 155024 544058 250122 -106971
13205 -42358 -13864 558523 85822 230752 -273364 331595 206264 125516 194487 -40875 -156740
13194a56740A59402G3469N13743B40876L54725b0713B31724g7069C51468n7827
13184B93641g1741k5823L5322A13535P1287k5937J47017j03347L30246b92569
13173C57371A42231o0423k724b3064A01341a66417A5306J82914G337L03573D5784
13161B54164Q7357f7030B7897J96328I7264J05229B896J36616K21613I8073O4633
13150A62706A0163L35865A68912D1053K3944M31316B23029G1187b34273I2934
13139I6400j7797E283N9256a20075n2535L0450a0823H2801k3962g1643F7925C518
13126a96498C51636N1091A35532b50725C78855D0185K72204a53188B11702F8799
13115a58896C7637J34201p9730a44389A37797J78994c4691D59088A20539g9903
$$ plain form
13194 -156740 159402 73469 587212 240876 595601 -20713 231724 -77069 351468 293641
13184 293641 -71741 -97564 -62242 113535 184822 158885 305902 202555 532801 -292569
13173 357371 142231 81808 79084 -23064 101341 -166417 15306 198220 7337 310910 45784
13161 254164 341521 -67030 27897 224225 97264 202493 2896 139512 361125 98073 162706
13150 162706 10163 346028 168912 41053 64997 496313 223029 71187 -234273 92934
13139 96400 78603 5283 64539 -120075 -172610 -142160 -10823 82801 58839 -71643 67925 3518
13126 -196498 351636 402727 135532 -250725 378855 40185 312389 -153188 211702 68799
13115 -158896 37637 171838 92108 -144389 137797 316791 -34691 459088 120539 -79903
13104b56453D38408i9188C53848A09772R6970b92042C68112A7147J18930f5589
13093a08352M0641B46878m1220i5831A47961R2921J79831m9640E4929K68287G1837
13081C07848n9776H0465h5512A31115d8856n062A27817c2315B3401L49829E8274
13069C86364A66096p6211J83771a70857L0032A95547a6474B04405D1378a64420
13058C49946C84K11432I3157D0555J0252L78886A84194E9813c00204B39067H9690
13046C07621A44998D373O343L4082a14728i724A2691P1517M6250k9199A5952g7159
13033A24674K19777b29342c1541r4204C22220c422m9281I9068a6351C61751n6051
13022C05700a600B81412f8846j8162b6830E0094K45191c1644H4216a46597D3523
$$ plain form
13104 -256453 438408 -99188 353848 109772 206742 -292042 368112 17147 136077 -65589
13093 -108352 -67711 246878 205658 -95831 147961 240882 420713 371073 54929 323216 71837
13081 307848 248072 80465 -85512 131115 -48856 -53918 127817 -32315 23401 373230 58274
13069 386364 166096 89885 273656 -170857 -140825 195547 -16474 204405 41378 -164420
13058 349946 384 211816 93157 40555 50807 429693 184194 59813 -300204 239067 89690
13046 307621 144998 4373 10716 44798 -114728 -9724 12691 84208 130458 101259 15952 -77159
13033 124674 344451 -229342 -31541 -125745 322220 -3422 -52703 99068 -16351 361751 305700
13022 305700 -1600 281412 -68846 -87008 -26830 50094 295285 -31644 84216 -146597 43523
13010A80226K09407a53827B74385H6183a69080B31612h1663A59458P7252i3685
12999B10077J75651F2931a51256A82798p1494i516C21013p1667c4076A38563K45606
12988C84169j62893K9020L1285f451B84986b070k20363A57600E6823i8265E739
12976b5388j31662I2345J73283j06701C0412c6655E7288P9246e2251A16885J46475
12965B63360b18917A34869n2435b23003A53172a48465N2522K0106I3549a52216
12954D1416a65006D1766A3181J36841h0394A06585b97291I1179J71117j09353
12944A52943a10311j40886i6983c9956B24138G0202M3538f4574l55787B05266
12933I5781J93156j28957a50660A76788n9273L4926L0823G5331k2961A1265J79848
$$ plain form
13010 180226 389633 -153827 274385 86183 -169080 231612 -81663 159458 236710 -93685
12999 210077 385728 62931 -151256 182798 111304 -9516 321013 249346 -34076 138563 384169
12988 384169 221276 250296 281581 -6451 284986 -2070 -222433 157600 56823 -98265 5739
12976 -25388 -157050 92345 265628 158927 30412 -36655 57288 136534 -52251 116885 263360
12965 263360 -218917 134869 82434 -223003 153172 -148465 -95943 -75837 93549 -152216
12954 41416 -165006 41766 13181 150022 -80394 106585 -297291 91179 262296 152943
12944 152943 -110311 -251197 -96983 -39956 224138 70202 113740 -64574 -420361 205266
12933 95781 288937 159980 -150660 176788 117515 152441 183264 75331 52370 11265 191113
12922A91113a0420k64806B05739H9306l4209P4479a854A82426K54626H9459d8587
12910c67142L533c6709C45828j53460H7993J16947q3075j6747f8862H0248N3794
12899A34042a02511B96159F732a91147A97763o5598K43997A65808a72123L3692
12889a38431A49931C3304a47397C1443J5202J03472F6570K28067N3144e0054D2047
12877C57094a30422G8089a17037C39974q8848r4762c22145J17425b8076B08992
12866a05864C844K41046A03516Q6166a62902p1916A10311C8586a43070A11529
12855b46970A05120J36012a98994i5622C8874K64260i6515r4801b9043l250k67318
12844b99611C4602K61338a51624K3108C39097a06918a9449j31927q1316C1411
$$ plain form
12922 191113 -10420 -275226 205739 89306 55097 129576 -1854 182426 437052 89459 -48587
12910 -367142 -363609 -36709 345828 192368 87993 204940 121865 105118 -68862 80248 134042
12899 134042 -102511 296159 6732 -191147 197763 132165 376162 165808 -172123 -138431
12889 -138431 149931 33304 -147397 31443 46645 150117 66570 294637 347781 -50054 42047
12877 357094 -130422 78089 -117037 339974 251126 156364 -322145 -204720 -28076 208992
12866 -105864 3844 244890 103516 189682 -162902 -234818 110311 38586 -143070 111529
12855 -246970 105120 241132 -198994 -95622 38874 303134 -96515 -191316 -29043 -32293 -299611
12844 -299611 34602 295940 -151624 -128516 339097 -106918 -19449 -151376 -232692 31411
12833g8947A61022B9210i268l00957A08990I59J73248E5944j8272K1105i3782
12821a96967A13302e4154B6758O6656c20754A77102i6760B34353l4353J06895
12811C06895j02576a76058G9759b8114C59845q1715b20794f3328R509D20631b35886
12799E4937a60251A58891b20952H7619a27733g061r82B24402I2128J3046e0724
12787h8666C07054a0136q9252h925A54769E6715a04721A54338J45472c29718B88401
12775h0593B6991i4617j35948c5657p0646I399b00052B41015I3780a43560M6034
12764i7526B99064a37545B22714D9426a87406p4060A71211c35B6581a09112j86374
12753b95486e5430j69777e2876A22815E9634J6798J32172K1379a7855j33403l9939
$$ plain form
12833 -78947 161022 29210 -9268 -310225 108990 959 174207 55944 37672 58777 -93782
12821 -196967 113302 -54154 26758 93414 -320754 177102 -96760 234353 200000 306895
12811 306895 204319 -176058 79759 -28114 359845 278130 -220794 -63328 -53819 420631 -235886
12799 54937 -160251 158891 -220952 87619 -127733 -7061 -8043 224402 92128 105174 -50724
12787 -88666 307054 -10136 -99388 -8925 154769 56715 -104721 154338 299810 -329718 288401
12775 -80593 26991 -94617 -230565 -35657 -106303 9399 -200052 241015 93780 -143560 -97526
12764 -97526 299064 -137545 222714 49426 -187406 -261466 171211 -335 26581 -109112 -295486
12753 -295486 -55430 -225207 -52876 122815 59634 76432 208604 229983 -17855 -151258 -191197
12742a91197A09925f6158H3646k4939k2576K24162H0875R9677a57774B89477b06153
12730B52942c2732k30897A8307O9846J39962C4106a16759B40315C5155K32349
12720B67504G7629J21690q2145o859e7829j87351R1474h056A30538m9164N2426
12709A33800A4573L46319G2371B6525a57835b9201D1215L70943f7340k6559A24618
12697A71816a03075R874A84075E2080b707p950E2510K57168q4428I2969b69263
12685F4983a6764A40710j7934c6588J5493l28928B28815f672l05216A20878b6061
12673f4989A58493E7071e4687A45487b72529A90481q4208j6029k0203J25125a53953
12661A48982K25242L0014A03377j0486h2053C85772j48578b14783A12606J7961
$$ plain form
12742 -191197 109925 -66158 83646 58707 36131 260293 80875 180552 -157774 289477 -206153
12730 252942 -32732 -263629 18307 88153 228115 34106 -116759 240315 35155 267504
12720 267504 77629 199319 117174 110315 -57829 -245180 -153706 -8056 130538 81374 133800
12709 133800 14573 360892 72371 26525 -157835 -29201 41215 412158 -67340 -93899 124618
12697 171816 -103075 -93201 184075 52080 -2707 -10657 52510 309678 225250 92969 -269263
12685 64983 -16764 140710 122776 -36588 -21095 -350023 228815 -6672 -311888 120878 -26061
12673 -64989 158493 57071 -54687 145487 -272529 190481 106273 90244 70041 195166 -153953
12661 148982 374224 404238 103377 92891 -82053 385772 237194 -214783 112606 130567
12651A30567P4169p7429J07436a82488A00567a83277A04597K19046A32878m5788
12641H7090J32251l5509J9860E0337J28980E7072d4282A881K0470J29657d79495
12629G6383a2913A41983k4614i3221j7409A02865b07164C77211H5836m0899L19666
12618C64603j48338I2588A7721K39371j22A22493a77680D00498A27503E1982L29500
12607C81482n7634j09875j9421D4933K0967a28121j5537A59436o9583i2007D2692
12595B39414C8855M5464a47703A85966e6214B91542D4582L3973a39695C46527
12584D5865L6407J71073a51813B03836Q4952K13968b1046C47572i2381r8688F0818
12572b13568B15677B2145J17360F8397P8797O6361f5607j891k03887m4079H8642
$$ plain form
12651 130567 204736 127307 234743 -182488 100567 -183277 104597 323643 132878 87090
12641 87090 219341 183832 203692 50337 179317 57072 -44282 1881 22351 152008 -479495
12629 76383 -12913 141983 117369 -93221 -110630 102865 -207164 377211 85836 44937 364603
12618 364603 216265 92588 17721 257092 256970 122493 -177680 400498 127503 51982 381482
12607 381482 323848 213973 194552 44933 65900 -128121 -143658 159436 89853 -92007 42692
12595 239414 38855 84319 -147703 185966 -56214 291542 44582 78555 -139695 346527
12584 45865 82272 253345 -151813 203836 288788 502756 -21046 347572 -92381 -191069 60818
12572 -213568 215677 22145 139505 68397 147194 213555 -65607 -67498 -271385 -315464 88642
12560B78016q9320a60411A55086c76413J85240A37522i9563H473R0415N4959a7541
12548a54727A74953C5578J58961G4484R8933o1087a09535A87014G7651a04977
12537C49327B2522f859A72914b00462G1899l2095L69765a58043F9754g6023A18619
12525I555J6211a52482j43659B76868q9989b1235H6382O8087C2432b06451C7087
12513B94554b52130e9116B39410f2741q6545H4918m894f1290k2092I0876J87198
12502B78074H3723R0333a04045k8524A3621L5816c4228F0957G560a55948A79651
12490A82748K0714b20440A80541a93981b2094j5419p1748L9568j8355p6273A16699
12478c25873C4969a16565B82336a45950B69609c05269B9582c2828E3059K66152
$$ plain form
12560 278016 188696 -160411 155086 -376413 -191173 137522 -99563 8473 98888 153847 -17541
12548 -154727 174953 35578 194539 74484 173417 112330 -109535 187014 77651 -104977
12537 349327 22522 -6859 172914 -200462 71899 39804 409569 -158043 69754 -76023 118619
12525 9555 25766 -152482 -296141 276868 186879 -21235 86382 154469 32432 -206451 37087
12513 294554 -252130 -59116 239410 -62741 -149286 84918 80024 -61290 -83382 90876 278074
12502 278074 83723 174056 -104045 -132569 13621 49437 -34228 60957 7560 -155948 179651
12490 182748 203462 -220440 180541 -193981 -22094 -37513 -109261 -69693 -88048 -164321 116699
12478 -325873 34969 -116565 282336 -145950 269609 -305269 29582 -32828 53059 319211
12468C19211A9779a36042B66540m9612p4997f9919b8806p1485A28012b26012B72465
12456A25867l3797i6503b5380J0229j56092C4919c9302r5780L9530I6409R8699
12445A95108D7025d47032I3909O7712a53490m3183j00357B04395R805e9058A18233
12433A42948C5687a22244e8197k41092A21193A8790G375N5945a59143j09354B07717
12421A59858b54079p570A43910e15472B36354F8145f0051C04037P645r5043G3393
12409C4520J05260m2373a69567f7161j9506j82707f1815C20653h3741A51893o0744
12398I1149a29584q6803B15522g0382A75401b56401H4374e5787k26853a9590A08796
12386a96485i4402C5702a35130I6835B1362a90764e3640j63973A07539k7633Q4519
$$ plain form
12468 319211 19779 -136042 266540 216928 141931 -69919 -28806 -100291 128012 -226012 272465
12456 125867 92070 -96503 -25380 -15151 -171243 34919 -39302 -135082 -95552 96409 195108
12445 195108 47025 -447032 93909 161621 -153490 -196673 -297030 204395 214200 -59058 118233
12433 142948 35687 -122244 -58197 -299289 121193 18790 7375 63320 -159143 -268497 207717
12421 159858 -254079 -261649 143910 -515472 236354 68145 -60051 304037 311682 216639 73393
12409 34520 139780 97407 -169567 -67161 -86667 -269374 -61815 320653 -83741 151893 91149
12398 91149 -129584 -216387 215522 -70382 175401 -256401 84374 -55787 -282640 -19590 108796
12386 -196485 -94402 35702 -135130 96835 21362 -190764 -53640 -217613 107539 79906 164425
12375A64425a51528O8016p8902H2895A42g6926A5656a06676G6289d9569J542B24248
12362B42431e4189k05799a08119q507Q641D1373a63861e6361j4191A2446h3735
12350a15739A48228a79543E1397K05796I4674N3929b48805H5298g2484j10701
12340a83185B6611d8464j34494N9267a7181C26660f8081C20404H3365K43868a25850
12328b81857M574A0361h3046A76968E4909J05335G1981a18978l31500a71105F8649
12316a62114d1451j966O351B50734a3490B3860J23619b52829g3017F7917B8653
12304C53560a94253H7923R4458h6228D12671F8174J077B0558a04794b3942n4022
12293g7964C14950g8315C1325a09801a709m3279r2041a8709j18747A50536m9101
$$ plain form
12375 164425 -151528 -83512 -162414 82895 142 -76926 15656 -106676 76289 -49569 -48027 224248
12362 242431 -54189 -259988 -108119 -116626 -107985 41373 -163861 -56361 -70552 12446 -83735
12350 -115739 148228 -179543 51397 257193 94674 148603 -248805 85298 -72484 -183185
12340 -183185 26611 -48464 -182958 -123691 -17181 326660 -68081 320404 83365 327233 -125850
12328 -281857 -277283 10361 -83046 176968 54909 160244 71981 -118978 -450478 -171105 68649
12316 -162114 -41451 -43417 -37066 250734 -13490 23860 147479 -252829 -73017 67917 28653
12304 353560 -194253 87923 182381 -86228 412671 68174 69251 20558 -104794 -23942 -77964
12293 -77964 314950 -78315 31325 -109801 -1709 -44988 -137029 -18709 -137456 150536 101435
12282A01435a12331j818C8119J32995a59326c3434f467j33071A14739e014A03508
12270A07699C65d17593i782k73225j4639A71115K6348G1378j6870K83190A5428
12258C56980i6915K3881j6187G088J36630J8669A8791g3927A28859K56361H6842
12246e2120A31667D0949R0108L47418A18770M1566a96662f0814B19589o030M5782
12235B59341p8207l5351J08469j20516j9800K07539E5091J62135f7899B03538
12224F4412a69429D27840D4717a21025A4230a6621A24112D9566i5480B52703J31928
12213C84631j03757a65034C37136q6031r8702l6483L27170l7151i8676D19664
12202B28431l4626O0288J91563j33692j6889P9191i1167k19133A07876a05675
$$ plain form
12282 101435 -112331 -114149 38119 171114 -159326 -33434 -6467 -139538 114739 -5014 103508
12270 107699 365 -417593 -9782 -283007 -297646 171115 197463 71378 54508 337698 15428
12258 356980 -96915 -73034 -89221 7088 143718 162387 18791 -73927 128859 385220 86842
12246 -52120 131667 40949 131057 478475 118770 160336 -196662 -60814 219589 213559 259341
12235 259341 181134 145783 254252 133736 113936 321475 55091 217226 -67899 203538
12224 64412 -169429 427840 44717 -121025 14230 -16621 124112 49566 -95480 252703 384631
12213 384631 280874 -165034 337136 251105 152403 115920 443090 405939 -98676 419664
12202 228431 193805 254093 445656 311964 295075 374266 -91167 -310300 107876 -105675
12191B94781k0968m1791B1515Q2927J43297R5201M9455e2819D13694d3948C26959
12179D85468g5308r6040C90460j11357A08727B1389J26968n2531L41573E0196
12168i466C64504q0328L8035g1247D27016A2782d9831A78542g608B21133f6554
12156A74923a0995D45590j14414m4701j35561K89418B11612P504K05298A19793
12145d2632A91016K18418j26363A05035K23333a11150A07623m0642j3049g163
12134A24782k1587b37057B92697c86199a05993d2063F3732N6657l4481Q0433C0944
12122c56502e7969D4352J7807a34238e3462j31332A06136f1041a5723n938H5176
12110d8223E994a45278N7189C28599A6225a18860A56919b7551l132r1794B90360
$$ plain form
12191 294781 273813 232022 21515 104442 247739 342940 392395 -52819 413694 -43948 326959
12179 485468 -75308 -171348 390460 279103 108727 21389 148357 95826 437399 50196
12168 -9466 364504 284176 322211 -71247 427016 12782 -49831 178542 -7608 221133 -66554
12156 174923 -10995 445590 331176 286475 150914 440332 211612 219116 424414 119793
12145 -42632 191016 409434 283071 105035 328368 -111150 107623 66981 53932 -7163
12134 124782 103195 -237057 292697 -386199 -105993 -42063 63732 120389 85908 166341 30944
12122 -356502 -57969 44352 62159 -134238 -53462 -184794 106136 -61041 -15723 -21661 85176
12110 -48223 5994 -145278 -88089 328599 16225 -118860 156919 -27551 -30683 -122477 290360
12098A98029J67750j51917a65077g540k71385a78C4586a23790e8390A78923a92896
12086h2949q3486N9389l94966i9772A1959a09050b3296D0863a54752e0801A67542
12074h6927A1614J93629a55768E0744K5089K7934b05405I7998b8049D8316K94455
12063C42771q3009D0757c35707f7650j07102B64659C0515a6909B35508J9141O5191
12052C19840c53490h2435I2313C9570J8412A980K71053a22752K3967C14997g6237
12040B14148p9983M6620h4059l0075e6279B57642a71078n2825C1906L915c9446
12028C06758e5247C00669a93523C1998h2488A23183c20043e1458B14911n9405
12018A55506G979J1582o295M8126K1786L9603a73557A20995B8105a64799B71963
$$ plain form
12098 198029 365779 213862 -165077 -7540 -278925 -178 34586 -123790 -58390 178923 -192896
12086 -82949 -166435 -107046 -502012 -99772 11959 -109050 -23296 40863 -154752 -50801 167542
12074 -86927 11614 205243 -155768 50744 75833 103767 -205405 97998 -28049 48316 342771
12063 342771 259762 40757 -335707 -67650 -174752 264659 30515 -16909 235508 254649 319840
12052 319840 -353490 -82435 92313 39570 57982 1980 273033 -122752 -98785 314997 -76237
12040 214148 134165 180785 -84059 -114134 -56279 257642 -171078 -223903 31906 35821 -39446
12028 306758 -55247 300669 -193523 31998 -82488 123183 -320043 -51458 214911 155506
12018 155506 7979 19561 13266 61392 83178 122781 -173557 120995 28105 -164799 271963
12006E7519A4441Q6104b24413c5825j3963b1984B22759a7618j92891A22140a6212
11994I4664j9742a22373C6663b00970f9435B8356b45058A98309P3605a23305B32483
11982A27479P8918l4408a66599H5498b55819J04310P0456A90435g8079A62448
11971b30880m8980J15941D9234e4192n0070c6053j26170A27378a64164A32280
11960A58113A3220L8419i180k68048J37026B00389o2012J44377O2663c783j78130
11949a81913L6370A43119a56396A27160N5573d6880n4457B96756I9543B4053K88702
11938C12755B2702a05388c0676l9501j7855k75307D9623J94885h1670B39629O4479
11927C04108C7614e9776A54159B1884J38938a7683B82930a36771F2145R9661B665
$$ plain form
12006 57519 14441 100545 -224413 -35825 -49788 -21984 222759 -17618 -210509 122140 -16212
11994 94664 74922 -122373 36663 -200970 -69435 28356 -245058 198309 271914 -123305 232483
11982 127479 206397 171989 -166599 85498 -255819 -151509 -81053 190435 -78079 162448
11971 -230880 -279860 -163919 49234 -54192 -104262 -36053 -162223 127378 -164164 132280
11960 158113 13220 51639 -9180 -277228 -140202 200389 138377 282754 345417 -3783 -181913
11949 -181913 -145543 143119 -156396 127160 182733 -46880 -101337 296756 99543 24053 312755
11938 312755 22702 -105388 -30676 -70177 -88032 -363339 49623 244508 -81670 239629 304108
11927 304108 37614 -59776 154159 21884 160822 -17683 282930 -136771 62145 161806 2665
11915B67075n2238f0749m570A15571M8717e8994A0013c22485A98951I3606A7134
11903c07199m922P2915R6477A98602D5955a61034N9448A19481J75455b22311a02560
11891b21544K0591A51137o5845O9277N8439n1245J46696c80162A70780D8642b4158
11879A14987l5148B1233a05369c4874j14216I4187a84468a861n7539A29240c1828
11867f0786I1240J90788E9577i0108G541J04835b51862L9355b5565B21084r3518
11856A27566a49383E5257b09674I1575G166J1261J06970B243b3931I1034j1394
11845G9640j8469e9872p4035O811L9586g864A21372a89728C68335A4257J21172
11834A35429a57261D5596d08024O1070E2245b00155L8171m9252N2973B6955b48766
$$ plain form
11915 267075 214837 -60749 -65319 115571 164288 -58994 10013 -322485 198951 93606 17134
11903 -307199 -312121 -239206 -142729 198602 45955 -161034 -101586 119481 294936 -222311 -102560
11891 -221544 -200953 151137 85292 154569 213008 161763 308459 -380162 170780 48642 -24158
11879 114987 79839 21233 -105369 -34874 -149090 94187 -184468 -1861 -59400 129240 -31828
11867 -60786 91240 282028 59577 -90108 7541 112376 -251862 -212507 -25565 221084 127566
11856 127566 -149383 55257 -209674 91575 7166 18427 125397 2243 -23931 91034 79640
11845 79640 61171 -59872 -133907 -127096 -87510 -7864 121372 -189728 368335 14257 135429
11834 135429 -157261 45596 -408024 -346954 52245 -200155 -161984 -211236 -158263 26955 -248766
11822G4768d4367B68473b2970j73559g2897B51054h4370l13811a617j05843d3773
11810a27995A12952f8125L3240J6456A47408F5499P2966a18967D6063c7959B51979
11798h5545b9479j59475B1516b86685R3183A62342D0476a46863H5840R1052B778
11786b23131D3355N243i344I3350f8536B6777a54741A8585a42677A03469a789
11774D6135h5227A0088b7932B35967g9526m2699m1634M6448A05821P5686a44173
11762A66807O5214b31498A6979N96709H7175j9389R4404h9966F6469f5964m9446
11751a15410E4927c7824B55137b32564A10905a62788A78205A0067a29802H3079
11740b13376P9430N3000c6449C6674Q32J256a41461A22969n6131h4806a655j19860
$$ plain form
11822 74768 -44367 268473 -22970 -196529 -72897 251054 -84370 -398181 -1617 -107460 -43773
11810 -127995 112952 -68125 -34885 -18429 147408 65499 138465 -118967 46063 -37959 251979
11798 -85545 -29479 -188954 21516 -286685 -193502 162342 40476 -146863 85840 176892 2778
11786 -223131 43355 48598 -9344 93350 -68536 26777 -154741 18585 -142677 103469 -1789
11774 46135 -85227 10088 -27932 235967 -79526 -122225 -163859 -117411 105821 181507 -144173
11762 166807 232021 -231498 16979 613688 87175 67786 162190 -89966 66469 -65964 -115410
11751 -115410 54927 -37824 255137 -232564 110905 -162788 178205 10067 -129802 83079
11740 -213376 -133946 -80946 -36449 36674 37506 38762 -141461 122969 66838 -84806 -1655 -121515
11728a21515k95091a34719L3536A4226c23908A40865D4578A3052c49712B99911
11717e9976B757P6260L6294J12229a03875B04464a09426D1387K79573c39112H107
11705B08362o2497k2867c222C8676J14359j4231J13269a59382A2555a26036B28037
11693D11125a81539A56650J25473i279l4909f494l5221A39602O7010b16234J03131
11682a13103A14115N1899i9760B3318J98521j01470L40842b42189B50744J08719
11672C59463f6889B00578j7960d1134C13362h5123G7977o061j8162e291A49827
11660b41186B73961L8524o6442h9939F7160j6386j1898J35079j5396g0810A50466
11648B70500a78681f6222B90606E9771c4756B15021d9868A74644A6292c17419
$$ plain form
11728 -121515 -416606 -134719 -101183 14226 -323908 140865 44578 13052 -349712 299911
11717 -59976 2757 79017 115311 227540 -103875 204464 -109426 41387 320960 -339112 8107
11705 208362 145865 122998 -3222 38676 153035 138804 252073 -159382 12555 -126036 228037
11693 411125 -181539 156650 282123 -9279 -44188 -6494 -41715 139602 206612 -216234 -113103
11682 -113103 114115 166014 -99760 23318 221839 120369 461211 -242189 250744 359463
11672 359463 -66889 200578 182618 -41134 313362 -85123 77977 71916 53754 -5291 149827
11660 -241186 273961 312485 246043 -89939 67160 50774 38876 173955 158559 -70810 150466
11648 270500 -178681 -66222 290606 59771 -34756 215021 -49868 174644 16292 -317419
11637b85335B92888K625A14310e7087B0894Q5335a08471m2059J9323D06753d7845
11625e5339j81779E6027K33395b261q7789j78900J01162I0369l689k1610k8479
11614C6591K19996k3977b7957A81135F0526m595k7037J25263c25134D5750J41947
11603A87697b71902R4494B05608r9870a66499j80951A67772i342B04714G4632
11592B98023c7866A81068k5003a68615I7871L59922B07796c4103B3910h1004E1922
11580a38835j64874e3443l834D3526J49987c9611D68931F9058K56749J13967A85583
11568A34477J75964C3522L0281e4037H1101K28853c2528n6472D5280K70080D415
11556G8449k5785J36809J36523j08258D5635g5400A3818g4204C29845I0176a99555
$$ plain form
11637 -285335 292888 295513 114310 -57087 20894 106229 -108471 -150530 -131207 406753 -47845
11625 -55339 -237118 56027 289422 -2261 -90050 -268950 -167788 90369 86680 65070 36591
11614 36591 256587 232610 -27957 181135 60526 55931 28894 154157 -325134 45750 187697
11603 187697 -271902 -177408 205608 105738 -166499 -347450 167772 -9342 204714 74632
11592 298023 -37866 181068 156065 -168615 97871 457793 207796 -34103 23910 -81004 51922
11580 -138835 -303709 -53443 -57277 43526 193513 -39611 468931 69058 325807 439774 185583
11568 134477 310441 33522 63803 -54037 81101 309954 -32528 -89000 45280 315360 4415
11556 78449 52664 189473 325996 217738 45635 -75400 13818 -74204 329845 90176 -199555
11544h6170A3501M08748B0749L0887M5074i6446k74642a82612B21402o2903J06493
11533B64992a15695B46119a77513P672C6182K5535J3907K41660D9037J79603a21547
11521i6975A39019J1527b36291A47543J73665A52645K0696J56816A15874M3328
11511A59202A7635Q4754j3398J74812d9143J1049j86127q6562D30928A66083l453
11500A62630L375J86972b00708b5744C26579e8462q9834A704L4195Q5264L52103
11489D73266A54710A8982K55477b0220A79698m9882d47748C77499o4897j35978
11479A76624J24457r5498E8355a46587H7551a47840D03721e2378B49672Q8567
11469C38239j53387k3600d0246A24510k9810O7202J2298k0431J7773L6413o0686
$$ plain form
11544 -86170 13501 422249 20749 51636 96710 -96446 -371088 -182612 221402 158499 264992
11533 264992 -115695 246119 -177513 -169841 36182 61717 75624 317284 49037 228640 -121547
11521 -96975 139019 150546 -236291 147543 321208 152645 173341 330157 115874 159202
11511 159202 17635 102389 88991 263803 -49143 -38094 -224221 -310783 430928 166083 162630
11500 162630 166005 352977 -200708 -25744 326579 -58462 -148296 1704 35899 121163 473266
11489 473266 154710 18982 274459 -20220 179698 129816 -447748 377499 312602 176624
11479 176624 301081 205583 58355 -146587 87551 -147840 403721 -52378 249672 338239
11469 338239 184852 161252 -40246 124510 94700 161902 174200 153769 171542 207955 147269
11458A47269N0484e9444B33458g3618B5743K54843q0455a24943A83123K05476
11448C88599B832a18298A24527a38431n4220A48481a36129A92537o0217O0487
11438A92807K0621I9012N8077K9715M21364B71235i6925A2261a3370p31l0998
11427d5099B3288g2814A84834c12607A72861a85246D8252a334B44592B1450J12182
11416A33632d06629B14715G3796b8281A25608c3045E5964e3681B2300L53562b4142
11404d27618B37559g9645A23276H501K227d03007A58878L0081B7713a78775A34757
11392I9634a20433A93662f0365B46901a68917I6081b82447b7632B7385g9198k23466
11381c02664A28525Q1810D6261a53654C4210a7911r6242A83498p9765a85509I4274
$$ plain form
11458 147269 197753 -59444 233458 -73618 25743 280586 200131 -124943 183123 388599
11448 388599 2832 -118298 124527 -138431 -192651 148481 -136129 192537 132320 192807
11438 192807 213428 99012 157089 186804 608168 271235 -96925 12261 -13370 -14101 -45099
11427 -45099 23288 -72814 184834 -312607 172861 -185246 48252 -1334 244592 21450 133632
11416 133632 -406629 214715 73796 -28281 125608 -33045 55964 -53681 22300 375862 -24142
11404 -427618 237559 -79645 123276 8501 10728 -403007 158878 188959 27713 -178775 134757
11392 99634 -120433 193662 -60365 246901 -168917 96081 -282447 -27632 27385 -79198 -302664
11381 -302664 128525 210335 46261 -153654 34210 -17911 -114153 183498 103733 -185509 94274
11369b4067B41453b9901A76721J38123b83181i5186j97392A61567F6088J22382
11359A88470a97849A1256a01973I6296H773M7790e3543B41172a33005C6706b21924
11347F2249J04262a04764G5334a12320D7404A8607b42665A7329g9928k12289c9019
11335A53236j8093k976a01470A46828f6748I3963P7351f5820B20881r5322f9147
11323a77632Q4588j42319A85101b18369c8976j14020A27728j9196d6686B64947
11312d7948E6254c40570M1791b0886j44575g5203k52755h1683j89524d5420m2380
11301h7800A52843c9479A8094f053C32087j23303b8125r1541K4949A39227J40164
11290B79391f9534k04587E1712f4690A41205b45921j66913J96660C9854b19656
$$ plain form
11369 -24067 241453 -29901 176721 314844 -283181 -95186 -292578 161567 66088 188470
11359 188470 -197849 11256 -101973 96296 8773 56563 -53543 241172 -133005 36706 -221924
11347 62249 166511 -104764 75334 -112320 47404 18607 -242665 17329 -79928 -292217 -39019
11335 153236 135143 132167 -101470 146828 -66748 93963 171314 -65820 220881 125559 -69147
11323 -177632 -93044 -235363 185101 -218369 -38976 -152996 127728 108532 -46686 264947
11312 -47948 56254 -340570 -298779 -20886 -165461 -75203 -327958 -81683 -271207 -45420 -87800
11301 -87800 152843 -39479 18094 -6053 332087 208784 -28125 -119666 -94717 139227 279391
11290 279391 -69534 -274121 51712 -64690 141205 -245921 -412834 -216174 39854 -219656
11279I839d2724p8852L0991H0964b64668a11278E5056d9117A593L9263i6839A35021
11266B99022M8589a22922H5665g8285A0268O8084b69168b1389A90917a58707A40905
11254a03272F5077A0535c31890a16022H2645B8404f0866r8204E9783h8418l6696
11243a25114C9383j6549a28587c147A46176a41113n657j2966l2079J8456c178
11231c21493a7815k43352a00614B61682b13006C2793a25771H1455K08776d0441
11220a2401j9372A46213i3110C10867d5942k51544i8143l932q2893j43096b8841
11208F7466a88115b7862G6586f3335b415A56004B2815b2078A92828C4907K56601
11197B91508f9792I2566O9449g3251B45364F193c66347G5628b29563h8716L7105
$$ plain form
11279 9839 -42724 -121576 -90585 80964 -264668 -111278 55056 -49117 1593 40856 -96839 135021
11266 299022 347611 -122922 85665 -78285 10268 78352 -269168 -21389 190917 -158707 140905
11254 -103272 65077 10535 -331890 -116022 82645 28404 -60866 -159070 59783 -88418 -125114
11243 -125114 39383 22834 -128587 -3147 146176 -141113 -146770 -159736 -191815 -173359 -3178
11231 -321493 -17815 -261167 -100614 261682 -213006 32793 -125771 81455 290231 -40441
11220 -12401 -31773 146213 -93110 310867 -45942 -297486 -98143 -102075 -184968 -328064 -28841
11208 67466 -188115 -27862 76586 -63335 -2415 156004 22815 -22078 192828 34907 291508
11197 291508 -69792 92566 162015 -73251 245364 6193 -366347 75628 -229563 -88716 -51611
11186e1611C9931Q088J06293h6680K251B2429J65011b70226P8032k42515C4243
11174G6831i1287a8970E8310b38965e1202j17409b4280q5128c2135A54159p0839
11163H3320b01348g4142k0925G2834c34173B80339b93676R1909i6625A6979h8791
11151b70632A16508R1153F6363a83142A04004l2069a58914c6070j13887n5675
11141b05632A09251a83459K7478n283E287h7053A07827K06531B9452a26237l5484
11130a61721c8311C84159d01633c0319E4352d08694B36540B7242A0173K65434
11120B75607a85239A1376L6135L26648j72311b02467B8855N4469a75961f3374
11109b75059A91362i9194E8400J04008a14942G3392L68442A3335J95655o97f2925
$$ plain form
11186 -51611 39931 48019 154312 -86680 -84429 22429 187440 -270226 -192194 -434709 34243
11174 76831 -91287 -18970 58310 -238965 -51202 -168611 -24280 -109408 -32135 154159 83320
11163 83320 -201348 -74142 -95067 72834 -334173 280339 -293676 -201767 -96625 16979 -88791
11151 -270632 116508 207661 66363 -183142 104004 71935 -158914 -36070 -149957 -205632
11141 -205632 109251 -183459 -155981 -161264 5287 -87053 107827 314358 29452 -126237 -161721
11130 -161721 -38311 384159 -401633 -30319 54352 -408694 236540 27242 10173 275607
11120 275607 -185239 11376 47511 374159 201848 -202467 28855 83324 -175961 -63374
11109 -275059 191362 -99194 58400 162408 -114942 73392 441834 13335 208990 208293 -62925
11097d9370q2997A34822g9090C2717M50860d3047B31854E4605c0207B05187a23316
11085a88507A71012c3196B92433J11899C9962P3741J8048f4180I971J22910G097
11073B47630j07002K28184l2624r5050q9776E4379L48518A55180o5380J69035
11063B58835l1340m7465l098E2131K85634j29020J16626I7118J66117A23210M12079
11052E35289j94187K66169B05196O3008J63812Q0651J14757K75268B93057M92740
11042G85797l25821J58811r514j80057J94439r2213J24133J06353P8865j74560
11032F66233j45819K79838L4466m04879M04642l54523L51989r909K3687k75343
11022E70382j78239M10082j2297l20800M15757m06696J50739j34676B45439M44098
$$ plain form
11097 -49370 -132367 134822 -79090 32717 483577 -43047 231854 54605 -30207 205187 -123316
11085 -188507 171012 -33196 292433 404332 39962 113703 131751 -64180 9971 132881 7097
11073 247630 140628 368812 336188 241138 151362 54379 402897 155180 89800 258835
11063 258835 227495 180030 176932 52131 337765 208745 325371 97118 263235 123210 535289
11052 535289 341102 607271 205196 268204 432016 512667 627424 902692 293057 785797
11042 785797 459976 618787 609273 429216 623655 531442 655575 761928 840793 666233
11032 666233 520414 800252 834718 429839 834481 479958 831947 822038 845725 570382
11022 570382 392143 802225 789928 469128 884885 478189 628928 494252 245439 689537
11012F89537J49232j3695k84147M81398m15170j12563M00469k3490l65688J7123
11002E23006j38347K67756J13706k78496L79524k10782B19865M04966O359n0704
10992E80486J06187r6528q0862L43165C80374K62235K2896l21164L03981j38329
10982E09993J79000n4955Q15J22564l71256K65859J54078j4458J10533L7183k81081
10971F58275L117J8015K14145K19018j80656m0799K92925N5254K08548j13629
10961A334213N01861K7087K42091K87301p5790J05863l36755L55701J13514n89706
10951A965380J19895l24390P8866k69605p1142j19229M17396k60757o0448m79
10941A475487j83137J5518j59581L5637j83806j1141D81118K73937k10486A51495
$$ plain form
11012 689537 838769 825074 540927 1022325 607155 494592 895061 871571 505883 523006
11002 523006 384659 652415 766121 487625 867149 656367 219865 624831 631190 580486
10992 580486 686673 590145 509283 852448 380374 642609 665505 344341 648322 509993
10982 509993 688993 634038 634853 757417 386161 652020 806098 791640 902173 939356 658275
10971 658275 661392 679407 893552 1112570 931914 891115 1184040 1239294 1447842 1334213
10961 1334213 1836074 1863161 2105252 2392553 2316763 2422626 2085871 2441572 2555086 1965380
10951 1965380 2085275 1760885 1839751 1570146 1499004 1379775 1797171 1536414 1475966 1475487
10941 1475487 1292350 1307868 1148287 1183924 1000118 988977 481118 755055 544569 151495
10930C80210j0069f7553B72405l4946a4086D40913d0548C21343f1728I4350a5238
10918h5537J7882B5640M954a1671k39344G8355a98147a2411j02270B698d3864
10906b5656I4513N5753F5511O4613J76724N8540a4361D57139G5291B2821a09181
10894b29834D8148a51312B56945F313Q8118g1938E7034d6695B01895a85449E4299
10882B08325b24771c5912a4413m18930D948N4606A4223K03831q5508a78235A87363
10870a722A32363P5579R9608A9034c36714A08866D5357h6927L0795j53848d1711
10858b67765P5059Q3634L4626R627j42509A59986a34243A81877h4123E5743a67252
10846a35039o4857m3864A83044a6122o6983j69183E6214M7703a20904I802e4316
$$ plain form
10930 380210 370141 -67553 272405 237459 -14086 440913 -40548 321343 -61728 94350 -15238
10918 -85537 -67655 25640 30594 -11671 -251015 78355 -198147 -12411 -114681 2698 -43864
10906 -25656 94513 150266 65511 130124 306848 365388 -14361 457139 75291 22821 -109181
10894 -229834 48148 -151312 256945 6313 94431 -71938 57034 -46695 201895 -185449 54299
10882 208325 -224771 -35912 -14413 -433343 4948 59554 14223 218054 132546 -178235 187363
10870 -1722 132363 207942 307550 19034 -336714 108866 45357 -86927 -56132 -209980 -41711
10858 -267765 -192706 -109072 -74446 -64819 -207328 159986 -134243 181877 -84123 55743 -167252
10846 -135039 -199896 -243760 183044 -16122 -83105 -252288 56214 103917 -120904 9802 -54316
10834i1036B43893j4794B776d6335A0452a51276j62356h0559a4752A28624K429
10823A31053a30897k39928a0898k66714B7503j3193K79334b83891b0813q0155
10813a00968L7366r5451I2763h135D295g5180k18776J08323Q9469A5222Q2303
10802I7525J93901A38370b40914L6672c3254C4305b58490R9979n7327J02641b5873
10790A97698g4607k1418B26062r5225a37638j23960A08082h0129J6290A15703
10779F2355i3412o515j14383G6411e7577D513a40794C3251b55344L9432a1022
10767C676a10141m2181g1851D1441J2612N256b6111a2309C3886A3518P744F652
10754A35712f8552j05435k0236c015C1385a9040G4041a99207e409D30691i6696
$$ plain form
10834 -91036 243893 229099 2776 -46335 10452 -151276 -313632 -80559 -14752 128624 131053
10823 131053 -130897 -370825 -10898 -277612 27503 14310 293644 -283891 -20813 -100968
10813 -100968 -63602 -159053 92763 -8135 4295 -75180 -293956 -185633 -96164 15222 97525
10802 97525 291426 138370 -240914 -204242 -33254 34305 -258490 -158511 -215838 -113197 -25873
10790 197698 -74607 -96025 226062 130837 -137638 -261598 108082 -80129 -63839 115703
10779 62355 -93412 -99927 -214310 76411 -57577 4513 -140794 33251 -255344 -215912 -11022
10767 3676 -110141 -152322 -71851 41441 54053 59309 -26111 -12309 33886 13518 21262 6652
10754 135712 -68552 -173987 -194223 -3015 31385 -19040 74041 -199207 -5409 430691 -96696
10742b7406k4597A37987B3156O210R2858a73694b2387Q816B92208o4054I3490
10730c28367a43522O1859c3148D249b31754B74224D6080L2575a03232a5563A68796
10718a4019A33600Q562a79927M8563A2631J29912p0372a63660N84j7122Q5552
10707i4646E5218J01605b4908B21618a73595c160k8613k54936A64126G0463a69579
10695C7006c43231R9899a07713A5006a16468a53A44491B8629I126a03956q5761
10684a89717B11432a53958B92951d04037A81464h2514C6530Q2841L9784A5328
10673b60117a00825c4505j50343A84521N0747B6809b52011i8907q8267P6277n722
10662a16619n923A89616I3782a27395l43708a4812A32073Q3734d1051N118C1876
$$ plain form
10742 -27406 -52003 137987 23156 29366 122224 -173694 -22387 -13571 292208 228154 93490
10730 -328367 -143522 -81663 -33148 4249 -231754 274224 46080 78655 -103232 -15563 168796
10718 -14019 133600 142162 -179927 -131364 12631 142543 72171 -163660 -163076 -180198 -94646
10707 -94646 55218 156823 -24908 221618 -173595 -3160 -31773 -286709 164126 70463 -169579
10695 37006 -343231 -243332 -107713 15006 -116468 -153 144491 28629 9126 -103956 -189717
10684 -189717 211432 -153958 292951 -404037 181464 -82514 36530 119371 159155 15328
10673 -260117 -100825 -34505 -184848 184521 235268 26809 -252011 -98907 -187174 -110897 -116619
10662 -116619 -122542 189616 93782 -127395 -471103 -14812 132073 215807 -41051 -35933 31876
10650a20476N6576j00566O9679k1166A7906a55223I498b46607D8764d40242a50360
10638C42333a92062N5803d355k7741p8024B8049b15516o6086G5718a28620A02736
10626d28905a91742E9413b95253j41164A66825E6000d377H2055e1334n7543C38031
10614G4701a6783B9959i3542k14190a09237a2925I4516a65696j32813J39851B66467
10602D92008d1639j57309e0042j29070A52582B6137P9784K88412A79712E5823
10591D7796a59807A07756k8106b25244B2341a50614e0894o8659e196C699a29627
10579G264K64572a46817k7956F319J17423J45733D1378n963c51693g284l3784
10568d1068D1053k838H827c25702a17402A17313f0271k8627j57532A48244n4716
$$ plain form
10650 -120476 -63900 -164466 -94787 -115953 17906 -155223 9498 -246607 48764 -440242 -150360
10638 342333 -192062 -136259 -4355 -32096 -110120 28049 -215516 -281602 75718 -128620 102736
10626 -428905 -191742 59413 -295253 -436417 166825 56000 -4377 82055 -51334 -108877 338031
10614 74701 -16783 29959 -93542 -307732 -109237 -12925 94516 -165696 -298509 -158658 266467
10602 492008 -41639 -198948 -50042 -179112 152582 26137 105921 394333 179712 55823
10591 47796 -159807 107756 79650 -225244 22341 -150614 -50894 -119553 -5196 3699 -129627
10579 7264 271836 -146817 -174773 6319 123742 269475 41378 35415 -351693 -7284 -41068
10568 -41068 41053 38215 8827 -325702 -117402 117313 -60271 -88898 -246430 148244 93528
10557I3528a36711K722b4494l81283h7151A29656k5496R1147K72107B1940N9955
10546H1895b95527a21625g804A66191F3791c6664k9166k90679a17328M2534A6338
10534A12115M4144a58047j45729b5608j53022B8427g8001l91439g9353c584A94617
10522B02016a50747k4051l4286o5669P6503P1134j5907B0401Q5257a09137l70841
10511d79978b3693F2296c2082l66982a76503C0044b8109q7998B46596a87014I1126
10499a0045l58648C8164i461A09441l9478a30755m8633g816A49056a01646k03577
10488c05223N5349p198A13360B5034R9421l0071J75828h325F2984a9652o9950
10477h9602C01149h4665A00363C8065L0486J75079e2951B97971m4105L77017k32624
$$ plain form
10557 93528 -136711 -133989 -24494 -405777 -87151 129656 104160 195307 467414 21940 81895
10546 81895 -295527 -121625 -7804 166191 63791 -36664 -65830 -356509 -117328 -74794 16338
10534 112115 156259 -158047 -303776 -25608 -178630 28427 -78001 -469440 -79353 -3584 194617
10522 202016 -150747 -174798 -209084 -274753 -198250 -127116 -143023 20401 105658 -109137 -479978
10511 -479978 -23693 62296 -32082 -399064 -176503 30044 -28109 -116107 246596 -187014 91126
10499 -10045 -368693 38164 -9461 109441 69963 -130755 -179388 -7816 149056 -101646 -305223
10488 -305223 -249874 -257072 113360 25034 124455 94384 270212 -8325 62984 -19652 -89602
10477 -89602 301149 -84665 100363 38065 68551 243630 -52951 297971 253866 630883 398259
10466C98259j1633A11644L17254A90491d43912F8952i8684J1880d505j22547A94263
10454c48481A17152N0134C216b62637i6301A63042f6826l33991J85639B89257
10443a00498j51730H1624h8271a0189C71207A59841b06295A60530b75439e9858
10432C5182i3494k37475J40398G4663g6043j31913B1907L4008M7482f887B2921
10420b05072h6664j18069g9931A00679f4622j69516A39562c0715k10878a16834
10409A21591E9366a86614L7068L9452r2350D1553a56133A67618J9263m9545k1692
10398A15644e6383A87766d0159j11380k9530B10549b75493R3159L4060d8348a0753
10386i0064j13396A31735O5882J75751G0328k7810b1474k2875k09063B00954b17196
$$ plain form
10466 398259 386626 111644 428898 190491 -443912 68952 -98684 -86804 -4505 -127052 194263
10454 -348481 117152 167286 3216 -262637 -96301 163042 -66826 -400817 -215178 289257
10443 -100498 -252228 81624 -88271 -10189 371207 159841 -206295 160530 -275439 -59858
10432 35182 -93494 -330969 -190571 74663 -76043 -207956 21907 55915 103397 -6887 22921
10420 -205072 -86664 -204733 -79931 100679 -64622 -234138 139562 -30715 -241593 -116834
10409 121591 59366 -186614 -149546 -110094 -202444 41553 -156133 167618 186881 137336 115644
10398 115644 -56383 187766 -40159 -151539 -181069 210549 -275493 -182334 -148274 -48348 -10753
10386 -90064 -203460 131735 197617 373368 70328 42518 -21474 -44349 -253412 200954 -217196
10374g6092A77138q0502K33979c814q2905p7596e5986D1370N08261k09918c2171
10362B20374r7526a52217A67095L0974p3799d4972B41945K50456B15581L42196
10352E57777A00456L87991B01606K13615H8585K64369H6667M2238M2885i4307
10341A69896n1408J45390J80875b1359D08086J81775N366L15921D27139n4679
10331C72460A66086J82213J34791j40394J02386l077A97735L43840A20506P1196
10321A91702J26913J7132c05767C28583A14943a6379A25991h9127a9689C03585
10310b40807i2625C30172p8436m9280K01359q2404j19227H3204h0953d59A75207
10298A49531h4995B1776b24443a02451H634c46753I7963a95872c0244C1984K41776
$$ plain form
10374 -76092 177138 96636 330615 -3814 -86719 -164315 -55986 41370 549631 339713 -32171
10362 220374 122848 -152217 167095 198069 124270 -44972 241945 492401 215581 557777
10352 557777 100456 488447 201606 415221 88585 352954 86667 128905 171790 -94307
10341 169896 118488 263878 444753 -21359 408086 589861 595227 911148 427139 372460
10331 372460 166086 348299 483090 342696 445082 442005 197735 541575 120506 191702
10321 191702 318615 335747 -305767 328583 114943 -16379 125991 -89127 -19689 303585
10310 -240807 -92625 330172 251736 202456 403815 321411 202184 83204 -80953 -459 175207
10298 149531 -84995 21776 -224443 -102451 8634 -346753 97963 -195872 -30244 31984 273760
10287B73760g7413K1151k04700N6205f7955A18095E4973O7617a19419A82429a56500
10275B62402a042j37307C1634h2720B4899i9602K266k53222I2960l1580b30126
10263b879j14639j70063a33810N5171j96096A40735K2828I487K11060J30006a1048
10251I3627a33649D1347e6352B78013J5152A01107O5689A2532L75745j81133r3115
10240A14029c6760D282b84546A64305j1865f9339K4136k0189A04494e9357n3731
10229a13088j92404D6659J88177K29647a24951D444b500k58958B46506H7590a02738
10217B511h891G6137b77373a28296e121l93464J05697A0567K06093J03065D6708
10205I7875K21177a85095i246C9368J510i6698B12750e8078m3108b7r930l81686
$$ plain form
10287 273760 -77413 -56262 -260962 -204757 -67955 118095 54973 122590 -119419 182429 -156500
10275 262402 -1042 -138349 31634 -82720 24899 -99602 -97336 -350558 92960 61380 -230126
10263 -2879 -117518 -287581 -133810 -78639 -274735 140735 163563 9487 220547 350553 -11048
10251 93627 -133649 41347 -56352 278013 293165 101107 166796 12532 388277 207144 114029
10240 114029 -36760 4282 -284546 164305 152440 -69339 -45203 -65392 104494 -59357 -113088
10229 -113088 -305492 46659 234836 464483 -124951 4444 -2500 -261458 246506 87590 -102738
10217 2511 -8891 76137 -277373 -128296 -5121 -398585 -292888 10567 216660 319725 46708
10205 97875 319052 -185095 -9246 39368 40878 -96698 212750 -58078 -101186 -27 -9957 -391643
10193c91643R3936I8016b48200G7764e5619D4073j1653K3420K04989i7408j55877
10182b53285A36779n4025a51134E5608c42910D07192b10181e9634k12289a0337
10171D857b54350r1950a09417D4811J3139M3231j0014q032a23367m1071j57009
10160c21447F1087b60583G9512b59535P2840F4905Q291b75478a33688q9359G8550
10148c54303B45466j13455c4727A86016b72879a06315p4389B7873c61748j7314
10138c79062a74086A27435B8301b33874g5642k95362a70844C59337h5601B905
10127a20839p2467a6096A07429b55912r2309g5932B38270f5093m2025j64720E0999
10115A43234n5514c1129q4574B46387a10068M8942B1876e3765k30348M9900h7585
$$ plain form
10193 -391643 -297707 98016 -248200 77764 -55619 44073 32420 55840 260829 -97408 -253285
10182 -253285 136779 82754 -151134 55608 -342910 407192 -210181 -59634 -271923 -10337
10171 4857 -254350 -346300 -109417 44811 57950 101181 91167 83135 -123367 -164438 -321447
10160 -321447 61087 -260583 79512 -259535 -186695 64905 73196 -275478 -133688 -223047 78550
10148 -354303 245466 132011 -34727 186016 -272879 -106315 -180704 27873 -361748 -379062
10138 -379062 -174086 127435 28301 -233874 -75642 -371004 -170844 359337 -85601 2905
10127 -120839 -193306 -16096 107429 -255912 -348221 -75932 238270 -65093 -107118 -271838 50999
10115 143234 87720 -31129 -115703 246387 -110068 -61126 21876 -53765 -284113 -234213 -87585
10103a87578A27493a85450D9803h6937A4516h5879a8371g225I6082h0295k9726
10092a10021e558B994M731a86870B97506j01586k2766a7498G1243a2728p227B84888
10079f6353k1216F4427a4244k1133q6654j43205o0997a37915E3611d8000q9549
10068a37549j54791N4705a6937j38532C32871G8544a75571j3863D3818K66998
10058C10816A50127b24572H1757N014a63020J7453p4181j38857A78843a84917
10047a3231A73484J1205E081L26319b61420H398a51929O0984k2557H2728J28955
10036B11683h3218k0046c0896B11661c3295A2079b13591A72061E4733b2390j62389
10025a84779P8550C5251a65309j14623a5818m13034B67678j04309c5581l40948
$$ plain form
10103 -187578 127493 -185450 49803 -86937 14516 -85879 -18371 -7225 96082 -80295 -110021
10092 -110021 -5558 2994 7725 -186870 297506 195920 173154 -17498 71243 -12728 -19955 284888
10079 -66353 -87569 64427 -14244 -35377 -122031 -265236 -326233 -137915 53611 -48000 -137549
10068 -137549 -292340 -237635 -16937 -155469 332871 78544 -175571 -189434 43818 310816
10058 310816 150127 -224572 81757 86771 -163020 -145567 -219748 -358605 178843 -184917
10047 -13231 173484 184689 5081 331400 -261420 8398 -151929 -90945 -113502 82728 211683
10036 211683 -83218 -103264 -30896 211661 -33295 12079 -213591 172061 54733 -22390 -184779
10025 -184779 -106229 35251 -165309 -279932 -15818 -428852 267678 163369 -35581 -376529
10015c76529J0530A42133m5444a81695n148A17544b30750D4523m999h7487F8619
10003b61517c9966o061J671k06157a7562n074A77408b44987A01224a71930n667
9992a77597O4033j04846c9550j71039F809b30017F6255b70084J26652k9039b6845
9980A07981r922M6470E4614i5436j78978J12670F3040c15075J29007a8406k57626
9969b76032f4712N890H5290b54766F3600Q9007e3029F2807J46086a13113L2361
9958h0752A05360h0405A4281J31424b03472B619a50999e6226k17189F1850f7737
9946b35205j47916a88028A29616a95085A87571d5075l101J4159E600K30804j12635
9935A23769a56511D1238K0093e5206B46718A9867b56938F2395K07380a98308Q5251
$$ plain form
10015 -376529 -365999 142133 96689 -181695 -186843 117544 -230750 44523 39524 -87487 68619
10003 -261517 -39966 -46027 -44356 -250513 -17562 -22636 177408 -244987 101224 -171930 -177597
9992 -177597 -113564 -218410 -39550 -210589 6809 -230017 66255 -270084 -143432 -172471 -26845
9980 107981 98059 144529 54614 -95436 -274414 -161744 63040 -315075 -186068 -18406 -276032
9969 -276032 -64712 -58822 85290 -254766 63600 152607 -53029 62807 208893 -113113 -80752
9958 -80752 105360 -80405 14281 145705 -203472 2619 -150999 -56226 -273415 61850 -67737
9946 -235205 -383121 -188028 129616 -195085 187571 -45075 -48176 -34017 5600 236404 123769
9935 123769 -156511 41238 61331 -55206 246718 19867 -256938 62395 269775 -198308 -113057
9924a13057n3404J2785C67926C5923c07418J24537G0235J60772l7678a24134j37151
9913b61285d014p8414c5772C31119E2581g0052k21248D34223b41120j31949J37282
9902b35787A09096c16931A19199L0239G2238R035A6440O8052b11923l17364a2927
9890c6315m2670A33756a12794o2116j58595j02879a18184b6495j19699D35967
9879f6969F5962a07677A83494E5467b67707a04797k18441A10693D5038J44514
9869A89552d81578J76525c1358j3516K2344A7066e9991D6371c92504c1647b546
9857c55181H3008b44989H54K97076j47022c48662J16772I7063a67784j29033M7922
9846b48895A68547J07123C4875K0763a93645d7012b558j99199d8064q1875I7922
$$ plain form
9924 -113057 -166461 -153676 367926 35923 -307418 -182881 70235 231007 193329 -124134 -261285
9913 -261285 -4014 -82428 -35772 331119 52581 -70052 -291300 434223 -241120 -373069 -235787
9902 -235787 109096 -316931 119199 149438 72238 81273 16440 84492 -211923 -529287 -12927
9890 -36315 -78985 133756 -112794 -174910 -333505 -436384 -118184 -26495 -146194 435967
9879 -66969 65962 -107677 183494 55467 -267707 -104797 -323238 110693 45038 189552
9869 189552 -481578 -305053 -31358 -44874 -22530 17066 -59991 46371 -392504 -31647 -2546
9857 -355181 83008 -244989 854 297930 150908 -348662 -231890 97063 -167784 -296817 -248895
9846 -248895 168547 275670 34875 55638 -193645 -47012 -2558 -201757 -48064 -129939 97922
9834a29531n637B4756J51415b73805B7404b3161k51796N6839c1210A65155l7225
9823A27930h3353n351F0079b76190h0520j66824E9635a74104c5203r2897A698
9811a52197M8497A31649E2191g0061k12221L8564M4140N6237L1453A35097J52007
9800B87104E4980c8545B73784a54579I1176O8358F4228B4414J25152d22420c1866
9788A41844E8718Q712b17980b5243m6352i692j46964A01294a70616B4544c4597
9776H004b27060D0665a68679O333g6549b5097l22114J12386R3908P0057j13766
9765a84626B35482a48367j6348F1103k2225o80a76628A0570R0773a62329a0365
9753A28591O3755J2476j01306f0624A5542a99890I2739R2196b40233i238B38604
$$ plain form
9834 -129531 -135168 24756 176171 -273805 27404 -23161 -274957 -218118 -31210 165155 127930
9823 127930 -83353 -88704 60079 -276190 -80520 -247344 59635 -174104 -35203 -128100 1698
9811 -152197 -103700 131649 52191 -70061 -282282 -243718 -199578 -143341 -111888 135097 287104
9800 287104 54980 -38545 273784 -154579 91176 159534 64228 24414 149566 -422420 -31866
9788 141844 58718 67430 -217980 -25243 -71595 -9692 -156656 101294 -170616 24544 -34597
9776 8004 -227060 40665 -168679 -162346 -76549 -25097 -347211 -234825 -140917 -70860 -184626
9765 -184626 235482 -148367 -164715 61103 38878 38198 -176628 10570 101343 -162329 -10365
9753 128591 192346 204822 103516 -60624 15542 -199890 92739 184935 -240233 -9238 238604
9741B50575r7590a79026j13008A03315a39220k15676f1546j26341A383L3626a7961
9729b83070P7745A00513O662a06161A91576q08h3754B0863i9209K4564k62320
9718c36965F5979K04388K6504b30583m663A36371c5730n21802E4510b57102A13422
9706B01668b1487m3075r4680p8041C0797G17R4450b43186c1341j06819J4454B42470
9693D1359A1842a87233A26738a02024r7303A30675m6176a55007d0219E681a62188
9681E4332Q0702k1817B6384b16479J2061d0403D9894a24559M805N0140C48666
9669i8455B0271J88037d54435J27186K493g035j37901B46438c96087I2771c22721
9657a17246M8168A14373n6324c3654A75726A1138c17104g7778j32638J01499A13399
$$ plain form
9741 250575 152985 -179026 -292034 103315 -139220 -354896 -61546 -187887 1383 35009 -17961
9729 -283070 -205325 100513 107175 -106161 191576 190768 -83754 20863 -99209 -74645 -336965
9718 -336965 65979 270367 296871 -230583 -235246 136371 -35730 -557532 54510 -257102 113422
9706 201668 -21487 -64562 -159242 -237283 30797 717 95167 -243186 -31341 -138160 -123706 242470
9693 41359 11842 -187233 126738 -102024 -199327 130675 84499 -155007 -40219 5681 -162188
9681 54332 135034 113217 26384 -216479 -204418 -40403 49894 -124559 -119754 -69614 348666
9669 -98455 20271 208308 -454435 -327249 -324756 -7035 -144936 246438 -396087 92771 -322721
9657 -117246 -69078 114373 58049 -33654 175726 11138 -317104 -77778 -210416 -108917 113399
9645B99581a6020B0101d8551D1614c54876a63785k08105N0717J07937G3861C3061
9633a62418A96886e6689q8848A48902a5393r9497J882o4835B49007I0710a2485
9621f5052B59086p9832F7517k59d4149j6469A3565f3492b8455r8281c19j40692
9609a41011e1939j16651O7640k06541E8500b26024B04755M19103b06242b3466
9598A53366m891J64508c50544A90996b18961D9090b7976A09588e806E3149L3062
9587H6211d02169a89142P2141C695c07229B39573h3366j25120I5639L8273a2370
9575B15835B4772g2305J3758c983A19268k1996D6324P8133k0671b97514f9686
9563g1140q766b3851k3478J711k38740d6373p9276J7625C10570H5587a06800c4116
$$ plain form
9645 299581 -16020 20101 -48551 41614 -354876 -163785 -371890 -321173 -213236 73861 33061
9633 -162418 196886 -56689 -145537 148902 -15393 -114890 -113008 -177843 249007 90710 -12485
9621 -65052 259086 179254 67517 67258 -44149 -60618 13565 -63492 -28455 -126736 -319 -141011
9609 -141011 -51939 -168590 -100950 -307491 58500 -226024 204755 623858 -206242 -23466
9598 153366 148475 312983 -350544 190996 -218961 49090 -27976 109588 -5806 53149 86211
9587 86211 -402169 -189142 -117001 3695 -307229 239573 -83366 -208486 95639 133912 -12370
9575 215835 24772 -72305 -58547 -3983 119268 97272 46324 124457 103786 -297514 -69686
9563 -71140 -79906 -23851 -47329 -45618 -284358 -46373 -125649 -108024 310570 85587 -106800 -34116
9550e0617a9823k3184A35101J62122b50734b0261l65549A05390B6713c97866j10785
9539e08651C6532c94516E495a45681a1984A4947R4892c6250j74984a7941j07257
9528a25198l7799B0970J05490l6918a92388P0266B772J06369b54682e7634F2200
9516b41507I8308Q2698e8005r050Q854E4393b1342F470J5548a10170L6564g178
9503a16989j25745D1115j217e7006j7389G6054A3192K6091c7192k45249A10118
9491f5857k74542e6243A63771d3333j52860K3128H1805c86683J37143A52199i1302
9479A19845a82502j41314J31620A97934M7000b08671f1060J6687B6124a10355
9468b04623A84922a68174B09934F8862F718K43487d38582a07865A0711Q4351a34713
$$ plain form
9550 -50617 -19823 -43007 135101 297223 -250734 -20261 -385810 105390 26713 -397866 -508651
9539 -508651 36532 -394516 5495 -145681 -11984 14947 109839 -36250 -211234 -17941 -125198
9528 -125198 -162997 20970 126460 89542 -192388 -122122 2772 109141 -254682 -57634 62200
9516 -241507 98308 181006 -58005 -67055 -58201 54393 -21342 6470 22018 -110170 -73606 -7178
9503 -116989 -242734 41115 39898 -57006 -74395 76054 13192 39283 -37192 -282441 110118
9491 -65857 -340399 -56243 163771 -43333 -196193 -173065 81805 -386683 -249540 152199 -91302
9479 119845 -182502 -323816 -192196 197934 244934 -208671 -61060 -44373 26124 -110355
9468 -204623 184922 -168174 209934 68862 6718 250205 -438582 -107865 10711 95062 -134713
9456c2086r3178j02722O6589B39070A4295c42751M4490a04899d2978l03949a63279
9444a46197l12835a47338j65786A51646C4299P1768k499m9212a84383p5007A8839
9432D1812d60178B50313a90710R0016E9758a11199B62721B65K15055A4214b51469
9420A51949M7940c41282f4442m7624I7327c23210l4485a60412p1403o4841G2664
9408a29190j42620A835J91588q1967b08712E6657i7989k5006q5845B87038d270
9396b85838F3338e2419j94032C03677a65436j24736A18135E3599a04525b253j70642
9385a72895r6781N4227h6645C64218b55892F9169M3312b76341P9884A6961a94542
9373b19641B14718b59304o4748A08196A5424h5012k09921i1458A68073J13350
$$ plain form
9456 -32086 -125264 -227986 -161397 239070 14295 -342751 -298261 -104899 -42978 -346927 -163279
9444 -146197 -459032 -147338 -313124 151646 34299 106067 103568 54356 -184383 -259390 18839
9432 41812 -460178 250313 -190710 -100694 59758 -111199 262721 265 215320 14214 -251469
9420 151949 199889 -341282 -64442 -112066 97327 -323210 -357695 -160412 -231815 -296656 72664
9408 -129190 -271810 1835 193423 111456 -208712 56657 -97989 -122995 -208840 287038 -4270
9396 -285838 63338 -52419 -246451 303677 -165436 -290172 118135 53599 -104525 -2253 -172895
9385 -172895 -269676 -215449 -86645 364218 -255892 69169 112481 -276341 -196457 16961 -194542
9373 -219641 214718 -259304 -324052 108196 15424 -85012 -294933 -91458 168073 281423
9363B81423a55248A78145f7593l12878F3577c2435o0318l40183G6064a2224m7463
9352e9687a6407q2634i163C3503a77742F4340K20514c46677A21029J9381c192
9340i3143n1669j36565N1625A06592f4857A60882f3065B91365d72423G7384J72092
9329B49476b48422f3523j69944b7046j26613o8700h2397C03045a67889B5759d3253
9317a55567e7664A33263b02219h8509j93875K5479i3783p0555e5804G0633a41444
9305E3870a0968H1713a6352j42620o560I0862b66997h0228G3000a22067A44404
9293E18849i850k40215R5500j23399R2290G8640a523l4818C3585P6262a13102
9281a8939j08080e1894A13849b78164C07361m5130B6221c97516A37196b92032
$$ plain form
9363 281423 -155248 178145 -67593 -380471 63577 -32435 -92753 -432936 76064 -12224 -59687
9352 -59687 -16407 -99041 -9163 33503 -177742 64340 284854 -346677 121029 140410 -3192
9340 -93143 -144812 -281377 -229752 106592 -64857 160882 -63065 291365 -472423 77384 249476
9329 249476 -248422 -63523 -233467 -27046 -153659 -222359 -82397 303045 -167889 25759 -43253
9317 -155567 -57664 133263 -202219 -88509 -282384 -256905 -93783 -164338 -55804 70633 -141444
9305 53870 -10968 81713 -16352 -158972 -165532 90862 -266997 -80228 73000 -122067 144404
9293 518849 -9850 -250065 -154565 -277964 -185674 78640 -1523 -36341 33585 109847 -113102
9281 -18939 -127019 -51894 113849 -278164 307361 262231 26221 -397516 137196 -292032
9270A20733b2096j60449K0360n2642M6950I9204Q9392a7434A44051k1656a03419
9258c4901j34861J2515b9806l76028B8904M5562j8804Q9599b9900E2486A6522
9246a15424d0078p4350j60799a7062j00766j8363e164j8016A05608K9438a84296
9234e9019B95734A38816h1465K5415j43563l0171A58794Q713d2015o3313m7104
9223a52432j04533b5298n7606G1759M1487k2167g0582l52946J92965f0259j35849
9212a96108A25778f8955H5205a27735j12553h2862m6867H1656N131J79989f008
9200c26356F0975d57191C6827J25329a15307k56291J75799C6532d46510a57435
9189c48922A8863e6422A65967e7736B89240f6476j2954j7989E0382h9717A00541
$$ plain form
9270 120733 -22096 -182545 -162185 -214827 -167877 99204 188596 -17434 144051 122395 -103419
9258 -34901 -169762 -157247 -29806 -405834 28904 74466 55662 145261 -29900 52486 16522
9246 -115424 -40078 -114428 -275227 -17062 -117828 -136191 -5164 -23180 105608 135046 -184296
9234 -59019 295734 138816 -81465 -56050 -199613 -229784 158794 167507 -42015 -105328 -152432
9223 -152432 -256965 -25298 -82904 71759 113246 91079 -70582 -423528 -230563 -60259 -196108
9212 -196108 125778 -68955 85205 -127735 -240288 -82862 -129729 81656 86787 266776 -6008
9200 -326356 60975 -457191 36827 162156 -115307 -371598 -195799 36532 -446510 -157435
9189 -348922 18863 -56422 165967 -57736 289240 -66476 -79430 -97419 50382 -89717 100541
9177c5106q3384r4459F9050b35479A49329b73292e6790A71463a46849A52528b18049
9165a20702A0508a92542g3844B25488a99367A41622c20981I7480J9360K2235b30943
9153e3617A28130d7164L246C2008P1658a00056k2303l4500A648a41434C1909Q7453
9141A19362a08179K7575A82854h0451C3600b71040A83679f4827b129K00C2274
9129A90490b88189D5268b27451M8122D4180N899J43703l5242b44652H612a59206
9117a59405k99755A77153a22004A87247F963i8690B76362a16673E7055b23970
9106b2006l24780a04219p1422M1113B18739o734c76644c5972j00874m9324B83791
9094a05113K3117O881L2506A06344C429J17824a69197K8895N3043k99088f6883
$$ plain form
9177 -35106 -118490 -212949 69050 -235479 149329 -273292 -56790 171463 -146849 152528 -218049
9165 -120702 10508 -192542 -73844 225488 -199367 141622 -320981 97480 116840 139075 -230943
9153 -53617 128130 -47164 -43918 32008 103666 -100056 -122359 -156859 1648 -141434 31909 119362
9141 119362 -108179 -80604 182854 -80451 33600 -271040 183679 -64827 -2129 -1929 32274
9129 190490 -288189 45268 -227451 -179329 44180 50079 193782 158540 -244652 8612 -159206
9117 -159405 -459160 177153 -122004 187247 6963 -98690 276362 -116673 57055 -223970
9106 -22006 -346786 -104219 -175641 -134528 218739 212005 -376644 -35972 -136846 -186170 283791
9094 -105113 -81996 -75115 -42609 106344 3429 121253 -169197 -140302 -87259 -386347 -66883
9082f561B60573e9976A17355a32723K7997p8643A57179c08927A00915c58161a03870
9070i7755A38488b80753f5913L2660A49019D3371b34751a01872B0415a55459j97797
9059c53256b7039B49461b16217c341F1669A1470a01546A54902K2680f5872G5644
9047b27322A39015a68720n1389K0779j49674D2421A3116b00879m8607A0561J79257
9036A89818b42066R8015A95237b51753J23658r6643F201b93949e2836H4952E699
9024b37488e9833k92684g572l3305l32330A79094G7051i7639A47356a73555n2402
9013b25957f7690c2083a2255A64601h5121A96234A0744g284l39928G1480K0858
9002I2338b82821h3130j81906F7456a45352l36313a09475a6591l69674a46663
$$ plain form
9082 -6561 260573 -59976 117355 -132723 -104726 -183369 157179 -308927 100915 -358161 -103870
9070 -97755 138488 -280753 -65913 -33253 149019 43371 -234751 -101872 20415 -155459 -353256
9059 -353256 -27039 249461 -216217 -3341 61669 11470 -101546 154902 177582 -65872 75644
9047 -227322 139015 -168720 -220109 -199330 -349004 42421 13116 -200879 -249486 10561 189818
9036 189818 -242066 -144051 195237 -251753 -128095 -224738 6201 -293949 -52836 84952 5699
9024 -237488 -59833 -352517 -7572 -40877 -373207 179094 77051 -97639 147356 -173555 -225957
9013 -225957 -67690 -32083 -12255 164601 -85121 196234 10744 -7284 -347212 71480 92338
9002 92338 -282821 -83130 -265036 67456 -145352 -481665 -109475 -16591 -386265 -146663
8991a3354k16708a0483F9726d4205n2170K3702J7670C777a98489P1477b723A4875
8978F5793h8949A9449b74242b2040A54368g7624k76121l1398a46175j42367a0800
8966e5120n2118B42618a03557D96613G641b941o965k8256k11999B60845B2748
8954h8598A55042j7698g7250n9278n1190e6925B69516F3475b1105D9536L600R6559
8942A49695d8347j44645B11722f7060a3423G7679a2815n37089A73953g3543B16067
8930A7673b38400q9000Q8018B3794j0277b94957N4843C7382J1692a63053C05142
8918B83805J12200A44026K39641F2139K25234j08201N09063A30397Q65529M80830
8908A476756P48260J701023M371038J932679D577992B098636q32292l01123m49960
$$ plain form
8991 -13354 -230062 -10483 69726 -44205 -96375 -72673 -55003 3777 -198489 -127012 -2723 14875
8978 65793 -88949 19449 -274242 -22040 154368 -77624 -353745 -385143 -146175 -288542 -10800
8966 -55120 -107238 242618 -103557 496613 7641 -2941 -9906 -38162 -250161 260845 22748
8954 -88598 155042 137344 -77250 -136528 -187718 -56925 269516 63475 -21105 49536 53136 149695
8942 149695 -48347 -192992 211722 -67060 -13423 77679 -12815 -549904 173953 -73543 216067
8930 17673 -238400 -327400 -239382 23794 13517 -294957 -240114 37382 49074 -163053 305142
8918 283805 396005 144026 383667 62139 287373 179172 688235 130397 995926 1476756
8908 1476756 2225016 3926039 8297077 10229756 4577992 2098636 1266344 965221 515261
8899E15261m1209J9329A82295R9442j05944O3094F8042L01253I7850M4023j3670
8888A28203P5435p2925b52979A30704a37618O7405B77877h7368k6311j63j36459
8877b50301L5029O962B3294a22373k3583H7825D1166E173J32401b79606m5565
8866c25171A56911J77119B8479b41679O8872h1786E3339K96217c3112l69644i861
8854A57817G958a23251C59774b39562J04948L0761j17376B40878d50250C19582
8843B96214b29218i296B14318a63093P1800A35973b11084E6836b4485m6789a4049
$$ plain form
8899 515261 474052 493381 182295 281737 175793 238887 68042 369295 97850 141873 128203
8888 128203 203638 130713 -252979 130704 -137618 -70213 277877 -87368 -113679 -113842 -250301
8877 -250301 -215272 -208310 23294 -122373 -145956 87825 41166 5173 137574 -279606 -325171
8866 -325171 156911 334030 28479 -241679 -172807 -81786 53339 349556 -33112 -402756 -9861
8854 157817 7958 -123251 359774 -239562 -134614 -103853 -221229 240878 -450250 319582
8843 296214 -229218 -9296 214318 -163093 -91293 135973 -211084 56836 -24485 -71274 -14049
$$ [...]
##END NTUPLES=NMR SPECTRUM
##END=
