
##TITLE=AC1232_PUEHDE125_6075406_ZkziUhQfc5
##JCAMPDX= 6.0         $$ Bruker NMR JCAMP-DX V2.0
##DATA TYPE= NMR SPECTRUM
##DATA CLASS= NTUPLES
##ORIGIN= BRUKER
##OWNER= Administrator
$$ 1.72 TOPSPIN		Version 2.1
$$ 2012-05-08 23:50:48.125 -0500  Administrator@TOPSPIN
$$ Compression mode = diff/dup
##.OBSERVE FREQUENCY= 400.13188235
##.OBSERVE NUCLEUS= ^1H
##.ACQUISITION MODE= SIMULTANEOUS (DQD)
##.ACQUISITION SCHEME= undefined
##.AVERAGES= 64
##.DIGITISER RES= 22
##SPECTROMETER/DATA SYSTEM= spect
##.PULSE SEQUENCE= noesygpps1d.comp
##.SOLVENT NAME= COFFEE_meoh
##.SHIFT REFERENCE= INTERNAL, COFFEE_meoh, 1, 14.96685
##AUDIT TRAIL= $$ (NUMBER, WHEN, WHO, WHERE, PROCESS, VERSION, WHAT)
$$ ##TITLE= Audit trail, TOPSPIN		Version 2.1
$$ ##JCAMPDX= 5.01
$$ ##ORIGIN= Bruker BioSpin GmbH
$$ ##OWNER= Administrator
$$ $$ C:\Bruker\TOPSPIN/data/COFFEE/nmr/AC1232_PUEHDE125_6075406_ZkziUhQfc5/22/pdata/1/auditp.txt
$$ ##AUDIT TRAIL=  $$ (NUMBER, WHEN, WHO, WHERE, PROCESS, VERSION, WHAT)
(   1,<2012-05-08 23:50:43.218 -0500>,<Administrator>,<TOPSPIN>,<go>,<TOPSPIN 2.1>,
      <created by zg
	started at 2012-05-08 23:39:13.046 -0500,
	POWCHK enabled, PULCHK disabled,
       configuration hash MD5:
       AF F2 23 6B 01 CD 40 DD E5 A1 38 A0 06 EA F7 77
       data hash MD5: 64K
       B6 90 BD CD 3D C4 00 36 25 A9 D1 CA 75 8A 11 71>)
(   2,<2012-05-08 23:50:46.015 -0500>,<Administrator>,<TOPSPIN>,<proc1d>,<TOPSPIN 2.1>,
      <Start of raw data processing
       efp LB = 0.3 FT_mod = 6 PKNL = 1 PHC0 = 0 PHC1 = 0 SI = 128K 
       data hash MD5: 128K
       58 E8 ED A0 55 04 43 49 0D FF 45 D2 0C 53 A9 39>)
(   3,<2012-05-08 23:50:47.187 -0500>,<Administrator>,<TOPSPIN>,<proc1d>,<TOPSPIN 2.1>,
      <pk PHC0 = 34.0686 PHC1 = 0 
       data hash MD5: 128K
       E7 79 AC 47 F5 0D AE C2 09 C9 65 C9 49 69 FE DA>)
(   4,<2012-05-08 23:50:47.796 -0500>,<Administrator>,<TOPSPIN>,<proc1d>,<TOPSPIN 2.1>,
      <abs ABSG = 1 
       data hash MD5: 128K
       EB 08 BD D2 56 9F F8 4F 7D 00 26 12 A2 A3 15 C8>)
(   5,<2012-05-08 23:50:47.875 -0500>,<Administrator>,<TOPSPIN>,<proc1d>,<TOPSPIN 2.1>,
      <abs ABSG = 2 
       data hash MD5: 128K
       2F BE D2 EA 9B 91 0B 37 E0 97 17 30 80 C2 46 FC>)
(   6,<2012-05-08 23:50:47.937 -0500>,<Administrator>,<TOPSPIN>,<proc1d>,<TOPSPIN 2.1>,
      <abs ABSG = 3 
       data hash MD5: 128K
       B0 8E A2 B8 52 72 0D 62 25 25 D4 7D EC FB 2C 93>)
(   7,<2012-05-08 23:50:47.984 -0500>,<Administrator>,<TOPSPIN>,<proc1d>,<TOPSPIN 2.1>,
      <abs ABSG = 4 
       data hash MD5: 128K
       7E 70 90 BC 5F 99 70 9D B1 93 CE F0 0E 95 5C 6D>)
(   8,<2012-05-08 23:50:48.031 -0500>,<Administrator>,<TOPSPIN>,<proc1d>,<TOPSPIN 2.1>,
      <abs ABSG = 5 
       data hash MD5: 128K
       FC 8A F7 00 40 25 5D 2A 35 EB 79 DA 90 08 5C 1B>)
$$ ##END=
$$ 
$$ $$ hash MD5
$$ $$ 28 E2 16 5D B0 D1 A7 64 61 49 93 96 46 B8 3C 1B
##$RELAX= 
##$RELAX= 
##$RELAX= 
##$RELAX= 
##$RELAX= 
##$RELAX= 
##$RELAX= 
##$RELAX= 
$$ Bruker specific parameters
$$ [...]
##$TP07= 0
##$TPNAME0= <>
##$TPNAME1= <>
##$TPNAME2= <>
##$TPNAME3= <>
##$TPNAME4= <>
##$TPNAME5= <>
##$TPNAME6= <>
##$TPNAME7= <>
##$TPOAL= (0..7)
0.5 0.5 0.5 0.5 0.5 0.5 0.5 0.5
##$TPOFFS= (0..7)
0 0 0 0 0 0 0 0
##$TUNHIN= 0
##$TUNHOUT= 0
##$TUNXOUT= 0
##$USERA1= <user>
##$USERA2= <user>
##$USERA3= <user>
##$USERA4= <user>
##$USERA5= <user>
##$V9= 5
##$VALIST= <valist>
##$VCLIST= <CCCCCCCCCCCCCCC>
##$VD= 0
##$VDLIST= <DDDDDDDDDDDDDDD>
##$VPLIST= <PPPPPPPPPPPPPPP>
##$VTLIST= <TTTTTTTTTTTTTTT>
##$WBST= 1024
##$WBSW= 4
##$XGAIN= (0..3)
0 0 0 0
##$XL= 0
##$YL= 0
##$YMAX_a= 11171302
##$YMIN_a= -5742775
##$ZGOPTNS= <>
##$ZL1= 120
##$ZL2= 120
##$ZL3= 120
##$ZL4= 120
##$ABSF1= 14.96685
##$ABSF2= -5.58568
##$ABSG= 5
##$ABSL= 3
##$ALPHA= 0
##$AQORDER= 0
##$ASSFAC= 0
##$ASSFACI= 0
##$ASSFACX= 0
##$ASSWID= 0
##$AUNMP= <proc_prof1d_extract.lims>
##$AXLEFT= 0
##$AXNAME= <>
##$AXNUC= <1H>
##$AXRIGHT= 0
##$AXTYPE= 0
##$AXUNIT= <>
##$AZFE= 0.1
##$AZFW= 0.1
##$BCFW= 0
##$BC_mod= 0
##$BYTORDP= 0
##$COROFFS= 0
##$CY= 15
##$DATMOD= 1
##$DC= 0
##$DFILT= <>
##$DTYPP= 0
##$F1P= 0
##$F2P= 0
##$FCOR= 0.5
##$FTSIZE= 131072
##$FT_mod= 6
##$GAMMA= 0
##$GB= 0
##$INTBC= 1
##$INTSCL= 1
##$ISEN= 128
##$LB= 0.3
##$LEV0= 0
##$LPBIN= 0
##$MAXI= 10000
##$MC2= 0
##$MEAN= 0
##$ME_mod= 0
##$MI= 0
##$NCOEF= 0
##$NC_proc= -3
##$NLEV= 6
##$NOISF1= 0
##$NOISF2= 0
##$NSP= 0
##$NTH_PI= 0
##$NZP= 0
##$OFFSET= 14.96685
##$PC= 1
##$PHC0= 34.0686
##$PHC1= 0
##$PH_mod= 1
##$PKNL= yes
##$PPARMOD= 0
##$PPDIAG= 0
##$PPIPTYP= 0
##$PPMPNUM= 2147483647
##$PPRESOL= 1
##$PSCAL= 4
##$PSIGN= 0
##$PYNMP= <proc.py>
##$REVERSE= no
##$SF= 400.130005508158
##$SI= 131072
##$SIGF1= 0
##$SIGF2= 0
##$SINO= 400
##$SIOLD= 131072
##$SPECTYP= <>
##$SREGLST= <1H.CDCl3>
##$SSB= 0
##$STSI= 131072
##$STSR= 0
##$SW_p= 8223.68421052632
##$SYMM= 0
##$S_DEV= 0
##$TDeff= 65536
##$TDoff= 0
##$TI= <>
##$TILT= no
##$TM1= 0
##$TM2= 0
##$TOPLEV= 0
##$USERP1= <user>
##$USERP2= <user>
##$USERP3= <user>
##$USERP4= <user>
##$USERP5= <user>
##$WDW= 1
##$XDIM= 131072
##$YMAX_p= 356484409
##$YMIN_p= -49532823
##$CURPLOT= <Network HP LaserJet P1505>
##$CURPRIN= <$Network HP LaserJet P1505>
##$DFORMAT= <normdp>
##$LAYOUT= <+/1D_H.xwp>
##$LFORMAT= <normlp>
##$PFORMAT= <normpl>
##$SURQMSG= 1
$$ End of Bruker specific parameters
$$ ---------------------------------
##NTUPLES= NMR SPECTRUM
##VAR_NAME=  FREQUENCY,     SPECTRUM/REAL,   SPECTRUM/IMAG
##SYMBOL=    X,             R,               I
##VAR_TYPE=  INDEPENDENT,   DEPENDENT,       DEPENDENT
##VAR_FORM=  AFFN,          ASDF,            ASDF
##VAR_DIM=   131072,        131072,          131072
##UNITS=     HZ,            ARBITRARY UNITS, ARBITRARY UNITS
##FACTOR=    0.0627417313425165, 1,          1
##FIRST=     8223.62146879498, 2703,         -108067
##LAST=      0,             6362,            -109314
##MIN=       0,             -49532823,       0
##MAX=       8223.62146879498, 356484409,    0
$$ Real data points
##PAGE= N=1
##DATA TABLE= (X++(R..R)), XYDATA
$$ [...]
61102A101072j1139r540o908n064m769n414o127o282n340l295j227m89j263k778
61088A031437m724p340j0040j1273j0333q371o967o346n585m160k620j900k197
61075I49581k473j241J749M837O079N471M718M973N740O070N667M540K806J317
61061I99834J340K823M053L881L278L679M762N230N092N662P443R366J0179R523
61047A076145P593M801J922l26k116m222o853r655j2737j6623k0726k3065k2300
61034I71838j9410j6762j5859j6555j7880j8855j8770j7469j5553j3969j3230
61023G87526j3168j3257j2962j1910j0014p592n315l944l877m685n239m728l575
61010F87260k955l312l784l247j577M16J849K346K120J787J905K525L444M858
$$ plain form
61102 1101072 1089933 1080393 1073485 1068421 1063652 1058238 1052111 1045829 1040489 1037194 1035967 1035478 1034215 1031437
61088 1031437 1026713 1019373 1009333 998060 987727 979356 972389 966043 960458 956298 953678 951778 949581
61075 949581 947108 945867 947616 952453 958532 964003 968721 973694 979434 985504 991171 995711 998517 999834
61061 999834 1001174 1003997 1008050 1011931 1015209 1018888 1023650 1028880 1033972 1039634 1047077 1056443 1066622 1076145
61047 1076145 1083738 1088539 1090461 1090135 1088019 1083797 1076944 1067289 1054552 1037929 1017203 994138 971838
61034 971838 952428 935666 919807 903252 885372 866517 847747 830278 814725 800756 787526
61023 787526 774358 761101 748139 736229 726215 718623 713308 709364 705487 700802 695563 690835 687260
61010 687260 684305 680993 677209 673962 672385 672801 674650 676996 679116 680903 682808 685333 688777 693635
60996F93635P113R528J0368Q815O412N509O561P973Q562R030J0521J2774J4462
60983H11263J4865J4459J4063J4066J4359J4617J4576J4402J4710J6038J8394
60972I75812K1461K4896K8126L0364L1591L3282L7278M3713N0798N7071O3165
60961A397557P0834Q0703R1911J03844J17312J33667J53470J76484K02102K27919
60951B755803K47028K48004K20844J65703R6337L3357p839k3861k0209m510J5219
60940C725876K7590J8591k0027q2179j49131k01493k30566k39431k35481k23670
60930B390079k06058j84897j63658j44878j28416j12587r6628q1485o8532n8392
60920A144548n0935m5660m1567l7291l2077k6543k1989j8909j6587j4176j1622
$$ plain form
60996 693635 700748 710276 720644 729459 735871 741380 747941 755914 764476 773506 784027 796801 811263
60983 811263 826128 840587 854650 868716 883075 897692 912268 926670 941380 957418 975812
60972 975812 997273 1022169 1050295 1080659 1112250 1145532 1182810 1226523 1277321 1334392 1397557
60961 1397557 1468391 1549094 1641005 1744849 1862161 1995828 2149298 2325782 2527884 2755803
60951 2755803 3002831 3250835 3471679 3637382 3733719 3767076 3759237 3735376 3715167 3710657 3725876
60940 3725876 3753466 3772057 3752030 3669851 3520720 3319227 3088661 2849230 2613749 2390079
60930 2390079 2184021 1999124 1835466 1690588 1562172 1449585 1352957 1271472 1202940 1144548
60920 1144548 1093613 1047953 1006386 969095 937018 910475 888486 869577 852990 838814 827192
60909H27192r384p623o169n002m360m240m231m070m045m445m691l651j185J049
60895G65145J041j304l994n145m726l759k651j232Mk0j464l180m341n599p809
60880G20966j0188j0846r191o933o311p825j0059j1448j1728j1697j1926j2105
60868F00709j1609j0437r185q147o882m939k732j301j290k407l813m733m764l961
60854E24509k719j379RJ326K052J743Q54N16J310K594L357L383L257L445L670
60839E47927L272K004N26j8Q64K326L030K723K457K962L503K974J611P32R42J562
60823E79397J890J989J849P95j332l091k748n92J103O95j111k528k881k807k775
60808E67853k382j213L29J402J555J010K55l81r07j516k318l261m303n427o241
$$ plain form
60909 827192 817808 810185 804016 799014 794654 790414 786183 782113 778068 773623 768932 765281 764096 765145
60895 765145 766186 764882 760888 755743 751017 747258 744607 743375 743379 743359 741895 738715 734374 728775 720966
60880 720966 710778 699932 690741 683808 677497 669672 659613 648165 636437 624740 612814 600709
60868 600709 589100 578663 569478 561331 554449 549510 546778 545477 544187 541780 537967 533234 528470 524509
60854 524509 521790 520411 520420 521746 523798 525541 526395 526911 528221 530815 534172 537555 540812 544257 547927
60839 547927 551199 553203 553729 553711 554575 556901 559931 562654 565111 568073 571576 574550 576161 576893 577835 579397
60823 579397 581287 583276 585125 585920 584588 581497 578749 578157 579260 579955 578844 576316 573435 570628 567853
60808 567853 565471 564258 564587 565989 567544 568554 568809 568428 567521 566005 563687 560426 556123 550696 544455
60793E44455o037m687l197k593k343q94K104N015O260O227O338O922P130O501
60779E71201N540M797M386M374M702M672L599K162J980L456N069N328M442L292
60765F29000J804m43k606k986j165J271K385J583m03k607m507o017p142p653p201
60750E93313n938m750m455m868n039m485l821m010n167o272o190m911l607l157
60736E26643l018k162q77o23j839l098l213k984l746m833m185j381J382J871L75
60721D98312q60j37K256M671N730N359M444L636K876K189K154L008L886L941L745
60706E45210M549O407Q162R170R860J0469J0421R268P380N423M001L735M733N955
60692F44743O255O006O288O525M859J373j182r21O77J191M70l67j548l945o548
$$ plain form
60793 544455 538418 533731 530534 527941 525598 524704 526808 531823 538083 544310 550648 557570 564700 571201
60779 571201 576741 581538 585924 590298 595000 599672 603271 605433 607413 610869 615938 621266 625708 629000
60765 629000 630804 630361 627755 624769 623604 624875 627260 628843 628440 625833 621326 615309 608167 600514 593313
60750 593313 587375 582625 578170 573302 568263 563778 559957 555947 550780 544508 538318 533407 529800 526643
60736 526643 523625 521463 520586 519963 518124 515026 511813 508829 505083 500250 496065 494684 496066 497937 498312
60721 498312 497452 497315 499571 504242 509972 515331 519775 523411 526287 528476 530630 533638 537524 541465 545210
60706 545210 549759 556166 564328 573498 583358 593827 604248 613516 620896 626319 630320 634055 638788 644743
60692 644743 650998 657004 663292 669817 674676 676049 674867 673946 674623 675814 676284 675917 674369 670424 663876
60677F63876p180n621m056m096n149o029o585p134p566p688p600p334o850o432
60663E74556o252n631l934k193k256l948m752l204j064p95k058k444j042O40J298
60648E36921J617K638L729L455J942J059K043L868M559L568K069J137N18n46k011
60633E66566l148l526l334k913k442j984j583j483k297m450p125q394p144m460
60619E12283k473k131k813l677m431m941m995m609l948k982j866j304j666k004
60605D68443j084P08J740J519J358K183L013K443P95k14N71K682M693N406M777
60590D99033L899L816M396M844N091N612N983M951K450K44j02J181L053N009O560
60575E56020O723N377M154M524N776O318O238O879Q238Q693P438N572M433M284
$$ plain form
60677 663876 656696 651075 647019 642923 637774 631745 625160 618026 610460 602772 595172 587838 580988 574556
60663 574556 568304 562673 558739 556546 554290 550342 545590 542386 541322 540527 538469 536025 534983 535623 536921
60648 536921 538538 541176 544905 548360 550302 551361 553404 557272 561831 565399 567468 568605 569123 568577 566566
60633 566566 563418 559892 556558 553645 551203 549219 547636 546153 543856 539406 532281 523887 516743 512283
60619 512283 509810 507679 504866 501189 496758 491817 486822 482213 478265 475283 473417 472113 470447 468443
60605 468443 467359 468067 469807 471326 472684 474867 477880 480323 481118 480904 481475 484157 488850 494256 499033
60590 499033 502932 506748 511144 515988 521079 526691 532674 537625 540075 540319 540217 541398 544451 549460 556020
60575 556020 562743 568120 572274 576798 582574 588892 595130 602009 610247 618940 626378 631950 636383 640667
60561F40667M966O447Q055Q502P467O153N415M338J770j456l204k793j870k337
60547F82120m252o202p057o776n918n160n224o530q388r077p416m221j589p10
60533F03600j014j470j857k258k225j375m20n46j756k666k080j30K243M274N513
60518E97833N634M686L396K690K793L118L307M152O774J0684J3362J2783J0158
60505F81370R002J1183J4923J7218J7174J6278J6304J8056K1406K5369K8545L0553
60493I07381L2689L6188M0430M4085M7407N1630N6259N8793N7486N2776M5566
60482A430690L5705K3040Q550o389k0747l3090m1406m4967m5496m5309m4877m3203
60470A172501l9738l4761k8571k1697j5614j1775r874q122n309j687K210O453
$$ plain form
60561 640667 645633 652080 660135 668637 676104 682257 687672 692010 693780 692324 689120 686327 684457 682120
60547 682120 677868 671666 664609 657833 651915 646755 641531 635001 626613 617536 610120 605899 604310 603600
60533 603600 602586 601116 599259 597001 594776 593401 592981 592435 590679 588013 585933 585803 588046 592320 597833
60518 597833 603467 608153 611549 614239 617032 620150 623457 627609 634383 645067 658429 671212 681370
60505 681370 690372 701555 716478 733696 750870 767148 783452 801508 822914 848283 876828 907381
60493 907381 940070 976258 1016688 1060773 1108180 1159810 1216069 1274862 1332348 1385124 1430690
60482 1430690 1466395 1489435 1497985 1491596 1470849 1437759 1396353 1351386 1305890 1260581 1215704 1172501
60470 1172501 1132763 1098002 1069431 1047734 1032120 1020345 1010471 1002349 997040 995353 997563 1004016
60458A004016J1068J5421J8859K1599K4570K8574L3684L9353M4961N0369N5716
60447A348190O0682O4330O5842O4977O1615N5587M7502L9038L1604K5324K0188
60436A884879J7595J9398K5621L4263M3183N0936N5811N5709M9631L8290K2798
60425B298114L787j7671l9483n9720p7497r1952j01476j05169j04335j01258r6865
60414A506475r0866q3787p7187p1667o6068n9382n2394m6686m2708l9602l6445
60403H39683l2920k9054k5133k1734j9248j7399j5708j4340j3765j3696j3194
60392F23492j2007j0968j0618j0308r411q561q621q896p830n449l597l357l618
60379E20251l025k130k342l537m173l497k340j765j934k335k212r23J168K332
$$ plain form
60458 1004016 1015084 1030505 1049364 1070963 1095533 1124107 1157791 1197144 1242105 1292474 1348190
60447 1348190 1408872 1473202 1539044 1604021 1665636 1721223 1768725 1807763 1839367 1864691 1884879
60436 1884879 1902474 1921872 1947493 1981756 2024939 2075875 2131686 2187395 2237026 2275316 2298114
60425 2298114 2301901 2284230 2244747 2185027 2107530 2015578 1914102 1808933 1704598 1603340 1506475
60414 1506475 1415609 1331822 1254635 1182968 1116900 1057518 1005124 958438 915730 876128 839683
60403 839683 806763 777709 752576 730842 711594 694195 678487 664147 650382 636686 623492
60392 623492 611485 600517 589899 579591 570180 561619 552998 544102 536272 530823 527226 523869 520251
60379 520251 517226 515096 512754 509217 505044 501547 499207 497442 495508 493173 490961 490038 491206 493538
60365D93538J270q57j598n55J85o02j402o28O37M01q91r86O79K292K583K447L016
60348D99529L814L872L431L439M007M452M521M612M967N381N688N983O301O480
60334E66477O365N941N224M356L772L976N037O332O918O260M727L328K835L138
60320F34686L590L816L936M055L962L485K889K720L268M227M741M049K360R88
60306F82772J089K252K914K263J194J012J766K408K244J523O88k76j424k311k324
60291F95790j524o78k67J31J035J886J458l55k011k166j402j198j776k085j787
60276F85051j753k388k850k675k850m166n446m818k384k97k49j857l663m730n030
60261F39895n036n232n617n477m144k030l72J83K13O41J673K768L275K862J702
$$ plain form
60365 493538 494808 493951 492353 491798 491983 491381 489979 489351 489988 490389 489498 488512 489191 491483 494066 496513 499529
60348 499529 503343 507215 510646 514085 518092 522544 527065 531677 536644 542025 547713 553696 559997 566477
60334 566477 572842 578783 584007 588363 592135 596111 601148 607480 614398 620658 625385 628713 631548 634686
60320 634686 638276 642092 646028 650083 654045 657530 660419 663139 666407 670634 675375 679424 681784 682772
60306 682772 683861 686113 689027 691290 692484 693496 695262 697670 699914 701437 702125 701849 700425 698114 695790
60291 695790 694266 693588 693321 693452 694487 696373 697831 697476 695465 693299 691897 690699 688923 686838 685051
60276 685051 683298 680910 678060 675385 672535 668369 662923 658105 655721 655424 655175 653318 649655 644925 639895
60261 639895 634859 629627 624010 618533 614389 612359 611987 612170 612383 613024 614697 617465 620740 623602 625304
60246F25304L81o62j625k932m352n158n212n245n725o045n427m187l411l504l763
60231E68437l475k888k702k993l159k808k213j637p70O60K077K511J926J364J566
60216E55896K089K152J787J654K179L353M949O472P274P313P260P373O899N431
60202F22081M044L898M253L380J264j58L16J758K787L260L586L736L809M549O183
60187F68746P580P617O762O378O952Q072R707J2356J5849J8926K0248J9581J8096
60174H26870J7699J9609K3121K6179K7694K8844L1513L5933M0535M3833M5670
60163A167500M6851M8224N0067N1944N3292N4252N5420N6443N5806N2697M8245
60152A740741M3936L9663L4555K9010K4216J9972J4744Q079J501l397o415q042
$$ plain form
60246 625304 625685 625023 623398 620466 616114 610956 605744 600499 594774 588729 583302 579115 575704 572200 568437
60231 568437 564962 562074 559372 556379 553220 550412 548199 546562 545792 546452 548529 551040 552966 554330 555896
60216 555896 557985 560137 561924 563578 565757 569110 574059 580531 587805 595118 602378 609751 616650 622081
60202 622081 626125 630023 634276 637656 638920 638762 639078 640836 643623 646883 650469 654205 658014 662563 668746
60187 668746 676326 683943 690705 697083 704035 712107 721814 734170 750019 768945 789193 808774 826870
60174 826870 844569 864178 887299 913478 941172 970016 1001529 1037462 1077997 1121830 1167500
60163 1167500 1214351 1262575 1312642 1364586 1417878 1472130 1527550 1583993 1639799 1692496 1740741
60152 1740741 1784677 1824340 1858895 1887905 1912121 1932093 1946837 1954916 1956417 1953020 1946605 1938563
60140A938563q558q377q002p029m325l2L827N797P205J0665J6850K3886K9660
60127B000130L3824L7481M1830M7225N2914N7463N9841O0251N9672N8677N6998
60116B566306N4089M9805M4330L7796L0147K1522J2588M211l373j0840j8762k6583
60104B761236l3000l7303l9839m1254m1840m1538l9869l6027k9867k2880j7094
60093B380725j2701p823j138O325J2667J7364K1009K3749K5233K5671K5530K4425
60081B541036K1556J7341J3506J1202R859Q170N566K441l75k099k406j690m92
60068B623615J405M902J0382J7051K3725K9978L6358M3787N2756O2795P2575Q0945
60056C060274Q8034R5101J03194J12167J20900J28185J33423J36881J39295J40834
$$ plain form
60140 1938563 1930005 1921628 1913626 1906597 1902272 1902240 1906067 1911864 1919069 1929734 1946584 1970470 2000130
60127 2000130 2033954 2071435 2113265 2160490 2213404 2270867 2330708 2390959 2450631 2509308 2566306
60116 2566306 2620395 2670200 2714530 2752326 2782473 2803995 2816583 2820794 2817421 2806581 2787819 2761236
60104 2761236 2728236 2690933 2651094 2609840 2568000 2526462 2486593 2450566 2420699 2397819 2380725
60093 2380725 2368024 2360201 2359063 2365388 2378055 2395419 2416428 2440177 2465410 2491081 2516611 2541036
60081 2541036 2562592 2579933 2593439 2604641 2614500 2622670 2628236 2630677 2630302 2628203 2625797 2624107 2623615
60068 2623615 2625020 2629922 2640304 2657355 2681080 2711058 2747416 2791203 2843959 2906754 2979329 3060274
60056 3060274 3148308 3243409 3346603 3458770 3579670 3707855 3841278 3978159 4117454 4258288
60046D258288J40423J36396J27917J15517J00468Q4028O7052M9550L0686R951
60036E120276j1506l1549m9139o4866p9206r1434j00964j08642j15401j20236
60026D347333j20932j16931j10367j03887r8139r1803q3585p3753o3840n5090
60016C429006m7231l9037l0127k1787j5532j1305p745m035o27J781L107L444K623
60003C262535O82j747l974n864p681r783j2721j7013k2324k7397l1347l4651l8237
59990C050478m2019m4967m6481m6860m6484m5295m3310m0971l8598l5756l1575
59979B588162k5711j8897j2492p291k639L059J0692J9559K8321L6347M3589M9585
59967B712284N3652N6113N8401O1475O4681O6422O5391O0956N3213M3316L3137
$$ plain form
60046 4258288 4398711 4535107 4663024 4778541 4879009 4963037 5030089 5079639 5110325 5120276
60036 5120276 5108770 5077221 5028082 4963216 4884010 4792576 4691612 4582970 4467569 4347333
60026 4347333 4226401 4109470 3999103 3895216 3797077 3705274 3621689 3547936 3484096 3429006
60016 3429006 3381775 3342738 3312611 3290824 3275292 3263987 3256242 3252207 3251580 3253361 3256468 3259912 3262535
60003 3262535 3263217 3261470 3257496 3251632 3243951 3234168 3221447 3204434 3182110 3154713 3123366 3088715 3050478
59990 3050478 3008459 2963492 2917011 2870151 2823667 2778372 2735062 2694091 2655493 2619737 2588162
59979 2588162 2562451 2543554 2531062 2523771 2521132 2524191 2534883 2554442 2582763 2619110 2662699 2712284
59967 2712284 2765936 2822049 2880450 2941925 3006606 3073028 3138419 3199375 3252588 3295904 3329041
59956C329041K3769J4661M790n612j5287k3724l1746m0116m8192n4461n8081n9449
59944C035593n9348n7955n4912n0258m4933m0031l5594l0489k3587j4849n208
59933B618429M254J2908K0816K8638L6998M5643N3592O0372O6556P2690P8132
59922C099028Q1663Q2772Q1615P8069P1919O3815N4929M5383L4217K1341Q488
59911C723239k684j2574k2678l3112m2410m9516n4756n8456n9914n8473n4782
59900C273884m9936m3942l6108k6810j7660r715k532M571J1317J7224K2784K8855
59888C171932L5296M1233M6393N1137N5215N7576N7675N6149N3935N1529M9265
59877C727335M7378M5446M2631L8942L5452L2816L0527K8254K6978K7953L1174
$$ plain form
59956 3329041 3352810 3367471 3372261 3366649 3351362 3327638 3295892 3255776 3207584 3153123 3095042 3035593
59944 3035593 2976245 2918290 2863378 2813120 2768187 2728156 2692562 2662073 2638486 2623637 2618429
59933 2618429 2622683 2635591 2656407 2685045 2722043 2767686 2821278 2881650 2948206 3020896 3099028
59922 3099028 3180691 3263463 3345078 3423147 3495066 3558881 3613810 3659193 3693410 3714751 3723239
59911 3723239 3720555 3707981 3685303 3652191 3609781 3560265 3505509 3447053 3387139 3328666 3273884
59900 3273884 3223948 3180006 3143898 3117088 3099428 3089713 3087181 3091752 3103069 3120293 3143077 3171932
59888 3171932 3207228 3248461 3294854 3345991 3401206 3458782 3516457 3572606 3626541 3678070 3727335
59877 3727335 3774713 3820159 3862790 3901732 3937184 3970000 4000527 4028781 4055759 4083712 4114886
59866D114886L5610M0321M4739M8747N3293N9928O8562P6644Q1893Q5039Q8195
59855D797857R1173R1412Q7459Q0444P1799O1377M8521L3513J7092k54j7805l4437
59843E328151m9604o3603p6223q6207r2702r6382r8345r8712r7056r3386q7970
59832D387961q0842p2283o3266n4691m6596l8587l0446k1971j3032m361K655P796
59820C972337J2687J8652K4558K8050K8373K6694K3905J9487J2860M736l559j1575
59808D157205j9980k9426l9523m9144n7622o5182p1835p6469p8120p7866p8117
59797C513921p9629q0537p9088p6037p3271p1022o7900o3301n8462n5013n3316
59786B756345n2268n0322m6820m2608l9015l6070l2521k7932k3666k1114j9904
$$ plain form
59866 4114886 4150496 4190817 4235556 4284303 4337596 4397524 4466086 4542730 4624623 4709662 4797857
59855 4797857 4889030 4980442 5067901 5148345 5220144 5281521 5330042 5363555 5380647 5380393 5362588 5328151
59843 5328151 5278547 5214944 5138721 5052514 4959812 4863430 4765085 4666373 4569317 4475931 4387961
59832 4387961 4307119 4234836 4171570 4116879 4070283 4031696 4001250 3979279 3966247 3961886 3964541 3972337
59820 3972337 3985024 4003676 4028234 4056284 4084657 4111351 4135256 4154743 4167603 4172339 4168780 4157205
59808 4157205 4137225 4107799 4068276 4019132 3961510 3896328 3824493 3748024 3669904 3592038 3513921
59797 3513921 3434292 3353755 3274667 3198630 3125359 3054337 2986437 2923136 2864674 2809661 2756345
59786 2756345 2704077 2653755 2606935 2564327 2525312 2489242 2456721 2428789 2405123 2384009 2364105
59775B364105j8865j7753j6945j6262j5418j4872j4949j4804j3583j2038j1398
59764B197218j1330j0552r004p497n687k461J641M610N863O906Q523R347Q224
59751B195801O161M681L710K478J406J579K903L944L378R63k318m533m072j357
59737B214724J372K594L024L961N222N831N828O094O831P546Q342R919J2226J4130
59723B307644J4703J4109J3089J2171J1683J2016J3457J5840J8434K0360K1403
59712B474909K2499K5069K9615L5362M1342M7195N2732N7523O1636O6143P2014
59701B986039P8890Q5762R2650J00642J10219J20295J29071J35284J38374J37904
59691D115130J32904J21619J02154P4163M0202N013k6850n2663p1334q2649q7228
$$ plain form
59775 2364105 2345240 2327487 2310542 2294280 2278862 2263990 2249041 2234237 2220654 2208616 2197218
59764 2197218 2185888 2175336 2166332 2158835 2153148 2150687 2152328 2156938 2162801 2169707 2178230 2187577 2195801
59751 2195801 2201962 2206643 2210353 2212831 2214237 2215816 2218719 2222663 2226041 2227004 2224686 2220153 2216081 2214724
59737 2214724 2216096 2218690 2221714 2225675 2230897 2236728 2242556 2248650 2255481 2263027 2271369 2281288 2293514 2307644
59723 2307644 2322347 2336456 2349545 2361716 2373399 2385415 2398872 2414712 2433146 2453506 2474909
59712 2474909 2497408 2522477 2552092 2587454 2628796 2675991 2728723 2786246 2847882 2914025 2986039
59701 2986039 3064929 3150691 3243341 3343983 3454202 3574497 3703568 3838852 3977226 4115130
59691 4115130 4248034 4369653 4471807 4545970 4586172 4591185 4564335 4511672 4440338 4357689 4270461
59680D270461q6555q2280p5474o6810n7080m6980l6602k5886j5506o359J984J1185
59668C784098K1815L2149M0461M7713N6295O6419P5804Q3327R0909J00683J12018
59657D511691J22942J33231J44234J56464J69326J82681J96831K11149K24583
59648F053132K37426K50798K64459K76983K88063K98375L06892L10853L09292
59639H596273L04242K97033K85750K68208K45751K21906J98656J76094J54671
59630A0748584J35135J16909R9049Q2574O9531N9433M9204L7390K6324J8679J3513
59619A1456325P448r11r265j4252j4684j2060q578n056n27O470J6348K8117M0323
59606A1489698N2181O3967P6426Q9711J02983J15326J26741J37509J46549J51676
$$ plain form
59680 4270461 4183906 4101626 4026152 3959342 3902262 3855282 3818680 3792794 3777288 3770929 3772913 3784098
59668 3784098 3805913 3838062 3878523 3926236 3982531 4048950 4124754 4208081 4298990 4399673 4511691
59657 4511691 4634633 4767864 4912098 5068562 5237888 5420569 5617400 5828549 6053132
59648 6053132 6290558 6541356 6805815 7082798 7370861 7669236 7976128 8286981 8596273
59639 8596273 8900515 9197548 9483298 9751506 9997257 10219163 10417819 10593913 10748584
59630 10748584 10883719 11000628 11099677 11182251 11251782 11311215 11360419 11397809 11424133 11442812 11456325
59619 11456325 11463773 11462862 11453597 11439345 11424661 11412601 11404023 11398967 11398440 11404910 11421258 11449375 11489698
59606 11489698 11541879 11605846 11682272 11771983 11874966 11990292 12117033 12254542 12401091 12552767
59596A2552767J51997J48887J43546J34558J19275R7179P0255M0161O500l1700
59586A3433425p3906j17933j61101k01151k36752k67538k93340l13319l26409
59577A1441976l32444l32204l26418l15633l00997k84132k66099k47623k30611
59568H805815k18162k12324k12851k18821k30253k46790k65486k81462k90983
59559F628683k93143k88816k79163k65410k49092k31683k14262j97609j82196
59550D427309j67883j54035j40319j27083j14806j03657r3843q5786p9310p3161
59540C287426o6239n9175n3691n0363m8053m5731m3666m2153m0325l7495l4758
59529B765777l3736l4119l4067l2883l1603l0735k9345k7106k5458k5543k6272
$$ plain form
59596 12552767 12704764 12853651 12997197 13131755 13251030 13348209 13418464 13458625 13465125 13433425
59586 13433425 13359519 13241586 13080485 12879334 12642582 12375044 12081704 11768385 11441976
59577 11441976 11109532 10777328 10450910 10135277 9834280 9550148 9284049 9036426 8805815
59568 8805815 8587653 8375329 8162478 7943657 7713404 7466614 7201128 6919666 6628683
59559 6628683 6335540 6046724 5767561 5502151 5253059 5021376 4807114 4609505 4427309
59550 4427309 4259426 4105391 3965072 3837989 3723183 3619526 3525683 3439897 3360587 3287426
59540 3287426 3221187 3162012 3108321 3057958 3009905 2964174 2920508 2878355 2838030 2800535 2765777
59529 2765777 2732041 2697922 2663855 2630972 2599369 2568634 2539289 2512183 2486725 2461182 2434910
59518B434910k5868k4315k2837k1689j9948j7170j3842j0453p326n148m300l710
59506B258304j777J397L911M576M530N782Q956J2943J6292J8534K0470K3295K7204
59493B404417L1024L3715L5857L8856M2858M6542M9080N1213N3997N7384O0755
59482B905698O4163O8320P3487P8725Q2111Q1663P6619O8227N9190N2033M7765
59471C658001M5731M4380M2398L9560L6503L3466K9689K4431J8074J1512M798
59460C988543k638j0650j8123k4146k8740l2437l5888l9660m3570m6250m6350
59449C660091m4233m1580l9323l6921l3689k9684k4909j8832j1296l136M714J2056
59437C393258J9170K6426L4428M3689N3648O2862P0646P7767Q5013R1785R6821
$$ plain form
59518 2434910 2409042 2384727 2361890 2340201 2320253 2303083 2289241 2278788 2271462 2266314 2262014 2258304
59506 2258304 2256527 2257924 2261835 2266411 2270941 2276723 2285679 2298622 2314914 2333448 2353918 2377213 2404417
59493 2404417 2435441 2469156 2505013 2543869 2586727 2633269 2682349 2733562 2787559 2844943 2905698
59482 2905698 2969861 3038181 3111668 3190393 3272504 3354167 3430786 3499013 3558203 3610236 3658001
59471 3658001 3703732 3748112 3790510 3830070 3866573 3900039 3929728 3954159 3972233 3983745 3988543
59460 3988543 3985905 3975255 3957132 3932986 3904246 3871809 3835921 3796261 3752691 3706441 3660091
59449 3660091 3615858 3574278 3534955 3498034 3464345 3434661 3409752 3390920 3379624 3376488 3381202 3393258
59437 3393258 3412428 3438854 3473282 3516971 3570619 3633481 3704127 3781894 3866907 3958692 4055513
59426D055513R9575J00089R8032R2800Q4475P3962O2072M8800L3629J6447j912
59415D763482k0025l6795n1677o4090p3395p9833q4572q7871q8139q4103p7288
59404D015694p0567o4707n8128n0064m1771l4257k6992j9846j4332j1611j0679
59393C612740r836q853q513r215j1166j5003k0893k7866l4979m2332m9986n7012
59381C317086o2679o7575p2450p6829p9836q1289q1046p8625p4767p1898p1293
59370B498799p0993o8419o3908n9634n6115n2174m7651m3626m0139l6128l1570
59359A928442k7514k3913j9552j4209q678k695M620J1690J4481J0812K829n616
59347A870697j2117j5485j4873j0905o016j808K662Q405J3459J4312R684J410
$$ plain form
59426 4055513 4155088 4255177 4353209 4446009 4530484 4604446 4666518 4715318 4748947 4765394 4763482
59415 4763482 4743457 4706662 4654985 4590895 4517500 4437667 4353095 4265224 4177085 4092982 4015694
59404 4015694 3945127 3880420 3822292 3772228 3730457 3696200 3669208 3649362 3635030 3623419 3612740
59393 3612740 3602904 3594051 3585538 3576323 3565157 3550154 3529261 3501395 3466416 3424084 3374098 3317086
59381 3317086 3254407 3186832 3114382 3037553 2957717 2876428 2795382 2716757 2641990 2570092 2498799
59370 2498799 2427806 2359387 2295479 2235845 2179730 2127556 2079905 2036279 1996140 1960012 1928442
59359 1928442 1900928 1877015 1857463 1843254 1834576 1831881 1836501 1848191 1862672 1873484 1876313 1870697
59347 1870697 1858580 1843095 1828222 1817317 1811301 1809493 1812155 1820560 1834019 1848331 1858015 1859425
59335A859425p894j6389k2664k5565k4824k1157j5714r908n197k077M02L278O221
59322A717937Q321R987J2791J7275K1978K5153K6887K8942L2676L7553M1791M4349
59310B025640M5943M8016N1161N5002N9255O3971O8806P3007P6488Q0059Q4199
59299B731547Q8398R2327R6998J03958J13518J24404J35034J44806J54262J64313
59289C949565J75268J86629J97780K08530K18562K26982K33154K37513K40263
59280E874246K39683K33390K21512K06904J91574J74479J53831J30071J05285
59271G530975Q0778N6636L2840R354j4354l8493o2042q3838j04159j24151j43926
59260G139620j62423j78843j93143k05180k14461k20665k23712k23466k20139
$$ plain form
59335 1859425 1851531 1835142 1812478 1786913 1762089 1740932 1725218 1715310 1710113 1708036 1708438 1711716 1717937
59322 1717937 1726258 1736245 1749036 1766311 1788289 1813442 1840329 1869271 1901947 1939500 1981291 2025640
59310 2025640 2071583 2119599 2170760 2225762 2285017 2348988 2417794 2490801 2567289 2647348 2731547
59299 2731547 2819945 2912272 3009270 3113228 3226746 3351150 3486184 3630990 3785252 3949565
59289 3949565 4124833 4311462 4509242 4717772 4936334 5163316 5396470 5633983 5874246
59280 5874246 6113929 6347319 6568831 6775735 6967309 7141788 7295619 7425690 7530975
59271 7530975 7611753 7668389 7701229 7710583 7696229 7657736 7595694 7511856 7407697 7283546 7139620
59260 7139620 6977197 6798354 6605211 6400031 6185570 5964905 5741193 5517727 5297588
59251E297588k14615k07583j98768j87928j76150j64929j54319j43204j31297
59242C718795j19614j08904r8910q9368q0719p3444o7437o2285n7604n3025m8452
59231B859033m4148m0189l6234l2453k9906k8797k7177k3018j7179j2517j0115
59220B557300q378n919l200p42K178N902R288J1579J3873J7223K0542K2142K2445
59207B664233K3406K5579K7413K7477K6033K4115K2045J9289J5381J0701O285
59196B891957K624j194o505j3075j9087k3459k7098l1244l5661l9370m2113m4016
59184B611759m4706m4153m3534m3788m3877m2094l8907l6744l6888l8067l8406
59173B160595l7509l6110l4735l3238l1081k7823k3875k0666j9221j8803j7791
$$ plain form
59251 5297588 5082973 4875390 4676622 4488694 4312544 4147615 3993296 3850092 3718795
59242 3718795 3599181 3490277 3391367 3301999 3221280 3147836 3080399 3018114 2960510 2907485 2859033
59231 2859033 2814885 2774696 2738462 2706009 2676103 2647306 2620129 2597111 2579932 2567415 2557300
59220 2557300 2548922 2543003 2539803 2539061 2541239 2547141 2556429 2568008 2581881 2599104 2619646 2641788 2664233
59207 2664233 2687639 2713218 2740631 2768108 2794141 2818256 2840301 2859590 2874971 2885672 2891957
59196 2891957 2894581 2893387 2886882 2873807 2854720 2831261 2804163 2772919 2737258 2697888 2655775 2611759
59184 2611759 2567053 2522900 2479366 2435578 2391701 2349607 2310700 2273956 2237068 2199001 2160595
59173 2160595 2123086 2086976 2052241 2019003 1987922 1960099 1936224 1915558 1896337 1877534 1859743
59162A859743j5628j2817r411n180j227O20N78J284M408Q550J1706J4285J7906
59149A874817K2283K5449K6932K8775L2965L9094M5237N0351N5169O1017O8222
59138B330311P5824Q2841Q9557R6989J05185J12910J19337J25016J30451J34697
59128C403118J36451J35749J33218J28115J18843J05279Q9073P1282N1288K8605
59118D401021M335k0001m3811o6529q6502j02300j14435j24199j31103j33237
59108C583239j30388j25132j20058j15215j09336j02404r5526q8897q1560p3253
59098B541470o4919n7086m9184m1201l4676l0791k8438k5641k2250j9617j7947
59087B149720j5882j3075j1291j1965j4013j5285j5173j4508j3775j2865j2132
$$ plain form
59162 1859743 1844115 1831298 1821887 1816707 1815480 1816100 1816678 1817962 1822370 1830920 1842626 1856911 1874817
59149 1874817 1897100 1922549 1949481 1978256 2011221 2050315 2095552 2145903 2201072 2262089 2330311
59138 2330311 2406135 2488976 2578533 2675522 2780707 2893617 3012954 3137970 3268421 3403118
59128 3403118 3539569 3675318 3808536 3936651 4055494 4160773 4249846 4321128 4372416 4401021
59118 4401021 4405356 4385355 4341544 4275015 4188513 4086213 3971778 3847579 3716476 3583239
59108 3583239 3452851 3327719 3207661 3092446 2983110 2880706 2785180 2696283 2614723 2541470
59098 2541470 2476551 2419465 2370281 2329080 2294404 2263613 2235175 2209534 2187284 2167667 2149720
59087 2149720 2133838 2120763 2109472 2097507 2083494 2068209 2053036 2038528 2024753 2011888 1999756
59076A999756j2100j2153j0975q660p053p433q778q998p212m196j150J205K653
59063A914906L406M140N587P822J0022J1137J0879J0052R847J0697J2049J3216
59051B023760J4124J4934J5364J4916J3634J2119J0925J0367J0735J1928J2959
59040B165765J2563J0621Q467P572Q224R590J0583J0571R635Q407P383O463N522
59027B281366N084N749P029P684P326O861P088P729Q207Q501Q655Q198O727M558
59013B380762K364O94K6L65L38k156p428j3120j6903j9222k2027k5644k8660l0523
58999B218866l2326l4762l7083l8617l9753m0717m0791l9687l8522l8315l8439
58988A799854l7752l6399l5245l4073l1972k9232k7305k6649k6042k4501k2662
$$ plain form
59076 1999756 1987656 1975503 1964528 1955868 1948815 1941382 1932604 1923606 1916394 1912198 1911048 1912253 1914906
59063 1914906 1918312 1922452 1928039 1935861 1945883 1957020 1967899 1977951 1987798 1998495 2010544 2023760
59051 2023760 2037884 2052818 2068182 2083098 2096732 2108851 2119776 2130143 2140878 2152806 2165765
59040 2165765 2178328 2188949 2197416 2204988 2213212 2222802 2233385 2243956 2253591 2261998 2269381 2275844 2281366
59027 2281366 2286450 2292199 2299228 2306912 2314238 2321099 2328187 2335916 2344123 2352624 2361279 2369477 2376204 2380762
59013 2380762 2383126 2383820 2383846 2384211 2384549 2382393 2374965 2361845 2344942 2325720 2303693 2278049 2249389 2218866
58999 2218866 2186540 2151778 2114695 2076078 2036325 1995608 1954817 1915130 1876608 1838293 1799854
58988 1799854 1762102 1725703 1690458 1656385 1624413 1595181 1567876 1541227 1515185 1490684 1468022
58977A468022k1493k0678j9269j7291j5523j4028j2018r283o730n166m280l177
58965A319086j497M68K317L780M644M884M780M690M708M687M301L107R47j500
58951A359402l080l465l654m731o550q050q536q025o883n769n503o109o358n295
58937A277394l860l802n109n877m914l111j823j126k85J127L154N463P005O860
58923A271096N968O623R471J2534J4155J5196J6899J8325J8137J7552J8827K1434
58911A446217K2447K0709J8024J5948J3928J1418R366Q333P081M503J456o96k089
58898A576645l506m653m831m398m138l896l136k276k086k279j992j307r50p94
58884A536403J06K087M590P220R991J2548J4205J4759J4596J4175J4112J5261
$$ plain form
58977 1468022 1446529 1425851 1406582 1389291 1373768 1359740 1347722 1338439 1331709 1326543 1322263 1319086
58965 1319086 1317589 1318057 1320374 1324154 1328798 1333682 1338462 1343152 1347860 1352547 1356848 1359955 1360902 1359402
58951 1359402 1356322 1352857 1349203 1344472 1337922 1329872 1321336 1313311 1306428 1300659 1295156 1289047 1282689 1277394
58937 1277394 1273534 1269732 1264623 1258746 1253832 1250721 1248898 1247772 1247487 1248614 1251768 1257231 1264236 1271096
58923 1271096 1277064 1283687 1293158 1305692 1319847 1335043 1351942 1370267 1388404 1405956 1424783 1446217
58911 1446217 1468664 1489373 1507397 1523345 1537273 1548691 1558057 1566390 1573471 1577974 1579430 1578734 1576645
58898 1576645 1573139 1568486 1563655 1559257 1555119 1551223 1548087 1545811 1543725 1541446 1539454 1538147 1537197 1536403
58884 1536403 1536509 1538596 1543186 1550406 1560397 1572945 1587150 1601909 1616505 1630680 1644792 1660053
58872A660053J7589J9548J9950K0110K2324K6300K9113K9212K8503K9427L1783
58861A933912L3831L5183L6782L8833M0605M2016M3895M6662N0024N3851N8091
58850B413685O1907O4343O6086O9060P3757P8261Q0761Q1809Q2987Q4344Q4694
58839C241694Q4023Q3999Q5860Q8999R2130R4941R7958J01425J05066J08702J12502
58828D297299J16587J20705J24339J27086J28989J30435J31473J31343J29085
58819E437341J24786J19657J14598J09096J01917R2482Q1094O8146N3753L8060
58809F340930K1402M148j3167k9575m4227n7230o9364q0751r0473r7998j04378
58798E779317j11145j18180j23626j26310j27416j28872j30554j30367j27390
$$ plain form
58872 1660053 1677642 1697190 1717140 1737250 1759574 1785874 1814987 1844199 1872702 1902129 1933912
58861 1933912 1967743 2002926 2039708 2078541 2119146 2161162 2205057 2251719 2301743 2355594 2413685
58850 2413685 2475592 2539935 2606021 2675081 2748838 2827099 2907860 2989669 3072656 3157000 3241694
58839 3241694 3325717 3409716 3495576 3584575 3676705 3771646 3869604 3971029 4076095 4184797 4297299
58828 4297299 4413886 4534591 4658930 4786016 4915005 5045440 5176913 5308256 5437341
58819 5437341 5562127 5681784 5796382 5905478 6007395 6099877 6180971 6249117 6302870 6340930
58809 6340930 6362332 6366480 6353313 6323738 6279511 6222281 6152917 6072166 5981693 5883695 5779317
58798 5779317 5668172 5549992 5426366 5300056 5172640 5043768 4913214 4782847 4655457
58789D655457j23572j21186j19591j16159j10367j05006j02503j01567r8964r3745
58779C562797q7987q3545p9787p5022o8920o2640n7215n2664m8458m4220l9782
58768B862557l4924k9470k3814j9044j5948j3901j1370p716l760j86L516P665
58756B713605J1132J2867J3913J6153J9438K1917K3242K5300K9190L3415L6082
58745B956254L7373L8562M0067M1822M4421M8391N3016N7362O1746O6906P2360
58734C518280P7119Q1529Q6843R3122R9148J04339J09286J14194J18284J21168
58724D523312J23542J25877J27425J27191J25117J21816J17705J12924J07381
58715E612290J00404R0959P8759O4710M9717L3534J5473l935k2746l9321n3896
$$ plain form
58789 4655457 4531885 4410699 4291108 4174949 4064582 3959576 3857073 3755506 3656542 3562797
58779 3562797 3474810 3391265 3311478 3236456 3167536 3104896 3047681 2995017 2946559 2902339 2862557
58768 2862557 2827633 2798163 2774349 2755305 2739357 2725456 2714086 2706370 2702610 2702424 2705940 2713605
58756 2713605 2724737 2737604 2751517 2767670 2787108 2809025 2832267 2857567 2886757 2920172 2956254
58745 2956254 2993627 3032189 3072256 3114078 3158499 3206890 3259906 3317268 3379014 3445920 3518280
58734 3518280 3595399 3676928 3763771 3856893 3956041 4060380 4169666 4283860 4402144 4523312
58724 4523312 4646854 4772731 4900156 5027347 5152464 5274280 5391985 5504909 5612290
58715 5612290 5712694 5803653 5882412 5947122 5996839 6030373 6045846 6041911 6019165 5979844 5925948
58704E925948o8161q3156r7772j09684j17768j23160j27698j31960j35401j37779
58694D793409j39347j39834j38416j35060j31018j27531j24601j21380j17252
58685C618970j12289j07165j02785r9390r5892r0867q4501p8635p4359p0489o5279
58674B637319n8958n3436m9879m7709m5914m4313m3143m2220m1015l9240l7104
58663B134388l5182l4017l3433l2351k9906k6737k4413k3313k1926j8962j5480
58652A838668j3765j4370j5417j5148j4141j4279j6305j9363k2633k6303l0686
58641A636258l5148l8428l9737l9239l7745l6169l4976l3924l2453l0485k8533
58630A249421k6921k5256k3018k0384j8035j6289j4730j2843j0627q576p080n999
$$ plain form
58704 5925948 5857787 5774631 5676859 5567175 5449407 5326247 5198549 5066589 4931188 4793409
58694 4793409 4654062 4514228 4375812 4240752 4109734 3982203 3857602 3736222 3618970
58685 3618970 3506681 3399516 3296731 3197341 3101449 3010582 2926081 2847446 2773087 2702598 2637319
58674 2637319 2578361 2524925 2475046 2427337 2381423 2337110 2293967 2251747 2210732 2171492 2134388
58663 2134388 2099206 2065189 2031756 1999405 1969499 1942762 1918349 1895036 1873110 1854148 1838668
58652 1838668 1824903 1810533 1795116 1779968 1765827 1751548 1735243 1715880 1693247 1666944 1636258
58641 1636258 1601110 1562682 1522945 1483706 1445961 1409792 1374816 1340892 1308439 1277954 1249421
58630 1249421 1222500 1197244 1174226 1153842 1135807 1119518 1104788 1091945 1081318 1072742 1065662 1059663
58618A059663m948m023l952n208p224r029j0456j1971j3403j3787j2857j1637
58606I51168j0988j0406r073p318o086n533n283n628p105r045r882r193q239q034
58592H39355p961p018n528m787n332o349o673n818m166k508j525j325j404j071
58578G77890l0J386K565L258L883M900N931N898M367K355J434K314M541P214R450
58563H37356J0657J0952J1160J1838J2609J2942J3132J3660J4066J3417J1743
58552I73532R990Q685P682P173P847R782J2081J3874J4929J5288J5230J5703J7748
58539A129544K1192K4696K7188K8460K8503K7594K7008K8154L0551L2303L3065
58528A438258L4795L8501M2020M2560M0341L8037L7350L7694L7634L6120L2644
$$ plain form
58618 1059663 1054715 1050692 1046740 1041532 1034308 1025279 1014823 1002852 989449 975662 962805 951168
58606 951168 940180 929774 920701 913383 907297 901764 896481 890853 883748 874703 864821 855628 847389 839355
58592 839355 831394 824376 818848 814061 808729 802380 795707 789889 785723 783215 781690 780365 778961 777890
58578 777890 777860 779246 781811 785069 788952 793852 799783 805681 810048 812403 813837 816151 820692 827906 837356
58563 837356 848013 858965 870125 881963 894572 907514 920646 934306 948372 961789 973532
58552 973532 983522 992207 999889 1007062 1014909 1024691 1036772 1050646 1065575 1080863 1096093 1111796 1129544
58539 1129544 1150736 1175432 1202620 1231080 1259583 1287177 1314185 1342339 1372890 1405193 1438258
58528 1438258 1473053 1511554 1553574 1596134 1636475 1674512 1711862 1749556 1787190 1823310 1855954
58517A855954K7676K2724J8807J5065J0026L807k200p413j2193j6178j8255j8576
58505A879244j8867k0169k1547k1820k1341k1234k1840k2831k4078k5337k5743
58494A634437k4760k3448k3529k5171k6542k5999k4091k2902k3727k5920k7811
58483A360537k8258k7238k5514k4105k3774k4384k4783k3803k1543j9284j8105
58472A099746j7953j8082j7825j6779j4853j2552j0712r589q646p511o505n884
58460I52855n308m642m552n461o499o476n455m349l323j894m09k7q12j202j21
58445I02325J208O42j992m342l990r98K307L790L325K154J056j54j559k518k464
58430H98790j599l33J261K911L779L445K643K257K086J595J254J959L299L775
$$ plain form
58517 1855954 1883630 1906354 1925161 1940226 1950252 1954059 1951859 1944446 1932253 1916075 1897820 1879244
58505 1879244 1860377 1840208 1818661 1796841 1775500 1754266 1732426 1709595 1685517 1660180 1634437
58494 1634437 1609677 1586229 1562700 1537529 1510987 1484988 1460897 1437995 1414268 1388348 1360537
58483 1360537 1332279 1305041 1279527 1255422 1231648 1207264 1182481 1158678 1137135 1117851 1099746
58472 1099746 1081793 1063711 1045886 1029107 1014254 1001702 990990 981401 972755 965244 958739 952855
58460 952855 947547 942905 938353 932892 926393 919917 914462 910113 906790 904896 904487 904460 903648 902446 902325
58445 902325 903533 904175 902183 897841 893851 892853 895160 898950 902275 904429 905485 905331 903772 901254 898790
58430 898790 897191 896858 898119 901030 904809 908254 910897 913154 915240 916835 918089 920048 923347 927122
58416I27122K774J236K12k08l24k37j41l49o66n28l0j00j263k893m027m332m039
58399I12207l442k743k013j207n83q51k189l386k902r17O74M90r37k189k494k032
58383H85486j492j571k215k300q91J306K762L273L885M774M853L874L171L498
58369I08413L908L720L922N258O546O503N998O523P483P132N627M934N674O160
58355I87801N031L159K253K806M085N303O113O460O472O342O262O619P860R760
58341A066326J1226J1547J1344J1598J2208J2454J2443J2885J3648J3776J2890
58330A202345J1571J0324R239Q580Q702R321R836J0212J0521R889P419M100K207
58317A314266K477L427L835M189N050N756N822O114P317Q499Q694Q779J0148J2265
$$ plain form
58416 927122 929896 931132 931344 931136 930812 930575 930434 930085 929419 928891 928861 928761 927498 924605 920578 916246 912207
58399 912207 908765 906022 904009 902802 902219 901368 899179 895793 892891 891974 892648 893138 892201 890012 887518 885486
58383 885486 883994 882423 880208 877908 877017 878323 881085 884358 888243 893017 897870 901744 904915 908413
58369 908413 912321 916041 919963 925221 931767 938270 944268 950791 958274 965406 971033 975967 981641 987801
58355 987801 992832 995991 998244 1001050 1005135 1010438 1016551 1023011 1029483 1035825 1042087 1048706 1056566 1066326
58341 1066326 1077552 1089099 1100443 1112041 1124249 1136703 1149146 1162031 1175679 1189455 1202345
58330 1202345 1213916 1224240 1233479 1242059 1250761 1260082 1269918 1280130 1290651 1300540 1307959 1312059 1314266
58317 1314266 1316743 1320170 1324005 1328194 1333244 1339000 1344822 1350936 1358253 1366752 1375446 1384225 1394373 1406638
58303A406638J3334J3020J2770J3509J4674J5751J7124J8745J9255J7503J4430
58292A576753J2430J2855J4707J5941J5812J5600J6894J9535K1821K2647K2591
58281A767586K2629K2746K2535K2287K2410K2318K1187J9619J9205K0379K1888
58270B004789K2663K3074K3941K5315K6858K8501L0061L1010L1417L2348L4449
58259B314426L6684L7570L7169L6777L6886L6822L6468L6930L8825M1052M2201
58248B731810M2483M3220M4851M6482M7308M7517M7759M8565N0404N3378N6544
58237C260321N8482N9113O0112O2766O6073O7957O8000O7912O9340P2223P5350
58226C987649P7698P8888P9224P9678Q1325Q4392Q8278R2640R7825J03866J09782
$$ plain form
58303 1406638 1419972 1432992 1445762 1459271 1473945 1489696 1506820 1525565 1544820 1562323 1576753
58292 1576753 1589183 1602038 1616745 1632686 1648498 1664098 1680992 1700527 1722348 1744995 1767586
58281 1767586 1790215 1812961 1835496 1857783 1880193 1902511 1923698 1943317 1962522 1982901 2004789
58270 2004789 2027452 2050526 2074467 2099782 2126640 2155141 2185202 2216212 2247629 2279977 2314426
58259 2314426 2351110 2388680 2425849 2462626 2499512 2536334 2572802 2609732 2648557 2689609 2731810
58248 2731810 2774293 2817513 2862364 2908846 2956154 3003671 3051430 3099995 3150399 3203777 3260321
58237 3260321 3318803 3377916 3438028 3500794 3566867 3634824 3702824 3770736 3840076 3912299 3987649
58226 3987649 4065347 4144235 4223459 4303137 4384462 4468854 4557132 4649772 4747597 4851463 4961245
58215D961245J14489J18054J21574J26067J31831J38493J45348J51981J58901
58206F167983J67066J76502J86004J94796K03793K14301K26020K37420K47956
58197H021841K58676K70432K82506K93591L03551L13596L24962L37944L52157
58188A0759256L67455L84256M02902M22985M43799M65412M88599N13484N39172
58179A4787320N65301N93088O23812O57030O91554P27728P67092Q09882Q54583
58170B1077390R00394R48698J001423J059169J121777J189661J263459J343142
58162B9905113J428307J519066J615962J719614J831121J952391K085436K231859
58154D4288869K393393K572336K770977K991463L236768L510962L817930M161106
$$ plain form
58215 4961245 5075734 5193788 5315362 5441429 5573260 5711753 5857101 6009082 6167983
58206 6167983 6335049 6511551 6697555 6892351 7096144 7310445 7536465 7773885 8021841
58197 8021841 8280517 8550949 8833455 9127046 9430597 9744193 10069155 10407099 10759256
58188 10759256 11126711 11510967 11913869 12336854 12780653 13246065 13734664 14248148 14787320
58179 14787320 15352621 15945709 16569521 17226551 17918105 18645833 19412925 20222807 21077390
58170 21077390 21977784 22926482 23927905 24987074 26108851 27298512 28561971 29905113
58162 29905113 31333420 32852486 34468448 36188062 38019183 39971574 42057010 44288869
58154 44288869 46682262 49254598 52025575 55017038 58253806 61764768 65582698 69743804
58146F9743804M545733M980629N476473O041883O679121P379046Q118585Q869664
58138A21834938R620863J0393711J1232678J2173240J3217064J4333904J5478373
58131B08284771J6596970J7616593J8422811J8837023J8604300J7418513J5010922
58124C30791903J1285592O427682R02685m670626r705998j3795866j6761589j8619348
58116B85854435j9509488j9628960j9182052j8350262j7279387j6079719j4831861
58109A60992706j3592201j2397374j1269282j0219887r254238q372285p570986
58102H8316453o846015o191927n602169n070657m593406m167541l788774l451178
58094D8604786l149470k880126k639833k424276k229419k053011j893681j749274
$$ plain form
58146 69743804 74289537 79270166 84746639 90788522 97467643 104846689 112965274 121834938
58138 121834938 131455801 141849512 153082190 165255430 178472494 192806398 208284771
58131 208284771 224881741 242498334 260921145 279758168 298362468 315780981 330791903
58124 330791903 342077495 348505177 349407862 344737236 335031238 321235372 304473783 285854435
58116 285854435 266344947 246715987 227533935 209183673 191904286 175824567 160992706
58109 160992706 147400505 135003131 123733849 113513962 104259724 95887439 88316453
58102 88316453 81470438 75278511 69676342 64605685 60012279 55844738 52055964 48604786
58094 48604786 45455316 42575190 39935357 37511081 35281662 33228651 31334970 29585696
58086B9585696j617273j496585j387614j290416j203560j124935j052980r86878
58078A9425455r26273q71162q21571p76769p35006o94447o54533o16243n80968
58069A2748483n49218n20336m93263m67470m43204m20907m00439l80902l61373
58060H711371l41903l23590l07331k92563k77814k62724k48812k37564k28178
58051F190892k18325k07152j96410j88098j81951j76053j69263j62039j55243
58042D536358j49219j44011j39385j34443j28067j20356j12973j07470j03627
58033C396807r9934r5393r0330q5601q1557p7834p3876o9646o5896o3546o2588
58022B530606o1824n9992n6995n3784n1279m9777m9167m9068m8787m7660m5617
$$ plain form
58086 29585696 27968423 26471838 25084224 23793808 22590248 21465313 20412333 19425455
58078 19425455 18499182 17628020 16806449 16029680 15294674 14600227 13945694 13329451 12748483
58069 12748483 12199265 11678929 11185666 10718196 10274992 9854085 9453646 9072744 8711371
58060 8711371 8369468 8045878 7738547 7445984 7168170 6905446 6656634 6419070 6190892
58051 6190892 5972567 5765415 5569005 5380907 5198956 5022903 4853640 4691601 4536358
58042 4536358 4387139 4243128 4103743 3969300 3841233 3720877 3607904 3500434 3396807
58033 3396807 3296873 3201480 3111150 3025549 2943992 2866158 2792282 2722636 2656740 2593194 2530606
58022 2530606 2468782 2408790 2351795 2298011 2246732 2196955 2147788 2098720 2049933 2002273 1956656
58011A956656m3051m0215l7369l5429l5465l6969l7570l5399l1414k8376k7664
58000A567735k8055k7684k6180k4489k3480k3358k3838k4155k3316k1170j9017
57989A302993j8458j9619k1048k1359k0452j9129j8109j7569j7190j6434j5147
57978A098479j3948j3594j3933j4049j3588j3161j3118j2795j1787j1176j2284
57967I55046j4363j4921j2732r551q139r165j0805j1004r443p429o447o946q051
57954H26050q348p164n133l407k469j942j391q29m33j58J70O70J351K077K617
57939H01661K958L497M441N115M481K608Q77L64O16O93Q09J888L728M842M403
57924H42981L299K681K309J243l60j161l59J347K783L607M307N314O531P502P772
$$ plain form
58011 1956656 1913605 1873390 1836021 1800592 1765127 1728158 1690588 1655189 1623775 1595399 1567735
58000 1567735 1539680 1511996 1485816 1461327 1437847 1414489 1390651 1366496 1343180 1322010 1302993
57989 1302993 1284535 1264916 1243868 1222509 1202057 1182928 1164819 1147250 1130060 1113626 1098479
57978 1098479 1084531 1070937 1057004 1042955 1029367 1016206 1003088 990293 978506 967330 955046
57967 955046 940683 925762 913030 903479 895340 886175 875370 864366 854923 847494 841047 834101 826050
57954 826050 817702 810538 805405 801998 799529 797587 796196 795367 794934 794776 794946 795616 796967 799044 801661
57939 801661 804619 808116 812557 817672 822153 824761 825638 826002 826618 827311 828120 830008 833736 838578 842981
57924 842981 846280 848961 851270 852513 852153 850992 850633 851980 854763 858370 862677 867991 874522 882024 889796
57909H89796P190O130N245M738M003K355L7j892k845l527n029p365r465j0718
57895H78653j1873j3834j5988j6611j5116j3064j2412j3223j3815j2953j1088
57884G28676r363q285p728p572p515o673m275r03J678K267J307p5j582l648o164
57869F70145q172q966q862q617q636r102j0281j1995j3086j2279r668o837n200
57856E48444m689m148k585J99L539O026O241M182J793J212K382L171K088J29p71
57841E67213m58o32k257m210n037n058n535o416o354n119m381n271o450n950m188
57826D99897l526m936o827p446o989o542o313o070o250p176p654o033k756l96
57812D20983o10k104k382q09Q97R73l78j430r43N52J492J110L18N68K123L760
$$ plain form
57909 889796 896986 903116 908361 913099 917102 919457 919494 917602 914757 911230 906201 898836 889371 878653
57895 878653 866780 852946 836958 820347 805231 792167 779755 766532 752717 739764 728676
57884 728676 719313 711028 703300 695728 688213 681540 677265 676362 678040 680307 681614 681539 679957 676309 670145
57869 670145 661973 653007 644145 635528 626892 617790 607509 595514 582428 570149 560481 553644 548444
57856 548444 543755 539607 537022 537221 540760 546786 553027 557209 559002 560214 562596 565767 567855 567984 567213
57841 567213 566755 566123 563866 559656 554619 549561 544026 537610 531256 526137 521756 516485 510035 504085 499897
57826 499897 496371 491435 484608 477162 470173 463631 457318 451248 444998 437822 430168 424135 421379 420983
57812 420983 420373 418269 415887 415078 415975 416948 416570 415140 414197 414749 416241 417351 417669 418237 420360 424120
57796D24120M139K962Q55j377l067l754l444k730k326k489k973l454l817m021
57782C98624l896l229k107j137j038j896k944l276k678j629o78j37m1n1M37J489
57766C75813K050R87j247k808k694j973k116k889k899j876j164j822l273m341
57752C49748m719m767m540l938l392l522m128m393l977l078j484J237M268N595
57738C18910M519L090L692N806O730N200K768J465J789L333N708P898Q186O152
57724C85246L832L528M959N802M601J945r50l523n726p616r247j0410j0623r964
57710C51854r408r598r917r648r376r829j0118q863o745n867o568o923n816m396
57696B38782l695k971j578o27j088j718q33R20J463L61q32j070r02r73q65R8J806
$$ plain form
57796 424120 428259 431221 432076 430699 427632 423878 420434 417704 415378 412889 409916 406462 402645 398624
57782 398624 394728 391499 389392 388255 387217 385321 382377 379101 376423 374794 374116 373979 373938 373887 374324 375813
57766 375813 377863 378850 377603 374795 372101 370128 368012 365123 362224 360348 359184 357362 354089 349748
57752 349748 345029 340262 335722 331784 328392 324870 320742 316349 312372 309294 307810 309047 313315 318910
57738 318910 323429 326519 330211 336017 342747 347947 350715 352180 353969 357302 363010 370908 379094 385246
57724 385246 389078 392606 397565 403367 407968 409913 408963 405440 399714 392098 382851 372441 361818 351854
57710 351854 342446 332848 322931 313283 303907 294078 283960 275097 268352 262485 255917 248994 243178 238782
57696 238782 235087 232116 230538 229911 228823 227105 226272 227192 228655 229016 228184 227114 226212 225239 224374 224472 226278
57679B26278L413L992L170J647P46R93J563J637J601K149L030L727M503N547N834
57664B69830M525K869K844M121M482L360K648L358L737K073m33j414p24q8n8N67
57648C01697K245L554L221K069J890L113M571N367N990P224Q579Q525O359L230
57634C67634J157J200K871M880O112O169N589N497O642Q779J1235J3771J6467
57621D58003J9019K0949K2422K4235K6913L0321L4095L8005M1969M6327N1964
57610H14222N9325O7216P3125P4645P0161N8734M0890J9670n00j6671k8349l5583
57598A196885l7743l5150l0372k6181k2708j8108j1761n361o64K494N347Q228
57586A024906J0324J1122J1364J2187J3508J3838J2053Q923O116L775L24m937
$$ plain form
57679 226278 229691 233683 236853 238500 239246 240239 241802 243439 245040 247189 250219 253946 258449 263996 269830
57664 269830 274355 277224 280068 284189 288671 292031 294679 298037 301774 303847 303414 302000 301276 301188 301130 301697
57648 301697 303942 307496 310717 312786 314676 317789 322360 327727 333717 340941 349520 358045 364404 367634
57634 367634 368791 369991 372862 377742 383854 390023 395612 401109 407751 416530 427765 441536 458003
57621 458003 477022 497971 520393 544628 571541 601862 635957 673962 715931 762258 814222
57610 814222 873547 940763 1013888 1088533 1158694 1217428 1258318 1277988 1277488 1260817 1232468 1196885
57598 1196885 1159142 1123992 1093620 1067439 1044731 1026623 1014862 1009501 1008837 1011331 1016678 1024906
57586 1024906 1035230 1046352 1057716 1069903 1083411 1097249 1109302 1118225 1124341 1128116 1128440 1123503
57574A123503j0204j3228j4294j5790j8981k2478k4165k3710k2632k2369k2784
57563I12868k2588k0987j8785j7655j8184j9179j9135j7773j5692j3167j0301
57552G19422p849o578n793l805l04K809L598K344R27O31J376K706M594P066R678
57537G30822J1735J2974J3886J5253J7221J8931J9474J9150J9236K0300K1426
57526I20408K1534K0855K0274J9648J7806J4352J0502P679N812L666M55l416p145
57513A052430j0395j3305j5970j8291k0172k1769k3463k5555k7771k9139k8640
57502H17960k6333k3633k2223k2531k3402k3218k1370j8626j6311j5106j4530
57491E90677j3534j1699r767q854r144r607r174p950p033p170p852p831o396m058
$$ plain form
57574 1123503 1113299 1100071 1085777 1069987 1051006 1028528 1004363 980653 958021 935652 912868
57563 912868 890280 869293 850508 832853 814669 795490 776355 758582 742890 729723 719422
57552 719422 711573 704995 699202 695397 695093 697902 701500 703844 704771 705402 706778 709484 714078 721144 730822
57537 730822 742557 755531 769417 784670 801891 820822 840296 859446 878682 898982 920408
57526 920408 941942 962797 983071 1002719 1020525 1034877 1045379 1053058 1058870 1062536 1062991 1059575 1052430
57513 1052430 1042035 1028730 1012760 994469 974297 952528 929065 903510 875739 846600 817960
57502 817960 791627 767994 745771 723240 699838 676620 655250 636624 620313 605207 590677
57491 590677 577143 565444 555677 546823 537679 528072 518898 510948 503915 496745 488893 481062 474666 470608
57477D70608k010j087j304k150l058l500l127k203j697k359l694m343l655k354
57463D34067j416p81K09J503K233J966J480J907L518N615P380Q517R122R302R065
57448D93687Q558Q294Q914J0441J1918J2257J1567J1271J2512J4731J6391J6832
57436F37373J6852J7352J8117J8329J7829J7221J6998J7141J7522J7981J7803
57425H30518J5774J1382N792J145j246j895k391l882o348r030j1384j3391j5099
57412G99945j6175j6184j5146j3515j1665r855q603q498r337r999r562q241o817
57399F56348n582m397l404k961k893k505j332N28K701M580N284M425L133L341
57385F57266N657Q558J0213J0476J0519J1108J2122J3397J5030J6776J7996J8445
$$ plain form
57477 470608 468598 467511 466207 464057 460999 457499 454372 452169 450472 448113 444419 440076 436421 434067
57463 434067 432651 431870 432079 433582 435815 437781 439261 441168 444686 450301 457681 466198 475320 484622 493687
57448 493687 502245 510539 519453 529894 541812 554069 565636 576907 589419 604150 620541 637373
57436 637373 654225 671577 689694 708023 725852 743073 760071 777212 794734 812715 830518
57425 830518 846292 857674 863466 864611 863365 861470 859079 855197 848849 839819 828435 815044 799945
57412 799945 783770 767586 752440 738925 727260 717405 708802 700304 690967 680968 671406 663165 656348
57399 656348 650766 646369 642965 640004 637111 634606 633274 633802 636503 641083 646367 650792 653925 657266
57385 657266 662923 671481 681694 692170 702689 713797 725919 739316 754346 771122 789118 807563
57373H07563J8344J7538J5447J2435J0321J0413J1471J0944Q272N670N027N318
57361I38763M172J100k412n452q609j2124j4976j6551j7743j9297k0286j9614
57349H06971j8087j7352j7402j6842j5396j4272j3895j3068j1044q968q253q655
57337F43737q924q512p658o479m937l265j623K11K082K967K141M46n57m28P6N47
57321F09824J341K532L481L905M371N327O304O764P028P606Q011P270N636M828
57307F84228N977Q065R135Q772Q416R189J0372J0577R655Q574P931P553P409P948
57293H03801R284J0773J1707J1961J1796J1658J2210J3819J5760J6556J5603J3852
57281I58780J2550J1943J1670J1818J2734J4047J4661J3980J2708J2223J3126
$$ plain form
57373 807563 825907 843445 858892 871327 881648 892061 903532 914476 922748 928418 933445 938763
57361 938763 942935 944035 941623 936171 927562 915438 900462 883911 866168 846871 826585 806971
57349 806971 788884 771532 754130 737288 721892 707620 693725 680657 669613 660645 652392 643737
57337 643737 634813 626301 618643 612164 607227 603962 602339 602550 604632 607599 609740 610186 609629 609201 609277 609824
57321 609824 611165 613697 617178 621083 625454 630781 637085 643849 650877 658483 666494 673764 679400 684228
57307 684228 690205 698270 707405 716177 724593 733782 744154 754731 764386 772960 780891 788444 795853 803801
57293 803801 813085 823858 835565 847526 859322 870980 883190 897009 912769 929325 944928 958780
57281 958780 971330 983273 994943 1006761 1019495 1033542 1048203 1062183 1074891 1087114 1100240
57270A100240J4506J4916J4196J3832J5156J7553J9291J9674J9379J8943J8204
57259A285890J7379J7201J7464J6856J5091J3989J5230J7964J9765J9429J7809
57248A474067J6470J6510J8186K0641K2252K2164K1202K0636K0603K0424J9946
57237A693101J9550J9465J9978K1659K4277K6176K6042K4896K4851K6209K7215
57226A953419K6715K5489K4827K5003K5548K6036K6281K6538K7472K9123L0141
57215B246592K9268K7491K7304K9554L2389L3738L3641L3524L4130L4883L4711
57204B597225L3051L0432K8148K6898K6053K4948K4321K5071K6127K5368K2777
57193B890419K0653K0188J9909J8441J6940J7279J9297K1510K3399K5253K6561
$$ plain form
57270 1100240 1114746 1129662 1143858 1157690 1172846 1190399 1209690 1229364 1248743 1267686 1285890
57259 1285890 1303269 1320470 1337934 1354790 1369881 1383870 1399100 1417064 1436829 1456258 1474067
57248 1474067 1490537 1507047 1525233 1545874 1568126 1590290 1611492 1632128 1652731 1673155 1693101
57237 1693101 1712651 1732116 1752094 1773753 1798030 1824206 1850248 1875144 1899995 1926204 1953419
57226 1953419 1980134 2005623 2030450 2055453 2081001 2107037 2133318 2159856 2187328 2216451 2246592
57215 2246592 2275860 2303351 2330655 2360209 2392598 2426336 2459977 2493501 2527631 2562514 2597225
57204 2597225 2630276 2660708 2688856 2715754 2741807 2766755 2791076 2816147 2842274 2867642 2890419
57193 2890419 2911072 2931260 2951169 2969610 2986550 3003829 3023126 3044636 3068035 3093288 3119849
57182C119849K6475K5559K5486K6864K8603K9563K9748K9748K9823K9859K9665
57171C431242K9208K8791K8851K9181K8777K6969K4405K2304K1022K0004J8883
57160C709637J7948J7624J8056J9262K1147K3317K5173K6323K6801K7092K7830
57149C960210K9082K9913K9235K7245K5306K4297K3900K3771K4262K5348K5967
57138D248536K5510K5036K5709K6724K6235K4186K2667K3265K5312K7119K7947
57127D528246K8212K8458K8838K9297K9757L0050K9865K8873K7107K5073K3264
57116D837040K1634K0089J9328K0182K1882K2317K0764J9244J9895K1901K2595
57105E066871K1175J9689K0188K2342K4312K4894K4404K4184K5607K9011L3322
$$ plain form
57182 3119849 3146324 3171883 3197369 3224233 3252836 3282399 3312147 3341895 3371718 3401577 3431242
57171 3431242 3460450 3489241 3518092 3547273 3576050 3603019 3627424 3649728 3670750 3690754 3709637
57160 3709637 3727585 3745209 3763265 3782527 3803674 3826991 3852164 3878487 3905288 3932380 3960210
57149 3960210 3989292 4019205 4048440 4075685 4100991 4125288 4149188 4172959 4197221 4222569 4248536
57138 4248536 4274046 4299082 4324791 4351515 4377750 4401936 4424603 4447868 4473180 4500299 4528246
57127 4528246 4556458 4584916 4613754 4643051 4672808 4702858 4732723 4761596 4788703 4813776 4837040
57116 4837040 4858674 4878763 4898091 4918273 4940155 4962472 4983236 5002480 5022375 5044276 5066871
57105 5066871 5088046 5107735 5127923 5150265 5174577 5199471 5223875 5248059 5273666 5302677 5335999
57094E335999L7137L9956M1864M2503M1414L9156L6749L3991K9626K3420J6733
57083E718548J0684N085l07m990r155j4499k2272l1360l9783m7367n5369o3965
57071E445250p2050p9743q9285j02434j18140j33856j48543j63383j79923j98531
57061D159362k18654k39555k60581k81461l02750l25494l50072l75832m02247
57052A402716m29848m59435B2556e01030n57808n94320o33071o73183p14668p59023
57042d433103q07786q61582r21190r88337j064525j150051j245152j351106j468556
57033a4291388j595215j726705j859360j990742k117668k235768k341775k434597
57025c0593218k512364k567562k584061k537977k402901k158800j800685j341331
$$ plain form
57094 5335999 5373136 5413092 5454956 5497459 5538873 5578029 5614778 5648769 5678395 5701815 5718548
57083 5718548 5729232 5734317 5734010 5729020 5719865 5705366 5683094 5651734 5611951 5564584 5509215 5445250
57071 5445250 5373200 5293457 5204172 5101738 4983598 4849742 4701199 4537816 4357893 4159362
57061 4159362 3940708 3701153 3440572 3159111 2856361 2530867 2180795 1804963 1402716
57052 1402716 972868 513433 22556 -501030 -1058838 -1653158 -2286229 -2959412 -3674080 -4433103
57042 -4433103 -5240889 -6102471 -7023661 -8011998 -9076523 -10226574 -11471726 -12822832 -14291388
57033 -14291388 -15886603 -17613308 -19472668 -21463410 -23581078 -25816846 -28158621 -30593218
57025 -30593218 -33105582 -35673144 -38257205 -40795182 -43198083 -45356883 -47157568 -48498899
57017d8498899q06533k27391L65244R43112J481284J958429K357504K667732K886698
57008c6872820L019734L076315L066723L001399K891440K748068K581513K400567
57000a4087061K212208K021075J830085J642446J462461J293845J138138R95662
56992a491141f24132A28242O50348N58983M77892M07673L47545K95129K48779
56983C114591K08559J74390J44626J17382R2399P0788N3538M0766L1733K4745
56973D073517J7585Q940o69r756j7381k3425k7916l0973l3374l6295m0253m4619
56961C835381m8457n1488n4099n6612n8888o0656o2003o3418o5290o7421o9106
56950C177943o9754o9456o8914o8950p0013p2189p5399p9358q3369q6567q8821
$$ plain form
57017 -48498899 -49305432 -49532823 -49167579 -48224467 -46743183 -44784754 -42427250 -39759518 -36872820
57008 -36872820 -33853086 -30776771 -27710048 -24708649 -21817209 -19069141 -16487628 -14087061
57000 -14087061 -11874853 -9853778 -8023693 -6381247 -4918786 -3624941 -2486803 -1491141
56992 -1491141 -624132 128242 778590 1337573 1815465 2223138 2570683 2865812 3114591
56983 3114591 3323150 3497540 3642166 3759548 3851947 3922735 3976273 4017039 4048772 4073517
56973 4073517 4091102 4100042 4099373 4089617 4072236 4048811 4020895 3989922 3956548 3920253 3880000 3835381
56961 3835381 3786924 3735436 3681337 3624725 3565837 3505181 3443178 3379760 3314470 3247049 3177943
56950 3177943 3108189 3038733 2969819 2900869 2830856 2758667 2683268 2603910 2520541 2433974 2345153
56939B345153r1212r4927r9579j03219j04405j03566j01782r8951r4230q7958
56929A365324q1854p6963p2508o7317o1548n6248n1732m7307m2443l7636l4085
56918G35683l2733l3399l4506l4112l1641k8356k5743k3886k2041k0207j9082
56907D29977j8551j7403j4899j1680q651n715k361J049L381M072L738L317L101
56894C69375K721J809M14j244l187n558p898r011q084n819l840k841j941j57K179
56879C26918L946M636M662M648N074O329Q398J0445J1337J0684Q933O569L683
56866D16262M21k710n165o821p998r133j0360j1217j0984r604p971p033o896p152
56852C13639p594p982p526n582k784n63M55Q64J190J185N96j33l36L31K010M624
$$ plain form
56939 2345153 2253941 2159014 2059435 1956216 1851811 1748245 1646463 1547512 1453282 1365324
56929 1365324 1283470 1206507 1133999 1066682 1005134 948886 897154 849847 807404 769768 735683
56918 735683 702950 669551 635045 600933 569292 540936 515193 491307 469266 449059 429977
56907 429977 411426 394023 379124 367444 358793 353078 350717 351766 355147 359219 362957 366274 369375
56894 369375 372096 373905 374319 373075 369888 364330 356432 347421 339337 333518 329678 326837 324896 324739 326918
56879 326918 330864 335500 340162 344810 349884 356213 364611 375056 386393 397077 406010 412579 416262
56866 416262 416683 413973 408808 401987 393989 384856 374496 363279 352295 342691 334720 327687 320791 313639
56852 313639 306045 298063 290537 284955 282171 281608 282063 282927 284117 285302 285898 285765 285429 285760 287770 292394
56836B92394P428R319R938R978J0171J0712J1709J3220J4533J4524J3271J2226
56824D29423J2113J1857J0529R096Q776Q700P058M099K082K161L121L540L574
56811E16129L889M216M086M039N021P008R141J0946J2568J3969J4698J4641J4377
56798F34728J4393J4204J2705R358M719k41m896q723j0834j0573q504n913l185
56785F37238L08M394P538Q944J0097J2817J6681J9819K1772K3654K5658K6411
56773H15331K5242K3199K0921J7079J0227J346o784j2317j5475j7448j9025k0262
56761H22034k0742k0170j8870j7443j5831j3352r853o011k124K394P480J1423
56749G18935J2614J1728J0767J0200Q511M696k25m784r001j3788j8969k2998k4583
$$ plain form
56836 292394 299822 309141 319079 329057 339228 349940 361649 374869 389402 403926 417197 429423
56824 429423 441536 453393 463922 473018 481794 490494 497552 501651 503733 505894 509015 512555 516129
56811 516129 520018 524234 528320 532359 537380 544388 553529 564475 577043 591012 605710 620351 634728
56798 634728 649121 663325 676030 685388 690107 689866 684970 676247 665413 654840 646336 640423 637238
56785 637238 637546 641940 649478 658422 668519 681336 698017 717836 739608 763262 788920 815331
56773 815331 840573 863772 884693 901772 911999 913345 906561 894244 878769 861321 842296 822034
56761 822034 801292 781122 762252 744809 728978 715626 705773 699762 697638 700032 707512 718935
56749 718935 731549 743277 754044 764244 772755 777451 777226 772442 763441 749653 730684 707686 683103
56736F83103k3916k2114j9932j7387j4512j1915j0330r733r327q399o766m374
56724E24398j146K373M900N637N239M653L401K46m364q043r376r937j2058j5425
56710D90498j7507j7200j6237j6425j7089j6430j4352j2322j0980r553p766o737
56698C27900p287q473q753p820o462n185l956k989k715k974k960k305j657k000
56684B62364l529n311n999n016l128j588q30m41l30q32j491j018O57J590L69j463
56668B34004j295Q51K392J792J68q86j230j263q79k67l80j514k466k062o60P72
56652B27077K049L281L912L438K441J812J470P90k51j348k614l873l885j746J220
56637B33773K479J266p60j826j780j222m22K81J11j066k007j411L12J507J424
$$ plain form
56736 683103 659187 637073 617141 599754 585242 573327 562997 553264 543937 535538 528772 524398
56724 524398 523252 525625 530525 536162 541401 546054 549455 549701 545337 537294 527918 517981 505923 490498
56710 490498 472991 455791 439554 423129 406040 389610 375258 362936 351956 342403 334637 327900
56698 327900 320613 312140 303387 295567 289105 283920 279964 276975 274260 271286 268326 266021 264364 262364
56684 262364 258835 253524 247525 242509 239381 237793 236963 236522 236192 235360 233869 232851 233508 235098 235467 234004
56668 234004 232709 233560 235952 237744 237912 237026 235796 234533 233654 233387 233007 231493 229027 226965 226305 227077
56652 227077 229126 232407 236319 239757 242198 244010 245480 246270 246019 244671 242057 238184 234299 232553 233773
56637 233773 236252 237518 236758 234932 233152 231930 231508 231789 231900 230834 228827 227416 227728 229235 230659
56622B30659J096J841L470M505L996K600J708J938K824L677M118L906K944J699
56608B70981R83R44P47l11j708k104p11J894L977L762R51k620m455l815j990k19
56592B66306J471K942L034J259p44j111l93n56j795k278j119L41P49M70K16m66
56576B68326k084l650l713k376j054n95p37j263k314l431l397j690N33J622J258
56561B45435N84N74Q47L44j144k475k374r44L71M04l72n07M89J425J058o1j80
56544B43474J295K966L335K587J714P71p07k038j750J66J760J530J54q36r88p61
56528B52672m07j41o32k106l447l389k238j312r19o7J785L793M760M298K834J174
56512B56658J43j8J38K05P99K639M901N680M388K691K524L878N139N144M390M293
$$ plain form
56622 230659 231755 233596 237066 241571 245567 248167 249875 251813 254637 258314 262432 266338 269282 270981
56608 270981 271964 272908 273655 273344 271636 269532 268821 270715 274692 278454 279405 276785 272330 268515 266525 266306
56592 266306 267777 270719 273753 275012 274268 273157 272764 272208 270413 268135 267016 267357 268106 268576 268792 268326
56576 268326 266242 262592 258879 256503 255449 254854 254117 252854 250540 247109 243712 242022 242555 244177 245435
56561 245435 246019 246593 247440 247784 246640 244165 241791 240847 241218 241622 241250 240743 241232 242657 243715 243654 243474
56544 243474 244769 247735 251070 253657 255371 256142 255435 253397 251647 251813 253573 255103 255257 254421 253433 252672
56528 252672 252265 252124 251492 249386 245939 242550 240312 239000 238081 238014 239799 243592 248352 252650 255484 256658
56512 256658 256801 256783 256921 257126 257925 260564 265465 271145 275533 278224 280748 284626 289765 294909 299299 303592
56496C03592N475O853O713M797K750K029K116J708R46J053K028K424J673R49J136
56481C46242J310K15j819l409l747k875j167M78O39j186l474m067k643r11m55
56466C23131j184k046k442k595k906l330l343k507j123j65l90j571k757l110k483
56451B91179j373m85j35m5J11P8o45j825k454j931p75R2L47K35k1l74p34r26o90
56432B79629K02J580K603K499J611J060J256J553J569J853K582K689J274p98j786
56417B99376j168J48J243J777J420R3j243j261n0Q30M32m54p18m73m29n52k98
56400B98673K77O55Q35J448K818M494N600N301L202Q0k100j773M08K164K146J142
56384C25370M76K89K1k59r9K15n0p84j030m47J42q8r34j667j954j950j865j697
$$ plain form
56496 303592 309067 315920 322633 327430 330180 332209 334325 336033 336979 338032 340060 342484 344157 345106 346242
56481 346242 347552 347767 345948 342539 338792 335917 334750 335228 335867 334681 331207 327140 324497 323586 323131
56466 323131 321947 319901 317459 314864 311958 308628 305285 302778 301655 301490 301100 299529 296772 293662 291179
56451 291179 289806 289321 289186 289141 289252 289330 288685 286860 284406 282475 281700 281792 282139 282374 282353 281979 281245 280319 279629
56432 279629 279831 281411 284014 286513 288124 289184 290440 291993 293562 295415 297997 300686 301960 301162 299376
56417 299376 298208 298356 299599 301376 302796 302889 301646 300385 300335 301165 301597 301143 300425 299952 299523 298971 298673
56400 298673 298950 299605 300440 301888 304706 309200 314800 320101 323303 323383 321283 319510 319918 322082 324228 325370
56384 325370 325846 326135 326156 325897 325798 326013 325963 325179 324149 323702 323844 323756 322822 321155 319201 317251 315386 313689
56366C13689j129K23K022K928J941Pq51j76L46n86k083k616k159j669j348q10
56350C07729l31m87q95o51J12L72q5k91M55J759K874L408L270K719K529L229M190
56333C29906M245L201J923J011L10k59l57K06J232K443L379L343K317J497J831
56318C56228K491K089R85O57J189J302Q98J414L221M736M826M174L470K208M32
56303C90320k32J237L486M535M036K575L55j928k440m18K050K359P36n19l24M68
56287D06296J079J516J624J168P52J088J559J065M1l9R60J601J233Q67J414K406
56271D24630K953K809K137J209O82J274K820M375N319N700N680N440N384N537
56257D75949N057L441J859J927L449M837N552O402P392P256N733M437M545N097
$$ plain form
56366 313689 312560 312783 314805 317733 319674 319681 318830 318654 319000 318414 316331 313715 311556 309887 308539 307729
56350 307729 307398 306911 306016 305365 305477 305849 305764 305473 305928 307687 310561 313969 317239 319958 322487 325716 329906
56333 329906 334151 337352 339275 340286 340596 340337 339980 340186 341418 343861 347240 350583 352900 354397 356228
56318 356228 358719 360808 361793 362450 363639 364941 365839 367253 370474 375210 380036 384210 387680 389888 390320
56303 390320 390088 391325 394811 399346 403382 405957 406312 404384 401944 401526 403576 405935 406671 406152 405828 406296
56287 406296 407375 408891 410515 411683 412435 413523 415082 416147 416188 416149 417109 418710 419943 420810 422224 424630
56271 424630 427583 430392 432529 433738 434420 435694 438514 442889 448208 453908 459588 465028 470412 475949
56257 475949 481006 484447 486306 488233 491682 496519 502071 508473 515865 523121 528854 533291 537836 542933
56243E42933M752M020M473O346Q177Q549P435O013N544O195O884O705O404P522
56229F31952J0064J2211J2807J2798J3517J4602J4758J3892J3382J4282J6147
56218G80412J7605J7694J6699J5924J6489J8368K0759K3184K5549K7332K7837
56207A007852K7456K7720K9631L2735L6198L9836M3575M6797M9137N1401N4933
56196A447271O0349O7113P3968P9640Q3918Q8294R4547J02261J08734J11991J12820
56185B430906J13126J13340J12489J09865J05260R8213Q8376P6337O2945M8076
56175C358933L1242J3298l648j8114l0280m1222n1882o2631p2906q1365q7089
56164B954336r0578r2880r4162r4102r3222r2540r2002r0663q8391q5925q3051
$$ plain form
56243 542933 547685 551705 556178 562524 570701 579250 586685 592698 598242 604437 611321 618026 624430 631952
56229 631952 642016 654227 667034 679832 693349 707951 722709 736601 749983 764265 780412
56218 780412 798017 815711 832410 848334 864823 883191 903950 927134 952683 980015 1007852
56207 1007852 1035308 1063028 1092659 1125394 1161592 1201428 1245003 1291800 1340937 1392338 1447271
56196 1447271 1507620 1574733 1648701 1728341 1812259 1900553 1995100 2097361 2206095 2318086 2430906
56185 2430906 2544032 2657372 2769861 2879726 2984986 3083199 3171575 3247912 3310857 3358933
56175 3358933 3390175 3403473 3399825 3381711 3351431 3310209 3258327 3195696 3122790 3041425 2954336
56164 2954336 2863758 2770878 2676716 2582614 2489392 2396852 2304850 2214187 2125796 2039871 1956820
56153A956820p8545p2593o7542o4940o3187n9686n4405m9534m6047m2609l8098
56142A319634l3455l0194k8202k6068k3009j9589j6700j4543j2630j0493q243
56131A096508o496n536m804l543j948r54q16o42K95J542K380K935L551L857L612
56116A089941L846N614P860Q338O941O291Q209J1238J2886J2965J3116J4055J5164
56103A216464J6342J8306K0974K3237K4763K6682K9896L3883L7724M1261M4650
56092A534182M7660N0353N3727N8860O5712P3494Q1931R1467J02237J13252J22654
56081B395529J28632J30240J27601J21339J11954J00078Q7229P5705O7248O1902
56071C407457N8169N4027M7932L9461K9292J8543Q062j566r901j7254k5199l5545
$$ plain form
56153 1956820 1878275 1805682 1738140 1673200 1610013 1550327 1495922 1446388 1400341 1357732 1319634
56142 1319634 1286179 1255985 1227783 1201715 1178706 1159117 1142417 1127874 1115244 1104751 1096508
56131 1096508 1090012 1084476 1079672 1076129 1074181 1073227 1072411 1071769 1072064 1073606 1075986 1078921 1082472 1086329 1089941
56116 1089941 1093787 1099401 1107261 1115599 1122540 1128831 1137040 1148278 1161164 1174129 1187245 1201300 1216464
56103 1216464 1232806 1251112 1272086 1295323 1320086 1346768 1376664 1410547 1448271 1489532 1534182
56092 1534182 1581842 1632195 1685922 1744782 1810494 1883988 1965919 2057386 2159623 2272875 2395529
56081 2395529 2524161 2654401 2782002 2903341 3015295 3115373 3202602 3278307 3345555 3407457
56071 3407457 3465626 3519653 3567585 3607046 3636338 3654881 3662943 3661377 3651476 3634222 3609023 3573478
56059C573478m8592o3071p7713r1877j04318j12691j15260j12571j06591r8604
56049B642190q8804p7703o6774n7280m9082m1188l3344k6556k1840j8769j5799
56038B145051j1939p600l639l28K354M167N187O285Q098J0045J1480J3255J6618
56025B199034K0757K3165K2828K1626K1967K4294K7380K9916L1153L1085L0791
56014B483996L1586L3405L5048L6342L8471M1538M3652M3643M3054M3838M5511
56003B920084M6559M7429M9795N3416N6084N6682N6346N6314N6530N6738N7363
55992C513340N8661O0272O2139O4730O7881P0502P1974P2918P4176P5962P8493
55981D271048Q2365Q7529R2640R6319R8650J00951J04349J09009J14354J19657
$$ plain form
56059 3573478 3524886 3461815 3384102 3292225 3187907 3075216 2959956 2847385 2740794 2642190
56049 2642190 2553386 2475683 2408909 2351629 2302547 2261359 2228015 2201459 2179619 2160850 2145051
56038 2145051 2133112 2125512 2121873 2121545 2123899 2128066 2133253 2139538 2147636 2157681 2169161 2182416 2199034
56025 2199034 2219791 2242956 2265784 2287410 2309377 2333671 2361051 2390967 2422120 2453205 2483996
56014 2483996 2515582 2548987 2584035 2620377 2658848 2700386 2744038 2787681 2830735 2874573 2920084
56003 2920084 2966643 3014072 3063867 3117283 3173367 3230049 3286395 3342709 3399239 3455977 3513340
55992 3513340 3572001 3632273 3694412 3759142 3827023 3897525 3969499 4042417 4116593 4192555 4271048
55981 4271048 4353413 4440942 4533582 4629901 4728551 4829502 4933851 5042860 5157214 5276871
55971E276871J24678J29996J36438J44088J52138J59894J67476J75449J84116
55962F651144J93384K02864K12154K21404K31503K43135K55612K67427K78133
55953H756760K88970L01310L15103L29304L43286L57332L72133L88327M06375
55944A1858900M26380M48077M71091M95176N20171N46072N73289O02577O34405
55935A6576138O68537P04301P41259P79555Q19774Q62475R07935R56484J009234
55926B4025692J067921J133606J205690J282748J364271J451111J544407J644732
55918C4720178J752584J869160J996327K135979K289608K458533K644692K851411
55910E2718472L083296L345052L640637L973771M349151M772848N251514N791116
$$ plain form
55971 5276871 5401549 5531545 5667983 5812071 5964209 6124103 6291579 6467028 6651144
55962 6651144 6844528 7047392 7259546 7480950 7712453 7955588 8211200 8478627 8756760
55953 8756760 9045730 9347040 9662143 9991447 10334733 10692065 11064198 11452525 11858900
55944 11858900 12285280 12733357 13204448 13699624 14219795 14765867 15339156 15941733 16576138
55935 16576138 17244675 17948976 18690235 19469790 20289564 21152039 22059974 23016458 24025692
55926 24025692 25093613 26227219 27432909 28715657 30079928 31531039 33075446 34720178
55918 34720178 36472762 38341922 40338249 42474228 44763836 47222369 49867061 52718472
55910 52718472 55801768 59146820 62787457 66761228 71110379 75883227 81134741 86925857
55902H6925857O395719P066754P803769Q606624R477045J0417844J1430751J2514819
55894A60639182J3665162J4869649J6102455J7315290J8427065J9311439J9783431
55887B80113673J9594275J8455282J6111625J2458932P648111K102511l585582
55880C52898827q829718j3199338j6479963j8648759j9812189k0144639j9841533
55873B35942688j9087838j8040856j6824759j5532261j4229879j2964014j1765325
55866A27497756j0651046r627828q696030p852825p092416o406525n787538n231033
55858F6152515m734013m291391l896053l542163l226593k946809k698641k476740
55850C8340112k276487k095195j931817j785445j653693j532990j421105j318710
$$ plain form
55902 86925857 93321576 100388330 108192099 116798723 126275768 136693612 148124363 160639182
55894 160639182 174304344 189173993 205276448 222591738 241018803 260330242 280113673
55887 280113673 299707948 318163230 334274855 346733787 354381898 356484409 352898827
55880 352898827 344069109 330869771 314389808 295741049 275928860 255784221 235942688
55873 235942688 216854850 198813994 181989235 166456974 152227095 139263081 127497756
55866 127497756 116846710 107218882 98522852 90670027 83577611 77171086 71383548 66152515
55858 66152515 61418502 57127111 53231058 49688895 46462302 43515493 40816852 38340112
55850 38340112 36063625 33968430 32036613 30251168 28597475 27064485 25643380 24324670
55842B4324670j227431j146840j074493j008506r48546q94303q44520p97989p54316
55833A5627726p13213o73954o36109o00028n66175n34629n05486m78960m54692
55824A0464480m31706m09429l88101l67875l48467l30029l13377k98584k84306
55815G292606k69567k55507k44056k35200k26831k17371k07331j97911j89290
55806E249542j81075j73667j67898j63359j58246j51370j43760j37415j32773
55797C839979j28178j22024j14608j07453j01525r6809r3109r0114q6880q2458
55787B816821p7510p4191p3663p4301p3171o8985o2988n7310n3242n0894m9650
55776B100916m8639m7255m5351m2902l9815l6477l3975l2970l2625l1676l0396
$$ plain form
55842 24324670 23097239 21950399 20875906 19867400 18918854 18024551 17180031 16382042 15627726
55833 15627726 14914513 14240559 13604450 13004422 12438247 11903618 11398132 10919172 10464480
55824 10464480 10032774 9623345 9235244 8867369 8518902 8188873 7875496 7576912 7292606
55815 7292606 7023039 6767532 6523476 6288276 6061445 5844074 5636743 5438832 5249542
55806 5249542 5068467 4894800 4726902 4563543 4405297 4253927 4110167 3972752 3839979
55797 3839979 3711801 3589777 3475169 3367716 3266191 3169382 3076273 2986159 2899279 2816821
55787 2816821 2739311 2665120 2591457 2517156 2443985 2375000 2312012 2254702 2201460 2150566 2100916
55776 2100916 2052277 2005022 1959671 1916769 1876954 1840477 1806502 1773532 1740907 1709231 1678835
55765A678835l0232l1349l1973l0831k8945k7885k7351k5946k3673k2001k1594
55754A377055k1534k0994k0306j9943j9606j8864j7730j6154j3969j1758j0697
55743A185500j0836j0570q728o189m540l957l653l589m392n912p260q128q890
55730A098856r580r945j0368j1448j2768j3407j3747j5192j7772j9616j9505j8531
55718I26977j8109j7660j5660j2309r426p905o671m608k464k137m379p867j0538
55705H07244j1471j1155j0264q924p435o967q448j0957j2215j0884p800m848l360
55692F92516l723n581p925r511r755r035q089p526p772q739r489r154q231q039
55678E79947q737r088q471p861q146q734q696q227p938p638p008o720p637r306
$$ plain form
55765 1678835 1648603 1617254 1585281 1554450 1525505 1497620 1470269 1444323 1420650 1398649 1377055
55754 1377055 1355521 1334527 1314221 1294278 1274672 1255808 1238078 1221924 1207955 1196197 1185500
55743 1185500 1174664 1164094 1155366 1149177 1144637 1140680 1137027 1133438 1129046 1123134 1115874 1107746 1098856
55730 1098856 1089276 1079331 1068963 1057515 1044747 1031340 1017593 1002401 984629 965013 945508 926977
55718 926977 908868 891208 875548 863239 853813 845908 839237 834629 832165 830028 825649 817782 807244
55705 807244 795773 784618 774354 765430 757995 751028 742580 731623 719408 708524 700724 695876 692516
55692 692516 688793 683212 675287 665776 656021 646986 638897 631371 623599 614860 605371 596217 587986 579947
55678 579947 571210 562122 553651 545790 537644 528910 520214 511987 504049 496411 489403 482683 475046 465740
55664D65740j0369j0190r204q104p400p338p421o613m813l494l846m972n085l849
55650C73042k336j240n66o12j652k952l598m118n637p596q122o852n592n649o251
55635C10269o225n707n222m507l330k358k199k358k127j781j858j913r41J263
55621B71006L872N829O372N293L276J542P57O75J077K131L382L394J426j207k449
55606C06376j807m40N87J145J375J207P18K42n6j95m2O15J611K377K354J330m30
55589C16967k144k901k493j605r57o24m13m11p37j237j903l096m823o265o680
55574B80678o289n644m613k908j132k78l31m57l91n83q83l50J166K343K012P75
55558B63115J69O14R42j14k531n019o134n382l553k054j712k153k309j504k6J234
$$ plain form
55664 465740 455371 445181 435977 427873 420473 413135 405714 399101 394288 390794 386948 381976 376891 373042
55650 373042 370706 369466 368900 368288 366636 363684 360086 355968 350331 342735 334613 327761 322169 316520 310269
55635 310269 304044 298337 293115 288608 285278 282920 280721 278363 276236 274455 272597 270684 269743 271006
55621 271006 274878 280707 287079 292372 295648 297190 297947 298622 299699 301830 305212 308606 310032 308825 306376
55606 306376 304569 304129 304716 305861 307236 308443 309161 309403 309347 309152 309110 309725 311336 313713 316067 317397 316967
55589 316967 314823 311922 309429 307824 306867 306243 305830 305419 304682 303445 301542 298446 293623 287358 280678
55574 280678 274389 268745 264132 261224 260092 259814 259483 259026 258635 258052 257169 256819 257985 260328 262340 263115
55558 263115 263284 263898 264840 264726 262195 257176 251042 245660 242107 240053 238341 236188 233879 232375 232349 233583
55542B33583J585R76k45j815l563n057n731n526n096n063n371n573n344m394k526
55527A80840m18K98j188l294l467j264J193K071J883J997K395K192J596J810L076
55512A89720M130L843K396N40j341l037m213n014o169p765q480p114m547l054
55498A49895l606m904n484n656o541p943q333o818m159j744l02P5n38j766k700
55483H9476k520j396m06m31j203j598q29P25K034K560K563K230J240l34j276l98
55467I0437J738L234L084K056J118J39j228k400k519j743r56n65l97n12j211k384
55451H7891l506m263m615m445l764k983k303j253K71R82l64k604k906m16K286
55436E8008K404M68o63L65K111K746K253J711J501J098L10j43N78K508M886O733
$$ plain form
55542 233583 235168 236144 235899 234084 230521 225464 219733 214207 209111 204048 198677 193104 187760 183366 180840
55527 180840 180422 180720 179532 176238 172771 171507 172700 174771 176654 178651 181046 183238 184834 186644 189720
55512 189720 193850 197693 200089 200629 199288 196251 192038 187024 180855 173090 164610 157496 152949 149895
55498 149895 146289 141385 135901 130245 123704 115761 107428 100610 96451 94707 94405 94480 93942 92176 89476
55483 89476 86956 85560 85154 84723 83520 81922 81093 81818 83852 86412 88975 91205 92445 92111 90835 90437
55467 90437 92175 95409 98493 100549 101667 101806 100578 98178 95659 93916 92960 92395 91998 91486 90275 87891
55451 87891 84385 80122 75507 71062 67298 64315 62012 60759 61030 62012 61648 59044 56138 55722 58008
55436 58008 60412 60880 60217 60582 62693 65439 67692 69403 70904 72002 72312 72169 72747 75255 80141 86874
55420H6874P194N727K614o61k341k182j708k180k880k344q46l04j672l738m997
55405G6556n433n658n498m621l802m084m974m832l155j333p67j288j827j929j958
55390B5397k363l196m063m211l020p93J149J586M82j163k257k265j263J46J140
55375E306J218O13kj80JK32L19K80K05J00j73p29j429j862j658q69p0L2F15i57
55354b445l17Q68R37n0j055j320q56Q1J287f28A611J242O8p21G46a595k592j414
55336e601M72J480J283J067A54J335l54a572l843l333k351j524l0K488M433a840
55319e65q96q68P08E21K671K490J713K05j737B595i80k326R0i23A621N32C78a694
55300b228N56p7j255j578j518k124k803k106k38R75O79rl6M2o38j619j850j313
$$ plain form
55420 86874 94068 99795 102409 101748 99407 97225 95517 93337 90457 88113 87267 86963 85291 81553 76556
55405 76556 71123 65465 59967 55346 51544 47460 42486 37654 34499 33166 32399 31111 29284 27355 25397
55390 25397 23034 19838 15775 11564 8544 7751 8900 10486 10968 9805 7548 5283 4020 4166 5306
55375 5306 6524 7137 7135 6955 6956 7188 7507 7787 7992 8092 7919 7190 5761 3899 2241 1372 1302 1334 615 -957
55354 -2445 -2762 -1894 -957 -1007 -2062 -3382 -4238 -4157 -2870 -628 1611 2853 2921 2200 746 -1595 -4187 -5601
55336 -5601 -5129 -3649 -2366 -1299 154 1489 1135 -1572 -5415 -8748 -11099 -12623 -12653 -10165 -5732 -1840
55319 -565 -1461 -2329 -1621 521 3192 5682 7395 7600 5863 2595 -980 -3306 -3216 -923 1621 2153 378 -1694
55300 -2228 -1672 -1749 -3004 -4582 -6100 -8224 -11027 -13133 -13371 -12396 -11717 -11726 -11762 -11720 -12358 -13977 -15827 -17140
55282a7140p93m58J02O63M68l20l99Q61K323K529J628R08Q50P39K05n6M27R08
55264f555O18J81O72J581J195q18k601k590j618j363j650q05J583L808d130a073
55247D20J58c90j721j732r47K92J493h75A038J226P86N75k90A201b554l640j769
55230g963L84J484J370P07K66M55J129d14A605J970J469J50j662H44a311q97j12
55213b320L27h32A099J465M7o24p6J65q52e03q34c37A183J75A5a476n48L18N26
55194a180L40K33b40A62Ha109j472n71Q29i41h7H1B9h4l36m29j63J62K60K84A8
55172A20b46m66J19H9L73e3r19m73M8j65j071k081k711k722k036q53L67J261J676
55153i732J380J81j383k037j159J37K05q11r46Q31K870K849R41m15K49J779K408
$$ plain form
55282 -17140 -17933 -18391 -18289 -17626 -17158 -17478 -17877 -17016 -14693 -12164 -10536 -9628 -8778 -8039 -7834 -7890 -7463 -6555
55264 -6555 -5937 -5756 -5084 -3503 -2308 -3126 -5727 -8317 -9935 -11298 -12948 -13753 -12170 -8362 -4130 -1073
55247 420 578 -390 -2111 -3843 -4790 -4498 -3005 -875 1038 2264 3050 3625 3335 1201 -2554 -6194 -7963
55230 -7963 -7579 -6095 -4725 -4018 -3752 -3297 -2168 -414 1605 3575 5044 5194 3532 844 -1311 -2208 -2320
55213 -2320 -1993 -832 1099 2564 2611 1987 1911 2076 1224 -503 -1337 -337 1183 1358 15 -1476 -2024 -1706 -1180
55194 -1180 -840 -607 -240 162 8 -1109 -2581 -3152 -2323 -941 -87 81 29 -84 -420 -849 -1012 -850 -590 -306 18
55172 120 -246 -712 -593 89 462 -53 -972 -1445 -1397 -1562 -2633 -4714 -7425 -10147 -12183 -13036 -12669 -11408 -9732
55153 -9732 -8352 -8171 -9554 -11591 -12750 -12613 -12408 -13219 -14165 -13334 -10464 -7615 -6674 -7089 -6840 -5061 -2653
55136b653f19I81J251L64j007c93k134j839j350m47P74J599J570J042N42M7o68
55119a257j381j532p83O23J944A8J863Q33l00G14b438l456j856K58P37l06o01
55102g662Q04K077J623N76O77g09K29j868k785j667q1O83J113J774a248C48J133
55085A481J141O65j086g99l128j027J740a34A799G96b681l405j001J399K118J748
55069a822c41H18J78A83e09K40D38N00M81P33K76j146i96j968n79O82J137g21
55050A61J174J559J216Pq60k92Q91Q53m86j009P45L497M810L840J781J95k18L64
55032A8228J271J887K169K474K728K403J596J302J966K463J481n13j723j384o88
55017C5660j036k125k345r35R72J651P85l41o27l78l49m09p7J56o27j967k216
$$ plain form
55136 -2653 -619 981 2232 2596 1589 -393 -2527 -4366 -5716 -6163 -5389 -3790 -2220 -1178 -636 -589 -1257
55119 -1257 -2638 -4170 -4953 -4330 -2386 18 1881 2714 2414 714 -2438 -5894 -7750 -7492 -6755 -7061 -7662
55102 -7662 -6858 -4781 -3158 -2582 -1905 -709 -480 -2348 -5133 -6800 -6881 -6198 -5085 -3311 -1248 348 1481
55085 1481 2622 3287 2201 -799 -3927 -4954 -3214 -134 1799 796 -2681 -6086 -7087 -5688 -3570 -1822
55069 -1822 -341 818 996 183 -509 -269 438 938 1419 2152 2428 1282 -996 -2964 -3543 -2861 -1724 -721
55050 161 1335 2894 4110 4117 3257 2965 3856 4709 4223 3214 3959 7456 12266 16106 17887 18082 17864 18228
55032 18228 19499 21386 23555 26029 28757 31160 32756 34058 36024 38487 39968 39455 37732 36348 35660
55017 35660 34624 32499 30154 29219 30191 31842 32627 32286 31659 31281 30932 30523 30446 30602 29975 28008 25792
55000B5792q95M37K83r46k028k726l370l510k422n65O99Q16N07M72N57L85J14
54983A3600J86P38J400J592J096L95R3Ko26j742k219j422l08j19p19j106j044
54966I797j081j255r02K22J531K341K462K075J584J445J663J733J375Q25L4j377
54950B2472k744k254M31K734K137k03j003M93J878J547O93P04J057R28Q49J326
54934C1045J498P44J76R11K026J944R99Q61J959L028L033K255J545J527K288L079
54918E8918K708J109n6N33J878J996P56k12j48Ol67m09N73J605J218n30k159k624
54900F4795k292k109k316k218j208K60R24N5j745l224l694l386k917k598k075
54885C6252o75J470K810J966q6p03Q94K352J594j8J55J858K424J072J6Q45K338
$$ plain form
55000 25792 24897 25334 25617 24671 22643 19917 16547 13037 10615 10050 10749 11565 12072 12544 13101 13486 13600
54983 13600 13786 14524 15924 17516 18612 19007 19100 19102 18476 16734 14515 13093 12785 12666 11947 10841 9797
54966 9797 8716 7461 6559 6781 8312 10653 13115 15190 16774 18219 19882 21615 22990 23815 23849 22472
54950 22472 19728 17474 17905 20639 22776 22573 21570 22063 23941 25488 26181 26885 27942 28870 29719 31045
54934 31045 32543 33287 33463 34374 36400 38344 39343 40204 42163 45191 48224 50479 52024 53551 55839 58918
54918 58918 61626 62735 62679 63212 65090 67086 67842 67630 67482 67488 67121 66712 67285 68890 70108 69578 67419 64795
54900 64795 62503 60394 58078 55860 54652 54912 55836 55891 54146 50922 47228 43842 40925 38327 36252
54885 36252 35577 37047 39857 41823 41737 41034 41928 44280 45874 45856 46011 47869 50293 51365 51381 52226 54564
54868E4564L027L700N639P988Q863Q235P737Q045Q381Q473R142J0496J1075R672
54854A65037O922M301K272L43j631l263m459n471o156o129n800o248p576q348
54840A23794p516o100n793o291n713l674k254l005m540m491k904j930k416k628
54826F4539p47K743N842P260P116O099M720L282K090J680K749N358Q213R482Q709
54811A39135P228O253N195K678j244m823o550o561n952n403m929m565m652n405
54797A10405o536p479p755p160n780m095k825k390k528k647k491k178j750j204
54783E3587r07j329k135k217j039N12J188Q27K85K97R25J807K321J859M51j060
54767E5372j875j890j169L81K125K465P69j236j511o90j189l494n317m748k473
$$ plain form
54868 54564 57591 61291 66930 74918 83781 92016 99753 107798 116179 124652 133794 144290 155365 165037
54854 165037 171959 176260 178532 178875 177244 173981 169522 164051 157895 151766 145966 139718 132142 123794
54840 123794 116278 110178 104385 98094 92381 88707 86453 83448 78908 74417 71513 69583 67167 64539
54826 64539 63792 66535 72377 79637 86753 92852 97572 100854 102944 104624 107373 112731 120944 130426 139135
54811 139135 146363 152616 157811 160489 159245 154422 147872 141311 135359 129956 125027 120462 115810 110405
54797 110405 103869 96390 88635 81475 75695 71600 68775 66385 63857 61210 58719 56541 54791 53587
54783 53587 52680 51351 49216 46999 45960 46472 47660 48487 48772 49069 49994 51801 54122 55981 56432 55372
54767 55372 53497 51607 50438 50819 52944 55409 56178 54942 53431 52741 51552 48058 42741 37993 35520
54752C5520k70Q99O25j133k927k406M34K338R29j709j904L69J843R41n21q75q65
54735C1288j331j138P01K643K432M50p58l5J026N50j029j516M94M039O657O740
54719E1213N001L479L212L407L031K393K489L438M395M800M948N365O305P736
54705A11212R226J0052J0016R977J0690J1335J0322P580M850L244J875l16k577
54692A97486l495l345l711n024n948n375l738j938k33J252J985J813J600K104
54678A73433K869L063K990L718N429P090P849P821P355O367M834L226J896N14
54664B38454j228k669k636r39J140K056J394j65j792l060l760l921m124n174p070
54649B06506q740r356r514j0357j1805j2536j1727r871p735n526l556k695l218
$$ plain form
54752 35520 35250 36149 36774 35641 32714 30308 30742 33080 34009 32300 30396 30765 32608 33549 33028 32153 31288
54735 31288 29957 28819 29520 32163 34595 35045 34287 34252 35278 35828 34799 33283 33777 37816 44473 51213
54719 51213 56214 59693 62905 66312 69343 71736 74225 77663 82058 86858 91806 97171 103476 111212
54705 111212 120438 130490 140506 150483 161173 172508 182830 190410 195260 198504 200379 200063 197486
54692 197486 193991 190646 186935 181911 175963 170588 166850 164912 164679 165931 167916 169729 171329 173433
54678 173433 176302 179365 182355 186073 191502 198592 206441 214262 221617 227984 232818 236044 237940 238454
54664 238454 237226 234557 231921 230982 232122 234178 235572 235407 233615 230555 226795 222874 218750 213576 206506
54649 206506 197766 188410 178896 168539 156734 144198 132471 122600 114865 109339 105783 103088 99870
54636I9870l960l579k354j784k521l559l559k336q62l8K88J098K630L410J730
54621H4474j647l572k201N62J645Q20L96J444K487K136J064N73P47R46J036J190
54605I2100J206Q81L78l00j523l059l699k582l81J485K259J964Q28n97j345q77
54589H6738K33J119J756K659L794M573M744M702M872N208N327M991M466M379M942
54574A44503N525N576N708O996R277J1254J2507J4007J6253J8176J8838J8941
54562B87561J9511K0073J9316J6758J2588O706o30p786j2873j5621j6963j7318
54550C11322j6596j5433j4743j4218j2833j0828r615r656r997j0078j0293j0348
54538A66684q904n822l188k904m279n245n086m639m411l840k509j032m50j128
$$ plain form
54636 99870 95910 92331 89977 88193 85672 82113 78554 76218 75356 75318 75606 76704 79334 82744 84474
54621 84474 82827 79255 77054 77616 79261 80081 80477 81921 84408 86544 87608 88181 88928 89874 90910 92100
54605 92100 93306 94187 94565 94265 92742 89683 85984 83402 83021 84506 86765 88729 89557 88960 87615 86738
54589 86738 86971 88090 89846 92505 96299 100872 105616 110318 115190 120398 125725 130716 135182 139561 144503
54574 144503 150028 155604 161312 168308 177585 188839 201346 215353 231606 249782 268620 287561
54562 287561 307072 327145 346461 363219 375807 382513 381883 374097 361224 345603 328640 311322
54550 311322 294726 279293 264550 250332 237499 226671 217056 207400 197403 187325 177032 166684
54538 166684 157780 151958 148770 145866 141587 136342 131256 126617 122206 118366 115857 114825 114375 113247
54524A13247k375l023k507j421p20m90o5N94O28k66j074q17j2J72l69p53o86q51
54506I9212j617k200j589L9J321J093l12j355j008pN4j168k259j956q51m71j090
54489H5836j459o81M90O23n95k010k294j155O49K280L482M338M660L975K180P
54473A00326j378j275K1J467K160K128K209L050M344N280N564N608N823O226O704
54458A48257P181P444P321P178P633Q554Q944Q215O975N975M869K771j81k765
54444B28371m249n284o916r183j1016j1378j0232q570p527p426p644p572p295
54431A24079o994n963l189P71L531L340J328J95Q13J260l50l173m655l651j496
54416A05846r7J03M8O17J640K050J103m32o63J142L108K695N0j882j022J383K654
$$ plain form
54524 113247 110872 107849 105342 103921 103201 102711 102646 103240 103868 103602 102528 101711 101699 101871 101502 100749 100063 99212
54506 99212 97595 95395 93806 93845 95166 96259 95947 94592 93584 93577 93631 92463 90204 88248 87397 86926 85836
54489 85836 84377 83696 84186 84809 84214 82204 79910 78755 79404 81684 85166 89504 94164 98139 100319 100326
54473 100326 98948 97673 97694 99161 101321 103449 105658 108708 113052 118332 123896 129504 135327 141553 148257
54458 148257 155438 162882 170203 177381 185014 193568 202512 210727 217702 223677 228546 231317 231136 228371
54444 228371 224122 218838 211922 202739 191723 180345 170113 161543 154016 146590 138946 131374 124079
54431 124079 117085 111122 107933 108704 112235 115575 116903 117098 117911 119171 118821 115648 110993 107342 105846
54416 105846 105749 105852 105900 106517 108157 110207 111310 110878 110215 111357 114465 117160 117210 115328 114306 115689 118343
54399A18343J892K51r54j107n8J518J987M79j544j848m45N53J32l98J65J060J133
54382A21159P92J034J481R08o71j827j557l33P06Q88K61o85j334j328o74N07J952
54365A21279K881K307J85k177l387l221k141l17J931L314K491l4k019j846o8J667
54349A20845K473K634K793L309M004M134K867L87j773j981j42K259L670L676K837
54334A51992J898J312J102Q41J1j251k036j673p02k98q21j480j517j065n78j26
54318A45609K88K73m22j304j735j858k312l183l819l591k336l88J303J513Q0j460
54302A26658j568p24o18j544k052j286q1P37J492K328K311J040j31Q5Q16M14q50
54285A27027j151M3J270J287N70J79L53P43J087J130N28p25k192l542m713n443
$$ plain form
54399 118343 120235 120486 119532 118425 118367 119885 121872 122351 120807 118959 118514 119067 119199 118801 118966 120026 121159
54382 121159 121951 122985 124466 125374 124703 122876 121319 120986 121692 122580 122841 122156 120822 119494 118820 119327 121279
54365 121279 124160 126467 126652 124475 121088 117867 115726 115409 117340 120654 123145 123111 121092 119246 119178 120845
54349 120845 123318 125952 128745 132054 136058 140192 143059 143446 141673 139692 139550 141809 145479 149155 151992
54334 151992 153890 155202 156304 157145 157156 155905 153869 152196 151494 151196 150375 148895 147378 146313 145735 145609
54318 145609 145897 146170 145748 144444 142709 140851 138539 135356 131537 127946 125610 125222 126525 128038 128118 126658
54302 126658 125090 124366 123748 122204 120152 118866 118785 119522 121014 123342 125653 126693 126562 126647 127463 127877 127027
54285 127027 125876 125919 127189 128476 129046 129225 129578 130321 131408 132538 133066 132341 130149 126607 121894 116451
54269A16451n310m412l425k808k467k338k608l049k883j742k90O17R62J328J940
54254H9966K441K426J745M19j269k593k745j591R1J226J256L79p82j534j358k84
54238H7793Q45R79J08m97J44J226J124l47j650j640p63J93J202K121K021O62m87
54221I3034j61O68L18p18n98N65N76j301l031k946k062j890j794m59J378J739
54205H3318L74j038j416j264j137p87j56J01l50j016j439j726j878j513o63K1
54189F9431K85O75J454J980J812J583J944K301J651K84m92k37J14l22j346k382
54173G8735l218l523k518o0K336K651O24j799k519j317L33R44J69j307k503k847
54157F4181k596k548l072l488k688m25K340M372N081M399K363n88l064l279p58
$$ plain form
54269 116451 111141 106729 103304 100496 98029 95691 93083 90034 87151 85409 85119 85736 86698 88026 89966
54254 89966 92407 94833 96578 96997 95728 93135 90390 88799 88890 90116 91372 91751 90969 89435 88077 87793
54238 87793 88638 89617 89725 89228 89372 90598 91722 91375 89725 88085 87322 87515 88717 90838 92859 93521 93034
54221 93034 92873 93541 93859 93141 92543 93108 93684 92383 89352 86406 84344 82454 80660 80201 81579 83318
54205 83318 83692 82654 81238 79974 78837 78050 77894 77995 77645 76629 75190 73464 71586 70073 69410 69431
54189 69431 69716 70391 71845 73825 75637 77220 79164 81465 83116 83400 82908 82671 82785 82463 81117 78735
54173 78735 75517 71994 69476 69416 71752 74403 75027 73228 70709 69392 69725 70669 70838 69531 67028 64181
54157 64181 61585 59037 55965 52477 49789 49364 51704 56076 61157 65556 67919 67331 64267 60988 60230
54142F0230K780M646L556P09j533j907j152q48j620k621k622j351K69J070O65
54127F0271l43r55n05R60K765L991L958K640P31p71j270j001o87o92o81k66J71
54110F8316k22j555k766k739j611n42l33p30j055j053r44j036j398j693j282R4
54094D9451J722K417J772M55q01j876k668k625j477O8J052J393J680K173K626
54079E5362K801K474J254p93k609l054k167p94P40K447L499K713M88j104q69N0
54063F0438k8j042j651j196j66P71J265J070K98l21j57L62J80r94k168k075m55
54046E4131J717L082L115K481K090J925J309J14r91j539j669j420o84l1m26j564
54030F1640j708k0K039K643J935J250R69N58P6M9K21j03o86o90k64l89j208j780
$$ plain form
54142 60230 63010 67656 71212 71921 70388 68481 67329 66481 64861 62240 59618 58267 58536 59606 60271
54127 60271 59928 58973 58468 59428 62193 66184 70142 72782 73513 72742 71472 70471 69784 69092 68411 68145 68316
54110 68316 68094 66539 63773 61034 59423 58881 58548 57818 56763 55710 54766 53730 52332 50639 49357 49451
54094 49451 51173 53590 55362 55817 55016 53140 50472 47847 46370 46438 47490 48883 50563 52736 55362
54079 55362 58163 60637 61891 61098 58489 55435 53268 52474 53214 55661 59160 61873 62361 61257 60388 60438
54063 60438 60410 59368 57717 56521 56355 57126 58391 59461 59759 59438 59281 59643 59823 58829 56661 54586 54131
54046 54131 55848 58930 62045 64526 66616 68541 69850 69964 68973 67434 65765 64345 63661 63630 63204 61640
54030 61640 59932 59912 61951 64594 66529 67779 68748 69306 69382 69431 69652 69549 68863 68173 67909 67520 66312 64532
54012F4532j509o21O54K071K603J312q52j642m00J114J289O66N79J192J869K481
53996G5338L255L911L870K932J315m05j162j56J800K680J729M55M01J008Q41r6
53980I7716o22l50J06N32J284K093K101J213L36%j65l43m3P49R07m05k275k909
53962I9925j844m83m01j696l179l666k874j396k26q3q27j533j508j155j357k091
53946G5606k250j105O36J656J403K81j072k013j938q51K87N56J43j67l02p29j242
53929F8899j051j08O16N18R4M6L68O70P42N47K42K55O93Q77K70l24K49J424J412
53910G6439L0p08M72K148K372J379P29Q50R82R10J135J661J946J929K075K467
53894I6816K799L012L144K794J700N35J77M48N44N86J541L538N272N560M784M303
$$ plain form
54012 64532 63023 62402 63056 65127 67730 69042 68190 66548 66148 67262 68551 69217 69796 70988 72857 75338
53996 75338 78593 82504 86374 89306 90621 90216 89054 88898 90698 93378 95107 95562 95963 96971 97812 97716
53980 97716 97094 96744 96850 97382 98666 100759 102860 104073 104409 104409 104244 103901 103858 104607 105514 105109 102834 99925
53962 99925 98081 97598 97197 95501 92322 88656 85782 84386 84160 84077 83250 81717 80209 79054 77697 75606
53946 75606 73356 72251 72887 74543 75946 76227 75155 73142 71204 70353 70640 71196 71339 71172 70870 70141 68899
53929 68899 67848 67740 68356 68874 68968 69014 69382 70052 70794 71341 71583 71838 72531 73408 73678 73354 73603 75027 76439
53910 76439 76469 75761 76233 78381 80753 82132 82861 83711 84693 85603 86738 88399 90345 92274 94349 96816
53894 96816 99615 102627 105771 108565 110265 110800 110977 111425 111969 112555 114096 117634 122906 128466 133250 137553
53878A37553M808N613N691N228N735P995J0205R448N354J059n15n6l35k228l983
53863A91572m079l033k187k052k279k351j874q93l1J16m43j508l099m612m419
53848A58828j715J663K849J416l31p14o30j646l624n203n585m873l385j665p37
53833A34648j402l299n017n259l870j926p75o96q60p72j059k148k954k289r73
53818A01349q54j839j830J6J773J464k67j327r04J88R78J014J97j013j649j377
53802I5919j107j722k691k843k105j489j534j562n79J544L794M862M425L536L243
53787A01691K974J378j148k282q17J432J977Q22j88l73q21k103l071k433m41J457
53771I8054K068J264j39j142j402j331j218p81K4M59J9n51k87M09L39n58j093
$$ plain form
53878 137553 142361 147974 153665 158893 164628 172623 182828 192276 197630 198689 198174 198118 197783 195555 191572
53863 191572 187493 184460 182273 180221 177942 175591 173717 172824 172793 172909 172466 170958 167859 163247 158828
53848 158828 157113 158776 161625 163041 162710 161996 161366 159720 156096 150893 145308 140435 137050 135385 134648
53833 134648 133246 129947 124930 119671 115801 113875 113100 112404 111544 110772 109713 107565 104611 102322 101349
53818 101349 100495 98656 96826 96842 98615 100079 99812 98485 97581 97769 98747 99761 99958 98945 97296 95919
53802 95919 94812 93090 90399 87556 85451 83962 82428 80866 80287 81831 85625 90487 94912 98448 101691
53787 101691 104665 106043 104895 102613 101796 103228 105205 106027 105839 105466 104645 102542 99471 97038 96597 98054
53771 98054 100122 101386 101247 100105 98703 97372 96154 95373 95397 95856 95875 95324 95037 95446 95785 95227 94134
53754I4134o35J61O83J206J925K237J648P40N11J120J823J810Q16o38j364m14
53738A05763J699L193K897J605J061J835K828K720J402r1p56m97J6K05J69L62
53722A24411R11J505J777J507N58r17k199k495j848j067p16o34o08q53j407j728
53706A16197j496j314j884k704k523r97P70J541J191N16K26L98O02M04%J67J169
53689A12263J982J406m9m67R10K546K709J758J294J805K489K848L027K744J519
53674A38784J20J72J825L199K882J707J211J567K061K492K874K660J672R66J434
53659A65626K231K179J977L182N322O103M629K462J225Q65Q61J319K032K108J510
53644B03631J645L261N079N572N017M583M428M007L461L319L389L136K656K306
$$ plain form
53754 94134 93499 93660 94343 95549 97474 99711 101359 102099 102610 103730 105553 107363 108179 107541 106177 105763
53738 105763 107462 110655 113552 115157 116218 118053 120881 123601 125003 124912 124156 123659 123675 123880 124049 124411
53722 124411 125322 126827 128604 130111 130669 129752 127553 125058 123210 122143 121427 120793 120185 119332 117925 116197
53706 116197 114701 113387 111503 108799 106276 105279 106049 107590 108781 109297 109523 109921 110523 110927 110927 111094 112263
53689 112263 114245 115651 115602 115135 116045 118591 121300 123058 124352 126157 128646 131494 134521 137265 138784
53674 138784 138904 139076 140901 144100 146982 148689 149900 151467 153528 156020 158894 161554 163226 164192 165626
53659 165626 167857 170036 172013 175195 180517 186620 191249 193711 194936 195801 196662 197981 200013 202121 203631
53644 203631 205276 208537 213616 219188 224205 228788 233216 237223 240684 244003 247392 250528 253184 255490
53630B55490J845J064O24J110J820J738J161J086J391J104K37j69J60K88l46j108
53614B67495j243q38m45n02j180k027j991o80O71N86n22r97n08l59j060j425n96
53597B54379N86J107J237J445J262L83j79N01J473J071o19j777j218M62K014K772
53581B64899K688K101J662J748J809J041j93m38R94K986L959L824L835M666N432
53566C01013M983L641K888L375M106M050L854M954P229Q714P976N907M568M811
53552C72069N752O140N598M648M055M131M393L987K718J452J175J908K749K880
53538D23655K203J226O65R22J696K138J662M71q64k054l008l492l302k716k293
53523D16909k145j797r36r0k38j556k853k584o16J403J773M95j110k032k051j091
$$ plain form
53630 255490 257335 258399 259023 260133 261953 263691 264852 265938 267329 268433 268670 268501 268661 268949 268603 267495
53614 267495 266252 265414 264969 264467 263287 261260 259269 258589 259260 259846 259324 258327 257819 257460 256400 254975 254379
53597 254379 254965 256072 257309 258754 260016 260399 260220 260721 262194 263265 262646 260869 259651 260113 262127 264899
53581 264899 267587 269688 271350 273098 274907 275948 275755 275317 276311 279297 283256 287080 290915 295581 301013
53566 301013 305996 309637 312525 315900 320006 324056 327910 332864 340093 348807 356783 362690 367258 372069
53552 372069 377821 383961 389559 394207 398262 402393 406786 410773 413491 414943 416118 418026 420775 423655
53538 423655 425858 427084 427749 428671 430367 432505 434167 434638 433774 431720 428712 425220 421918 419202 416909
53523 416909 414764 412967 412031 411941 411703 410147 407294 404710 404094 405497 407270 407765 406655 404623 402572 401481
53507D01481P54K488K794J751Q62R66J274J182J581L183M582L806J309l33L26
53492D28006K245L969N427O931P792P180N672M774N093N909O537P294Q772J0761
53478E16362J2386J3217J3709J4409J5158J5472J5464J5715J6295J6640J6695
53467F81522J7440J9658K2702K5114K6190K6415K6599K7169K8059K8917K9631
53456I59416L0919L3709L7474M0093M0336L9634M0048M1166M0814L8478L6097
53445A378184L5171L5163L5354L6296L8153L9321L8463L6858L6851L8462L9370
53434A787646L8101L5657L3833L3276L3655L4472L5092L4698L2943L0294K7424
53423B157091K4773K2895K2505K3527K4537K3908K1487J8468J5610J2232P480
$$ plain form
53507 401481 402235 404723 407517 409268 410130 411096 412370 413552 415133 418316 422898 426704 428013 427680 428006
53492 428006 430251 434220 439647 446578 454370 461550 467222 471996 477089 482998 489535 496829 505601 516362
53478 516362 528748 541965 555674 570083 585241 600713 616177 631892 648187 664827 681522
53467 681522 698962 718620 741322 766436 792626 819041 845640 872809 900868 929785 959416
53456 959416 990335 1024044 1061518 1101611 1141947 1181581 1221629 1262795 1303609 1342087 1378184
53445 1378184 1413355 1448518 1483872 1520168 1558321 1597642 1636105 1672963 1709814 1748276 1787646
53434 1787646 1825747 1861404 1895237 1928513 1962168 1996640 2031732 2066430 2099373 2129667 2157091
53423 2157091 2181864 2204759 2227264 2250791 2275328 2299236 2320723 2339191 2354801 2367033 2374513
53412B374513K012k343m694o070p997j0759j3580j5963j7919j9349k0284k1601
53400B235966k4200k7319k8916k8246k6885k6526k7059k7738k8918l0984l2493
53389A926682l1330k7659k4060k2455k2248k1765k0247j7911j5142j2318r785
53378A701762p527n336l442k168r54J310M537P200Q353Q980J0532J2996J5344
53365A751587J7194J9067K1314K3823K6557K9535L2409L4766L6784L8916M1058
53354B073010M2782M4351M6655M9904N3066N5029N6006N7331O0004O3718O7433
53343B669289P0680P3921P7452Q0461Q1893Q2125Q2867Q4979Q7263Q8048Q7303
53332C566281Q6330Q5846Q5266Q3748Q1110P7735P4295P1410O8897O5433N9881
$$ plain form
53412 2374513 2376525 2374182 2369488 2363418 2355421 2344662 2331082 2315119 2297200 2277851 2257567 2235966
53400 2235966 2211766 2184447 2155531 2127285 2100400 2073874 2046815 2019077 1990159 1959175 1926682
53389 1926682 1895352 1867693 1843633 1821178 1798930 1777165 1756918 1739007 1723865 1711547 1701762
53378 1701762 1694235 1688899 1685457 1683289 1682335 1683645 1688182 1695382 1703735 1712715 1723247 1736243 1751587
53365 1751587 1768781 1787848 1809162 1832985 1859542 1889077 1921486 1956252 1993036 2031952 2073010
53354 2073010 2115792 2160143 2206798 2256702 2309768 2364797 2420803 2478134 2538138 2601856 2669289
53343 2669289 2739969 2813890 2891342 2971803 3053696 3135821 3218688 3303667 3390930 3478978 3566281
53332 3566281 3652611 3738457 3823723 3907471 3988581 4066316 4140611 4212021 4280918 4346351 4406232
53321D406232N2972M6735M2036L7558L1697K4587J7617J1501N644q15q085j5899
53309D651780k4078l2626m1439n0054n7783o4192o9415p3892p7819q1031q3331
53298C996120q4651q4916q4169q2788q1277p9709p7805p5640p3885p3111p3161
53287C125008p3453p3491p2913p1333o8688o5554o2677o0171n7517n4387n1130
53276B413694m8192m5362m1995l7996l4158l1284k9316k7691k6288k5434k5110
53265B040868k4869k4626k4739k5058k4640k2942k0522j8036j5282j1980q773
53254A819401o480m887l177j103J200L891O764Q682R214J0245J3927J9343K3316
53241A900336K4628K5230K6862K8967L0805L3072L5816L7141L6078L4908L6202
$$ plain form
53321 4406232 4459204 4505939 4547975 4585533 4617230 4641817 4659434 4670935 4676579 4675764 4667679 4651780
53309 4651780 4627702 4595076 4553637 4503583 4445800 4381608 4312193 4238301 4160482 4079451 3996120
53298 3996120 3911469 3826553 3742384 3659596 3578319 3498610 3420805 3345165 3271280 3198169 3125008
53287 3125008 3051555 2978064 2905151 2833818 2765130 2699576 2636899 2576728 2519211 2464824 2413694
53276 2413694 2365502 2320140 2278145 2240149 2205991 2174707 2145391 2117700 2091412 2065978 2040868
53265 2040868 2015999 1991373 1966634 1941576 1916936 1893994 1873472 1855436 1840154 1828174 1819401
53254 1819401 1812921 1808034 1804857 1803754 1804954 1808845 1815609 1824291 1833505 1843750 1857677 1877020 1900336
53241 1900336 1924964 1950194 1977056 2006023 2036828 2069900 2105716 2142857 2178935 2213843 2250045
53230B250045L8934M0030L8713L6613L4298L0750K6188K2440J9871J6564J1566
53219B566012O653L525J149k466p261j1520j4418j6627j8846k1053k3126k5334
53207B436688k8118l1731l5988m0098m3136m4775m5268m4862m3973m3731m5126
53196A989882m7401m8501m7580m5872m4704m3937m3089m2502m2345m1698m0006
53185A502247l8408l8070l8126l7001l5202l4798l6075l6643l4438l0272k6638
53174A116576k4816k3953k2513k0155j8184j8164j9941k1510k1330k0162j9817
53163H86031k0662k1606k2124k2739k3414k3055k1230j9041j7582j6690j6061
53152F61827j6391j8151j9983j9817j7433j4772j3495j3267j2701j1256r701r042
$$ plain form
53230 2250045 2288979 2329009 2367722 2404335 2438633 2469383 2495571 2518011 2537882 2554446 2566012
53219 2566012 2572665 2576190 2577339 2574873 2567612 2556092 2541674 2525047 2506201 2485148 2462022 2436688
53207 2436688 2408570 2376839 2340851 2300753 2257617 2212842 2167574 2122712 2078739 2035008 1989882
53196 1989882 1942481 1893980 1846400 1800528 1755824 1711887 1668798 1626296 1583951 1542253 1502247
53185 1502247 1463839 1425769 1387643 1350642 1315440 1280642 1244567 1207924 1173486 1143214 1116576
53174 1116576 1091760 1067807 1045294 1025139 1006955 988791 968850 947340 926010 905848 886031
53163 886031 865369 843763 821639 798900 775486 752431 731201 712160 694578 677888 661827
53152 661827 645436 627285 607302 587485 570052 555280 541785 528518 515817 504561 494860 485818
53140D85818r515j0563j1501j2006j2028j1506j0433r048p643o167m513l213l218
53127C74464m679o402p003o297n093l913k525p10J048J876J324k58j997l035k878
53112C33922j543L16J369L49k515n094n278l397j809j871k375j625m7M72p35k381
53096C07758l125k994k699k475k074j353m92J20J43k42l19J59K55r64k688l017
53080B85993j550j45m96k034l018k900k553k751l317l563k879j241L49M17j206
53065B59106k837l017k472k864m146m706l899k757j985r44O79J718J098m74j510
53050B30990j719j852k133j989j204m31m12j271k522l457l595l084k489k037j478
53035B01317q56p80j511k423k766k393j351L21J722J220j418l910l923k038o91
$$ plain form
53140 485818 476303 465740 454239 442233 430205 418699 408266 399218 391575 385408 380895 377682 374464
53127 374464 369785 363383 356380 350083 344990 341077 338552 337842 338890 340766 342090 341832 339835 336800 333922
53112 333922 332379 332695 334064 334413 331898 326804 321526 318129 316320 314449 312074 310449 310402 310874 310139 307758
53096 307758 304633 301639 298940 296465 294391 293038 292546 292666 292809 292567 292248 292407 292662 291698 289010 285993
53080 285993 284443 284298 283802 281768 278750 275850 273297 270546 267229 263666 260787 259546 259895 260312 259106
53065 259106 256269 253252 250780 247916 243770 239064 235165 232408 230423 229479 230158 231876 232974 232500 230990
53050 230990 229271 227419 225286 223297 222093 221662 221250 219979 217457 214000 210405 207321 204832 202795 201317
53035 201317 200461 199681 198170 195747 192981 190588 189237 189558 191280 192500 191082 187172 183249 181211 180520
53020A80520p20q49l74k29p99q48M14J662J207p18k564l443l426k712j657j012
53004A64452r35l96J333L179L474K275J038L80l62j348j649q52J48O17J081K165
52988A74600L222L041J378r85l114m149l277n98K099K580M59k324l542k645p26
52973A66019P56R20j99j624k049j079L18R58P81M92K73l16j119j140m2J023Q71
52956A64843Op9R41J828J631Q99P08J250J935K325K349J945J140L82K49P82J404
52939A84538J523J064L87j25l92o08r16j227j308r50L6J611L071L327K226J235
52923A93492J859L655M860M969N207O107O242M485K212J724L128M416M316L535
52909B50207L071K793K134J036l20j919l383l789k602n23J012J030l50k050k790
$$ plain form
53020 180520 179800 178951 178577 178348 177549 176701 177115 178777 179984 179266 176702 173259 169833 167121 165464 164452
53004 164452 163517 163121 164454 167633 171107 173382 174420 174800 174438 173090 171441 170589 170737 171354 172435 174600
52988 174600 177822 180863 182241 181256 178142 173993 170716 170118 172217 174797 175256 172932 169390 166745 166019
52973 166019 166775 167695 167496 165872 163823 162744 163062 164020 164801 165293 165566 165250 164131 162991 162949 163972 164843
52956 164843 164849 164770 165711 167539 169170 170069 170777 172027 173962 176287 178636 180581 181721 182103 182352 183134 184538
52939 184538 186061 187125 187512 187387 186995 186387 185471 184244 182936 181986 182022 183633 186704 190031 192257 193492
52923 193492 195351 199006 203866 208835 214042 220149 226391 230876 233088 234812 237940 242356 246672 250207
52909 250207 253278 256071 258205 259241 258921 257002 253619 249830 247228 246705 247717 248747 248397 246347 243557
52894B43557k214j334j302j876j860r90l78o97j119p02R2K32k13l48kP2n34j302
52876B29082j622j436r67l92Q2K72K56J94L4k24k23J99L61l98j404j370n82q88
52858B20974k889m530l687j093P81J055Q32P35J55q05p64O12J462K88j619j968
52842B09539o88L47K70j6J65K16l79j173j667j978k110j619m85N21P97M44l12
52825B01872j262j674q23O04J012K18k14L67M96p27j607k65K106K599N87j666
52809B01623k221j376l47L01N47N92Q24J165N73j583l971m600l609l018l594l857
52793A77449k703j189p72j219j356q21l4O50Q71J35j349k387k154j181m80l28
52777A63132n03q84j184r05j21M43O55J273K405K884K033R51R33J611J944K046
$$ plain form
52894 243557 241343 240009 238707 236831 234971 233981 233603 232906 231787 231085 231177 231409 231196 230848 230846 230918 230384 229082
52876 229082 227460 226024 225057 224665 224747 225019 225275 225469 225503 225279 225056 225255 225616 225218 223814 222444 221862 220974
52858 220974 218085 213555 209868 208775 209556 210611 211443 212178 212333 211528 210764 211376 212838 213126 211507 209539
52842 209539 208851 209198 209468 209452 209617 209833 209454 208281 206614 204636 202526 200907 200422 200943 201740 202184 201872
52825 201872 200610 198936 198113 198717 199729 199947 199733 200100 200596 199869 198262 197997 200103 202702 203289 201623
52809 201623 199402 198026 197679 197980 198527 199119 199943 201108 201681 200098 196127 191527 187918 184900 181306 177449
52793 177449 174746 173557 172785 171566 170210 169389 169355 170005 170876 171011 169662 167275 165121 163940 163460 163132
52777 163132 162629 161745 160561 159656 159535 159978 160633 161906 164311 167195 169228 170179 171112 172723 174667 176713
52761A76713K546K919K150O53k21m08j234l021m167l233q69R43R48n08k052k510
52745A68649j900j358j835l038m034m442m404l825k616j429j202j959k799l001
52731A30807k409r88R81K453K352R00o41j459j535p21J169L247L899K770J282
52716A42107O49M67j18r08j182q49k33N43J137O37j290l348l776k447q38K1N72
52699A31144J500K328J959K96j284j254M49K367L075K563J874J640J501R71K26
52684A49355k67n34r83j670k106j826r49K6Q11J541K304K687K214J161L88J97
52668A52349k9o86j165q92m57o62r34j0J928L185K921K262K480L099K727R84j081
52651A66019k076j227J101L339L760K327R90J502L431M916M892L722K156O30l93
$$ plain form
52761 176713 179259 182178 184328 184981 184760 184352 183118 180097 175930 172697 171828 172771 173719 173211 171159 168649
52745 168649 166749 165391 163556 160518 156484 152042 147638 143813 141197 139768 138566 136607 133808 130807
52731 130807 128398 127410 128391 130844 133196 134096 133455 131996 130461 129740 130909 134156 138055 140825 142107
52716 142107 142756 143223 143105 142197 141015 140166 139933 140476 141613 142250 140960 137612 133836 131389 130551 130572 131144
52699 131144 132644 134972 136931 137227 135943 134689 135138 137505 140580 143143 145017 146657 148158 149129 149355
52684 149355 149088 148554 147571 145901 143795 141969 141020 141046 141857 143398 145702 148389 150603 151764 152152 152349
52668 152349 152320 151634 150469 149577 149120 148458 147524 147514 149442 152627 155548 157810 160290 163389 166116 167100 166019
52651 166019 163943 162716 163817 167156 170916 173243 174233 175735 179166 184082 188974 192696 194852 195482 195089
52636A95089l26Q76K388L045K272N93p43r83p42j168k206k516j469k59l53j480
52620A92018k181j802r86n24o30j174j766j661m13J329K304J925O96l99m55Q71
52604A87152K732L446K264M53l11o4K0k55j30K80p7j272k149k333k727l395k859
52587A80775n98J429J174p63k311k727k612k001m42J395J991R76m84j370j616
52572A72816j462j267j885l591m665k772J743N647O503N044L169J440j70p20N52
52557A80382K414K921K030J264J130O80m31j249j242j069j058l83J354K952K996
52542A92691J622O4q59r53j74J060J666J056J33R9O99P03k7j89J056K928M146
52525B05721M296L664K467R47l29q52o80j81M86J213J649J489R82O45N55L14k19
$$ plain form
52636 195089 194763 195639 198027 201072 203344 203937 203194 202211 201469 200301 198095 195579 194110 193851 193498 192018
52620 192018 189837 188035 187049 186525 185895 184721 182955 181294 180881 182210 184514 186439 187135 186736 186281 187152
52604 187152 189884 193330 195594 196047 195736 195672 195692 195437 195307 195587 195510 194238 192089 189756 187029 183634 180775
52587 180775 180177 181606 182780 182017 179706 176979 174367 172366 171924 173319 175310 176286 175802 174432 172816
52572 172816 171354 170087 168202 164611 159946 157174 158917 164564 171067 176111 179280 180720 180550 179830 180382
52557 180382 182796 185717 187747 189011 190141 190821 190390 189141 187899 186830 185772 185389 186743 189695 192691
52542 192691 194313 194377 193518 192565 192391 193451 195117 196173 196306 196405 197104 197807 197780 197591 198647 201575 205721
52525 205721 210017 213681 216148 217095 216766 215914 215234 215053 215539 216752 218401 219890 220872 221517 222072 222386 222167
52508B22167n59j74Q20J728K011J662R82K49k61l34j65m53j609k953l207j981
52492B17923k42Q87J272J401J435J118L13q36j988k512j841m51Q1j186l102l616
52476B08656k210l49L19o66k705m652n262m225k826k513k888k260l50J038M79
52461A79586j241k407k302j224J83Q71j28k191l273k567j714k087k316m69K316
52446A61037K841L07k460k616m10J951K969K639J635O16k39j318k727l442k264
52431A58519L29K306K328R20o55j623j539k28J598K665K631K406K576K668K345
52416A77246K070J898R38r86k400k170j336j473k097j474L88J428M61j137j234
52401A70122N10K507L046J866K83j58O87J482J245P51J407L136M342L817J897
$$ plain form
52508 222167 221608 221434 222254 223982 225993 227655 228637 228886 228625 228291 228126 227673 226064 223111 219904 217923
52492 217923 217681 218568 219840 221241 222676 223794 224107 223271 221283 218771 216930 216479 216560 215374 212272 208656
52476 208656 206446 206097 206416 205750 203045 198393 193131 188906 186080 183567 180679 178419 178069 179107 179586
52461 179586 178345 175938 173636 172412 172595 173466 173338 171147 167874 165307 163593 161506 159190 158721 161037
52446 161037 163878 164185 161725 159109 158699 160650 163619 166258 167893 168509 168270 166952 164225 160783 158519
52431 158519 158848 161154 163482 164402 163747 162124 160585 160357 161955 164620 167251 169657 172233 174901 177246
52416 177246 179316 181214 182152 181166 178766 176596 175260 173787 171690 170216 170604 172032 172493 171356 170122
52401 170122 170632 173139 176185 178051 178334 178176 178863 180345 181590 182341 183748 186884 191226 195043 196940
52386A96940j49j035r1J957L036J744p11j789q50L05L74K45J003J880J548L91
52370B04798p0O24J651K383K777K485J134o15j475j170m89L09J710L245L192R27
52354B21416j567j781M36L105M625M853M240L214K467K510K711J863L0j248j012
52339B45862j32K87O90K185M413N562M518K094K4n29N43K523M281N055N105N153
52323B87634N276M914M070L564L773L907L267K531K939M492N918O360O289O534
52309C51468P190P755P859P407O477N565N618P156R380J0697J0371R304Q966R954
52295D65167J1909J4348J6847J8500J8284J6454J4955J5632J8262K0988K2491
52284F53837K3130K3966K5410K6998K8014K8169K8059K8840L0944L3192L3944
$$ plain form
52386 196940 196791 195756 195665 197622 200658 202402 201691 199902 199052 199357 199731 199976 200979 202859 204407 204798
52370 204798 204728 205352 207003 209386 212163 214648 215782 215167 213692 212522 212033 212342 214052 217297 220489 221416
52354 221416 219849 218068 218504 221609 226234 231087 235327 238541 241008 243518 246229 248092 248122 246874 245862
52339 245862 245730 246017 246707 248892 253305 258867 263385 265479 265503 264974 265517 268040 272321 277376 282481 287634
52323 287634 292910 297824 301894 305458 309231 313138 316405 318936 321875 326367 332285 338645 344934 351468
52309 351468 358658 366413 374272 381679 388156 393721 399339 406495 415875 426572 436943 446247 455213 465167
52295 465167 477076 491424 508271 526771 545055 561509 576464 592096 610358 631346 653837
52284 653837 676967 700933 726343 753341 781355 809524 837583 866423 897367 930559 964503
52273I64503L3144L2319L2487L3053L3127L2828L2531L1859L0359K8474K6834
52262A311518K5138K2765K0067J7954J6496J4954J2829R989O234J975j144j903
52250A456872j516k337m533o000n902o022p540q633p177m352l227m430n435m128
52236A385640j107J871M075N738P031Q032R077J0537J2622J5503J8990K1941K2908
52223A522858K1814K0278J9824K0429K1214K1705K1713K0772J8635J5932J3392
52212A738566J0699P121L115K37q49j397l167o569j0489j3475j4807j4970j5412
52199A678603j7282j9951k1347k0365j8413j7730j8594j9294j8737j7807j7661
52188A471422j7759j6521j3436r604o384m207k722j537n63K3J65L23J258L025
$$ plain form
52273 964503 997647 1029966 1062453 1095506 1128633 1161461 1193992 1225851 1256210 1284684 1311518
52262 1311518 1336656 1359421 1379488 1397442 1413938 1428892 1441721 1451710 1457944 1459919 1458775 1456872
52250 1456872 1455356 1453019 1448486 1442486 1436584 1430562 1423022 1414389 1407212 1402860 1399633 1395203 1389768 1385640
52236 1385640 1384533 1386404 1390479 1396217 1403248 1411280 1420357 1430894 1443516 1459019 1478009 1499950 1522858
52223 1522858 1544672 1564950 1584774 1605203 1626417 1648122 1669835 1690607 1709242 1725174 1738566
52212 1738566 1749265 1756386 1759501 1759738 1758889 1757492 1754325 1747756 1737267 1723792 1708985 1694015 1678603
52199 1678603 1661321 1641370 1620023 1599658 1581245 1563515 1544921 1525627 1506890 1489083 1471422
52188 1471422 1453663 1437142 1423706 1414102 1407718 1403511 1400789 1399252 1398689 1398712 1398877 1399200 1400458 1403483
52174A403483M566M835M222M213N561P485Q794R169Q987Q491P760P193P325Q048
52160A500132Q485P985P007O736P707R094R669R280Q929R286R786R514Q454P234
52146A619298O140N106M370M170L966K954J361K44p6l30q25r02l60k65j479l344
52130A640028m696n313n517n121l974k925l048m282n874p525r060r478p930n385
52116A559900l738l319k864j957j618k036j575P77L362L718J741k55k19J763L997
52101A557677M835M148L597N040Q271J1004J1535J0600J0009J0425J1449J2944
52089A661534J4984J6959J8041J8379J8788J9521K0358K1489K3099K4313K3961
52078A881426K2453K1501K1831K2452K2474K2207K1901K0882J8885J7014J6158
$$ plain form
52174 1403483 1408049 1412884 1417106 1421319 1426880 1434365 1443159 1452328 1461315 1469806 1477566 1484759 1492084 1500132
52160 1500132 1508617 1516602 1523609 1530345 1538052 1547146 1556815 1566095 1575024 1584310 1594096 1603610 1612064 1619298
52146 1619298 1625438 1630544 1634914 1639084 1643050 1646004 1647365 1647609 1647533 1647203 1646378 1645476 1645116 1644851 1643372 1640028
52130 1640028 1635332 1630019 1624502 1619381 1615407 1612482 1609434 1605152 1599278 1591753 1582693 1573215 1565285 1559900
52116 1559900 1556162 1552843 1549979 1548022 1546404 1544368 1542793 1543570 1546932 1550650 1552391 1552136 1551917 1553680 1557677
52101 1557677 1562512 1566660 1570257 1575297 1583568 1594572 1606107 1616707 1626716 1637141 1648590 1661534
52089 1661534 1676518 1693477 1711518 1729897 1748685 1768206 1788564 1810053 1833152 1857465 1881426
52078 1881426 1903879 1925380 1947211 1969663 1992137 2014344 2036245 2057127 2076012 2093026 2109184
52067B109184J5432J3502J0833R047Q363P253M858K348J177J010L32j354l011
52054B178974l680l792m494o214q397j0324j1621j2045j1520j0484r529q473o568
52041B071833m072k506k410j796J559O764J0674J2055J2900J4991J7329J8225
52029B155546J8208J8942K0498K1619K2050K2681K3581K3798K3058K2012K0751
52018B392744J8777J6597J5562J5624J4973J2556R329O132K107l407q912j2504
52006B479578j4682j7561k1809k6175k9809l3221l6649l9141l9988l9978m0357
51995B140208m1285m2062m2372m2556m2762m2444m0984l8737l7088l7006l7553
51984A695359l6507l2995k8837k6518k6214k5806k3586j9948j6397j3982j2962
$$ plain form
52067 2109184 2124616 2138118 2148951 2157998 2166361 2173614 2178472 2180820 2181997 2183007 2183339 2181985 2178974
52054 2178974 2175294 2171502 2167008 2160794 2152397 2142073 2130452 2118407 2106887 2096403 2086874 2078401 2071833
52041 2071833 2067761 2065255 2062845 2061049 2062608 2069372 2080046 2092101 2105001 2119992 2137321 2155546
52029 2155546 2173754 2192696 2213194 2234813 2256863 2279544 2303125 2326923 2349981 2371993 2392744
52018 2392744 2411521 2428118 2443680 2459304 2474277 2486833 2496162 2502294 2504401 2500994 2492082 2479578
52006 2479578 2464896 2447335 2425526 2399351 2369542 2336321 2299672 2260531 2220543 2180565 2140208
51995 2140208 2098923 2056861 2014489 1971933 1929171 1886727 1845743 1807006 1769918 1732912 1695359
51984 1695359 1658852 1625857 1597020 1570502 1544288 1518482 1494896 1474948 1458551 1444569 1431607
51973A431607j3053j3446j3222j2191j1074j0638j1076j2232j3816j5287j6171
51962A289401j6669j7312j8038j8318j8284j8783k0132k1746k3304k5143k7040
51951A064632k7869k7264k6584k7249k8970l0585l1633l2074l1445k9820k8734
51940G42405k9445l0643k9770k6486k3096k1355k0715k0117j9668j9586j9021
51929D82503j7189j4720j2749j1405j0217r354r269r534r162p948o658n875n448
51916C52975n050m597m005l112k025j170r51j536k905m715o183o444n246l238
51902C01798j600j284k291l681m482m676m802m783l825j831j3M72j14p36j048
51887B67104j340j538j260p68q27j529k197k518k849l119k527r78P9p00k508l220
$$ plain form
51973 1431607 1418554 1405108 1391886 1379695 1368621 1357983 1346907 1334675 1320859 1305572 1289401
51962 1289401 1272732 1255420 1237382 1219064 1200780 1181997 1161865 1140119 1116815 1091672 1064632
51951 1064632 1036763 1009499 982915 955666 926696 896111 864478 832404 800959 771139 742405
51940 742405 712960 682317 652547 626061 602965 581610 560895 540778 521110 501524 482503
51929 482503 465314 450594 437845 426440 416223 406869 397600 388066 378904 370956 364298 358423 352975
51916 352975 347925 343328 339323 336211 334186 333016 332065 330529 327624 322909 316726 310282 305036 301798
51902 301798 300198 298914 296623 292942 288460 283784 278982 274199 270374 268543 268530 269002 268888 268152 267104
51887 267104 265764 264226 262966 262198 261371 259842 257645 255127 252278 249159 246632 245654 245733 245033 242525 239305
51871B39305k204j153j570k582k375j251j558m133o438n589k453p53k163m198
51857B00885l873j681m40j234k543k950k756k553k035j016l44p68j817k650l231
51842A70994l611l046j125O96L72j802l186k135n6P81L17J84Q52R63k21j235k61
51825A58481K256L920L113N91j628k240j307K82J472J546N88m99p81j79N34N54
51809A66703k55j345j877j205O67K837L980L485K172J524K040K689K351J399J165
51794A86330J963K628K365J966K418L223L312L066L841N598O677O344N941O735
51780B42407P920P897O480M715L344K705L418N660Q154R317R390J0058J2006J4156
51766C47627J5547J6595J8056J9754K1068K1834K2013K0963J7655J1644L665m526
$$ plain form
51871 239305 237101 235948 234378 231796 229421 228170 226612 222479 216041 210452 207999 207246 205083 200885
51857 200885 197012 195331 194891 193657 191114 188164 185408 182855 180820 179804 179460 178692 176875 174225 170994
51842 170994 167383 164337 163212 163908 164280 162478 159292 157157 157101 157882 158199 158383 159235 160198 159977 158742 158481
51825 158481 160737 164657 167770 168361 166733 164493 163186 163468 164940 166486 167074 166575 165794 165615 166149 166703
51809 166703 166448 165103 163226 162021 162688 165525 169505 172990 175162 176686 178726 181415 183766 185165 186330
51794 186330 188293 190921 193286 195252 197670 200893 204205 207271 211112 216710 223387 229731 235672 242407
51780 242407 250327 258224 264704 269419 272763 275468 278886 284546 292700 302017 311407 321465 333471 347627
51766 347627 363174 379769 397825 417579 438647 460481 482494 503457 521112 532756 536421 531895
51754E31895j1070j5217j7641j9238j9969j9499j8278j7056j5639j3551j1619
51743C53118j1354j2555j3210j2279j0870r964q650n982l205k389l627n114n590
51730B48329n306m796m113l283k507j731q57k60m61j318k157k554k466j919j179
51715B13422q26r98j008l98J69q6o83o14Q9O46R85J559K040J614N17j60j98l69
51697B15701p21l23R36J887J884J631J601J299Q15J420L327M469L088M18r35m20
51681B36077N04J187K448M454N891N791M764L839L270K981L066L210K539Q70o22
51666B80269p36K69J137J046m6j979m326n952n587l267p55j19j926m882p097p597
51650B38452o716n305l891k609j597r84n83n5N01N71o1r74j731k344k883k966
$$ plain form
51754 531895 520825 505608 487967 468729 448760 429261 410983 393927 378288 364737 353118
51743 353118 341764 329209 315999 303720 292850 282886 274236 268254 265049 262660 259033 253919 248329
51730 248329 243023 238227 234114 230831 228324 226593 225736 225476 225015 223697 221540 218986 216520 214601 213422
51715 213422 212596 211598 210590 210192 210361 210275 209592 208978 209067 209713 210698 212257 214297 215911 216428 216268 216070 215701
51697 215701 214980 214657 215593 217480 219364 220995 222596 223895 224710 226130 229457 233926 237014 237432 236497 236077
51681 236077 236581 237768 240216 244670 250561 256352 261116 264955 268225 271206 274272 277482 280021 280891 280269
51666 280269 279533 279802 280939 281985 281939 279960 275634 269682 264095 260828 260073 259954 258028 253146 246049 238452
51650 238452 231736 226431 222540 219931 218334 217350 216767 216712 217213 217784 217723 216749 215018 212674 209791 206825
51634B06825k235j113m21k65J43J326K681L083K086K28j606k796l085k558j661
51619B00632j023r62j194j131m97L54Q30P86Q02J636L348N078N777N171L945L002
51603B26554K583K044N00k129m708n781n092l912l547l762l302j817m77l35q93
51588A95926q82mR21J365J746K541L444L759L192J976N31n97q97l27N93J430K250
51571B16967L055L142J841k47j463q10R78K417K848K653K316J848J036j76j539
51556B34866k476k312j038K40J81j243k499k087j68J609J690o0k391l791l754
51541B16767l030k416j619N6J906J995l12k937l385j800n07q66j983k551k390
51526A96928j867j061k12J08m4J86R42J032k35j595j494m55k59j176j584m37J373
$$ plain form
51634 206825 204590 203477 203056 202791 202934 204260 206941 210024 212110 212338 210732 207936 204851 202293 200632
51619 200632 199609 198647 197453 196322 195825 196179 197009 197795 198597 200233 203581 208659 214436 219607 223552 226554
51603 226554 229137 231181 231681 229552 224844 219063 213971 210059 206512 202750 199448 197631 197154 196819 195926
51588 195926 195044 195040 195961 197326 199072 201613 205057 208816 212008 213984 214515 213918 213021 212694 213287 214717 216967
51571 216967 220022 223164 225005 224758 223295 222485 223463 225880 228728 231381 233697 235545 236581 236405 234866
51556 234866 232390 230078 229040 229280 229461 228218 225719 223632 223464 225073 226763 226703 224312 220521 216767
51541 216767 213737 211321 209702 209758 211664 213659 213347 210410 207025 205225 204718 203852 201869 199318 196928
51526 196928 195061 194000 193788 193896 193852 194038 194980 196012 195777 194182 192688 192233 191974 190798 189214 188777 190150
51509A90150K492K759K781K701K194J218K85P4R43K479L531L177J795P26O96J048
51493B19049P35l43j312j335m44O24J248J530J888K161J826J226J635L360M679
51478B36527L954K129J550K634L476K953K229K505L019K571J614J396J878K022
51464B70457J596J216Q96pj316j780p31Q41J438P58j44k01M76P40k33j918l069
51447B69019l267l253l604l905l529k553j356l5J086J210K82k70P38K239K026
51432B54828j96k319k590j583q83j018j496j993k437k444j721r37j192k400l098
51417B28521k291r81r77k531m023m217l703l495l241k122r07j345l418m887m358
51402A86025l156l164m050m077k760j187k39P9j30p06r45l29M30K76n08q03o95
$$ plain form
51509 190150 192642 195401 198182 200883 203077 204295 204580 204654 205597 208076 211607 214784 216579 217305 218001 219049
51493 219049 219784 219441 218129 216794 216350 216974 218222 219752 221640 223801 225627 226853 228488 231848 236527
51478 236527 240481 242610 244160 246794 250270 253223 255452 257957 260976 263547 265161 266557 268435 270457
51464 270457 272053 273269 274165 274158 272842 271062 270331 271172 272610 273368 273224 273023 273499 274239 274006 272088 269019
51447 269019 265752 262499 258895 254990 251461 248908 247552 247517 248603 249813 250095 249825 250563 252802 254828
51432 254828 254632 252313 249723 248140 247257 246239 244743 242750 240313 237869 236148 235211 234019 231619 228521
51417 228521 226230 225249 224272 221741 217718 213501 209798 206303 203062 200940 200033 198688 195270 190383 186025
51402 186025 182869 179705 175655 171578 168818 167631 167392 167471 167341 166635 165690 165361 165791 166067 165559 164756 164061
51385A64061j371k968l927k943l20K767N040N168K722l86j223O49K436J852m8
51370A71509q89m03r9o09j180j257r46m3J794L842M530L213R14q06j151m15L62
51353A78366J93p74j260m64P41J035N10K82O82J060J251J864K952L606L240K269
51337A95553J138k28j602k103j407n36o71j788l076m040m452l774j757O19J822
51322A73698J571J099J321J526M69j695l328l230k014j340k030l327l935l468
51308A55317k751k825l740m381l551j371N97Q78l31j478j491p95l14j05N17J841
51292A36017L211L659K731Q82p59j188m30M86N70l00j632k888l512k970j454j79
51276A32244k46j262j732p73R77K152J921O17n19l47R47J893J448K96k19J7k6
$$ plain form
51385 164061 162690 159722 155795 152852 152532 155299 160339 165507 168229 167843 166620 167269 169705 171557 171509
51370 171509 170620 170217 170118 169509 168329 167072 166126 166083 167877 171719 176249 179462 180376 179570 178419 178004 178366
51353 178366 178559 177785 176525 176061 176802 177837 178347 178629 179311 180371 181622 183486 186438 190044 193284 195553
51337 195553 196691 196463 194861 192758 191351 190815 190144 188356 185280 181240 176788 173014 171257 171876 173698
51322 173698 175269 176368 177689 179215 179684 177989 174661 171431 169417 168077 166047 162720 158785 155317
51308 155317 152566 149741 146001 141620 138069 136698 137295 138173 137842 136364 134873 134078 133764 133659 134176 136017
51292 136017 139228 142887 145618 146500 145741 144553 144123 144609 145179 144879 143247 140359 136847 133877 132423 132244
51276 132244 131998 130736 129004 128231 129208 131360 133281 133898 133379 133032 133979 135872 137320 137616 137397 137414 137388
51259A37388q15j743k289k499k164q54Q34J326J37j160r58K88J123J424K262L662
51243A35962M117K696N51m86q2N04K12o64j192j002m49J65R59J966K709K685K013
51226A50664J286R69J220J993K793K686J280n14j516j849k420k984k219j61J088
51211A52316Jk208l307k882k003j026N10K109K392J165j50n20l33o0O82J941K607
51194A51234J814L58m00k77j4K40R62K043K632K225J194J54m47k07R66K256K384
51177A67117J051n33j023m10K63L07j9j57J07P61J779K851L158K010j45j721j408
51160A73988M12J996J992O85n82r60p44o69r44j196j117q61o88n35k16M5k59j099
51142A69248j586r19N61J685J852J651K026L051L759L007O04k163l298j925N59
$$ plain form
51259 137388 136573 134830 132541 130042 127878 127024 127858 129184 129321 128161 127203 127491 128614 130038 132300 135962
51243 135962 140079 142775 143326 142840 142758 143262 143474 142810 141618 140616 140167 140332 141291 143257 145966 148651 150664
51226 150664 151950 152919 154139 156132 158925 161611 162891 162377 160861 159012 156592 153608 151389 151228 152316
51211 152316 152317 150109 146802 143920 141917 140891 141401 143510 145902 147067 146917 146397 146064 146004 146686 148627 151234
51194 151234 153048 153406 153006 152729 152715 152955 153917 155960 158592 160817 162011 162165 161718 161511 162477 164733 167117
51177 167117 168168 167635 166612 166202 166465 166772 166753 166596 166703 167464 169243 172094 175252 177262 177117 175396 173988
51160 173988 174400 176396 178388 179073 178491 177531 176787 176118 175174 173978 172861 172000 171312 170777 170561 170606 170347 169248
51142 169248 167662 166743 167304 168989 170841 172492 174518 177569 181328 184335 184939 182776 179478 177553 178112
51127A78112J760Q61o08q57j7M39j97j228j871k233k695l024k668j558k40O73
51111A64649R17N78n3n41m83K10J025J098J03j119j296l05N81M44R9Q52K302K617
51093A71678J095p52j250o62l52n80m07M98J208J038P07J314K657L335K400M78
51077A82405r38r42J23J246J636J145J71o17p47l77j60l46l32M09J153O08j180
51060A83257k484k012m30Q83J740K621K916J347j748m009l556r28J939L785M409
51045A87730L930K681J379O19M07P46K055M227N869N642M159L294L596L659K433
51030B32426R44Q18J905K525J783O20L13Q27J102O78K88P63J748J977Q24q34j541
51013B47166p97O00J511J441O84K7K49J475K862L312K638J704J304J299J042L22
$$ plain form
51127 178112 179872 180733 180125 179268 179251 179690 179493 178265 176394 174161 171466 168442 165774 164216 163976 164649
51111 164649 165566 166144 166091 165550 165067 165277 166302 167400 167503 166384 165088 164783 165364 165808 165907 166759 169061 171678
51093 171678 172773 172021 170771 170109 169757 169177 168770 169268 170476 171514 172221 173535 176192 179527 181927 182405
51077 182405 181467 180525 180648 181894 183530 184675 184846 184229 183482 183105 182945 182599 182267 182676 183829 184437 183257
51060 183257 180773 178761 178331 179214 180954 183575 186491 187838 186090 182081 178525 177597 179536 183321 187730
51045 187730 191660 194341 195720 196339 196746 197492 199547 203774 209643 215285 219444 222738 226334 229993 232426
51030 232426 233370 234188 236093 238618 240401 241021 241334 242161 243263 243941 244229 244992 246740 248717 249541 248707 247166
51013 247166 246369 246969 248480 249921 250605 250632 250881 252356 255218 258530 261168 262872 264176 265475 266517 266839
50997B66839n16j107j349j123j33J670L570M325L364J702J082J850K404J336m57
50982B83457q23P30K475K916K472K231K243J980J552J392J297Q02J00k87m30p26
50966C01381r79o28L30J515K890M419N347M886L562K657K474K321K275L433N974
50951C41857Q277Q771P700O385N625N560O254P460Q397Q642Q706R154R714J0036
50937D52538J0648J2166J4078J5358J5942J6567J7354J7635J7219J6910J7646
50926F24061J9741K2835K5892K7572K7593K7611K9574L3182L6263L7914L9776
50915I52014M3546M8569N3083N6810O0938O6041P1506P6959Q2858Q9340R5538
50904A697202J00553J04314J06947J08252J08483J08908J10343J11350J09135
$$ plain form
50997 266839 266323 265216 263867 262744 262611 264281 267851 272176 275540 277242 278324 280174 282578 283914 283457
50982 283457 282634 283364 285839 288755 291227 293458 295701 297681 299233 300625 301922 302724 302824 302537 302107 301381
50966 301381 300402 299774 300104 301619 304509 308928 314275 319161 322723 325380 327854 330175 332450 335883 341857
50951 341857 350134 358905 366605 372990 378615 384175 390429 397889 406286 414928 423634 432788 442502 452538
50937 452538 463186 475352 489430 504788 520730 537297 554651 572286 589505 606415 624061
50926 624061 643802 666637 692529 720101 747694 775305 804879 838061 874324 912238 952014
50915 952014 995560 1044129 1097212 1154022 1214960 1281001 1352507 1429466 1512324 1601664 1697202
50904 1697202 1797755 1902069 2009016 2117268 2225751 2334659 2445002 2556352 2665487
50895B665487J02597R3580Q4619P6288O7420N7237M6253L5393K5366J6825J0102
50884C281167M570q37o108j0144j2572j4424j6322j7182j5962j3994j4092j7624
50872C146476k3645l0706l8111m5426n2332n9382o7560p6467q4056q9038r2472
50861B487281r5977r9289j00842j00181r8321r5879r2189q6632p9805p2876o6437
50850A498853o0511n5149n0456m6217m2001l7592l3149k8961k5279k2178j9375
50839A077985j6256j2451q450n373l925l720l764l404k530j096R57L243M984N934
50825A032134O837Q564J1007J3215J4456J4843J5191J6527J9374K3023K5864K6967
50813A228002K7054K7447K8632L0499L3334L7321M1500M4657M7247N0885N5918
$$ plain form
50895 2665487 2768084 2861664 2946283 3022571 3089991 3147228 3193481 3228874 3254240 3271065 3281167
50884 3281167 3285737 3284900 3278792 3268648 3256076 3241652 3225330 3208148 3192186 3178192 3164100 3146476
50872 3146476 3122831 3092125 3054014 3008588 2956256 2896874 2829314 2752847 2668791 2579753 2487281
50861 2487281 2391304 2292015 2191173 2090992 1992671 1896792 1804603 1717971 1638166 1565290 1498853
50850 1498853 1438342 1383193 1332737 1286520 1244519 1206927 1173778 1144817 1119538 1097360 1077985
50839 1077985 1061729 1049278 1040828 1035455 1031530 1027810 1024046 1020642 1018112 1017016 1017973 1021216 1026200 1032134
50825 1032134 1038971 1047535 1058542 1071757 1086213 1101056 1116247 1132774 1152148 1175171 1201035 1228002
50813 1228002 1255056 1282503 1311135 1341634 1374968 1412289 1453789 1498446 1545693 1596578 1652496
50802A652496O1128O6245P2822Q1607R0839R8665J06022J15378J27283J39909
50792B612394J51552J62093J72201J82496J93426K04807K15525K24758K33041
50783D352293K40832K46487K47508K43724K37194K28513K15328J95605J70710
50774F378194J43829J16520Q8556O0356L3805J0709q254k2830l2668l7870l9335
50763F691012l8067l4547k9169k3081j8223j6452j8599k4505l4073m7988o6793
50752F339515q9269j12425j33708j52853j71123j89032k05333k18022k25777k28415
50742D613558k26483k20699k11669k00040j86728j72691j58370j43646j28540
50733B964692j13698j00067q8331p8741p1037o4369n7784n1247m5708m1730l8556
$$ plain form
50802 1652496 1713624 1779869 1852691 1934298 2025137 2123802 2229824 2345202 2472485 2612394
50792 2612394 2763946 2926039 3098240 3280736 3474162 3678969 3894494 4119252 4352293
50783 4352293 4593125 4839612 5087120 5330844 5568038 5796551 6011879 6207484 6378194
50774 6378194 6522023 6638543 6727099 6787455 6821260 6831969 6823715 6800885 6768217 6730347 6691012
50763 6691012 6652945 6618398 6589229 6566148 6547925 6531473 6512874 6488369 6454296 6406308 6339515
50752 6339515 6250246 6137821 6004113 5851260 5680137 5491105 5285772 5067750 4841973 4613558
50742 4613558 4387075 4166376 3954707 3754667 3567939 3395248 3236878 3093232 2964692
50733 2964692 2850994 2750927 2662596 2583855 2512818 2448449 2390665 2339418 2293710 2251980 2213424
50722B213424l5203l2090l0552l0749l1014k9716k7100k4844k4200k5055k6452
50711A896449k7441k7581k7178k7189k8388l0287l1229k9961k7063k4350k2856
50700A592926k1829j9985j7143j4170j1562q867n591k013J158L702O163R494J4456
50687A526739K0969K7875L3693L7890M1229M4914M9769N6078O3479P0790P6860
50676B050285Q2031Q7967R5371J02732J08334J12741J17867J23881J28660J30555
50666C140424J30203J28954J26862J23223J18128J12097J04541R3860P9293O1848
50656D219433M3287K4803O940r686k3948l4359l9878m0735l8391l4288k8840k2006
50644D022332j4425p335j442L151N878N522J351o251j6721k9937m5357o1269p5912
$$ plain form
50722 2213424 2178221 2146131 2115579 2084830 2053816 2024100 1997000 1972156 1947956 1922901 1896449
50711 1896449 1869008 1841427 1814249 1787060 1758672 1728385 1697156 1667195 1640132 1615782 1592926
50700 1592926 1571097 1551112 1533969 1519799 1508237 1499370 1493779 1491766 1492924 1496626 1502789 1512283 1526739
50687 1526739 1547708 1575583 1609276 1647166 1688395 1733309 1783078 1839156 1902635 1973425 2050285
50676 2050285 2132316 2220283 2315654 2418386 2526720 2639461 2757328 2881209 3009869 3140424
50666 3140424 3270627 3399581 3526443 3649666 3767794 3879891 3984432 4078292 4157585 4219433
50656 4219433 4262720 4287523 4294463 4284777 4260829 4226470 4186592 4145857 4107466 4073178 4044338 4022332
50644 4022332 4007907 4000572 3999130 4002281 4008159 4013681 4015032 4008781 3992060 3962123 3916766 3855497 3779585
50631C779585q8716r9703j08208j13341j15382j15481j13916j09750j02411r2602
50621B720075q1476o9888n8776m9084m0656l2128k2590j2684l569M365J1072J6149
50609B380810J9528K2081K4490K6073K5809K4053K2016K0207J8630J8056J9358
50598B621111K1601K2687K2305K2505K4606K7108K7931K7469K7878K9974L2472
50587B907647L4214L5730L8165M1661M5431M8998N2620N6426N9509O0243N7651
50576C438295N2393M6237M0513L5106K8890K0950J1593K265n625j2041j8147k4638
50564C615791l0778l5537l9043m1962m3856m3343l9891l4459k8224k1764j5619
50553C241315j0446o222k232J620M361N206M384K135k049q493j6576k5649l5914
$$ plain form
50631 3779585 3690869 3591166 3482958 3369617 3254235 3138754 3024838 2915088 2812677 2720075
50621 2720075 2638599 2568711 2509935 2460851 2420195 2388067 2365477 2352793 2349224 2353589 2364661 2380810
50609 2380810 2400338 2422419 2446909 2472982 2498791 2522844 2544860 2565067 2583697 2601753 2621111
50598 2621111 2642712 2665399 2687704 2710209 2734815 2761923 2789854 2817323 2845201 2875175 2907647
50587 2907647 2941861 2977591 3015756 3057417 3102848 3151846 3204466 3260892 3320401 3380644 3438295
50576 3438295 3490688 3536925 3577438 3612544 3641434 3662384 3673977 3676242 3670617 3658576 3640429 3615791
50564 3615791 3585013 3549476 3510433 3468471 3424615 3381272 3341381 3306922 3278698 3256934 3241315
50553 3241315 3230869 3224647 3222415 3224035 3228396 3233602 3237986 3240121 3238072 3229579 3213003 3187354 3151440
50540C151440m7479n9228o9544p7762q4095q8665r1316r2036r0911q8078q4127
50529B278199p9845p5054o8641o0514n2442m5946m0369l4369k8430k4185k1816
50518A746588j9951j7923j6218j4666j2073q231m651k483q55J769N590R635J3146
50505A679677J6001J8348K0714K4011K8533L3158L6307L7828L9391M2677M7491
50494B024136N2063N5208N7687O0873O4525O6802O6703O5348O4409O4298O4765
50483B706817O6175O8911P2177P5045P8352Q4030R2445J01750J10123J17430J24539
50472C697794J32172J40729J50051J58968J66045J71165J75445J79362J81906
50463E153637J81846J78696J72094J61429J46711J28843J08539Q5897O1364L5903
$$ plain form
50540 3151440 3103961 3044733 2975189 2897427 2813332 2724667 2633351 2541315 2450404 2362326 2278199
50529 2278199 2198354 2123300 2054659 1994145 1941703 1895757 1855388 1821019 1792589 1768404 1746588
50518 1746588 1726637 1708714 1692496 1677830 1665757 1657526 1652875 1650392 1649537 1651306 1656896 1666531 1679677
50505 1679677 1695678 1714026 1734740 1758751 1787284 1820442 1856749 1894577 1933968 1976645 2024136
50494 2024136 2076199 2131407 2189094 2249967 2314492 2381294 2447997 2513345 2577754 2642052 2706817
50483 2706817 2772992 2841903 2914080 2989125 3067477 3151507 3243952 3345702 3455825 3573255 3697794
50472 3697794 3829966 3970695 4120746 4279714 4445759 4616924 4792369 4971731 5153637
50463 5153637 5335483 5514179 5686273 5847702 5994413 6123256 6231795 6317692 6379056 6414959
50453F414959R639j8269m7496p5484r9618j19462j35822j48455j56140j58459
50443E465393j56190j50257j41188j29345j14682r6742p5898n4303l4518j7404
50433D494866k284J1112K1919K9054L1549K8032J7286j83k2119m6434p2232r8371
50421D392195j22144j40650j53189j61339j66607j68841j67350j62803j57048
50412B992224j51042j43861j34430j23627j13743j05803r8381q9522p9153o8996
50402A883666o0499n3503m6891l9932l2928k6765k1978j8260j4852j1278p526
50391A549254l724j99K349L479L937N277Q215J1848J4757J6337J6880J7004J7342
50378A662756J8255J9452K0435K1390K2918K4665K5412K5164K6001K9663L5052
$$ plain form
50453 6414959 6424598 6406329 6358833 6283349 6183731 6064269 5928447 5779992 5623852 5465393
50443 5465393 5309203 5158946 5017758 4888413 4773731 4676989 4601091 4546788 4512270 4494866
50433 4494866 4492582 4503694 4525613 4554667 4586216 4614248 4631534 4631351 4609232 4562798 4490566 4392195
50421 4392195 4270051 4129401 3976212 3814873 3648266 3479425 3312075 3149272 2992224
50412 2992224 2841182 2697321 2562891 2439264 2325521 2219718 2121337 2031815 1952662 1883666
50402 1883666 1823167 1769664 1722773 1682841 1649913 1623148 1601170 1582910 1568058 1556780 1549254
50391 1549254 1545530 1545331 1547680 1551159 1555096 1560373 1568588 1580436 1595193 1611530 1628410 1645414 1662756
50378 1662756 1681011 1700463 1720898 1742288 1765206 1789871 1815283 1840447 1866448 1896111 1931163
50367A931163L9384M1341M1898M2392M3197M4383M6348M9318N2868N6503O0267
50356B449062O4537O9553P5262Q1198Q6490R0325R2600R3805R4336R4061R2435
50345C383664Q8782Q2707P4529O5105N4838M3127K9198J3395k870j8409l3268
50334C780798m8473o4798q1468r5892j05320j09174j09389j08100j05481j00320
50324B852383r2128q1918p1225o0950n1031m0733k9465j7732o973J741Q233J2230
50312B422432J2891J0124N401j0o922j6905k9540m2344n3334o2207o8962p2981
50300B097643p3977p2899p1201o9861o9154o8529o6558o2071n5758m9769m5339
50289A392527m1633l7335l2514k8234k4947k2068j8879j5275j1652q323n073j472
$$ plain form
50367 1931163 1970547 2011888 2053786 2096178 2139375 2183758 2230106 2279424 2332292 2388795 2449062
50356 2449062 2513599 2583152 2658414 2739612 2826102 2916427 3009027 3102832 3197168 3291229 3383664
50345 3383664 3472446 3555153 3629682 3694787 3749625 3792752 3821950 3835345 3832475 3814066 3780798
50334 3780798 3732325 3667527 3586059 3490167 3384847 3275673 3166284 3058184 2952703 2852383
50324 2852383 2760255 2678337 2607112 2546162 2495131 2454398 2424933 2407201 2400228 2401969 2410202 2422432
50312 2422432 2435323 2445447 2450848 2450838 2443916 2427011 2397471 2355127 2301793 2239586 2170624 2097643
50300 2097643 2023666 1950767 1879566 1809705 1740551 1672022 1605464 1543393 1487635 1437866 1392527
50289 1392527 1350894 1313559 1281045 1252811 1227864 1205796 1186917 1171642 1159990 1151667 1146594 1145122
50277A145122K256N020O012N823N761O310O984P408P564P292O656O684Q315J0526
50263A237733J1106R797Q988J0350J2324J2432J0951J0397J1877J3784J4298J3549
50251A377586J2854J3007J4035J5679J7303J7865J6943J5575J5199J5778J5731
50240A547555J3941J1046Q276N750K879p3k081l113m485o990r685j1308j2021
50227A539691j2830j4052j5400j6869j8387j8983j7663j4980j2533j1156j0692
50216A376146j1211j2968j5139j6263j6220j6280j6733j6064j3232r415o485m821
50204A221315l671k691k062j637j042k06P45J677K091J304l94j641j736j638k449
50189A207965l853n024o165p885r739j0843j1595j3255j5889j8091j8967j9109
$$ plain form
50277 1145122 1147378 1152398 1158410 1164233 1169994 1176304 1183288 1190696 1198260 1205552 1212208 1218892 1227207 1237733
50263 1237733 1248839 1258636 1267624 1277974 1290298 1302730 1313681 1324078 1335955 1349739 1364037 1377586
50251 1377586 1390440 1403447 1417482 1433161 1450464 1468329 1485272 1500847 1516046 1531824 1547555
50240 1547555 1561496 1572542 1580818 1586568 1589447 1589374 1587293 1584180 1579695 1572705 1563020 1551712 1539691
50227 1539691 1526861 1512809 1497409 1480540 1462153 1443170 1425507 1410527 1397994 1386838 1376146
50216 1376146 1364935 1351967 1336828 1320565 1304345 1288065 1271332 1255268 1242036 1232621 1226136 1221315
50204 1221315 1217644 1214953 1212891 1211254 1210212 1210006 1210751 1212428 1214519 1215823 1215429 1213788 1212052 1210414 1207965
50189 1207965 1204112 1199088 1192923 1185038 1175299 1164456 1152861 1139606 1123717 1105626 1086659 1067550
50177A067550j9286j9297j8724j7839j7096j6296j5059j3745j3189j3499j3777
50166H89743j3155j1795j0525r762r232q625p967p302o535n963o189o940o764
50153G78989m856k582j888k591k970k741l463n502o774n734l856l568m910o002
50139G21552n916n345m938m727n014o221p753q292p377n734m221l409l873n653
50125F43079p338p117m928k485r37L29K188M202N218M908M193M446O434R588J2278
50110F74058J3322J3190J3366J4753J7296K0673K4336K7282K9093L1146L5347
50099I13862M1396M6724M9524N0529N1269N1983N2213N2153N1990N0804M7514
50088A459961M2651L7901L4137L1030K8513K7301K7437K7315K4888J9533J2181
$$ plain form
50177 1067550 1048264 1028967 1010243 992404 975308 959012 943953 930208 917019 903520 889743
50166 889743 876588 864793 854268 844506 835274 826649 818682 811380 804845 798882 792693 785753 778989
50153 778989 774133 771551 769663 767072 764102 761361 757898 752396 745622 739888 736032 732464 727554 721552
50139 721552 715636 710291 705353 700626 695612 689391 681638 673346 665969 660235 656014 652605 648732 643079
50125 643079 635741 628624 623696 621211 620274 620603 622791 626993 632211 637119 641312 645758 652192 661780 674058
50110 674058 687380 700570 713936 728689 745985 766658 790994 818276 847369 878515 913862
50099 913862 955258 1001982 1051506 1102035 1153304 1205287 1257500 1309653 1361643 1412447 1459961
50088 1459961 1502612 1540513 1574650 1605680 1634193 1661494 1688931 1716246 1741134 1760667 1772848
50077A772848L821n429j5581k5652l3973l9785m3955m7685n0882n2348n1363m8394
50065A361622m4314l9730l5190l1237k7847k4437k0813j7523j4918j2522r881
50054A083210p413n614l839r21K964O035O927O433O711Q956J2317J5046J6346
50041A147158J6809J7316J7976J8362J8359J8230J8037J7482J6577J5908J5915
50030A338129J6078J5252J2789R240N901L752K713J951R43K0l92p15j815l625
50016A400221m828m266k248j18J205J924K867M593O885Q891R968J0528J1739J4163
50002A461524J7091J9543K1479K3428K5251K6208K6338K6812K8365L0077L0486
49991A736602K9653K9168L0096L1821L3290L4587L6539L9360M2636M6446N1386
$$ plain form
50077 1772848 1776669 1771240 1755659 1730007 1696034 1656249 1612294 1564609 1513727 1461379 1410016 1361622
50065 1361622 1317308 1277578 1242388 1211151 1183304 1158867 1138054 1120531 1105613 1093091 1083210
50054 1083210 1075797 1070183 1066344 1065423 1068387 1074422 1081349 1087782 1094493 1103449 1115766 1130812 1147158
50041 1147158 1163967 1181283 1199259 1217621 1235980 1254210 1272247 1289729 1306306 1322214 1338129
50030 1338129 1354207 1369459 1382248 1391488 1397389 1401141 1403854 1405805 1406748 1406768 1406376 1405661 1403846 1400221
50016 1400221 1395393 1391127 1388879 1388761 1389966 1391890 1394757 1399350 1406235 1415126 1425094 1435622 1447361 1461524
50002 1461524 1478615 1498158 1519637 1543065 1568316 1594524 1620862 1647674 1676039 1706116 1736602
49991 1736602 1766255 1795423 1825519 1857340 1890630 1925217 1961756 2001116 2043752 2090198 2141584
49980B141584N7200O2431O5902O7755O8353O6949O2560N5904M9413M5069M2860
49969B785980M1546M0164L8518L6615L4072L0010K3372J3602R96j3637k9479m5571
49957B956188o0448p2618q1564q8026r3233r8014j02427j05694j06610j04670
49947B042884j00865r6843r3146q8844q3054p6213o9612o4184o0058n6786n3619
49936A199660m9993m6099m2561l9348l5560l0890k6682k4678k4858k5295k4261
49925H29435k1845j9350j7700j6894j6638j6888j7576j8077j7368j5024j1990
49914F40085r970r756j0339j0096q658p177o666o758o444n545m722m238l644k764
49900E43308k188k246k243j440k86K21P6K31J049J849K090K048K115K354L035
$$ plain form
49980 2141584 2198784 2261215 2327117 2394872 2463225 2530174 2592734 2648638 2698051 2743120 2785980
49969 2785980 2827526 2867690 2906208 2942823 2976895 3006905 3030277 3043879 3044875 3031238 3001759 2956188
49957 2956188 2895740 2823122 2741558 2653532 2560299 2462285 2359858 2254164 2147554 2042884
49947 2042884 1942019 1845176 1752030 1663186 1580132 1503919 1434307 1370123 1310065 1253279 1199660
49936 1199660 1149667 1103568 1061007 1021659 986099 955209 928527 903849 878991 853696 829435
49925 829435 807590 788240 770540 753646 737008 720120 702544 684467 667099 652075 640085
49914 640085 630115 620359 610020 599924 591266 584089 577423 570665 564221 558676 553954 549716 546072 543308
49900 543308 541120 538874 536631 535191 534905 535126 535202 535433 536482 538331 540421 542469 544584 546938 549973
49885E49973M519O214O765N925N146N466N982N609N193O344Q807J0861J1987J3449
49871F52240J6116J9278K1935K3896K5380K6784K9200L3736L9702M4740M7546
49860I80553M9395N2142N5583N7821N7681N5683N2879M9518M5114L9528L3694
49849A529591K9035K6036K3852K1772K0302J9802J8647J4245N933m549j5454k6403
49837A662809l7183m6989n5470o2980o8978p1744p0797o8088o5596o3050n9348
49826I92586n4878n0734m6713m1923l6776l2532k9205k5641k1466j7514j4426
49815F20778j2122j0619r999r716r163q746r106r530q651o678n342n358n579n038
$$ plain form
49885 549973 554492 560706 567471 573396 578542 584008 589990 595599 600792 607136 615943 626804 638791 652240
49871 652240 668356 687634 709569 733465 758845 785629 814829 848565 888267 933007 980553
49860 980553 1029948 1082090 1137673 1195494 1253175 1308858 1361737 1411255 1456369 1495897 1529591
49849 1529591 1558626 1584662 1608514 1630286 1650588 1670390 1689037 1703282 1709215 1704666 1689212 1662809
49837 1662809 1625626 1578637 1523167 1460187 1391209 1319465 1248668 1180580 1114984 1051934 992586
49826 992586 937708 886974 840261 798338 761562 729030 699825 674184 652718 635204 620778
49815 620778 608656 598037 588038 578322 569159 560413 551307 541777 533126 526448 521106 515748 510169 505131
$$ [...]
##END NTUPLES=NMR SPECTRUM
##END=
