
##TITLE=AC1233_CMOAH12092_6610494_DhLeZNSFOO
##JCAMPDX= 6.0         $$ Bruker NMR JCAMP-DX V2.0
##DATA TYPE= NMR SPECTRUM
##DATA CLASS= NTUPLES
##ORIGIN= BRUKER
##OWNER= Administrator
$$ 1.72 TOPSPIN		Version 2.1
$$ 2012-08-02 03:02:21.890 -0500  Administrator@TOPSPIN
$$ Compression mode = diff/dup
##.OBSERVE FREQUENCY= 400.02188249412
##.OBSERVE NUCLEUS= ^1H
##.ACQUISITION MODE= SIMULTANEOUS (DQD)
##.ACQUISITION SCHEME= undefined
##.AVERAGES= 8
##.DIGITISER RES= 22
##SPECTROMETER/DATA SYSTEM= spect
##.PULSE SEQUENCE= zg30
##.SOLVENT NAME= COFFEE_meoh
##.SHIFT REFERENCE= INTERNAL, COFFEE_meoh, 1, 14.98509
##AUDIT TRAIL= $$ (NUMBER, WHEN, WHO, WHERE, PROCESS, VERSION, WHAT)
$$ ##TITLE= Audit trail, TOPSPIN		Version 2.1
$$ ##JCAMPDX= 5.01
$$ ##ORIGIN= Bruker BioSpin GmbH
$$ ##OWNER= Administrator
$$ $$ C:\Bruker\TOPSPIN/data/COFFEE/nmr/AC1233_CMOAH12092_6610494_DhLeZNSFOO/10/pdata/1/auditp.txt
$$ ##AUDIT TRAIL=  $$ (NUMBER, WHEN, WHO, WHERE, PROCESS, VERSION, WHAT)
(   1,<2012-08-02 03:02:13.109 -0500>,<Administrator>,<TOPSPIN>,<go>,<TOPSPIN 2.1>,
      <created by zg
	started at 2012-08-02 03:01:06.218 -0500,
	POWCHK enabled, PULCHK disabled,
       configuration hash MD5:
       6B 1B 68 BB D9 2E 58 E2 7F 35 AD 54 07 DF 0E 41
       data hash MD5: 64K
       EA 3F 46 C0 62 5B 7A CC 8A E2 96 DB 1B 67 31 F4>)
(   2,<2012-08-02 03:02:17.406 -0500>,<Administrator>,<TOPSPIN>,<proc1d>,<TOPSPIN 2.1>,
      <Start of raw data processing
       efp LB = 0 FT_mod = 6 PKNL = 1 PHC0 = 0 PHC1 = 0 SI = 32K 
       data hash MD5: 32K
       CD EE 43 59 47 47 E8 84 BD 18 DD 0A 26 AB E2 A7>)
(   3,<2012-08-02 03:02:17.687 -0500>,<Administrator>,<TOPSPIN>,<proc1d>,<TOPSPIN 2.1>,
      <pk PHC0 = 177.5281 PHC1 = 0 
       data hash MD5: 32K
       05 B9 67 FC C9 2A D5 6D 15 67 82 1C D3 98 F0 9D>)
(   4,<2012-08-02 03:02:17.765 -0500>,<Administrator>,<TOPSPIN>,<proc1d>,<TOPSPIN 2.1>,
      <abs ABSG = 1 
       data hash MD5: 32K
       B0 36 BE BA B6 9B 83 3D 67 17 0E 19 66 88 9F 49>)
(   5,<2012-08-02 03:02:17.796 -0500>,<Administrator>,<TOPSPIN>,<proc1d>,<TOPSPIN 2.1>,
      <abs ABSG = 2 
       data hash MD5: 32K
       61 EC 57 5F E1 9A C8 1D 8F 0B A9 89 07 E1 2A 07>)
(   6,<2012-08-02 03:02:17.828 -0500>,<Administrator>,<TOPSPIN>,<proc1d>,<TOPSPIN 2.1>,
      <abs ABSG = 3 
       data hash MD5: 32K
       03 84 97 C9 AB 47 F9 18 78 4B 1A 67 A7 EB F5 B8>)
(   7,<2012-08-02 03:02:17.859 -0500>,<Administrator>,<TOPSPIN>,<proc1d>,<TOPSPIN 2.1>,
      <abs ABSG = 4 
       data hash MD5: 32K
       84 DA 1D 28 6F 3C 86 B9 17 D4 02 22 FF 5D 3C 1F>)
(   8,<2012-08-02 03:02:17.875 -0500>,<Administrator>,<TOPSPIN>,<proc1d>,<TOPSPIN 2.1>,
      <abs ABSG = 5 
       data hash MD5: 32K
       1D E8 74 F0 D2 34 9B 1F BE 55 75 E3 F9 AF 09 DB>)
$$ ##END=
$$ 
$$ $$ hash MD5
$$ $$ FC F1 71 EC 21 BC FD 21 C1 49 39 65 95 3B 72 7B
##$RELAX= 
##$RELAX= 
##$RELAX= 
##$RELAX= 
##$RELAX= 
##$RELAX= 
##$RELAX= 
$$ Bruker specific parameters
$$ --------------------------
$$ [...]
##$TP= (0..7)
150 150 150 150 150 150 150 150
##$TP07= 0
##$TPNAME0= <>
##$TPNAME1= <>
##$TPNAME2= <>
##$TPNAME3= <>
##$TPNAME4= <>
##$TPNAME5= <>
##$TPNAME6= <>
##$TPNAME7= <>
##$TPOAL= (0..7)
0.5 0.5 0.5 0.5 0.5 0.5 0.5 0.5
##$TPOFFS= (0..7)
0 0 0 0 0 0 0 0
##$TUNHIN= 0
##$TUNHOUT= 0
##$TUNXOUT= 0
##$USERA1= <user>
##$USERA2= <user>
##$USERA3= <user>
##$USERA4= <user>
##$USERA5= <user>
##$V9= 5
##$VALIST= <valist>
##$VCLIST= <CCCCCCCCCCCCCCC>
##$VD= 0
##$VDLIST= <DDDDDDDDDDDDDDD>
##$VPLIST= <PPPPPPPPPPPPPPP>
##$VTLIST= <TTTTTTTTTTTTTTT>
##$WBST= 1024
##$WBSW= 4
##$XGAIN= (0..3)
0 0 0 0
##$XL= 0
##$YL= 0
##$YMAX_a= 476714
##$YMIN_a= -622033
##$ZGOPTNS= <>
##$ZL1= 120
##$ZL2= 120
##$ZL3= 120
##$ZL4= 120
##$ABSF1= 14.98509
##$ABSF2= -5.573092
##$ABSG= 5
##$ABSL= 3
##$ALPHA= 0
##$AQORDER= 0
##$ASSFAC= 0
##$ASSFACI= 0
##$ASSFACX= 0
##$ASSWID= 0
##$AUNMP= <proc_prof1d_extract_pilot.lims>
##$AXLEFT= 0
##$AXNAME= <>
##$AXNUC= <1H>
##$AXRIGHT= 0
##$AXTYPE= 0
##$AXUNIT= <>
##$AZFE= 0.1
##$AZFW= 0.1
##$BCFW= 0
##$BC_mod= 0
##$BYTORDP= 0
##$COROFFS= 0
##$CY= 15
##$DATMOD= 1
##$DC= 0
##$DFILT= <>
##$DTYPP= 0
##$F1P= 0
##$F2P= 0
##$FCOR= 0.5
##$FTSIZE= 32768
##$FT_mod= 6
##$GAMMA= 0
##$GB= 0
##$INTBC= 1
##$INTSCL= 1
##$ISEN= 128
##$LB= 0
##$LEV0= 0
##$LPBIN= 0
##$MAXI= 10000
##$MC2= 0
##$MEAN= 0
##$ME_mod= 0
##$MI= 0
##$NCOEF= 0
##$NC_proc= -8
##$NLEV= 6
##$NOISF1= 0
##$NOISF2= 0
##$NSP= 0
##$NTH_PI= 0
##$NZP= 0
##$OFFSET= 14.98509
##$PC= 1
##$PHC0= 177.5281
##$PHC1= 0
##$PH_mod= 1
##$PKNL= yes
##$PPARMOD= 0
##$PPDIAG= 0
##$PPIPTYP= 0
##$PPMPNUM= 2147483647
##$PPRESOL= 1
##$PSCAL= 4
##$PSIGN= 0
##$PYNMP= <proc.py>
##$REVERSE= no
##$SF= 400.02
##$SI= 32768
##$SIGF1= 0
##$SIGF2= 0
##$SINO= 400
##$SIOLD= 32768
##$SPECTYP= <>
##$SREGLST= <1H.CDCl3>
##$SSB= 0
##$STSI= 32768
##$STSR= 0
##$SW_p= 8223.68421052631
##$SYMM= 0
##$S_DEV= 0
##$TDeff= 65536
##$TDoff= 0
##$TI= <>
##$TILT= no
##$TM1= 0
##$TM2= 0
##$TOPLEV= 0
##$USERP1= <user>
##$USERP2= <user>
##$USERP3= <user>
##$USERP4= <user>
##$USERP5= <user>
##$WDW= 1
##$XDIM= 32768
##$YMAX_p= 458047652
##$YMIN_p= -642270
##$CURPLOT= <Network HP LaserJet P1505>
##$CURPRIN= <$Network HP LaserJet P1505>
##$DFORMAT= <normdp>
##$LAYOUT= <+/1D_H.xwp>
##$LFORMAT= <normlp>
##$PFORMAT= <normpl>
##$SURQMSG= 1
$$ End of Bruker specific parameters
$$ ---------------------------------
##NTUPLES= NMR SPECTRUM
##VAR_NAME=  FREQUENCY,     SPECTRUM/REAL,   SPECTRUM/IMAG
##SYMBOL=    X,             R,               I
##VAR_TYPE=  INDEPENDENT,   DEPENDENT,       DEPENDENT
##VAR_FORM=  AFFN,          ASDF,            ASDF
##VAR_DIM=   32768,         32768,           32768
##UNITS=     HZ,            ARBITRARY UNITS, ARBITRARY UNITS
##FACTOR=    0.250966925370066, 1,           1
##FIRST=     8223.43324360094, -5278,        87126
##LAST=      0,             -141629,         -11961
##MIN=       0,             -642270,         0
##MAX=       8223.43324360094, 458047652,    0
$$ Real data points
##PAGE= N=1
##DATA TABLE= (X++(R..R)), XYDATA
$$ [...]
19479G6925a21798k73266h2612K6063k30792a3960j02613M1835l36121A680M01894
19468D03574A64868l0472K4536O5687a83690A77546B9022h6103l5471j85045N7376
19457b49243J6505I461J78352C1862J54706a91032C79892c5241D8844b738C3311
19445b50871E2006K4300n720a03642P520j95563D8466J5702a56159O9626A63093
19433d30654J47323G5695j4266a80457C1023J04880m9963l9959a89068b0756O887
19422a3869m9066n7476l4613C31114A45118d95499J90731K2441J1070L7780A38433
19410A56692C8082d05725A9796R8094a54792G9055b7961j17380D1147J56902b50967
19398G7004K4654j117l2701a02858F8175b42534n4060A64172a48449c5582J0264
$$ plain form
19479 76925 -121798 -395064 -82612 -56549 -287341 -13960 -116573 -74738 -410859 1680 403574
19468 403574 164868 134396 158932 224619 -183690 177546 29022 -86103 -121574 -306619 -249243
19457 -249243 -232738 9461 187813 31862 186568 -191032 379892 -35241 48844 -2738 33311
19445 -250871 52006 76306 70586 -103642 -96122 -291685 48466 64168 -156159 -86533 163093
19433 -430654 -283331 75695 61429 -180457 31023 135903 85940 45981 -189068 -20756 -13869
19422 -13869 -62935 -120411 -155024 331114 145118 -495499 -304768 -282327 -271257 -233477 138433
19410 156692 38082 -405725 19796 117890 -154792 79055 -27961 -145341 41147 198049 -250967
19398 77004 101658 100541 67840 -102858 68175 -242534 -296594 164172 -148449 -35582 -25318
19387b5318k50659l3817P7614K074a14299j57708A5955J05249b09236A83639e38607
19375B93382K7707c1042A2591J0244J16349a38172k72633a45266H0017d48339
19364H1457b94817a12708j19883A5464a04862A6646b39834H8846d23038J75182
19354b47856g1395G4763k4595a13596k79940n0989a47147a157k44188M9354A25966
19342a42266a174k84193b9163n5082l29517B45815a46228m9473c7539F3840K2758
19331H6598a6854A56943K65015b26529L2492L3555f8216L1356D6500b55516R305
19320b46211B40723a44771j71829a45972L3245R517j66815R2091k12744a38435
19309E5786a41385O231A16093J72266a37068n5318q7534i3812c9123r3624B6005
$$ plain form
19387 -25318 -275977 -309794 -232180 -230106 -114299 -272007 15955 121204 -209236 183639 -538607
19375 293382 321089 -31042 12591 22835 139184 -138172 -410805 -145266 80017 -448339
19364 81457 -294817 -112708 -232591 15464 -104862 16646 -239834 88846 -423038 -247856
19354 -247856 -71395 74763 50168 -113596 -393536 -444525 -147147 -1157 -245345 -195991 125966
19342 -142266 -1174 -285367 -29163 -84245 -413762 245815 -146228 -195701 -37539 63840 86598
19331 86598 -16854 156943 421958 -226529 -194037 -160482 -68216 -36860 46500 -255516 -246211
19320 -246211 240723 -144771 -316600 -145972 -112727 -103210 -270025 -177934 -390678 -138435
19309 55786 -141385 -135154 116093 288359 -137068 -192386 -279920 -93812 -39123 -132747 26005
19297a32323P249j10873l6206j22990c4973n3722m85599B804P7502a81900i393
19285b00859O2644N859b4596A19153a81684a422q9845A1708Q7314B4107A1344
19273b77769j9657c6975D98b29325e7367A30510c7785r9419O4612j48290E757
19261F2397c21089A51695a12439J387A23059K54558E7106e0508A4769a63885P2978
19250i0907j9045M1641k14552A69301g2492m8856q675A63441a20729d2590k0519
19239f3109J9811m47381a20213b538A74999c98138a62367a4949B3633J78633c8337
19227A88792p3087a63298h669p0932j34534m6261h9348j55749H9022a47819B5105
19215c47185D8676M608c21229a24019O437d7721K3650j98231C04643j30312d2937
$$ plain form
19297 -132323 -125074 -235947 -272153 -395143 -34973 -88695 -574294 2804 80306 -181900 -9393
19285 -200859 -138215 -132356 -24596 119153 -181684 -1422 -91267 11708 99022 24107 11344
19273 -277769 -297426 -36975 498 -229325 -57367 130510 -37785 -137204 -72592 -220882 5757
19261 62397 -321089 151695 -112439 -111052 123059 377617 57106 -50508 14769 -163885 -90907
19250 -90907 -109952 -68311 -282863 169301 -72492 -121348 -130023 163441 -120729 -42590 -63109
19239 -63109 -43298 -490679 -120213 -2538 174999 -398138 -162367 -14949 23633 202266 -38337
19227 188792 115705 -163298 -8669 -79601 -214135 -260396 -89348 -245097 89022 -147819 25105
19215 -347185 48676 53284 -321229 -124019 -117582 -47721 -24071 -222302 304643 174331 -42937
19203b8189A4045P4118R1008d50149G2726a8792I6514b0708A0620c60413J56371
19192b04042C4361a81034A59569B2968K5682K8117P3531a6257F7106J49559d0213
19180I6868J6555B2688d9095j40708J8555K9649B9927e51653a42086K0842D3789
19168A10373l6607A0375N5795a5449r1633l79044d63B08860i920A45938B0872
19156B28356p088O6064b55656b7595A55929a78881B27421c90095A83154C2776
19145h8453p2459F3870B1862c78494f9126A79609c56990A27304M5297b19134P4103
19134a45031I8556B8027d67763G4172a30102l7809k22980i9128k28165J60717
19124a66576D8322a62887C47991b34212A02749g7300j37124h5208G4684a33417
$$ plain form
19203 -28189 14045 88163 179171 -450149 72726 -18792 96514 -20708 10620 -360413 -204042
19192 -204042 34361 -181034 159569 22968 48650 76767 150298 -16257 67106 216665 -40213
19180 96868 113423 22688 -49095 -189803 -171248 -141599 29927 -551653 -142086 -121244 43789
19168 110373 73766 10375 66170 -15449 -107082 -486126 -463 208860 -9920 145938 20872
19156 228356 221268 287332 -255656 -27595 155929 -178881 227421 -390095 183154 32776
19145 -88453 -160912 63870 21862 -378494 -69126 179609 -356990 127304 172601 -219134 -145031
19134 -145031 98556 28027 -467763 74172 -130102 -167911 -390891 -99128 -327293 -166576
19124 -166576 48322 -162887 347991 -234212 102749 -77300 -214424 -85208 74684 -133417
19113C0965M1410a60704A68365b7961C7820j5075k420a55602G0146a25641j60226
19102b85867k39924a59204B79966a3783k78066F2747d5717A87427b08800p3348
19092b82148B87032a89434r1999a01236M1397m9757k16601B94307c4063A05227
19081b15297B9146e275R98l9208p8988A84044b5026q4706k8305K3390A19109J6565
19069A35674J8848F9479e11590J57117E2015d9268J0287R490j16087I2001c94683
19057C2278c04746h0696B42930a24473J0255C2887N2378c2872A08293Q7284a51872
19045A76152m6513a82162A9825c8850J2278p9903B70191b90460F6706b8386B85201
19033b6062j77477I5120A8398J14810c6596p6789B18090A08614C0062a63291e6904
$$ plain form
19113 30965 72375 -160704 168365 -27961 37820 22745 20325 -155602 70146 -125641 -285867
19102 -285867 -525791 -159204 279966 -13783 -291849 62747 -45717 187427 -208800 -282148
19092 -282148 287032 -189434 -281433 -101236 -59839 -109596 -326197 294307 -34063 105227
19081 -215297 29146 -5275 -4277 -43485 -122473 184044 -25026 -109732 -138037 -114647 119109 135674
19069 135674 154522 69479 -511590 -354473 52015 -49268 -38981 -29491 -145578 92001 -394683
19057 32278 -304746 -80696 242930 -124473 -114218 32887 85265 -32872 108293 195577 -151872
19045 176152 129639 -182162 19825 -38850 -26572 -106475 270191 -290460 66706 -28386 285201
19033 -26062 -203539 95120 18398 133208 -36596 -113385 218090 108614 30062 -163291 -56904
19021A06472g266p1538G739J34499e5451a1782B16952c5467o5709k23389f9123
19009a10963A38496a51506a9616q6244p4204C906i7489A92199J92357D7366b26299
18997a11372I1375g2480m97965a73152O7489D09469b43979P3555B16694K01372
18987D18066b17390D4149a1023A36393I575P443a57311a2413k86302A33485a41157
18975f3961j55975B58642b65909D37227A74153M10715j06145j72446a08081M8849
18965e9232B93339a06190B68874a55226k8115k06372a43144d9745k58217F3718
18954A91637D139f4076k08169d6654G9230b389j17157B9490A4498b34502r2798
18943c27300A98937a65272A97256g5766q7198C0216J17524b93727k0194A15202
$$ plain form
19021 106472 -7266 -78804 7739 142238 -55451 -11782 216952 -35467 -101176 -324565 -69123
19009 -110963 138496 -151506 -19616 -105860 -180064 3906 -97489 192199 384556 47366 -226299
18997 -111372 91375 -72480 -570445 -173152 -105663 409469 -243979 -170424 216694 418066
18987 418066 -217390 44149 -11023 136393 9575 17018 -157311 -12413 -298715 133485 -141157
18975 -63961 -219936 258642 -265909 437227 174153 584868 478723 306277 -108081 -59232
18965 -59232 293339 -106190 268874 -155226 -183341 -389713 -143144 -49745 -307962 63718
18954 191637 4139 -64076 -272245 -46654 79230 -2389 -119546 29490 14498 -234502 -327300
18943 -327300 198937 -165272 197256 -75766 -162964 30216 147740 -293727 -313921 115202
18932a30137C14845a13707q8722k9919d5146j80908b887j45619e5661A17541a31245
18920D7012a49440E2495j4834i6253J9651K6532D5737J947Q0463D9371b02610
18908e6814B79696J02854J48863k50720e0551A80527g4776J0657I7491P4035B6536
18896C11703A55750g2035B52548a99659r107f3079j05300A19556B0449d0860k78025
18885c18885A61511K1656d8103j51309Q8763k08071L2074F166a40600j10341P5476
18874a75465D0930a41713c6680m7788D7046M6813A115c00300e7575j59790H7751
18862b20638Q4480j8686J3395k66782I2824a38045I9741a56777j44869h0424B80816
18850B7718J5136P4993R0245f5549A32380e7430a3072B84392B5431a90723G7123
$$ plain form
18932 -130137 314845 -113707 -202429 -232348 -45146 -226054 -2887 -148506 -55661 117541 -131245
18920 47012 -149440 52495 37661 -96253 -76602 -50070 45737 47684 128147 49371 -202610
18908 -56814 279696 382550 531413 280693 -50551 180527 -74776 -64119 97491 171526 26536
18896 311703 155750 -72035 252548 -199659 -208766 -63079 -168379 119556 20449 -40860 -318885
18885 -318885 161511 183167 -48103 -199412 -110649 -318720 -286646 6166 -140600 -250941 -175465
18874 -175465 40930 -141713 -36680 -84468 47046 93859 1115 -300300 -57575 -217365 87751
18862 -220638 -136158 -154844 -141449 -408231 92824 -138045 99741 -156777 -301646 -80424 280816
18850 27718 42854 117847 208092 -65549 132380 -57430 -13072 284392 25431 -190723 77123
18838F035d135A05709b85252h5316A97085d3997j07171C6407J81111c0666H031
18826a26976b6776n5599D6404K17016o8262H6388P1492n193p4311J05442i6867
18814A23639a26615j01951E40N435O8187J40680a1191k57601B62722d0250R545
18803c0705j51625k02214a5353l25098h2942A73176b20143d7277k30228D572N4228
18792E8800b46155f4569j62416i4220E4198g7134j69873G3725a103A07205K91466
18781C98671a18260A34465a6803A65223a87715F1555J20304d95850b05399I4602
18770C66037A34863f230o0907A58349h1439d521A23774e0774J8237l5350A00011
18758A72071O132E9419B0154a97223c6098j57546A74384R733a91980H4695d2597
$$ plain form
18838 6035 -4135 105709 -285252 -85316 197085 -43997 -151168 36407 217518 -30666 8031
18826 -126976 -26776 -82375 46404 263420 195158 86388 157880 152687 78376 183818 -96867
18814 123639 -126615 -228566 540 5975 74162 214842 -11191 -268792 262722 -40250 -30705
18803 -30705 -182330 -384544 -15353 -340451 -82942 173176 -220143 -47277 -277505 4572 58800
18792 58800 -246155 -64569 -226985 -94220 54198 -77134 -247007 73725 -1103 107205 398671
18781 398671 -118260 134465 -16803 165223 -187715 61555 181859 -495850 -205399 94602
18770 366037 134863 -6230 -67137 158349 -81439 -4521 123774 -50774 -32537 -67887 100011
18758 172071 178203 59419 20154 -197223 -36098 -193644 174384 184117 -191980 84695 -42597
18746B29823o9556A2893L0620K75513E7012b26140A81989a52132B8198d40421
18735B9961n565b26722k0210h2255A39128a95241A98085a95122d0459j01878e5259
18723B1714c68569B4881a16732o1796A58656c45894i919j79514I1766N6925m9655
18712I9036a3544j80233M0272L2139n4319q394A0654a44490j31716L7565a7647
18700f07996b55744J10174B1476b90501A50112b88147J39194k2341C40918d5191
18689b99127A28038J1259d6634j27613c6536j90191N571P6688l7230A68473a74753
18677B95712G9677b11167l9543a17029D139a70113B06716c35913a66880k8146
18667a95026A85828f8885A7997a79158A50557a35258k53287P9818a12611A1102
$$ plain form
18746 229823 160267 12893 43513 319026 57012 -226140 181989 -152132 28198 -440421
18735 29961 24396 -226722 -246932 -82255 139128 -195241 198085 -195122 -40459 -142337 -55259
18723 21714 -368569 24881 -116732 -178528 158656 -345894 -9919 -189433 91766 148691 99036
18712 99036 -13544 -193777 -153505 -121366 -175685 -184079 10654 -144490 -276206 -238641 -17647
18700 -607996 -255744 -145570 21476 -290501 150112 -288147 -148953 -171294 340918 -45191
18689 -299127 128038 139297 -46634 -174247 -36536 -226727 -221156 -144468 -181698 168473 -174753
18677 295712 79677 -211167 -250710 -117029 4139 -170113 206716 -335913 -166880 -195026
18667 -195026 185828 -68885 17997 -179158 150557 -135258 -388545 -308727 -112611 11102
18656b59149Q1419D0572a97795P3637D3395p631a85180a1160k49559I0545b4503
18644d3625k24733a29629k5432a0732l9312j5128D42142a60937q1614n040A16631
18632F5274c52983a74174h2718L6712j13933B63146j31417a55121L0804b2598
18621A08097f1788m2125I8359c5572l52287B96596g9224j99838J35462l94889
18611e38489H7668b48784A76966H5993A8738a68292N4657p1114B12114a42548
18600B28719j10747b47377A11401Q7271a65149E1204A9216h3942P707A9847P7606
18589I7453c71900A30628a69756J0104j33698j18711B52048C7128J29412e5481
18578f6577F6532c09380A0845b32500A65634h505j05686j25880A5285L33952A57775
$$ plain form
18656 -259149 -177730 40572 -197795 -124158 43395 35764 -185180 -11160 -260719 90545 -24503
18644 -43625 -268358 -129629 -155061 -10732 -50044 -65172 442142 -160937 -242551 -247591 116631
18632 65274 -352983 -174174 -82718 -46006 -159939 263146 131729 -155121 -124317 -22598
18621 108097 -61788 -103913 98359 -35572 -387859 296596 -79224 -279062 -143600 -538489
18611 -538489 87668 -248784 176966 85993 18738 -168292 -113635 -184749 212114 -142548
18600 228719 117972 -247377 111401 198672 -165149 51204 19216 -83942 -76235 19847 97453
18589 97453 -371900 130628 -169756 -159652 -293350 -412061 252048 37128 166540 -55481
18578 -66577 66532 -309380 10845 -232500 165634 -8505 -114191 -240071 15285 349237 157775
18566a31842k5434n4474Q7459F540c15524e468j22642B64841a30257J0967k6917
18555a46207M0881k0986I9140b69029A44089L174c69832I766M77650E7430b68135
18543E6648e0687j13221o9672M1440r0543o3405K2418h6956G9912l5266b12470
18531B52749p7841E6704i9175D3836e0773C54176a48903a7485j8034n2086b3981
18519D48861a07207N2589B21698g0264A85891F7624A6405J2072B79b986k32982
18508b35968i1364A18716n6308J0916h061A22903j2705n4010J10262b35947C16210
18496b86389I9445C7382b8992k01626i8681A36881c37909a39652a3174k69923
18486b83097J20902j69799I0083k8842a22119j76676i9641B69401p1604b28837
$$ plain form
18566 -131842 -157276 -211750 -124291 6540 -315524 -5468 -128110 264841 -130257 -119290 -146207
18555 -146207 -105326 -126312 99140 -269029 144089 147263 -369832 9766 487416 57430 -268135
18543 56648 -50687 -163908 -233580 -192140 -282683 -346088 -323670 -86956 79912 44646 -212470
18531 252749 174908 56704 -99175 43836 -50773 354176 -148903 -17485 -35519 -87605 -23981
18519 448861 -107207 -54618 221698 -70264 185891 67624 16405 28477 279 -2986 -235968
18508 -235968 -91364 118716 62408 73324 -8061 122903 110198 56188 166450 -235947 316210
18496 -286389 99445 37382 -28992 -230618 -98681 136881 -337909 -139652 -13174 -283097
18486 -283097 -162195 -331994 90083 61241 -122119 -298795 -99641 269401 197797 -228837
18475a70824M6003D4452i0013l5830J5999G7738b54164Q6312c4116l5571I3617
18463h4393k5195A59478c61971I5095l9485Q4476a48173A80557f079j94552L2381
18452a68250B8965P6459a90339g2999C8394J60193c16190A44595P1638b23407
18441a69283k7319P4166o755j38748F0205a35647l8335E0713a59367I9659a25219
18429B83327a63434J1047B8020h424A65781d29050B8631a65311M875m1289A65594
18417i6749q3943b9616A3942R3639a32160A81858A7428a94857b5664j00547n1358
18406a77569f717m30A88582c05152d1185A1529J23773d5383A12694a6005C81426
18394h4601a5529p1219B83823d0093C7664c0975k54160A69188L6072b38859E6960
$$ plain form
18475 -170824 -124821 44452 -90013 -125843 -109844 77738 -254164 -167852 -34116 -69687 93617
18463 -84393 -109588 159478 -361971 95095 55610 140086 -148173 180557 -6079 -200631 -168250
18452 -168250 28965 105424 -190339 -72999 38394 198587 -316190 144595 216233 -223407
18441 -169283 -196602 -122436 -129191 -267939 60205 -135647 -173982 50713 -159367 99659 -125219
18429 283327 -163434 -152387 28020 -8424 165781 -429050 28631 -165311 -160436 -201725 165594
18417 -96749 -180692 -29616 13942 107581 -132160 181858 17428 -194857 -25664 -126211 -177569
18406 -177569 -6717 -7147 188582 -305152 -41185 11529 135302 -45383 112694 -16005 381426
18394 -84601 -15529 -86748 283823 -40093 37664 -30975 -285135 169188 205260 -238859 56960
18382A91445A9344R6810d79803J18887O1032C73635a64952D4631J9215M6946m8792
18371F2000a63837G5870a99261B17582b74670a26060L4217I3700b5229m8375m05853
18360d79457g6061A51513B0644J33714c7905A75360E1552A3555a90123h8175b9262
18348f6884A7057c6345G5464M6804n8520e7129J6977j95298d1461J8385A82837
18336b14592Q803A40006N5689M9411C9352a64136J2027m6174h8925J3864j81061
18325b56122g8774m0351J9378l50446f7471F4007L479P9554b35704j08833a003
18313A28014a88734B75565j30203C9756q109a66724M2312B10109l6799Q4527A0242
18301f0760A18574m5263b7325B48876f4015B19552a09451L3744I6847a58947A48477
$$ plain form
18382 191445 19344 116154 -479803 -360916 -299884 373635 -164952 44631 63846 110792 62000
18371 62000 -163837 75870 -199261 217582 -274670 -126060 -91843 93700 -25229 -73604 -479457
18360 -479457 -76061 151513 20644 154358 -37905 175360 51552 13555 -190123 -88175 -29262
18348 -66884 17057 -36345 75464 122268 63748 -57129 -40152 -235450 -41461 -23076 182837
18336 -214592 -205789 140006 195695 245106 39352 -164136 -152109 -198283 -88925 -75061 -256122
18325 -256122 -78774 -119125 -99747 -450193 -67471 64007 67486 147040 -235704 -344537 -1003
18313 128014 -188734 275565 145362 39756 31647 -166724 -124412 210109 173310 257837 10242
18301 -60760 118574 73311 -27325 248876 -64015 219552 -109451 -75707 96847 -158947 148477
18289a34666l354b300D1841a06167A45484A7273c02073A97472c32930a61789K255
18278a59534D2666M3635b34731B59390d05771f6951k92556j22873k8643B29603
18267B06469I4040A6163a57872E5139f5770F2114h3975G5501e8547B90516e3057
18255c66223A7548M3943h8352D057a52080q997d3592e957k12846L8826Q2342A37685
18242a92072A04294b10960A11487j5761p134A6653J29553f1817o556m7594A38953
18230a65857A87825a38250O4361j70840K4571h374A14456L0307a06418b0140A13056
18218C0920b3768C954b88754D9665b02433A20747f8963E55870e0157C3104a53041
18206e3464D0084g2396H4899b3547E1509J09521L0612B1320a66230j17141a11705
$$ plain form
18289 -134666 -138020 -2300 41841 -106167 145484 17273 -302073 197472 -332930 -161789 -159534
18278 -159534 42666 86301 -234731 259390 -405771 -66951 -359507 -482380 -511023 229603
18267 206469 94040 16163 -157872 55139 -65770 62114 -83975 75501 -58547 290516 -53057
18255 -366223 17548 61491 -88352 4057 -152080 -161077 -43592 -5957 -218803 -179977 -97635 137685
18242 -192072 104294 -210960 111487 95726 88592 16653 146206 -61817 -68373 -115967 138953
18230 -165857 187825 -138250 -73889 -244729 -220158 -8374 114456 144763 -106418 -20140 113056
18218 30920 -23768 3954 -288754 49665 -202433 120747 -68963 555870 -50157 33104 -153041
18206 -53464 40084 -72396 84899 -23547 51509 161030 191642 21320 -166230 -283371 -111705
18194i1303F2065k4523K1010J0341L7026d2466j0350E1932K1358b5476A77457
18182e16746A43819b57146I4180i0519k8642B7670E757i0593A54205F8637C3787
18170e8434j52229n8289a23423I5208a87446m9389A05412K43177d5824o2503C8623
18158B84486a93417A15399Q1156o4604b96001I8532a20865D0311a13498G5107
18147a79331E68393j11313h5959j79750A15483l5436J04482f3107J936H1582f5210
18135g2733A6885L7328i0328A72089q5940B9902a34942A32745f866C93578b15809
18123H3240d6483K404G4233K5208g8116j91897g5202A30732E6809a06010A75690
18111A72879a45765N6324A88160a85961C24310j40677c39312J67382l7592N9351
$$ plain form
18194 -91303 62065 37542 58552 68893 105919 -42466 -52816 51932 73290 -25476 177457
18182 -516746 143819 -257146 94180 -90519 -119161 27670 5757 -90593 154205 68637 33787
18170 -58434 -210663 -268952 -123423 95208 -187446 -236835 105412 348589 -45824 -108327 38623
18158 284486 -193417 115399 196555 131951 -296001 98532 -120865 40311 -113498 75107
18147 -179331 568393 457080 -85959 -265709 115483 80047 184529 -63107 -61171 81582 -65210
18135 -72733 16885 54213 -90328 172089 86149 29902 -134942 132745 -6866 393578 -215809
18123 83240 -46483 -44079 74233 99441 -78116 -270013 -75202 130732 56809 -106010 175690
18111 172879 -145765 -89441 188160 -185961 324310 183633 -339312 -171930 -209522 -150171
18101a50171m8355f5013b1330C5657J07721a88732J5190G32O0392L55591A53369
18089C8224b5784l3431D5435R9165Q3104j11139g0860H3993a26030d991l4884
18078c9875j22119P6820D971J13159J78663i7161c2645A24594l3709P3768O535
18067A71188m2548G635a00611G830L5419b22920n851H8970d18995H5476a53999
18055a40783B68087G6680i4637J0579r6096b6921j3862A18007L919C2667Q842
18044D1509c06671h5178F0248c1221i290F2591B3648b260A44650a14748E9649
18032D8268a84331f0579a6051A73108h699j15109M7439j36440j04854J10752j23310
18021c30221B63699c8612A01913P813b80587J14492H6521L03809A42655D3367
$$ plain form
18101 -150171 -198526 -65013 -21330 35657 143378 -188732 -173542 732 61124 416715 153369
18089 38224 -25784 -59215 45435 144600 227704 116565 -70860 83993 -126030 -4991 -39875
18078 -39875 -161994 -85174 4971 118130 296793 -97161 -32645 124594 90885 164653 171188
18067 171188 128640 7635 -100611 7830 43249 -222920 -228771 88970 -418995 85476 -153999
18055 -140783 268087 76680 -94637 -84058 -180154 -26921 -40783 118007 121926 32667 41509
18044 41509 -306671 -85178 60248 -31221 -9290 62591 23648 -2260 144650 -114748 59649
18032 48268 -184331 -60579 -16051 173108 -8699 -123808 -76369 -212809 -317663 -206911 -330221
18021 -330221 263699 -38612 101913 109726 -280587 -166095 86521 390330 142655 43367
18010a1577A46629b02815e7694K0262B9135N1238b54700C84194A0952e6670j46993
17999b03663l6307F4391K14889A03429L59296a34258K3057h537j07244A03985
17988f1775k34669h4313H437K01974o3716o1044a8433m1483j18427A94031k0992
17977A73039b2007j4730j15651d6975l36399g1051B84880p5857C6139K76424a12683
17965a76746B4092J95829j03397J98709K5469a59892I6458J95202A2560J72721
17955A85281I0869L2670J24075a33653A64063c66382C93732E0365K09349b89932
17944B25286a30705e4313j35077a087B48533a66405A85409c7478E6227g3017A38204
17932H2844R8427i2900l3046B01388h9855I39d0152p2824J0174A88962a04024
$$ plain form
18010 -11577 146629 -202815 -57694 -37432 29135 80373 -254700 384194 10952 -56670 -203663
17999 -203663 -239970 64391 279280 103429 462725 -134258 -111201 -8537 -115781 103985
17988 -61775 -296444 -84313 8437 210411 146695 85651 -18433 -59916 -178343 194031 173039
17977 173039 -22007 -36737 -152388 -46975 -383374 -71051 284880 209023 36139 312563 -112683
17965 -176746 24092 219921 116524 315233 340702 -159892 96458 291660 12560 185281
17955 185281 90869 123539 247614 -133653 164063 -366382 393732 50365 259714 -289932
17944 225286 -130705 -54313 -189390 -1087 248533 -166405 185409 -37478 56227 -73017 138204
17932 82844 181271 -92900 -125946 201388 -89855 939 -40152 -112976 -102802 188962 -104024
17920f9788j27006b4581B56293F8866O8439b43657I7683d1401C7793J74538a54027
17908A4723C052a83639C872a7721j18664A21809h8894B28563m8387c2128B11663
17896c17561a14762d3812n1971A49458h7266A35730j209R3766C1705e1037A84168
17884a46131c7124G0000g0991j22077C50465A9693b58627N9179B90252b81291
17873A06489L3191A0865a8893n3844o80A51794c5006C9490a71132B10272J36219
17862C46491A38399K9322a60138B80206j03747l9750E7343A9648a00692j59852
17852b60544M0595D1560L6658J35703a02954B79676b98005A29715a48194b5824
17841B95795A21927N7421d6049D5040c5403D7927J16554j3463m0526J09316R8891
$$ plain form
17920 -69788 -196794 -24581 256293 68866 137305 -243657 97683 -41401 37793 212331 -154027
17908 14723 3052 -183639 3872 -17721 -136385 121809 -88894 228563 180176 -32128 211663
17896 -317561 -114762 -43812 -95783 149458 -87266 135730 134521 228287 31705 -51037 184168
17884 -146131 -37124 70000 -70991 -193068 350465 19693 -258627 -199448 290252 -281291
17873 106489 139680 10865 -18893 -72737 -73417 151794 -35006 39490 -171132 210272 346491
17862 346491 138399 167721 -160138 280206 176459 136709 57343 19648 -100692 -260544
17852 -260544 -219949 41560 78218 213921 -102954 279676 -298005 129715 -148194 -25824
17841 295795 121927 179348 -46049 45040 -35403 47927 164481 151018 110492 219808 318699
17830C18699b844B4175b3527A33248E2254e7033B76159d4855m403j09563L9227
17819a19594A63872G2515J45499A9288J70503a24462E83M98704g651B00000b1930
17807B7529a47143C3930L79819j78230A12478J55676A00701K8289a32916N3408
17797g9508A53958e0314B35764O8627A26264e1640B50697O0766B9211J41227m9969
17786A20469a17874G2320O3246m5126J6396J37816e6824r3921A19562j4633b23909
17774a50794a6625k187B75509A27180a0488A48289B4761J5684K79896e3007m9079
17763a02086B01351a37566B34502b41702E1418M16379f04819A29457d4571F5434
17752A24955c6525H7691R4891H2802C9506K03725J62991b7714A09534K16137f3260
$$ plain form
17830 318699 -2844 24175 -23527 133248 52254 -57033 276159 -44855 -49258 -158821 -119594
17819 -119594 163872 72515 218014 19288 189791 -124462 583 499287 -7651 200000 -21930
17807 27529 -147143 33930 413749 235519 112478 268154 100701 128990 -132916 -79508
17797 -79508 153958 -50314 235764 304391 126264 -51640 250697 311463 29211 170438 120469
17786 120469 -117874 72320 135566 90440 106836 244652 -56824 -150745 119562 104929 -223909
17774 -150794 -16625 -18812 275509 127180 -10488 148289 24761 40445 320341 -53007 -102086
17763 -102086 201351 -137566 234502 -241702 51418 467797 -604819 129457 -44571 65434
17752 124955 -36525 87691 182582 82802 39506 243231 406222 -27714 109534 325671 -63260
17740E1521J88105f7142A26032J19868B4151K06868K47205E7148K18412m0323
17730B35237F551M5461J96649b0497B6234i8773A85921o7840P1413B289K79747
17719B82036o6688N0967C4881d3430A38860L8480J52045B8436J51043H5795J22821
17708B08616N4000b55426F4591K48877I1315A1026a28970A79411J27964A17564
17697b03728A47403L0262a32779N4283B03899h2967A49345A6014b89400A54292
17686a55699A60110G4114B631c4371j39526D36359j33923j18991a9628B83117
17675C82104G3523a5416j832B0187N9289L04091A45128K34655b39781h5369L2918
17664e2451p011C14328j03833C1827b01310d8666G3290h8392q067B6592L83041
$$ plain form
17740 51521 239626 -67142 126032 245900 24151 231019 478224 57148 275560 235237
17730 235237 6551 52012 248661 -20497 26234 -98773 185921 118081 189494 2289 282036
17719 282036 215348 266315 34881 -43430 138860 177340 329385 28436 179479 85795 208616
17708 208616 262616 -255426 64591 313468 91315 11026 -128970 179411 307375 117564
17697 -203728 147403 177665 -132779 -78496 203899 -82967 149345 16014 -289400 154292
17686 -155699 160110 74114 2631 -34371 -173897 436359 302436 183445 -19628 283117
17675 382104 73523 -15416 -17248 20187 79476 383567 145128 379783 -239781 -85369 -52451
17664 -52451 -59462 314328 210495 31827 -201310 -48666 73290 -88392 -96459 26592 409633
17653D09633A26885g1609C7429J54812d9117D3527J33147n5398J28485p3547H4657
17641C64996D1583K84198I5310J73441a29419B66718l7890J42447b20344A77451
17630A48601J43578j29744p044J13360C0513J17512K37021E7602k7932J29353
17620A59023P530N9595a6286B28341J58788j46944g0108A93825J75261h5783D106
17608a6589C02021J14423a06497m547L7980D62721H9415k9191b63011f5941C10331
17596A93674e8529G6778J05517m3766J05546H7621P772M6789K8455o3001C9060
17584D38716D0567a82791P5667B34455b3299D11795A78591a28625B63175j14639
17574A48536C3922M9049c6755G5148d9965o0670A39992J3578D7580J12379e032
$$ plain form
17653 409633 126885 -71609 37429 192241 -49117 43527 176674 121276 249761 176214 84657
17641 364996 41583 325781 95310 268751 -129419 266718 228828 371275 -220344 177451
17630 148601 292179 162435 155391 268751 30513 148025 385046 57602 29670 159023
17620 159023 166553 226148 -16286 228341 387129 240185 -70108 193825 369086 -85783 4106
17608 -16589 302021 416444 -106497 -111044 -73064 462721 89415 60224 -263011 -65941 310331
17596 193674 -58529 76778 182295 138529 244075 87621 95393 142182 170637 107636 39060
17584 438716 40567 -182791 -107124 234455 -23299 411795 178591 -128625 263175 148536
17574 148536 33922 82971 -36755 75148 -49965 -110635 139992 153570 47580 159959 -5032
17562D54553A23533K79602A21575J37223f3316A98637n4178R4636K0382A19221
17551D42148n1118A56103K60953G8739j241L46448j92978L5328q3569H8087K24755
17540C12842A44978J36249J42562j75967R3745p9478m6718M8633J64040A66416
17529B77959L2542J17603J72292q5733K86154L36950N0750l16211k32531J72184
17519H11959j88102K66830k98106A39325F4517M82328k2998j0570L21586K36315
17509A071178L98756n59526K99112k73277l21056j46909o8748O5833j29064j49778
17499A86521K77712k31789J16903J40797j2280j52114k8430J71096A63177R1886
17489B55063p9601O8066O9530e2176J0495B99712J33230B5422J23094K5301J18392
$$ plain form
17562 454553 123533 403135 121575 258798 -63316 198637 144459 239095 259477 119221
17551 442148 391030 156103 417056 78739 77498 423946 230968 266296 182727 88087 312842
17540 312842 144978 281227 423789 247822 341567 262089 215371 264004 428044 166416
17529 277959 310501 428104 600396 514663 800817 1137767 1188517 872306 639775 811959
17519 811959 623857 890687 592581 139325 64517 546845 523847 513277 834863 1071178
17509 1071178 1469934 910408 1209520 936243 615187 468278 399530 465363 336299 186521
17499 186521 464233 232444 349347 490144 477864 325750 297320 468416 163177 255063
17489 255063 175462 243528 313058 -52176 -41681 299712 432942 25422 148516 173817 292209
17478B92209J42933J092M0042a57124B83823K97703B41520j19870J49200C9834
17467A21355L12751A8803L20101r5506j3099L33336B45627j6624q280n1373M04902
17456E74252B42487K71386j64370A40283j4950L68861A38966L1304N5570J25453
17446C51293k4410n3028K54113j96893J40481q4372R970L49653B20281L67012
17436E87293j74075c8843D42313j43413L02123A30063L60603A90671A1090K61103
17426B72193A34604N1767n979K81217A27944J93425L71463l13660j88474B983
17415G47134A80289L32738j67871M3849A41912M94175k94257n5890F8547J87501
17405B56048K18137D8993J73281J4294A02636K26487q3680J17066A46196Q0234
$$ plain form
17478 292209 435142 436234 476276 -157124 283823 581526 241520 121650 270850 39834
17467 121355 434106 18803 338904 243398 230299 563635 245627 229003 220723 169350 574252
17456 574252 242487 513873 349503 140283 125333 494194 138966 170270 225840 351293
17446 351293 326883 273855 527968 331075 471556 387184 397154 746807 220281 587293
17436 587293 413218 -38843 442313 298900 601023 130063 490666 190671 11090 272193
17426 272193 134604 186371 180392 461609 127944 321369 692832 379172 190698 2983
17415 747134 180289 513027 345156 389005 141912 636087 341830 285940 68547 256048
17405 256048 474185 48993 222274 236568 102636 329123 245443 362509 146196 226430
17395B26430P7041L01750k78392A62747K56992c4853D41679l6174j71004j454
17385B33047J9125k9129G9575K29749j6131k6363p7003l7957l1385K05015A36797
17373C78543l9808G0120K66147j59460R7614R6452J19138o8556j09396j31976
17363A80083Q9417p9243K45939A06643M79150Q028i8816C55663q6916o1360K84688
17352D92075C8688e1877G6480J26142p3074A274N57727A08093J24713A07722N8628
17341A66350m1513K73280A47351J39036L4265J08898j71417i815D86360r6194
17331C90166A68576n2944k0617j5139M68051A73002K67609J07443j85976I1186
17320D04374m8335R989e4872D24615J27818B60000l3632J13511q6926q3833L56201
$$ plain form
17395 226430 303471 605221 326829 162747 419739 -34853 441679 405505 234501 233047
17385 233047 252172 223043 79575 309324 293193 266830 189827 151870 120485 325500 136797
17373 378543 338735 70120 336267 176807 274421 370873 490011 421455 312059 180083
17363 180083 269500 190257 436196 106643 585793 593821 -98816 355663 268747 207387 492075
17352 492075 38688 -51877 76480 202622 129548 1274 559001 108093 232806 107722 166350
17341 166350 124837 398117 147351 286387 320652 429550 258133 -9815 486360 390166
17331 390166 168576 115632 95015 79876 547927 173002 440611 548054 362078 91186
17320 404374 356039 366028 -54872 424615 552433 260000 226368 339879 252953 169120 525321
17309E25321H0188J43987I0831J68651N5117o1327A21207K83507J8718R3775d3400
17297C14279L1283J92384j43289r8359j41395A3107M96631B50745J14677n6765
17287C08657A20231J91703q2256J08846K13417B14278J87847H8525K93567l318
17277C78774H7700K79537o8980n0960I1480J76552r9978J5891J46969O1769j48261
17266B44422J74656j50828K90056J088k35758Q682a22344B89463j11298L94826
17256E72991k84404J61601n0112J02080l4249q9998r1507J58242m7977L66234
17246G62901C54932N2292Q3485k44724L21216B68300J20061L8258N5476P6900
17236E58995B18037K17439P7061n716i9515D49850J33854B19692O6032K59413
$$ plain form
17309 525321 80188 224175 90831 259482 314599 253272 121207 404714 423432 517207 -43400
17297 314279 345562 537946 394657 296298 154903 13107 509738 250745 365422 308657
17287 308657 120231 311934 229678 338524 551941 214278 402125 88525 382092 378774
17277 378774 87700 367237 298257 247297 91480 268032 168054 183945 330914 392683 244422
17266 244422 419078 268250 558306 559394 323636 332318 -122344 289463 178165 572991
17256 572991 288587 450188 400076 502156 467907 377909 286402 444644 396667 762901
17246 762901 354932 407224 490709 245985 567201 268300 388361 426619 482095 558995
17236 558995 218037 435476 512537 506821 -99515 449850 583704 219692 285724 545137
17226E45137N686l8605B18343K17417H4888L13347j55534b6061H14895B42091
17215I3608M99927o0293j58215K00696N8978j13642q530A03458K04701K81196
17205E89355j77490A77889K65353K40718B94382J31261P137J13045j65037K5230
17195D06018q1844K59055k51808P8902p0511p6049o5539K04151J59709J04154
17185F66238A04157N31906k78675j62949L41280A70091J57120J74565j53167M8206
17175C96815N0921j22042L86074q5893H7920L52687M0724J86881K4713r151K5
17164F83799B52948M0279N7101M3289L09956j18936J36892n9306n742j80841J50320
17153F25960L76114C97289j2660M50150k19958j69005L13853j9024k98290K4078
$$ plain form
17226 545137 550823 512218 218343 435760 84888 398235 242701 -26061 814895 242091
17215 93608 593535 533242 375027 575723 634701 521059 512529 103458 308159 589355
17205 589355 411865 177889 443242 683960 294382 425643 432780 545825 380788 406018
17195 406018 324174 583229 331421 410323 339812 263763 198224 402375 562084 666238
17185 666238 104157 636063 357388 194439 535719 170091 327211 501776 348609 396815
17175 396815 447736 325694 711768 625875 87920 440607 481331 668212 692925 683774 683799
17164 683799 252948 293227 350328 393617 703573 584637 721529 662223 656481 475640 625960
17153 625960 1002074 397289 384629 834779 614821 445816 759669 740645 442355 466433
17143D66433M25852m27567M19783m10068l3197L21124C31497J97306J9494p1707
17133D76590M17058l37476p2210j63043N29470k63924J09824B96628J94800R6049
17123E87477R6105P4387k2075K45551C57167J62628m6398L516r6499M794K73669
17112F58877P4213k94055N3656J84085l37258J84818J9334P3601P6087K1666Q434
17101G23458p3611M1549j60936J7002L34791n5120j41823k3739q7341K56918j42679
17090F88469M7115l32360K93028K8193j31890Q7349p0251K06606P8826K57495
17080A152580l13680j37153L5775n5699M3289J63224D24143N54836m2119l21721
17070F15139l3125L26746l5385j82795L8178O7843M3777j12731K3174j34201J88759
$$ plain form
17143 466433 892285 464718 884501 474433 441236 762360 331497 528803 548297 476590
17133 476590 893648 556172 483962 320919 850389 586465 696289 296628 491428 587477
17123 587477 683582 757969 735894 981445 357167 519795 473397 476913 380414 385208 658877
17112 658877 733090 439035 492691 676776 339518 524336 543670 617271 693358 715024 723458
17101 723458 649847 691396 530460 547462 882253 827133 685310 661571 574230 831148 688469
17090 688469 735584 403224 696252 724445 592555 679904 609653 816259 895085 1152580
17080 1152580 838900 701747 737522 681823 725112 888336 424143 978979 936860 615139
17070 615139 582014 908760 873375 690580 728758 796601 840378 727647 750821 616620 805379
17059H05379q4941P9220N25923o49045K80531j24158k01093K48627J59834D97373
17048I60345j47028n6567J99903n7470J96368j27924O6834l83404J79346j20680
17038G09723J10254K35399j07649r1289M3534m6054N13813k02660n4158j90138
17028I20775K21718l68867J57229K66421k1410n48065K82323L29455J63048l75757
17018A026870q4353L04155j34612k07408j99262J03556L07305j37720K68265L68746
17008A615542l48578J3984J46898M3176l93237J92428l90712K92687m8322k4757
16998A099109L1106L07521k50020M2896K79195r3976j8587l5822j50696j103K95385
16987A505008L001j13557j50398M20178k89241J68098p2269J38786j39488j88559
$$ plain form
17059 805379 720438 799658 1325581 676536 957067 832909 631816 880443 1040277 497373
17048 960345 813317 756750 956653 899183 1095551 967627 1034461 651057 830403 709723
17038 709723 819977 1055376 947727 856438 899972 853918 1367731 1165071 1110913 920775
17028 920775 1142493 773626 930855 1197276 1175866 627801 910124 1239579 1402627 1026870
17018 1026870 942517 1246672 1112060 904652 705390 808946 1116251 978531 1246796 1615542
17008 1615542 1266964 1280948 1427846 1471022 1077785 1270213 879501 1172188 1123866 1099109
16998 1099109 1130215 1437736 1187716 1230612 1509807 1415831 1397244 1361422 1210726 1209623 1505008
16987 1505008 1508009 1394452 1244054 1664232 1374991 1543089 1470820 1609606 1470118 1281559
16977A281559K55627L43517k66856q7530l02992K70381K64978l16114Q2899j18162
16967A407307K03035K22315p4891k8189N6482k21209J25984J39256o7343j50020
16957A612727o3884L6448J00449K7165k0506K83782J04363k57971L09702l39412
16947A792863j1518L42844l4742r877J76901l87128K76969k87436L23932K566
16937B185374l09957O54776o04486K70894j5281l13547K79161j13711k9465K35775
16927B239533J8045J31121j41713j12542P344K86814j59068p2377L90406J9190
16917B606753l85378M39402l8871k58672M57516l46707J31242l7189R2177M613
16907B664886O5196J11202K7292k95140L64857l15929L35353q6254J96364m6412
$$ plain form
16977 1281559 1537186 1880703 1613847 1526317 1223325 1493706 1758684 1442570 1525469 1407307
16967 1407307 1610342 1832657 1757766 1729577 1786059 1564850 1690834 1830090 1762747 1612727
16957 1612727 1548843 1585291 1685740 1712905 1692399 1976181 2080544 1822573 2132275 1792863
16947 1792863 1781345 2124189 2089447 2079570 2256471 1869343 2146312 1858876 2182808 2185374
16937 2185374 1875417 2530193 1925707 2196601 2181320 1867773 2146934 2033223 2003758 2239533
16927 2239533 2257578 2388699 2246986 2134444 2141788 2428602 2269534 2197157 2587563 2606753
16917 2606753 2221375 2660777 2621906 2363234 2820750 2474043 2605285 2568096 2660273 2664886
16907 2664886 2730082 2841284 2868576 2573436 2938293 2622364 2957717 2871463 3067827 3021415
16897C021415k1090J79182k04589L05471j76528j09226L56047k43088K18685K59317
16887C585596n43006M67592k95393J93667R1972q030K59322k3771l0622J36119
16877C833446j12750K50873R5779q2302j54536K49982J85189J63609l8083N8062
16867D449269m7997l25628l1756P53832k73531P3674L31300l11258L84968J5175
16857E018048K50913k14581R5614K69443k18444K23651l7941K12206J21205l0289
16847E689825K30599j30484J20957J73527P3750J06176k25661K41681L60383K04943
16837F845696K34456k40514K4170K10220j44366L56570K60649j40181K73049K29522
16827G909271O2271l7608M41654K761o8108K56863L99756J27843L64057n1405
$$ plain form
16897 3021415 3000325 3179507 2974918 3280389 3103861 2994635 3350682 3107594 3326279 3585596
16887 3585596 3042590 3510182 3214789 3408456 3500428 3492398 3751720 3727949 3697327 3833446
16877 3833446 3720696 3971569 4067348 3985046 3830510 4080492 4265681 4429290 4391207 4449269
16867 4449269 4401272 4075644 4043888 4797720 4524189 4597863 4929163 4617905 5002873 5018048
16857 5018048 5268961 5054380 5149994 5419437 5200993 5424644 5386703 5598909 5720114 5689825
16847 5689825 5920424 5789940 5910897 6084424 6158174 6264350 6038689 6280370 6640753 6845696
16837 6845696 7080152 6839638 6863808 7074028 6929662 7286232 7546881 7406700 7679749 7909271
16827 7909271 7971542 7933934 8375588 8378349 8310241 8567104 8966860 9094703 9458760 9407355
16817I407355P3192M53016J0508N5108M53526M57325M1627J39745j41126N17934
16807A1468210K86789K00762M43942L05425j6920M06897M52369L16309m8626K48264
16797A4063421N89910K92881M69642K47073L87356L26199L05887O89974L99999
16788A7772342M24672M00054O09856L80439K34038J190628J90505L11432Q95203
16779B2409169K17520J031043O59310P00252N51590Q49740Q49625Q12628J083268
16770B9164145R66256N07235J041707R40162J374111J156696Q70108J083603J359958
16761C8463981J428554J299526J524946J305125J636736J649003J372144J709960
16753E0389975K099940J842543J961099J908116K447477J875691K220926K582424
$$ plain form
16817 9407355 9480547 9933563 9944071 9999179 10452705 10910030 10951657 11091402 10950276 11468210
16807 11468210 11754999 11955761 12399703 12705128 12688208 13095105 13547474 13863783 13815157 14063421
16797 14063421 14653331 14946212 15415854 15662927 16050283 16376482 16682369 17372343 17772342
16788 17772342 18197014 18597068 19206924 19587363 19821401 21012029 21202534 21513966 22409169
16779 22409169 22626689 23657732 24317042 25017294 25568884 26418624 27268249 28080877 29164145
16770 29164145 30130401 30637636 31679343 32619505 33993616 35150312 36020420 37104023 38463981
16761 38463981 39892535 41192061 42717007 44022132 45658868 47307871 48680015 50389975
16753 50389975 52489915 54332458 56293557 58201673 60649150 62524841 64745767 67328191
16745F7328191J876836K619926K710275K374463K757972K582026K386934K707972
16737H7344595L330278K285886K880732K703421K520909K478337K113733K562233
16729A08220124K044595J508968K069275J225458J199553J017953P99626L1091
16721A18116643K02586k66237r77267o98435j234949j533233j378726k317739
16713A09912643j705448k176144k701790k840659k382744k855843k962475k542019
16705H9745521k587656k835471k625514k725008k806866k549877k829359k360512
16697F8425258k602115k119811k264311k158719k578378j675937k168755j932887
16689E0924345j749720k075191j568514j298518j603990j448272j532314j325223
$$ plain form
16745 67328191 69205027 71824953 74535228 76909691 79667663 82249689 84636623 87344595
16737 87344595 90674873 92960759 95841491 98544912 101065821 103544158 105657891 108220124
16729 108220124 110264719 111773687 113842962 115068420 116267973 117285926 118085552 118116643
16721 118116643 118319229 118052992 117075725 116377290 115142341 113609108 112230382 109912643
16713 109912643 108207195 106031051 103329261 100488602 98105858 95250015 92287540 89745521
16705 89745521 87157865 84322394 81696880 78971872 76165006 73615129 70785770 68425258
16697 68425258 65823143 63703332 61439021 59280302 56701924 55025987 52857232 50924345
16689 50924345 49174625 47099434 45530920 44232402 42628412 41180140 39647826 38322603
16681C8322603j279649j252693j246764j151289o46043j268779j254639o53680
16673B9569067j079646o21433j159278q69659n78553r03366p15098o99540o39590
16664B2302904l71979o58893n32770p25251n72601n70831n82045k39657l14362
16655A7734515j68464j019672l04381q20264O0154m37572m19718n90466j78615
16646A3855517p8932m23914j90331o18213J8828k30817n23573k53807j51410j95321
16636A1208027l91628p9799l65680Q0949q17305J5980m9409m037k89849k88464
16626I018785k94374k0196k00520m0884m07648J78528m27838j71902L2620l36436
16616G330135m4007j90242M20630k30808m93844n3026m62750K05372j7520l46095
$$ plain form
16681 38322603 37042954 35790261 34543497 33392208 32746165 31477386 30222747 29569067
16673 29569067 28489421 27867988 26708710 25839051 25260498 24357132 23642034 22942494 22302904
16664 22302904 21930925 21272032 20739262 20014011 19441410 18870579 18288534 18048877 17734515
16655 17734515 17566051 16546379 16241998 15421734 15481888 15044316 14624598 14034132 13855517
16646 13855517 13776585 13352671 13162340 12544127 12562955 12332138 11808565 11554758 11403348 11208027
16636 11208027 10816399 10736600 10370920 10451869 9634564 9650544 9601135 9597098 9307249 9018785
16626 9018785 8724411 8704215 8503695 8462811 8055163 8233691 7805853 7633951 7666571 7330135
16616 7330135 7286128 7095886 7516516 7285708 6791864 6738838 6276088 6481460 6463940 6117845
16606F117845J67717l64059J63986m28357K92924j19328o12k23624j0338l33564
16596E262590J08415k04424p5740L4643j35634k80091K13046L8292m06863J51052
16586D705286p4780P7263j02446n17862J6210R1965J25903k05492J23901p05672
16576C534276K90323J13521k21679l2905j10499M5657N6968k02196j96911k8238
16566C248317M27060l61874L10987n8014m05363J83534j124O3247k54962J07570
16556C259378j00829k11901O6379R475l97K43097n18093K60268k41585j37475
16546B628317n6349Q329K64960j68393J89938k34220k14659k19533N16228l59692
16536B354926k65423K00936k18133M71546r7815n01k1583j32131J36807M120J58015
$$ plain form
16606 6117845 6285562 5921503 6085489 5657132 5950056 5830728 5830116 5606492 5596154 5262590
16596 5262590 5371005 5166581 5090841 5125484 4989850 4709759 4922805 4961097 4554234 4705286
16586 4705286 4630506 4707769 4605323 4087461 4103671 4195636 4321539 4116047 4239948 3534276
16576 3534276 3824599 3938120 3716441 3683536 3573037 3618694 3675662 3473466 3276555 3248317
16566 3248317 3675377 3313503 3624490 3566476 3161113 3344647 3343523 3406770 3151808 3259378
16556 3259378 3158549 2946648 3013027 3022502 3022105 3265202 2747109 3007377 2765792 2628317
16546 2628317 2571968 2580297 2845257 2676864 2866802 2632582 2417923 2198390 2714618 2354926
16536 2354926 2089503 2290439 2072306 2543852 2446037 2445536 2423953 2291822 2428629 2432749 2590764
16525B590764m62401M00700n91766J79446p5787j92320k68K24185J02338j37976
16515B036915L6290J48161k57423N417q9537J70844J0176l12750M28898k29942
16505A947049l90851N3625n6804N62201l94030K53581r5642k8961j52622L7563
16495A735109j99820p0822R0887L44810p7493o02322M45102M3359q5959l35979
16485A286872R4954O487J20400J04823o4213R8253k07148J45666j82140J23221
16475A527175J06392o68729M03456p1067J65198m7759k3057k5112K9593j72997
16465A223093L09297k84895j06719J69861M9311J62012m51135L33032R0776k64325
16455A230308N9987j97183M06971k06715m11812J10881J8266L12289j73414k41976
$$ plain form
16525 2590764 2128363 2529063 1937297 2116743 2040956 1848636 1848368 2072553 2174891 2036915
16515 2036915 2073205 2221366 1963943 1969360 1879823 2050667 2060843 1748093 2176991 1947049
16505 1947049 1556198 1609823 1553019 2115220 1721190 1974771 1879129 1850168 1697546 1735109
16495 1735109 1535289 1464467 1555354 1900164 1822671 1220349 1665451 1708810 1622851 1286872
16485 1286872 1381826 1388313 1508713 1613536 1549323 1647576 1440428 1586094 1403954 1527175
16475 1527175 1633567 964838 1368294 1297227 1462425 1414666 1391609 1366497 1396090 1223093
16465 1223093 1532390 1247495 1140776 1310637 1359948 1521960 1070825 1403857 1494633 1230308
16455 1230308 1290295 1093112 1500083 1293368 881556 992437 1010703 1322992 1149578 907602
16445I07602J87677L06803m97356R5600M40275l88776J56835Q1913l43922M9018
16435I95669K65936k98746M00441m27690r4985L43968k79498J53461m9478L04664
16425A313742n92750M33456k68704K64387j76998j93091k41751N94257k47433
16416H85115J32948j60564L3302M2336m785J71823m57869K82542J0581j8404j26093
16405G90932j04717J89056j46075j77778l265M23618J25406k41311q3928M3641
16395H15579K19923n10186K42189J47257D07387M00065l9832k51547J66450N3928
16385G36451n7992R0123l4995p691N9975l3847j09656j4442K14081l6349j80536
16374F25122J10566B94344K53539L97354K046m64060r7549O08436j84377k85015
$$ plain form
16445 907602 1095279 1402082 904726 1000326 1440601 1051825 1208660 1290573 946651 995669
16435 995669 1261605 962859 1363300 935610 840625 1184593 905095 1058556 1009078 1313742
16425 1313742 720992 1154448 885744 1150131 973133 780042 538291 1132548 885115
16416 885115 1018063 857499 890801 933137 928352 1100175 642306 924848 935429 917025 790932
16405 790932 686215 875271 729196 551418 548153 971771 1097177 855866 771938 815579
16395 815579 1035502 525316 767505 914762 407387 807452 767620 516073 682523 736451
16385 736451 678459 768582 733587 725896 785871 752024 642368 627926 842007 805658 625122
16374 625122 735688 294344 547883 945237 947283 483223 385674 994110 809733 524718
16364E24718O488M4437M6069j23964K94318k70082K83522N988j5542j78359Q6963
16353G04556M46602n75034R9914j11718R7359Q2317j32818j00278J46006l17873
16343C39033M17052Q6286k47775j11729O3125p2585k35419J77251J57380k4372
16333E48247J92577j50231J69711j36780j52968j20102M77994l31520j38664L61977
16323G20241k2060B64523K76536k1631N7926J42691l3534l25078Q4225m5741m4127
16312C55790Q1199J51600K08932B80720L00259N369B54437o2975J57368M22819
16302G71649C61619L8937N0306K64028j85414B55334L6419J87781j67789N8542
16292C70287L02726k27370J14574j38003K06656j49155L06144C66123K62497o8967
$$ plain form
16364 524718 531206 575643 621712 497748 792066 521984 805506 811494 795952 617593 704556
16353 704556 1151158 576124 676038 564320 661679 743996 611178 510900 656906 339033
16343 339033 756085 842371 594596 482867 545992 473407 237988 415239 572619 548247
16333 548247 740824 590593 760304 623524 470556 350454 828448 496928 358264 720241
16323 720241 698181 264523 541059 519428 577354 720045 686511 361433 445658 399917 355790
16312 355790 436989 588589 797521 280720 580979 586348 254437 191462 348830 771649
16302 771649 361619 400556 450862 714890 529476 255334 291753 479534 311745 370287
16292 370287 673013 445643 560217 422214 628870 479715 785859 366123 628620 559653
16282E59653k0137B49094P4894n1693N09001k56043j1253k25522J91052K2189
16272E01719n5442M0160A05969L17122J83314k13678o1036L49355r8062q1355
16262E01629q1679j60372r7197a52832B48245J44561j71082q5109M84380k21269
16252C99726j44355j05439a25044B2855L63649J23150j68170J70036B26995J30295
16242C57290J92614k67307K18304j22826o4531r9409J27607j12332N9655N266
16232B94331A22431K53546j50041q7069J52697K5374J20034j84903J61911j34424
16222B79556m5581J70757M4878j6172j94203e2112G98534B50033R7939J14380
16212D62352M9259c2061j5430D25965l3102j11300R5811I0879a41013D75230j61059
$$ plain form
16282 559653 539516 249094 323988 272295 781296 525253 514000 288478 479530 501719
16272 501719 446277 486437 105969 423091 606405 392727 331691 681046 582984 501629
16262 501629 419950 259578 162381 -152832 248245 392806 221724 136615 620995 399726
16252 399726 255371 149932 -125044 22855 386504 509654 341484 511520 226995 357290
16242 357290 549904 282597 500901 378075 313544 214135 341742 229410 289065 294331
16232 294331 122431 375977 225936 138867 291564 316938 436972 252069 413980 279556
16222 279556 233975 404732 449610 433438 239235 -52112 798534 250033 347972 462352
16212 462352 511611 -32061 -47491 425965 392863 281563 377374 90879 -141013 475230 314171
16201C14171J02852E0810K33823R3959o5143K28570B03118J89843A5749P0161
16191H5910K03992K26529k53253p895K67052A48560j4024K83049m2642A52125
16180A74961j7551a06700H6122L18937A77958K7449n0125l573p5468K22122j26635
16169A71728J23725g8147A10384c9701D07727b07306B92432b52653A59612c064
16158A24436n5846a44887A37886D1934Q7360J19737a45240a8467D21769C4120
16147c6436A08191j9889L1224D6584K9287A6938L61691m9468K763c0442A50486
16135B97754A15841c0009A37203J1252R9636F9493d2580B1306N4654J74763D8155
16123B40585m2750m6539k4287a72143B04936C8026c34243h6568A43123K41501
$$ plain form
16201 314171 417023 50810 284633 378592 313449 542019 203118 392961 15749 85910
16191 85910 289902 516431 263178 255283 522335 148560 134536 417585 374943 152125
16180 174961 157410 -106700 86122 405059 177958 205407 155282 151709 76241 298363 171728
16169 171728 295453 -78147 110384 -39701 407727 -207306 292432 -252653 159612 -3064
16158 124436 68590 -144887 137886 41934 129294 249031 -145240 -18467 421769 34120
16147 -36436 108191 88302 119526 46584 75871 16938 378629 329161 331924 -30442 150486
16135 297754 115841 -30009 137203 148455 248091 69493 -42580 21306 75960 250723 48155
16123 240585 197835 151296 127009 -172143 204936 38026 -334243 -86568 143123 384624
16113C84624j27679H692K15153c4795B11743l7358m2555L9592L05379B38142L79982
16102F18124A0579O8855R8170A6255M02775D2637A2031M3743K62141F7854k1863
16091D5991a74235k850d0080n6913B16113A06763J57455H9850K49328B9785Q9642
16080A19427D0265b42464B46961D3569K40350A08235b92972e6914b1204C41122
16069f4023C23182H5362d1162B9436L3059K37878a27051L189H7210D2972J23891
16058A66863J98282A07255D6893P0371a15368N7033o4941c3936I9703Q7719D1434
16046C70788C8905b54226F4138B7405a59695C87056a579A61295b04750C17768
16035a01915B56708H5388e078m7013A73525J45562b53574D104L21433G8732b0634
$$ plain form
16113 384624 256945 8692 223845 -34795 211743 174385 131830 171422 476801 238142 618124
16102 618124 10579 79434 177604 16255 419030 42637 12031 55774 317915 67854 45991
16091 45991 -174235 -177085 -40080 -96993 216113 106763 264218 89850 339178 29785 119427
16080 119427 40265 -242464 246961 43569 283919 108235 -292972 -56914 -21204 341122
16069 -64023 323182 85362 -41162 29436 62495 300373 -127051 -123862 87210 42972 166863
16058 166863 365145 107255 46893 117264 -115368 -58335 -123276 -33936 99703 187422 41434
16046 370788 38905 -254226 64138 27405 -159695 387056 -1579 161295 -204750 317768
16035 -101915 256708 85388 -5078 -52091 173525 319087 -253574 4104 325537 78732 -20634
16023A19155i2244A77753P8088O8408j17146n5186o9844J7094P6343b1200B97216
16011e9955A16606J0740a9736j44464A19082b34703J00666M9750L9688E22515
16000B94354b08739I2702b51642D8645i8732k5078C57244a67417C2410M4266Q9702
15989A66378J18951J21260n0070M11121L70739J65161q224n45674K1832C06850
15978I8672b38577R4498d5736j86753l355B93168F2371J61659B2006h9684B78224
15966A54766h4251j04438b4309C09148a87509C45641F5488b06621j50711F724
15955A60952a81267e0878B3680c1905n1949B41024b44555J03343E2274g3400A69393
15943A61542f5917n1973K1967j65302R2837j49904J35477B57692i2118A52426
$$ plain form
16023 119155 -92244 177753 255841 324249 207103 151917 82073 99167 175510 -21200 297216
16011 -59955 116606 127346 -19736 -164200 119082 -234703 -134037 -84287 -44599 522515
16000 294354 -208739 92702 -251642 48645 -98732 -123810 357244 -167417 32410 76676 166378
15989 166378 285329 406589 356519 767640 1138379 1303540 1295316 749642 771474 306850
15978 98672 -238577 -144079 -45736 -232489 -235844 293168 62371 224030 22006 -89684 278224
15966 154766 -84251 -188689 -24309 309148 -187509 345641 65488 -206621 -357332 6724
15955 160952 -181267 -50878 23680 -31905 -83854 241024 -244555 -141212 52274 -73400 169393
15943 161542 -65917 -117890 -95923 -261225 -168388 -318292 -182815 257692 -92118 152426
15932G5497J75197a63729G7879M9972D2378a7183F2464J50215I2373Q4795A1801
15920a57148B57846c48320c7404l6061I2784D2871j1035Q0980i9001k6124g602
15908A17248a15970B7778P51a07942a9821F0295j3882J42879a03695A39079c7844
15896B05114i8013p0985c6491B0229i6482l07018C0350K08401I7213a7197k7813
15885d5010G5365f4178j66178j13257b9564n5003k06418i056A91876F6755a93689
15873C2861j3302c06794J47057D9804F652R3039a33476L5041c3402A6650K02546
15862B19196c84877C0143a75066K0833L0720A83405a23655G8095J70826b5960
15851A52132o7205P9439O4885a4357q245j21455n5050I0798J07394M3163c9874
$$ plain form
15932 75497 250694 -163729 77879 127851 42378 -17183 62464 212679 92373 177168 11801
15920 -157148 257846 -348320 -37404 -73465 92784 42871 31836 112816 -99001 -125125 -7602
15908 117248 -115970 27778 28529 -107942 -19821 60295 46413 189292 -103695 139079 -37844
15896 205114 -98013 -168998 -36491 20229 -96482 -403500 30350 238751 97213 -17197 -45010
15885 -45010 75365 -64178 -230356 -343613 -29564 -84567 -290985 -9056 191876 66755 -193689
15873 32861 19559 -306794 -159737 49804 6652 99691 -133476 -98435 -33402 16650 219196
15862 219196 -384877 30143 -175066 -154233 -123513 183405 -123655 78095 248921 -25960
15851 152132 84927 164366 229251 -14357 -22602 -144057 -199107 90798 198192 241355 -39874
15839a42602j49713C5493b21064i8242r3294D5093a70236g4371A96009B2016e2455
15827A57504a40634C6291M9340n585a06251B737b22528A57410G2835k3450d69814
15815A7913d5988k14653n4081J07765j31401I9037c3389B70624b3745j71421b9860
15803a57447J6672A996J65345J95026E9093K28349b15583C43733o8121D1161f8646
15791d71661C1481N7042D864O765a8705j64985P4506F2719f7936b1601k10694
15780b32295C94790a86032A86686B7659c21753C4454a30896H8771j7617A7574
15769a40553A14408a42773D2789j1819h9176I2186J51100I9803M2152a0498B3574
15757B08116d2411j4157l35711D56614E6605f3249A4706Q070i570F1271a56626
$$ plain form
15839 -142602 -292315 35493 -221064 -98242 -191536 45093 -170236 -74371 196009 22016 -52455
15827 157504 -140634 36291 85631 80046 -106251 2737 -222528 157410 72835 49385 -469814
15815 17913 -45988 -260641 -314722 -206957 -338358 99037 -33389 270624 -23745 -195166 -29860
15803 -157447 -140775 1996 167341 362367 59093 287442 -215583 343733 275612 41161 -68646
15791 -471661 31481 88523 4864 11629 -18705 -183690 -109184 62719 -67936 -21601 -232295
15780 -232295 394790 -186032 186686 27659 -321753 34454 -130896 88771 71154 17574
15769 -140553 114408 -142773 42789 30970 -89176 92186 243286 99803 141955 -10498 23574
15757 208116 -42411 -56568 -392279 456614 56605 -63249 14706 22776 -9570 61271 -156626
15745b5376I1800d8127k54006J33303D3419J40317a22458o3100C9740f7571l9866
15734a07437J9552A63652l5340N6399b80915R3865a9545B02692c1506J3631A50511
15722A18220j290n5897J86381a53937A03584b18804n0710B00154m5797E588F16
15710C20894b31238A45799a12528G3755k4421b16389A37279c08917A98101a54392
15699a50840e1876k4855j8332D2225a88321O2330F774A509P0763K5548J14506
15688B12326K3904q9990e1076A6469d8575C4394J74280a12206B1329C720Q4701
15677H8421c8325j35074G5878a53775A08189a09239D6988c3256A946a30485A34094
15665F0825G029P4300h2709B65796C1032O2438a26600B9167b50634A36801f9240
$$ plain form
15745 -25376 91800 -48127 -302133 -168830 43419 183736 -122458 -185558 39740 -67571 -107437
15734 -107437 -87885 163652 128312 184711 -280915 -187050 -19545 202692 -31506 -17875 150511
15722 118220 116930 61033 247414 -153937 103584 -218804 -269514 200154 154357 5588 616
15710 320894 -231238 145799 -112528 73755 49334 -216389 137279 -308917 198101 -154392
15699 -150840 -51876 -76731 -95063 42225 -188321 -125991 6774 1509 72272 97820 212326
15688 212326 236230 146240 -51076 16469 -48575 34394 208674 -112206 21329 3720 88421
15677 88421 -38325 -173399 75878 -153775 108189 -109239 46988 -33256 1946 -130485 134094
15665 60825 7029 81329 -82709 265796 31032 93470 -126600 29167 -250634 136801 -69240
15653a7094j13744L9092a930B17175a01917b6343A14861n1775J10242K5719E8296
15641b8016H3624M2556b09279L5194E27207G1620a8943H1595B1280c94182b9103
15629A490J01210e4307A9635J21085B2537b02322q6666r8742a91235N0613I2016
15617A9235a89504C0678c6217m8961A3789b68223b924A17140b11916i2672d436
15605i3667k48387D4054O9586b19154J0172j16276P8574R1796d9316G3557R7420
15594A70977n8707b69776A70329a35838e3824q950E4573a15600e2726k9510A35007
15582F6362K3875K3886B8003d194l44348a28291A14682P6840c52087G6237f5386
15570a80091A23668a36356p8961i3018B85483m9119k3929K955b19326D8391f7962
$$ plain form
15653 -17094 -130838 -91746 -1930 217175 -101917 -26343 114861 63086 173328 199047 58296
15641 -28016 83624 126180 -209279 -174085 527207 71620 -18943 81595 21280 -394182 -29103
15629 1490 102700 -54307 19635 140720 22537 -202322 -288988 -387730 -191235 -140622 92016
15617 19235 -189504 30678 -36217 -85178 13789 -268223 -2924 117140 -211916 -92672 -4436
15605 -93667 -342054 44054 113640 -219154 -208982 -325258 -246684 -154888 -49316 73557 170977
15594 170977 112270 -269776 170329 -135838 -53824 -62774 54573 -115600 -52726 -82236 135007
15582 66362 90237 114123 28003 -4194 -348542 -128291 114682 191522 -352087 76237 -65386
15570 -180091 123668 -136356 -215317 -93018 285483 236364 212435 215390 -219326 48391 -67962
15558b47787E7361J45610d0755k51425K5866b4805o158A07691h7043c2295F7274
15546B75363b38972B08164J1669j3470a72215c3390m57804A65775n0561e8739
15535c02810H8048a9004m1445A11963a55107B88714A43241F129b62320B87199
15524d21947A06881i6622C57695b4498C8734Q5304n561L9119a9662A02719O3113
15513A65832a75419B68795j3498a5276A95587F0010P5291J34657p814n8308J82662
15502C86498H3243N3452P8887b891B45034E5739L1413e9265A38122D0604J74345
15491B14949K8426a54625E9018M4705E1094K74428b4001E3756J73267q1474J91675
15480C37224A35173B8622B893b2594B95768A02222M31102A74067M53643N5124
$$ plain form
15558 -247787 57361 202971 -40755 -292180 -266314 -24805 -30963 107691 -87043 -32295 67274
15546 275363 -238972 208164 219833 206363 -172215 -33390 -491194 165775 115214 -58739
15535 -302810 88048 -19004 -60449 111963 -155107 288714 143241 6129 -262320 287199
15524 -421947 106881 -96622 357695 -24498 38734 124038 118477 157596 -19662 102719 165832
15513 165832 -175419 268795 255297 -15276 195587 60010 135301 269958 262144 203836 386498
15502 386498 83243 136695 215582 -2891 245034 55739 87152 -59265 138122 40604 214949
15491 214949 243375 -154625 59018 103723 51094 325522 -24001 53756 227023 145549 337224
15480 337224 135173 28622 2893 -22594 295768 102222 533324 174067 627710 682834
15470F82834B44810H8725c49591B29619b4696A68504R9833c82832A66015o8401
15460I7614k6902P5265g8726B08287f5738A11573J40358B6065K06201b53089g471
15448A68442L4095a14464A85218i8006F23159L1194J62684L59119L485p1962m65465
15437F42214j35916B43457J27268A85006e0330A3149K8264g6143j03278C73195
15426A09236K00913a36965j81421a27136B25389g968j13968E9540c9237R051J1769
15415a8417A48259a78751m5012J05685E1751a46020I6112f145D86349k13217q5073
15404A88059M3911J05480E3472f8966r488A53269J38309M8447j63143E3059c81456
15392i1827F1021Q2272C1464O0898j5141e9410m0623A63694K35457j22479e557
$$ plain form
15470 682834 244810 88725 -349591 229619 -24696 168504 268337 -382832 166015 97614
15460 97614 70712 145977 -78726 208287 -65738 111573 251931 26065 232266 -253089 -7471
15448 168442 202537 -114464 185218 -98006 623159 654353 817037 1176156 1179641 1107679 642214
15437 642214 506298 243457 370725 185006 -50330 13149 41413 -76143 -179421 373195
15426 109236 310149 -136965 -318386 -127136 225389 -7968 -121936 59540 -39237 -30186 -18417
15415 -18417 148259 -178751 -223763 -118078 51751 -146020 96112 -6145 486349 273132 188059
15404 188059 231970 337450 53472 -68966 -78454 153269 291578 340025 176882 53059 -381456
15392 -91827 61021 143293 31464 92362 77221 -59410 -100033 163694 399151 276672 -5557
15380C8028a03571F6015a46031A35537F2272K26389o6452j02190l5789L58827
15370D43057j97799l0188f5492B11484D320b07564A06187J45942j04512R3722
15360B41339A8589J4119L98622A67230C724L23796r2499L45618B73182d7278a8902
15348A90429C2626K958f1603B62854m3853M0569n9651K71360A58330L05964a7408
15336B3788P1947J08938a8556C82410a48336A40540F8360J25405J39147j64496
15326A68416j7716l6209Q3482G2811L98391B7210J04956J08949a15751A35256
15315A07044b99392C10723A51062l7530C6110K32903n9985K57208j59330F7248
15304i6172H1442J19735G9586C4018J78543A8165a73125L9279d9659j00429H8110
$$ plain form
15380 38028 -103571 66015 -146031 135537 62272 288661 222209 120019 84230 443057
15370 443057 245258 215070 -65492 211484 4320 -207564 106187 252129 147617 241339
15360 241339 18589 32708 431330 167230 3724 327520 235021 580639 273182 -47278 -18902
15348 190429 32626 35584 -61603 262854 219001 259570 199919 471279 158330 464294 -17408
15336 23788 95735 204673 -18556 382410 -148336 140540 68360 193765 332912 168416
15326 168416 150700 114491 197973 72811 471202 27210 132166 241115 -115751 135256
15315 107044 -299392 310723 151062 113532 36110 269013 209028 466236 306906 67248
15304 -96172 81442 201177 79586 34018 212561 18165 -173125 -133846 -49659 -150088 88110
15292A23195e3819A28360o399E872h0945m9747e6715a0486B3540F334a87240e1954
15279A08457a48266I2422b25867e9057C4730J29156l2313n7922a49598B69716
15268H5581K5213a04062B75732D2678M59000B07480i2548B12701H3040b3226k8657
15257e1883A28028E9360K00069B5222K40086B6958K88698l8721d8697A70942a51997
15245B05695a1844D8843N99416L46257J069330m82962K24386j80914o84123k64846
15235F75387B19541D2666J44508b25507C13357j46777b18599A38287J78044A5086
15224g8750n3482N311G3443a19885B52207o7842J04874j35323a56011H7481K18152
15213C05633f97C66004I6136K9214c17466J55214e7713A15947C94Q1462O5671
$$ plain form
15292 123195 -53819 128360 121961 5872 -80945 -130692 -56715 -10486 23540 6334 -187240 -51954
15279 108457 -148266 92422 -225867 -59057 34730 163886 131573 73651 -149598 269716
15268 85581 110794 -104062 275732 42678 501678 207480 -92548 212701 83040 -23226 -51883
15257 -51883 128028 59360 259429 25222 265308 26958 315656 276935 -48697 170942 -151997
15245 205695 -11844 48843 648259 994516 2063846 1580884 1805270 1624356 940233 675387
15235 675387 219541 42666 187174 -225507 313357 166580 -218599 138287 316331 15086
15224 -78750 -132232 -126921 73443 -119885 252207 184365 289239 153916 -156011 87481 305633
15213 305633 -697 366004 96136 125350 -317466 -162252 -57713 115947 394 81856 147527
15202A47527o9888M5331n2422J12199b2610A12459C8012K34577F4827L34478A96560
15190E9675L14095P289d267A27411f1436K7438E3502b08377A37992N2351K5996
15179B16339D164L66453A84652K74681A17474K5837a72351D05514j33719g0894
15168e3142B89206b78377a01483A28118M0203J12176B5008a66980B55782m7781
15158B08001q4055P8868E3658K00212a01094C71380j51083B3359J15362O1522
15148B00243a41148i745H9234b64434B49904g107l00423A27078b67014D0107g7498
15136c1938k49927A23757N7126q1049l1631L54881A5807P9787m7305J71890H4404
15124C21140j00671A06672J6875K61574A85825n9858K67956L30908A16404L53599
$$ plain form
15202 147527 77639 122970 70548 182747 -22610 112459 38012 272589 64827 399305 196560
15190 59675 373770 381059 -4267 127411 -61436 -33998 53502 -208377 137992 190343 216339
15179 216339 4164 370617 184652 459333 117474 143311 -172351 405514 271795 -70894
15168 -53142 289206 -278377 -101483 128118 168321 280497 25008 -166980 255782 208001
15158 208001 123946 202814 53658 253870 -101094 371380 220297 23359 138721 200243
15148 200243 -141148 -9745 89234 -264434 249904 -7107 -307530 127078 -267014 40107 -77498
15136 -31938 -281865 123757 180883 99834 68203 423084 15807 95594 48289 220179 84404
15124 321140 220469 106672 123547 385121 185825 125967 393923 724831 116404 470003
15114D70003D4147K37620C6769J64443D1959Q7578A5507b79048h2810C0603P7110
15103A07713O2133A9754O1947q532K5253K84128A22860a7922B24532I1960B7926
15091H3480N11050A60190B709K37663d4487A12257m1016N1421N4116q0016k6037
15080G0725b05539A15558l9982K81255j75144a17167A75745h20F7041a22668A54277
15068A76239O1208p0634K67782A04074b38655B94654k1958n8057L8323j9318J06566
15057C40210j04364n7918K71092A11531K17328L0343k3252j44081L19125J4360
15047E25354L7662n9597j03021C7012O98356A31974J39222P0543q5398J0547P0268
15036C37156J77148k10201j25452L51769K47254k84610J6220M57917j38089j8663
$$ plain form
15114 470003 44147 281767 36769 201212 41959 129537 15507 -279048 -82810 30603 107713
15103 107713 169846 19754 81701 73169 98422 382550 122860 -17922 224532 91960 27926
15091 83480 594530 160190 2709 240372 -44487 112257 71241 122662 176778 96762 70725
15080 70725 -205539 115558 75576 356831 181687 -117167 175745 -820 67041 -122668 154277
15068 176239 237447 166813 434595 104074 -238655 294654 272696 214639 252962 233644 340210
15057 340210 235846 177928 449020 111531 328859 359202 335950 191869 510994 525354
15047 525354 563016 503419 400398 37012 735368 131974 271196 341739 256341 266888 337156
15036 337156 514304 304103 178651 530420 777674 493064 509284 967201 829112 810449
15026H10449j50157j22570J63662k07257O4908J7945k46956O2800K80021B43810
15015G90188C19868o3102J63061P0696K51496n0596j76719k36814K43133k22462
15005B98561m9313b9335G10670k46733J35460j84252K58360p1271j31878j73914
14995B96442M37799k77831A30618L63352J82219l18382J49943Q0961p7855j46960
14985C63896L3973P6557j38818N80988n7778J64390j08286l28264K81969m00798
14975D67829K62645k66257M8446K89826k71083K83547l85212K97307k33446j91522
14965C02080J01221j75333K40900k33893n4668M3552J36868l4222r501M5897d1057
14953A70179K9091L49812B02444M98956r4044E786J39039O9762L69940j03360
$$ plain form
15026 810449 660292 537722 701384 494127 559035 576980 330024 392824 672845 243810
15015 790188 319868 256766 419827 490523 742019 691423 514704 277890 521023 298561
15005 298561 249248 -29335 710670 463937 599397 415145 673505 602234 470356 296442
14995 296442 734241 456410 130618 493970 676189 357807 507750 588711 510856 363896
14985 363896 397869 474426 335608 916596 858818 1023208 914922 586658 868627 467829
14975 467829 730474 464217 512663 802489 531406 814953 429741 727048 493602 302080
14965 302080 403301 227968 468868 234975 180307 223859 360727 326505 317004 362901 -41057
14953 170179 199270 549082 202444 701400 607356 5786 144825 214587 584527 481167
14943D81167L69843k07911L1829j82055B30788Q2922L16827J00862l36243l064
14933C92092J35389L79068j7643J23048J88571K01747k38587L63263K50894J16020
14923A893862j90522k65853k34384J66624M38238J12125O97407k27055J4374n72357
14913A832459l64576j91603k66171m9302M5862k6811m29502R0036k82481L8557
14903C96468r2616J62951k14533J70127j77785K98143j19857L4027P8019r1257
14893D43687j66240p2609M91627j30305O2405j60302l3410M29385O9424l13415
14883F20247L09448q802l18753J30665K24540j17721J19850k67235l18128j4097
14873C60014J40648O3133j28444J80924r6359q2693J51811J08287k9391J93383
$$ plain form
14943 481167 851010 643099 674928 492873 230788 313710 630537 731399 395156 392092
14933 392092 527481 906549 888906 1011954 1200525 1402272 1163685 1526948 1777842 1893862
14923 1893862 1703340 1437487 1203103 1369727 1807965 1920090 2617497 2390442 2404816 1832459
14913 1832459 1467883 1276280 1010109 960807 1006669 979858 550356 640392 357911 396468
14903 396468 303852 466803 252270 422397 244612 542755 422898 456925 534944 443687
14893 443687 277447 204838 696465 566160 628565 468263 434853 864238 933662 620247
14883 620247 929695 920893 602140 732805 957345 839624 959474 692239 374111 360014
14873 360014 500662 563795 435351 616275 519916 437223 589034 697321 667930 861313
14863H61313p9257m6575o8217j47099L39998C56930L21277M610B94145N9824J41294
14852D95263B30359M89910L9945n4241l2387L6351B42219O33369n8891M69775
14842A286472j73355l1760J37326m1267k30551j88334J35911J01501J45753l31097
14832H10599l00881K3056k14167P5892K20909K15212j12914k7958j66793A61281
14821B89482O26215D19967M02444m4874O9034n6924J32600k5669m5630l27553
14811E23395J95423J58217o2853j61794J64264L44874j30688R2723j82685J41844
14801A082720p1263j11321L0330j60055k55259n4734J42805j29427J13149m1675
14791E45270o2461k06144M27959k16580J57036k8050j46126K05593q5372n019
$$ plain form
14863 861313 782056 735481 667264 520165 860163 356930 678207 682817 294145 353969 495263
14852 495263 230359 720269 760214 705973 673586 709937 242219 875588 816697 1286472
14842 1286472 1113117 1081357 1218683 1177416 946865 758531 894442 995943 1141696 810599
14832 810599 509718 532774 318607 394499 615408 830620 717706 689748 522955 161281
14821 289482 915697 419967 822411 777537 846571 789647 922247 896578 850948 523395
14811 523395 718818 877035 814182 652388 816652 1161526 1030838 1123561 940876 1082720
14801 1082720 1011457 900136 930466 770411 515152 460418 603223 473796 586945 545270
14791 545270 482809 276665 704624 488044 645080 617030 470904 676497 591125 586106
14781E86106j3340j09377J90902J72970L4314J23821k01798K84410k65051k3835
14771G79122l1697p6495j74733J42366q1358k01326L79926q7859q6588n9689R2593
14760E94262p5680L37972m04419M10145m6032k09881j9397k39896Q3942J92647
14750F23663p266j19429L170L26536J35670k46323n8142J09085J63303m43271
14740D86996K56088j84051N70195k87342k53103J65336Q6732n2339j20937M21590
14730A089165R4236o8387L40471J97047L80402K26077o8658j001858J32074l75828
14720I44741N4630K55924n37823L19650l49802J42183K99736m41534K41822j47776
14710G81751O7326J10384k41966L66684k87212K84604J16639N30968k17530L27505
$$ plain form
14781 586106 572766 463389 654291 827261 861575 985396 783598 1068008 802957 779122
14771 779122 747425 670930 496197 638563 557205 355879 735805 647946 561358 501669 594262
14760 594262 518582 856554 452135 862280 816248 606367 586970 347074 431016 623663
14750 623663 616397 496968 500138 826674 962344 716021 657879 766964 930267 486996
14740 486996 743084 559033 1129228 841886 588783 754119 840851 788512 667575 1089165
14730 1089165 1183401 1115014 1455485 1652532 2032934 2259011 2190353 1188495 1320569 944741
14720 944741 999371 1255295 717472 1037122 687320 829503 1129239 687705 929527 781751
14710 781751 849077 959461 717495 1084179 796967 1081571 1198210 1729178 1511648 1839153
14700A839153K63373J62736n40591m04988L91220j14896m93980k58904O6910J23912
14690A033945m54964N15373j9371k15547k35302J80955K10684r0047J01757l6905
14680I90578k15514J20249K12835j61081j19014N0167K627J94377N6945r5275
14670A036894k5087k63500K09657R1993k04650J64686L34146k22365Q688P3517
14660A203979m77654M74277l06908N10857l58300L64341k53904J34009r3187J75361
14650A372871J99886m38703k2554L26487o7860j46112N7752J31490l82286P1532
14640A102503M0621p6042J15449K12182l68305J7781K689L64536j53453j02914
14630A155047L4380J2894K1986K53683l27881J98040K29835m33109M06069j15579
$$ plain form
14700 1839153 2102526 2265262 1724671 1319683 1710903 1596007 1102027 843123 910033 1033945
14690 1033945 578981 1094354 1074983 859436 624134 805089 1015773 925726 1027483 990578
14680 990578 775064 895313 1108148 947067 828053 878220 880847 1075224 1132169 1036894
14670 1036894 1011807 748307 957964 1049957 845307 1009993 1344139 1121774 1130462 1203979
14660 1203979 726325 1200602 893694 1404551 1046251 1410592 1156688 1290697 1197510 1372871
14650 1372871 1572757 1134054 1111500 1437987 1370127 1224015 1281767 1413257 1030971 1102503
14640 1102503 1143124 1067082 1182531 1394713 1026408 1044189 1046878 1411414 1257961 1155047
14630 1155047 1189427 1202321 1224307 1477990 1150109 1348149 1577984 1144875 1550944 1435365
14620A435365k6445J06437k66314J32433K51963k75919J08522n0765J12745J384
14610A529406l00585K98672K41637k49067k03245R8575J97756J02617j4533j73370
14600A527863K88517k85528p9724M5378L93365k79557k5638j26712N36996l96184
14590A598776M67772k88452o288K02361r2716O729J74516k94004P99P7157J60842
14579B007492J43597P7457n13805N80116j80170j06309L42512j98033K2045J54927
14569B329829l80802J15759k26176N32457j61950M1913L7937M55119m17646J09708
14559B436148L33627L28268j77050j04125J83361O60581N05316j16771P52027
14550D801382O75078K192812L070517O660940J5218347J7158456B2377379H105231
$$ plain form
14620 1435365 1408920 1515357 1249043 1381476 1633439 1357520 1466042 1415277 1528022 1529406
14610 1529406 1228821 1527493 1769130 1520063 1316818 1415393 1613149 1715766 1701233 1527863
14600 1527863 1816380 1530852 1451128 1496506 1889871 1610314 1584676 1457964 1994960 1598776
14590 1598776 2066548 1778096 1771808 1974169 1881453 1888182 2062698 1768694 1769493 1846650 2007492
14579 2007492 2151089 2228546 1714741 2294857 2114687 2008378 2350890 2152857 2174902 2329829
14569 2329829 1949027 2064786 1838610 2371067 2209117 2251030 2288967 2744086 2326440 2436148
14559 2436148 2769775 3098043 2920993 2816868 3000229 3660810 4166126 4049355 4801382
14550 4801382 5476460 7669272 10739789 17400729 32619076 49777532 22377379 8105231
14541D243147j246973n43627L85562J01227J218801J706117k734803p40663m42159
14532A946629K63238J7968P1844O9820l43401m9603M31199J18227j21884m56683
14522A947354K31680N1391N87630j67054j43287Q9959J40110q834j7371o1915
14512B649663Q3732l32001K31814M13800r6357l16753J69818K46192p7347J45321
14502C117882l6371j8667J67421j82994K41859j50396K80047j82019L41456k87922
14492C290296N71706k29817j94931k27980L09263k29582N01738l41299J70062
14483C619456m5729N69183m54704N6883J68008Q6173K87467n7656r8213K02314
14473D333182l59168L27640K68654k29270K0441o9617J08777m0523l0070M72457
$$ plain form
14541 4243147 2996174 2452547 2838109 2939336 4158137 5864254 3129451 2388788 1946629
14532 1946629 2209867 2227835 2299679 2369499 2026098 1976495 2407694 2525921 2404037 1947354
14522 1947354 2179034 2230425 2818055 2651001 2507714 2597673 2737783 2728949 2711578 2649663
14512 2649663 2733395 2401394 2633208 3047008 2950651 2633898 2803716 3049908 2972561 3117882
14502 3117882 3081511 3062844 3230265 3047271 3289130 3138734 3418781 3236762 3578218 3290296
14492 3290296 3862002 3632185 3437254 3209274 3518537 3288955 3790693 3449394 3619456
14483 3619456 3573727 4142910 3688206 3745089 3913097 3999270 4286737 4229081 4130868 4333182
14473 4333182 3974014 4301654 4570308 4341038 4361479 4291862 4400639 4360116 4330046 4802503
14463D802503q7339L4393k33465L33660l59898J78176L72494J16179k40186J62223
14453E078740P7834K78792j77354J62027M26500m89086L06995J39149J13450j07717
14443E809330j77269O51024j35883p051n1800N26533j05138k61095L67551K30579
14433F846781m68642O05596J25055N0368j98650R4605j2289M46508Q9851L18461
14423G897644m29442O30937P0399L54290M8037O00931m37694J81868J53680n19255
14413H551395M04108j13448M52157K10551K07101K74728k26011M51539L70960
14404A0583080j41062M09418k69965M22494l22075J94548L4522L86385j89510
14395A1107835O15020P3046L03517l5641J79338M42801K59741J81801M69500L98014
$$ plain form
14463 4802503 4715164 4749557 4516092 4849752 4489854 4668030 5040524 5156703 4916517 5078740
14453 5078740 5156574 5435366 5258012 5420039 5846539 5357453 5664448 5803597 5917047 5809330
14443 5809330 5632061 6283085 6147202 6140151 6088351 6614884 6509746 6248651 6616202 6846781
14433 6846781 6378139 6983735 7108790 7159158 6960508 7055113 7042824 7489332 7579183 7897644
14423 7897644 7468202 8099139 8169538 8523828 8571865 9172796 8735102 8916970 9070650 8551395
14413 8551395 8955503 8842055 9294212 9504763 9711864 9986592 9760581 10212120 10583080
14404 10583080 10442018 10851436 10581471 11003965 10681890 10876438 10910960 11297345 11107835
14395 11107835 11722855 11795901 12099418 12063777 12243115 12685916 12945657 13127458 13596958 13994972
14385A3994972p4590L58316R7816P46081L47997R0149q3877L98125J31181J34394
14375A6140564L85259K66737K35745N43456N48534J83576K13880Q38592j91728
14366A9164615P57091P97219O7916M27329p951O65978N39669O19392M68483M37748
14356B3937489K96075P21960N47363O54439L33754M82040J153551Q83873M63125
14347B9473669R05224N58622N42247Q58946J316336N82895R11063J547668K97574
14338C6994244J190655J270100J163345J161445Q27875J745684J120237J605678
14330D7079263J491932J297278J472840J802374J476903J731242J866574K287205
14322F0505611K268320K043017K210260K671906K267416K208408K698424K903175
$$ plain form
14385 13994972 13920382 14278698 14376514 15122595 15470592 15560741 15476864 15874989 16006170 16140564
14375 16140564 16525823 16792560 17028305 17571761 18120295 18303871 18517751 19356343 19164615
14366 19164615 19921706 20718925 20786841 21214170 21206219 21872197 22411866 23031258 23499741 23937489
14356 23937489 24233564 24955524 25502887 26157326 26491080 26973120 28126671 29010544 29473669
14347 29473669 30378893 30937515 31479762 32338708 33655044 34237939 35149002 36696670 36994244
14338 36994244 38184899 39454999 40618344 41779789 42607664 44353348 45473585 47079263
14330 47079263 48571195 49868473 51341313 53143687 54620590 56351832 58218406 60505611
14322 60505611 62773931 64816948 67027208 69699114 71966530 74174938 76873362 79776537
14314G9776537L106195L238129L120234L551044M044043M149226M159803M282890
14306A09428101M898965N009912N039909N516397N686308O570203O645933O635086
14298A55430814P427203P787329Q086883Q858516R242831R719326J0476290J0796144
14290B27825336J0938284J2208274J2679038J2899650J3700616J3842736J4344145
14283C18438079J4789953J4768440J5149248J4392770J4539515J4170695J3343076
14276D19591776J2309864J0321057P732431L408470K059519J157016J467519l45878
14268D57701774l608519m341586p913633r358290j1700304j3367679j4240277
14261C93171486j5289178j5648117j5913041j6124555j5710611j5152576j4613346
$$ plain form
14314 79776537 82882732 86120861 89241095 92792139 96836182 100985408 105145211 109428101
14306 109428101 114327066 119336978 124376887 129893284 135579592 142149795 148795728 155430814
14298 155430814 162858017 170645346 178732229 187590745 196833576 206552902 217029192 227825336
14290 227825336 238763620 250971894 263650932 276550582 290251198 304093934 318438079
14283 318438079 333228032 347996472 363145720 377538490 392078005 406248700 419591776
14276 419591776 431901640 442222697 449955128 453363598 455423117 456580133 458047652 457701774
14268 457701774 454093255 449751669 441838036 432479746 420779442 407411763 393171486
14261 393171486 377882308 362234191 346321150 330196595 314485984 299333408 284720062
14254B84720062j4538183j3382007j3014920j2509835j1682358j1552330j0402205
14247A97638224q016537r316823q980686q062026p831794o992131p256337o553388
14239A34628502o048353n327474n201198n408059n267257m507655m202226m133973
14231I4532307l284532l650209l725588l111870l166233k935776k842147k562547
14223F9253405k530987k341305k228754j822484k213099j710971k440007j545020
14215E2420778j576023j103102j333851j485557j825085j163204j308895j143694
14207D1481367n88492j312796r82236j668985j011406q67777j027157l3626j316165
14198C2672727j073327q52526o84239q31874m53587o21111p46336q19578o86813
$$ plain form
14254 284720062 270181879 256799872 243784952 231275117 219592759 208040429 197638224
14247 197638224 189621687 180304864 171324178 163262152 155430358 148438227 141181890 134628502
14239 134628502 128580149 123252675 118051477 112643418 107376161 102868506 98666280 94532307
14231 94532307 91247775 87597566 83871978 80760108 77593875 74658099 71815952 69253405
14223 69253405 66722418 64381113 62152359 60329875 58116776 56405805 53965798 52420778
14215 52420778 50844755 49741653 48407802 46922245 45097160 43933956 42625061 41481367
14207 41481367 40892875 39580079 38597843 36928858 35917452 35049675 34022518 33988892 32672727
14198 32672727 31599400 30746874 30062635 29230761 28777174 28156063 27409727 26590149 25903336
14189B5903336p00157m67834o12348n42789m83488o96748k00366l35908q71153
14180B0992545j3922o15980n56437k18807m65066l25161m72757k13497o60452
14171A7450466m40430j80540p8652o63189j69988l32310j75179k26367l91533
14162A4792278j58677k00381n06305q3032k71120k63228k58374l26808m5282n5488
14152A2623583n18741l63807j6580j37263k76597j93780J45020n34286J51702
14143A0879251q3661k21611o6516k97702m86570R0566l80756q5095Q6776k99021
14133I135661J9287j84896k33989r9597k963m4246m27734J40265j86764J31904
14123H246928o3690k41121l06152k549N4969k74976r9343j06974j54826K52569
$$ plain form
14189 25903336 25203179 24735345 24122997 23580208 23096720 22399972 22199606 21863698 20992545
14180 20992545 20978623 20362643 19806206 19587399 19122333 18797172 18324415 18110918 17450466
14171 17450466 17010036 16829496 16750844 16087655 15917667 15585357 15410178 15183811 14792278
14162 14792278 14633601 14433220 13926915 13843883 13572763 13309535 13051161 12724353 12679071 12623583
14152 12623583 12104842 11741035 11724455 11587192 11310595 11116815 11261835 10727549 10879251
14143 10879251 10795590 10573979 10507463 10209761 9723191 9813757 9433001 9347906 9434682 9135661
14133 9135661 9154948 8970052 8736063 8636466 8633503 8589257 8161523 8301788 8115024 8246928
14123 8246928 8183238 7942117 7635965 7633416 7688385 7413409 7314066 7207092 7052266 7304835
14113G304835m58903j29234M44033R8566o28518k467n36362L89192J8992m48201
14103F051933p5069j67548O5591L0601O784l81504K68502l6389j21394r0807q1848
14092E468852k94851J93285K0159k33191J16766k09842r7600r6715J19487k14578
14082D771772L29901l11072O1922l7297l83048K60017l6737j79420q8666j02664
14072D284708k27155L94741m23270L00575K0557R2428k90748Q6456k52754j804
14062C983734m9175J79117J85918L1277n54897Q5275L5519r892l31549K01311
14052C756638k73767K1197j56048J91654j12233J98202l97395K9776k47088K50069
14042C261005K9751k50025K87010J99991j28290l85800k2276K21971l27075L82517
$$ plain form
14113 7304835 6845932 6716698 7160731 7259297 6630779 6628312 6091950 6481142 6500134 6051933
14103 6051933 5976864 5809316 5874907 5905508 5912292 5530788 5799290 5762901 5641507 5550700 5468852
14092 5468852 5174001 5367286 5387445 5154254 5271020 5061178 4963578 4866863 4986350 4771772
14082 4771772 5101673 4790601 4852523 4815226 4432178 4692195 4655458 4476038 4387372 4284708
14072 4284708 4057553 4452294 4029024 4329599 4350156 4442584 4151836 4238292 3985538 3983734
14062 3983734 3934559 4113676 4299594 4330871 3775974 3861249 3896768 3886876 3555327 3756638
14052 3756638 3482871 3504068 3348020 3539674 3427441 3625643 3228248 3258024 3010936 3261005
14042 3261005 3290756 3040731 3327741 3527732 3399442 3013642 2991366 3213337 2886262 3268779
14032C268779j10678j69916m1120L37618n76148M07647q2687n1033j67600k8044
14022B786818K2822j79900l4881J65605m52142L47869m95l85209J21404r7972
14012B293919j85040J46603K82771j37367j77070M37942l65601J70132j08898
14003B357391J72529r2767l78572L9786K44747j51292k16145L36602k02300K18009
13993B327988j25230K04631l2385M81812P70973K077833N280197J2593935K6011645
13984D9591399j8911131A4240874o034269k275562j253627p83016m25405n56345
13976B912650J8218o1987j67358q72k59686K19671l85358J05603j13602J15604
13966B382883O7157J26873j69441l21240k28417M70040m42362L84536r3306P3931
$$ plain form
14032 3268779 3158101 2988185 2947065 3284683 2708535 3116182 3033495 2982462 2814862 2786818
14022 2786818 2809640 2629740 2594859 2760464 2308322 2656191 2655696 2270487 2391891 2293919
14012 2293919 2108879 2255482 2538253 2400886 2223816 2661758 2296157 2466289 2357391
14003 2357391 2529920 2437153 2058581 2098367 2343114 2191822 1975677 2312279 2109979 2327988
13993 2327988 2202758 2407389 2375004 2856816 3627789 5705622 10985819 23579754 49591399
13984 49591399 30680268 14240874 8206605 5931043 4677416 3894400 3468995 2912650
13976 2912650 2930868 2868881 2701523 2700651 2440965 2660636 2275278 2380881 2267279 2382883
13966 2382883 2450040 2576913 2407472 2086232 1857815 2327855 1885493 2270029 2176723 2250654
13956B250654o99008J85451K84540k03174J53275K24211l96858j10549K04653
13947A893195k48680J37259J87055q9813Q4134j15049k36225L9L41264m5478j35165
13936A772536k6874l5064j3324J17486J10850k99081l34813K72284N9457j43012
13926A480445R9301K21436k90736K74030k31519N9686j05704J30590J0713o0249
13916A587993k92878J45415k7757j95319P01889n00511K1589P9143k32477j50708
13906A136379N49641l53780k08134M6679L3889J10752J9423p352Q6570n4472Q4013
13895A443608j57709j15707K1576J90239j99301J77691J43081j43482m4353j08844
13885A206799L41753l28847P0996M0298l69018L78227q9557O4364k8985j81371
$$ plain form
13956 2250654 1551646 1737097 2021637 1818463 1971738 2195949 1799091 1688542 1893195
13947 1893195 1644515 1781774 1968829 1879016 1963150 1848101 1611876 1611915 1953179 1907701 1772536
13936 1772536 1745662 1710598 1697274 1814760 1925610 1626529 1291716 1564000 1623457 1480445
13926 1480445 1579746 1801182 1510446 1784476 1552957 1612643 1506939 1637529 1648242 1587993
13916 1587993 1295115 1440530 1412773 1217454 1919343 1418832 1440421 1519564 1287087 1136379
13906 1136379 1686020 1332240 1124106 1170785 1204674 1315426 1334849 1327497 1414067 1359595 1443608
13895 1443608 1285899 1170192 1191768 1382007 1182706 1360397 1503478 1359996 1315643 1206799
13885 1206799 1548552 1219705 1290701 1330999 961981 1340208 1250651 1315015 1286030 1104659
13875A104659K71499l5182k51221M04324l83131M4452m16053M46936r1678k70989
13865H23616J13494M16022l63884j14543K52769l7136j08110P5825J58237l46786
13855H69504K06918k19128R8124K8830L98414o02757K26855j4501J88996m04447
13845G76808J14968J74608o0253j64946L02203k29059m2640K15119r6362K05363
13835A195809n66562J11862o481J54541l3793J53678j77474J61524j75072J85682
13825A003714m76k7966k4555j20453J25507K18516m3467j53706j33551J5962J22342
13814I81867k05704J7925J85813K65182n84927K83135j35994J93343m84969K39208
13804G54879j95608J93020j97008J34594q2133M5154J75011J72853m80254M1330
$$ plain form
13875 1104659 1376158 1340976 1089755 1494079 1110948 1155400 739347 1186283 1094605 823616
13865 823616 937110 1353132 989248 874705 1127474 1090338 982228 1058053 1216290 869504
13855 869504 1076422 857294 955418 984248 1382662 779905 1006760 992259 1181255 776808
13845 776808 891776 1066384 1006131 841185 1143388 914329 871689 1086808 990446 1195809
13835 1195809 629247 741109 734628 889169 855376 1009054 831580 993104 818032 1003714
13825 1003714 1003238 975272 950717 830264 955771 1174287 1130820 977114 843563 859525 981867
13814 981867 776163 794088 979901 1245083 660156 943291 807297 1000640 515671 754879
13804 754879 559271 752291 555283 689877 607744 652898 827909 1000762 520508 561838
13794E61838L20296N5022l13884M03449l43807q7113K60687k32285J94278j37676
13784F80805J12998l0314j32130k85966M74998m1807n157N293L0428k93356K50817
13773G66609m8321q2171j81471L08154j29384J38200J50898l46095K95871k04775
13763F67515q4832N3323q210K87003l71319j54740K64764K22064M4217m40719
13753D79066R1045m9781J73696K0474j1025J79309l71246n3737K76304j26437
13743F07668j70204K15916j67454K34073j64304j6058L78188m20576L24796C86316
13732B98233N80359j14332j21446J15912k80321j44084l0970O3885K73250N0315
13722F90801P9026k68018A68736N64557n9384o1163r715k28799J4503J10655N1226
$$ plain form
13794 561838 882134 937156 623272 1026721 682914 595801 856488 624203 818481 680805
13784 680805 793803 763489 631359 345393 820391 778584 773427 778720 809148 515792 766609
13773 766609 718288 636117 454646 762800 633416 771616 922514 576419 872290 667515
13763 667515 582683 636006 627796 914799 543480 388740 653504 875568 919785 479066
13753 479066 570111 520330 694026 714500 703475 882784 511538 457801 734105 607668
13743 607668 437464 653380 485926 719999 555695 539637 917825 497249 822045 386316
13732 298233 878592 764260 642814 758726 478405 334321 303351 367236 640486 690801
13722 690801 769827 501809 168736 733293 673909 612746 603031 374232 388735 499390 550616
13711E50616J10686K06910B52761K86058j05137Q5527m427k6126m802L8177q9532
13700D32499L95474k54638K5295j83732K054J35126J3514q6635j91883L06739
13690E93813j51180M2633j87795J63565o0518P0829P3771J45538k53645J09722
13680E46733J09802m4254j36888j13156J22970L3367j4425R6617c1647D87286
13669C80950p9502M18034k69568E5095K11385J60825j68764P5775j08976J8126
13659B43466K42221P5215j52841K30779k73493P7324j66171J72252K51968j37152
13649E63568j47323q9467L4122J481J39758f0099F95768p8606k58395K28725k34240
13638C53252K18852Q6829k67916R0480O9968k65639L59074A21073O34344B36736
$$ plain form
13711 550616 661302 868212 252761 538819 433682 519209 514782 488656 483854 522031 432499
13700 432499 827973 573335 598630 414898 416952 552078 565592 478957 287074 593813
13690 593813 442633 485266 297471 461036 400518 471347 545118 690656 437011 546733
13680 546733 656535 612281 475393 362237 485207 518574 504149 600766 -31647 487286
13669 380950 301448 719482 449914 55095 266480 427305 258541 334316 225340 243466
13659 243466 485687 560902 408061 638840 365347 442671 276500 448752 700720 563568
13649 563568 416245 326778 360900 362381 502139 -60099 695768 617162 358767 587492 353252
13638 353252 572104 658933 391017 481497 551465 285826 644900 121073 755417 236736
13627E01650j33888H7422M33385j47882K25076J21854C30583N47351C46286J3496
13617C59782O7337A82605K94683j09919g593C68722O7748J06669j44037j59238
13607B39864K40287A65664J05970n0521J46285J64498B18928D4370J8609M83590
13597E46569r8491j40901A47718K1058L0922J18363J03565A56784L47755k09707
13587B94832A07011K72142K68920l01782J15890n3202j59928J32154P6860f0448
13576B0392K20681K5783M29454j11546J39066j55233A47217K98929j73871J24565
13566C96840H5431i2731A08167K24089J3544j01035m4182l1632J42090J03896
13556D14937K7772j17032A61222A8378M00159j63390G1826L40958j71631N6031
$$ plain form
13627 501650 367762 87422 520807 372925 598001 719855 330583 877934 346286 359782
13617 359782 427119 182605 477288 367369 -7593 368722 436470 543139 399102 239864
13607 239864 480151 165664 271634 221113 367398 531896 218928 44370 62979 546569
13597 546569 448078 307177 147718 168776 199698 318061 421626 156784 504539 294832
13587 294832 107011 379153 648073 346291 462181 408979 249051 381205 458065 -60448
13576 20392 241073 266856 696310 584764 723830 568597 147217 446146 272275 396840
13566 396840 85431 -92731 108167 332256 345800 244765 200583 168951 311041 414937
13556 414937 442709 325677 161222 18378 418537 255147 71826 412784 241153 297184
13546B97184Q0481j59876J7576p1783J05892L08679j7729k19977K05031k61354
13536B84124K79376q3761B09445M966j4418L75638k49954j08668J6435J19860
13526C53304L7150j23681J3004j27823C1746J20412K55719j33274J65363p7979
13516C61987C0222K40665J49120B02766M04428A90513k2564D3756L72530A77483
13505D64174A09256l0659J31291p3766K13014N9578d3931C35840D9912e8582p5554
13494a34136A3288a36141C68463A06236O8251J57397o3355l4851j09796J38061
13484B61943J69095j16444q3676K02837a54165I7942Q0779K98110n1049r2654
13474C33128L00691B58649L1796a92335M3911b0018A34395J21194I7806L31622
$$ plain form
13546 297184 377665 217789 235365 163582 269474 578153 560424 340447 545478 284124
13536 284124 563500 479739 209445 214411 199993 575631 325677 217009 233444 353304
13526 353304 390454 266773 279777 151954 31746 152158 407877 274603 439966 361987
13516 361987 30222 270887 420007 202766 607194 190513 167949 43756 416286 177483
13505 464174 109256 78597 209888 136122 349136 408714 -43931 335840 49912 -58582 -134136
13494 -134136 13288 -136141 368463 106236 174487 331884 268529 233678 123882 261943
13484 261943 431038 314594 230918 433755 -154165 97942 178721 476831 425782 333128
13474 333128 633819 258649 290445 -192335 -148424 -20018 134395 255589 97806 429428
13464D29428J54817C1479J66279P9498J53344M4356A24658K47939J21324j66470
13454C27451D5577K59686J65468o7230A7058K84266d4044A70889J43420E2796
13443D91776p5390C4478K38150p8788K2387B2832O5985J37535a40835e2241A02498
13431C44844A58857K37467K0924a93558A14104J40950o8333p4397J95237I4378
13420B31031g7468A91285P4758q8617j5706J50502a8383C83717o8601d5291A87986
13408C43336r1576Q714A23153Q1781J02293m5435P0812c1474A58100K03331A12457
13396B01006j3778A7379M41232I8772b7752B93625Q5504A49720a81118D60938
13385E51550A20443M6468G1700K49103F8975K0541J03113M75858k62888I1940
$$ plain form
13464 429428 584245 31479 197758 277256 430600 474956 124658 372597 493921 327451
13454 327451 45577 305263 470731 403501 17058 301324 -44044 170889 314309 52796
13443 491776 416386 34478 272628 193840 216227 22832 88817 226352 -140835 -52241 102498
13431 344844 158857 396324 417248 -193558 114104 255054 186721 112324 307561 94378
13420 231031 -77468 191285 266043 177426 161720 312222 -18383 383717 315116 -45291 187986
13408 343336 251760 260474 123153 204934 307227 261792 332604 -31474 158100 361431 112457
13396 201006 187228 17379 458611 98772 -27752 293625 379129 149720 -181118 460938
13385 551550 120443 166911 71700 320803 68975 89516 192629 668487 405599 91940
13374B92522a58749B86639O5129M3230J02037G5226J1687J99755L0931P2393G7432
13362E39637A10302O9523m1157l5664M95974B73194j10529l422k6283J7109N9911
13351B09980h759A78524D2544K96048I0594m0338K16593G1764K81872M8943A36861
13339B97504a78227D87584k319b4917D73738k35143Q8440j07373q8646K78553
13329D09569A37848J33311a30796b8162A66938N9943L76499A76189h6035H0422
13318A59888F7295K91653j54765I6077Q0245O4721p502L5615G2206g1994A02619
13306B50924k9936n3999i74B30962b57855B85799j21904k6989K71109B4740K57745
13295B82485q3697a87141A7061a25023C686c0577p9971j29528B22246f9908j17361
$$ plain form
13374 292522 -158749 286639 351768 394998 497035 75226 86913 286668 317599 389992 77432
13362 539637 110302 179825 138668 103004 598978 273194 162665 159243 132960 150069 209980
13351 209980 -8759 178524 42544 338592 90594 50256 266849 71764 353636 402579 136861
13339 297504 -178227 487584 485265 -24917 473738 238595 327035 219662 131016 409569
13329 409569 137848 271159 -130796 -28162 166938 226881 603380 176189 -86035 80422
13318 159888 67295 358948 204183 96077 176322 241043 233541 269156 72206 -71994 102619
13306 250924 220988 166989 -974 230962 -257855 285799 163895 136906 408015 24740 282485
13295 282485 198788 -187141 17061 -125023 3686 -30577 -110548 -240076 222246 -69908 -187269
13284a87269B5151L61184i7865H6194K03168n2171p3717J03554c75483C13884
13273C22441r1120i496A67288d1981C95151j30832J03617A16801m5693g9501B12084
13261a53726A77170c6296o1837B12782l3461N5998p2808j929M4508o5166J19708
13250B59632E7338P5442Q7380Q5555n3872A23868N411a72132B4327i4605C44547
13238B09375k7954l2622K0294a56085A81789F3560a71225O135G9650N36993j38689
13227D77954A64495a3281A88697b1229C47057F9068O7093J52107Q974o3573C4140
13215A31419b02604D9892O7442l9722N9624C0168b1527B10760O1730j28340J30732
13204B74882P1932c04749A97984l6851A7919a63373B72048e16116C36301d6123
$$ plain form
13284 -187269 25151 386335 -97865 86194 289362 237191 163474 267028 -375483 313884
13273 322441 231321 -9496 167288 -41981 395151 264319 367936 116801 71108 -79501 212084
13261 -153726 177170 -36296 -98133 212782 179321 235319 162511 160582 205090 139924 259632
13250 259632 57338 132780 220160 305715 251843 123868 129279 -172132 24327 -94605 344547
13238 209375 181421 148799 169093 -156085 181789 63560 -171225 -165090 79650 616643 477954
13227 477954 164495 -13281 188697 -21229 347057 69068 136161 288268 297242 233669 34140
13215 131419 -202604 49892 117334 77612 137236 30168 -21527 210760 272490 144150 274882
13204 274882 346814 -304749 197984 161133 17919 -163373 272048 -516116 336301 -46123
13193A70011b96353f5318H1559q50K27680n5364B2445K5116b19762F9277J49016
13182B18293E1291B4023b27187F1656a20764j6685A1175J98354l5727K7248l6975
13171A64075l0961a33533d9478D0539b67781A49656F2334M2145B6716J95148i2831
13159A07970a51664C70860J38783r2378A77839b8092A72272O4024a35554A0718
13148A63702o4689l5569b37742k3920a7482C73798m2056l562J97732a54587q5044
13137b39631m4049F1699R576a45090B61752j10157E7978d39031D9766J73657b2171
13125D1614O7006O5547a95015B00400a03328J1640I4595J97015r7931m0752E8188
13113B35168k3290P7984r8155i6579H1026J34850D5343L5859a01146A85061a15927
$$ plain form
13193 170011 -296353 -65318 81559 80709 308389 253025 22445 47561 -219762 69277 218293
13182 218293 51291 24023 -227187 61656 -120764 -137449 11175 209529 173802 201050 164075
13171 164075 133114 -133533 -49478 40539 -267781 149656 62334 104479 26716 221864 -92831
13159 107970 -151664 370860 509643 417265 177839 -28092 172272 236296 -135554 10718
13148 163702 99013 63444 -237742 -261662 -17482 373798 331742 328180 525912 -154587 -239631
13137 -239631 -283680 61699 71275 -145090 261752 151595 57978 -439031 49766 223423 -22171
13125 41614 108620 174167 -195015 200400 -103328 -91688 94595 291610 193679 152927 58188
13113 235168 211878 289862 191707 -96579 81026 215876 45343 81202 -101146 185061 -115927
13101I8681J85565j30325m9572J6362d2613A75290H6686K44358E4332L4074j5424
13090G2982O8662B4804b12438h359c397B17679c75871B52867H5799L7351J25301
13079B48451C1884L22948i8570A73921K35781h216B29742D9656N666Q4663a382
13067a2997B09960a55352M393j49803h7943B44936j19179a43560A75038J87894
13057C62932a54383B04250D6517J27643J55209H0625l9580O3085K055h6411I5227
13045f2819C16126c0567m7948n7593p300D7736b33475J01194F5663c04246B20013
13033A44490B241d7031C20311a59856C7929J9183K6566P9706J1954a59950P9944
13022h0006B2595L21783B6711a23421B96382I4211J37141A4323Q7979L21199C1286
$$ plain form
13101 98681 284246 153921 104349 120711 -42613 175290 86686 331044 54332 88406 72982
13090 72982 141644 24804 -212438 -8359 -3397 217679 -375871 252867 85799 123150 248451
13079 248451 31884 354832 -98570 173921 409702 -8216 229742 49656 55322 139985 -1382
13067 -12997 209960 -155352 -150959 -300762 -87943 244936 125757 -143560 175038 362932
13057 362932 -154383 204250 46517 174160 329369 80625 41045 104130 106185 -86411 95227
13045 -62819 316126 -30567 -78515 -136108 -143408 47736 -233475 -132281 65663 -304246 220013
13033 144490 2241 -47031 320311 -159856 37929 57112 83678 163384 175338 -159950 -80006
13022 -80006 22595 344378 26711 -123421 296382 94211 231352 14323 102302 423501 31286
13010a06926d6622B26023b21351A31316p708J23861a57874I6877O912B1544c21262
12998A31073J7957B4512J30316f597l36305A6395P8116b2941j00729I5204K74621
12987C69825G7767K45015d2512A18728k8817e8818k0590b8950l7514c0257A05401
12975g7463B20257m4828a35767B5272a36769j4217G1374i6392B01355l4987L5153
12964B01521k4501b092j2848m8410J9484A24323C7316O3086m7955a12212C7919
12952g4591F2904a82384k9573J1795N9018C97943o8920d4650A21515A1674c00766
12940E2642Q2016g6212b8161A35795a1532B81954H2640r472e2995D3391K6357
12929F9748g060C0149K52230b9937K592o9312n4834d8497J9791B28129a63323
$$ plain form
13010 -106926 -46622 226023 -221351 131316 123608 247469 -157874 96877 103789 21544 -321262
12998 131073 149030 24512 154828 -6597 -342902 16395 94511 -22941 -123670 95204 369825
12987 369825 77767 322782 -42512 118728 89911 -58818 -79408 -28950 -66464 -30257 105401
12975 -77463 220257 175429 -135767 25272 -136769 -150986 71374 -96392 201355 166368 201521
12964 201521 177020 -2092 -14940 -63350 -43866 124323 37316 100402 52447 -112212 37919
12952 -74591 62904 -182384 -211957 -200162 -141144 397943 329023 -44650 121515 11674 -300766
12940 52642 134658 -76212 -28161 135795 -11532 281954 82640 73168 -52995 43391 69748
12929 69748 -7060 30149 282379 -29937 -27345 -96657 -151491 -48497 -28706 228129 -163323
12917B3701L3181R6552j8800b7248A23503e7159C49566i2776A99872m1019p0317
12906H8536A9776O2298J06038p8020A7762a65225B89124m88r3174N3893f0645
12894b93987f6522C87058j89036G6705K6590a07422j55953A83556G5066J52273
12884B27339h2326A3015J13837a89195c5929A01514L8114O1530I9892c06344F1816
12872H3045l0531a5072E371J62778d19372I9776a48461B56367d0873q6357J1356
12861a15874G3719K1510a0682l516n99A46319c432I193e2410k90925J56125B29839
12848A04806J6831a19826e4055C42883b6932h868A19722m9228k3434a84612C6388
12836c49712C943d8145H0158l9064L3550c3657J3808q5360A44833d0729D8520
$$ plain form
12917 23701 56882 153434 134634 -27248 123503 -57159 349566 -92776 199872 158853 88536
12906 88536 19776 82074 188112 110092 17762 -165225 289124 288636 195462 249355 -60645
12894 -293987 -66522 387058 198022 76705 103295 -107422 -263375 183556 75066 227339
12884 227339 -82326 13015 126852 -189195 -35929 101514 139628 201158 99892 -306344 61816
12872 83045 52514 -15072 5371 168149 -419372 99776 -148461 256367 -40873 -127230 -115874
12861 -115874 73719 95229 -10682 -14198 -14797 146319 -3432 9193 -52410 -343335 -187210 229839
12848 104806 121637 -119826 -54055 342883 -26932 -8868 119722 70494 47060 -184612 36388
12836 -349712 3943 -48145 80158 41094 74644 -33657 -19849 -105209 144833 -40729 48520
12824B55077E9492J06480C8218a6157B02032b2270B7219I11J28534J02362b208
12812E4718a5739j17025j2566g0094A26791A4690a31748M256A84650a22774C8297
12800a08093b9600j53322H9651b96789i5893A92223a40629P0208A68203a00292
12789B50503f7789I7963g8108b1251A10596g1740F7737a71748c7891l10295c2272
12777A96874a67009o7433q672d9181D2966L2607D569K09623j03918m3735a72741
12765A11729D5234a53653A762J76181D9797a35044K2466B71159a89018j07739
12755b96757H8634b72546A1697J23502a05618A36987D2172c04570A9123Q2955
12745A02078L5659J1440j5309i2623E7931k7631a37836b8466C4428a29881D7980
$$ plain form
12824 255077 59492 165972 38218 -16157 202032 -22270 27219 911 129445 231807 -2208
12812 54718 -15739 -132764 -145330 -70094 126791 14690 -131748 -127492 184650 -122774 38297
12800 -108093 -29600 -182922 89651 -296789 -95893 192223 -140629 -70421 168203 -100292
12789 250503 -67789 97963 -78108 -21251 110596 -71740 67737 -171748 -37891 -348186 -32272
12777 196874 -167009 -234442 -243114 -49181 42966 75573 4569 214192 110274 66539 -172741
12765 111729 45234 -153653 1762 177943 49797 -135044 -112578 271159 -189018 -296757
12755 -296757 88634 -272546 11697 135199 -105618 136987 42172 -304570 19123 102078
12745 102078 137737 149177 133868 -92623 57931 30300 -137836 -28466 34428 -129881 47980
12733b09747H7913K31755i3135C68472A55109b29281l4238G044c29706A51629
12722A15467J56624b98596B97300b5062j45602m7795C40298G9553A2517M68108
12712D80625H4041c8462l3251B38271I0334l255J39571r819H8146M7801Q3981
12701B19928A05088m9611J58461n7666Q0755J8338c03855C50450b9975K556j53032
12690a80451d8551C6047c11248g998I5045b89096B15161d06371B5550L46555A4646
12678D2250J59928b13647f3149G0774j8518O0852a72962B43680n2315f2525b946
12666A07368L8718J96114b92375A02623K0357O3552o6807a24782J5553H8252K5828
12655A14080C8112b78107A60380e5731I2017o416a101B10610r5553J18609b39522
$$ plain form
12733 -209747 87913 319668 -93135 368472 155109 -229281 -263519 7044 -329706 151629
12722 115467 272091 -298596 297300 -25062 -170664 -218459 340298 79553 12517 480625
12712 480625 84041 -38462 -71713 238271 90334 87079 226650 216831 88146 135947 219928
12701 219928 105088 55477 213938 156272 237027 255365 -303855 350450 -29975 -27419 -180451
12690 -180451 -48551 36047 -311248 -7998 95045 -289096 215161 -406371 25550 372105 14646
12678 42250 202178 -213647 -63149 70774 52256 113108 -172962 243680 191365 -62525 -2946
12666 107368 146086 342200 -292375 102623 122980 186532 119725 -124782 -109229 88252 114080
12655 114080 38112 -278107 160380 -55731 92017 85601 -1101 210610 115057 233666 -239522
12643e7467A19772O0983b38327I7790a7585I0119N07610D8288K65293E2765k2631
12632C0134P5868L00224p1136p581K8131m2921a51133C0735d22894a75617O5226
12621a10391A60176R6422p0316Q59j1095R009d8583A62472j0124D3079E611b59854
12608i2850q1716b8027j37089c0717k12743C0591o707J00614K54782c9827H6812
12596A08383K48056P1801h3180c436q7049A18367C7644L25531I3869A3154a87211
12584h4222A24790P2848i0863b7225e696D22316e7391B65524F3058h8567k5206
12573a13773A84085b0420A55815a14795B27394f1711n8814A75823L5753b5945
12562a05778o6262F8057E600J80613e765A04030a26633F2626b06728A3483a12866
$$ plain form
12643 -57467 119772 180755 -238327 97790 -17585 90119 597729 48288 313581 52765 30134
12632 30134 106002 406226 335090 327509 355640 312719 -151133 30735 -422894 -175617 -110391
12621 -110391 160176 256598 186282 187141 176046 185055 -48583 162472 152348 43079 5611 -259854
12608 -92850 -174566 -28027 -165116 -30717 -243460 30591 23884 124498 379280 -39827 86812
12596 108383 356439 428240 -83180 -3436 -90485 118367 37644 363175 93869 13154 -187211
12584 -84222 124790 197638 -90863 -27225 -5696 422316 -57391 265524 63058 -88567 -113773
12573 -113773 184085 -20420 155815 -114795 227394 -61711 -120525 175823 211576 -25945
12562 -105778 -172040 68057 5600 186213 -5765 104030 -126633 62626 -206728 13483 -112866
12550a40602d8639m9746A65605m7692f285p6519A81442b24193A98056d82586B48214
12538h458K928I6985A0238e5331J4248o9229A44863Q4257g4280B166M8982K0574
12526G1722C1248d248A63168C2995Q159g6809B35686a48699A95178E2416a07922
12514c01288E0376a86669O7607A70423a626C5641J27324d0121a8432A85355b66993
12502C27218A41613f3238k59432J56833B50624M4501c1522k56136H2473J11539
12492A94012d05926A30881R2804J47910G5276b86037L0969A19655a05126k03714
12482c08840L4500C77558C7841O5051i3832j29975B6369K20224A2709K99257b25686
12470f6878A53982D744M7019e7525A60287J0097J9373b71837B0361c59219D3848
$$ plain form
12550 -140602 -48639 -98385 165605 117913 -6285 -82804 181442 -224193 198056 -482586 248214
12538 -8458 -5530 96985 10238 -55331 -41083 -110312 144863 229120 -74280 2166 51148 71722
12526 71722 31248 -4248 163168 32995 41154 -76809 235686 -148699 195178 52416 -107922
12514 -301288 50376 -186669 -119062 170423 -1626 35641 162965 -40121 -18432 185355 -266993
12502 327218 141613 -63238 -322670 -165837 250624 295125 -31522 -287658 82473 194012
12492 194012 -405926 130881 223685 371595 75276 -286037 -255068 119655 -105126 -308840
12482 -308840 -274340 377558 37841 102892 -93832 -223807 26369 246593 12709 311966 -225686
12470 -66878 153982 4744 51763 -57525 160287 170384 189757 -271837 20361 -359219 43848
12458B80186d10579a32067C2304b87651J31307M2929H3684a79374e4408A10151
12447a1844k21436f275l91185E8079J25931C1991N1062g9573E0212a81550b9545
12435C26236a32138B30836b82730J04241A26422b43172J4845b8006j3016j50456
12425a91478J2906D4119a6089B75477p6994J24062o5480B8821J51137b48623e2746
12413g6482P180B48017B4760b0072B11925D1192f0841k76758I8357b22933L6848
12402a86085A60946C5207J21273N8078b38601Q3201r8434N142E8309J29166a25104
12390D3732i9923k4472A63823e656l9406k17698f6783D25119A89161h2534G42
12378a8763j77927N2315G974h8611B43895a08911o7997C90805j85894p310C6915
$$ plain form
12458 280186 -410579 -132067 32304 -287651 -156344 -113415 83684 -179374 -54408 110151
12447 -11844 -233280 -6275 -397460 58079 184010 31991 83053 -79573 50212 -181550 -29545
12435 326236 -132138 230836 -282730 -178489 126422 -243172 -228327 -28006 -41022 -191478
12425 -191478 -178572 44119 -16089 275477 198483 322545 257065 28821 179958 -248623 -52746
12413 -76482 -69302 248017 24760 -20072 211925 41192 -60841 -337599 98357 -222933 -186085
12402 -186085 160946 35207 156480 214558 -238601 -155400 -253834 -248692 58309 187475 -125104
12390 43732 -99923 -124395 163823 -5656 -45062 -262760 -66783 425119 189161 -82534 742
12378 -18763 -196690 -144375 7974 -88611 243895 -108911 -176908 390805 204911 197601 36915
12366g6913j9756A63555K27792c812E2608c4375m275A24349a30160D9448j6869
12355C2579J25538N068F0046a61482G644K95459C6186J03541b58600B22964o1966
12344A60998m7864J47949B0708R058b31647M6071h4124R052E2943A7099R7738
12333A14837G209c138n1334A24905J23219R8184e9355C02203R3539j02457j14867
12322A78418J46296A12240K28743A21064L70255A67596k5983J50762L5505d3053
12311B48465r1582G7216K50741j05269l7845G2265E323K59745a77745E1600K6086
12300G7686C7768K79890H0695R44J49644A00995a08725D6071o171P902r932K71928
12288C09798A01895g9565m8585A24481N7920C8262L3003j6191J95842E784M2845
$$ plain form
12366 -76913 -96669 163555 391347 -3812 52608 -34375 -38650 124349 -130160 49448 32579
12355 32579 158117 163185 60046 -161482 7644 303103 36186 139727 -258600 222964 160998
12344 160998 113134 261083 20708 29766 -231647 -185576 -84124 -75072 52943 17099 114837
12333 114837 7209 -3138 -54472 124905 248124 346308 -59355 302203 395742 293285 178418
12322 178418 324714 112240 340983 121064 491319 167596 141613 292375 327880 -43053
12311 248465 156883 77216 327957 222688 184843 72265 5323 265068 -177745 51600 77686
12300 77686 37768 317658 80695 81639 231283 100995 -108725 46071 39900 47802 37870 309798
12288 309798 101895 -79565 -128150 124481 182401 38262 71265 55074 250916 5784 48629
12277D8629L41801A65006q1783J00277m284F9055a20893A87721b93448E8735K92637
12266C51372J1763F4924K62103d9898A85741H0580N4024M1712J81496A4804J21484
12255A36288J98913j07529C5183L29612i1212C5005K94813a62768A50478D7800
12244G1888a07324k6110A24400A2214K38633a29749C3135K68504M8765A0139K19638
12233B29777J57530j28360j00849h9547A0063M10667a8888D34740F945K46678
12223B53623K71441b4797C08679A3177J29265m1781K98301A29906O7441f6997
12212B72880b01576A3994K2814J07498L0937p8375J56644j04162h6515L539B10840
12200b18217B00538K82011B07722K61768B26588B5101L44453A63384a02067M5629
$$ plain form
12277 48629 390430 165006 83223 183500 179216 69055 -120893 187721 -293448 58735 351372
12266 351372 363135 64924 327027 -49898 185741 80580 134604 176316 357812 14804 136288
12255 136288 335201 227672 35183 364795 -91212 35005 329818 -162768 150478 47800
12244 71888 -107324 -133434 124400 12214 250847 -129749 33135 301639 350404 10139 229777
12233 229777 387307 258947 158098 -89547 10063 420730 -18888 434740 6945 253623
12223 253623 525064 -24797 308679 13177 142442 100661 398962 129906 197347 -66997
12212 272880 -201576 13994 36808 144306 175243 96868 253512 149350 -86515 -82976 210840
12200 -218217 200538 482549 207722 469490 226588 25101 369554 163384 -102067 -56438
12190e6438A7858J93249l6415G4972L31102j51654I0097K04462a8209B20809c04381
12178C08965j37288c147A0283O8542K18339C2557L99336j83319Q3833j26953M36652
12167F42106B67904q5042f8100A11643a06238d5913l350B65895o1785J04253C6180
12155C09559j38383K0708O850J56025j67148g4569a1373D55093B08099I7564h2445
12143a43760m4398A38386R064a72098B64937b84773A34691R8854o9195D9339J24988
12132A74327D896c2892k03043A32535b14048A96012E2741Q9102Q2833k0300b140
12120A67376c819A10015b4357D11626A71221D0431e6017B33183c3493G3459a11591
12108c29951D15649j42201H7696M6146J6517p5065a52053B34255I7572J32364
$$ plain form
12190 -56438 17858 211107 174692 74972 406074 254420 90097 294559 -18209 220809 -304381
12178 308965 171677 -3147 10283 78825 297164 32557 431893 248574 332407 205454 642106
12167 642106 267904 182862 -68100 111643 -106238 -45913 -49263 265895 204110 308363 36180
12155 309559 171176 191884 198734 354759 187611 -74569 -11373 455093 208099 97564 -82445
12143 -143760 -188158 138386 147450 -172098 264937 -284773 134691 233545 164350 49339 174327
12132 174327 4896 -32892 -235935 132535 -214048 196012 52741 141843 224676 204376 -2140
12120 167376 -3819 110015 -24357 411626 171221 40431 -56017 233183 -33493 73459 -111591
12108 -329951 415649 273448 87696 133842 150359 75294 -152053 234255 97572 229936
12098B29936F9702M71432b32737c6697A18342C4559J15756F8016f3828B5084K33094
12087B58178G2799j1429K54218B5858K80931b5573k23177E1743K21992F6732K73535
12076C40267D6143a84582A74575k4764K31874j74376P1940G0524J84077A16629
12065a46092o355A02118J11103b30881C258h6785L0704A39723d8941A91070L0561
12054B21631B8297b83360B6514c4276F9265b87734B04587J167R237e0673m2785
12043i3458q286A5647a30785B14791a17793k4408a9063A98707Q4926d5893l7133
12032h3026i314B39808b95464i4120H0602b51964e9513j44583M1136A6091K52943
12021B69034G3670l1404j1442O0811K45519r3771j15507d01533a00208C00981
$$ plain form
12098 229936 69702 541134 -232737 -36697 118342 34559 150315 68016 -63828 25084 258178
12087 258178 72799 61370 315588 25858 306789 -25573 -248750 51743 273735 66732 340267
12076 340267 46143 -184582 174575 149811 381685 207309 279249 70524 254601 116629
12065 -146092 -152447 102118 213221 -230881 3258 -86785 -56081 139723 -48941 191070 221631
12054 221631 28297 -283360 26514 -34276 69265 -287734 204587 205754 214991 -50673 -93458
12043 -93458 -101744 15647 -130785 214791 -117793 -142201 -19063 198707 283633 -45893 -83026
12032 -83026 -9314 239808 -295464 -94120 80602 -251964 -59513 -204096 -162960 16091 269034
12021 269034 73670 42266 30824 91635 337154 243383 127876 -401533 -100208 300981
12010A90686k2432b02290E59325I3189l3460a29357b220A20280J89258H3816J7605
11999A01421m7314b69337Q4678A62a16041k04640b6082n785k5158A13993J09432
11988B23425n1812a4005k1286G341J09351D4002J55293e5752b0700h04k0644I5371
11975A68655e5846A88494e1446G1991l2831M1696e0219n6046k0726D9960J10168
11964A60128c9935j96908a11541M5858A58516E9443b9374A62805a48256A57200
11953A1189K14656A1362O5492i947j59348f6635j41922N9652G7162i0199a8107
11941a67078H8551b17371b4366E8709b15034O7774M9432A37082E3138b75496G8342
11929G8529a80273n009A87252c33920B03563A1764a41361p252I2757J27946a06062
$$ plain form
12010 190686 168254 -202290 559325 93189 59729 -129357 -2220 120280 309538 83816 101421
11999 101421 54107 -269337 -184659 162 -116041 -320681 -26082 -31867 -57025 113993 223425
11988 223425 171613 -14005 -35291 7341 116692 44002 199295 -55752 -20700 -804 -21448 95371
11975 168655 -55846 188494 -51446 71991 39160 80856 -50219 -106265 -126991 49960 160128
11964 160128 -39935 -236843 -111541 -65683 158516 59443 -29374 162805 -148256 157200
11953 11189 225845 11362 76854 -9947 -169295 -66635 -208557 -148905 77162 -90199 -18107
11941 -167078 88551 -217371 -24366 58709 -215034 -147260 -97828 137082 53138 -275496 78342
11929 78529 -180273 -185282 187252 -333920 203563 11764 -141361 -148613 92757 220703 -106062
11917A31615l3351c83261a03635A72297G9235J30574D9841a06270b5747n8943
11907h4690A4995K25485A08844A8846c8616B56171O841b66649C55553m8347a70976
11895g2879I9467A3954a48671k49029Q7440M0005J20981A21190i0435E8640B5025
11883A10565b37752I4704a69498A11157b36301N2896c1453I1495c27524J13676
11873b13848d9615k08193d8839j18182A96081D8897A8638h9456d884r2381k36129
11862c33394i5011j1649o0153C04852a10819J7279B26364a25669j0848k83378
11852d19895f6781j9629C04631a27540C77788A30789j7488a27672L2156G7180
11841A6479L25410B2853d0257D4468J5276J9465J71263b0165l8606b427D9086
$$ plain form
11917 131615 98264 -383261 -103635 172297 79235 209809 49841 -106270 -25747 -84690
11907 -84690 14995 240480 108844 18846 -38616 256171 263012 -266649 355553 307206 -170976
11895 -72879 99467 13954 -148671 -397700 -310260 -270255 -149274 121190 -90435 58640 25025
11883 110565 -237752 94704 -169498 111157 -236301 -183405 -31453 91495 -327524 -213848
11873 -213848 -49615 -257808 -48839 -167021 196081 48897 18638 -89456 -4884 -97265 -333394
11862 -333394 -95011 -106660 -166813 304852 -110819 -93540 226364 -125669 -136517 -419895
11852 -419895 -66781 -86410 304631 -127540 377788 130789 113301 -127672 -95516 77180
11841 16479 341889 22853 -40257 44468 59744 79209 250472 -20165 -58771 -2427 49086
11829c9547j58866a9101m8020F9126L7412N5468j5742d08170J37022f6057F4099
11817B79256b16753A7530j749d618A24265g2321G893J09122a22670c7530A43928
11805a26100A39154a57342h475j64673j68983C02605F3757b35930A19416a56065
11794C00865G2333l0831M4636c39878A20393c9732k04958J7588B75499a27210
11783a51126E0995e8073q7157j7514A8136f1176k89458c7529A58669a88391A78313
11771b03131j14917I5802K5079h2135A43184b0363k96147A96965N4308a71706
11760a44504B9230O0759b96315J19019p4232Q8959B3971K84405a23363A66753
11749a48154C5918e9441D583f0754j13623B6877a37236j6242F9207M4180c27738
$$ plain form
11829 -39547 -198413 -19101 -67121 69126 106538 162006 146264 -408170 -271148 -66057 64099
11817 279256 -216753 17530 15781 -4618 124265 -72321 7893 117015 -122670 -37530 143928
11805 -126100 139154 -157342 -8475 -173148 -342131 302605 63757 -235930 119416 -156065
11794 300865 72333 41502 86138 -339878 120393 -39732 -244690 -227102 275499 -127210
11783 -151126 50995 -58073 -145230 -162744 18136 -61176 -350634 -37529 158669 -188391 178313
11771 -203131 -318048 95802 120881 -82135 143184 -20363 -316510 196965 251273 -171706
11760 -144504 29230 89989 -296315 -177296 -251528 -162569 23971 308376 -123363 166753
11749 -148154 35918 -59441 4583 -60754 -174377 26877 -137236 -153478 69207 113387 -327738
11737e0888j3443r7498M5266A84102n6241a13678m4137e3822A81074D1432L16816
11726C58248A30234J9531N6598J33217A07100J56185E3518P6976J75617l6471
11716B69640o2242D6459R3458e8706a9967k54255A29401L17649b130k64583c7202
11704C47880a68868P9456q6276b1892A11407a7644k9496A24320b60187J25961
11694a34226D6197f8064l7034A30946e5024E6027a15248J075C56122b65974i4690
11682a22739l1821C11546G5400N3540i3071A90414a9661k2007F741a11908D3641
11670I0279f0608A23830j759n681N0049G3302a96021A00721c33956B67819A12469
11658B18884I5954h1002D2016O5616b2832A49932j706g3578n9593k24582C8659
$$ plain form
11737 -50888 -64331 -161829 -116563 184102 127861 -113678 -157815 -53822 181074 41432 358248
11726 358248 130234 149765 206363 339580 107100 263285 53518 130494 306111 269640
11716 269640 207398 46459 139917 -58706 -19967 -274222 129401 447050 -2130 -266713 -37202
11704 347880 -168868 -89412 -175688 -21892 111407 -17644 -47140 124320 -260187 -134226
11694 -134226 46197 -68064 -105098 130946 -55024 56027 -115248 -114173 356122 -265974 -94690
11682 -122739 -154560 311546 75400 128940 -93071 190414 -19661 -41668 6741 -111908 43641
11670 90279 -60608 123830 122071 116390 166439 73302 -196021 100721 -333956 267819 112469
11658 218884 95954 -81002 42016 107632 -22832 149932 148226 -73578 -133171 -357753 38659
11646f7405K047l73746A5616a0100I8317a67305n7273M2941A90190H882O6109
11635G4991h6469D4359J50192a22817d1124k7849g443A42099o7202J9988N4344
11624A49229a44042A00560h6339C2433c41149J27489N4688j1222B51419e4269
11613I014a3050A8592K67249B7547J29982J40977b57035j4954a5219A3829d6569
11601a32671n911n271P1114B27343E382K37234j07890B3487O6180b49235A91989
11589f3394q8979M1994b4572j17814A4101J4184e0780E891K23242K822F5867J10798
11577A76665J55227i8377A92826A473c79692b9200j98416A63880C0224f7244j65296
11566b32540E9343a5562D20210b39002I3826g4529A75236k2462c39399A20098
$$ plain form
11646 -67405 -65358 -439104 15616 -10100 98317 -167305 -224578 -181637 190190 8882 74991
11635 74991 -86469 44359 194551 -122817 -41124 -68973 -7443 142099 74897 94885 149229
11624 149229 -144042 100560 -86339 32433 -341149 -213660 -158972 -170194 251419 -54269
11613 9014 -13050 18592 285841 27547 157529 298506 -257035 -271989 -15219 13829 -46569
11601 -132671 -138582 -143853 -72739 227343 5382 242616 134726 23487 89667 -249235 191989
11589 -63394 -152373 -110379 -24572 -142386 14101 28285 -50780 5891 229133 231955 65867 176665
11577 176665 331892 -98377 192826 1473 -379692 -29200 -227616 163880 30224 -67244 -232540
11566 -232540 59343 -15562 420210 -239002 93826 -74529 175236 152774 -339399 120098
11555a48825A81590a25313A71583o5691K16557C1780g913B98726L454A09476b7964
11543g7770P780j54370A25249f2893B39754a17454e0611C63460F3341a79845b3139
11531A07080l4626b16887C82476j31628B2156O8572J5717b019B29865A12963A3679
11519b83024A0464a30946h14E1148k466M909J26979i3033B80606j19426l8823
11508A22357b27301B1080a71087J552B69120b9405A93137a18650j41469B85711
11497B6101A2465L1256a50874o1105C20395d0815l4392C62477B8757c07810A72292
11485a13280A85615a75986C09471c61069D62139F8438J20357n8821D4141J94445
11475B38586H3379B1429b76920D298K86088I3662J01541b63721C39982j13680
$$ plain form
11555 -148825 181590 -125313 171583 105892 322449 31780 -7913 298726 302180 109476 -27964
11543 -77770 -69990 -224360 125249 -62893 239754 -117454 -50611 363460 63341 -179845 -23139
11531 107080 72454 -216887 382476 250848 22156 90728 106445 -2019 229865 112963 13679
11519 -283024 10464 -130946 -814 51148 48682 53591 180570 -93033 280606 161180 122357
11508 122357 -227301 21080 -171087 -169535 269120 -29405 193137 -118650 -260119 285711
11497 26101 12465 43721 -150874 -211979 320395 -40815 -75207 362477 28757 -307810 172292
11485 -113280 185615 -175986 309471 -361069 462139 68438 188795 129974 44141 238586
11475 238586 83379 21429 -276920 4298 290386 93662 195203 -263721 339982 226302
11465B26302p639F8535R7508E6176K08939c4386A87160F0257a94459F30449A99402
11453b14047D07653a10267l4340e3117A97119A2911L17080b69102A83602D4443
11442D4017b19214B91005n7961H9012c00245D7118J90282F3629A9070K41461b75794
11430a63360c689j88956A41h0831r352A52130a46423B0420P8512C7628K8775i6503
11417c5657A3899a21512B8287J60820b6676l29980J77774h1108j14080l9088a14636
11405H7805b78835C0483d6706I028e1397n9013O839A9485a0539j1513A21112C1284
11392b08271k1294b6933B0881c35542A30699a01051Q901I566a91525R2381k02096
11381c01240B90840a82704a7114m2600E8969J31272r1438N5649A6424K4191a31825
$$ plain form
11465 226302 218663 68535 166043 56176 265115 -34386 187160 60257 -194459 630449 199402
11453 -214047 407653 -110267 -144607 -53117 197119 12911 329991 -269102 183602 44443
11442 44017 -219214 291005 233044 89012 -300245 47118 237400 63629 19070 260531 -275794
11430 -163360 -3689 -192645 141 -80831 -90183 152130 -146423 20420 98932 37628 66403 -96503
11417 -35657 13899 -121512 28287 189107 -26676 -356656 -178882 -81108 -195188 -234276 -114636
11405 87805 -278835 30483 -46706 9028 -51397 -110410 -103571 19485 -10539 -22052 121112 31284
11392 -208271 -229565 -26933 20881 -335542 130699 -101051 -92150 9566 -191525 -99144 -301240
11381 -301240 290840 -182704 -17114 -59714 58969 190241 98803 154452 16424 40615 -131825
11369b03266p7862J06439C61878r0508H868a37972d1811j57403a0387m6455B66995
11357b48738b2777C04890c7335j38870B5798Q5425L0952B5642h0125a4904m7766
11346f2670o4968A3132J51732q0283P1780b47963E1200b17118B02137b80167c0170
11334b07660f9945j19643O9214B00697a021E1151K4239h1887I1687g656H7219
11322f6200j11377A01605h5153j25280A74534D2631Q6187J40428e913G7136a44683
11310a71979J3649J3832A27925c14899e693k50636h3820I2953A3117a37891A98999
11298a09307j04097a8488j44595k38352a98121A86867a57218G7473K1649a96540
11287a39664A42225E3342I420c2715j25279A17421f3183k52020Q299g8740q8162
$$ plain form
11369 -203266 -281128 -174689 361878 271370 8868 -137972 -41811 -199214 -10387 -56842 266995
11357 -248738 -22777 304890 -37335 -176205 25798 111223 142175 25642 -80125 -14904 -62670
11346 -62670 -127638 13132 164864 84581 156361 -247963 51200 -217118 202137 -280167 -30170
11334 -207660 -69945 -189588 -120374 200697 -1021 51151 75390 -81887 91687 -7656 87219
11322 -66200 -177577 101605 -85153 -210433 174534 42631 128818 269246 -5913 77136 -144683
11310 -171979 -158330 -144498 127925 -314899 -5693 -256329 -83820 92953 13117 -137891 198999
11298 -109307 -213404 -18488 -163083 -401435 -198121 186867 -157218 77473 99122 -196540
11287 -139664 142225 53342 9420 -32715 -157994 117421 -63183 -315203 -306904 -78740 -166902
11276a66902B26570d68287b28131A81295a71291B40053g4379q6230d6000q1317
11266a27317E0695B1691J6876K05160A3485N3627j4211b6844o0011L2182j79076
11255b33749j09298a60604D9265d909A4463a27145A49359J38404D6619h5424h719
11243i7484A85503C7697a3973k3146k0671p5117A55130b76095h311A56517k6954
11232A29563a28202D4974a85191m4352R3505A02657b8819j61589d0359q5044j9163
11221a44566A33843h4205j06020j43153A10361a61039b7440j78277A62401a86900
11210i8123A01060O4716E6598a69820d104A85163q0171P1346b20973J03950H191
11198h0624B77114b48184P8954l3142C66501A09283M1238a55803A60247b64812
$$ plain form
11276 -166902 226570 -468287 -228131 181295 -171291 240053 -74379 -160609 -46000 -127317
11266 -127317 50695 21691 38567 243727 13485 67112 52901 -26844 -86855 -54673 -233749
11255 -233749 -343047 -160604 49265 -4909 14463 -127145 149359 287763 46619 -85424 -8719
11243 -97484 185503 37697 -13973 -37119 -57790 -132907 155130 -276095 -8311 156517 129563
11232 129563 -128202 44974 -185191 -229543 -136038 102657 -28819 -190408 -40359 -125403 -144566
11221 -144566 133843 -84205 -190225 -333378 110361 -161039 -27440 -205717 162401 -186900
11210 -98123 101060 165776 56598 -169820 -4104 185163 104992 176338 -220973 -117023 8191
11198 -80624 277114 -248184 -169230 -202372 366501 109283 150521 -155803 160247 -264812
11187E21016A73749a37334A40246b26761G1492b48612E9112B6881b27734R653
11177b18081H5532k9510A3778a33203B66441h7919j45284R7474f3968k00534A44408
11165g2225L608j02957l8979Q7947j06441C9828a45362e2058A40503a26361j52042
11154b78403j1036B0855K52127E9313b7758r5124l3315o3353A06195i1898o8693
11143a60591O0767D8736d147A22312E0064a54078A22652J31964b8005A84064B9421
11131f0987C1155a96553c7104A89897f8424D4037g8880A79904q1836K6940d3771
11119a9120B260R2209g8210r5563j7086J695f4863A97276n9162o0458J3182c8513
11106B58139D974J53382d678B01206n0751F1279K26508k8297K10735A42709J06841
$$ plain form
11187 521016 173749 -137334 140246 -226761 71492 -248612 59112 26881 -227734 -218081
11177 -218081 85532 56022 13778 -133203 266441 -87919 -233203 -135729 -63968 -264502 144408
11165 -72225 -68617 -171574 -210553 -122606 -229047 39828 -145362 -52058 140503 -126361 -278403
11154 -278403 -289439 20855 272982 59313 -27758 -122882 -156197 -219550 106195 -91898 -160591
11143 -160591 -99824 48736 -4147 122312 50064 -154078 122652 254616 -28005 184064 29421
11131 -60987 31155 -196553 -37104 189897 -68424 44037 -78880 179904 98068 125008 -43771
11119 -19120 2260 94469 -78210 -173773 -190859 -189164 -64863 197276 138114 77656 90838 -38513
11106 258139 4974 158356 -4678 201206 150455 61279 287787 259490 470225 142709 249550
11095B49550A6587L38147a86683a7170j2352A23344D9897M7029A1700J22966E3146
11083D93217A72179A8650K71235L7554K1777q8029m8818n8095J68615p145P7451
11072C93195n4328j61613R2102E610O83464j66473B01906F4903M17959j86037
11062B96825m4161K01011n5360J1985J07821L4875A71603L59915O976k65017m7214
11051B26263K33118J20856J62492j87140j79377K53805O9330j05187L52038n5542
11041H90656l7095q8466l65123L73326j59142J59524k0907j46143j84748o1473
11031C60409L97313B94403L03795J33064p1993K76882m51530J27122K88520k80338
11021F19925J155n68o6191K11079k08646p013Q3721Q5j1430j37533J94839B89141
$$ plain form
11095 249550 16587 354734 -186683 -17170 -29522 123344 49897 96926 11700 134666 53146
11083 493217 172179 18650 289885 327439 349216 261187 212369 154274 322889 315744 393195
11072 393195 338867 177254 269356 5610 689074 522601 201906 64903 482862 296825
11062 296825 252664 453675 398315 410300 518121 552996 171603 531518 538494 273477 226263
11051 226263 459381 580237 742729 555589 376212 630017 699347 594160 946198 890656
11041 890656 853561 765095 399972 773298 614156 773680 752773 606630 421882 360409
11031 360409 757722 294403 598198 731262 659269 936151 484621 611743 900263 619925
11021 619925 621080 620512 554321 765400 556754 549741 633462 633547 622117 484584 679423 289141
11008D66646A64258N13126L1243l10034j26137L9588K03500O0960k28082M9622
10998C98044J49996J13322k91018o8832J16284J41292j38660L55066k27875q6779
10988D60840J3874n1548M46548j62533K05995j25886k80541M44831j33826j19251
10978F98503J95574O1258J39l14473O53870k21291Q37834j14721K4055K84352
10968B105100J02090J98120Q5135k11898m64651r7359N2137j85649j66034R3146
10958A510137j66165L29364j01180j67858K34495k38591L6266J21122p3491k59806
10948A224293r5956p5023m22023J45956l76385K0716a8508B51485b40963A10359
10937A78448J63339G3321K32224J40531l4661h4602C8080L20708a2901p1029B3156
$$ plain form
11008 466646 164258 677384 708627 398593 272456 312044 515544 576504 348422 398044
10998 398044 548040 661362 370344 301512 417796 559088 420428 775494 547619 460840
10988 460840 474714 423166 869714 707181 913176 787290 506749 951580 817754 698503
10978 698503 894077 955335 955474 641001 1294871 1073580 1911414 1796693 1820748 2105100
10968 2105100 2207190 2405310 2490445 2278547 1813896 1716537 1768674 1583025 1416991 1510137
10958 1510137 1343972 1673336 1572156 1404298 1638793 1400202 1436468 1557590 1484099 1224293
10948 1224293 1128337 1053314 631291 777247 400862 421578 -18508 251485 -240963 110359
10937 178448 341787 73321 305545 446076 411415 -84602 38080 358788 -12901 -83930 23156
10925b6887D7030a93672A36320a2189A11352b26145D1879g981m0477k34641a40785
10913a22568B4043i7732m810p7145i341D9333M16907a5586F5442c51323A69045
10901G8641a38132M3393d1225D44286A68831j7528c32270e1169I5374a02468j09796
10890b12264q1839A10852c257k6796C0370A4740a4980j08284a2995j3004j84228
10879b10227E0296i8238C12439a54341B3651K6553a23347J4891A14085b92236
10868a20617B57936i2546j11476c876r9698f956B41786A05468e2203j51581A36483
10856c95323J50872c2580m8193B003a0232C03209k4859E3382f7880A12247a71624
10844a55751c6259G2243f7590D7261g5453C38756b38779B6699b28160R0132c3026
$$ plain form
10925 -26887 47030 -193672 136320 -12189 111352 -226145 41879 -7981 -48458 -283099 -140785
10913 -122568 24043 -97732 -102542 -179687 -9341 49333 466240 -15586 65442 -351323 169045
10901 78641 -138132 -94739 -41225 444286 168831 151303 -332270 -51169 95374 -102468 -212264
10890 -212264 -294103 110852 -3257 -30053 30370 14740 -14980 -123264 -12995 -25999 -210227
10879 -210227 50296 -98238 312439 -154341 23651 50204 -123347 -108456 114085 -292236
10868 -120617 257936 -92546 -204022 -3876 -103574 -6956 241786 105468 -52203 -203784 136483
10856 -395323 -244451 -32580 -80773 2003 -10232 303209 278350 53382 -67880 112247 -171624
10844 -155751 -36259 72243 -67590 47261 -75453 338756 -238779 26699 -228160 -138028 -33026
10832F518K4862a62887C09366A5738L2194b84704P4901J441L0452d2233k46659
10821b88892b1479j43883D214c26007J57075L6071A52961h3184A8489J67848b47424
10809C2791J38555J40670E3258L8529J50554j14117d4492k63001a08214m7485
10799a55699D2868g0911a9768B10449m4445q569a77732o6715j13278a19716r733
10788a29449I1131a50768L0229N0900K2770l5999o6076l6893k4071g7047A01777
10776h805p2164B3974i1397A21701a98793K6029b0208j84161E9190N4564a18901
10764I8911K54930h9148b8812j93686M5217B02630b44999A23471c23239B58966
10753a43008G7544h2098j96773A06848i3129l7926B4546c36606D8955K74868G8034
$$ plain form
10832 6518 31380 -162887 309366 15738 47932 -284704 -209803 -208362 -177910 -42233 -288892
10821 -288892 -21479 -165362 4214 -326007 -168932 -132861 152961 -83184 18489 186337 -247424
10809 32791 171346 312016 53258 91787 242341 128224 -44492 -307493 -108214 -155699
10799 -155699 42868 -70911 -19768 210449 166004 157435 -177732 -244447 -357725 -119716 -129449
10788 -129449 91131 -150768 -120539 -69639 -46869 -82868 -148944 -185837 -209908 -77047 101777
10776 -8805 -80969 23974 -91397 121701 -198793 -172764 -20208 -204369 59190 113754 -118901
10764 98911 353841 -89148 -28812 -222498 -177281 202630 -244999 123471 -323239 258966
10753 -143008 77544 -82098 -278871 106848 -93129 -131055 24546 -336606 48955 323823 78034
10741a88003h8042A49758a47901A39461B5895c56164a33995k8928P6263F604c47876
10729a25621A06225R7975c34184a37844m3954K2236b6361j26058j00850A1130
10718A14900a76536c4345o3852I9983c29944a28561c142k09948f7888I2216b34739
10706i7688j42729K2948e8536j75170A31246N6140J75519c00678A41539b9014
10695h7987H5823a27666e9472A78262d0579B09180a95208n9805B11466K4617A13758
10683B05737d5312C48412E0568c47900p6326i0092p5151E8213c5470A87208a30706
10671i9898K4359H539a63408k11720i5384j11210A68106n2023E1030g0894p2758
10660a43652e7513I158b08757G7755J12718a74239L7517j3485A44438i5379G7009
$$ plain form
10741 -188003 -88042 149758 -147901 139461 25895 -356164 -133995 -162923 -86660 6604 -347876
10729 -125621 106225 204200 -334184 -137844 -181798 -159562 -26361 -152419 -253269 11130
10718 114900 -176536 -34345 -98197 99983 -329944 -128561 -3142 -213090 -67888 92216 -234739
10706 -97688 -240417 -217469 -58536 -233706 131246 187386 362905 -300678 141539 -29014
10695 -87987 85823 -127666 -59472 178262 -40579 209180 -195208 -255013 211466 236083 113758
10683 205737 -45312 348412 50568 -347900 -424226 -90092 -165243 58213 -35470 187208 -130706
10671 -99898 -75539 8539 -163408 -375128 -95384 -206594 168106 116083 51030 -70894 -143652
10660 -143652 -57513 9158 -208757 77755 190473 -174239 -136722 -150207 144438 -95379 77009
10648b14282e4196G8592J37451b3472k16021K4404c3646m8461A89891a06231j39270
10637b45501g3327k48903A93625i7612B48060r9025B1481b41509F2562c81096
10626E7746d1495m7300j24535f6674j50673G2184a9264l69852a36393B4151K0619
10615D4770P473J1368c19317J31932L4115B43862a90233B50267c27736a62658
10604a28633a5624k02871A72763d7752C1615a4200E8450R1953b62469A5467M5762
10593F1229k9492a27109f3405j15888b601j89175j16742r3108A47278K5860D159
10581F4745c48816C7440a63623H3210a43172A59611i3368l63559b24133Q2516
10571a41617A4816M4795B2763d56887g1242r2710A00336p52g7101m1052k03813
$$ plain form
10648 -214282 -54196 78592 216043 -23472 -239493 -215089 -33646 -82107 189891 -106231 -245501
10637 -245501 -73327 -322230 193625 -97612 248060 149035 21481 -241509 62562 -381096
10626 57746 -41495 -88795 -213330 -66674 -217347 72184 -19264 -389116 -136393 24151 44770
10615 44770 52243 63611 -319317 -187385 -153270 243862 -190233 250267 -327736 -162658
10604 -128633 -15624 -218495 172763 -47752 31615 -14200 58450 150403 -262469 15467 61229
10593 61229 31737 -127109 -63405 -179293 -2601 -191776 -308518 -401626 147278 173138 4159
10581 64745 -348816 37440 -163623 83210 -143172 159611 -93368 -456927 -224133 -141617
10571 -141617 14816 59611 22763 -456887 -71242 -163952 100336 99584 -77101 -118153 -321966
10560c21966j606j44209J01901P2290a27162q9328A06871n3160a00825a8620E9381
10548A41669g2809L4345B04434G2410O4986d5133k63891F5629L5802B6577p947
10537A8630J12841A2780d77796a10310c1059A4280c9643j93457R2124f8654A8320
10525b13639m5535L0564B5051A2046c17476A43323A1877c9400j92060b9829B7794
10513A04999k341b8887A25073a31036m09658B44955b55140A3736d5836H7867b14974
10501D1663K28540F0259Q6190n8815J30850O4117a91369L6867B49772p9931C1140
10489h2387E6945c2972j98305i1796c7265B40043a5524A95333J61692b28391A35009
10477c30269a14551A96745q6547N37430k95612a3398A52330j5610E4247k5350
$$ plain form
10560 -321966 -323572 -467781 -365880 -293590 -127162 -216490 106871 53711 -100825 -18620 59381
10548 141669 -72809 -38464 204434 72410 137396 -45133 -309024 65629 101431 26577 18630
10537 18630 131471 12780 -477796 -110310 -31059 14280 -39643 -233100 -140976 -68654 18320
10525 -213639 -259174 -228610 25051 12046 -317476 143323 11877 -39400 -231460 -29829 27794
10513 104999 102658 -28887 125073 -131036 -540694 244955 -255140 13736 -45836 87867 -214974
10501 41663 270203 60259 146449 87634 218484 282601 -191369 -154502 249772 169841 31140
10489 -82387 56945 -32972 -231277 -91796 -37265 240043 -15524 195333 357025 -228391 135009
10477 -330269 -114551 196745 110198 647628 352016 -13398 152330 136720 54247 28897
10467B8897J38653d296j44252r3410A32252M0415d683j16036p2741g3002G3320
10455a06881k36475e2001I0177I83M2374b458B61070a8753B09421d8589B56831
10443A26903a55637P6129G1557M0931M7827E6319a89499r7693J39653M7270G0839
10431D8872e006K317k1814l74294a75294A07912c67928a52586f6028j17872b5538
10419f27109f2016r8253F7673m410c88184a60878A44979a44679n1928A17330i7203
10407A6996a26748A93178k6231c74502N8060J30187m45276e7550j4542C20044
10396G6841K4986a06915A04472D8182J31939g6173B27802J99805f5827p2062D6681
10384A80604H9487c94A72509a54936A61043a19656C7530a06675A60114L5701J72789
$$ plain form
10467 28897 167550 -4296 -148548 -241958 132252 172667 -4683 -120719 -193460 -73002 73320
10455 -106881 -343356 -52001 90177 983 43357 -2458 261070 -18753 209421 -48589 256831
10443 126903 -155637 -79508 71557 112488 160315 56319 -189499 -287192 -147539 -100269 70839
10431 48872 -5006 -2689 -24503 -398797 -175294 107912 -367928 -152586 -66028 -183900 -25538
10419 -627109 -62016 -160269 67673 63263 -388184 -160878 144979 -144679 -196607 117330 -97203
10407 16996 -126748 193178 166947 -374502 -316442 -186255 -631531 -57550 -72092 320044
10396 76841 101827 -106915 104472 48182 180121 -76173 227802 427607 -65827 -137889 46681
10384 180604 89487 -394 172509 -154936 161043 -119656 37530 -106675 160114 195815 368604
10373C68604a80636B73419b33641P9788D7948J51799J55301O7313o1869j68217
10363A92275K95248B25955J76621A64623K05237b02094E37K03767J7098k8870
10353A92532e7431B40494k9104m9630O89211l30555L5585j95753j52265J38800
10343C46783M8144m4804N0220A41510P8083K7142r3774J49680c1444B83510C4894
10331A14418j9109R1184a85612d782j24750D6306d14552g9160C5865J38447a70442
10319A14653J63227a22970H9944b050A3597k770R9101K04999C2238O3466b8892
10307b11795B10090m8559M277b7261D9141a06352A43126m701a22673j31933a26914
10295i0857h998k6004r051j81664j08066i7374j82011A47930a64658A78529a98004
$$ plain form
10373 368604 -180636 273419 -233641 -153853 47948 199747 355048 422361 360492 192275
10363 192275 487523 225955 402576 164623 369860 -202094 537 204304 221402 192532
10353 192532 -57431 240494 211390 161760 850971 520416 556001 360248 207983 346783
10343 346783 394927 350123 400343 141510 219593 246735 152961 302641 -31444 283510 34894
10331 114418 95309 186493 -185612 -4782 -129532 46306 -414552 -79160 35865 174312 -170442
10319 114653 277880 -122970 89944 -2050 13597 10827 109928 314927 32238 95704 -28892
10307 -211795 210090 161531 165808 -27261 49141 -106352 143126 138425 -122673 -254606 -126914
10295 -90857 -8998 -35002 -44053 -225717 -333783 -97374 -279385 147930 -164658 178529 -198004
10283B87712h1864j1823A46095b83451G9728L2115a09196B29391b75733N4863
10273b20870m9818J34616f1325A71964a47601N3238D3694d9102K2978j648j34892
10262a62664A47379K82251c6422H0866m576F095c1852C90974a21046B24981l7948
10251A87033K4155L5497J4625B0140K82764D1016h8931A44549a18387I2360b31364
10239D3357l571d8613n9335m563j2340A31439b48862A16756a97532j15740j140
10228c14412N3153c2139q993r2064D22383f4772A62022J6418a89352m8318c7422
10216c94953c6614A04164a91979I2456e5538B00221r2370B3621K02014b63050
10205c40369g4539G9769b2860B59189a42727a179E31a4472J87p9811c4672r5582
$$ plain form
10283 287712 -81864 -93687 146095 -283451 79728 111843 -109196 229391 -275733 -220870
10273 -220870 -270688 -136072 -61325 171964 -147601 -94363 43694 -49102 -26124 -27772 -162664
10262 -162664 147379 429630 -36422 80866 76290 6095 -31852 390974 -121046 224981 187033
10251 187033 211188 246685 261310 20140 302904 41016 -88931 144549 -118387 92360 -231364
10239 43357 39786 -48613 -107948 -112511 -124851 131439 -248862 116756 -197532 -313272 -314412
10228 -314412 -261259 -32139 -41132 -133196 422383 -64772 162022 178440 -189352 -237670 -37422
10216 -394953 -36614 104164 -191979 92456 -55538 200221 107851 23621 225635 -263050
10205 -340369 -74539 79769 -22860 259189 -142727 -1179 531 -14472 -14285 -94096 -34672 -130254
10193a30254j30922B6291K8811L9655P571a69798J1675A65772C5127J80525h2424
10181b12325m7916Q6039H9235d6699A48128o4713b23006N4844A01760c5784j04147
10170a39931p498f0775b689k17528n2412A93544b897F922a05827a2234o3473j08287
10158a83994A66816b1829p4229j25582f6130k43814i6904K2458j56109K4211j69254
10147c75598J19140q7683a5461F6083J46084d26593H4681J67858b257A05479a12968
10135d9496q4115d6677a9674j43570A63544H1463b21992G8635b57262f5855D1395
10123f7481A15512a0416k16676P9252J5274d4010B291a0352q9414A8287J9084
10112C7371a2126A92936G3966b18714P8249r8805A84416F9863b68529A86972d04290
$$ plain form
10193 -130254 -261176 26291 55102 94757 102328 -169798 -158123 165772 35127 215652 -82424
10181 -212325 -260241 -174202 89235 -46699 148128 83415 -223006 -168162 101760 -35784 -139931
10170 -139931 -147429 -60775 -2689 -220217 -272629 193544 -2897 6922 -105827 -12234 -75707 -183994
10158 -183994 166816 -21829 -96058 -221640 -66130 -309944 -96904 -74446 -230555 -206344 -375598
10147 -375598 -256458 -344141 -15461 66083 212167 -426593 84681 252539 -2257 105479 -112968
10135 -49496 -133611 -46677 -19674 -163244 163544 81463 -221992 78635 -257262 -65855 41395
10123 -67481 115512 -10416 -227092 -147840 -132566 -44010 2291 -10352 -99766 18287 37371
10112 37371 -12126 192936 73966 -218714 -140465 -239270 184416 69863 -268529 186972 -404290
10100A8854K49612c15107n4521J652n8768B2334c60063a35645O7307l49494a9347
10088a73750e0548K4451q2729k3673A44229o0815K5236a54864L2006M4340F6317
10076a91596j60446b0072q907H8697K8481R133b56296J09304p5249m5645a3361
10064a35077L0585A37840m8960a55386m1499Q3667b6982A07474a68323N8779K3977
10053h5567D8745q523c3879C24572a81966F1223J32100J4798J4580d6604B851
10041e760k71121j35588B03818b27232P1174H7254b27028K5760P6954p5569f785
10029b57311a13790H0268B0062N6495b54114B31793h9910c5856a1996A51741a68992
10017g7835A58438D8182A9102a54033L5611C5065b73830l09318A2252Q3377a45337
$$ plain form
10100 18854 268466 -315107 -369628 -367976 -426744 22334 -360063 -135645 -68338 -417832 -19347
10088 -173750 -50548 -26097 -108826 -132499 144229 83414 108650 -154864 -122858 -78518 66317
10076 -191596 -352042 -20072 -28979 88697 117178 126311 -256296 -146992 -222241 -267886 -13361
10064 -135077 -104492 137840 88880 -155386 -196885 -113218 -26982 107474 -168323 -109544 -85567
10053 -85567 48745 40222 -33879 324572 -181966 61223 193323 208121 222701 -46604 2851
10041 -5760 -276881 -412469 203818 -227232 -156058 87254 -227028 -201268 -124314 -199883 -6785
10029 -257311 -113790 80268 20062 76557 -254114 231793 -89910 -35856 -11996 151741 -168992
10017 -77835 158438 48182 19102 -154033 -118422 35065 -273830 -583148 12252 95629 -145337
10005e5153I0642k2967J37985e1862j20787j30491B68668j14209b36649a13472
9994a78373J0897b5362h935G1855c0226D0919J61610a63753f2419B45453b33517
9982A1087J14505b52187j2644A34007a53780B53258b68978D1235b258o4041a0807
9970f8799l03376A11547a87753B26221a22380F7428b62252J10077A41282o9740
9960G1542a58632A5118k19e8043B20183D138c60293J23943k22094h3266k4915
9949a08181k72850A82654b21363h2949J3494b7607j89199a6882B69212a84034
9938D6371a37967l2135j0525g5132j94574N3440r0618N7679a19589j55405l0434
9927c05428B06448a67055g1611k70586P5360A65531D9147a73549a1474B33200
$$ plain form
10005 -55153 90642 67675 205660 -51862 -172649 -303140 268668 154459 -236649 -113472
9994 -178373 -167476 -25362 -8935 71855 -30226 40919 202529 -163753 -62419 245453 -233517
9982 11087 125592 -252187 -264831 134007 -153780 253258 -268978 41235 -2258 -66299 -10807
9970 -68799 -372175 111547 -187753 226221 -122380 67428 -262252 -152175 141282 71542
9960 71542 -158632 15118 14899 -58043 220183 4138 -360293 -236350 -458444 -83266 -108181
9949 -108181 -381031 182654 -221363 -82949 -69455 -27607 -216806 -16882 269212 -184034
9938 46371 -137967 -170102 -180627 -75132 -269706 -216266 -306884 -249205 -119589 -274994 -305428
9927 -305428 206448 -167055 -71611 -342197 -266837 165531 49147 -173549 -11474 233200
9916C3471a05184q1563A68890f4732j47183H3006P5513a07424c1955A25546b26841
9904H783Q9956I46M1293b50226R6948k4414B45369b20671k332g7261j08004d2031
9891a73757B02392g3958q8378b6349r1813L830c9139A75456e9550q1502k88042
9880d29094J75639e7063n4262H2034J6376a29586k85750A0020J49981f2663C5557
9868G3346a68106M4170I6632c48831a5561k7926j93075g2376j03392j52279J00547
9857b27500b5454G7041a92752j35683O936h520j07296k6910k8985k15427J2379
9846c74759L5212d4418j5641e310k22102a3392k1073k41281j14152a07390J7496
9835h9894j42252l0375h5351A44163I166b7130p5115c9389q2749j17315A82660
$$ plain form
9916 33471 -105184 -186747 168890 -64732 -211915 83006 158519 -107424 -31955 125546 -226841
9904 8783 98739 946 42239 -250226 -153278 -177692 245369 -220671 -223003 -77261 -185265 -42031
9891 -173757 202392 -73958 -162336 -26349 -118162 -114332 -39139 175456 -59550 -141052 -429094
9880 -429094 -253455 -57063 -111325 82034 98410 -129586 -415336 10020 160001 -62663 35557
9868 73346 -168106 -123936 96632 -348831 -15561 -43487 -236562 -72376 -175768 -328047 -227500
9857 -227500 -25454 77041 -192752 -328435 -321499 -8520 -115816 -142726 -171711 -387138 -374759
9846 -374759 -339547 -44418 -60059 -5310 -227412 -13392 -34465 -275746 -389898 -107390 -89894
9835 -89894 -232146 -262521 -85351 144163 9166 -27130 -102245 -39389 -122138 -239453 182660
9823A24923C7755P5814a66741C8104b08218A24817D326c56078a9801k00k16851
9812b36852j45674B64980a00293j87100I714J27918a80215A33001m309C3529l879
9801B9650b3973B5563J74476b40913B9117b50441J6460e4611D5112a55367D1563
9789b74265a12236A16095c8078F5417i0358A71548i1029k69903D812a20019L2830
9778h7189k25548j05311c8308m39832E7994c08260d3985l29079A03802C8154c8230
9766a0092k37133H1327A445L2455f99A87128d21047A81325O8201j11467a2681
9754b0017A64996e790k76934D8701j3738P0824f130k8840k31873A22398k6372
9743I6026C647J4369a7053q5698A57132a54524G3890d49821d1581q3165f0839
$$ plain form
9823 124923 37755 113569 -166741 38104 -208218 124817 4326 -356078 -19801 -20001 -236852
9812 -236852 -382526 264980 -100293 -287393 9714 137632 -180215 133001 128692 33529 29650
9801 29650 -23973 25563 200039 -240913 29117 -250441 -233981 -54611 45112 -155367 41563
9789 -274265 -112236 116095 -38078 65417 -90358 171548 -91029 -360932 4812 -120019 -87189
9778 -87189 -312737 -418048 -38308 -478140 57994 -308260 -43985 -373064 103802 38154 -38230
9766 -10092 -247225 81327 1445 33900 -699 187128 -421047 181325 249526 138059 -12681
9754 -20017 164996 -5790 -282724 48701 34963 105787 -6130 -34970 -266843 122398 96026
9743 96026 3647 18016 -17053 -102751 157132 -154524 73890 -449821 -41581 -124746 -60839
9731a13810l1832A5995b59089O833N6100l3741j79623E0237J38443d6922m50427
9720d97349K01423a19912A62714b84614J41550a1069F7801k9677a64393I9938
9709A30016d0264j87350A45013n0955a35940l57031a37164d7634p0698D1081a39341
9697a94800l7532A39865B6653J05249e4982g247q6276A42659i2058a8447A71262
9685b1869j64752R1945J6236n7631A55333G4044b19411l962b5648r749k9559m3610
9673a08566m0207d0912q9501A02179a23182A37887A3543M5204c19404e8478b1098
9661i3826A14858c9497j82645r4341A28577f5938A36231f4600o379m13406a71566
9649G3239a45247k5488e7340k28932F7722a58360A39858m8630k5288c19432J45799
$$ plain form
9731 -113810 -145642 15995 -259089 -252256 -196156 -229897 -409520 50237 188680 -46922 -497349
9720 -497349 -295926 -119912 162714 -284614 -143064 -11069 67801 38124 -164393 99938
9709 130016 -40264 -227614 145013 94058 -135940 -492971 -137164 -47634 -118332 41081 -139341
9697 -194800 -232332 139865 26653 131902 -54982 -7247 -93523 142659 -92058 -18447 171262
9685 -21869 -186621 -94676 -78440 -136071 155333 74044 -219411 -223373 -25648 -35397 -64956 -108566
9673 -108566 -148773 -40912 -130413 102179 -123182 137887 13543 58747 -319404 -58478 -21098
9661 -93826 114858 -39497 -222142 -316483 128577 -65938 136231 -64600 -70979 -484385 -171566
9649 73239 -145247 -170735 -57340 -286272 67722 -158360 139858 91228 65940 -319432 -173633
9638a73633o6174a18418b453j72850g0847J9857D822c32463d1657j3422C5234
9626c7341j37394b9053j30927N518A18392d32194d0160F1488d12441A14617f0599
9614a34195j25396A65611K23066b46353A24045m1435b76234C03410b83913O9726
9604b14187o6756D23961A08766a04969d1266D2029g5241l8278A61370a68707B32240
9592I6705a10903e4501j16581h2096r8477A09682b47285b5303C82630a16350F8759
9580H9454b08374h7859l68210C1758b45977O2843C2361b69336F9162O0481b28135
9568c93017J77955e8836k97437a7836j48270N0495j88599E9778d32129g3777j00911
9557a74688f0789j1368A3688c9584B10509F1775b76357c1638n4164j64026n877
$$ plain form
9638 -173633 -239807 -118418 -2453 -175303 -70847 -50990 4822 -332463 -41657 -55079 35234
9626 -37341 -174735 -29053 -159980 -154462 118392 -432194 -40160 61488 -412441 114617 -60599
9614 -134195 -259591 165611 388677 -246353 124045 82610 -276234 303410 -283913 -214187
9604 -214187 -280943 423961 108766 -104969 -41266 42029 -75241 -113519 161370 -168707 232240
9592 96705 -110903 -54501 -171082 -82096 -180573 109682 -247285 -25303 382630 -116350 68759
9580 89454 -208374 -87859 -456069 31758 -245977 -183134 32361 -269336 69162 129643 -228135
9568 -393017 -215062 -58836 -356273 -17836 -166106 -115611 -304210 59778 -432129 -73777 -174688
9557 -174688 -60789 -72157 13688 -39584 210509 61775 -276357 -31638 -85802 -249828 -255705
9546b55705j06889J65815A90224a96645L5689m7421j46275A71316l2835m3209
9536I5272c18079a23695d2549j029l0442B28120i2605c7024G1682c1356k7783
9525e9139A56771d7900j85806H0322c33106P2594I5606J129a82450l9353a6585
9513a51346c0995k858A01232q039f4174l24354A39112h4724k81291N7987b0622
9501I8157e8083D5137N8698l2554a00648J0268F988J73708a24522c9975k55324
9490b95299G778a95425J1239g9569J4153q1122B4804Q2471K0472a91217J0127
9479a81090N7703m1556a1915j45387L7945A14834c78601A2356c13900C46492F7639
9467e084l11946n0768J76960B66792e8159B67759a85090L9425f6214H2372a89123
$$ plain form
9546 -255705 -362594 -196779 190224 -196645 -160956 -208377 -354652 171316 138481 95272
9536 95272 -318079 -123695 -42549 -43578 -74020 228120 -92605 -37024 71682 -31356 -59139
9525 -59139 156771 -47900 -233706 80322 -333106 -260512 95606 96735 -182450 -221803 -16585
9513 -151346 -30995 -33853 101232 93193 -64174 -388528 139112 -84724 -366015 -308028 -20622
9501 98157 -58083 45137 103835 71281 -100648 -90380 6988 180696 -124522 -39975 -295299
9490 -295299 7778 -195425 -184186 -79569 -65416 -146538 24804 107275 127747 -191217 -181090
9479 -181090 -123387 -164943 -11915 -157302 -119357 114834 -378601 12356 -313900 346492 67639
9467 -5084 -317030 -367798 -190838 266792 -58159 267759 -185090 -145665 -66214 82372 -189123
9455h752B46630m9456a94232h5956A2305b07670f4290e417B994Q8791N8579G1063
9442B89165m3559K0575b61258G7572e0616F3436b56499A52147c53768b4799A96552
9430h6193K8121o1916K547A88967b87879c4099l25134a05377l4425M9645b2073
9418A6664b33314p3691p6866f4968C5213C707c38985a57474N7509B8867a27852
9406A29001d06562A07072J51515A4436f8985E0151g894j7249j36883d797r5849
9395a00646d1066A56409f953j07307D4286i3388I7699O9884a71927e2303n2060
9384a04363j90403H9779b69999B52304a45711c1065l33190B24578A471b44994
9373B47230A13031a1770Q99j7404o0941l24909a51201G8559a49995A98915A163
$$ plain form
9455 -8752 246630 197174 -194232 -85956 12305 -207670 -64290 -5417 2994 91785 150364 71063
9442 289165 245606 266181 -261258 77572 -50616 63436 -256499 152147 -353768 -24799 196552
9430 -86193 -58072 -119988 -117441 188967 -287879 -34099 -359233 -105377 -139802 -90157 -22073
9418 16664 -233314 -307005 -383871 -64968 35213 3707 -338985 -157474 -99965 28867 -127852
9406 129001 -406562 107072 258587 14436 -68985 50151 -7894 -25143 -162026 -4797 -100646
9395 -100646 -41066 156409 -6953 -114260 44286 -93388 97699 167583 -171927 -52303 -104363
9384 -104363 -294766 89779 -269999 252304 -145711 -31065 -364255 224578 1471 -244994
9373 247230 113031 -11770 -10871 -28275 -89216 -414125 -151201 78559 -149995 198915 1163
9361f0422I9436J0120E1588a35295G5412i4916j02108h950B4286B709a64915G7159
9348B9619c4407p8550j77523I1957L3973b11588E0934P6192D3685a1269j43122
9337a54391A01111f7129J3989l6131k55318A67359d8782n1678b2065H1716b6319
9325C998b05908k2579P9236G1674J61716b01921N4418k84244J05043a03040j4765
9314a17805L0957r6879k24714b5574l5572j11816L539D5667I856h0132l54639
9303d34771L7645a58439r2990F0413c7821B59650a77441C01960c8652B57159f7118
9291b50005g5659B0477b18245d8800o1611M8528r3628K4104j86529A33326C8523
9279b78040j28644I7015m2919c75261A70566g9513r8553n1580K3315b2312A89451
$$ plain form
9361 -60422 99436 109556 51588 -135295 75412 -94916 -197024 -8950 24286 2709 -164915 77159
9348 29619 -34407 -112957 -290480 91957 125930 -211588 50934 127126 43685 -11269 -154391
9337 -154391 101111 -67129 -53140 -89271 -344589 167359 -48782 -100460 -22065 81716 -26319
9325 3998 -205908 -228487 -149251 71674 233390 -201921 -147503 -431747 -326704 -103040 -117805
9314 -117805 -86848 -183727 -408441 -25574 -61146 -172962 -169423 45667 9856 -80132 -434771
9303 -434771 -397126 -158439 -251429 60413 -37821 259650 -177441 301960 -38652 257159 -67118
9291 -250005 -75659 20477 -218245 -48800 -110411 -61883 -155511 -131407 -317936 133326 38523
9279 -278040 -406684 97015 54096 -375261 170566 -79513 -178066 -229646 -206331 -22312 189451
9267a42855b5160j92983A62143b92621L6723A9285a01253M6706A5104a31051B08275
9255c1090m695n4833k02897A09126J7313A1760c65430J77875P3954A87184H658
9243a01827j7382j18914C1929a5399B62431a80329A02820h7400D813b68629f7140
9231g0607k40782e6808q174o5419H0859b80283A7872b8763p1825j8175A46906
9219a69011A88242b84746a9449k99498j20F3821Q9484E7922J81766c4450j60474
9208a94924j15961a28922l3521B525J21160a64154C9445b52901B97631b71988
9197B56977E9095A9760b64176H0774J62264a71232l0100B6754d1095l761a661
9185b49795Q5387B47110A9588J71867d3121m369A48733i1810B48369b1350A08444
$$ plain form
9267 -142855 -25160 -218143 162143 -292621 -255898 19285 -101253 -54547 15104 -131051 208275
9255 -31090 -35785 -90618 -293515 109126 126439 11760 -365430 -187555 -113601 187184 8658
9243 -101827 -119209 -238123 31929 -15399 262431 -180329 102820 -87400 4813 -268629 -67140
9231 -70607 -311389 -56808 -64982 -130401 80859 -280283 17872 -28763 -100588 -118763 146906
9219 -169011 188242 -284746 -19449 -318947 -319067 63821 153305 57922 239688 -34450 -194924
9208 -194924 -310885 -128922 -162443 2525 123685 -164154 39445 -252901 297631 -271988
9197 256977 59095 19760 -264176 80774 243038 -171232 -201332 26754 -41095 -44856 -1661
9185 -249795 -164408 247110 19588 191455 -43121 -47490 148733 -91810 248369 -21350 108444
9173a11276A0896O456h3168j00345d9669j00444D3128L5580l9165a4601j63333
9162a77934A9845O6382k1798a22570j34766B7349a44333A6949J29708b5454p4330
9151i9784F3317c69565a1788l77416a61044j26204c049B25995F6761b6451P575
9140a8876r156B5801Q022d45029d1205r2602B6426C59M9348c61071O5913O0231
9128b34927c1418l5743p2877A35124b24674A25503b22909A1296L5337O8810f3793
9116A58456e4597j12574j05157i1212j55961G2279i4519j16340I9216B9642e2788
9104G5549b44541c4294F6080a05015D920R3115a04664D9382J3731c16714f5137
9092a14995j83223f8704C3465a83626k040g2847A52817d9003j00856q4257F4204
$$ plain form
9173 -111276 10896 17352 -83168 -183513 -49669 -150113 43128 78708 39543 -14601 -177934
9162 -177934 19845 86227 64429 -122570 -257336 27349 -144333 16949 146657 -25454 -99784
9151 -99784 63317 -369565 -11788 -389204 -161044 -287248 -3049 225995 66761 -26451 -18876
9140 -18876 -28032 25801 33823 -445029 -41205 -133807 26426 359 49707 -361071 -295158 -234927
9128 -234927 -31418 -67161 -140038 135124 -224674 125503 -222909 11296 46633 115443 -63793
9116 158456 -54597 -167171 -272328 -91212 -247173 72279 -94519 -210859 99216 29642 -52788
9104 75549 -244541 -34294 66080 -105015 4920 98035 -104664 49382 63113 -316714 -65137
9092 -114995 -298218 -68704 33465 -183626 -185666 -72847 152817 -49003 -149859 -234116 64204
9080a28321M1709j55699i1740B94477r2459b9765A61060a73891N1692d501D1549
9068a92947Q5022k74517a04442k5976A37448b85539i6512C48412b86649A03469
9057H0482M3389L33904B08037a16203A98532F4678b0052C67926a46346A03162
9046a15553j09057D5463a73148A53744a72392K9491C1554a09989j01517J01264
9036a10242N919M4815k4193A40667m4166A6310L9102b18828a1517F7516b49884
9024i0330n2494k21293a72523M4633c6620F5503J4963e563m8557j66210P9940
9013a40390H1759a80436N2460k12254P4405M9831b0938p9207A05290b30286a05018
9001A9975n572J12333a3453j5456m0826J4287j24657L703m894m9225A13875g7811
$$ plain form
9080 -128321 -86612 -242311 -91740 294477 202018 -29765 161060 -173891 -122199 -4501 41549
9068 -192947 -107925 -382442 -104442 -130418 137448 -285539 -96512 348412 -286649 103469
9057 80482 123871 457775 208037 -116203 198532 64678 -20052 367926 -146346 103162
9046 -115553 -224610 45463 -173148 153744 -172392 -142901 31554 -109989 -211506 -110242
9036 -110242 -104323 -59508 -83701 140667 96501 16310 55412 -218828 -11517 67516 -249884
9024 -90330 -142824 -364117 -172523 -127890 -36620 65503 80466 -5563 -54120 -220330 -140390
9013 -140390 81759 -180436 -127976 -340230 -265825 -215994 -20938 -100145 105290 -230286 -105018
9001 19975 14403 126736 -13453 -28909 -69735 -55448 -180105 -176402 -181296 -230521 113875 -77811
8988a7383k55814H5908P4255c52535a65358c8592k1940A09341c05408i8025M3319
8977e4706G7295h7265j97712B89258a83100j8589A94897b10658j93572a39838
8966B69650c21354J53475A1770d6295j38661A38081b08523I9533J19171A01414
8955I374J68650a49021j25534J31867j34888O7392A98433E1838a956o5960b9569
8943A89459d9577j37469m0068P5589A67042a8594d909n0906n350b5627G908N13092
8931E21000A00462J7003c17857B43094L7520J0417k289p8546J18009N64609M83150
8920A375964J901948J0485989E803573A297837D50075A92499b18662F6311d4898
8910b62591Q1514k40877a62711A51457A0695J99128H2363d770B10783E5529b46683
$$ plain form
8988 -17383 -273197 85908 160163 -352535 -165358 -38592 -60532 109341 -305408 -98025 -54706
8977 -54706 77295 -87265 -284977 289258 -183100 -201689 194897 -210658 -404230 -139838
8966 269650 -321354 -167879 11770 -46295 -184956 138081 -208523 99533 218704 101414
8955 9374 178024 -149021 -274555 -142688 -277576 -210184 198433 51838 -1956 -67916 -29569
8943 189459 -49577 -187046 -227114 -151525 167042 -18594 -4909 -55815 -61165 -25627 7908 521000
8931 521000 100462 117465 -317857 243094 280614 291031 288742 210196 328205 892814 1375964
8920 1375964 3277912 13763901 5803573 1297837 450075 192499 -218662 66311 -44898
8910 -262591 -181077 -421954 -162711 151457 10695 209823 82363 -4770 210783 55529 -246683
8898H3633i6131o9503E9554b66443B6830J52536E7081b5370k2811C2880J71706
8887B04586h6005j2677K9149D7721a59525B78312a02213A86866a7184A97433a81196
8875A25248R106P758b64430e1197p2749N6135A38425l4980g2928k26131g667p9440
8863h7107G0613m209d32079h684B9742b7019l14155B7735a09132D1034b36819
8851b44923a2842k19967L6839N4422a3250k07756j30251a72330O1419G3715h8557
$$ plain form
8898 83633 -96131 -165634 59554 -266443 26830 179366 57081 -25370 -48181 32880 204586
8887 204586 -86005 -98682 -69533 47721 -159525 278312 -102213 186866 -17184 197433 -181196
8875 125248 134354 142112 -264430 -51197 -123946 -67811 138425 103445 -72928 -299059 -7667 -87107
8863 -87107 70613 66404 -432079 -8684 29742 -27019 -341174 27735 -109132 41034 -236819
8851 -244923 -12842 -232809 -195970 -141548 -13250 -221006 -351257 -172330 -110911 73715 -88557
$$ [...]
##END NTUPLES=NMR SPECTRUM
##END=
