
##TITLE=AC1233_PERAH12114_6519287_kQ2xMY586G
##JCAMPDX= 6.0         $$ Bruker NMR JCAMP-DX V2.0
##DATA TYPE= NMR SPECTRUM
##DATA CLASS= NTUPLES
##ORIGIN= BRUKER
##OWNER= Administrator
$$ 1.72 TOPSPIN		Version 2.1
$$ 2012-07-13 15:07:31.515 -0500  Administrator@TOPSPIN
$$ Compression mode = diff/dup
##.OBSERVE FREQUENCY= 400.02188249412
##.OBSERVE NUCLEUS= ^1H
##.ACQUISITION MODE= SIMULTANEOUS (DQD)
##.ACQUISITION SCHEME= undefined
##.AVERAGES= 8
##.DIGITISER RES= 22
##SPECTROMETER/DATA SYSTEM= spect
##.PULSE SEQUENCE= zg30
##.SOLVENT NAME= COFFEE_meoh
##.SHIFT REFERENCE= INTERNAL, COFFEE_meoh, 1, 14.98509
##AUDIT TRAIL= $$ (NUMBER, WHEN, WHO, WHERE, PROCESS, VERSION, WHAT)
$$ ##TITLE= Audit trail, TOPSPIN		Version 2.1
$$ ##JCAMPDX= 5.01
$$ ##ORIGIN= Bruker BioSpin GmbH
$$ ##OWNER= Administrator
$$ $$ C:\Bruker\TOPSPIN/data/COFFEE/nmr/AC1233_PERAH12114_6519287_kQ2xMY586G/20/pdata/1/auditp.txt
$$ ##AUDIT TRAIL=  $$ (NUMBER, WHEN, WHO, WHERE, PROCESS, VERSION, WHAT)
(   1,<2012-07-13 15:07:24.234 -0500>,<Administrator>,<TOPSPIN>,<go>,<TOPSPIN 2.1>,
      <created by zg
	started at 2012-07-13 15:06:17.656 -0500,
	POWCHK enabled, PULCHK disabled,
       configuration hash MD5:
       6B 1B 68 BB D9 2E 58 E2 7F 35 AD 54 07 DF 0E 41
       data hash MD5: 64K
       D2 7B 15 74 67 4F D7 A7 B1 FB 9B 64 91 51 93 83>)
(   2,<2012-07-13 15:07:27.125 -0500>,<Administrator>,<TOPSPIN>,<proc1d>,<TOPSPIN 2.1>,
      <Start of raw data processing
       efp LB = 0 FT_mod = 6 PKNL = 1 PHC0 = 0 PHC1 = 0 SI = 32K 
       data hash MD5: 32K
       78 9E 80 B3 E6 AB 3B CD 5A A5 7A 9D 20 8A 8A DE>)
(   3,<2012-07-13 15:07:27.453 -0500>,<Administrator>,<TOPSPIN>,<proc1d>,<TOPSPIN 2.1>,
      <pk PHC0 = 175.7483 PHC1 = 0 
       data hash MD5: 32K
       C9 6D E3 FA E7 3C B0 DE A3 86 63 26 89 D8 CB 42>)
(   4,<2012-07-13 15:07:27.546 -0500>,<Administrator>,<TOPSPIN>,<proc1d>,<TOPSPIN 2.1>,
      <abs ABSG = 1 
       data hash MD5: 32K
       EE 2E 68 E3 56 03 1B 51 3C 10 B1 33 5A 7E F7 01>)
(   5,<2012-07-13 15:07:27.593 -0500>,<Administrator>,<TOPSPIN>,<proc1d>,<TOPSPIN 2.1>,
      <abs ABSG = 2 
       data hash MD5: 32K
       D9 61 4B 36 64 34 4F FC AA C5 AD 00 8F 7B C5 18>)
(   6,<2012-07-13 15:07:27.625 -0500>,<Administrator>,<TOPSPIN>,<proc1d>,<TOPSPIN 2.1>,
      <abs ABSG = 3 
       data hash MD5: 32K
       AA ED CA 9E B2 F1 01 AB 1D 39 79 FC C7 44 7B 68>)
(   7,<2012-07-13 15:07:27.656 -0500>,<Administrator>,<TOPSPIN>,<proc1d>,<TOPSPIN 2.1>,
      <abs ABSG = 4 
       data hash MD5: 32K
       E9 3E 8A 08 BF F4 98 56 D2 75 97 5F 26 CE 68 D4>)
(   8,<2012-07-13 15:07:27.687 -0500>,<Administrator>,<TOPSPIN>,<proc1d>,<TOPSPIN 2.1>,
      <abs ABSG = 5 
       data hash MD5: 32K
       E0 69 9D 95 92 80 9C 2B AF 76 E5 B9 AD A0 E2 DF>)
$$ ##END=
$$ 
$$ $$ hash MD5
$$ $$ BF 73 8E 4B 5D 33 45 E8 09 91 01 8E 73 69 F4 4B
##$RELAX= 
##$RELAX= 
##$RELAX= 
##$RELAX= 
##$RELAX= 
##$RELAX= 
##$RELAX= 
##$RELAX= 
$$ Bruker specific parameters
$$ [...]
150 150 150 150 150 150 150 150
##$TP07= 0
##$TPNAME0= <>
##$TPNAME1= <>
##$TPNAME2= <>
##$TPNAME3= <>
##$TPNAME4= <>
##$TPNAME5= <>
##$TPNAME6= <>
##$TPNAME7= <>
##$TPOAL= (0..7)
0.5 0.5 0.5 0.5 0.5 0.5 0.5 0.5
##$TPOFFS= (0..7)
0 0 0 0 0 0 0 0
##$TUNHIN= 0
##$TUNHOUT= 0
##$TUNXOUT= 0
##$USERA1= <user>
##$USERA2= <user>
##$USERA3= <user>
##$USERA4= <user>
##$USERA5= <user>
##$V9= 5
##$VALIST= <valist>
##$VCLIST= <CCCCCCCCCCCCCCC>
##$VD= 0
##$VDLIST= <DDDDDDDDDDDDDDD>
##$VPLIST= <PPPPPPPPPPPPPPP>
##$VTLIST= <TTTTTTTTTTTTTTT>
##$WBST= 2048
##$WBSW= 25
##$XGAIN= (0..3)
0 0 0 0
##$XL= 0
##$YL= 0
##$YMAX_a= 513605
##$YMIN_a= -650681
##$ZGOPTNS= <>
##$ZL1= 120
##$ZL2= 120
##$ZL3= 120
##$ZL4= 120
##$ABSF1= 14.98509
##$ABSF2= -5.573092
##$ABSG= 5
##$ABSL= 3
##$ALPHA= 0
##$AQORDER= 0
##$ASSFAC= 0
##$ASSFACI= 0
##$ASSFACX= 0
##$ASSWID= 0
##$AUNMP= <proc_prof1d_extract_pilot.lims>
##$AXLEFT= 0
##$AXNAME= <>
##$AXNUC= <1H>
##$AXRIGHT= 0
##$AXTYPE= 0
##$AXUNIT= <>
##$AZFE= 0.1
##$AZFW= 0.1
##$BCFW= 0
##$BC_mod= 0
##$BYTORDP= 0
##$COROFFS= 0
##$CY= 15
##$DATMOD= 1
##$DC= 0
##$DFILT= <>
##$DTYPP= 0
##$F1P= 0
##$F2P= 0
##$FCOR= 0.5
##$FTSIZE= 32768
##$FT_mod= 6
##$GAMMA= 0
##$GB= 0
##$INTBC= 1
##$INTSCL= 1
##$ISEN= 128
##$LB= 0
##$LEV0= 0
##$LPBIN= 0
##$MAXI= 10000
##$MC2= 0
##$MEAN= 0
##$ME_mod= 0
##$MI= 0
##$NCOEF= 0
##$NC_proc= -8
##$NLEV= 6
##$NOISF1= 0
##$NOISF2= 0
##$NSP= 0
##$NTH_PI= 0
##$NZP= 0
##$OFFSET= 14.98509
##$PC= 1
##$PHC0= 175.7483
##$PHC1= 0
##$PH_mod= 1
##$PKNL= yes
##$PPARMOD= 0
##$PPDIAG= 0
##$PPIPTYP= 0
##$PPMPNUM= 2147483647
##$PPRESOL= 1
##$PSCAL= 4
##$PSIGN= 0
##$PYNMP= <proc.py>
##$REVERSE= no
##$SF= 400.02
##$SI= 32768
##$SIGF1= 0
##$SIGF2= 0
##$SINO= 400
##$SIOLD= 32768
##$SPECTYP= <>
##$SREGLST= <1H.CDCl3>
##$SSB= 0
##$STSI= 32768
##$STSR= 0
##$SW_p= 8223.68421052631
##$SYMM= 0
##$S_DEV= 0
##$TDeff= 65536
##$TDoff= 0
##$TI= <>
##$TILT= no
##$TM1= 0
##$TM2= 0
##$TOPLEV= 0
##$USERP1= <user>
##$USERP2= <user>
##$USERP3= <user>
##$USERP4= <user>
##$USERP5= <user>
##$WDW= 1
##$XDIM= 32768
##$YMAX_p= 482395200
##$YMIN_p= -763203
##$CURPLOT= <Network HP LaserJet P1505>
##$CURPRIN= <$Network HP LaserJet P1505>
##$DFORMAT= <normdp>
##$LAYOUT= <+/1D_H.xwp>
##$LFORMAT= <normlp>
##$PFORMAT= <normpl>
##$SURQMSG= 1
$$ End of Bruker specific parameters
$$ ---------------------------------
##NTUPLES= NMR SPECTRUM
##VAR_NAME=  FREQUENCY,     SPECTRUM/REAL,   SPECTRUM/IMAG
##SYMBOL=    X,             R,               I
##VAR_TYPE=  INDEPENDENT,   DEPENDENT,       DEPENDENT
##VAR_FORM=  AFFN,          ASDF,            ASDF
##VAR_DIM=   32768,         32768,           32768
##UNITS=     HZ,            ARBITRARY UNITS, ARBITRARY UNITS
##FACTOR=    0.250966925370066, 1,           1
##FIRST=     8223.43324360094, -155808,      -160678
##LAST=      0,             -30684,          46318
##MIN=       0,             -763203,         0
##MAX=       8223.43324360094, 482395200,    0
$$ Real data points
##PAGE= N=1
##DATA TABLE= (X++(R..R)), XYDATA
$$ [...]
$$ plain form
19516 -241206 -401530 360613 -436046 -57944 -163954 -56521 -125378 -310623 -235085 166668
19505 196625 -105188 24904 45088 -321423 69013 138222 -52251 -107346 -30607 328150 133213
19493 -104916 -14308 -30228 72716 -179305 -130722 94825 -74144 -115806 -175399 -27895 -351304
19482 -351304 -92162 172780 -275026 28285 -339384 -70988 82647 136462 63052 128216 122088
19471 122088 -343352 317357 61005 209822 -207079 -3759 130778 32422 -126415 -229812
19461 -229812 -101923 -75713 84759 -256322 -109969 -119550 -205911 -55180 -134795 180663 98579
19450 98579 -101791 -354544 71447 -256972 -273475 -149925 136354 31826 -125297 -102769
19440 -102769 -160111 -405157 -398401 -520 -84426 -30865 105725 43514 -338770 -11153 53958
$$ packed form
19516b41206j60324C60613d36046e7944j06010e6521o8857j85245P5538A66668
19505A96625a05188B4904K0184c21423F9013O9209e2251n5095c0607C28150A33213
19493a04916a4308j5920G2716a79305M8583I4825g4144m1662n9593b7895l23409
19482c51304i2162A72780b75026B8285c39384g0988H2647N3815F3052O5164o128
19471A22088c43352C17357F1005J48817b07079c759A30778C2422a26415j03397
19461b29812a01923K6210H4759b56322a09969r581q6361e5180p9615A80663q2084
19450I8579a01791k52753G1447b56972j6503J23550A36354C1826a25297K2528
19440a02769n7342k45046O756e20q3906c0865A05725D3514c38770a1153E3958
$$ plain form
19428 -258992 -71030 -304396 27500 -209181 38628 -170172 101645 -103548 -360987 61910
19417 -466649 -23259 -99953 -52279 82947 -644430 -119186 225259 95958 80339 -223084 -277324
19406 -277324 -206702 -306521 62319 80249 56949 -31560 -268899 -172274 -304279 -79693 -503824
19395 -503824 10930 -242357 -77934 -109933 -440780 -254973 -44023 194299 117076 292911
19385 292911 -36532 -63241 230093 93355 -73546 -228466 142179 -101819 -35407 91764 -45562
19373 190525 166155 -47180 142864 -46933 -211736 -29207 -190605 -76661 -168848 -155676 -156737
19362 -156737 18238 -286246 128699 150661 -310130 20814 -207968 -27409 61600 33962 -302258
19350 262523 -55729 -169361 8921 150262 129447 -367876 229727 239421 38891 288258 207477
$$ packed form
19428b58992g1030k33366B7500b09181C8628a70172A01645a03548k57439F1910
19417d66649b3259p6694M7674H2947f44430a19186B25259I5958j5619b23084n4240
19406b77324P0622r9819F2319J7930k3300c1560k37339R6625j32005g9693m24131
19395e03824A0930b42357g7934l1999l30847J85807d4023A94299p7223J75835
19385B92911c6532k6709B30093I3355g3546j54920A42179a01819c5407I1764d5562
19373A90525k4370d7180A42864d6933j64803b9207j61398g6661r2187J3172j061
19362a56737A8238b86246A28699K1962c10130B0814b07968b7409F1600k7638c02258
19350B62523e5729j13632H921J41341k0815c67876B29727R694C8891K49367q0781
$$ plain form
19339 207477 45890 -211815 -88495 -83230 -184838 89231 -40191 19075 214342 129368 17875
19327 -321659 -261674 31416 -38510 -140621 -268881 39517 -305910 43348 -159530 323566
19316 -62281 113830 -83557 95548 -304948 -173989 166278 70078 -119208 -198768 56789 10854
19304 38979 171389 78822 264479 68616 -42221 165299 -1200 -233296 -166133 -68678 -291655
19293 -291655 -85228 113785 82628 122324 -45361 -177597 -16893 -351736 -259004 202146 -289866
19281 60723 -79501 -107000 -91827 -40191 -254666 185503 22876 -97789 50915 200039 207158
19270 207158 -244132 -235559 -64414 -61898 -163364 -11498 -54129 19612 -166561 351153 -100830
19258 -3913 -22932 130261 -168166 -176815 -580775 44509 -31667 -412428 -79826 -197853 -90997
$$ packed form
19339B07477D5890b11815h8495N265j01608H9231d0191A9075J95267q4974A7875
19327c21659N9985C1416c8510j02111j28260C9517c05910D3348a59530C23566
19316f2281A13830h3557I5548c04948J30959A66278G0078a19208p9560E6789A0854
19304C8979J32410G8822J85657F8616d2221A65299a200k32096O7163f8678k22977
19293b91655h5228A13785l1157L9696d5361j32236a6893l34843R2732B02146b89866
19281F0723g9501k7499J5173d0191k14475A85503B2876i7789E0915J49124P119
19270B07158b44132Q573f4414K516j01466a1498m2631A9612a66561C51153a00830
19258c913j9019A30261a68166q649m03960D4509c1667l80761g9826j18027i0997
$$ plain form
19246 -85073 -23401 -203362 34664 53533 162005 -90079 -261417 -284886 -125944 151434 152841
19235 152841 190058 25477 -331335 35752 -86919 -336404 105263 -233857 9276 77881 143894
19224 143894 -300056 -158473 -188665 -336326 43711 -150479 -391536 172485 -359987 -387132
19214 -387132 8328 -81256 5515 -133894 -314616 69365 -267292 101156 -329487 159983 83502
19203 83502 119405 -161511 195395 -106819 -72287 -306499 -57217 307154 -178537 -303496
19193 -303496 -325160 -88849 -78724 -146131 -6791 96131 -77912 -217140 -179572 -25172 8156 -210538
19180 -302267 117737 113574 -152143 151560 -114587 121445 -31842 -347372 -25238 -141111
19170 -141111 -442230 165332 12979 -52167 -393975 -204388 -126751 -146242 113969 -301469
$$ packed form
19246h5073b3401j79961C4664J8869J08472i0079j71338k3469a25944A51434J407
19235A52841L7217B5477c31335C5752h6919k49485A05263b33857I276O8605O6013
19224A43894c00056J41583l0192j47661D3711a50479k41057A72485c59987k7145
19214c87132H328h1256E515a33894j80722F9365b67292A01156c29487A59983p6481
19203H3502L5903a61511A95395a06819L4532k34212e7217C07154a78537j24959
19193c03496k1664h8849J0125o7407f791I6131g7912j39228L7568b5172H156b10538
19180c02267A17737m163a52143A51560a14587A21445c1842l15530b5238j15873
19170a41111l01119A65332A2979e2167l41808J89587P7637j9491A13969c01469
$$ plain form
19159 218633 -222622 154319 96505 -388336 -56562 -76761 -530250 -17329 229502 129604
19149 129604 -12475 105824 -180327 -82192 -398369 48042 -125759 -52225 105956 -317071
19138 201327 -56267 105824 -84790 51945 -56565 -72157 129291 98294 -451516 -222600 162198
19126 117771 -263659 472975 -208552 23066 37315 59738 -43168 -136048 -42406 -242231 141644
19114 37341 49790 -309960 224319 -51488 20110 105192 -285030 -249907 142885 234562 -167938
19102 8234 -83401 -54232 273084 -166304 -252188 117300 -192155 249134 -69323 79510 6878
19090 -214616 -160772 -170057 -164093 43671 -50106 153785 -109630 -108673 -28043 -642518 -215101
19078 157815 -117248 510623 15325 9911 -38109 -52095 143282 -191999 -89219 -30788 -73545
$$ packed form
19159B18633b22622A54319n7814c88336e6562k0199m53489a7329B29502r9898
19149A29604a2475A05824a80327h2192l16177D8042a25759e2225A05956c17071
19138B01327e6267A05824h4790E1945e6565j5592A29291l0997d51516b22600A62198
19126A17771b63659D72975b08552B3066J4249K2423d3168r2880d2406j99825A41644
19114C7341J2449c09960B24319e1488B0110Q5082b85030L5123A42885R1677a67938
19102H234h3401K9169B73084a66304q5884A17300a92155B49134f9323G9510F878
19090b14616N3844r285N964D3671e0106A53785a09630R57b8043o14475b15101
19078A57815a17248E10623A5325n414c8109j3986A43282a91999h9219c0788m2757
$$ plain form
19067 -73545 71093 -247290 -51920 -123977 36824 -234227 60176 119680 62819 -35625 -234234
19056 -234234 67429 -314376 -289785 340955 -94921 86729 163744 -434272 62738 39094 -237670
19044 -107880 46663 -112259 181217 102180 32750 156957 -180209 -355641 -169325 -266758
19034 -266758 -133713 19539 -178078 -208133 -181670 172995 256026 213245 211539 108951 -172543
19022 52634 -69620 104596 -69419 -184284 48498 -1810 157607 -163089 -162945 -221577 35331
19010 107177 -203023 67445 -28301 6542 71956 -112796 257999 24677 -120742 96372 -108748
18998 -383061 -37759 -9242 -125576 115082 -254217 -114410 119246 243426 24776 263792
18988 263792 -129226 144096 -26980 354904 -23456 -364015 86239 129235 219028 -490692
$$ packed form
19067g3545G1093b47290e1920p2057C6824b34227F0176N9504n6861c5625j98609
19056b34234F7429c14376K4591C40955i4921H6729P7015d34272F2738k3644b37670
19044a07880D6663a12259A81217p9037C2750J24207a80209j75432a69325r7433
19034b66758J33045A9539a78078l0055K6463A72995Q3031m2781j706j02588a72543
19022E2634f9620A04596f9419j14865D8498a810A57607a63089J44n8632C5331
19010A07177b03023F7445b8301F542O5414a12796B57999B4677a20742I6372a08748
18998c83061c7759i242j16334A15082b54217a14410A19246J24180B4776K39016
18988B63792a29226A44096b6980C54904b3456l40559H6239M2996Q9793d90692
$$ plain form
18977 282166 6972 -73662 65472 -68158 202835 119904 -87989 107058 -164607 -16801 -109065
18966 -109065 25834 -288037 -237084 -43058 113597 66648 -231824 -19229 -74429 -45983 -81906
18955 -81906 102387 -311836 416854 -409522 105026 183235 176476 -57938 39859 -149410 28961
18943 -270441 -335810 -170635 -35456 262651 148280 -132850 274861 -72392 -46948 96691
18932 90028 329669 -14751 2897 -131851 -241416 -359154 -123741 19469 -255472 -115543
18921 180305 -152058 -86152 132810 223117 15169 71076 -256383 -115603 -125348 -106548 -268451
18910 -268451 200434 -184498 -182709 180525 -325163 130248 -269890 -278675 191952 51371
18899 -165049 -380553 -113358 76355 -174037 -316417 -67555 -158679 88250 -104244 -99134 117764
$$ packed form
18977B82166F972g3662F5472f8158B02835q2931h7989A07058a64607a6801r2264
18966a09065B5834b88037N0953d3058A13597m6949b31824a9229n5200K8446l5923
18955h1906A02387c11836D16854d09522A05026P8209o759e7938C9859a49410B8961
18943b70441o5369J65175c5456B62651j14371a32850B74861g2392K5444I6691
18932I0028K39641a4751B897a31851j09565j17738a23741A9469b55472a15543
18921A80305a52058O5906A32810R0307A5169N5907b56383a15603r745J8800j61903
18910b68451B00434a84498J789A80525c25163A30248b69890q785A91952E1371
18899a65049k15504a13358G6355a74037j42380f7555r1124H8250a04244N110A17764
$$ plain form
18887 -264091 -80951 9950 -290307 -67178 175067 -198510 -41478 54721 -106804 6312 -80032
18875 -44628 -101087 59217 3329 -212600 -268267 -348555 -142338 6575 -275960 -110140 -43448
18863 49797 -109420 244794 -327509 229124 212848 -151633 214689 -157918 49189 191510
18853 191510 -226934 -9829 -244205 -105797 -32855 -226013 -283817 8096 163208 -97379 -224041
18842 -224041 -101498 -95553 24894 -367298 13537 -85895 -69463 40842 -83994 -299105 -127668
18830 -110978 -436856 -46268 -11944 -338677 -99781 161026 -307107 -43327 101177 443698
18820 443698 134864 420546 -73771 -440462 375645 10187 54976 306651 266228 187369
18810 187369 86451 189145 251890 -67155 46660 260697 -140938 -429768 -132777 311567
$$ packed form
18887b64091h0951I950b90307f7178A75067a98510d1478E4721a06804F312h0032
18875d4628n6459E9217C329b12600n5667q0288a42338F575b75960a10140d3448
18863D9797a09420B44794c27509B29124j6276a51633B14689a57918D9189J42321
18853A91510b26934i829k34376a05797c2855j93158n7804H096J55112i7379j26662
18842b24041a01498N945B4894c67298A3537h5895J6432D0842h3994k15111a27668
18830a10978l25878d6268a1944l26733i9781A61026c07107d3327A01177L42521
18820D43698A34864K85682g3771l66691C75645A0187M4789K51675m0423p8859
18810A87369H6451J02694O2745f7155D6660K14037a40938k88830a32777C11567
$$ plain form
18799 40579 44754 -95665 -492773 -344840 21465 -187270 -226144 144603 -269234 169772 202993
18788 202993 -24948 -170375 21414 -250827 116541 -9613 -45187 -68744 170951 -104129 -107627
18777 -107627 -95837 -6496 -206900 -166853 -481349 -28123 248941 -197349 -68545 -6321 1159
18765 47155 -182903 -106913 35789 176885 -106173 -271571 -60299 -256336 -63811 14903 45122
18754 45122 -208230 100156 -78892 94677 5715 -108342 -45190 -133619 177502 105354 -166144
18742 196448 292183 -284241 63744 -197477 83485 -302004 -211129 126128 -332884 385889
18731 -91840 -25647 -251760 -70036 72738 -202789 -288837 -434296 104195 50525 -36708 74830
18719 -43665 -145109 -182647 53260 -22625 -392810 -430943 -33318 32096 2353 -2158 41012 226452
$$ packed form
18799D0579M175i5665l97108J47933B1465a87270l8874A44603b69234A69772L3221
18788B02993b4948j45427B1414b50827A16541i613l5574k3557A70951a04129l498
18777a07627J1790f496k00404M0047l14496b8123B48941a97349f8545f321A159
18765D7155a82903P5990C5789J41096a06173j65398f0299j96037f3811A4903L0219
18754D5122b08230A00156g8892I4677E715a08342d5190q8429A77502p2148a66144
18742A96448R5735b84241F3744a97477H3485c02004R0875A26128c32884C85889
18731i1840b5647k26113g0036G2738b02789q6048j45459A04195E0525c6708G4830
18719d3665j01444l7538E3260b2625l70185l8133c3318C2096B353b158D1012J85440
$$ plain form
18707 226452 -59745 118456 -232144 -79721 60957 435568 -128092 8229 58265 106568 -59412
18695 13615 105277 -158242 957 -340986 138652 179296 -342107 77842 -60930 47064 -56702
18683 -218243 -194267 -301442 20769 166805 443399 -158598 71665 59555 211816 -262890
18672 -52906 -221475 -33706 -26409 -119453 -62611 -92557 -99896 166629 -89661 -224577 -68296
18660 -41851 -160878 225373 -220861 -102151 -130470 65527 13416 -50474 329833 -206085
18649 -179211 218617 -282669 7028 -456601 112593 83277 -193945 110193 -228704 -247610
18639 -247610 -169999 -156221 24520 -152330 -175770 23965 -75002 147244 -41721 87756 -60156
18627 234771 18491 -83625 -173874 96170 -58354 -78854 -168226 245764 276268 324169 44226
$$ packed form
18707B26452e9745A18456b32144g9721F0957L74611a28092H229N0036M8303e9412
18695A3615R1662a58242I57c40986A38652M0644c42107G7842f0930D7064e6702
18683b18243K3976j07175B0769J46036K76594a58598G1665j2110J52261b62890
18672e2906j68569c3706P297r3044N6842k9946p339A66629h9661j34916f8296
18660d1851j19027B25373b20861a02151k8319F5527A3416e0474C29833b06085
18649a79211B18617b82669G028d56601A12593k9316a93945A10193b28704j8906
18639b47610P7611J3778B4520a52330k3440B3965g5002A47244d1721H7756f0156
18627B34771A8491h3625r0249I6170e8354k0500q9372B45764L0504M7901D4226
$$ plain form
18615 -22777 -243555 25136 54930 -222605 44453 -230009 126406 173961 -111851 174122
18604 143343 -453370 -57894 -64839 -150220 -206452 -85223 25530 -71384 -69646 -123130 -21953 -135351
18592 -135351 -15903 -23880 -171042 -29063 -74646 -312411 -81358 -256046 -329978 -219568 -71422
18580 228990 3267 -36114 -106374 123508 -42355 62954 189195 58047 61115 -334546 29615
18568 -211673 -242287 -151910 -111316 -152853 -104589 199266 123108 -203702 67598 -1584 -188259
18557 -188259 -313015 -362467 -98873 -22963 -365920 -159631 -328488 190568 -243503 177525
18546 -155132 -264594 70004 86316 244729 -124698 -199415 -154266 23596 47305 147287 -15635
18534 -188112 292782 -269278 51898 4377 217282 -264175 207918 91420 -9994 154367 -303
$$ packed form
18615b2777k20778B5136K9794b22605D4453b30009A26406M7555a11851A74122
18604A43343d53370e7894o945q5381n6232h5223B5530g1384J738n3484b1953j13398
18592a35351a5903p977j47162b9063m5583k37765h1358j74688p3932J10410g1422
18580B28990C267c6114p0260A23508d2355F2954J26241E8047L068c34546B9615
18568b11673l0614R0377M0594m1537M8264A99266p6158b03702F7598a584j86675
18557a88259j24756m9452i8873b2963l42957a59631j68857A90568b43503A77525
18546a55132j09462G0004J6312J58413a24698p4717M5149B3596K3709R9982a5635
18534a88112B92782b69278E1898D377K12905b64175B07918I1420i994A54367c03
$$ plain form
18522 59775 -34349 177456 33109 54716 125399 202716 250247 58115 -93381 -426030 64656
18510 43483 -93476 -187708 8222 -122822 -42480 -70332 8945 -134576 -54672 -335931 124358
18498 -196688 -12787 -284263 -339559 256688 -71634 -167629 -216796 -59507 -249045 56141 -211015
18486 -238946 -293712 -68122 118588 139796 -49939 46251 -101485 98018 53891 -38577 -285039
18475 -285039 -274119 108570 10022 -90566 -563206 8879 -216786 -168324 -54076 347029 47192
18463 -200493 113108 -20282 58179 136541 11743 161982 -52577 -69394 -201331 273622 -503930
18451 49023 94683 88622 63538 249610 -96164 77458 -376790 95578 46460 7421 138802
18440 138802 -297518 -161045 -249050 -216880 208941 -170970 128422 40327 298030 134489
$$ packed form
18522E9775c4349A77456C3109K1607P0683P7317M7531E8115i3381l32649F4656
18510D3483i3476r4232H222a22822d2480k7852H945a34576e4672k81259A24358
18498a96688a2787k71476n5296B56688g1634r5995m9167e9507j89538E6141b11015
18486b38946n4766f8122A18588K1208d9939D6251a01485I8018m4127c8577k46462
18475b85039J0920A08570A0022i0566m72640H879b16786M8462e4076C47029D7192
18463b00493A13108b0282E8179P8362A1743J50239e2577j6817j31937B73622e03930
18451D9023M5660o061k5084J86072i6164G7458c76790I5578D6460G421J31381
18440A38802b97518J36473q8005L2170B08941a70970A28422D0327K57703A34489
$$ plain form
18429 -333142 -136616 -150662 -38812 55677 111646 -108238 -81119 267220 -23755 70908 266469
18418 266469 -90135 -228859 138572 250132 165063 -133230 -28052 -131784 45792 18113
18407 131551 -177724 252930 108177 105857 -67210 107759 1132 -375208 -380318 -412300 190267
18395 -174227 26999 -43771 -126300 109610 21541 -157303 15962 100950 266861 29731 -263769
18383 -8671 119210 -51978 -342729 17927 40414 -189418 -197417 -77176 176177 154395 31792
18371 -128925 -140585 22293 -238150 -120068 -94690 263264 -67629 -223987 21023 309238
18361 309238 332307 189306 -248208 -54127 41173 -83288 -174222 -192152 -113208 -51101 48250
18349 -525196 13880 -91137 -296671 -124117 -152099 117141 -227363 -73630 -271542 90184
$$ packed form
18429c33142a36616j4046c8812E5677N5969a08238K7119B67220b3755G0908J95561
18418B66469i0135j38724A38572J11560q5069a33230b8052j03732D5792A8113
18407A31551a77724B52930A08177k320f7210A07759A132c75208n110l1982A90267
18395a74227B6999d3771q2529A09610B1541a57303A5962Q4988J65911B9731b63769
18383h671A19210e1978k90751A7927K2487a89418p999g7176A76177k1782C1792
18371a28925j1660B2293b38150J18082K5378B63264f7629j56358B1023K88215
18361C09238K3069j43001b48208e4127D1173h3288r0934j7930P8944e1101D8250
18349e25196A3880i1137k05534a24117k7982A17141b27363g3630j97912I0184
$$ plain form
18338 -93132 288945 10015 31006 462034 205612 150459 25841 261132 -10920 62768 13189
18326 -225223 -117119 -117713 109148 -164887 -186632 -44453 -191476 -94215 -123725 -133068 -263262
18315 -263262 242068 72163 -141506 263746 -17235 -352399 53143 -101128 -231516 80288
18304 131834 6340 -73643 -139501 -106593 -155644 255884 45265 309047 124357 31628 21793
18293 21793 -180470 -155800 -373635 -137374 149953 -76226 -174895 164545 46275 26769 -129447
18281 -25809 131017 217860 -236399 -175378 -143486 195959 -93346 -95191 243786 -227453 -179853
18270 -179853 -217438 -164310 194908 181554 -25552 150479 109158 52823 -20812 -56915 271153
18258 -203950 149044 119134 -43915 -412658 -74742 22127 -245809 -64132 24416 -246310 -65353
$$ packed form
18338i3132B88945A0015K0991M31028B05612n5153B5841K35291a0920F2768A3189
18326b25223J08104n94A09148a64887k1745d4453j47023i4215k9510r343j30194
18315b63262B42068G2163a41506B63746a7235l35164E3143a01128j30388H0288
18304A31834F340g3643o5858L2908m9051B55884D5265K63782A24357C1628r835
18293B1793a80470K4670k17835a37374A49953g6226r8669A64545D6275j9506a29447
18281b5809A31017Q6843b36399O1021L1892A95959i3346j845B43786b27453M7600
18270a79853l7585N3128A94908j3354b5552A50479m1321E2823b0812l6103B71153
18258b03950A49044k9910d3915l68743g4742B2127b45809f4132B4416b46310f5353
$$ plain form
18246 -239906 -244421 22182 241665 -190918 365862 3633 47721 -21485 -261584 -243853 -23394
18234 -85942 -128687 -94799 -19289 -117213 66540 59055 -245180 37741 163776 -114380 -113481 307923
18221 -50545 -151449 -195780 139759 -110489 66571 16416 -240801 -126317 -39405 28417 150420
18210 150420 179988 57457 -16729 -90328 2012 158871 -68412 -266568 35295 -44330 296671
18198 -203064 65416 124204 35695 168732 -54279 130296 108343 -149064 25214 162138 -158782
18186 108306 -148672 -128016 132007 -78911 -273901 -349964 -48373 54947 147686 417546 -217953
18174 -137422 187136 115766 -232405 7713 89499 7588 -412576 -21937 -257630 -233297 -73749
18162 -57395 85362 -125297 -351285 -19918 -216301 -120726 -211474 2234 70821 65580 -123760
$$ packed form
18246b39906m515B2182K19483a90918C65862C633M4088b1485k40099J7731b3394
18234h5942m2745L3888a9289r7924F6540p485b45180C7741J26035a14380Q99C07923
18221e0545j00904m4331A39759a10489F6571A6416b40801J14484c9405B8417J22003
18210A50420K9568E7457a6729p3599B012J56859f8412j98156C5295d4330B96671
18198b03064F5416N8788C5695J33037e4279A30296k1953a49064B5214J36924a58782
18186A08306a48672K0656A32007g8911j94990p6063d8373E4947R2739K69860b17953
18174a37422A87136p1370b32405G713Q1786G588d12576b1937k35693K4333g3749
18162e7395H5362a25297k25988a9918j96383R5575r0748B234O8587n241a23760
$$ plain form
18150 363893 -324925 -317403 -195211 -10197 -75965 -15673 -312594 62846 262317 -117768 46648
18138 -87276 187490 252581 -208918 36390 -13015 14758 -120108 48722 -169172 -187061 32268
18126 -35711 85105 143565 -228989 51956 -363330 -17703 -110281 -146510 131577 -191449 -27712
18114 74751 -117551 71606 -378194 1093 -37668 -18729 -332301 71044 52024 -97559 70931
18102 93615 -55941 65101 116798 206460 -153970 -290243 181668 -13274 88797 -129992 63466
18090 100475 27227 266578 137361 -2171 -321868 -136457 -84167 -10086 -337768 159729
18079 348597 -228714 191026 227926 -124810 178981 -50905 -125330 -152329 -52334 -282050
18069 -282050 -187999 -187463 -197093 -308624 -1594 -23038 -157781 -164272 -124149 180117 -20141 -21661
$$ packed form
18150C63893c24925P522J22192a0197o5768a5673k96921F2846J99471a17768D6648
18138h7276A87490O5091b08918C6390a3015A4758a20108D8722a69172j7889C2268
18126c5711H5105N8460b28989E1956c63330a7703r2578l6229A31577a91449b7712
18114G4751a17551G1606c78194A093c7668a8729l13572G1044j9020i7559G0931
18102I3615e5941F5101N1697Q9662a53970j36273A81668a3274H8797a29992F3466
18090A00475B7227K39351j29217b171l19697a36457N2290a0086l27682A59729
18079C48597b28714A91026L6900a24810A78981e0905p4425k6999e2334k29716
18069b82050R4051N36r630j11531a594k1444j34743o491M0123A80117b0141j520
$$ plain form
18057 -21661 -86356 -251365 304300 -141634 -258140 66562 -274658 -212087 200964 38323
18046 91288 -205764 -79893 -130048 34754 64388 -729736 -6135 -260910 84157 -19223 -42845
18035 -42845 255134 284113 -272655 -58766 73193 87762 -303777 63955 237308 -102705 -187083
18024 -187083 61640 -197764 -1212 200833 -194057 -71211 -229918 15242 149244 303741
18014 303741 -47497 -21875 83955 139493 -304389 -171533 -130138 22699 254581 -23850 -144635
18003 -144635 -182442 -8535 91884 9755 -460228 327227 -141955 138387 -129113 -65939 1101
17991 204487 253297 38054 -147087 -125170 150265 149931 -115628 177327 7640 13844 267670
17980 267670 -214376 315695 -179545 -30302 176974 -91031 -39026 -338665 71319 -137101
$$ packed form
18057b1661o4695j65009C04300a41634j16506F6562b74658O2571B00964C8323
18046I1288b05764g9893n0155C4754K9634g29736f135k54775H4157a9223k3622
18035d2845B55134K8979b72655e8766G3193J4569c03777F3955J73353a02705q4378
18024a87083F1640a97764a212B00833a94057g1211j58707A5242J34002J54497
18014C03741d7497b1875H3955N5538c04389J32856M1395B2699K31882b3850j20785
18003a44635l7807h535I1884I755d60228C27227a41955A38387a29113O3174A101
17991B04487M8810C8054a47087K1917A50265l34a15628A77327G640O204K53826
17980B67670b14376C15695a79545c0302A76974i1031c9026k99639G1319a37101
$$ plain form
17969 -269354 -239259 -496838 -304165 -142477 92186 5584 -182570 -27685 -213701 97296 149269
17958 149269 -276432 103514 -96102 -140997 80053 -144224 -77673 91939 -141374 47984 179364
17947 179364 153933 -252897 -162052 271275 -50596 52497 -267794 156239 -48356 22299 -187413
17935 80085 -176682 123806 -118314 -16644 112430 -296309 -50450 194659 -134173 77055
17924 -37336 277322 -598118 -19853 -279347 -36663 -219854 148785 3996 94735 -79113 65172
17912 35594 -134867 -131032 -296443 -134237 -246898 -243564 109975 303414 -39320 -73496 12604
17900 370119 -239158 -91033 -2235 43849 -47715 11427 83017 -199210 32013 42570 -79159
17888 -51282 -332835 -114308 -126933 38849 255303 317004 30003 280160 -96349 -320711 -355453
$$ packed form
17969b69354L0095k57579J92673a42477I2186E584a82570b7685j86016I7296N1973
17958A49269b76432A03514i6102m4895H0053a44224O6551I1939a41374D7984J31380
17947A79364k5431b52897R0845B71275e0596E2497b67794A56239d8356B2299a87413
17935H0085a76682A23806a18314a6644A12430b96309e0450A94659a34173G7055
17924c7336B77322e98118a9853k59494c6663j83191A48785C996R0739g9113F5172
17912C5594a34867L835j65411a34237j12661L334A09975J93439c9320l4176A2604
17900C70119b39158i1033b235D3849d7715A1427P1590a99210C2013J0557g9159
17888e1282k81553a14308j2625C8849K16454O1701C0003K50157i6349k24362l4742
$$ plain form
17877 -355453 -14715 233858 -139250 -138496 -28768 -160671 370382 -5354 23186 198175 98683
17865 -223553 -12504 -290468 315298 160526 59054 -142850 -140640 117517 -201364 -341933
17855 -341933 -168169 40984 47656 -247539 193552 -234650 -142494 97579 4545 19362 152061
17844 152061 -39651 -120854 -89450 114609 63319 199023 -71700 -315174 -129833 -218006 -179654
17833 -179654 -232204 92927 -139254 -128067 62599 219882 465019 212684 -46374 230961
17822 -209510 111628 -112902 -7938 70618 218964 122409 -99002 203546 282806 -103327 -48097
17810 256575 -7669 -373225 212156 -68763 4109 903 34957 431284 112603 65391 225012
17799 225012 -134374 -145457 99162 -210060 390910 -160855 -18408 282552 -255238 -58546
$$ packed form
17877c55453a4715B33858a39250P54b8768j31903C70382e354B3186J74989I8683
17865b23553a2504k77964C15298j54772E9054a42850K210A17517b01364j40569
17855c41933a68169D0984O672b47539A93552b34650R2156I7579D545J4817J32699
17844A52061c9651q1203L1404A14609n1290J35704g1700k43474a29833q8173L8352
17833a79654n2550I2927a39254J1187F2599J57283K45137B12684d6374B30961
17822b09510A11628a12902g938G0618J48346r6555i9002B03546P9260a03327d8097
17810B56575g669l65556B12156f8763D109I03L4054L96327A12603m7212J59621
17799B25012a34374j1083I9162b10060C90910a60855a8408B82552b55238e8546
$$ plain form
17788 -13570 50438 -25218 121708 66175 458415 159202 -83951 -198808 -96117 158138 -237774
17776 -64241 -91541 -20366 96623 -88057 -40481 -135641 -251377 -176283 99351 237218 319422
17765 319422 116602 146837 -94161 -139450 -320610 84490 21856 -121216 -28424 341704 -90852
17753 48097 -14888 25439 153968 29106 -152608 -49719 205359 -442942 -262646 -122980
17742 -84213 -19453 61394 88723 251862 -135782 153244 162071 16008 -87424 -209370 170895
17730 -6054 250757 153002 222466 -11539 80312 -115157 -181010 -2265 -232561 5677 47171 -190914
17717 80289 7914 248073 -364902 -97344 -98773 -121872 68049 77524 299173 68867 141038 -65941
17704 11806 344846 -197361 129747 30395 104619 -44128 -42846 59445 -39322 -123052 171196
$$ packed form
17788a3570E0438b5218A21708n5533L92240A59202h3951j14857i6117A58138b37774
17776f4241k7300b0366I6623h8057d0481r5160j15736P5094I9351J37867Q2204
17765C19422A16602L0235i4161m5289j81160H4490B1856a21216b8424C41704i0852
17753D8097a4888B5439J28529B9106a52608d9719B05359d42942J80296a22980
17742h4213a9453F1394K7329J63139a35782A53244Q827A6008h7424j21946A70895
17730f054B50757r7755O9464a1539H0312a15157o5853b265k30296E677M1494a90914
17717H0289G914K40159c64902i7344j429k3099F8049R475K21649F8867P2171f5941
17704A1806L33040a97361A29747C0395P4224d4128J282E9445c9322q3730A71196
$$ plain form
17692 -82950 46152 -11863 88996 258616 72755 155509 100604 -85979 -181533 16188 220720
17681 220720 86023 -181456 233102 -55829 204794 432503 107387 -111308 29497 340631
17671 340631 183149 276332 232702 -24306 -20544 105099 -307337 142395 430000 139173
17660 -35354 -255548 215901 259720 -145302 -20341 117557 -129078 225061 71830 132539
17650 132539 105698 -467829 -377483 -85887 -6685 -133873 -22255 -31709 94833 280220 80480
17638 -87430 -267821 49808 147892 -143398 157759 48488 -72276 -118301 -86494 116966 -43490
17626 -25374 172620 -44356 259355 -568301 303577 34299 320309 195419 306993 303399
17616 303399 221965 -187358 -59075 -59009 -6515 169623 -77322 98797 -119003 -35981 102137
$$ packed form
17692h2950D6152a1863H8996J69620G2755Q2754n4905h5979r5554A6188K04532
17681B20720H6023a81456B33102e5829B04794K27709A07387a11308B9497L11134
17671C40631j57482R3183m3630b4306L762A05099c07337A42395K87605A39173
17660c5354k20194B15901M3819a45302b0341A17557a29078B25061G1830O0709
17650A32539k6841d67829R0346h5887f685j27188b2255r454I4833J85387H0480
17638h7430j80391D9808R8084a43398A57759D8488g2276m6025L1807A16966d3490
17626b5374A72620d4356B59355e68301C03577C4299K86010j24890J11574l594
17616C03399q1434a87358e9075O6f515A69623g7322I8797a19003c5981A02137
$$ plain form
17604 24461 234864 -5404 -176269 154627 -33186 104837 165834 2857 -185891 -30088 86133
17592 -144580 -36840 43211 -19305 369400 182873 -171561 -275180 -35379 -37876 -11642 -165342
17581 -165342 -1111 98309 247307 -85593 -136112 85849 277403 164954 364841 252626 -76215
17569 120740 110361 218817 -148776 -37906 35607 -22625 13813 169338 130880 209816 -82507
17557 122763 168736 27269 59790 177351 -81238 -59303 76696 -144814 141878 -438479 272319
17545 128437 127259 25294 498030 36112 -68334 26547 85395 -131151 -82325 -121424 46219
17533 445021 219608 181773 -17919 -76054 47160 -83531 -137416 -120299 -35456 -71274 282487
17521 174639 190215 23059 -362324 432182 126071 178781 158146 -150596 -191574 31144 220843
$$ packed form
17604B4461K10403e404j70865A54627c3186A04837O0997B857a85891c0088H6133
17592a44580c6840D3211a9305C69400A82873a71561j03619c5379k497a1642j53700
17581a65342a111I8309J48998h5593n0519H5849J91554j12449J99887j12215g6215
17569A20740j0379J08456a48776c7906C5607b2625A3813J55525l8458P8936h2507
17557A22763M5973B7269L2521J17561h1238K1935G6696a44814A41878d38479B72319
17545A28437j178B5294M72736C6112f8334B6547N8848a31151M8826l9099D6219
17533D45021B19608l7835a7919n8135D7160h3531n3885J7117c5456l5818B82487
17521A74639J5576B3059c62324D32182A26071N2710k0635a50596m0978C1144J89699
$$ plain form
17510 220843 44993 -17448 121575 215794 -170406 -183119 -71113 -172648 226042 101746
17499 91776 182013 368088 211247 -168914 273511 -109244 231385 -19750 88122 28301
17488 135667 209687 224185 211138 -120969 60797 -75331 156953 210665 -57590 88797 326424
17477 326424 -58319 88484 463882 39178 427066 363587 159720 -133334 206781 368580
17467 368580 262692 199980 40682 100777 -136194 -16855 85280 104338 -184972 261372 72654
17455 33782 -70578 36161 278439 396206 327291 463346 286841 71980 -56745 361495 30656
17443 367898 283685 217320 330996 67604 95276 290545 403447 204136 -57913 63997 261126
17432 261126 376782 236512 308446 100944 225783 7544 162235 207191 525005 251741
$$ packed form
17510B20843D4993a7448A21575R4219a70406j2713g1113j01535B26042A01746
17499I1776R0237J86075j56841a68914B73511a09244B31385a9750H8122B8301
17488A35667P4020J4498j3047a20969F0797g5331A56953N3712e7590H8797K37627
17477C26424e8319H8484L75398C9178L87888o3479A59720a33334B06781J61799
17467C68580j05888o2712D0682O0095a36194a6855H5280J9058a84972B61372G2654
17455C3782g0578C6161K42278J17767o8915J36055j76505G1980e6745C61495C0656
17443C67898q4213o6365J13676F7604K7672J95269J12902j99311e7913F3997J97129
17432B61126J15656j40270P1934A00944J24839G544J54691M4956L17814B51741
$$ plain form
17421 -12691 339349 492348 439237 229407 282890 293880 16269 260376 106288 208869
17411 208869 308518 96043 20353 185869 -6148 -94156 -28952 -25767 -71342 450594 9430 363531
17399 363531 51159 -49514 267466 376906 -91918 312336 221160 280115 183499 95383 210434
17388 210434 154007 372976 142587 -238642 61707 418719 254575 50147 -56056 -26845
17377 360200 255782 224027 75529 260672 739049 112289 302834 638772 104156 285756
17367 285756 165012 -91318 481529 -320104 202945 -106537 -86810 298549 -1772 334738
17356 379045 101606 136300 647963 87586 206512 45685 14084 -149750 120210 374969
17346 374969 219742 532363 217981 349262 -47707 129425 361731 115330 202033 128510
$$ packed form
17421a2691C39349J52999n3111k09830N3483J0990A6269K44107A06288J02581
17411B08869R9649I6043B0353J65516f148q8008b8952L185m5575D50594I430L54101
17399C63531E1159d9514B67466J09440i1918C12336r1176N8955r6616q8116J15051
17388B10434n6427K18969A42587b38642F1707L57012j64144E0147e6056b6845
17377C60200j04418l1755G5529J85143M78377A12289J90545L35938A04156J81600
17367B85756j20744i1318D81529c20104B02945a06537J9727B98549a772C34738
17356C79045A01606L4694N11663H7586J18926D5685A4084a49750A20210K54759
17346C74969j55227L12621B17981J31281d7707A29425K32306A15330Q6703p3523
$$ plain form
17336 128510 -188402 31024 178101 237565 -13792 180260 313226 354063 113524 19625
17325 333594 168554 212750 -33141 1940 68477 -361350 -174651 195147 265981 554388 520403
17314 520403 -100406 -679 238346 -123502 24790 -66512 -29122 45488 130450 331619 138166
17302 103252 -40491 287068 49449 19168 149684 241614 262351 189390 177787 -7646 287961
17290 90336 -122069 30170 138038 72345 112803 134189 226930 305598 53234 233134 149518
17279 149518 -80350 385175 112050 289605 108049 -66939 -171046 42142 -106179 259838
17268 137439 96243 153427 396101 444043 171994 176669 702857 168445 234308 286597 164569
17257 164569 58721 74030 205213 229930 303970 506548 199317 200407 228989 35679 464475
$$ packed form
17336A28510a88402C1024J47077N9464a3792A80260J32966M0837A13524A9625
17325C33594j65040M4196c3141A940O6537c61350a74651A95147P0834K88407l3985
17314E20403a00406f79B38346a23502B4790f6512b9122D5488Q4962K01169A38166
17302A03252d0491B87068D9449A9168J30516R1930K0737p2961j1603g646B87961
17290I0336a22069C0170J07868o5693M0458K1386R2741P8668E3234J79900q3616
17279A49518h0350C85175A12050J77555A08049f6939j04107D2142a06179B59838
17268A37439m1196N7184K42674M7942A71994M675N26188A68445O5863N2289j22028
17257A64569E8721J5309J31183K4717P4040K02578A99317J090K8582C5679M28796
$$ plain form
17246 464475 206059 60720 114920 119958 151465 -44192 110055 167230 69190 34024 79781
17235 79781 447294 37576 238098 330368 580999 247268 65993 328535 297027 226352 421088
17224 421088 -83401 -23130 264339 437213 -187414 101103 167353 144966 196318 241858 323773
17213 323773 275264 372407 242664 30840 152938 622240 625693 472039 402473 81410 152626
17202 152626 156791 65536 445748 -36276 1952 170495 358749 443126 573681 68213 301678
17191 301678 204044 377208 93190 336858 418692 382781 -2363 363654 225933 334526 46413
17179 316913 127565 156271 87891 172247 156712 117934 11745 164706 222927 496441 40173
17167 238769 334948 272883 116697 43758 325225 80712 550686 122573 85298 123255 559924
$$ packed form
17246D64475B06059F0720N4200N038L1507d4192A10055N7175F9190C4024M5757
17235G9781L67513C7576K00522R2270K50631B47268F5993K62542l1508p0675J94736
17224D21088h3401b3130B64339J72874a87414A01103O6250k2387N1352M5540Q1915
17213C23773m8509R7143j29743C0840J22098M69302L453j53654o9566H1410P1216
17202A52626M165F5536L80212c6276A952J68543J88254Q4377J30555F8213K33465
17191C01678r7634J73164I3190K43668Q1834l5911b363C63654j37721J08593D6413
17179C16913A27565K8706o8380Q4356j5535l8778A1745J52961N8221K73514D0173
17167B38769R6179o2065A16697D3758K81467H0712M69974A22573l7275L7957M36669
$$ plain form
17156 559924 442748 349811 152012 433151 346440 229051 338912 -73125 -80668 127354
17145 37 358294 168133 352326 301320 429502 303770 244738 284491 503939 106742 66955
17134 66955 140899 371243 265850 515572 473712 616577 360103 190326 271487 369400
17124 369400 272886 186118 198965 371916 122599 500353 137839 417301 376655 714254
17114 714254 247485 211172 622310 203350 33665 458158 287568 441326 41781 161503
17104 161503 453394 358418 121326 415571 551148 623202 1730 411685 490272 249838
17094 249838 634863 472746 410850 126270 7167 300717 555420 580786 635532 610062 348778
17083 348778 277131 516523 398171 451668 601155 413876 355581 263756 313955 95941 599038
$$ packed form
17156E59924j17176r2937A52012K81139q6711j17389J09861g3125p543A27354
17145C7L58257A68133J84193n1006J28182j25732n9032L9753K19448A06742l9787
17134F6955P3944K30344j05393K49722m1860J42865k56474j69777Q1161R7913
17124C69400r6514q6768J2847J72951A22599L77754A37839K79462m0646L37599
17114G14254B47485l6313M11138B03350C3665M24493j70590J53758D1781J19722
17104A61503K91891r4976A21326K94245J35577P2054A730M09955P8587k40434
17094B49838L85025j62117o1896A26270G167K93550K54703K5366N4746k5470k61284
17083C48778p1647K39392j18352N3497J49487j87279n8295r1825N0199I5941N03097
$$ plain form
17072 599038 520509 416857 392743 410715 363879 194767 494324 198212 -50823 449539
17061 318352 518459 596047 602420 535090 561165 582764 879957 433606 276738 465784 386549
17050 386549 761733 478427 540889 580098 666344 190787 373510 481292 624396 561397
17040 561397 565769 398579 583315 144685 338712 676344 489936 528780 730642 563474
17030 563474 761484 762895 414186 945465 371807 539738 442410 940519 811630 863284
17020 863284 310030 320968 852195 607677 566177 813727 549206 813986 665034 631125
17010 631125 631338 875648 634557 745787 718433 903125 749062 612518 521312 733548
17000 733548 650538 469645 918614 798668 613339 596402 861710 629516 823543 651510
$$ packed form
17072E99038p8529j03652k4114J7972m6836j69112K99557A98212e0823D49539
17061C18352K00107P7588O373o7330K6075K1599K97193D33606j56868J89046p9235
17050C86549L75184k83306O2462L9209Q6246A90787J82723J07782J43104o2999
17040E61397M372j67190J84736A44685J94027L37632j86408L8844K01862j67168
17030E63474J98010J411l48709N31279C71807J67931r7328M98109j28889N1654
17020H63284C10030J0938N31227k44518m1500K47550k64521K64780j48952l3909
17010F31125K13K44310k41091J11230k7354J84692j54063j36544r1206K12236
17000G33548q3010j80893M48969j19946j85329j6937K65308k32194J94027j72033
$$ plain form
16990 651510 836971 460221 1174599 689699 1048263 659395 861630 816243 769389 1081635
16980 1081635 659410 825248 591231 868928 769354 870702 952759 620137 873982 1037302
16970 1037302 842599 1045846 766764 1156196 769853 753347 843808 1032269 1296786 881251
16960 881251 1237897 727209 830594 1197734 840360 1087028 1024273 1138350 1025634 950780
16950 950780 1027092 955679 1323675 1064647 788603 1289804 936819 1156288 758971 907707
16940 907707 908841 1199277 939480 1387678 1299349 1538447 1054776 1058891 761076 1390844
16930 1390844 1327123 1272724 1067888 1434632 1172398 1246262 1544387 1350857 1247674 1366401
16920 1366401 1938424 1471321 1356084 1511358 1560181 1329779 1249649 1610653 1671182 1606869
$$ packed form
16990F51510J85461l76750P14378m84900L58564l88868K02235m5387m6854L12246
16980A081635m22225J65838k34017K77697r9574J01348Q2057l32622K53845J63320
16970A037302j94703K03247k79082L89432l86343j6506R0461J88461K64517m15535
16960H81251L56646n10688J03385L67140l57374K46668o2755J14077j12716p4854
16950I50780P6312p1413L67996k59028k76044N01201l52985K19469l97317J48736
16940I07707J134K90436k59797M48198q8329K39098m83671M115k97815O29768
16930A390844o3721n4399k04836L66744k62234P3864K98125j93530j03183J18727
16920A366401N72023m67103j15237J55274M8823k30402q0130L61004O0529o4313
$$ plain form
16910 1606869 1554294 1164006 1366503 1698109 1401064 1545278 1554457 1899699 1411583 1601376
16900 1601376 1727962 1925821 1571113 1442781 1786076 1719012 1538856 1507741 1477881 2156402
16890 2156402 2019409 1799441 2058985 1982468 2045259 2046080 2248263 2370365 1904409 2378413
16880 2378413 2256850 2259719 2126123 2179362 2445082 2376485 2395699 2271533 2373477 2328264
16870 2328264 2286093 2452780 2360773 2807683 2287850 2360015 2447842 2616790 2490524 2547898
16860 2547898 2894881 3030045 2764031 2763851 2920029 2636400 2743018 3292033 3093391 3007152
16850 3007152 3071807 3003266 3537480 3547428 3547247 3214052 3445926 3713871 3445204 3587098 3535224
16839 3535224 3785997 4037258 3488116 4005921 3685509 4269380 4091889 4355584 4223878
$$ packed form
16910A606869n2575l90288K02497L31606k97045J44214R179L45242m88116J89793
16900A601376J26586J97859l54708j28332L43295o7064j80156l1115k9860O78521
16890B156402j36993k19968K59544p6517O2791Q21K02183J22102m65956M74004
16880B378413j21563K869j33596N3239K65720o8597J9214j24166J01944m5213
16870B328264m2171J66687r2007M46910n19833P2165Q7827J68948j26266N7374
16860B547898L46983J35164k66014j80J56178k83629J06618N49015j98642q6239
16850C007152O4655o8541N34214R948j81l33195K31874K67945k68667J41894n1874
16839C535224K50773K51261n49142N17805l20412N83871j77491K63695j31706
$$ plain form
16830 4223878 4209688 4429265 4451353 4527139 4343918 4568155 4861515 4899154 4975065 4971151 4904241
16819 4904241 5109543 5531526 5840116 5761672 5994512 5834423 6276692 6024803 6203128 6448081
16809 6448081 6225501 6823270 6859970 6665129 7002179 7452356 7620246 7833372 7526988 7854504
16799 7854504 8103545 8080070 8384943 8627435 8925708 9094741 9311953 9621997 9863547 9949661
16789 9949661 10299275 10351997 10983343 11110354 11460573 11661000 12117979 12316523 13090948 13009005
16779 13009005 13654662 13878660 14454768 15197827 15626197 15907279 16394259 16895892 17492023
16770 17492023 18277018 18471547 19606109 20215182 20748339 21428459 22336164 23113330 24094279
16761 24094279 24871579 26206079 27147652 28068012 29528260 30638305 32235287 33374148
$$ packed form
16830D223878j4190K19577K2088P5786j83221K24237K93360L7639P5911l914o6910
16819D904241K05302M21983L08590p8444K32840j60089M42269k51889J78325K44953
16809F448081k22580N97769L6700j94841L37050M50177J67890K13126l06384L27516
16799G854504K49041k3475L04873K42492K98273J69033K17212L10044K41550Q6114
16789I949661L49614N2722O31346J27011L50219K00427M56979J98544P74425q1943
16779A3009005O45657K23998N76108P43059M28370K81082M86980N01633N96131
16770A7492023P84995J94529J134562O09073N33157O80120R07705P77166R80949
16761B4094279P77300J334500R41573R20360J460248J110045J596982J138861
$$ plain form
16753 33374148 34974522 37041317 38469078 40438219 42078651 44353774 46857178 49212712
16745 49212712 51583840 54600715 57736080 60709433 64163540 67802942 71760762 76287965
16737 76287965 80824989 85588326 90971886 96506041 102627721 109191502 116086229 123274346
16729 123274346 130981259 138787769 147202362 155679129 163989296 172592790 180895711 188559160
16721 188559160 195911575 201725575 207058736 210951032 213303946 214177022 213286447 211250858
16713 211250858 207618508 202780467 196252777 189225463 181387311 172698694 164076698 155528043
16705 155528043 146409029 138162403 129839572 121946070 114521310 107518717 100904225 94826892
16697 94826892 88707349 83091379 78183195 73639157 68914533 65131917 61373596 57863928
$$ packed form
16753C3374148J600374K066795J427761J969141J640432K275123K503404K355534
16745D9212712K371128L016875L135365K973353L454107L639402L957820M527203
16737G6287965M537024M763337N383560N534155O121680O563781O894727P188117
16729A23274346P706913P806510Q414593Q476767Q310167Q603494Q302921P663449
16721A88559160P352415N814000N333161L892296K352914Q73076q90575k035589
16713B11250858l632350m838041o527690p027314p838152q688617q621996q548655
16705A55528043r119014q246626q322831p893502p424760p002593o614492o077333
16697I4826892o119543n615970m908184m544038m724624l782616l758321l509668
$$ plain form
16689 57863928 54762780 51509742 49023024 46290065 43634230 42153626 39835794 37596695
16681 37596695 36098100 34127819 32672639 31318976 29915344 28679429 27565282 26059822
16673 26059822 25130969 24027437 23124814 22143077 21295099 20585060 19574180 18635027 18231735
16664 18231735 17754373 17057881 16126564 15515755 15479876 14615667 14363100 13801474 13346033
16655 13346033 12865050 12646523 12123911 11906480 11435916 10797804 10552265 10558780 9961756 9742256
16645 9742256 9401285 9714549 9025392 8631788 8718177 8556144 8084242 7584232 7901817 7432563
16635 7432563 7326242 7063002 7170188 6909953 6750838 6104041 6055325 6321444 6246037 5907456
16625 5907456 5550136 5665109 5904432 5548040 5302922 5114765 4900672 5226240 5010294
$$ packed form
16689E7863928l101148l253038k486718k732959k655835j480604k317832k239099
16681C7596695j498595j970281j455180j353663j403632j235915j114147j505460
16673B6059822r28853j103532r02623r81737q47978p10039j010880r39153m03292
16664A8231735m77362o96492r31317o10809l5879q64209k52567n61626m55441
16655A3346033m80983k18527n22612k17431m70564o38112k45539O515n97024k19500
16645I742256l40971L13264o89157l93604Q6389j62033m71902n00010L17585m69254
16635G432563j06321k63240J07186k60235j59115o46797m8716K66119p5407l38581
16625E907456l57320J14973K39323l56392k45118j88157k14093L25568k15946
$$ plain form
16616 5010294 4769001 4609098 4308783 4403155 4752540 4207178 4013913 4342701 4038813 4326031
16606 4326031 4083588 3623455 3762576 3810052 3619380 3578290 3751870 3492928 3177788 3361156
16596 3361156 3175445 3100222 3249714 3108185 3022296 3104120 2868599 2879478 2904166 2849851
16586 2849851 2961961 2528858 2775306 2392703 2573824 2317161 2554387 2485362 2500949 2581545
16576 2581545 2215705 2260152 2502262 2203421 2036629 2056825 2225318 2179154 1846827 2438363
16566 2438363 2232013 1772601 2159999 2423638 1950857 1995595 1766607 1860505 2103517 1944596
16556 1944596 1569874 2147079 1508925 1800150 1564029 1546398 1785089 1604172 1485688 1612565
16546 1612565 1509834 1651941 1461551 1517167 1529184 1492340 1277666 1686746 942413 1608347
$$ packed form
16616E010294k41293j59903l00315R4372L49385n45362j93265L28788l03888K87218
16606D326031k42443m60133J39121M7476j90672m1090J73580k58942l15140J83368
16596C361156j85711p5223J49492j41529q5889Q1824k35521J0879K4688n4315
16586B849851J12110m33103K46448l82603J81121k56663K37226o9025J5587Q0596
16576B581545l65840M4447K42110k98841j66792K0196J68493m6164l32327N91536
16566B438363k06350m59412L87398K63639m72781M4738k28988R3898K43012j58921
16556A944596l74722N77205o38154K91225k36121j7631K38691j80917j18484J26877
16546A612565j02731J42107j90390N5616J2017l6844k14674M09080p44333O65934
$$ plain form
16536 1608347 1443586 1318138 1579932 1001870 1086859 1006084 1284692 1325196 1120217 1172227
16526 1172227 1264530 1361415 1329566 943528 1024728 1270082 1397524 1192081 969440 1239516
16516 1239516 1372210 902404 1315986 1073803 1656146 750945 941094 1348558 1092757
16507 1092757 591330 693158 871214 628448 894765 655346 1234182 1001228 1092385 732196
16497 732196 904837 937206 919040 611075 631730 1005883 918541 1264097 828994 602406
16487 602406 864015 761048 609750 648704 638263 780455 863123 926191 582872 624065
16477 624065 726100 621964 936324 935908 472967 671342 583928 676407 815647 668892
16467 668892 683193 749444 497158 816215 1027544 456070 674867 662904 431068 693581
$$ packed form
16536A608347j64761j25448K61794n78062Q4989q0775K78608M0504k04979N2010
16526A172227R2303R6885l1849l86038Q1200K45354J27442k05443k22641K70076
16516A239516J32694m69806M13582k42183N82343G50945J90149M07464k55801
16507A092757n01427J01828J78056k42766K66317k39419N78836k32954R1157l60189
16497G32196J72641L2369j8166l07965K0655L74153q7342L45556m35103k26588
16487F02406K61609j02967j51298L8954j0441J42192Q2668O3068l43319M1193
16477F24065J02035j04136L14360m16m62941J98375q7414R2479J39240j46755
16467F68892J4301O6251k52286L19057K11329D56070K18797j1963k31836K62513
$$ plain form
16457 693581 799628 724893 458527 514560 652971 350155 619833 663666 640258 620364
16447 620364 742139 371348 640976 819765 505927 439312 478662 549337 300222 610374
16437 610374 223381 633505 431712 351703 535458 773591 383207 647968 521766 265259
16427 265259 356685 387299 476723 304911 642231 414812 461922 576271 153366 573632
16417 573632 613831 615800 521583 276067 185495 463229 423433 515302 444656 539758 460633
16406 460633 415279 192934 144716 444293 298165 267496 316695 635422 283364 587839
16396 587839 237605 343174 228305 366910 344384 378210 389616 -117315 387993 375971
16386 375971 418163 62374 393315 297310 467986 350017 475210 434938 269436 482484
$$ packed form
16457F93581J06047p4735k66366N6033J38411l02816K69678M3833k3408j9894
16447F20364J21775l70791K69628J78789l13838o6615L9350P0675k49115L10152
16437F10374B23381M10124k01793q0009J83755K38133C83207K64761j26202k56507
16427B65259R1426L0614Q9424j71812L37320k27419M7110J14349A53366M20266
16417E73632M0199J969r4217k45516r0572K77734l9796R1869p0646R5102p9125
16406D60633m5354A92934m8218K99577j46128l0669M9199L18727B83364L04475
16396E87839B37605J05569j14869J38605k2526L3826J1406a17315C87993j2022
16386C75971M2192F2374L30941r6005J70676j17969J25193m0272j65502K13048
$$ plain form
16376 482484 263911 25510 241129 294809 501384 367824 519364 510538 346222 123958
16365 -128381 239622 214423 431109 47333 404376 364326 236048 215988 419936 333882
16355 333882 81353 553531 285505 154996 342183 172401 405079 -138651 -51666 83878
16344 135897 350288 418313 373032 264444 376863 491255 177005 186286 13765 123518
16334 123518 459955 392280 144036 98184 226995 91607 369469 548284 -151110 66819
16323 19832 349748 58537 346147 -7453 87482 -52567 284369 215636 568866 220305 -16404
16311 177573 187685 224156 91432 311135 330866 235164 318636 217690 401630 737107 -21324
16299 -50882 161227 -11406 409946 190311 -224657 120150 -15853 132130 270671 221540
$$ packed form
16376D82484k18573B5510K15619N3680K06575j33560J51540q826j64316A23958
16365a28381B39622k5199K16686D7333L57043m0050j28278k0060K03948q6054
16355C33882H1353M72178k68026j30509J87187j69782K32678a38651e1666H3878
16344A35897K14391O8025m5281j08588J12419J14392A77005R281A3765J09753
16334A23518L36437o7675A44036m5852J28811I1607K77862J78815a51110F6819
16323A9832L29916E8537K87610g453H7482e2567B84369o8733L53230B20305a6404
16311A77573J0112L6471I1432K19703J9731r5702Q3472j00946J83940L35477b1324
16299e0882A61227a1406D09946A90311b24657A20150a5853A32130J38541m9131
$$ plain form
16289 221540 213189 -105124 255492 -52914 31364 275423 153519 -11346 148593 318630
16279 318630 451059 -177908 273436 116267 -128686 198529 393942 296827 -45310 352030
16268 396876 64475 -101813 123743 173567 212943 22455 297619 -70746 32598 308174 57156
16256 -56137 113231 54151 -163891 109053 118863 -63415 -85073 -26505 184002 189147 250366
16245 250366 -8403 -50575 36512 16334 175827 59092 279625 -256553 101131 147757 288471
16234 288471 -83397 -141942 -118290 -195594 95268 316529 137518 132858 130959 336539 299012
16223 299012 85408 271305 65022 109156 -149502 202666 -184027 405882 -287328 27631
16212 40935 -120963 23585 110176 373 -68253 -92437 -53300 86572 -21421 220585 -30368 220556
$$ packed form
16289B21540q351a05124B55492e2914C1364K44059j21904a1346A48593J70037
16279C18630J32429a77908B73436A16267a28686A98529J95413r7115d5310C52030
16268C96876F4475a01813A23743M9824L9376B2455K75164g0746C2598K75576E7156
16256e6137A13231E4151a63891A09053R810f3415k1658b6505A84002N145O1219
16245B50366h403m2172C6512A6334J59493E9092K20533b56553A01131M6626J40714
16234B88471h3397n8545K3652p7304I5268K21261A37518m660j899K05580l7527
16223B99012H5408J85897F5022M4134a49502B02666a84027D05882b87328B7631
16212D0935a20963B3585Q6591C73f8253k4184L9137H6572b1421B20585c0368B20556
$$ plain form
16199 235742 -1687 84495 -4794 148411 145338 -96482 -181502 -135506 333591 127863 -170072
16187 -140856 50976 -218172 285119 231559 21073 -391128 394376 20465 -11824 -161750
16177 -161750 94901 38823 350650 -79641 216775 138562 92167 173282 126475 74661 -255247
16165 124721 134899 -11329 187151 281311 194569 244995 -41507 -488365 245885 29118 -80692
16153 -236906 33326 -78042 227676 -14111 84057 -391507 -102309 35885 353016 -232657
16142 -26600 -158534 164868 276128 -115810 -153698 140813 213760 162200 -362363 118744
16131 -58892 222649 291436 -81891 206898 -152502 -105064 -224475 11148 94756 -84047 -110473
16120 -110473 -303972 165966 362859 44959 255564 165729 -68312 -34559 -29281 35325 187559
$$ packed form
16199B35742a687H4495d794A48411l073i6482q5020M5996C33591A27863a70072
16187a40856E0976b18172B85119n3560B1073c91128C94376B0465a1824j49926
16177a61750I4901C8823L11827g9641B16775p8213m6395Q1115m6807n1814b55247
16165A24721J0178a1329A87151R4160q6742N0426d1507m46858B45885B9118h0692
16153b36906C3326g8042B27676a4111H4057c91507a02309C5885L17131b32657
16142b6600j31934A64868J11260a15810l7888A40813P2947n1560c62363A18744
16131e8892B22649O8787h1891B06898a52502M7438j19411A1148Q3608h4047k6426
16120a10473j93499A65966J96893D4959K10605q9835f8312L3753N278C5325J52234
$$ plain form
16109 187559 -13691 -36234 239754 172897 -62878 -281684 -80591 281308 -23699 85314 140434
16098 140434 248380 461769 -281551 -6551 196786 -14460 -19713 38198 390995 342935 15501
16086 -47533 -5029 -81916 44952 -360879 -96217 -42589 4154 168566 -193998 -53327 -199084
16075 -199084 309204 -132052 -71911 63778 126228 -287050 195226 -430845 281806 156718
16065 156718 -144845 -252405 -43569 -266660 -167439 -99610 -28826 -192730 -265395 53954 174799
16054 174799 -28468 -177452 -165679 -160178 81197 295235 100591 148193 -20500 -250901 114436
16042 133749 -31135 -84724 -243852 -87119 131219 -15265 -148012 133510 -378762 -59340
16031 -54191 61257 -19547 176232 -385344 -61626 25766 -410581 119115 -50570 234082 -336095
$$ packed form
16109A87559a3691k2543B39754o6857f2878k18806h0591B81308b3699H5314N5120
16098A40434J07946K13389b81551f551A96786a4460n253C8198L52797m8060A5501
16086d7533e029p6887D4952c60879i6217d2589D154J64412a93998e3327j45757
16075a99084C09204a32052O0141F3778O2450b87050A95226d30845B81806j25088
16065A56718a44845j07560d3569k23091R9221O7829b8826j63904p2665E3954J20845
16054A74799b8468j48984J1773N501H1197K14038A00591M7602b0500k30401A14436
16042A33749c1135n3589j59128h7119A31219a5265j32747A33510c78762e9340
16031e4191F1257a9547A76232c85344f1626B5766d10581A19115e0570B34082c36095
$$ plain form
16019 117712 -10191 -186938 9942 1571 -132554 -56021 347125 -59850 -137677 257373 -270798
16007 469972 -75531 -42453 -66866 -231279 156128 91064 -199884 96635 -152541 -1937 -130918
15996 -130918 192340 -246990 -34330 -171672 -222244 3607 -3029 -74691 -68736 73663 221131
15985 221131 154549 -86883 130795 417937 165392 175119 517807 114935 168287 -206565
15974 18818 -257751 155009 -160636 15536 285431 -110522 62487 -153499 -51680 -85293
15964 -85293 -115934 -14514 82074 62775 -12352 -313942 23081 131304 -64124 -140127 -23027
15952 104631 227317 -17542 251480 98906 -289753 -21278 -210726 -20026 -138351 -164141
15942 -164141 -237928 92371 -243411 -120202 -30315 -33475 457872 -149303 30771 4545 -206352
$$ packed form
16019A17712a0191j76747I942A571a32554e6021C47125e9850p7827B57373b70798
16007D69972g5531L3078k4413j64413A56128o5064a99884I6635a52541a937j28981
15996a30918A92340b46990c4330j37342n0572C607c029p1662N955G3663J47468
15985B21131o6582h6883A30795K87142A65392R727L42688A14935N3352b06565
15974A8818b57751A55009a60636A5536K69895a10522F2487a53499e1680l3613
15964h5293l0641a4514H2074j9299a2352l01590B3081J08223f4124p6003b3027
15952A04631J22686a7542B51480I8906b89753b1278j89448b0026j18325k5790
15942a64141p3787I2371b43411a20202c0315l160D57872a49303C0771D545b06352
$$ plain form
15930 51645 -117435 -27296 70748 -87293 435549 -94041 -155480 186524 -47673 -958 180278
15918 49411 66652 -212869 198973 47722 139592 -125174 -297190 -57539 22647 -195135 -271459
15907 -271459 308592 -22133 -178397 6644 28678 43508 -23240 151128 60015 203670 -60369
15895 216691 -67715 127687 -115035 -45050 67120 -241371 -205621 -54110 205409 93710 74202
15884 74202 362548 -39612 377861 -38111 -16813 -348736 -115967 -195910 -48243 6937 66077
15873 66077 14661 -219523 53677 170586 368995 -225197 -25716 104548 -114004 -138253
15863 -138253 -311851 -352802 -200011 53338 -4029 -413933 -99913 -171831 -132282 -107371 -47090
15851 -176468 73756 -41850 80844 -256103 124111 134776 -160558 145115 -105414 117812
$$ packed form
15930E1645a17435b7296G0748h7293D35549i4041o1439A86524d7673i58A80278
15918D9411J7241b12869A98973D7722R1870a25174j72016e7539B2647a95135p6324
15907b71459C08592b2133j56264F644K2034J4830b3240A51128F0015J43655f0369
15895B16691f7715A27687a15035d5050F7120b41371L5750e4110B05409I3710j9508
15884G4202K88346c9612C77861c8111a6813l31923a15967p9943d8243F937N9140
15873F6077A4661b19523E3677J16909J98409b25197b5716A04548a14004k4249
15863a38253j73598m0951J52791E3338d029m09904i9913p1918L9549K4911d7090
15851a76468G3756d1850H0844b56103A24111J0665a60558A45115a05414A17812
$$ plain form
15840 94173 246950 26817 -58018 53675 -125078 -120445 -237478 -140077 284948 -306256 55196
15828 -120319 38544 -394118 -173912 -102430 -278909 -159432 10149 -79882 102092 90080
15818 90080 -356760 -127605 -337546 180218 327835 -10269 -336700 -125324 3373 -137957
15807 -88579 -91033 71515 -474974 -192479 -147591 92594 124029 -306297 11013 -150790 -204816
15796 -204816 238583 -24740 -52929 34357 -102276 66261 -142215 -106369 -47896 28873 54407
15785 54407 -145382 60064 -71810 -332482 -251715 -26512 -113581 -392136 -163087 -374843 -84304
15773 88356 27440 -160893 -253263 -410701 -94439 28822 -108636 -154296 -158738 -183422 16471
15761 -92262 105744 -149233 -110660 16968 81753 239998 -25755 -120539 111756 -89478 -97416
$$ packed form
15840I4173J52777B6817e8018E3675a25078M633j17033R7401B84948c06256E5196
15828a20319C8544c94118a73912P1482j76479J19477A0149g9882A02092j2012
15818I0080c56760a27605k09941A80218J47617a0269l26431a25324C373a37957
15807h8579k454G1515d74974a92479M4888I2594L1435c06297A1013a50790n4026
15796b04816B38583b4740k8189C4357a02276F6261a42215L5846d7896B8873K5534
15785E4407a45382F0064g1810k60672Q0767b6512q7069k78555a63087k11756h4304
15773H8356B7440a60893r2370j57438i4439B8822a08636m5660m442k4684A6471
15761i2262A05744a49233L8573A6968O4785J58245b5755r4784A11756h9478p938
$$ plain form
15750 -97416 -172013 354530 -26490 260954 -28851 182779 202168 -115094 -99473 174222 115962
15739 115962 -234627 295202 24995 -75318 96848 9982 213838 309298 190669 285169 -121599
15727 -98372 -113906 -388713 287018 109415 -82303 -79250 252389 -165406 -359405 -229413
15717 -229413 142962 -195532 42344 -89884 -43682 -179857 7720 77532 -423628 -200037 26350
15705 98599 115396 -256731 137452 -311504 -152337 -22992 243125 40645 131275 -223235
15694 -69918 -250356 -33565 71836 223117 78281 -91894 99852 -66281 -174 -85425 -168824 12280
15681 -45422 193268 -179426 -171596 -56292 -13570 -121826 120139 221534 69445 140422 161755
15670 161755 -45774 -201335 -72984 -466672 -65071 -217087 -18572 -294552 -71124 -281070
$$ packed form
15750i7416p4597C54530b6490B60954b8851A82779J9389a15094J5621A74222n8260
15739A15962b34627B95202B4995g5318I6848I982K03856R5460j18629R4500a21599
15727i8372j5534k74807B87018A09415h2303L053B52389a65406j93999J29992
15717b29413A42962a95532D2344h9884d3682j36175G720O9812d23628b00037B6350
15705I8599J6797b56731A37452c11504a52337b2992B43125D0645R0630b23235
15694f9918j80438c3565G1836J51281G8281i1894I9852f6281a74q5251q3399A2280
15681d5422A93268a79426P830e6292a3570j08256A20139J01395F9445P0977K1333
15670A61755d5774j55561g2984l93688f5071j52016a8572k75980g1124k09946
$$ plain form
15660 -281070 269279 -56239 40421 58960 296696 38800 157834 -141593 -80073 317661
15649 -6892 9864 -349945 -106916 96808 204202 87739 -40842 214400 -85948 -162596 18344
15637 -9260 -138555 211187 308718 68381 -50582 -250543 -95135 -128480 186104 9454 -270903
15625 -38615 122678 52756 -106814 10980 34838 55114 33916 -70496 8626 -126115 95856
15613 -120188 -105802 -158367 -49817 366777 33898 162569 -84255 99808 -339068 1545 -145486
15601 -295642 -72699 -73958 -207542 -219146 -383184 -251890 -158054 -241472 35472 -378362 -245890
15590 -245890 -27059 -37568 -171737 105472 -200934 -116630 177058 231866 -26246 -307131
15580 -307131 44974 217412 88034 25930 166454 -44826 259002 73292 -184393 -91402 -186292
$$ packed form
15660b81070B69279e6239D0421J8539K37736C8800J19034a41593O1520C17661
15649f892I864c49945a06916I6808J07394H7739d0842B14400h5948p6648A8344
15637i260j29295B11187R7531F8381e0582j99961i5135l3345A86104I454b70903
15625c8615A22678E2756a06814A0980K3858K0276k1198g0496H626a26115I5856
15613a20188J4386n2565d9817C66777C3898J28671h4255I9808c39068A545a45486
15601b95642g2699j259j33584j1604j64038J31294R3836q3418C5472c78362J32472
15590b45890b7059j0509j34169A05472b00934Q4304A77058N4808b6246k80885
15580c07131D4974J72438H8034B5930J40524d4826B59002G3292a84393i1402r4890
$$ plain form
15569 -186292 -43801 98469 -38516 -58241 -441729 19538 14581 -55036 -106054 89440 54706
15558 54706 -90797 100585 236223 218197 172894 -379853 -59869 -215490 162230 -107775
15547 -169170 -84457 -127718 -115974 94489 -29880 -12559 137292 25178 -72712 28727 109301
15536 109301 54798 -372564 -92332 61821 5082 11761 229117 -82316 149038 -49958 -192988
15525 -192988 35211 66596 107229 87642 -202163 16482 -36687 230111 -74316 14049 -80455
15513 -11686 270517 82006 100727 8580 232017 -261965 -59771 -117164 -147428 -146516 367138
15501 54790 38375 -312738 -321038 45947 152093 318158 -258163 195800 151281 81574 -51973
15489 -114672 106915 -119492 126564 85601 189945 -51273 91922 160879 -154977 -20790
$$ packed form
15569a86292d3801I8469c8516j9725l83488A9538m957e5036n1018H9440l4734
15558E4706i0797A00585J35638j8026m5303c79853e9869j55621A62230a07775
15547a69170h4457m3261J1744I4489b9880a2559A37292B5178g2712B8727Q0574
15536A09301n4503c72564i2332F1821E082O679K17356h2316A49038d9958j43030
15525a92988C5211L1385M0633j9587b02163A6482c6687B30111g4316A4049h0455
15513a1686B70517H2006J8721H580K23437b61965e9771n7393l0264R12C67138
15501E4790j6415c12738q300D5947J06146J66065b58163A95800m4519o9707e1973
15489a14672A06915a19492A26564m0963J04344e1273I1922O8957a54977b0790
$$ plain form
15478 -14055 -227597 -13791 -154714 -415458 -145100 288368 20460 137826 -50897 196574
15467 -310080 -89328 -271798 30437 -37741 -114407 241057 171305 36670 356030 196183 314084
15456 314084 9261 131465 -82920 60521 -300130 -135700 -18992 67675 -88168 -71597 89174
15444 -137899 -377181 177777 38863 -366696 -145534 235458 -437830 2923 -139948 -26182
15433 247862 -334536 36362 120572 247311 -463117 -221721 156713 -129911 -192537 113124
15422 136303 121553 -58918 -76908 -114008 21620 46558 420160 -114490 -400230 327617 -208370
15410 -197343 -80270 -132381 -78000 65875 -41529 -61223 -21035 137764 -221105 12600 67043
15399 67043 -65865 -380105 88811 -186547 -178359 205798 74202 -179428 33504 -201886 -32879
$$ packed form
15478a4055k13542a3791j40923k60744a45100B88368B0460J17366e0897A96574
15467c10080h9328j82470C0437c7741p6666B41057o9752C6670L19360j59847J17901
15456C14084I261J22204h2920F0521c00130a35700a8992F7675h8168J6571H9174
15444a37899k39282A77777C8863c66696a45534B35458d37830B923a39948b6182
15433B47862c34536C6362Q4210J26739d63117b21721A56713a29911o2626A13124
15422A36303j4750e8918j7990l7100B1620K4938L73602a14490k85740C27617b08370
15410a97343h0270n2111N4381F5875d1529j9694b1035A37764b21105A2600N4443
15399F7043f5865l14240H8811a86547Q188B05798G4202a79428C3504b01886c2879
$$ plain form
15387 -3668 515984 -104704 -131581 -42946 -91315 90267 9766 215417 138873 -190281 176095
15375 -185814 34042 139004 -5575 137376 73815 31876 -177967 -292163 -20206 -38239 -17706
15363 -265000 59795 -68195 254972 125261 -117399 64461 287615 -125111 148243 245535
15353 245535 -48200 299409 78066 74085 -72254 -54468 -42593 -131612 -218126 14136 -92416
15341 -177079 -34438 -49488 127142 34855 243037 33667 141005 -132795 -103949 307087
15330 86133 -174432 -41885 318168 -230399 147291 -199627 -133011 -12950 82052 43024 115429
15319 115429 232426 112217 -25090 193325 269975 -119679 187000 154029 -54999 148866
15308 -12432 267582 -195716 55068 106654 -5285 -82047 415453 81749 -186404 109426 842
$$ packed form
15387c668E15984a04704k6877d2946m8369I0267I766K05651p6544a90281A76095
15375a85814C4042J04962e575A37376o3561C1876a77967j14196b0206j8033a7706
15363b65000E9795f8195B54972A25261a17399F4461K23154a25111A48243R7292
15353B45535d8200B99409G8066l981g2254J7786J1875q9019q6514A4136i2416
15341a77079c4438j5050A27142C4855K08182C3667J07338a32795K8846C07087
15330H6133a74432d1885C18168b30399A47291a99627O6616a2950H2052l9028P2405
15319A15429J16997A12217b5090A93325P6650a19679A87000l2971e4999A48866
15308a2432B67582a95716E5068N1586e285p6762D15453H1749a86404A09426H42
$$ plain form
15296 102795 127918 -202465 -219200 107094 -193912 150637 141000 -55589 296019 91063 51873
15285 51873 90705 -334764 258780 22544 -125285 -54160 -111081 -50758 -52684 9155 311967
15274 311967 -255444 41960 -218258 -14520 75451 -108527 -102931 14058 288447 27036 418095
15263 418095 -315484 53848 -258453 33817 187556 34984 89982 404140 84427 30373 44349
15252 44349 419807 641864 16144 572686 1119348 1450621 1314652 1504488 858433 276410
15241 510330 -129694 189952 9017 -326 324239 173130 -304279 -169381 -79516 -41842 -121322
15230 -121322 179118 -62009 -27272 -225134 -217579 61481 -122055 -172576 248970 -266395 -264557
15219 -264557 185981 -102907 -18431 11552 224033 329205 325540 2020 365946 62388 200618
$$ packed form
15296A02795K5123b02465j6735A07094a93912A50637r637e5589B96019I1063l9190
15285E1873L8832c34764B58780B2544a25285e4160n6921e0758j926I155L02812
15274C11967b55444D1960b18258a4520G5451a08527N596A4058K74389B7036L91059
15263D18095c15484E3848b58453C3817J53739C4984N4998L14158H4427C0373J3976
15252D4349L75458K22057A6144N56542N46662L31273j35969J89836o46055B76410
15241E10330a29694A89952I017c26C24239j51109c04279J34898g9516L7674p9480
15230a21322A79118f2009b7272j97862P555F1481a22055n0521B48970b66395J838
15219b64557A85981a02907a8431A1552K12481J05172l665B020L63926F2388J38230
$$ plain form
15208 200618 137923 6791 -249815 64037 254250 83040 42090 217743 84861 -94345 87831
15196 41558 96152 204258 179232 64069 131781 18927 126845 297270 56423 -386676 -93121
15184 150365 -151666 -122444 188449 -20730 -158733 207748 315408 360245 -90303 -26051
15173 -296656 109793 -93439 -46848 102471 -3607 86387 -269065 -142976 -136133 444964 288580
15162 288580 -336221 144837 27717 115694 18967 85181 -94903 149012 -47075 194325 46324
15150 63166 78473 -137835 6633 -51072 12356 22337 -146408 312283 453301 -338833 241687
15138 98712 95167 -161771 -93086 42999 532473 70176 -12014 203252 196211 159819 83984
15127 83984 268814 -3368 203147 349189 -131158 147638 152509 68828 -64517 304484 359517
$$ packed form
15208B00618o2695F791b49815F4037J90213H3040m0950J75653H4861i4345H7831
15196D1558N4594J08106k5026F4069O7712A8927J07918J70425E6423c86676i3121
15184A50365a51666K9222A88449b0730j38003B07748J07660M4837i0303b6051
15173b96656A09793i3439M6591A02471c607H6387b69065J26089O843D44964j56384
15162B88580c36221A44837B7717Q7977A8967O6214i4903A49012d7075A94325D6324
15150F3166J5307a37835F633e1072A2356R981a46408C12283J41018c38833B41687
15138I8712l545a61771O8685D2999M89474G0176a2014B03252p041l6392p5835
15127H3984J84830c368B03147J46042a31158A47638M871F8828f4517C04484N5033
$$ plain form
15116 359517 -170817 43162 106369 142476 23607 175044 339338 -54427 138231 342563
15106 342563 445972 -143721 123690 -48937 50457 -172152 324801 43374 120568 69043
15096 69043 -153749 73233 147145 71342 174424 -200451 1424 -96478 25828 -78464 -284644
15085 -284644 571483 248734 174993 230382 173651 79263 -20178 49532 88786 243232 161094
15074 161094 -105314 227730 16710 339861 -152178 281711 75932 419771 154619 331213
15064 331213 582389 173005 322699 276822 437307 371469 231154 411955 -70052 157260
15053 220961 -57965 29853 676254 447701 -32743 391708 114291 115518 156794 194114 321908
15042 321908 271503 257413 503012 278452 47346 392796 -17959 234876 375531 231971
$$ packed form
15116C59517a70817D3162O3207L6107B3607J51437J64294e4427A38231K04332
15106C42563J03409a43721A23690d8937E0457a72152C24801D3374P7194n1525
15096F9043a53749G3233P3912G1342J03082b00451A424i6478B5828g8464k06180
15085b84644E71483B48734p3741N5389n6731G9263b0178D9532L9254J54446q2138
15074A61094a05314B27730A6710L23151a52178B81711G5932L43839A54619J76594
15064C31213K51176A73005J49694m5877J60485o5838j40315J80801g0052A57260
15053B20961e7965B9853O46401k28553c2743C91708A14291J227M1276L7320J27794
15042C21908n0405j4090K45599k24560D7346L45450a7959B34876J40655j43560
$$ plain form
15032 231971 357059 136206 -18229 -71683 -36971 -12819 533585 8104 105669 140293 182262
15021 182262 18328 426669 277470 226630 172826 -60277 203322 162593 347395 -112974
15010 326564 164535 398044 -279736 187418 185952 452794 208728 488132 222047 188550
15000 188550 73713 402475 386599 124154 50362 13307 -43279 176639 160392 286795 286410
14989 286410 -1298 353330 57365 342940 -79147 355557 138367 -8618 398893 192685 263537
14978 263537 443607 241234 229993 333097 297938 245427 133691 319926 397217 113122
14967 362007 101088 247641 326860 397220 120896 332317 177679 112359 810204 215088
14956 356373 -39989 169636 360652 326329 290670 275550 359363 77956 299211 99180 406194
$$ packed form
15032B31971J25088A36206a8229n3454L4712a2819E33585H104R7565L4624M1969
15021A82262A8328M08341j49199n0840n3804f0277B03322m0729J84802a12974
15010C26564j62029K33509b79736A87418j466K66842B08728K79404B22047l3497
15000A88550G3713L28762j5876A24154E0362A3307d3279A76639j6247J26403l85
14989B86410a298C53330E7365K85575g9147C55557A38367h618C98893A92685P0852
14978B63537J80070k02373j1241J03104l5159n2511j11736J86235P7291A13122
14967C62007A01088J46553P9219P0360A20896K11421j54638o5320O97845B15088
14956C56373c9989A69636J91016l4323l5659j5120Q3813G7956K21255I9180L07014
$$ plain form
14945 406194 263124 270576 424831 479509 350018 464343 514006 539736 466440 183654 291359
14934 291359 224274 305614 288323 323412 224796 184455 278625 183182 68131 382222 120964
14922 386857 179871 353494 611045 216847 210521 489643 379145 565009 378554 761571
14912 761571 109705 311251 -10093 452888 585010 287683 370243 332387 232166 163958
14902 163958 229818 731967 354872 655613 147172 17572 520760 480216 240632 210107
14892 210107 347789 144191 346116 310897 555830 321844 272823 407004 337485 582704
14882 582704 292925 401413 324456 297713 574771 399204 447579 433725 119659 238703
14872 238703 296384 423522 316541 533270 136785 471428 521392 312094 371961 396763
$$ packed form
14945D06194j43070P452J54255N4678j29491J14325M9663K5730p3296A83654J07705
14934B91359o7085Q1340j7291L5089r8616m0341R4170r5443F8131L14091A20964
14922C86857A79871J73623K57551B16847o326K79122j10498J85864j86455L83017
14912G61571A09705K01546a0093D52888J32122B87683Q2560l7856j00221o8208
14902A63958O5860N02149C54872L00741A47172A7572N03188m0544k39584l0525
14892B10107J37682A44191K01925l5219K44933k33986m9021J34181o9519K45219
14882E82704k89779J08488p6957k6743K77058j75567M8375j3854A19659J19044
14872B38703N7681J27138j06981K16729A36785L34643M9964k09298N9867K4802
$$ plain form
14862 396763 338477 488737 362398 311467 275416 131447 308210 346072 572102 373190
14852 373190 281021 414413 144115 687211 229087 564791 471774 578609 684713 746833
14842 746833 468866 430686 577797 568871 599310 326636 204218 502375 679156 657304
14832 657304 386316 300574 493543 616273 325909 562890 748297 442309 543544 794687
14822 794687 407368 278182 635296 139807 589773 484245 321402 687995 506554 712423
14812 712423 473384 404855 379473 719546 443606 579768 605478 601603 239250 581447
14802 581447 280114 603793 360490 912130 364476 560464 356428 140818 317232 469471
14792 469471 634747 609666 683643 549482 718514 758043 473517 794971 618931 647667
$$ packed form
14862C96763n8286J50260j26339n0931l6051A31447J76763L7862K26030j98912
14852C73190r2169J33392A44115N43096B29087L35704r3017J06835J06104O2120
14842G46833k77967l8180J47111q926L0439k72674j22418K98157J76781k1852
14832F57304k70988q5742J92969J22730k90364K36981J85407l05988J01235K51143
14822G94687l87319j29186L57114A39807M49966j05528j62843L66593j81441K05869
14812G12423k39039o8529k5382L40073k75940J36162K5710l875B39250L42197
14802E81447B80114L23679k43303N51640C64476J95988k04036A40818J76414J52239
14792D69471J65276k5081P3977j34161J69032L9529k84526L21454j76040K8736
$$ plain form
14782 647667 789789 835956 817041 641972 614209 941201 273239 644342 562899 607057
14772 607057 479537 635976 947762 900892 857393 511772 288806 672391 450347 627282
14762 627282 386098 551678 150506 587343 576060 948133 958812 870775 542813 654000
14752 654000 712585 821793 372529 725694 702147 695373 1147725 535080 762637 830132
14742 830132 440776 684928 616657 984446 1126044 723378 592521 793725 628965 522422
14732 522422 768676 640141 1081590 887128 904920 797624 944358 1071868 848594 940865
14722 940865 614945 630193 894652 920237 1166008 730795 922180 989098 737471 1045256
14712 1045256 719221 741616 809472 1104455 864832 649280 674663 887515 878310 1077318
$$ packed form
14782F47667J42122M6167j8915j75069k7763L26992B73239L71103q1443M4158
14772F07057j27520J56439L11786m6870m3499l45621k22966L83585k22044J76935
14762F27282k41184J65580A50506M36837j1283L72073J0679q8037l27962J11187
14752F54000N8585J09208C72529L53165k3547o774M52352E35080K27557O7495
14742H30132l89356K44152o8271L67789J41598m02666j30857K01204j64760j06543
14732E22422K46254j28535M41449j94462J7792j07296J46734J27510k23274R2271
14722I40865l25920J5248K64459K5585K45771m35213J91385O6918k51627L07785
14712A045256l26035K2395O7856K94983k39623k15552K5383K12852r205J99008
$$ plain form
14702 1077318 852882 1132779 745162 889763 564059 1156864 921412 1009190 814367 880427
14692 880427 650488 597389 946097 984508 1062796 1066256 881408 811131 960543 882118 947415
14681 947415 1214238 976645 1359289 816103 1109094 1137409 926017 965635 1206902 961783
14671 961783 1030086 982049 1120268 910883 1165847 729916 1082079 1143784 1353047 1435139
14661 1435139 1260713 1181491 989022 989281 1064286 848607 1176485 1094298 1373230 1498922
14651 1498922 1374606 1168154 1422242 1302711 1211132 1393694 1248611 1391430 1110183 1382028
14641 1382028 1436760 1158059 1160278 1414738 1414132 1280915 936297 1420851 1577562 1435947
14631 1435947 1482333 1555908 1455920 1639884 1391918 1098738 1306606 1221419 1277226 1437898
$$ packed form
14702A077318k24436K79897l87617J44601l25704N92805k35452Q7778j94823O6060
14692H80427k29939n3099L48708L8411P8288L460j84848p0277J49412p8425O5297
14681I47415K66823k37593L82644n43186K92991K8315k11392L9618K41267k45119
14671I61783O8303m8037J38219k09385K54964m35931L52163O1705K09263Q2092
14661A435139j74426p9222j92469K59P5005k15679L27878q2187K78932J25692
14651A498922j24316k06452K54088j19531r1579J82562j45083J42819k81247K71845
14641A382028N4732k78701K219K54460o06j33217l44618M84554J56711j41615
14631A435947M6386P3575r9988J83964k47966k93180K07868q5187N5807J60672
$$ plain form
14621 1437898 1345449 1495330 1564129 1451916 1720008 1430756 1322861 1503099 1695141 1662065
14611 1662065 1412591 1563779 1847924 1642523 1510873 1674022 1694628 1562720 1974543 1698157
14601 1698157 1765869 1737171 1912842 1774446 2195692 1646640 2015980 1860891 1973821 1822070
14591 1822070 1755800 1881285 1825522 2114033 1717191 1682546 1566479 2117019 2119227 2272038
14581 2272038 1907297 1877520 2019651 1872092 2237825 2208430 2272603 2068713 2517985 2203006
14571 2203006 1971507 2361124 2565526 2310191 2254278 2431227 2632253 2728226 2666358 2579958
14561 2579958 2650694 2797673 3020737 3013336 3376593 3414849 3514309 3324835 4386315 4568015
14551 4568015 5328522 6154684 8188465 12019790 20461764 35856445 47247648 29231805
$$ packed form
14621A437898r2449J49881O8799j12213K68092k89252j07895J80238J92042l3076
14611A662065k49474J51188K84145k05401j31650J63149K0606j31908M11823k76386
14601A698157O7712k8698J75671j38396M21246n49052L69340j55089J12930j51751
14591A822070o6270J25485n5763K88511l96842l4645j16067N50540K208J52811
14581B272038l64741k9777J42131j47559L65733k9395O4173k03890M49272l14979
14571B203006k31499L89617K04402k55335n5913J76949K01026R5973o1868q6400
14561B579958P0736J46979K23064p401L63257L8256R9460j89474J061480J81700
14551D568015P60507Q26162K033781L831325Q441974J5394681J1391203j8015843
$$ plain form
14543 29231805 12174475 5404436 3448349 2705355 2623131 2218012 2242421 2132335 2279447
14534 2279447 2202144 2303100 2178674 2132177 2369620 2134846 2316918 2461357 2263704 2617458
14524 2617458 2889387 2425716 2502837 2909955 2465472 2606441 2613291 2733438 2727330 2619978
14514 2619978 3078287 2956579 3010157 2719840 3012096 3280854 3122178 2857999 2907995 2973635
14504 2973635 3276810 3348816 3087525 3157589 3094169 3486789 3418424 3423903 3470210 3213464 3643695
14493 3643695 3498909 3315024 3728827 3624800 3572563 3781527 3974921 3963274 4104883 4275561
14483 4275561 3978206 4018768 4395327 4287944 4234614 3865076 4213865 4302706 4472126 4271089
14473 4271089 4444614 4351325 4823780 4546261 4463691 4251713 4804816 4467980 4996044 4926385
$$ packed form
14543B9231805A2174475E404436j956087p42994q2224m05119K4409j10086J47112
14534B279447p7303J00956j24426m6497K37443k34774J82072J44439j97653L53754
14524B617458K71929m63671P7121M07118m44483J40969O850J20147o108j07352
14514B619978M58309j21708N3578k90317K92256K68758j58676k64179M9996O5640
14504B973635L03175P2006k61291P0064o3420L92620o8365N479M6307k56746M30231
14493C643695j44786j83885M13803j04027n2237K08964J93394j1647J41609J70678
14483D275561k97355M0562L76559j07383n3330l69538L48789Q8841J69420k01037
14473D271089J73525r3289M72455k77519q2570k11978N53103l36836N28064o9659
$$ plain form
14463 4926385 5092206 4862625 4858174 5528581 5097099 5366255 5520388 5211985 5534892 5680004
14453 5680004 5718532 5787062 5720651 5879874 5730747 6154730 6139118 5682526 6130772 6236651
14443 6236651 6369328 6451160 6178716 6544079 6536604 6797978 6987251 6844731 6964677 7159901
14433 7159901 7329726 7438499 7308192 7267757 7801506 7611014 7807860 7938677 7993786 8151842
14423 8151842 8020337 8230158 8423997 8820592 8690931 8611238 8936402 9099981 9154692 9335924
14413 9335924 9486270 9256819 9449389 9648629 9879984 10161336 10338228 10322687 10633405 10672553
14403 10672553 11095771 11646314 11307146 11419083 12018430 12172094 12287498 11991732 12543773
14394 12543773 12581459 12561086 12892743 13377381 13471363 13921130 13793874 14379421 14460514 14678285
$$ packed form
14463D926385J65821k29581m451O70407m31482K69156J54133l08403L22907J45112
14453E680004L8528O8530o6411J59223j49127M23983j5612m56592M48246J05879
14443F236651J32677Q1832k72444L65363p475K61374J89273j42520J19946J95224
14433G159901J69825J08773j30307m0435N33749j90492J96846J30817N5109J58056
14423H151842j31505K09821J93839L96595j29661p9693L25164J63579N4711J81232
14413I335924J50346k29451J92570J99240K31355K81352J76892j5541L10718L9148
14403A0672553M23218N50543l39168J11937N99347J53664J15404k95766N52041
14394A2543773L7686k0373L31657M84638R3982M49767j27256N85547Q1093K17771
$$ plain form
14384 14678285 15199809 15440629 15498032 15934908 15911830 16604473 17042946 16991271 17525587 17765857
14374 17765857 18080438 18128425 18853756 19010994 19619938 19939939 20457085 20744276 21153960
14365 21153960 21613768 22239481 22820791 23190727 23544965 24661357 24569777 25098641 25861622
14356 25861622 26393453 26866300 27688521 28304062 29013182 29952413 30163005 31219141 31919506
14347 31919506 32823465 33788933 34500171 34990432 36428264 37381151 38049951 39469114 40270174
14338 40270174 41753982 42303293 43812092 45721646 46496097 47899080 49229803 51018083
14330 51018083 52618227 54235636 55917329 57701063 59528979 61674667 63490905 65737914
14322 65737914 68353827 70767549 72979755 75798235 78370899 81606338 84475765 87875662
$$ packed form
14384A4678285N21524K40820N7403M36876k3078O92643M38473n1675N34316K40270
14374A7765857L14581M7987P25331J57238O08944L20001N17146K87191M09684
14365B1153960M59808O25713N81310L69936L54238J116392r1580N28864P62981
14356B5861622N31831M72847Q22221O15541P09120R39231K10592J056136P00365
14347C1919506R03959R65468P11238M90261J437832R52887O68800J419163Q01060
14338D0270174J483808N49311J508799J909554P74451J402983J330723J788280
14330E1018083J600144J617409J681693J783734J827916K145688J816238K247009
14322F5737914K615913K413722K212206K818480K572664L235439K869427L399897
$$ plain form
14314 87875662 91359545 94941089 98805696 102877083 107087027 111521346 116580957 121013882
14306 121013882 126631331 132296420 137983522 144525057 151220838 157935747 165647608 173005491
14298 173005491 181361400 190218169 199863113 209829895 219842200 230883061 242246371
14291 242246371 254089710 267079453 279975483 293464303 307537656 322539856 337347482
14284 337347482 352622781 367880384 383188897 398195134 413080099 427327229 440816486
14277 440816486 453364215 464066428 473293745 479909105 482395200 481841250 479743142 476633172
14269 476633172 475795044 471937314 465918279 457897106 447162338 434637983 420385231 405938753
14261 405938753 390319548 374530093 358459129 342500792 326616037 310698907 296177775
$$ packed form
14314H7875662L483883L581544L864607M071387M209944M434319N059611M432925
14306A21013882N617449N665089N687102O541535O695781O714909P711861P357883
14298A73005491Q355909Q856769R644944R966782J0012305J1040861J1363310
14291B42246371J1843339J2989743J2896030J3488820J4073353J5002200J4807626
14284C37347482J5275299J5257603J5308513J5006237J4884965J4247130J3489257
14277D40816486J2547729J0702213R227317O615360K486095n53950k098108l109970
14269D76633172q38128l857730o019035q021173j0734768j2524355j4252752j4446478
14261D05938753j5619205j5789455j6070964j5958337j5884755j5917130j4521132
$$ plain form
14254 296177775 282394832 268510365 255253972 242756230 230740198 219399330 208169035
14247 208169035 198202326 188946925 180303515 171766154 164027742 155999881 149027169 142174035
14239 142174035 136263172 130245587 124820936 119793431 114419151 109672411 105287772 100965252
14231 100965252 97479399 93844410 89919940 86263776 83326858 79897362 77173979 74473732
14223 74473732 71611842 68959040 67033501 64838730 62398147 60590160 58399769 56683302
14215 56683302 55251619 53436752 52118763 50221757 48502069 47311273 45929189 44790775
14207 44790775 43867565 42515835 41111301 39934669 38541959 37829467 37178372 36226107 35725873
14198 35725873 34202614 33400323 32294398 31420763 30930852 30168365 29209251 28601737 27885860
$$ packed form
14254B96177775j3782943j3884467j3256393j2497742j2016032j1340868j1230295
14247B08169035r966709r255401q643410q537361p738412q027861o972712o853134
14239A42174035n910863o017585n424651n027505n374280m746740m384639m322520
14231A00965252l485853l634989l924470l656164k936918l429496k723383k700247
14223G4473732k861890k652802j925539k194771k440583j807987k190391j716467
14215E6683302j431683j814867j317989j897006j719688j190796j382084j138414
14207D4790775r23210j351730j404534j176632j392710p12492o51095r52265n00234
14198C5725873j523259q02291j105925q73635m89911p62487r59114o07514p15877
$$ plain form
14189 27885860 27329971 26529796 25963297 25256639 24989759 24724593 23505697 23309641 22815452
14180 22815452 22224908 21783873 21270803 21227342 20619535 20249770 19863079 19378673 19109013
14171 19109013 18776338 18532780 17755916 17416753 17522733 16984304 16794496 16266864 16139466
14162 16139466 15962292 15715217 15314864 14747884 14481089 14390017 13963712 14292046 13807073
14153 13807073 13591308 13120201 13375877 13034786 12694379 12540931 12292857 12040494 11769676
14144 11769676 11617363 11837723 11407454 10935229 11098968 11026404 10664983 10544831 10807355
14135 10807355 10415809 9953192 9768373 9650497 9671299 9745549 9329538 9384333 9005966 9287247
14125 9287247 8871400 9220743 8741883 8966841 8579065 8730502 8018875 8105108 7849960 8068711
$$ packed form
14189B7885860n55889q00175n66499p06658k66880k65166j218896j96056m94189
14180B2815452n90544m41035n13070m3461o07807l69765l86691m84406k69660
14171A9109013l32675k43558p76864l39163J05980n38429j89808n27632j27398
14162A6139466j77174k47075m00353n66980k66795r1072m26305L28334m84973
14153A3807073k15765m71107K55676l41091l40407j53448k48074k52363k70818
14144A1769676j52313K20360m30269m72225J63739p2564l61421j20152K62524
14135A0807355l91546m62617j84819j17876K0802P4250m16011N4795l78367K81281
14125I287247m15847L49343m78860K24958l87776J51437p11627Q6233k55148K18751
$$ plain form
14115 8068711 7893641 7559966 7589025 7595802 7402461 7164525 7166445 7507562 7309677 6878338
14105 6878338 7015915 6621049 6592778 6599514 6449953 6513619 6491376 6467021 6636199 6429353
14095 6429353 6198874 5838747 5804041 5815776 5626013 6103404 5503072 5794663 5643303 5700725
14085 5700725 5511981 5488843 5382260 5264276 5063634 5206893 5097838 4927342 5156271 5179705
14075 5179705 5126902 5147654 5198591 4890228 4480735 4862308 4240717 4750644 4577985 4559149
14065 4559149 4692997 4488758 4638017 4462216 4428264 4323845 4432036 4373643 4909873 4284591
14055 4284591 4004281 4315177 4169405 4106771 3957111 4046042 4204713 3801489 3591574 3895755
14045 3895755 3611795 4020289 3821292 3669196 3585777 3706358 3572592 3598426 3241305 3607314
$$ packed form
14115H068711j75070l33675K9059O777j93341k37936J920L41117j97885m31339
14105F878338J37577l94866k8271O736j49561O3666k2243k4355J69178k06846
14095F429353k30479l60127l4706J1735j89763M77391o00332K91591j51360N7422
14085E700725j88744k3138j06583j17984k00642J43259j09055j70496K28929K3434
14075E179705n2803K0752N0937l08363m09493L81573o21591N09927j72659j8836
14065D559149J33848k04239J49259j75801l3952j04419J08191n8393N36230o25282
14055D284591k80310L10896j45772o2634j49660Q8931J58671m03224k09915L04181
14045C895755k83960M08494j98997j52096q3419J20581j33766K5834l57121L66009
$$ plain form
14035 3607314 3327875 3482825 3541511 3311374 3626797 3469736 3441415 3331511 3188958 3281871
14025 3281871 3047991 3053783 2835932 2985251 3137308 3157965 3040514 2746456 2919735 2590615
14015 2590615 2683554 2412522 2740393 2392919 2898018 2618777 2641524 2599833 2603627 2703963
14005 2703963 2618805 2553369 2619129 2384363 2560336 2681134 2083894 2558310 2340217 2345274
13995 2345274 2583411 2528598 2495259 2492155 2613360 2938121 4185433 6833844 13710613 28956830
13985 28956830 44842537 32938741 16373571 9132677 6599695 5371245 4426755 4093391
13977 4093391 3635553 3390541 3460609 3372427 2987039 2924077 2627447 2863933 2660340 2699151
13967 2699151 2497815 2493627 2561127 2474745 2118116 2483116 2492910 2448507 2391125 1975876 2003111
$$ packed form
14035C607314k79439J54950N8686k30137L15423j57061k8321j09904j42553R2913
14025C281871k33880N792k17851J49319J52057K0657j17451k94058J73279l29120
14015B590615R2939k71032L27871l47474N05099k79241K2747m1691L794J00336
14005B703963q5158o5436O5760k34766J75973J20798n97240M74416k18093N057
13995B345274K38137n4813l3339l104J21205L24761J247312K648411O876769J5246217
13985B8956830J5885707j1903796A6373571p240894k532982j228450r44490l33364
13977D093391m57838k45012P0068q8182l85388o2962k96630K36486k03593L8811
13967B699151k01336m188O7500q6382l56629L65000R794m4403n7382m15249K7235
$$ plain form
13956 2003111 2348474 2213097 1893447 1935704 2424455 1957290 1804221 2078343 2042650 1905849
13946 1905849 2039560 2099311 2010269 2289498 1776005 2116632 2098901 1934124 1956024 1805104
13936 1805104 1798083 1728442 2024824 1726527 1751896 1688211 1657352 1566965 1643238 1486000 1876544
13925 1876544 1719684 1796291 1483457 1487283 1626812 1535234 1618228 1703810 1689336 1682771 1529190
13914 1529190 1680389 1703934 1620963 1529053 1741419 1753748 1707418 1328392 1370895 1388404 1572534
13903 1572534 1382607 1182937 1562195 1517507 1302756 1441858 1215956 1203292 1596422 1228817
13893 1228817 1267417 1258479 1322192 1546874 1304598 1232760 1353182 1180542 1399336 1295191
13883 1295191 1454830 1149105 1127335 1380992 1428095 1293841 1239905 1141234 1214281 1335709
$$ packed form
13956B003111L45363j35377l19650M2257M88751m67165j53069K74122l5693j36801
13946A905849J33711N9751q9042K79229n13493L40627j7731j64777K1900j50920
13936A805104p021o9641K96382k98297K5369o3685l0859r0387P6273j57238L90544
13925A876544j56860P6607l12834L826J39529r1578Q2994Q5582j4474o565j53581
13914A529190J51199K3545q2971r1910K12366J2329m6330l79026M2503J7509J84130
13903A572534j89927j99670L79258m4688k14751J39102k25902j2664L93130l67605
13893A228817L8600q938O3713K24682k42276p1838J20422j72640K18794j04145
13883A295191J59639l05725k1770K53657M7103j34254n3936r8671P3047J21428
$$ plain form
13873 1335709 1263258 1186657 1303661 1145708 1373101 1444783 707352 1394284 1258069 1174304
13863 1174304 1469588 1329498 1456819 989141 1134418 1181228 1029456 1204129 867376 1176469
13853 1176469 1365050 1217957 1086442 1006290 1035998 1129258 1388151 1041339 990004 1214648
13843 1214648 1240970 820429 949445 1065454 1112253 951886 978910 1126557 1384640 1015111
13833 1015111 1137846 998217 920491 1090294 965649 915036 1179327 959922 1241155 1248371
13823 1248371 1122506 989689 999233 596828 1167977 846691 1054298 865711 1022354 1191840
13813 1191840 577056 1239355 981405 913994 817218 1362229 1051355 906586 1127400 855379
13803 855379 904545 875351 980071 949292 759191 801895 914614 545036 962175 983294
$$ packed form
13873A335709p2451p6601J17004j57953K27393P1682G07352O86932j36215q3765
13863A174304K95284j40090J27321m67678J45277M6810j51772J74673l36753L09093
13853A176469J88581j47093j31515q0152K9708R3260K58893l46812n1335K24644
13843A214648K6322m20541J29016J16009M6799j60367K7024J47647K58083l69529
13833A015111J22735j39629p7726J69803j24645n0613K64291k19405K81233P216
13823A248371j25865j32817R544m02405N71149l21286K07607j88587J56643J69486
13813A191840E77056O62299k57950o7411r6776N45011l10874j44769K20814k72021
13803H55379M9166k9194J04720l0779j90101M2704J12719l69578M17139K1119
$$ plain form
13793 983294 754972 961662 820388 949768 941770 830295 1081544 1083269 1072535 741752
13783 741752 697168 924818 712971 763781 716812 1104548 778275 637124 1065418 836797
13773 836797 640967 631852 660980 643545 537484 701263 957979 752702 417890 881565
13763 881565 256142 818186 854707 851063 745018 912441 793312 652035 671142 973189
13753 973189 865631 639278 595875 604409 577877 440105 816790 841329 683576 758114 496145
13742 496145 531169 634826 405177 607303 693077 517525 896520 798886 694501 999546
13732 999546 640486 802459 519938 1020211 714545 641446 514347 656911 592750 614564
13722 614564 468419 650183 649148 401866 627068 361275 541286 405610 616579 543880
$$ packed form
13793I83294k28322K06690j41274J29380p998j11475K51249J725j0734l30783
13783G41752m4584K27650k11847N0810m6969L87736l26273j41151M28294k28621
13773H36797j95830r115K9128j7435j06061J63779K56716k05277l34812M63675
13763H81565B56142N62044L6521l644j06045J67423j19129j41277J9107L02047
13753I73189j07558k26353m3403Q534k6532j37772L76685K4539j57753P4538k61969
13742D96145L5024J03657k29649K02126Q5774j75552L78995r7634j04385L05045
13732I99546l59060J61973k82521N00273l05666p3099j27099J42564o4161K1814
13722F14564j46145J81764j035k47282K25202k65793J80011j35676K10969p2699
$$ plain form
13712 543880 520244 771713 599442 669934 1040732 655978 807538 841522 724559 525664
13702 525664 330810 679496 839839 631647 530443 956296 1029792 623218 367913 517386
13692 517386 596206 641624 562899 499358 570434 336020 760824 370927 217659 507266
13682 507266 628489 570241 657896 915087 334431 648250 703284 460905 691818 629200
13672 629200 614310 388771 356697 547794 389417 594149 375452 446134 508387 512204 782219
13661 782219 561915 776200 374461 362906 550904 139827 452414 185451 355877 612190
13651 612190 580459 601050 438673 399267 492594 794087 563419 300072 660433 467460
13641 467460 114739 369806 408976 643828 419489 647929 601081 231797 581563 678506
$$ packed form
13712E43880k3636K51469j72271P0492L70798l84754J51560L3984j16963j98895
13702E25664j94854L48686J60343k08192j01204M25853P3496m06574k55305J49473
13692E17386P8820M5418p8725o3541P1076k34414M24804C70927j53268K89607
13682E07266J21223n8248Q7655K57191C34431L13819N5034k42379K30913o2618
13672F29200j4890k25539l2074J91097j58377K04732k18697P0682O2253L817K70015
13661G82219k20304K14285C74461j1555J87998A39827L12587A85451J70426K56313
13651F12190l1731K0591j62377l9406R3327L01493k30668k63347L60361j92973
13641D67460A14739K55067L9170K34852k24339K28440m6848B31797L49766R6943
$$ plain form
13631 678506 211128 340003 263142 189290 491693 530533 713516 661015 754704 419453
13621 419453 547510 314544 139933 771209 450084 558214 684668 160592 403459 525137
13611 525137 722272 366153 346086 347788 576055 315575 385377 422412 248565 545147
13601 545147 353266 459401 274752 210150 542637 468574 201756 539481 122363 107044
13591 107044 528727 292879 478122 555580 367734 550617 373483 294650 111171 466825
13581 466825 341382 584471 116634 427181 5826 219274 95724 459255 268674 646510
13571 646510 46959 461287 268888 407167 472822 304802 375670 283702 -92462 408993
13560 454463 490508 258897 57470 559794 646930 417621 346702 358935 162347 378104
$$ packed form
13631F78506B11128J28875p6861p3852L02403L8840J82983n2501R3689l35251
13621D19453J28057k32966A39933O31276l21125J08130J26454A60592K42867J21678
13611E25137J97135l56119k0067J702K28267k60480O9802L7035j73847K96582
13601E45147j91881J06135j84649o4602L32487p4063B01756L37725A22363j5319
13591A07044M21683k35848J85243P7458j87846J82883j77134p8833A11171L55654
13581D66825j25443K43089A16634L10547E826K13448I5724L63531j90581L77836
13571F46510D6959M14328j92399J38279O5655j68020P0868r1968i2462D08993
13560D54463L6045k31611E7470N02324Q7136k29309p0919J2233A62347K15757
$$ plain form
13550 378104 331816 278206 592341 512347 516511 330748 328719 471354 672440 329242 575152
13539 575152 282205 580148 762304 97134 472025 403688 602477 425339 236385 104124
13528 -17305 250963 233069 -21813 334290 303658 -6602 219404 136138 308111 398136 134397
13516 613917 355681 208120 357346 283598 499042 762827 341145 428134 80431 256946
13506 256946 462965 534929 356737 167843 -86028 351253 283804 709291 109840 468786
13496 468786 109926 522382 398062 279955 479477 332765 285546 493127 187983 389966
13486 389966 302855 265191 200011 454956 -239086 -116628 109744 165646 227262 479200
13476 479200 192060 396882 259812 187250 223785 260449 295043 316359 459785 313862
$$ packed form
13550C78104m6288n3610L14135p9994M164j85763k029J42635K01086C29242K45910
13539E75152B82205K97943J82156I7134L74891o8337J98789j77138j88954A04124
13528a7305B50963j7894b1813C34290l0632f602B19404q3266J71973R0025A34397
13516F13917k58236j47561J49226p3748K15444K63785C41145Q6989H0431J76515
13506B56946K06019P1964j78192A67843h6028C51253o7449M25487A09840L58946
13496D68786A09926M12456j24320j18107J99522j46712m7219K07581A87983K01983
13486C89966q7111l7664o5180K54945b39086a16628A09744N5902O1616K51938
13476D79200A92060K04822j37070p2562L6535L6664L4594K1316J43426j45923
$$ plain form
13466 313862 68788 618111 384446 -20686 368230 -252600 303680 177243 247529 387042
13456 387042 267519 -44943 118510 374687 352998 403190 59222 41116 123454 223219 104856
13444 444713 402473 420446 152749 39421 193950 193654 320316 151881 589891 237908 480811
13433 480811 415910 5712 410825 190086 226088 -93150 377522 6744 320710 193841 427502
13422 427502 152762 186680 319147 347740 295068 390199 36650 540191 107168 835827
13412 835827 443293 187319 -251061 152809 218563 125259 245327 164395 355093 545059
13402 545059 -147398 226849 211769 153217 150821 246219 292542 -26589 88087 44884 491672
13391 491672 116807 249704 535757 -174051 -190095 177578 -107837 120299 313445 334899
$$ packed form
13466C13862F8788N49323k33665b0686C68230b52600C03680j26437P0286J39513
13456C87042j19523d4943A18510K56177k1689N0192E9222j8106Q2338R9765A04856
13444D44713m2240J7973A52749C9421J54529k96J26662A51881M38010B37908K42903
13433D80811o4901E712M05113A90086L6002i3150C77522F744L13966j26869K33661
13422D27502A52762L3918J32467K8593n2672R5131C6650N03541A07168P28659
13412H35827l92534A87319b51061A52809O5754r3304J20068q0932J90698J89966
13402E45059a47398B26849j5080n8552k396R5398M6323b6589H8087m3203M46788
13391D91672A16807J32897K86053a74051j6044A77578a07837A20299J93146K1454
$$ plain form
13381 334899 265034 367777 55149 340435 159500 328412 321859 239993 245138 316635 92345
13369 61078 278505 392699 353752 316105 389603 107520 271376 93424 5635 126234 375204
13358 375204 336943 355381 479791 -99237 -52017 -68209 123592 324355 240313 297050 356202
13347 356202 141422 454640 312394 -73803 -37097 340806 260707 283589 -2782 422609 223470
13336 223470 112654 74277 339824 -143491 478803 220492 238680 261595 561517 125748
13325 409795 292393 100531 187184 94111 386875 124649 451125 561285 403989 49858
13314 -129391 173890 401204 321333 58634 548527 439781 302654 -23689 227566 233986
13304 233986 75806 226824 -113876 11322 -76487 151417 189103 -70109 131570 122818 198822
$$ packed form
13381C34899o9865J02743E5149K85286A59500J68912o553q1866N145P1497I2345
13369F1078K17427J14194l8947l7647P3498A07520J63856I3424E635J20599K48970
13358C75204l8261J8438J24410i9237M7220j6192A23592K00763q4042N6737N9152
13347C56202A41422L13218j42246g3803L6706C40806q0099K2882b782D22609j99139
13336B23470j10816l8377K65547a43491D78803B20492J8188K2915K99922A25748
13325D09795j17402A00531Q6653r3073K92764A24649L26476J10160j57296D9858
13314a29391A73890K27314p9871E8634M89893j08746j37127b3689B27566O420
13304B33986G5806J51018a13876A1322g6487A51417L7686g0109A31570q752P6004
$$ plain form
13293 198822 14366 128830 252451 469840 121700 53605 232875 284310 88213 181815
13283 181815 266543 -23643 297808 -5661 -175006 -7726 193891 322230 24371 -9189 247409
13271 -39538 45636 178220 273064 -86078 49665 67844 268514 288863 469002 86819 -55128
13259 214428 124171 -200759 156036 304931 44097 111212 60045 137451 127258 449641 129878
13247 173408 127752 -312499 -39076 28194 306710 100097 199909 221877 479253 -1762 78572
13235 -346800 -67587 479150 -139509 139159 194803 -2219 299970 -53125 -86985 -169647 146168
13223 65232 -57486 184394 -30575 240445 134929 -19620 -112613 307998 88823 163833 122898
13212 122898 124367 414944 344097 -71072 109600 33131 -30388 24955 52290 76506 151995
$$ packed form
13293A98822A4366J14464J23621K17389A21700E3605J79270N1435H8213R3602
13283A81815Q4728b3643B97808e661j69345g726A93891J28339B4371i189B47409
13271c9538D5636J32584R4844h6078D9665J8179K00670K0349J80139H6819e5128
13259B14428r0257b00759A56036J48895D4097O7115n1167P7406j0193L22383A29878
13247A73408m5656c12499c9076B8194K78516A00097R9812K1968K57376a762G8572
13235c46800f7587D79150a39509A39159N5644b219B99970e3125l3860q2662A46168
13223F5232e7486A84394c0575B40445j05516a9620r2993C07998H8823P5010m0935
13212A22898J469K90577p0847g1072A09600C3131c0388B4955K7335K4216P5489
$$ plain form
13201 151995 -134636 174111 3645 622810 121504 -8499 320404 49735 4883 -81958 285833
13189 428636 349604 190448 130838 284457 383159 -33289 -164339 -18952 20418 213307 325897
13178 325897 -169015 266088 57436 -9217 -119938 -39063 274815 21627 10945 -167509 180176
13166 332853 225018 373395 219013 295624 154982 -77040 87671 158578 252843 421299
13156 421299 131657 167834 465584 -77069 97694 371509 336152 264210 -4917 376769 -142607
13144 159528 5458 88563 -110422 113190 235556 238318 -201024 93052 114707 276756 101930
13132 -16897 -49417 -61681 -145456 -60064 -75021 137852 -104454 -39944 -41704 285566 -5079
13120 129815 -291043 -55795 352112 -89283 51045 -30819 275393 176137 122366 284703 114733
$$ packed form
13201A51995a34636A74111C645O19165A21504h499C20404D9735D883h1958B85833
13189D28636p9032j59156n9610J53619R8702c3289j31050a8952B0418J92889J12590
13178C25897a69015B66088E7436i217j10721c9063B74815B1627j0682a67509A80176
13166C32853j07835J48377j54382P6611j40642g7040H7671P0907R4265J68456
13156D21299A31657L6177K97750g7069I7694K73815l5357p1942d917C76769a42607
13144A59528E458Q3105a10422A13190J22366K762b01024I3052K1655J62049A01930
13132a6897l2520j2264q3775f0064j4957A37852a04454c9944j760B85566e079
13120A29815b91043e5795C52112h9283E1045c0819B75393r9256n3771J62337A14733
$$ plain form
13108 106212 108037 76208 -52685 142576 272680 147155 -29835 463007 360255 -53823 289255
13096 377527 111738 4817 284275 205585 -76690 280369 306971 135365 241895 127066
13086 127066 -8924 220959 -48717 -125968 -20936 16356 -43973 368503 459307 192723 -167625
13074 402220 -271822 593956 187160 -78274 -200799 120839 294238 216498 73287 130313
13064 130313 12854 109946 114243 39232 -13389 -15852 312031 317802 -26701 117183 -55828 -103628
13052 -103628 57328 387170 164161 100248 125093 214431 101810 -226057 247043 207800
13042 207800 -79205 85245 -90249 -123676 331362 -57799 -88210 307775 230294 66494 164011
13031 164011 -272613 -57717 -20149 -66954 -58368 540044 226884 -65366 210442 177706 128310
$$ packed form
13108A06212J825l1829e2685A42576J30104j25525b9835D63007j02752e3823B89255
13096C77527A11738D817K79458p8690g6690B80369K6602A35365J06530j14829
13086A27066h924B20959d8717p7251b0936A6356d3973C68503R0804A92723a67625
13074D02220b71822E93956A87160g8274j22525A20839J73399p7740G3287N7026
13064A30313A2854R7092M297C9232a3389k463C12031N771b6701A17183e5828m7800
13052a03628E7328L29842A64161o3913K4845Q9338A01810b26057B47043l9243
13042B07800g9205H5245i0249l3427C31362e7799l0411C07775p7481F6494R7517
13031A64011b72613e7717b0149m6805Q586E40044B26884f5366B10442l2736m9396
$$ plain form
13020 128310 312860 363076 144567 79662 272607 -115794 259735 114175 194971 210648
13010 210648 7879 209871 111321 391447 239862 333310 -104495 239516 259402 287423 176527
12999 176527 -56336 108698 204736 284588 201333 73850 248061 -169766 86420 320575 -185392
12987 -2707 -116146 -123305 -112826 277916 189973 311532 256187 -217475 295441 -78699 -367963
12976 -367963 -65666 89337 187177 473893 156222 116526 139817 -148116 235943 461482
12966 461482 -220998 -78823 181284 -105156 -36303 -116668 128800 80837 188365 264585
12956 264585 -142334 228486 -126177 387507 143389 -187203 -69851 210643 -106175 -246083
12946 -246083 464169 51777 100482 245455 161507 7076 -94575 -56343 -244171 58525 -177516
$$ packed form
13020A28310J84550N0216A44567o4905J92945a15794B59735A14175Q0796J5677
13010B10648G879K01992r8550K80126j51585R3448a04495B39516J9886K8021j10896
12999A76527e6336A08698R6038P9852q3255G3850J74211a69766H6420K34155a85392
12987b707j13439p159J0479B77916q7943J21559n5345b17475B95441g8699k89264
12976c67963f5666H9337R7840K86716A56222l9696K3291a48116B35943K25539
12966D61482b20998g8823A81284a05156c6303q0365A28800m7963J07528P6220
12956B64585a42334B28486a26177C87507A43389a87203f9851B10643a06175j39908
12946b46083D64169E1777M8705J44973q3948G076i4575L8232j87828E8525a77516
$$ plain form
12934 -315277 -2313 316243 -63926 275463 -138144 -6320 152802 178632 -275571 71672 212614
12923 212614 -84160 -36147 198752 -36352 349288 343438 -429957 136045 19257 119396 353527
12912 353527 -191445 -223687 -337168 80086 -33656 -19738 90434 165099 -181068 -116328 -75258
12901 -75258 -98723 138428 -129251 170287 263918 -2134 18903 -163648 362523 107427 -2587
12889 -184695 -65896 -54513 209743 47096 -198798 34123 304708 163908 -64738 403748
12878 -246327 60583 164918 72325 148628 67772 -78889 316193 -101059 -130055 -6137 171062
12866 -231586 -24802 -141797 -237155 421313 -133471 179593 166743 325954 279413 -128308
12855 242264 -20690 185687 31622 27683 26102 -38765 181662 196962 107451 98342 16651 79093
$$ packed form
12934c15277b313C16243f3926B75463a38144f320A52802K5830b75571G1672J40942
12923B12614h4160c6147A98752c6352C49288n850d29957A36045A9257J00139K34131
12912C53527a91445l2242j13481H0086c3656J3918I0434P4665a81068O4740M1070
12901g5258k3465A38428a29251A70287R3631b134A8903a63648C62523A07427b587
12889a84695f5896J1383B09743D7096a98798C4123K70585j40800f4738D03748
12878b46327F0583J04335G2325P6303F7772g8889C16193a01059k8996f137A71062
12866b31586b4802j16995r5358D21313a33471A79593j2850J59211m6541a28308
12855B42264b0690A85687C1622l939j581c8765A81662J5300q9511r109A6651O2442
$$ plain form
12843 79093 188240 -160027 -42244 154524 -256319 -41980 -189652 379736 65574 254277
12833 254277 70020 -240772 87235 30058 -96604 195843 230554 135747 -99920 -56155 -76560
12822 -76560 11617 24657 -55799 120432 38255 -114624 -125940 -6539 121349 -295878 -3887
12810 28001 4646 316850 15481 108153 -49604 277418 183916 228711 118684 64981 -251190
12798 -66433 136981 73323 -53236 260065 -5891 -138446 -36432 -194785 -117446 44259 185942
12787 185942 -45554 125431 179424 121834 138542 62352 -15901 187247 5003 90818 129782
12776 129782 113036 277228 59221 -105139 43291 -57926 180931 172438 -23784 -182511 -126111
12765 -126111 118096 98339 52692 155431 119024 -205694 -83387 -204474 -321379 -14076
$$ packed form
12843G9093J09147a60027d2244A54524b56319d1980j47672C79736F5574J88703
12833B54277G0020b40772H7235C0058i6604A95843L4711r4807i9920M3765k0405
12822g6560A1617J3040e5799A20432C8255a14624j1316f539A21349b95878c887
12810B8001D646L12204A5481R2672d9604B77418r3502M4795j10027n3703b51190
12798f6433A36981o3658e3236B60065e891j32555c6432j58353P7339D4259J41683
12787A85942d5554A25431N3993n7590J6708F2352a5901A87247E003Q5815L8964
12776A29782j6746J64192E9221a05139D3291e7926A80931q493b3784j58727N6400
12765a26111A18096j9757m5647J02739l6407b05694h3387j21087j16905a4076
$$ plain form
12754 -225444 -116693 -391144 238410 -103346 -71846 94490 391986 -211922 7342 -48273
12743 58916 31096 -84679 83496 15329 -173552 -94335 113251 418927 63272 -66181 229621
12731 129073 -60887 189915 -184720 157985 222221 246369 -159750 -82797 205391 255562
12721 255562 194002 55533 -165332 76111 183557 41294 -124804 357478 317563 3182 27456
12710 27456 289399 -29579 452545 555345 453929 449862 23060 36658 348853 166392 175252
12699 175252 67187 -43878 164159 59010 -101594 370178 17934 64013 124910 81008 -126674
12687 221773 -145436 111224 185976 -8770 -157806 -357567 -69153 298137 -270003 -36357
12676 224236 153027 -234828 249709 350958 -79862 -141113 -2425 70155 327382 170127 405114
$$ packed form
12754b25444J08751k74451B38410a03346L1500I4490K97496b11922G342d8273
12743E8916k7820h4679H3496A5329a73552P9217A13251L05676F3272f6181B29621
12731A29073f0887A89915a84720A57985O4236K4148a59750P6953B05391N0171
12721B55562o1560E5533a65332G6111J07446D1294a24804C57478l9915C182K4274
12710B7456K61943b9579D52545J02800j01416m067B3060J3598L12195A66392Q860
12699A75252F7187d3878A64159E9010a01594C70178A7934M6079O0897m3902a26674
12687B21773a45436A11224P4752h770j49036j99761f9153B98137b70003c6357
12676B24236p1209b34828B49709J01249g9862o1251b425G0155K57227j57255K34987
$$ plain form
12665 405114 278243 225284 -167663 49521 115965 -139384 79106 103191 149442 30983 283392
12654 283392 49412 170906 -42609 -6330 88405 175517 -116012 61432 -538 28474 -42885 66434
12641 -26716 -262153 -344344 37580 227255 -123647 -71761 100593 -45148 306830 257119 -159200
12629 102647 273594 227997 314784 162124 -41933 89640 53648 226247 49903 252447 174267
12618 174267 -216731 136266 302159 -212388 -99982 148479 67226 19531 9362 -116568
12607 185994 72833 136265 10014 220018 -236569 62179 -92582 348373 240065 154468 74071
12595 234554 107969 61069 220647 201979 109426 233021 65630 -23196 57740 -88523 5499
12583 235336 -54171 260554 219255 74730 -152745 -117462 -6301 -85269 324851 4352 -94118
$$ packed form
12665D05114j26871n2959a67663D9521O6444a39384G9106K4085M6251C0983K52409
12654B83392D9412J21494d2609f330H8405Q7112a16012F1432e38B8474d2885F6434
12641b6716k35437q2191C7580J89675a23647N1886A00593d5148C06830m9711a59200
12629A02647J70947m5597Q6787j52660d1933H9640l5992J72599D9903K02544p8180
12618A74267b16731A36266J65893b12388i9982A48479F7226A9531I362a16568
12607A85994G2833O3432A0014K10004b36569F2179i2582C48373j08308q5597G4071
12595B34554A07969m6900J59578j8668r2553J23595F5630b3196E7740h8523E499
12583B35336e4171B60554m1299G4730a52745L5283f301p8968C24851D352i4118
$$ plain form
12571 -72733 190226 102515 -15533 73330 87929 59580 209996 104721 -198308 -10014 105788
12559 -288953 89795 260041 584783 290481 277307 -239932 -131193 156905 -254486 324366
12548 -150766 181730 -38299 582166 -50975 -134030 102244 -139999 116509 15445 -213330
12537 -299387 -264093 80092 216111 -87437 116402 18911 19697 -61944 -24721 151100 -63891
12525 225157 -91533 34200 205557 220252 69665 125889 -179686 -246353 152710 -23642 28283
12513 -47470 292227 148874 -195525 -53671 -117523 -22219 -165883 179441 86643 141189 211822
12502 211822 -103791 -185771 195953 -117558 -66828 88305 -34015 -95924 86934 -254179 179614
12490 6922 -559353 -58889 143319 -230634 -292570 -360661 49793 -234967 -79042 181858 -254944
$$ packed form
12571g2733A90226q7711a5533G3330J4599k8349J50416A04721a98308a0014A05788
12559b88953H9795J70246L24742B90481j3174b39932J08739A56905b54486C24366
12548a50766A81730c8299E82166e0975q3055A02244a39999A16509A5445b13330
12537b99387L5294H0092J36019h7437A16402A8911P86f1944b4721A51100f3891
12525B25157i1533C4200J71357J4695F9665N6224a79686o6667A52710b3642B8283
12513d7470B92227j43353a95525e3671o3852b2219j43664A79441H6643N4546P0633
12502B11822a03791q1980A95953a17558N0730H8305c4015o1909H6934b54179A79614
12490F922e59353e8889A43319b30634o1936o8091D9793b34967g9042A81858b54944
$$ plain form
12478 304564 339192 164063 -81777 94763 -254619 -65639 -8791 -176238 166555 -20582 68918
12466 -128189 15169 -35496 -55094 440663 -24197 -481273 -78222 -275538 255873 212412 -23532
12454 197268 -190679 298928 -246503 96531 52325 33807 82888 -216414 -8345 172218 -204326
12442 -10687 -70947 -42153 -114960 152737 -224661 173522 37497 -311210 -138147 142754
12431 61600 -79440 -413688 2120 110789 31180 200496 154443 57578 -261372 -30725 -14095
12419 91800 304237 104062 103801 4740 -35980 -285918 489751 -251421 -132833 300666 336574
12408 336574 -52617 130846 9098 208313 -314767 -68752 84842 -147473 -96920 76771 -270765
12396 -60678 -16851 -251008 54882 -138543 3069 -148809 -69637 101659 -3431 45138 -64074
$$ packed form
12478C04564L4628A64063h1777I4763b54619f5639h791j67447A66555b0582F8918
12466a28189A5169c5496j9598D40663b4197m57076g8222j97316B55873m3461b3532
12454A97268a90679B98928b46503I6531m4206j8518M9081b16414h345A72218b04326
12442a0687o0260K8794p2807A52737b24661A73522C7497c11210a38147A42754
12431F1600g9440l34248B120J08669C1180J69316m6053E7578b61372c0725a4095
12419I1800K12437A04062k61D740c5980k49938D89751b51421J18588C00666L5908
12408C36574e2617A30846I098J99215c14767f8752H4842a47473N0553G6771b70765
12396f0678a6851k34157E4882a38543C069a48809f9637A01659c431D5138f4074
$$ plain form
12384 -322258 122399 114922 -262345 -103940 218981 145215 -140188 176420 -298452 114546
12373 -63754 141430 69665 114511 17267 57743 17745 -193810 313664 221157 -62970 19602
12361 -279967 371177 147622 -21661 313548 -101777 -195451 -95304 170426 66979 240211
12351 240211 -61401 147724 -36894 233123 -150682 145978 152082 -18702 -96004 -394887 -135170
12339 -39787 -2409 241131 -267722 -284565 25863 483465 -75762 -159326 -234881 -131746 134458
12327 116183 -3409 -203779 -105560 5521 266900 -288697 -45373 348230 339110 -4741 -75071
12316 -75071 190018 -46649 96456 -6166 288553 -9698 -61993 -150054 -44333 326074 25145
12304 356226 302844 429492 18533 -26480 305007 -221974 11855 -42529 52034 -119428 192553
$$ packed form
12384c22258A22399p477b62345a03940B18981p3766a40188A76420b98452A14546
12373f3754A41430F9665M4846A7267M0476A7745a93810C13664r2507f2970A9602
12361b79967C71177A47622b1661C13548a01777r3674i5304A70426F6979J73232
12351B40211f1401A47724c6894B33123a50682A45978O104a8702p7302k98883a35170
12339c9787b409B41131b67722j6843B5863M57602g5762q3564p5555J03135A34458
12327A16183c409k00370R8219E521K61379b88697d5373C48230r120d741p0330
12316g5071A90018d6649I6456f166B88553i698n2295q8061d4333C26074B5145
12304C56226n3382J26648A8533b6480C05007b21974A1855d2529E2034a19428A92553
$$ plain form
12292 288515 -115173 -54613 130380 59703 309124 118581 206113 222622 227017 219453 17786
12280 4968 89278 256941 384608 -183153 264846 242420 385176 152322 -39273 286399
12269 26448 137496 24174 68210 -5141 -2437 -17446 -111554 256027 -22168 154174 -204609
12257 219992 -21710 84451 690627 50189 308838 185917 127780 426393 -1466 -31183 129219
12245 163619 252193 -225351 226097 12060 -150519 -137835 -101356 -10773 71923 284603 11605
12233 -109530 141862 190733 53700 -138244 -15162 326332 83454 110722 422175 121976
12222 278655 -17845 161473 27680 526765 -35807 321762 223697 -67957 65599 505232 -79202
12210 -165258 140612 192661 131158 -264606 236556 139302 384135 132157 358338 196133
$$ packed form
12292B88515a15173e4613A30380E9703K49421A18581Q7532J6509M395p564A7786
12280D968Q4310J67663J27667a83153B64846k2426J42756A52322c9273B86399
12269B6448J11048B4174M4036e141b437j5009r4108B56027b2168A54174b04609
12257B19992b1710H4451O06176E0189K58649j22921n8137K98613a466k9717A29219
12245A63619Q8574b25351B26097A2060a50519J2684L6479a0773G1923K12680A1605
12233a09530A41862M8871E3700a38244a5162C26332H3454K7268L11453A21976
12222B78655a7845A61473B7680M99085c5807C21762r8065f7957F5599M39633g9202
12210a65258A40612N2049o1503b64606B36556r7254K44833A32157K26181j62205
$$ plain form
12200 196133 201641 -102080 20892 -10877 152652 208135 82094 106613 258185 201893 159135
12189 159135 102336 -29409 98897 469957 160510 41677 4398 128738 -7326 360012 317050
12178 317050 88167 19756 454551 194283 180383 -115500 508890 186437 912 95393 161509
12167 161509 424027 498422 10711 -4785 -112824 -57799 -3840 335271 236107 183862 221525
12156 221525 265909 112513 89417 -157337 -169881 -80767 -12219 221239 242450 -20009 199794
12144 -277513 75543 -71345 -151174 -125973 -35855 185950 -209837 302216 171967 181063 -275980
12132 104349 197785 -52142 -293191 -104393 -177724 330802 217097 -25526 -50933 -67676 56492
12120 163104 252167 43250 -106910 9134 513186 -147938 -33992 -130381 96414 -31270 -12452
$$ packed form
12200A96133N508a02080B0892a0877A52652N5483H2094K4519J51572n6292m2758
12189A59135n6799b9409I8897L71060A60510D1677D398J24340g326C60012m2962
12178C17050H8167A9756M34795A94283j3900a15500E08890A86437I12R4481O6116
12167A61509K62518P4395A0711d785j08039N5025c840C35271r9164n2245L7663
12156B21525M4384A12513k3096a57337j2544h0767a2219B21239K1211b0009A99794
12144b77513G5543g1345p9829K5201c5855A85950b09837C02216j30249R096b75980
12132A04349R3436e2142k41049a04393p3331C30802j13705b5526k5407j6743E6492
12120A63104Q9063D3250a06910I134N04052a47938c3992r6389I6414c1270a2452
$$ plain form
12108 95442 -217311 84313 -88374 296985 312144 13352 -12096 -37682 -18046 -103869 165345
12096 236543 -186020 201792 199327 295596 318196 -34354 -26734 429384 -293169 -21216 -197559
12085 -197559 119823 -54859 365000 -243913 -78854 -220003 -194799 -205554 221506 -7147 -145288
12074 -145288 56810 -28806 204791 219285 34759 723339 1637815 928694 472691 171198
12063 -59914 -100335 177822 116469 86199 401481 -233003 -158860 -98527 -440010 98869 -278786
12051 -188351 -4178 211731 365870 221058 -115046 293296 -321717 72338 -36951 35459
12040 -45784 100290 -226166 -167263 -6518 3996 259326 203050 -272971 140177 297090 -74694
12028 198309 -9127 171967 -2445 -95428 246442 135982 -98023 -73045 101982 321064 -61805
$$ packed form
12108I5442b17311H4313h8374B96985J5159A3352a2096k5586a8046q5823A65345
12096B36543a86020B01792k465R6269K2600c4354P620D29384b93169b1216j76343
12085a97559A19823e4859C65000b43913g8854j41149K5204j0755B21506g147j38141
12074a45288E6810b8806B04791J4494C4759O88580R14476p09121m56003A71198
12063e9914m0421A77822o1353l0270L15282b33003P4143O0333l41483I8869b78786
12051a88351d178B11731J54139j44812a15046B93296c21717G2338c6951C5459
12040d5784A00290b26166N8903f518C996K55330n6276b72971A40177J56913g4694
12028A98309i127A71967b445r2983B46442j10460i8023K4978A01982K19082f1805
$$ plain form
12016 40918 -53607 163540 -295517 92160 -187615 311683 176657 206072 105723 -84077
12005 161297 239692 209744 -176823 41560 -23850 43300 -366771 163160 -112555 -132600 5176
11993 -21383 85715 -23413 281395 -145751 2981 26057 -531969 195797 -2742 128409 -223472
11981 135875 47845 75475 43191 -75901 31064 234891 7773 195792 -195887 -186046 -192413
11970 -192413 268809 -203608 64911 193015 -174447 59678 -123410 -136720 -154500 82682
11959 164992 60816 -18837 -52084 -575515 63295 -124803 -169177 142386 6801 -74114 -214340
11948 -214340 219753 396778 -59839 -12667 264672 199783 -238785 -118197 51339 -1091 151013
11936 -260809 -45922 -304873 41731 39432 91362 -152424 -301032 52647 -267914 217376 118316
$$ packed form
12016D0918e3607A63540b95517I2160a87615C11683j35026K9415j00349h4077
12005A61297P8395k9948a76823D1560b3850D3300c66771A63160a12555k0045E176
11993b1383H5715b3413B81395a45751B981K3076e31969A95797b742A28409b23472
11981A35875D7845K7630l2284g5901C1064K03827G773J88019a95887R841o367
11970a92413B68809b03608F4911J28104a74447E9678a23410j3310j7780H2682
11959A64992F0816a8837l3247n23431F3295a24803m4374A42386F801g4114j40226
11948b14340B19753J77025e9839a2667B64672o4889b38785a18197E1339a091A51013
11936b60809d5922k58951D1731k299N1930a52424j48608E2647b67914B17376r9060
$$ plain form
11925 118316 -49113 23812 152769 -195320 208492 -305065 169517 114862 134288 -330876
11914 -44432 -210544 46495 218038 157811 169811 -85082 28009 79200 26328 -145005 -141300
11903 -141300 -118647 -174462 -35634 187149 -15677 432612 -39335 -218024 59745 -77314 32832
11891 388747 -187976 243601 408992 -366794 -91640 235931 -354655 73372 -241952 -186168
11881 -186168 -14711 -331449 -99335 60268 -125481 -12167 102683 -227391 164240 -54918
11870 75100 210501 44040 -205926 -25279 -130461 152186 -281188 -91347 -119726 71256 -91313
11858 -178712 -264044 -176898 -57593 -116674 -97998 -96663 93472 -89756 297626 -40499 -321925
11847 -321925 -203486 -104649 -215277 276666 -39950 -51300 -201003 -177867 176469 80392
$$ packed form
11925A18316d9113B3812J28957a95320B08492c05065A69517n4655J9426c30876
11914d4432j66112D6495J71543o0227J2000h5082B8009N1191B6328a45005L705
11903a41300K2653n5815c5634A87149a5677D32612c9335j78689E9745g7314C2832
11891C88747a87976B43601J65391c66794i1640B35931c54655G3372b41952N5784
11881a86168a4711l16738i9335F0268a25481a2167A02683b27391A64240e4918
11870G5100J35401D4040b05926b5279j05182A52186b81188i1347k8379G1256i1313
11858a78712q5332Q7146e7593n9081J8676J335I3472h9756B97626d0499k81426
11847c21925J18439R8837j10628B76666c9950j1350j49703K3136A76469H0392
$$ plain form
11836 98149 -241147 24381 272567 -11611 -173588 -158394 191882 447698 -338524 131520
11825 -79341 -241250 162883 -96512 16636 211085 -15015 105395 168603 -61194 -304462 299010
11813 -256360 235057 -97270 -402172 -81416 -101341 -267213 -165908 201585 -145416 -211097
11803 -211097 -87977 84597 -8098 -53567 122638 -354230 -11297 -136758 -224803 -203097 196297
11791 -70437 -126997 -120516 -10446 168539 112295 118448 71800 427144 72595 82939 179453 5997
11778 -62133 -149160 187521 -271413 -903 -125992 -30259 -142189 -158560 -58293 -188109 89023
11766 -196770 235248 1406 38530 160344 -324434 210092 185053 -73507 -164774 98599 200054
11755 200054 -42057 -94319 204814 51303 70313 -185182 191901 -58781 -63608 88115 -300197
$$ packed form
11836I8149b41147B4381K48186a1611j61977J5194A91882K55816c38524A31520
11825g9341j61909A62883i6512A6636J94449a5015A05395O3208f1194k43268B99010
11813b56360B35057i7270l04902h1416j9925j65872J01305B01585a45416o5681
11803b11097h7977H4597h098m5469A22638c54230a1297j25461q8045K1706A96297
11791g0437n6560O481a0446A68539n6244O153m6648L55344G2595J0344R6514E997
11778f2133q7027A87521b71413i03j25089c0259j11930j6371e8293j29816H9023
11766a96770B35248A406L7124J21814c24434B10092k5039g3507r1267I8599J01455
11755B00054d2057n2262B04814E1303J9010a85182A91901e8781m827H8115c00197
$$ plain form
11743 135478 -9843 88191 -77369 -90549 -265812 331690 246974 15319 137789 310139 -210232
11731 21429 365688 139326 -205851 -151529 -50375 132661 358608 112463 293364 -168806
11720 -147349 5252 -156330 -191489 -177595 453504 98309 283433 421049 118943 -90784 204688
11708 109339 176757 98677 110045 153481 -233761 -127931 -830 -25280 97929 -217191 -38821
11696 -41188 262980 -241684 188543 73323 121769 209826 -40338 50237 224853 66277 40572
11685 40572 216023 58714 -44957 -163009 21683 274305 -150556 -113866 -272524 -198908 100842
11673 -44568 19413 285205 54851 108144 106210 -113174 288127 -16495 8666 152038 -55795
11661 191478 168527 -46178 -239758 156979 166974 -22880 -35986 -129276 159094 -327863 112330
$$ packed form
11743A35478i843H8191g7369j3180j75263C31690q4716A5319J22470J72350b10232
11731B1429L44259A39326b05851N4322e0375A32661K25947A12463J80901a68806
11720a47349E252a56330l5159J3894D53504I8309J85124J37616A18943i0784B04688
11708A09339O7418p8080J1368M3436b33761J05830h30k4450I7929b17191c8821
11696d1188B62980b41684A88543G3323M8446Q8057d0338E0237J74616F6277k5705
11685D0572J75451E8714d4957j18052B1683K52622a50556L6690j58658P3616A00842
11673d4568A9413K65792E4851N3293j934a13174B88127a6495H666J43372e5795
11661A91478k2951d6178j93580A56979R995b2880j3106r3290A59094c27863A12330
$$ plain form
11649 272876 -230873 20482 -108860 199839 32646 415657 135467 -38274 95077 84029
11639 84029 -89646 158943 292441 232565 -228033 25154 223811 -3784 7776 164144 -16300
11627 242804 32790 132966 -191588 -237714 199870 398050 250187 -3919 -215585 3586 -76312
11615 275067 -137503 97346 174963 -192680 -24984 54562 1341 9199 -57765 33269 -285688
11603 -136201 195042 -216950 16113 -126363 -37576 74634 -138338 -119398 -16756 -114269 -100659
11592 -100659 115911 28131 166543 256531 -123802 258063 68032 240043 -156692 503778
11581 233017 -193335 41496 -280657 90364 28956 76580 159591 1767 391641 -35446 -17079
11569 54376 134368 113677 179339 289460 86323 103619 16277 -24278 -289951 -35888 149900
$$ packed form
11649B72876b30873B0482a08860A99839C2646L83011A35467c8274I5077j1048
11639H4029h9646A58943J33498n9876b28033B5154J98657c784G776J56368a6300
11627B42804C2790J00176a91588m6126A99870J98180j47863c919k11666C586g6312
11615B75067a37503I7346P7617a92680b4984E4562A341P858e7765C3269b85688
11603a36201A95042b16950A6113a26363c7576G4634a38338J8940a6756r7513J3610
11592a00659A15911B8131J38412Q9988a23802B58063F8032J72011a56692E03778
11581B33017a93335D1496b80657I0364B8956M7624Q3011A767L89874c5446a7079
11569E4376P9992k0691O5662J10121H6323J7296A6277b4278k65673c5888A49900
$$ plain form
11557 322795 -37737 12614 166439 170723 72538 -55703 261746 -193727 -48928 -261505 261362
11545 -49282 93906 87790 159659 -299750 48430 -360812 84251 -145914 -28529 -15654 -47350
11534 -47350 143374 41484 267564 169146 255511 -120379 -42606 414181 147034 286578
11524 286578 116301 -157766 144657 268847 258990 183321 383908 -58138 217502 130823
11514 130823 58336 110167 420660 216073 -4094 225741 -10733 378692 113348 374245
11504 374245 57506 -116176 -85026 149144 270152 217509 303078 251565 183683 116364 21467
11492 647782 264364 418284 317110 5070 263581 160441 105861 -84249 224525 483991
11482 483991 185054 222582 236457 196864 48045 38544 154451 329145 200781 117665 419947
$$ packed form
11557C22795c7737A2614J53825M284G2538e5703B61746a93727d8928k12577B61362
11545d9282I3906o116P1869b99750D8430c60812H4251a45914b8529J2875l1696
11534d7350A43374D1484K26080r8418Q6365a20379d2606D14181A47034J39544
11524B86578A16301a57766A44657J24190r857p5669K00587e8138B17502q6679
11514A30823E8336N1831L10493k04587d094B25741a0733C78692A13348K60897
11504C74245E7506a16176L1150A49144J21008n2643Q5569n1513o7882o7319B1467
11492F47782B64364J53920j01174E070K58511j03140n4580h4249B24525K59466
11482D83991A85054L7528J3875l9593D8045r501J15907J74694j28364q3116L02282
$$ plain form
11471 419947 104401 401941 138929 141205 323148 -17449 253177 161058 -14917 178912
11460 37731 50621 104345 451611 -165006 -113629 168440 129510 166477 276844 -48897 330857
11448 75724 262575 -329483 -16141 347091 18790 226122 7636 -31410 -206622 151010 299477
11437 299477 408649 139930 -88990 -158806 -166022 388248 -103101 79768 206128 139544 -124881
11425 -75844 52120 372860 -115723 17323 -182761 -180560 -264725 83934 267449 24263 -13834
11413 -119950 -22528 75291 78483 -306930 10165 -3463 230370 95067 -102893 297191 -252098
11401 240234 -60316 10269 188101 -10595 297879 -47645 -42053 -200833 -92033 111314 -106602
11389 21008 -51352 56079 -137079 82836 -202238 265683 43341 157691 -171824 78174 103622
$$ packed form
11471D19947A04401K97540A38929K276J81943a7449B53177r2119a4917A78912
11460C7731J2890N3724L47266a65006N1377A68440l8930L6967J10367d8897C30857
11448G5724J86851c29483a6141C47091A8790K07332G636c1410j75212A51010J48467
11437B99477J09172A39930h8990o9816p216C88248a03101G9768J26360o6584a24881
11425g5844E2120L20740a15723A7323a82761K201q4165H3934J83515B4263a3834
11413a19950b2528G5291L192c06930A0165c463B30370I5067a02893B97191b52098
11401B40234f0316A0269J77832a0595B97879d7645N592j58780i2033A11314a06602
11389B1008e1352E6079a37079H2836b02238B65683D3341J14350a71824G8174K5448
$$ plain form
11378 103622 -43716 -90234 120316 74509 222441 -98360 227099 482770 36632 -76520 162451
11366 -139573 -49586 85873 228222 137068 -63030 -110433 -7265 -16559 9807 -130675 -364433
11355 -364433 31660 -66100 -116573 -208728 63380 -7677 -82736 -324509 -46185 368720 340272
11344 340272 -395888 140718 -127742 -353281 176440 13067 -209522 80599 62168 -218008
11333 -86939 -57888 56991 -193556 81224 -16296 169337 16562 68847 108005 -72882 -108610
11322 -108610 -296117 289554 -113183 81165 -68031 -14351 -24315 -103240 -154587 89506 43932
11310 -177516 207541 167476 208627 22344 -111440 76849 -191079 40403 -197553 92721 15579
11298 149057 177871 187037 -129008 -115965 -214733 22817 -101598 6760 129027 108266 47392
$$ packed form
11378A03622d3716m6518A20316m5807J47932i8360B27099K55671C6632g6520A62451
11366a39573d9586H5873J42349r1154f3030m7403g265r294I807a30675k33758
11355c64433C1660f6100n0473r2155F3380g677p5059k41773d6185C68720k8448
11344C40272c95888A40718a27742k25539A76440A3067b09522H0599j8431b18008
11333h6939K9051E6991a93556H1224a6296A69337A6562N2285L9158g2882l5728
11322a08610j87507B89554a13183H1165f8031a4351r964p8925n1347H9506D3932
11310a77516B07541m0065M1151B2344a11440G6849a91079D0403a97553I2721A5579
11298A49057K8814R166a29008J3043r8768B2817a01598F760J22267k0761D7392
$$ plain form
11286 -182591 109667 23253 -175720 82512 -336594 75706 -146520 -216846 -42245 161072
11275 -321412 -115171 -8981 191430 147856 115402 -5805 -93437 227933 91873 46257 116265
11264 116265 58501 -323912 126093 -284876 130430 -116594 -49608 -218397 -122412 -315114
11254 -315114 192937 232456 194583 -5470 24518 -180893 17808 -234580 153529 -374520 225638
11242 -76885 -81063 -35078 -96380 118794 -15675 206049 330152 -167484 -20965 10621 -177945
11230 -120127 19930 -125061 200081 -55777 -81050 -325782 -328965 -12496 95964 -60306 330854
11218 27591 -16796 65003 337908 146491 -32523 -422654 -201719 -34893 -107593 91703 -213463
11206 -250181 -92768 201871 -16291 -108640 4686 -60584 51556 146963 -369141 -179960 -88736
$$ packed form
11286a82591A09667B3253a75720H2512c36594G5706a46520p0326d2245A61072
11275c21412a15171h981A91430m3574l2454e805q7632B27933I1873m5616P0008
11264A16265n7764c23912A26093b84876A30430a16594d9608j68789R5985j92702
11254c15114A92937L9519l7873e470B4518a80893A7808b34580A53529c74520B25638
11242g6885m178c5078o1302A18794a5675B06049J24103a67484b0965A0621a77945
11230a20127A9930a25061B00081e5777k5273k44732l183a2496I5964f0306C30854
11218B7591a6796F5003K72905A46491c2523l90131b01719c4893p2700I1703b13463
11206b50181i2768B01871a6291r2349D686f0584E1556R5407c69141a79960h8736
$$ plain form
11194 -275631 -85844 -50156 214204 54173 -244601 5848 -165317 -110812 -194485 110078 -156778
11182 79126 -48527 -247277 325003 -17301 -299534 -154518 -121932 -115049 -69886 -350333 127459
11170 297232 122150 -34772 397668 16363 38791 -265222 142476 213811 -149099 144532
11159 -44175 -93275 101989 127478 -190765 207258 -95313 -191692 -161653 -363036 79965 -103110
11147 167638 -271846 288777 -95405 337031 37886 -35738 -426005 -263287 92550 119414
11137 119414 190255 238354 332351 8218 -213798 -155518 -97201 -23971 -50198 -50134 100899 103945
11125 103945 -2176 126347 350906 127811 -53534 -194665 -266501 373087 217973 438435
11115 438435 -177485 141213 45367 -38356 257428 122738 110922 -8812 96002 63282 95839
$$ packed form
11194b75631h5844L5688B14204E4173b44601E848a65317N4505q3673A10078a56778
11182G9126d8527j98750C25003a7301k82233J45016L2586O883M5163k80447A27459
11170B97232A22150c4772C97668A6363K2428b65222A42476P1335a49099A44532
11159d4175m9100A01989K5489a90765B07258i5313r6379L0039k01383G9965a03110
11147A67638b71846B88777i5405C37031C7886c5738l90267J62718I2550K6864
11137A19414P0841M8099R3997H218b13798N8280N8317b3971k6227O4A00899L046
11125A03945b176A26347K24559A27811e3534j41131p1836C73087j55114K20462
11115D38435a77485A41213D5367c8356B57428A22738j1816h812I6002l2720L2557
$$ plain form
11104 95839 392397 263868 -30487 240600 309521 409087 143252 55495 434192 78061 146981
11093 146981 394005 545977 532995 313257 339119 168877 21979 164223 258408 91462
11082 144215 557519 45716 296818 387456 115889 186089 320004 442600 103173 507267
11072 507267 288301 171220 504393 328975 492927 430515 305541 57947 283326 757937
11062 757937 778101 435160 641028 330126 390521 357967 499490 608858 683371 645065
11052 645065 681992 751595 1066994 635207 741896 690958 617078 893152 689079 760919
11042 760919 684495 760158 802852 853217 805595 661729 755455 891969 806964 1094333 520438
11030 872500 776699 693381 786222 836746 1003853 827374 579967 891668 483854 775370
$$ packed form
11104I5839K96558j28529c0487B40600O8921R9566A43252E5495L78697G8061O8920
11093A46981K47024J51972j2982k19738K5862A68877B1979J42244R4185I1462
11082A44215M13304D5716K51102R0638A15889P0200J33915J22596A03173M04094
11072E07267k18966j17081L33173j75418J63952o2412j24974E7947K25379M74611
11062G57937K0164l42941K05868l10902O0395l2554J41523J09368P4513l8306
11052F45065L6927O9603L15399m31787J06689n0938p3880K76074k04073P1840
11042G60919p6424P5663M2694N0365m7622j43866R3726J36514q5005K87369E20438
11030H72500r5801q3318R2841N0524J67107j76479k47407L11701m07814K91516
$$ plain form
11020 775370 754894 549167 949093 524108 784725 752413 856208 872046 452795 976336
11010 976336 736172 575922 770763 613085 855504 562185 826052 882896 404633 711827
11000 711827 1033739 841805 584918 549466 509741 770899 843904 452529 582315 760063
10990 760063 795680 826385 707307 887330 1076263 965281 884705 1028954 1178430 1420114
10980 1420114 1393617 1767336 1252321 1728624 1635863 2311653 2302729 2900927 3211397 3058149
10970 3058149 3133119 2618781 2684743 2613199 2153192 2102676 1868003 1992809 1671268 1409066
10960 1409066 1995811 1986057 1802930 1959091 1751014 1477445 1478976 1753719 1552369 1052132
10950 1052132 770771 715784 727511 360875 771192 352593 501397 310887 471404 506648
$$ packed form
11020G75370k0476k05727L99926m24985K60617l2312J03795J5838m19251N23541
11010I76336k40164j60250J94841j57678K42419k93319K63867N6844D04633L07194
11000G11827L21912j91934k56887l5452l9725K61158P3005l91375J29786J77748
10990G60063L5617L0705j19078J80023J88933j10982q0576J44249J49476K41684
10980A420114k6497L73719n15015M76303r2761O75790q924N98198L10470j53248
10970C058149P4970n14338O5962p1544m60007n0516k34673J24806l21541k62202
10960A409066N86745r754j83127J56161k08077k73569J531K74743k01350n00237
10950A052132k81361n4987J1727C60875M10317C52593J48804j90510J60517L5244
$$ plain form
10940 506648 127132 -61610 245531 256980 62231 117543 177175 -102415 49444 142319 -169962
10928 -101705 -88959 -69988 -11283 28603 -364049 224907 18396 170667 193692 -171828 -375711
10917 -375711 18503 -10537 -14212 191498 50966 -173181 -131737 -44964 -149221 156142 -132043
10905 -143580 155443 25762 302051 11300 69775 -410810 116024 -31918 49543 -242840
10894 14309 138501 59638 212255 -134465 -7409 42327 -92922 197748 -112838 -77864 -186557
10883 -186557 -36557 -27910 -108250 -332785 16371 -207772 -113926 -30858 -448990 -43266 73191
10871 38971 -303456 -25002 37905 72737 -78369 -169739 246131 -162696 195449 30150 166835
10860 166835 -100422 -233939 164816 -20019 -46511 -62130 31585 136124 -81599 -202208
$$ packed form
10940E06648A27132f1610B45531J1449F2231N5312N9632a02415D9444R2875a69962
10928a01705J2746J8971a1283B8603c64049B24907A8396J52271K3025a71828k03883
10917c75711A8503a0537l675A91498E0966a73181M1444d4964j04257A56142a32043
10905a43580A55443B5762K76289A1300N8475d10810A16024c1918D9543b42840
10894A4309J24192E9638J52617a34465g409D2327i2922A97748a12838L4974j08693
10883a86557c6557Q647q0340k24535A6371b07772R3846c0858m18132d3266G3191
10871C8971c03456b5002C7905L4832g8369r1370B46131a62696A95449C0150J36685
10860A66835a00422j33517A64816b0019k6492j5619C1585J04539h1599j20609
$$ plain form
10850 -202208 -193835 -80898 -209902 214008 -106986 -193091 349047 10522 66541 -177980 -79839
10838 -166884 -150552 110979 -16884 103590 -10451 26681 -162399 112203 201716 108164 -325473
10826 -22239 1249 60875 -26832 245735 84949 -13891 -309045 -369413 -252089 281345 81673
10814 -100662 139977 -73899 136015 130061 100085 -229849 65232 61795 114191 -176774 259640
10802 -318109 180050 -44693 228851 74523 -11247 -296152 132558 203270 141336 -1194 -192360
10791 -192360 211097 224970 26777 124818 -168676 -131803 313722 -89457 -40370 55729 187934
10780 187934 10182 -133180 -272948 122586 34743 56320 -44571 255699 -3216 301874 18070
10768 38354 -11365 -72384 -211646 138946 2622 105011 87865 -110590 241261 -103772 -213508
$$ packed form
10850b02208Q373h0898j29004B14008a06986q6105C49047A0522N6019a77980g9839
10838a66884J6332A10979a6884A03590a0451B6681a62399A12203Q9513r3552c25473
10826b2239A249N9626b6832B45735H4949a3891k95154o0368J17324B81345H1673
10814a00662A39977g3899A36015n954k9976b29849F5232l437N2396a76774B59640
10802c18109A80050d4693B28851G4523a1247k84905A32558P0712o1934a194j91166
10791a92360B11097J3873B6777R8041a68676L6873C13722h9457d0370E5729J32205
10780A87934A0182a33180j39768A22586C4743K1577d4571B55699c216C01874A8070
10768C8354a1365o1019j39262A38946B622J02389j7146a10590B41261a03772j09736
$$ plain form
10757 -213508 10391 6295 -172702 483061 -242084 241482 -28306 9824 -107650 157271 -59555
10745 -17084 -110514 288457 -505663 -169628 190781 55810 69152 -435212 -332577 150187
10734 -573058 -359855 147008 186 160321 -473832 89455 -208894 78409 -33223 -151961 -189621
10723 -189621 -8580 153955 87236 56813 40801 195317 74980 276001 -196363 -22600 -290414
10712 -290414 -159318 -8745 6875 20527 -232875 -76093 121208 35871 -24094 63540 82494
10701 82494 -209244 138067 105945 -445566 -100221 -50543 236516 270263 -56352 -213187
10691 -213187 21231 297063 -80145 242054 -248220 90500 146808 -23133 -23284 151691 -231490
10679 -74792 14417 -43466 263048 -322525 -108449 35237 36437 292854 -63011 -87200 105145
$$ packed form
10757b13508A0391m096a72702D83061b42084B41482b8306I824a07650A57271e9555
10745a7084r3430B88457e05663a69628A90781E5810J3342d35212J02635A50187
10734e73058K13203A47008A86J60135d73832H9455b08894G8409c3223j18738l7660
10723a89621h580A53955o6719l0423j6012J54516G4980K01021a96363b2600k67814
10712b90414J31096h745F875J3652b32875g6093A21208C5871b4094F3540J8954
10701H2494b09244A38067l2122d45566a00221M9678B36516L3747e6352j56835
10691b13187B1231K75832h0145B42054b48220I0500N6308b3133j51A51691b31490
10679g4792A4417d3466B63048c22525a08449C5237J200K56417f3011k4189A05145
$$ plain form
10667 -139615 -8034 -118853 -188273 -39976 21995 -224234 -437588 -194384 199328 -270512
10656 -336609 -314724 -23882 31551 -320745 -20520 -183891 -117275 -199651 -153809 -277330 -88952
10644 -140839 -259330 -26373 -230715 -12126 67928 190918 290624 159601 -163526 29061
10633 232111 -60780 -120454 -339135 -377107 284547 63106 -114868 -77712 -178520 -84033 -129250
10622 -129250 -124893 -196263 27691 -319984 -209436 -236333 -237926 -38957 274382 -136104 -5544
10610 48523 -272765 -61369 -361954 -11747 -176367 84175 37888 -332220 28387 63317 355023
10599 355023 105676 -132087 -143453 -362213 9074 -22785 -145547 -173881 -405897 137306
10588 287617 -239288 -55383 -11242 127631 60248 -95641 -202831 340315 -66228 -117602 105680
$$ packed form
10667a39615h034j10819o9420c9976B1995b24234k13354a94384A99328b70512
10656c36609K1885b3882C1551c20745b0520j63371O6616q2376M5842j23521h8952
10644a40839j18491b6373k04342a2126F7928J22990R9706j31023a63526B9061
10633B32111f0780n9674k18681l7972B84547F3106a14868L7156j00808h4033m5217
10622a29250M357p1370B7691c19984J10548k6897j593c8957B74382a36104e544
10610D8523b72765f1369l00585a1747j64620H4175C7888c32220B8387L4930K91706
10599C55023A05676a32087j1366k18760I074b2785j22762k8334k32016A37306
10588B87617b39288e5383a1242A27631F0248i5641j07190C40315f6228n1374A05680
$$ plain form
10576 -29612 -268393 19767 65068 163846 -77326 -62099 366102 5396 -140304 184253 -244388
10564 188203 -280454 -16851 -79931 -65117 -173995 -185479 122144 -67157 -126410 -65126 -210034
10553 -210034 -98990 138233 113331 -645891 20526 88012 42823 -37562 24692 157819 -324086
10541 242701 -644 135059 272971 -112664 -203958 -33194 421921 -342589 -119799 148973
10530 -29388 -107141 -139401 48273 -1731 331926 -45078 366025 -10979 133296 41638 -13821
10518 -197233 -13646 -255987 258421 -273871 -50622 -348774 73013 31896 117838 54064 -42451
10506 127724 -138233 -146543 56084 79249 41392 14925 -120415 -217531 33958 319422 95510
10494 297832 -137854 170 -8102 111870 -126770 -61686 -46058 156997 96257 215103 -300410
$$ packed form
10576b9612k38781A9767M5301R8778g7326J5227C66102E396a40304A84253b44388
10564A88203b80454a6851o3080J4814j08878j1484A22144f7157n9253O1284j44908
10553b10034i8990A38233k4902f45891B0526O7486D2823c7562B4692J33127c24086
10541B42701f44A35059J37912a12664r1294c3194D21921c42589a19799A48973
10530b9388p7753l2260D8273a731C31926d5078C66025a0979A33296D1638a3821
10518a97233a3646k42341B58421b73871e0622k98152G3013C1896Q5942E4064d2451
10506A27724a38233q310E6084K3165l7857A4925a20415r7116C3958K85464I5510
10494B97832a37854A70h102A11870a26770f1686J5628A56997o0740J18846c00410
$$ plain form
10482 469687 130048 964300 74634 499250 280622 199386 241357 -69992 -102834 5447 -352652
10470 199991 98160 -121856 -125152 151856 -365952 194441 -235264 -7686 -67178 -87893 349836
10458 -137654 -29844 -172531 122839 212338 -81259 34072 -82293 -347275 22097 116766 -156803
10446 237823 205026 340078 8170 -20396 53817 -52788 254052 -200908 -7966 -31605 -37732
10435 -37732 -47923 -291122 -24243 30796 -596101 -59868 -134113 -102769 -64974 -145038 -363048
10424 -363048 3747 -241665 28078 -301812 147061 198283 -62772 165317 -170149 -242234 -389712
10413 -389712 -33038 -34025 52465 64600 -7581 191921 90008 251591 -263012 74690 71024 -238403
10400 3277 224904 -113382 11014 287932 -180849 -250704 381498 -8994 192904 17440 423291
$$ packed form
10482D69687A30048Q34252G4634M24616k18628q1236M1971f9992l2842E447c52652
10470A99991I8160a21856l296A51856c65952A94441b35264g686n9492k0715C49836
10458a37654b9844j42687A22839Q9499h1259C4072h2293k64982B2097R4669a56803
10446B37823l2797J35052H170b0396E3817e2788B54052b00908g966k3639o127
10435c7732j0191k43199b4243C0796e96101e9868p4245L1344L7795q0064k18010
10424c63048C747b41665B8078c01812A47061N1222f2772A65317a70149p2085j47478
10413c89712c3038r87E2465J2135g581A91921I0008J61583b63012G4690l666b38403
10400C277K21627a13382A1014K76918a80849o9855C81498h994A92904A7440M05851
$$ plain form
10389 423291 339443 67530 -52765 53920 332268 57298 327984 46910 -2132 216800 -125431
10377 106440 185596 -21884 248642 450814 369651 347510 -79475 175539 243756 160237 595939
10366 595939 831365 353281 493634 109757 147586 56794 260147 170202 41885 272066
10356 272066 -32612 -27289 249389 509282 274863 772822 740961 736207 448465 276732 450421
10345 450421 291481 119027 463790 449845 224877 135471 -32069 229661 141275 197291
10335 197291 297919 109209 242457 3293 195161 264499 -65366 -234271 -327693 762 71989
10324 71989 205805 239028 669652 -220632 681062 498254 -93331 -61676 121122 -135464
10313 323919 68598 -275470 132841 -126880 -137686 254163 -216253 70493 -47335 -363300
$$ packed form
10389D23291q3848F7530e2765E3920K78348E7298K70686D6910b132B16800a25431
10377A06440P9156b1884B48642K02172q1163k2141g9475A75539O8217q3519M35702
10366E95939K35426C53281J40353A09757L7829E6794K03353q9945D1885K30181
10356B72066c2612N323B49389K59893k34419M97959l1861m754k87742j71733J73689
10345D50421j58940A19027L44763j3945B24877q9406c2069B29661q8386N6016
10335A97291J00628A09209J33248C293J91868O9338f5366j68905r3422G62P1227
10324G1989J33816L3223M30624b20632F81062j82808i3331L1655A21122a35464
10313C23919F8598b75470A32841a26880j0806B54163b16253G0493d7335l15965
$$ plain form
10303 -363300 27730 103898 257519 194957 -34942 432091 -150191 -391628 226212 93756
10292 138337 1090 -205197 366566 -4199 -58202 56290 15689 121945 -46292 89333 78852
10281 78852 134577 118797 142075 22542 31736 -14590 89665 -132669 -139377 108747 -446893
10269 87116 -508769 55413 -186790 250062 149424 356378 -393795 358649 181692 169037
10259 169037 379321 35604 1700 10165 -60183 -59032 105766 63372 320642 18834 11865 -366866
10246 -14519 127867 -42286 109538 3194 255147 -166686 -1352 -32223 -202429 -381727 149680
10234 254319 26090 -174306 4507 -133824 56058 -211776 -248519 -112652 188414 42025 -21504
10222 203053 -31558 -28780 -414317 -48905 -266889 392399 139066 125456 -152929 -34111 18488
$$ packed form
10303c63300B7730P6168J53621o2562c4942D32091a50191k41437B26212I3756
10292A38337A090b05197C66566d199n4003E6290A5689J06256d6292H9333j0481
10281G8852N5725j5780K3278B2542R194a4590H9665a32669o708A08747d46893
10269H7116e08769E5413a86790B50062j00638K06954c93795C58649j76957j2655
10259A69037K10284C5604A700Q465f0183J151A05766m2394K57270A8834o969c66866
10246a4519A27867d2286A09538C194K51953a66686a352l0871j70206j79298A49680
10234B54319B6090a74306D507a33824E6058b11776l6743a12652A88414D2025b1504
10222B03053c1558K778l85537d8905k17984C92399A39066j3610a52929c4111A8488
$$ plain form
10210 65859 -145312 142758 103533 -79258 -45352 -165692 -67187 -81210 365698 -214191 -139986
10199 -139986 -35425 -304322 22478 -104705 -401653 -114325 -398144 28203 5377 -157349
10188 25973 -35044 -50901 -112620 -81150 12090 -249299 -43828 -162227 45714 -29386 -168654
10177 -168654 -347363 -154427 37069 -14209 223772 -5943 -278729 222053 -265838 -286938
10167 -286938 147354 270347 -223555 -127634 -26518 -148835 -363338 -105129 61252 -153833
10156 -85296 -177695 -163712 67896 -61523 -126867 -55010 192109 -143878 -147919 -113887 245224
10144 -9060 -45740 -488394 81672 -85027 17345 -163057 -19523 -68701 -50791 -102417 -190260
10133 -190260 15781 -138063 -228724 151322 -205533 -131515 -247270 321593 -133094 46752
$$ packed form
10210F5859a45312A42758l9225g9258L3906j20340f7187j4023C65698b14191P4205
10199a39986c5425k68897B2478a04705k96948a14325k83819B8203E377a57349
10188B5973c5044j5857o1719L1470A2090b49299d3828j18399D5714b9386j39268
10177a68654j78709a54427C7069a4209B23772e943k72786B22053b65838k1100
10167b86938A47354J22993b23555R5921b6518j22317k14503a05129F1252a53833
10156h5296r2399J3983F7896f1523o5344e5010A92109a43878m041L4032B45224
10144i060l6680m42654H1672h5027A7345a63057a9523m9178J7910n1626q7843
10133a90260A5781a38063r0661A51322b05533P4018j15755C21593a33094D6752
$$ plain form
10122 -147776 -54676 -276694 177123 -154373 113272 -347507 272236 96915 -181745 238001
10111 -106193 -21362 -265620 450855 -149395 -181173 -111043 85768 -43728 -235039 -79887 126286
10099 -15267 -379 175146 -54672 198112 -130801 18243 67799 202963 258680 -164724 1099
10087 -112088 195720 -160979 -230967 -223068 -70199 -185038 -188227 -252403 -15608 -172623 109438
10075 -335774 175978 -325735 -46206 -177261 -434247 -89775 -108258 -305594 298375 251422
10065 251422 -485389 53517 -104848 29857 454493 -146695 -322241 -32026 -92202 -18487
10054 -147752 295111 221945 -99160 74081 -475032 -231519 325598 -109221 -21580 148813
10043 245113 36220 -60243 -191743 -357144 14171 -163492 117720 -23422 -97396 211030
$$ packed form
10122a47776e4676k22018A77123a54373A13272c47507B72236I6915a81745B38001
10111a06193b1362k44258D50855a49395l1778P0130H5768d3728j91311g9887A26286
10099a5267c79A75146e4672A98112a30801A8243M9556J35164N5717a64724A099
10087a12088A95720a60979o9988P899g0199j14839l189o4176a5608j57015A09438
10075c35774A75978c25735d6206j31055k56986h9775j8483j97336B98375m6953
10065B51422d85389E3517a04848B9857M24636a46695j75546c2026o0176a8487
10054a47752B95111p3166i9160G4081d75032b31519C25598a09221b1580A48813
10043B45113C6220f0243j31500j65401A4171a63492A17720b3422p3974B11030
$$ plain form
10032 -174230 -75180 -140496 -53881 -328177 31990 98758 -100371 133035 223113 -80766 -135146
10021 -135146 -217846 -211744 -19140 134689 -194485 -145122 -51348 -307177 -26643 -36851 156272
10009 -384189 -2725 136603 -67948 -121267 -479445 81881 255906 -27358 -428558 -49983 -93772
9998 -93772 -209537 -176019 54545 -495089 84826 -387815 -176896 84061 -121033 19905 -35676
9986 149569 69628 -264825 -170533 -243014 -154163 13483 8746 -230393 -133850 38397 199573
9975 199573 468972 -48314 -126068 60100 -67394 64531 -188817 58570 -48140 -127878 -60577
9963 23172 -103613 -290235 -39127 -138033 -39534 -222544 -55247 161046 -365632 115772 -157429
9951 35503 152110 -296696 97437 257066 20079 -120469 21915 -68935 -69209 116729 231956
$$ packed form
10032a74230g5180o5316e3881k74296C1990O6768a00371A33035R0078h0766n4380
10021a35146q2700O102a9140A34689a94485M9363e1348k55829b6643j0208A56272
10009c84189b725A36603f7948n3319l58178H1881J74025b7358m01200d9983m3789
9998i3772j15765L3518E4545d95089H4826c87815a76896H4061a21033A9905c5676
9986A49569F9628b64825R4292p2481Q8851A3483m737b30393R6543C8397J61176
9975A99573K69399d8314p7754F0100f7394F4531a88817E8570d8140p9738f0577
9963B3172a03613j86622c9127r8906c9534j83010e5247A61046c65632A15772a57429
9951C5503J16607b96696I7437J59629B0079a20469B1915f8935k74A16729J15227
$$ plain form
9940 231956 -150740 150558 -142141 -310778 138841 -208677 -95371 -290220 -26053 110498
9929 -171523 160295 106290 -258815 93789 -55186 46654 -166781 -72063 -178371 -364890 -67549
9917 -43724 -90653 15587 -106793 11139 -98358 -280393 -128151 2282 -43711 -229474 -45262
9905 -97066 176828 -161408 -133662 105503 -29302 256214 87060 -149941 -291669 -150446
9895 -150446 -186643 19537 -249138 -41027 126317 -171510 -68103 -52478 -28853 14704 178608
9884 178608 -327235 -159729 -117679 -120135 -194614 -113757 96714 -66560 79637 21954 -65838
9872 253017 -278600 60134 -230076 -118194 308226 90616 -162504 73810 -100145 -163843
9862 -163843 172902 -87176 109497 -284446 -128857 -55136 69018 -177638 -314000 123002
$$ packed form
9940B31956a50740A50558a42141j68637A38841b08677i5371j94849b6053A10498
9929a71523A60295n4005b58815I3789e5186D6654a66781g2063j06308j86519f7549
9917d3724m6929A5587a06793A1139i8358j82035a28151B282d3711j85763d5262
9905i7066A76828a61408K7746A05503b9302B56214H7060a49941j41728J41223
9895a50446l6197A9537b49138d1027A26317a71510f8103J5625K3625A4704J63904
9884A78608c27235a59729M2050k456p4479Q0857I6714f6560G9637B1954f5838
9872B53017b78600F0134b30076J11882C08226I0616a62504G3810a00145o3698
9862a63843A72902h7176A09497b84446a28857e5136F9018a77638j36362A23002
$$ plain form
9851 -390358 -226363 -141648 58683 -498325 -174563 55075 191870 -329381 -284048 107748
9840 102577 -4353 12773 114044 -143880 -25876 -435919 183026 -98597 47766 -55018 -115000
9829 -115000 -347681 -102186 -373299 -177297 58094 173777 -280530 -368205 -203506 -238035
9819 -238035 138927 -70015 60155 -190873 316050 -43619 -162230 -293765 -149205 85209
9808 -46423 25644 -165650 254996 -19392 -348831 -342191 -108450 -42002 36977 -25539 116052
9796 -303938 5469 -28430 -339461 92847 178354 -235957 -349164 45715 25015 -188648 -99081
9785 -99081 153866 -186809 122686 74246 -170649 -291111 83445 -202260 -248532 28072 -294078
9773 -15715 -69845 42982 -173038 232859 124668 -61011 -233296 -91689 -184755 326260 -105702
$$ packed form
9851c90358J63995Q4715E8683d98325a74563E5075J36795c29381M5333A07748
9840A02577d353A2773J01271a43880b5876m10043A83026i8597D7766e5018n9982
9829a15000k32681a02186k71113a77297E8094J15683b80530q7675J64699l4529
9819b38035A38927g0015F0155a90873C16050d3619j18611j31535J44560H5209
9808d6423B5644a65650B54996a9392l29439O640a08450d2002C6977b5539A16052
9796c03938E469b8430l11031I2847Q5507b35957j13207D5715k0700a88648Q9567
9785i9081A53866a86809A22686m8440a70649j20462H3445b02260m6272B8072b94078
9773a5715n4130D2982a73038B32859j08191f1011j72285i1689r3066C26260a05702
$$ plain form
9761 -217967 -256984 -44198 -137257 -203706 -112297 -88107 -8268 -56905 -239803 252621 18875
9749 -221577 -27986 -81373 -101770 -70499 351892 -93346 -185622 278670 -116890 -27766 -295055
9738 -295055 -280445 -213314 239175 57040 238717 -31481 -66848 -75903 -79597 9822 -176542 -29004
9725 -358987 87898 -48701 -273951 78014 -222457 -130552 1280 -60427 79083 57663 9885 120525
9713 120525 -197271 -23567 -238816 -83157 -189689 85728 -62129 12613 263527 -216253 5777
9701 -110151 92342 -204228 -413419 -176758 -70646 -43119 -24131 190609 -246133 -61260 35493
9689 192930 -279372 11607 149755 -122978 264740 -282194 -191980 247892 56036 -16097
9678 -123113 147199 101531 248021 -387088 -203438 58768 -147738 -222379 289575 -177621
$$ packed form
9761b17967l9017d4198r3059o6449R1409K4190h268m8637j82898B52621A8875
9749b21577b7986n3387k0397L1271C51892i3346r2276B78670a16890b7766k67289
9738b95055J4610O7131B39175E7040J81677c1481l5367r055l694I822a76542b9004
9725c58987H7898d8701k25250G8014b22457R1905A280f0427G9083k1420I885J10640
9713A20525a97271b3567k15249h3157j06532H5728f2129A2613K50914b16253E777
9701a10151I2342b04228k09191a76758g0646K7527J8988A90609b46133f1260C5493
9689A92930b79372A1607J38148a22978B64740b82194R0214B47892E6036a6097
9678a23113A47199m5668J46490c87088J83650E8768a47738p4641B89575a77621
$$ plain form
9667 -119871 -78372 175022 -188556 -34234 102081 -48192 -228525 63463 -144310 -71644 -288888
9656 -288888 -119336 128983 -373026 49976 -192800 -72725 104443 26368 343744 -168392
9645 25413 -277386 153181 -103326 -84576 8912 136651 -156828 -57878 -375332 -41831 88139
9633 115636 265871 -160 -113655 -205269 5700 -86603 5406 -270725 -59723 -154224 -61834 -159478
9621 -159478 -36482 -256922 -213948 201819 91633 -324162 -100770 76468 -44532 -61759 -240408
9610 -240408 80537 -113417 -134118 55711 -140455 -119518 124993 -267253 -151984 -97733 427579
9598 -376037 -148437 235008 37525 -149185 -415690 27855 93001 -271571 -145125 -92244
9588 -92244 -347097 239191 -22759 -73893 243417 -490336 -59563 -40306 33914 170015 24481
$$ packed form
9667a19871M1499A75022a88556c4234A02081d8192j80333F3463a44310g1644k17244
9656b88888a19336A28983c73026D9976a92800g2725A04443B6368L17376a68392
9645B5413b77386A53181a03326J8750H912J27739a56828e7878l17454d1831H8139
9633A15636J50235a60j13495r1614E700h6603E406b70725e9723r4501f1834r7644
9621a59478c6482k20440M2974B01819I1633c24162a00770G6468d4532j7227j78649
9610b40408H0537a13417k0701E5711a40455K0937A24993b67253J15269N4251D27579
9598c76037a48437B35008C7525a49185k66505B7855O5146b71571J26446N2881
9588i2244k54853B39191b2759n1134B43417d90336e9563J9257C3914J36101B4481
$$ plain form
9576 -199118 -188 -215648 57516 -43261 -147972 -349342 -44256 -198086 -252853 119409 -41769
9564 -225170 -501620 -171777 -229685 -232372 -132978 -109518 -449715 135858 199251 63206 -162209
9552 137935 -224077 276962 -32784 -403160 -31571 212114 -249189 88982 -134251 190288
9541 -76770 -138312 269284 -79607 103581 182028 80907 -227849 -310897 -306753 -157779 -145075
9530 -145075 -167432 -113356 241511 -99909 -156543 277002 231667 108272 102216 23444 -303231
9518 141900 118631 56008 -84735 -172448 -149503 56795 127691 -426917 -140340 -72294 -220642
9507 -220642 -298894 -38977 30990 88920 17476 -38777 -2390 182219 -201534 138841 -358686
9495 -15776 -189699 231686 23334 -125035 -61826 -82051 -223362 -289103 -241259 -21753 -174906
$$ packed form
9576a99118a88k15460E7516d3261j04711k01370d4256j53830n4767A19409d1769
9564b25170k76450a71777n7908k687R9394K3460l40197A35858O3393F3206a62209
9552A37935b24077B76962c2784l70376c1571B12114b49189H8982a34251A90288
9541g6770o1542B69284g9607A03581P8447H0907b27849q3048M144J48974J2704
9530a45075k2357N4076B41511i9909n6634B77002m5335A08272o056B3444c03231
9518A41900k3269E6008h4735q7713K2945E6795P0896d26917a40340O8046j48348
9507b20642p8252c8977C0990N7930A7476c8777b390A82219b01534A38841c58686
9495a5776j73923B31686B3334a25035f1826k0225j41311o5741M7844b1753j53153
$$ plain form
9484 -174906 251639 -164761 -119776 116106 -225367 56034 -26794 62735 -41156 -13349 56182
9472 -278234 -232623 201627 131492 -151540 -80514 134161 -68489 -369674 110227 -88303 85775
9460 3063 -89707 10178 -248463 49838 -211692 -286571 36347 93761 -393602 -64228 -140048
9449 -140048 55664 403356 -225937 -204868 -171007 217042 101509 -259281 -29157 -152163
9439 -152163 147106 120186 101640 174222 7559 -296655 -9687 -244099 201721 39977 -87343
9427 35794 -114996 -178823 -137257 38425 -575512 -408149 49192 -29378 242623 -239961 -1420
9415 -72505 -88542 191502 -19195 -229190 160447 -20153 -170261 184249 -206724 77637 -179678
9403 -136514 -210545 87173 59510 -293064 -57534 -82926 39754 -191201 -329355 143388 107457
$$ packed form
9484a74906B51639a64761M4985A16106b25367E6034b6794F2735d1156a3349E6182
9472b78234M5611B01627p0135a51540P1026A34161f8489l01185A10227h8303H5775
9460C063h9707A0178b48463D9838b11692p4879C6347N7414c93602f4228p5820
9449a40048E5664L47692b25937K1069L3861B17042A01509b59281b9157j23006
9439a52163A47106k6920j8546P2582G559b96655i687k34412B01721C9977h7343
9427C5794a14996o3827M1566C8425e75512J67363D9192b9378B42623b39961a420
9415g2505j6037A91502a9195k09995A60447b0153j50108A84249b06724G7637a79678
9403a36514p4031H7173k7663b93064e7534k5392C9754a91201j38154A43388l5931
$$ plain form
9392 107457 -374557 66253 -85470 -96489 2830 -132224 -343488 -116556 -63528 -93388 -111491
9381 -111491 -266772 -226916 113547 -217589 -69218 91020 64883 -204757 82967 128857 -37832
9369 -25221 9504 -271862 -71210 179060 -322741 -74281 55865 -15655 -231426 -42883 -518692
9358 -518692 305309 12710 -76486 181078 -374209 -170926 -91410 -248340 111119 -320082
9347 -22586 63213 104656 33353 -153588 -198410 138872 28169 275164 180 -320937 -167896
9336 -167896 -313316 -306642 -113052 -337701 376210 218163 223943 37894 -50532 -137628 293745
9324 101177 -122212 328424 210927 -91825 -548861 -95735 -289965 7568 -130376 294611
9313 107548 -184297 85023 161322 90659 -234141 -334092 -314769 -8310 -151347 170901 8038
$$ packed form
9392A07457c74557F6253h5470j1019B830a32224k11264a16556N3028k9860j8103
9381a11491j55281L9856A13547b17589f9218I1020k6137b04757H2967M5890c7832
9369b5221I504b71862g1210A79060c22741g4281E5865a5655k15771d2883m75809
9358e18692C05309A2710g6486A81078c74209a70926P9516j56930A11119c20082
9347b2586F3213M1443C3353a53588m4822A38872B8169K46995A80c20937J53041
9336a67896j45420O674a13052k24649C76210j58047N780C7894e0532q7096B93745
9324A01177a22212C28424j17497i1825m57036i5735j94230G568a30376B94611
9313A07548a84297H5023P6299p0663b34141r9951J9323h310j43037A70901H038
$$ plain form
9301 154498 -77622 -5593 128846 -168456 224692 306811 -289016 17065 -143959 -9388 157810
9289 -55427 -25985 -80173 327 -10662 -195583 15221 -108826 36564 -269257 -281441 64125 154531
9277 154531 -381961 -30156 -110269 -18151 -44662 -33873 84652 374840 -155854 44932 154034
9266 154034 226776 57763 -78199 8397 -240246 -62039 -110621 165961 -181811 2934 -185698
9254 208780 -126401 -195651 -71262 166602 38347 -138938 -38725 31893 -638717 301234 -102560
9242 376328 97153 54658 14464 29026 -130095 -83534 -212064 -207365 -4806 -222734 285484
9230 -112654 -54640 -109994 30766 -37599 69424 -240838 108562 -182581 -211651 -231758 -363462
9219 -363462 -183893 84598 -58981 -318059 -334038 -125816 26423 -222743 47728 -146420 -163678
$$ packed form
9301A54498g7622e593A28846a68456B24692Q2119b89016A7065a43959i388A57810
9289e5427b5985n4188C27a0662j84921A5221a08826C6564b69257j2184F4125R0406
9277A54531c81961c0156q0113a8151k6511J0789H4652K90188a55854D4932J09102
9266A54034P2742E7763g8199H397b40246f2039m8582A65961a81811B934a85698
9254B08780a26401o9250g1262A66602C8347a38938c8725C1893f38717C01234a02560
9242C76328I7153m2495A4464J4562a30095M6561j28530M699d806k17928B85484
9230a12654e4640n5354C0766c7599F9424b40838A08562a82581k9070k0107j31704
9219c63462J79569H4598e8981k59078j5979a25816B6423b22743D7728a46420j7258
$$ plain form
9208 -163678 -196489 17310 -350178 170654 -13271 139409 -61833 12034 257838 -280749 -158463
9197 -158463 63293 121696 8516 -77475 225555 168324 47600 -25349 -98568 -43054 -164733
9186 -164733 -109814 -143662 5390 -122157 -120132 48147 -75818 46012 -103181 194295 -86752
9174 5704 -120313 -42055 -61976 94504 80930 12935 -155735 -162051 -45897 -82147 356030 -117976
9161 119854 -222315 -143037 246586 -12439 -66362 -209081 -38226 -51356 19481 -76715 79417
9149 -11031 -10373 23819 172953 -134049 -173200 220867 -187798 -267 -24309 58055 -441456 279167
9136 -303907 26524 199204 -177502 -135947 254298 -20059 325662 -174898 -78808 100504
9125 73204 -29641 -89775 -620176 -202694 -215044 -23201 -182549 -91166 -232975 -230646 -28709
$$ packed form
9208a63678l2811A7310c50178A70654a3271A39409f1833A2034K45804b80749J22286
9197a58463F3293N8403H516g7475B25555n7231D7600b5349p3219d3054j21679
9186a64733N4919l3848E390a22157K025D8147g5818D6012a03181A94295h6752
9174E704a20313d2055j9921I4504j3574A2935a55735o316d5897l6250C56030a17976
9161A19854b22315P9278B46586a2439n3923j42719c8226j3130A9481g6715G9417
9149a1031O58B3819J49134a34049l9151B20867a87798b67k4042E8055d41456B79167
9136c03907B6524J72680a77502M1555B54298b0059C25662a74898g8808A00504
9125G3204b9641o0134n30401b02694j2350b3201j59348i1166j41809K329b8709
$$ plain form
9113 40656 94440 -369053 61626 -37428 -245075 100028 -274866 -50320 -175258 79145 79781
9102 79781 -279143 189264 -35491 -309798 -151631 120603 225273 12733 -223002 151765
9091 -143582 -121832 -128906 65824 -65943 -234163 -18488 44078 -34315 -344121 -92123 -296616
9080 -296616 107586 -136427 175139 -40619 136552 5927 -107807 -197374 -256502 8641 29213
9069 29213 208798 187072 291895 -124955 -478567 -334463 -330329 148707 -73519 -185554 -160390
9058 -160390 128946 -94697 6225 -371111 -232929 207258 184690 41513 254160 -426220 -323705
9047 -323705 150331 -174660 -111847 -52118 221560 39832 244385 141109 48861 161088
9037 161088 40663 135988 -90552 -38474 -101298 -5680 51886 109305 -358899 -26523 -274506
$$ packed form
9113D0656N3784c69053F1626c7428k07647A00028b74866e0320j24938G9145O36
9102G9781b79143A89264c5491k74307a51631A20603J04670A2733b23002A51765
9091a43582K1750p074F5824f5943j68220a8488D4078c4315l09806i2123k04493
9080b96616A07586a36427A75139d0619A36552E927a07807q9567n9128H641K0572
9069B9213J79585k1726J04823a24955l53612J44104M134A48707g3519j12035K5164
9058a60390A28946i4697F225c71111J38182B07258k2568D1513K12647d26220J02515
9047c23705A50331a74660O2813e2118B21560C9832K04553j03276D8861J12227
9037A61088D0663R5325i0552c8474o2824e680E1886N7419c58899b6523k47983
$$ plain form
9026 -274506 109539 -94141 28369 203897 131434 -266819 -325118 197705 -132784 -375041
9016 -375041 -151871 -144025 -209048 -194714 -565374 -193037 30427 -173140 97972 302521 -140091
9004 -370760 -173101 -213265 76837 -168398 -236811 237898 5981 -353514 -93044 268126 39283
8992 43688 -130755 -235822 -188388 -101737 41919 -95270 -149707 -38870 18098 -80674 -332304
8981 -332304 -218810 152857 116086 -330894 -42257 -115894 -32594 -319506 -281221 -2452 196749
8969 -222253 -74445 115126 -40950 -15175 302065 -156478 -77200 -244902 -301009 -90073 -62346
8958 -62346 -34343 9553 159232 -177262 -58159 122710 -147000 -116501 -281168 91107 53433
8947 53433 -333351 73932 98797 -343594 -41015 -8679 72983 273998 315230 157951 -114222
$$ packed form
9026b74506A09539i4141B8369J75528p2463b66819n8299A97705a32784k42257
9016c75041a51871P846o5023J4334l70660a93037C0427a73140I7972K04549a40091
9004c70760a73101m0164G6837a68398o8413B37898E981c53514i3044B68126C9283
8992D3688a30755j05067M7434Q6651D1919i5270n4437c8870A8098h0674k51630
8981c32304J13494A52857l6771c30894d2257p3637c2594k86912L8285b452A96749
8969b22253g4445A15126d0950a5175C02065a56478g7200j67702n6107i0073K7727
8958f2346K8003I553J49679a77262e8159A22710a47000L0499j64667I1107l7674
8947E3433c33351G3932K4865c43594d1015h679G2983K01015M1232j57279a14222
$$ plain form
8935 138393 629482 127094 23280 144915 27892 -77757 -78289 -258886 313759 335865 325140
8924 325140 1296202 3853565 8938393 10418317 2273753 876856 208640 315258 98316
8914 133531 18687 121119 -101431 90937 -78158 195406 -37720 1357 -209533 -578 146838
8902 190195 -77750 -297165 -131244 -240865 48328 30832 4177 -4675 -122124 125518 -442826
8890 -153517 206326 -275405 -174272 98099 31092 -77184 195139 -156556 -187658 -216970 -185962
$$ packed form
8935A38393M91089A27094B3280J21635B7892g7757n32j80597C13759K2106j0725
8924C25140R71062K557363N084828J479924B273753H76856B08640J06618I8316
8914A33531A8687J02432a01431I0937g8158A95406c7720A357b09533e78A46838
8902A90195g7750k19415a31244j09621D8328j7496D177d675j17449A25518d42826
8890a53517B06326b75405J01133I8099C1092g7184A95139a56556l1102k9312L1008
$$ [...]
##END NTUPLES=NMR SPECTRUM
##END=
