
##TITLE=AC1233_PERAH12114_6519287_kQ2xMY586G
##JCAMPDX= 6.0         $$ Bruker NMR JCAMP-DX V2.0
##DATA TYPE= NMR SPECTRUM
##DATA CLASS= NTUPLES
##ORIGIN= BRUKER
##OWNER= Administrator
$$ 1.72 TOPSPIN		Version 2.1
$$ 2012-07-13 15:20:34.531 -0500  Administrator@TOPSPIN
$$ Compression mode = diff/dup
##.OBSERVE FREQUENCY= 400.02188249412
##.OBSERVE NUCLEUS= ^1H
##.ACQUISITION MODE= SIMULTANEOUS (DQD)
##.ACQUISITION SCHEME= undefined
##.AVERAGES= 64
##.DIGITISER RES= 22
##SPECTROMETER/DATA SYSTEM= spect
##.PULSE SEQUENCE= noesygpps1d.comp
##.SOLVENT NAME= COFFEE_meoh
##.SHIFT REFERENCE= INTERNAL, COFFEE_meoh, 1, 14.96091
##AUDIT TRAIL= $$ (NUMBER, WHEN, WHO, WHERE, PROCESS, VERSION, WHAT)
$$ ##TITLE= Audit trail, TOPSPIN		Version 2.1
$$ ##JCAMPDX= 5.01
$$ ##ORIGIN= Bruker BioSpin GmbH
$$ ##OWNER= Administrator
$$ $$ C:\Bruker\TOPSPIN/data/COFFEE/nmr/AC1233_PERAH12114_6519287_kQ2xMY586G/22/pdata/1/auditp.txt
$$ ##AUDIT TRAIL=  $$ (NUMBER, WHEN, WHO, WHERE, PROCESS, VERSION, WHAT)
(   1,<2012-07-13 15:20:29.578 -0500>,<Administrator>,<TOPSPIN>,<go>,<TOPSPIN 2.1>,
      <created by zg
	started at 2012-07-13 15:08:59.375 -0500,
	POWCHK enabled, PULCHK disabled,
       configuration hash MD5:
       6B 1B 68 BB D9 2E 58 E2 7F 35 AD 54 07 DF 0E 41
       data hash MD5: 64K
       C0 44 3C 0F B7 19 D0 AD DE 0C C3 C0 F7 7F 9A 7B>)
(   2,<2012-07-13 15:20:32.593 -0500>,<Administrator>,<TOPSPIN>,<proc1d>,<TOPSPIN 2.1>,
      <Start of raw data processing
       efp LB = 0.3 FT_mod = 6 PKNL = 1 PHC0 = 0 PHC1 = 0 SI = 128K 
       data hash MD5: 128K
       17 5D 6C 1F A7 B3 3E 22 A4 FE E4 00 6E 5C B0 AE>)
(   3,<2012-07-13 15:20:33.703 -0500>,<Administrator>,<TOPSPIN>,<proc1d>,<TOPSPIN 2.1>,
      <pk PHC0 = -2.351074 PHC1 = 0 
       data hash MD5: 128K
       67 37 95 27 48 7A 06 D9 8F 96 64 96 3F 5D 95 4B>)
(   4,<2012-07-13 15:20:34.203 -0500>,<Administrator>,<TOPSPIN>,<proc1d>,<TOPSPIN 2.1>,
      <abs ABSG = 1 
       data hash MD5: 128K
       1B 59 BD DA 93 13 8B A6 5E DC 1E 03 BF 50 DB BE>)
(   5,<2012-07-13 15:20:34.281 -0500>,<Administrator>,<TOPSPIN>,<proc1d>,<TOPSPIN 2.1>,
      <abs ABSG = 2 
       data hash MD5: 128K
       80 D4 F0 81 E3 DB 20 AD 26 1E 9B 65 CF 98 2E 29>)
(   6,<2012-07-13 15:20:34.328 -0500>,<Administrator>,<TOPSPIN>,<proc1d>,<TOPSPIN 2.1>,
      <abs ABSG = 3 
       data hash MD5: 128K
       F0 B4 45 55 40 C1 AF 63 C3 25 AF A0 92 B1 FF D4>)
(   7,<2012-07-13 15:20:34.390 -0500>,<Administrator>,<TOPSPIN>,<proc1d>,<TOPSPIN 2.1>,
      <abs ABSG = 4 
       data hash MD5: 128K
       A3 23 C0 A6 15 AA 17 15 EC B2 E2 1F 64 B8 C9 A3>)
(   8,<2012-07-13 15:20:34.437 -0500>,<Administrator>,<TOPSPIN>,<proc1d>,<TOPSPIN 2.1>,
      <abs ABSG = 5 
       data hash MD5: 128K
       02 EE 05 F3 C1 0C 6E 67 3C AC 09 0A 15 39 89 15>)
$$ ##END=
$$ 
$$ $$ hash MD5
$$ $$ 16 D9 E4 D0 AF CE 11 BE 98 40 55 B1 AD 1B 2D BE
##$RELAX= 
##$RELAX= 
##$RELAX= 
##$RELAX= 
##$RELAX= 
##$RELAX= 
##$RELAX= 
##$RELAX= 
##$RELAX= 
$$ [...]
##$TP07= 0
##$TPNAME0= <>
##$TPNAME1= <>
##$TPNAME2= <>
##$TPNAME3= <>
##$TPNAME4= <>
##$TPNAME5= <>
##$TPNAME6= <>
##$TPNAME7= <>
##$TPOAL= (0..7)
0.5 0.5 0.5 0.5 0.5 0.5 0.5 0.5
##$TPOFFS= (0..7)
0 0 0 0 0 0 0 0
##$TUNHIN= 0
##$TUNHOUT= 0
##$TUNXOUT= 0
##$USERA1= <user>
##$USERA2= <user>
##$USERA3= <user>
##$USERA4= <user>
##$USERA5= <user>
##$V9= 5
##$VALIST= <valist>
##$VCLIST= <CCCCCCCCCCCCCCC>
##$VD= 0
##$VDLIST= <DDDDDDDDDDDDDDD>
##$VPLIST= <PPPPPPPPPPPPPPP>
##$VTLIST= <TTTTTTTTTTTTTTT>
##$WBST= 2048
##$WBSW= 25
##$XGAIN= (0..3)
0 0 0 0
##$XL= 0
##$YL= 0
##$YMAX_a= 11707191
##$YMIN_a= -9551253
##$ZGOPTNS= <>
##$ZL1= 120
##$ZL2= 120
##$ZL3= 120
##$ZL4= 120
##$ABSF1= 14.96091
##$ABSF2= -5.597272
##$ABSG= 5
##$ABSL= 3
##$ALPHA= 0
##$AQORDER= 0
##$ASSFAC= 0
##$ASSFACI= 0
##$ASSFACX= 0
##$ASSWID= 0
##$AUNMP= <proc_prof1d_extract.lims>
##$AXLEFT= 0
##$AXNAME= <>
##$AXNUC= <1H>
##$AXRIGHT= 0
##$AXTYPE= 0
##$AXUNIT= <>
##$AZFE= 0.1
##$AZFW= 0.1
##$BCFW= 0
##$BC_mod= 0
##$BYTORDP= 0
##$COROFFS= 0
##$CY= 15
##$DATMOD= 1
##$DC= 0
##$DFILT= <>
##$DTYPP= 0
##$F1P= 0
##$F2P= 0
##$FCOR= 0.5
##$FTSIZE= 131072
##$FT_mod= 6
##$GAMMA= 0
##$GB= 0
##$INTBC= 1
##$INTSCL= 1
##$ISEN= 128
##$LB= 0.3
##$LEV0= 0
##$LPBIN= 0
##$MAXI= 10000
##$MC2= 0
##$MEAN= 0
##$ME_mod= 0
##$MI= 0
##$NCOEF= 0
##$NC_proc= -2
##$NLEV= 6
##$NOISF1= 0
##$NOISF2= 0
##$NSP= 0
##$NTH_PI= 0
##$NZP= 0
##$OFFSET= 14.96091
##$PC= 1
##$PHC0= -2.351074
##$PHC1= 0
##$PH_mod= 1
##$PKNL= yes
##$PPARMOD= 0
##$PPDIAG= 0
##$PPIPTYP= 0
##$PPMPNUM= 2147483647
##$PPRESOL= 1
##$PSCAL= 4
##$PSIGN= 0
##$PYNMP= <proc.py>
##$REVERSE= no
##$SF= 400.020009674967
##$SI= 131072
##$SIGF1= 0
##$SIGF2= 0
##$SINO= 400
##$SIOLD= 131072
##$SPECTYP= <>
##$SREGLST= <1H.CDCl3>
##$SSB= 0
##$STSI= 131072
##$STSR= 0
##$SW_p= 8223.68421052631
##$SYMM= 0
##$S_DEV= 0
##$TDeff= 65536
##$TDoff= 0
##$TI= <>
##$TILT= no
##$TM1= 0
##$TM2= 0
##$TOPLEV= 0
##$USERP1= <user>
##$USERP2= <user>
##$USERP3= <user>
##$USERP4= <user>
##$USERP5= <user>
##$WDW= 1
##$XDIM= 131072
##$YMAX_p= 419566131
##$YMIN_p= -12412
##$CURPLOT= <Network HP LaserJet P1505>
##$CURPRIN= <$Network HP LaserJet P1505>
##$DFORMAT= <normdp>
##$LAYOUT= <+/1D_H.xwp>
##$LFORMAT= <normlp>
##$PFORMAT= <normpl>
##$SURQMSG= 1
$$ End of Bruker specific parameters
$$ ---------------------------------
##NTUPLES= NMR SPECTRUM
##VAR_NAME=  FREQUENCY,     SPECTRUM/REAL,   SPECTRUM/IMAG
##SYMBOL=    X,             R,               I
##VAR_TYPE=  INDEPENDENT,   DEPENDENT,       DEPENDENT
##VAR_FORM=  AFFN,          ASDF,            ASDF
##VAR_DIM=   131072,        131072,          131072
##UNITS=     HZ,            ARBITRARY UNITS, ARBITRARY UNITS
##FACTOR=    0.0627417313425164, 1,          1
##FIRST=     8223.62146879497, 3718,         -63082
##LAST=      0,             5007,            -62604
##MIN=       0,             -12412,          0
##MAX=       8223.62146879497, 419566131,    0
$$ Real data points
##PAGE= N=1
##DATA TABLE= (X++(R..R)), XYDATA
$$ [...]
61621D30107j250j922k491k487k092j708j455j188p80k97o8n19j707l087l976
61606D05080m196m102m034m077m236m516m824n032n047m730l962l060k751l244
61592C47269l712l343k547k274k467k257j687j881l146m187l901k882k291k134
61578C08560j749j310j527k201k348j795j481j981k666k658j937j039l09J54K68
61563B85981P9p3J05N65J082J550J884J826J159Q5p32o97M7O23L42m20o18J11
61545B92899R92J212R36Q03R41J066J190J512J819J728J388J298J422J268P73
61530C11247M42N06O47O81P88R17O57rn46p30r95j564j924j639j105r43j180j481
61512C03769j767j979j715p86K23O19N24N28O50M32j60o72r79j355j728j639j136
$$ plain form
61621 430107 428857 426935 424444 421957 419865 418157 416702 415514 414734 414437 414369 413850 412143 409056 405080
61606 405080 400884 396782 392748 388671 384435 379919 375095 370063 365016 360286 356324 353264 350513 347269
61592 347269 343557 340214 337667 335393 332926 330669 328982 327101 323955 319768 315867 312985 310694 308560
61578 308560 306811 305501 303974 301773 299425 297630 296149 294168 291502 288844 286907 285868 285559 285713 285981
61563 285981 286060 285987 286092 286657 287739 289289 291173 292999 294158 294243 293511 292814 292861 293484 293826 293406 292788 292899
61545 292899 293891 295103 296039 296842 297783 298849 300039 301551 303370 305098 306486 307784 309206 310474 311247
61530 311247 311689 312195 312842 313523 314311 315228 315885 315876 315330 314600 313605 312041 310117 308478 307373 306430 305250 303769
61512 303769 302002 300023 298308 297522 297745 298364 298888 299416 300066 300498 300338 299666 298687 297332 295604 293965 292829
61495B92829r34j310j567j056j66K96L19N52J197J699J614J189Q62O47K87k17
61479B96241n51m66K3P50J568K338K930L190K957K210J267O57N59N41J14n58q57
61462C12913o44m23n13n28r4L60J06p74j355r84N6J021J467J428J205J160J425
61445C15826J741J792J727J940K365K396J757R58O53Q78J181J272J182J097J322
61430C38087K165L483M433M136K571O01p94j179p36lM58M59L39O12J465K570L260
61413C61927K998J883P87O40J356J896J519O27k3m22j084j993k549k522k386k524
61397C60130k664k331j518o38n5O4k56p47r66o55mM94M11k09p22l92P19J604J471
61378C53736Q27P98J518J966J537R19R94J596J956J853J602J313R22P22J022J394
$$ plain form
61495 292829 291895 290585 289018 287962 287796 288092 288411 288963 290160 291859 293473 294662 295524 296171 296458 296241
61479 296241 295690 295224 295247 295997 297565 299903 302833 306023 308980 311190 312457 313114 313673 314214 314328 313770 312913
61462 312913 312269 311846 311333 310805 310711 311071 311177 310403 309048 308064 308120 309141 310608 312036 313241 314401 315826
61445 315826 317567 319359 321086 323026 325391 327787 329544 330502 331155 332033 333214 334486 335668 336765 338087
61430 338087 340252 343735 348168 352304 354875 355476 354682 353503 352767 352764 353222 353681 354020 354632 356097 358667 361927
61413 361927 364925 366808 367595 368235 369591 371487 373006 373633 373610 373188 372104 370111 367562 365040 362654 360130
61397 360130 357466 355135 353617 352979 352924 352988 352732 351985 351019 350364 350360 350854 351265 351056 350334 349942 350661 352265 353736
61378 353736 354563 355361 356879 358845 360382 361301 362295 363891 365847 367700 369302 370615 371537 372259 373281 374675
61362C74675J079J91l03O7O56Q76J128K015L175L696L440L213L669M618N505O104
61346D13804O579P137P790Q257Q129P283O082M981M081L387L171L640M321M491
61332D93133M212M184M406L818J868l51j262p36o0k55j225k417l466l984l548
61317D94317k246q31M1L93O41J119K027L368M763N762O538P771R539J0948J1294
61302E55444J1144J1566J2630J3361J2990J1580R469O806L900J390l47j673l244
61289F45016n245p197q410q588q163q062q820r883j0097r059p541o429n647m633
61275E37242l420k600k330k089j506p52R4J354K934L915L624K775K601L143L380
61260E48365L035L134M359N896O632O734P103P781P964P361O571O055N540M650
$$ plain form
61362 374675 375754 375945 375642 375709 376365 377241 378369 380384 383559 387255 390695 393908 397577 402195 407700 413804
61346 413804 420383 427520 435310 443567 451696 458979 465061 470042 474123 477510 480681 484321 488642 493133
61332 493133 497345 501529 505935 509753 511621 511270 510008 509272 509212 508957 507732 505315 501849 497865 494317
61317 494317 492071 491240 491281 491674 492315 493434 495461 498829 503592 509354 515892 523663 533202 544150 555444
61302 555444 566588 578154 590784 604145 617135 628715 638184 644990 648890 650280 649933 648260 645016
61289 645016 639771 632574 624164 615576 607413 599351 590531 580648 570551 561492 553951 547522 541875 537242
61275 537242 533822 531222 528892 526803 525297 524545 524639 525993 528927 532842 536466 539241 541842 544985 548365
61260 548365 551400 554534 558893 564789 571421 578155 585258 593039 601003 608364 614935 620990 626530 631180
61246F31180L474K328J388O57q9j274k914m220m355l549k770k413k154j964k252
61231F11073k810k760j928j240j183r13L81K171L523M577N978P476Q206Q067P715
61216F48333P446O957O248N753N616N570N531N652N775N471M619L417J987N54
61202G18929k88j79L10M13L89J092K565M046N350P101R452J1664J3256J4487J5400
61187H03987J5372J4236J2789J1540R855P151M197K258J400N71q82k578l777m092
61173H72027l637l086l398m861o548p259o941o644p114q061q878r511j0285j1299
61159G74505j2290j2993j3385j3569j3560j3258j2580j1614j0535r445q260o813
61147F36203n011l063j512q50r14j067j135j812l610n857p398q031q416q655p965
$$ plain form
61246 631180 634654 636982 638370 639027 638938 637664 634750 630530 626175 622626 619856 617443 615289 613325 611073
61231 611073 608263 605503 603575 602335 601152 600239 600620 602791 606314 610891 616869 624345 632551 640618 648333
61216 648333 655779 662736 668984 674737 680353 685923 691454 697106 702881 708352 712971 716388 718375 718929
61202 718929 718641 718462 718772 719185 719574 720666 723231 727277 732627 739728 749180 760844 774100 788587 803987
61187 803987 819359 833595 846384 857924 867779 874930 879127 881385 882785 883356 882474 879896 876119 872027
61173 872027 868390 865304 861906 857045 850497 843238 836297 829653 822539 814478 805600 796089 785804 774505
61159 774505 762215 749222 735837 722268 708708 695450 682870 671256 660721 651276 643016 636203
61147 636203 631192 628129 626617 625767 624853 623786 622651 620839 617229 611372 603974 595943 587527 578872 570907
61132E70907o011l582j562M9J519K582K970L173L948N325O802Q195R700J1299
61118F15314J2801J4392J6499J9007K1156K2423K3171K4156K5538K6666K6861
61107H47984K6232K5506K5030K4354K3045K1489K0331J9418J7956J5624J2754
61096A079723R482N641J525k187n486r046j2870j5958j7868j9544k1817k4027
61084I67568k5047k4884k4295k3498k2372k1325k0786k0201j8769j6927j5880
61073G33584j5724j5200j3495j1293r690q886q285p285n716l898k446j727j512
61060F28427j313q56M5J633L672N290N957O251O954P889Q449Q828R693J1047J2388
61045G14354J3773J5606J7604J9075K0109K1406K3013K4378K5600K7368K9617
$$ plain form
61132 570907 564896 561314 559752 559801 561320 563902 566872 570045 573993 579318 586120 594315 604015 615314
61118 615314 628115 642507 659006 678013 699169 721592 744763 768919 794457 821123 847984
61107 847984 874216 899722 924752 949106 972151 993640 1013971 1033389 1051345 1066969 1079723
61096 1079723 1089205 1094846 1096371 1094184 1088698 1079652 1066782 1050824 1032956 1013412 991595 967568
61084 967568 942521 917637 893342 869844 847472 826147 805361 785160 766391 749464 733584
61073 733584 717860 702660 689165 677872 668182 659296 651011 643726 638010 634112 631666 629939 628427
61060 628427 627114 626258 626303 627936 631608 636898 642855 649106 656060 663949 672398 681226 690919 701966 714354
61045 714354 728127 743733 761337 780412 800521 821927 844940 869318 894918 922286 951903
61034I51903L1446L2651L4155L6665L9818M2871M5264M6584M6987M7605M9318
61023A405267N1233N1874N1790N3253N7123O2026O7038P3240Q1645R1550J02055
61012B148094J13635J27165J43109J62970J89718K25324K69527L22616L87543
61003D089701M67586N64363O81222Q26750J010527J234041J485999J742340J964416
60994A4066945K098014K084991J888845J517583J027995N12357P6388j89806k46768
60985B2836544j30739N4606J82682J57080n9359m45822r37395j438878j845628
60976A8373091k078319k115234j994757j783925j541031j300594j080123q88971
60968E590137p29689n98590m90472m02328l31986k76008k31001j95301j67819
$$ plain form
61034 951903 983349 1016000 1050155 1086820 1126638 1169509 1214773 1261357 1308344 1355949 1405267
61023 1405267 1456500 1508374 1560164 1613417 1670540 1732566 1799604 1872844 1954489 2046039 2148094
61012 2148094 2261729 2388894 2532003 2694973 2884691 3110015 3379542 3702158 4089701
61003 4089701 4557287 5121650 5802872 6629622 7640149 8874190 10360189 12102529 14066945
60994 14066945 16164959 18249950 20138795 21656378 22684373 23196730 23273118 23083312 22836544
60985 22836544 22705805 22760411 22943093 23100173 23040814 22594992 21657597 20218719 18373091
60976 18373091 16294772 14179538 12184781 10400856 8859825 7559231 6479108 5590137
60968 5590137 4860448 4261858 3771386 3369058 3037072 2761064 2530063 2334762 2166943
60959B166943j46525j29475j15990j05473r6156q6353p6007o5901n6309m7582
60949A241172m0899l6916l4497l2172l0081k9108k8834k7940k6171k4348k2701
60938I07505k0703j8483j6994j6625j6734j6591j5929j4651j3025j1980j2136
60927G33654j2687j2293j0999j0063r994j0018r595r115q782q077o797n579m884
60914F14771m372l768l439l515l342k427j183j84O79J711K784L728M717N762O429
60899F18351O673P250Q639J0138J0853J0974J1261J1766J1972J1909J2108J2618
60887G44512J2943J3001J3302J4078J4908J5365J5445J5242J4769J4232J4010
60876I01807J4123J4202J4074J3949J3839J3243J1731R541P303N419L838K258
$$ plain form
60959 2166943 2020418 1890943 1774953 1669480 1573324 1486971 1410964 1345063 1288754 1241172
60949 1241172 1200273 1163357 1128860 1096688 1066607 1037499 1008665 980725 954554 930206 907505
60938 907505 886802 868319 851325 834700 817966 801375 785446 770795 757770 745790 733654
60927 733654 720967 708674 697675 687612 677618 667600 658005 648890 640108 632031 625234 619655 614771
60914 614771 610399 606631 603192 599677 596335 593908 592725 592541 593220 594931 597715 601443 606160 611922 618351
60899 618351 625024 632274 640913 651051 661904 672878 684139 695905 707877 719786 731894 744512
60887 744512 757455 770456 783758 797836 812744 828109 843554 858796 873565 887797 901807
60876 901807 915930 930132 944206 958155 971994 985237 996968 1006509 1013812 1019231 1023069 1025327
60864A025327L43k057m715p158r088j0552j1649j2363j2729j3063j3790j5113
60852I13393j6873j8558j9490j9230j8033j6725j6069j6203j6636j6714j6135
60841G22727j5233j4747j5053j5651j5678j5011j4468j4708j5306j5271j4314
60830E57287j3110j2349j1930j1275j0142q788p497o300n230m509m222m002l403
60817D54530k586k256k691l237l112k413j865j602r24N11J868K020R84o4k30K51
60801D39184O63P76Q10Q68R04J075J544J908J376j81j795k378j899j202r22j013
60785D39718j228j440j541j499j635k203k683k243j156q85k143l712m022l296
60771D10032l003l585m023l647l006k661k294j642j229j427j651j326r60j298
$$ plain form
60864 1025327 1025670 1023613 1018898 1011740 1002652 992100 980451 968088 955359 942296 928506 913393
60852 913393 896520 877962 858472 839242 821209 804484 788415 772212 755576 738862 722727
60841 722727 707494 692747 677694 662043 646365 631354 616886 602178 586872 571601 557287
60830 557287 544177 531828 519898 508623 498481 489693 482196 475896 470666 466157 461935 457933 454530
60817 454530 451944 449688 446997 443760 440648 438235 436370 434768 433844 434355 436223 438243 439227 439163 438933 439184
60801 439184 439847 440623 441433 442301 443205 444280 445824 447732 449108 448927 447132 444754 442855 441653 440731 439718
60785 439718 438490 437050 435509 434010 432375 430172 427489 425246 424090 423205 421062 417350 413328 410032
60771 410032 407029 403444 399421 395774 392768 390107 387813 386171 384942 383515 381864 380538 379578 378280
60757C78280j986k096j535r38m37L57J220J358P34L20P09J347J575J617J986K576
60741C85087K975L204L495L641L154J965M76r45k135k964l335l353l225l056k863
60726C82121k709k672k842l329m016m315l678k499j930k480l320l451l030k905
60712C38945l237l436l216k918k766k552k151j723j256n38K57N79L23M5P7Pn60
60695C15880j227j300p28p9K20K19J98L81Q22J289J374R98O64R41J843K884L568
60678C27947L661L290K962L189L851M195L834L316L310L660L849L976M473M986
60664C80499M562L065J493O74L78J81K98R30J429J033Q4l50RL56Q1l97l62K67
60646C94230J102J932K661K902K172O32q41j522j612j937k931m182n003n226n186
$$ plain form
60757 378280 376294 374198 372663 371725 371288 371645 372865 374223 374957 375277 375986 377333 378908 380525 382511 385087
60741 385087 388062 391266 394761 398402 401556 403521 403997 403052 400917 397953 394618 391265 388040 384984 382121
60726 382121 379412 376740 373898 370569 366553 362238 358560 356061 354131 351651 348331 344880 341850 338945
60712 338945 335708 332272 329056 326138 323372 320820 318669 316946 315690 315152 315409 315988 316311 316356 316433 316440 315880
60695 315880 314653 313353 312625 312546 312766 312985 313183 313564 314386 315675 317049 318047 318711 319652 321495 324379 327947
60678 327947 331608 334898 337860 341049 344900 349095 352929 356245 359555 363215 367064 371040 375513 380499
60664 380499 385061 388126 389619 390293 390671 390852 391150 392080 393509 394542 394626 394276 394285 394641 394722 394325 393963 394230
60646 394230 395332 397264 399925 402827 404999 405631 404790 403268 401656 399719 396788 392606 387603 382377 377191
60631C77191n127m964m617m147l487k411j115l54n87j172r65K67J530J741Q09
60616C52592n04j395j501j001n02n66j076j271o46L64Q96O75K14J00L95Q00J088
60599C48662J238J302J353J518J945K556K904K477J391N25O08J287J548J085O60
60584C71059Q39J037L60j022k065k191j736j115k73Q56J953K751L420M221N083
60569C83177N838O579P536Q720R939J0951J1479J1328J0662R880R026P595N213
60556D97923K213p61l444n814p458p762o736n204l910k749j121J131L449N136
60542D64893O054O668P524Q766J0193J1625J2981J4054J4524J4317J3623J2368
60530E97590J0045O461K431p64k681l989n420o826p512p138o042m879m132l902
$$ plain form
60631 377191 372064 367100 362483 358336 354849 352438 351323 350969 350382 349210 348245 348512 350042 351783 352592
60616 352592 352088 350693 349192 348191 347689 347123 346047 344776 344130 344494 345390 346065 346279 346379 346774 347574 348662
60599 348662 349900 351202 352555 354073 356018 358574 361478 363955 365346 365871 366479 367766 369314 370399 371059
60584 371059 371898 372935 373295 372273 370208 368017 366281 365166 364893 365749 367702 370453 373873 378094 383177
60569 383177 389015 395594 403130 411850 421789 432740 444219 455547 466209 476089 485115 492710 497923
60556 497923 500136 499375 495931 490117 482659 474897 468161 462957 459047 456298 455177 456308 459757 464893
60542 464893 470947 477615 485139 493905 504098 515723 528704 542758 557282 571599 585222 597590
60530 597590 607635 614096 616527 615763 613082 609093 603673 596847 589335 582197 576155 571276 567144 563242
60516E63242l939l891l545k862j834n16Q21J845K479K886L153L313L743N070P419
60501E77384J0078J2362J4507J7373K1388K6179L1138L5795L9683M2389M4019
60490H72295M5148M5894M5301M2095L5925K7546J7821O992m861j7063k8368l7747
60478A050978m4875m9817n2518n2827n0948m7513m3131l8069l2629k7612k3886
60467E87153k1411j9130j6203j3047j0702r434q556p609o983p076p470p466o984
60454D45082o346n481m148k763k193k546k889k514j850j669j973k189k161k230
60440D04130k467k448j897j085m63k24l12n78p91p66n84n62q46j189j158n57L24
60423C88527Q57O04j63o16k55N30J002R92R08J030J178J128R44Q12Q19R57J115
$$ plain form
60516 563242 559303 555412 551867 549005 547171 546655 547476 549321 551800 554686 557839 561152 564895 569965 577384
60501 577384 587462 599824 614331 631704 653092 679271 710409 746204 785887 828276 872295
60490 872295 917443 963337 1008638 1050733 1086658 1114204 1132025 1139017 1134156 1117093 1088725 1050978
60478 1050978 1006103 956286 903768 850941 799993 752480 709349 671280 638651 611039 587153
60467 587153 565742 546612 530409 517362 506660 497226 488670 481061 474078 467002 459532 452066 445082
60454 445082 438736 433255 429107 426344 424151 421605 418716 416202 414352 412683 410710 408521 406360 404130
60440 404130 401663 399215 397318 396233 395770 395546 395234 394656 393865 393099 392515 391953 391107 389918 388760 388203 388527
60423 388527 389384 389988 389825 389209 388954 389484 390486 391478 392386 393416 394594 395722 396666 397478 398297 399254 400369
60406D00369J056P35M97O48R09P92M82O55J399J961J899J745K059K439K151J361
60390D21157R19J142J502J585J580J721J797J620J523J979K868L519L476K989
60376D49377K686K871L277L491L436L295L144K903K662K618K700K558K103J658
60362D88779J409J111O32L68O78J235J505J531J783K371L033L729M635N648O496
60347E24943P288Q271R046Q883P868O950O508N719L813J217j200l288n254o697
60333E74067p031o609o426o688o551n554m465m274m930n565n564n003m278l779
60319D97350l771m162m369l812k574j325n02J75J218K563L592M034M510N930Q401
60304E07258J1143J3489J5558J7676J9574K0683K0955K0674J9436J6088J0177
$$ plain form
60406 400369 401425 402160 402657 403305 404214 405006 405488 406143 407542 409503 411402 413147 415206 417645 419796 421157
60390 421157 422076 423218 424720 426305 427885 429606 431403 433023 434546 436525 439393 442912 446388 449377
60376 449377 452063 454934 458211 461702 465138 468433 471577 474480 477142 479760 482460 485018 487121 488779
60362 488779 490188 491299 491931 492299 492977 494212 495717 497248 499031 501402 504435 508164 512799 518447 524943
60347 524943 532231 540502 549548 558431 566299 573249 579757 585476 589289 590506 589306 586018 580764 574067
60333 574067 567036 560427 554001 547313 540762 535208 530743 526469 521539 515974 510410 505407 501129 497350
60319 497350 493579 489417 485048 481236 478662 477337 476835 477010 478228 480791 484383 488417 492927 498857 507258
60304 507258 518401 531890 547448 565124 584698 605381 626336 647010 666446 682534 692711
60293F92711K891m004r818j4957j9432k2290k2724k1150j8797j6495j4248j1749
60281E19938q946o192m093l048k762k430j740j381k080l349l911l401k825l070
60267D70710l711l810l302k874k793k708k434k195k042j734j323j213j426j425
60253D37720r91o58q76j302j357j083q87p43k65N26J126J218R59N91J84j20k1
60236D34021N74J295J622J387R73J013J723K524K575J888J518K236L360L521K446
60221D62676J266J023J580K193K513K606K493K224K098K419L137M046N090O130
60207E01494O722O602O259O497P389Q098P888P020O369O353O515O197N399M744
60193E93546M601M520L823K559J449R02N61j7p48j349j893k573l226l544l617
$$ plain form
60293 692711 695602 691598 681780 666823 647391 625101 602377 581227 562430 545935 531687 519938
60281 519938 510992 504800 500707 497659 494897 492467 490727 489346 487266 483917 480006 476605 473780 470710
60267 470710 466999 463189 459887 457013 454220 451512 449078 446883 444841 443107 441784 440571 439145 437720
60253 437720 436729 436071 435195 433893 432536 431453 430566 429823 429558 430084 431210 432428 433387 433978 434162 434042 434021
60236 434021 434595 435890 437512 438899 439872 440885 442608 445132 447707 449595 451113 453349 456709 460230 462676
60221 462676 463942 464965 466545 468738 471251 473857 476350 478574 480672 483091 486228 490274 495364 501494
60207 501494 508216 514818 521077 527574 534963 543061 550949 557969 564338 570691 577206 583403 588802 593546
60193 593546 598147 602667 606490 609049 610498 611400 611961 611944 611196 609847 607954 605381 602155 598611 594994
60178E94994l762l982m044m043m321m890n337n439n368n205m752l969l188k623
60164E34071k098j560j465k219l437m177l874k766j497n64j02Q6L15P14J119J369
60148E13915J545J792K020K066K027K173K442K394J826J240J414K498L764M421
60134E45537M503M713N374N912N645M789M169L988L477J997J08r16m30J016K329
60119E92211K796K423J737J296J268J454J742K303L172L914M033L558K936K402
60105F27245J828J109K52q59k285l560l912l235k439k456l197l795l624k760j633
60090E96679o34L6M79J067K004K975L478L472L359L358L283K996K669K413J984
60075F29618J124p3j389k857m527o075p037p469p925q652r203r101q576q297q486
$$ plain form
60178 594994 591232 587250 583206 579163 574842 569952 564615 559176 553808 548603 543851 539882 536694 534071
60164 534071 531973 530413 528948 526729 523292 519115 515241 512475 510978 510414 510312 510398 510713 511427 512546 513915
60148 513915 515460 517252 519272 521338 523365 525538 527980 530374 532200 533440 534854 537352 541116 545537
60134 545537 550040 554753 560127 566039 571684 576473 580642 584630 588107 590104 590212 589296 588866 589882 592211
60119 592211 595007 597430 599167 600463 601731 603185 604927 607230 610402 614316 618349 621907 624843 627245
60105 627245 629073 630182 630434 629575 627290 623730 619818 616583 614144 611688 608491 604696 601072 598312 596679
60090 596679 596045 596081 596560 597627 599631 602606 606084 609556 612915 616273 619556 622552 625221 627634 629618
60075 629618 630742 630669 629280 626423 621896 615821 608784 601315 593390 584738 575535 566434 557858 549561 541075
60060E41075q634q201p248o288n608n033m305l562l196l284l295k586j166K52
60046D78921R69R23N27K04L23J299L221N393O691O610N730M994M780M867M938
60031E30390M832M450L736K774J660L34j275l001m506n597o336o864p238p411
60017E05948p281o881o511o448o450n902m725l688l402l387k793j813j503k151
60003D43013k766k522j905j803k121k037j337o47m32m54k62L23J284K408L128
59988D33870K828J625M98L48J206K480L710M743N439N536M869L593K143J015L86
59973D74289l4o78j576k430l181m066m968n150m142k554j410q34q8J047J723J273
59957D47221M29N25J713K672K262Q74j58k01K41N06O65J075J522J415Q42P72J817
$$ plain form
60060 541075 532441 524240 516992 510704 505096 500063 495758 492196 489000 485716 482421 479835 478669 478921
60046 478921 479890 480813 481340 481544 481867 483166 486387 491780 498471 505081 510811 515805 520585 525452 530390
60031 530390 535222 539672 543408 546182 547842 548176 546901 543900 539394 533797 527461 520597 513359 505948
60017 505948 498667 491786 485275 478827 472377 466475 461750 458062 454660 451273 448480 446667 445164 443013
60003 443013 440247 437725 435820 434017 431896 429859 428522 427875 427443 426989 426727 427050 428334 430742 433870
59988 433870 436698 438323 438821 439169 440375 442855 446565 451308 456747 462283 467152 470745 472888 473903 474289
59973 474289 474255 473577 472001 469571 466390 462324 457356 452206 448064 445510 444100 443266 443178 444225 445948 447221
59957 447221 447650 448175 449888 452560 454822 455696 455538 455337 455578 456084 456749 457824 459346 460761 461603 462375 464192
59940D64192L188L497K485J288R00J035Q14P2o87j207j713k255k431j914r01O2
59924D66425N35M80L95R77K284L401L414K552J783J471J276J281K137L732M826
59909D96969M714M355M937O029O200N055L398J728j24j825k266j084M62P68m49
59894E28867k089k843k075j27J911L016L177L267L836M503M660M268L688L213
59880E57272L063L378L935M260M339M646N189N157L992K248Q40j18j064k064k846
59865E92227l500m366n310n812n757n551n458n321m948m299l303j920m47O75J414
59850E38324K226L593N653Q121J0245J1184J0824R943R098P727N110J911k10n57
59836F23192n5J87R3N6m4o94k050l868n711o951p025o102n150m974n444n915o040
$$ plain form
59940 464192 467380 470877 473362 474650 475550 476585 477399 477471 476784 475577 473864 471609 469178 467264 466363 466425
59924 466425 466960 467440 467835 468812 471096 474497 477911 480463 482246 483717 484993 486274 488411 492143 496969
59909 496969 501683 506038 510975 517004 523204 528259 531657 533385 533261 531436 529170 528086 528548 529316 528867
59894 528867 526778 523935 521860 521733 523644 526660 529837 533104 536940 541443 546103 550371 554059 557272
59880 557272 560335 563713 567648 571908 576247 580893 586082 591239 595231 597479 598319 598201 597137 595073 592227
59865 592227 588727 584361 579051 573239 567482 561931 556473 551152 546204 541905 538602 536682 536235 536910 538324
59850 538324 540550 544143 549796 557917 568162 579346 590170 600113 609211 616938 622048 623959 623749 623192
59836 623192 623137 623324 623417 623473 623429 622735 620685 616817 611106 604155 597130 591028 585878 580904 575460 569545 563505
59819E63505n892n622n406n416n610n725n724n799n775m976l155j102J66N48O40
59804E04657O73L56l49r76j229j408j903k520k639j995j107p86j176j482r70p0
59788D87076L9r66j986j834n89P75J535J501O42o97j588j453j047j576k885l489
59772D73458k655j375q48q94o30K2M50N21P27J196J528J595J751K044J915J108
59756D79913L09M18J471K722L551L875L843L649L627M078M877N547N831N890N830
59741E35431N392M421L358K920L326M111M614M429L453J914M55j37L86J377J803
59726E77253J195J9q23q50l28J99N03P15Q59O90J18n10q21q55q42p22l55k3j70
59707E75252n89n18K71J035J028M97K16M10P15J001J577K426K831K223J080N85
$$ plain form
59819 563505 557613 551991 546585 541169 535559 529834 524110 518311 512536 507560 504405 503303 503469 504017 504657
59804 504657 505330 505686 505337 504361 503132 501724 499821 497301 494662 492667 491560 490774 489598 488116 487146 487076
59788 487076 487115 486149 484163 482329 481740 482515 484050 485551 486193 485496 483908 482455 481408 479832 476947 473458
59772 473458 470803 469428 468580 467686 467056 467078 467528 468049 468776 469972 471500 473095 474846 476890 478805 479913
59756 479913 480222 480640 482111 484833 488384 492259 496102 499751 503378 507456 512333 517880 523711 529601 535431
59741 535431 540823 545244 548602 551522 554848 558959 563573 568002 571455 573369 573824 573687 574073 575450 577253
59726 577253 578448 578467 577644 576794 576466 576665 577168 577883 578742 579432 579550 579040 578219 577364 576522 575800 575445 575422 575252
59707 575252 574663 574145 574416 575451 576479 576976 577192 577602 578317 579318 580895 583321 586152 588375 589455 590040
59691E90040J312K565L181K792K003J386P69k19j318j887j805j564j403j022l27
59676E94503M1n60j920l219l955m230m327m409m550m726m773m641m532m563m443
59661E39696l831k829j807q70P3Q46J092Q61P24J139K001K875L417L495L151K534
59645E52567J757Q35o8n73n77o43j433k836m094m736m872m591l755k605j913k068
59629E20395k482k316j485n73q6j79q22j750k473k744k871l144l246k794k181
59614D91249k277l223m194m392l807k792j587m86N4o7k78J08J167K417L267L179
59598D78338J865k35j980k563k310j982j700j138n53n60r12n37Q62K097K051J106
59582D71849L68M7m25j089j358j175j297k144l204l826l968l791l154k070j158
$$ plain form
59691 590040 591352 593917 597098 599890 601893 603279 604048 603829 602511 600624 598819 597255 595852 594830 594503
59676 594503 594544 593984 592064 588845 584890 580660 576333 571924 567374 562648 557875 553234 548702 544139 539696
59661 539696 535865 533036 531229 530359 530432 531278 532370 533231 533955 535094 537095 539970 543387 546882 550033 552567
59645 552567 554324 555159 555091 554518 553941 553298 551865 549029 544935 540199 535327 530736 526981 524376 522463 520395
59629 520395 517913 515597 514112 513539 513453 513274 512452 510702 508229 505485 502614 499470 496224 493430 491249
59614 491249 488972 485749 481555 477163 473356 470564 468977 468491 468545 468478 468200 468308 469475 471892 475159 478338
59598 478338 480203 479968 477988 475425 473115 471133 469433 468295 467742 467182 466270 465733 466595 468692 470743 471849
59582 471849 472217 472264 471839 470750 469392 468217 466920 464776 461572 457746 453778 449987 446833 444763 443605
59567D43605j029j449j598j084k84K20K34%r9Q1K57L4m77o43q4P84J287J330J335
59548D42420J556J860K113K385K724L084L542M296N335O419P492Q922J1082J3833
59534E17063J6505J8375J9033J8253J5689J1002M530k299p574j0162j0203q469
59522E81743n600k186Q65K668L130K987K948K977K485J078j032l236n039o350
59508E77438p255p756p876p989q593r653j0425j0160q789o885n127l966l491l401
59494D76072l242k859k405j921j238m31N9J1k45l45k58O3Q66K007K737K613K172
59477D73656K129K408K642L018L750M181L509K227J635K036K513K572K796L486
59463E12558L916L480K648K113J781J358J211J830K925L835M504N304O257P039
$$ plain form
59567 443605 442576 441127 439529 438445 438161 438381 438615 438615 438516 438597 438854 438888 438411 437768 437684 438468 439755 441085 442420
59548 442420 443976 445836 447949 450334 453058 456142 459684 463980 469315 475734 483226 492148 503230 517063
59534 517063 533568 551943 570976 589229 604918 615920 620450 618151 610577 600415 590212 581743
59522 581743 576143 573957 574822 577490 580620 583607 586555 589532 592017 593095 592063 588827 583788 577438
59508 577438 570183 562427 554551 546562 537969 528316 517891 507731 498942 492057 486930 482964 479473 476072
59494 476072 472830 469971 467566 465645 464407 463976 464035 464046 463801 463456 463198 463261 464127 466134 468871 471484 473656
59477 473656 475785 478193 480835 483853 487603 491784 495293 497520 499155 501191 503704 506276 509072 512558
59463 512558 516474 519954 522602 524715 526496 527854 529065 530895 533820 537655 542159 547463 553720 560759
59449E60759P589Q078Q384Q153P353O328N318M267K981J248j055l706o144p936
59435F01617r068r636r546q816p786o802n914n167m697m276l243j365P00K273
59421E28274L571N197P096Q724R987J1304J2871J4544J6386J8696K1445K4189
59409F82284K6439K7600K6777K3265J7268R569P14q664j6769k1081k0443j6113
59397G30846j0380m773KL174L841J603l299j0211j7848k4099k6975k6112k3030
59384E92739j9703j7014j4641j2028r104o231l803k096j209r22o53R8J199J993
59370E08625K111J917J999K486L130L826M630N346N606N372N003M841M969N397
59356E65258O148P073P924Q636R282R773J0018J0409J1607J3635J5651J6918J7602
$$ plain form
59449 560759 568348 576426 584810 592963 600316 606644 611962 616229 619210 620458 619403 615697 609553 601617
59435 601617 592549 582913 573367 564551 556765 549963 544049 538882 534185 529909 526666 525301 526001 528274
59421 528274 531845 537042 544138 552862 562849 574153 587024 601568 617954 636650 658095 682284
59409 682284 708723 736323 763100 786365 803633 813202 813916 805252 788483 767402 746959 730846
59397 730846 720466 715693 715695 718869 722710 724313 721014 710803 692955 668856 641881 615769 592739
59384 592739 573036 556022 541381 529353 520249 514018 510215 508119 506910 505988 505335 505433 506632 508625
59370 508625 510736 512653 514652 517138 520268 524094 528724 534070 539676 545048 550051 554892 559861 565258
59356 565258 571406 578479 586403 595039 604321 614094 624112 634521 646128 659763 675414 692332 709934
59343G09934J8213J8695J8611J7981J7323J6809J5963J4396J2385J0370Q186N234
59331H84100J391k631n996q585j0813j2851j4382j5176j5488j5718j5915j5913
59319G52023j5690j5270j4491j3258j1906j0822r809q299o286m475l377k753k156
59306F33431j545r95k15J178L124N300P619J0223J3037J5599J7255J7304J5197
59293G36512J0911N080j453p883j3170j6086j6194j4582j2856j1532r966p793
59281F40988n605m037k975j978r52k6P82J436J823K165L036M606O277P521Q597
59266F61658R893J0968J0996R902Q401O965N389L365Q94j895m774p240q871r901
59252F95750j0919j1928j2354j1995j1335j0640r496p627n549l953k868j889q18
$$ plain form
59343 709934 728147 746842 765453 783434 800757 817566 833529 847925 860310 870680 878866 884100
59331 884100 885491 882860 876864 868279 857466 844615 830233 815057 799569 783851 767936 752023
59319 752023 736333 721063 706572 693314 681408 670586 660777 652478 646192 641717 638340 635587 633431
59306 633431 631886 630891 630676 631854 634978 640278 647897 658120 671157 686756 704011 721315 736512
59293 736512 747423 752503 751050 743167 729997 713911 697717 683135 670279 658747 648781 640988
59281 640988 635383 631346 628371 626393 625441 625415 626197 627633 629456 631621 634657 639263 645540 653061 661658
59266 661658 671551 682519 693515 703417 711818 718783 724172 727537 728431 726536 721762 714522 705651 695750
59252 695750 684831 672903 660549 648554 637219 626579 617083 609456 603907 599954 597086 595197 594379
59239E94379L13J432K292K565K433K560L062L123K281J439J676K557K655J549
59225F24316K61l79p40j507k660l780m710n576o399o982o912n776l757j968j562
59210E71869k408l243l151k309j231j16Q19J150Q11L39J26Qk11l03n8M02J056
59193E63550K136L487M363M323L792L367L130L031L245L682L763L315K970L101
59179F11255L066K355J736K177L141L151J839L27l65k32M11J489K822M004M872
59164F42048N531N908N899N939O603P653Q236Q063P571O849N401L189R65q42k670
59149G16343m804o644p609q018q377q424p693o551n811n539n024m015l218l414
59135F31202m413n207n012m092l461l758m525m829m434l859l353k523j199k0L55
$$ plain form
59239 594379 594692 596124 598416 600981 603414 605974 609036 612159 614440 615879 617555 620112 622767 624316
59225 624316 624577 624198 623458 621951 619291 615511 610801 605225 598826 591844 584932 579156 575399 573431 571869
59210 571869 569461 566218 563067 560758 559527 559411 560230 561380 562191 562530 562656 562664 562453 562150 562092 562494 563550
59193 563550 565686 569173 573536 577859 581651 585018 588148 591179 594424 598106 601869 605184 608154 611255
59179 611255 614321 616676 618412 620589 623730 626881 628720 629047 628682 628450 628861 630350 633172 637176 642048
59164 642048 647579 653487 659386 665325 671928 679581 687817 695880 703451 710300 715701 718890 719855 719013 716343
59149 716343 711539 704895 697286 689268 680891 672467 664774 658223 652412 646873 641849 637834 634616 631202
59135 631202 626789 621582 616570 612478 609017 605259 600734 595905 591471 587612 584259 581736 580537 580517 580872
59120E80872J88K92J012K062L131M194N329O640Q206R749J0551J0117Q777P337
59106F58457O292N755N836O439O926O624N749N203N326N434M827L636K355J025
59092G29884n25j978k703k610k282k153k023j586j076r77j357j906k577l702n361
59077F97068p022q092q589q929r229r241q956q799r046r287q873p745o534n769
59063E80957n259m432l124j846j252j574k571l772m654m785m114k970j708n41
59049E38355J69j17j321k364k255j397r98j290j354q70q01j723k596k178q55M9
59033E18454K24M41J018J490J764K369L460M554N475O571P800Q553Q719R042R999
59018E89933J1166J2073J2836J3409J3067J1423R250P535O203M517K416N63p21
$$ plain form
59120 580872 581060 581352 582364 584426 587557 591751 597080 603720 611926 621675 632226 642343 651120 658457
59106 658457 664749 670504 676340 682779 689705 696329 702078 707281 712607 718041 722868 726504 728859 729884
59092 729884 729359 727381 724678 722068 719786 717633 715610 714024 712948 711971 710614 708708 706131 702429 697068
59077 697068 690046 681954 673365 664436 655207 645966 637010 628211 619165 609878 601005 593260 586726 580957
59063 580957 575698 571266 568142 566296 565044 563470 560899 557127 552473 547688 543574 540604 538896 538355
59049 538355 538524 538407 537086 534722 532467 531070 530072 528782 527428 526558 525757 524034 521438 519260 518405 518454
59033 518454 518678 519119 520137 521627 523391 525760 529220 533774 539249 545820 553620 562173 570892 579934 589933
59018 589933 601099 613172 626008 639417 652484 663907 673157 680692 686895 691412 693828 694391 693670
59005F93670j764k797l485l383k451j008N45J895K902L551L868M018M362N043
58991G04966N473M758K895J038K19J29l72j810l577m735m928m518m127m006l866
58976F87539l283k231j030J56J414K778M191N744P487R098J0258J1214J2281J2930
58962G58546J2351J0995J0369J0923J1291J0270Q435O893N456L233K94k539n078
58949H41439p742j0389j2331j3451j4273j4985j5344j5404j5386j4955j3569j1573
58937F82037r905q692p222n393m074l776l932l921l777l511k725j476o60p75j122
58922F21076q88l25j44l46n29q45j654k576k829k377j867j471o43P22J856K149
58906F09309K049K418L446M642N619O388P067P792Q894J0724J3124J5266J6243
$$ plain form
59005 693670 691906 689109 685624 682241 679790 678782 679327 681222 684124 687675 691543 695561 699923 704966
58991 704966 710439 715197 718092 719130 719349 719478 719106 717296 713719 708984 704056 699538 695411 691405 687539
58976 687539 684256 682025 680995 681151 682565 685343 689534 695278 702765 711863 722121 733335 745616 758546
58962 758546 770897 781892 792261 803184 814475 824745 833180 840073 845529 848762 849056 846517 841439
58949 841439 833697 823308 810977 797526 783253 768268 752924 737520 722134 707179 693610 682037
58937 682037 672132 663440 656218 650825 646751 642975 639043 635122 631345 627834 625109 623633 622973 622198 621076
58922 621076 620188 619863 619719 619373 618844 617999 616345 613769 610940 608563 606696 605225 604582 605304 607160 609309
58906 609309 611358 613776 617222 621864 627483 633871 640938 648730 657624 668348 681472 696738 712981
58893G12981J5794J4428J2949J1941J1581J1800J2596J4107J6263J8425J9722
58882H72587J9924J9673J9525J9035J7250J4020J0241O746L489Q0l439o689r508
58869I82934j1966j3972j5301j5908j5957j5568j4755j3485j1714r626p923p545
58857H29214q658j0216j0907j0438r620r359r884j0791j1405j1229j0358r454
58845G06895r017q813q319p510o820o466o321o369o857p764q561q640p933o925
58831F00580o121n542m768l660k818k971l831m144l160j529l64J06M59J134K137
58816E65508L291M194M239L438K810L276M390M990M781M349L859K938J839J492
58802F15394K003K205J261k28j242j725k247k992l794m694n721o509o739o679
$$ plain form
58893 712981 728775 743203 756152 768093 779674 791474 804070 818177 834440 852865 872587
58882 872587 892511 912184 931709 950744 967994 982014 992255 999001 1002490 1002570 999131 992442 982934
58869 982934 970968 956996 941695 925787 909830 894262 879507 866022 854308 844682 836759 829214
58857 829214 820556 810340 799433 788995 779375 770016 760132 749341 737936 726707 716349 706895
58845 706895 697878 689065 680746 673236 666416 659950 653629 647260 640403 632639 624078 615438 607505 600580
58831 600580 594459 588917 584149 580489 577671 574700 570869 566725 563565 562036 561672 561778 562237 563371 565508
58816 565508 568799 572993 577232 580670 583480 586756 591146 596136 600917 605266 609125 612063 613902 615394
58802 615394 617397 619602 620863 620635 619393 617668 615421 612429 608635 603941 598220 591711 584972 578293
58788E78293o676o392n202l209j289j61J95K75O32J603L016M227M753M812M845
58773E79722M697L740J881p8j369k115l010m277n399n916o102o533p151p161o056
58758E34873m377l175k864k985k918k377j293K76J919K980L162K774K266J811
58744E30072J506J656K499L767M871N403N365N001M626M547M906N496N858N702
58730E91275N244M975N064N093M674M151M266N060N674N465M785M273L958L617
58716F57574L526M032M755N142N541O730Q412R287Q778P612O399M777K491K57
58702G35313j315k778m927p457r586j1431j3666j6037j7460j7599j7348j7422
58690E98287j7379j6470j4818j3173j1883j0666r253p837o792o228n871n372m592
$$ plain form
58788 578293 571617 565225 560023 556814 555525 555364 555559 555834 556466 558069 561085 565312 570065 574877 579722
58773 579722 584419 588159 590040 589962 588593 586478 583468 579191 573792 567876 561774 555241 548090 540929 534873
58758 534873 530496 527321 524457 521472 518554 516177 514884 515160 517079 520059 523221 525995 528261 530072
58744 530072 531578 533234 535733 539500 544371 549774 555139 560140 564766 569313 574219 579715 585573 591275
58730 591275 596519 601494 606558 611651 616325 620476 624742 629802 635476 640941 645726 649999 653957 657574
58716 657574 661100 665132 669887 675029 680570 687300 695712 704999 713777 721389 727788 732565 735056 735313
58702 735313 733998 731220 726293 718836 709250 697819 684153 668116 650656 633057 615709 598287
58690 598287 580908 564438 549620 536447 524564 513898 504645 496808 490016 483788 477917 472545 467953
58677D67953l640k723k083k027k647l388l318k060k73J116J977K877M113N378
58663D61255O371P232Q108Q688Q477P373N727L943K150K24j992m402o478p430
58649D99246o820m925k468m2K009L323L546K749J543M98l29j113j688j619q36
58634D93074J20N82K87m33q39k63J199K583L002K666K418K384J834N47m73k31
58618E08457J014K267L090L633L892L784L777M551N980P086P122O228N003L946
58604E69830L344L180L006K337J214J10o71j121j225j049j099j980l587n036n544
58589E61709n002l709j959k3J851L511M876N908O823Q050R571J0581J0352R274
58575F21813Q437Q330Q499Q400P953P323O747O617P196Q283R567J1147J3199J5407
$$ plain form
58677 467953 464313 461590 459507 457480 454833 451445 448127 446067 445794 446910 448887 451764 455877 461255
58663 461255 467626 474858 482966 491654 500131 507504 513231 517174 519324 519548 517556 513154 506676 499246
58649 499246 492426 487501 485033 484991 487000 490323 493869 496618 498161 498659 498330 497217 495529 493910 493074
58634 493074 493194 493776 494063 493630 492791 492528 493727 496310 499312 501978 504396 506780 508614 509161 508688 508457
58618 508457 509471 511738 514828 518461 522353 526137 529914 534465 540445 547531 554653 560881 565884 569830
58604 569830 573174 576354 579360 581697 582911 583021 582350 581229 580004 578955 577856 575876 572289 567253 561709
58589 561709 556707 552998 551039 551016 552867 556378 561254 567162 573985 582035 591606 602187 612539 621813
58575 621813 630250 638580 647079 655479 663432 670755 677502 684119 691315 699598 709165 720312 733511 748918
58561G48918J7404J9502K2159K4938K6860K7722K8030K7715K5925K2300J7514
58550A008987J2335P050K009k185n349p764r353r721r217q945r387r975j0478
58537I48007j1691j4185j7237j9750k1479k2641k3028k2342k0858j9075j7080
58526G38641j4790j2416j0165p972n956m625m074l514k208n72L03K6p02r62o11
58511F70403m08j160k639l603l226k180j645j700j538j033r01j324j694j820k149
58496F43383k542k139q97O7R8k12l53o58j063n62J184K923L517L520M061N163
58480F55490O262P446R108J1083J3104J5271J7296J8106J7270J5817J4683J3260
58468H14196J0539O766K800j236n379q755j0401j0588j0098q949p015n075l761
$$ plain form
58561 748918 766322 785824 807983 832921 859781 887503 915533 943248 969173 991473 1008987
58550 1008987 1021322 1028372 1030381 1028196 1022847 1015083 1005730 996009 986792 977847 968460 958485 948007
58537 948007 936316 922131 904894 885144 863665 841024 817996 795654 774796 755721 738641
58526 738641 723851 711435 701270 693298 687342 682717 678643 675129 672921 672349 672652 672678 671976 671014 670403
58511 670403 669995 668835 666196 662593 659367 657187 655542 653842 652304 651271 650370 649046 647352 645532 643383
58496 643383 640841 638702 637805 637872 637970 637758 637405 636747 635684 635122 636306 639229 642746 646266 650327 655490
58480 655490 661752 669198 678306 689389 702493 717764 735060 753166 770436 786253 800936 814196
58468 814196 824735 831501 834301 833065 827686 818931 808530 797942 787844 778895 771880 766805 763044
58455G63044k202P51M480P318Q844R931J0886J1076J0260Q838O852L971M62k983
58441H41528o156r048j1057j1641j1416j1269j0802r018o240l913k597j608n30
58428G46233L97J357K944M858O048O458P309R303J1587J2884J2729J1392R379
58415H42878P248N179K725l52l265n103o262p842r790j0805j0193q654p167o087
58401G82510n482n341n200m443l115j813p38M28J795L093M121M733M670M039L583
58386G82840L709L774L125K240J893J884J728J860K822L879L897L197K933L120
58372H22901K857K262K437L552M591N106N694O659P605Q476R668J1014J1925J2579
58358I17326J3649J4909J5369J4812J3938J3070J1978J0816R866Q597O331L680
$$ plain form
58455 763044 760842 761593 766073 773391 782235 792166 803052 814128 824388 833226 840078 844049 844511 841528
58441 841528 835372 826324 815267 803626 792210 780941 770139 761121 754881 750968 748371 746763 746233
58428 746233 746630 747987 750931 755789 761837 768295 775604 784907 796494 809378 822107 833499 842878
58415 842878 850126 855305 858030 857678 854413 849310 843048 835206 825416 814611 804418 795764 788597 782510
58401 782510 777028 771687 766487 762044 758929 757116 756378 756806 758601 761694 765815 770548 775218 779257 782840
58386 782840 786549 790323 793448 795688 797581 799465 801193 803053 805875 809754 813651 816848 819781 822901
58372 822901 825758 828020 830457 834009 838600 843706 849400 856059 863664 872140 881808 892822 904747 917326
58358 917326 930975 945884 961253 976065 990003 1003073 1015051 1025867 1035733 1044330 1050661 1054341
58346A054341J887J023L36N1J048K917M168M456M906O148P717R361J1240J2843
58332A122442J3480J3835J5236J7353J8500J8261J7863J7743J6911J5068J3347
58321A300039J2366J1370R885Q501P505O402N282N019N670O223O283O529P239
58308A398313P957Q789J0341J2309J3795J4995J6760J8637J9373J9283J9805K0787
58296A581144K0714J9757J9908K1582K2851K2726K2657K3830K5408K6435K7272
58285A834284K8190K8562K8309K8250K8438K8178K8033K9487L2207L4149L4876
58274B162963L6187L8844M1395M3039M4938M7823N0812N3426N6253N8978O0460
58263B695118O1382O3858O7734P0421P1211P2475P5446P8249P9330P9660Q0112
$$ plain form
58346 1054341 1056228 1057251 1057587 1057638 1058686 1061603 1065771 1070227 1075133 1081281 1088998 1098359 1109599 1122442
58332 1122442 1135922 1149757 1164993 1182346 1200846 1219107 1236970 1254713 1271624 1286692 1300039
58321 1300039 1312405 1323775 1333660 1342161 1349666 1356068 1361350 1366369 1372039 1378262 1384545 1391074 1398313
58308 1398313 1406270 1415059 1425400 1437709 1451504 1466499 1483259 1501896 1521269 1540552 1560357 1581144
58296 1581144 1601858 1621615 1641523 1663105 1685956 1708682 1731339 1755169 1780577 1807012 1834284
58285 1834284 1862474 1891036 1919345 1947595 1976033 2004211 2032244 2061731 2093938 2128087 2162963
58274 2162963 2199150 2237994 2279389 2322428 2367366 2415189 2466001 2519427 2575680 2634658 2695118
58263 2695118 2756500 2820358 2888092 2958513 3029724 3102199 3177645 3255894 3335224 3414884 3494996
58252C494996P9965P9374Q0158Q2720Q5268Q7336R0793R6202J01762J07096J14219
58241D499889J23327J31628J38044J45093J54250J63565J71871J81265J93240
58232E902172K06337K19582K34222K50171K65200K79567K96741L17614L39087
58223H310693L60511L85876M16993M50424M84309N22319N67296O17029O70229
58214A2785679P30791Q01952Q82132R70807J072685J192068J329391J487516J674966
58205B2927987J898986K162889K474562K849927L304060L848365M501186N290716
58197D9258678O242574P377902Q732046J0363654J2340313J4732663J7626848
58190A26674678K1101746K5135463K9494780L3681538L6946892L8371012L7050124
$$ plain form
58252 3494996 3574961 3654335 3734493 3817213 3902481 3989817 4080610 4176812 4278574 4385670 4499889
58241 4499889 4623216 4754844 4892888 5037981 5192231 5355796 5527667 5708932 5902172
58232 5902172 6108509 6328091 6562313 6812484 7077684 7357251 7653992 7971606 8310693
58223 8310693 8671204 9057080 9474073 9924497 10408806 10931125 11498421 12115450 12785679
58214 12785679 13516470 14318422 15200554 16171361 17244046 18436114 19765505 21253021 22927987
58205 22927987 24826973 26989862 29464424 32314351 35618411 39466776 43967962 49258678
58197 49258678 55501252 62879154 71611200 81974854 94315167 109047830 126674678
58190 126674678 147776424 172911887 202406667 236088205 273035097 311406109 348456233
58183C48456233L2384650K4329407J3466670R29171j1737852k2831812l0959008
58176C54037459l5531152l6889658l5916231l3485924l0211470k6520869k2776901
58169A32705254j9263764j6135232j3437992j1169901r299980p769435o514688
58162D9114262n489855m658460l979234l415230k946171k559390k237391j964002
58154B1864529j733326j542466j382365j243682j124406j023961r36212q55076
58146A2023035p80952p15196o54095n94286n38545m90385m47875m08060l72531
58137G021110l43472l18804k96132k77082k63041k50831k37133k23239k11197
58128D600179j99313j85759j72759j62781j54040j44007j34150j26918j21084
$$ plain form
58183 348456233 380840883 405170290 418636960 419566131 407828279 384996467 354037459
58176 354037459 318506307 281616649 245700418 212214494 182003024 155482155 132705254
58169 132705254 113441490 97306258 83868266 72698365 63398385 55628950 49114262
58162 49114262 43624407 38965947 34986713 31571483 28625312 26065922 23828531 21864529
58154 21864529 20131203 18588737 17206372 15962690 14838284 13814323 12878111 12023035
58146 12023035 11242083 10526887 9872792 9278506 8739961 8249576 7801701 7393641 7021110
58137 7021110 6677638 6358834 6062702 5785620 5522579 5271748 5034615 4811376 4600179
58128 4600179 4400866 4215107 4042348 3879567 3725527 3581520 3447370 3320452 3199368
58119C199368j14098j06543j00415r5348r0064q5252q1808p8416p3864o9502o6666
58108B237392o3952n9868n5745n3284n1621m9448m7760m7656m7729m6295m4184
58097A669850m2725m1165l8580l6105l4773l3335l0795k8761k8642k8757k7071
58086A299141k4700k3768k3677k2603k1060k0814k1503k1244j9708j8090j6857
58075A065117j5751j5177j5627j6497j7094j7703j8339j7963j6468j5593j6155
58064H82750j6330j4613j2441j1602j1114r254p050o805q419r859j0392j0830
58052G54041j1373j1505j1426j1485j0964r237p295o335n853m878l946l941m239
58039F51564m021m150n586p114o995n845n476n848n614m954n311o762q006q710
$$ plain form
58119 3199368 3085270 2978727 2878312 2782964 2692900 2607648 2525840 2447424 2373560 2304058 2237392
58108 2237392 2173440 2113572 2057827 2004543 1952922 1903474 1855714 1808058 1760329 1714034 1669850
58097 1669850 1627125 1585960 1547380 1511275 1476502 1443167 1412372 1383611 1354969 1326212 1299141
58086 1299141 1274441 1250673 1226996 1204393 1183333 1162519 1141016 1119772 1100064 1081974 1065117
58075 1065117 1049366 1034189 1018562 1002065 984971 967268 948929 930966 914498 898905 882750
58064 882750 866420 851807 839366 827764 816650 807396 800346 793541 785122 775263 764871 754041
58052 754041 742668 731163 719737 708252 697288 688051 680756 674421 668568 663690 659744 655803 651564
58039 651564 647543 643393 637807 630693 623698 617853 612377 606529 600915 595961 590650 583888 575882 567172
58025E67172r644j0735j1056j0638j0357j0239r576q525p839p336o295n042m525
58012D55365m674m638m285l926l209j946j289k216l495l090j161L43O32N59N02
57997D23472m6q63j069q72j314k169k058q90k97j191k539l019k443j207K88J227
57981D05010Q04n73j676k205k997m307n225n132m539m108l844l593l319k698j368
57966C60230K37J194J314J223J210J048Q31R81J239P87m77j688k161k015j589
57951C62364j118j011j603k476k798k373j670r22M9J236K418L650N014O118O556
57936C73434O649O925P251P333P662Q840J0290J0732R875Q527P206N763M275L119
57922D77881K059L08k306n087p365q923r602r438r143r512j0310j0608j0118r362
$$ plain form
58025 567172 557528 546793 535737 525099 514742 504503 494927 486402 478563 471227 464932 459890 455365
58012 455365 450691 446053 441768 437842 434633 432687 431398 429182 425687 422597 421436 421779 422411 422970 423472
57997 423472 423426 422563 421494 420622 419308 417139 415081 414191 413894 412703 410164 407145 404702 403495 403783 405010
57981 405010 405814 405241 403565 401360 398363 394056 388831 383699 379160 375052 371208 367615 364296 361598 360230
57966 360230 360467 361661 362975 364198 365408 366456 367287 368268 369507 370294 369817 368129 365968 363953 362364
57951 362364 361246 360235 358632 356156 353358 350985 349315 348393 348442 349678 352096 355746 360760 366878 373434
57936 373434 380083 387008 394259 401592 409254 418094 428384 439116 448991 457518 464724 470487 474762 477881
57922 477881 479940 480248 477942 472855 465490 456567 446965 437527 428384 418872 408562 397954 387836 378474
57908C78474q677p939p123o281n030l084j197n51j179k010k401k651k989l130
57894C24232k987k886k829k386j477m91M27J468K480K990K977K966L274L764M266
57879C35788M619M419L455K214J283M83p01k056k907l133l148l086k901k952l601
57864C27776m433m807m814m783m318k959j479j057j488j512p98j47K43J117K547
57849B99088L491L371K855K532K080J247N21K11j89j124k233l013l513l892l990
57834B97442l696l235k753k123j361o72m2O89J296J366J026Q55J092J527K073
57819B93484K735L225L324L401L816M162L951L634L789L711K181n83l143m828
57805C22859o057o799o485n575n442o220o449n420m240l834l475k322j068q21
$$ plain form
57908 378474 369797 361858 354735 348454 343424 340340 339143 338592 337413 335403 333002 330351 327362 324232
57894 324232 321245 318359 315530 313144 311667 311176 311603 313071 315551 318541 321518 324484 327758 331522 335788
57879 335788 340407 344826 348281 350495 351778 352261 351560 349504 346597 343464 340316 337230 334329 331377 327776
57864 327776 323343 318536 313722 308939 304621 301662 300183 299126 297638 296126 295328 295181 295424 296541 299088
57849 299088 302579 305950 308805 311337 313417 314664 315185 315396 315207 314083 311850 308837 305324 301432 297442
57834 297442 293746 290511 287758 285635 284274 283602 283560 284249 285545 286911 287937 288792 289884 291411 293484
57819 293484 296219 299444 302768 306169 309985 314147 318098 321732 325521 329232 331413 330830 327687 322859
57805 322859 316802 310003 303518 297943 292501 286281 279832 274412 270172 266338 262863 260541 259473 258652
57791B58652j367j682j441j048p44o18q81j431j626j100l42J12M83J228K231L046
57775B53472L514L733L830M009M375M562M111L279K808K831K810K523K166J516
57761B99539J30j461k062j621j499k397l348l343k756k335j949j224m45K0M34
57746B75683J030J429J424J481J752J514L74q99j582k114k995l534k874j626j224
57731B67839k017l090l615l441k601j181M24J831L052M078M461L961L181K838
57717B75720K713K012N15j231k631l378l442l148l040l331l675l824l967m199
57703B45094m214l873l460l054k347j427r03q41m74M39R47L71n12o68l48m70j093
57686B23167j642k022k490k780k425j589p54Q9J167K305L425N153P952J1155J3893
$$ plain form
57791 258652 257285 255603 254162 253114 252370 251752 250871 249440 247814 246714 246372 246484 246967 248195 250426 253472
57775 253472 256986 260719 264549 268558 272933 277495 281606 284885 287693 290524 293334 295857 298023 299539
57761 299539 299669 298208 296146 294525 293026 290629 287281 283938 281182 278847 276898 275674 275229 275249 275683
57746 275683 276713 278142 279566 281047 282799 284313 284687 283788 282206 280092 277097 273563 270689 269063 267839
57731 267839 265822 262732 259117 255676 253075 251894 252318 254149 257201 261279 265740 269701 272882 275720
57717 275720 278433 280445 280960 279729 277098 273720 270278 267130 264090 260759 257084 253260 249293 245094
57703 245094 240880 237007 233547 230493 228146 226719 225816 224975 224501 224940 225887 226258 225746 225078 224730 224260 223167
57686 223167 221525 219503 217013 214233 211808 210219 209465 209554 210721 213026 216451 221604 229556 240711 254604
57671B54604J6582K0475K5922L2188L8642M4967N0195N2569N0578M3560L1536
57660F61818J5439k544j9707l4067m4486n0079n0530m6910m1220l4948k8697k2947
57648C01122j8222j4527j1454q956p223n907m364k753j926k095k414k202j704
57635B17375j295p13L77J631K384K451K110J579Q97J38n96j313k037k608k734
57620B17646k283j527j025j134j630j986k030j987j871j359m49K12R5n48j068
57605A99056j165q94l88K1j69r85j743j921j862k113k491k504k251k244k530k717
57589A73100k665k489k054j207m55n67j466k145j905j111m88k11L7L11J67p49
57573A56103j965k356j338K28Q44Q0j070j548j350r74o22l77m89q73q72q1R69
$$ plain form
57671 254604 271186 291661 317583 349771 388413 433380 483575 536144 586722 630282 661818
57660 661818 677257 674713 655006 620939 576453 526374 475844 428934 387714 352766 324069 301122
57648 301122 282900 268373 256919 247963 240740 234833 230469 227716 225790 223695 221281 219079 217375
57635 217375 216080 215367 215744 217375 219759 222210 224320 225899 226796 226934 226338 225025 222988 220380 217646
57620 217646 215363 213836 212811 211677 210047 208061 206031 204044 202173 200814 200365 200577 200672 200124 199056
57605 199056 197891 196997 196609 196630 196461 195476 193733 191812 189950 187837 185346 182842 180591 178347 175817 173100
57589 173100 170435 167946 165892 164685 164230 163663 162197 160052 158147 157036 156548 156337 156374 156685 156852 156103
57573 156103 154138 151782 150444 150672 151516 151596 150526 148978 147628 146654 146032 145655 145166 144293 143421 143340 144309
57556A44309J577J727J713J473J039J068K027L287L831L579L184K846K155R87
57542A74802k00r28r92l97M77R64Q56P55J219J975K469K575K198R73q18j821j152
57525A82955K71J037J187J582K005J522M10QO53J344J544J838K474K783K546K534
57509B06693L102L447K965K239J993J962J598J090R08R21O87J77l24o70q48r18
57493B25022j185j928k751k860k183j592j721k227k572k777k954k735j838p00
57479A94999K3K14J52p7n63j227j858k292k383k062j591j398j523j636j704k087
57463A74987k739k866j806LJ425J791J451J232J602K253K528K217J820J793J926
57448A87617J779J483J496J802J945J803J714J839K003K141K355K555K570K537
$$ plain form
57556 144309 145886 147613 149326 150799 151838 152906 154933 158220 162051 165630 168814 171660 173815 174802
57542 174802 174602 173674 172682 172285 172762 173726 174582 175337 176556 178531 181000 183575 185773 186746 185928 184107 182955
57525 182955 183226 184263 185450 187032 189037 190559 190969 190977 191630 192974 194518 196356 198830 201613 204159 206693
57509 206693 209795 213242 216207 218446 220439 222401 223999 225089 225997 226918 227605 227782 227458 226788 225940 225022
57493 225022 223837 221909 219158 216298 214115 212523 210802 208575 206003 203226 200272 197537 195699 194999
57479 194999 195022 195236 195388 195311 194748 193521 191663 189371 186988 184926 183335 181937 180414 178778 177074 174987
57463 174987 172248 169382 167576 167579 169004 170795 172246 173478 175080 177333 179861 182078 183898 185691 187617
57448 187617 189396 190879 192375 194177 196122 197925 199639 201478 203481 205622 207977 210532 213102 215639
57434B15639K608K485J876J237J277J810J987J586J157Q96M25k14m04n4J41p7
57418B32375p9N14J138J297J372J853K505K880L079L406L845M297M735M815M022
57403B72054K699K087K740L615L485K599K143K499L007L134L048L051L173L365
57389C12699L658L950M000L726L376L422M121N141N742N642N437N721O036N457
57375C78128M019K742K155J850J632J998L023L771L472K560J904J744J934K557
57361D13489L513M168M189M223M973O059O556O346O106O216O342O077N407M657
57347D88321M304M738N824O902P444P456P128O545O010O005O448O618O235O011
57333E75989O577P443P736P426P099O925O673O481O775P471P938P824P398P105
$$ plain form
57434 215639 218247 220732 222608 223845 225122 226932 228919 230505 231662 232558 232983 232769 232365 232311 232452 232375
57418 232375 232296 232810 233948 235245 236617 238470 240975 243855 246934 250340 254185 258482 263217 268032 272054
57403 272054 274753 276840 279580 283195 286680 289279 291422 293921 296928 300062 303110 306161 309334 312699
57389 312699 316357 320307 324307 328033 331409 334831 338952 344093 349835 355477 360914 366635 372671 378128
57375 378128 382147 384889 387044 388894 390526 392524 395547 399318 402790 405350 407254 408998 410932 413489
57361 413489 417002 421170 425359 429582 434555 440614 447170 453516 459622 465838 472180 478257 483664 488321
57347 488321 492625 497363 503187 510089 517533 524989 532117 538662 544672 550677 557125 563743 569978 575989
57333 575989 582566 590009 597745 605171 612270 619195 625868 632349 639124 646595 654533 662357 669755 676860
57319F76860P132P390P640P673P609P813Q361Q930R309R650R950R856R279Q770
57305G96222Q846R398J0066J0780J1470J1824J1770J1742J1965J1997J1517J1053
57293I28650J1281J2028J2561J2575J2339J2181J2349J2968J3707J3882J3360
57282A067881J2853J2825J2776J2227J1683J1854J2410J2568J2382J2470J2800
57271A204729J2869J2889J3651J5156J6409J6835J7017J7775J9110K0355K0916
57260A387711K0671K0001J9557J9751K0460K1324K2127K2717K3030K3484K4829
57249A625662K7023K8824K9185K8578K8217K8407K8542K8351K8144K8021K7769
57238A936723K7501K7530K7668K7477K7093K7016K7149K6968K6545K6518K6942
$$ plain form
57319 676860 683992 691382 699022 706695 714304 722117 730478 739408 748717 758367 768317 778173 787452 796222
57305 796222 805068 814466 824532 835312 846782 858606 870376 882118 894083 906080 917597 928650
57293 928650 939931 951959 964520 977095 989434 1001615 1013964 1026932 1040639 1054521 1067881
57282 1067881 1080734 1093559 1106335 1118562 1130245 1142099 1154509 1167077 1179459 1191929 1204729
57271 1204729 1217598 1230487 1244138 1259294 1275703 1292538 1309555 1327330 1346440 1366795 1387711
57260 1387711 1408382 1428383 1447940 1467691 1488151 1509475 1531602 1554319 1577349 1600833 1625662
57249 1625662 1652685 1681509 1710694 1739272 1767489 1795896 1824438 1852789 1880933 1908954 1936723
57238 1936723 1964224 1991754 2019422 2046899 2073992 2101008 2128157 2155125 2181670 2208188 2235130
57227B235130K7189K7083K7216K7846K8375K8236K7588K6804K6012K5432K5413
57216B532324K5794K5875K5474K5274K5747K6380K6561K6633K7284K8346K8937
57205B824629K8737K8334K8207K7987K7072K5646K4535K4152K4009K3476K2596
57194C109380K1841K1341K1014K1170K2254K3876K4972K5209K5383K6079K6821
57183C369340K7048K7063K7136K6618K5038K3400K3071K3791K4026K3100K1695
57172C641326K0379J8976J7516J6635J6617J6974J7178J7023J6206J4551J2743
57161C826124J1746J1360J0402Q555O876O032N373M313L491L573L939L633K940
57148C908357K890L609M228M229L982L928M014L979L672K894J367j010m008p208
$$ plain form
57227 2235130 2262319 2289402 2316618 2344464 2372839 2401075 2428663 2455467 2481479 2506911 2532324
57216 2532324 2558118 2583993 2609467 2634741 2660488 2686868 2713429 2740062 2767346 2795692 2824629
57205 2824629 2853366 2881700 2909907 2937894 2964966 2990612 3015147 3039299 3063308 3086784 3109380
57194 3109380 3131221 3152562 3173576 3194746 3217000 3240876 3265848 3291057 3316440 3342519 3369340
57183 3369340 3396388 3423451 3450587 3477205 3502243 3525643 3548714 3572505 3596531 3619631 3641326
57172 3641326 3661705 3680681 3698197 3714832 3731449 3748423 3765601 3782624 3798830 3813381 3826124
57161 3826124 3837870 3849230 3859632 3868187 3875063 3881095 3886468 3890781 3894272 3897845 3901784 3905417 3908357
57148 3908357 3911247 3914856 3919084 3923313 3927295 3931223 3935237 3939216 3942888 3945782 3947149 3946139 3942131 3934923
57134C934923j0257j3069j5822j8663k1448k3966k6233k8164k9173k8680k7020
57123C692428k5110k3138k0374j6600j2934j0751j0375j1311j3148j5521j7578
57112C515588j8182j6486j1929l945P640K2095L8211N5317P3713R4346J18576
57101C874944J48255J85738K33597K94114L68631M57176N58942O73377Q00500
57092G595274R39987J090165J247919J408800J566514J712312J835301J923424
57084A9319696J964677J948972J870961J732230J541039J310010J053546P85375
57076C1526506N15297K46139k5887l05934n93818q81185j154140j398051j600543
57067B6328384j752301j847519j884832j867729j803809j703442j578286j439443
$$ plain form
57134 3934923 3924666 3911597 3895775 3877112 3855664 3831698 3805465 3777301 3748128 3719448 3692428
57123 3692428 3667318 3644180 3623806 3607206 3594272 3583521 3573146 3561835 3548687 3533166 3515588
57112 3515588 3497406 3480920 3468991 3465046 3472686 3494781 3532992 3588309 3662022 3756368 3874944
57101 3874944 4023199 4208937 4442534 4736648 5105279 5562455 6121397 6794774 7595274
57092 7595274 8535261 9625426 10873345 12282145 13848659 15560971 17396272 19319696
57084 19319696 21284373 23233345 25104306 26836536 28377575 29687585 30741131 31526506
57076 31526506 32041803 32287942 32262055 31956121 31362303 30481118 29326978 27928927 26328384
57067 26328384 24576083 22728564 20843732 18976003 17172194 15468752 13890466 12451023
57059A2451023j295756j153505j017468q91547p78156o77875n90406n15433m52059
57050E078818l98145l51375l10827k76701k48633k25197k05038j87547j72300
57041B703055j58632j46006j34222j23003j11978j01158r0872q1064p1237o1219
57031A623664n1273m1292l0477j8065l947J1481K7158M0652M8164M5942L2044
57020A684051P373k4007n5617q0900r6112j01249r8641r1164q1528p1816o2885
57009I27505n4635m7153m1023l6364l2418k8593k5183k2587k0559j8821j7714
56998E82455j7494j7534j6978j5802j4570j3489j2388j1302j0371r338p709n270
56986D30210k098J622N314P954Q991Q973Q678P794N257Q61m186q420j1263j2888
$$ plain form
57059 12451023 11155267 10001762 8984294 8092747 7314591 6636716 6046310 5530877 5078818
57050 5078818 4680673 4329298 4018471 3741770 3493137 3267940 3062902 2875355 2703055
57041 2703055 2544423 2398417 2264195 2141192 2029214 1928056 1837184 1756120 1684883 1623664
57031 1623664 1572391 1531099 1500622 1482557 1478610 1490091 1517249 1557901 1606065 1652007 1684051
57020 1684051 1691424 1667417 1611800 1530900 1434788 1333539 1234898 1143734 1062206 990390 927505
57009 927505 872870 825717 784694 748330 715912 687319 662136 639549 618990 600169 582455
56998 582455 564961 547427 530449 514647 500077 486588 474200 462898 452527 443189 435480 430210
56986 430210 428112 429734 435048 443002 451993 460966 469644 477438 482695 483556 479370 470950 459687 446799
56972D46799j3469j3034j1833j0459r410q523p050m504j420J093K592L845N958
56959C80585R276J3175J6596J8596J8739J7201J4336J0053M033l327j0575j6131
56947D72557j9340k0477k0130j8797j6788j4163j0933p412m110j201J609M554
56935C45369P585J0715J4204J8133K2076K5263K6778K5736K1729J5204P037k141
56923E37688j1623j9940k5462k7839k8030k6761k4049k0342j6960j4704j2965
56912C09013j0982r123q114p706p029n810m469l369k660k513k852l122k860k166
56898B36238j286j84J053K069K981M590P220R986J1941J3359J5077J7135J8876
56885C39055J9911K0113J9098J6543J2746Q149K775l079q161j1318j2861j3806
$$ plain form
56972 446799 433330 420296 408463 398004 388594 380071 373021 368517 367097 368190 370782 374627 380585
56959 380585 389861 403036 419632 438228 456967 474168 488504 498557 502590 499263 488688 472557
56947 472557 453217 432740 412610 393813 377025 362862 351929 344517 340407 339206 340815 345369
56935 345369 352954 363669 377873 396006 418082 443345 470123 495859 517588 532792 539829 537688
56923 537688 526065 506125 480663 452824 424794 398033 373984 353642 336682 321978 309013
56912 309013 298031 288908 280794 273088 266059 260249 255780 252411 249751 247238 244386 241264 238404 236238
56898 236238 234952 234768 235821 237890 240871 245461 252681 262667 274608 287967 303044 320179 339055
56885 339055 358966 379079 398177 414720 427466 435615 438390 435311 427150 415832 402971 389165
56873C89165j4072j2590r164n071j539J505M891R026J3634J8260K2936K8274L4694
56860D79949M1407M6640M9141M8729M5058L6905K3717P235r367k3472l3451l8164
56848F74327l7689l4058k9743k5322j9771j2731n067K637J0600J8799K6867L5322
56836F04171M5359N6938O8168P7035Q2442Q3177P7302O3524M2447J6009j3137
56825A203435m1105o3070p5736p9344p6612p0133o1434n1636m1740l2171k2801
56814E87653j3500m245N076J4520K3857L2868M1584M9713N5924N8155N4759M5280
56802I51644L0323J1115j0569l2138n0274o2045o6516o5172o0366n3567m5400
56791E47035l6802k9047k2536j6523j0382m392J030O185J1602J7190K2288K6224
$$ plain form
56873 389165 375093 362503 353339 348268 346729 348234 353125 362151 375785 394045 416981 445255 479949
56860 479949 521356 567996 617137 665866 710924 747829 771546 778781 769414 745942 712491 674327
56848 674327 636638 602580 572837 547515 527744 515013 509946 512583 523183 541982 568849 604171
56836 604171 649530 706468 774636 851671 934113 1017290 1094592 1158116 1200563 1216572 1203435
56825 1203435 1162330 1099260 1023524 944180 867568 797435 736001 684365 642625 610454 587653
56814 587653 574153 569908 574984 589504 613361 646229 687813 737526 793450 851605 906364 951644
56802 951644 981967 993082 982513 950375 900101 838056 771540 706368 646002 592435 547035
56791 547035 510233 481186 458650 442127 431745 427353 428383 434568 446170 463360 485648 511872
56779E11872K8370K7998K4454J7489P397m761j7041k7263l4190l7894l8977l7857
56767D19597l4979l1093k6876k2618j8603j5419j3458j2302j1077r383p621o400
56755B09768n814n394m753m060l719l617l184k303j633j597j659j202o35p53j368
56740A68077j544j092p70r20r85o00k75m67q66j023j073j291j528j525j333r68
56724A51817j76J011J941K071J711J573J830K044J825J192M50n4j58J2K28M10
56708A67727M92K17n16j176j059j95O26Q23M10m41j661k961l899m341m339l630
56692A46077k047l58K55k25o03k31J77j09p00r87j216j764k110j487j57Q86J174
56675A36575J035Q59P53P57Q36P75N21L93O17R85J309J809K604L313L697M174
$$ plain form
56779 511872 540242 568240 592694 610183 617580 612819 595778 568515 534325 496431 457454 419597
56767 419597 384618 353525 326649 304031 285428 270009 256551 244249 233172 223789 216168 209768
56755 209768 203954 198560 193807 189747 186028 182411 179227 176924 175291 173694 172035 170833 170198 169445 168077
56740 168077 166533 165441 164671 163751 162766 162166 161891 161424 160558 159535 158462 157171 155643 154118 152785 151817
56724 151817 151641 152652 154593 156664 158375 159948 161778 163822 165647 166839 167289 167235 167077 167089 167317 167727
56708 167727 168219 168436 167920 166744 165685 165490 166116 166939 167349 166908 165247 162286 158387 154046 149707 146077
56692 146077 144030 143672 143927 143702 143099 142868 143045 142936 142236 141249 140033 138269 136159 134672 134515 135401 136575
56675 136575 137610 138469 139222 139979 140815 141590 142111 142504 143121 144106 145415 147224 149828 153141 156838 161012
56659A61012N043N643N128L813K937L100L681L852L538L197L143L303L319K783
56645B13492J618K73o26q32o09l54l07m96p99j112j441j739j734j240o20m90q62
56628B02122j069p45l37l51o38q07q74r65q20j78N94Q41M94M4k24m87q67j179
56610A94554j305j490j985k554k593j807o99j84n87j233j263o79k32m18j016j580
56594A74929j851j668r97j73K88K87J16l2p4K93J280K274K352J611J200J706K399
56577A83940K442K047J858J949K107K439K973L221K829K269K196K552K922L382
56563B19126M291N546O755P919R328J0935J2379J3486J4174J4051J2645J0053
56551C40688O938L950J422m95j699k110j636m51O67P41l16j497j926j891k222
$$ plain form
56659 161012 166055 171698 176826 180639 183576 186676 190357 194209 197747 200944 204087 207390 210709 213492
56645 213492 215110 215383 214757 213925 213316 212962 212655 212159 211360 210248 208807 207068 205334 204094 203474 202984 202122
56628 202122 201053 200308 199971 199620 198982 198175 197301 196336 195516 195338 195932 196773 197267 197311 197087 196600 195733 194554
56610 194554 193249 191759 189774 187220 184627 182820 182121 181937 181350 180117 178854 178175 177943 177525 176509 174929
56594 174929 173078 171410 170413 170240 170528 170815 170931 170899 170825 171118 172398 174672 177024 178635 179835 181541 183940
56577 183940 186382 188429 190287 192236 194343 196782 199755 202976 205805 208074 210270 212822 215744 219126
56563 219126 223417 228963 235718 243637 252965 263900 276279 289765 303939 317990 330635 340688
56551 340688 347626 351576 352998 352503 350804 348694 347058 346607 347274 348015 347699 346202 344276 342385 340163
56536C40163l096l982m481m734n080n643o203o374o093n874o183o620o317n210
56522B64273m136l615l357l192l496m224m524l946l144k743k353j518p85q44j372
56507B21024j643j747k156k592k394j684j177j103j148j190j296j273j036j025
56493A99560j466j657r01K35O06J31k80k16j34k70k40J83P86J430K136K612K354
56476B04869J379K76m11m13L31J353J643P37m25n10N32J602J983J853J480Q40
56460B17119J02l69n55p28q80q36p91r77j024l86O78J283J010J83p14j225q58
56443B11032K77J045M72q16j289n57K90L60n7k87j42K56P25Q46K75o72j261j253
56425B09244j029q74p21n57m47l01r4j35n70r90j091j267j829k239j945j373r81
$$ plain form
56536 340163 337067 333085 328604 323870 318790 313147 306944 300570 294477 288603 282420 275800 269483 264273
56522 264273 260137 256522 253165 249973 246477 242253 237729 233783 230639 227896 225543 224025 223240 222396 221024
56507 221024 219381 217634 215478 212886 210492 208808 207631 206528 205380 204190 202894 201621 200585 199560
56493 199560 198094 196437 195536 195771 196377 196508 196228 196012 195878 195608 195368 195551 196337 197767 199903 202515 204869
56476 204869 206248 206524 206113 205700 206031 207384 209027 209764 209339 208829 209361 210963 212946 214799 216279 217119
56460 217119 217221 216852 216297 215569 214689 213853 213062 212085 211061 210675 211353 212636 213646 213829 213115 211890 211032
56443 211032 211309 212354 212826 212010 210721 210164 210454 210814 210757 210470 210328 210584 211309 212155 212430 211758 210497 209244
56425 209244 208215 207341 206620 206063 205616 205315 205221 205086 204516 203526 202435 201168 199339 197100 195155 193782 192801
56408A92801j15J898M135N148N242N947P418Q136P301N736M241K681J153L10Q3
56393B52115m63j420j731j126q22j520k216j875r96n09l40k1L17N41J099K015
56377B43048K314J501O62R74J947K262J679J003P36Q02J209J947K556K614K395
56362B67649K394K573K606K405J836O55o61q79L40J539J265J19k44M13Q85P09
56346B83604Q01J620K193J595M10q5M21J188J640J864K000J905J622J669K413
56331C04860L320L432K594J756J767K345K640K447K267K370K413J977J048n4q42
56316C34340q86k62L42L63l9m15o47o76j51Q27J231L91o85m80Q86J936K131K326
56298C40532K921L154K724K616L514M581M732M144L642L388L063K858L374M700
$$ plain form
56408 192801 192686 194584 198719 203867 209109 215056 222474 230610 237911 243647 247888 250569 251722 252032 252115
56393 252115 251652 250232 248501 247375 246553 245033 242817 240942 239946 239437 239097 239076 239393 239934 241033 243048
56377 243048 245362 246863 247525 248499 250446 252708 254387 255390 256126 256928 258137 260084 262640 265254 267649
56362 267649 270043 272616 275222 277627 279463 280118 279457 278578 278918 280457 281722 281841 281597 282010 282895 283604
56346 283604 284405 286025 288218 289813 290223 290138 290559 291747 293387 295251 297251 299156 300778 302447 304860
56331 304860 308180 311612 314206 315962 317729 320074 322714 325161 327428 329798 332211 334188 335236 335182 334340
56316 334340 333454 333192 333534 333897 333858 333443 332796 332120 331969 332796 334027 334418 333733 333253 334139 336075 338206 340532
56298 340532 343453 346607 349331 351947 355461 360042 364774 368918 372560 375948 379011 381869 385243 389943
56284C89943O176O944O604N589M934N284O173O768P125P866Q912R554R740J0129
56270D91741J0790J1095J1079J1639J3061J4556J5719J7142J9084K0774K1736
56259F58416K2650K4261K6495K9325L3312L8475M3831M8899N4633O1862O9838
56248A111997P7383Q4691R2762J01694J10587J18672J25647J31230J35178J37386
56238B227227J37371J34170J27306J17373J05100R0371P2724N2262K9670N845
56228C099419j8037m0600o0890p8481r2948j04057j12489j19229j23922j25081
56218B223685j22457j17947j13477j09062j03757r7482r0903q4377p7899p1543
56208A234781o5327n9187n3435m8601m4607m0917l7554l4898l2468k9361k6017
$$ plain form
56284 389943 396119 403063 409667 415256 420190 425474 431647 438415 445540 453406 462318 471872 481612 491741
56270 491741 502531 513626 524705 536344 549405 563961 579680 596822 615906 636680 658416
56259 658416 681066 705327 731822 761147 794459 832934 876765 925664 980297 1042159 1111997
56248 1111997 1189380 1274071 1366833 1468527 1579114 1697786 1823433 1954663 2089841 2227227
56238 2227227 2364598 2498768 2626074 2743447 2848547 2938918 3011642 3063904 3093574 3099419
56228 3099419 3081382 3040782 2979892 2901411 2808463 2704406 2591917 2472688 2348766 2223685
56218 2223685 2101228 1983281 1869804 1760742 1656985 1559503 1468600 1384223 1306324 1234781
56208 1234781 1169454 1110267 1056832 1008231 963624 922707 885153 850255 817787 788426 762409
56197G62409k3877k2918k1390j8538j5643j3644j1760r536q089p989p841o583
56185E94601n351n333n481m340k551j532j009l3P84L03p76q67j22J3n85o55K09
56168E67275J164J747K261K735L001L554M923O485P237P377P802Q586R216R832
56154F43195J0860J1873J2135J1904J2050J2871J4267J6356J8927K1303K3815
56143H09556K8287L5669M4321N2212N9699O8345P8036Q7084R4325R9288J01041
56132A557863R8769R2944Q4517P3891O2223N2410M6557M3363M0018L5743L1330
56121B219628K6220J8789R102r39r965j7740k4018k9050l4803m3390n4533o6277
56109A993024p7452q7327r3822r4869r1218q5385p8201o8912n8319m8860m1450
$$ plain form
56197 762409 738532 715614 694224 675686 660043 646399 634639 625103 617014 609025 601184 594601
56185 594601 589250 583917 578436 574096 571545 570013 569004 568971 569755 570058 569282 568415 568293 568306 567721 567066 567275
56168 567275 568439 570186 572447 575182 578183 581737 586660 593145 600382 607759 615561 624147 633363 643195
56154 643195 654055 665928 678063 689967 702017 714888 729155 745511 764438 785741 809556
56143 809556 837843 873512 917833 970045 1029744 1098089 1176125 1263209 1357534 1456822 1557863
56132 1557863 1656632 1749576 1834093 1907984 1970207 2022617 2069174 2112537 2152555 2188298 2219628
56121 2219628 2245848 2264637 2273739 2272800 2262835 2245095 2221077 2192027 2157224 2113834 2059301 1993024
56109 1993024 1915572 1828245 1734423 1639554 1548336 1462951 1384750 1315838 1257519 1208659 1167209
56098A167209l4840k8389k3009j9039j5465j1731q388n658l173j179j86M95J989
56085A018636L859M778M893N414O302O545O363O830P676P831P774Q788J0278J0536
56071A116503R895J0294J1865J2838J2887J3555J5130J6060J5908J6088J7226
56060A268249J8274J8782J9551K0631K1129K1201K1895K2895K2928K2337K2644
56049A500516K3598K3479K2284K1700K1951K1712K1139K1748K3148K3294K2334
56038A746903K2750K5185K7570K9021L1123L4556L7743L9803M1780M4119M5934
56027B126487M7390M9746N2470N3522N3044N3498N5597N7493N8475O0024O2529
56016B730275O4501O5745O7820P0858P3373P5590P9274Q4014Q7596R0319R4742
$$ plain form
56098 1167209 1132369 1103980 1080971 1061932 1046467 1034736 1026348 1020690 1017517 1016338 1016152 1016647 1018636
56085 1018636 1022495 1027273 1032166 1037580 1043882 1050427 1056790 1063620 1071296 1079127 1086901 1095689 1105967 1116503
56071 1116503 1126398 1136692 1148557 1161395 1174282 1187837 1202967 1219027 1234935 1251023 1268249
56060 1268249 1286523 1305305 1324856 1345487 1366616 1387817 1409712 1432607 1455535 1477872 1500516
56049 1500516 1524114 1547593 1569877 1591577 1613528 1635240 1656379 1678127 1701275 1724569 1746903
56038 1746903 1769653 1794838 1822408 1851429 1882552 1917108 1954851 1994654 2036434 2080553 2126487
56027 2126487 2173877 2223623 2276093 2329615 2382659 2436157 2491754 2549247 2607722 2667746 2730275
56016 2730275 2794776 2860521 2928341 2999199 3072572 3148162 3227436 3311450 3399046 3489365 3584107
56005C584107J00917J06282J10538J16010J22819J28613J33515J40217J48672
55996D691690J56090J62722J71978J84060J95577K06308K19912K36708K52453
55987F477498K65923K81071K99815L19527L39565L63358L91839M21813M53034
55978I613443M89624N32467N77917O26192O82804P49453Q22410R02407R96639
55969A5993356J108219J234093J376803J547518J753742J996084K281900K630078
55961B9921793L057473L573994M196298M951654N862403O944030Q227738R769532
55953G6504915J1631705J3878151J6594082J9867180K3695068K7881504L1985148
55946B22037753L5306627L6919010L5836654L1351049K3355358J2447013j80363
$$ plain form
56005 3584107 3685024 3791306 3901844 4017854 4140673 4269286 4402801 4543018 4691690
55996 4691690 4847780 5010502 5182480 5366540 5562117 5768425 5988337 6225045 6477498
55987 6477498 6743421 7024492 7324307 7643834 7983399 8346757 8738596 9160409 9613443
55978 9613443 10103067 10635534 11213451 11839643 12522447 13271900 14094310 14996717 15993356
55969 15993356 17101575 18335668 19712471 21259989 23013731 25009815 27291715 29921793
55961 29921793 32979266 36553260 40749558 45701212 51563615 58507645 66735383 76504915
55953 76504915 88136620 102014771 118608853 138476033 162171101 190052605 222037753
55946 222037753 257344380 294263390 330100044 361451093 384806451 397253464 397073101
55939C97073101j2915039k3987491l1924076l6059849l6718943l4876927l1602710
55932A88988066k7715473k3754987k0057494j6791771j3994483j1641320r696647
55925F5335891q110602o815133n749628m876644m165119l578052l086378k677739
55917B6276596k341464k058562j813909j604632j428607j276304j140690j023747
55909A3588681r26194q40692p61415o90901o31532n78920n29451m85984m50480
55900G693112m18503l86451l57086l32739l09833k85233k61813k42678k25647
55891D873129k08201j92498j80697j70199j58085j45939j36141j27421j17840
55882C436108j08495j00893r4307q8577q5787q6397q7466q7132q6947q7444q5852
$$ plain form
55939 397073101 384158062 360170571 328246495 292186646 255467703 220590776 188988066
55932 188988066 161272593 137517606 117460112 100668341 86673858 75032538 65335891
55925 65335891 57225289 50410156 44660528 39783884 35618765 32040713 28954335 26276596
55917 26276596 23935132 21876570 20062661 18458029 17029422 15753118 14612428 13588681
55909 13588681 12662487 11821795 11060380 10369479 9737947 9159027 8629576 8143592 7693112
55900 7693112 7274609 6888158 6531072 6198333 5888500 5603267 5341454 5098776 4873129
55891 4873129 4664928 4472430 4291733 4121534 3963449 3817510 3681369 3553948 3436108
55882 3436108 3327613 3226720 3132413 3043836 2958049 2871652 2784186 2697054 2610107 2522663 2436811
55871B436811q0920p5818p3211p1426o8413o5579o4468o3270n9938n5730n2598
55860A705440m9940m6618m3446m1074l8265l4581l1950l1289l0550k8339k6402
55849A302986k6263k6485k5742k5489k6932k8272k7672k6275k5638k4817k2581
55838A016820k0038j8431j6877j4689j3480j4252j4933j3467j1110j0009r714
55827H59820q859q138q740r684r538r098r765j0880j1192j1316j2238j2993j2354
55814G25025j1403j1807j2845j2589j0844q749o681m746l961m704n183l667j118
55801F26728M48J002J767K763L249L568M319M687L662K097J551J937K093J751
55787F61622J187j8k003l461l322k685l297n110p102r428j2769j6381j8772j9604
$$ plain form
55871 2436811 2355891 2280073 2206862 2135436 2067023 2001444 1936976 1873706 1813768 1758038 1705440
55860 1705440 1655500 1608882 1565436 1524362 1486097 1451516 1419566 1388277 1357727 1329388 1302986
55849 1302986 1276723 1250238 1224496 1199007 1172075 1143803 1116131 1089856 1064218 1039401 1016820
55838 1016820 996782 978351 961474 946785 933305 919053 904120 890653 879543 869534 859820
55827 859820 850961 842823 834083 824399 814861 805763 795998 785118 773926 762610 750372 737379 725025
55814 725025 713622 701815 688970 676381 665537 656788 650107 645361 641400 636696 631513 627846 626728
55801 626728 627176 628178 629945 632708 635957 639525 643844 648531 652193 654290 655841 657778 659871 661622
55787 661622 662809 662791 660788 657327 654005 651320 648023 642913 635811 626383 613614 597233 578461 558857
55773E58857j9303j7731j4884j1945r856p816m932k230j188j288j067p05j381
55760D64531k846l749l900m184m754n137n683o977q314q557q038p893q002p393
55746C79104o235n604n573n288m701m488m566m234l570l190k998k596k489l253
55732C20319m024l460j855o57k80l2J06n15j692k516k911l510m145m099l656l726
55716B83347m024l348j699m96m41p30n62r9L87J071J998K890L656M211M012K714
55700B92887J003k69j389l073m884n712n583n526n785n612m730l671k721j760
55686B43175j069j029j132o00K48N39N88J474L050L898L434K568K055J636J061
55671B59896O21K79l99j171j147k63M18K04l97o86n85k34K59N33L25K00R04K008
$$ plain form
55773 558857 539554 521823 506939 494994 485138 477322 472390 470160 468972 467684 466617 465912 464531
55760 464531 461685 457936 454036 449852 445098 439961 434278 427301 418987 410430 402392 394499 386497 379104
55746 379104 372869 367265 361692 356404 351703 347215 342649 338415 334845 331655 328657 326061 323572 320319
55732 320319 316295 312835 310980 310323 310043 310011 310117 309602 307910 305394 302483 298973 294828 290729 287073 283347
55716 283347 279323 275975 274276 273780 273339 272609 272047 271948 272335 273406 275404 278294 281950 286161 290173 292887
55700 292887 293890 293621 292232 289159 284275 278563 272980 267454 261669 256057 251327 247656 244935 243175
55686 243175 242106 241077 239945 239345 239593 240132 240720 242194 245244 249142 252576 255144 257199 258835 259896
55671 259896 260517 260796 260397 259226 258079 257816 258234 258438 258041 257355 256770 256536 256795 257328 257653 257853 258757 260765
55653B60765K324J759J460J948K305J714O41m7k07k45m86j117k035k639k439j969
55637B61732k310l644n100n960o235o088n671n405n484n202l865k190j561j917
55623B01100j873r64k88n48j013r76q80j199j480j285j123j502j934j749j240
55608A83046j139j516j831j817j630j509j621j993k319k203j703j238r14m57J45
55593A61301N96Q76J184J295P69j53p20q41j176j919k350j963j097k37N47J191
55577A57303J524J810K554L445L465K450J597J927L081M136M786N106M935M203
55563B02322L238K229Q99q33k480l746m994o418p422p368o401m991l320j675q23
55548A58217j155j924k029j358o64m73o43q48r08o87j89L00M92M34L93M73N48
$$ plain form
55653 260765 263089 264848 266308 268256 270561 272275 272916 272869 272662 272417 271931 270814 268779 266140 263701 261732
55637 261732 259422 255778 250678 244718 238483 232395 226724 221319 215835 210633 206768 204578 203017 201100
55623 201100 199227 198263 197975 197427 196414 195438 194558 193359 191879 190594 189471 187969 186035 184286 183046
55608 183046 181907 180391 178560 176743 175113 173604 171983 169990 167671 165468 163765 162527 161613 161156 161301
55593 161301 161897 162773 163957 165252 166021 165868 165148 164307 163131 161212 158862 156899 155802 155565 156112 157303
55577 157303 158827 160637 163191 166636 170101 172551 174148 176075 179156 183292 188078 193184 198119 202322
55563 202322 205560 207789 208688 207855 205375 201629 196635 190217 182795 175427 169026 164035 160715 159040 158217
55548 158217 157062 155138 153109 151751 151087 150614 149971 149123 148215 147528 147339 147639 148131 148565 148958 149431 149979
55531A49979M79K49O0K46Q86J527J669J457J405J485J059p9j272j867k041k356
55515A52886k909l269l097k510j961j850k154k426k343k130k114k118j755j177
55501A21073q90q45m39M51J086P93j69r78j102o31n1J63q1m61o87p91p80l63O06
55482A15904J745K656L386L909L730K714J729J497J395M83p15r15k09K8o53j250
55466A35434j247j416k148k506j753o13j32k69m37n39p12p48n14k93k07R5O59
55449A22654R05N96K92L29K03l90p98m26K31L70Nl80o76r46r49o37n30r49j377
55430A17527j218o56j40L46Q94J131P78K73J66L61N36P16Q74N63l45j168j326
55413A19312j197j329j452r90r8N82P69M93k64j164j384o35J47l6q44j169o37
$$ plain form
55531 149979 150458 150707 150767 151013 151899 153426 155095 156552 157957 159442 160501 160422 159150 157283 155242 152886
55515 152886 149977 146708 143611 141101 139140 137290 135136 132710 130367 128237 126123 124005 122250 121073
55501 121073 120183 119338 118899 119350 120436 121229 121060 120082 118980 118349 118298 118461 118380 117919 117232 116441 115661 115298 115904
55482 115904 117649 120305 123691 127600 131330 134044 135773 137270 138665 139148 138433 137518 137309 137337 136684 135434
55466 135434 134187 132771 130623 128117 126364 125751 125619 125350 124913 124374 123662 122914 122400 122107 121900 121995 122654
55449 122654 123559 124155 124447 124776 124979 124589 123791 123365 123596 123966 123971 123591 122915 121969 121020 120383 119853 118904 117527
55430 117527 116309 115653 115513 115859 116753 117884 118662 118935 119101 119462 119998 120714 121588 122151 121806 120638 119312
55413 119312 118115 116786 115334 114344 114246 114828 115597 116090 115826 114662 113278 112643 112790 112754 111910 110741 110104
55396A10104K95J220J893J917J170K61j94l44m75k41O15J389J300P14M24K79k40
55379A20087o30m4R37Q28m17j211o99Q8L3n28p51o18n70n57l50r3N0L30Q49J072
55359A17806N14m55j065j063p15k42K36M62L25J85M13P05L68o11j300q76L58J217
55341A16262Q60m58j729k150j662p72k8L36L73J81j89n66n11K32J171J342M72
55324A13164n68q18l92n7j1J11K75Ko41r75p48m50k95J92J145J806J558Q09K77
55305A14384kk85m04j29K27K63J09P8P5m2J0M13O48J21q86j507j329o00L06J042
55285A12492J285J033P46P43Q05O91O28P86Q20M16j17m02n75q20q19l59L1j81
55267A17203o50o77j96M34J083J589J447N58j99j60rp40j936k283j478m29K30
$$ plain form
55396 110104 110399 111619 113512 115429 116599 116860 116666 116322 115847 115606 116221 117610 118910 119624 120048 120327 120087
55379 120087 119457 119413 120350 121178 120761 119550 118851 118939 118972 118444 117693 117075 116505 115948 115598 115505 115555 115885 116734 117806
55359 117806 118320 117865 116800 115737 115022 114780 115016 115478 115803 115988 116401 117106 117474 116863 115563 114687 115045 116262
55341 116262 117122 116664 114935 112785 111123 110351 110323 110659 111032 111213 111024 110458 109947 110179 111350 112692 113164
55324 113164 112596 111778 111386 111329 111318 111429 111704 111706 111065 110090 109342 108892 108597 108789 109934 111740 113298 114107 114384
55305 114384 114382 114097 113693 113564 113791 114054 114163 114241 114316 114274 114284 114697 115345 115466 114580 113073 111744 111144 111450 112492
55285 112492 113777 114810 115556 116299 117104 117795 118423 119209 120029 120445 120328 119926 119351 118531 117712 117353 117384 117203
55267 117203 116553 115876 115680 116114 117197 118786 120233 120791 120592 120432 120423 119683 117747 115464 113986 113557 113787
55250A13787O75R98R51O57N61O34M14j14n68q79j169j088l25M17J62p76j137o74
55232A12526l96p14p82j97M1r09k171k174o42J201K087J796J041P20J119J604
55216A14150J294J18j100j548j098j98M80L72m80j321j496j156p75l18M59J219
55200A08602J440J308J377J535J232N64J23n3m12q92j009p99o56m32J08K38q74
55183A11400k321k214m86P73K92p71j022r14j455k162j735l8J803K769K578J468
55167A07965J87l29J06P30J015J287J773J913J325N61J81p8m90n58O3O89O15K32
55149A17187K00J61n87j670k099j693j024k64Q02J829K021J241K20l45l00J34
55133A15813M91K50m94q42j41J088J841J835J422Q27J71j82j11j64p21j259j175
$$ plain form
55250 113787 114462 115460 116411 117068 117629 118263 118677 118563 117995 117116 115947 114859 114534 114951 115113 114337 113200 112526
55232 112526 112130 111416 110634 110437 110478 109569 107398 105224 104582 105783 107870 109666 110707 111427 112546 114150
55216 114150 115444 115562 114462 112914 111816 111618 112098 112470 111990 110669 109173 108017 107242 106924 107383 108602
55200 108602 110042 111350 112727 114262 115494 116058 116181 116128 115716 114824 113815 113016 112360 111928 112036 112274 111400
55183 111400 109079 106865 106379 107152 107444 106673 105651 104737 103282 101120 99385 99347 101150 103919 106497 107965
55167 107965 108152 107823 107929 108659 109674 110961 112734 114647 115972 116533 116714 116636 116146 115588 115651 116340 116955 117187
55149 117187 117387 117548 116961 115291 113192 111499 110475 110211 111013 112842 114863 116104 116324 115979 115679 115813
55133 115813 116304 116554 116060 115218 115077 116165 118006 119841 121263 122090 122261 122079 121968 121804 121083 119824 118649
55116A18649q13p05m82L25R69M59n37l46J152K214J780Q09N26O98N48J95J70K93
55098A25904Qn74q60p44o22o64o40m10r8K13M83N51K41l28p77q40n68k03L4O2
55078A20168l0k0L16J034J837K146J625P38L80P40R55K82p71j091n14j1k86q90
55060A26608r65l58L13M20j15p72q70k45M71N01j17n87m02J61O12Q64R39O58K6
55041A27142l97j12N23O42k1q91j447j752j889j529n88J55r8r20j040q9R38J228
55023A19855J231J585J814J145N1k10N06J015O24N4J05M55L65o9j44M04J164J587
55005A31537J342N55j32q3M88O92J54n63q99r17o77N2R79J074kj078r82j61J93
54986A31572KP0M64M28k02o88n84k38L3L18N91N47J73j98m54o20l84M84J276R04
$$ plain form
55116 118649 117836 117131 116649 116974 117943 118402 117865 117519 118671 120885 122665 123474 124000 124698 125246 125441 125611 125904
55098 125904 125912 125338 124478 123734 123112 122448 121808 121398 121300 121513 121996 122547 122788 122460 121683 120843 120275 120072 120106 120168
55078 120168 120138 120118 120434 121468 123305 125451 127076 127814 128194 128934 129889 130171 129400 128309 127795 127784 127498 126608
55060 126608 125643 125285 125598 126018 125903 125131 124261 124016 124487 124988 124871 124284 123882 124043 124655 125519 126458 127116 127142
55041 127142 126745 126633 127156 127798 127777 126886 125439 123687 121798 120269 119681 119836 119738 118818 117778 117689 118627 119855
55023 119855 121086 122671 124485 125630 125681 125471 125977 126992 127616 127670 127775 128230 128595 128526 128382 128786 129950 131537
55005 131537 132879 133434 133302 133219 133707 134399 134553 133990 133091 132174 131497 131549 132528 133602 133600 132522 131540 131379 131572
54986 131572 131574 131644 132108 132536 132334 131646 131062 130824 130857 131175 131766 132313 132486 132288 131834 131214 130830 131314 132590 133494
54966A33494n59j733j591m83O77J404J563J118L76j42l22m21k83N88J924K554
54950A38164J876O67n7k63m38n27j96L74O37M56J09k22m97n95m93m80p87j207
54932A36521j451j577j684j460n64P01J592J731J385J044R87J193J447J604J924
54917A43393K822M124M990M897M424M499N143N455M766L267J587J79p73j329j810
54902A85634k570l568m429m943n230n308m879l779k479j751j829k086j693n11
54888A40579P45J261R13L06N8K69O32Q47Q39O84N29N79R93J734K540L119L358
54871A59985L371L335L391L701M411N264N380L963J356j045k306k946l927n076
54857A78857n317m368l289l083l518l735l457l032k688k387k199k249k278j783
$$ plain form
54966 133494 132935 131202 129611 129128 129805 131209 132772 133890 134266 134124 133802 133381 133098 133686 135610 138164
54950 138164 140040 140707 140650 140387 139949 139422 139226 139600 140237 140693 140802 140580 140083 139488 138995 138515 137728 136521
54932 136521 135070 133493 131809 130349 129785 130486 132078 133809 135194 136238 137225 138418 139865 141469 143393
54917 143393 146215 150339 155329 160226 164650 169149 174292 179747 184513 187780 189367 189546 188773 187444 185634
54902 185634 183064 179496 175067 170124 164894 159586 154707 150928 148449 146698 144869 142783 141090 140579
54888 140579 141324 142585 143498 143804 143862 144131 144763 145610 146449 147133 147662 148241 149234 150968 153508 156627 159985
54871 159985 163356 166691 170082 173783 178194 183458 188838 192801 194157 193112 190806 187860 183933 178857
54857 178857 173540 169172 165883 162800 159282 155547 152090 149058 146370 143983 141784 139535 137257 135474
54843A35474o92L96P92L88l13o86n16j12L9j65l84l50k65n12j038j376j212p10
54825A28758k05J90M75N31K41j77l04o6N6l48j000j224q03k20O4J19J75J83O3
54806A26508J36P44J612K047J775J178O98L90J54K9Ro9k52l20j16J27N3l16n57
54787A33830l21K48O46N66K42J52L76N30L91K54L43L18k10q84r03j10Q59J508
54769A37835K000K585L101L379L646M100M483M478M306M503N113N549N240M292
54755A94610L389L013K794J793l87k960m772n579n986o240n902m854l830l419
54741A61670l171k451j635j598k269k541j787o65j52l25m53k4P26J192J122Q91
54725A48530J059J662K062J756J083Q23J215J773K129K544L381M458N225N364
$$ plain form
54843 135474 134782 135178 135970 136358 136045 135359 134843 134731 134770 134605 134221 133871 133606 133094 132056 130680 129468 128758
54825 128758 128553 128743 129218 129749 129990 129813 129509 129443 129499 129151 128151 126927 126124 125904 125968 126087 126262 126445 126508
54806 126508 126644 127388 129000 131047 132822 134000 134698 135088 135242 135271 135280 135211 134959 134639 134523 134650 134703 134387 133830
54787 133830 133509 133757 134403 134969 135211 135363 135739 136269 136660 136914 137257 137575 137365 136481 135578 135468 136327 137835
54769 137835 139835 142420 145521 148900 152546 156646 161129 165607 169913 174416 179529 185078 190318 194610
54755 194610 197999 201012 203806 205599 205212 202252 197480 191901 185915 179675 173773 168919 165089 161670
54741 161670 158499 156048 154413 152815 150546 148005 146218 145553 145401 145076 144623 144599 145325 146517 147639 148530
54725 148530 149589 151251 153313 155069 156152 156975 158190 159963 162092 164636 168017 172475 177700 183064
54711A83064M893L873K360N66j169k623l706m309m339l976l552l199k766k222
54697A62895j905k110k626k918k713k190j603r73k42M61Q71Q40M99J42m9k40p50
54680A47389j544k046j787j081p23r99j417j479j280j107r42o60l62r9L87J180
54664A33430J711J321K12o76p67l02K51P39J162J353J127N19k07p02p59n76o57
54647A37179j203j685j450o06J45N30R82J724K189J728N91k68k08M72R56P58J46
54630A41980k50j99k8j2R8N63J002Q03N4m89m52k75m88j025j478j603j275m16
54612A36510P60J651J788J262N27j6j73RK07O0l87p12o91n44n08m77k33K35P56
54593A40024J095J036O56N20J041J642J188m81k079k384j656j062j079j186q59
$$ plain form
54711 183064 187957 191830 194190 194756 193587 190964 187258 182949 178610 174634 171082 167883 165117 162895
54697 162895 160990 158880 156254 153336 150623 148433 146830 145857 145615 146076 146947 147787 148286 148428 148379 148139 147389
54680 147389 145845 143799 142012 140931 140208 139209 137792 136313 135033 133926 132984 132324 131962 131863 132250 133430
54664 133430 135141 136462 136674 135998 135231 134929 135180 135919 137081 138434 139561 140080 139873 139171 138412 137836 137179
54647 137179 135976 134291 132841 132235 132380 132910 133892 135616 137805 139533 140124 139856 139648 140120 141076 141834 141980
54630 141980 141730 141531 141503 141491 141589 142152 143154 143957 144011 143522 143070 142795 142307 141282 139804 138201 136926 136510
54612 136510 137270 138921 140709 141971 142498 142482 142309 142318 142525 142585 142198 141486 140795 140251 139743 139266 139033 139268 140024
54593 140024 141119 142155 142811 143331 144372 146014 147202 146721 144642 142258 140602 139540 138461 137275 136416
54578A36416k05M00P58Q69Q71R71J192J207P42L0m10m31l48l49k37J88P45J105
54560A43514J211J200J046N42k70r26j020o92l63p0M39J004R45%j111j482j016
54543A42951j83P46J639K067J714J028P53Q99R93J098J726K667L008K445J625
54528A65176R33L4j035j398o75J82J38n44r71r82r94j072r47o71m38j52J75P4
54510A56833o89j420j281m43K74N34N21K19m96j205j281p67k15J74N70Q48P62
54493A52938O25R60J494J376M94k47j84L09N64M91L69K65Q1j46k60k17j16j72
54475A58624n46j071j295r69l47K83J002J875K517K587K354K216J956J176K40
54460A70602n8L36O50L85j84o33q47p61k88L34O85O73M78J8q90j824j936j008
$$ plain form
54578 136416 136211 136611 137369 138238 139109 140080 141272 142479 143221 143251 142841 142410 142062 141713 141476 141664 142409 143514
54560 143514 144725 145925 146971 147513 147243 146317 145297 144605 144242 144172 144611 145615 146560 146560 145449 143967 142951
54543 142951 142768 143514 145153 147220 148934 149962 150715 151614 152607 153705 155431 158098 161106 163551 165176
54528 165176 166109 166143 165108 163710 163035 163217 163355 162811 161840 160858 159864 158792 157845 157174 156736 156584 156759 156833
54510 156833 156144 154724 153443 153000 153274 153808 154329 154548 154052 152847 151566 150799 150584 150758 151328 152176 152938
54493 152938 153563 154523 156017 157393 157887 157640 157456 157765 158329 158820 159189 159454 159535 159389 159129 158912 158796 158624
54475 158624 158078 157007 155712 154743 154396 154679 155681 157556 160073 162660 165014 167230 169186 170362 170602
54460 170602 170544 170880 171530 171915 171731 171098 170251 169490 169202 169536 170221 170894 171372 171390 170500 168676 166740 165732
54442A65732K52J042J154P57P1n88r90j252j560j663j159k29N73J141J730K115
54426A67126J701N83l60o11n59o20o15k95J82O04R52J077P29Q8l44n05p24q81
54408A67528m83K43L65k62n80N3Q41Q61M32L39M78K63j99l33q3K07N58J188J847
54389A73263K049J749J139K11q42j248o50l2o29k031k569j541m2O55N29K43L4
54372A70288k28m50m01q2L68Q97J361J456J139Q72J071J473J496J109R51J361
54356A82681J706J078m04j454j043L85J593K098K441K919K977K244J425J467K201
54341B02314K568K036J155O36M84J63p38k135l457l989l506k601k168k484l046
54326A85232l252k955k303j410l67N78J099R79K09r57j960k140j263J37J106J120
$$ plain form
54442 165732 165984 167026 168180 168937 169008 168420 167430 166178 164618 162955 161796 161567 162140 163281 165011 167126
54426 167126 168827 169410 169050 168439 167880 167260 166645 166350 166532 167136 168088 169165 169894 169982 169638 169133 168409 167528
54408 167528 167045 167288 167653 167391 166811 166864 167705 168566 168998 169337 169815 170078 169879 169546 169463 169670 170228 171416 173263
54389 173263 175312 177061 178200 178411 177569 176321 175671 175639 175010 172979 170410 168869 168827 169482 170011 170254 170288
54372 170288 170060 169610 169209 169127 169495 170392 171753 173209 174348 175220 176291 177764 179260 180369 181320 182681
54356 182681 184387 185465 185061 183607 182564 182949 184542 186640 189081 192000 194977 197221 198646 200113 202314
54341 202314 204882 206918 208073 208709 209193 209356 208618 206483 203026 199037 195531 192930 190762 188278 185232
54326 185232 181980 179025 176722 175312 174945 175523 176622 177601 177810 176853 174893 172753 171490 171627 172733 173853
54310A73853M93j42n96j039j328r86q9M86J57n10o68m44n27p82n26ll59j734k616
54291A62640j790N4J442J933J958J637Q64J18J2K88K10k09l07R5M94N94N27L24
54273A70884j2KP63J568J232j69j148p50L42J006J055Q31L27n62j375j467p96
54256A71731J61R71J370J135L39m99q64p02j93N61J334J685J438R87P17M41j81
54239A80431r86j458j413j043o01l53o06j266j605j012P7O31L53J0L19J070J548
54222A74096J427Q91J99n07j040j145o91J03P19P25J74m32p23q08r13q83m71M6
54204A70767J07k23j89N18J116P47k63p79l76J79Q4m78p78n68k15n1o8j89m92
54185A68849r53j274j145o14l3L42N88Q53R14L26q42j661j197K17J136P04k86
$$ plain form
54310 173853 174346 174204 173608 172569 171241 170255 170166 170652 170809 170299 169631 169187 168660 167878 167352 167349 166990 165256 162640
54291 162640 160850 160904 162346 164279 166237 167874 168738 168856 168868 169156 169366 169157 168850 168945 169439 170033 170560 170884
54273 170884 170872 170874 171637 173205 174437 174268 173120 172370 172712 173718 174773 175604 175931 175369 173994 172527 171731
54256 171731 171892 172863 174233 175368 175707 175208 174344 173642 173449 174010 175344 177029 178467 179454 180171 180612 180431
54239 180431 179445 177987 176574 175531 174930 174577 173971 172705 171100 170088 170165 170796 171149 171159 171478 172548 174096
54222 174096 175523 176414 176613 176106 175066 173921 173230 173333 174052 174777 174951 174519 173796 172988 172075 171192 170721 170767
54204 170767 170874 170651 170462 170980 172096 172843 172580 171801 171425 171604 171688 171210 170432 169864 169649 169598 169530 169341 168849
54185 168849 167896 166622 165477 164863 164830 165172 165760 166613 167527 167853 167011 165350 164153 164370 165506 166210 165924
54168A65924m64L49J143J194P45J44p13j700k021j165J47P14K69m91j020j322
54152A61733j329p60J91P33M62o7j01L26O53O58N66N03L49K01M07J003J439J129
54134A68096J84o45o67J24J126J669J515R42L92P6n3j19j72j99j29J48O25J012
54116A73925R81N99L31M52O23L37l82r74j004n24K07R75J467J298N02k33j98N46
54098A78928J232J235O10j72p44j016j091j046q43l99K21Q24J316J718J881J506
54082A84160O35j43l34j36lQ3M10P95P77M83N79J166J428Q07j25m78k34L5K78
54063A90183J011K276L270L321K731K294K286K381K411K687L384M101M481M961
54049B31778O245Q025Q934Q139O286M419K599M01j821l159l480l446l237k324
$$ plain form
54168 165924 165460 165809 166952 168146 168891 169035 168322 166622 164601 163436 163583 164297 164566 164075 163055 161733
54152 161733 160404 159644 159835 160568 161030 160963 160862 161188 161841 162499 163065 163568 163917 164118 164525 165528 166967 168096
54134 168096 168280 167635 166968 167092 168218 169887 171402 172344 172736 172812 172759 172640 172468 172269 172140 172288 172913 173925
54116 173925 174906 175505 175836 176288 176911 177248 176866 175892 174888 174364 174571 175546 177013 178311 178813 178580 178382 178928
54098 178928 180160 181395 182005 181833 181089 180073 178982 177936 177093 176694 176915 177739 179055 180773 182654 184160
54082 184160 184795 184652 184318 184182 184179 184262 184672 185467 186244 186727 187306 188472 189900 190707 190582 190104 189870 189905 190183
54063 190183 191194 193470 196740 200061 202792 205086 207372 209753 212164 214851 218235 222336 226817 231778
54049 231778 238023 246048 254982 263121 269407 273826 276425 276826 275005 271846 268366 264920 261683 259359
54035B59359o38R95K017K729L384L639L492L722M654N286M604L060J871J356R70
54020C00500N33L50L58J94J2K98Q26P22k98j571k504l254m160n134n906o356o462
54003B68148o203n681m943l876k610j866k187l019l238k551j667j086o04j53k07
53988B28257q82j472j339q31p22j179j711j812j325m93P6j48r35j398j038l39
53972B12709k1j66l82m63m38k60P1L11K89K33M06O26N52L03L76R47J674K177K407
53953B21351K411K142J673J477K139L691N380O307O293N942N811N824N690N521
53939B81652N585N674N297M415L500K788K074J286P10M41J17m39p65l84N16J331
53923C13798J782K054K468L230M299N248N554N323N407O384P688Q228P714O938
$$ plain form
54035 259359 258721 259716 261733 264462 267846 271485 274977 278699 283353 288639 293243 296303 298174 299530 300500
54020 300500 301033 301383 301741 301935 301947 302245 303071 303793 303495 301924 299420 296166 292006 286872 280966 274610 268148
54003 268148 261945 256264 251321 247445 244835 242969 240782 237763 234525 231974 230307 229221 228617 228464 228257
53988 228257 227375 225903 224564 223733 223011 221832 220121 218309 216984 216491 216567 216419 215484 214086 213048 212709
53972 212709 212688 212522 212140 211677 211239 210979 211050 211361 211650 211883 212289 212915 213467 213770 214146 215093 216767 218944 221351
53953 221351 223762 225904 227577 229054 231193 234884 240264 246571 252864 258806 264617 270441 276131 281652
53939 281652 287237 292911 298208 302623 306123 308911 310985 312271 312981 313422 313539 313100 312335 311951 312467 313798
53923 313798 315580 317634 320102 323332 327631 332879 338433 343756 349163 355547 363235 371463 379177 386115
53909C86115O746P232P926Q402Q468Q112P516P141P516Q806J0489J1601J1426
53896D97496R926P349L602j631p990j4021j8086j9632j9434j8628j7756j6715
53884C84480j5380j3957j2708j1525j0075q343o764n670m918m285l862l700l445
53871B79848k833k392k880m099m871m368k941j502o79o90j421k307k696k656k879
53856B40634l561l897l192j937j230j455k022k177j612n64L21M47l9k95J74Q84
53840B20479J161J034Q22L87m97j364j510j053o65m11K77J354J922J544R24P57
53824B25161O60o5j080j294l26R88J677J643J441J405J369J140Q88R34J275J522
53808B37338J371J033J061J732K719L384L420L178L328M191N392O273O521O276
$$ plain form
53909 386115 392861 400093 408019 416421 424889 433001 440517 447658 455174 463980 474469 486070 497496
53896 497496 507422 514771 518373 516742 508752 494731 476645 457013 437579 418951 401195 384480
53884 384480 369100 355143 342435 330910 320835 312492 305728 300058 295140 290855 286993 283293 279848
53871 279848 277015 274623 271743 267644 262773 258405 255464 253962 253283 252593 251172 248865 246169 243513 240634
53856 240634 237073 233176 229984 228047 226817 225362 223340 221163 219551 218987 219308 219755 219716 219421 219595 220479
53840 220479 221640 222674 223496 223883 223386 222022 220512 219459 218794 218383 218660 220014 221936 223480 224404 225161
53824 225161 225821 225756 224676 223382 223056 224044 225721 227364 228805 230210 231579 232719 233607 234541 235816 237338
53808 237338 238709 239742 240803 242535 245254 248638 252058 255236 258564 262755 268147 274420 280941 287217
53794B87217N711M881L968L303K888K348J563J036J174J521J274M09l02m90p40
53779C15761j706l188m393m823m535l874l314l352m052m719m584l774l198l300
53765B62949l524l273k854k918l316l251k497j706j376j185p14j95o5k60m93q26
53749B34496j427k007k145j896j499p75M32J478J483O34LK1J04k9K06J016J484
53732B31579Q71j71n39j89J74M17R14J479J464Q73M80P14J170J391J416J345J040
53715B44428N90M81R61J589J795J634J662K237L143L799L698K850J875J515J932
53700B74189K597K919K772K423K194K283K727L332L799L979L932L665L009J872
53686C15692N49m04n80l6O93R06K30r62j745j508p01m59j267k269k271j252l85
$$ plain form
53794 287217 292928 297809 301777 305080 307968 310316 311879 312915 314089 315610 316884 317293 316991 316501 315761
53779 315761 314055 310867 306474 301651 297116 293242 289928 286576 282524 277805 273221 269447 266249 262949
53765 262949 259425 256152 253298 250380 247064 243813 241316 239610 238234 237049 236335 236140 236075 235815 235322 234496
53749 234496 233069 231062 228917 227021 225522 224747 225179 226657 228140 228774 228777 228798 228902 228873 229079 230095 231579
53732 231579 232450 232279 231740 231551 231725 232142 233056 234535 235999 236872 237352 238066 239236 240627 242043 243388 244428
53715 244428 245018 245499 246460 248049 249844 251478 253140 255377 258520 262319 266017 268867 270742 272257 274189
53700 274189 276786 279705 282477 284900 287094 289377 292104 295436 299235 303214 307146 310811 313820 315692
53686 315692 316241 315837 315257 315221 315914 316820 317050 316088 314343 312835 312134 311675 310408 308139 305868 304616 304231
53669C04231m36r04r97q68j102j546j461p40m8K22L07K46l24j221j474o02N14
53652B93797P33J16l64j93K44M00J83j45k30N5M94Q11J145J778K320J966Q18J38
53634C04066O97J664J857J397J214J453J525J327J327J513J393J043J217K183
53620C23876L276L848L908L727L485L489M029M793N066M701M293M243M258L989
53606C80981L574L231K953K824L121L748M074L763L342L506M134M418L818K587
53592D30074J438R23J078J482J676J487R67K02o86j527k269k992l590l782l696
53577D20785l972m776n206m390k844j930k051k331k043j493j299j503j743j728
53563C83476j321n84J41N42P17R04J010R44J120J842K501K246J297O24M38K44
$$ plain form
53669 304231 303795 302891 301894 301026 299924 298378 296917 296177 296129 296351 296658 296904 296580 295359 293885 293283 293797
53652 293797 294530 294646 294282 294089 294333 294733 294916 294771 294541 294596 295090 295901 297046 298824 301144 303110 303928 304066
53634 304066 304763 306427 308284 309681 310895 312348 313873 315200 316527 318040 319433 320476 321693 323876
53620 323876 327152 331000 334908 338635 342120 345609 349638 354431 359497 364198 368491 372734 376992 380981
53606 380981 384555 387786 390739 393563 396684 400432 404506 408269 411611 415117 419251 423669 427487 430074
53592 430074 431512 432435 433513 434995 436671 438158 439125 439327 438641 437114 434845 431853 428263 424481 420785
53577 420785 416813 412037 406831 402441 399597 397667 395616 393285 391242 389749 388450 386947 385204 383476
53563 383476 382155 381571 381712 382254 382971 383875 384885 385829 386949 388791 391292 393538 394835 395459 395897 396141
53547C96141K10J162K894M018L969L845M538N358N389M974M837M805M602M917
53533D51659O352P995Q531Q232Q430R395J0215J0660J1547J3084J4258J4410J4247
53520E89015J4691J5590J6273J6682J7232J7956J8539J9027J9935K1617K3758
53509G90315K5628K6698K7041K7135K7268K7289K6990K6540K6272K6170K5850
53498A083196K5033K3868K2770K2025K1562K1079K0503K0233K0618K1233K1215
53487A323335K0409J9631J9496J9584J9214J8501J8025J7899J7772J7454J6851
53476A528171J5597J3482J1009Q785O523L510Q5k380l316l978o058r714j3504
53463A548212j5944j6766j6803j7030j7730j8396j8510j8257j8361j9193k0417
$$ plain form
53547 396141 396351 397513 400407 404425 408394 412239 416777 422135 427524 432498 437335 442140 446742 451659
53533 451659 458011 466006 474537 482769 491199 500594 510809 521469 533016 546100 560358 574768 589015
53520 589015 603706 619296 635569 652251 669483 687439 705978 725005 744940 766557 790315
53509 790315 815943 842641 869682 896817 924085 951374 978364 1004904 1031176 1057346 1083196
53498 1083196 1108229 1132097 1154867 1176892 1198454 1219533 1240036 1260269 1280887 1302120 1323335
53487 1323335 1343744 1363375 1382871 1402455 1421669 1440170 1458195 1476094 1493866 1511320 1528171
53476 1528171 1543768 1557250 1568259 1577044 1583567 1587077 1587162 1584782 1581466 1577488 1571430 1561716 1548212
53463 1548212 1532268 1515502 1498699 1481669 1463939 1445543 1427033 1408776 1390415 1371222 1350805
53452A350805k1517k2286k2720k2770k2535k2354k2363k2104k0961j8994j7000
53441A115201j5647j4743j3517j1482q814o043l627j836p40r7N20J341K266L243
53427A046025M426N811P020P899Q925J0507J2197J3366J4355J6049J8359K0213
53415A185152K1292K2643K5015K7591K9172K9875L0709L2051L3523L5039L7009
53404A509071L9515M2131M4541M6802M8974N1075N3313N5823N8198N9773O0378
53393B069594O0393O0222O0088O0157O0405O0418N9773N8573N7250N6021N4741
53382B717635N3025N0223M5788M0185L4931L1054K7921K4234J9759J5177J0665
53371C070597N648j27o290j2644j9375k6431l3480m0460m7286n3105n6858n8712
$$ plain form
53452 1350805 1329288 1307002 1284282 1261512 1238977 1216623 1194260 1172156 1151195 1132201 1115201
53441 1115201 1099554 1084811 1071294 1059812 1050998 1044955 1041328 1039492 1038752 1038655 1039175 1040516 1042782 1046025
53427 1046025 1050451 1056262 1063282 1071181 1080106 1090613 1102810 1116176 1130531 1146580 1164939 1185152
53415 1185152 1206444 1229087 1254102 1281693 1310865 1340740 1371449 1403500 1437023 1472062 1509071
53404 1509071 1548586 1590717 1635258 1682060 1731034 1782109 1835422 1891245 1949443 2009216 2069594
53393 2069594 2129987 2190209 2250297 2310454 2370859 2431277 2491050 2549623 2606873 2662894 2717635
53382 2717635 2770660 2820883 2866671 2906856 2941787 2972841 3000762 3024996 3044755 3059932 3070597
53371 3070597 3076245 3076118 3069828 3057184 3037809 3011378 2977898 2937438 2890152 2837047 2780189 2721477
53359B721477n9938o1217o2034o1918o1145n9874n7694n4640n1675m9534m7920
53348B093888m6518m5845m6278m6983m6748m5451m3844m2354m0828l9119l7136
53337A612784l4667l1854k9478k7960k6454k3810k0270j7247j5523j4586j3820
53326A357115j3399j3656j4339j4972j5444j5728j5524j4585j3214j1950j0865
53315A203439r538p745n885m550l758k798r16J815M438O019O521O766P588R170
53301A210566J1132J3100J5089J7320J9763K1997K3726K5226K7015K9010L0387
53290A444331L0573L0030K9764L0073L0194K9241K7185K4736K2456K0225J7640
53279A736448J4633J1481Q297M879J171k445n558q233j0851j3551j6132j8462
$$ plain form
53359 2721477 2661539 2600322 2538288 2476370 2415225 2355351 2297657 2243017 2191342 2141808 2093888
53348 2093888 2047370 2001525 1955247 1908264 1861516 1816065 1772221 1729867 1689039 1649920 1612784
53337 1612784 1578117 1546263 1516785 1488825 1462371 1438561 1418291 1401044 1385521 1370935 1357115
53326 1357115 1343716 1330060 1315721 1300749 1285305 1269577 1254053 1239468 1226254 1214304 1203439
53315 1203439 1193901 1186156 1180271 1175721 1171963 1169165 1168249 1170064 1174502 1180521 1187042 1193808 1201396 1210566
53301 1210566 1221698 1234798 1249887 1267207 1286970 1308967 1332693 1357919 1384934 1413944 1444331
53290 1444331 1474904 1504934 1534698 1564771 1594965 1624206 1651391 1676127 1698583 1718808 1736448
53279 1736448 1751081 1762562 1770859 1775738 1776909 1774464 1768906 1760673 1749822 1736271 1720139 1701677
53267A701677k0669k2905k5137k7141k8572k9186k9221k9416l0242l1307l1813
53256A396068l1584l1180l0996l0816l0319k9660k9266k9328k9601k9543k8716
53245A065059k7342k6279k6160k6557k6531k5825k4942k4118k2929k1125j9119
53234G94132j7373j5871j4457j3155j1871j0366q848q017q145q661r017r400j0082
53221F48869j0778j1182j1684j2794j4269j5419j5962j5983j5414j4210j2813
53210D98361j1697j0711r493q330p879q134q403q247p863p554p423p606q109q400
53196C78512p847o637n732n755o394o989p147o671n523m098l095k818k955l108
53182C03743l132k855k075j084o77j198k001k275k042j886j922j596n14R49J981
$$ plain form
53267 1701677 1681008 1658103 1632966 1605825 1577253 1548067 1518846 1489430 1459188 1427881 1396068
53256 1396068 1364484 1333304 1302308 1271492 1241173 1211513 1182247 1152919 1123318 1093775 1065059
53245 1065059 1037717 1011438 985278 958721 932190 906365 881423 857305 834376 813251 794132
53234 794132 776759 760888 746431 733276 721405 711039 702191 694174 686029 677368 668351 658951 648869
53221 648869 638091 626909 615225 602431 588162 572743 556781 540798 525384 511174 498361
53210 498361 486664 475953 466460 458130 450251 442117 433714 425467 417604 410050 402627 395021 386912 378512
53196 378512 370665 364028 358296 352541 346147 339158 332011 325340 319817 315719 312624 309806 306851 303743
53182 303743 300611 297756 295681 294597 293920 292722 290721 288446 286404 284518 282596 281000 280486 281435 283416
53167B83416K019J103k71j445j843j305k87L34K2q43j391j365j386j906k418k238
53151B70196j641j421j581j338n05O8k21q05q57n00l74m59j53O01J053O25l58
53134B62330j061r44p6J006J583J206J52p43q61m12r2k14l47R2J010J664J521
53117B65814R37O99J063J492J427R50N28L54K29l9l77o49p93p67o03n27q63j551
53099B67324j969j534m80K33m1r15j486j355q65m42k60m53j134j860j763p26O6
53082B52340n10j828k110p52Q70J247N51J6P6P9l70p05k52P64J502J472R53N11
53064B53854L84L91K73L0j83l22m85o37n60k60j40m92r53p94J41J160J497J136
53046B54040O82N78P06O92L61j92p83j284j612j693j477r97m09RRl82p56o06J74
$$ plain form
53167 283416 285435 286538 286267 284822 282979 281674 281387 281721 281743 280900 279509 278144 276758 274852 272434 270196
53151 270196 268555 267134 265553 264215 263710 263778 263557 262752 261895 261395 261021 260562 260409 261010 262063 262688 262330
53134 262330 261269 260325 260249 261255 262838 264044 264196 263453 262592 262180 262088 261874 261527 261619 262629 264293 265814
53117 265814 266751 267450 268513 270005 271432 272382 272910 273264 273493 273454 273077 272428 271635 270868 270265 269738 268875 267324
53099 267324 265355 263821 263341 263574 263533 262618 261132 259777 258912 258470 258210 257757 256623 254763 253000 252274 252340
53082 252340 251830 250002 247892 247140 248010 249257 249808 249824 249900 249979 249609 248904 248652 249416 250918 252390 253343 253854
53064 253854 254238 254629 254902 254932 254749 254427 253942 253305 252745 252485 252345 251853 250900 250106 250247 251407 252904 254040
53046 254040 254722 255300 256006 256698 257059 256867 256084 254800 253188 251495 250018 249021 248612 248621 248630 248248 247492 246886 247060
53027B47060J085J460J123N28K40L80O49P84P98P54N21m1o58o72K62J559K127
53010B57959J531N44K17O19Q64L40n61j138j315j440j441q40L36J221J062J58
52994B58116n55o12l32j06Q4L46M51K02m2L75J516K542K515J425K58j5N86J141
52976B67895R29K39KO01J429J750J673J823K296K495K179J997K528L225K937J418
52960B95416l19j236j324j167r88o22j89j95q32j584j775j307o84m24o13j017
52944B81140j433j861k349k775k812k257j345o15l52k95j0N52J031J116P82J35
52928B68652p05j487j864j717j291q48m50j56j47l77m16L5N87O07J38j24J82O04
52910B61223N36J8m58o23o53p78r59r26m98J64O30O42L62Qn53j455k227k122j152
$$ plain form
53027 247060 248145 249605 250728 251256 251496 251876 252525 253309 254107 254861 255382 255341 254683 254011 254273 255832 257959
53010 257959 259490 260034 260251 260870 261734 262074 261513 260375 259060 257620 256179 255339 255675 256896 257958 258116
52994 258116 257561 256949 256617 256511 256595 256941 257392 257594 257552 257927 259443 261985 264500 265925 266183 266168 266754 267895
52976 267895 268824 269063 269065 269666 271095 272845 274518 276341 278637 281132 283311 285308 287836 291061 293998 295416
52960 295416 295097 293861 292537 291370 290382 289760 289571 289376 288544 286960 285185 283878 283194 282770 282157 281140
52944 281140 279707 277846 275497 272722 269910 267653 266308 265693 265341 265046 265036 265588 266619 267735 268517 268652
52928 268652 267947 266460 264596 262879 261588 260740 260290 260134 259987 259610 259194 259229 259816 260423 260561 260437 260619 261223
52910 261223 261759 261777 261319 260696 260043 259265 258306 257380 256882 257046 257676 258318 258680 258688 258135 256680 254453 252331 251179
52891B51179k06Q4Q3L84Q73J010O75K30j7N4M49Q61P57J44j52M10J111R67L10
52872B59206L38J185J717J392J095J545K040J684R28Q10J260J341Q33M03L02M8
52856B76127m64o10j72J03l35r01p63j50M1m75j207j820k497l276l776l746l466
52839B52613l279l113k661j811p07L01P02J42j010j738j385l90K61K04p2j7L43
52822B38383N91M12j34o28n68O3O18M57k29o44m10P1L71N88Q85J053Q58N44N24
52803B42805Q83J507K344L063K857J231j070k607k721j975j197p02n62r19j619
52788B41318k063j796j023k42L22O70P24M96L13M68P63P48L48j6R5O79J342J598
52770B44744J236N29p5n21j137j913k120j191K90J031N42l33n34k1M45L63Jp9
$$ plain form
52891 251179 250973 251057 251140 251524 252397 253407 254082 254312 254295 254349 254798 255659 256416 256560 256408 256818 257929 258896 259206
52872 259206 259544 260729 262446 263838 264933 266478 268518 270202 271130 271940 273200 274541 275374 275777 276079 276127
52856 276127 275663 275053 274881 274984 274649 273748 272985 272835 272876 272401 271194 269374 266877 263601 259825 256079 252613
52839 252613 249334 246221 243560 241749 241042 241343 242045 242187 241177 239439 238054 237664 237925 238129 238057 238040 238383
52822 238383 238974 239386 239252 238624 238056 238119 238737 239194 238965 238321 237911 237982 238353 238941 239826 240879 241737 242281 242805
52803 242805 243688 245195 247539 250602 253459 254690 253620 251013 248292 246317 245120 244418 243856 242937 241318
52788 241318 239255 237459 236436 236194 236516 237186 237910 238406 238719 239187 239950 240698 241046 241030 241125 241804 243146 244744
52770 244744 245980 246509 246434 245913 244776 242863 240743 239552 239842 240873 241415 241082 240548 240527 240972 241335 241336 241257
52752B41257L72J140J737J728J039R3m88l63K41P61Q49P02P92J234J588J394P95
52735B54871L86M75Q05J058J360J973K743L120K774J968J283J038R79N41n39j809
52719B73026k520k471k190k202k385k370k197k097j877j172k19K51R1pL59O15
52703B52635J41o18p42j87K15J2l15k19J90N51Q31J148J316J047M47M7K50Q62
52685B57611J249R81L37j6J37K23k98j137j561j369r38m59K01Q47R36M36N3K75
52667B57508O92P08M28K97L31K36K8o2p1j62j46K97R59J209Q35L65M61J249K322
52648B67484L104L216K684J829Q84j57j220j946k127k029k004j958j594j012o26
52633B64528o29r20j353j642j191L16K251L501L680L369L157K997K603J929J025
$$ plain form
52752 241257 241629 242769 244506 246234 247273 247366 246878 246515 246756 247517 248366 249068 249860 251094 252682 254076 254871
52735 254871 255257 255732 256537 257595 258955 260928 263671 266791 269565 271533 272816 273854 274833 275374 274835 273026
52719 273026 270506 268035 265845 263643 261258 258888 256691 254594 252717 251545 251326 251577 251668 251661 252020 252635
52703 252635 252776 252158 251416 251229 251444 251456 251141 250922 251112 251663 252494 253642 254958 256005 256452 256499 256749 257611
52685 257611 258860 259841 260178 260162 260299 260522 260224 259087 257526 256157 255219 254760 254961 255808 256744 257180 257233 257508
52667 257508 258200 258908 259336 259633 259964 260200 260228 260166 260095 259933 259787 260084 261043 262252 263087 263452 263913 265162 267484
52648 267484 270588 273804 276488 278317 279201 279044 277824 275878 273751 271722 269718 267760 266166 265154 264528
52633 264528 263899 262979 261626 259984 258793 259109 261360 264861 268541 271910 275067 278064 280667 282596 283621
52618B83621q1j154j801j953j903j755j301o37l75q35j496j652j286q65n44j16
52602B65867L59M34r7q11j051o06J34O48Q02Q22Q03M80k33p60l51Q46J756J614
52584B70656Q58M65P15J003P78J98j30J77J001J883K378K259J525L19j059k137
52568B80889k484k012j016J5N83L77m15j078j033m61m3r4l34m72n45o30o58o95
52550B69894r51j267j117l75K96K61k58n31k67J89M59M92M24L74L94L98J79l04
52532B68290q16j091j034o01K22J152J647J516J106O36k00j498k449k100o39P69
52516B64910J473J870K390K695K339J648J378J732K206K415K595L158L962M281
52502B99052L559K082O86j81q90j950l189l945l916l362k580j673r15p99j316
$$ plain form
52618 283621 283540 282386 280585 278632 276729 274974 273673 273036 272661 271826 270330 268678 267392 266527 265983 265867
52602 265867 266226 266660 266563 265752 264701 264095 264229 264877 265679 266501 267304 267784 267551 266791 266440 267286 269042 270656
52584 270656 271514 271979 272694 273697 274475 274673 274543 274720 275721 277604 279982 282241 283766 284085 283026 280889
52568 280889 278405 276393 275377 275392 275975 276352 275937 274859 273826 273365 273322 273228 272894 272422 271877 271247 270589 269894
52550 269894 268943 267676 266559 266184 266480 266741 266483 265952 265685 265874 266333 266825 267249 267623 268017 268415 268594 268290
52532 268290 267474 266383 265349 264748 264970 266122 267769 269285 270391 271027 270827 269329 266880 264780 264141 264910
52516 264910 266383 268253 270643 273338 275677 277325 278703 280435 282641 285056 287651 290809 294771 299052
52502 299052 302611 304693 305379 305198 304308 302358 299169 295224 291308 287946 285366 283693 282778 281979 280663
52487B80663j710j340n86l48q04j220r74k70K84M17L09K48M22Q40J183J044N48
52470B78706M37J203K358K954K679K038J534J272J309J765K439K868K998L233
52456C07793L517L062J444n57j929k724l638m658n025m476l579k781j976j198
52442B83275r21j277j644j447q79m18j08J95L59K08o2k08l88q24j222j008p7R98
52424B74552J518J206L70k90j80N61J143J037O22O26J221J970K540K983L358L526
52408B96763L442L414L901N095O753Q416R743J0602J0832J0098Q119N042J370
52395C83590k337n532p664q608q877q930q352o491l891k199k258l041k950j561
52381C10899L86K065K992K905K094J524J875K657K871K360J903K101K871L915
$$ plain form
52487 280663 278953 277613 277027 276679 275875 274655 273681 273411 273695 274112 274421 274669 275091 275931 277114 278158 278706
52470 278706 279143 280346 282704 285658 288337 290375 291909 293181 294490 296255 298694 301562 304560 307793
52456 307793 311310 314372 315816 315259 313330 310606 306968 302310 297285 292809 289230 286449 284473 283275
52442 283275 282354 281077 279433 277986 277107 276689 276581 276776 277135 277343 277281 277073 276685 275861 274639 273631 273554 274552
52424 274552 276070 277276 277646 277356 277176 277737 278880 279917 280539 281165 282386 284356 286896 289879 293237 296763
52408 296763 300205 303619 307520 312615 319368 327784 337527 348129 358961 369059 377178 382220 383590
52395 383590 381253 375721 368057 359449 350572 341642 333290 326799 322908 320709 318451 315410 312460 310899
52381 310899 311285 313350 316342 319247 321341 322865 324740 327397 330268 332628 334531 336632 339503 343418
52367C43418N019N858O073N660M922M052L089K132J180m2j567k710k694j674n85
52352C72131m4O7N1MO0M26J105J971L046M220M873M461L459K981L458M343N229
52335D11841O375P861R011R226Q880Q920R911J1741J3881J5559J6189J6069J6356
52322E61820J7927K0445K2857K4514K5389K5537K4876K3526K1961K0696J9986
52311H09534J9704J9445J8836J7931J7188J6899J6758J6198J5047J3760J2948
52300I94248J2770J2630J1622R435O826M951M201L851K922J036j510m195o552
52287A052235q287r373r952j0062r662q924q216p600o644n009k998j247L1J229
52273I65521K757M624O614Q700J0962J3209J4883J5561J5424J5136J5185J5514
$$ plain form
52367 343418 348437 354295 360368 366028 370950 375002 378091 380223 381403 381361 379794 377084 374390 372716 372131
52352 372131 372087 372154 372205 372209 372269 372695 373800 375771 378817 383037 387910 392371 395830 398811 402269 406612 411841
52335 411841 418216 426077 435088 444314 453194 462114 472025 483766 497647 513206 529395 545464 561820
52322 561820 579747 600192 623049 647563 672952 698489 723365 746891 768852 789548 809534
52311 809534 829238 848683 867519 885450 902638 919537 936295 952493 967540 981300 994248
52300 994248 1007018 1019648 1031270 1040705 1047531 1052482 1056683 1060534 1063456 1064492 1062982 1058787 1052235
52287 1052235 1043948 1034575 1024623 1014561 1004899 995975 987759 980159 973515 968506 965508 964261 964292 965521
52273 965521 968278 972902 979516 988216 999178 1012387 1027270 1042831 1058255 1073391 1088576 1104090
52261A104090J5734J5503J4766J3802J3073J2807J2680J2248J1573J1009J0418
52250A247703R233P485O022N257M402K538j64k924n606q548j1498j3622j4556
52237A225722j4684j4431j4008j3668j3466j2903j1587j0180r722j0042r917q841
52225A082273p625o950o443n629m807m368m012l319k374j248M42K688M475M858
52211A047961M278M052M803O063P153P747P732P152O354N766N489N359N256N137
52197A130302M939M633M293L940L597L474L745M045L789L069K659K893L182L021
52183A181581K657K398J890Q08m54j514k850n067p679r543j0231j0254j0049r586
52169A122107q829p860o633n182l944l216k468r41J148K772L427L611L899M237
$$ plain form
52261 1104090 1119824 1135327 1150093 1163895 1176968 1189775 1202455 1214703 1226276 1237285 1247703
52250 1247703 1256936 1264421 1270443 1275700 1280102 1282640 1282476 1279552 1273946 1265398 1253900 1240278 1225722
52237 1225722 1211038 1196607 1182599 1168931 1155465 1142562 1130975 1120795 1111073 1101031 1091114 1082273
52225 1082273 1074648 1067698 1061255 1055626 1050819 1046451 1042439 1039120 1036746 1035498 1035940 1038628 1043103 1047961
52211 1047961 1052239 1056291 1061094 1067157 1074310 1082057 1089789 1096941 1103295 1109061 1114550 1119909 1125165 1130302
52197 1130302 1135241 1139874 1144167 1148107 1151704 1155178 1158923 1162968 1166757 1169826 1172485 1175378 1178560 1181581
52183 1181581 1184238 1186636 1188526 1189334 1188880 1187366 1184516 1179449 1171770 1162227 1151996 1141742 1131693 1122107
52169 1122107 1113278 1105418 1098785 1093603 1089659 1086443 1083975 1083034 1084182 1086954 1090381 1093992 1097891 1102128
52155A102128M383M334M116L635K933K142J092m93k217l062k536j356n56l15l6
52140A114192O00J163J110N48J80N52J498K419K990L415M099N426P732J1023J4575
52125A171522J7373J9266K1200K3875K6734K8778K9959L1059L2488L3945L4988
52114A471187L5288L4490L2529K9978K7439K4731K1432J7993J5333J3352J0864
52103A734616P297L478M25j858l794n259n894n936o066o607p388q163q798r278
52089A676775r853j0967j2722j4610j6037j6892j7333j7306j6623j5324j3597
52078A515511j1438q687n326j579K143N303P441Q619R488J0702J2356J4151J5896
52065A574580J7528J8778J9199J8641J7487J6341J5520J4824J3745J1910R400
$$ plain form
52155 1102128 1106511 1110845 1114961 1118596 1121529 1123671 1124763 1124270 1122053 1118991 1116455 1115099 1114543 1114228 1114192
52140 1114192 1114792 1115955 1117065 1117613 1117793 1118345 1119843 1122262 1125252 1128667 1132766 1138192 1145924 1156947 1171522
52125 1171522 1188895 1208161 1229361 1253236 1279970 1308748 1338707 1369766 1402254 1436199 1471187
52114 1471187 1506475 1540965 1573494 1603472 1630911 1655642 1677074 1695067 1710400 1723752 1734616
52103 1734616 1741913 1745391 1745816 1743958 1740164 1734905 1729011 1723075 1717009 1710402 1703014 1694851 1686053 1676775
52089 1676775 1666922 1655955 1643233 1628623 1612586 1595694 1578361 1561055 1544432 1529108 1515511
52078 1515511 1504073 1495386 1490060 1488481 1490624 1495927 1503368 1511987 1521475 1532177 1544533 1558684 1574580
52065 1574580 1592108 1610886 1630085 1648726 1666213 1682554 1698074 1712898 1726643 1738553 1747953
52054A747953O664M167K094L43j299k926m419n716p153r304j2255j5313j7734
52041A685102j9558k1281k2938k4081k4648k5141k5730k5752k4587k2566k0609
52030A428211j9149j7869j6362j4594j2759j1002r460q357p917q156q750r240
52018A284596r435r602j0033j0546j0649j0247r848r888j0201j0401j0608j1367
52006A161771j2890j4643j5860j6344j6658j7455j8751j9955k0548k0560k0320
51995I67787k0092k0106k0542k1068k0683j8690j5705j3103j1417r952q138o533
51983G81758o046o766q127r657j0992j1566j1180j0719j1395j3138j4469j4234
51971F53469j2840j1429j0456r595q540p238n526l299j006O73J788L123M976O551
$$ plain form
52054 1747953 1754617 1758784 1760878 1761221 1759922 1756996 1752577 1746861 1739708 1730404 1718149 1702836 1685102
52041 1685102 1665544 1644263 1621325 1597244 1572596 1547455 1521725 1495973 1471386 1448820 1428211
52030 1428211 1409062 1391193 1374831 1360237 1347478 1336476 1327016 1318659 1310742 1302586 1293836 1284596
52018 1284596 1275161 1265559 1255526 1244980 1234331 1224084 1214236 1204348 1194147 1183746 1173138 1161771
52006 1161771 1148881 1134238 1118378 1102034 1085376 1067921 1049170 1029215 1008667 988107 967787
51995 967787 947695 927589 907047 885979 865296 846606 830901 817798 806381 796429 788291 781758
51983 781758 775712 768946 760819 751162 740170 728604 717424 706705 695310 682172 667703 653469
51971 653469 640629 629200 618744 609149 600609 593371 587845 584546 583540 584213 586001 589124 594100 600651
51957F00651P027O684O372O234N674M457K973J372p35l356n556o389n950n068
51943F14390m248l335k028k71J693L467M909O515Q915J1730J3583J3706J2943
51930F81969J2398J1711R619N950J861j853n527r421j2768j4672j5248j5380j5745
51917F32894j6457j7252j7553j6769j4948j2891j1301j0143q979p568n845l712
51905D89476j258J133L266N484Q221J1366J4311J6457J7499J7508J6857J5778
51893F16098J3778J0009M425j843p569j2399j6395j9171k0215j9758j8567j6918
51881E11475j4459j1171p849n375l799k410n44J783L914N205N682N990O586P171
51867E02199P129O346N237M041K516M21j986m088n424n997o119o058n797n083
$$ plain form
51957 600651 607678 614362 620734 626968 632642 637099 640072 641444 640709 637353 631797 625408 619458 614390
51943 614390 610142 606807 604779 604508 606201 609668 614577 621092 630007 641737 655320 669026 681969
51930 681969 694367 706078 715697 721647 723508 721655 716128 706707 693939 679267 664019 648639 632894
51917 632894 616437 599185 581632 564863 549915 537024 525723 515580 506601 499033 493188 489476
51905 489476 488218 489351 492617 498101 506322 517688 531999 548456 565955 583463 600320 616098
51893 616098 629876 639885 644310 642467 634898 622499 606104 586933 566718 546960 528393 511475
51881 511475 497016 485845 477996 472621 468822 466412 465868 467651 471565 476770 482452 488442 495028 502199
51867 502199 509328 515674 520911 524952 527468 527889 525903 521815 516391 510394 504275 498217 492420 487337
51853D87337l700j728M10K127L015L149L032L041L043K663J846Q04m59k168m241
51838D98171o097p110p065o178n011m294m311m439l833k561j449p27K64J731K690
51823D49781K279J018k5p20j591k565l048l060l178l439l228k389j494q44p8R96
51807D28415K046K898L766M384L860J953k13j441j822k068k152j584o62l12p00
51792D36368j061j080j416k415l223k961k155k062k826l230k402r35K5J72oj93
51776D10600m35n87l19K02K78k76n67L42K144L606M109M309N122O560P940Q896
51760D51924R682J0511J0988J0449Q637N890K763l50l223n596p193p929q035p882
51746D70636p676p352o748n854m792l614k221o33Q19J789K408L197M475O018P437
$$ plain form
51853 487337 483637 481909 482319 484446 487461 490610 493642 496683 499726 502389 504235 505039 504580 502412 498171
51838 498171 492074 484964 477899 471721 466710 462416 458105 453666 449833 447272 445823 445096 445360 447091 449781
51823 449781 452060 453078 453053 452333 450742 448177 445129 442069 438891 435452 432224 429835 428341 427497 427419 428415
51807 428415 430461 433359 437125 441509 445369 447322 447109 445668 443846 441778 439626 438042 437380 437068 436368
51792 436368 435307 434227 432811 430396 427173 424212 422057 419995 417169 413939 411537 410602 410627 410799 410793 410600
51776 410600 410165 409578 409259 409461 409739 409463 408896 409238 411382 414988 419097 423406 428528 435088 443028 451924
51760 451924 461606 472117 483105 493554 502191 508081 510844 510494 507271 501675 494482 486553 478518 470636
51746 470636 462960 455608 448860 443006 438214 434600 432379 431746 432565 434354 436762 439959 444434 450452 457889
51731D57889Q578R321R352Q504P136N773M445K865J195J42J20O81R54L47j310
51716E15992l777o313p899q025p115n953m898l935l268l307m001m584m259k968
51702D45690j354Q1J457L063M560N086M293K916J888J213K56r60j460n99R97K088
51686D69215K045J090k96j714k899l868m901o061o844o654n496l915k421j202
51672D26079k40O68J866L434M963O022O738P577Q584R310R446R157Q631P645N757
51657E15637K822q08m469p455r284r767q924o906m074r64J969M516O442P168O076
51642D91979L195n74m098o793q667r751r799q691o929n333m257l478k828k485
51628D21491k388k029j331j154k133l354l278j871o69n91q38m58J40K7p72j564
$$ plain form
51731 457889 466467 475788 485140 493644 500780 506553 510998 513863 515058 515200 515320 516001 516955 517302 515992
51716 515992 512215 505902 498003 489978 482863 476910 472012 468077 464809 461502 457501 452917 448658 445690
51702 445690 444336 444417 445874 448937 453497 458583 462876 465792 467680 468893 469149 468189 466729 466130 467127 469215
51686 469215 471260 472350 472054 470340 467441 463573 458672 452611 445767 439113 433617 429702 427281 426079
51672 426079 425839 426507 428373 431807 436770 442792 449530 457107 465691 475001 484447 493604 502235 509880 515637
51657 515637 518459 517651 513182 505727 496443 486676 477752 470846 466772 465808 467777 472293 478735 485903 491979
51642 491979 495174 494600 490502 483709 475042 465291 455492 446801 439872 434539 430282 426804 423976 421491
51628 421491 419103 417074 415743 414589 412456 409102 405824 403953 403284 402693 401855 401397 401537 401564 400792 399228
51612C99228k131k580k571j710m66K25K14J74M90R13J295J852K545K938K960L283
51596D06659M557O507Q124Q654Q366Q273Q901R435Q507N907K845K25k398n477
51582D79085p956q264o461m201k639j405L28K755N602Q470J0845J2484J3905J5752
51568E18300J7703J8844J9136J9549K0551K1503K1825K1735K1425K0641J9758
51557G40970K0274K3277K8010L2718L6332L8543L8840L6507L1358K3757J4134
51546A064720L165p801j7346k5040l1368l6669m0690m3111m3885m2979m0358l6400
51534G02238l1957k7808k4240k1256j8840j6858j4946j2794j0630r140q765r004
51522D96000q771p545n989n087m995n119n109n143n222m934m139l262k678k282
$$ plain form
51612 399228 397097 394517 391946 390236 389770 389995 390209 390383 390873 391786 393081 394933 397478 400416 403376 406659
51596 406659 411216 417723 425847 434501 442867 451140 460041 469476 477983 483890 486735 486960 484562 479085
51582 479085 471129 462865 456404 452203 449564 448159 448487 451242 456844 465314 476159 488643 502548 518300
51568 518300 536003 554847 573983 593532 614083 635586 657411 679146 700571 721212 740970
51557 740970 761244 784521 812531 845249 881581 920124 958964 995471 1026829 1050586 1064720
51546 1064720 1067885 1060084 1042738 1017698 986330 949661 908971 865860 821975 778996 738638 702238
51534 702238 670281 642473 618233 596977 578137 561279 546333 533539 522909 513769 505004 496000
51522 496000 487229 479684 473695 468608 463613 458494 453385 448242 443020 438086 433947 430685 428007 425725
51508D25725j931j756j664j138L0J265J892J970J975K091K206K289K321K167J887
51493D39329J890K302K526J897N55p59j481j456q09q0o7r74k059k673l146m033
51477D30962m927n027m573m642n465o038n624m689l944l378k811k667l295l997
51463C69885l627k160r28j037k057k546j722j84R22J128Q32N93O59J109J968L042
51447C65877L998M853N965P302Q236Q477Q780J0142J2529J4878J6167J5917J4017
51434D97138J0796P197M141J640q02l027m211m162l789m094n265o996q937j0510
51420D69119j1042j0494r544q502o913m683k821k240k397k063j020kP38J661K744
51405D12541L216K840K535L144M242M787M444L677K915K301K084K535L359L745
$$ plain form
51508 425725 423794 422038 420374 419236 419266 420531 422423 424393 426368 428459 430665 432954 435275 437442 439329
51493 439329 441219 443521 446047 447944 448499 447740 446259 444803 443994 443914 443847 442873 440814 438141 434995 430962
51477 430962 426035 421008 416435 411793 406328 400290 394666 389977 386033 382655 379844 377177 373882 369885
51463 369885 366258 364098 363170 362133 360076 357530 355808 355624 356546 357674 358506 359099 359758 360867 362835 365877
51447 365877 369875 374728 380693 387995 396231 404708 413488 423630 436159 451037 467204 483121 497138
51434 497138 507934 515131 519272 520912 520110 517083 512872 508710 504921 500827 495562 488566 479629 469119
51420 469119 458077 447583 438039 429537 422624 417941 415120 412880 410483 408420 407400 407398 408136 409797 412541
51405 412541 415757 418597 421132 424276 428518 433305 437749 441426 444341 446642 448726 451261 454620 458365
51391D58365L331K723K874M028N629P129Q590J0361J2488J4787J7379K0739K4974
51378E93397K9535L3943L8504M3747M9285N3848N6522N7319N6327N2894M6224
51367A111545L6432K4537J1717j001j2671k2793l1677l9887m7162n2444n5028
51356I21568n5319n4267n2435m9771m5918m0663l4417k8366k3717k0585j8033
51345D98077j5309j2616j0467q882p656o907o737o640n917m587l411k958l065
51332D02925l243l198k898k392j744j031m53l94j089k145k721k470j945j776j859
51317C73567j759j509j399j265p49j18j5m17n70j11M23M74K17J10J83J39r9k70
51299C66832K7J082K764M327M854M060K468Q64j71l96o7P4m70j192j165l42L55
$$ plain form
51391 458365 461696 464419 467293 471321 476950 484079 492669 503030 515518 530305 547684 568423 593397
51378 593397 622932 656875 695379 739126 788411 842259 898781 956100 1012427 1065321 1111545
51367 1111545 1147977 1172514 1184231 1183230 1170559 1147766 1116089 1076202 1029040 976596 921568
51356 921568 866249 811982 759547 709776 663858 623195 588778 560412 536695 516110 498077
51345 498077 482768 470152 459685 450803 443147 436240 429503 422863 416946 412359 408948 405990 402925
51332 402925 399682 396484 393586 391194 389450 388419 387966 387572 386483 384338 381617 379147 377202 375426 373567
51317 373567 371808 370299 368900 367635 366886 366768 366753 366336 365766 365655 366078 366552 366769 366879 367062 367201 367102 366832
51299 366832 366859 367941 370705 375032 379886 383946 386414 387278 387107 386711 386644 386718 386248 385056 383891 383549 383904
51282C83904L99K87N33Q35P61O07R62J791K511K706K318J524P64O19J123J532
51266D03176J192L69j83k39j54j34L6N35J152J402Q60m64j921k654k418j743j172
51249C97640o60l2M02P0j168k843m199m551l694k184r09j76L84R57J114O17m4
51232C80724k69q3J55K98K50r2l70P5J063J352L05j059j507j319j385j356k68
51215C76514J315J564Q3j223o56J085K040J461K81k52L09J611K921L571L388K752
51199C96764K153J851J884K083K098J769J496J773K387K497J677L72o94j225j368
51184D15517j434j725k216k456k136j674j662j868j548p78n79j388k276k189j313
51169C90275n69l19k37j23m6J16O58J514K238K613K894L421M198M940N282M937
$$ plain form
51282 383904 384303 384590 385123 385958 386719 387326 388288 390079 392590 395296 397614 399138 399902 400521 401644 403176
51266 403176 404368 404737 404554 404315 404161 404027 404063 404598 405750 407152 408012 407548 405627 402973 400555 398812 397640
51249 397640 396980 396948 397350 397420 396252 393409 389210 384659 380965 378781 377872 377696 378080 379037 380151 380768 380724
51232 380724 380455 380372 380527 380825 381075 380983 380613 380688 381751 383103 383408 382349 380842 379523 378138 376782 376514
51215 376514 377829 379393 379476 378253 377597 378682 380722 382183 382464 382212 382521 384132 387053 390624 394012 396764
51199 396764 398917 400768 402652 404735 406833 408602 410098 411871 414258 416755 418432 418804 418110 416885 415517
51184 415517 414083 412358 410142 407686 405550 403876 402214 400346 398798 398020 397441 396053 393777 391588 390275
51169 390275 389706 389387 389150 389027 388981 389097 389755 391269 393507 396120 399014 402435 406633 411573 416855 421792
51153D21792L815K102J64j617k947l646l747l472l058k576j950j159m14o7k85
51138D02935p54r49o76j63M20J168J972K267J653N46j99k21Q6J17l90j165j465
51121D05182o75Q55J921J813J122Q08R56J156J525K352L100K922K103J795K283
51106D29218K627K320K074K516L137L263L129L272L493L257K612K004J516J026
51092D65464P57J020J511J466N48p77j689j717j062l95j89k60k24k66q95j934
51076D61358k486k087j230n21M9O59J165J489J868K355K606K578K829L689M754
51061D79075N739P124R326J1813J3723J4852J5333J4916J3378J1278R554Q604
51049F14715Q424R195J0986J3195J4969J5981J6099J4808J1821P978M606K101
$$ plain form
51153 421792 425607 427709 427873 426256 423309 419663 415916 412444 409386 406810 404860 403701 403287 403220 402935
51138 402935 402181 401232 400556 400393 400813 401981 403953 406220 407873 408419 408220 407999 408085 408202 407812 406647 405182
51121 405182 404507 405362 407283 409096 410218 411026 411982 413138 414663 417015 420115 423037 425140 426935 429218
51106 429218 431845 434165 436239 438755 441892 445155 448284 451556 455049 458306 460918 462922 464438 465464
51092 465464 466221 467241 468752 470218 470766 469989 468300 466583 465521 465126 464937 464677 464453 464187 463292 461358
51076 461358 458872 456785 455555 455034 455083 455742 456907 458396 460264 462619 465225 467803 470632 474321 479075
51061 479075 484814 491938 501264 513077 526800 541652 556985 571901 585279 596557 606111 614715
51049 614715 623139 632334 643320 656515 671484 687465 703564 718372 730193 738171 742777 744878
51037G44878n6k193m240o340q630j0549j1502j2177j3958j6841j9098j9461j8491
51024F01342j7232j5686j3412j0803q613o691m259j272J318K749L229L421L726
51011E37817M258N101O263P524Q572R252R660R997J0361J0713J0960J1062J1025
50998F52565J0883J0726J0680J0785J0948J1102J1249J1318J1111J0572R943R476
50986G81358R147Q798Q372P833P110O392O326P491R658J1853J3186J3456J3019
50973I03999J2407J2077J2411J3744J6315J9994K4195K8376L2702L7783M3615
50962A157618M9333N4249N8638O2968O6880O9652P1281P2353P2911P2237O9804
50951A877924O5872O1017N5561M9561M2899L5498K7789K0774J5110J0317N670
$$ plain form
51037 744878 744822 742629 738389 732049 723419 712870 701368 689191 675233 658392 639294 619833 601342
51024 601342 584110 568424 555012 544209 535596 528905 524646 523374 524692 527441 530670 534091 537817
51011 537817 542075 547176 553439 560963 569535 578787 588447 598444 608805 619518 630478 641540 652565
50998 652565 663448 674174 684854 695639 706587 717689 728938 740256 751367 761939 771882 781358
50986 781358 790505 799303 807675 815508 822618 829010 835336 842827 852485 864338 877524 890980 903999
50973 903999 916406 928483 940894 954638 970953 990947 1015142 1043518 1076220 1114003 1157618
50962 1157618 1206951 1261200 1319838 1382806 1449686 1519338 1590619 1662972 1735883 1808120 1877924
50951 1877924 1943796 2004813 2060374 2109935 2152834 2188332 2216121 2236895 2252005 2262322 2267992
50940B267992J610n92p83n22j391l492o075q844j1882j4831j7061j8638k0437
50927B165054k3163k6666l0322l3812l7338m1272m5690n0364n4947n9034o2033
50916A700413o3366o3084o1926o0499n8565n5577n1547m6934m1965l6803l2107
50905A128040k8592k6006k3431k0706j8602j7433j6450j5099j3888j3277j2602
50894I21954j0997q841p321o826o682o257n493m465l144j685l03J097K606L782
50880H67425M036L637L554M227N162N894O613P525Q292Q596Q808R561J0908J2375
50866I66613J3647J4799J6020J7494J9414K1802K4379K6958K9850L3559L8130
50855A222665M3203M8567N4258O0193O6239P2756Q0483Q9611R9360J08871J18120
$$ plain form
50940 2267992 2269602 2269010 2268227 2267705 2266314 2262822 2256747 2247903 2236021 2221190 2204129 2185491 2165054
50927 2165054 2141891 2115225 2084903 2051091 2013753 1972481 1926791 1876427 1821480 1762446 1700413
50916 1700413 1637047 1573963 1512037 1451538 1392973 1337396 1285849 1238915 1196950 1160147 1128040
50905 1128040 1099448 1073442 1050011 1029305 1010703 993270 976820 961721 947833 934556 921954
50894 921954 910957 902116 894795 887969 881287 875030 869537 865072 861928 860243 859940 861037 863643 867425
50880 867425 871461 875098 878652 882879 888041 893935 900548 908073 916365 924961 933769 943330 954238 966613
50866 966613 980260 995059 1011079 1028573 1047987 1069789 1094168 1121126 1150976 1184535 1222665
50855 1222665 1265868 1314435 1368693 1428886 1495125 1567881 1648364 1737975 1837335 1946206 2064326
50844B064326J27455J36615J44816J51757J57753J62788J66024J66561J64147
50835C442242J58760J49918J36982J20105J00438P9362N7803L6277J5398l776
50825D293509j9919l2029l9939m4103m4909m2435l6883k8925j9489r694j216L782
50813C977750L825r72r525k1046l5180n1218o8087q5110j02048j18159j31953
50802C358277j42270j49054j52766j53472j51011j45643j37994j28558j17682
50793B079827j05902r3880q2055p0612n9704m9423l9774l0941k3513j7909j3736
50782A492378j0127o804m414l574l946m550m767m767n086o074p669r439j0817
50769A410344j1596j2225j3379j5165j7001j8426j9607k0856k1925k2331k2122
$$ plain form
50844 2064326 2191781 2328396 2473212 2624969 2782722 2945510 3111534 3278095 3442242
50835 3442242 3601002 3750920 3887902 4008007 4108445 4187807 4245610 4281887 4297285 4293509
50825 4293509 4273590 4241561 4201622 4157519 4112610 4070175 4033292 4004367 3984878 3975184 3973968 3977750
50813 3977750 3981575 3980603 3971078 3950032 3914852 3863634 3795547 3710437 3608389 3490230 3358277
50802 3358277 3216007 3066953 2914187 2760715 2609704 2464061 2326067 2197509 2079827
50793 2079827 1973925 1880045 1797990 1727378 1667674 1618251 1578477 1547536 1524023 1506114 1492378
50782 1492378 1482251 1475447 1471033 1467459 1463513 1458963 1454196 1449429 1444343 1438269 1430600 1421161 1410344
50769 1410344 1398748 1386523 1373144 1357979 1340978 1322552 1302945 1282089 1260164 1237833 1215711
50758A215711k1807k1518k0787j9249j7116j4767j2352j0003p919n901l308J24
50746A061108L741O710R027J1373J4209J7478K0975K4562K8131L1791L5950M0895
50734A305950M6421N2206N8222O4360O9968P4424P7895Q0955Q3640Q5530Q6638
50723B086209Q7330Q7428Q6185Q3355P9486P4915O9155O1562N1998M0521K7052
50712B835196J1879l887j8767l1552m1343m7421m9465m7723m2805l5617k7438
50701B501057j9473j2057m854J905O868Q649P021K665l892j2560k3234l5426m8220
50688B368449o0354p0615p8379q3546q5882q4968q0992p5078o8322o0874n2427
50677A567012m3153l3723k4703j6419r146k849L111R475J6284K2795K8123L1726
$$ plain form
50758 1215711 1193904 1172386 1151599 1132350 1115234 1100467 1088115 1078112 1070193 1064292 1060984 1061108
50746 1061108 1064849 1071559 1080586 1091959 1106168 1123646 1144621 1169183 1197314 1229105 1265055 1305950
50734 1305950 1352371 1404577 1462799 1527159 1597127 1671551 1749446 1830401 1914041 1999571 2086209
50723 2086209 2173539 2260967 2347152 2430507 2509993 2584908 2654063 2715625 2767623 2808144 2835196
50712 2835196 2847075 2843188 2824421 2792869 2751526 2704105 2654640 2606917 2564112 2528495 2501057
50701 2501057 2481584 2469527 2464673 2466578 2473446 2482095 2489116 2491781 2487889 2475329 2452095 2416669 2368449
50688 2368449 2308095 2237480 2159101 2075555 1989673 1904705 1823713 1748635 1680313 1619439 1567012
50677 1567012 1523859 1490136 1465433 1449014 1439868 1437019 1440130 1449605 1465889 1488684 1516807 1548533
50665A548533L3506L3782L3060L1596K9334K6376K3244K0411J7983J6047J4943
50654A828815J4773J5030J5103J4953J4942J5318J6193J7679J9614K1525K3281
50643B017226K5474K8690L2724L6979M1274M5599M9543N2649N5083N7139N8297
50632B500677N7659N5229N2005M8746M5471M2257L9603L7552L5088L0823K3834
50621B968944J3637L8j6337l3611m9219o0844o6822o6330n9934m9775l8555k7961
50609B513231j8220r135j174M669P776Q223O184J421o219j6043k6765l7544m8285
50596B378119n8769o8097p5320q0238q3020q3463q1260p6896p1620o6364o1136
50585A571936n5520m9463m3396l7942l3493k9901k6532k2918j9364j6661j5157
$$ plain form
50665 1548533 1582039 1615821 1648881 1680477 1709811 1736187 1759431 1779842 1797825 1813872 1828815
50654 1828815 1843588 1858618 1873721 1888674 1903616 1918934 1935127 1952806 1972420 1993945 2017226
50643 2017226 2042700 2071390 2104114 2141093 2182367 2227966 2277509 2330158 2385241 2442380 2500677
50632 2500677 2558336 2613565 2665570 2714316 2759787 2802044 2841647 2879199 2914287 2945110 2968944
50621 2968944 2982581 2982619 2966282 2932671 2883452 2822608 2755786 2689456 2629522 2579747 2541192 2513231
50609 2513231 2495011 2485876 2484702 2489371 2497147 2505370 2511554 2512975 2506756 2490713 2463948 2426404 2378119
50596 2378119 2319350 2251253 2175933 2095695 2012675 1929212 1847952 1771056 1699436 1633072 1571936
50585 1571936 1516416 1466953 1423557 1385615 1352122 1322221 1295689 1272771 1253407 1236746 1221589
50574A221589j4303j3162j1200q606n950l563j236J348L967N965P183Q251R819
50561A200102J1837J3976J6281J8926K1729K4433K7152L0017L2635L4596L6172
50550A467856L7882L9574M0596M0732M0207L8923L6602L3655L1124K9638K9153
50539A865942K9760L1883L5544M0175M5481N1707N8840O6308P3757Q1372Q9136
50528B469905R6604J03808J11490J19791J27530J33598J38326J42564J45893J46862
50518C736371J44776J40175J33496J24236J11716R5932P7303N6158L3000Q845
50508D662008j5195l8612o1257q2513j01177j16246j27414j34455j36510j32670
50498C715959j23197j09500r2822p3632n2496l0720r507J0665K9033M3631N2497
$$ plain form
50574 1221589 1207286 1194124 1182924 1174318 1168368 1164805 1163569 1164917 1168884 1174849 1182032 1190283 1200102
50561 1200102 1211939 1225915 1242196 1261122 1282851 1307284 1334436 1364453 1397088 1431684 1467856
50550 1467856 1505738 1545312 1585908 1626640 1666847 1705770 1742372 1776027 1807151 1836789 1865942
50539 1865942 1895702 1927585 1963129 2003304 2048785 2100492 2159332 2225640 2299397 2380769 2469905
50528 2469905 2566509 2670317 2781807 2901598 3029128 3162726 3301052 3443616 3589509 3736371
50518 3736371 3881147 4021322 4154818 4279054 4390770 4486702 4564005 4620163 4653163 4662008
50508 4662008 4646813 4608201 4546944 4464431 4363254 4247008 4119594 3985139 3848629 3715959
50498 3715959 3592762 3483262 3390440 3316808 3264312 3233592 3224085 3234750 3263783 3307414 3359911
50487C359911N5326N2688M4144K8764P571j6380m0860o5749r0684j13106j30054
50476C091571j40893j46806j48483j45865j39718j31784j23230j14061j04214
50467A896517r4190q4476p5224o6668n9136n2498m6301m0513l5511l1216k6924
50456A283860k2214j7494j3412j0143p371m583j354K268N647Q152R835J1149J2247
50443A256587J3017J3527J3843J3589J2493J1132J0320R794Q493O252M217L314
50431A376578L188L121L156L708M751O034P633R679J1904J4025J6246J8913K1933
50418A500869K4942K7839L0781L3957L7707M2420M7923N3357N8070O2313O6538
50407A986716P0443P3261P4779P5372P5159P3706P0553O5673N9417N2418M5239
$$ plain form
50487 3359911 3415237 3467925 3512069 3540833 3548404 3532024 3491164 3425415 3334731 3221625 3091571
50476 3091571 2950678 2803872 2655389 2509524 2369806 2238022 2114792 2000731 1896517
50467 1896517 1802327 1717851 1642627 1575959 1516823 1464325 1418024 1377511 1342000 1310784 1283860
50456 1283860 1261646 1244152 1230740 1220597 1213226 1208643 1207289 1209557 1215204 1223356 1233191 1244340 1256587
50443 1256587 1269604 1283131 1296974 1310563 1323056 1334188 1344508 1354302 1362795 1369047 1373264 1376578
50431 1376578 1379766 1382887 1386043 1389751 1394502 1400536 1408169 1417848 1429752 1443777 1460023 1478936 1500869
50418 1500869 1525811 1553650 1584431 1618388 1656095 1698515 1746438 1799795 1857865 1920178 1986716
50407 1986716 2057159 2130420 2205199 2280571 2355730 2429436 2499989 2565662 2625079 2677497 2722736
50396B722736L7667K8553J7037L754r779k2920l6186m9767o2628p3443q1658q7140
50384B386226q9469q8274q3882p6968o7774n6377m3551l0668j8657p548K799J2014
50372A837871J9437K4570K6945K5961K1274J3274K889q982k1548l3787m4526n2969
50360A810409n8930o2552o4081o3985o2910o1190n8698n5364n1645m8156m5032
50349A177866m1977l8868l5887l3102l0351k7498k4451k0942j6831j2729r672
50338H85558p816n942k822J269M938P323Q744R809J0685J1431J2467J4180J6326
50325I66150J8263J9642K0416K0201J8075J3465P230J412k413m465o155q221r936
50312A053664j0253r188p580n991m428k983j942j173j32J248K257K365K004K024
$$ plain form
50396 2722736 2760403 2788956 2805993 2809747 2799968 2777048 2740862 2691095 2628467 2555024 2473366 2386226
50384 2386226 2296757 2208483 2124601 2047633 1979859 1923482 1879931 1849263 1830606 1823058 1825857 1837871
50372 1837871 1857308 1881878 1908823 1934784 1956058 1969332 1972221 1963239 1941691 1907904 1863378 1810409
50360 1810409 1751479 1688927 1624846 1560861 1497951 1436761 1378063 1322699 1271054 1222898 1177866
50349 1177866 1135889 1097021 1061134 1028032 997681 970183 945732 924790 907959 895230 885558
50338 885558 877742 871800 868978 870247 875185 882508 891252 901061 911746 923177 935644 949824 966150
50325 966150 984413 1004055 1024471 1044672 1062747 1076212 1083442 1084854 1082441 1077976 1071821 1063600 1053664
50312 1053664 1043411 1034223 1026643 1020652 1016224 1013241 1011299 1010126 1009994 1011242 1013499 1015864 1017868 1019892
50298A019892K699L704M720N641O406P125Q194R870J1773J3215J3963J4333J4681
50285A136216J5322J6808J9712K3920K8581L2833L6222L8130L7251L2076K1874
50274A438945P307r521k5412l7065m2532m2146l8021l2600k7463k3107j9393j6126
50262A132866j3329j1073r278p849o909o559o384n648m140k455j240m76J66P17
50248A058409J140J852L368N509P543R201J0958J3174J5476J7424J9288K1676
50236A185018K4551K7157K8910K9949L0614L0769K9945K7967K5172K1983J8632
50225A480667J5345J2522J0449Q893P231M933J707k721q604j5769k3417l0518
50213A460718l6332m0516m2987m3776m2918m0381l6322l1328k6073k0751j5343
$$ plain form
50298 1019892 1022591 1026295 1031015 1036656 1043062 1050187 1058381 1068251 1080024 1093239 1107202 1121535 1136216
50285 1136216 1151538 1168346 1188058 1211978 1240559 1273392 1309614 1347744 1384995 1417071 1438945
50274 1438945 1446252 1436731 1411319 1374254 1331722 1289576 1251555 1218955 1191492 1168385 1148992 1132866
50262 1132866 1119537 1108464 1099186 1091337 1084428 1077869 1071485 1065837 1061697 1059242 1058002 1057526 1057692 1058409
50248 1058409 1059549 1061401 1064769 1070278 1077821 1087022 1097980 1111154 1126630 1144054 1163342 1185018
50236 1185018 1209569 1236726 1265636 1295585 1326199 1356968 1386913 1414880 1440052 1462035 1480667
50225 1480667 1496012 1508534 1518983 1527876 1535107 1540040 1541747 1539026 1530422 1514653 1491236 1460718
50213 1460718 1424386 1383870 1340883 1297107 1254189 1213808 1177486 1146158 1120085 1099334 1083991
50202A083991j0630q230r027j2099j5702j8971k1913k4180k5005k4298k2813k1017
50190H70106j8740j6223j4455j3847j3428j2188j0566r694r609r315q411p577
50178G26053p331p246o724n847n069m579m355m400m538m318l508k476j804j622
50164F62236j573j237m18P80J977K773L213L821M891O003O605O871P558R018J0755
50149G23273J2089J2838J3160J3023J2221J0790R095P391N583L552J572J70m06
50136H24351m16j72M14J697L752O222Q698J1067J3403J5709J7988K0383K3068
50123I46164K6049K9281L2951L7400M2650M8117N2927N6496N8769N9952O0107
50112A450863N9120N7098N4699N2803N1781N1260N0627M9474M7371M3566L7356
$$ plain form
50202 1083991 1073361 1065131 1056104 1044005 1028303 1009332 987419 963239 938234 913936 891123 870106
50190 870106 851366 835143 820688 806841 793413 781225 770659 760965 751356 742041 733630 726053
50178 726053 718722 711476 704752 698905 693836 689257 684902 680502 675964 671646 668138 665662 663858 662236
50164 662236 660663 659426 659008 659788 661765 664538 667751 671572 676463 682466 689071 695942 703500 712518 723273
50149 723273 735362 748200 761360 774383 786604 797394 806489 813880 819463 823015 824587 824757 824351
50136 824351 823935 823763 824177 825874 829626 835848 844546 855613 869016 884725 902713 923096 946164
50123 946164 972213 1001494 1034445 1071845 1114495 1162612 1215539 1272035 1330804 1390756 1450863
50112 1450863 1509983 1567081 1621780 1674583 1726364 1777624 1828251 1877725 1925096 1968662 2006018
50101B006018K8689J7998N600q246k2661l6159m7571n6564o3129o7123o8655o8382
50089A619815o6835o3769n8667n1759m4056l6606l0107k4941k0964j7465j4025
50078A190621j1276j0196j0592j1090j0708r777r116q978r107r213r010q341p623
50065A065594p670q724j0116j1187j1930j2398j2218j1273j0259r804r582r005
50053I41428q238p635o697m751k370r02m75K46K071M174N489O292P557R393J0869
50038I56451J1220J0627R919R791J0173J0236R267P615O394O126O208N880N161
50025A065068M369L315J624m75k203l110l455l773m394n279o039o216n755n109
50011A028568m712m591m638m894n234n065l762j360J568M647P961J1737J6098
$$ plain form
50101 2006018 2034707 2052705 2058305 2050059 2027398 1991239 1943668 1887104 1823975 1756852 1688197 1619815
50089 1619815 1552980 1489211 1430544 1378785 1334729 1298123 1268016 1243075 1222111 1204646 1190621
50078 1190621 1179345 1169149 1158557 1147467 1136759 1126982 1117866 1108888 1099781 1090568 1081558 1073217 1065594
50065 1065594 1057924 1049200 1039084 1027897 1015967 1003569 991351 980078 969819 960015 950433 941428
50053 941428 933190 925555 918858 914107 911737 910835 910360 910606 912677 916851 922340 928632 936189 945582 956451
50038 956451 967671 978298 988217 998008 1008181 1018417 1027684 1035299 1041693 1047819 1054027 1059907 1065068
50025 1065068 1069437 1072752 1074376 1073901 1071698 1068588 1065133 1061360 1056966 1051687 1045648 1039432 1033677 1028568
50011 1028568 1023856 1019265 1014627 1009733 1004499 999434 995672 994312 995880 1000527 1008488 1020225 1036323
49998A036323K1065K6438L1635L5966L9112M1169M2192M1960M0295L7500L4353
49987A428008L1592K9401K7363K4927K1716J7249J0704J547r650k1492l2955m3692
49975A484718n3090n9900o3339o3964o2775n9955n5312m9462m3624l8273l2994
49964I02030k7750k3394k0546j8740j7074j5223j3362j1558r755q059o543m981
49952G25045l114j073Q07K517M325O301Q195R780J0972J1621J1477J0523R128
49939H06504P713O390N075L830K764J633j38k798n911q935j1932j5225j8415k0358
49925G50197k0400j9177j7753j6357j4447j1847r129o873n086l570k342j390l43
49912F21483J121K625L303K787J784J459K288L726M946N698O271O917P642Q507
$$ plain form
49998 1036323 1057388 1083826 1115461 1151427 1190539 1231708 1273900 1315860 1356155 1393655 1428008
49987 1428008 1459600 1489001 1516364 1541291 1563007 1580256 1590960 1592507 1582857 1561365 1528410 1484718
49975 1484718 1431628 1371728 1308389 1244425 1181650 1121695 1066383 1016921 973297 935024 902030
49964 902030 874280 850886 830340 811600 794526 779303 765941 754383 744628 736569 730026 725045
49952 725045 721931 720858 721665 724182 728507 734808 743003 752783 763755 775376 786853 797376 806504
49939 806504 814217 820607 825682 829512 832276 833909 833771 830973 825062 816127 804195 788970 770555 750197
49925 750197 729797 710620 692867 676510 662063 650216 641087 634214 629128 625558 623216 621826 621483
49912 621483 622604 625229 628532 631319 633103 634562 636850 640576 645522 651220 657491 664408 672050 680557
49898F80557R698J1189J2643J3839J4847J5615J5674J4570J2320R218N521J599
$$ plain form
49898 680557 690255 701444 714087 727926 742773 758388 774062 788632 800952 810170 815691 817290
$$ [...]
##END NTUPLES=NMR SPECTRUM
##END=
