
##TITLE=AC1233_PERAH12114_6519287_kQ2xMY586G
##JCAMPDX= 6.0         $$ Bruker NMR JCAMP-DX V2.0
##DATA TYPE= NMR SPECTRUM
##DATA CLASS= NTUPLES
##ORIGIN= BRUKER
##OWNER= Administrator
$$ 1.72 TOPSPIN		Version 2.1
$$ 2012-07-13 15:43:32.609 -0500  Administrator@TOPSPIN
$$ Compression mode = diff/dup
##.OBSERVE FREQUENCY= 400.02188249412
##.OBSERVE NUCLEUS= ^1H
##.ACQUISITION MODE= SIMULTANEOUS (DQD)
##.ACQUISITION SCHEME= undefined
##.AVERAGES= 8
##.DIGITISER RES= 22
##SPECTROMETER/DATA SYSTEM= spect
##.PULSE SEQUENCE= zg30
##.SOLVENT NAME= COFFEE_meoh
##.SHIFT REFERENCE= INTERNAL, COFFEE_meoh, 1, 14.98509
##AUDIT TRAIL= $$ (NUMBER, WHEN, WHO, WHERE, PROCESS, VERSION, WHAT)
$$ ##TITLE= Audit trail, TOPSPIN		Version 2.1
$$ ##JCAMPDX= 5.01
$$ ##ORIGIN= Bruker BioSpin GmbH
$$ ##OWNER= Administrator
$$ $$ C:\Bruker\TOPSPIN/data/COFFEE/nmr/AC1233_PERAH12114_6519287_kQ2xMY586G/10/pdata/1/auditp.txt
$$ ##AUDIT TRAIL=  $$ (NUMBER, WHEN, WHO, WHERE, PROCESS, VERSION, WHAT)
(   1,<2012-07-13 15:43:25.468 -0500>,<Administrator>,<TOPSPIN>,<go>,<TOPSPIN 2.1>,
      <created by zg
	started at 2012-07-13 15:42:18.578 -0500,
	POWCHK enabled, PULCHK disabled,
       configuration hash MD5:
       6B 1B 68 BB D9 2E 58 E2 7F 35 AD 54 07 DF 0E 41
       data hash MD5: 64K
       72 29 2A DC FF 7B BD D4 D8 9C D0 73 F7 E8 7C EE>)
(   2,<2012-07-13 15:43:28.125 -0500>,<Administrator>,<TOPSPIN>,<proc1d>,<TOPSPIN 2.1>,
      <Start of raw data processing
       efp LB = 0 FT_mod = 6 PKNL = 1 PHC0 = 0 PHC1 = 0 SI = 32K 
       data hash MD5: 32K
       32 83 41 31 35 3F 4A AE D1 80 82 26 BB 58 B8 F6>)
(   3,<2012-07-13 15:43:28.546 -0500>,<Administrator>,<TOPSPIN>,<proc1d>,<TOPSPIN 2.1>,
      <pk PHC0 = 176.825 PHC1 = 0 
       data hash MD5: 32K
       92 B4 79 65 9D 0C 08 CE 16 C4 A0 D9 15 21 66 0B>)
(   4,<2012-07-13 15:43:28.656 -0500>,<Administrator>,<TOPSPIN>,<proc1d>,<TOPSPIN 2.1>,
      <abs ABSG = 1 
       data hash MD5: 32K
       29 EB 4E 4A 55 F9 0C 42 78 B3 B0 4A AC 06 8E DD>)
(   5,<2012-07-13 15:43:28.687 -0500>,<Administrator>,<TOPSPIN>,<proc1d>,<TOPSPIN 2.1>,
      <abs ABSG = 2 
       data hash MD5: 32K
       48 DE 54 52 98 18 52 44 6B 7E 84 70 4D E2 5F 0A>)
(   6,<2012-07-13 15:43:28.734 -0500>,<Administrator>,<TOPSPIN>,<proc1d>,<TOPSPIN 2.1>,
      <abs ABSG = 3 
       data hash MD5: 32K
       E3 17 24 7B F9 7A FB 7E D1 C2 62 54 00 A8 C4 6D>)
(   7,<2012-07-13 15:43:28.765 -0500>,<Administrator>,<TOPSPIN>,<proc1d>,<TOPSPIN 2.1>,
      <abs ABSG = 4 
       data hash MD5: 32K
       1A 4D EE B5 74 0A 24 D7 E8 DE 21 38 63 D1 16 28>)
(   8,<2012-07-13 15:43:28.796 -0500>,<Administrator>,<TOPSPIN>,<proc1d>,<TOPSPIN 2.1>,
      <abs ABSG = 5 
       data hash MD5: 32K
       AA 8F 17 0B F5 FC 85 99 10 88 53 76 1F F8 BD F0>)
$$ ##END=
$$ 
$$ $$ hash MD5
$$ $$ 6C 56 16 9E AD E6 72 60 D9 A0 26 44 6A C6 17 2F
##$RELAX= 
##$RELAX= 
##$RELAX= 
##$RELAX= 
##$RELAX= 
##$RELAX= 
##$RELAX= 
##$RELAX= 
$$ Bruker specific parameters
$$ --------------------------
$$ [...]
150 150 150 150 150 150 150 150
##$TP07= 0
##$TPNAME0= <>
##$TPNAME1= <>
##$TPNAME2= <>
##$TPNAME3= <>
##$TPNAME4= <>
##$TPNAME5= <>
##$TPNAME6= <>
##$TPNAME7= <>
##$TPOAL= (0..7)
0.5 0.5 0.5 0.5 0.5 0.5 0.5 0.5
##$TPOFFS= (0..7)
0 0 0 0 0 0 0 0
##$TUNHIN= 0
##$TUNHOUT= 0
##$TUNXOUT= 0
##$USERA1= <user>
##$USERA2= <user>
##$USERA3= <user>
##$USERA4= <user>
##$USERA5= <user>
##$V9= 5
##$VALIST= <valist>
##$VCLIST= <CCCCCCCCCCCCCCC>
##$VD= 0
##$VDLIST= <DDDDDDDDDDDDDDD>
##$VPLIST= <PPPPPPPPPPPPPPP>
##$VTLIST= <TTTTTTTTTTTTTTT>
##$WBST= 2048
##$WBSW= 25
##$XGAIN= (0..3)
0 0 0 0
##$XL= 0
##$YL= 0
##$YMAX_a= 502937
##$YMIN_a= -644570
##$ZGOPTNS= <>
##$ZL1= 120
##$ZL2= 120
##$ZL3= 120
##$ZL4= 120
##$ABSF1= 14.98509
##$ABSF2= -5.573092
##$ABSG= 5
##$ABSL= 3
##$ALPHA= 0
##$AQORDER= 0
##$ASSFAC= 0
##$ASSFACI= 0
##$ASSFACX= 0
##$ASSWID= 0
##$AUNMP= <proc_prof1d_extract_pilot.lims>
##$AXLEFT= 0
##$AXNAME= <>
##$AXNUC= <1H>
##$AXRIGHT= 0
##$AXTYPE= 0
##$AXUNIT= <>
##$AZFE= 0.1
##$AZFW= 0.1
##$BCFW= 0
##$BC_mod= 0
##$BYTORDP= 0
##$COROFFS= 0
##$CY= 15
##$DATMOD= 1
##$DC= 0
##$DFILT= <>
##$DTYPP= 0
##$F1P= 0
##$F2P= 0
##$FCOR= 0.5
##$FTSIZE= 32768
##$FT_mod= 6
##$GAMMA= 0
##$GB= 0
##$INTBC= 1
##$INTSCL= 1
##$ISEN= 128
##$LB= 0
##$LEV0= 0
##$LPBIN= 0
##$MAXI= 10000
##$MC2= 0
##$MEAN= 0
##$ME_mod= 0
##$MI= 0
##$NCOEF= 0
##$NC_proc= -8
##$NLEV= 6
##$NOISF1= 0
##$NOISF2= 0
##$NSP= 0
##$NTH_PI= 0
##$NZP= 0
##$OFFSET= 14.98509
##$PC= 1
##$PHC0= 176.825
##$PHC1= 0
##$PH_mod= 1
##$PKNL= yes
##$PPARMOD= 0
##$PPDIAG= 0
##$PPIPTYP= 0
##$PPMPNUM= 2147483647
##$PPRESOL= 1
##$PSCAL= 4
##$PSIGN= 0
##$PYNMP= <proc.py>
##$REVERSE= no
##$SF= 400.02
##$SI= 32768
##$SIGF1= 0
##$SIGF2= 0
##$SINO= 400
##$SIOLD= 32768
##$SPECTYP= <>
##$SREGLST= <1H.CDCl3>
##$SSB= 0
##$STSI= 32768
##$STSR= 0
##$SW_p= 8223.68421052631
##$SYMM= 0
##$S_DEV= 0
##$TDeff= 65536
##$TDoff= 0
##$TI= <>
##$TILT= no
##$TM1= 0
##$TM2= 0
##$TOPLEV= 0
##$USERP1= <user>
##$USERP2= <user>
##$USERP3= <user>
##$USERP4= <user>
##$USERP5= <user>
##$WDW= 1
##$XDIM= 32768
##$YMAX_p= 481698800
##$YMIN_p= -810889
##$CURPLOT= <Network HP LaserJet P1505>
##$CURPRIN= <$Network HP LaserJet P1505>
##$DFORMAT= <normdp>
##$LAYOUT= <+/1D_H.xwp>
##$LFORMAT= <normlp>
##$PFORMAT= <normpl>
##$SURQMSG= 1
$$ End of Bruker specific parameters
$$ ---------------------------------
##NTUPLES= NMR SPECTRUM
##VAR_NAME=  FREQUENCY,     SPECTRUM/REAL,   SPECTRUM/IMAG
##SYMBOL=    X,             R,               I
##VAR_TYPE=  INDEPENDENT,   DEPENDENT,       DEPENDENT
##VAR_FORM=  AFFN,          ASDF,            ASDF
##VAR_DIM=   32768,         32768,           32768
##UNITS=     HZ,            ARBITRARY UNITS, ARBITRARY UNITS
##FACTOR=    0.250966925370066, 1,           1
##FIRST=     8223.43324360094, 260080,       -153166
##LAST=      0,             -155829,         -25955
##MIN=       0,             -810889,         0
##MAX=       8223.43324360094, 481698800,    0
$$ Real data points
##PAGE= N=1
##DATA TABLE= (X++(R..R)), XYDATA
$$ [...]
$$ plain form
19534 -133682 -67998 -360031 2054 -139957 -1260 -82571 -276406 72891 -168772 130707 31999
19522 -4826 -328777 183663 -244732 -107048 105100 -291948 8804 47543 -316573 -154552
19511 -136374 61024 -220516 -273097 -90915 71132 -262673 -116730 206048 -196312 5982 115840
19500 115840 -134990 -251801 -18274 177553 -407795 -337216 -312061 38248 -153490 -39532
19489 -193508 324820 -512298 -173604 -189498 -155070 -88008 -227085 -238120 143058 -99222
19478 189030 -35762 -55590 57611 -299207 -331072 -318518 -103226 100972 -245634 -330551 -16841
19466 -94843 -120883 202230 -76133 -424550 -192608 -181962 66346 135900 -62603 26853 -16342
19454 -221897 -340192 -141094 -202592 -69410 -474466 -33066 -128145 101315 137121 1759 -48690
$$ packed form
19534a33682O5684k92033B054a39957a260q1311j93835G2891a68772A30707C1999
19522d826l23951A83663b44732a07048A05100b91948H804L8739c16573a54552
19511a36374F1024b20516n2581i0915G1132b62673a16730B06048a96312E982J09858
19500A15840a34990j16811a8274A77553d07795P0579K5155C8248a53490c9532
19489a93508C24820e12298a73604j5894L4428O7062j39077j1035A43058i9222
19478A89030c5762j9828E7611b99207l1865J2554a03226A00972b45634q4917a6841
19466i4843k6040B02230g6133l48417a92608J0646F6346O9554f2603B6853a6342
19454b21897j18295a41094o1498f9410m05056c3066r5079A01315L5806A759d8690
$$ plain form
19442 -241178 297397 290327 149117 -235688 -122882 -339046 160221 -177359 48837 -348105
19431 200677 -99832 60860 302165 51282 23679 85724 152716 -49913 129798 96673 -189292
19419 70063 -13862 211429 -3516 -114818 -108365 -229139 98254 -200311 -188376 -76384 239477
19407 -253382 114472 -166084 52351 245605 -117584 209882 125380 -120945 -404536 103967
19396 -317552 -40106 -174117 189622 79021 16042 -58997 101787 137680 5130 -13094 -193261
19385 -193261 -239283 176172 243148 -149857 -144151 123131 -126358 290781 80726 36426 109874
19374 109874 -92083 184273 51469 18326 -263332 124223 85962 82222 -212753 -31042 135502
19362 -165380 259683 -313394 -122816 -215057 -91934 187004 -399607 -142675 -199737 167102
$$ packed form
19442b41178B97397p070j41210b35688J12806k16164A60221a77359D8837c48105
19431B00677i9832F0860K41305E1282B3679O2045O6992d9913A29798l3125a89292
19419G0063a3862B11429c516j11302O453j20774I8254b00311J1935g6384B39477
19407b53382A14472a66084E2351J93254a17584B09882q4502a20945k83591A03967
19396c17552d0106j34011A89622G9021A6042e8997A01787L5893E130a3094j80167
19385a93261m6022A76172O6976a49857N706A23131a26358B90781H0726C6426P3448
19374A09874i2083A84273E1469A8326b63332A24223l8261l740b12753c1042A35502
19362a65380B59683c13394a22816r2241i1934A87004c99607a42675n7062A67102
$$ plain form
19351 -58924 4836 -138634 -50365 160794 230531 -128677 -63895 -35938 -120493 297697 -223982
19339 -254623 52806 79615 -85755 -92328 -334305 317729 -33676 -63572 -55901 137398 -4988
19327 -368029 66744 96230 -52973 -80555 98869 21722 -287523 601 -187566 -85659 13201
19315 139677 -22429 -68930 -88340 17700 -226308 -212268 272178 48361 43794 -238747 -205829
19304 -205829 -143562 164540 233625 -59688 7192 102638 -195950 -170181 -317385 -110711 164573
19292 14921 -187365 -345427 -87220 90214 6990 -83343 -230961 146877 -403145 -561156 59920
19280 -407209 -97436 -208792 -125955 -126258 42718 187774 -555370 203027 -250127 277431 2932
19268 -31820 -162605 -47872 118615 -294793 -4059 -174312 -151250 -367071 157413 183820 -86022
$$ packed form
19351e8924D836a38634e0365A60794O9737a28677f3895K7957q4555B97697b23982
19339b54623E2806K6809h5755o573k41977C17729c3676k9896P671A37398d988
19327c68029F6744K9486e2973k7582I8869B1722b87523F01a87566h5659A3201
19315A39677b2429m6501j9410A7700b26308J4040B72178D8361m567b38747L2918
19304b05829O2267A64540O9085e9688G192R5446a95950K5769j47204a10711A64573
19292A4921a87365j58062h7220I0214F990h3343j47618A46877d03145j58011E9920
19280d07209i7436j11356Q2837l03D2718J45056e55370B03027b50127B77431B932
19268c1820j30785d7872A18615b94793d059j70253K3062k15821A57413K6407h6022
$$ plain form
19256 -119281 103598 29312 -273833 -3197 7305 -174093 -350388 -371047 72725 -206413 -231168
19245 -231168 -157202 -27606 124608 75955 -198180 587028 21203 -26695 70936 -394031 -142843
19233 -13920 135157 60131 -311750 -301413 18661 33185 -120945 -398097 -195325 31012 -50360
19221 -21468 -103481 -134033 145835 -369891 -83030 -88944 -61473 -126086 -76367 -347415 -119334
19209 49839 -238059 11038 -38362 -285164 -77195 218196 -142009 48188 -85650 -54923 61558
19197 -158573 -209015 38660 -305404 -68363 -220487 -355165 17748 -374191 -95145 -119059 70939
19185 -323205 59191 -167878 -191247 208196 -348479 -35369 162173 -90995 -284744 -212094
19175 -212094 208666 -326562 -487932 49111 238618 25689 -143462 171237 -79233 -110429
$$ packed form
19256a19281A03598B9312b73833c197G305a74093j76295k0659G2725b06413k4755
19245b31168P3966b7606A24608m8653a98180E87028B1203b6695G0936c94031a42843
19233a3920A35157F0131c11750J0337A8661J4524a20945k77152a95325C1012e0360
19221b1468q2013l0552A45835c69891h3030n914K7471o4613M9719k71048a19334
19209D9839b38059A1038c8362k46802g7195B18196a42009D8188h5650L0727F1558
19197a58573n0442C8660c05404f8363j52124j34678A7748c74191i5145k3914G0939
19185c23205E9191a67878k3369B08196c48479c5369A62173i0995j93749P2650
19175b12094B08666c26562j61370D9111J89507B5689a43462A71237g9233l1196
$$ plain form
19165 -110429 -434026 86717 -21533 131558 -157284 -70172 17979 -220120 331 -231762 -118351
19154 -118351 28200 -168345 -175898 -29443 -305879 -105178 -108981 22165 -420473 -121892 251147
19142 -370186 -333489 -246072 227472 -115043 33109 171986 -138349 12900 -177733 26470
19131 58319 80532 -62684 122337 -207052 -301342 247364 62627 -43641 -124500 171126 -160601
19119 -86976 -111940 -366267 148486 -122261 -276999 -6149 87125 -258713 -89845 -81030 -222467
19108 -222467 261504 -41751 -242631 -14052 49597 -55461 196008 -49836 -66503 120987 -236243
19096 -293128 -92881 -132946 -122181 265371 166310 36932 -119720 66204 -56600 -143197 -237580
19085 -237580 -57601 120770 18502 -108307 79799 -116686 84515 -122683 -240982 260013
$$ packed form
19165a10429l23597H6717b1533A31558a57284g0172A7979b20120C31b31762J13411
19154a18351B8200a68345p553b9443k76436a05178l803B2165d20473a21892B51147
19142c70186L6697Q7417B27472a15043C3109J38877a38349A2900a77733B6470
19131E8319K2213f2684A22337b07052r4290B47364F2627d3641q0859A71126a60601
19119h6976k4964k54327A48486a22261j54738f149H7125b58713h9845Q815j41437
19108b22467B61504d1751k00880a4052D9597e5461A96008d9836j6667A20987b36243
19096b93128i2881m0065J0765B65371r9061C6932a19720F6204e6600q6597r4383
19085b37580e7601A20770A8502a08307G9799a16686H4515a22683j18299B60013
$$ plain form
19074 27720 -102698 118905 4897 -196007 224239 -47684 80402 16992 -105489 -199321 206070
19062 -361167 92509 -20135 84726 -171236 -5275 35375 -155898 19066 7560 -58149 -227218
19051 -227218 78504 -101132 -113768 24106 -179465 -188537 340528 -121239 130821 48147 -318903
19039 -79939 -12572 72743 -306713 61695 79527 -24787 4006 25293 279250 314255 125660
19027 -30906 282901 195173 243462 204636 122776 51565 -118407 161318 170939 105955 -137368
19015 138362 11782 225626 -208642 79105 -364624 -69440 -101188 -124928 19634 36418 -139839
19003 95049 20328 221930 -22714 -83677 -75926 -376171 44387 67817 -59626 -74183 -57758
18992 -57758 97163 -34125 -234666 32920 -97921 -135270 -255817 144171 -29307 -199876 156511
$$ packed form
19074B7720a02698A18905D897a96007B24239d7684H0402A6992a05489r3832B06070
19062c61167I2509b0135H4726a71236e275C5375a55898A9066G560e8149j69069
19051b27218G8504a01132j2636B4106a79465r072C40528a21239A30821D8147c18903
19039g9939a2572G2743c06713F1695J7832b4787D006K1287K53957L5005A25660
19027c0906B82901q7728M8289l8826q1860E1565a18407A61318R621o4984a37368
19015A38362A1782K13844b08642G9105c64624f9440l1748k3740A9634J6784a39839
19003I5049B0328K01602b2714o0963P751l00245D4387K3430e9626j4557J6425
18992e7758I7163c4125k00541C2920i7921l7349j20547A44171b9307j70569A56511
$$ plain form
18980 166027 -71971 -135512 141835 -59330 146563 -225611 -93624 223689 150199 -273878
18969 -221868 -109188 185851 -10407 -140297 -12000 -49537 -204679 -38942 -92166 46047 -165689
18957 -422622 -93236 4963 -94628 79712 -357396 -199008 -255659 -281062 -208220 -160685 159469
18945 -53223 232797 -35990 19278 128904 -210658 -110974 -4827 144813 318025 209975 289825
18934 289825 -35969 321597 62038 47224 -24626 -73326 10443 -12676 90099 46018 47322
18923 47322 -83458 483342 -172730 -93354 -198976 328848 -175388 -241219 -350562 -141029
18912 -487192 -15462 -45919 -291011 -19899 -105431 -166479 136667 -162515 282109 32384 -216589
18900 -17261 199913 44378 -337813 -134024 164805 -2505 -45030 -62182 -144005 -333958 -143580
$$ packed form
18980A66027g1971o3541A41835e9330A46563b25611i3624B23689p3490b73878
18969b21868a09188A85851a0407j29890a2000l7537j55142c8942n3224D6047a65689
18957d22622i3236D963i4628G9712c57396J58388n6651k5403P2842M7535A59469
18945e3223B32797c5990A9278J09626b10658R9684d827A44813J73212j08050P9850
18934B89825c5969C21597F2038j4814b4626m8700A0443a2676I0099m4081J304
18923D7322h3458D83342a72730P9376j05622C28848a75388o5831j09343a41029
18912d87192a5462l0457k45092a9899q5532o1048A36667a62515B82109C2384b16589
18900a7261A99913D4378c37813a34024A64805b505m2525j7152q1823j89953a43580
$$ plain form
18888 42863 -174819 34365 38081 -212709 131819 -422817 -293312 237324 -132794 -88085
18878 -88085 10724 -127101 293599 120401 169630 -103125 -390573 202998 -105787 -37169
18867 -88984 -73646 -335043 -297442 -131770 121918 178296 -110976 -98409 342 -90717 5022
18855 807 -60771 4659 -4877 -406454 -144002 97882 -210939 -187041 -28467 -160155 -30934 -11572
18842 -68407 -109331 -343574 -114068 116383 197364 -85034 141122 -129716 -369925 -165238
18831 -394760 -151330 -49013 80440 -93154 -583 -19370 -47309 -210743 -103123 -190117 -117254
18820 -117254 -225681 -44315 -194768 80071 216000 332477 -119574 78253 26363 474369
18810 474369 97170 203431 294232 -71834 141326 295084 190048 379261 82138 -308991
$$ packed form
18888D2863a74819C4365L716b12709A31819d22817J29505B37324a32794M4709
18878h8085A0724a27101B93599A20401M9229a03125k87448B02998a05787c7169
18867h8984J5338k61397L7601a31770A21918N6378a10976J2567C42i0717E022
18855H07f0771D659d877m01577a44002I7882b10939K3898b8467j31688c0934a1572
18842f8407m0924k34243a14068A16383Q0981h5034A41122a29716k40209a65238
18831c94760a51330d9013H0440i3154e83j8787k7939j63434a03123q6994P2863
18820a17254j08427d4315j50453H0071J35929J16477a19574G8253B6363M48006
18810D74369I7170J06261R0801g1834A41326J53758j05036J89213H2138c08991
$$ plain form
18799 334749 -61268 28649 91926 39353 -220862 171335 -336354 47343 -308993 -81091 -108097
18788 -108097 67456 130458 -53558 18570 80639 -67667 -337085 -381253 -481806 191390 -139327
18776 -183777 151485 -196274 -218103 332440 -211283 198562 -57905 -42730 -158306 -470701
18766 -470701 -113475 104120 -399819 -180249 -158465 85408 78066 -125630 -327347 36279
18755 34001 -84414 -101179 -241786 -194317 3001 -460410 -92954 -23717 65365 10531 -139431
18743 -291006 -199463 -112870 -26059 -154112 127532 219333 -321132 50108 -33146 102195 -68150
18731 69443 41688 -137811 -331937 -477739 -41509 -135643 424162 311903 -92023 -135363 -2467
18719 -155184 275282 12377 -30451 115634 91240 55801 -228143 -63194 -154553 4919 203568
$$ packed form
18799C34749f1268B8649O3277C9353b20862A71335c36354D7343c08993h1091k7006
18788a08097F7456O3002e3558A8570O2069f7667k69418m4168j00553A91390a39327
18776a83777A51485a96274k1829C32440b11283A98562e7905J5175j15576l12395
18766d70701a13475A04120c99819a80249K1784H5408p342a25630k01717C6279
18755C4001h4414j6765j40607M7469C001d60410i2954b3717F5365A0531a39431
18743b91006R1543Q6593b6059j28053A27532R1801c21132E0108c3146A02195f8150
18731F9443k7755a37811j94126j45802d1509r4134D24162j12259i2023m3340b467
18719a55184B75282A2377c0451A15634k4394l5439b28143f3194r1359D919J98649
$$ plain form
18708 203568 -55804 -211948 -22195 -108839 189207 -107870 50625 -204384 -291386 23259 -168555
18696 -47458 -151431 -185786 167413 -157128 86927 157478 133368 -61199 -307522 -41297 124754
18684 -461797 -39369 181874 -243463 131898 -294113 340696 297798 1965 -84025 -213317
18674 -213317 96204 177833 -167070 -107969 238528 -1080 160135 -465211 -117657 -156424 37378
18662 171305 -562347 -108177 -96510 -253491 60975 172093 61657 291439 295577 128623
18651 -157108 -140483 215220 130881 -42631 -363694 23224 -198227 -163893 145330 160626 -6855
18639 -38707 12950 -95875 -72338 42170 -255965 -17561 -186022 -158104 -270769 154389 41708
18627 140002 30378 -318234 7134 -871 196386 54048 27990 -212475 -112101 155460 -23086
$$ packed form
18708B03568e5804j56144b2195q6644A89207a07870E0625b04384q7002B3259a68555
18696d7458j03973l4355A67413a57128H6927P0551k4110f1199k46323d1297A24754
18684d61797c9369A81874b43463A31898b94113C40696m2898A965h4025j29292
18674b13317I6204Q1629a67070N9101B38528a080A60135d65211a17657l8767C7378
18662A71305e62347a08177J1667j56981F0975J11118F1657K29782M138A28623
18651a57108J6625B15220q4339d2631l21063B3224a98227L4334A45330J5296f855
18639c8707A2950i5875K3537D2170b55965a7561j68461K7918j12665A54389D1708
18627A40002C0378c18234G134h71A96386E4048k6058b12475J00374A55460b3086
$$ plain form
18615 -122803 -79499 -208075 -1623 -21821 -74813 -180457 452487 -109154 71374 -209311 23674
18603 280312 169193 -223912 -187582 -160579 64682 -155578 -63938 196184 196900 -88045 -221518
18592 -221518 157581 -142258 19430 -97254 -42701 -98420 -48697 -296822 -18391 -180107 214295
18580 -249486 -34221 -341927 131248 247637 -140234 -215465 -46710 -109860 -121596 -297771
18570 -297771 216239 -115229 334 -289863 186439 -265421 -57665 1967 -260589 -220911 -248806
18559 -248806 -190727 73687 61222 237398 -133735 -47652 59810 -90471 108434 104063 -218712
18547 -169090 -145509 -209316 -157201 -162286 156714 154965 108568 -49200 26655 165614 52853
18535 -156310 37727 -355984 43032 -251056 39596 -32802 -50287 103945 273789 -316607
$$ packed form
18615a22803M3304j28576a623k0198n2992j05644D52487a09154G1374b09311B3674
18603B80312j11119b23912L6330K7003F4682a55578f3938A96184P16h8045j33473
18592b21518A57581a42258A9430i7254d2701n5719d8697k48125a8391j61716B14295
18580b49486c4221l07706A31248J16389a40234p5231d6710o3150j1736j76175
18570b97771B16239a15229C34b89863A86439b65421e7665A967b60589L9678k7895
18559b48806N8079G3687j2465J76176a33735d7652E9810i0471A08434m371b18712
18547a69090K3581o3807N2115n085A56714j749m6397d9200B6655J38959E2853
18535a56310C7727c55984D3032b51056C9596c2802j7485A03945J69844c16607
$$ plain form
18524 -241291 -397258 56302 260865 -11872 -339428 -150109 -262338 -210077 -54266 175105
18513 -77753 -14477 -64346 226194 -237519 -111918 -210502 -334456 -109403 228587 232272 267392
18502 267392 278884 -135625 -121734 35289 -332051 -249877 -88793 -341764 -286925 -63428 40527
18490 -5270 159661 -113789 -3189 -10339 -197221 -109956 182935 -25133 -400915 -28343 -73169
18479 -73169 -34128 -124284 -263507 -87172 -197955 -84011 -225072 -179008 -58080 -69729 -271378
18468 -271378 17531 -180823 170245 -19451 -215392 44291 -259329 -470575 -45528 170579
18457 -363258 -146732 202532 135458 108975 -106190 -293531 -23484 -190775 -351378 -100992
18446 24352 -229985 153891 91717 5375 -13933 -426501 31863 -340666 -16763 -148062 -175072
$$ packed form
18524b41291j55967E6302K04563a1872l27556a50109j12229N2261e4266A75105
18513g7753a4477m9869B26194b37519a11918r8584j23954a09403B28587L685L5120
18502B67392J1492a35625J3891C5289c32051Q2174h8793k52971N4839f3428D0527
18490e270A59661a13789c189p150j86882Q7265A82935b5133l75782b8343m4826
18479g3169c4128r0156j39223h7172j10783h4011j41061M6064e8080j1649k01649
18468b71378A7531a80823A70245a9451j95941D4291b59329k11246d5528A70579
18457c63258a46732B02532o7074k6483a06190j87341b3484j67291j60603a00992
18446B4352b29985A53891o2174E375a3933m12568C1863c40666a6763j31299k7010
$$ plain form
18435 -175072 -185197 187947 -139029 -213133 18131 83495 -156476 188839 -172063 -146388
18425 -146388 -67325 42236 -130818 -132853 -301295 -151091 -272774 -128517 21405 225573
18415 225573 85641 8767 -3333 -99989 247689 87500 -50965 -141020 90140 -420750 -13725
18403 82608 435657 163195 180033 133648 54985 171323 278668 -232841 244633 -47497
18392 -113656 -147587 -81474 -26448 -49584 38952 -82271 7421 -375281 -89002 54640 -246867
18380 -297920 44160 84829 -224144 21552 34345 -35176 -126069 7445 -32245 -56880 -271420
18369 -271420 249749 81722 -49164 -307280 -208783 48299 102848 131070 224868 -937 402183
18357 -255128 28631 -207269 257534 10253 11710 189591 94233 100451 -34790 3752 -270894
$$ packed form
18435a75072j0125A87947a39029p4104A8131O5364a56476A88839a72063K5675
18425a46388f7325D2236a30818k035j68442J50204j21683a28517B1405K04168
18415B25573H5641H767c333r6656B47689H7500e0965r0055I0140d20750a3725
18403H2608L53049A63195J6838m6385E4985J16338J07345b32841B44633d7497
18392a13656l3931O6113b6448k3136C8952h2271G421c75281h9002E4640b46867
18380b97920D4160M0669b24144B1552J2793c5176r0893G445c2245k4635k14540
18369b71420B49749H1722d9164k58116R8497D8299N4549K8222R3798i37D02183
18357b55128B8631b07269B57534A0253J457J77881I4233O218c4790C752b70894
$$ plain form
18345 -61145 -50023 -297885 36162 93340 229312 -468498 -12909 -293872 -148956 -14972 -230817
18334 -230817 103607 35062 -92103 -458142 -411607 -59355 31024 -80130 -209910 -467467 -120496
18322 10581 -34515 83960 -323773 67360 -412121 -251570 -219930 -82484 -243374 -354453 -32193
18310 83377 169712 -166227 61209 44294 50162 159896 -113880 55299 -171912 219967 -105683
18298 -134640 -22680 2069 180792 -524133 202056 -202050 129187 96978 -92673 -207818
18288 -207818 -329938 -35502 -224489 325924 -420352 -258615 -83711 -98006 -147850 8801 159515
18277 159515 -87184 -193488 -404325 242858 -114967 -17038 -373541 -195449 7769 64826
18267 64826 -177499 -85594 97072 -23500 -39725 -31042 84839 -231991 -52271 -123737 -20713
$$ packed form
18345f1145J1122k47862C6162N7178J35972d68498a2909k80963J44916a4972k15845
18334b30817A03607C5062i2103l66039M6535e9355C1024h0130j29780k57557a20496
18322A0581c4515H3960c23773F7360d12121J60551L1640h2484j60890j11079c2193
18310H3377Q6335a66227F1209j6915N868J09734a13880E5299a71912B19967a05683
18298a34640b2680B069J78723e24133B02056b02050A29187l2209i2673j15145
18288b07818j22120c5502j88987C25924d20352J61737h3711j4295m9844H801J50714
18277A59515h7184j06304k10837B42858a14967a7038l56503J78092G769N7057
18267F4826a77499h5594I7072b3500j6225Q683H4839b31991e2271p1466b0713
$$ plain form
18255 -152672 -184362 -52862 23915 -141981 -114788 -188482 -126451 -337647 37014 186118 94969
18244 94969 -250384 -105413 -91003 -142995 -36376 -188070 -4361 -131261 113685 212785 -323983
18232 -94840 -21786 -374968 75440 -176163 70876 -79010 -27869 -89248 -123514 107261 363542
18221 363542 247237 225266 35823 210374 121966 -111210 -47772 57892 -249881 63467 -189604
18209 56457 -241958 -38658 -326270 -356275 27002 -286924 -214443 171730 -414625 -88527 86438
18197 228203 -323566 -6515 32146 -6583 317339 -179191 11070 -160253 -42216 34373 77107
18186 77107 -11370 104305 -152599 146071 -149644 106046 -63690 17496 -339972 -180227
18176 -180227 -131485 -226157 193590 -25741 172645 -125499 -19950 -88913 177216 -240707
$$ packed form
18255a52672l1690e2862B3915a41981K7193p3694O2031k11196C7014J49104r1149
18244I4969b50384a05413J4410n1992c6376j51694d361j26900A13685R9100c23983
18232i4840b1786l53182G5440a76163G0876g9010b7869o1379l4266A07261K56281
18221C63542j16305k1971C5823J74551q8408a11210d7772E7892b49881F3467a89604
18209E6457b41958c8658k87612l0005B7002b86924P2481A71730d14625h8527H6438
18197B28203c23566f515C2146f583C17339a79191A1070a60253d2216C4373M2734
18186G7107a1370A04305a52599A46071a49644A06046f3690A7496c39972J59745
18176a80227M8742r4672A93590b5741A72645a25499a9950o8963A77216b40707
$$ plain form
18165 -163025 119796 -7663 -88844 -183117 -64571 24961 -201517 213979 -48460 -181158 2059
18153 -116722 -298427 293 204909 96276 -134457 -105362 81992 -49099 9218 134088 -214732
18141 123796 -16899 183552 -198865 -93966 136391 62488 -335186 22044 -107575 128174
18130 -181415 -178262 -158267 177306 -111771 -397749 -163327 -213472 157369 -140079 245514
18119 388322 -491699 155285 -33119 -219079 -427340 184136 -78861 -83991 66598 -334398
18108 102898 -230627 27505 109455 -214371 -220260 -94997 10022 110523 -137355 -294728 -26181
18096 -45550 111156 -847 -360342 -77203 71882 -33612 198378 -25391 -311418 260715 -126229
18084 -196439 301217 -144181 100378 -61278 -57991 -94279 91709 100774 -116570 -263262 -129060
$$ packed form
18165a63025A19796g663q1181r4273f4571B4961b01517B13979d8460j32698B059
18153a16722j81705B93K04616I6276a34457K9095H1992d9099I218J24870b14732
18141A23796a6899A83552a98865i3966A36391F2488c35186B2044a07575A28174
18130a81415L153J9995A77306a11771k85978a63327n0145A57369a40079B45514
18119C88322d91699A55285c3119j85960k08261A84136g8861n130F6598c34398
18108A02898b30627B7505Q1950b14371n889i4997A0022J00501a37355j57373b6181
18096d5550A11156h47l59495g7203G1882c3612A98378b5391k86027B60715a26229
18084a96439C01217a44181A00378f1278L287l6288I1709R065a16570j46692a29060
$$ plain form
18072 262044 -188100 49238 -310927 -7536 -272277 -198915 -70359 -118580 -135167 -397052 -152035
18060 53710 -202650 -164564 -129668 -146113 268510 60230 -265771 66905 46960 -396497 -371969
18049 -371969 -185695 253276 95450 8161 -118463 -218151 406729 -201816 47738 133449 24963
18037 -146836 -207282 56240 17160 -163676 -6236 50246 54128 50086 -2716 -21154 -224445 42295
18024 35099 -243930 68968 -234209 132249 172950 -66260 -10417 -129273 -59464 62274 144943
18013 144943 148062 -148011 -58028 -334670 -265960 238615 348567 143822 -66645 -370718
18003 -370718 -349017 -368093 -48724 -124624 -1627 -77623 -293760 -231324 -13674 -204713 40303
17991 -48674 97339 -349272 -62325 -56855 -159444 235164 333830 -53576 62478 -101775 72659
$$ packed form
18072B62044a88100D9238c10927g536k64741P3362g0359m8221j6587k61885a52035
18060E3710b02650L8086L4896j6445B68510F0230b65771F6905j9945c96497K4528
18049c71969a85695B53276I5450H161a18463r9688D06729b01816D7738Q5711B4963
18037a46836o0446E6240A7160a63676f236E0246L882m042b716j8438k03291D2295
18024C5099b43930F8968b34209A32249M0701f6260a0417j18856e9464F2274Q2669
18013A44943L119a48011e8028k76642O8710B38615J09952A43822f6645l04073
18003c70718K1701j9076d8724p5900a627p5996k16137O2436a3674j91039D0303
17991d8674I7339c49272f2325N470j02589B35164R8666e3576F2478a01775G2659
$$ plain form
17979 57670 -345777 -8043 -464 -283706 -103942 -45326 -86588 23587 -31886 156752 101621
17968 101621 122443 135435 166799 16109 -61643 -309918 -322697 -37677 -410355 -112509 -35231
17956 186547 218919 112382 -231611 24220 -6170 -228516 11896 179732 160784 -182458 -109124
17945 -109124 -419206 -148766 -69374 -2696 245267 252712 -110231 -235944 19456 -55672 221125
17933 335776 22928 -132739 68129 11402 -272596 -377694 -534075 326867 37802 -85206
17922 184822 92179 -13971 54867 133326 308404 122272 -1817 -206808 -481394 113944 171205
17911 171205 -144497 45854 607 -195955 88195 203174 217741 180852 26001 104195 -29354
17899 -148259 183470 140240 -198543 -108511 -143824 31568 -359444 476985 -106897 -68949
$$ packed form
17979E7670c45777h043d64k83242a03942d5326m1262B3587c1886A56752n5131
17968A01621K0822J2992L1364A6109f1643k48275j2779c7677l72678a12509c5231
17956A86547L2372j06537b31611B4220f170k22346A1896J67836j8948a82458P3334
17945a09124l10082a48766f9374b696B45267P445a10231j25713A9456e5672B21125
17933C35776B2928a32739F8129A1402b72596j05098j56381C26867C7802h5206
17922A84822I2179a3971E4867P8459J75078A22272a817k04991k74586A13944N7261
17911A71205a44497D5854F07a95955H8195J14979J4567l6889B6001P8194b9354
17899a48259A83470m3230a98543R0032l5313C1568c59444D76985a06897L7948
$$ plain form
17889 -68949 -190580 -2976 -192137 15982 -64121 -55875 48749 -8868 -21511 36605 -38466 -178757
17877 -178757 -221047 -219871 -178840 -5998 -171928 -420825 -361755 213784 -121874 285679 100942
17865 66598 -270873 181349 12925 -728 -220075 -4946 -158552 65978 6013 -61679 20276 257831
17853 257831 -162614 42056 -181012 -123160 -236356 34058 -186753 -151989 231889 -91108
17842 15157 -328766 -182665 9557 -57591 432220 -214164 310584 -256251 -284540 -26953 -149695
17831 -149695 -162886 297517 -207149 -38639 -33044 70082 -204711 125719 -113786 -92451 -359216
17820 -359216 96416 -10466 -48351 -219273 56958 -111774 59514 -178116 84796 -374248 77734
17808 -269019 18703 257628 -585227 -265801 5662 62813 21819 123410 302722 -3553 240642
$$ packed form
17889f8949j21631b976j89161A5982f4121Q246D8749h868j2643C6605c8466j40291
17877a78757m2290J176M1031e998j65930k48897N9070B13784a21874B85679A00942
17865F6598b70873A81349A2925g28k19347d946j53606F5978F013f1679B0276K37555
17853B57831a62614D2056a81012N7852j13196C4058a86753L4764B31889i1108
17842A5157c28766J46101I557e7591D32220b14164C10584b56251k8289b6953j22742
17831a49695j3191B97517b07149c8639N595G0082b04711A25719a13786K1335k66765
17820c59216I6416a0466l7885j70922E6958a11774E9514a78116H4796c74248G7734
17808b69019A8703K38925e85227b65801E662N7151B1819J01591J79312c553B40642
$$ plain form
17796 38772 -287554 -165692 -118172 -98793 -88578 -237759 -34511 23671 108171 -171793 53415
17784 -263629 108087 -156847 -158380 -78000 67170 207324 24617 95931 -14626 72641 -309256
17772 81248 -179624 -162663 31577 285655 -53428 202794 84081 236003 33052 -163360 61344
17760 -423029 102575 -185987 194563 40369 31948 70029 131995 48098 -15631 -19580 82152
17748 116569 339606 401611 153864 -26508 107852 16213 275268 88498 -28646 159463
17737 89020 -280789 85014 -85 42973 143285 -99792 101109 -465630 121714 11838 -39985
17725 -171517 109915 107352 6875 282834 211239 74244 -195079 -217243 -310647 248454 261806
17714 261806 323585 56311 -16730 -42093 111884 -40971 44881 -185527 178013 73974 -131001
$$ packed form
17796C8772b87554J21862M7520J9379J0215j49181c4511B3671Q4500a71793E3415
17784b63629A08087a56847j533g8000F7170J40154B4617P1314a4626G2641c09256
17772H1248a79624J6961C1577K54078e3428B02794H4081J51922C3052a63360F1344
17760d23029A02575a85987A94563D0369q421L8081O1966D8098a5631l949H2152
17748A16569K23037O2005A53864b6508A07852A6213K59055H8498b8646A59463
17737H9020b80789H5014h5D2973J00312i9792A01109d65630A21714A1838c9985
17725a71517A09915k563F875K75959p1595G4244a95079k2164r3404B48454J3352
17714B61806O1779E6311a6730k5363A11884d0971D4881a85527A78013G3974a31001
$$ plain form
17702 -2740 -7729 87522 437610 -220402 64750 247738 23675 -71692 5860 154973 -272485
17690 -334971 -48648 204835 178131 220954 8888 29368 376801 -156341 -78498 -45239 -40951
17679 -40951 157065 -47063 -202788 -12766 41694 -129414 21038 147237 -88716 -106135 18627
17667 234481 202345 131514 163424 -347977 514540 268340 -205494 -228320 -8569 -84427 -153843
17656 -153843 279252 157779 118252 301310 115776 20279 114823 345772 87165 -149601
17645 -144204 46073 103539 56327 139602 -95621 39326 202857 -146116 192376 -169312 -295610
17634 -295610 -133388 -130103 -290724 -353800 206478 -277306 338988 -15530 31850 192226
17624 192226 53618 115166 255039 -46787 166755 -25830 189299 -63555 15488 253258 196530
$$ packed form
17702b740m989H7522L50088b20402F4750J82988B3675g1692E860J49113b72485
17690c34971d8648B04835k6704M2823H888K0480L47433a56341P7843L3259M288
17679d0951A57065d7063j55725a2766D1694a29414B1038J26199h8716j7419A8627
17667B34481l2136p0831L1910c47977E14540k46200b05494k2826h569p5858o9416
17656a53843B79252j21473l9527J83058A15776B0279R4544K30949H7165a49601
17645a44204D6073N7466m7212Q3275i5621C9326J63531a46116A92376a69312j26298
17634b95610a33388L285j60621o3076B06478b77306C38988a5530C1850J60376
17624A92226E3618O1548J39873d6787A66755b5830A89299f3555A5488K37770n6728
$$ plain form
17613 196530 37920 70400 144483 186954 -42197 213576 157622 -291156 282610 52108 -496682
17601 336036 -247740 -292841 255030 -135835 -210857 -4228 -81379 38035 81045 -127470 -61179
17589 337527 123205 106912 -117387 130402 -356637 29397 53371 -150828 279383 37719
17578 369504 -114 -93488 63673 -132393 170064 -221231 376271 192816 42308 48514 63877
17567 63877 96794 77887 216761 111161 -50935 28298 8769 247462 -171426 6641 229155
17556 229155 -76566 129819 457962 -176563 -75022 240348 -82008 31943 293374 -3732 131106
17544 156726 -114463 -235763 184727 64792 259743 -246678 -241498 -77235 -23352 201848
17533 335844 92093 38688 92923 -179804 -211812 178884 203238 -81301 79671 131407 227092
$$ packed form
17613A96530C7920L2480P4083M2471d2197B13576n5954b91156B82610E2108d96682
17601C36036b47740m5101B55030a35835p5022d228p7151C8035M3010a27470f1179
17589C37527A23205j6293a17387A30402c56637B9397K3974a50828B79383C7719
17578C69504a14r3374F3673a32393A70064b21231C76271j83455D2308O206J5363
17567F3877L2917j8907J38874j05600e0935B8298H769K38693a71426F641K22514
17556B29155g6566A29819L28143a76563g5022B40348h2008C1943K61431c732A31106
17544A56726a14463j21300A84727F4792J94951b46678N180g7235b3352B01848
17533C35844I2093C8688N4235a79804l2008A78884K4354h1301G9671N1736R5685
$$ plain form
17522 227092 -113684 315625 424443 368658 218230 40948 199719 102535 -305929 177825
17511 10749 192218 161473 -21554 175514 284596 -78023 116361 -334929 468407 117888
17500 229557 149316 -178409 113072 62041 411794 -228107 -65527 -212729 29209 19171
17490 19171 146198 464683 -37622 403052 17860 126784 -102381 70198 197562 47032
17479 175249 -10540 7158 227856 214930 682050 -83843 242746 429384 50129 371655 213368
17468 213368 -49263 241578 42268 458781 -123873 219625 -58840 58413 173240 329049
17458 329049 74677 -140346 258227 -243549 440911 -35635 134498 328161 445957 86954
17447 478674 350666 185418 299987 447143 526665 563811 105041 282769 596872 326917
$$ packed form
17522B27092a13684C15625J08818n5785j50428D0948J58771r7184c05929A77825
17511A0749J81469l0745b1554A75514J09082g8023A16361c34929D68407A17888
17500B29557q0241a78409A13072n1031L49753b28107f5527j47202B9209j0038
17490A9171J27027L18485c7622D03052A7860J08924a02381G0198J27364D7032
17479A75249a0540G158K20698j2926M67120h3843B42746J86638E0129L21526j58287
17468B13368d9263B41578D2268M16513a23873B19625e8840E8413J14827J55809
17458C29049G4677a40346B58227b43549D40911c5635A34498J93663J17796H6954
17447D78674j28008j65248J14569J47156P9522L7146A05041J77728L14103k69955
$$ plain form
17437 326917 -47913 199653 -8131 26609 613356 241443 496320 220932 146305 432552
17427 432552 323448 214543 495366 498565 29115 264549 307990 652665 15371 81069 89537
17416 89537 542619 47991 231923 392465 566008 89724 331113 340893 348882 341010 165827
17404 13613 -16494 222372 234659 -234248 206176 33699 105282 136189 -311368 197566 118128
17393 118128 236086 426820 294651 -109772 346457 279661 -201331 425698 7879 64550
17383 64550 190214 128960 107358 2206 35303 218647 -91369 13372 -7282 287978 79582
17371 -80977 277084 -20813 187562 192478 252566 175834 -28748 155618 -208506 255945 294010
17360 294010 231023 -31372 175516 225758 234816 -16352 168621 153166 23482 255407 195678
$$ packed form
17437C26917d7913A99653h131B6609N86747B41443K54877B20932p4627K86247
17427D32552j09104j08905K80823L199B9115K35434M3441L44675A5371O5698Q468
17416H9537M53082D7991J83932J60542J73543H9724K41389R780P989p872A65827
17404A3613a6494B22372J2287b34248B06176C3699P1583L0907c11368A97566p9438
17393A18128J17958J90734j32169a09772C46457o6796b01331D25698G879N6671
17383F4550J25664o1254k1602B206L3097J83344i1369A3372g282B87978G9582
17371h0977B77084b0813A87562M916O0088p6732b8748A55618b08506B55945L8065
17360B94010o2987c1372A75516N0242R058a6352A68621j5455B3482K31925n9729
$$ plain form
17349 195678 473189 380876 209403 78849 176981 67337 86818 -66841 11402 130126 293088
17338 293088 146070 432372 277299 -61127 -187426 320080 47782 -38245 -124933 88345
17327 405409 -50155 223019 177782 8961 -312376 101334 194020 173854 466064 136038 -126064
17315 426220 157882 222518 -103232 -59471 527160 51945 309996 196563 254835 309561
17305 309561 223605 401877 266846 382868 75476 440166 278958 318625 44735 -110247
17294 142390 377769 232920 246414 35095 458172 -59632 252652 143716 192085 64467
17283 69600 128353 -85747 5139 40680 609256 307161 33658 49259 -162740 155203 -219506
17271 128585 486294 382013 71402 413413 130491 259839 233876 44009 235273 -1162
$$ packed form
17349A95678K77511r2313j71473G8849R8132F7337J9481f6841A1402J18724J62962
17338B93088A46070K86302j55073f1127j26299C20080D7782c8245q6688H8345
17327D05409e0155B23019m5237H961c12376A01334R2686k0166K92210A36038a26064
17315D26220A57882O4636a03232M3761E27160E1945K58051j13433N8272N4726
17305C09561q5956J78272j35031J16022G5476L64690j61208L9667D4735a10247
17294A42390K35379j44849J3494C5095M23077e9632B52652j08936M8369F4467
17283F9600N8753h5747E139L5541N68576l02095C3658J5601a62740A55203b19506
17271A28585L57709j04281G1402L42011A30491J29348k5963D4009J91264a162
$$ plain form
17260 196727 238334 160653 30917 150958 46041 43627 -56438 -9558 633618 685305 6038 92969
17248 92969 435794 118648 293218 252214 215463 221765 194877 -32457 30344 389461 3227
17236 248348 295638 196632 92479 359183 178055 315356 -159187 395938 463679 229105
17225 -214049 487343 113848 -15984 102939 148919 38059 85813 487313 272090 500522
17215 500522 51404 242132 199894 492267 426994 94490 169044 96763 723560 552927 -25201
17203 159646 -6338 458849 479506 158514 101406 332328 150757 294183 152091 516939
17193 516939 392654 349056 48608 329277 206021 391786 271160 337271 356107 242327
17183 242327 158031 311162 487790 288160 50420 89190 379087 703020 502476 325203
$$ packed form
17260A96727M1607p7681C0917J20041D6041k414e6438i558F33618N1687F038Q6931
17248I2969L42825A18648J74570m1004l6751O302k6888c2457C0344L59117C227
17236B48348M7290r9006I2479K66704A78055J37301a59187C95938O7741B29105
17225b14049D87343A13848a5984A02939M5980C8059M7754M01500k15223K28432
17215E00522E1404J90728m2238K92373o5273I4490P4554p2281O26797j70633b5201
17203A59646f338D58849K0657A58514n7108K30922A50757J43426j42092L64848
17193E16939j24285m3598D8608K80669j23256J85765j20626O6111J8836j13780
17183B42327q4296J53131J76628j99630E0420L8770K89897L23933k00544j77273
$$ plain form
17173 325203 325147 312023 551285 19123 296972 251789 350641 604966 56673 -81897 37671
17161 164735 16137 17087 752932 396194 226928 115973 295013 205809 297724 312841 670605
17150 670605 228131 -20530 588411 292754 58244 333161 548329 251601 457322 425875
17140 425875 714180 46476 371200 343768 86557 568793 188088 98603 413419 -152417
17129 148619 38126 254049 -29462 917061 411210 269381 279280 173639 323627 415453
17119 415453 326918 128816 535444 168791 420611 315417 89403 415070 378846 320240
17109 320240 70019 620353 327227 736752 357173 252845 274509 695643 277506 -82299
17098 -11005 343646 434199 603175 329400 401861 471967 506251 131702 646642 246461
$$ packed form
17173C25203n6j3124K39262A9123K77849m5183R8852K54325E6673h1897C7671
17161A64735A6137R50P35845l56738j69266j10955J79040q9204R1915J5117L57764
17150F70605B28131b0530E88411B92754E8244K74917K15168B51601K05721l1447
17140D25875K88305D6476L24724k7432H6557M82236A88088q9485L14816a52417
17129A48619C8126K15923b9462I17061D11210j41829R899j05641J49988R1826
17119D15453q8535A28816M06628A68791K51820j05194H9403L25667l6224n8606
17109C20240G0019N50334k93126M09525C57173j04328K1664M21134B77506h2299
17098a1005C43646R0553J68976k73775P2461P0106L4284A31702N14940B46461
$$ plain form
17087 511456 756885 452656 670213 329129 444737 442874 569375 517122 716525 342012
17076 314432 814852 743332 498073 297756 438287 420435 624918 377006 892922 886402
17066 886402 355943 227057 728038 856721 740617 448144 835802 494717 614067 597453
17056 597453 461480 679069 519565 654094 696375 467215 526609 782319 457179 566113
17046 566113 611264 748085 857394 608255 743777 413866 481943 525214 613818 653760
17036 653760 542366 683957 722636 768926 849671 747477 706868 397878 915302 717142
17026 717142 640320 759719 563840 637373 744929 710699 735203 618246 587944 948064
17016 948064 554176 940336 283523 589958 901585 921239 661217 920261 629982 1055045
$$ packed form
17087E11456K45429l04229K17557C29129J15608j863J26501n2253J99403C42012
17076C14432N00420p1520k45259k00317J40531j7852K04483k47912N15916o520
17066H86402C55943j28886N00981J28683j16104k92473L87658l41085J19350j6614
17056E97453j35973K17589j59504J34529M2281k29160N9394K55710l25140J08934
17046E66113M5151J36821J09309k49139J35522l29911O8077M3271Q8604L9942
17036F53760j11394J41591L8679M6290Q0745j02194m0609l08990N17424j98160
17026G17142p6822J19399j95879P3533J07556l4230K4504j16957l0302L60120
17016I48064l93888L86160B83523L06435L11627J9654k60022K59044k90279M25063
$$ plain form
17006 1055045 946749 733685 901496 677130 932543 795877 1154232 716990 900884
16997 900884 507298 657060 589142 484734 853926 606313 970591 1091609 1014232 754913
16987 754913 904775 744849 774179 807310 1077079 951076 912399 783783 1367380 937537
16977 937537 894558 883252 1241186 900248 833236 842205 1086508 858665 883409 1259257 1095642
16966 1095642 991624 1104575 778279 1376526 1202437 823807 1475676 1424509 1142424 944241
16956 944241 1215404 1030980 902148 1203947 1053803 1146956 834197 923510 1307182 1269889
16946 1269889 1391360 1094577 1255018 1278967 1145925 1604257 1256735 1095214 1378153 1583366
16936 1583366 1085523 1593388 1183299 1268900 1290115 1580487 1536690 1155402 1827336 1991911
$$ packed form
17006A055045j08296k13064J67811k24366K55413j36666L58355m37242J83894
16997I00884l93586J49762o7918j04408L69192k47613L64278J21018p7377k59319
16987G54913J49862j59926K9330L3131K69769j26003l8677j28616N83597m29843
16977I37537m2979j1306L57934l40938o7012Q969K44303k27843K4744L75848j63615
16966A095642j04018J12951l26296N98247j74089l78630O51869n1167k82085j98183
16956I44241K71163j84424j28832L01799j50144R3153l12759Q9313L83672l7293
16946A269889J21471k96783J60441K3949j33042M58332l47522j61521K82939K05213
16936A583366m97843N07865m10089Q5601K1215K90372m3797l81288O71934J64575
$$ plain form
16926 1991911 1683324 1468736 1222656 1705088 1271201 1444061 1443924 1961413 1746559 1704567
16916 1704567 1488703 1704916 1628019 1675270 1549674 1646175 1698276 2024836 1710334 1979830
16906 1979830 1856044 1821078 1724952 2065025 2076451 2333486 2148648 1752317 1940473 2077670
16896 2077670 2094104 2132648 2161261 1807923 2159967 2244388 1981146 1813411 1994772 2286447
16886 2286447 2518686 2458101 2511174 2475437 2699434 2124863 2253149 2595221 2740478 2538219
16876 2538219 2754798 2687135 2679812 2823989 2464099 2790326 2743876 2475381 2965913 2607678
16866 2607678 2989719 2912819 3225108 2941282 2980238 3132390 3397713 3103321 3153581 3173122
16856 3173122 3073256 3333096 3256469 3510703 3525081 3466423 3464748 3812742 3685680 3939198
$$ packed form
16926A991911l08587k14588k46080M82432m33887J72860j37N17489k14854m1992
16916A704567k15864K16213p6897M7251j25596R6501N2101L26560l14502K69496
16906A979830j23786l4966r6126L40073J1426K57035j84838l96331J88156J37197
16896B077670J6434L8544K8613l53338L52044Q4421k63242j67735J81361K91675
16886B286447K32239o0585N3073l5737K23997n74571J28286L42072J45257k02259
16876B538219K16579o7663p323J44177l59890L26227m6450k68495M90532l58235
16866B607678L82041p6900L12289k83826L8956J52152K65323k94392N0260J9541
16856C173122r9866K59840p6627K54234J4378n8658j675L47994j27062K53518
$$ plain form
16846 3939198 3729820 3892585 4111174 3815406 3629208 4242956 3933169 4154045 4380932
16837 4380932 4362713 4243843 4669609 4362277 4697533 4631930 4711281 4890463 4945185 5008470
16827 5008470 5283663 5084460 5421519 5392715 5513750 5533634 5794906 5426792 5930155 6254525
16817 6254525 6159775 6231712 6259466 6260247 6321083 6982609 6673229 7086162 7199192 7316062 7606123
16806 7606123 7585765 7757630 7970225 7863420 8132075 8315056 8760463 8717679 9093655 9415955
16796 9415955 9620979 9676831 10106506 10384041 10570096 10492038 11277172 11252509 11650911 11500953
16786 11500953 12383956 12388895 12914933 13171101 13691663 13846662 14036976 14595678 15006890 15716326
16776 15716326 15720110 16310265 16925567 17454282 17881722 18803819 19214292 20087513 20516665 21401696
$$ packed form
16846C939198k09378J62765K18589k95768j86198O13748l09787K20876K26887
16837D380932j8219j18870M25766l07332L35256o5603P9351J79182N4722O3285
16827E008470K75193j99203L37059k8804J21035J9884K61272l68114N03363L24370
16817F254525r4750P1937K7754P81O0836O61526l09380M12933J13030J16870K90061
16806G606123k0358J71865K12595j06805K68655J82981M45407m2784L75976L22300
16796I415955K05024N5852M29675K77535J86055p8058P85134k4663L98402j49958
16786A1500953Q83003M939N26038K56168N20562J54999J90314N58702M11212P09436
16776A5716326L784N90155O15302N28715M27440R22097M10473Q73221M29152Q85031
$$ plain form
16766 21401696 21917711 22902416 23471824 24450981 25515320 26265409 27315426 28737984 29693924
16757 29693924 30633291 32052480 33566788 34460386 35925133 37866527 39277983 41108916
16749 41108916 43001722 45165511 47694916 49510692 51956501 54467714 57307917 60095126
16741 60095126 63381265 66664905 70300070 73887688 78070734 82423192 86991418 92058706
16733 92058706 97043497 102564943 108193751 114279830 120735961 126747074 133862121 140647670
16725 140647670 147602468 154383222 161230494 167617736 173686828 179357203 183826848 187931178
16717 187931178 190467737 192246656 192748300 191952776 190489255 187038367 183464319 178403727
16709 178403727 172913678 166510061 159706426 152663038 145675192 138443981 131644507 124268601
$$ packed form
16766B1401696N16015R84705N69408R79157J064339P50089J050017J422558R55940
16757B9693924R39367J419189J514308Q93598J464747J941394J411456J830933
16749D1108916J892806K163789K529405J815776K445809K511213K840203K787209
16741F0095126L286139L283640L635165L587618M183046M352458M568226N067288
16733I2058706M984791N521446N628808O086079O456131O011113P115047O785549
16725A40647670O954798O780754O847272O387242O069092N670375M469645M104330
16717A87931178K536559J778919N01644p95524j463521l450888l574048n060592
16709A78403727n490049o403617o803635p043388o987846p231211o799474p375906
$$ plain form
16701 124268601 117448836 110991915 104645158 98570727 93281105 87916637 82693478 77973776
16693 77973776 73830636 69785672 65897769 62083690 59005509 55560608 53013306 50378308
16685 50378308 47806909 45493326 42891417 40804031 38793305 37424870 35617850 34254441
16677 34254441 32403666 31116382 29713995 28253599 27190727 26367832 25180529 24104533
16669 24104533 23704217 22189676 21648913 20534476 19670919 19180961 18230114 17901174 17446205
16660 17446205 16734265 15956427 15520368 14768022 14321648 14225423 13682735 13551163 12287399
16651 12287399 12109025 11995571 11793838 11353630 10821962 10781019 10460086 10233782 9920170
16642 9920170 9512755 9309003 9303207 8428531 8701280 8545270 8089797 7711654 7768324 7391468
$$ packed form
16701A24268601o819765o456921o346757o074431n289622n364468n223159m719702
16693G7973776m143140m044964l887903l814079l078181l444901k547302k634998
16685E0378308k571399k313583k601909k087386k010726j368435j807020j363409
16677C4254441j850775j287284j402387j460396j062872q22895j187303j075996
16669B4104533m00316j514541n40763j114437q63557m89958r50847l28940m54969
16660A7446205p11940p77838m36059p52346m46374r6225n42688j31572j263764
16651A2287399j78374j13454k01733m40208n31668m0943l20933k26304l13612
16642I920170m07415k03752n796q74676K72749j56010m55473l78143N6670l76856
$$ plain form
16632 7391468 7122273 7337056 6573320 6886966 6585155 6365510 6514316 6453553 5920620 6143147
16622 6143147 5618183 5905519 5548581 5450882 5539280 5413853 5431429 4683791 5094375 5228941
16612 5228941 4730591 4695996 4101325 4561874 4495075 4266756 3965097 3959188 3965481 3695187
16602 3695187 3941395 3707496 3388482 3706071 3595169 3404283 3435493 3305914 3274938 3561589
16592 3561589 3225520 3463102 2969133 3056392 3030257 2811069 3343343 2709413 2725994 2567038
16582 2567038 2766615 2770785 2418014 2792035 2599337 2570696 2373369 2405949 2319114 2377019
16572 2377019 1910790 2087898 2336049 2387486 2142524 1805402 2217480 1766679 1814585 2107912
16562 2107912 1767185 1984786 1929144 1766511 1686443 1929235 1614334 1864430 1868196 1470652
$$ packed form
16632G391468k69195K14783p63736L13646l01811k19645J48806o0763n32933K22527
16622F143147n24964K87336l56938r7699Q8398j25427J7576p47638M10584J34566
16612E228941m98350l4595n94671M60549o6799k28319l01659n909O293k70294
16602C695187K46208k33899l19014L17589j10902j90886L1210j29579l0976K86651
16592C561589l36069K37582m93969Q7259k6135k19188N32274o33930J6581j58956
16582B567038J99577M170l52771L74021j92698k8641j97327L2580q6835N7905
16572B377019m66229J77108K48151N1437k44962l37122M12078m50801M7906K93327
16562B107912l40727K17601n5642j62633q0068K42792l14901K50096L766l97544
$$ plain form
16552 1470652 1690594 2117813 1946043 1621825 1537641 1869973 1284880 1472683 1405956 1691133
16542 1691133 1370706 1624930 1555501 1428560 1431768 1338969 1194343 1422276 1543759 1357163
16532 1357163 1387929 1003541 1466511 1497003 1279338 1335350 1323738 1112231 1334903 1033369
16522 1033369 1003015 1224875 1058506 1224626 1227821 1379540 954321 1167135 1339306 779496
16512 779496 1065266 1149497 1235288 1176692 901407 655811 814342 734431 801750 978383
16502 978383 707662 1070344 512745 927388 716208 819988 956645 631745 741164 698916
16492 698916 523196 1131812 671142 988772 543315 768083 537884 807028 698443 722703
16482 722703 976581 715550 615569 691413 783321 766551 977083 730849 684445 712737 644517
$$ packed form
16552A470652K19942M27219j71770l24218q4184L32332n85093J87803o6727K85177
16542A691133l20427K54224o9429j26941L208r2799j44626K27933J21483j86596
16532A357163L0766l84388M62970L0492k17665N6012j1612k11507K22672l01534
16522A033369l0354K21860j66369J66120L195J51719m25219K12814J72171n59810
16512G79496K85770Q4231Q5791n8596k75285k45596J58531p9911O7319J76633
16502I78383k70721L62682E12745M14643k11180J03780J36657l24900J09419m2248
16492F98916j75720O08616m60670L17630m45457K24768k30199K69144j08585K4260
16482G22703K53878k61031r9981P5844R1908j6770K10532k46234m6404K8292o8220
$$ plain form
16471 644517 925054 626886 797427 673128 970403 713984 793507 458617 663280 706857
16461 706857 544963 759465 429793 425292 805890 700753 673813 998213 866177 440827
16451 440827 579663 486998 577504 551866 386903 475252 565041 611709 203643 541814 528651
16440 528651 244050 320912 251600 287049 718570 565329 646265 244206 314544 379655 614578
16429 614578 444938 125139 285814 519416 330400 188899 326129 295794 240631 353382
16419 353382 543270 345344 65165 368864 784998 135220 884356 579469 361852 412980
16409 412980 445924 402787 229986 -170083 375915 525730 479747 229124 253493 146520
16399 146520 319775 272898 -15148 233337 453546 505859 264657 377228 744088 131385
$$ packed form
16471F44517K80537k98168J70541j24299K97275k56419P9523l34890K04663M3577
16461G06857j61894K14502l29672m501L80598j05137k6940L24400j32036m25350
16451D40827J38836r2665R0506k5638j64963Q8349Q9789M6668B03643L38171j3163
16440E28651B44050P6862o9312L5449M31521j53241Q0936B44206P0338O5111K34923
16429F14578j69640A25139J60675K33602j89016j41501J37230l0335n5163J12751
16419C53382J89888j97926F5165L03699M16134A35220P49136l04887k17617N1128
16409D12980L2944m3137j72801a70083C75915J49815m5983B29124K4369j06973
16399A46520J73255m6877a5148B33337K20209N2313k41202J12571L66860A31385
$$ plain form
16388 127942 248330 183100 40518 143329 454409 565340 472497 364026 275794 215826
16378 215826 240027 487777 256846 360966 344645 87442 148388 368515 365090 176821 -8523
16366 135833 441412 168565 247111 70186 -31139 470158 562704 350526 521992 252472
16355 133156 -11912 244449 233306 397932 -147536 122750 421191 549334 196824 663771
16345 663771 68887 231530 362646 -172555 233897 420241 415741 550851 28291 56263
16335 56263 318356 277984 -142673 317481 294073 -8695 223028 -86464 449960 18671 527109
16324 527109 164412 -137204 378338 49448 180781 387156 -80844 463961 28362 -134157
16313 84191 418477 -83450 115803 120307 78647 365261 89634 247019 -92685 -113943 132732
$$ packed form
16388A27942J20388o5230D0518J02811L11080J10931r2843j08471q8232n9968
16378B15826K4201K47750k30931J04120j6321H7442O0946K20127l425A76821h523
16366A35833L05579A68565P8546G0186c1139D70158R2546k12178J71466B52472
16355A33156a1912B44449j1143J64626a47536A22750K98441J28143A96824M66947
16345F63771F8887J62643J31116a72555B33897J86344m500J35110B8291K7972
16335E6263K62093m0372a42673C17481k3408h695B23028h6464D49960A8671N08438
16324E27109A64412a37204C78338D9448J31333K06375h0844D63961B8362a34157
16313H4191L34286h3450A15803M504m1660K86614H9634J57385i2685k1258A32732
$$ plain form
16301 197465 256658 -181 133062 -87720 36991 60461 17473 121899 60843 348856 31477
16289 31696 84058 295362 158790 371006 331576 161946 5097 78036 542377 223067 415116
16278 415116 48645 293420 -113360 95943 113483 -316607 61907 118221 -54857 92410 520993
16267 520993 223157 82623 59288 45602 -1120 82811 528 3154 102033 240160 244575 210867
16255 210867 -350139 149191 162019 -122434 226742 -154564 52013 63245 -82948 103077
16244 173574 107937 3204 -2747 26371 173109 408164 267747 -107091 -127718 -25163 -183305
16233 -183305 220649 -112076 53166 182543 -170969 -131767 287872 107613 -83989 -93876
16223 -93876 -50972 -56895 115674 143731 424915 140950 266315 370517 419074 -13000 -368866
$$ packed form
16301A97465N9193a81A33062h7720C6991K3470A7473J04426F0843K88013C1477
16289C1696N2362K11304j36572K12216l9430A61946E097P2939M64341B23067J92049
16278D15116D8645K44775a13360I5943J7540c16607F1907N6314e4857I2410M28583
16267E20993B23157H2623k3335j3686a120H2811E28K626R8879J38127M415l3708
16255B10867c50139A49191J2828a22434B26742a54564E2013J1232h2948A03077
16244A73574o5637C204b747B6371J46738K35055j40417a07091k0627b5163j58142
16233a83305B20649a12076E3166J29377a70969L9202B87872A07613h3989r887
16223i3876M2904n923A15674K8057K81184A40950J25365J04202M8557a3000l55866
$$ plain form
16212 -368866 -153249 120679 66339 83902 -156958 34136 -165018 145137 -117780 -78369
16202 -78369 -17053 -75491 128481 -20095 -140661 -115268 -98422 -300201 -129846 101738 88284
16191 88284 -91814 46128 -39404 -31154 186967 30514 -39984 272571 230341 502840 -96757
16179 139313 470035 244185 249632 -48992 188483 291570 -243658 -115827 146365 -31917
16168 322737 -292440 132226 -33488 81312 294240 84081 92385 233752 262820 347290 -59396
16156 -76852 41434 316711 100732 385968 50559 -276383 -392349 164350 -13016 22885
16145 -448710 -37933 -25638 7921 99048 -396947 33482 -108021 -83155 32435 -166199 88545
16133 -109357 -33264 -79889 -186886 188114 321531 47085 322931 -40950 -250114 -397442
$$ packed form
16212c68866a53249A20679n4340J7563a56958C4136a65018A45137a17780L9411
16202g8369a7053n8438A28481b0095j20566K5393J6846k01779a29846A01738j3454
16191H8284i1814D6128c9404Q250A86967C0514c9984B72571m2230K72499i6757
16179A39313L30722k25850N447d8992A88483J03087b43658a15827A46365c1917
16168C22737b92440A32226c3488H1312K12928H4081Q304J41367K9068Q4470e9396
16156g6852D1434K75277A00732K85236E0559b76383j15966A64350a3016B2885
16145d48710c7933J2295G921R1127c96947C3482a08021K4866C2435a66199H8545
16133a09357c3264m6625j06997A88114J33417D7085K75846d0950k09164j47328
$$ plain form
16123 -397442 -189798 520206 -255134 -8446 212545 133059 -16672 -255719 -87601 -24478 172366
16111 531973 -199023 -378873 247444 -46970 101065 -70712 127913 205636 27330 217293
16101 217293 176048 220877 -90788 293278 184059 116376 28708 -10748 74162 -218518 -14829
16089 -90529 -50067 -53557 21960 -266113 13214 -360532 27977 120624 107208 46688 143160
16078 143160 -104844 160397 -291783 -96760 263081 241792 -134888 105094 -57957 -132177
16068 -132177 80046 -14199 -66938 -207818 -282589 -195203 -242183 143845 212069 -407257 -121852
16056 4350 72974 90237 -60188 -111376 154539 -23184 -413000 995 178509 -122271 138359
16044 -156135 2447 210474 4987 265479 -77488 270736 14954 -20908 53197 146509 -16726
$$ packed form
16123c97442a89798E20206b55134h446B12545p9486a6672k39047h7601b4478A72366
16111E31973a99023j79850B47444d6970A01065g0712A27913P7723B7330J89963
16101B17293m1245M4829i0788B93278j09219o7683B8708a0748G4162b18518a4829
16089i0529M0462l490B1960b66113A3214c60532B7977R2647j3416D6688R6472
16078A43160a04844A60397b91783i6760B63081k1289a34888A05094e7957p4220
16068a32177H0046a4199n2739j40880p4771Q7386m6980A43845O8224d07257a21852
16056D350O8624J7263f0188n1188A54539b3184l89816I95J77514a22271A38359
16044a56135B447K08027D987K60492g7488B70736A4954b0908E3197R3312a6726
$$ plain form
16032 -24356 -185029 206989 -26102 -171878 -48945 -101268 -129206 -51559 -176302 144586 -261211
16020 -161613 34336 -90902 -362023 47214 4234 -383696 174965 425258 -71217 -270854 121949
16008 134293 -180759 -7523 -59503 2824 132570 166915 19166 100542 -137030 62848 -90896
15996 -174709 -463959 343916 104155 -230135 106847 76820 -16149 -225168 -69451 -59004
15986 -59004 108037 -88636 209183 671 293906 570458 56691 392223 641323 349490 99864
15974 257180 -109552 148341 227486 27130 290718 -423211 -118816 83448 8694 -198491
15963 -222693 -41548 118064 192574 111053 355216 258560 67037 131868 -179691 12953 -67754
15951 -304090 -51566 474524 27137 48420 -2092 -107583 -218423 -26604 246001 -77040 -333999
$$ packed form
16032b4356j60673B06989b6102j45776d8945n2323k7938e1559j24743A44586b61211
16020a61613C4336i0902k71121D7214D234c83696A74965K50293g1217j99637A21949
16008A34293a80759g523n1980B824J29746L4345A9166Q1376a37030F2848i0896
15996a74709k89250C43916A04155b30135A06847l0027a6149k09019f9451J0447
15986e9004A08037h8636B09183F71K93235K76552E6691L35532K49100k91833I9864
15974B57180a09552A48341P9145B7130K63588d23211a18816H3448H694a98491
15963b22693d1548A18064P4510q1521K44163r6656F7037O4831a79691A2953f7754
15951c04090e1566D74524B7137K1283b092j05491j10840b6604B46001g7040k56959
$$ plain form
15940 -333999 -216286 10954 183938 -29935 23141 10896 -80660 -36256 -165591 82999 -266109
15928 -53678 -177060 84858 77348 -107298 -61579 97111 -91733 -9551 352 -59597 143677 -10748
15915 5635 -145975 -38566 172650 -181166 81444 109869 -287593 42521 -59924 -113520 -2302
15903 -112801 -395244 -323568 29708 -166329 -66737 -203803 -24950 203275 -259513 -250139 158824
15891 -91152 43574 -82684 89148 220625 68710 -264145 -44888 240965 -90644 -148696 58554
15879 -89657 -118242 -26974 -153047 -87037 -444086 16509 -337278 -66719 -296606 -53531 144422
15867 219427 -29785 292873 -430802 229155 48514 -157616 46082 -46932 138630 186103
15857 186103 -165178 -171464 -41462 60568 -253918 164012 25948 -209457 -91985 -163539 -276547
$$ packed form
15940c33999J17713A0954J72984b9935B3141A0896h0660c6256j29335H2999b66109
15928e3678j23382H4858p510a07298M5719I7111i1733i551C52e9597A43677a0748
15915E635a45975c8566A72650a81166H1444K8425b87593D2521e9924n3596b302
15903a12801k82443P1676B9708a66329f6737j37066b4950B03275b59513R374A58824
15891i1152D3574h2684H9148J31477F8710b64145d4888B40965i0644n8052E8554
15879h9657k8585b6974j26073O6010l57049A6509c37278f6719k29887e3531A44422
15867B19427b9785B92873d30802B29155D8514a57616D6082d6932A38630M7473
15857A86103a65178o286d1462F0568b53918A64012B5948b09457i1985p1554j13008
$$ plain form
15846 -276547 -8842 -320377 -76979 -394 -298220 211009 -136844 -17863 174605 -20660 31992
15834 -160989 124356 -206329 -82254 -27275 331403 -270269 -26720 -411461 -71495 -190115
15824 -190115 -315132 173835 -93982 -221569 -408417 -97427 153730 2120 -87483 -143437 74527
15812 253161 -295843 -130294 -49697 199193 -304322 34392 -135973 -69697 -158488 159055
15801 -19127 -182599 -2830 -59390 -50654 -214601 60792 195523 31146 113980 15880 227573
15790 227573 412223 -139777 29894 -140485 -37362 -287848 190933 -101478 248989 209677
15780 209677 99497 -5361 -174164 182566 -52092 74284 -191617 163810 -94883 -519346 84302
15768 -173276 258290 32387 37347 6626 206215 -147267 -457186 237685 290619 -111229 -143541
$$ packed form
15846b76547h842l11535g6979c94k97826B11009a36844a7863A74605b0660C1992
15834a60989A24356b06329h2254b7275C31403b70269b6720l84741g1495j18620
15824a90115j25017A73835i3982j27587j86848i7427A53730B120h7483n5954G4527
15812B53161b95843a30294d9697A99193c04322C4392a35973O6276q8791A59055
15801a9127j63472b830n6560Q736j63947F0792J34731C1146Q2834A5880K11693
15790B27573J84650a39777B9894a40485c7362k50486A90933a01478B48989l9312
15780B09677I9497e361j68803A82566e2092G4284a91617A63810i4883m24463H4302
15768a73276B58290C2387M960F626J99589a47267l09919B37685N2934a11229l2312
$$ plain form
15757 -143541 -112163 257129 112809 -26600 107317 221713 -108773 -22357 136455 102007
15747 102007 -246177 -217081 412228 -204889 -255031 311826 112025 127893 -25784 -134327
15737 -134327 -36911 -2591 -151200 46516 -105891 119394 118402 -11483 -184164 -303712 -30710
15725 -222943 -131408 -285702 -102903 61068 -205551 -112236 -54189 -512605 44439 -176541
15714 20792 -28671 -25357 -14659 935 79198 116492 -95070 -148004 -89140 -211417 -208558 377143
15701 16705 -7687 -110386 138138 147455 -369558 -207199 126230 -148052 285112 64412 -93303
15689 86600 367302 38216 321765 -112696 177838 282607 -265770 138798 -238236 -439046
15679 -439046 108428 -17926 113220 139729 -241116 -55773 46946 272814 72160 -167378
$$ packed form
15757a43541L1378B57129A12809b6600A07317J14396a08773b2357A36455l4448
15747A02007b46177K9096D12228b04889n0142C11826A12025J5868b5784j08543
15737a34327c6911b591j48609D6516a05891A19394r92a1483j72681j19548c0710
15725b22943R1535j54294a02903F1068b05551R3315e4189m58416D4439a76541
15714B0792b8671L314J0698I35P8263L7294i5070n2934N8864j22277K859C77143
15701A6705g687j02699A38138R317c69558J62359A26230a48052B85112F4412i3303
15689H6600K80702C8216K83549a12696A77838J04769b65770A38798b38236k00810
15679d39046A08428a7926A13220K6509b41116e5773D6946K25868G2160a67378
$$ plain form
15668 -100903 -256933 107296 18330 318161 425775 -472194 123744 -260587 -178425 293353
15657 -262853 -124468 -208439 -20478 14675 -190933 -417423 249481 -333691 88601 69305
15647 69305 -169389 -4735 -265537 -161395 14917 -72831 153818 -216546 112659 -434228
15636 -318603 -8034 -32224 -67219 -199520 -100528 -49074 -164982 -6262 152741 -170642 -366164
15625 -366164 -56188 310537 393183 184182 88299 229262 -8576 409024 -306059 -45752 199610
15613 163455 161731 81770 -79911 -196016 -165722 76255 47565 -99705 134497 -243870 -125458
15602 -125458 -449261 -204093 169243 -130568 68290 32792 140042 -224422 58945 61651
15592 61651 -57343 -139953 104581 -212587 20342 -32733 373727 150378 203194 -32422 29328
$$ packed form
15668a00903j56030A07296A8330K99831J07614d72194A23744b60587Q2162B93353
15657b62853a24468q3971b0478A4675a90933k26490B49481c33691H8601j9296
15647F9305a69389d735k60802J04142A4917g2831A53818b16546A12659d34228
15636c18603h034k4190l4995j32301R8992d9074j15908f262A52741a70642j95522
15625c66164e6188C10537Q2646A84182H8299J40963h576D09024c06059d5752A99610
15613A63455j724p9961g9911j16105L0294G6255k8690i9705A34497b43870J18412
15602a25458l23803b04093A69243a30568F8290C2792J07250b24422E8945K706
15592F1651e7343q2610A04581b12587B0342c2733C73727A50378N2816c2422B9328
$$ plain form
15580 -75170 -35923 -254140 -99845 -204635 -88128 -18220 94478 23131 -49363 12458 -297931
15568 -302625 -288674 2659 -308805 -217442 -177319 -58439 366945 -165084 327093 -21985 1066
15556 127084 36915 54537 -405568 129047 233297 -191292 -429703 356535 -87430 -142282
15546 -142282 -311860 106088 -187347 -4646 295512 -105173 193958 274947 57263 373257
15536 373257 -102663 -145729 9749 30483 145996 -361659 -73115 84308 -100002 269657 137508
15525 137508 133372 -357534 -177575 -104073 89569 98206 -161291 -77682 381857 -97048 -166140
15514 -166140 13343 255330 74172 -11868 -194805 139392 50142 8451 -169333 -101888 83018
15502 120771 -123114 48701 29131 -248136 -10006 47745 -17840 -41575 -320251 362722 46424
$$ packed form
15580g5170c5923k18217i9845j04790h8128a8220I4478B3131d9363A2458b97931
15568c02625J3951B659c08805R1363M0123e8439C66945a65084C27093b1985A066
15556A27084C6915J7622d05568A29047J04250a91292k38411C56535h7430n4852
15546a42282j69578A06088a87347d646B95512a05173A93958Q0989E7263L15994
15536C73257a02663m3066I749K0734J15513c61659g3115H4308a00002B69657j32149
15525A37508m136c57534a77575P3502H9569Q637a61291g7682C81857i7048o9092
15514a66140A3343K41987G4172a1868j82937A39392E0142H451a69333O7445H3018
15502A20771a23114D8701j9570b48136a0006D7745a7840k3735k78676C62722D6424
$$ plain form
15490 5855 59245 19862 -181295 -176709 22730 180585 -63821 -28095 130359 -70994 -88549
15479 -88549 86661 58150 -177185 205834 319368 -234207 -30478 163664 -480222 44100
15468 18202 68722 167989 22443 369384 -220810 -10512 138944 52581 177431 15950 1928
15456 236388 -25907 7818 13943 -62716 -44954 97869 -196272 231762 -264897 -230560 -104121
15444 102243 172544 -108257 -137738 127400 292023 124862 506711 65505 32285 -23761
15433 -142480 -88366 -71857 44426 176796 -118125 19889 -263684 317524 288708 -231309
15422 233246 25351 -24711 11683 -354452 177489 -8185 108276 163055 183557 -114397 -56233
15410 -170222 -61876 73613 -257747 73147 -267441 -54948 -97186 -97512 -132389 -256105 -371575
$$ packed form
15490E855N3390A9862a81295M586B2730J57855f3821b8095A30359g0994j7555
15479h8549H6661k8511a77185B05834J13534b34207c0478A63664d80222D4100
15468A8202N0520R9267B2443L46941b20810a0512A38944E2581J24850A5950A928
15456B36388b5907G818O125f2716J7762I7869a96272B31762b64897L4337a04121
15444A02243P0301a08257k9481A27400J64623A24862L81849F5505C2285b3761
15433a42480N4114J6509D4426J32370a18125A9889b63684C17524k8816b31309
15422B33246B5351b4711A1683c54452A77489h185A08276N4779K0502a14397e6233
15410a70222f1876G3613b57747G3147b67441e4948m2238l26l4877j23716j15470
$$ plain form
15399 -371575 86677 -76762 -90063 -189947 -140457 45981 -381513 125709 -228733 -58368 31556
15387 222244 -23085 -358760 141266 -500473 -307931 -78612 -182968 183473 -193849 -134775
15377 -134775 17105 -314681 53447 196122 201331 -260181 -86556 -9698 -174942 203383 -347710
15365 115995 -166672 -203030 -67219 -358361 -169227 -135278 143638 -198708 20380 388378
15355 388378 -68269 4710 -347090 -175953 198213 -4131 -218690 113414 67312 -218236 123699
15343 -174517 64108 21987 128788 36010 -210567 7163 1189 262776 174300 84373 -53085
15331 307343 129570 -58618 168856 -161691 21220 -231800 282271 45234 3230 386795
15321 386795 227874 14312 29454 52536 404084 -168127 39007 -180586 -134146 133562
$$ packed form
15399c71575H6677g6762j3301r9884M9490D5981c81513A25709b28733e8368C1556
15387B22244b3085l35675A41266e00473J92542g8612j04356A83473a93849N9074
15377a34775A7105c14681E3447J42675N209b60181h6556i698j65244B03383c47710
15365A15995a66672l6358f7219k91142a69227L3949A43638a98708B0380L67998
15355C88378f8269D710c47090J71137A98213d131k14559A13414m6102b18236A23699
15343a74517F4108B1987J06801C6010b10567G163A189K61587q8476H4373e3085
15331C07343A29570e8618A68856a61691B1220b31800B82271D5234C230L83565
15321C86795j58921A4312J5142K3082L51548a68127C9007a80586M6440A33562
$$ plain form
15310 -75706 320294 88457 -194652 -37379 -106097 46081 245086 6604 545956 155376 97282
15299 97282 216696 46304 135650 -25436 -223708 326714 -288896 312504 275601 -37724 -132355
15288 -132355 117054 -84659 -74127 22424 147821 161100 38708 238058 -71350 -160687 -32352
15276 53106 -91126 304466 -111984 27527 165069 284209 -402071 -72824 -17345 -152074
15266 -152074 110221 -278137 12638 106228 -57419 -154573 33800 227826 -63922 49199 89398
15255 89398 26517 215958 238237 216694 -37119 -94786 -3693 -22420 -77673 77579 400143
15244 400143 382202 1454077 2496648 2689565 2395798 2492567 1318306 650169 87204 464814
15234 464814 204369 16091 14865 -197144 -119420 -48202 154786 -370601 92866 98561 -384493
$$ packed form
15310g5706C20294H8457a94652c7379o8718D6081J99005F604N39352A55376n8094
15299I7282J19414D6304Q9346b5436j98272C26714b88896C12504l6903c7724r4631
15288a32355A17054h4659J0532B2424J25397J3279C8708J99350g1350q9337c2352
15276E3106i1126C04466a11984B7527J37542J19140d02071g2824a7345j34729
15266a52074A10221b78137A2638R3590e7419r7154C3800J94026f3922D9199M0199
15255H9398B6517J89441K2279k1543c7119n7667c693j8727n5253G7579L22564
15244D00143j7941J071875J042571J92917k93767R6769j174261F50169H7204L77610
15234D64814B04369A6091j226a97144P7724d8202A54786c70601I2866N695c84493
$$ plain form
15222 -306208 290340 -80768 315264 39820 212212 283479 -178252 -10688 16526 -37080 137714
15210 47516 -93627 386712 191300 377729 -285562 -851 -209127 27149 239737 -122073 -137653
15199 -137653 -114329 -100398 -122258 -59691 112990 159219 -8036 -286970 131608 446668 117789
15187 115253 -79652 69296 36298 -75524 251300 225249 -129508 160963 31820 179490 -16296
15175 -179895 481395 155292 -70011 211932 120068 83458 320480 100487 226075 -102958
15164 -147919 241055 9236 87487 25577 -215739 65607 292811 122790 -154193 341611
15153 137113 -190133 -263911 148038 162386 182943 -184681 -27484 -23533 121637 456943 -4875
15141 -329796 -61753 -161181 -83596 79979 188285 368643 -256343 -161613 -150853 154549 240979
$$ packed form
15222c06208B90340h0768C15264C9820J72392P1267a78252a0688A6526c7080A37714
15210D7516i3627C86712A91300J86429b85562h51k08276B7149K12588a22073j5580
15199a37653K3324J3931k1860e9691A12990M6229h036k78934A31608L15060A17789
15187A15253g9652F9296l2998g5524B51300k6051a29508A60963C1820J47670a6296
15175a79895D81395A55292g0011B11932r1864l6610K37022A00487J25588a02958
15164a47919B41055I236P8251B5577b15739F5607K27204A22790a54193C41611
15153A37113a90133p3778A48038J4348K0557a84681b7484L951A21637L35306d875
15141c29796f1753r9428P7585G9979J08306J80358b56343R4730J0760A54549Q6430
$$ plain form
15130 240979 171881 5106 281513 83859 254928 241811 -19923 174716 123366 78335 319582
15119 319582 105699 310522 197916 240137 330089 164421 326109 284963 141177 178211
15109 178211 317621 -33173 82097 72620 208000 -127295 193627 751 141306 30846 292342
15098 292342 64023 53642 -176947 92712 -51597 133840 62138 43845 9583 -108186 143749
15086 204149 120539 117333 139885 71110 332680 279078 299757 330357 445738 176293 -204561
15074 217818 113418 -110496 366676 357768 134492 11701 -3872 160829 144058 193756 -175158
15062 334870 -72988 -85992 222562 173780 138547 166948 492629 -187563 31989 179568 14759
15050 94130 266880 188771 203561 172229 128645 273011 -191066 281399 -106361 93905 189941
$$ packed form
15130B40979o9098E106K76407H3859J71069j3117a9923A74716n1350m5031K41247
15119C19582A05699K04823j12606M2221Q9952A64421J61688m1146A41177L7034
15109A78211J39410c3173H2097r477J35380a27295A93627G51J40555C0846K61496
15098B92342F4023j0381a76947I2712e1597A33840F2138j8293I583a08186A43749
15086B04149q3610l206K2552o8775K61570n3602K0679L0600J15381A76293b04561
15074B17818j04400a10496C66676q908A34492A1701c872A60829j6771M9698a75158
15062C34870g2988j3004B22562m8782l5233K8401L25681a87563C1989J47579A4759
15050I4130J72750p8109J4790l1332m3584J44366a91066B81399a06361I3905R6036
$$ plain form
15039 189941 165835 339090 195005 236526 144934 477137 591945 152742 71491 154665
15029 154665 -127573 339947 203024 303162 90755 226076 22260 -19823 275178 130882
15018 220200 207187 370421 409244 296455 188497 185000 255429 130153 140967 84744 319046
15007 319046 42584 261375 70683 462106 84850 553792 281263 235007 -64816 108846
14996 272376 178946 -267012 242079 137063 -55719 70197 413318 215910 194379 9052 200457
14985 200457 338595 -25252 321107 -206385 168582 181749 -52606 127412 73618 118301
14975 118301 3181 188727 410055 358979 279815 301079 201865 9100 357285 327595 -26331
14963 -230336 367672 537923 323432 441549 2826 129316 277248 171497 299999 -3014
$$ packed form
15039A89941k4106J73255j44085M1521r1592L32203J14808A52742G1491Q3174
15029A54665a27573C39947j36923J00138I0755J35321B2260a9823B75178A30882
15018B20200j3013J63234L8823j12789j07958l497P0429j25276J0814n6223K34302
15007C19046D2584K18791G0683L91423H4850M68942k72529m6256f4816A08846
14996B72376r3430b67012B42079j05016e5719G0197L43121j97408k1531I052J91405
14985B00457J38138b5252C21107b06385A68582J3167e2606A27412n3794M4683
14975A18301C181J85546K21328n1076p9164K1264r9214I100L48185k9690b6331
14963b30336C67672J70251k14491J18117B826J26490J47932j05751J28502c014
$$ plain form
14952 154176 262055 251245 -66086 -22534 210190 208163 -102181 102125 238542 119261
14941 288865 183919 252026 33404 286658 228920 283074 194801 -168844 39389 220781 329082
14930 329082 45341 293208 351956 471409 264506 656153 169288 329273 123583 382341
14920 382341 256679 7952 410536 187611 416164 318792 128167 110398 302927 482318
14910 482318 350670 144416 219041 556993 320312 117100 458910 -132877 184905 295455
14900 295455 59600 200291 250032 417117 420886 442705 44377 654996 457326 403020 437223
14889 437223 246243 353920 360771 463235 587660 283365 236260 350271 484189 385837
14879 385837 621082 140285 283917 455127 478378 519820 42506 428642 458259 318967
$$ packed form
14952A54176J07879j0810f6086b2534B10190k027a02181A02125J36417A19261
14941B88865j04946O8107C3404K53254n7738N4154q8273a68844C9389J81392J08301
14930C29082D5341K47867N8748J19453k06903L91647A69288J59985A23583K58758
14920C82341j25662G952M02584A87611K28553r7372A28167j7769J92529J79391
14910D82318j31648A44416P4625L37952k36681A17100L41810a32877A84905J10550
14900B95455E9600J40691M9741J67085L769K1819D4377O10619j97670n4306L4203
14889D37223j90980J07677O851J02464J24425B83365m7105J14011J33918r8352
14879C85837K35245A40285J43632J71210K3251M1442D2506L86136K9617j39292
$$ plain form
14869 318967 648074 607199 182287 115387 496833 397808 646228 453707 407662 532722
14859 532722 399682 221523 445445 242308 443284 462285 590492 425375 484612 466958
14849 466958 258058 496261 384644 262637 37581 350457 408135 388725 224000 469028
14839 469028 162765 614523 402158 579971 465468 416001 504702 596419 446432 549286
14829 549286 308940 525312 588411 113985 208333 469660 213150 182547 517659 411836
14819 411836 438815 384397 100909 160143 751022 285343 601345 613115 303160 550567
14809 550567 455925 527531 451778 502808 209983 355778 342971 509756 664465 639863 686174
14798 686174 415008 345188 527950 373450 340430 609074 714656 567926 806599 694195
$$ packed form
14869C18967L29107m0875A82287o6900L81446r9025K48420j92521m6045J25060
14859E32722j33040j78159K23922k03137K00976J9001J28207j65117N9237j7654
14849D66958k08900K38203j11617j22007C7581L12876N7678j9410j64725K45028
14839D69028A62765M51758k12365J77813j14503m9467Q8701R1717j49987J02854
14829E49286k40346K16372O3099A13985R4348K61327B13150l0603L35112j05823
14819D11836K6979n4418A00909N9234N90879B85343L16002J1770C03160K47407
14809E50567r4642P1606p5753N1030B09983J45795j2807J66785J54709k4602M6311
14798F86174k71166o9820J82762j54500l3020K68644J05582j46730K38673j12404
$$ plain form
14788 694195 417662 483806 191089 847961 567935 566983 349781 346970 497970 259474 643346
14777 643346 685008 577425 476095 838335 826753 606425 511066 656175 445536 694422
14767 694422 622959 691076 594673 778065 559646 908087 505453 586418 571132 985259
14757 985259 453810 341382 477641 579127 866134 839000 756094 568932 837616 622497
14747 622497 416282 730407 844809 561485 869651 899581 768097 568778 864433 906566
14737 906566 686316 702709 538277 776598 844581 629768 683345 217093 798374 759103
14727 759103 803310 673969 946753 876869 598918 907714 505051 556562 638212 909646
14717 909646 618075 648825 891435 833759 515063 826834 435472 700313 724483 760107
$$ packed form
14788F94195k76533O6144A91089O56872k80026r52k17202k811J51000k38496L83872
14777F43346M1662j07583j01330L62240j1582k20328r5359J45109k10639K48886
14767F94422p1463O8117r6403J83392k18419L48441m02634Q0965j5286M14127
14757I85259D53810j12428J36259J01486K87007k7134q2906j87162K68684k15119
14747F22497k06215L14125J14402k83324L08166K9930j31484j99319K95655M2133
14737I06566k20250J6393j64432K38321O7983k14813N3577B17093N81281l9271
14727G59103M4207j29341K72784o9884k77951L08796m02663N1511Q1650K71434
14717I09646k91571L0750K42610n7676l18696L11771l91362K64841K4170L5624
$$ plain form
14707 760107 1044598 934373 833072 1064451 838809 923216 898691 744690 920611 975864
14697 975864 842181 517772 643964 907130 1022304 795441 1233619 1076008 1271696 513589
14686 1118934 1049807 949239 716684 1029128 1253909 933688 845829 619606 864448 864796
14676 864796 1199819 1126717 691099 993708 1259405 985245 1123759 952232 1259059 1079973
14666 1079973 1357120 777566 897523 844388 713608 760107 938322 1156907 1152808 1183771
14656 1183771 851087 1054024 912753 1339106 765895 1396658 1243570 1077247 1251668
14647 1251668 1306428 1025108 1341144 934869 1289880 1136010 1375070 1205059 1182242 1236693
14637 1236693 1350316 1120890 1202517 1218860 1114993 1285893 1389552 1145260 1343941 1029134
$$ packed form
14707G60107K84491j10225j01301K31379k25642Q4407k4525j54001J75921N5253
14697I75864j33683l24409J26192K63166J15174k26863M38178j57611J95688E13589
14686A118934o9127j00568k32555L12444K24781l20221q7859k26223K44842L48
14676H64796L35023p3102m35618L02609K65697k74160J38514j71527L06827j79086
14666A079973K77147n79554J19957n3135j30780M6499J78215K18585m099L0963
14656A183771l32684K02937j41271M26353n73211O30763j53088j66323J74421
14647A251668N4760k81320L16036m06275L55011j53870K39060j70011k2817N4451
14637A236693J13623k29426Q1627J6343j03867J70900J03659k44292J98681l14807
$$ plain form
14627 1029134 1222815 1495085 1131411 1282746 1230936 1047046 1472252 1475878 1425694 1537905
14617 1537905 1113562 1396017 1387033 1214027 1461192 1357259 1391188 2049944 1219293 1676266
14607 1676266 1441950 1461606 1793697 1426879 1419043 1292421 1591236 1620070 1508693 1447682
14597 1447682 1731109 1450582 1643930 1765039 1559918 1543030 1646566 2184876 1561170 1493833
14587 1493833 2108544 1975702 1853619 2094568 1790837 1990122 2190612 1901495 1914663 2000519
14577 2000519 2116542 2214402 2021764 2124686 2191379 2119423 2045412 1654961 2282297 2434983
14567 2434983 2570409 2488495 2305348 2277220 2406713 2563594 2465388 2844883 2519288 2529097
14557 2529097 3245995 2765044 3268171 3406719 3788848 4015021 4297378 5663637 7690447
$$ packed form
14627A029134J93681K72270l63674J51335n1810j83890M25206L626n0184J12211
14617A537905m24343K82455q984j73006K47165j03933L3929O58756q30651M56973
14607A676266k34316J9656L32091l66818p836j26622K98815K8834j11377o1011
14597A447682K83427k80527J93348J21109k05121j6888J03536N38310o23706o7337
14587A493833O14711j32842j22083K40949l03731J99285K00490k89117J3168Q5856
14577B000519J16023R7860j92638J02922O6693p1956p4011l90451O27336J52686
14567B434983J35426q1914j83147k8128J29493J56881r8206L79495l25595R809
14557B529097P16898m80951N03127J38548L82129K26173K82357J366259K026810
$$ plain form
14548 7690447 11031869 19019987 39245047 51458608 22738665 7957084 3915337 2879880
14540 2879880 2788789 3162069 4771018 6810253 4471385 2564562 2086979 2086836 1868951
14531 1868951 2198540 1888924 2148256 1781496 1913929 2527076 2801790 2430056 2466250 2285141
14521 2285141 2485784 2259816 2451549 2436996 2478956 2669016 2627788 2734505 2741084 2552564
14511 2552564 2645045 2726511 3188507 2958064 2952715 3275524 2801511 2969681 3059177 2618504
14501 2618504 3046254 2954254 3088118 2868656 3174000 3481337 3235779 3406838 3487495 3189484
14491 3189484 3298990 3342986 3242548 3292330 3591534 3592297 3568087 3774847 4065267 4046026 3851247
14480 3851247 4223534 3665116 3937363 3837630 4003007 3870676 3960075 4428410 4272846 4320546
$$ packed form
14548G690447L341422P988118K0225060J2213561B2738665G957084C915337j035457
14540B879880r1091L73280J608949K039235k338868j906823m77583j43k17885
14531A868951L29589l09616K59332l66760J32433O13147K74714l71734L6194j81109
14521B285141K00643k25968J91733j4553M1960J90060m1228J06717O579j88520
14511B552564R2481Q1466M61996k30443n349L22809m74013J68170Q9496m40673
14501B618504M27750r2000J33864k19462L05344L07337k45558J71059Q0657k98011
14491C189484J09506M3996j00438M9782K99204P63k4210K06760K90420j9241j94779
14480C851247L72287n58418K72247r9733J65377j32331Q9399M68335j55564M7700
$$ plain form
14470 4320546 4413887 4448230 4225159 4453145 4515726 4892159 4847305 4753504 4372422 4712944
14460 4712944 5126288 5091958 5213867 4913567 5338025 4932320 5292680 5318159 5472037 5339769
14450 5339769 5593010 5517320 5825852 6032510 5702523 6073615 6292389 6193500 6117646 6244801
14440 6244801 5984059 6352406 6326550 6341440 6537139 6425488 6628616 6778227 6954354 7038389
14430 7038389 7182646 7094475 7260680 7439980 7533291 7513637 7802509 7628405 8267987 7746135
14420 7746135 8218741 8444658 8224424 8666670 8698613 9126929 9119499 8924181 9020979 9290015
14410 9290015 9625515 9971041 9952689 9798133 9887543 10111110 10629501 10358803 10670871 10670585
14400 10670585 10930959 11046353 11172318 11618560 11836534 12041519 11865295 12316428 12441002
$$ packed form
14470D320546R3341L4343k23071K27986O2581L76433m4854r3801l81082L40522
14460D712944M13344l4330J21909l00300M24458m05705L60360K5479J53878j32268
14450E339769K53241p5690L08532K06658l29987L71092K18774r8889p5854J27155
14440F244801k60742L68347k5856J4890J95699j11651K03128J49611J76127Q4035
14430G038389J44257q8171J66205J79300R3311j9654K88872j74104O39582n21852
14420G746135M72606K25917k20234M42246L1943M28316p430j95318R6798K69036
14410I290015L35500L45526j8352j54556Q9410K23567N18391k70698L12068k86
14400A0670585K60374J15394J25965M46242K17974K04985j76224M51133J24574
$$ plain form
14391 12441002 12510434 12515197 13135817 13139363 13641388 13835112 13843679 13983752 14229183 14926071
14381 14926071 14987157 15262311 15665371 15827041 15984056 16333733 16690053 17125561 17079794 17804577
14371 17804577 18163512 18695393 18818498 19552238 19441288 19929979 20374547 20740827 21370146
14362 21370146 21797776 22170725 23063056 23615414 23834805 24203303 25199820 25588557 26227352
14353 26227352 26810398 27572737 28134566 28669538 29676453 30446534 31162039 31921181 32712222
14344 32712222 33926253 34156258 35644789 36749231 37326342 38268624 39643271 40703323
14336 40703323 41976573 42991946 44469858 45661894 47228362 48421398 49822379 51391041
14328 51391041 53037142 54943036 56696275 58601116 60623777 62692789 65146626 67056897
$$ packed form
14391A2441002O9432M763O20620L546N02025J93724Q567J40073K45431O96888
14381A4926071O1086K75154M03060J61670J57015L49677L56320M35508m5767P24783
14371A7804577L58935N31881J23105P33740j10950M88691M44568L66280O29319
14362B1370146M27630L72949Q92331N52358K19391L68498R96517L88737O38795
14353B6227352N83046P62339N61829N34972J006915P70081P15505P59142P91041
14344C2712222J214031K30005J488531J104442N77111R42282J374647J060052
14336D0703323J273250J015373J477912J192036J566468J193036J400981J568662
14328E1391041J646101J905894J753239J904841K022661K069012K453837J910271
$$ plain form
14320 67056897 69467532 72030381 74849306 77883088 80505792 84003979 86750586 90270726
14312 90270726 93582041 97962582 101812721 106029359 110732956 115574616 120135849 125750875
14304 125750875 131427267 137580975 143503971 150197059 157560880 165082524 173004802 181305174
14296 181305174 190398739 199947613 209809535 220331876 231165058 242943666 255349669
14289 255349669 268256206 281489329 295387340 310036712 324724166 340356878 355829517
14282 355829517 371640527 387352020 403263052 418254664 432890667 446635374 458689870
14275 458689870 469620340 477986086 481698800 481312654 481195153 479260968 477009354 475862523
14267 475862523 469701071 461095849 449955346 437559309 423750016 408729989 392329436
$$ packed form
14320F7056897K410635K562849K818925L033782K622704L498187K746607L520140
14312I0270726L311315M380541L850139M216638M703597M841660M561233N615026
14304A25750875N676392O153708N922996O693088P363821P521644P922278Q300372
14296A81305174R093565R548874R861922J0522341J0833182J1778608J2406003
14289B55349669J2906537J3233123J3898011J4649372J4687454J5632712J5472639
14282C55829517J5811010J5711493J5911032J4991612J4636003J3744707J2054496
14275D58689870J0930470Q365746L712714l86146j17501j934185k251614j146831
14267D75862523o161452q605222j1140503j2396037j3809293j5020027j6400553
$$ plain form
14260 392329436 375914396 359295769 342646114 326473476 310145805 294810598 279959629
14253 279959629 265578944 251656566 238785423 226509685 215211059 205859399 196367243
14246 196367243 186575383 177337258 168615928 160503584 152845938 145745683 138943114 132504036
14238 132504036 127050873 121857125 116238579 111024503 106399331 101837279 98139107 94630054
14230 94630054 90842778 86866499 83894871 80426444 77337344 74204789 71814161 69254484
14222 69254484 66863933 64631674 62608783 60539678 58213973 56525597 54428902 52623958
14214 52623958 51335562 50383700 48728559 47008679 45637190 44019152 43036043 42130963
14206 42130963 41566585 39738999 38017399 37164133 36214300 35519117 35257355 34154423 33110997
$$ packed form
14260C92329436j6415040j6618627j6649655j6172638j6327671j5335207j4850969
14253B79959629j4380685j3922378j2871143j2275738j1298626r351660r492156
14246A96367243r791860r238125q721330q112344p657646p100255o802569o439078
14238A32504036n453163n193748n618546n214076m625172m562052l698172l509053
14230I4630054l787276l976279k971628l468427l089100l132555k390628k559677
14222F9254484k390551k232259k022891k069105k325705j688376k096695j804944
14214E2623958j288396r51862j655141j719880j371489j618038r83109r05080
14206D2130963n64378j827586j721600q53266r49833o95183k61762j102932j043426
$$ plain form
14197 33110997 32086095 31252714 30484862 30030656 29025503 28202800 27784030 27304473 26432357
14188 26432357 25779257 25396816 24665464 24451143 23525303 22881952 22184950 21873571 21595406
14179 21595406 21206013 20527972 20464044 19892148 19558254 19178862 18613950 18411900 17832928
14170 17832928 17685642 17174108 17123499 16598194 16450746 15972702 15607006 15284412 15376395 14936184
14160 14936184 14683234 14301477 14141670 14010492 13824654 13435284 13196752 12887167 12770842
14151 12770842 12561696 12284073 12284240 11604045 12011515 11544540 11213490 11189553 11266473 10697216
14141 10697216 10618092 10720192 10367962 10376582 10135406 10000375 9630414 9465170 9594168 9638546
14131 9638546 9368211 9180436 8770503 8974706 8755379 8548186 8529393 8131277 8353579 8227306
$$ packed form
14197C3110997j024902q33381p67852m54206j005153q22703m18770m79557q72116
14188B6432357o53100l82441p31352k14321r25840o43351o97002l11379k78165
14179B1595406l89393o78041o3928n71896l33894l79392n64912k02050n78972
14170A7832928j47286n11534n0609n25305j47448m78044l65696l22594R1983m40211
14160A4936184k52950l81757j59807j31178j85838l89370k38532l09585j16325
14151A2770842k09146k77623J67o80195M07470m66975l31050k3937P6920n69257
14141A0697216p9124J02100l52230Q620k41176j35031l69961j65244J28998M4378
14131I638546k70335j87775m09933K04203k19327k07193j8793l98116K22302j26273
$$ plain form
14121 8227306 7821787 8149005 7820864 7715442 7799583 7701549 7236581 7467064 7263493 7312038
14111 7312038 6999938 6904115 6886505 6931586 6592583 6595876 6342358 6620713 6441315 6805232
14101 6805232 6275150 6285724 6067227 6371872 5908483 5763561 5884509 6204208 5736483 5793963
14091 5793963 5323401 5866042 5686888 5483938 5405396 5031573 5199372 5282011 5235104 5194986
14081 5194986 5050178 4812859 4913711 5117436 4758275 4777113 4809178 4826939 4494254 4710032
14071 4710032 4355891 4465950 4380806 4546241 4383258 4202711 4298322 4471290 4294831 4420303
14061 4420303 4248247 4456829 4352786 4295008 4518982 4601722 4233356 4007207 4269401 3675532
14051 3675532 3840111 4026155 3742073 3919524 3962889 3650905 3681679 3390162 3440701 3460933
$$ packed form
14121H227306m05519L27218l28141j05422Q4141r8034m64968K30483k03571M8545
14111G312038l12100r5823j7610M5081l39003L293k53518K78355j79398L63917
14101F805232n30082J0574k18497L04645m63389j44922J20948L19699m67725N7480
14091E793963m70562N42641j79154k02950p8542l73823J67799Q2639m6907m0118
14081E194986j44808k37319J00852K03725l59161J8838L2065J7761l32685K15778
14071D710032l54141J10059q5144J65435j62983j80547R5611J72968j76459J25472
14061D420303j72056K08582j04043n7778K23974Q2740l68366k26149K62194n93869
14051C675532J64579J86044k84082J77451M3365l11984L0774k91517N0539K0232
$$ plain form
14041 3460933 3847919 3806927 3322591 3232355 3475450 3185162 3564141 3361889 3659038 3215778
14031 3215778 3484726 3314260 3140524 3320908 3227959 3083362 3064567 3051705 2981182 2989352
14021 2989352 2669402 2775881 2918737 3349306 2693010 3066643 2843468 2809016 2370762 2452153
14011 2452153 2582207 2375477 2662358 2474184 2240975 2309919 2432531 2494954 2438451 2412535
14001 2412535 2481372 2314341 1898037 2331607 2102709 2241333 2174245 2069692 2384928 2317652
13991 2317652 2424373 2734668 3876780 6076147 12190291 30246920 51750388 30851429
13983 30851429 14109201 7954502 5734835 4920518 4083049 3569205 3490768 3067865 3209396
13974 3209396 2905594 3028298 2397350 2716556 2542125 2681533 2208197 2399442 2398742 2358246
$$ packed form
14041C460933L86986m0992m84336r0236K43095k90288L78979k02252K97149m43260
14031C215778K68948j70466j73736J80384r2949j44597j8795j2862p0523Q170
14021B989352l19950J06479J42856M30569o56296L73633k23175l4452m38254Q1391
14011B452153J30054k06730K86881j88174k33209O8944J22612O2423n6503k5916
14001B412535O8837j67031m16304M33570k28898J38624o7088j04553L15236o7276
13991B317652J06721L10295J142112K199367O114144J8056629K1503468k0898959
13983C0851429A4109201o154699k219667q14317q37469n13844p8437m22903J41531
13974C209396l03802J22704o30948L19206j74431J39408m73336J91245p00m0496
$$ plain form
13964 2358246 2619987 2419962 2605473 2460892 2609920 1949818 2475013 2174802 2284158
13955 2284158 2215440 1838949 2495435 2136613 2051466 2115396 2041182 1689671 1656407 1961090
13945 1961090 1940485 2047217 1654867 1901807 2162623 1905685 1922838 1658227 2089557 1830909
13935 1830909 1743078 1772493 1787824 1778061 1990857 1675851 1617990 1648014 1620230 1825904 1588760
13924 1588760 1625296 1362531 1639854 1845463 1669307 1702516 1578601 1565554 1549228 1580772
13914 1580772 1595247 1213594 1713400 1605285 1688533 1751305 1446808 1834829 1549799 1519481
13904 1519481 1777344 1467705 1382771 1582967 1312379 1270419 1206225 1395628 1320497 1243790
13894 1243790 1348558 1437871 1523784 1220207 1328355 1616691 1273156 1463984 1375508 1651329
$$ packed form
13964B358246K61741k00025J85511j44581J49028o60102N25195l00211J09356
13955B284158o8718l76491O56486l58822q5147O3930p4214l51511l3264L04683
13945A961090k0605J06732l92350K46940K60816k56938J7153k64611M31330k58648
13935A830909q7831K9415J5331r763K12796l15006n7861L0024k7784K05674k37144
13924A588760L6536k62765K77323K05609j76156L3209j23915j3047j6326L1544
13914A580772J4475l81653M99806j08115Q3248O2772l04497L88021k85030l0318
13904A519481K57863l09639q4934K00196k70588m1960o4194J89403p5131p6707
13894A243790J04768Q9313Q5913l03577J08148K88336l43535J90828q8476K75821
$$ plain form
13884 1651329 1425004 1328817 1529114 1098263 1326952 1396569 1174649 1059843 1301206 1217347
13874 1217347 1402023 1208268 1446068 1068077 1400203 1279043 1474285 1013307 1275489
13865 1275489 1202482 1208637 1372099 1227481 1153952 1196846 1187649 1175375 1221673 1277212 1436401
13854 1436401 915948 1161517 1111956 1101224 1443227 1091349 1062088 971995 1129910 1354403
13844 1354403 977395 971502 807322 1006495 1242320 1289416 1293775 1072665 835930 701106
13834 701106 1252426 796226 837939 1159842 1216509 1112129 1012089 1057749 948643 1053907
13824 1053907 856520 422086 973222 793581 861757 969883 826720 829554 711631 1217713
13814 1217713 913815 915797 1010341 955523 1373439 1019196 866633 978919 853747 1042686
$$ packed form
13884A651329k26325r6187K00297m30851K28689O9617k21920j14806K41363q3859
13874A217347J84676j93755K37800l77991L32126j21160J95242m60978K62182
13865A275489p3007O155J63462j44618p3529M2894r197j2274M6298N5539J59189
13854A436401n20453K45569m9561j0732L42003l51878k9261r0093J57915K24493
13844A354403l77008n893j64180J99173K35825M7096M359k21110k36735j34824
13834G01106N51320m56200M1713L21903N6667j04380j00040M5660j09106J05264
13824A053907j97387D22086N51136j79641O8176J08126j43163K834j17923N06082
13814A217713l03898J982R4544n4818M17916l54243j52563J12286j25172J88939
$$ plain form
13804 1042686 913759 850296 596679 668544 937798 760406 1119346 676915 810336 658532
13794 658532 1033606 990396 991848 856534 685515 1203970 910606 458912 913404 836978
13784 836978 792860 745230 741288 1123624 668386 953479 676528 880770 686773 944455
13774 944455 826903 414475 712392 598042 846554 487239 669063 608376 670275 743050
13764 743050 438323 657889 767606 931781 849200 612349 795465 441247 827421 571328
13754 571328 766562 637602 702840 690622 679230 711102 443811 848933 517853 981142
13744 981142 547617 772300 435245 309501 806403 729819 651336 724349 471732 559695
13734 559695 875991 639220 807766 702349 401114 610824 598713 505756 635193 632655
$$ packed form
13804A042686j28927o3463k53617P1865K69254j77392L58940m42431J33421j51804
13794F58532L75074m3210J452j35314j71019N18455k93364m51694M54492p6426
13784H36978m4118m7630l942L82336m55238K85093k76951K04242j93997K57682
13774I44455j17552m12428K97917j14350K48512l59315J81824o0687O1899P2775
13764G43050l04727K19566J09717J64175q2581k36851J83116l54218L86174k56093
13754E71328J95234j28960O5238j2218j1392L1872k67291M05122l31080M63289
13744I81142m33525K24683l37055j25744M96902p6584p8483P3013k52617Q7963
13734E59695L16296k36771J68546j05417l01235K09710j2111r2957J29437k538
$$ plain form
13724 632655 587717 537212 683032 577553 663668 670268 765078 634254 701806 522269 754785
13713 754785 870308 502859 527334 221126 593471 533398 878482 299425 945556 783608
13703 783608 754220 663157 403309 516737 493203 568458 532680 687419 495911 782107
13693 782107 519107 679745 531894 310894 588301 592239 620101 508537 647574 87584
13682 922223 526868 322840 744315 683046 400506 532482 379837 713050 662525 483628
13672 483628 645849 531477 652261 797828 456772 529673 203827 505497 594908 43358
13661 570355 482053 693771 453119 349106 611281 327249 261102 567223 412881 336187
13651 336187 347057 312883 593327 621095 541363 451732 349016 615487 722700 450083
$$ packed form
13724F32655m4938n0505J45820j05479Q6115O600R4810j30824O7552j79537K32516
13713G54785J15523l67449K4475B21126L72345o0073L45084B99425O46131j61948
13703G83608k9388r1063k59848J13428k3534P5255l5778J54739j91508K86196
13693G82107k63000J60638j47851k21000K77407L938K7862j11564J39037H7584
13682I22223l95355k04028M21475o1269k82540J31976j52645L33213n0525j78897
13672D83628J62221j14372J20784J45567l41056P2901B03827L01670Q9411D3358
13661E70355q8302K11718k40652j04013K62175k84032o6147L06121j54342p6694
13651C36187J0870l4174K80444K7768p9732q9631j02716K66471J07213k72617
$$ plain form
13641 450083 249544 465411 279458 684726 322554 473360 648756 554593 350825 589169
13631 589169 759295 528830 698166 282732 449217 121446 353025 506068 599308 555791
13621 555791 158071 340229 545251 664199 231743 515546 709784 838966 123090 644310
13611 644310 589971 266303 273743 371609 165611 399640 140319 449065 292979 768780
13601 768780 606484 323105 211378 332776 333403 94093 327289 109369 363312 264874
13591 264874 483705 231750 170919 369744 310151 13730 85367 542749 436708 416987
13581 416987 -102160 539816 524108 391225 480468 530637 178955 80442 323084 82146
13570 485969 737046 574272 97220 455588 170169 270440 254072 643318 81264 510421
$$ packed form
13641D50083k00539K15867j85953M05268C22554J50806J75396r4163k03768K38344
13631E89169J70126k30465J69336B82732J66485A21446K31579J53043R3240m3517
13621E55791A58071J82158K05022J18948B31743K83803J94238J29182A23090N21220
13611F44310n4339B66303P440R7866A65611K34029A40319L08746j56086M75801
13601G68780j62296k83379j11727J21398O27I4093K33196A09369K53943r8438
13591B64874K18831B31750o0831J98825n9593A3730P1637M57382j06041j9721
13581D16987a02160E39816j5708j32883Q9243N0169A78955H0442K42642H2146
13570D85969K51077j62774I7220L58368A70169J00271j6368L89246H1264M29157
$$ plain form
13560 510421 -126595 432834 223662 303005 346279 292890 275152 463409 226739 527797
13550 527797 301245 -89489 320262 345213 227292 137019 196067 221012 244108 361980 363882
13539 363882 686823 374658 280479 364230 416007 349501 12431 167236 322130 148490
13528 460606 429979 350858 61887 249198 596182 435501 226089 115632 322382 -92120
13517 486778 646138 299330 290943 621923 149235 340903 184059 403678 180466 91834
13507 91834 292040 431694 125002 54843 324016 275685 499372 105217 355994 76246
13496 254965 -19429 369 233086 87188 425831 26909 143220 280142 122095 194960 357201
13485 357201 -10483 168679 50392 372498 391464 595377 441015 284261 258963 304896
$$ packed form
13560E10421a26595D32834k09172P9343M3274n3389j7738J88257B26739L01058
13550E27797k26552h9489C20262K4951j17921r0273N9048K4945K3096J17872J902
13539C63882L22941l12165r4179Q3751N1777o6506A2431J54805J54894A48490
13528D60606l0627p9121F1887J87311L46984j60681k09412j10457K06750i2120
13517D86778J59360B99330q387L30980A49235J91668j56844K19619A80466q8632
13507I1834K00206J39654A25002E4843K69173m8331K23687A05217K50777G6246
13496B54965a9429C69K32717H7188L38643B6909J16311J36922A22095P2865J62241
13485C57201a0483A68679E0392L22106J8966K03913j54362j56754k5298M5933
$$ plain form
13475 304896 447914 304076 429264 336128 592000 368198 379669 446444 168726 468555
13465 468555 446950 262277 126012 270926 281864 372232 587607 147282 315102 176042
13455 176042 297161 347976 24239 175595 239743 148820 495755 140256 -21547 228157
13444 487843 324892 64968 200503 62007 387538 398099 289355 382305 479791 219527
13433 55167 323723 274509 244359 493419 335036 77997 54586 193552 146645 206453 139667
13422 139667 50977 436658 259180 190659 544967 299832 68402 644106 460041 -714 324038
13410 523023 195229 300348 119581 179434 78224 290467 222928 -62822 227108 381916
13400 381916 231438 51525 39207 298863 501150 132734 461640 173307 387697 701826
$$ packed form
13475C04896J43018j43838J25188r3136K55872k23802J1471O6775A68726K99829
13465D68555k1605j84673A26012J44914J0938R0368K15375A47282J67820j39060
13455A76042J21119N0815B4239J51356O4148r0923L46935A40256b1547B28157
13444D87843j62951F4968J35535F2007L25531J0561j08744R2950R7486B19527
13433E5167K68556m9214l0150K49060j58383G7997k3411J38966m6907N9808o6786
13422A39667E0977L85681j77478o8521L54308k45135F8402N75704j84065g14C24038
13410E23023A95229J05119A19581N9853G8224K12243o7539f2822B27108J54808
13400C81916j50478E1525j2318K59656K02287A32734L28906A73307K14390L14129
$$ plain form
13390 701826 312457 -3122 -14611 317190 227691 638597 45487 242817 425638 103788
13379 153472 371875 199669 54532 438572 -93242 220079 387321 149078 103482 374115
13369 374115 558006 235461 153870 111502 103315 49610 74595 506529 263397 104162 601894
13358 601894 216259 297126 290627 357215 197784 299308 177989 412623 175437 241602
13348 241602 376964 421559 159952 318027 206483 357276 188048 634736 322149 466283
13338 466283 274170 306529 222495 356647 99530 -90373 469333 116918 532695 143416
13327 395733 222678 97386 -208730 -66204 238761 533052 392799 -82433 15355 231691
13317 231691 486364 237906 237685 415309 328495 192427 364640 358491 -84088 11642 -247971
$$ packed form
13390G01826C12457c122j1489C17190q9499M10906D5487J97330J82821A03788
13379A53472K18403j72206E4532L84040i3242B20079J67242A49078m5596K70633
13369C74115J83891B35461q1591m2368q187D9610K4985M31934k43132A04162M97732
13358F01894B16259Q0867o499O6588j59431J01524j21319K34634A75437O6165
13348B41602J35362M4595A59952J58075j11544J50793j69228M46688l12587J44134
13338D66283j92113L2359q4034J34152I9530i0373D69333A16918M15777A43416
13327C95733j73055I7386b08730f6204B38761K94291j40253h2433A5355K16336
13317B31691K54673B37906k21J77624q6814j36068J72213o149h4088A1642b47971
$$ plain form
13305 2908 119810 -31454 298870 116722 347708 189062 269153 211415 219956 -67989 2696
13293 433918 11101 235893 437841 13661 258832 136652 333130 113555 361201 -148513
13282 362710 304703 155064 139949 324189 264462 -43837 311544 184143 230418 -36568 266909
13270 370030 12249 141494 368421 150981 162437 93765 -1584 50558 189962 195864 421856
13259 421856 346487 412985 197744 219469 420246 -129148 220677 -24764 410332 8501 321545
13248 321545 -196574 134702 198120 320418 -171737 -80893 401153 212166 251600 162359
13238 162359 43173 394078 -105098 147481 343979 309104 -120693 340137 -259311 203747
13227 173197 -162253 218912 -28529 342387 325902 122268 87895 113711 -20583 -80519 68638
$$ packed form
13305B908J16902c1454B98870A16722K30986j58646Q0091n7738Q541f7989B696
13293D33918A1101K24792K01948A3661K45171j22180J96478A13555K47646a48513
13282C62710n8007j49639j5115J84240n9727d3837C11544j27401M6275c6568B66909
13270C70030A2249J29245K26927A50981J1456o8672a584E0558J39404N902K25992
13259D21856p5369O6498A97744K1725K00777a29148B20677b4764D10332H501L13044
13248C21545a96574A34702O3418J22298a71737h0893D01153j88987L9434q9241
13238A62359D3173L50905a05098A47481J96498l4875a20693C40137b59311B03747
13227A73197a62253B18912b8529C42387j6485A22268l4373K5816b0583n9936F8638
$$ plain form
13215 41860 -201963 67615 128394 37082 381284 60610 -18632 314483 294202 19525 122029
13204 122029 133038 186270 263946 68646 37670 394770 187521 -147911 267878 28995 60127
13193 60127 -6704 86928 94167 347456 283111 188869 -10868 98166 -138974 408547 -345123
13181 -120366 -254302 -255707 322524 30668 209012 248950 111453 332664 36366 206626
13171 206626 82539 139652 -59872 44813 7745 -61832 278180 -160723 88454 -6022 267644
13159 183247 287829 -34878 -96391 134776 70117 -144774 -92882 34161 -80526 105135 -253622
13147 -238943 -83695 256292 272375 217015 121695 -15959 -9395 47926 79289 -45253 228028
13135 213806 -7256 230538 268770 220350 403317 107476 193635 -125044 323695 396195 244694
$$ packed form
13215D1860b01963F7615O0779C7082L44202F0610a8632C14483k0281A9525J02504
13204A22029J1009N3232P7676F8646l0976L57100A87521a47911B67878B8995L1132
13193F0127f704H6928P239K53289o4345r4242a0868I8166a38974D08547c45123
13181a20366j33936j405C22524C0668J78344L9938A11453K21211C6366J70260
13171B06626H2539N7113e9872D4813G745f1832B78180a60723H8454f022B67644
13159A83247J04582c4878o1513A34776o4659a44774N1892C4161h0526A05135b53622
13147b38943h3695B56292J6083n5360r5320a5959O564D7926L1363d5253B28028
13135B13806g256B30538L8232m8420J82967A07476Q6159a25044C23695P2500j51501
$$ plain form
13124 244694 -25392 40548 274490 -98548 46264 236489 275148 376736 -18547 10842 77711
13113 77711 -12451 408821 40554 118208 -47373 14342 36755 89114 240716 163787 -73110
13101 226137 212441 356822 -266382 -80804 110390 43119 210377 26705 -70509 -120295 -14947
13089 -17601 131949 5832 -80174 32152 -17143 -158205 117187 127680 -117723 71394 -21646
13077 290285 -105822 -44001 98146 297150 171550 316493 -57880 333547 309838 -150635
13066 -257487 -93126 273100 93050 176155 155222 210974 -153893 57587 294347 85701 268874
13055 268874 -171913 -3229 208901 -26809 -75533 309165 152542 443782 147358 -201277
13044 173112 -155993 265266 269376 132853 -139062 317517 316462 -94356 33070 474896 132488
$$ packed form
13124B44694b5392D0548K33942i8548D6264J90225L8659J01588a8547A0842O6869
13113G7711a2451D08821D0554P7654d7373A4342K2413N2359J51602p6929g3110
13101B26137j3696J44381b66382h0804A10390D3119J67258B6705g0509m9786a4947
13089a7601A31949E832h0174C2152a7143j41062A17187J0493a17723G1394b1646
13077B90285a05822d4001I8146J99004j25600J44943e7880C33547k3709a50635
13066b57487i3126B73100I3050Q3105k0933N5752a53893E7587K36760H5701J83173
13055B68874a71913c229B08901b6809m8724C09165A52542K91240A47358b01277
13044A73112a55993B65266M110A32853a39062C17517j055i4356C3070M41826A32488
$$ plain form
13032 141060 -9983 -23924 163899 185932 -73475 267484 91868 241353 107629 -68252 221503
13020 311708 -117551 55372 159934 405995 171494 22716 -21746 194597 211999 96858
13009 126800 -39779 333325 25370 104580 -6372 348922 233016 -6658 190230 28470 31412
12998 31412 67331 139151 127476 -293116 58007 20423 -39656 253261 242091 311682 26744
12986 95419 -140542 49092 23062 41181 17230 284709 214917 -5759 252240 52978 23288
12974 336013 357840 50124 -216000 -216078 -141149 -34996 -165321 164124 -101051 -13843 182895
12962 259827 82789 -108065 95813 155180 25130 -211635 -159518 142966 -194490 237553
12951 28025 257400 163994 -253731 65916 278535 -341840 173089 39 198021 148214 -292195
$$ packed form
13032A41060i983j3941A63899K2033g3475B67484I1868J49485A07629f8252B21503
13020C11708a17551E5372J04562K46061A71494B2716b1746A94597J7402I6858
13009A26800c9779C33325B5370P9210f372C48922j15906f658A90230B8470K942
12998C1412L5919P1820j1675b93116E8007B0423c9656B53261j1170O9591B6744
12986I5419a40542D9092B3062J8119A7230K67479o9792e759B52240E2978B3288
12974C36013K1827E0124b16000p8P4929c4996j30325A64124a01051a3843A82895
12962B59827H2789a08065I5813N9367B5130b11635N2117A42966a94490B37553
12951B8025K29375r3406b53731F5916K12619c41840A73089C9J97982m9807b92195
$$ plain form
12939 77803 -300323 46510 -436761 141109 304251 78482 -159839 375213 -69643 -203832
12929 -203832 262989 96874 184298 104351 8199 191966 -187861 241708 -84583 -138953 273670
12917 -208192 542333 264820 237416 129966 280390 239420 -72980 79328 179245 16932 287941
12906 287941 73599 -268459 214090 211318 -5133 90913 463880 -6675 88002 120093 -56563
12894 42497 -111219 -164502 179452 208676 35936 -62223 80015 166538 174382 80232 135757
12883 135757 -84646 30830 -48584 152169 -179681 45612 -126539 137356 50816 7335 43810
12872 43810 135333 -141532 -115226 -32420 312841 -118946 129890 51904 7024 -175714 -184142
12861 -184142 289 -181075 -8081 287004 3938 117928 16525 -60582 -139333 -145370 239474 53912
$$ packed form
12939G7803c00323D6510d36761A41109J63142G8482a59839C75213f9643j34189
12929b03832B62989I6874Q7424p9947H199J83767a87861B41708h4583n4370B73670
12917b08192E42333B64820k7404j07450J50424m0970g2980G9328R9917A6932K71009
12906B87941G3599b68459B14090k772e133I0913L72967f675H8002L2091e6563
12894D2497a11219n3283A79452K9224C5936f2223H0015Q6523P844H0232N5525
12883A35757h4646C0830d8584A52169a79681D5612a26539A37356E0816G335L6475
12872D3810R1523a41532K6306c2420C12841a18946A29890E1904G024a75714q428
12861a84142B89a81075h081B87004C938J13990A6525f0582p8751o037B39474E3912
$$ plain form
12848 19188 38810 -150381 -125808 156069 275646 365761 -26097 243522 -79009 -391953 176203
12836 266362 -178500 38190 -37501 -150035 -215632 -7589 -126806 -44665 214675 161635 -475023
12824 -82810 55855 -182765 -68259 -347669 117328 -21926 -20344 -185012 49951 -59229 -336541
12813 -336541 111217 -367610 -28690 11289 92487 146312 582862 159573 60311 -69154 -232169
12802 -232169 138625 -39639 -33919 153409 96390 426454 120435 -158227 -196527 -280274 -217999
12791 -217999 26577 346376 39463 130374 -40109 -100986 -14465 214012 -348373 -189329 -52984
12779 173288 123770 71956 28236 -37850 127705 142199 -293169 135553 38635 -273977 38117
12767 66011 392055 -161497 48135 157142 -37192 -177920 91445 -150129 -80548 163192
$$ packed form
12848A9188J9622a50381K4573A56069J19577R0115b6097B43522g9009l12944A76203
12836B66362a78500C8190c7501j12534o5597g589j19217d4665B14675n3040d75023
12824h2810E5855a82765f8259k79410A17328b1926J582j64668D9951e9229k77312
12813c36541A11217c67610b8690A1289Q1198N3825M36550A59573F0311f9154j63015
12802b32169A38625c9639N720A53409n7019L30064A20435a58227l8300q3747O2275
12791b17999B6577L19799C9463R0911d0109o0877a4465B14012c48373J59044e2984
12779A73288m9518n1814B8236c7850A27705J4494b93169A35553C8635b73977C8117
12767F6011L26044a61497D8135J09007c7192j40728I1445a50129O9581A63192
$$ plain form
12756 -6671 -263940 223583 91797 424604 303040 34103 -45574 95666 -277367 -33824 56867
12744 11365 -286453 -142385 29366 309553 225501 119609 -15222 21061 -44653 134045 74074
12733 74074 350074 215705 683559 652608 120525 223704 -41289 19135 195606 81444
12722 29171 121899 311180 363244 63580 29522 32821 155733 -133599 267295 133957 84398
12711 84398 -4131 218602 210029 214724 226578 311217 222495 526382 248677 143078 292410
12700 292410 -31728 185540 7253 -234753 326826 225120 -168410 238230 354492 -494121
12689 -163248 -191561 -148009 68097 75885 180036 88160 -181909 -12456 228291 30952 310244
12678 310244 -80200 82670 -54400 -20674 163225 66228 161378 232351 86765 251700 88739
$$ packed form
12756f671k57269B23583I1797L32807j21564C4103d5574I5666b77367c3824E6867
12744A1365b86453a42385B9366K80187q4052j05892a5222B1061d4653A34045n9971
12733G4074K76000j34369M67854l0951A20525J03179d1289A9135J76471H1444
12722B9171R2728J89281N2064F3580B9522L299J22912a33599B67295j33338m9559
12711H4398d131B18602q573M695J1854Q4639q8722L03887B48677j05599J49332
12700B92410c1728A85540G253b34753C26826j01706a68410B38230J16262d94121
12689a63248k8313M3552F8097P788J04151H8160a81909a2456B28291C0952K79292
12678C10244h0200H2670e4400b0674A63225F6228R5150P0973H6765J64935H8739
$$ plain form
12666 161247 144812 -181999 147184 206223 198175 14010 258078 119409 -13185 384545 448589
12655 448589 149917 230354 87217 -153790 203708 380046 16690 23227 149307 -57562 104508
12643 -30815 96485 112253 299956 245957 77862 -82957 323319 26516 342260 15032 205548
12632 205548 299164 107655 249991 233911 200356 170292 161145 239760 249813 418981 303993
12621 303993 254636 20559 -248007 132483 217578 176388 -66233 5585 36469 -72974 -39959
12610 -39959 -58668 -173656 19400 234343 55810 386998 88685 208805 105111 282165
12600 282165 -45207 249588 -33569 383058 -104110 217399 252020 241903 298315 364607 125236
12588 -61070 197556 80206 63117 202755 77968 128675 146753 55584 122055 73198 -372114
$$ packed form
12666A61247j6435a81999A47184N9039q048A4010K44068A19409a3185C84545O4044
12655D48589A49917Q0437H7217a53790B03708J76338A6690O537J26080e7562A04508
12643c0815I6485J5768J87703n3999G7862h2957C23319B6516L15744A5032J90516
12632B05548R3616A07655J42336j6080l3555l0064r147P8615J0053J69168j14988
12621C03993m9357B0559b48007A32483Q5095m1190f6233E585L0884g2974L3015
12610c9959j8709j14988A9400K14943E5810L31188H8685J20120j03694J77054
12600B82165d5207B49588c3569C83058a04110B17399L4621j0117N6412O6292A25236
12588f1070A97556H0206j7089J39638G7968N0707J8078E5584O6471m8857c72114
$$ plain form
12576 145568 207444 -8769 -29403 58785 45432 117674 308923 69764 -205923 126174 143263
12565 143263 -69398 -217668 -187837 55308 -36729 309662 169396 -103739 447326 63996
12554 307812 285947 308082 -2618 -66462 -60986 -109419 -42467 329626 96904 -272892 -98658
12542 198512 -399716 415593 296106 154261 222838 -57223 10496 276442 295495 97981
12531 -35154 50859 361075 397356 224236 -305964 323221 165768 78027 239197 290047
12521 290047 5174 158843 278006 -42672 134437 23730 -41761 -203493 -53432 -406155 24588
12509 -117768 -197425 196897 32210 175081 246728 558096 -127660 52070 294798 250199
12499 250199 204667 121383 65300 129915 -13546 -14452 -268886 50829 297329 -180453 4619
$$ packed form
12576A45568O1876h769k0634E8785j3353P2242J91249F9764b05923A26174J7089
12565A43263f9398j48270K9831E5308c6729C09662j40266a03739D47326F3996
12554C07812k1865K2135b618o3844N476m8433d2467C29626I6904b72892i8658
12542A98512c99716D15593j19487j41845O8577e7223A0496K65946J9053I7981
12531c5154E0859L10216L6281j73120c05964C23221j57453G8027J61170N0850
12521B90047E174J53669J19163d2672A34437B3730d1761j61732e3432l52723B4588
12509a17768p9657A96897C2210J42871P1647L11368a27660E2070K42728m4599
12499B50199m5532q3284n6083O4615a3546r06k54434E0829K46500a80453D619
$$ plain form
12487 132287 53254 54442 -351921 62293 75804 25012 -16977 7018 54958 56851 284761 -13096
12474 102705 58320 157517 -253861 -93075 -61094 -339222 118478 191694 62262 -4691 245373
12462 -16101 65871 217309 214205 -59552 308298 130642 -247372 -397662 -108611 187966
12451 -103561 -97490 -166062 46464 11801 -165662 78839 257516 14019 -52471 101435 -52602
12439 -107460 -241570 -66989 124156 -50049 201857 -25536 -32410 253101 -81502 132963 -355431
12427 -96616 181388 -36195 44661 18850 -113655 394795 101612 288147 -91579 143262
12416 18519 -88932 83142 228696 222517 -165654 -166802 -213087 6387 -627923 95628 -299529
12404 -93356 -288532 -121372 -141413 99101 -397940 -311885 -102380 178551 217288 -40729 43352
$$ packed form
12487A32287E3254J188c51921F2293J3511B5012a6977G018M7940J893K27910a3096
12474A02705m4385R9197b53861i3075L1981k78128A18478P3216F2262d691B45373
12462a6101F5871J51438l104e9552C08298A30642b47372j50290a08611A87966
12451a03561O071o8572D6464A1801a65662G8839J78677A4019e2471A01435e2602
12439a07460j34110f6989A24156e0049B01857b5536o874B53101h1502A32963c55431
12427i6616A81388c6195D4661A8850a13655C94795A01612J86535i1579A43262
12416A8519h8932H3142J45554o179a65654j148m6285F387f27923I5628b99529
12404i3356j95176a21372k0041I9101c97940Q6055a02380A78551L8737d0729D3352
$$ plain form
12392 -67722 10157 -352809 211517 -132773 267820 -32483 160213 460058 -271700 353164
12381 -155140 -436732 148420 -11500 232676 190277 -138669 -3223 97000 29192 -124681 125518
12369 -149958 16627 121716 -297330 110956 230236 331150 188121 -13068 -119506 58876
12358 -205960 289133 203353 -41308 342218 203261 337754 61215 235547 -480528 207621
12347 200786 63609 228648 127060 -277577 -14236 -156871 96848 -74148 108917 -79772
12336 2701 113317 313985 425197 -173897 127001 -321437 -66628 84931 65320 265704
12326 265704 815 299626 -40678 415393 -156749 229934 198281 -156111 -38280 -184790 -272266
12315 -272266 324262 82999 -344700 -55129 203233 179353 41524 -170300 -122476 289235
$$ packed form
12392f7722A0157c52809B11517a32773B67820c2483A60213K99845b71700C53164
12381a55140k81592A48420a1500B32676m2399a38669c223I7000B9192a24681A25518
12369a49958A6627J05089b97330A10956J19280J00914j43029a3068j06438E8876
12358b05960B89133q5780d1308C42218j38957J34493F1215J74332d80528B07621
12347B00786F3609J65039j01588b77577a4236j42635I6848g4148A08917g9772
12336B701J10616K00668J11212a73897A27001c21437f6628H4931j9611K00384
12326B65704H15K98811d0678D15393a56749B29934l1653a56111c8280j46510q7476
12315b72266C24262H2999c44700e5129B03233k3880D1524a70300M7824B89235
$$ plain form
12304 47718 132055 108307 105164 -54488 30281 -112587 214991 -4770 -62533 -192299 -27250
12292 -71105 -23143 126394 -97246 66577 -16430 194179 167782 128983 24982 245651 387505
12281 387505 388029 431386 151496 -65484 123468 595835 35117 557432 324487 202166 343375
12270 343375 337098 210480 116965 -28882 142394 85768 355893 -77152 203960 357111 295447
12259 295447 50739 9140 -88603 68318 -173138 164627 115553 100124 165116 220453 -123177
12247 584398 -90018 412255 4623 102815 133102 42700 -21359 59359 204839 -19250 73627
12235 310670 -153351 273137 -114749 -25478 21755 376603 -98299 68885 346214 118107
12224 262444 193418 425662 135753 283050 313685 333667 571715 358838 62925 277612
$$ packed form
12304D7718Q4337k3748l143e4488C0281a12587B14991d770n7763j29766b7250
12292g1105b3143A26394i7246F6577a6430A94179k6397l8799B4982K20669J41854
12281C87505N24M3357A51496f5484A23468M72367C5117N22315k32945j22321J41209
12270C43375o277j26618r3515b8882A42394n6626K70125g7152B03960J53151o1664
12259B95447E0739I140h8603F8318a73138A64627m9074j5429O4992N5337a23177
12247E84398i0018D12255D623R8192L0287D2700b1359E9359J45480a9250G3627
12235C10670a53351B73137a14749b5478B1755L54848i8299F8885K77329A18107
12224B62444o9026K32244A35753J47297L0635J9982K38048k12877F2925K14687
$$ plain form
12214 277612 123533 253878 189319 450083 198562 15372 190055 219037 449107 337958
12204 337958 41335 118660 42633 94753 408065 378670 164843 107352 395832 109838 460521
12193 460521 -83793 402371 356016 319727 464709 465655 509441 -162 301590 469215 141161
12181 105178 89643 226792 291485 231553 432325 326962 124048 23792 209776 279786
12171 279786 316796 60243 344710 168630 124814 -10197 168684 341937 -42070 650480
12160 47761 -32284 321897 -38311 75451 405777 18481 -87207 231768 11511 397168 155486
12148 256769 46719 141938 42634 449548 102620 178527 -218403 370173 184872 -150450
12137 -4928 -8552 -52655 -7914 -64647 156138 -78305 -48972 -101745 -15400 402859 -25003 -128533
$$ packed form
12214B77612A23533J30345o4559K60764A98562A5372J74683K8982K30070j11149
12204C37958D1335P7325D2633N2120L13312k9395A64843n7491K88480A09838L50683
12193D60521h3793D02371m6355l6289J44982R46M3786a62C01590J67625A41161
12181A05178j5535J37149O4693n9932K00772j05363A24048B3792J85984P0010
12171B79786L7010F0243K84467A68630m3816a0197A68684J73253d2070F50480
12160D7761c2284C21897c8311G5451L30326A8481h7207B31768A1511L85657A55486
12148B56769D6719R5219D2634M06914A02620P5907b18403C70173A84872a50450
12137d928l624m4103g914n6733A56138g8305K9333n2773a5400D02859b5003j03530
$$ plain form
12125 -128533 295244 -44086 131115 103396 356544 -18347 344600 -52976 323717 117296
12114 -3331 -49754 133263 396562 18057 -159107 50991 -84286 93216 -40695 25970 -33630
12102 531489 -132159 241688 108822 129685 101186 -70887 -56341 -156616 -24473 5370 70584
12091 70584 14340 288708 -73460 -117271 -167147 226576 84771 149311 -123685 -64486 13106
12079 19479 419665 146956 108355 -182887 178550 564632 1522087 2783067 2751553 1377693
12069 1377693 28031 299904 23891 129182 317459 262779 -286112 137425 113289 108545
12059 108545 303399 -126356 278587 168860 18504 261861 324397 -108984 -28576 98521
12048 213 -108538 -159672 -168089 234765 -434345 -52379 164284 -125243 -62430 -304912 -54469
$$ packed form
12125a28533B95244d4086A31115k7719K53148a8347C44600e2976C23717A17296
12114c331m6423A33263K63299A8057a59107E0991h4286I3216d0695B5970c3630
12102E31489a32159B41688A08822K0863k8499g0887J4546j00275b4473E370O5214
12091G0584A4340K74368g3460m3811m9876B26576H4771O4540a23685N9199A3106
12079A9479M00186A46956l8601a82887A78550L86082R57455J260980l1514j373860
12069A377693B8031K71873B3891J05291J88277n4680b86112A37425k4136m744
12059A08545J94854a26356B78587j09727A8504K43357O2536a08984b8576I8521
12048B13a08538n1134q417B34765d34345e2379A64284a25243f2430k42482e4469
$$ plain form
12036 -46824 -160161 163493 -278401 -41453 -93752 -405762 311341 134520 -47115 42071
12025 -189887 -2923 -306606 -228671 5881 -127115 -283539 106553 -17803 85898 221328 184580
12014 184580 -9715 -196149 53514 24789 68791 119658 156546 180305 50780 121144 189171
12003 189171 286156 198132 148007 116811 417700 -12606 73212 -121294 244458 81198 265212
11992 265212 214020 -189461 -182453 -331784 -137854 31987 262050 -80842 313483 -45215 -39351
11981 -39351 255634 -94910 14680 -93131 449542 81303 134733 2168 -126671 87999 23006
11969 43816 -488578 20422 -10876 -93529 31444 89088 -132841 104882 -129915 -231876 85386
11957 -220978 -48627 -176213 173703 -35437 -224256 -107719 172548 226832 330998 -28487
$$ packed form
12036d6824j13337A63493b78401d1453n2299l12010C11341A34520d7115D2071
12025a89887b923l03683P7935E881a27115j56424A06553a7803H5898J35430l6748
12014A84580i715j86434E3514B4789M4002N0867L6888K3759E0780P0364O8027
12003A89171R6985q8024n0125l1196L00889a2606G3212a21294B44458H1198J84014
11992B65212n1192a89461P008j49331a37854C1987K30063h0842C13483d5215N864
11981c9351B55634i4910A4680i3131D49542H1303N3430B168a26671H7999B3006
11969D3816d88578B0422a0876q2653C1444N7644a32841A04882a29915j01961H5386
11957b20978d8627j27586A73703c5437j88819a07719A72548N4284J04166b8487
$$ plain form
11946 -93102 199986 -251851 24106 -37433 74322 124756 -58558 120925 -104417 92653 -50165
11934 25708 -34157 -124598 45410 -104291 -248888 -147585 -59301 108530 367399 -65914 -78193
11923 -78193 -57253 -232636 137779 197230 -5309 75103 43039 -41897 240556 170819 -231033
11911 -152842 -99436 108020 -89608 40143 -105610 99440 29151 31848 -176700 150263 -77828
11899 322164 203135 -323866 -69522 97801 17549 299754 111388 -20178 8233 106315 -199547
11887 41769 31403 81566 64610 -156708 -35788 33438 154613 83771 46514 -11807 137089
11875 -161992 -336490 23101 -68485 110930 -176594 -67585 -72406 -156215 153995 98588 -62297
11863 17954 70315 58091 -279691 -162270 -128535 230707 63196 105751 -42144 -62730 -201042
$$ packed form
11946i3102A99986b51851B4106c7433G4322N0434e8558A20925a04417I2653e0165
11934B5708c4157r0441D5410a04291j44597J01303e9301A08530K58869f5914j2279
11923g8193K0940j75383A37779N9451e309G5103l2064d1897B40556o9737b31033
11911a52842N3406A08020h9608D0143a05610I9440B9151K697a76700A50263g7828
11899C22164j19029c23866f9522I7801A7549K82205A11388b0178H233R8082a99547
11887D1769j0366N0163j6956a56708c5788C3438J21175p0842l7257a1807A37089
11875a61992j74498B3101f8485A10930a76594f7585m821q3809A53995n5407f2297
11863A7954N2361j2224b79691J17421L3735B30707F3196M2555d2144k0586j38312
$$ plain form
11852 -201042 -15811 -16823 29910 222645 65576 88932 99255 -188236 -160099 188645 370310
11841 370310 -61733 -68465 99738 -200704 473120 -170720 74011 121530 201843 -209957 -31931
11829 48826 136315 -278709 -78568 -353081 -189004 -109743 6603 -130161 -69908 -73497 -41960
11818 -41960 18750 10936 19238 83535 -239175 454056 96424 197111 -158803 66740 -177662
11806 39027 249923 -88199 -89596 -148056 259490 251134 -248679 -88409 81451 -129698 19882
11794 133538 -223609 -113981 -91071 -176947 165577 97749 -29288 -153863 29689 -221788
11783 301161 -34268 67906 -129252 1330 104270 142614 -220270 -113932 99488 31730 147319
11772 147319 198478 44882 198171 -94548 -32529 385835 72278 342967 -7313 -97933 78829
$$ packed form
11852b01042a5811j012B9910J92735F5576K3356J0323a88236K8137A88645J81665
11841C70310f1733o732I9738b00704D73120a70720G4011M7519Q0313b09957c1931
11829D8826Q7489b78709g8568k74513J64077P9261F603a30161O0253l589L1537
11818d1960A8750p814Q302O4297b39175D54056I6424J00687a58803F6740a77662
11806C9027K10896h8199j397n8460B59490q356b48679h8409H1451a29698A9882
11794A33538b23609J09628K2910q5876A65577o7828b9288j24575B9689b21788
11783C01161c4268F7906a29252A330J02940L8344b20270J06338I9488C1730J15589
11772A47319N1159D4882J53289i4548c2529C85835G2278K70689g313r0620G8829
$$ plain form
11760 202659 -150001 105519 123094 -52958 -189728 237661 -405271 394975 -198196 385430
11749 -272033 141751 11500 235188 250495 142816 -154967 -80713 290487 273348 202950
11739 202950 277422 117045 299767 35902 -26500 -184316 140363 36544 232916 -155326
11728 -24029 -86119 167309 149151 -57293 280964 187428 -182684 86973 71516 -297660 -90681
11716 -44427 297775 32070 89626 282281 90184 2121 209597 266479 -153985 314121 400134
11705 400134 -213992 -28947 136913 -34835 215272 102454 271484 190075 38847 390680
11695 390680 327762 154610 237460 -1598 299123 -44466 388907 -21855 200816 -63300 122507
11683 325493 -52373 159978 325406 227351 98342 -37977 86347 291533 -65487 214745 344844
$$ packed form
11760B02659a50001A05519J7575e2958j36770B37661d05271C94975a98196C85430
11749b72033A41751A1500K23688J5307j07679a54967P4254B90487j7139p0398
11739B02950P4472A17045J82722C5902b6500j57816A40363C6544J96372a55326
11728b4029o2090A67309j8158e7293B80964r3536a82684H6973j5457b97660i0681
11716d4427B97775C2070N7556J92655I0184B121K07476N6882a53985C14121Q6013
11705D00134b13992b8947A36913c4835B15272A02454J69030q1409C8847L51833
11695C90680o2918A54610Q2850a598B99123d4466C88907b1855B00816f3300A22507
11683C25493e2373A59978J65428r8055I8342c7977H6347K05186f5487B14745J30099
$$ plain form
11672 344844 453992 236459 -272125 -172075 386159 162321 133535 129780 -155687 161204
11661 -26389 -413 107002 142881 -49873 198103 360782 333466 274274 -176165 109289 213721
11650 213721 104099 231857 236996 155728 -47209 -123424 208657 216418 -223427 -214951 146885
11638 -27150 28742 -12990 67904 -79587 -100616 -283641 -127211 -103744 -4526 72424 32497
11626 134854 193908 -63770 78800 105663 26127 64907 327861 -53428 -203716 198785 73389
11614 -140276 -107680 161174 4485 7572 206991 28633 224853 -115371 -81724 275259 -31933
11602 117115 271249 157860 329815 182637 -11750 -33284 202181 162296 72313 -2121 12134
11590 182036 -167904 100096 179277 -131740 -428053 282373 292869 355479 12510 -98307
$$ packed form
11672C44844J09148k17533b72125J00050C86159A62321k8786l755a55687A61204
11661b6389d13A07002L5879d9873A98103J62679k7316n9192a76165A09289J04432
11650B13721A04099J27758N139q1268d7209p6215B08657P761b23427Q476A46885
11638b7150B8742a2990F7904g9587k1029j83025a27211K3467d526G2424C2497
11626A34854N9054f3770G8800K6863B6127L8780K62954e3428j50288A98785G3389
11614a40276L2596A61174D485L087J99419B8633J96220a15371L3647B75259c1933
11602A17115J54134j13389J71955j47178a1750k1534B02181l9885G2313b121A2134
11590A82036a67904A00096P9181a31740k96313B82373J0496O2610A2510i8307
$$ plain form
11579 174681 599226 242534 -220906 234458 105888 35667 156736 530416 -55669 410473
11568 107147 424975 361143 -55290 170459 59801 212093 509636 -225327 244784 131221
11558 131221 27193 199643 -45940 170382 258267 -64623 143725 37135 467230 13453 -172801
11546 -119107 10173 439615 106813 235844 318313 -47009 -86142 -7843 196753 104184 71900
11535 71900 86745 431783 174730 -29235 166702 226016 -23413 389093 403442 370055 210889
11524 210889 230055 290752 133396 229883 63731 175804 219749 170117 45196 -80969 452675
11512 153870 242490 382732 398055 289926 68785 203690 23658 297975 -65943 344854
11501 96573 232252 62446 76208 449794 171637 -84407 158192 435790 183466 33910
$$ packed form
11579A74681M24545B42534b20906B34458A05888C5667J21069L73680e5669D10473
11568A07147L17828o3832e5290A70459E9801J52292K97543b25327B44784j13563
11558A31221B7193J72450d5940A70382Q7885f4623A43725C7135M30095A3453a72801
11546a19107A0173M29442A06813J29031Q2469d7009l9133g843A96753r2569l2284
11535G1900J4845L45038A74730b9235A66702N9314b3413C89093J4349l3387j59166
11524B10889J9166O0697A33396R6487F3731J12073M3945m9632D5196h0969D52675
11512A53870Q8620J40242J5323j08129F8785J34905B3658K74317f5943C44854
11501I6573J35679F2446J3762L73586A71637h4407A58192K77598A83466C3910
$$ plain form
11490 41151 271259 227414 508028 -8347 233569 285331 104360 442468 471909 319701 491716
11479 491716 21350 267656 49136 449645 480368 265786 806791 38529 350545 279243
11469 279243 258873 293586 311986 125865 -124264 296553 246353 257725 607917 420175
11459 420175 153655 1492 441941 371471 268564 647610 224569 87219 69492 321462
11449 321462 14508 49711 -25012 92612 216250 190306 331365 291714 -45033 323758 278463
11438 278463 -108667 258380 24086 187997 83804 192591 116555 -97149 356492 -13520
11427 91578 120799 284127 -24738 201504 -39756 -259035 156816 96522 149491 123795 65893
11416 65893 -84164 -371338 -305886 -224004 51948 -75098 -163898 116654 132906 -151818 100247
$$ packed form
11490D1151K30108m3845K80614h347B33569N1762A04360L38108K9441j52208J72015
11479D91716B1350K46306D9136M00509L0723k14582N41005C8529L12016p1302
11469B79243k0370L4713J8400A25865a24264B96553n0200J1372L50192j87742
11459D20175A53655A492M40449p0470j02907L79046B24569H7219j7727K51970
11449C21462A4508L5203b5012I2612J23638k5944J41059l9651d5033C23758m5295
11438B78463a08667B58380B4086J63911H3804J08787p6036i7149C56492a3520
11427I1578K9221J63328b4738B01504c9756k19279A56816o0294N2969k5696n7902
11416F5893h4164k87174O5452Q1882E1948g5098q8800A16654J6252a51818A00247
$$ plain form
11404 -223922 107413 192738 187356 -244440 217215 145980 509268 26731 161938 339621
11394 339621 -48073 -70026 187476 -95958 14073 -22752 -277697 352352 -363337 282228
11383 223807 -126924 -194963 75381 -85143 85664 -55260 56987 -75918 269652 -43529 -128988
11372 -128988 -17187 135139 -17519 211575 5811 -85208 -128555 25422 210549 117022 253732
11361 253732 -105034 28655 -275776 -93927 104831 300703 -46226 28678 18191 -234402
11350 23252 -100640 -240685 -228194 -115038 159009 -356838 162644 27069 -107726 206329
11339 -33445 -131968 266476 -350442 16806 60326 155543 -90929 57879 -56914 251736 -48309
11327 30626 109865 34831 -211953 74808 125618 88870 53484 119644 -11863 462505 259055
$$ packed form
11404b23922A07413Q5325n382b44440B17215p1235L63288B6731J35207J77683
11394C39621d8073k1953A87476i5958A4073b2752k54945C52352c63337B82228
11383B23807a26924o8039G5381h5143H5664e5260E6987g5918B69652d3529q5459
11372a28988a7187A35139a7519B11575E811h5208m3347B5422J85127r3527J36710
11361B53732a05034B8655b75776i3927A04831J95872d6226B8678j0487b34402
11350B3252a00640j40045J2491J13156A59009c56838A62644B7069a07726B06329
11339c3445r8523B66476c50442A6806M3520R5217i0929E7879e6914B51736d8309
11327C0626P9239C4831b11953G4808N0810l6748l5386O6160a1863D62505k03450
$$ plain form
11316 259055 -19374 361797 -118493 102145 80665 -21257 -80841 -176847 -300747 29 118399
11305 118399 -28544 370754 139088 115115 185156 285307 -166454 -86513 -248042 48727
11294 265053 -69953 -217984 -107355 -182973 -65289 -128917 18460 -79570 147687 84024 36471
11282 60850 361948 119472 -121484 109028 1233 -98681 -21306 -100592 -32876 -201952 14994
11270 -155324 33917 -30402 -334239 -234972 -18833 360805 -122523 91404 -137770 -34628 195827
11258 94425 1139 -193209 58568 -164233 -223159 -231811 -153450 -101042 16461 95503 -141192
11246 509969 -41038 144316 -55164 267783 69862 -197929 -337606 135829 -68219 -66132 -72209
11235 -72209 331848 -91947 -181231 23099 -269817 97317 -529497 182030 -265456 82139 150527
$$ packed form
11316B59055a9374C61797a18493A02145k1480b1257n9584r6006j23900B9J18370
11305A18399b8544C70754A39088k3973P0041J00151a66454P9941j61529D8727
11294B65053f9953j48031a07355p5618f5289o3628A8460g9570A47687o3663C6471
11282F0850L01098A19472a21484A09028A233i8681b1306p9286c2876j69076A4994
11270a55324C3917c0402l03837R9267a8833C60805a22523I1404a37770c4628A95827
11258I4425A139a93209E8568a64233n8926q652P8361N2408A6461P9042a41192
11246E09969d1038A44316e5164B67783F9862a97929j39677A35829f8219K087o077
11235g2209C31848i1947q9284B3099b69817I7317e29497A82030b65456H2139O8388
$$ plain form
11224 150527 148406 30799 -93391 123417 84896 -119402 52117 -11911 -114206 -61454 95322
11212 -54505 90228 -309961 -356489 -104626 92745 -36202 199952 193017 67505 313875 227109
11201 227109 -73075 26719 -199963 64198 115357 -50048 37026 390333 -111512 -107493 -199840
11190 -199840 224434 5350 151460 -289752 -49078 219702 -189764 -187389 449181 -6429 -56355
11179 -56355 -106851 -10183 6080 38809 -18882 -195954 71292 287175 20878 2331 -173350
11167 87027 -533883 95836 -126742 -59152 77240 -215226 95750 73449 166973 97084 151490
11156 151490 121510 -54652 77036 -416473 -315809 35931 46731 -118069 247528 -22418 -1805
11144 18631 66340 219282 153043 94911 429106 -24783 48834 202830 83175 403334 -5605
$$ packed form
11224A50527k121C0799i3391A23417l8521a19402E2117a1911j02295N2752I5322
11212e4505I0228c09961m6528a04626I2745c6202A99952o935F7505K46370q6766
11201B27109g3075B6719a99963F4198N1159e0048C7026L53307a11512M019r2347
11190a99840B24434E350J46110b89752d9078B19702a89764K375D49181f429m9926
11179e6355n0496a0183F080L2729a8882j77072G1292K15883B0878B331a73350
11167H7027e33883I5836a26742e9152G7240b15226I5750k2301R3524o9889N4406
11156A51490k9980e4652G7036d16473J00664C5931J0800a18069B47528b2418a805
11144A8631M7709J52942o6239n8132L34195b4783D8834J53996H3175L20159e605
$$ plain form
11132 284762 193530 67716 217135 186746 61219 -296365 66885 32653 344309 515536 194447
11120 -24473 58458 -108822 -102074 26607 -7064 -16867 231411 -140578 -94637 104962 -185572
11108 493465 41606 108325 198849 -15956 445310 123295 375264 102250 334005 184480
11098 184480 315803 45058 228599 -21386 196573 208876 222807 15789 109581 195082 203713
11087 203713 343411 -7556 23904 363201 490824 227426 734483 355257 632568 508425
11077 508425 282075 521678 74183 338008 409397 615061 201980 512472 239889 367635
11067 367635 465743 329552 466328 524909 414244 725543 739873 1085512 516633 790885
11057 790885 371756 1021594 772820 793376 903956 709642 915019 1150531 1211113 903648
$$ packed form
11132B84762r1232F7716J49419l0389F1219b96365F6885C2653L11656J71227A94447
11120b4473E8458a08822O748B6607g064r803B31411a40578M5941A04962a85572
11108D93465D1606O6719R0524a5956D45310A23295K51969A02250K31755j49525
11098A84480J31323D5058J83541b1386A96573J2303J3931A5789R3792Q5501Q631
11087B03713J39698g556B3904L39297J27623B27426N07057C55257K77311j24143
11077E08425k26350K39603G4183K63825P1389K05664B01980L10492B39889J27746
11067C67635R8108j36191J36776N8581j10665L11299J4330L45639E16633K74252
11057G90885C71756O49838k48774K0556J10580j94314K05377K35512O0582l07465
$$ plain form
11047 903648 1005428 994949 1254894 1139157 1414050 1210091 1129839 1052442 1179240 1024341
11037 1024341 1044631 878016 1376757 863439 997447 1213960 1276026 601583 1195640 883501
11027 883501 1055351 974421 1081925 1035321 1242787 909922 1043576 1085080 797644 808753
11017 808753 836331 697013 647539 1028960 756278 940572 707241 743053 575509 929997
11007 929997 1103029 836610 895877 1102041 1119375 846725 985411 1039212 873236 929694
10997 929694 869755 1164354 1101269 808832 1096856 1072074 955895 974859 1018954 958183 1326460
10986 1326460 1083557 1386180 1030549 1501147 1219205 1290381 1781624 1469654 1798592 2032551
10976 2032551 2215138 2269390 2494864 2928507 3291303 3336688 3535915 3734946 4007190 4390879
$$ packed form
11047I03648J01780j0479K59945j15737K74893k03959q0252p7397J26798j54899
11037A024341K0290j66615M98741n13318J34008K16513O2066F01583N94057l12139
11027H83501J71850q0930J07504m6604K07466l32865J33654M1504k87436J1109
11017H08753K7578j39318m9474L81421k72682J84294k33331L5812j67544L54488
11007I29997J73032k66419N9267K06164J7334k72650J38686N3801j65976N6458
10997I29694n9939K94599o3085k92437K88024k4782j16179J8964M4095o0771L68277
10986A326460k42903L02623l55631M70598k81942P1176M91243l11970L28938K33959
10976B032551J82587N4252K25474M33643L62796M5385J99227J99031K72244L83689
$$ plain form
10966 4390879 4130214 3866613 3208513 2836468 2557171 3014194 2569282 2862741 2589060
10957 2589060 2808997 2652828 2757995 2739529 2799957 2234571 2240301 2011025 1596689 1345649
10947 1345649 1098892 864946 643049 898332 579189 451961 369964 467897 346065 424345
10937 424345 508017 254503 -49498 -34195 332642 559578 8894 540392 410292 198809
10926 295669 83411 350774 101133 572237 283718 610433 363166 -81594 3676 -37411
10915 174942 13295 93856 360979 463244 23283 -173581 248872 -116466 506379 -323636
10904 53816 96346 16041 155880 212023 89108 -220216 105627 336672 302341 -296754 154236
10892 -29052 -126485 -54279 -330895 24917 -233837 348364 -50895 40169 310177 542294 -83270
$$ packed form
10966D390879k60665k63601o58100l72045k79297M57023m44912K93459k73681
10957B589060K19937j56169J05167j8466O0428n65386N730k29276m14336k51040
10947A345649k46757k33946k21897K55283l19143j27228q1997R7933j21832P8280
10937D24345Q3672k53514d9498J5303C32642K26936H894N31498j30100A98809
10926B95669H3411K67363A01133M71104B83718L26715k47267h1594C676c7411
10915A74942A3295Q0561K67123J02265B3283a73581B48872a16466E06379c23636
10904E3816M2530A6041J39839N6143H9108b20216A05627K31045l4331b96754A54236
10892b9052r7433e4279k76616B4917b33837C48364e0895D0169K70008K32117h3270
$$ plain form
10880 40041 138850 12442 -104391 -83288 225237 38496 -115340 6041 -79522 -63972 -46879
10869 -46879 -80843 56400 73828 -5980 254601 -177675 57635 56483 136602 65416 -133733
10857 -7410 392097 -9324 1761 -45679 154489 7439 172468 -93485 215451 -121988 -35637
10845 313871 27567 17908 22283 -82503 -342861 56223 -214745 16461 15870 -359097 64202 221219
10833 221219 42870 -19571 -231982 -16802 -44546 -70107 153459 -95031 -70724 138985 -83882
10821 -33016 285903 -34123 110308 103701 -292724 35890 -82751 -33713 -229833 -181476 -132618
10810 -132618 -86506 -147370 -120138 -61343 172280 -157158 40641 -39773 121259 78722 140535
10799 140535 94766 -177139 45572 161319 140490 -57614 -112047 -127378 51376 -99080 30269
$$ packed form
10880D0041R8809A2442a04391K1103B25237C8496a15340F041g9522J5550J7093
10869d6879l3964E6400J7428e980B54601a77675E7635j152Q0119F5416a33733
10857g410C92097i324A761d5679A54489G439J65029i3485B15451a21988c5637
10845C13871B7567r659M375h2503k60358E6223b14745A6461n91c59097F4202J57017
10833B21219D2870a9571k12411a6802k7744k5561A53459i5031K4307A38985h3882
10821c3016B85903c4123A10308o607b92724C5890h2751c3713j96120M8357M8858
10810a32618M6112o0864K7232N8795A72280a57158D0641c9773A21259m2537O1813
10799A40535m5769a77139D5572J15747k0829e7614n4433j5331E1376i9080C0269
$$ plain form
10787 120784 12517 -71609 341635 39207 -182151 -318780 63335 240079 -245797 -242837 -186059
10776 -186059 -124985 39434 -810889 -244277 -111504 208869 -117719 -316757 27770 22557
10766 22557 130142 184186 -5934 292883 -2821 111730 -24944 -34466 22098 190818 -222272
10754 -31887 -164123 73592 -133111 -29441 40591 219503 -45217 -214611 133370 362364
10744 362364 -45427 -147988 43623 -175342 -275733 -76350 -36962 -222803 -120392 -43955
10733 33140 -199551 -44544 -88309 -9471 -244338 -175307 -85032 318764 -145882 -152670 -278424
10722 -278424 91134 223369 -196097 4830 -100397 68971 100044 73918 -83353 271567 154805
10711 154805 9537 -384280 -202031 -204379 -236647 177388 -248524 -276653 24328 45187 58002
$$ packed form
10787A20784A2517g1609C41635C9207a82151j36629F3335J76744b45797K960N6778
10776a86059O1074C9434h10889b44277a11504B08869a17719j99038B7770n213
10766B2557J07585N4044e934B92883b821A11730b4944r522B2098J68720b22272
10754c1887j32236G3592a33111b9441D0591J78912d5217j69394A33370K28994
10744C62364d5427j02561D3623a75342j00391g6350c6962j85841J02411d3955
10733C3140a99551d4544m3765i471k34867O9031h5032C18764a45882o788j25754
10722b78424I1134J32235a96097D830a00397F8971L1073k6126h3353B71567j16762
10711A54805I537c84280J82249k348l2268A77388b48524k8129B4328K0859J2815
$$ plain form
10700 58002 17831 146184 -9039 82273 117057 17337 -599 -337265 -232647 63492 28780 322238
10688 322238 -86872 40304 -135393 -26351 172195 -62684 -260349 -74518 55773 -20521 -302808
10677 -302808 -20260 -1747 40244 55134 -166396 -86222 -387214 128197 199202 -275580 -134496
10665 141305 -326707 -127969 128447 -22330 1713 44742 26082 -119739 -58947 33879 -45623
10653 -103308 -97770 -321796 71212 -17596 -488734 -340267 -156202 -52696 -57251 -64432 120247
10641 -130204 -179225 -198918 -36187 56117 80750 -125733 42033 31493 -85734 -117460 -199727
10630 -199727 9839 -230981 -164512 47720 -320491 11988 86828 131677 344249 -166909 258621
10618 -134328 56807 -210676 2454 17476 77866 -23212 240992 -252787 -41450 82134 -177297
$$ packed form
10700E8002A7831J28353i039H2273L4784A7337e99l36666J04618F3492B8780K93458
10688C22238h6872D0304a35393b6351A72195f2684j97665g4518E5773b0521k82287
10677c02808b0260a747D0244J4890a66396Q0174l00992A28197P1005b75580a34496
10665A41305c26707a27969A28447b2330A713M3029j8660a19739e8947C3879d5623
10653a03308N538k24026G1212a7596m71138J48467a56202e2696m555p181A20247
10641a30204m9021j9693c6187E6117K4633a25733D2033j0540h5734l1726q2267
10630a99727I839b30981O6469D7720c20491A1988P4840M4849K12572a66909B58621
10618a34328E6807b10676B454J5022O0390b3212B40992b52787d1450H2134a77297
$$ plain form
10606 -75326 162546 2371 -51519 116002 164011 221361 70774 -104091 257207 -128884 -179539
10595 -179539 137389 87867 -10633 -91415 -143716 -110600 -22849 -118228 -126438 -110766 -300097
10584 -300097 -345202 -218471 -175171 10935 -295510 -7519 2755 69149 89465 -295616 -106285
10572 -85466 -113451 -128870 -160372 -74100 182194 379907 -427772 -63766 107002 -250923 50619
10560 994 -228492 65128 227823 -290818 4083 171509 -143557 -332101 159446 174889 -9613
10548 -378440 -217462 -60881 88475 -32743 245398 102852 -120153 -88582 383122 38800
10537 148967 -236091 -136646 183996 -165038 -125644 -115247 -45064 71401 -25667 174922 -125984
10525 86710 -75351 -2198 223892 64606 178441 -33444 133684 54384 -52981 92184 81478
$$ packed form
10606g5326A62546B371e1519A16002M8009N7350G0774a04091B57207a28884n0655
10595a79539A37389m9522a0633q0782n2301L3116b2849r5379q210J5672j89331
10584c00097m5105J26731M3300A0935b95510g519B755O6394K0316b95616a06285
10572h5466k7985j5419l1502g4100A82194J97713d27772f3766A07002b50923E0619
10560I94b28492F5128J62695b90818D083J67426a43557j88544A59446J5443i613
10548c78440J60978f0881H8475c2743B45398A02852a20153L1571C83122C8800
10537A48967b36091R9445A83996a65038L9394J0397d5064G1401b5667A74922a25984
10525H6710g5351b198B23892F4606J13835c3444A33684E4384e2981I2184j0706
$$ plain form
10514 81478 91438 209522 -52698 151789 -111136 -57912 -17716 45543 -44182 -275165 -40417
10502 -73033 88044 -88253 -117970 66059 222216 400766 -145150 -335393 9709 -208561 15276
10490 133388 105199 -356938 37098 -337971 -6179 137440 -273350 159250 35839 -200009
10479 487795 95548 181199 393852 719640 641764 852874 468072 382611 207208 249160
10469 249160 228380 -4667 27797 218797 266894 3037 202609 -189059 -98042 53222 182388
10458 182388 95851 202431 -120375 -119588 -211707 -196719 726 66921 -250319 12008 142995
10447 142995 -10893 23288 125164 194305 -82534 159404 -125206 141584 25966 -177962
10436 -126292 406046 76444 -161393 171974 -158871 -197326 63647 83949 200202 82230
$$ packed form
10514H1478R960J18084e2698A51789a11136N3224a7716D5543d4182k30983d0417
10502g3033H8044h8253k9717F6059J56157J78550a45150j90243I709b08561A5276
10490A33388k8189c56938C7098c37971f179A37440b73350A59250C5839b00009
10479D87795I5548Q5651K12653L25788p7876K11110l84802q5461j75403M1952
10469B49160k0780d667B7797J91000M8097C037J99572a89059R1017E3222J29166
10458A82388q6537J06580a20375P87r2119J4988G26O6195b50319A2008J30987
10447A42995a0893B3288J01876O9141h2534A59404a25206A41584B5966a77962
10436a26292D06046G6444a61393A71974a58871l8455F3647K0302J16253H2230
$$ plain form
10425 -367356 -381932 164316 -20809 32915 18746 112477 -366281 -74256 330339 254895 203868
10414 203868 -217444 1740 47841 558918 -261061 148624 -120657 -105382 -172844 76589 -92735
10402 190420 159300 -5088 -215331 96964 228675 -100423 30031 -254223 -24137 133194 273239
10391 273239 -57189 147868 142957 110116 161843 426382 235275 203812 242703 -102705 129700
10379 506847 21791 210099 152540 417229 311765 534269 634843 266853 216326 271170
10369 271170 573403 568371 259211 459899 644446 503586 655028 445820 312672 277458
10359 277458 315214 296247 435639 355666 -194176 498281 284415 692942 747074 586967
10349 586967 804515 991681 855626 333613 664142 108938 727024 485867 580046 488164
$$ packed form
10425c67356j4576A64316b0809C2915j4169R3731c66281g4256C30339p5444n1027
10414B03868b17444A740M6101N11077b61061A48624a20657J5275o7462G6589i2735
10402A90420l1120e088k10243I6964J31711a00423C0031b54223b4137A33194J40045
10391B73239e7189A47868m911l2841N1727K64539j91107l1463L8891a02705A29700
10379E06847B1791J88308n7559K64689j05464K22504J00574B66853n0527N4844
10369B71170L02233n032B59211K00688J84547j40860J51442k09208j33148l5214
10359B77458L7756j8967J39392p9973a94176D98281k13866M08527N4132j60107
10349E86967K17548J87166j36055C33613L30529A08938O18086k41157R4179r1882
$$ plain form
10339 488164 669489 170540 115550 -277105 496048 269264 67224 160008 181264 103546
10329 103546 -45862 32626 218384 -144843 273292 85973 49517 -36038 376537 89688 126381
10318 126381 16137 202466 268054 36340 379341 91000 166598 374199 39689 -30805 33863
10306 -150738 -157699 -298627 -14629 366717 -274780 -15134 92231 114197 81398 96189 256740
10295 256740 62584 70646 -249920 -33559 -267088 -196635 -6768 91263 -87607 -81752 59723 50951
10283 50951 -260393 -259350 -253386 -210301 120480 65205 265913 -209420 -98101 92960 58569
10272 58569 160914 -249344 40558 73950 -218825 -106120 -260634 -71121 -270290 29200
10261 76111 220670 61509 -78813 750 -51749 298505 371644 490552 791716 597304 590934
$$ packed form
10339D88164J81325A70540n4990b77105D96048k26784F7224R2784K1256p7718
10329A03546d5862C2626J85758a44843B73292H5973l6456c6038C76537H9688L6693
10318A26381A6137J86329O5588C6340L43001I1000P5598K07601C9689c0805C3863
10306a50738o961j40928a4629C66717b74780a5134I2231K1966l2799J4791J60551
10295B56740F2584Q062b49920c3559k33529P0453f768I1263h7607N855E9723q772
10283E0951b60393J043N964M3085A20480n5275K00708b09420i8101I2960l4391
10272E8569J02345b49344D0558L3392b18825a06120j54514g1121j99169B9200
10261G6111J44559F1509g8813G50e1749B98505P3139J18908L01164j94412o370
$$ plain form
10250 590934 318004 153947 153306 32974 11305 123851 207869 3022 75179 145234 -29863
10238 128226 -215026 -119940 323278 -1231 -225081 222019 153253 -239216 -80031 215057
10227 -44557 -98133 -111710 129089 416668 -60372 -24204 87442 -136363 26360 247488 -67302
10215 53766 78400 217581 -306015 -98670 186453 124609 -52035 -226659 6801 -373039 -17178
10203 -157234 -126359 50428 192765 60537 -182939 -44527 -25847 -218943 248943 45779 11671
10191 -79088 -260921 64403 -58078 -279819 31997 -47944 64072 376082 -27551 -220458 -213572
10180 -213572 -230876 362907 -182446 -137694 219069 -94565 -117925 78495 -257618 -230845 -106333
10168 -122697 174102 144792 -110524 -188159 -82475 -26985 -504828 -5576 -143419 -94429 85526
$$ packed form
10250E90934k72930A53947o41C2974A1305J12546Q4018C022P2157P0055b9863
10238A28226b15026R5086C23278a231k23850B22019o8766b39216h0031B15057
10227d4557n3576j3577A29089K87579f0372b4204H7442a36363B6360K21128f7302
10215E3766K4634J39181c06015i8670A86453o1844e2035j74624F801c73039a7178
10203a57234L0875E0428J42337F0537a82939d4527J8680j93096B48943D5779A1671
10191g9088j81833F4403e8078k21741C1997d7944F4072L12010b7551j92907O886
10180b13572j7304C62907a82446M4752B19069i4565k3360G8495b57618K6773a06333
10168a22697A74102k9310a10524p7635h2475b6985m77843e576j37843M8990H5526
$$ plain form
10156 -393603 -56474 7157 155430 -113044 -149037 38625 -209945 -108749 -9406 -69519 -54151
10145 -54151 -50343 -299588 -12140 -1998 -253079 19841 -143696 -21086 150320 -48724 -252988
10134 -252988 132296 -288333 271954 -130804 -202598 -480216 -111432 -170945 29020 -61400
10123 -176201 -65489 -365035 149045 -43950 101020 201091 -331408 -167389 472 -139824
10112 -120526 -205833 57493 -158207 -213977 10353 -215772 139313 -144963 -56358 -196453
10102 -196453 374078 -154298 -233282 -106363 -153625 180531 -36468 33020 20446 -147195
10091 -155893 -290778 287659 85335 28906 -197853 -157322 -293288 47599 -28427 -339781
10081 -339781 -163753 32036 96370 -97836 -81303 8618 -93850 -373 22525 210862 241591 -73791
$$ packed form
10156c93603e6474G157J48273a13044l5993C8625b09945J01196i406o0113J5368
10145e4151L808k49245a2140a998k51081A9841a43696b1086A50320d8724k04264
10134b52988A32296b88333B71954a30804p1794k77618a11432n9513B9020f1400
10123a76201f5489k99546A49045d3950A01020J00071c31408J64019D72a39824
10112a20526q5307E7493a58207n5770A0353b15772A39313a44963e6358j40095
10102a96453C74078a54298p8984a06363m7262A80531c6468C3020j2574a47195
10091a55893j34885B87659H5335B8906a97853M0531j35966D7599b8427l11354
10081c39781a63753C2036O4334i7836J6533H618i3850c73B2525J88337L0729g3791
$$ plain form
10068 1556 -216644 -321753 -41402 -178082 39118 41892 -224209 -164020 59338 151135 -107355
10056 233842 -26224 249392 -326668 -274795 -389923 -66408 265248 86323 64117 -72319 27065
10044 78976 -204298 119410 189935 -203776 -236613 -206236 -174069 -152267 114357 -131983 152679
10032 -167175 -333427 -73538 294755 -203685 250869 -23109 -223599 -275399 -63813 -253090
10022 -253090 -203720 -213354 47079 -143267 32860 -206446 58890 -51311 -85964 179611 -119141
10010 -29226 171019 -151714 -116739 -13158 -246132 51382 -138485 136256 -234291 -137202
10000 -137202 -67420 -60827 -497559 -133989 137490 -65092 125595 1419 -112760 -265142 186552
9988 -160840 -413609 54062 -260426 -189373 -541271 211407 103746 -237640 -143532 -228976
$$ packed form
10068A556b16644j05109d1402j36680C9118K774b24209O0189E9338R1797a07355
10056B33842b6224B49392c26668N1873j15128f6408B65248H6323k2206g2319B7065
10044G8976b04298A19410P0525b03776l2837L0377L2167K1802A14357a31983A52679
10032a67175j66252g3538B94755b03685B50869b3109k00490n1800f3813j89277
10022b53090M9370r634D7079a43267C2860b06446E8890e1311l4653A79611a19141
10010b9226A71019a51714L4975a3158k32974E1382a38485A36256b34291R7089
10000a37202f7420O593m36732a33989A37490f5092A25595A419a12760j52382A86552
9988a60840k52769E4062b60426P1053l51898B11407A03746b37640R4108q5444
$$ plain form
9978 -228976 -100101 92305 -278532 44142 -35382 -150542 -105997 -118689 -3663 248938 -217612
9966 79576 -142092 17144 212914 -312106 199534 -114673 -186577 84 -36262 -110796 247255
9954 -114653 -477575 275292 -116414 81463 -67229 26271 -106495 -221674 33049 197727
9944 197727 -113122 -280238 -100115 58979 -227537 -178024 -238414 -12649 314732 -91541 332469
9932 -106359 -221157 -12419 17530 -26913 -499507 51860 -26238 370010 -550118 -91446 20995
9920 -8206 52391 114801 126576 157440 144173 -122981 -283092 -5876 114288 118847 -175875 93997
9907 135048 164352 -180835 -26994 -111588 -274074 73010 -65579 43104 -7623 -229323 -148101
9896 -148101 -74111 90263 -183443 70937 -445697 150481 -194335 -110087 -8022 132584 -34191
$$ packed form
9978b28976a00101I2305b78532D4142c5382j15160M4545j2692c663B48938b17612
9966G9576a42092A7144J95770c12106A99534a14673p1904H4c6262p4534B47255
9954a14653l62922B75292a16414H1463f7229B6271a06495j15179C3049J64678
9944A97727a13122j67116a00115E8979b27537M9513o0390a2649C14732i1541C32469
9932a06359j14798a2419A7530b6913m72594E1860b6238C70010e50118i1446B0995
9920h206E2391O2410J1775L0864j3267a22981j60111e876A14288M559a75875I3997
9907A35048K9304a80835b6994q4594j62486G3010f5579D3104g623k21700Q1222
9896a48101P3990I0263a83443G0937d45697A50481a94335Q4248h022A32584c4191
$$ plain form
9884 21339 -172801 159249 100705 -206194 -55982 250469 51680 -116160 -156993 -184729 -84012
9872 -55849 52573 -145226 -176970 -49754 118690 -300310 -167728 -246282 -64506 -228622 -179549
9861 -179549 -145517 -122040 -149819 -264312 -118043 139112 -134678 -239740 142174 -433217
9850 49733 -66462 -427141 -113919 90794 -250829 -168029 -275397 135089 21218 -29155 -170123
9839 -170123 30526 7225 -55000 -311173 35391 -27572 90954 -283828 -57736 -71261 -170202
9828 -170202 53414 -135684 1122 31443 -69658 -344423 73010 -173668 138047 55312 -287961
9816 101938 -325646 308272 178910 -202829 125072 14163 -465083 133012 -194333 80545
9805 -59227 -78933 -178427 11135 -170287 210035 -230347 -205044 202181 26147 -423049 -341751
$$ packed form
9884B1339a72801A59249n8544b06194e5982B50469E1680a16160m0833k7736h4012
9872e5849E2573a45226l1744d9754A18690c00310J32582p8554f4506j64116M9073
9861a79549L4032K3477k7779j14493a18043A39112a34678j05062A42174d33217
9850D9733f6462l60679a13919I0794b50829Q2800j07368A35089B1218b9155j40968
9839a70123C0526G225e5000k56173C5391b7572I0954b83828e7736j3525r8941
9828a70202E3414a35684A122L0321f9658k74765G3010a73668A38047E5312b87961
9816A01938c25646C08272j29362b02829A25072A4163d65083A33012a94333H0545
9805e9227j9706r9494A1135a70287B10035b30347K5303B02181B6147d23049Q1298
$$ plain form
9794 -341751 47372 -5781 -80385 -108993 -181147 -151874 -45712 -480810 -48446 41341 64778 124121
9782 124121 63621 -264013 206341 18073 -170355 -168875 -234523 74689 -508227 -237053 -84756
9770 54039 -353695 -66267 -183006 -69024 116583 -42036 140754 -213055 -206604 -370247 21162
9758 420308 -143619 -227931 -156504 173288 -392930 31471 -189443 65903 -254296 -177827 -101978
9747 -101978 -131322 81866 11536 -169249 -185015 -38726 -130028 34814 -374247 -172507 244428
9735 -146100 -1555 -304344 269813 -393898 3122 127445 -20832 -396127 -109770 62749 165889
9724 165889 26641 137929 -149222 -34701 -235531 -74694 152919 -87725 -142440 -210729 -204097
9713 -204097 -66120 -55852 -51800 30187 23827 -136969 168840 -107360 -34043 -228275 23077
$$ packed form
9794c41751D7372e781p4604k8608p2154K9273d5712m35098d8446D1341K3437N9343
9782A24121o0500b64013B06341A8073a70355J480o5648G4689e08227b37053h4756
9770E4039c53695f6267j16739f9024A16583d2036A40754b13055O451j63643B1162
9758D20308a43619q4312P1427A73288c92930C1471a89443F5903b54296P6469P5849
9747a01978k9344H1866A1536a69249j5766c8726r1302C4814c74247a72507B44428
9735a46100a555l02789B69813c93898C122J24323b0832l75295a09770F2749J03140
9724A65889B6641J11288a49222c4701k00830g4694A52919h7725n4715o8289O632
9713b04097f6120J0268M052C0187o360a36969A68840a07360c4043j94232B3077
$$ plain form
9701 -82399 72654 139343 19555 101270 328254 -20479 38363 -199449 45834 -214591 55739
9689 -417133 62157 -348290 136770 61318 -86428 85784 -286093 -224907 150099 -58948 50814
9677 -344440 -121208 -259320 592 -23049 -139980 -109390 -118571 101675 -73223 -186420 -84660
9665 -88308 205174 -151121 135675 93879 -145664 -143702 81008 -116969 -196 -135839 21383
9653 -230492 -326174 -468110 -25273 -2264 -337142 -29993 -273798 -319445 165666 80785 24104
9641 -50165 67710 180952 53274 78738 8798 102376 181382 -165963 -16364 -224023 -113498
9630 -113498 -264613 418 -8851 -352741 -149782 -336486 -143040 -63097 96381 -66867 25367
9618 -75113 -308385 15240 -1580 -55159 583637 100510 -15270 -119232 -349102 -133993 -299449
$$ packed form
9701h2399G2654O6689A9555Q1715K26984b0479C8363a99449D5834b14591E5739
9689d17133F2157c48290A36770F1318h6428H5784b86093O1186A50099e8948E0814
9677c44440a21208j38112E92b3049j16931L0590r181A01675g3223j13197h4660
9665h8308B05174a51121A35675m1796a45664J962H1008a16969a96j35643B1383
9653b30492r5682j41936b5273b264l34878b9993k43805m5647A65666H0785B4104
9641e0165F7710J13242E3274K5464H798R3578P9006a65963a6364k07659J10525
9630a13498j51115D18h851l43890a49782j86704a43040f3097I6381f6867B5367
9618g5113k33272A5240a580n3579E83637A00510a5270j03962k29870a33993j65456
$$ plain form
9607 -299449 129124 -169628 -101499 -240041 111689 -228673 -210672 34458 -32986 55405 -245037
9595 106968 -234493 86547 -101128 93783 -15979 -263245 337911 383530 -125536 -346882
9585 -346882 -25967 88308 -78326 7265 -167580 -248492 -13169 63295 176953 -108568 -73332
9574 -73332 31005 -152900 -331674 -95607 -31956 -88991 -5619 -72319 -260392 -44893 -10249
9562 191508 111797 -138481 -330947 170169 -363693 162746 -84036 62210 -117758 -107801 17062
9550 -165998 -56401 -62377 337295 -116356 -216481 65194 13836 -55497 -329954 170974 62138
9538 183136 -233195 34791 -45461 -372026 -75029 65746 -446484 151519 391710 -78809 21912
9526 14350 47552 -202368 -148361 -17596 -50394 -49400 171585 -148871 -171038 -204934 210197
$$ packed form
9607b99449A29124a69628O8129j38542A11689b28673J8001C4458c2986E5405b45037
9595A06968b34493H6547a01128I3783a5979k47266C37911M5619a25536k21346
9585c46882b5967H8308g8326G265a67580q0912a3169F3295J13658a08568L5236
9574g3332C1005a52900j78774i5607c1956n7035e619o6700j88073d4893a0249
9562A91508p9711a38481j92466A70169c63693A62746h4036F2210a17758R957A7062
9550a65998e6401n976C37295a16356j00125F5194A3836e5497k74457A70974F2138
9538A83136b33195C4791d5461l26565g5029F5746d46484A51519K40191g8809B1912
9526A4350L3202b02368N4007a7596l2798R94A71585a48871k2167l3896B10197
$$ plain form
9514 -287122 -164947 111644 -17822 23029 -143299 256721 216298 -270628 -201595 -75789 -62438
9503 -62438 -155293 -1774 188442 148981 234343 -89687 -170056 240175 23406 -200027 118879
9491 -122975 159027 -115271 -133554 277730 -234983 198073 193817 -186792 167870 29657
9480 -578978 -172219 116682 389070 -19946 154023 367513 97688 3625 -146399 -254846
9470 -254846 -158878 -79846 250017 -218784 193535 -21223 -289166 82385 -264949 -332465 13154
9458 -62303 102298 130216 -121105 -234736 -241269 302368 -90642 -254572 -266534 -58328 11959
9446 146947 126486 -392876 32872 -4322 186134 -140887 -95541 -143131 -49653 35628 -279672
9434 30986 -123230 -176131 94804 -63958 -151606 -262523 -1928 -284562 -151536 -10781 -191186
$$ packed form
9514b87122J22175A11644a7822B3029a43299B56721m0423b70628O9033g5789J3351
9503f2438r2855a774A88442l9461Q5362h9687q0369B40175B3406b00027A18879
9491a22975A59027a15271j8283B77730b34983A98073m256a86792A67870B9657
9480e78978a72219A16682K72388a9946A54023K13490I7688C625a46399j08447
9470b54846R5968P9032B50017b18784A93535b1223k67943H2385b64949o7516A3154
9458f2303A02298K7918a21105j13631o533C02368i0642j63930j1962e8328A1959
9446A46947k0461c92876C2872d322A86134a40887M5346m7590d9653C5628b79672
9434C0986a23230n2901I4804f3958q7648j10917a928k82634J33026a0781j80405
$$ plain form
9423 -191186 -100697 -134867 -61433 13995 -536577 -223173 -206294 -52365 -103469 245655 610
9411 -448145 -136364 -345028 -152308 -36502 -168101 -66680 -179057 -138884 -147194 113617 318179
9400 318179 48044 -353164 -374727 -145092 -78150 -314115 137230 221862 -204847 216138
9389 -234697 97315 63429 -34988 191296 -200178 -107861 241475 -152161 -248701 -305562 -368568
9378 -368568 28007 88262 -88377 -87022 295594 -98385 -48196 -188972 188991 -82520 -116706
9367 -116706 -169836 51280 -259728 116007 332594 -159940 81189 -98304 -177428 -49695 -21759
9355 22120 19937 -106501 106692 -163297 -134130 -93244 15385 -96617 -10363 113572 -172213
9343 -329362 -185794 88890 -63700 -180646 -168197 -43950 48967 -172560 -108045 -153317 -23359
$$ packed form
9423a91186R0489l4170f1433A3995e36577b23173J6879e2365n1104B45655F10
9411d48145a36364k08664a52308c6502j31599f6680j12377M0173q310A13617K04562
9400C18179D8044c53164k1563a45092O6942k35965A37230Q4632b04847B16138
9389b34697I7315l3886c4988A91296b00178R2317B41475a52161r6540n6861o3006
9378c68568B8007O0255h8377J355B95594i8385d8196j40776A88991h2520l4186
9367a16706n3130E1280b59728A16007K16587a59940H1189i8304p9124d9695b1759
9355B2120k183a06501A06692a63297K9167M0886A5385i6617a0363A13572a72213
9343c29362J43568H8890f3700j16946J2449d3950D8967a72560O4515m5272b3359
$$ plain form
9331 -234692 -265268 -73316 82484 104769 274314 -29081 -155098 -443837 -35968 271740 -131103
9319 151018 -470778 -64097 -124925 -43658 -100694 -267694 211689 -119643 -79692 -1061 -56616
9308 -56616 -224583 -334120 -18298 -46058 157974 -272905 -274191 -181713 -266773 -156087 -124614
9297 -124614 134620 -48232 -79716 -324669 98889 -13084 -81252 -61511 97354 -8577 -48171
9286 -48171 -109613 69769 -336702 -86115 -163793 -109614 71727 -133321 -102118 -238408 -172926
9275 -172926 -241904 40840 -222064 141935 7302 -239177 -23925 -165853 44847 -125903 -140074
9264 -140074 -273019 -36200 50482 230478 27476 -60772 -425616 143372 -369744 121683
9253 94607 38097 -235173 -8926 117531 79419 -375320 -78427 -177249 60431 -198379 -142537
$$ packed form
9331b34692l0576g3316H2484K2285J69545b9081j26017k88739c5968B71740a31103
9319A51018d70778f4097o0828d3658n7036j67000B11689a19643L9951a061n5555
9308e6616j67967j09537a8298k7760A57974b72905j286R2478q5060J10686L1473
9297a24614A34620d8232l1484k44953I8889a3084o8168J9741I7354h577l9594
9286d8171o1442F9769c36702h6115p7678N4179G1727a33321L1203j36290O5482
9275a72926o8978D0840b22064A41935G302b39177b3925j41928D4847a25903j4171
9264a40074j32945c6200E0482J79996B7476f0772l64844A43372c69744A21683
9253I4607C8097b35173h926A17531l8112c75320g8427r8822F0431a98379N5842
$$ plain form
9242 -142537 -427626 199423 110500 -24995 -138333 -125057 -242176 18296 -247392 -160768 -446742
9231 -446742 -222326 282256 -245091 31123 -197398 293858 -53579 -127173 75923 -161247
9220 86112 -322468 -26841 212409 2211 -78507 273025 156229 38642 179203 -264876 232681
9208 -351019 89997 35768 -159860 11071 227973 12211 -212631 -313551 20527 87663 98510
9197 98510 -5588 101215 -80696 -91773 -165618 -111494 -152598 -270238 197775 -323692 -35375
9185 2292 -128911 -120308 -314189 364653 -161190 -303749 -164631 -62681 58828 125596 -177386
9173 154352 106070 43469 -163333 -432998 -238707 362817 15612 207205 406146 -79470
9162 -30358 -36656 -181980 -258123 30735 28697 -88529 -336994 184581 124219 -40393 -113685 -208630
$$ packed form
9242a42537k85089A99423q8923b4995j13338J3276j17119A8296b47392Q6624k85974
9231d46742b22326B82256b45091C1123a97398B93858e3579p3594G5923a61247
9220H6112c22468b6841B12409B211g8507B73025j16796C8642J40561b64876B32681
9208c51019H9997C5768a59860A1071K16902A2211b12631j00920B0527O7136J0847
9197I8510e588A01215h0696j1077p3845N4124m1104j17640A97775c23692c5375
9185B292a28911Q603j93881C64653a61190j42559J39118f2681E8828O6768a77386
9173A54352m8282D3469a63333k69665J94291C62817A5612J91593J98941g9470
9162c0358o298j45324p6143C0735k038h8529k48465A84581o0362d0393p3292r4945
$$ plain form
9150 -208630 53882 -72349 -233472 19814 -450857 292071 -70169 -106157 303042 139672 -203076
9138 -123276 124613 66105 -151762 -56087 -199348 135157 -58897 -121110 -268012 42368 94013
9127 94013 -22221 -201711 -4022 -145677 -128097 -220677 -141275 -135805 99191 -129888 183749
9115 33526 -148383 -113800 -305186 -145407 -191707 -510549 354671 -152096 -35394 33581 -47761
9103 282792 -291401 2652 112671 274739 52692 15388 -125695 -170718 -2567 -343014 17811
9091 -353155 16326 -11903 127719 -167339 116983 -127330 -261551 -110808 113058 -23111
9080 -173538 100136 -57386 -138626 77183 -173247 119000 -207326 -339346 -329119 -48768 -59295
9069 -59295 -297670 -208788 -96635 -163470 -146794 -252463 -136397 234030 42942 -92915 -176892
$$ packed form
9150b08630E3882g2349j61123A9814d50857B92071g0169l5988C03042A39672b03076
9138a23276A24613n8508a51762e6087j43261A35157e8897o2213j46902D2368N1645
9127I4013b2221j79490d022j41655J7580r2580P9402N470I9191a29888A83749
9115C3526a48383L4583j91386a45407m6300l18842C54671a52096c5394C3581d7761
9103B82792b91401B652J10019J62068E2692A5388a25695m5023b567l40447A7811
9091c53155A6326a1903A27719a67339A16983a27330j34221a10808A13058b3111
9080a73538A00136e7386q1240G7183a73247A19000b07326j32020J0227d8768j0527
9069e9295k38375Q8882i6635o6835J6676j05669J16066B34030D2942i2915q3977
$$ plain form
9058 -176892 63757 -262882 -455410 -175447 26932 -99872 -302061 130389 -231960 -3186 -121435
9047 -121435 -206191 -199636 -12070 23541 -72294 62627 44893 -259752 -364817 -145002 -151146
9036 -151146 -298554 -254103 176046 -93070 91813 124257 133906 -3666 -238902 -99536 -26443
9024 -50630 -70987 -297747 36089 -37148 92073 79459 107312 165157 -148582 64104 1988 -154126
9011 181464 -122999 -394119 -184018 -101943 369251 -70293 -168431 -51492 -39187 -323784 -153655
8999 -276928 -339425 -100629 61223 -230780 -378044 -129854 62181 -11985 -137365 -316181
8989 -316181 -338751 8604 125205 -440921 -339231 -171398 -32954 -240992 -79512 -43889 -191609
8978 -191609 -92863 -276277 120493 -186394 -75906 -269838 -194232 -251693 100390 -26093 -115158
$$ packed form
9058a76892F3757b62882j92528a75447B6932i9872k02189A30389b31960c186j18249
9047a21435q4756O555a2070B3541g2294F2627j7734b59752j05065a45002o144
9036a51146j47408M4451A76046i3070I1813L2444R649c666k35236i9536b6443
9024e0630k0357k26760C6089c7148I2073j2614K7853N7845a48582F4104A988a54126
9011A81464a22999k71120a84018Q2075C69251g0293r8138e1492J2305k84597a53655
8999b76928o2497a00629F1223b30780j47264a29854F2181a1985j25380j78816
8989c16181k2570H604J16601d40921J01690J67833c2954k08038g9512L5623j47720
8978a91609i2863j83414A20493a86394g5906j93932P5606n7461A00390b6093q9065
$$ plain form
8967 -115158 -130265 96407 -98744 -14907 -155846 -607780 20171 19166 75651 -97486 -15096
8955 -124544 366404 -241562 117650 902 -42863 -4942 -410874 -44249 -110724 -48718 -281666
8944 -281666 -18422 40253 -297967 -203049 6994 -347 -130552 -111678 57943 186979 445193
8933 445193 434432 -324341 372502 -17972 -98844 -133020 144532 -70446 357009 872016 1218325
8922 1218325 3596374 9962947 9047102 2459010 967080 -136569 137704 65245 31421
8912 123623 -303374 -157376 263759 -79379 150443 11617 23153 -159478 -675552 70832
8901 69977 -166237 -369229 -173187 195525 211335 -219065 47555 37524 33313 -199344 -150942
8890 -150942 -183465 -119591 48273 -313661 133240 -132100 43921 -135926 80067 -33672 -71107
$$ packed form
8967a15158j5107I6407i8744a4907j40939m51934B0171j005N6485i7486a5096
8955a24544C66404b41562A17650I02d2863d942m05932d4249o6475d8718k32948
8944b81666a8422D0253b97967R4918F994c47j30205J8874E7943J29036K58214
8933D45193j0761c24341C72502a7972q0872l4176A44532g0446C57009N15007L46309
8922A218325K378049O366573r15845B459010I67080a36569A37704F5245C1421
8912A23623c03374J45998B63759g9379A50443A1617J1536a59478n16074G0832
8901F9977a66237k02992a73187A95525J5810b19065D7555j0031m211a99344M8402
8890a50942l2523O3874D8273c13661A33240a32100D3921a35926H0067c3672l7435
$$ [...]
##END NTUPLES=NMR SPECTRUM
##END=
