
##TITLE=AC1233_PERAH12114_6519287_kQ2xMY586G
##JCAMPDX= 6.0         $$ Bruker NMR JCAMP-DX V2.0
##DATA TYPE= NMR SPECTRUM
##DATA CLASS= NTUPLES
##ORIGIN= BRUKER
##OWNER= Administrator
$$ 1.72 TOPSPIN		Version 2.1
$$ 2012-07-13 15:56:37.640 -0500  Administrator@TOPSPIN
$$ Compression mode = diff/dup
##.OBSERVE FREQUENCY= 400.02188249412
##.OBSERVE NUCLEUS= ^1H
##.ACQUISITION MODE= SIMULTANEOUS (DQD)
##.ACQUISITION SCHEME= undefined
##.AVERAGES= 64
##.DIGITISER RES= 22
##SPECTROMETER/DATA SYSTEM= spect
##.PULSE SEQUENCE= noesygpps1d.comp
##.SOLVENT NAME= COFFEE_meoh
##.SHIFT REFERENCE= INTERNAL, COFFEE_meoh, 1, 14.96155
##AUDIT TRAIL= $$ (NUMBER, WHEN, WHO, WHERE, PROCESS, VERSION, WHAT)
$$ ##TITLE= Audit trail, TOPSPIN		Version 2.1
$$ ##JCAMPDX= 5.01
$$ ##ORIGIN= Bruker BioSpin GmbH
$$ ##OWNER= Administrator
$$ $$ C:\Bruker\TOPSPIN/data/COFFEE/nmr/AC1233_PERAH12114_6519287_kQ2xMY586G/12/pdata/1/auditp.txt
$$ ##AUDIT TRAIL=  $$ (NUMBER, WHEN, WHO, WHERE, PROCESS, VERSION, WHAT)
(   1,<2012-07-13 15:56:32.812 -0500>,<Administrator>,<TOPSPIN>,<go>,<TOPSPIN 2.1>,
      <created by zg
	started at 2012-07-13 15:45:02.453 -0500,
	POWCHK enabled, PULCHK disabled,
       configuration hash MD5:
       6B 1B 68 BB D9 2E 58 E2 7F 35 AD 54 07 DF 0E 41
       data hash MD5: 64K
       ED 20 B2 9E 75 82 CE 06 A3 B8 C6 F8 15 3D 83 3A>)
(   2,<2012-07-13 15:56:35.703 -0500>,<Administrator>,<TOPSPIN>,<proc1d>,<TOPSPIN 2.1>,
      <Start of raw data processing
       efp LB = 0.3 FT_mod = 6 PKNL = 1 PHC0 = 0 PHC1 = 0 SI = 128K 
       data hash MD5: 128K
       37 7E CF 8B 2D 06 40 19 4D F4 DE A8 D7 7C 98 47>)
(   3,<2012-07-13 15:56:36.890 -0500>,<Administrator>,<TOPSPIN>,<proc1d>,<TOPSPIN 2.1>,
      <pk PHC0 = -0.7745361 PHC1 = 0 
       data hash MD5: 128K
       28 6B 86 B6 9A 2F 3E 58 BA 55 11 BC 3A 32 1C 63>)
(   4,<2012-07-13 15:56:37.125 -0500>,<Administrator>,<TOPSPIN>,<proc1d>,<TOPSPIN 2.1>,
      <abs ABSG = 1 
       data hash MD5: 128K
       72 D4 A7 2F 2E 44 2E DD 1E 82 F3 B6 FE 1B 75 12>)
(   5,<2012-07-13 15:56:37.375 -0500>,<Administrator>,<TOPSPIN>,<proc1d>,<TOPSPIN 2.1>,
      <abs ABSG = 2 
       data hash MD5: 128K
       56 3E EA 5B A1 61 27 18 88 97 78 C2 06 95 EB AB>)
(   6,<2012-07-13 15:56:37.437 -0500>,<Administrator>,<TOPSPIN>,<proc1d>,<TOPSPIN 2.1>,
      <abs ABSG = 3 
       data hash MD5: 128K
       A8 EF B2 BB 32 26 F3 BA 6A FF 24 CD B9 37 67 BA>)
(   7,<2012-07-13 15:56:37.500 -0500>,<Administrator>,<TOPSPIN>,<proc1d>,<TOPSPIN 2.1>,
      <abs ABSG = 4 
       data hash MD5: 128K
       B0 91 35 4A 2A B0 F3 1C 11 29 9C EA 80 5E 1A A1>)
(   8,<2012-07-13 15:56:37.562 -0500>,<Administrator>,<TOPSPIN>,<proc1d>,<TOPSPIN 2.1>,
      <abs ABSG = 5 
       data hash MD5: 128K
       75 E0 BA 1A 9E 91 99 22 07 69 5A E3 0A 68 35 D9>)
$$ ##END=
$$ 
$$ $$ hash MD5
$$ $$ 7E AA 0A 04 2C 97 57 5E 83 A6 8E 6F E8 81 5B 74
##$RELAX= 
##$RELAX= 
##$RELAX= 
##$RELAX= 
##$RELAX= 
##$RELAX= 
##$RELAX= 
##$RELAX= 
##$RELAX= 
$$ [...]
##$TP07= 0
##$TPNAME0= <>
##$TPNAME1= <>
##$TPNAME2= <>
##$TPNAME3= <>
##$TPNAME4= <>
##$TPNAME5= <>
##$TPNAME6= <>
##$TPNAME7= <>
##$TPOAL= (0..7)
0.5 0.5 0.5 0.5 0.5 0.5 0.5 0.5
##$TPOFFS= (0..7)
0 0 0 0 0 0 0 0
##$TUNHIN= 0
##$TUNHOUT= 0
##$TUNXOUT= 0
##$USERA1= <user>
##$USERA2= <user>
##$USERA3= <user>
##$USERA4= <user>
##$USERA5= <user>
##$V9= 5
##$VALIST= <valist>
##$VCLIST= <CCCCCCCCCCCCCCC>
##$VD= 0
##$VDLIST= <DDDDDDDDDDDDDDD>
##$VPLIST= <PPPPPPPPPPPPPPP>
##$VTLIST= <TTTTTTTTTTTTTTT>
##$WBST= 2048
##$WBSW= 25
##$XGAIN= (0..3)
0 0 0 0
##$XL= 0
##$YL= 0
##$YMAX_a= 16788516
##$YMIN_a= -13108024
##$ZGOPTNS= <>
##$ZL1= 120
##$ZL2= 120
##$ZL3= 120
##$ZL4= 120
##$ABSF1= 14.96155
##$ABSF2= -5.596632
##$ABSG= 5
##$ABSL= 3
##$ALPHA= 0
##$AQORDER= 0
##$ASSFAC= 0
##$ASSFACI= 0
##$ASSFACX= 0
##$ASSWID= 0
##$AUNMP= <proc_prof1d_extract.lims>
##$AXLEFT= 0
##$AXNAME= <>
##$AXNUC= <1H>
##$AXRIGHT= 0
##$AXTYPE= 0
##$AXUNIT= <>
##$AZFE= 0.1
##$AZFW= 0.1
##$BCFW= 0
##$BC_mod= 0
##$BYTORDP= 0
##$COROFFS= 0
##$CY= 15
##$DATMOD= 1
##$DC= 0
##$DFILT= <>
##$DTYPP= 0
##$F1P= 0
##$F2P= 0
##$FCOR= 0.5
##$FTSIZE= 131072
##$FT_mod= 6
##$GAMMA= 0
##$GB= 0
##$INTBC= 1
##$INTSCL= 1
##$ISEN= 128
##$LB= 0.3
##$LEV0= 0
##$LPBIN= 0
##$MAXI= 10000
##$MC2= 0
##$MEAN= 0
##$ME_mod= 0
##$MI= 0
##$NCOEF= 0
##$NC_proc= -2
##$NLEV= 6
##$NOISF1= 0
##$NOISF2= 0
##$NSP= 0
##$NTH_PI= 0
##$NZP= 0
##$OFFSET= 14.96155
##$PC= 1
##$PHC0= -0.7745361
##$PHC1= 0
##$PH_mod= 1
##$PKNL= yes
##$PPARMOD= 0
##$PPDIAG= 0
##$PPIPTYP= 0
##$PPMPNUM= 2147483647
##$PPRESOL= 1
##$PSCAL= 4
##$PSIGN= 0
##$PYNMP= <proc.py>
##$REVERSE= no
##$SF= 400.020009416648
##$SI= 131072
##$SIGF1= 0
##$SIGF2= 0
##$SINO= 400
##$SIOLD= 131072
##$SPECTYP= <>
##$SREGLST= <1H.CDCl3>
##$SSB= 0
##$STSI= 131072
##$STSR= 0
##$SW_p= 8223.68421052631
##$SYMM= 0
##$S_DEV= 0
##$TDeff= 65536
##$TDoff= 0
##$TI= <>
##$TILT= no
##$TM1= 0
##$TM2= 0
##$TOPLEV= 0
##$USERP1= <user>
##$USERP2= <user>
##$USERP3= <user>
##$USERP4= <user>
##$USERP5= <user>
##$WDW= 1
##$XDIM= 131072
##$YMAX_p= 428046374
##$YMIN_p= -14189
##$CURPLOT= <Network HP LaserJet P1505>
##$CURPRIN= <$Network HP LaserJet P1505>
##$DFORMAT= <normdp>
##$LAYOUT= <+/1D_H.xwp>
##$LFORMAT= <normlp>
##$PFORMAT= <normpl>
##$SURQMSG= 1
$$ End of Bruker specific parameters
$$ ---------------------------------
##NTUPLES= NMR SPECTRUM
##VAR_NAME=  FREQUENCY,     SPECTRUM/REAL,   SPECTRUM/IMAG
##SYMBOL=    X,             R,               I
##VAR_TYPE=  INDEPENDENT,   DEPENDENT,       DEPENDENT
##VAR_FORM=  AFFN,          ASDF,            ASDF
##VAR_DIM=   131072,        131072,          131072
##UNITS=     HZ,            ARBITRARY UNITS, ARBITRARY UNITS
##FACTOR=    0.0627417313425164, 1,          1
##FIRST=     8223.62146879497, -1563,        -88881
##LAST=      0,             1062,            -89222
##MIN=       0,             -14189,          0
##MAX=       8223.62146879497, 428046374,    0
$$ Real data points
##PAGE= N=1
##DATA TABLE= (X++(R..R)), XYDATA
$$ [...]
61305I96723J9632J9889J9791J9182J8069J6806J5105J1936P097J871k729p218
61293A136154j2187j6675j9356k0409k0933k1160k0600j9394j8186j7039j5565
61282I34650j3777j1829r447o593m186l030k468j223Q03K606L686M566N859P611
61268I07228R449J0741J0997J0581J0646J1824J3526J5035J6481J8198J9847K0955
61256A075508K1584K1708K0727J8263J4764J0574N355p66o390j0169j2268j3665
61244A145225j4719j5200j4977j3935j1996r814q460p797o413l836j352J67J661
61231A038554L876N715O193O434P889R864J0863J1266J2534J4576J6000J6360
61219A160124J6151J5125J2678R592P465O566N973N459N569O064O092N703N633
$$ y = [996723, 1016355, 1036244, 1056035, 1075217, 1093286, 1110092, 1125197, 1137133, 1144230, 1146101, 1143372, 1136154, 1123967, 1107292, 1087936, 1067527, 1046594, 1025434, 1004834, 985440, 967254, 950215, 934650, 920873, 909044, 899597, 893004, 888818, 885788, 883320, 882097, 882900, 885506, 889192, 893758, 899617, 907228, 916677, 927418, 938415, 948996, 959642, 971466, 984992, 1000027, 1016508, 1034706, 1054553, 1075508, 1097092, 1118800, 1139527, 1157790, 1172554, 1183128, 1188483, 1187717, 1181327, 1171158, 1158890, 1145225, 1130506, 1115306, 1100329, 1086394, 1074398, 1064584, 1056124, 1048327, 1041914, 1038078, 1036726, 1036893, 1038554, 1042430, 1048145, 1054338, 1060772, 1068661, 1078525, 1089388, 1100654, 1113188, 1127764, 1143764, 1160124, 1176275, 1191400, 1204078, 1213670, 1221135, 1227701, 1233674, 1239133, 1244702, 1250766, 1256858, 1262561, 1268194]
61206A268194N804N606N402O086P410Q484R603J1881J5126J7934J9903K1996K4621
61193A428050K6890K8071K8280K7662K6169K4200K2152J9357J4847R116L734p32
61181A657796m984r266j2910j5678j8081k0213k1626k2476k3575k5100k6500k7662
61169A429725k8921l0032l0358l0112l0100l0314l0023k9186k8401k7528k5776
61158A108974k3124k0280j7285j3600r633o623m851l317j368O52K538M601O672
61145A023356P968Q271Q128P734O619M602K110m28k568l485k666p47J363L845
61131A064102P306J1258J4712J7836K1503K5510K8878L1660L4802L8268M0999
61120A336834M2711M4139M5483M6127M5982M5574M4744M2725L9567L6140L2710
$$ y = [1268194, 1273998, 1279604, 1285006, 1291092, 1298502, 1306986, 1316589, 1328470, 1343596, 1361530, 1381433, 1403429, 1428050, 1454940, 1483011, 1511291, 1538953, 1565122, 1589322, 1611474, 1630831, 1645678, 1654794, 1658528, 1657796, 1652812, 1643546, 1630636, 1614958, 1596877, 1576664, 1555038, 1532562, 1508987, 1483887, 1457387, 1429725, 1400804, 1370772, 1340414, 1310302, 1280202, 1249888, 1219865, 1190679, 1162278, 1134750, 1108974, 1085850, 1065570, 1048285, 1034685, 1025052, 1018429, 1013578, 1010261, 1008893, 1009545, 1012083, 1016684, 1023356, 1031324, 1039595, 1047723, 1055457, 1062076, 1066678, 1068788, 1068360, 1065792, 1062307, 1059641, 1058894, 1060257, 1064102, 1071408, 1082666, 1097378, 1115214, 1136717, 1162227, 1191105, 1222765, 1257567, 1295835, 1336834, 1379545, 1423684, 1469167, 1515294, 1561276, 1606850, 1651594, 1694319, 1733886, 1770026, 1802736]
61109A802736K8835K4528K0178J5638J0714O122K451j296o380j2165j7187k1794
61097A852380k7487l4019l9604m3777m7601n1072n2880n2938n2642n2237n0395
61086A347728m6870m3159m0001l6573l2685k9407k6886k3913k0362j7718j6372
61075A013782j4752j1988r174p111n086k879j627j597j298J10J585K417L447M977
61061I70806N809N676O318Q668J1149J2371J3414J5678J8454K0512K2311K4768
61049A135934K7316K9064L0520L2455L4278L5106L5333L5693L5913L5591L5194
61038A502397L4920L3850L1422K8551K6127K3723K0821J7931J5438J2790R871
61027A757841P624O307M698K185l8q82q06l44Q60K554L476L732N413R507J4354
$$ y = [1802736, 1831571, 1856099, 1876277, 1891915, 1902629, 1908751, 1911202, 1909906, 1903526, 1891361, 1874174, 1852380, 1824893, 1790874, 1751270, 1707493, 1659892, 1608820, 1555940, 1503002, 1450360, 1398123, 1347728, 1300858, 1257699, 1217698, 1181125, 1148440, 1119033, 1092147, 1068234, 1047872, 1030154, 1013782, 999030, 987042, 977868, 970757, 965671, 962792, 961165, 959568, 958270, 958380, 959965, 962382, 965829, 970806, 976615, 982291, 988609, 997277, 1008426, 1020797, 1034211, 1049889, 1068343, 1088855, 1111166, 1135934, 1163250, 1192314, 1222834, 1255289, 1289567, 1324673, 1360006, 1395699, 1431612, 1467203, 1502397, 1537317, 1571167, 1602589, 1631140, 1657267, 1680990, 1701811, 1719742, 1735180, 1747970, 1757841, 1765465, 1771772, 1776470, 1778655, 1778617, 1777735, 1776929, 1776585, 1777445, 1779999, 1783475, 1787207, 1792620, 1802127, 1816481]
61012A816481J8553K3047K8676L4179L8634M3558N0414N8115O5137P1936P9101
61001B327831Q5299Q9573R3602R9316J06333J14084J24139J37835J53893J71193
60991C503098J91540K16821K46162K79148L19050L69154M28810M97187N77813
60982F628783O74993P89829R25725J093583J304186J560102J863069K217629K603068
60973A9660967K942034L132015L133944L009464K833537K576120K120760J430261
60965D0839102O62595P1939k11215k69855k69333k87622l16509l96202o64797
60956C9158103j229076k013037k776663l287407l459921l349900l062595k688449
60948A7291055k293387j923240j600686j328089j100602r14413p64588o43367
$$ y = [1816481, 1835034, 1858081, 1886757, 1920936, 1959570, 2003128, 2053542, 2111657, 2176794, 2248730, 2327831, 2413130, 2502703, 2596305, 2695621, 2801954, 2916038, 3040177, 3178012, 3331905, 3503098, 3694638, 3911459, 4157621, 4436769, 4755819, 5124973, 5553783, 6050970, 6628783, 7303776, 8093605, 9019330, 10112913, 11417099, 12977201, 14840270, 17057899, 19660967, 22603001, 25735016, 28868960, 31878424, 34711961, 37288081, 39408841, 40839102, 41501697, 41573636, 41362421, 41092566, 40823233, 40535611, 40219102, 39822900, 39158103, 37929027, 35915990, 33139327, 29851920, 26391999, 23042099, 19979504, 17291055, 14997668, 13074428, 11473742, 10145653, 9045051, 8130638, 7366050, 6722683]
60940F722683n44089m63588l99687l49393l10141k79950k55723k33870k13003
60931C673239j93941j76856j60637j45123j31641j20662j10944j01716r4030q9029
60921B348660q6138q3772q0852p6989p2044o6271o0357n4818m9659m4841m0614
60910A632305l7117l4140l1575k9721k8800k8365k7570k6064k4432k3499k3329
60899A317693k3180k2596k2008k1855k1640k0571j8935j7803j7392j6740j5277
60888A099696j3701j2795j2250j1363j0286r727r802r964r829r521r240q975q629
60875I63614q100p269o282n761o390q147j0054j0890j0273r047q430q687q846
60862H55438p908o048m334l494l368l400l268k972k665k426k133j656j194j075
$$ y = [6722683, 6178594, 5715006, 5315319, 4965926, 4655785, 4375835, 4120112, 3886242, 3673239, 3479298, 3302442, 3141805, 2996682, 2865041, 2744379, 2633435, 2531719, 2437689, 2348660, 2262522, 2178750, 2097898, 2020909, 1948865, 1882594, 1822237, 1767419, 1717760, 1672919, 1632305, 1595188, 1561048, 1529473, 1499752, 1470952, 1442587, 1415017, 1388953, 1364521, 1341022, 1317693, 1294513, 1271917, 1249909, 1228054, 1206414, 1185843, 1166908, 1149105, 1131713, 1114973, 1099696, 1085995, 1073200, 1060950, 1049587, 1039301, 1029574, 1019772, 1009808, 999979, 990458, 981218, 972243, 963614, 955514, 948245, 941963, 936202, 929812, 921665, 911611, 900721, 890448, 881401, 872971, 864284, 855438, 847530, 841482, 837148, 833654, 830286, 826886, 823618, 820646, 817981, 815555, 813422, 811766, 810572, 809497]
60848H09497j127p75NM76L47M84J654L190L808L377K871K738K356J156n35k018
60832H27504k941l304l199k744k070j374j135j911l567n094n679n543n345n273
60818G78325n208n239n335n014m089l249l099l250l115l038l604m396m601m371
60804G20717m450m760m644m242m292m756m919m787n052n627n605m843m316m528
60790F53896m768m353l505k661j847j203j206j887k570k778k766k810k700k227
60776F16615j585j057p78r17j438j688q98P22K083K499K348K387K973L910M581
60761F29757M338L340K717L238M226M587M468M754N286M997L690K394J700J061
60747F80553P0p27q19n87p10j432k733m530o397p736q472q981r346r262q638p678
$$ y = [809497, 808370, 807595, 807600, 808076, 808423, 808907, 810561, 813751, 817559, 820936, 823807, 826545, 828901, 830057, 829522, 827504, 824563, 821259, 818060, 815316, 813246, 811872, 810737, 808826, 805259, 800165, 794486, 788943, 783598, 778325, 773117, 767878, 762543, 757529, 753440, 750191, 747092, 743842, 740727, 737689, 734085, 729689, 725088, 720717, 716267, 711507, 706863, 702621, 698329, 693573, 688654, 683867, 678815, 673188, 667583, 662740, 658424, 653896, 649128, 644775, 641270, 638609, 636762, 635559, 634353, 632466, 629896, 627118, 624352, 621542, 618842, 616615, 615030, 613973, 613195, 612278, 610840, 609152, 608254, 608976, 611059, 613558, 615906, 618293, 621266, 625176, 629757, 634095, 637435, 640152, 643390, 647616, 652203, 656671, 661425, 666711, 671708, 675398, 677792, 679492, 680553, 680623, 679896, 679077, 678490, 677780, 676348, 673615, 669085, 662688, 654952, 646480, 637499, 628153, 618891, 610253, 602575]
60731F02575o424m945l715l033k378j273m02p17j738k089j556j192j420j555j353
60716E68785j467k012k089j292l76K0J53K93K52K28Q59J922K259J583J081J586
60700E71785K320K291J832J880K620L610M531N079M890M194L853M223M646M538
60686F22292M153L847L475L088L269M126M712M186K892J744J184J198J651K135
60672F63952K105J602J181R14L20m60n12L16Q20N9j361k329k666k847l080l408
60656F54606m007m679m681l723k570k035j990j848j437q96l74j79o17j338j641
60641F22591j610k036k894l104k341j823k453l326l077j794n61J50N50P15P09
60626E99696R91J775K392K205J622J477J774J899J594R57p3j349k079j596m02
$$ y = [602575, 596151, 591206, 587491, 584458, 582080, 580807, 580405, 579688, 577950, 575861, 574305, 573113, 571693, 570138, 568785, 567318, 565306, 563217, 561925, 561549, 561569, 561722, 562015, 562267, 562495, 563354, 565276, 567535, 569118, 570199, 571785, 574105, 576396, 578228, 580108, 582728, 586338, 590869, 595948, 600838, 605032, 608885, 613108, 617754, 622292, 626445, 630292, 633767, 636855, 640124, 644250, 648962, 653148, 656040, 657784, 658968, 660166, 661817, 663952, 666057, 667659, 668840, 669754, 670074, 669614, 669102, 669418, 670238, 670297, 668936, 666607, 663941, 661094, 658014, 654606, 650599, 645920, 641239, 637516, 634946, 632911, 630921, 629073, 627636, 626740, 626366, 626187, 625570, 624232, 622591, 620981, 618945, 616051, 612947, 610606, 608783, 606330, 603004, 599927, 598133, 597572, 597722, 598272, 598987, 599696, 600687, 602462, 604854, 607059, 608681, 610158, 611932, 613831, 615425, 616382, 616309, 614960, 612881, 611285, 610883]
60611F10883L43K22k01l31j68q0m40j343k334k666k068j076l25Q7L66O10Q68J237
60593F03584J673K090K670L581M392M482M079M057M649N241N563O018O561O362
60579F65002N126L660K683J998J392J243J620J747J194O16O44Q71Q13R23J788
60564F91320K981L750M184M898O143P921J0358J3187J5502J6780J7595J8658J9757
60551H33034K0326K0341J9823J8137J4681R834M559n21n011q402j0544j1890j2659
60538H91708j2288j0437p851n492l423j217J154L541O149R102J2014J4567J6989
60525I14516J9392K1346K2672K3838K4881K4812K2846J9483J5590J1222O213J143
60513A127954l223o781r598j1314j1900j2137j2431j2047j0486q687p608o554
$$ y = [610883, 611226, 611448, 611247, 610916, 610748, 610668, 610228, 608885, 606551, 603885, 601817, 600741, 600416, 600503, 600869, 601479, 602347, 603584, 605257, 607347, 610017, 613598, 617990, 622472, 626551, 630608, 635257, 640498, 646061, 652079, 658640, 665002, 670128, 673788, 676471, 678469, 679861, 681104, 682724, 684471, 685665, 686281, 686925, 687796, 688609, 689532, 691320, 694301, 698051, 702235, 707133, 713276, 721197, 731555, 744742, 760244, 777024, 794619, 813277, 833034, 853360, 873701, 893524, 911661, 926342, 936176, 940735, 940214, 935203, 926801, 916257, 904367, 891708, 879420, 868983, 861132, 855640, 852217, 851000, 852154, 855695, 861844, 870946, 882960, 897527, 914516, 933908, 955254, 977926, 1001764, 1026645, 1051457, 1074303, 1093786, 1109376, 1120598, 1126811, 1127954, 1124731, 1117950, 1108352, 1097038, 1085138, 1073001, 1060570, 1048523, 1038037, 1029350, 1021742, 1015188]
60501A015188m308j246J145K349L068L777M497N724Q161J1614J5327J9308K4195
60488A108799K9941L5812M1656M7967N4656O0784O5575O8824P0146O8739O4166
60477A717065N6771M7305L6575K5372J4144K866q399j9162k9070l8376m7205n4923
60465A702963o0910o5353o8529o9937o9027o6318o2759n8495n3223m7438m2244
60454A038730l8106l4659l1455k8124k4227k0000j6729j5334j4871j3620j1422
60443G90183r629q894q339p102n525m339l630l063k569k313k380k697l028l073
60429G23602k746k188j392k56Q17J032L78n6M78J307J425R45N42J91m30q42k65
60412G22542J010J892J919J499R70L54j19j64L2K52R04K375M008M709M359L748
$$ y = [1015188, 1010880, 1009634, 1010779, 1013128, 1016196, 1019973, 1024470, 1030194, 1038355, 1049969, 1065296, 1084604, 1108799, 1138740, 1174552, 1216208, 1264175, 1318831, 1379615, 1445190, 1514014, 1584160, 1652899, 1717065, 1773836, 1821141, 1857716, 1883088, 1897232, 1900098, 1891699, 1872537, 1843467, 1805091, 1757886, 1702963, 1642053, 1576700, 1508171, 1438234, 1369207, 1302889, 1240130, 1181635, 1128412, 1080974, 1038730, 1000624, 965965, 934510, 906386, 882159, 862159, 845430, 830096, 815225, 801605, 790183, 780554, 771660, 763321, 756219, 750694, 746355, 742725, 739662, 737093, 734780, 732400, 729703, 726675, 723602, 720856, 718668, 717276, 717020, 717837, 718869, 719247, 719191, 719669, 720976, 722401, 723346, 723888, 724079, 723649, 722807, 722542, 723552, 725444, 727363, 728862, 729832, 730186, 730067, 729903, 729935, 730187, 731091, 733466, 737474, 742183, 746542, 750290]
60396G50290L317K941K732L040L713M206M366M353M014L225K587K798L521L785
60382G98888L375K898K645K430K464L209M308M686L988L093K914L337L602L240
60368H45077K481K029K443L373L792L287K674K828L396L492L078K811K849K829
60354H86439K735K875L143L177L080L247L620L908M348N426O998Q399R336J0007
60340I56738J0540J0999J1681J2666J3295J2704J0757P953M708J177k599o750
60328A043869j1280j5348j7624j7869j7217j6342j4568j1573q706p217o412n015
60316H94698l423k812k841k117o15L37K73J51O50J500K496L842N332O532P822
60301I11825J0133J3548J7261K0840K4550K8519L2507L6278L9324M0701M0038
$$ y = [750290, 753607, 756548, 759280, 762320, 766033, 770239, 774605, 778958, 782972, 786197, 788784, 791582, 795103, 798888, 802263, 805161, 807806, 810236, 812700, 815909, 820217, 824903, 828891, 831984, 834898, 838235, 841837, 845077, 847558, 849587, 852030, 855403, 859195, 862482, 865156, 867984, 871380, 874872, 877950, 880761, 883610, 886439, 889174, 892049, 895192, 898369, 901449, 904696, 908316, 912224, 916572, 921998, 928996, 937395, 946731, 956738, 967278, 978277, 989958, 1002624, 1015919, 1028623, 1039380, 1047333, 1052041, 1053218, 1050619, 1043869, 1032589, 1017241, 999617, 981748, 964531, 948189, 933621, 922048, 913342, 906125, 899713, 894698, 891275, 888463, 885622, 883505, 882890, 883227, 883500, 883651, 884301, 885801, 888297, 892139, 897471, 904003, 911825, 921958, 935506, 952767, 973607, 998157, 1026676, 1059183, 1095461, 1134785, 1175486, 1215524]
60290A215524L7981L4596K8276J7881N080p250j8282k8844l8334m4511m6487m5716
60278A109914m3593m0071l5090k9586k4449j9945j6501j4568j3420j1668r334
60267H51689p832p565p290o321n580n744n931n119l624k281j332q00q82j359j483
60252G88546j024n30k81J9L13R3n96j152j533k146k528j695lR32O59O05J794L344
60234G84817M076M156M288M480M537M809N577O492P244Q028Q928R652J0219J0997
60220H78300J1821J2138J2200J2902J4173J4874J4609J4232J4174J3705J2470
60209A025598J1237J0432R324P578O223O122O611O617O085N394M312K578O57r64
60195A107804k561m481o363p738q776r779j0529j0730j0520j0178r774r398r126
$$ y = [1215524, 1253505, 1288101, 1316377, 1334258, 1339338, 1332088, 1313806, 1284962, 1246628, 1202117, 1155630, 1109914, 1066321, 1026250, 991160, 961574, 937125, 917180, 900679, 886111, 872691, 861023, 851689, 843857, 836292, 829002, 822681, 817101, 811357, 805426, 800307, 796683, 794402, 793070, 792270, 791388, 790029, 788546, 787522, 786992, 786711, 786730, 787043, 787136, 786540, 785388, 783855, 781709, 779181, 777486, 777483, 778415, 779074, 779679, 781473, 784817, 788893, 793049, 797337, 801817, 806354, 811163, 816740, 823232, 830476, 838504, 847432, 857084, 867303, 878300, 890121, 902259, 914459, 927361, 941534, 956408, 971017, 985249, 999423, 1013128, 1025598, 1036835, 1047267, 1056591, 1064169, 1070392, 1076514, 1083125, 1089742, 1095827, 1101221, 1105533, 1108111, 1108768, 1107804, 1105243, 1100762, 1094399, 1086661, 1077885, 1068106, 1057577, 1046847, 1036327, 1026149, 1016375, 1006977, 997851]
60182I97851q642p612o354n368m355k831j469j388k150k077p40M95P36O33O86
60167I57415L35n38q40j1Q66P19l7n04o20n57m0Q52J370J330J511K156K365J774
60149I67546J405J964K702K938L304M370N338N472N568O683Q381R553J0031J0200
60135A045455R951R221Q742R019R384R164Q965R610J0553J0667R917R018P993
60122A167659O362M339K721J734R25o5j347l024m996o765q012q880r465r646r766
60107A121774j0507j1695j2176j1442j0289r330p942n551k877r75J56J145K215
60094A042506L289M354N032M645L326K179J796J589J147J007J439J657J161O56
60080A075783P27O99k20j764l402n252p271q727r447j0428j2208j3791j4220j4021
$$ y = [997851, 989209, 981597, 975243, 969875, 965520, 962689, 961220, 959832, 957682, 955605, 954865, 955360, 956096, 956729, 957415, 957750, 957212, 956372, 956361, 957227, 957946, 957909, 957405, 956785, 956228, 956188, 957040, 958410, 959740, 961251, 963407, 965772, 967546, 968951, 970915, 973617, 976555, 979859, 984229, 989567, 995039, 1000607, 1007290, 1015671, 1025224, 1035255, 1045455, 1055406, 1064627, 1073369, 1082388, 1091772, 1100936, 1109901, 1119511, 1130064, 1140731, 1150648, 1159666, 1167659, 1174021, 1178360, 1181081, 1182815, 1183740, 1183675, 1182328, 1179304, 1174308, 1167543, 1159531, 1150651, 1141186, 1131540, 1121774, 1111267, 1099572, 1087396, 1075954, 1065665, 1056335, 1048393, 1042842, 1039965, 1038990, 1039146, 1040291, 1042506, 1045795, 1050149, 1055181, 1059826, 1063152, 1065331, 1067127, 1068716, 1069863, 1070870, 1072309, 1073966, 1075127, 1075783, 1076510, 1077209, 1076989, 1075225, 1071823, 1066571, 1059300, 1050573, 1041126, 1030698, 1018490, 1004699, 990479, 976458]
60066I76458j3948j3596j2429j1006r887q545o639n150m777m382k666l40J059
60053H84152J626K592M129N437O464P778R095R593R437R558J0031J0005R102P725
60039I86724O092L976J245j977n408q234r438r215r225j0482j1864j1835j0726
60026I09633j0049j0305j0834j1209j1396j1049r922q661q054p875p390o551n756
60013G90582n022m356m227m726m960m352l698l846m184l678k628j983j554l40
59999G41028J795M073N983P435Q181Q210Q290R024R853R915R309Q682Q118P418
59985H47314O639N555L417K43k633m331n683p628r443r995r621r264q698p252
59971G88620n503m600m518m400m018l545k584q75P67J576K150L344M676N266N440
$$ y = [976458, 962510, 948914, 936485, 925479, 915592, 907047, 900408, 895258, 890481, 886099, 883433, 883093, 884152, 885778, 888370, 892499, 897936, 904400, 912178, 921273, 930866, 940303, 949861, 959892, 969897, 978999, 986724, 992816, 996792, 998037, 996060, 990652, 982418, 972980, 963765, 954540, 944058, 932194, 920359, 909633, 899584, 889279, 878445, 867236, 855840, 844791, 834869, 826208, 818154, 810279, 802889, 796338, 790582, 785560, 781204, 776977, 772251, 767291, 762939, 759241, 755395, 751211, 747533, 744905, 742922, 741368, 741028, 742823, 746896, 752879, 760314, 768495, 776705, 784995, 794019, 803872, 813787, 823096, 831778, 839896, 847314, 853953, 859508, 862925, 863168, 860535, 856204, 850521, 842893, 833450, 823455, 813834, 804570, 795872, 788620, 783117, 778517, 773999, 769599, 765581, 762036, 759452, 758577, 759344, 760920, 763070, 766414, 771090, 776356, 781796]
59956G81796N873O126N611N078N440O015N695M953M840M844L791K023O79n00k399
59941H39865m240m345k954j971k053k066j391p34m64KQ96J724K289K773K953K652
59925H32936K642L688N151N951O305O979P603P494P357Q142Q882P938N864M659
59911I21591M529L770J825K3q50j475k239k611k589k868l301k956j831p48L51
59896I10621K190M280N304N313N661O655P309P425P827Q380P929O519N605N796
59882I96814O314O887Q076R495R816R024Q532Q674Q073O043L518J146j528m428
59868A076456o530p811r630j2419j4766j5528j5216j4627j3845j3124j3085j3309
59856I26566j2439j0293q239o927n440l268j320k63N25J642K790L840N130O241
$$ y = [781796, 787669, 793795, 799406, 804484, 809924, 815939, 821634, 826587, 831427, 836271, 840062, 842085, 842764, 842264, 839865, 835625, 831280, 828326, 826355, 824302, 822236, 820845, 820111, 819647, 819649, 820545, 822269, 824558, 827331, 830284, 832936, 835578, 839266, 844417, 850368, 856673, 863652, 871255, 878749, 886106, 894248, 903130, 911068, 916932, 921591, 926120, 929890, 931715, 931738, 930888, 929413, 927174, 924563, 921974, 919106, 915805, 912849, 911018, 910270, 910621, 912811, 917091, 922395, 927708, 933369, 940024, 947333, 954758, 962585, 970965, 978894, 985413, 991018, 996814, 1003128, 1010015, 1018091, 1027586, 1037402, 1046426, 1054958, 1063632, 1071705, 1077748, 1081266, 1082412, 1080884, 1076456, 1069926, 1062115, 1052485, 1040066, 1025300, 1009772, 994556, 979929, 966084, 952960, 939875, 926566, 914127, 903834, 895595, 888668, 883228, 879960, 878640, 878377, 878902, 880544, 883334, 887174, 892304, 898545]
59842H98545O081M755L707L558L471L145L501M760N747N986O699Q812J1505J3637
59828I83909J5206J6597J7734J8570J9120J8595J6096J2361R232P003M191K88
59816A138902l283n497o915p885p636o095m700m521n304p026j0318j4504j7311
59803A037907j7648j6756j5781j4267j2069j0542j0388j0280r098p707p175o959
59791H99237o343n945o286o416n480m208l526l099k517k364k785k567j088K36
59777H46849l8j354k397k941l062k077J16J966K112J191N14K40J77R94L043N217
59761H50550O434P172Q169Q957R057R278J0221J0783R871Q419P975Q246P837O595
59747I69564N477M768L952K908J872P95k39o63m43n24j322j813j218l30p4L8O62
$$ y = [898545, 904626, 909381, 913088, 916646, 920117, 923262, 926763, 931523, 937270, 943256, 949955, 958767, 970272, 983909, 999115, 1015712, 1033446, 1052016, 1071136, 1089731, 1105827, 1118188, 1127420, 1134423, 1138614, 1138902, 1135619, 1130122, 1123207, 1115322, 1107686, 1101591, 1096891, 1092370, 1087066, 1080040, 1069722, 1055218, 1037907, 1020259, 1003503, 987722, 973455, 961386, 950844, 940456, 930176, 921078, 913371, 906196, 899237, 892894, 886949, 880663, 874247, 868767, 864559, 861033, 857934, 855417, 853053, 850268, 847701, 846613, 846849, 846811, 845457, 843060, 840119, 837057, 834980, 835096, 837062, 839174, 840365, 840879, 841119, 841296, 842290, 845333, 850550, 856984, 864156, 872325, 881282, 890339, 899617, 909838, 920621, 930492, 938911, 946886, 955132, 962969, 969564, 975041, 979809, 983761, 986669, 988541, 989336, 989097, 988434, 987991, 987467, 986145, 984332, 983114, 982784, 982710, 982748, 983410]
59730I83410J114O31j9K71J139J601J720J974J967J289P63J275K236K651K787
59715A004809L301L692L240K626K932L744L936L673L979M850N369N287N027M551
59701A061016L658K970L248M086M496M415M472M703M652M342M061L714L247L087
59687A116167L194K449J56k601m199m416m074l573k994k904l757m984n765o185
59673A076514o656o976o934p058p694q171p794o850n718m034j836k97q0p2Q46
59658A007190J951K099J789K161K893K964K651K901L290K454K26k233m112n412
59644A020812o143o458p172q702j0016r900q807q059p798p168o132n584n790o063
59630I17020n876n269m435l739l812m760n775o295o746p406p542o634n420m584
$$ y = [983410, 984524, 985155, 985136, 985407, 986546, 988147, 989867, 991841, 993808, 995097, 995860, 997135, 999371, 1002022, 1004809, 1008110, 1011802, 1015042, 1017668, 1020600, 1024344, 1028280, 1031953, 1035932, 1040782, 1046151, 1051438, 1056465, 1061016, 1064674, 1067644, 1070892, 1074978, 1079474, 1083889, 1088361, 1093064, 1097716, 1102058, 1106119, 1109833, 1113080, 1116167, 1119361, 1121810, 1121966, 1119365, 1115166, 1110750, 1106676, 1103103, 1100109, 1097205, 1093448, 1088464, 1082699, 1076514, 1069858, 1062882, 1055948, 1048890, 1041196, 1033025, 1025231, 1018381, 1012663, 1008629, 1006793, 1006496, 1006416, 1006344, 1007190, 1009141, 1011240, 1013029, 1015190, 1018083, 1021047, 1023698, 1026599, 1029889, 1032343, 1032569, 1030336, 1026224, 1020812, 1014669, 1008211, 1001039, 992337, 982321, 972421, 963614, 955555, 947757, 940589, 934457, 928873, 923083, 917020, 911144, 905875, 901440, 897701, 893889, 889129, 883354, 877059, 870313, 862907, 855365, 848731, 843311, 838727]
59616H38727l504j577L50J248J581K204K667K245J685K138L105L228K520K060
59602H58677K038J776J285J114J015K72r44j874k486l257m050m400m363m079l248
59587H37476k061j633k317k688j639k99k23q51o88M7mq77j474j624k005k548k768
59570H13824l127m175m958m214k582j681j549j008j49k08j192j709j163l08L02
59555G86103P13O65l7m79L59J816K445K264K414L114L728M404N604O553O253N741
59539H31660P020J0001J2732J4643J7081K0407K3009K3854K4027K4748K5432K4427
59527A059041K0670J4343P073J510o27k83J07q19k926n937r472j2300j3462j3930
59513A042988j5341j7444j8602j8480j8170j7885j6705j4669j2961j1807j0205
$$ y = [838727, 835223, 833646, 833996, 835244, 836825, 839029, 841696, 843941, 845626, 847764, 850869, 854097, 856617, 858677, 860715, 862491, 863776, 864890, 865905, 866177, 865233, 863359, 860873, 857616, 853566, 849166, 844803, 840724, 837476, 835415, 833782, 831465, 828777, 827138, 826839, 826616, 825765, 825077, 825124, 825120, 824243, 822769, 821145, 819140, 816592, 813824, 810697, 806522, 801564, 797350, 794768, 793087, 791538, 790530, 790381, 790173, 788981, 787272, 786109, 785801, 786103, 786816, 787481, 787444, 786965, 787324, 789140, 791585, 793849, 796263, 799377, 803105, 807509, 813113, 819666, 825919, 831660, 838680, 848681, 861413, 876056, 893137, 913544, 936553, 960407, 984434, 1009182, 1034614, 1059041, 1079711, 1094054, 1101127, 1102637, 1102010, 1101727, 1101834, 1101015, 1098089, 1092152, 1082680, 1070380, 1056918, 1042988, 1027647, 1010203, 991601, 973121, 954951, 937066, 920361, 905692, 892731, 880924, 870719]
59502H70719q038o520o062n520m022k006r3J553K522K291J335P93Q86R15O74M75
59486H49902N7r13j586q68O31J360J268J608K568L165L370M171N525O344O635
59471H83237P410Q381Q008O279N140N512N971N240M127M126N624Q171J1116J3408
59457I81750J4149J3860J3994J4895J5484J5014J3690J1590Q527N081K182l14
59445A109902l170o047p935r102j0726j2696j3784j3934j4256j4725j4006j1798
59433I77723r277p016m490j788K77J982M438P354R366J0709J3141J6777J9645
59420A038841K0848K1610K2502K2284K0506J8595J7254J5307J2431J0505J0476
59409A231159J0163P302L048K57n79j785n445j1282j7092k0178j8928j3941p546
$$ y = [870719, 862681, 856161, 850099, 844579, 840557, 838551, 838458, 840011, 842533, 844824, 846159, 846952, 847838, 848753, 849427, 849902, 849959, 849046, 847460, 846592, 847223, 848583, 849851, 851459, 854027, 857192, 860562, 864733, 870258, 876602, 883237, 890647, 899028, 907036, 913315, 918455, 923967, 929938, 935178, 939305, 943431, 949055, 957226, 968342, 981750, 995899, 1009759, 1023753, 1038648, 1054132, 1069146, 1082836, 1094426, 1102953, 1108034, 1110216, 1109902, 1106732, 1100685, 1092750, 1083648, 1072922, 1060226, 1046442, 1032508, 1018252, 1003527, 989521, 977723, 968446, 961430, 956940, 955152, 955429, 957411, 961849, 969203, 978569, 989278, 1002419, 1019196, 1038841, 1059689, 1081299, 1103801, 1126085, 1146591, 1165186, 1182440, 1197747, 1210178, 1220683, 1231159, 1241322, 1248624, 1251672, 1251929, 1251350, 1249565, 1244120, 1232838, 1215746, 1195568, 1176640, 1162699, 1155153]
59396A155153k008J640L500M447N314N275J804n972j4613j9289j8987j6553j4076
59383A085635j1158p788n525m814l898j770K03P68O97R88J244J086J265K133K784
59368A061850K767K897L490L645L238L649N521P716R476J1554J4150J5905J6318
59355A162176J7155J9896K3545K6430K8509L0418L1753L1867L1154L0220K8843
59344A461966K6732K4161K1061J6786J1503O310J405m238j0671j6312k0240k3402
59332A495061k6592k9189l0718l1815l2654l2264l0480k8715k7719k6416k3996
59321A174503k1353j9321j7384j5207j3619j2941j2134j0765r926j0163j0328
59310A021362r653r004q975q676p581o670o528o254n419n074n592n609m411l287
$$ y = [1155153, 1153145, 1154785, 1158285, 1162732, 1168046, 1173321, 1175125, 1169153, 1154540, 1135251, 1116264, 1099711, 1085635, 1074477, 1066689, 1061164, 1056350, 1052452, 1050682, 1050885, 1051653, 1052350, 1053338, 1054582, 1055668, 1056933, 1059066, 1061850, 1064617, 1067514, 1071004, 1074649, 1077887, 1081536, 1087057, 1094773, 1104249, 1115803, 1129953, 1145858, 1162176, 1179331, 1199227, 1222772, 1249202, 1277711, 1308129, 1339882, 1371749, 1402903, 1433123, 1461966, 1488698, 1512859, 1533920, 1550706, 1562209, 1568519, 1569924, 1565686, 1555015, 1538703, 1518463, 1495061, 1468469, 1439280, 1408562, 1376747, 1344093, 1311829, 1281349, 1252634, 1224915, 1198499, 1174503, 1153150, 1133829, 1116445, 1101238, 1087619, 1074678, 1062544, 1051779, 1041853, 1031690, 1021362, 1011709, 1002705, 993730, 985054, 977473, 970803, 964275, 958021, 952602, 947528, 941936, 936327, 931916, 928629]
59296I28629l163l012j963q19r0J252L514N045M935M772O036P885R255J0945J3681
59281I86902J6260J7733J9424K2712K6610K9601L2096L5106L8324M1265M4391
59270A310424M7119M6889M2364L5577K8607K0189Q203o282k0059l1290l9533m3869
59258A398339m3858m1213l8038l4379k9521k4387k0349j6956j3125r408o821m691
59246A115593j869J069L020M580O882R465J1352J2978J4900J5984J5130J3434
59234A222518J2352J1050Q002L911N61k081n152q417j1009j3441j6387j8553j8329
59221A165025j6619j5486j4988j3893j2483j1967j1872j0812r153q405q543q433
59209A022371q148q374q204o239l347j743j668j464n18L07Q12J624K474K576K427
$$ y = [928629, 925466, 922454, 920491, 919672, 919582, 920834, 924348, 929393, 934328, 939100, 945136, 953021, 962276, 973221, 986902, 1003162, 1020895, 1040319, 1063031, 1089641, 1119242, 1151338, 1186444, 1224768, 1266033, 1310424, 1357543, 1404432, 1446796, 1482373, 1510980, 1531169, 1539372, 1533090, 1513031, 1481741, 1442208, 1398339, 1354481, 1313268, 1275230, 1240851, 1211330, 1186943, 1166594, 1149638, 1136513, 1127105, 1120284, 1115593, 1113724, 1114793, 1117813, 1122393, 1129275, 1138740, 1150092, 1163070, 1177970, 1193954, 1209084, 1222518, 1234870, 1245920, 1253922, 1257833, 1258394, 1256313, 1251161, 1242744, 1231735, 1218294, 1201907, 1183354, 1165025, 1148406, 1132920, 1117932, 1104039, 1091556, 1079589, 1067717, 1056905, 1047752, 1039347, 1030804, 1022371, 1014223, 1005849, 997645, 991406, 988059, 986316, 984648, 983184, 982666, 982973, 983785, 985409, 987883, 990459, 992886]
59194I92886L135M278M594M306M550N095M870M339M909O320O993O715O707P161
59180A066858O968N946N220N351N892O744Q193R724J0537J1006J2002J3161J3405
59167A181007J2780J2087J1248R576P211M680J679k221o400j0152j3851j7681
59155A189963k0512k1691k2504k3930k4566k3038k0822j9996j9668j7629j4371
59144I61236j2206j1295r822p642o475o591o332m962l377k036o62J25n21j539
59130H87901j017Q26K153K692L810N658O959P607Q800J0515J1455J1620J2508
59117I71487J4520J6467J7762J8861J9547J9057J7913J7395J7243J6062J3937
59106A160251J2327J1562J0716R799R624R583Q053N118K553R77o50k657m033m335
$$ y = [992886, 996021, 1000299, 1004893, 1009199, 1013749, 1018844, 1023714, 1028053, 1032962, 1039282, 1046275, 1052990, 1059697, 1066858, 1073826, 1079772, 1084992, 1090343, 1096235, 1102979, 1111172, 1120896, 1131433, 1142439, 1154441, 1167602, 1181007, 1193787, 1205874, 1217122, 1226698, 1233909, 1238589, 1240268, 1238047, 1231647, 1221495, 1207644, 1189963, 1169451, 1147760, 1125256, 1101326, 1076760, 1053722, 1032900, 1012904, 993236, 975607, 961236, 949030, 937735, 927913, 920271, 913796, 907205, 900873, 895911, 892534, 890498, 889836, 889961, 889440, 887901, 886884, 887710, 889863, 892555, 896365, 902023, 908982, 916589, 925389, 935904, 947359, 958979, 971487, 986007, 1002474, 1020236, 1039097, 1058644, 1077701, 1095614, 1113009, 1130252, 1146314, 1160251, 1172578, 1184140, 1194856, 1204655, 1214279, 1223862, 1231915, 1237033, 1239586, 1240563, 1239913, 1237256, 1233223, 1228888]
59092A228888m072l224j466K16L26q68j949k882m719p249r359j1373j4407j7687
59078A150175j9190j8817j8263j7865j6433j4201j2956j2950j2407j0558q592
59067I87943p256n987m755m331m399l803k857l042m232m748m294m234m787m635
59053I24583l668l428m293m763m053l069k321j220J05N91K59K58O45M33j42K00
59037I00117J224J354O95J253L750O650Q805J0662J2483J3742J4636J5921J7012
59024A008304J6650J5499J5489J6457J6157J3924J1561J0134Q598O178L556J139
59012A143646j455l721m453l869l244k351J20L584N897O938Q827J2182J5025J6061
58998A193187J6223J6328J5851J4611J3157J1077P478L331P03n69k523n383p296
$$ y = [1228888, 1224816, 1221592, 1220126, 1220342, 1220668, 1219800, 1217851, 1214969, 1210250, 1203001, 1193642, 1182269, 1167862, 1150175, 1130985, 1112168, 1093905, 1076040, 1059607, 1045406, 1032450, 1019500, 1007093, 996535, 987943, 980687, 974700, 969945, 965614, 961215, 957412, 954555, 951513, 947281, 942533, 938239, 934005, 929218, 924583, 920915, 917487, 913194, 908431, 904378, 901309, 898988, 897768, 897873, 898464, 898723, 898981, 899626, 900059, 899917, 900117, 901341, 902695, 903390, 904643, 908393, 915043, 923848, 934510, 946993, 960735, 975371, 991292, 1008304, 1024954, 1040453, 1055942, 1072399, 1088556, 1102480, 1114041, 1124175, 1132773, 1138951, 1142507, 1143646, 1142191, 1138470, 1134017, 1130148, 1126904, 1124553, 1124673, 1128257, 1134154, 1141092, 1149919, 1162101, 1177126, 1193187, 1209410, 1225738, 1241589, 1256200, 1269357, 1280434, 1287912, 1291243, 1291946, 1291377, 1288854, 1283471, 1276175]
58985A276175p891q739r965r829q232p076o460m105M70M676O854Q284J0170J1896
58971A256228J3431J6080J9588K1640K1507K1109K1364K0802J8976J7687J7283
58960A465695J5169R900L674j211n462j0492j5771k0373k4681k8736l1129l1177
58948A325406l0078k8692k6390k3176k0466j8660j6423j3258j0318p873m826j505
58936A123741J37lL37J872K543J283l86j602l546o262p686p268p133q071p996
58921A079960n978m139l704k877o79P65J38m25R80K910L625M072N469O888P661
58906A094666R243J2312J4919J5854J6935J9704K2795K4851K6989K9981L2114
58895A320363L2381L2877L5351L8225L9598M0250M1149M0880L8374L5345L3288
$$ y = [1276175, 1268284, 1259545, 1249580, 1239751, 1231519, 1224443, 1217983, 1213878, 1214348, 1219024, 1225878, 1234162, 1244332, 1256228, 1269659, 1285739, 1305327, 1326967, 1348474, 1369583, 1390947, 1411749, 1430725, 1448412, 1465695, 1480864, 1490764, 1494438, 1493227, 1487765, 1477273, 1461502, 1441129, 1416448, 1387712, 1356583, 1325406, 1295328, 1266636, 1240246, 1217070, 1196604, 1177944, 1161521, 1148263, 1137945, 1130072, 1125246, 1123741, 1123878, 1123875, 1124212, 1126084, 1128627, 1129910, 1129524, 1127922, 1124376, 1118114, 1110428, 1103160, 1096027, 1087956, 1079960, 1073982, 1069843, 1066139, 1063262, 1062583, 1063348, 1063486, 1063061, 1064041, 1066951, 1070576, 1074648, 1080117, 1087005, 1094666, 1103909, 1116221, 1131140, 1146994, 1163929, 1183633, 1206428, 1231279, 1258268, 1288249, 1320363, 1352744, 1385621, 1420972, 1459197, 1498795, 1539045, 1580194, 1621074, 1659448, 1694793, 1728081]
58884A728081L0690K5904K0079J4598Q409O77o607j1585j5562k0368k5214k8786
58872A720316l1827l4833l5940l3980l1118k9571k8309k5752k3111k1961k1118
58861A402796j9051j7008j6691j7120j6736j6201j6328j5752j3633j2103j2947
58850A229226j4410j4355j3992j5167j6630j6489j5880j6574j7244j5805j3372
58839A059308j2228j1793j0173p982o999o724n607m206l810l511j782O00K067
58826I87160L091M664N874N852O115Q045J0041J0063Q937Q226P198M980L268L448
58812A076962L396P65k713l914l274l332m306m844n402p089q698q517p597p843
58798A013594q464p691o282n931n953m957m019m640n333l842j072O91J757L681
$$ y = [1728081, 1758771, 1784675, 1804754, 1819352, 1827761, 1828438, 1821831, 1810246, 1794684, 1774316, 1749102, 1720316, 1688489, 1653656, 1617716, 1583736, 1552618, 1523047, 1494738, 1468986, 1445875, 1423914, 1402796, 1383745, 1366737, 1350046, 1332926, 1316190, 1299989, 1283661, 1267909, 1254276, 1242173, 1229226, 1214816, 1200461, 1186469, 1171302, 1154672, 1138183, 1122303, 1105729, 1088485, 1072680, 1059308, 1047080, 1035287, 1025114, 1017132, 1010133, 1003409, 997802, 993596, 989786, 986275, 984493, 985093, 987160, 990251, 994915, 1000789, 1006641, 1012756, 1020801, 1030842, 1040905, 1049842, 1058068, 1065266, 1070246, 1073514, 1076962, 1080358, 1081123, 1078410, 1074496, 1071222, 1067890, 1063584, 1058740, 1053338, 1046249, 1037551, 1029034, 1021437, 1013594, 1005130, 997439, 991157, 985226, 979273, 974316, 970297, 965657, 960324, 956482, 955410, 956101, 957858, 961539]
58784I61539N714O275O225P157Q024P003N061M126L493J539q07j857k529m393
58770A006570o311o681p001r336j2217j2934j1974j1328j0449p937n174m173l755
58757H97300j949r4k71q44Q46L405L792K912L865O347P679P964R218J0770J0502
58742I61442R434J0143J1787J1540R845R395J0079R836R275J0470J2266J1887
58730A087399J0232J0425J2064J2147J0861J1087J2715J2835J1226J0389J0382
58719A211762Q716N400L070K123M21k236l982n125p784j1500j3734j4503j6092
58706A156536j8490j9598j9536k0191k1135k0579j9699k1063k3495k3482k1185
58695I28083j9829j9734j8213j5045j2698j1341q856n693m440m796m177k997l882
$$ y = [961539, 967253, 973528, 979753, 986910, 994934, 1001937, 1006998, 1011124, 1014617, 1016156, 1015349, 1013492, 1010963, 1006570, 1000259, 993578, 986577, 977241, 965024, 952090, 940116, 928788, 918339, 910402, 905228, 901055, 897300, 895351, 895257, 894986, 894142, 894988, 898393, 902185, 905097, 908962, 915309, 922988, 930952, 940170, 950940, 961442, 970876, 981019, 992806, 1004346, 1014191, 1023586, 1033665, 1043501, 1052776, 1063246, 1075512, 1087399, 1097631, 1108056, 1120120, 1132267, 1143128, 1154215, 1166930, 1179765, 1190991, 1201380, 1211762, 1220478, 1225878, 1228948, 1231071, 1231492, 1229256, 1225274, 1220149, 1212365, 1200865, 1187131, 1172628, 1156536, 1138046, 1118448, 1098912, 1078721, 1057586, 1037007, 1017308, 996245, 972750, 949268, 928083, 908254, 888520, 870307, 855262, 842564, 831223, 822367, 816674, 812234, 807438, 803261, 800264, 796382]
58682G96382o048o128m443m483o143n582k210K95O74J794M681O788P382R053J2513
58667H04525J5151J6119J7551J9606J9454J6531J3703J1912Q594K734l319q226
58655I34335j3113j7665j9573j8933j8506j8722j7199j3844j1505j0702q857n514
58643G60202l236k452o87K243L611L206L922N985O138L756K216K763K632P15l96
58628G90618L75P23l5N84L105M651M317M819P122Q610Q299Q721J0854J2221J1760
58613H76744J1556J2163J1178Q054N363L862J377k174l946l592m081n873n902
58600I04729l676k480l080k253P79K650K415L581P447J0605J1390J2606J5407
58587I60120J6733J5519J5297J7667J9120J7404J5254J4720J3553J0441Q240Q737
$$ y = [796382, 790334, 784206, 779763, 775280, 769137, 763555, 761345, 761640, 762314, 764108, 768789, 775577, 782959, 792012, 804525, 819676, 835795, 853346, 872952, 892406, 908937, 922640, 934552, 943146, 945880, 942561, 934335, 921222, 903557, 883984, 865051, 846545, 827823, 810624, 796780, 785275, 774573, 765716, 760202, 756966, 754514, 753827, 756070, 759681, 762887, 766809, 772794, 778932, 782688, 784904, 787667, 790299, 791014, 790618, 790993, 791716, 791681, 792265, 795370, 800021, 804338, 809157, 816279, 824889, 833188, 841909, 852763, 864984, 876744, 888300, 900463, 911641, 919695, 925058, 928920, 930297, 928123, 924177, 920585, 916504, 910631, 904729, 901053, 898573, 895493, 893240, 894019, 896669, 899084, 902665, 910112, 920717, 932107, 944713, 960120, 976853, 992372, 1007669, 1025336, 1044456, 1061860, 1077114, 1091834, 1105387, 1115828, 1124068, 1132805]
58575A132805R461Q858R415J2671J6271J8881K2792K8819L3932L6620L9301M2763
58563A412589M3895M1690L9627L9108L6412K9267K0710J3225N000m653j2139j5468
58551A649263j7623k0540k1347j8274j4606j3140j2204j0699j1421j5682k0211
58540A473516k3039k6824l2761l7082l7350l6474l6671l5373l1009k6775k4569
58529A125589k1254j5192j0364r418q637m617j12J582K356M459N561L591J297
58516A074841J027J66l525p158p893p702q558q308n759m276n807o877n077l605
58502A001489m804n313k684n88k103l895k557p41j288j247K271O114O929P440
58488I99023J0809J4317J4803J5042J8431K2559K4194K5530K9204L2256L1194
$$ y = [1132805, 1142266, 1151124, 1160539, 1173210, 1189481, 1208362, 1231154, 1259973, 1293905, 1330525, 1369826, 1412589, 1456484, 1498174, 1537801, 1576909, 1613321, 1642588, 1663298, 1676523, 1681523, 1676870, 1664731, 1649263, 1631640, 1611100, 1589753, 1571479, 1556873, 1543733, 1531529, 1520830, 1509409, 1493727, 1473516, 1450477, 1423653, 1390892, 1353810, 1316460, 1279986, 1243315, 1207942, 1176933, 1150158, 1125589, 1104335, 1089143, 1078779, 1069361, 1060724, 1056107, 1055995, 1057577, 1059933, 1064392, 1069953, 1073544, 1074841, 1075868, 1076034, 1072509, 1065351, 1057458, 1049756, 1041198, 1032890, 1027131, 1022855, 1017048, 1010171, 1005094, 1001489, 996685, 991372, 988688, 988100, 985997, 982102, 979545, 978804, 977516, 976269, 978540, 984654, 991583, 999023, 1009832, 1024149, 1038952, 1053994, 1072425, 1094984, 1119178, 1144708, 1173912, 1206168, 1237362]
58477A237362K8127K5825K1842J3624M402k207q323j6524k3637k6019k5852k6081
58465A202539k4385j8484j2037q805o139n98N374Q726J2058J7964K2750K2707
58453A221670K1038K1638K1497J6441Q876K704l848j2980k0568k2384k1647k2777
58441A209660k3127j8757j2887j0427r257n056J39K355L611P355J0993J1038J0673
58428A176313J4003J7855J7498J5397J5897J6402J2467O520K932n09p399j4262
58416A273114j6171j5797j7878j9906j7523j3950j4527j6718j5154j1788j1420
58405A102282j1958q884m707m276n251k950J73m31j843P94M334L383Q09K049M112
58390A077636J203l617l619n60m44j766O28M384L896J506L033O310N640L348N245
$$ y = [1237362, 1265489, 1291314, 1313156, 1326780, 1331182, 1328975, 1320652, 1304128, 1280491, 1254472, 1228620, 1202539, 1178154, 1159670, 1147633, 1138828, 1132689, 1132091, 1137465, 1146191, 1158249, 1176213, 1198963, 1221670, 1242708, 1264346, 1285843, 1302284, 1311160, 1313864, 1310016, 1297036, 1276468, 1254084, 1232437, 1209660, 1186533, 1167776, 1154889, 1144462, 1135205, 1130149, 1130288, 1132643, 1136254, 1143609, 1154602, 1165640, 1176313, 1190316, 1208171, 1225669, 1241066, 1256963, 1273365, 1285832, 1292352, 1295284, 1294775, 1287376, 1273114, 1256943, 1241146, 1223268, 1203362, 1185839, 1171889, 1157362, 1140644, 1125490, 1113702, 1102282, 1090324, 1081440, 1076733, 1072457, 1067206, 1064256, 1064429, 1063998, 1062155, 1062949, 1067283, 1070666, 1071475, 1073524, 1077636, 1078839, 1075222, 1071603, 1071043, 1070599, 1068833, 1069461, 1073845, 1077741, 1079247, 1082280, 1088590, 1094230, 1097578, 1102823]
58375A102823Q933Q420O118Q197J2387J2630J1497J5337K1293K2075J9645K1171
58363A270526K5109K4501K0512J9455J9849J5726R334P177O908J680n905p928
58351A406944n747o637r296o899j261M15k63L663J0030J1258R347J2289J8542
58338A442385K0120J8183K0203K4489K3153J7817J6611J8165J4469P117M539N513
58326A632764J811n170o877m282n355q516n605J063K189n66K147Q613R022M900
58312A626138O607J3264J4427J0362J1106J6470J6638J1888J1961J6427J5590
58301A770878J0306J0752J6121J5935J1040J2366J9238K0279J5634J6654K3427
58290A942630K4758K0645K2371K9733L0980K6021K6678L3117L3568K8275K9754
$$ y = [1102823, 1111756, 1120176, 1126294, 1134491, 1146878, 1159508, 1171005, 1186342, 1207635, 1229710, 1249355, 1270526, 1295635, 1320136, 1340648, 1360103, 1379952, 1395678, 1405012, 1412189, 1419097, 1420777, 1414872, 1406944, 1401197, 1394560, 1385264, 1378365, 1377104, 1377519, 1377256, 1380919, 1390949, 1402207, 1411554, 1423843, 1442385, 1462505, 1480688, 1500891, 1525380, 1548533, 1566350, 1582961, 1601126, 1615595, 1622712, 1627251, 1632764, 1634575, 1629405, 1622528, 1618246, 1612891, 1604375, 1598770, 1599833, 1602022, 1601456, 1603603, 1612216, 1621238, 1626138, 1632745, 1646009, 1660436, 1670798, 1681904, 1698374, 1715012, 1726900, 1738861, 1755288, 1770878, 1781184, 1791936, 1808057, 1823992, 1835032, 1847398, 1866636, 1886915, 1902549, 1919203, 1942630, 1967388, 1988033, 2010404, 2040137, 2071117, 2097138, 2123816, 2156933, 2190501, 2218776, 2248530]
58279B248530L8067M0187L5347L6255M3724M5354M0958M3465N2786N5105N0127
58268B729905N2113O1783O4673N9727O1241O9841P0439O1964N9666O4777O2041
58257C418170N0680M6909N2253N1112M3256M5851N9310O5021O1337O6846Q3191
58246D043936R0783Q6866R0739J05214J11012J05830J09878J25785J33116J29650
58236E132809J36621J55780J64515J61229J70540J95264K10039K11359K24976
58227F763132K54209K72098K75290K92418L27806L52460L62880L90411M39329
58218I730033M76891M98607N39152O04034O58667P00653P70564Q74396R72354
58209A5825351J062160J191140J367406J548661J739470K003456K358205K763686
$$ y = [2248530, 2286597, 2326784, 2362131, 2398386, 2442110, 2487464, 2528422, 2571887, 2624673, 2679778, 2729905, 2782018, 2843801, 2908474, 2968201, 3029442, 3099283, 3169722, 3231686, 3291352, 3356129, 3418170, 3468850, 3515759, 3568012, 3619124, 3662380, 3708231, 3767541, 3832562, 3893899, 3960745, 4043936, 4134719, 4221585, 4312324, 4417538, 4528550, 4634380, 4744258, 4870043, 5003159, 5132809, 5269430, 5425210, 5589725, 5750954, 5921494, 6116758, 6326797, 6538156, 6763132, 7017341, 7289439, 7564729, 7857147, 8184953, 8537413, 8900293, 9290704, 9730033, 10206924, 10705531, 11244683, 11848717, 12507384, 13208037, 13978601, 14852997, 15825351, 16887511, 18078651, 19446057, 20994718, 22734188, 24737644, 27095849, 29859535]
58201B9859535L236278L855139M628295N480428O401464P471486Q728759J0189302
58193G9850686J2009629J4415770J7464525K1134319K5560169L0592837L4958233
58186B35986168L6631480L4739636L0596536K5910854K0162328J0919565k818740
58179C92127827j8423536l1385613l8809472m0769324l8946745l4974995l0034047
58172A58784095k5031278k0532302j6686396j3461088j0847179q785818p111704
58165E6328330n695695m523753l577082k762171k007342j310395o52148L4446
58157C5834190P89466J607298K463742L242018L686487L619148L189682K692892
58149E7124923K102695J025909p55987k874191m646433n647021n892047n607164
$$ y = [29859535, 33095813, 36950952, 41579247, 47059675, 53461139, 60932625, 69661384, 79850686, 91860315, 106276085, 123740610, 144874929, 170435098, 201027935, 235986168, 272617648, 307357284, 337953820, 363864674, 384027002, 394946567, 392127827, 373704291, 342318678, 303509206, 262739882, 223793137, 188818142, 158784095, 133752817, 113220515, 96534119, 83073031, 72225852, 63440034, 56328330, 50632635, 46108882, 42531800, 39769629, 37762287, 36451892, 35799744, 35834190, 36623656, 38230954, 40694696, 43936714, 47623201, 51242349, 54432031, 57124923, 59227618, 60253527, 59497540, 56623349, 51976916, 46329895, 40437848, 34830684]
58141C4830684n012865m294224l593500k970576k427639j974339j624154j353450
58133A1579937j124442r34175p95087o89649n89936n00647m39964l98678l57247
58124E750112l21488l04158k92682k70260k47281k38424k30547k05908j75471
58115C463893j57516j44463j21938r9806r3375r3340q4205p4050p7352q6162q5973
58104B345713q2795q7874r2615q4986p4215p3847p6250o8577n8094n7282n9142
58093A530036n1490m1051l9778m1278l3860k3520k1637k2906j7170j0356j2512
58082A214478j7517j5309j1867j6759k3261k0986j6181j9425k4998k2374j6793
58071A009008j8562k2848j9707j3824j4956j8677j5629j0284j1953j6223j3649
$$ y = [34830684, 29817819, 25523595, 21930095, 18959519, 16531880, 14557541, 12933387, 11579937, 10455495, 9521320, 8726233, 8036584, 7446648, 6946001, 6506037, 6107359, 5750112, 5428624, 5124466, 4831784, 4561524, 4314243, 4075819, 3845272, 3639364, 3463893, 3306377, 3161914, 3039976, 2940170, 2846795, 2753455, 2669250, 2595200, 2517848, 2431686, 2345713, 2262918, 2175044, 2082429, 1997443, 1923228, 1849381, 1773131, 1704554, 1646460, 1589178, 1530036, 1478546, 1437495, 1397717, 1356439, 1322579, 1299059, 1277422, 1254516, 1237346, 1226990, 1214478, 1196961, 1181652, 1169785, 1153026, 1129765, 1108779, 1092598, 1073173, 1048175, 1025801, 1009008, 990446, 967598, 947891, 934067, 919111, 900434, 884805, 874521, 862568, 846345, 832696]
58060H32696q072q460j1198q037l131m906r201p511l883o757j1883j0130m755
58047G34772m518o942m525l91j835n311l467j09k756p372n910k044l872p969o376
58032F71375k716n398j1006j0431n982o465j0438r915o114o208q645o551j874
58019E79632j759m578l481K6l27k460J2M537L916Q7L15L344K580m96O66M546M475
58002E91035J511J740L863K091j691j228J685M81l433l622j307k592n917m779
57988E77837n83k97l487l868j685k468n335m632j539k170n588n377j719o28k413
57973E36048k112o7r69l678k928N4m78l560l156J99L78k706l299q74l47j935j147
57956E09423J649J807j55L52K421J185k141j923J157J366r78j39L905N454L909
$$ y = [832696, 824624, 816164, 804966, 796929, 793798, 788892, 779691, 772180, 768297, 761540, 749657, 739527, 734772, 730254, 723312, 718787, 718396, 716561, 711250, 707783, 707674, 704918, 697546, 691636, 689592, 685720, 677751, 671375, 668659, 663261, 652255, 641824, 635842, 629377, 618939, 609024, 602910, 596702, 588057, 581506, 579632, 577873, 573295, 569814, 569840, 569513, 567053, 567065, 571602, 575518, 575605, 575920, 579264, 581844, 581348, 582014, 586560, 591035, 592546, 594286, 598149, 600240, 598549, 597321, 599006, 599487, 596054, 592432, 591125, 588533, 582616, 577837, 577254, 576957, 573470, 569602, 567917, 565449, 560114, 555482, 553943, 551773, 546185, 540808, 539089, 538461, 536048, 533936, 533869, 532900, 529222, 526294, 526348, 525870, 522310, 519154, 519353, 519731, 517025, 513726, 512852, 512505, 510570, 509423, 511072, 512879, 512724, 513076, 515497, 516682, 514541, 512618, 513775, 515141, 514163, 514024, 517929, 523383, 527292]
57941E27292M329P289Q418P920J0406J5142J6552J4624J4843J7655J7942J5267
57929F77679J4471J5567J3250P333L636L336J292l699o692o197o578r113r774
57916F94511p765p412r635j0073p530o045o850o441m239m078o402o959m808l854
57902F02420m975m640k652l183o517p820n868n072o927p364m598k099j616n07
57888E38582K068L306K849L747N920N700L187K692M594M340J024o80J008K205
57874E80542R88L78J563J464p10j450K87J166K01O34L148M180K858K696M504M665
57858F07114K433J774L800M512K403J130K251K383J68r26N23J104n93j224M64
57843F27316P91j887l940l269k834m454n358m022l238m346m484k497j499k695
$$ y = [527292, 531621, 538910, 547328, 555248, 565654, 580796, 597348, 611972, 626815, 644470, 662412, 677679, 692150, 707717, 720967, 728300, 731936, 735272, 736564, 732865, 726173, 719976, 713398, 704285, 694511, 686746, 679334, 669699, 659626, 652096, 646051, 639201, 632760, 628521, 624443, 618041, 611082, 606274, 602420, 597445, 592805, 590153, 586970, 580453, 572633, 566765, 561693, 554766, 547402, 542804, 540705, 539089, 538582, 540650, 543956, 546805, 550552, 556472, 562172, 565359, 568051, 572645, 576985, 578009, 577329, 578337, 580542, 581530, 581908, 583471, 584935, 584225, 582775, 583062, 584228, 584429, 585063, 588211, 592391, 595249, 597945, 602449, 607114, 609547, 611321, 615121, 619633, 622036, 623166, 625417, 627800, 627968, 627042, 627565, 628669, 628076, 626852, 627316, 628107, 626220, 622280, 619011, 616177, 611723, 606365, 602343, 599105, 594759, 590275, 587778, 586279, 583584]
57829E83584k818o17L74j434k441n31J104J63p80K25Q71k72p98K10k81l110m385
57812E69064k348q43k407l917k834j843l276m594l498k162k361j746J068K986
57798E41289K091J581L996O557O478N874P155Q354P347O043O156N404K157o63
57784F09819n20L42l88n42J968M528M324L428M776O923P235O688P105P102N081
57769F67869K902K550K339L06j970k621l151n154o854o559o113p243q014o602
57755F21685n026n334n688m067k288k461k810j019J525K694L559N582P143O709
57741F20204O190P396Q278O579L988K971K597J248K04P40R04r46k576j704k89
57726F55784j083l033l915m438n875o752n694m587n103n356l763k737m377o009
$$ y = [583584, 580766, 580149, 580523, 579089, 576648, 576117, 577221, 577384, 576604, 576829, 577700, 577428, 576630, 576840, 576559, 573449, 569064, 566716, 565873, 563466, 559549, 556715, 554872, 551596, 547002, 543504, 541342, 538981, 537235, 538303, 541289, 543380, 544961, 548957, 555514, 561992, 567866, 575021, 583375, 590722, 596765, 602921, 608325, 610482, 609819, 609299, 609641, 609253, 608711, 610679, 615207, 619531, 622959, 627735, 634658, 641893, 648581, 655686, 662788, 667869, 670771, 673321, 675660, 675966, 673996, 671375, 668224, 663070, 656216, 649657, 643544, 636301, 628287, 621685, 616659, 611325, 605637, 601570, 599282, 596821, 594011, 592992, 594517, 597211, 600770, 606352, 613495, 620204, 626394, 633790, 642068, 648647, 652635, 655606, 658203, 659451, 659655, 660395, 661299, 660353, 657777, 656073, 655784, 654701, 651668, 647753, 643315, 637440, 630688, 624994, 620407, 615304, 609948, 606185, 603448, 599071, 593062]
57712E93062m479j632r16j611j138k39j065k585k630k134k920l650k369p28j212
57697E63754k581k361j469j914k355o58J430Q66j366k153j494j341j157P05K956
57682E50862L270K726L962O502Q211R682J2828J6712J9241K1499K6034L2322L8169
57669G52020M4214N2575O2198O9690P3664P4478P1230O2840N0493L5010J3924
57658A362336j4159m3855o6452p8102q0716p6647o7433n6391m7089l9404l1239
57647G60849k3437j8698j6610j4221j0957q669p440n615l534k992l429k651q76
57634F41720j96n23K7J277J422Q06J413L059L822L678M069M526L439J530Q30R48
57618F71847J05j025m32J134J218O2j05N44pj283q51J132K040J276O88P74L88
$$ y = [593062, 588583, 586951, 586035, 584424, 583286, 583047, 581982, 579397, 576767, 574633, 571713, 568063, 565694, 564966, 563754, 561173, 558812, 557343, 555429, 553074, 552416, 553846, 554712, 553346, 551193, 549699, 548358, 547201, 547906, 550862, 554132, 556858, 560820, 567322, 575533, 585215, 598043, 614755, 633996, 655495, 681529, 713851, 752020, 796234, 848809, 911007, 980697, 1054361, 1128839, 1200069, 1262909, 1313402, 1348412, 1362336, 1348177, 1304322, 1237870, 1159768, 1079052, 1002405, 934972, 878581, 831492, 792088, 760849, 737412, 718714, 702104, 687883, 676926, 668257, 660817, 655202, 651668, 648676, 645247, 642596, 641720, 641524, 641001, 641028, 642305, 643727, 644533, 645946, 649005, 652827, 656505, 660574, 665100, 668539, 670069, 670899, 671847, 671952, 670927, 670495, 671629, 672847, 672909, 672804, 673348, 673341, 672058, 671207, 672339, 674379, 675655, 676343, 677117, 677505]
57601F77505r5P04J846J192m50l41J391K053J147P48J263J017l7k25K33m45j759
57584F85747j472Q0L76o46n63Q23J022n49j697j533j423j593p56N19J78j311j322
57567F75880K59R13L03P79K592L072J539N93J486K315K054K267L536M082L291
57552G04961K930L579L570K687L168N590P414P102O326O626P175P247P654Q259
57538G84288P272M474K150J508J068j11p26P1J059J417J997L098L700L749M488
57523H19502N733N807M831M932O439P209O548O329P300P744P006O886Q181R189
57509I13636Q964Q837R409R330Q377Q440J0012J0917J0001Q862Q546P830O228
57496A029389N336N690N520M293M118N928P538P303O471O124N125L045J881K630
$$ y = [677505, 677410, 678114, 679960, 681152, 680702, 680361, 681752, 683805, 684952, 685700, 686963, 687980, 687943, 687718, 687951, 687506, 685747, 684275, 684355, 684731, 684085, 683522, 684345, 685367, 684818, 683121, 681588, 680165, 678572, 677816, 678335, 678513, 677202, 675880, 676139, 677052, 677355, 678134, 680726, 683798, 685337, 685930, 687416, 689731, 691785, 694052, 697588, 701670, 704961, 707891, 711470, 715040, 717727, 720895, 726485, 733899, 741001, 747327, 753953, 761128, 768375, 776029, 784288, 791560, 796034, 798184, 799692, 800760, 800649, 799923, 799994, 801053, 802470, 804467, 807565, 811265, 815014, 819502, 825235, 831042, 835873, 840805, 847244, 854453, 861001, 867330, 874630, 882374, 889380, 896266, 904447, 913636, 922600, 931437, 940846, 950176, 958553, 966993, 977005, 987922, 997923, 1006785, 1015331, 1023161, 1029389, 1034725, 1040415, 1045935, 1050228, 1054346, 1060274, 1067812, 1075115, 1081586, 1087710, 1092835, 1095880, 1097761, 1100391]
57482A100391L279K382J672K876M770N679O178P037P202O046N108N354N262L773
57468A167009K621L495N217N970O042O264O061N093M664N471O131N694N332N829
57454A240893N998N335N480P037P846O635N602O855Q960R611R290R542J0004R812
57440A348900R818J0734J1188J0194R519J0852J2668J2621J1250J0578J0724J0640
57428A479686J0574J1131J1314J0031Q346P886Q325Q553Q886R999J1112J1375
57416A597218J1577J2595J3635J3881J4117J4873J4900J3496J2364J2971J4081
57405A745708J4099J3820J4456J5048J4415J3705J4263J4907J4071J2912J3337
57394A900741J4579J4683J4007J4265J5347J5882J5896J6280J6630J6190J5833
$$ y = [1100391, 1103670, 1106052, 1107724, 1110600, 1115370, 1121049, 1127227, 1134264, 1141466, 1147512, 1152620, 1157974, 1163236, 1167009, 1169630, 1173125, 1178342, 1184312, 1190354, 1196618, 1202679, 1207772, 1212436, 1217907, 1224038, 1229732, 1235064, 1240893, 1246891, 1252226, 1257706, 1264743, 1272589, 1279224, 1284826, 1291681, 1300641, 1310252, 1319542, 1329084, 1339088, 1348900, 1358718, 1369452, 1380640, 1390834, 1400353, 1411205, 1423873, 1436494, 1447744, 1458322, 1469046, 1479686, 1490260, 1501391, 1512705, 1522736, 1531082, 1538968, 1547293, 1555846, 1564732, 1574731, 1585843, 1597218, 1608795, 1621390, 1635025, 1648906, 1663023, 1677896, 1692796, 1706292, 1718656, 1731627, 1745708, 1759807, 1773627, 1788083, 1803131, 1817546, 1831251, 1845514, 1860421, 1874492, 1887404, 1900741, 1915320, 1930003, 1944010, 1958275, 1973622, 1989504, 2005400, 2021680, 2038310, 2054500, 2070333]
57383B070333J6641J7732J7846J7805J8924K0355K0512J9828J9505J8919J7060
57372B275460J5187J5199J6401J6732J6169J6136J6527J6216J5618J5992J6931
57361B452568J7178J7177J8208J9785K0490K0580K1295K2376K2798K3039K4044
57350B679538K4972K4608K3930K4536K5523K4939K3403K3198K4384K4976K4466
57339B948473K4197K4501K4433K4076K4392K4987K4710K4079K4487K5424K5234
57328C218993K4261K4375K5644K6310K5924K5783K6321K6720K7007K7907K8832
57317C508077K8585K7857K8379K9830L0372K9993L0405L1763L2438L2186L2500
57306C842385L3591L3876L2979L2486L3231L4273L5075L6213L7536L7945L7501
$$ y = [2070333, 2086974, 2104706, 2122552, 2140357, 2159281, 2179636, 2200148, 2219976, 2239481, 2258400, 2275460, 2290647, 2305846, 2322247, 2338979, 2355148, 2371284, 2387811, 2404027, 2419645, 2435637, 2452568, 2469746, 2486923, 2505131, 2524916, 2545406, 2565986, 2587281, 2609657, 2632455, 2655494, 2679538, 2704510, 2729118, 2753048, 2777584, 2803107, 2828046, 2851449, 2874647, 2899031, 2924007, 2948473, 2972670, 2997171, 3021604, 3045680, 3070072, 3095059, 3119769, 3143848, 3168335, 3193759, 3218993, 3243254, 3267629, 3293273, 3319583, 3345507, 3371290, 3397611, 3424331, 3451338, 3479245, 3508077, 3536662, 3564519, 3592898, 3622728, 3653100, 3683093, 3713498, 3745261, 3777699, 3809885, 3842385, 3875976, 3909852, 3942831, 3975317, 4008548, 4042821, 4077896, 4114109, 4151645, 4189590, 4227091]
57295D227091L7560L8500L9400M0062M1095M2025M1691M0662M0815M2365M3662
57284D674928M4005M4258M4667M4624M4636M5968M8142M9351M9460M9929N0852
57273E190820N0889N0264N0705N2149N2613N1823N1784N3085N3814N3080N2435
57262E763461N2681N2368N0773M9452M9315M8892M7141M5576M5820M7204M8271
57251F300954M8783M8904M8339M7452M7430M8257M8475M7764M7647M8750M9717
57240F832472M9877N0613N2787N5065N6134N6468N6611N5887N4108N2498N1472
57229G423992M9582M6026M2285L9880L8414L7106L6408L6841L8054M0135M3895
57218G872618M8771N2631N4816N7189O0986O4951O7852P0331P2738P3611P2180
$$ y = [4227091, 4264651, 4303151, 4342551, 4382613, 4423708, 4465733, 4507424, 4548086, 4588901, 4631266, 4674928, 4718933, 4763191, 4807858, 4852482, 4897118, 4943086, 4991228, 5040579, 5090039, 5139968, 5190820, 5241709, 5291973, 5342678, 5394827, 5447440, 5499263, 5551047, 5604132, 5657946, 5711026, 5763461, 5816142, 5868510, 5919283, 5968735, 6018050, 6066942, 6114083, 6159659, 6205479, 6252683, 6300954, 6349737, 6398641, 6446980, 6494432, 6541862, 6590119, 6638594, 6686358, 6734005, 6782755, 6832472, 6882349, 6932962, 6985749, 7040814, 7096948, 7153416, 7210027, 7265914, 7320022, 7372520, 7423992, 7473574, 7519600, 7561885, 7601765, 7640179, 7677285, 7713693, 7750534, 7788588, 7828723, 7872618, 7921389, 7974020, 8028836, 8086025, 8147011, 8211962, 8279814, 8350145, 8422883, 8496494, 8568674]
57207H568674P0088O8822O7503O4992O2011N9464N6866N4275N3482N5221N7263
57196I238661N7301N5796N4203N2604N1127N1320N3797N6553N7808N8401N9298
57185I846869N9172N6957N4412N3403N2837N1120M9330M8917M8447M5968M2658
57174A0410090M0730L9439L6742L3336L1447L0994L0391K9895L0584L1200K9633
57163A0774481K6419K3338J9600J3035M032n372j5170k6448l7863m7030n4558
57152A0674464o2719p1069p7633q3443r1191r9927j05823j08038j09070j09432
57142I756119j06817j00812r3685q6067p6474o5485n5680m7091l7443k7321k0062
57131I039182j6147j2934j0463j1906j7671k4899l3551m6550o2436p4420p8484
$$ y = [8568674, 8638762, 8707584, 8775087, 8840079, 8902090, 8961554, 9018420, 9072695, 9126177, 9181398, 9238661, 9295962, 9351758, 9405961, 9458565, 9509692, 9561012, 9614809, 9671362, 9729170, 9787571, 9846869, 9906041, 9962998, 10017410, 10070813, 10123650, 10174770, 10224100, 10273017, 10321464, 10367432, 10410090, 10450820, 10490259, 10527001, 10560337, 10591784, 10622778, 10653169, 10683064, 10713648, 10744848, 10774481, 10800900, 10824238, 10843838, 10856873, 10860905, 10855533, 10840363, 10813915, 10776052, 10729022, 10674464, 10611745, 10540676, 10463043, 10379600, 10288409, 10188482, 10082659, 9974621, 9865551, 9756119, 9649302, 9548490, 9454805, 9368738, 9292264, 9226779, 9171099, 9124008, 9086565, 9059244, 9039182, 9023035, 9010101, 8999638, 8987732, 8970061, 8945162, 8911611, 8865061, 8802625, 8728205, 8649721]
57120H649721p5968o6766m7662k0167P498K9673M7816O3180P3151P8708Q7257
57109H826441J03293J23993J48448J82589K29823K86129L50530M31042N33973
57100A1216261O58061Q06915R95657J235730J524182J857213K240505K674542
57092B3209066L146141L650792M206938M827454N491906O167952O839144P480645
57084F5020038Q029081Q418839Q625802Q610508Q228216P294335N794026L968314
57076A23989159K128328M15030j208477k775942m222019n462405o478084p280554
57068I9105036p848329q143371q163136p942596p524714o957568o304126n624911
57060D0596285m954673m311635l718647l197034k748504k361579k030831j755614
$$ y = [8649721, 8573753, 8506987, 8459325, 8439158, 8446656, 8476329, 8524145, 8587325, 8660476, 8739184, 8826441, 8929734, 9053727, 9202175, 9384764, 9614587, 9900716, 10251246, 10682288, 11216261, 11874322, 12681237, 13676894, 14912624, 16436806, 18294019, 20534524, 23209066, 26355207, 30005999, 34212937, 39040391, 44532297, 50700249, 57539393, 65020038, 73049119, 81467958, 90093760, 98704268, 106932484, 114226819, 120020845, 123989159, 126117487, 126532517, 125324040, 122548098, 118326079, 112863674, 106385590, 99105036, 91256707, 83113336, 74950200, 67007604, 59482890, 52525322, 46221196, 40596285, 35641612, 31329977, 27611330, 24414296, 21665792, 19304213, 17273382, 15517768]
57052A5517768j526773j330464j161548j020495r01266p94669o99997o21539n56702
57043F904315m98514m46605m04907l71192l39289l09262k85362k66092k46017
57034C737075k25577k09597j97468j83941j68447j54881j43226j29957j15880
57025B208101j05192r7421q8218p7604o9629o4507n8697n2234m8293m5921m0827
57014A459558l3143k7017k2629j6013o711J782R161J8698L0520M1798N3654P0706
57002A580364R3892J20662J50950J84129K11088K20301K13018K00727J83615J42876
56992C301622O2469m7926j57964k39594k80888k84630k62153k27058j88983j52096
56982A522799j19175r3377p4939o0984n0789m6924m9156n2109n1680m9322m7351
$$ y = [15517768, 13990995, 12660531, 11498983, 10478488, 9577222, 8782553, 8082556, 7461017, 6904315, 6405801, 5959196, 5554289, 5183097, 4843808, 4534546, 4249184, 3983092, 3737075, 3511498, 3301901, 3104433, 2920492, 2752045, 2597164, 2453938, 2323981, 2208101, 2102909, 2005488, 1917270, 1839666, 1770037, 1705530, 1646833, 1594599, 1546306, 1500385, 1459558, 1426415, 1399398, 1376769, 1360756, 1354045, 1355827, 1364988, 1383686, 1414206, 1456004, 1509658, 1580364, 1674256, 1794918, 1945868, 2129997, 2341085, 2561386, 2774404, 2975131, 3158746, 3301622, 3364091, 3316165, 3158201, 2918607, 2637719, 2353089, 2090936, 1863878, 1674895, 1522799, 1403624, 1310247, 1235308, 1174324, 1123535, 1076611, 1027455, 975346, 923666, 874344, 826993]
56971H26993m4583l9675l4464l0673k6941k2051j7475j4074r973m274R67N050
56959E88827J0693J8748K4961K5614K2894K1000J9814J5896P338n200j9748l2641
56947F98196l9533l9438l5727l1400k6229j9941j4407j0386n732N41N917Q785
56935D90646J1709J7591K5525L3095L9379M3358M2929L8242L2310K5547J3627
56924H13958n687k7273m3866n3288n7074n5646m9312m1200l4644k9390k3861j8906
56912C73811j5931j3667j0427p364o101n390l489j582j381j639n11Q60O80K00
56898C08069J500L716M955N910Q003J0031J0353J0447J2711J6629K0495K4746
56886D37565K9855L3168L2022K8114K4653K0742J2887Q87j1740k2137k9224l1758
$$ y = [826993, 782410, 742735, 708271, 677598, 650657, 628606, 611131, 597057, 587084, 582810, 583777, 588827, 599520, 618268, 643229, 668843, 691737, 712737, 732551, 748447, 755785, 750585, 730837, 698196, 658663, 619225, 583498, 552098, 525869, 505928, 491521, 481135, 475403, 475944, 481861, 490646, 502355, 519946, 545471, 578566, 617945, 661303, 704232, 742474, 774784, 800331, 813958, 808271, 780998, 737132, 683844, 626770, 571124, 521812, 480612, 445968, 416578, 392717, 373811, 357880, 344213, 333786, 326422, 320321, 314931, 311442, 309860, 308479, 306840, 306329, 307189, 307869, 308069, 309569, 313285, 318240, 324150, 332153, 342184, 352537, 362984, 375695, 392324, 412819, 437565, 467420, 500588, 532610, 560724, 585377, 606119, 619006, 619893, 608153, 586016, 556792, 525034]
56874E25034k9191k3682j7900j1699l948L923R731J4370K0264K7315L4108M1764
56862E90089N2598O5539P6423Q2270Q2606P7699O8349N5786L8944J4218j8205
56851A186316m9869p0328p6781p3857o5982n4608m1423k8736j6632l781R203K0863
56839G34385L2392M6174O1946P8286R6029J15087J29374J31188J20799J05602
56829A651262Q8686O3902K4630k6497p8501j19404j41710j44724j34128j17502
56819A066014r8993p9313n9708m2512k7938j3849O54J4436K7504M1916N8532P4918
56807I61661Q6942R1140Q6416P5300O1931M6231K2255j3774n5250q9348j08510
56796A164994j13941j09504r7888q2656o8136n5520m2934l0164j9386j0867k170
$$ y = [525034, 495843, 472161, 454261, 442562, 438614, 442537, 452268, 466638, 486902, 514217, 548325, 590089, 642687, 708226, 784649, 866919, 949525, 1027224, 1095573, 1151359, 1190303, 1204521, 1186316, 1136447, 1066119, 989338, 915481, 849499, 794891, 753468, 724732, 708100, 704319, 713522, 734385, 766777, 812951, 874897, 953183, 1049212, 1164299, 1293673, 1424861, 1545660, 1651262, 1739948, 1803850, 1828480, 1801983, 1723482, 1604078, 1462368, 1317644, 1183516, 1066014, 967021, 887708, 828000, 785488, 757550, 743701, 744355, 758791, 786295, 828211, 886743, 961661, 1048603, 1139743, 1226159, 1301459, 1363390, 1409621, 1431876, 1418102, 1362852, 1273504, 1164994, 1051053, 941549, 843661, 761005, 692869, 637349, 594415, 564251, 544865, 533998, 531828]
56785E31828P567J6652K4747L3367M1512M5202M2926L7594L1440K2667Q885r194
56773H35193k8881m7261o0752o6291o4571n9484n3468m6130l7815l0849k6122
56762C13569k1879j7200j3539j1622r969p752o148n679n108m040l714m233l987
56749A98699k705k083k434j931j50P92j39j255j283j117j352r91J87Q18N71Q29
56733A86456J848K124J363J101J700J787J356K100L892M465L428L010L879L979
56719B22488K705K328L779M753L744K420K271K303J765J836K758K657R80p7O58
56704B57368J436J086J126K439L177K059O19J80l66j857k925k753k738l579l638
56689B51634k147r58j262j581q94o39j598j999q29N5p08j550j103p32j677k520
$$ y = [531828, 539395, 556047, 580794, 614161, 655673, 700875, 743801, 781395, 812835, 835502, 844387, 835193, 806312, 759051, 698299, 632008, 567437, 507953, 454485, 408355, 370540, 339691, 313569, 291690, 274490, 260951, 249329, 239360, 231608, 225460, 219781, 214673, 210633, 206919, 202686, 198699, 195994, 193911, 191477, 189546, 189396, 190188, 190049, 188794, 187511, 186394, 185042, 184051, 184238, 185056, 185627, 186456, 188304, 190428, 191791, 192892, 194592, 196379, 197735, 199835, 203727, 208192, 211620, 214630, 218509, 222488, 225193, 227521, 231300, 236053, 239797, 242217, 244488, 246791, 248556, 250392, 253150, 255807, 256787, 256710, 257368, 258804, 259890, 261016, 263455, 266632, 268691, 269310, 269490, 269124, 267267, 264342, 261589, 258851, 255272, 251634, 249487, 248529, 247267, 245686, 244792, 244153, 242555, 240556, 239727, 239782, 239074, 237524, 236421, 235689, 234012, 231492]
56673B31492j838o65j78L33J178Q78q86j840p22N57L88R4J035K177K690L784N736
56656B44213O305M552L062L849N198N068M460M758M811L548K467K734K728J151
56642B98904l82n77j138l330m998m183k704k915l786l501l123m216n451m985l902
56627B49713l854l793k325r65j558k704k082m10J76k68n52r95k061k419j244k94
56611B24365r67j670q93l07j627l064k239j99P56R45J618J825M60p96m2J448J649
56594B21262J365K028K366Q77p21k11J110Q87M8Q92K763L426L019L009K963J970
56578B47053J394K764M588M690L839L807L936L076K621M055N685N553N267P126
56564C05454R754J0764J1463J4542J9061K2091K3532K5077K6159K5227K3283K1924
$$ y = [231492, 229654, 228989, 228811, 229144, 230322, 231200, 230314, 228474, 227752, 228309, 228697, 228791, 229826, 232003, 234693, 238477, 244213, 250518, 255070, 258132, 261981, 267179, 272247, 276707, 281465, 286276, 289824, 292291, 295025, 297753, 298904, 298522, 297945, 296807, 293477, 288479, 284296, 281592, 278677, 274891, 271390, 268267, 264051, 258600, 253615, 249713, 245859, 242066, 239741, 238776, 237218, 234514, 232432, 232022, 232198, 231930, 231378, 230383, 228322, 225903, 224659, 224365, 223398, 221728, 220835, 220528, 218901, 215837, 213598, 213399, 214155, 215100, 216718, 218543, 219003, 218207, 218165, 219613, 221262, 222627, 224655, 227021, 227898, 227177, 226966, 228076, 228963, 229011, 229903, 232666, 236092, 239111, 242120, 245083, 247053, 248447, 251211, 255799, 260489, 264328, 268135, 272071, 275147, 277768, 281823, 287508, 293061, 298328, 305454, 315208, 325972, 337435, 351977, 371038, 393129, 416661, 441738, 467897, 493124, 516407, 538331]
56552E38331J9710J4713Q868N354L466O61k206k528j241j550l541m799n207o513
56538E63518q264q811r183j1373j3934j3964j2415j2632j4584j5274j4082j2942
56526D16060j2072j0214q383q738j0290j0193q628p986q084o825m769m336n180
56513C10362m952l939m289n473n205m134m717o188n621l421k684l618l601k392
56499B50128k182k761j768M09R65j77m38M03K02p62m5J972K381J026O20J615J871
56482B53459J327J904K974K009k31m52J247J541j0m90N64N61n71P7K539L314J467
56465B71229J4K35m4j401j476P3M66j031j712m72N20L69Q01J935J589j24l28J398
56447B72041K144J075P39J985K464J457J236K410K709J593J277K010J296j084
$$ y = [538331, 558041, 572754, 581622, 586976, 590442, 591103, 588897, 586369, 585128, 583578, 580037, 575238, 570031, 563518, 555254, 546443, 537260, 525887, 511953, 497989, 485574, 472942, 458358, 443084, 429002, 416060, 403988, 393774, 385391, 376653, 366363, 356170, 347542, 339556, 331472, 324647, 319878, 315542, 310362, 305410, 301471, 297182, 291709, 286504, 282370, 277653, 271465, 265844, 262423, 259739, 256121, 252520, 250128, 247946, 245185, 243417, 243826, 244791, 244614, 244176, 244579, 244781, 244019, 243974, 245946, 248327, 249353, 249973, 251588, 253459, 254786, 256690, 259664, 261673, 261442, 260990, 262237, 263778, 263768, 263278, 263842, 264403, 263832, 263909, 266448, 269762, 271229, 271243, 271478, 271434, 270033, 268557, 268630, 269096, 268065, 266353, 265881, 266401, 266770, 267571, 269506, 271095, 270971, 270643, 272041, 274185, 275260, 275999, 277984, 280448, 281905, 283141, 285551, 288260, 289853, 291130, 293140, 294436, 293352]
56433B93352k163j048k59p98p96o9p96k675k609l94O68j84q2J443J239j102j718
56416B82009P39K628J776P61J417J563k15j768j849k393m042m301k380j016j367
56401B71562j115M99R16m32m83J679K838J651J144K844M075L498L708N603N912
56386C03899L321J462K572L726K545J344K119K636J088l14P5K0j928l156j824
56371C17585l74q90j501n37K33m19n11R08J493L83L86K596L860K492J309K103
56355C29116K470J178J120L518M870L255K064L653M918L236J267J617K066N31
56341C64879n41Q68K098J014L92K596M862M482L744N100O323N173M116N618P320
56326D18044O640N585O321O599M338K118K340K529K14k088j634o01j647k838j942
$$ y = [293352, 291189, 290141, 289882, 289084, 288288, 288219, 287423, 284748, 282139, 281745, 282413, 282229, 282147, 283590, 284829, 283727, 282009, 282748, 285376, 287152, 287913, 289330, 290893, 290678, 288910, 287061, 284668, 280626, 276325, 273945, 272929, 271562, 270447, 270946, 271862, 271430, 270947, 272626, 275464, 277115, 278259, 281103, 285178, 288676, 292384, 297987, 303899, 307220, 308682, 311254, 314980, 317525, 318869, 320988, 323624, 324712, 324398, 324473, 324493, 322565, 319409, 317585, 317211, 316321, 314820, 314283, 314516, 314097, 313586, 314494, 315987, 316370, 316756, 319352, 323212, 325704, 327013, 329116, 331586, 332764, 333884, 337402, 342272, 345527, 347591, 351244, 356162, 359398, 360665, 362282, 364348, 364879, 364338, 365206, 367304, 368318, 368710, 371306, 376168, 380650, 384394, 389494, 395817, 400990, 405106, 410724, 418044, 424684, 430269, 436590, 443189, 447527, 449645, 451985, 454514, 454728, 452640, 451006, 450405, 448758, 445920, 443978]
56311D43978j143k527l432j313J246J305R16K710M693M543M517O905R198Q863
56297D80459Q353J0215J1926J0854R538J0591J1328R120P169Q923J1480J0791
56285F00747Q844R409J1056J0763J0239J2236J4548J4023J2673J3721J5408J4843
56273G48510J3998J5874J8703J9937K1756K6569L1396L2964L3955L7920M2572
56262A044154M4750M7311N4066O2377O8105P3583Q3178R5014J04763J13896J26492
56251A917689J41360J54873J68259J84579K01652K15276K26391K37922K47821
56242C695822K52273K52379K50548K43866K28276K05758J80211J50057J12395
56233E571585P0551K9710j1078n4580r6930j31878j60007j85476k06964k20323
$$ y = [443978, 442835, 440308, 436876, 435563, 436809, 438114, 439030, 441740, 446433, 450976, 455493, 462398, 471596, 480459, 488812, 499027, 510953, 521807, 531345, 541936, 553264, 562384, 569553, 578476, 589956, 600747, 609591, 619000, 630056, 640819, 651058, 663294, 677842, 691865, 704538, 718259, 733667, 748510, 762508, 778382, 797085, 817022, 838778, 865347, 896743, 929707, 963662, 1001582, 1044154, 1088904, 1136215, 1190281, 1252658, 1320763, 1394346, 1477524, 1572538, 1677301, 1791197, 1917689, 2059049, 2213922, 2382181, 2566760, 2768412, 2983688, 3210079, 3448001, 3695822, 3948095, 4200474, 4451022, 4694888, 4923164, 5128922, 5309133, 5459190, 5571585, 5642136, 5671846, 5660768, 5606188, 5509258, 5377380, 5217373, 5031897, 4824933, 4604610]
56223D604610k27029k31553k33249k29045k21155k13828k05524j92582j77605
56214B673040j65824j56232j44636j32313j23110j15275j04861r4015q7103q1935
56204A467736p3777o4688n9617n6632n0562m3183l9919l9354l5988l0663k8286
56193I45067k7778k4279j8980j6786j6605j3860j0165j0366j2490j0914p157o979
56181G68708r219q172m850m847p099n843k037j610l938l188L09J101l46J145M632
56166G24746M681K443L851P929Q392N731O207R815J0872R617J1488J5750J6634
56153H38156J5029J7136K2236K3867K2526K4901L1014L4523L5488M0290M8935
56142A154101N5010N8337O5271P6231Q5410R2943J04767J20218J32381J40806
$$ y = [4604610, 4377581, 4146028, 3912779, 3683734, 3462579, 3248751, 3043227, 2850645, 2673040, 2507216, 2350984, 2206348, 2074035, 1950925, 1835650, 1730789, 1636774, 1549671, 1467736, 1393959, 1329271, 1269654, 1213022, 1162460, 1119277, 1079358, 1040004, 1004016, 973353, 945067, 917289, 893010, 874030, 857244, 840639, 826779, 816614, 806248, 793758, 782844, 775687, 768708, 759489, 751317, 746467, 741620, 734521, 728678, 726641, 725031, 721093, 717905, 718214, 719315, 718969, 720114, 724746, 729427, 731870, 735721, 743650, 752042, 757773, 763980, 773795, 784667, 794284, 805772, 821522, 838156, 853185, 870321, 892557, 916424, 938950, 963851, 994865, 1029388, 1064876, 1105166, 1154101, 1209111, 1267448, 1332719, 1408950, 1494360, 1587303, 1692070, 1812288, 1944669, 2085475]
56132B085475J51130J62041J65805J61907J56934J50696J36322J14737R5181Q0344
56122C460572O4597M7777L6586L0862K2325Q615m708j6959l3174n1327o3113o8889
56110C433164p7814r2035j05025j16274j32267j51385j63280j65183j63930j60529
56100B105442j48415j28756j11367r8260q2207o3423n1110m6135l9110k8253k2118
56089A286288k1934j8646j0660o922q918p376m80K526k16O12O884R031N047M798
56075A240034J0719J2987Q926Q266J3744J5624J0992R329J3186J2862O152L636
56063A366457Q140R061L452K235Q670J1433O432M662J0727J4467J1709J2266J9408
56050A489119K2660J8971J9411K6814K8985K2398J9819K5881K8447K3155K2430
$$ y = [2085475, 2236605, 2398646, 2564451, 2726358, 2883292, 3033988, 3170310, 3285047, 3380228, 3460572, 3525169, 3572946, 3609532, 3640394, 3662719, 3671334, 3666626, 3649667, 3616493, 3565166, 3502053, 3433164, 3355350, 3263315, 3158290, 3042016, 2909749, 2758364, 2595084, 2429901, 2265971, 2105442, 1957027, 1828271, 1716904, 1618644, 1536437, 1473014, 1421904, 1375769, 1336659, 1308406, 1286288, 1264354, 1245708, 1235048, 1228126, 1219208, 1211832, 1211352, 1213878, 1213662, 1214274, 1221158, 1230189, 1235236, 1240034, 1250753, 1263740, 1272666, 1280932, 1294676, 1310300, 1321292, 1330621, 1343807, 1356669, 1362821, 1366457, 1374597, 1383658, 1387110, 1389345, 1398015, 1409448, 1415880, 1420542, 1431269, 1445736, 1457445, 1469711, 1489119, 1511779, 1530750, 1550161, 1576975, 1605960, 1628358, 1648177, 1674058, 1702505, 1725660, 1748090]
56039A748090L0553L4387K8985K7484L5010L8219L1904K9976L8168M2342L6296
56028B121414L4382M3378M9110M4627M4035N4009N9665N3626N0888N9387O4538
56017B679059N8723N6798O6108P1197O5014O4404P7262Q6055Q1879Q2145R5748
56006C484392J04498R8935R7735J10765J18665J11117J08556J22904J34389J31394
55996D623350J34309J54542J70085J68487J72723J96359K15864K16924K23819
55987F276462K51623K75279K79087K89350L23097L53763L64331L83146M28493
55978I224631M71402M94049N28482N94502O59026P02891P64506Q68383R77929
55969A5285801J071446J192665J369738J562692J753032K001755K352537K769597
$$ y = [1748090, 1778643, 1813030, 1842015, 1869499, 1904509, 1942728, 1974632, 2004608, 2042776, 2085118, 2121414, 2155796, 2199174, 2248284, 2292911, 2336946, 2390955, 2450620, 2504246, 2555134, 2614521, 2679059, 2737782, 2794580, 2860688, 2931885, 2996899, 3061303, 3138565, 3224620, 3306499, 3388644, 3484392, 3588890, 3687825, 3785560, 3896325, 4014990, 4126107, 4234663, 4357567, 4491956, 4623350, 4757659, 4912201, 5082286, 5250773, 5423496, 5619855, 5835719, 6052643, 6276462, 6528085, 6803364, 7082451, 7371801, 7694898, 8048661, 8412992, 8796138, 9224631, 9696033, 10190082, 10718564, 11313066, 11972092, 12674983, 13439489, 14307872, 15285801, 16357247, 17549912, 18919650, 20482342, 22235374, 24237129, 26589666, 29359263]
55961B9359263L243147L852584M641979N543182O511524P618427Q928277J0444552
55953H0142935J2280207J4683980J7778284K1522870K6032367L1393907L6711825
55946B40546375L9880319L9252702L5440137L0419272K4586652J5785979K134938
55939D28046374j4741604l0235041m0367992m4266919m3433004l9761870l4662527
55932A80577417k9200223k4135288j9767825j6086886j3072637j0711213q863633
55925E8739712p349162o108857n148489m396834l753372l207466k788696k456944
55917B3529892k147218j867838j656457j488345j316370j154560j039253r50533
55909A1909318q48669p47830o81762o34192n70815n04661m65807m39730l96513
$$ y = [29359263, 32602410, 36454994, 41096973, 46640155, 53151679, 60770106, 69698383, 80142935, 92423142, 107107122, 124885406, 146408276, 172440643, 203834550, 240546375, 280426694, 319679396, 355119533, 385538805, 410125457, 425911436, 428046374, 413304770, 383069729, 342701737, 298434818, 255001814, 215239944, 180577417, 151377194, 127241906, 107474081, 91387195, 78314558, 67603345, 58739712, 51390550, 45281693, 40133204, 35736370, 31982998, 28775532, 25986836, 23529892, 21382674, 19514836, 17858379, 16370034, 15053664, 13899104, 12859851, 11909318, 11060649, 10312819, 9631057, 8996865, 8426050, 7921389, 7455582, 7015852, 6619339]
55900F619339l49580l27474l16976k89579k56416k43797k40676k21409j95813
55891D177619j87624j86718j69873j46921j40788j42629j30393j12079j08344
55882B852250j11185j00701q4829q2886q6915p7611o2187n9242o1993n2847l9264
55871B032590l9554m7304m4324l5362l6518m2510l8156k9681l2491l9955l5670
55860A611065k5109k4317k8465k2106j0165q773j4790j3451p352r762j7801j9571
55848A409403j9476k9521m3560m6513m1449m1998m5778m0801l0755k8525l1334
55837A009693k6984j8287j7177k0856j7587j0174j0256j5033j2714n604n118r164
55825H40739o853n75j271o571n446M3q77o055m561J852K496j033J671Q845R798
$$ y = [6619339, 6269759, 5942285, 5625309, 5335730, 5079314, 4835517, 4594841, 4373432, 4177619, 3989995, 3803277, 3633404, 3486483, 3345695, 3203066, 3072673, 2960594, 2852250, 2741065, 2640364, 2555535, 2472649, 2385734, 2308123, 2245936, 2186694, 2124701, 2071854, 2032590, 1993036, 1945732, 1901408, 1866046, 1829528, 1787018, 1748862, 1719181, 1686690, 1646735, 1611065, 1585956, 1561639, 1533174, 1511068, 1500903, 1492130, 1477340, 1463889, 1456537, 1446775, 1428974, 1409403, 1389927, 1360406, 1316846, 1270333, 1228884, 1186886, 1141108, 1100307, 1069552, 1041027, 1009693, 982709, 964422, 947245, 926389, 908802, 898628, 888372, 873339, 860625, 855021, 849903, 840739, 833886, 833311, 832040, 825469, 820023, 820066, 819189, 813134, 808573, 810425, 812921, 811888, 813559, 822404, 832202]
55810H32202N770P019J2129J0580L345Q71K798o08q690j1535r313j1443j7769
55797H15356j9117j5593j6165k0867k1060j6720j6096j9007j7423j1895j0615
55786F30798j2913j0322l294l26j214K300R710J2097R060R029J2572J1409M528
55773F73434k71j481n331j1653j3254j0099r658j2561j2069q088p424r911q585
55760E63049m092m467j0008j2568j0632j1005j4613j4844j1068j0035j2421j1618
55748D35678p193o067q908q666m290k656n166n444k166j378m079m149o12M85j691
55733C73698r35L538N109K290J191L352L045j010k993j457j860n340o340l723
55719C68565k990n155m667p00P51j593j849J459K547l03j526R64K517J813L357
$$ y = [832202, 837972, 844991, 857120, 867700, 871045, 871916, 874714, 874106, 865416, 853881, 844568, 833125, 815356, 796239, 780646, 764481, 743614, 722554, 705834, 689738, 670731, 653308, 641413, 630798, 617885, 607563, 604269, 603943, 602729, 605029, 614739, 626836, 635896, 644925, 657497, 668906, 673434, 673163, 671682, 666351, 654698, 641444, 631345, 621687, 609126, 597057, 588969, 581545, 571634, 563049, 558957, 554490, 544482, 531914, 521282, 510277, 495664, 480820, 469752, 459717, 447296, 435678, 428485, 422418, 413510, 404844, 400554, 397898, 392732, 387288, 385122, 383744, 379665, 375516, 374904, 375389, 373698, 372763, 376301, 381410, 383700, 384891, 388243, 391288, 390278, 387285, 385828, 383968, 378628, 372288, 368565, 365575, 360420, 355753, 355053, 355804, 354211, 352362, 353821, 356368, 356065, 354539, 355503, 358020, 359833, 363190]
55704C63190P370Q049M666L549O251O495K021j376r11j199m075m572r74J293l21
55689C89456j206R66K068M59M70L361M211J505N25L415N232L548K754M916N632
55674D27312K996J592L450L929Q38j151N43J693k12j157J200K823J225J28J718
55659D46927K054j317m574m836m937o964q140p052o960r184j0198q646q082r587
55645C58504r208n954m513o546p258m271j950k971l592j458k31k092l253j432
55631C03775l34k250l576k112j468l684m882k857j671l860n391l354j470k735
55617B64131l677j396N21j156l011j295J382J327J52M12L31j871l446k066l96
55602B49942r95j617n7J315K75j019o54p16k427k868o15Q06q15k150n34J276P17
$$ y = [363190, 370560, 378609, 383275, 386824, 393075, 399570, 401591, 400215, 399304, 398105, 394030, 389458, 388484, 389777, 389456, 388250, 389216, 391284, 391743, 392213, 395574, 399785, 401290, 401815, 405230, 410462, 414010, 416764, 421680, 427312, 430308, 431900, 435350, 439279, 440117, 438966, 439509, 441202, 440990, 439833, 441033, 443856, 445081, 445209, 446927, 448981, 447664, 443090, 438254, 433317, 426353, 418213, 411161, 404201, 395017, 384819, 376173, 368091, 358504, 349296, 343342, 338829, 332283, 325025, 320754, 318804, 315833, 312241, 310783, 310552, 308460, 305207, 303775, 303441, 301191, 297615, 295503, 294035, 290351, 285469, 282612, 280941, 277081, 271690, 268336, 266866, 264131, 260454, 259058, 259579, 258423, 255412, 254117, 255499, 256826, 256978, 257390, 257721, 255850, 252404, 250338, 249942, 248947, 247330, 247273, 248588, 248863, 247844, 247190, 246474, 244047, 241179, 240564, 241370, 240555, 238405, 237871, 239147, 239864]
55585B39864Q3J292J683m15j676J20J652L56o59J201K678P49j551p51Q88L12l32
55568B45494J721M064L481J849K255L432L076K674M056N139L842K299K654K919
55554B88955J301K47J704K854J174q68o67l82k279l933k953j817l001l926j945
55539B74464K73m10j807q98L62q30k416j616o11k344m519l641j428j420k570j930
55523B48659n25r12j981j524j041k699m503l702j996k267l186k216q71j685l004
55508B16547k057k73l23p68R65L160K751J038J139K218J553k9PQ57K41r04m01
55491B25721O59J68n91N72K204J734K44P2J97j390l254l125k465l647n117m100
55475B07882j752q82r73j46N10p15j989r66N56k42j978j791o28q51j289J80J668
$$ y = [239864, 239947, 241239, 242922, 242507, 240831, 240951, 242603, 242959, 242300, 243501, 246179, 246928, 245377, 244626, 245514, 245826, 245494, 247215, 251279, 254760, 256609, 258864, 262296, 265372, 268046, 272102, 277241, 281083, 283382, 286036, 288955, 290256, 290503, 292207, 295061, 296235, 295367, 294700, 294318, 292039, 288106, 285153, 283336, 280335, 276409, 274464, 274737, 274327, 272520, 271622, 271984, 271154, 268738, 267122, 266511, 264167, 259648, 256007, 254579, 253159, 250589, 248659, 248134, 247222, 245241, 243717, 242676, 239977, 235474, 231772, 229776, 227509, 224323, 222107, 221236, 219551, 216547, 214490, 214217, 213894, 213126, 214091, 217251, 220002, 221040, 222179, 224397, 225950, 225921, 225928, 226785, 227026, 226122, 225721, 226380, 226548, 225957, 226529, 228733, 230467, 230711, 230783, 230980, 229590, 226336, 223211, 220746, 217099, 211982, 207882, 206130, 205248, 204275, 204129, 204639, 203924, 201935, 200969, 201525, 201283, 199305, 197514, 196886, 196035, 194746, 194926, 196594]
55458A96594L27k097k059k88K31J7J310K758J561r97j614q22j330k404j416O90
55442A90461R82M8M81J504N39j342j055P23Q84l55m35J97p55k149j009J564J791
55425A92074k04q04N98J102j0l60O79J180P94J138K088J899Q14N49Q10J91m08
55408B02130N79J583J28k331k410m65M49J66R86K560K279K52q71o89j048j811
55392B01487j161M41R04N20J010J542J54j835j562K22M97n30k13J137Q72o48n68
55375B02269R44Q97r80j910j228j025j616j205nj17j252j107J38R8j206j460n07
55358A90728k21m04O66K143J733K95N14J608N51j960k231q3Q79l40r79j21j09
55341A92669j609k359j606j099j071R8J829J691Q5j24J105J025m21l49J382J674
$$ y = [196594, 196921, 194824, 192765, 192477, 192708, 192725, 194035, 196793, 198354, 197357, 195743, 194921, 193591, 191187, 189771, 190461, 191443, 191491, 191972, 193476, 194015, 192673, 191618, 192341, 193225, 192870, 192435, 192632, 191877, 189728, 188719, 190283, 192074, 191870, 191066, 191664, 192766, 192756, 192396, 193075, 194255, 195049, 196187, 198275, 200174, 200988, 201537, 202347, 202538, 202130, 202709, 204292, 204420, 202089, 199679, 199214, 199663, 199829, 200815, 203375, 205654, 205906, 205035, 204346, 203298, 201487, 200326, 200767, 201671, 202191, 203201, 204743, 204897, 203062, 201500, 201722, 202219, 201689, 201476, 202613, 203485, 202837, 202269, 203213, 204110, 203130, 201220, 199992, 198967, 197351, 196146, 196141, 196024, 194772, 193665, 193803, 193901, 192695, 191235, 190728, 190507, 190103, 190769, 192912, 194645, 194940, 195454, 197062, 197613, 195653, 193422, 193339, 194218, 193878, 192899, 192778, 192669, 191060, 188701, 187095, 185996, 184925, 185023, 186852, 188543, 188628, 188504, 189609, 190634, 190213, 189864, 191246, 192920]
55325A92920Jo25O26R88m19r23N18J471Q09M92J219R70o66j260q2N90n7o8R33
55306A97437P21r14j181N94J528L02q24o19q86k207k293m72O29k07o90M33J051
55289A92402r1r52j54N54p2m90L12P99J06j92O54J040L10N3O89M48q37q48Q60
55270A94591J600L15m90O56J630P71m09n32o56j325j029M63R06l92j072j3O71
55253A95685j08k58J281K091N13j327j266l78j26K83J327J288n02j767r63J52
55237A95925r3n52r9N8p71p82R92K420J738L71Q9J94k34k21O98Q60n59j674j091
55218A97269j93l34n73o8J54l64k88N58K96j285j591L10J733R51OO15J080n2r81
55199A97243j84N31l95j052M07K050J374n90j543j667k014j725k2J392R29q3R2
$$ y = [192920, 192921, 192296, 192922, 193910, 193491, 192568, 193086, 194557, 195366, 195858, 197077, 198047, 197381, 196121, 196039, 196629, 196572, 196504, 197437, 198158, 197244, 196063, 196657, 198185, 198487, 197663, 197044, 196158, 193951, 191658, 191186, 191815, 191608, 190918, 191351, 192402, 192311, 191359, 191205, 191759, 191687, 191197, 191509, 192308, 192414, 192222, 192876, 193916, 194226, 194279, 194968, 195416, 194579, 193731, 194591, 196191, 196506, 196016, 196672, 198302, 199073, 198664, 198132, 197476, 196151, 195122, 195585, 196491, 196099, 195027, 195014, 195685, 195577, 195319, 196600, 198691, 199204, 197877, 196611, 196233, 196107, 196390, 197717, 199005, 198503, 196736, 195773, 195925, 195832, 195280, 195181, 195239, 194468, 193686, 194678, 197098, 198836, 199207, 199296, 199490, 199256, 199035, 199733, 200593, 200034, 198360, 197269, 197076, 196742, 196169, 196101, 196255, 195891, 195603, 196161, 196457, 195172, 193581, 193891, 195624, 196575, 196581, 197196, 198276, 198224, 197243, 197059, 197590, 197195, 196143, 196550, 198600, 199974, 199384, 197841, 196174, 194160, 192435, 192413, 193805, 194734, 194651, 194743]
55182A94743O17K82J38J183J842O81p42n07M29M13J70R27J681J210O12J146J675
55165B06500Q86j29n7J75l66l58J126K200J236r8K03R42J54j197j163l19k05k38
55147B09292P02J490O53p28r17n55r52j259k81Q24N62J1O62J331L10j209j106
55130B08830o7j67j153j331q10q44j177q24l03m50k93J188K630K255Q17Q0j11
55113B08270o09n96P60J894J098l60k23J045J516J235J383J373k4j715j633j46
55097B13268O91M99M67P45N78L08Q04J618J851J871K235K186J206N72J194J586
55081B31679L26j229j184l48n29j238r08J01N09O47J281J424P8j291q56M68P34
55064B29664K73L91M15q79k383k324j423j382j635q00J56m34j465p62R12J072
$$ y = [194743, 195360, 195642, 195780, 196963, 198805, 199486, 198744, 198237, 198666, 199079, 199249, 200176, 201857, 203067, 203679, 204825, 206500, 207386, 207257, 207200, 207375, 207009, 206651, 207777, 209977, 211213, 211115, 211318, 212260, 212414, 211217, 210054, 209735, 209530, 209292, 209994, 211484, 212137, 211409, 210492, 209937, 208985, 207726, 207445, 208269, 208831, 208842, 209504, 210835, 211145, 209936, 208830, 208763, 208596, 207443, 206112, 205302, 204458, 203281, 202457, 202154, 201704, 201411, 202599, 205229, 207484, 208301, 208381, 208270, 207661, 207065, 207825, 209719, 210817, 210457, 210234, 211279, 212795, 214030, 215413, 216786, 216762, 215047, 213414, 213268, 213959, 214458, 214925, 215670, 216248, 216556, 217360, 218978, 220829, 222700, 224935, 227121, 228327, 228899, 230093, 231679, 232005, 230776, 229592, 229244, 228715, 227477, 226569, 226670, 227179, 227826, 229107, 230531, 230609, 229318, 228462, 228930, 229664, 229937, 230328, 230743, 229864, 227481, 225157, 223734, 222352, 220717, 219917, 220073, 219639, 218174, 217412, 218324, 219396]
55048B19396k28q61m99n18p64J08J544J670N85m5j23q33j735j336n1M18K06P71
55030B17705J744J400r4r08p57r17j382r10L56J015R31J038J083J77r23p24L14
55013B19148O51M74R56J498O36q95j122k19K9l35K23J442J475K82l03K09N48M52
54995B25149R38J852J904J164R21J205R52M01P48J631J488K25q53j369j845j946
54979B32565j189o36j306j818l31K124L165K843K799K764J407k57p3J249J156
54964B44462j97l18R51J234J20j95Q73J318L93k64m0k91j148q93N85J096j11j055
54946B46520m51N08P83R70J288R04N6J63J085J107K39O17K845M912N581N984O866
54929B79977P131O360O079P208Q458Q406P126N072K400m8j258j925l656o085p298
$$ y = [219396, 219168, 218307, 217808, 217290, 216526, 216634, 218178, 219848, 220433, 220388, 220265, 219432, 217697, 216361, 216310, 216728, 216934, 217705, 219449, 220849, 220755, 219847, 219090, 218173, 216791, 215881, 216237, 217252, 218183, 219221, 220304, 220481, 219558, 218834, 219148, 219799, 220273, 221229, 222727, 223363, 222468, 221346, 221127, 221156, 220821, 221044, 222486, 223961, 224243, 223940, 224149, 224697, 225149, 226087, 227939, 229843, 231007, 231928, 233133, 234085, 234486, 235234, 236865, 238353, 238578, 237725, 236356, 234511, 232565, 231376, 230740, 229434, 227616, 227285, 229409, 232574, 235417, 238216, 240980, 242387, 242130, 242057, 243306, 244462, 244265, 243947, 244898, 246132, 246252, 246057, 246930, 248248, 248641, 248377, 248337, 248046, 246898, 246005, 246590, 247686, 247575, 246520, 246069, 246577, 247360, 248330, 249618, 250522, 250578, 250741, 251826, 252933, 253172, 253789, 256634, 261546, 267127, 273111, 279977, 287108, 293468, 299547, 306755, 315213, 323619, 330745, 335817, 338217, 338169, 336911, 334986, 331330, 325245, 317947]
54914C17947p151p396q293q149o704n800n932n289l168j421j327j796j773j738
54900B52010j767q16R23J564O35J22J194K447K641K686L556M460M639M884N934
54885B85112P125P797Q388R129R306Q517P087M889J596j770l684m606o295q540
54871C24051r309q335p621p869p484n855m576m399l948k645k025k812l425k727
54857B51021j788j590j487j124j389k242k104o63K19m12j102q15o57j404j889
54842B32574j302p00p48m37N45O51p86k002j633q04p97q77j11P84R99J074J323
54825B27753Q46n05j275q00l32n39k18J175K115J628R03P86J68j476k369j255
54809B26605L53P10M85R39J490J191P30R88J310J005Q45J349J390K55p30l16O28
$$ y = [317947, 310796, 303400, 295107, 286958, 280254, 274454, 268522, 263233, 260065, 258644, 257317, 255521, 253748, 252010, 250243, 249427, 250350, 251914, 252549, 252671, 253865, 256312, 258953, 261639, 265195, 269655, 274294, 279178, 285112, 292237, 300034, 308422, 317551, 326857, 335374, 342461, 347350, 348946, 347176, 343492, 338886, 332591, 324051, 314742, 306407, 298786, 290917, 283433, 277578, 273002, 268603, 264655, 262010, 259985, 257173, 253748, 251021, 249233, 247643, 246156, 245032, 243643, 241401, 239297, 238634, 238853, 238441, 237339, 236524, 235867, 234463, 232574, 231272, 230572, 229824, 229387, 229932, 230583, 229797, 227795, 226162, 225358, 224561, 223684, 223573, 224357, 225356, 226430, 227753, 228599, 228094, 226819, 226019, 225687, 225148, 224930, 226105, 228220, 229848, 230751, 231537, 231705, 230229, 227860, 226605, 226958, 227668, 228153, 229092, 230582, 231773, 232503, 233491, 234801, 235806, 236651, 238000, 239390, 239645, 238915, 238599, 239227]
54792B39227R33J099J786K223J853J720K487K954K306J847K647L457K990K382
54778B69911L171M609N211N422O399P573P657O984O695O676O123N142M046K173
54764C47792q84l908n525o018o325o452o191o108o432o229m970l604k922k368
54750B79856j574j337j844j749m42O16L11k91rM15K8m79k83L2P2Q99K979M771
54732B81971N162N322O358P173O651N886O035N965M311K075P64l30k521n032o352
54717C23438o845p633q251p750o821o496o095m678l199k902k993k183j193j302
54703B55097j774j176l9K38l9J31K01p04j478o11R81J297M81J11J76n59j793k048
54685B48492j334j028j416j547j111n60J63J140J489O72j09K41O18m23j853j709
$$ y = [239227, 240160, 241259, 243045, 245268, 247121, 248841, 251328, 254282, 256588, 258435, 261082, 264539, 267529, 269911, 273082, 277691, 282902, 288324, 294723, 302296, 309953, 316937, 323632, 330308, 336431, 341573, 345619, 347792, 346908, 343000, 337475, 331457, 325132, 318680, 312489, 306381, 299949, 293720, 288750, 285146, 282224, 279856, 278282, 276945, 275101, 273352, 272910, 273526, 273837, 273546, 273537, 273952, 273980, 273501, 273218, 273250, 273322, 274221, 277200, 281971, 287133, 292455, 298813, 305986, 312637, 318523, 324558, 330523, 334834, 336909, 337673, 337343, 334822, 329790, 323438, 316593, 308960, 300709, 292959, 286138, 279642, 273547, 268869, 265670, 262768, 259775, 257592, 256399, 255097, 253323, 252147, 252108, 252346, 252307, 252438, 252639, 251935, 250457, 249846, 250827, 252124, 252605, 252716, 252892, 252333, 250540, 248492, 247158, 246130, 244714, 243167, 242056, 241496, 241659, 242799, 244288, 244960, 244851, 245092, 245710, 245287, 243434, 241725]
54669B41725m77k92j376j893j054O1N84O85M85mj82K76M40l74j050l96N96K89
54651B38043p57p15N41J600J904J943J666Q86M89J171J741Q01p37r47R1P91P51
54634B49262O62M01n19j287r49l88q76j522p24P77J003J88K19J175J317L74q8
54617B49025M23O55K0o78j042j407j475o76L07M22K34Q52J500O09j111j399n6
54600B46203R18O97N20J038J299O79k61j086j696j431NJ111L02j380j643n27J5
54583B44763l28r6P09M41q64j108L03J364P72k98o20o91j102j288p95p7O40J577
54565B43302K215J710O53M63R30N41o24p34P09K036K144J748J381M86q15j309
54549B54836p91m77o72j32J448K486J995J073R72J397J596J613J677J705J915
$$ y = [241725, 241248, 240956, 239580, 237687, 236633, 236694, 237278, 237963, 238448, 238444, 238262, 238538, 238978, 238604, 237554, 237158, 237754, 238043, 237286, 236571, 237112, 238712, 240616, 242559, 244225, 245111, 245600, 246771, 248512, 249313, 248576, 247629, 247720, 248511, 249262, 249924, 250325, 249806, 248519, 247570, 247182, 246306, 244784, 244060, 244837, 245840, 246028, 246247, 247422, 248739, 249113, 249025, 249448, 250103, 250123, 249445, 248403, 246996, 245521, 244845, 245152, 245574, 245808, 246660, 248160, 248769, 247658, 246259, 246203, 247121, 247818, 248338, 249376, 250675, 251354, 251093, 250007, 248311, 246880, 246885, 247996, 248298, 246918, 245275, 244748, 244763, 244435, 244339, 245048, 245489, 244625, 243517, 243820, 245184, 245956, 245658, 245038, 244347, 243245, 241957, 241162, 241085, 241725, 243302, 245517, 247227, 247880, 248343, 249273, 249814, 249190, 248456, 249165, 251201, 253345, 255093, 256474, 256960, 256145, 254836, 254045, 253568, 252896, 252764, 254212, 256698, 258693, 259766, 260738, 262135, 263731, 265344, 267021, 268726, 270641]
54534B70641K618L150K562J404J098J526J166k54j385j649j881k254j885q70n56
54519B73431j206j531j064q14j057p17L75Q34R2p12q40q85r03J0J518J710N1j516
54501B66776j511q89r31j206r10m76m92n79l88l58n80l58M12R50J141J635K060
54484B64296J190n46j018L71J656J447P78P37O72Q2%R16J499R90P99J935K862
54467B78666J966L32p0M89M14k63j79Q59J631J374M17o69j315r05L94J300Q55
54450B85296l12r86q42k91L17N44o9j050j092J40J300J187K13o22j122j449j454
54433B79708j221j265j468r61K77R67M57k28p5M73P37J092J913K440J860O36k55
54416B85087o17o87m08J08L45L01P13J636J928R20m23q62m30J52O40J034J115
$$ y = [270641, 273259, 276409, 278971, 280375, 281473, 282999, 284165, 283911, 282526, 280877, 278996, 276742, 274857, 273987, 273431, 272225, 270694, 269630, 268816, 267759, 267042, 267417, 268251, 268343, 267631, 266791, 265906, 265003, 265013, 266531, 268241, 268292, 266776, 265265, 264376, 263445, 262239, 261329, 260853, 260361, 259782, 259394, 259036, 258456, 258098, 258510, 259460, 260601, 262236, 264296, 265486, 264940, 263922, 264293, 265949, 267396, 268174, 268911, 269583, 269665, 269665, 270581, 272080, 273070, 273869, 275804, 278666, 280632, 280964, 280894, 281383, 281797, 281534, 281355, 282214, 283845, 285219, 285636, 284967, 283652, 282747, 283141, 284441, 285296, 284984, 283998, 283156, 282865, 283182, 283726, 283657, 282607, 281515, 281655, 282955, 284142, 284355, 283733, 282611, 281162, 279708, 278487, 277222, 275754, 274793, 275070, 276037, 276494, 276266, 276191, 276664, 277401, 278493, 280406, 282846, 284706, 285342, 285087, 284470, 283783, 283375, 283483, 283828, 284129, 284842, 286478, 288406, 289326, 288903, 288041, 287611, 287763, 288403, 289437, 290552]
54399B90552R10Q70J006P71K39K61J055J708J596J172R21P33O62J047J554J443
54383C06500J094J615K668K505P08j018j492j535j907j837p93J07j17p17p07m53
54367C04621m62r9J058J942J570P36P26J436K084K721L735M739N150N069M739
54352C39765M028L210L105L674L737K786J689Q31p48l365n516n991n539n261m870
54337C31535m008l587m236m742l783k020q77m00O9K55l59j122j179r77j366j980
54321C01223j984j579j396j183m86J91K17M8L47O73L16l50n75n33p71j133j268
54304B91757j380j478q79M40J189N49m64o33l49m79o77k57K68J03l20j71K86M16
54286B87921N45J137J563J078K70J19M59N86N37N20K2j089j624o74P31J081O03
$$ y = [290552, 291462, 292332, 293338, 294109, 294348, 294609, 295664, 297372, 298968, 300140, 301061, 301794, 302456, 303503, 305057, 306500, 307594, 309209, 311877, 314382, 315090, 314072, 312580, 311045, 309138, 307301, 306508, 306615, 306498, 305781, 305074, 304621, 304159, 304060, 305118, 307060, 308630, 309366, 310092, 311528, 313612, 316333, 320068, 324807, 329957, 335026, 339765, 343793, 347003, 350108, 353782, 357519, 360305, 361994, 362825, 362077, 358712, 353196, 347205, 341666, 336405, 331535, 327527, 323940, 319704, 314962, 311179, 309159, 308282, 307882, 307951, 308206, 307847, 306725, 305546, 304569, 303203, 301223, 299239, 297660, 296264, 295081, 294595, 294786, 295003, 295051, 295398, 296071, 296387, 296037, 295462, 294929, 294158, 293025, 291757, 290377, 288899, 288020, 288460, 289649, 290198, 289734, 289101, 288752, 288273, 287596, 287339, 287607, 287710, 287390, 287219, 287505, 287921, 288466, 289603, 291166, 292244, 292514, 292633, 293092, 293678, 294215, 294735, 294757, 293668, 292044, 291370, 292101, 293182, 293785]
54269B93785N42J015J204R72P93N77Nn11m63k35l57m36J06R53J630K346L114L090
54251C08130K018J127J286J414K41j485k073j238J31J484K407J979J2j998k720
54236C10715k771l194l434k576j403j150j271m76Q43J386J312J681K211J805Q34
54221C04512O54J198J201N28K22L83jj063j761j620j170o85ON86N57L00M50N25
54203C04822k95j447j589o41L65J062J797K258J745O96K66N51O45K92Jk09o94
54186C09625j030m90M56O20p7n95m76k37k72m96r28j482j582r32k33j11j46K2
54168C01636l34j626k633k247j412j558k094j493n6O08K31j00j13l96p36m70j10
54151B87097n28j013k54J170J547R80J096K027K116Q39l43m65k05j58J33Q65J460
$$ y = [293785, 294327, 295342, 296546, 297518, 298311, 298888, 298893, 298382, 297919, 297684, 297327, 296891, 296997, 297950, 299580, 301926, 305040, 308130, 310148, 311275, 312561, 313975, 314216, 312731, 310658, 309420, 309551, 311035, 313442, 315421, 315433, 313435, 310715, 307944, 304750, 301316, 298740, 297337, 296187, 294916, 294440, 295283, 296669, 297981, 299662, 301873, 303678, 304512, 305166, 306364, 307565, 308093, 308315, 308698, 308697, 307634, 305873, 304253, 303083, 302398, 302404, 302990, 303547, 303847, 304297, 304822, 304527, 303080, 301491, 300850, 301215, 302277, 304074, 306332, 308077, 308773, 309039, 309590, 310235, 310527, 310528, 310319, 309625, 308595, 308105, 308561, 309181, 309104, 308509, 308033, 307796, 307524, 307028, 306100, 304618, 303036, 302104, 301871, 301760, 301614, 301636, 301302, 299676, 297043, 294796, 293384, 291826, 289732, 288239, 288183, 288791, 289022, 288922, 288809, 288413, 287677, 287207, 287097, 286569, 285556, 285302, 286472, 288019, 288999, 290095, 292122, 294238, 295077, 294734, 294269, 294064, 293906, 294039, 294904, 296364]
54134B96364J733K031K082J319M49Q79K474L518L193K457K252K386K437K285J680
54119C27539N46l44k96N9j48l54L35J073M13j045j434o48k23l64K83J882K882
54102C30156K618K039J569N99o59j057p16r32j556q75J301K960L067K970L746
54087C45230M422M070L602M200N649P265Q950J0374J0714R948Q998P948N720K069
54073D39159j796n042p903j0122j0660r624q509p887o782n054m174m677m936l651
54059C48342j724n39q4J01j25n64l56M33O17Q5K82J563K242J530J192K703M713
54042C60411N177M316L602L316L054L344M794O547P397P648Q307R241R724J0082
54028D46960J1222J2968J4180J4204J3205J1571R785Q313O925M890K382P24M68
$$ y = [296364, 298097, 300128, 302210, 303529, 303978, 304857, 307331, 310849, 314042, 316499, 318751, 321137, 323574, 325859, 327539, 328085, 327741, 327445, 327504, 327356, 327002, 327337, 328410, 328823, 327778, 326344, 325696, 325473, 325109, 325392, 327274, 330156, 332774, 334813, 336382, 336981, 336322, 335265, 334549, 333617, 332061, 331186, 332487, 335447, 338514, 341484, 345230, 349652, 353722, 357324, 361524, 367173, 374438, 383388, 393762, 404476, 414424, 423422, 431370, 437090, 439159, 437363, 432321, 424418, 414296, 403636, 394012, 385503, 377616, 370834, 365780, 361606, 356929, 351993, 348342, 346618, 346079, 345995, 346096, 345971, 345407, 345051, 345484, 346101, 346186, 346468, 348031, 350273, 351803, 352995, 355698, 360411, 365588, 369904, 373506, 376822, 379876, 383220, 388014, 394561, 401958, 409606, 417913, 427154, 436878, 446960, 458182, 471150, 485330, 499534, 512739, 524310, 534095, 542408, 549333, 554223, 556605, 557329, 557797]
54015E57797M88j98r34q07l65o44j449j889j835j704j566j537k316m220o277p306
53999E25238p352p188p094o981p061p479p779p555p033o438n534m404l874m362
53985D35104n044m899l969k973k343k202k504k744k321j613j714k639l011k135
53971C94993j127j136j649j551r23o52r88j480j792j791j356o95l16j86L32J386
53955C81069K304K656K768K842K616K227K321K903L251L337M021N395O378O541
53941D30629O831P815Q648Q625Q349Q473Q621Q533Q844R705R938Q677O809N772
53927E46269N963P185R483J2601J5713J8481K1210K3413K3745K2057J9717J6868
53915G42705J1471K716o483j2356j4377j4496j3638j1181p269l390n96J310K919
$$ y = [557797, 558285, 558087, 557153, 556346, 555981, 555337, 553888, 551999, 550164, 548460, 546894, 545357, 543041, 538821, 532544, 525238, 517886, 510698, 503604, 496623, 489562, 482083, 474304, 466749, 459716, 453278, 447744, 443340, 439466, 435104, 430060, 425161, 421192, 418219, 415876, 413674, 411170, 408426, 406105, 404492, 402778, 400139, 397128, 394993, 393866, 392730, 391081, 389530, 388607, 387955, 386967, 385487, 383695, 381904, 380548, 379853, 379537, 379351, 379683, 381069, 383373, 386029, 388797, 391639, 394255, 396482, 398803, 401706, 404957, 408294, 412315, 417710, 424088, 430629, 437460, 445275, 453923, 462548, 470897, 479370, 487991, 496524, 505368, 515073, 525011, 533688, 540497, 546269, 552232, 559417, 568900, 581501, 597214, 615695, 636905, 660318, 684063, 706120, 725837, 742705, 754176, 756892, 750409, 738053, 723676, 709180, 695542, 684361, 677092, 673702, 673106, 674416, 677335]
53902F77335M553O236P457P462O508N964O338O244M393J552p21k251l752n006
53888G22312n206m618m387m985n955o967q067r151j0011j0642j1000j0949j0855
53875F19519j1382j2291j2529j1912j1487j1613j1181r608q011p367p012o213
53863D98913n643n902o088n405m807n310n994n606m907n393o629o913n947m829
53849D19540l986l004k113k026k501k666k463k425k381j808j023p24q03q24j031
53834C89762j617j746p49M94Q03N57P64J096N82m18p63m65l74m22ON18K76k83
53816C88021q3O06O74K30L38R91J192R32J111J617J415N61L07J018J754K135K836
53799D05655L974M729M973N677P159Q371Q559Q390Q784R646J0389J0829J1070
$$ y = [677335, 681888, 688124, 695581, 703043, 709551, 715515, 721853, 728097, 732490, 734042, 733321, 731070, 727318, 722312, 717106, 712488, 708101, 703116, 697161, 690194, 682127, 672976, 662965, 652323, 641323, 630374, 619519, 608137, 595846, 583317, 571405, 559918, 548305, 537124, 527516, 519505, 512138, 505126, 498913, 493270, 487368, 481280, 475875, 471068, 465758, 459764, 454158, 449251, 443858, 437229, 430316, 424369, 419540, 415554, 412550, 410437, 408411, 405910, 403244, 400781, 398356, 395975, 394167, 393144, 392420, 391617, 390793, 389762, 388145, 386399, 385650, 386144, 386947, 387504, 388268, 389364, 389946, 389528, 388765, 388300, 387926, 387504, 387510, 388028, 388304, 388021, 387938, 388544, 389218, 389448, 389786, 390777, 391969, 392901, 394012, 395629, 397044, 397605, 397912, 398930, 400684, 402819, 405655, 409629, 414358, 419331, 425008, 432167, 440538, 449097, 457487, 466271, 475917, 486306, 497135, 508205]
53786E08205J1035J0473R141P019M702L158K597K155J292O37O06J66j644l859
53772E55683m805m546m455m891n133n205n898o992p361o946o946p712q125p469
53758D69199o466n970n837n583n190m787m306l739l121k387j828k232l652m612
53744D09489l771j958j144j813k710l006l041l056k683j913j195m75N56J249M92
53729C85021j408k712k375j051K32J150J639J574J241J142J129O17k16n09j6O14
53713C86072R40J152J354J384J367J628K076K438K817L297L379K788K238K402
53699D15332K697K445K455L853N823O444N562M924N380N783N011L440J942P95
53685D71886O9j52k83r24j790j881q75N82J800K343J741J46j050o32O74J229R63
$$ y = [508205, 519240, 529713, 538854, 545873, 550575, 553733, 556330, 558485, 559777, 560414, 561020, 561186, 559542, 555683, 550878, 546332, 541877, 536986, 531853, 526648, 520750, 513758, 506397, 499451, 492505, 484793, 476668, 469199, 462733, 456763, 450926, 445343, 440153, 435366, 431060, 427321, 424200, 421813, 419985, 417753, 414101, 409489, 405718, 403760, 402616, 400803, 398093, 395087, 392046, 388990, 386307, 384394, 383199, 382724, 383280, 384529, 385021, 383613, 380901, 378526, 377475, 377707, 378857, 380496, 382070, 383311, 384453, 385582, 386199, 385983, 385474, 385458, 386072, 387012, 388164, 389518, 390902, 392269, 393897, 395973, 398411, 401228, 404525, 407904, 410692, 412930, 415332, 418029, 420474, 422929, 426782, 432605, 439049, 444611, 449535, 454915, 460698, 465709, 469149, 471091, 471886, 471955, 471803, 471520, 470596, 468806, 466925, 466050, 466632, 468432, 470775, 472516, 472662, 471612, 470980, 471654, 472883, 473846]
53668D73846J110J757J572J28j291j600j118n77k71m71j274j903j468m69j42m25
53652D67404j96N23N16l53p77l42k33r92j439o96L24M91R8j5J32J01l8K7L37Q78
53632D65750J603K022J631Q43O23J203K059K952L798L889K702J268J160K190K862
53617D96555K866L275M209M485L832L363L449L146K312K191L201M123M262M468
53603E45737N171N385M725M482N442O355N907M712M029L909L896M264N271O226
53589F15511O486O467O651O620N954N100M535M000L224K383J281o39k970m405
53575F60198m698n051n916o141n179m274m356m446l575k619k669l043k529j516
53561F04186j254j897k665l110k983j811Q2J177O48k47QR56J217P65O13R18J043
$$ y = [473846, 474956, 476713, 478285, 478413, 477122, 475522, 474404, 473827, 473556, 473085, 471811, 469908, 468440, 467971, 467829, 467404, 467208, 467731, 468247, 467894, 467117, 466775, 466542, 465550, 464111, 463415, 463739, 464230, 464328, 464313, 464445, 464546, 464508, 464535, 464872, 465750, 467353, 469375, 471006, 471849, 472472, 473675, 475734, 478686, 482484, 486373, 489075, 490343, 491503, 493693, 496555, 499421, 502696, 506905, 511390, 515222, 518585, 522034, 525180, 527492, 529683, 532884, 537007, 541269, 545737, 550908, 556293, 561018, 565500, 570942, 577297, 583204, 587916, 591945, 595854, 599750, 604014, 609285, 615511, 621997, 628464, 635115, 641735, 647689, 652789, 657324, 661324, 664548, 666931, 668212, 667573, 664603, 660198, 655500, 650449, 644533, 638392, 633213, 628939, 624583, 620137, 616562, 613943, 611274, 608231, 605702, 604186, 602932, 601035, 598370, 595260, 592277, 590466, 590548, 591725, 592373, 592126, 592134, 593090, 594307, 595072, 595685, 596603, 597646]
53544E97646R83J268J710J654J245J250J824K414K676K647K321J866J864K647
53530F24015L692M355M763N387O244P106Q015Q960R646R994J0333J0784J1149
53517G24443J1726J3198J5344J6945J7504J7953J9015K0099K0602K1110K2388
53506I20327K4179K5874K7460K8952K9890L0142L0274L0447L0036K9012K8455
53495A235048K8845K9186K8788K8491K9055K9719K9599K9235K9340K9324K8505
53484A555135K7634K7636K7893K7375K6502K6237K6189K5382K4144K3528K3386
53473A841041K2838K2170K2530K3871K4757K4288K2872K1136J9219J7057J4482
53462B076261J1158P216L540O43k133n464q804j1315j3249j5206j6686j6826j6020
$$ y = [597646, 598629, 599897, 601607, 603261, 604506, 605756, 607580, 609994, 612670, 615317, 617638, 619504, 621368, 624015, 627707, 632062, 636825, 642212, 648456, 655562, 663577, 672537, 682183, 692177, 702510, 713294, 724443, 736169, 749367, 764711, 781656, 799160, 817113, 836128, 856227, 876829, 897939, 920327, 944506, 970380, 997840, 1026792, 1056682, 1086824, 1117098, 1147545, 1177581, 1206593, 1235048, 1263893, 1293079, 1321867, 1350358, 1379413, 1409132, 1438731, 1467966, 1497306, 1526630, 1555135, 1582769, 1610405, 1638298, 1665673, 1692175, 1718412, 1744601, 1769983, 1794127, 1817655, 1841041, 1863879, 1886049, 1908579, 1932450, 1957207, 1981495, 2004367, 2025503, 2044722, 2061779, 2076261, 2087419, 2094635, 2098175, 2098818, 2096685, 2091221, 2082417, 2071102, 2057853, 2042647, 2025961, 2009135, 1993115]
53449A993115j5553j5937j6914j8603k1240k4068k5870k6567k7056k7596k7509
53438A746202k6475k5062k3888k3034k2316k1478k0197j8457j6579j4560j1910
53427A522246q717o042m547l555k313j234q31l43J235L434N100O349Q240J0849
53413A529871J3194J4951J6866J9304K1590K3055K3865K4593K5590K6905K8365
53402A768149K9748L1176L2978L5056L6880L8489M0716M3986M7600N0773N3584
53391B209135N6329N8854O1139O3618O6311O8509P0011P1505P3133P3995P3785
53380B946324P3526P3670P3075P1077O8918O7595O5948O2692N8935N6453N4648
53369C672861N1547M6977M2408L8221L3454K7961K2638J7536J1688M767k814j1196
$$ y = [1993115, 1977562, 1961625, 1944711, 1926108, 1904868, 1880800, 1854930, 1828363, 1801307, 1773711, 1746202, 1719727, 1694665, 1670777, 1647743, 1625427, 1603949, 1583752, 1565295, 1548716, 1534156, 1522246, 1513529, 1507487, 1502940, 1499385, 1497072, 1495838, 1495007, 1494664, 1495899, 1499333, 1504433, 1510782, 1519022, 1529871, 1543065, 1558016, 1574882, 1594186, 1615776, 1638831, 1662696, 1687289, 1712879, 1739784, 1768149, 1797897, 1829073, 1862051, 1897107, 1933987, 1972476, 2013192, 2057178, 2104778, 2155551, 2209135, 2265464, 2324318, 2385457, 2449075, 2515386, 2583895, 2653906, 2725411, 2798544, 2872539, 2946324, 3019850, 3093520, 3166595, 3237672, 3306590, 3374185, 3440133, 3502825, 3561760, 3618213, 3672861, 3724408, 3771385, 3813793, 3852014, 3885468, 3913429, 3936067, 3953603, 3965291, 3970058, 3967244, 3956048]
53357C956048k0691l0269l8328m4866n1093n6991o1139o3080o3984o4734o5089
53346C395784o4988o4960o4907o3923o1872n9848n8633n7874n7081n6358n5920
53335B729420n5806n6131n6700n6509n4673n1684m8650m5652m2073l8213l5085
53324B188244l2695l0067k7016k4488k3060k2336k1935k1878k2034k2278k3070
53313A917387k4637k5866k5335k3297k1289j9938j8653j7207j6052j4990j3099
53302A697024j0203p146m542k397q61J3J077L188N715P388Q451J0345J3442J6773
53288A738267J9869K3057K5907K7423K7904K8812L0443L1597L1859L2211L2952
53277B050301L2930L1536K9718K8216K6383K3667K0755J8410J6415J4305J2053
$$ y = [3956048, 3935357, 3905088, 3866760, 3821894, 3770801, 3713810, 3652671, 3589591, 3525607, 3460873, 3395784, 3330796, 3265836, 3200929, 3137006, 3075134, 3015286, 2956653, 2898779, 2841698, 2785340, 2729420, 2673614, 2617483, 2560783, 2504274, 2449601, 2397917, 2349267, 2303615, 2261542, 2223329, 2188244, 2155549, 2125482, 2098466, 2073978, 2050918, 2028582, 2006647, 1984769, 1962735, 1940457, 1917387, 1892750, 1866884, 1841549, 1818252, 1796963, 1777025, 1758372, 1741165, 1725113, 1710123, 1697024, 1686821, 1679675, 1675133, 1672736, 1671875, 1671888, 1672965, 1676153, 1681868, 1689256, 1697707, 1708052, 1721494, 1738267, 1758136, 1781193, 1807100, 1834523, 1862427, 1891239, 1921682, 1953279, 1985138, 2017349, 2050301, 2083231, 2114767, 2144485, 2172701, 2199084, 2222751, 2243506, 2261916, 2278331, 2292636, 2304689]
53266B304689R410N842J621k280n705r410j3360j6522j8851k1799k6053l0394
53254B177188l3581l5876l7758l8652l8165l7387l7633l8674l9219l8490l6671
53243A765082l4481l2941l2725l3216l3032l1881l0919l0945l1384l1618l2028
53232A409912l2911l3544l3117l1824l0256k8525k6614k4770k3022k1043j8959
53221A105327j7453j6626j5740j4476j3499j3305j3461j3566j3975j5088j6684
53210I41454j8396k0007k1026k0932k0143j9711j9795j9485j8353j6952j5557
53199G31097j3784j1865j0858j1014j1277j0966j0628j0697j0656j0226j0036
53188F09090j0289j0165r308q582q502q229p106n871n372n203m735m390m728n182
$$ y = [2304689, 2314099, 2319941, 2321562, 2319282, 2313577, 2304167, 2290807, 2274285, 2255434, 2233635, 2207582, 2177188, 2143607, 2107731, 2069973, 2031321, 1993156, 1955769, 1918136, 1879462, 1840243, 1801753, 1765082, 1730601, 1697660, 1664935, 1631719, 1598687, 1566806, 1535887, 1504942, 1473558, 1441940, 1409912, 1377001, 1343457, 1310340, 1278516, 1248260, 1219735, 1193121, 1168351, 1145329, 1124286, 1105327, 1087874, 1071248, 1055508, 1041032, 1027533, 1014228, 1000767, 987201, 973226, 958138, 941454, 923058, 903051, 882025, 861093, 840950, 821239, 801444, 781959, 763606, 746654, 731097, 717313, 705448, 694590, 683576, 672299, 661333, 650705, 640008, 629352, 619126, 609090, 598801, 588636, 579328, 570746, 562244, 554015, 546909, 541038, 535666, 530463, 525728, 521338, 516610, 511428]
53174E11428m882l992l244k840k640k724k991k951k520k239k229j907j290j306
53160D73673k175k763k432k171k865l763l812l326l095k846k016j081p91q16m24
53145D39297J31Q4n25j118j567j927j821j112n17o08q82p31m89n17k10R52K151
53128D30591K352K016K280L017L073K111R79M27O11J514K861L817L769L134K671
53113D65223K412K003J559J260P00k83q44k92M95M9j604l131l796l926l699k877
53097D53249j806j459k050k577k174j223p55j159j830j930j354q86j197j796j589
53082D29464m70M66N45L31L73K15m76q51p6J157J479P93J97L35P96J047R75N88
53064D36888n4p23j327k027k597k294j000J14o8j113j784j742j494j123k75P84
$$ y = [511428, 506546, 502554, 499310, 496470, 493830, 491106, 488115, 485164, 482644, 480405, 478176, 476269, 474979, 473673, 471498, 468735, 466303, 464132, 461267, 457504, 453692, 450366, 447271, 444425, 442409, 441328, 440537, 439721, 439297, 439428, 439512, 438987, 437869, 436302, 434375, 432554, 431442, 430925, 430317, 429435, 428704, 428215, 427698, 427488, 428440, 430591, 432943, 434959, 437239, 440256, 443329, 445440, 446419, 446846, 447457, 448971, 451832, 455649, 459418, 462552, 465223, 467635, 469638, 471197, 472457, 473157, 472874, 472030, 471738, 472233, 472282, 470678, 467547, 463751, 459825, 456126, 453249, 451443, 449984, 447934, 445357, 443183, 441960, 441205, 440046, 438216, 436286, 434932, 434046, 432849, 431053, 429464, 428994, 429460, 430005, 430336, 430709, 430924, 430448, 429597, 429521, 430678, 432157, 432950, 433147, 433482, 434278, 435325, 436300, 436888, 436834, 436111, 434784, 432757, 430160, 427866, 426866, 426980, 426912, 425799, 424015, 422273, 420779, 419656, 419381, 420165]
53048D20165J269J053Q15Q92Q99N58J85J38L48O10Q33R49Q54N57J72j51k23N6
53030D29979M14M08M6j94MN67J535K956M135L877K069J87l62J62N23J54n15q73
53012D45072o78j56J08k17n05J37J405J974J501J211J900K587K103R52M34P49
52996D58577J106J103R52P08L57J96M07O35O96J138K358L747M445M399M009L376
52980D88209K601K129K002J546M71m72o66n96q27r53n12J3J68N43J631K584K374
52963E00245J443R01Q04N67M44J061J998K238J733J220Q64K38o23j315j886k526
52947E07406k827k453j964j946j946j384q66j211j845j637q33o46j213j575j371
52932D83689j081p92j80M22L15k62m84l68n67r70r57p99j281k052j943r66m16
$$ y = [420165, 421434, 422487, 423302, 424194, 425093, 425651, 425836, 425974, 426322, 426932, 427765, 428714, 429568, 430125, 430297, 430146, 429923, 429979, 430393, 430801, 430847, 430653, 430657, 431224, 432759, 435715, 439850, 443727, 445796, 445983, 445621, 445783, 446306, 446460, 445945, 445072, 444394, 444238, 444346, 444129, 443624, 443761, 445166, 447140, 448641, 449852, 451752, 454339, 456442, 457394, 457828, 458577, 459683, 460786, 461738, 462446, 462803, 462999, 463406, 464041, 464737, 465875, 468233, 471980, 476425, 480824, 484833, 488209, 490810, 492939, 494941, 496487, 496958, 496486, 495820, 495224, 494397, 493444, 492932, 492945, 493113, 493656, 495287, 497871, 500245, 501688, 502589, 503393, 503960, 504404, 505465, 507463, 509701, 511434, 512654, 513518, 513756, 513133, 511818, 509932, 507406, 504579, 502126, 500162, 498216, 496270, 494886, 494020, 492809, 490964, 489327, 488494, 487848, 486635, 485060, 483689, 482608, 481816, 481636, 482058, 482373, 482111, 481627, 481259, 480692, 479722, 478765, 477966, 476685, 474633, 472690, 471724, 471308]
52915D71308q03j198q88l35r1n1m2j09M9Q17J740J832R86L4n69j015j173o31K46
52896D70107N00P9o4M77J045J110Q70M72k62j100j418j144p52l72J51M77J98r5
52878D70279M86J450J445M61k4N99J267J190J051J539K152K310K468L149L835
52863D93657L683K675J364J61o09o74l07k62p46j173j202j263j654k001k093k449
52847D87107l408m354m491l866l127k644k401k339k472k744l059l305l336l132
52833D42429k863k569k065j442j251j664j954j446n17J31O48J491K264K250J716
52818D35158J481J422P07n86j444j488j373j451j231l12J073K524L565L544K405
52803D43994J347J381J592L04k145l600l142k187k172k801l206l264l082k458
$$ y = [471308, 470505, 469307, 468419, 468084, 467993, 467942, 467900, 467791, 467840, 468657, 470397, 472229, 473215, 473249, 472680, 471665, 470492, 469861, 470107, 470607, 470686, 470622, 471099, 472144, 473254, 474124, 474596, 474334, 473234, 471816, 470672, 469920, 469548, 469699, 470176, 470374, 470279, 470765, 472215, 473660, 474121, 474097, 474696, 475963, 477153, 478204, 479743, 481895, 484205, 486673, 489822, 493657, 497340, 500015, 501379, 501540, 500931, 500257, 499950, 499688, 498942, 497769, 496567, 495304, 493650, 491649, 489556, 487107, 483699, 479345, 474854, 470988, 467861, 465217, 462816, 460477, 458005, 455261, 452202, 448897, 445561, 442429, 439566, 436997, 434932, 433490, 432239, 430575, 428621, 427175, 426658, 426789, 427437, 428928, 431192, 433442, 435158, 436639, 438061, 438768, 438182, 436738, 435250, 433877, 432426, 431195, 430883, 431956, 434480, 438045, 441589, 443994, 445341, 446722, 448314, 448618, 446473, 442873, 439731, 437544, 435372, 432571, 429365, 426101, 423019, 420561]
52789D20561j624j316j446r19N63J683J308L5q53j074j137j206j025m95K69J086
52773D14410J647J752J711J954K278K227K001K038J899Q09q09j632j309o86j92
52758D28098N25J212J015K02J90J263J941J344N28O21J127J129P97O43M17j14
52742D40938m17j52J24O6K85J089J625J202M05n3m61j095j249m58M20O05Q61K224
52724D45959M104N069M845M217L543K739K196K268K211J021q60j986j987j926
52710D71413k473k986k780k325k463l021k929j697k14K94j16j92O76J458J028
52695D53673m6l73J01J96l86n85J31R93J410J748K133J928J155R56J735K223J462
52678D68454M68O68J747K373K146J588Q27l71j709k563k797k592j986j227j006
$$ y = [420561, 418937, 417621, 416175, 415256, 415819, 417502, 418810, 418845, 417992, 416918, 415781, 414575, 413550, 413055, 413324, 414410, 416057, 417809, 419520, 421474, 423752, 425979, 427980, 430018, 431917, 432726, 431917, 430285, 428976, 428290, 428098, 428623, 429835, 430850, 431052, 431242, 432505, 434446, 435790, 436318, 436939, 438066, 439195, 439992, 440635, 441052, 440938, 440521, 440369, 440493, 440559, 440844, 441933, 443558, 444760, 445165, 445112, 444651, 443556, 442307, 441849, 442269, 442874, 443735, 445959, 450063, 455132, 459977, 464194, 467737, 470476, 472672, 474940, 477151, 478172, 477312, 475326, 473339, 471413, 468940, 465954, 463174, 460849, 458386, 455365, 452436, 450739, 450525, 450819, 450703, 450511, 451187, 452645, 453673, 453627, 453254, 453355, 453551, 453165, 452580, 452711, 453704, 455114, 456862, 458995, 460923, 462078, 463034, 464769, 466992, 468454, 468922, 469590, 471337, 473710, 475856, 477444, 478271, 477900, 476191, 473628, 470831, 468239, 466253, 465026, 464020]
52663D64020j442j626r18j9J24k62m64n96j107j550j059K28J334J816K159K894
52647D63532M055N249N758M997L367K160K012K024J085n82j909k421k343j773
52633D85211o71O23J579K005J976J611J293J509K128K447K265K052J766N83j544
52618E04833l324l920m186n107o038n707m180k566j419n79l6J64M13R16J093M94
52602D70851k54l50l2N5R2N40J038R60N77N87Q93Q78M74N1k83m11J54J358K087
52583D79265J629Q98J072J722J677J085J036J579J693J057M31K61K04L5j29m42
52567D93073j115j633j247j69N81M66k38j159j950k089j530j122j450j718r76
52552D77724Q7k6j266j996j310l4O58N05j16o87o82q0L34n0o96q35q25j349j773
$$ y = [464020, 462578, 460952, 460034, 460015, 460139, 459877, 459413, 458817, 457710, 456160, 455101, 455329, 456663, 458479, 460638, 463532, 467587, 472836, 478594, 483591, 486958, 489118, 491130, 493154, 494239, 493657, 491748, 489327, 486984, 485211, 484540, 485163, 486742, 488747, 490723, 492334, 493627, 495136, 497264, 499711, 501976, 504028, 505794, 506377, 504833, 501509, 497589, 493403, 488296, 482258, 476551, 472371, 469805, 468386, 467807, 467771, 467935, 468348, 469264, 470357, 470851, 470597, 470247, 470215, 470270, 470362, 470902, 471940, 472900, 473477, 474064, 474957, 475835, 476309, 476360, 476077, 475666, 475820, 477178, 479265, 480894, 481792, 482864, 484586, 486263, 487348, 488384, 489963, 491656, 492713, 493144, 493405, 493609, 493644, 493515, 493073, 491958, 490325, 489078, 488909, 489490, 489956, 489718, 488559, 486609, 484520, 482990, 481868, 480418, 478700, 477724, 477811, 477785, 476519, 474523, 473213, 473179, 473837, 474342, 474226, 473539, 472857, 472777, 473111, 473061, 472365, 471530, 470705, 469356, 467583]
52533D67583r21P52J483P99J46N21J109R31M53O87J638K513K819K658K368K371
52517D87910K870L539L889M006M387N132N911O660P445P724O681M405J906j49
52503E52316j909l491m637n421o338p313p463o296m562l402l103l048k576j621
52489D91136p05m05o99r52p34l17o5J73O30J033J056R90J216J485J431J395J825
52472D98493K400K634K960M043N361N774N326N222N885O260N426L805K278R71
52458E56838o27k713m885o454p001o782o517o564o591o318o009n809n222l960
52444D81386k678k122k069j900j587j288p04J85N13j99r24o05O0j88r03o88L10
52427D66599O54J12j01L33K77p34j621j587j148q08k42O25J108R97R71J283J327
$$ y = [467583, 466662, 467414, 468897, 469696, 469842, 470363, 471472, 472403, 472856, 473543, 475181, 477694, 480513, 483171, 485539, 487910, 490780, 494319, 498208, 502214, 506601, 511733, 517644, 524304, 531749, 539473, 546154, 550559, 552465, 552316, 550407, 546916, 542279, 536858, 530520, 523207, 515744, 509448, 504886, 501484, 498381, 495333, 492757, 491136, 490431, 490026, 489327, 488375, 487641, 487324, 487259, 487432, 488062, 489095, 490151, 491141, 492357, 493842, 495273, 496668, 498493, 500893, 503527, 506487, 510530, 515891, 521665, 526991, 532213, 538098, 544358, 549784, 553589, 555867, 556838, 556211, 553498, 548613, 542159, 535158, 528376, 521859, 515295, 508704, 502386, 496377, 490568, 485346, 481386, 478708, 476586, 474517, 472617, 471030, 469742, 469038, 469223, 469736, 469537, 468613, 468008, 468068, 467880, 466977, 466289, 466599, 467253, 467365, 467264, 467597, 467874, 467140, 465519, 463932, 462784, 461976, 461734, 462359, 463467, 464464, 465435, 466718, 468045]
52410D68045R91J113J971K710K913L369M496N328N076M597N263P220R633J1925
52396E34650J3884J5240J5958J6418J6740J6425J5130J3038J0025N395q48p219
52384F64836j1945j4407j4888j3666j1154q331o173m805l665k259n01J346K731
52371E77119L212L012K775K643K043N27j657l904n602o225n702m662l740k765
52357E57074j386j34J28l35l88K95J037J538K197K830K673J896J720K505L158
52342E74808K999K785L125L334K806K307K693L485L808L925M654N904O932P566
52328F31131Q161Q751R078R185R224R058Q549P880P064N705L775K091J445J731
52314G22828K468L547M944O261P267Q355R898J1604J3100J4617J6466J8301J9540
$$ y = [468045, 469036, 470149, 472120, 474830, 477743, 481112, 485608, 490936, 496012, 500609, 505872, 513092, 522725, 534650, 548534, 563774, 579732, 596150, 612890, 629315, 644445, 657483, 667508, 672903, 672055, 664836, 652891, 638484, 623596, 609930, 598776, 590445, 584272, 579467, 575802, 573543, 573042, 574388, 577119, 580331, 583343, 586118, 588761, 590804, 591331, 589674, 585770, 580168, 573943, 568241, 563579, 559839, 557074, 555688, 555554, 555682, 555347, 554959, 555254, 556291, 557829, 560026, 562856, 565529, 567425, 569145, 571650, 574808, 577807, 580592, 583717, 587051, 589857, 592164, 594857, 598342, 602150, 606075, 610729, 616633, 623565, 631131, 639292, 648043, 657121, 666306, 675530, 684588, 693137, 701017, 708081, 713786, 717561, 719652, 721097, 722828, 725296, 728843, 733787, 740048, 747315, 755670, 765568, 777172, 790272, 804889, 821355, 839656, 859196]
52301H59196K0203K0744K1361K1869K2016K1542K0278J8557J7130J6395J6046
52290A075337J5615J4971J4254J3905J4729J7137K0180K2159K2499K2193K2211
52279A275190K2431K2462K2460K2524K2271K1646K1373K1873K2430K2147K1135
52268A517942K0104J9363J8781J8174J7242J5623J3563J1934J1125J0475R214
52257A683540P397N539L917K624J717R10k49j660k768l561m638o030o927o874
52243A672937o308n465l807j082K005M699O932Q759J0073J1398J3690J6767J9050
52230A749648J9615J9388J9534J9869J9830J9849K0595K1650K2084K1648K0514
52219A974224J8637J6252J4241J3049J2015J0506Q824P200N088K411L10o08j613
$$ y = [859196, 879399, 900143, 921504, 943373, 965389, 986931, 1007209, 1025766, 1042896, 1059291, 1075337, 1090952, 1105923, 1120177, 1134082, 1148811, 1165948, 1186128, 1208287, 1230786, 1252979, 1275190, 1297621, 1320083, 1342543, 1365067, 1387338, 1408984, 1430357, 1452230, 1474660, 1496807, 1517942, 1538046, 1557409, 1576190, 1594364, 1611606, 1627229, 1640792, 1652726, 1663851, 1674326, 1683540, 1690937, 1696476, 1700393, 1703017, 1704734, 1705644, 1705395, 1703735, 1700967, 1697406, 1692768, 1686738, 1679811, 1672937, 1666629, 1661164, 1657357, 1656275, 1658280, 1662979, 1669911, 1678670, 1688743, 1700141, 1713831, 1730598, 1749648, 1769263, 1788651, 1808185, 1828054, 1847884, 1867733, 1888328, 1909978, 1932062, 1953710, 1974224, 1992861, 2009113, 2023354, 2036403, 2048418, 2058924, 2067748, 2074948, 2080036, 2082447, 2082757, 2082149, 2080536]
52206B080536m013o954q598q716q455q310p957p571p592p458o285m615l889m235
52192A985888m308l467k695l078m578o495q150q968q830q456q641r108q937p926
52178A892251o684n535m387l481l187l068k313j075l83n62p92m41J64N50Q29J225
52162A863111J555J498R45m9j302k559l898n823q395j0530j0967r720p912o288
52148A799666m715k997j313K06J644K869L551L704L713L834L992L981L559K670
52134A824364J897K242L966O142P902R460J1216J2635J3103J3232J3978J4864
52122A935001J4412J2315R819P893O236M290K155R8j927l922n760p653r957j2249
52108A950751j3330j2481j0111o981l393N85M614Q203J1017J3026J4519J5922
$$ y = [2080536, 2076523, 2069569, 2060971, 2052255, 2043800, 2035490, 2027533, 2019962, 2012370, 2004912, 1998627, 1994012, 1990123, 1985888, 1981580, 1978113, 1975418, 1972340, 1967762, 1961267, 1953117, 1944149, 1935319, 1926863, 1918222, 1909114, 1900177, 1892251, 1885567, 1880032, 1875645, 1872164, 1868977, 1865909, 1863596, 1862521, 1862138, 1861576, 1860784, 1860343, 1860507, 1861057, 1861886, 1863111, 1864666, 1866164, 1867109, 1867060, 1865758, 1863199, 1859301, 1853478, 1845083, 1834553, 1823586, 1813866, 1805954, 1799666, 1794951, 1791954, 1790641, 1790847, 1792491, 1795360, 1798911, 1802615, 1806328, 1810162, 1814154, 1818135, 1821694, 1824364, 1826261, 1828503, 1832469, 1838611, 1846513, 1855973, 1867189, 1879824, 1892927, 1906159, 1920137, 1935001, 1949413, 1961728, 1971547, 1979440, 1985676, 1989966, 1992121, 1992219, 1990292, 1986370, 1980610, 1972957, 1963000, 1950751, 1937421, 1924940, 1914829, 1907848, 1904455, 1905040, 1909654, 1917857, 1928874, 1941900, 1956419, 1972341]
52096A972341J7262J8008J7810J7130J6729J6811J7284J8432K0604K3430K6119
52085B181960K8410L0541L2398L3475L3608L3044L1894L0185K8327K6769K5278
52074B515889K3265K0710J8039J5252J2051Q785O349M934L693J819o24k979m566
52061B622617m923m229l522l837m956n744n780n975p296r551j1754j3261j4135
52048B527654j4704j5050j4891j3900j2115r968p841n848m111k729j383M97K855
52035B428466M952O507Q077R821J0771J0227R059Q575Q766Q779Q519Q495Q506
52022B539520P876O869O512P079P940Q855J0124J1450J1944J1518J1024J0710
52010B651421R745P668N120K564n92m905r735j4028j7601k0955k4272k7273k9795
$$ y = [1972341, 1989603, 2007611, 2025421, 2042551, 2059280, 2076091, 2093375, 2111807, 2132411, 2155841, 2181960, 2210370, 2240911, 2273309, 2306784, 2340392, 2373436, 2405330, 2435515, 2463842, 2490611, 2515889, 2539154, 2559864, 2577903, 2593155, 2605206, 2613991, 2620340, 2625274, 2628967, 2630786, 2630162, 2627183, 2622617, 2617694, 2613465, 2609943, 2606106, 2601150, 2595406, 2589626, 2583651, 2576355, 2566804, 2555050, 2541789, 2527654, 2512950, 2497900, 2483009, 2469109, 2456994, 2447026, 2439185, 2433337, 2429226, 2426497, 2425114, 2425611, 2428466, 2433418, 2439925, 2448002, 2457823, 2468594, 2478821, 2487880, 2496455, 2505221, 2514000, 2522519, 2531014, 2539520, 2547396, 2554265, 2560777, 2567856, 2575796, 2584651, 2594775, 2606225, 2618169, 2629687, 2640711, 2651421, 2661166, 2668834, 2673954, 2676518, 2675926, 2671021, 2661286, 2647258, 2629657, 2608702, 2584430, 2557157, 2527362]
51997B527362l1904l3536l4545l5205l6329l8663m1985m5020m6636m7200m8226
51986B088113n0390n2546n3197n2253n0629m8739m6459m4166m2649m1916m1022
51975A564147l9219l6570l3458l0098k6551k2653j8100j3174r075o721n597m543
51963A318388l478l358m679p024r955j3366j6872j9756k1548k1990k0654j7505
51951A158203j3588j0112o988l278J045M965Q015J0752J3562J6080J8030J9546
51939A216232K0431K0067J8313J5630J2206P875L036j447n358r186j2894j5751
51927A269154j7545j8844j9729j9476j7922j6074j4818j3840j2424j0437q141
51916A099904n751l577j868j08K732O841J1132J4457J6495J7237J6451J4054J0276
$$ y = [2527362, 2495458, 2461922, 2427377, 2392172, 2355843, 2317180, 2275195, 2230175, 2183539, 2136339, 2088113, 2037723, 1985177, 1931980, 1879727, 1829098, 1780359, 1733900, 1689734, 1647085, 1605169, 1564147, 1524928, 1488358, 1454900, 1424802, 1398251, 1375598, 1357498, 1344324, 1335249, 1328528, 1322931, 1318388, 1314910, 1311552, 1306873, 1299849, 1289894, 1276528, 1259656, 1239900, 1218352, 1196362, 1175708, 1158203, 1144615, 1134503, 1127515, 1124237, 1125282, 1130247, 1138262, 1149014, 1162576, 1178656, 1196686, 1216232, 1236663, 1256730, 1275043, 1290673, 1302879, 1310754, 1313790, 1312343, 1306985, 1297799, 1284905, 1269154, 1251609, 1232765, 1213036, 1193560, 1175638, 1159564, 1144746, 1130906, 1118482, 1108045, 1099904, 1094153, 1090576, 1088708, 1088600, 1091332, 1098173, 1109305, 1123762, 1140257, 1157494, 1173945, 1187999, 1198275]
51903A198275N164j312q438j4922k0212k4791k8804l1368l1815l0852k9793k9083
51891I52049k8140k6238k3256j9805j6776j4385j1787q182l995k69K844O000R312
51878H17372J2298J5078J8139K0841K1585J9925J7183J4463J1417P516L257o74
51866I78400m214p089q269p276n135l187j758p67o24j528k667l182l384m065n153
51851I20102n978o445o972p535p703p501p537q277r582j0897j1677j1811j1748
51838H06439j1779j1239r111n602k295l04Q76K198L565M184L843L014K050R50
51824G86789k67j453k385k711k149r33K57J070J727K396K856K940K767K331J386
51809G94621m1j614l217m924o298o485n326l707k498j637n75Q89K396L319L210
$$ y = [1198275, 1203439, 1202127, 1193689, 1178767, 1158555, 1133764, 1104960, 1073592, 1041777, 1010925, 981132, 952049, 923909, 897671, 874415, 854610, 837834, 823449, 811662, 803480, 799485, 799216, 802060, 808060, 817372, 829670, 844748, 862887, 883728, 905313, 925238, 942421, 956884, 968301, 975817, 979074, 978400, 974186, 967097, 958828, 951552, 946417, 943230, 941472, 940705, 940081, 938553, 935886, 932704, 929320, 925255, 920102, 914124, 907679, 900707, 893172, 885469, 877968, 870431, 862154, 852572, 841675, 829998, 818187, 806439, 794660, 783421, 774310, 768708, 766413, 766109, 766985, 769183, 772748, 776932, 780775, 783789, 785839, 786789, 786522, 785069, 782684, 779973, 777824, 776891, 777148, 778218, 779945, 782341, 785197, 788137, 790904, 793235, 794621, 794580, 792966, 789749, 784825, 778527, 772042, 766716, 763009, 760511, 758874, 758299, 759188, 761584, 764903, 768113]
51794G68113K403J928K323K868K785K662L550N119O026N837N094L678J011k042
51780H11355l451k761j723j507j142M43K531M104N599P837J0269J1756J2130J1809
51766H67249J0648Q323N159J602k356o380r332j0512j0617j0566j0208r128p691
51753H16191o421n125l684k725k551k328j453p17r55j437j016rM98O07J302K565
51737G92742L248K750J667Q05N39J031K264L744M823N149M655L582K816L324M742
51722H37881N505M999M627N824Q006R580J0056J0035R751Q792O835L778k35m224
51708I21210o657p093o645o026m444j508J197J982J381R31P69K62OR35J989R92
51692H99281k170n214o375n892m593k840j204n07p54j331k500n250r328j2771
$$ y = [768113, 770516, 772444, 774767, 777635, 780420, 783082, 786632, 791751, 797777, 803614, 808708, 812386, 813397, 811355, 807904, 805143, 803420, 801913, 800771, 801214, 803745, 807849, 813448, 821285, 831554, 843310, 855440, 867249, 877897, 886220, 891379, 892981, 890625, 884245, 874913, 864401, 853784, 843218, 833010, 823882, 816191, 809770, 804645, 800961, 798236, 795685, 793357, 791904, 791187, 790232, 788795, 787779, 787770, 788268, 788875, 790177, 792742, 795990, 798740, 800407, 801212, 801751, 802782, 805046, 808790, 813613, 818762, 823417, 826999, 829815, 833139, 837881, 843386, 848385, 853012, 858836, 866842, 876422, 886478, 896513, 906264, 915056, 921891, 925669, 925434, 921210, 914553, 907460, 900815, 894789, 890345, 888837, 890034, 892016, 893397, 894328, 895097, 895359, 895365, 896300, 898289, 899281, 897111, 891897, 885522, 879630, 875037, 872197, 870993, 870486, 869732, 868401, 865901, 860651, 851323, 838552]
51678H38552j3960j3131j1549j0242r814j0336j0962j0510q828o830n079l194
51666G24117q98J411L544O151R926J4653J9345K3061K5453K6887K7825K7899K5890
51653I35264K1124J4459P344M11o269j2100j6164j8242j8752j7987j6233j4153
51641H58702j2034r171n036p89J699K089J622J143K98j299l446o049r183j2195
51627H06351j3767j3311j1533r438p484n791m383l001j390J66J120J484J725J940
51613G42688J723Q34n58k110l333l766l675m007n064n808n313m156l371k736j396
51598F99952M11J673K287K985L822M203M314N077O713Q653J0840J3719J6843J8882
51584H00374J9310J8899J8254J7013J4709J1412P446L469R90J603N392J0892J6721
$$ y = [838552, 824592, 811461, 799912, 789670, 779856, 769520, 758558, 748048, 739220, 732390, 727311, 724117, 723219, 724630, 728174, 734325, 744251, 758904, 778249, 801310, 826763, 853650, 881475, 909374, 935264, 956388, 970847, 978191, 978602, 972333, 960233, 944069, 925827, 907075, 889088, 872855, 858702, 846668, 837497, 832461, 831672, 833371, 835460, 837082, 838225, 838523, 837224, 833778, 827729, 818546, 806351, 792584, 779273, 767740, 758302, 750818, 745027, 740644, 737643, 736253, 736419, 737539, 739023, 740748, 742688, 744411, 745245, 744687, 742577, 739244, 735478, 731803, 727796, 722732, 716924, 711611, 707455, 704084, 701348, 699952, 700363, 702036, 704323, 707308, 711130, 715333, 719647, 724724, 731437, 740090, 750930, 764649, 781492, 800374, 819684, 838583, 856837, 873850, 888559, 899971, 907417, 910886, 911876, 913479, 918871, 929763, 946484]
51571I46484K2426K7879L3024L8330M4292N0288N4874N7478N8961O0456O2358
51560A456850O4271O5040O3174N8505N3184M9711M7851M4742L8085K8026J5921
51549A985360K581j1890k7591m4330o0827p4560q3532q7994q9362q7873q2882
51538A337100p5129o6824n9256n2027m4826l8308l2775k7676k2914j9182j6486
51527H81697j3776j0548p503n195l366k015j690k171k261j422l23N42J363J845
51513H35177J167l29j167j021j350k988m883o099p290r018j0197r657p954o278
51499G68113m750l051j634q88j31J238K376K151R00j41o25j118j906k837l861
51484G53836m878n501n723o254p370q153p663o287n122m556m266l976l571k931
$$ y = [946484, 968910, 996789, 1029813, 1068143, 1112435, 1162723, 1217597, 1275075, 1334036, 1394492, 1456850, 1521121, 1586161, 1649335, 1707840, 1761024, 1810735, 1858586, 1903328, 1941413, 1969439, 1985360, 1987941, 1976051, 1948460, 1904130, 1843303, 1768743, 1685211, 1597217, 1507855, 1419982, 1337100, 1261971, 1195147, 1135891, 1083864, 1039038, 1000730, 967955, 940279, 917365, 898183, 881697, 867921, 857373, 849870, 844675, 841309, 839294, 837604, 835433, 833172, 831750, 831427, 831969, 833332, 835177, 836344, 836015, 834848, 833827, 832477, 829489, 824606, 818507, 811217, 802199, 792002, 782345, 774391, 768113, 763363, 760312, 758678, 757790, 757659, 758897, 761273, 763424, 764324, 764183, 763558, 762440, 760534, 757697, 753836, 748958, 743457, 737734, 731480, 724110, 715957, 708294, 702007, 696885, 692329, 688063, 684087, 680516, 677585]
51470F77585k289k158k393k127j150m56p05j155r09l31k06l14J26J165K278L231
51454F70192L994M258L932L619L816M102L885L481L722M884O636Q629J0617J2410
51440G48177J4114J5941J7441J7735J6810J5689J4786J3083R685N280J286j671
51428H88356l598m245l398j717o03j309m333q866j2671j3572j1646r017p149n458
51414H00774l056m52J381K348K613J769k09k141k925k926l039l192k762j790p67
51399G85626J37Q77J334K002L901O987R792J1463J3018J5542J8444K0846K3444
51386I13413K7557L3206L9574M6408N3677O0801O7620P5050Q3282R0379R4351
51375A585318R5602R5499R3642Q8581Q0234O9306N5156L6855J6009m282k3370
$$ y = [677585, 675296, 673138, 670745, 668618, 667468, 667012, 666307, 665152, 664243, 663912, 663706, 663392, 663518, 664683, 666961, 670192, 674186, 678444, 682376, 685995, 689811, 693913, 697798, 701279, 705001, 709885, 716521, 725150, 735767, 748177, 762291, 778232, 795673, 813408, 830218, 845907, 860693, 873776, 883461, 888741, 890027, 888356, 884758, 880513, 877115, 875398, 874795, 873486, 869153, 860287, 847616, 834044, 822398, 813381, 806232, 800774, 797718, 797266, 798647, 800995, 803608, 805377, 805168, 803027, 800102, 797176, 794137, 790945, 788183, 786393, 785626, 785763, 786640, 787974, 789976, 793877, 800864, 810656, 822119, 835137, 850679, 869123, 889969, 913413, 940970, 974176, 1013750, 1060158, 1113835, 1174636, 1242256, 1317306, 1400588, 1490967, 1585318, 1680920, 1776419, 1870061, 1958642, 2038876, 2108182, 2163338, 2200193, 2216202, 2211920, 2188550]
51364B188550m3393o5058q5477j01007j10307j13807j12122j06240r7914q8595
51354A264630p8684o8462n8761n0241m2825l6410l1195k6984k3074j9311j6359
51343H12324j4555j3348j2212j1239j0521r828r213r053r160q759p665o672o301
51330F83798o052n351m462l895l552k975k031r82j88L6k61m33K36J630K901L480
51314F61899L591L703M017M503M998N320N649O483P710Q174O976M888L547L389
51300G34847L307K184k35l760p836j1141j2354j1678j0673j0306j0060r105p390
51287F45800n273l071j360p36p88k58J337L053L958M374N063O045P018Q229R905
51272F83296J1214J0830Q570N743L703K597J735P60O7J08P04J264J544J849K410
$$ y = [2188550, 2145157, 2080099, 1994622, 1893615, 1783308, 1669501, 1557379, 1451139, 1353225, 1264630, 1185946, 1117484, 1058723, 1008482, 965657, 929247, 898052, 871068, 847994, 828683, 812324, 797769, 784421, 772209, 760970, 750449, 740621, 731408, 722355, 713195, 704436, 696771, 690099, 683798, 677746, 672395, 667933, 664038, 660486, 657511, 655480, 654498, 654310, 654346, 654085, 653652, 653888, 655518, 658419, 661899, 665490, 669193, 673210, 677713, 682711, 688031, 693680, 700163, 707873, 716047, 723023, 727911, 731458, 734847, 738154, 740338, 740103, 736343, 728507, 717366, 705012, 693334, 682661, 672355, 662295, 653190, 645800, 640527, 637456, 636096, 635360, 634572, 634314, 635651, 638704, 642662, 647036, 652099, 658144, 665162, 673391, 683296, 694510, 705340, 713910, 719653, 723356, 725953, 727688, 728448, 728515, 728623, 729327, 730591, 732135, 733984, 736394]
51257G36394K936K916K083M38j727l678m606m493m106l828l161j907j035j490
51243G14736k721l414l261l002k988k889k736l009l566l566k791k016j725j303
51229F75749j51J135J417M84p29j258r87m47n6K86Q93J741K423K611K301J724
51213F87136J264J468K513L697M076L756L765M377M628L908L042L004L492L652
51199G33778L397L034K377J285M04K74L12j67n59Q3J285J734J270Q31P71O20L37
51182G51066L13J64j016l078m805n547n704n486m580l157k067j660j528j499j793
51167G09623k079j597m23M73P05R11J587K422L060L452L433K913K562L106L923
51152G34071L632K141Q18M29L64J88L86J001J002j08j259j343p28m92r30j656
$$ y = [736394, 739330, 742246, 744329, 744767, 743040, 739362, 734756, 730263, 726157, 722329, 719168, 717261, 716226, 714736, 712015, 708601, 705340, 702338, 699350, 696461, 693725, 690716, 687150, 683584, 680793, 678777, 677052, 675749, 675598, 676733, 678150, 678634, 677905, 676647, 675660, 675213, 675157, 675443, 676336, 678077, 680500, 683111, 685412, 687136, 688400, 689868, 692381, 696078, 700154, 703910, 707675, 712052, 716680, 720588, 723630, 726634, 730126, 733778, 737175, 740209, 742586, 743871, 744275, 744549, 744861, 744694, 744135, 744218, 745503, 747237, 748507, 749338, 750109, 750729, 751066, 751379, 751543, 750527, 747449, 742644, 737097, 731393, 725907, 721327, 718170, 716103, 714443, 712915, 711416, 709623, 707544, 705947, 705524, 705997, 706702, 707613, 709200, 711622, 714682, 718134, 721567, 724480, 727042, 730148, 734071, 737703, 739844, 740662, 741091, 741455, 741643, 742029, 743030, 744032, 743924, 742665, 741322, 740594, 740102, 739172, 737516]
51136G37516k406l056l323l077k536j865j118o06n83n58J85J393K228K819M067
51121G29080N761O441N632M625M417M303L422K402K310L005L640L973M190M165
51107G87366L890L895M360M485L606K305J561J483J555J561J382O07q20k058k352
51092H12826k056j922j922j659j350j486j860j814j322j003j171j509j575j219
51078G90958n23K31P40J013J370J977K696L430M071M184L413K357K165L060M071
51063H25213M531M990O192Q090J0283J2633J4918J6754J8432K1003K4775K8545
51051I96359L1061L2508L3736L4584L3954L1225K6975K2489J9004J7125J6616
51040A295636J6831J7177J6661J3512O704j945q758j1983j3359j5281j7748j9193
$$ y = [737516, 735110, 732054, 728731, 725654, 723118, 721253, 720135, 719529, 718946, 718388, 718573, 719966, 722194, 725013, 729080, 734841, 741282, 746914, 751539, 755956, 760259, 763681, 766083, 768393, 771398, 775038, 779011, 783201, 787366, 791256, 795151, 799511, 803996, 807602, 809907, 811468, 812951, 814506, 816067, 817449, 818056, 817236, 815178, 812826, 810770, 808848, 806926, 805267, 803917, 802431, 800571, 798757, 797435, 796432, 795261, 793752, 792177, 790958, 790435, 790666, 791406, 792419, 793789, 795766, 798462, 801892, 805963, 810147, 813560, 815917, 818082, 821142, 825213, 829744, 834734, 840926, 849016, 859299, 871932, 886850, 903604, 922036, 943039, 967814, 996359, 1027420, 1059928, 1093664, 1128248, 1162202, 1193427, 1220402, 1242891, 1261895, 1279020, 1295636, 1312467, 1329644, 1346305, 1359817, 1366521, 1364576, 1355818, 1343835, 1330476, 1315195, 1297447, 1278254]
51028A278254j8973j7580j5256j2074r124q238j0262j4215j8048j9825j8649j5165
51016A100845j0931o970l288J64K954N015O984R100J0712J1547J2462J4139J6043
51003A168776J7492J8752K0050K0586J9668J7945J6238J4104J0912P508N127L312
50991A340470O32k815n360o186o209o389o554o226n436m291k691p48J254L514
50977A292965O581J0477J4614J8689K2927K7467L2171L7182M2992M9805N7176
50966A613046O4347P0590P5488P9227Q2364Q4935Q6229Q6026Q5554Q6328Q8344
50955B502478R0157R0627Q9812Q8216Q5814Q1966P5988O7900N8739M9818M1491
50944C323006L3242K5080J8009J2698Q863O480O385Q501J0710J1028J0081R733
$$ y = [1278254, 1259281, 1241701, 1226445, 1214371, 1205247, 1197009, 1186747, 1172532, 1154484, 1134659, 1116010, 1100845, 1089914, 1082944, 1079656, 1079820, 1082774, 1087789, 1094773, 1103873, 1114585, 1126132, 1138594, 1152733, 1168776, 1186268, 1205020, 1225070, 1245656, 1265324, 1283269, 1299507, 1313611, 1324523, 1332031, 1337158, 1340470, 1341102, 1338287, 1332927, 1326741, 1320532, 1314143, 1307589, 1301363, 1295927, 1291636, 1288945, 1288197, 1289451, 1292965, 1299546, 1310023, 1324637, 1343326, 1366253, 1393720, 1425891, 1463073, 1506065, 1555870, 1613046, 1677393, 1747983, 1823471, 1902698, 1985062, 2069997, 2156226, 2242252, 2327806, 2414134, 2502478, 2592635, 2683262, 2773074, 2861290, 2947104, 3029070, 3105058, 3172958, 3231697, 3281515, 3323006, 3356248, 3381328, 3399337, 3412035, 3420898, 3427378, 3433763, 3442264, 3452974, 3464002, 3474083, 3483816]
50932C483816R690P220L35j0195k1984l2925m1854m8700n4432o0093o5715p0772
50920C094391p5460q0429q5433q9315r1529r2583r2876r2013q9625q6031q1793
50909B137304p7182p2249o6918o1107n5163m9918m5643m1381l6268l1083k7385
50898A573007k5271k3296k0646j8104j6449j5096j2971j0028p246n467m588l804
50886A410041k478q73L33J210K643M713O065N849N408O722R621J2185J3553J4706
50872A489698J6369J7845J8428J8561J8985J9796K0993K2939K5702K8696L1518
50861A729530L4418L7591M0728M3704M7023N1178N6272O2533P0438P9888Q9967
50850B343270J00003J10311J21509J33613J46180J58805J71167J82934J93930
$$ y = [3483816, 3493506, 3500726, 3501061, 3490866, 3468882, 3435957, 3394103, 3345403, 3290971, 3230878, 3165163, 3094391, 3018931, 2938502, 2853069, 2763754, 2672225, 2579642, 2486766, 2394753, 2305128, 2219097, 2137304, 2060122, 1987873, 1920955, 1859848, 1804685, 1754767, 1709124, 1667743, 1631475, 1600392, 1573007, 1547736, 1524440, 1503794, 1485690, 1469241, 1454145, 1441174, 1431146, 1423900, 1418433, 1413845, 1410041, 1407563, 1406690, 1407023, 1408233, 1410876, 1415589, 1421654, 1427503, 1432911, 1439633, 1449254, 1461439, 1474992, 1489698, 1506067, 1523912, 1542340, 1560901, 1579886, 1599682, 1620675, 1643614, 1669316, 1698012, 1729530, 1763948, 1801539, 1842267, 1885971, 1932994, 1984172, 2040444, 2102977, 2173415, 2253303, 2343270, 2443273, 2553584, 2675093, 2808706, 2954886, 3113691, 3284858, 3467792, 3661722]
50841C661722K04084K13096K20478K25812K28544K27639K22111K11853J97360
50832E612699J78775J55925J29348J00530P1131M2532J6065p227k6989m3032n4465
50821F175292o0254o0562n6688m9732m0422l0194k1273j5277j2658j3706j9137
50810E795389k9322m3804o1874q2781j05227j27531j48543j67602j83631j95431
50800D649643k03015k07443k08917k06237j98626j86998j72966j57699j42150
50791B965592j27243j12999r8457q3248o8381n4938m2949l2242k3285j6289j0486
50780B295075n272j286O68J066R74N78o38k708n199p980j1088j4092j6426j8186
50766B215486j9918k1872k3949k6014k7725k8582k8717k9046l0032l0776l0078
$$ y = [3661722, 3865806, 4078902, 4299380, 4525192, 4753736, 4981375, 5203486, 5415339, 5612699, 5791474, 5947399, 6076747, 6177277, 6248408, 6290940, 6307005, 6299778, 6272789, 6229757, 6175292, 6115038, 6054476, 5997788, 5948056, 5907634, 5877440, 5856167, 5840890, 5828232, 5814526, 5795389, 5766067, 5722263, 5660389, 5577608, 5472381, 5344850, 5196307, 5028705, 4845074, 4649643, 4446628, 4239185, 4030268, 3824031, 3625405, 3438407, 3265441, 3107742, 2965592, 2838349, 2725350, 2626893, 2543645, 2475264, 2420326, 2377377, 2345135, 2321850, 2305561, 2295075, 2289803, 2288517, 2289185, 2290251, 2291225, 2291803, 2291165, 2288457, 2283258, 2275278, 2264190, 2250098, 2233672, 2215486, 2195568, 2173696, 2149747, 2123733, 2096008, 2067426, 2038709, 2009663, 1979631, 1948855, 1918777]
50755A918777k7917k5149k2242j9148j6003j3036j0053o699l030P73M852R197
50743A790322J3206J6554K0057K4744L0404L6082M1767M8410N6262O4323P1786
50732B213917P9096Q7064R5561J03611J10411J15842J20157J23487J25656J26419
50722C301221J25759J23774J20247J14727J07082R7638Q6489P3193N7588M0374
50712D248092K2360L710j5361l3479m8618n9634o6450o8986o6899o0617n1803
50701C802315m2154l2304k2331j2936n594j586j287m425j0679j9842l1477m4727
50689C572973n8641p2557q5893r7692j06812j12703j15503j15249j11555j04412
50679B591956r4887q4452p3846o3048n2094m1346l1039k1141j1738l071M917J2707
$$ y = [1918777, 1890860, 1865711, 1843469, 1824321, 1808318, 1795282, 1785229, 1778530, 1775500, 1776273, 1781125, 1790322, 1803528, 1820082, 1840139, 1864883, 1895287, 1931369, 1973136, 2021546, 2077808, 2142131, 2213917, 2293013, 2380077, 2475638, 2579249, 2689660, 2805502, 2925659, 3049146, 3174802, 3301221, 3426980, 3550754, 3671001, 3785728, 3892810, 3990448, 4076937, 4150130, 4207718, 4248092, 4270452, 4274162, 4258801, 4225322, 4176704, 4117070, 4050620, 3981634, 3914735, 3854118, 3802315, 3760161, 3727857, 3705526, 3692590, 3686996, 3685410, 3684123, 3679698, 3669019, 3649177, 3617700, 3572973, 3514332, 3441775, 3355882, 3258190, 3151378, 3038675, 2923172, 2807923, 2696368, 2591956, 2497069, 2412617, 2338771, 2275723, 2223629, 2182283, 2151244, 2130103, 2118365, 2115294, 2120211, 2132918]
50667B132918K0636K8353L5061M0246M4030M6718M8048M7182M3738L8706L3768
50656B559404K9655K5651K0963J6009J1891R030O921N051L449K339J680J211P10
50643B693964K13J27J072L394O873J1040J5651K0706K6186L1979L7846M3294M7705
50630B940050N0817N2898N4246N4832N4735N4623N5354N7353O0760O5700P1537
50619C572905P5959P6035P0840O2248N2146L9263K0143o059l4513n7359o9516
50608C802092p1512o7206n9973n1456m2647l4691k8575k4862k3867k5543k9204
50597C342556l4055m0036m7537n6205o4706p1949p7872q2701q6085q7462q6855
50586B607093q4759q1566p7532p2968o8039o2637n6898n1603m7507m4423m1454
$$ y = [2132918, 2153554, 2181907, 2216968, 2257214, 2301244, 2347962, 2396010, 2443192, 2486930, 2525636, 2559404, 2589059, 2614710, 2635673, 2651682, 2663573, 2672603, 2679524, 2684575, 2688024, 2690363, 2692043, 2693254, 2693964, 2694177, 2694304, 2695376, 2698770, 2705643, 2716683, 2732334, 2753040, 2779226, 2811205, 2849051, 2892345, 2940050, 2990867, 3043765, 3098011, 3152843, 3207578, 3262201, 3317555, 3374908, 3435668, 3501368, 3572905, 3648864, 3724899, 3795739, 3857987, 3910133, 3949396, 3969539, 3963480, 3928967, 3871608, 3802092, 3730580, 3663374, 3603401, 3551945, 3509298, 3474607, 3446032, 3421170, 3397303, 3371760, 3342556, 3308501, 3268465, 3220928, 3164723, 3100017, 3028068, 2950196, 2867495, 2781410, 2693948, 2607093, 2522334, 2440768, 2363236, 2290268, 2222229, 2159592, 2102694, 2051091, 2003584, 1959161, 1917707]
50575A917707l8031l4286l0447k6475k2372j8375j4555j0589o222j755K391O389
50563A723380J0814J5523J9402K1662K3060K5144K8326L1564L4049L6287L9050
50552B008261M2100M4721M6846M8628M9480M8715M7055M6208M6762M7455M6851
50541B523082M4828M2142L9408L7038L5475L4840L4835L5331L6679L9122M2364
50530B945144M5980M9720N3216N6058N8559O1816O6536P2253P8109Q3942R0114
50519C661447R6608J02700J07299J09386J08628J05814J02176R7928R1941Q3197
50509D667124P1926N8863M4038K7121Q635r913k7167m2634n6383o8440p8535q6133
50497D508502r0625r1556q8769q2466p3323o2321n0132l6780k2317p644N840J7181
$$ y = [1917707, 1879676, 1845390, 1814943, 1788468, 1766096, 1747721, 1733166, 1722577, 1716355, 1714600, 1716991, 1723380, 1734194, 1749717, 1769119, 1790781, 1813841, 1838985, 1867311, 1898875, 1932924, 1969211, 2008261, 2050361, 2095082, 2141928, 2190556, 2240036, 2288751, 2335806, 2382014, 2428776, 2476231, 2523082, 2567910, 2610052, 2649460, 2686498, 2721973, 2756813, 2791648, 2826979, 2863658, 2902780, 2945144, 2991124, 3040844, 3094060, 3150118, 3208677, 3270493, 3337029, 3409282, 3487391, 3571333, 3661447, 3758055, 3860755, 3968054, 4077440, 4186068, 4291882, 4394058, 4491986, 4583927, 4667124, 4739050, 4797913, 4841951, 4869072, 4877707, 4867794, 4840627, 4797993, 4741610, 4673170, 4594635, 4508502, 4417877, 4326321, 4237552, 4155086, 4081763, 4019442, 3969310, 3932530, 3910213, 3902569, 3908409, 3925590]
50485C925590K5796L0773L1190K7075J9073P076r623l0567n3535p6153r7051j15207
50473C684437j29419j39192j45086j47428j45640j39627j30824j20913j10328
50464B475980r9014q7653p7012o6825n6614m7011l8978l2267k5894j9881j5137
50453A909694j1887r474p624o655o314n577l850j460J225M305P857J1631J5441
50440A897312J9215K2658K5465K7852L0186L2190L3211L3209L2672L1562K9247
50429B214779K5539K1089J6524J1974P700M439K776K516K987L573L924L959L873
50416B325652L909M213N056O924R932J3482J7018K0838K5494L0746L5838M0622
50404B539724M5459N0070N3419N4974N5285N5081N4425N2919N0128M5709L9698
$$ y = [3925590, 3951386, 3982159, 4013349, 4040424, 4059497, 4066573, 4056950, 4026383, 3972848, 3896695, 3799644, 3684437, 3555018, 3415826, 3270740, 3123312, 2977672, 2838045, 2707221, 2586308, 2475980, 2376966, 2289313, 2212301, 2145476, 2088862, 2041851, 2002873, 1970606, 1944712, 1924831, 1909694, 1897807, 1888333, 1880709, 1874054, 1867740, 1862163, 1858313, 1856853, 1858078, 1862383, 1870240, 1881871, 1897312, 1916527, 1939185, 1964650, 1992502, 2022688, 2054878, 2088089, 2121298, 2153970, 2185532, 2214779, 2240318, 2261407, 2277931, 2289905, 2297605, 2302044, 2304820, 2307336, 2310323, 2313896, 2317820, 2321779, 2325652, 2329561, 2333774, 2338830, 2345754, 2355686, 2369168, 2386186, 2407024, 2432518, 2463264, 2499102, 2539724, 2585183, 2635253, 2688672, 2743646, 2798931, 2854012, 2908437, 2961356, 3011484, 3057193, 3096891]
50393C096891L2912K6369K0090J2979M179o073j7081k8558m0305n1583o1327o8914
50381B919579p4315p7575p8360p6180p1045o3833n5747m7259l7903k7376j6502
50370B293484o629J566Q135J2899J5202J4612J1326N709j963j1224k1276l1333
50358B290508m0783m8969n5188n8982o0294n9338n6633n2986m9064m5007m0728
50347A722536l6414l2346k8471k4601k0888j7612j4625j1471p909l841R74O458
50335A531790J1519J4612J5099J3558J0626O205O0p172j3944j8626k0412j9573
50323A523742j6925j3099q553m139q73J261L519O739J0048J2114J3135J4459J6538
50310A557966J8391J9148J8981J8390J7541J6652J6204J6439J7372J9401K3154
$$ y = [3096891, 3129803, 3156172, 3176262, 3189241, 3193420, 3187347, 3170266, 3141708, 3101403, 3049820, 2988493, 2919579, 2845264, 2767689, 2689329, 2613149, 2542104, 2478271, 2422524, 2375265, 2337362, 2309986, 2293484, 2286855, 2288421, 2296556, 2309455, 2324657, 2339269, 2350595, 2356304, 2354341, 2343117, 2321841, 2290508, 2249725, 2200756, 2145568, 2086586, 2026292, 1966954, 1910321, 1857335, 1808271, 1763264, 1722536, 1686122, 1653776, 1625305, 1600704, 1579816, 1562204, 1547579, 1536108, 1528199, 1524358, 1525332, 1531790, 1543309, 1557921, 1573020, 1586578, 1597204, 1603409, 1603469, 1596297, 1582353, 1563727, 1543315, 1523742, 1506817, 1493718, 1485165, 1481026, 1480153, 1481414, 1484933, 1491672, 1501720, 1513834, 1526969, 1541428, 1557966, 1576357, 1595505, 1614486, 1632876, 1650417, 1667069, 1683273, 1699712, 1717084, 1736485, 1759639]
50299A759639K8555L4886M1903M9684N6841O0240N7848N1236M3705L5762K3730
50288B244029L894k2305m7948o5748p3192p2771o8290o1965n4700m7280m0349
50277A693375l3978k8250k3703k0384j7172j3039q551m955k234O41L802O254P578
50264A559384Q538R747J0981J2198J3865J5822J6999J7027J7150J8755K1767K5162
50252A747395K8255L0868L2940L4715L6711L8871M0381M0970M1696M3598M6212
50241B162612M8250M9258M9620M9406M8288M6409M4313M1950L8749L4837L1283
50230B644975K8704K6282K2546J6733Q920o40j1679k3478l4863m4782n2629n7913
50218B522176o0022n8625n4184m7768m0458l3195k7031k3000k1538k2413k5221
$$ y = [1759639, 1788194, 1823080, 1864983, 1914667, 1971508, 2031748, 2089596, 2140832, 2184537, 2220299, 2244029, 2247923, 2225618, 2177670, 2111922, 2038730, 1965959, 1897669, 1835704, 1781004, 1733724, 1693375, 1659397, 1631147, 1607444, 1587060, 1569888, 1556849, 1548298, 1543343, 1541109, 1541750, 1545552, 1551806, 1559384, 1567922, 1577669, 1588650, 1600848, 1614713, 1630535, 1647534, 1664561, 1681711, 1700466, 1722233, 1747395, 1775650, 1806518, 1839458, 1874173, 1910884, 1949755, 1990136, 2031106, 2072802, 2116400, 2162612, 2210862, 2260120, 2309740, 2359146, 2407434, 2453843, 2498156, 2540106, 2578855, 2613692, 2644975, 2673679, 2699961, 2722507, 2739240, 2748160, 2747520, 2735841, 2712363, 2677500, 2632718, 2580089, 2522176, 2462154, 2403529, 2349345, 2301577, 2261119, 2227924, 2200893, 2177893, 2156355, 2133942, 2108721]
50207B108721k9551l4409l8125l9405l8243l5490l1898k8017k4644k2642k2285
50196A764012k3046k3938k3982k2818k1222k0520k1075k1820k1736k1119k0690
50185A522046k0231j9096j7583j6594j6153j5383j3920j2299j1004r991r124q196
50173A352472o608m082j553k78K1Q87K878M835N723N956O355O902P201P329P514
50158A395552P620P520P472P586P510P059O689P005Q151R882J1749J3142J3717
50145A510654J3855J4169J4546J4397J3646J2642J1280R354P779Q083J0454J3590
50133A654449J6865K1280K7735L5664M4135N3067O2523P1862Q0474Q8356R5110
50122B251520R9505J00909J00269R8653R5958R2117Q8469Q6328Q4859Q1850P6206
$$ y = [2108721, 2079170, 2044761, 2006636, 1967231, 1928988, 1893498, 1861600, 1833583, 1808939, 1786297, 1764012, 1740966, 1717028, 1693046, 1670228, 1649006, 1628486, 1607411, 1585591, 1563855, 1542736, 1522046, 1501815, 1482719, 1465136, 1448542, 1432389, 1417006, 1403086, 1390787, 1379783, 1369792, 1360668, 1352472, 1345864, 1341782, 1340229, 1339951, 1339972, 1340859, 1343737, 1348572, 1354295, 1360251, 1366606, 1373508, 1380709, 1388038, 1395552, 1403172, 1410692, 1418164, 1425750, 1433260, 1440319, 1447008, 1454013, 1462164, 1472046, 1483795, 1496937, 1510654, 1524509, 1538678, 1553224, 1567621, 1581267, 1593909, 1605189, 1614543, 1622322, 1630405, 1640859, 1654449, 1671314, 1692594, 1720329, 1755993, 1800128, 1853195, 1915718, 1987580, 2068054, 2156410, 2251520, 2351025, 2451934, 2552203, 2650856, 2746814, 2838931, 2927400, 3013728, 3098587, 3180437, 3256643]
50111C256643O8265N8061M4787K8084Q632j2724l5288n7740p7946r4095j05709
50100C080970j13368j17802j19291j17677j12991j06086r8334r0524q2578p4558
50090B047761o7245o1200n5966n0891m6187m2419l9378l6314l2983k9715k6690
50079A558773k3832k1254j9157j7419j5767j4204j2885j1843j1105j0733j0411
50068A390163r566q265p349p156o837n501l384j167J025L196M791N558O410Q311
50054A370229J0775J2611J3770J5178J7082J8845K0229K1539K2401K1852J9958
50043A564469J8145J7408J7162J6463J5474J5012J5194J5283J4690J3546J2348
50032A735194J1345J0358R118P742O771O589P007P543P963Q351Q922R959J1739
$$ y = [3256643, 3324908, 3382969, 3427756, 3455840, 3464472, 3451748, 3416460, 3358720, 3280774, 3186679, 3080970, 2967602, 2849800, 2730509, 2612832, 2499841, 2393755, 2295421, 2204897, 2122319, 2047761, 1980516, 1919316, 1863350, 1812459, 1766272, 1723853, 1684475, 1648161, 1615178, 1585463, 1558773, 1534941, 1513687, 1494530, 1477111, 1461344, 1447140, 1434255, 1422412, 1411307, 1400574, 1390163, 1380597, 1372332, 1364983, 1357827, 1350990, 1345489, 1342105, 1340938, 1341963, 1345159, 1349950, 1355508, 1361918, 1370229, 1381004, 1393615, 1407385, 1422563, 1439645, 1458490, 1478719, 1500258, 1522659, 1544511, 1564469, 1582614, 1600022, 1617184, 1633647, 1649121, 1664133, 1679327, 1694610, 1709300, 1722846, 1735194, 1746539, 1756897, 1766015, 1773757, 1780528, 1787117, 1794124, 1801667, 1809630, 1817981, 1826903, 1836862, 1848601]
$$ [...]
##END NTUPLES=NMR SPECTRUM
##END=
