
##TITLE=AC1233_PERAH12114_6519287_kQ2xMY586G
##JCAMPDX= 6.0         $$ Bruker NMR JCAMP-DX V2.0
##DATA TYPE= NMR SPECTRUM
##DATA CLASS= NTUPLES
##ORIGIN= BRUKER
##OWNER= Administrator
$$ 1.72 TOPSPIN		Version 2.1
$$ 2012-07-13 16:29:48.265 -0500  Administrator@TOPSPIN
$$ Compression mode = diff/dup
##.OBSERVE FREQUENCY= 400.02188249412
##.OBSERVE NUCLEUS= ^1H
##.ACQUISITION MODE= SIMULTANEOUS (DQD)
##.ACQUISITION SCHEME= undefined
##.AVERAGES= 8
##.DIGITISER RES= 22
##SPECTROMETER/DATA SYSTEM= spect
##.PULSE SEQUENCE= zg30
##.SOLVENT NAME= COFFEE_meoh
##.SHIFT REFERENCE= INTERNAL, COFFEE_meoh, 1, 14.98509
##AUDIT TRAIL= $$ (NUMBER, WHEN, WHO, WHERE, PROCESS, VERSION, WHAT)
$$ ##TITLE= Audit trail, TOPSPIN		Version 2.1
$$ ##JCAMPDX= 5.01
$$ ##ORIGIN= Bruker BioSpin GmbH
$$ ##OWNER= Administrator
$$ $$ C:\Bruker\TOPSPIN/data/COFFEE/nmr/AC1233_PERAH12114_6519287_kQ2xMY586G/50/pdata/1/auditp.txt
$$ ##AUDIT TRAIL=  $$ (NUMBER, WHEN, WHO, WHERE, PROCESS, VERSION, WHAT)
(   1,<2012-07-13 16:29:41.125 -0500>,<Administrator>,<TOPSPIN>,<go>,<TOPSPIN 2.1>,
      <created by zg
	started at 2012-07-13 16:28:34.218 -0500,
	POWCHK enabled, PULCHK disabled,
       configuration hash MD5:
       6B 1B 68 BB D9 2E 58 E2 7F 35 AD 54 07 DF 0E 41
       data hash MD5: 64K
       01 B4 C2 AC 40 85 15 36 56 B3 29 2F FA 02 AB 49>)
(   2,<2012-07-13 16:29:43.750 -0500>,<Administrator>,<TOPSPIN>,<proc1d>,<TOPSPIN 2.1>,
      <Start of raw data processing
       efp LB = 0 FT_mod = 6 PKNL = 1 PHC0 = 0 PHC1 = 0 SI = 32K 
       data hash MD5: 32K
       20 F6 7C E8 94 81 7A 9D 6B E0 32 B4 4D B5 F4 97>)
(   3,<2012-07-13 16:29:44.140 -0500>,<Administrator>,<TOPSPIN>,<proc1d>,<TOPSPIN 2.1>,
      <pk PHC0 = 178.0225 PHC1 = 0 
       data hash MD5: 32K
       B0 19 D6 98 83 73 D9 64 56 15 20 39 09 2E 4A 4A>)
(   4,<2012-07-13 16:29:44.265 -0500>,<Administrator>,<TOPSPIN>,<proc1d>,<TOPSPIN 2.1>,
      <abs ABSG = 1 
       data hash MD5: 32K
       9B BC 74 F1 FA 89 C2 AE 41 F5 6F 7A 9C 26 61 C2>)
(   5,<2012-07-13 16:29:44.296 -0500>,<Administrator>,<TOPSPIN>,<proc1d>,<TOPSPIN 2.1>,
      <abs ABSG = 2 
       data hash MD5: 32K
       74 B2 7E 48 23 1B 1D C6 07 CA EB AC 48 E9 7B 8B>)
(   6,<2012-07-13 16:29:44.328 -0500>,<Administrator>,<TOPSPIN>,<proc1d>,<TOPSPIN 2.1>,
      <abs ABSG = 3 
       data hash MD5: 32K
       DE ED D0 C9 C0 F2 39 91 5A 6E C4 96 95 23 EF 7B>)
(   7,<2012-07-13 16:29:44.359 -0500>,<Administrator>,<TOPSPIN>,<proc1d>,<TOPSPIN 2.1>,
      <abs ABSG = 4 
       data hash MD5: 32K
       78 00 7C 9D E4 8B 3B 4A 50 33 D6 B8 1D 4E FF B1>)
(   8,<2012-07-13 16:29:44.390 -0500>,<Administrator>,<TOPSPIN>,<proc1d>,<TOPSPIN 2.1>,
      <abs ABSG = 5 
       data hash MD5: 32K
       99 0A F4 E0 64 82 EC AC 1E 82 59 10 7B AD 16 8E>)
$$ ##END=
$$ 
$$ $$ hash MD5
$$ $$ B0 29 F3 C3 A0 93 55 71 E0 F6 7C CC 00 51 4D 7A
##$RELAX= 
##$RELAX= 
##$RELAX= 
##$RELAX= 
##$RELAX= 
##$RELAX= 
##$RELAX= 
##$RELAX= 
$$ Bruker specific parameters
$$ [...]
150 150 150 150 150 150 150 150
##$TP07= 0
##$TPNAME0= <>
##$TPNAME1= <>
##$TPNAME2= <>
##$TPNAME3= <>
##$TPNAME4= <>
##$TPNAME5= <>
##$TPNAME6= <>
##$TPNAME7= <>
##$TPOAL= (0..7)
0.5 0.5 0.5 0.5 0.5 0.5 0.5 0.5
##$TPOFFS= (0..7)
0 0 0 0 0 0 0 0
##$TUNHIN= 0
##$TUNHOUT= 0
##$TUNXOUT= 0
##$USERA1= <user>
##$USERA2= <user>
##$USERA3= <user>
##$USERA4= <user>
##$USERA5= <user>
##$V9= 5
##$VALIST= <valist>
##$VCLIST= <CCCCCCCCCCCCCCC>
##$VD= 0
##$VDLIST= <DDDDDDDDDDDDDDD>
##$VPLIST= <PPPPPPPPPPPPPPP>
##$VTLIST= <TTTTTTTTTTTTTTT>
##$WBST= 2048
##$WBSW= 25
##$XGAIN= (0..3)
0 0 0 0
##$XL= 0
##$YL= 0
##$YMAX_a= 509979
##$YMIN_a= -651389
##$ZGOPTNS= <>
##$ZL1= 120
##$ZL2= 120
##$ZL3= 120
##$ZL4= 120
##$ABSF1= 14.98509
##$ABSF2= -5.573092
##$ABSG= 5
##$ABSL= 3
##$ALPHA= 0
##$AQORDER= 0
##$ASSFAC= 0
##$ASSFACI= 0
##$ASSFACX= 0
##$ASSWID= 0
##$AUNMP= <proc_prof1d_extract_pilot.lims>
##$AXLEFT= 0
##$AXNAME= <>
##$AXNUC= <1H>
##$AXRIGHT= 0
##$AXTYPE= 0
##$AXUNIT= <>
##$AZFE= 0.1
##$AZFW= 0.1
##$BCFW= 0
##$BC_mod= 0
##$BYTORDP= 0
##$COROFFS= 0
##$CY= 15
##$DATMOD= 1
##$DC= 0
##$DFILT= <>
##$DTYPP= 0
##$F1P= 0
##$F2P= 0
##$FCOR= 0.5
##$FTSIZE= 32768
##$FT_mod= 6
##$GAMMA= 0
##$GB= 0
##$INTBC= 1
##$INTSCL= 1
##$ISEN= 128
##$LB= 0
##$LEV0= 0
##$LPBIN= 0
##$MAXI= 10000
##$MC2= 0
##$MEAN= 0
##$ME_mod= 0
##$MI= 0
##$NCOEF= 0
##$NC_proc= -8
##$NLEV= 6
##$NOISF1= 0
##$NOISF2= 0
##$NSP= 0
##$NTH_PI= 0
##$NZP= 0
##$OFFSET= 14.98509
##$PC= 1
##$PHC0= 178.0225
##$PHC1= 0
##$PH_mod= 1
##$PKNL= yes
##$PPARMOD= 0
##$PPDIAG= 0
##$PPIPTYP= 0
##$PPMPNUM= 2147483647
##$PPRESOL= 1
##$PSCAL= 4
##$PSIGN= 0
##$PYNMP= <proc.py>
##$REVERSE= no
##$SF= 400.02
##$SI= 32768
##$SIGF1= 0
##$SIGF2= 0
##$SINO= 400
##$SIOLD= 32768
##$SPECTYP= <>
##$SREGLST= <1H.CDCl3>
##$SSB= 0
##$STSI= 32768
##$STSR= 0
##$SW_p= 8223.68421052631
##$SYMM= 0
##$S_DEV= 0
##$TDeff= 65536
##$TDoff= 0
##$TI= <>
##$TILT= no
##$TM1= 0
##$TM2= 0
##$TOPLEV= 0
##$USERP1= <user>
##$USERP2= <user>
##$USERP3= <user>
##$USERP4= <user>
##$USERP5= <user>
##$WDW= 1
##$XDIM= 32768
##$YMAX_p= 477011234
##$YMIN_p= -718549
##$CURPLOT= <Network HP LaserJet P1505>
##$CURPRIN= <$Network HP LaserJet P1505>
##$DFORMAT= <normdp>
##$LAYOUT= <+/1D_H.xwp>
##$LFORMAT= <normlp>
##$PFORMAT= <normpl>
##$SURQMSG= 1
$$ End of Bruker specific parameters
$$ ---------------------------------
##NTUPLES= NMR SPECTRUM
##VAR_NAME=  FREQUENCY,     SPECTRUM/REAL,   SPECTRUM/IMAG
##SYMBOL=    X,             R,               I
##VAR_TYPE=  INDEPENDENT,   DEPENDENT,       DEPENDENT
##VAR_FORM=  AFFN,          ASDF,            ASDF
##VAR_DIM=   32768,         32768,           32768
##UNITS=     HZ,            ARBITRARY UNITS, ARBITRARY UNITS
##FACTOR=    0.250966925370066, 1,           1
##FIRST=     8223.43324360094, 263720,       -135899
##LAST=      0,             75175,           -110814
##MIN=       0,             -718549,         0
##MAX=       8223.43324360094, 477011234,    0
$$ Real data points
##PAGE= N=1
##DATA TABLE= (X++(R..R)), XYDATA
$$ [...]
19564i7664L6359j38408a6323j78915A85352D2830b8245l2528p9299G2179J03215
$$ -97664 -61305 -199713 -16323 -195238 185352 42830 -28245 -60773 -140072 72179 175394
19553A75394q4393i4037A06563a81349j22925A27962R733J82236c13404J52267
$$ 175394 91001 -94037 106563 -181349 -304274 127962 137695 319931 -313404 -161137
19543a61137f3101k32926F6566L938C5081Q8386B2810e722j33374B39222a11513
$$ -161137 -63101 -296027 66566 70504 35081 123467 22810 -5722 -139096 239222 -111513
19531b0870j26326N5256j49685J9669A49406P0835c46943f9553A12300A5315d4035
$$ -20870 -147196 -91940 -241625 -221956 149406 220241 -346943 -69553 112300 15315 -44035
19519A41017l5800J30576b73979a16977C3371a20966H8894J32106a273j11335
$$ 141017 105217 235793 -273979 -116977 33371 -120966 88894 221000 -1273 -112608
19509a12608G5880j1894A3644a28396A87843c3456F4819J11103a61997J7288E3887
$$ -112608 75880 63986 13644 -128396 187843 -33456 64819 175922 -161997 -144709 53887
19497a925F1146a78813p0493J23672d1436A16549J4565k2876J0737a82888h5476
$$ -1925 61146 -178813 -249306 -125634 -41436 116549 131114 108238 118975 -182888 -85476
19485A06393b26963m804J11248k3745k5474A6754P353K06385p256L4531c84716
$$ 106393 -226963 -231767 -120519 -144264 -169738 16754 24107 230492 223236 257767 -384716
19473e65193H0197a40206B17512b48708a16226N085j11250b8182j63849J5622
$$ -565193 80197 -140206 217512 -248708 -116226 -111141 -222391 -28182 -192031 -176409
19463a76409J0215b223n71242J15903a76683j513D479J76941J07481a13328a9143
$$ -176409 -166194 -2223 -573465 -457562 -176683 -178196 4479 181420 288901 -113328 -19143
19451b66003B05823f2245C8437b24414A4141n650L03953j51871D0351L5454b82698
$$ -266003 205823 -62245 38437 -224414 14141 8491 312444 160573 40351 75805 -282698
19439F67K57558b20221E3073g7142B98100M3083c0291R663p2079c1238j07200
$$ 667 258225 -220221 53073 -77142 298100 341183 -30291 -20628 -92707 -31238 -138438
19428a38438N3105B33292b32033I5689b0433B10272a40593c5988k2718o7372o8068
$$ -138438 -85333 233292 -232033 95689 -20433 210272 -140593 -35988 -58706 -126078 -194146
19417a94146f8336A88251B6578b3012A42831a17672j33833B8661L3634e3654A15405
$$ -194146 -68336 188251 26578 -23012 142831 -117672 -251505 28661 62295 -53654 115405
19405A51633c06348C0109i4366n9577L6445C2489K24844e7709k15748R5981A71559
$$ 151633 -306348 30109 -94366 -153943 -117498 32489 257333 -57709 -273457 -177476 171559
19393b48599H950d1917J5737r3505j63714j18922a85744E7897a04779A9073P640
$$ -248599 8950 -41917 -26180 -119685 -283399 -402321 -185744 57897 -104779 19073 26713
19382B6713b91690r7113A7602L23418h4110B69409g4324j64153h6885k67925A46013
$$ 26713 -291690 -388803 17602 341020 -84110 269409 -74324 -238477 -86885 -354810 146013
19370d10118a09547k57339J61365N3551i024j39596A79610k6237b44464b293r191
$$ -410118 -109547 -366886 -205521 -151970 -9024 -148620 179610 153373 -244464 -2293 -11484
19359a1484E8870a32684j14269F2605b53105C362K64276o6759F6380B1285b74926
$$ -11484 58870 -132684 -246953 62605 -253105 3362 267638 200879 66380 21285 -274926
19347b8924l13685b0527j55045j22267D493d8524d533k51526N6519d6717q8442
$$ -28924 -342609 -20527 -175572 -297839 4493 -48524 -4533 -256059 -199540 -46717 -135159
19336a35159j9669e0703E1785q490L7670A1893d43671e8295A6735d8091l01385
$$ -135159 -154828 -50703 51785 43295 80965 11893 -443671 -58295 16735 -48091 -349476
19325c49476k4624G3051Q097b5193k4537q4734a127B28K08291B3423i5043D4511
$$ -349476 -374100 73051 81148 -25193 -49730 -134464 -1127 228 208519 23423 -95043 44511
19312a32213k6582e8509B1622b56828d6574m7545I9293K08894a43879r6956C61565
$$ -132213 -158795 -58509 21622 -256828 -46574 -94119 99293 308187 -143879 -240835 361565
19300f5410A8293b0024A85158a74313J0536A49555b24630A0895L6871K37068j37346
$$ -65410 18293 -20024 185158 -174313 -163777 149555 -224630 10895 47766 284834 147488
19289A47488d2096F3269c5786q4551j70144A25169A5257c97452B52970b04828
$$ 147488 -42096 63269 -35786 -120337 -290481 125169 15257 -397452 252970 -204828
19278b537F4293J1208a8307G0145L5392b76476h511j16205k23324I0605h6890
$$ -2537 64293 75501 -18307 70145 105537 -276476 -8511 -124716 -348040 90605 -86890
19266d4139a9365j39531b2579j16967D4442K8644J53517H411J58585f6792A05798
$$ -44139 -19365 -158896 -22579 -139546 44442 73086 226603 8411 166996 -66792 105798
19254B45909i6559A45912a06213m0481G4637a16721b5657n0085I6924a60074B26708
$$ 245909 -96559 145912 -106213 -146694 74637 -116721 -25657 -75742 96924 -160074 226708
19242b13609B80640l9220e50741a43552K4609A00930a77595k57316K14183A84872
$$ -213609 280640 241420 -550741 -143552 -118943 100930 -177595 -434911 -220728 184872
19231d0877H0585N634k8604N94325a43023E163a35353a1636H0626d4604A8488
$$ -40877 80585 86219 57615 651940 -143023 5163 -135353 -11636 80626 -44604 18488
19219C0712O228c79206H2268A9993K02771C3816a45625A64197m6632O4540B4148
$$ 30712 36940 -379206 82268 19993 222764 33816 -145625 164197 117565 182105 24148
19207a7871E4238K163A0417b00978E9777e1140D4856a13479B0590a15459B6919
$$ -17871 54238 56401 10417 -200978 59777 -51140 44856 -113479 20590 -115459 26919
19195D908J03543a00950q9238j59924A31425l7297d09655B9763d3341B28174b49309
$$ 4908 108451 -100950 -190188 -350112 131425 94128 -409655 29763 -43341 228174 -249309
19183A66682j7241D3607L48e5074o2359A30586c24067a01392r6522I7765a49965
$$ 166682 149441 43607 43955 -55074 -117433 130586 -324067 -101392 -197914 97765 -149965
19171B36886b83967h1003A18451a9485k71562A62474b06606A67273e6620n0562
$$ 236886 -283967 -81003 118451 -19485 -291047 162474 -206606 167273 -56620 -107182
19161a07182k34111J19050R4983N0694n024p7261k5657A10858c42053a17102d4543
$$ -107182 -341293 -222243 -127260 -76566 -81590 -158851 -184508 110858 -342053 -117102 -44543
19149b17533M0370g5991m0378B31760a08060n7130P6304A28702a25352H827g8383
$$ -217533 -177163 -75991 -116369 231760 -108060 -165190 -88886 128702 -125352 8827 -78383
19137A34039D021d13595B12794B6127a31507H4360b02925f2038D8247M2412g1592
$$ 134039 4021 -413595 212794 26127 -131507 84360 -202925 -62038 48247 90659 -71592
19125h3031p548j63036a05505L8113a0051j14735A94161G321a11403l6384B44176
$$ -83031 -90579 -253615 -105505 -67392 -10051 -124786 194161 7321 -111403 -147787 244176
19113a07905I3320E351h33r9020k6671A49751P4431b74818a28059A07782k8352
$$ -107905 93320 5351 -833 -99853 -126524 149751 224182 -274818 -128059 107782 79430
19102G9430C8155f6662k19636N8810l3903D3903d5290D8860b54485M6183r2090
$$ 79430 38155 -66662 -286298 -227488 -261391 43903 -45290 48860 -254485 -208302 -300392
19091c00392A34681a76401r2333A2883h7701n7210A17049c18267l369g4804n41190
$$ -300392 134681 -176401 -268734 12883 -87701 -144911 117049 -318267 -321636 -74804 -615994
19080f15994E4773a97690B08740a48155k11309J65986P175j82173J42099c5701
$$ -615994 54773 -197690 208740 -148155 -359464 -193478 -186303 -368476 -226377 -35701
19069A98397d7107q2527j05442A01407J28074g0269k00284i5192n7272j75643
$$ 198397 -47107 -129634 -235076 101407 229481 -70269 -270553 -95192 -152464 -328107
19059c28107A64803K8866D3109c75696J34561A43308a3035j16780O1269j57109
$$ -328107 164803 193669 43109 -375696 -241135 143308 -13035 -129815 -68546 -225655
19049b25655A7535h0156A50206a01764C3797A886i7024o3004F7526c7917j64672
$$ -225655 17535 -80156 150206 -101764 33797 1886 -97024 -160028 67526 -37917 -202589
19038b02589F5570J48412l5430h923m3508m2204B87338F602M00894b35965B74880
$$ -202589 65570 213982 178552 -8923 -52431 -94635 287338 6602 407496 -235965 274880
19026g1722D41653C8282J48547f907A69108B894J11986M82B6997e726r1273l19001
$$ -71722 441653 38282 186829 -6907 169108 2894 114880 115362 26997 -5726 -96999 -416000
19014d16000D8982h7883M0203A31485A5994J22132a30483l007m466A77255B6847
$$ -416000 48982 -87883 -47680 131485 15994 138126 -130483 -133490 -137956 177255 26847
19002g4854j00230d6104k62832R9869n3315J20973j00376A05325M352b35991q6822
$$ -74854 -175084 -46104 -308936 -209067 -262382 -141409 -241785 105325 109677 -235991 -322813
18991c22813F0712a31152N1493j92894B55755b09607A44046J20493h2436j59580
$$ -322813 60712 -131152 -79659 -272553 255755 -209607 144046 264539 -82436 -242016
18981b42016B5612b27074h152D1263J97068e91175a61298c4968J1333m23842j1584
$$ -242016 25612 -227074 -8152 41263 238331 -591175 -161298 -34968 -23635 -447477 -459061
18970d59061F7127b22494g4254B09408a03272j34671e4436J6148l24647d6807
$$ -459061 67127 -222494 -74254 209408 -103272 -237943 -54436 -38288 -362935 -46807
18959G900b0231B23735p3324a19985j6486B62244D6907a46849B25130g1070k8467
$$ 7900 -20231 223735 150411 -119985 -136471 262244 46907 -146849 225130 -71070 -99537
18948i9537m61359J23967A31474B5697d57280A1057K12031a47284j4655j17804
$$ -99537 -560896 -436929 131474 25697 -457280 11057 223088 -147284 -161939 -279743
18938b79743o4122a47992f1195A42550Q4463o6563A5696b95586A15822f9060j53564
$$ -279743 -343865 -147992 -61195 142550 227013 160450 15696 -295586 115822 -69060 -222624
18927b22624A14975a70404j8045A30360b86061D0403b59940p3928c2456I5002
$$ -222624 114975 -170404 -188449 130360 -286061 40403 -259940 -333868 -32456 95002
18916b20889H3941I416i3818d68A70610d3043j30130A02598k6271a89299d8198
$$ -220889 83941 9416 -93818 -468 170610 -43043 -173173 102598 76327 -189299 -48198
18904C54210b5505q1799k03389C2619h0570E9239N4875b7483C3531h3168k13387
$$ 354210 -25505 -107304 -310693 32619 -80570 59239 114114 -27483 33531 -83168 -296555
18893b96555J46002B2073e9227n4750A70365p0941J3077K7801f3717J1919o4254
$$ -296555 -150553 22073 -59227 -113977 170365 99424 112501 140302 -63717 -51798 -116052
18882a16052d8222f933p8684j86445e5915G0860k4846f710j91427R0315k59551
$$ -116052 -48222 -6933 -85617 -272062 -55915 70860 46014 -6710 -198137 -107822 -367373
18871c67373i3269j19121k4856A63915G7094B1310b01711M4527B237e68284a55104
$$ -367373 -93269 -212390 -237246 163915 77094 21310 -201711 -157184 2237 -568284 -155104
18859c5515B23878p5496i3002J2624j34945A73452a34540C13093A34281B4240
$$ -35515 223878 148382 -93002 -80378 -215323 173452 -134540 313093 134281 24240
18848A14241a63178D56784B21256d6370I6222p348l4735a35885O0138A42311m7817
$$ 114241 -163178 456784 221256 -46370 96222 88874 54139 -135885 -75747 142311 94494
18837I4494b02412B2267h4928B2176b18194o6561a04955j35220F4240A8350M5764
$$ 94494 -202412 22267 -84928 22176 -218194 -284755 -104955 -240175 64240 18350 64114
18826F4114a1081j57987A27761k2934J2840J38417b89157A4653K38810a23860
$$ 64114 -11081 -169068 127761 104827 117667 256084 -289157 14653 253463 -123860
18815A17531a31033D1711K1065M0734K8901K43455i8867A40949L3700c82294c1069
$$ 117531 -131033 41711 62776 103510 132411 375866 -98867 140949 174649 -382294 -31069
18803a88045N9379e7515n0582o3716M1938I3457c80538A44435c75349i5276a0517
$$ -188045 -128666 -57515 -108097 -171813 -129875 93457 -380538 144435 -375349 -95276 -10517
18791A59770a11739j1814j00999f7424J6652A6661N6091a41083A59026a97994
$$ 159770 -111739 -123553 -224552 -67424 -50772 16661 72752 -141083 159026 -197994
18780a41035A95023b98686g6443A74770n0394E641a57305k54163D7604L01125
$$ -141035 195023 -298686 -76443 174770 124376 5641 -157305 -411468 47604 348729
18770C48729a86429q7202f8939A73321a08204A44063a99816k9012G7941a68511
$$ 348729 -186429 -273631 -68939 173321 -108204 144063 -199816 -228828 77941 -168511
18759d21916e4891l6925F0353J56213b3620j25175j21321f6419l97901a79679
$$ -421916 -54891 -91816 60353 216566 -23620 -148795 -270116 -66419 -464320 -179679
18748A81343a08367j127n0201o1046K422D29990D798M3113P9856j4674d6711a3294
$$ 181343 -108367 -109494 -159695 -220741 -218319 429990 4798 47911 127767 113093 -46711 -13294
18735d8023F6326c00029a03394j29920B96345A18314a53161k54530a84027A08686
$$ -48023 66326 -300029 -103394 -233314 296345 118314 -153161 -407691 -184027 108686
18724a69700A4212K65983d25194A8140b94677B17725a60694c9373j7453l65662
$$ -169700 14212 280195 -425194 18140 -294677 217725 -160694 -39373 -56826 -422488
18714d22488a92274d9713a2604n09413f192E199K31143A05480j4464l0615c20762
$$ -422488 -192274 -49713 -12604 -522017 -6192 5199 236342 105480 91016 60401 -320762
18702c1524B09213b60601g5851m2869A45884E9254a52321B89476b2117j87097
$$ -31524 209213 -260601 -75851 -118720 145884 59254 -152321 289476 -22117 -209214
18692b09214B05821B4497c00096a41223j29536J18320j3628A8142a63836a0657
$$ -209214 205821 24497 -300096 -141223 -270759 -152439 -166067 18142 -163836 -10657
18681a00439H8235a75036j70707a07654M8340P710E8198J12398m2396a24545a2187
$$ -100439 88235 -175036 -345743 -107654 -59314 -51604 58198 170596 128200 -124545 -12187
18669a11152k35644b034I0132K7859a6818j9346I3363g0008B77862b53860J12717
$$ -111152 -346796 -2034 90132 117991 -16818 -36164 93363 -70008 277862 -253860 -141143
18658a41143i855B66349a96664F498a10716k84239c6139l6678q9997B2163e9680
$$ -141143 -9855 266349 -196664 6498 -110716 -394955 -36139 -72817 -162814 22163 -59680
18646B57405g7649q3650P415g2927N704G5929a10500p4940J6585b328o7683A7570
$$ 257405 -77649 -161299 -153884 -72927 -67223 75929 -110500 -185440 -168855 -2328 -70011 17570
18633b61368e0827j8173j13932j60846J21899q5678h8842A40255a83367F2778
$$ -261368 -50827 -69000 -182932 -343778 -221879 -307557 -88842 140255 -183367 62778
18622a27907C21060h5969j0262j15279f1310j09031r3181B15946F0818l955J24760
$$ -127907 321060 -85969 -96231 -211510 -61310 -170341 -263522 215946 60818 56863 181623
18611A81623l9099a76469G217c09357A49197a1385k35820A19561h8408c6276j4592
$$ 181623 142524 -176469 7217 -309357 149197 -11385 -247205 119561 -88408 -36276 -50868
18600e0868A19190a49799B64360I8222L226D6073N1656O1646g0986j29289E1057
$$ -50868 119190 -149799 264360 98222 101448 46073 97729 159375 -70986 -200275 51057
18588c38211J00473J08035k0652E4058J0649a805A2190a82582I8063b19455g7782
$$ -338211 -237738 -129703 -150355 54058 64707 -1805 12190 -182582 98063 -219455 -77782
18576A08068b46047R5363H013J83076b03475j69994J73378o8153b7020B82279
$$ 108068 -246047 -150684 8013 191089 -203475 -373469 -200091 -268244 -27020 282279
18565g5424A97942o2372J12706H688d9192m68332d4641b019j05083B67779a09097
$$ -75424 197942 135570 248276 8688 -49192 -517524 -44641 -2019 -107102 267779 -109097
18553A3757c43894R9524a18478F9229b4248j3908r1712A46692g6051l12661a19057
$$ 13757 -343894 -244370 -118478 69229 -24248 -38156 -129868 146692 -76051 -388712 -119057
18541a03036r0773D4515b75752B20823A3665b2903m2277J7859J7331j23264j5480
$$ -103036 -193809 44515 -275752 220823 13665 -22903 -65180 -47321 -29990 -153254 -168734
18530a68734b2422F0723a84264j89138E6443O7120a3678G5230j2519i8831o3120
$$ -168734 -22422 60723 -184264 -373402 56443 123563 -13678 75230 62711 -98831 -161951
18519a61951p6590h4818q7836c2775E7717a6139k10910k5311J21750H1857d16765
$$ -161951 -238541 -84818 -172654 -32775 57717 -16139 -227049 -252360 -130610 81857 -416765
18507B767J2484a57353k166a3060j21753d7228o1841A07320L5816a91482A81444
$$ 2767 15251 -157353 -159519 -13060 -134813 -47228 -109069 107320 143136 -191482 181444
18495a37503E2415a11492m56496K17854I9100N0703d2704E7580c888r906E1234
$$ -137503 52415 -111492 -567988 -350134 99100 149803 -42704 57580 -3888 -13794 51234
18483a56191p4358E1437K00595l1541b43330l9575g6811o1941b6293C1240e39862
$$ -156191 -230549 51437 252032 220491 -243330 -282905 -76811 -138752 -26293 31240 -539862
18471d7084H3814a99973R5152K1766j1608A1834b26129f8848j30513c3644G9607
$$ -47084 83814 -199973 -104821 -83055 -94663 11834 -226129 -68848 -199361 -33644 79607
18459f1073I2767i2207m037a6687C7043l440J4848b54684R7660k66119c8772a780
$$ -61073 92767 -92207 -96244 -16687 37043 33603 48451 -254684 -157024 -423143 -38772 -1780
18446b99121A43851a4564l42503A46302D3954q607c93839A89286b07327p879h4156
$$ -299121 143851 -14564 -357067 146302 43954 35347 -393839 189286 -207327 -215206 -84156
18434B59516d81735b7465j35066f4995p7003A35250N7807q216J13679f3408A87177
$$ 259516 -481735 -27465 -162531 -64995 -141998 135250 193057 184841 298520 -63408 187177
18422d35807a17814E0605c8727q0777N0903q4m27409J96048A6170J3558L48830
$$ -435807 -117814 50605 -38727 -119504 -68601 -68685 -496094 -300046 16170 29728 378558
18411C78558h0265E9112a07161D8033a15056B98595j47109I932J22956J53034
$$ 378558 -80265 59112 -107161 48033 -115056 298595 151486 9932 132888 285922
18401B85922b75458A36035B0373a80573B2626K19304c14504A35935m8667c0826
$$ 285922 -275458 136035 20373 -180573 22626 241930 -314504 135935 87268 -30826
18390e2220F0963L588a10703C0748a6635J706j01534I6409b38942F7674a31769
$$ -52220 60963 64551 -110703 30748 -16635 -14929 -116463 96409 -238942 67674 -131769
18378a6448l07476A55537c5767j51464D682J07015b57249A04795A6793b15153
$$ -16448 -323924 155537 -35767 -187231 4682 111697 -257249 104795 16793 -215153
18367a13784Q970l6946A0588a70558C7738g533j44975C08278c10625B94350f8433
$$ -113784 -104814 -141760 10588 -170558 37738 -7533 -152508 308278 -310625 294350 -68433
18355B9083d37311H7581c5447k9441p6098j33778A30905J54297c11430B98457
$$ 29083 -437311 87581 -35447 -64888 -140986 -274764 130905 285202 -311430 298457
18344H9787K1710a4514j16220r5698c3876j36454a6126o1492D8753g0651B17790
$$ 89787 111497 -14514 -130734 -226432 -33876 -170330 -16126 -77618 48753 -70651 217790
18332A63411A7775J66814g6391p3497A32484L2179P3062c0179j58956a4324A48197
$$ 163411 17775 184589 -76391 -149888 132484 164663 237725 -30179 -189135 -14324 148197
18320c38755a05870B54252a24842n8076J9136C8819L17846D7832Q4406f0903H8144
$$ -338755 -105870 254252 -124842 -182918 -163782 38819 356665 47832 132238 -60903 88144
18308D1276b58602L3585N0611B01037c88774J76939F4480j1513a42700L0713M0923
$$ 41276 -258602 -225017 -174406 201037 -388774 -211835 64480 52967 -142700 -111987 -71064
18297g1064Q534J5472r2665A47520l2846K6937a46822c7266H7292K56453b7030
$$ -71064 -62530 -47058 -139723 147520 114674 141611 -146822 -37266 87292 343745 -27030
18285b69359K3956A39016M8132F3075a10665A35664q648c06758h561k23813a11303
$$ -269359 -245403 139016 187148 63075 -110665 135664 127016 -306758 -8561 -232374 -111303
18273b0207k02155j0067G2770h6504B16919h3767B75728m6395j12348c3198A42048
$$ -20207 -222362 -232429 72770 -86504 216919 -83767 275728 229333 116985 -33198 142048
18261A902b31596f5373j48849k13597G0630A7376J2808a541A16142l6898d5693
$$ 1902 -231596 -65373 -214222 -427819 70630 17376 30184 -1541 116142 79244 -45693
18249a29033i380k5318F75R84K67905j01957l3947D988b4117B29605b31801b9676
$$ -129033 -9380 -34698 675 1659 269564 167607 133660 4988 -24117 229605 -231801 -29676
18236b0382B16567a33668B14282c72126a03922b1253C26543E303a27656H1842
$$ -20382 216567 -133668 214282 -372126 -103922 -21253 326543 5303 -127656 81842
18225f3643C7880j7336a43880L7030A06675e46621G4497d6293A00973b3138D84693
$$ -63643 37880 20544 -143880 -106850 106675 -546621 74497 -46293 100973 -23138 484693
18213C2368b88877a12380B8387K8153a89991C3572O0102J38420b09602L8557C86961
$$ 32368 -288877 -112380 28387 56540 -189991 33572 93674 232094 -209602 -171045 386961
18201h792k85238J33054a8779l09321b2144B8262b44771C5316a47603M0128A93793
$$ -8792 -294030 -160976 -18779 -328100 -22144 28262 -244771 35316 -147603 -107475 193793
18189h692l6108j24852A47038a98175M8624d6910o71639a05396N766m27033K23927
$$ -8692 -44800 -169652 147038 -198175 -149551 -46910 -718549 -105396 -99630 -526663 -302736
18178c02736e2956J2774j02132N1994l37421h5237H777R0605K98458j51325a67435
$$ -302736 -52956 -40182 -142314 -90320 -427741 -85237 8777 99382 397840 246515 -167435
18166b31602b2301C2191K52705b10209C4676J35908g7283p1447M0419j58308B22693
$$ -231602 -22301 32191 284896 -210209 34676 170584 -77283 -148730 -108311 -266619 222693
18154A26541d16616e3186D4330j3082b88582R7477H458L9113g8875I3131c30967
$$ 126541 -416616 -53186 44330 31248 -288582 -191105 8458 47571 -78875 93131 -330967
18142D5784b4691B81372A22321c05278D1992K5096a80157A09176e2598D6345A8002
$$ 45784 -24691 281372 122321 -305278 41992 67088 -180157 109176 -52598 46345 18002
18130a57483N3723M4756B79351n0058d41162D6227b07774P7176r034E652e2677
$$ -157483 -103760 -59004 279351 229293 -441162 46227 -207774 -130598 -139632 5652 -52677
18118a30891B53634e7528b2270m2615q2940n4675D9226J10460c48768B616J81564
$$ -130891 253634 -57528 -22270 -64885 -147825 -202500 49226 159686 -348768 2616 184180
18107A84180a39808I0713c6686H0815a29540j50408m1064M6591B71106a01714
$$ 184180 -139808 90713 -36686 80815 -129540 -279948 -321012 -274421 271106 -101714
18096e7902m4911p3949A62658E6920a1050G6454j7896Q3902j9194e3496A75260
$$ -57902 -102813 -176762 162658 56920 -11050 76454 58558 142460 123266 -53496 175260
18084A29735N858J2733c47314M4882A64473C6934b15482f1396G5653b75228h0358
$$ 129735 135593 148326 -347314 -302432 164473 36934 -215482 -61396 75653 -275228 -80358
18072h8699j28687d1376j582B93250b073B11275C7217c3413E7313J70297j1081
$$ -88699 -217386 -41376 -42958 293250 -2073 211275 37217 -33413 57313 227610 216529
18061B16529a8148l7340j75123c3860j84472h0237a9489A26932j8436b91687B30675
$$ 216529 -18148 -55488 -230611 -33860 -218332 -80237 -19489 126932 108496 -291687 230675
18049H1087k5385M74a01465I7253B0315c62135A56857K20310P397l5037a34016
$$ 81087 55702 56176 -101465 97253 20315 -362135 156857 377167 384564 349527 -134016
18037a78746n1675g1414B17113b4835A40265a51301P0152A30218j577c90431a14520
$$ -178746 -230421 -71414 217113 -24835 140265 -151301 -81149 130218 128641 -390431 -114520
18025F1690q024J09506A723a93107a5343A58819a5441H3911a65174O6960d3770
$$ 61690 53666 163172 1723 -193107 -15343 158819 -15441 83911 -165174 -98214 -43770
18013a74972I661b51362g2318g844A60822b00768P4846C59974c208k24130c5149
$$ -174972 9661 -251362 -72318 -7844 160822 -200768 -125922 359974 -3208 -227338 -35149
18001D15004A18493E4805a07194a5759j90500H336a15621E1016A8779h9627L2432
$$ 415004 118493 54805 -107194 -15759 -206259 8336 -115621 51016 18779 -89627 -57195
17990e7195A35601o2263i4715f828A19062f0603C0747K16393p3896a41284B80150
$$ -57195 135601 73338 -94715 -6828 119062 -60603 30747 247140 173244 -141284 280150
17978A01110a57076J7131J7765c7920r8285m5560M4217A13338d78359G5324A7998
$$ 101110 -157076 -139945 -122180 -37920 -136205 -181765 -137548 113338 -478359 75324 17998
17966c0940k6754o1553C8836J05170m2248J23241G3730C3617a26719b1179k61084
$$ -30940 -57694 -119247 38836 144006 101758 224999 73730 33617 -126719 -21179 -282263
17955b82263g2833k9925c7180k69291R3334P628R5705r9556l18732c3828k19163
$$ -282263 -72833 -102758 -37180 -306471 -213137 -205509 -109804 -209360 -528092 -33828 -252991
17944b52991J02923r9667A8101j93d25685F0381i1309n3250A31172b8855k54748
$$ -252991 -150068 -249735 18101 17908 -425685 60381 -91309 -144559 131172 -28855 -283603
17933b83603n67G3470a11758B56563G4271r201d02395J76017e8125j46547C09647
$$ -283603 -284170 73470 -111758 256563 74271 65070 -402395 -226378 -58125 -204672 309647
17921G0234f663E1156L1804D0474b43792o1274i7796m3709F315L589b24118A67778
$$ 70234 -6663 51156 82960 40474 -243792 -305066 -97796 -141505 6315 9904 -224118 167778
17908a72116B1368Q4676E0524b19687A5347J69278k0225F4344O90B2332b65925
$$ -172116 21368 106044 50524 -219687 15347 184625 164400 64344 65034 22332 -265925
17896A20569K79660a58012A69363a54536b5437j15447d4147C3196K08313o5482
$$ 120569 400229 -158012 169363 -154536 -25437 -140884 -44147 33196 241509 176027
17886A76027a5533j99402A26932a34385A279f3576E5667f3733A11231J2241a73249
$$ 176027 -15533 -214935 126932 -134385 1279 -63576 55667 -63733 111231 123472 -173249
17874b66104a0756j20492L5584A21403m19b8923A58218b3692B6314J081b63338
$$ -266104 -10756 -131248 -95664 121403 120984 -28923 158218 -23692 26314 27395 -263338
17862a19616C06767b56968b9939A10978h7626n9561B17255o7630b18224F8482
$$ -119616 306767 -256968 -29939 110978 -87626 -147187 217255 149625 -218224 68482
17851G9076g244k91021C9816d97552A6945J0460Q0211a71655A88384i2098K2207
$$ 79076 -7244 -298265 39816 -497552 16945 27405 107616 -171655 188384 -92098 -69891
17840f9891G7744c4181C4741P0287m5348a18137G0960Q3254J0248H056J73911
$$ -69891 77744 -34181 34741 105028 59680 -118137 70960 154214 164462 8056 181967
17829A81967F1225c13183A10620B8311J11131b49409C54025b51725C14276a74112
$$ 181967 61225 -313183 110620 28311 139442 -249409 354025 -251725 314276 -174112
17818a3226D4972g7392j62898M0724E0658h2369j25348E9075j9089M1458c06277
$$ -13226 44972 -77392 -240290 -199566 50658 -82369 -207717 59075 39986 81444 -306277
17806a68777O9290j03752L020B29837g4951a7815E4061f3770k21180i614k8408
$$ -168777 -99487 -203239 -200219 229837 -74951 -17815 54061 -63770 -284950 -9614 -38022
17795c8022C17924a09600A35695o6090K09118b42915e1838A10665h1699j2415
$$ -38022 317924 -109600 135695 69605 278723 -242915 -51838 110665 -81699 -94114
17785i4114c3019L815j43686g2467D6194J00650f990D69930A15908a24368A92326
$$ -94114 -33019 -29204 -172890 -72467 46194 146844 -6990 469930 115908 -124368 192326
17773A46508b20644O8811B651b1130j39670B34313c46873b9302D79219d73840
$$ 146508 -220644 -151833 2651 -21130 -160800 234313 -346873 -29302 479219 -473840
17762h6227B1763f5260j05222C26094j33724d7696A99484J54167A71245L17775
$$ -86227 21763 -65260 -170482 326094 192370 -47696 199484 353651 171245 489020
17752D89020F8922Q9194a23692K5996A47041a56372C8232a24550k6799d4526r964
$$ 489020 68922 158116 -123692 -97696 147041 -156372 38232 -124550 -151349 -44526 -54490
17741e4490a4102j3465A21193b40691d1653p8478K6979I4012l605a92702A27634
$$ -54490 -14102 -27567 121193 -240691 -41653 -120131 -93152 94012 90407 -192702 127634
17729A8326J47279B9547a18406k579B31164h8744B98387A21658a55311k7252j11446
$$ 18326 165605 29547 -118406 -120985 231164 -88744 298387 121658 -155311 -182563 -294009
17718b94009B59774L9470G729K05757P332b75861I5168b76507D72940F5915a23538
$$ -294009 259774 299244 7729 213486 220818 -275861 95168 -276507 472940 65915 -123538
17706i1234G120J95984I5095a7778H4189J01099L4194a2783q1479B67343b4986
$$ -91234 7120 203104 95095 -17778 84189 185288 219482 -12783 -94262 267343 -24986
17694a68212l0781h6406D01658a20573c7192j1906B51923b8585j85599A59990
$$ -168212 -198993 -86406 401658 -120573 -37192 -49098 251923 -28585 -214184 159990
17683F2689r434R8996G2525a74981D34404A7898f6864b8957j17463L6918a402
$$ 62689 53255 152251 72525 -174981 434404 17898 -66864 -28957 -146420 -109502 -1402
17671a49019A14832a82581c7561n8196k77C4357A083f6510q4920O2295m2452j89263
$$ -149019 114832 -182581 -37561 -95757 -96034 34357 1083 -66510 -151430 -89135 -131587 -320850
17659c20850A31119d6401j7598a1003j01094l37274A82334a54832B54093A22501
$$ -320850 131119 -46401 -63999 -11003 -112097 -449371 182334 -154832 254093 122501
17648A47196d795k28023O1332A55123c10641A81563a22840c7627A858J24811a89191
$$ 147196 -4795 -232818 -171486 155123 -310641 181563 -122840 -37627 1858 126669 -189191
17636e50152b55812A08089a6422B21425a50799B43391d9872q0773B87299j37124
$$ -550152 -255812 108089 -16422 221425 -150799 243391 -49872 -130645 287299 150175
17626A50175a27631D1395c855A14803a034k1663l9583A31546N5193l0772E947
$$ 150175 -127631 41395 -3855 114803 -1034 -22697 -62280 131546 186739 155967 5947
17614h3667B516i8512A56443c1468C00014a63587B47668D8859g6401B89881C6525
$$ -83667 2516 -98512 156443 -31468 300014 -163587 247668 48859 -76401 289881 36525
17602a3234l22059a39432A8984C741P4113N5342a44291E3676c55614b5924l7037
$$ -13234 -335293 -139432 18984 3741 77854 133196 -144291 53676 -355614 -25924 -62961
17591f2961k47202J31828A77673c9412H4887a04256C18189f7852I0673L394a89253
$$ -62961 -310163 -178335 177673 -39412 84887 -104256 318189 -67852 90673 94067 -189253
17579g1538A11213i5738B74132j20610a41616M8034G6013h4362j00679c7958p1651
$$ -71538 111213 -95738 274132 153522 -141616 -93582 76013 -84362 -185041 -37958 -109609
17568a09609j316A46203O1691f3808j94800A42262J04642a02305b4870l0878q9225
$$ -109609 -110925 146203 207894 -63808 -258608 142262 246904 -102305 -24870 -55748 -144973
17557a44973B40374j13347c43299D0203M9154J80627M2066c9509F525e0858a2799
$$ -144973 240374 127027 -343299 40203 89357 269984 312050 -39509 6525 -50858 -12799
17545c1870l33359A96117r0686m5432P9445D9542A5979K16884f9418A39510e1968
$$ -31870 -365229 196117 105431 59999 139444 49542 15979 232863 -69418 139510 -51968
17533C3881J21583E6782L66051a52434A71724J26532a75848q2066B61908P6958
$$ 33881 155464 56782 422833 -152434 171724 298256 -175848 -257914 261908 338866
17523C38866a06673E2263a6684q7490e0430A31897h5292l8679A54400A9641c3666
$$ 338866 -106673 52263 -16684 -104174 -50430 131897 -85292 -123971 154400 19641 -33666
17511h4478C24882a89104l2735A53025e4029D69729F1360K9492J19746a63833
$$ -84478 324882 -189104 -221839 153025 -54029 469729 61360 90852 210598 -163833
17500a6223c442A37923M23028F0527K64389F7397a0898C13642h557F0605M06465
$$ -16223 -3442 137923 560951 60527 324916 67397 -10898 313642 -8557 60605 467070
17489D67070g7216D2477i8813A34562c04907A0600d23701B40710Q0617b4290B32900
$$ 467070 -77216 42477 -98813 134562 -304907 10600 -423701 240710 321327 -24290 232900
17477h7727F8460L40763b8404C47034C4522Q543K8050J88840A958d5026B49720
$$ -87727 68460 409223 -28404 347034 34522 43065 71115 259955 1958 -45026 249720
17465F9626d5236A66141j4063K4342o7530M26496j76910B7652j2300R407G795
$$ 69626 -45236 166141 152078 176420 108890 535386 358476 27652 15352 24759 7795
17453C79098B8539J94805j4649D2195R9287L74226j02234A13801K11889N6500
$$ 379098 28539 223344 208695 42195 141482 515708 413474 113801 325690 382190
17443C82190o6510j00736M4485R7299q6879O2410A21540P9262l8410a29345D4320
$$ 382190 315680 214944 259429 356728 269849 332259 121540 200802 162392 -129345 44320
17431b59159B56913N540m2703K893G4157d222A9587L15337A7180g2107D13974
$$ -259159 256913 262453 219750 222643 74157 -4222 19587 334924 17180 -72107 413974
17419B98522m3124m343o6160N345J72392j18490K4821c8234A67009K08732j00583
$$ 298522 255398 251055 184895 190240 362632 244142 268963 -38234 167009 375741 275158
17408B75158K7746j6368j12909d163o9966A5630d4231A75044a33123A92516K25336
$$ 275158 302904 286536 173627 -4163 -74129 15630 -44231 175044 -133123 192516 417852
17397D17852a41372f6199A70443Q5794D1123M6772J80815m9927I1616J15962b63324
$$ 417852 -141372 -66199 170443 256237 41123 87895 268710 218783 91616 207578 -263324
17385B23828K17701A56259L93955d488m3j74485H8834K15700j35819b56094A48957
$$ 223828 441529 156259 550214 -4488 -4531 -179016 88834 304534 168715 -256094 148957
17373B15367q1591a1431B57378R2258I1493P7641j1812e8854A10090N1609K08788
$$ 215367 133776 -11431 257378 349636 91493 169134 157322 -58854 110090 161699 370487
17362C70487a35090G2268d3439C29082g7706B10219F6372J33534D4202b67097
$$ 370487 -135090 72268 -43439 329082 -77706 210219 66372 199906 44202 -267097
17351a10803r6679C47598a06083j06146A5858J04480j5172a35474l644A067K86511
$$ -110803 -207482 347598 -106083 -212229 15858 120338 105166 -135474 -139118 1067 287578
17340B87578K64566A61564k0575g5056A18345j3153L99279B27125D2975K24624
$$ 287578 552144 161564 140989 -75056 118345 105192 504471 227125 42975 267599
17330B67599J0889a2699j52698c2449A87284J86034H7927f0091A34806L4693a02212
$$ 267599 278488 -12699 -165397 -32449 187284 373318 87927 -60091 134806 169499 -102212
17318g7849B43618r736l659H9947l0135a19361B90361A39830j1758m3885K24395
$$ -77849 243618 233882 230223 89947 59812 -119361 290361 139830 128072 84187 308582
17307C08582a27791C09058j52101D1413J41424J58484j49456K97152j65160A43755
$$ 308582 -127791 309058 156957 41413 182837 341321 191865 489017 323857 143755
17296h1308l0741E84893G6141C0655K4383O9779m6560K03713C3073K27928A17654
$$ -81308 -112049 584893 76141 30655 55038 124817 78257 281970 33073 261001 117654
17284C80956q0774K3159a61579L8097A49628R9551c702j54583A96737c09786a19857
$$ 380956 300182 323341 -161579 -123482 149628 249179 -3702 -158285 196737 -309786 -119857
17272H8799C8498J10642c0047B30385F9573J67964R0491A10201n1770J08183J14689
$$ 88799 38498 149140 -30047 230385 69573 237537 328028 110201 58431 166614 281303
17261B81303l6217E4808J77974m3039K9097d0531B05217J434O3225A4284c07541
$$ 281303 245086 54808 232782 189743 218840 -40531 205217 206651 269876 14284 -307541
17249A96010F4951L45612j33012M0663p2271J14046b5859B22715J67745j58633
$$ 196010 64951 410563 277551 318214 245943 359989 -25859 222715 390460 231827
17239B31827r7034n1279Q4978L04098k13868o554E5828K4622N7256N3265K7046
$$ 231827 134793 83514 168492 472590 258722 252168 55828 80450 137706 190971 218017
17228B18017P8394j13615M6395R814A07360m6131M09934o8103b1920j1812j12549
$$ 218017 296411 182796 229191 239005 107360 61229 471163 403060 -21920 -33732 -146281
17217a46281B50428M4180C201a14599E78347B66932G2787M03005k33168J24157
$$ -146281 250428 294608 3201 -114599 578347 266932 72787 475792 242624 366781
17207C66781N0431j5635a09686A86506K62802j36591k7610o0280K88330B9921
$$ 366781 417212 401577 -109686 186506 449308 312717 285107 224827 513157 29921
17196B48974c8242G9716J26376L72316G4279L26672j093n5890j04108R175l2031
$$ 248974 -38242 79716 206092 578408 74279 400951 399858 343968 239860 249035 217004
17185B17004j07446J44541J05631a59322C43812j40563o8212F6270M19314k26921
$$ 217004 109558 254099 359730 -159322 343812 203249 135037 66270 485584 258663
17175B58663Q8430j03446o497r4604J04718c9361B04521L9013O3756j5399K29270
$$ 258663 347093 243647 237150 142546 247264 -39361 204521 243534 307290 291891 521161
17164E21161C8189a67189A63705K86151A76856q3132K71796j35214m6719J48822
$$ 521161 38189 -167189 163705 449856 176856 93724 365520 230306 183587 332409
17154C32409m8758m0455o2430K58671B14103P0332r7337B3459K47937l7135L25887
$$ 332409 283651 243196 180766 439437 214103 284435 187098 23459 271396 234261 560148
17143E60148J49353k53123j37680j00355F2507P2889L52393M0998R5074C09687
$$ 560148 709501 456378 318698 218343 62507 135396 487789 528787 623861 309687
17132E86764B30844O1977B5941K00577j00683L58373A92594P0725i5944C29051
$$ 586764 230844 292821 25941 226518 125835 484208 192594 263319 -95944 329051
17121d2030D27383B07870L43070j35836J57405J38840c8882F81673k02694k12346
$$ -42030 427383 207870 550940 415104 572509 711349 -38882 681673 478979 266633
17111B66633M09679k87342j8599J22804n6583A06645L6069J70691j02606P6817
$$ 266633 676312 388970 370371 493175 436592 106645 142714 313405 210799 287616
17101B87616K78491B52342L50724J3379j94166M47977D02962k1457O463K74203
$$ 287616 566107 252342 603066 616445 422279 870256 402962 381505 387968 662171
17091F62171J33238l85732j04939O7304K20762G3504N97144l17426j73884E6128
$$ 662171 795409 409677 304738 372042 592804 73504 670648 353222 179338 56128
17080C84113J85068j21060A95251J39122J8463J66904A05758G472M33005C5266
$$ 384113 569181 448121 195251 334373 352836 519740 105758 7472 440477 35266
17069A96122J80709k9775Q1019j301J35450B44443K60369B46247L45565k25097
$$ 196122 376831 347056 428075 426774 562224 244443 504812 246247 591812 366715
17059C66715j2246A48760K91026o7686J74643j23296j01684J93531J44033j33206
$$ 366715 354469 148760 439786 372100 546743 423447 321763 515294 659327 526121
17049E26121j090K25273j48114j26323J52470k63581L26554j44247k20151M25131
$$ 526121 525031 750304 602190 475867 628337 364756 691310 547063 326912 752043
17039G52043k68434l9735k4486J49746K6796r8731O2786L00046l5003j30520o8011
$$ 752043 483609 443874 419388 569134 595930 497199 559985 860031 825028 694508 626497
17028F26497n3310o7537j09926J2342P7995J88769j21697j0152q6033Q3955L41887
$$ 626497 573187 505650 395724 408066 486061 674830 553133 542981 456948 540903 882790
17017H82790j79710J33729l01118J63128j02477j47482j64210L46494j04705j53043
$$ 882790 703080 836809 535691 698819 596342 448860 284650 631144 526439 373396
17007C73396O46136k77841j02380j29091L9184n4908L63095J42416m36278K8783
$$ 373396 1019532 741691 639311 510220 549404 494496 857591 1000007 563729 592512
16997E92512L35116k34904k04968J86097J60088j14616k25208K28101O4448p4613
$$ 592512 927628 692724 487756 673853 833941 719325 494117 722218 786666 712053
16987G12053J99256j97825J33604l70308K79038n717k31396R9043q1007J09348
$$ 712053 911309 713484 847088 476780 755818 750101 518705 617748 536741 646089
16977F46089M6982J62703O4481j38040K23233j76713J48599l90190L02236P2674
$$ 646089 693071 855774 920255 782215 1005448 828735 977334 587144 889380 962054
16967I62054m2786m6776k7131P0391j16865P0484K4804n4990N20631m92950K01390
$$ 962054 919268 872492 845361 915752 798887 869371 894175 839185 1359816 866866 1068256
16956A068256k52739J90533l2117K26036m45696M13872L14722l90980j78301R0362
$$ 1068256 815517 1006050 973933 1199969 754273 1168145 1482867 1091887 913586 1003948
16946A003948j54063J02143J33391M7874k2491o6142N7486P5817j79549o0237
$$ 1003948 849885 952028 1085419 1133293 1110802 1044660 1102146 1177963 998414 938177
16936I38177K48875J9146N5014j89019P103K75811j61305k41065K28570K38567
$$ 938177 1187052 1206198 1261212 1072193 1079296 1355107 1193802 952737 1181307 1419874
16926A419874l48570J72829J02479l65991J42104M0724J33538M54027p42823K13648
$$ 1419874 1071304 1244133 1346612 980621 1122725 1163449 1296987 1751014 1008191 1221839
16916A221839K49620j5887J37419j29063p4522j6338j61879M07321j13076J31351
$$ 1221839 1471459 1455572 1592991 1463928 1389406 1373068 1211189 1618510 1505434 1636785
16906A636785K6431J53536j93926l67164L58209J84807k729j33355l4088N7100
$$ 1636785 1663216 1816752 1622826 1255662 1613871 1798678 1795949 1662594 1628506 1685606
16896A685606O7783k78276L23736l0280k35303j3760O27545m22536l3458L77148
$$ 1685606 1753389 1475113 1798849 1768569 1533266 1519506 2147051 1724515 1691057 2068205
16886B068205l48665K55769l71517L16547L05971J28304j85218n6465j44945L80774
$$ 2068205 1719540 1975309 1603792 1920339 2226310 2354614 2169396 2112931 1967986 2348760
16876B348760m47894M49045k63678L90379l20534Q8326J75844J54822p0949k35409
$$ 2348760 1900866 2349911 2086233 2476612 2156078 2244404 2420248 2575070 2504121 2268712
16866B268712K59915M4881k29869L44130L0471k1843J6485n9492l4030K21787
$$ 2268712 2528627 2573508 2343639 2687769 2718240 2696397 2712882 2653390 2619360 2841147
16856B841147J74249k75103J28891K37660Q4495j64646O2458L8350J64314N9081
$$ 2841147 3015396 2740293 2869184 3106844 3191339 3026693 3089151 3127501 3291815 3350896
16846C350896K6559J74445n473o63586M99080J31441J18769p1402J29890J07662
$$ 3350896 3377455 3551900 3546427 2882841 3381921 3513362 3632131 3560729 3690619 3798281
16836C798281R2559J84484K5864l23740N76786M9418l55550K02584k35307K26343
$$ 3798281 3890840 4075324 4101188 3777448 4354234 4403652 4048102 4250686 4015379 4241722
16826D241722K06207j23834N43650l96116K60888M06145j9017l68794O73477L2910
$$ 4241722 4447929 4324095 4867745 4471629 4732517 5138662 5119645 4750851 5424328 5457238
16816E457238j20131M17761M5930K76948j99859k299L04266j24030M23461Q3524
$$ 5457238 5337107 5754868 5800798 6077746 5877887 5875588 6179854 6055824 6479285 6562809
16806F562809l0488K89857j38198N25176K769L11774K43721j03073L76699n1704
$$ 6562809 6532321 6822178 6683980 7209156 7211925 7523699 7767420 7664347 8041046 7989342
16796G989342K82284M65936k32936L47233P43748k36873J87918L71104M35436
$$ 7989342 8271626 8737562 8504626 8851859 9595607 9358734 9546652 9917756 10353192
16787A0353192M01853J16732L58533L43024L90517k92498Q79692J71496K97877
$$ 10353192 10755045 10871777 11230310 11573334 11963851 11671353 12551045 12722541 13020418
16778A3020418K47802R92870K60605M29063M35227M01453O90592J021915J83395
$$ 13020418 13268220 14261090 14521695 14950758 15385985 15787438 16478030 17499945 17683340
16769A7683340O39923N64014P47956O83066L00901J352618P84676M43352J374251
$$ 17683340 18323263 18887277 19635233 20318299 20619200 21971818 22756494 23199846 24574097
16760B4574097Q52840Q62798R37632J262306J270001J317938J259704J699038
$$ 24574097 25426937 26289735 27227367 28489673 29759674 31077612 32337316 34036354
16752C4036354J347100J874376J683175J867791K036151J932407K623383K144868
$$ 34036354 35383454 37257830 38941005 40808796 42844947 44777354 47400737 49545605
16744D9545605K784557L039358L495573K949217L351483L921978M127512M296592
$$ 49545605 52330162 55369520 58865093 61814310 65165793 69087771 73215283 77511875
16736G7511875M476788N423445N359299N819783O491199O868858O697851P601214
$$ 77511875 81988663 87412108 92771407 98591190 105082389 111951247 118649098 126250312
16728A26250312P780785Q248819Q008351Q879964Q176631Q420543Q103251P171383
$$ 126250312 134031097 142279916 150288267 159168231 167344862 175765405 183868656 191040039
16720A91040039P054282N562055M314244K788134J720941j5167j868938l146679
$$ 191040039 198094321 203656376 207970620 210758754 212479695 212464528 210595590 207448911
16712B07448911m251405o116459o657393p587507q586107q424460q523453r176417
$$ 207448911 203197506 197081047 190423654 182836147 174250040 165825580 157302127 148125710
16704A48125710q197880q276672q186048p424644p627213o533102o238302o085393
$$ 148125710 139927830 131651158 123465110 116040466 108413253 101880151 95641849 89556456
16696H9556456n747077m964337m825782m342127m223783l453638l489790l551776
$$ 89556456 83809379 78845042 74019260 69677133 65453350 61999712 58509922 54958146
16688E4958146l032733k667550k620388k394527j996046k800466j668010k176914
$$ 54958146 51925413 49257863 46637475 44242948 42246902 39446436 37778426 35601512
16680C5601512j244782j697691j548126j431478j056493j320580j118311j175577
$$ 35601512 34356730 32659039 31110913 29679435 28622942 27302362 26184051 25008474
16672B5008474j034794q61237r24837q74239p19997r81638q98812n60006l39232
$$ 25008474 23973680 23112443 22187606 21313367 20593370 19611732 18712920 18152914 17813682
16663A7813682q53684n78185k98347q94569n26804n53751j58051p79381o5200
$$ 17813682 16959998 16381813 16083466 15188897 14662093 14108342 13950291 13170910 13105710
16654A3105710j11522r43365l79488k87615j77789l14463p4648o06705k41862
$$ 13105710 12994188 12050823 11671335 11383720 11205931 10891468 10816820 10210115 9968253
16645I968253k61731K55467p30527l53903k75059j61362m04369j89878N9186k63573
$$ 9968253 9706522 9961989 9231462 8877559 8602500 8441138 8036769 7846891 7906077 7642504
16635G642504k86245q7141k73182Q2971o37862l8769P4686k20024j30689j97097
$$ 7642504 7356259 7269118 6995936 7078907 6441045 6402276 6476962 6256938 6126249 5929152
16625E929152l03871J63567r8076k47318j01455j68252j4961r9222m2420Q8101
$$ 5929152 5625281 5788848 5690772 5443454 5341999 5173747 5158786 5059564 5017144 5105245
16615E105245l21004q3383k54507L1980q8512j88323K25609m95709J95148q1549
$$ 5105245 4784241 4700858 4446351 4478331 4389819 4201496 4427105 3931396 4126544 4044995
16605D044995o9590j93593o9265j9675o6713j39893J52583l50887J26437j08294
$$ 4044995 3975405 3781812 3712547 3692872 3626159 3486266 3638849 3287962 3414399 3306105
16595C306105l16112m4434M42991m85648L6210k51560L99255l57417L68451k90513
$$ 3306105 2989993 2945559 3388550 2902902 2939112 2687552 3086807 2729390 3097841 2807328
16585B807328o6897L9849j75656R7735R6103r7926l62937J97224j33751k91605
$$ 2807328 2740431 2780280 2604624 2702359 2798462 2700536 2337599 2534823 2401072 2109467
16575B109467M37429m28795L3046J95790j63256K40660n38462M52847n18549J79450
$$ 2109467 2546896 2118101 2151147 2346937 2183681 2424341 1885879 2338726 1820177 1999627
16565A999627Q4082k92665J92686J56481O648n25283J51227O6752k28725K8889
$$ 1999627 2083709 1791044 1983730 2140211 2146859 1621576 1772803 1839555 1610830 1639719
16555A639719J01014r0877k48801O74037l42422r9234J9010j63957J97427k69627
$$ 1639719 1740733 1649856 1401055 2075092 1732670 1633436 1652446 1488489 1685916 1416289
16545A416289j94390p4138K44548J07480K07342o45025L15937j66601L99601l11478
$$ 1416289 1221899 1147761 1392309 1499789 1707131 1062106 1378043 1211442 1611043 1299565
16535A299565R2955K08902N4140n46345N5965J85471m02284J42198J86741R7130
$$ 1299565 1392520 1601422 1655562 1109217 1165182 1350653 948369 1090567 1277308 1374438
16525A374438p6039k45958K10125j89328K9774L32659n90190L56393p9038j50570
$$ 1374438 1298399 1052441 1262566 1073238 1103012 1435671 845481 1201874 1122836 972266
16515I72266N3693j00983K07542k94454j05543M66154k56766j54599k68723O02428
$$ 972266 1025959 924976 1132518 838064 732521 1198675 941909 787310 518587 1121015
16505A121015k69136M43186l25959m70329M32099L83666k84037J99166k0754k43893
$$ 1121015 851879 1295065 969106 498777 930876 1314542 1030505 1229671 1208917 965024
16495I65024k30437J02525J52251J35612E58254R9105R0582k44203O28190k55135
$$ 965024 734587 837112 989363 1124975 558254 657359 747941 503738 1131928 876793
16485H76793l8317j4201L04715l18844k22634O26994n33764r6126L95748l93562
$$ 876793 838476 824275 1128990 810146 587512 1214506 680742 584616 980364 586802
16475E86802J14572L2457J12960j69412J18035J38594r4159M3198C92546L02268
$$ 586802 701374 733831 846791 677379 795414 934008 839849 883047 392546 694814
16465F94814j31092j59932O20854B86236n6069K38730J95170o6895J1466L9041
$$ 694814 563722 403790 1024644 286236 230167 468897 664067 597172 608638 647679
16455F47679C13850K5480J53027L9240K62483A26972M78918K4320l8846j65245
$$ 647679 313850 339330 492357 531597 794080 126972 605890 630210 591364 426119
16445D26119L13341k20363j39118R9958j31922L77525k9409k04126o9294L3235
$$ 426119 739460 519097 379979 479937 348015 725540 696131 492005 422711 455946
16435D55946J06935k39953J28397l0622o3643M10347k49035j70057M43819l94932
$$ 455946 562881 322928 451325 420703 357060 767407 518372 348315 792134 397202
16425C97202N9186k122j64682M7565m6197O63462a27846C52190o246q3986R7625
$$ 397202 456388 454266 289584 337149 290952 954414 -127846 352190 345944 261958 359583
16414C59583n5878M14072k86695K8894J37497k02157J70457Q2760q7525o7597
$$ 359583 303705 717777 431082 459976 597473 395316 565773 648533 561008 493411
16404D93411D6070J28430J74093L92570C27340r3589M97186o2925j18721o4947
$$ 493411 46070 174500 348593 741163 327340 233751 730937 668012 549291 484344
16394D84344j13886L01521k16073j61742K52360A33412L0251J68789j17853Q5893
$$ 484344 370458 671979 455906 294164 546524 133412 163663 332452 214599 300492
16384C00492k7609K22326o1623d9375D48388A46835J38207o6912K19913A11303
$$ 300492 272883 495209 433586 -49375 448388 146835 285042 218130 438043 111303
16373C81923D4879L21655O3239k080j84428n7156J76834n278f0682E12669j42449
$$ 381923 44879 366534 429773 427693 243265 186109 362943 357665 -60682 512669 370220
16362C70220j13105K44640A43496P4548J79051H4745K58488j56463K98818j22094
$$ 370220 257115 501755 143496 218044 397095 84745 343233 186770 485588 363494
16352C63494m4636R5823J05215l2472b1255B59578h419C76345e5453A05454a55457
$$ 363494 318858 414681 519896 487424 -21255 259578 -8419 376345 -55453 105454 -155457
16340D01094j03600l880J60284m5080p0509F0593L16259F4067J26769A6774K10534
$$ 401094 297494 293614 453898 408818 338309 60593 376852 64067 190836 16774 227308
16329B27308L51268B22932b0317P653B07318F2133J75435J06480J27642A23742
$$ 227308 578576 222932 -20317 -12664 207318 62133 237568 344048 471690 123742
16318a46003G2087K3833k2609K76949l2157j6827Q3445j79016a83746B56282j20882
$$ -146003 72087 95920 73311 350260 318103 301276 384721 205705 -183746 256282 135400
16307A35400J55387N4884j54496d0260E43661I6809K70420b52981a19440B08989
$$ 135400 290787 345671 191175 -40260 543661 96809 367229 -252981 -119440 208989
16296D64548b50291D85898A74180h5959L4142A23623o1016J82896F1753a8319
$$ 464548 -250291 485898 174180 -85959 -51817 123623 62607 245503 61753 -18319
16285A63422Q3125r9945B3454b9616B2218a55168l013B24020r0141i3784B10214
$$ 163422 246547 146602 23454 -29616 22218 -155168 -158181 224020 133879 -93784 210214
16273C01201o0932n6298O5933g0000A21852a93440I5419J70938q4836J20158j07231
$$ 301201 240269 183971 249904 -70000 121852 -193440 95419 266357 181521 301679 194448
16262A94448J01422j21006f5389I8277a13776B70768j273Q2922b46863A4393M0408
$$ 194448 295870 174864 -65389 98277 -113776 270768 269495 352417 -246863 14393 54801
16251E4801M8566l1108M2755N3999qM2383m8469J80265k9721A2892J08644J89257
$$ 54801 103367 72259 115014 169013 169005 211388 162919 343184 313463 12892 121536 310793
16239C10793p5634k5398b19181a3839m1297A40315a70580B44261m3000f0999B22058
$$ 310793 235159 209761 -219181 -13839 -55136 140315 -170580 244261 201261 -60999 222058
16227a95464B07584D1388J9865h8779D61993j65549p8286P2781h8895A82339L4383
$$ -195464 207584 41388 61253 -88779 461993 296444 218158 290939 -88895 182339 216722
16216B16722G2109P330K05158G3961Q2407L54171B20424l4277c2362B03913a28760
$$ 216722 72109 79439 284597 73961 156368 510539 220424 186147 -32362 203913 -128760
16204A26891N6544f4127j81303Q7760F8909g566j307H1751D0726Q3441c3801B25213
$$ 126891 183435 -64127 -245430 -157670 68909 -7566 -8873 81751 40726 124167 -33801 225213
16191b10987a3085A55938D2501J31187N545d64037A49569L1938b1680E4341i2388
$$ -210987 -13085 155938 42501 173688 179233 -464037 149569 181507 -21680 54341 -92388
16179g6781K2488o3746F008J0923b3838J0454B42083a35517p7982A07741d6021
$$ -76781 -54293 -118039 6008 16931 -23838 -13384 242083 -135517 -213499 107741 -46021
16167B06117I5097m811a1804j08219A41130E8692J23986E9811M861f3738C4127
$$ 206117 95097 90286 -11804 -120023 141130 58692 182678 59811 64672 -63738 34127
16155A83523l8589h8288I0973i0522K1094B01256g2274C63256A12766c2249G9161
$$ 183523 144934 -88288 90973 -90522 -69428 201256 -72274 363256 112766 -32249 79161
16143i9898A6789P4030f614j74768j9574E2481O6539K03645b41598B6532Q3145
$$ -99898 16789 90819 -6614 -181382 -200956 52481 119020 322665 -241598 26532 109677
16132A09677a84766B27250g3928A73126P5201k4284g0577B5432P2967h1194A26931
$$ 109677 -184766 227250 -73928 173126 248327 224043 -70577 25432 98399 -81194 126931
16120A92841F363g275C67800b82469f5513c2371k47314A3007J67003f6245o2662
$$ 192841 6363 -7275 367800 -282469 -65513 -32371 -279685 13007 180010 -66245 -128907
16109a28907M0516H7570B6361q039J7286j5925b66386A05704J74180e4441C16582
$$ -128907 -88391 87570 26361 18322 35608 19683 -266386 105704 279884 -54441 316582
16097b44430C15338b18975h3714l35732F8879a20785L5684a3550l6402c439k71322
$$ -244430 315338 -218975 -83714 -419446 68879 -120785 -85101 -13550 -49952 -3439 -274761
16086b74761F1002a94249B05867b11308a02328C8819b26818b8433r7474k0777
$$ -274761 61002 -194249 205867 -211308 -102328 38819 -226818 -28433 -125907 -146684
16076a46684A47606a06827A26054b76023c4455A69302d951A64204c80639A2758
$$ -146684 147606 -106827 126054 -276023 -34455 169302 -4951 164204 -380639 12758
16065c39992C0496a13096L4467B73601j36289a09982A59566f4942q0226O2034
$$ -339992 30496 -113096 -78629 273601 137312 -109982 159566 -64942 -145168 -83134
16055h3134k30552J07274L2843P0580H3285c350p1967k19532A1018J71933h7931
$$ -83134 -313686 -206412 -173569 -102989 83285 -3350 -75317 -294849 11018 182951 -87931
16043a7296A73591C9877b42137I6579A5459R8826a64715C27996E7040b27443C24080
$$ -17296 173591 39877 -242137 96579 15459 114285 -164715 327996 57040 -227443 324080
16031A36305d6188j01996o6255J01831m7004A68226E9053b93338e6268E8595N0206
$$ 136305 -46188 -148184 -214439 -112608 -159612 168226 59053 -293338 -56268 58595 108801
16020A08801h1383a5686F324i6417j47907N5573A60625A4915a62185j1219j1629
$$ 108801 -81383 -15686 6324 -96417 -244324 -188751 160625 14915 -162185 -173404 -185033
16009a85033r9023J11437B60569b8944k17782j77278f3859k15614C0971c10136
$$ -185033 -284056 -172619 260569 -28944 -246726 -424004 -63859 -279473 30971 -310136
15998a65365R900E9654a34731A41110e2444E796c5049B78548A12627a1987r932
$$ -165365 -155465 59654 -134731 141110 -52444 5796 -35049 278548 112627 -11987 -21919
15987b1919j9676I8931c1772B24869K66014a1490A81727K72958b64827j5487l1320
$$ -21919 -41595 98931 -31772 224869 490883 -11490 181727 454685 -264827 -280314 -311634
15976c11634D13099g0960j3962k0774D6160k0046b38287A18831a9596r9620r1777
$$ -311634 413099 -70960 -84922 -105696 46160 26114 -238287 118831 -19596 -119216 -210993
15965b10993f2886A19198d3028B05190b23395o508F0909Q9867r807j4604a56870
$$ -210993 -62886 119198 -43028 205190 -223395 -229903 60909 150776 140969 126365 -156870
15953c1349A68507D8374b27757A42509c4853k37343r443a16A92456H1549b32683
$$ -31349 168507 48374 -227757 142509 -34853 -272196 -281639 -116 192456 81549 -232683
15941A40799h6400j8987A03788C2214a71563l5997l4647h0104L3984D4387k0394
$$ 140799 -86400 -105387 103788 32214 -171563 -207560 -242207 -80104 -46120 44387 23993
15930B3993O4269g432D1156i1387A39351b4928L904l96286K03600A42988F5454
$$ 23993 88262 -7432 41156 -91387 139351 -24928 -21024 -417310 -213710 142988 65454
15918c26053A52377l4359e5873e959j92748f8596j264D5327c13948C38892e974
$$ -326053 152377 118018 -55873 -5959 -198707 -68596 -69860 45327 -313948 338892 -5974
15906c3604k8181l2536P629q765j71621D73243a38276a6150l1579l63612C9541
$$ -33604 -61785 -94321 -86692 -95457 -267078 473243 -138276 -16150 -47729 -411341 39541
15894b54370G2333a91385A78499i6138K4323C2736b63539i2267c5841l25539a00985
$$ -254370 72333 -191385 178499 -96138 -71815 32736 -263539 -92267 -35841 -361380 -100985
15882c315A21473K06298f1565b1861R362k3570N086k37289C1435a92270I1872
$$ -3315 121473 327771 -61565 -21861 -12499 -36069 -30983 -268272 31435 -192270 91872
15870a04149j13017d3506k87795a20424C77129a07091j06935O4455l0770A2757
$$ -104149 -217166 -43506 -331301 -120424 377129 -107091 -214026 -149571 -180341 12757
15859b44469q0409A83813c09139A55276b1403B87233A20212C1769a84971A83686
$$ -244469 -324878 183813 -309139 155276 -21403 287233 120212 31769 -184971 183686
15848B0161J51047b36574A27477D4612b67980A38540b7129m230n6457F9208J10785
$$ 20161 171208 -236574 127477 44612 -267980 138540 -27129 -31359 -87816 69208 179993
15837A79993b46757F152b4813A43561J5779a44299B33077C7280d33387D0215a90703
$$ 179993 -246757 6152 -24813 143561 159340 -144299 233077 37280 -433387 40215 -190703
15825b23075a3235B053g1302A70775A5629a77493f3208I0886b19943p5924A24748
$$ -223075 -13235 2053 -71302 170775 15629 -177493 -63208 90886 -219943 -295867 124748
15813d40356a63105d7969D5634a01881n6463N9867l63866o9461D20298B4215L4505
$$ -440356 -163105 -47969 45634 -101881 -158344 -98477 -462343 -531804 420298 24215 58720
15802E8720b6845A94855h916l07050C0439J43407b48999C5679P6210a28429c4794
$$ 58720 -26845 194855 -8916 -315966 30439 173846 -248999 35679 111889 -128429 -34794
15790B94171h7370K9207K4110j23541B24294k8498m5278d879a662l4885A86197
$$ 294171 -87370 -58163 -34053 -157594 224294 195796 150518 -4879 -1662 -36547 186197
15778B74589c44132a0632A9802a12597I633a63688P9508k439j44857B52817b23658
$$ 274589 -344132 -10632 19802 -112597 9633 -163688 -84180 -86619 -231476 252817 -223658
15766b56334A13582k2141L05839C4540K06919a53750P6565r6493C1710e7953A80252
$$ -256334 113582 91441 397280 34540 241459 -153750 -77185 -173678 31710 -57953 180252
15754C2767G696J08228J750c28526C1534b3530o3703i703L640j69966a2446E0024
$$ 32767 7696 115924 117674 -328526 31534 -23530 -87233 -9703 -6063 -176029 -12446 50024
15741F3646f7136r5618B83409F5561a6474C899a51554f1195D174d80156F2117
$$ 63646 -67136 -162754 283409 65561 -16474 3899 -151554 -61195 4174 -480156 62117
15729H7564a81064B47485a44791I3641L6098i1378r3984q4235I0567h1655A19578
$$ 87564 -181064 247485 -144791 93641 129739 -91378 -185362 -269597 90567 -81655 119578
15717A6231J41746B9311Q1139a60899j73479a59841k1779a3120j77953p995k03259
$$ 16231 157977 29311 110450 -160899 -334378 -159841 -181620 -13120 -191073 -199068 -402327
15706d02327A51608p4410a74325h0306p186B03902a6991k1775B22691f7515n8687
$$ -402327 151608 77198 -174325 -80306 -87492 203902 -16991 -38766 222691 -67515 -126202
15695a26202B53405b12439B60652b99508A3577L61684b06061P7286G8213a52351
$$ -126202 253405 -212439 260652 -299508 13577 375261 -206061 -128775 78213 -152351
15684c1555k96825d2990r3375A34080m7300b55615f7723C7240b94401A35923c69648
$$ -31555 -328380 -42990 -136365 134080 86780 -255615 -67723 37240 -294401 135923 -369648
15672A03898e7847K3332j14762A58252b11187e0685j11532N6114d3903l60195
$$ 103898 -57847 -34515 -149277 158252 -211187 -50685 -162217 -106103 -43903 -404098
15662d04098C33806b8128A35039J17503a60881f1910B11558C0232K86533b68913
$$ -404098 333806 -28128 135039 252542 -160881 -61910 211558 30232 316765 -268913
15651A46467b34501f352k53306B08792I4988J70397a52176N4975K2073A34149
$$ 146467 -234501 -6352 -259658 208792 94988 265385 -152176 -97201 -75128 134149
15640E2220a10301M055j86615A3231b18159A2455b49570j77028H907a7866l03932
$$ 52220 -110301 -106246 -292861 13231 -218159 12455 -249570 -426598 8907 -17866 -321798
15629c21798K6345m2114e1063G0704f2681k99523h1967L6691C44267j29758o5458
$$ -321798 -295453 -337567 -51063 70704 -62681 -362204 -81967 -45276 344267 214509 149051
15618A49051J1156f4675A09556a45013k0499H7589L374P5398d2065k96012J65026
$$ 149051 160207 -64675 109556 -145013 -165512 87589 90963 166361 -42065 -338077 -173051
15607a73051A22440a10303A49764g4857k63862H4749a00235A74672c39396R4041
$$ -173051 122440 -110303 149764 -74857 -338719 84749 -100235 174672 -339396 -245355
15597b45355C4811J66687D1877L184a34610F7006e4860l17279G0950b50745c5446
$$ -245355 34811 201498 41877 45061 -134610 67006 -54860 -372139 70950 -250745 -35446
15585a35137A17440b20930a7099E1109a58605A36618a6708A65927B3775b26606
$$ -135137 117440 -220930 -17099 51109 -158605 136618 -16708 165927 23775 -226606
15574C00705p2018b82861B7167O4832J29444G0947a1886p8021r2704I4613m4791
$$ 300705 228687 -282861 27167 91999 221443 70947 -11886 -89907 -182611 94613 49822
15563D9822b60985B44295I5901C8045a56628A44912b71961D7216M28025a99285
$$ 49822 -260985 244295 95901 38045 -156628 144912 -271961 47216 475241 -199285
15552b54870j43265A60582J28359a13162A00632c4310B02787b04185A00825O2961
$$ -254870 -398135 160582 288941 -113162 100632 -34310 202787 -204185 100825 163786
15542A63786a47113l8400G6093N5854a21420A13510k7925i7157j61231g9827o5028
$$ 163786 -147113 -185513 76093 131947 -121420 113510 85585 -97157 -258388 -79827 -144855
15531a44855K3575J5598B28065a20545M4856l1499O361d5162m3954d2753B43791
$$ -144855 -121280 -105682 228065 -120545 -75689 -107188 -100827 -45162 -89116 -42753 243791
15519b36480B43129g4911A82137j1144B0659b282D6682L905c19841b7839D10236
$$ -236480 243129 -74911 182137 170993 20659 -2282 46682 50587 -319841 -27839 410236
15507F776J45069B3158O4191a58433J5519J4570l2602A93866L1577A00927L09482
$$ 6776 151845 23158 87349 -158433 -142914 -128344 -160946 193866 225443 100927 410409
15496D10409I5034a1856A30396A9686f3712A58133g012G3785K5928b06048h707
$$ 410409 95034 -11856 130396 19686 -63712 158133 -7012 73785 99713 -206048 -8707
15484C6327a32471k02631N8675a5192I1444D4634d2360C41067C6635J54098a12380
$$ 36327 -132471 -335102 -276427 -15192 91444 44634 -42360 341067 36635 190733 -112380
15472e1594M049H8559k7806M0989o155a76066D1619a70134F0072a70708C4410
$$ -51594 -47545 88559 60753 101742 95587 -176066 41619 -170134 60072 -170708 34410
15460h3629q4356h3273I6943b68945J1302C5490J28628Q5414b71578a7059j98420
$$ -83629 -167985 -83273 96943 -268945 -257643 35490 164118 249532 -271578 -17059 -215479
15449b15479J06915K3984o1399l8797A0841J1601d3669O83k54224M675a8609A03236
$$ -215479 -108564 -84580 -145979 -184776 10841 22442 -43669 -42986 -297210 -292535 -18609 103236
15436I198K28908J5258b56579N0329A21217a93496e2892J8438A57472c56928e660
$$ 9198 238106 253364 -256579 -206250 121217 -193496 -52892 -34454 157472 -356928 -5660
15424B08970E9577a37115A33002b27502O6946g3619A78085M2156G3639M706B0460
$$ 208970 59577 -137115 133002 -227502 -160556 -73619 178085 220241 73639 78345 20460
15412a00052B578d22942a339B13244a64342H0655j0213R4370h6669B54643b85798
$$ -100052 2578 -422942 -1339 213244 -164342 80655 70442 164812 -86669 254643 -285798
15400G1725P9193O3626a96151A82945G0336b65121a8064j21816A06152N4338k9240
$$ 71725 150918 214544 -196151 182945 70336 -265121 -18064 -139880 106152 160490 131250
15389A31250a76556K2543O6151j92938j11755a73023m4427i987G9737N6511c13443
$$ 131250 -176556 -154013 -87862 -280800 -392555 -173023 -217450 -9987 79737 136248 -313443
15377g637j91495F5055d6976F0297a16086A19999l9624L8841b57675m56L0837
$$ -7637 -199132 65055 -46976 60297 -116086 119999 80375 119216 -257675 -258131 -227294
15366b27294G6707h0198G8944L5303B9129p705J71633b091A50546P1219I4434
$$ -227294 76707 -80198 78944 114247 29129 21424 193057 -2091 150546 221765 94434
15354A64744B0503a71199d8269F0075N2651J33671c32081H2392k9313Q5893B3483
$$ 164744 20503 -171199 -48269 60075 112726 246397 -332081 82392 53079 138972 23483
15342I1918b0604r7555p9493A03800C86c91089d9699G4063J48819a03567j1104
$$ 91918 -20604 -118159 -197652 103800 386 -391089 -49699 74063 222882 -103567 -114671
15331a14671B09954A03290N4494G2843O5654m7241a72651L250e2130J5960P176
$$ -114671 209954 103290 157784 72843 138497 91256 -172651 -169401 -52130 -36170 -28994
15320b8994A15962J04603q4711a11109j2859d9146o1395c5659r3756B60762a43123
$$ -28994 115962 220565 135854 -111109 -123968 -49146 -110541 -35659 -129415 260762 -143123
15308B07121q1558A6021b05072A04932D123K4297a07366N3203H3371D0141N24230
$$ 207121 125563 16021 -205072 104932 4123 28420 -107366 -54163 83371 40141 564371
15297E64371i7009C26639C8998b09108h7001F6707J27371a99523C36674l8929
$$ 564371 -97009 326639 38998 -209108 -87001 66707 194078 -199523 336674 297745
15287B97745A37013c73373A93947i7580C09900b855k6755j63934n876O0725d54
$$ 297745 137013 -373373 193947 -97580 309900 -2855 -29610 -193544 -199420 -138695 -454
15275i6970A40216b64783A17696a69910q9362N8368B41735f1548K4360B6468a09326
$$ -96970 140216 -264783 117696 -169910 -259272 -200904 241735 -61548 -37188 26468 -109326
15263A42551o0023b30049A81866c3455j46012f9858j33762A42380K6318h4056
$$ 142551 82528 -230049 181866 -33455 -179467 -69858 -203620 142380 168698 -84056
15252a54626C46621j58830A3557O07762Q87083p3920n10417L24758F00443a43639
$$ -154626 346621 187791 13557 621319 1508402 1434482 924065 1248823 600443 -143639
15241A60976O7631K6925f9074I7226J5344d4278B2400D312a6634c799C07005c9935
$$ 160976 228607 255532 -69074 97226 112570 -44278 22400 4312 -16634 -3799 307005 -39935
15228b2603F542b00487h3419A65395J1589a30159B3370a94137R6793A54021M1027
$$ -22603 6542 -200487 -83419 165395 176984 -130159 23370 -194137 -97344 154021 195048
15217A95048i842A72578c9696j62517A67722b430p7719a8794j54645j33336A01302
$$ 195048 -9842 172578 -39696 -202213 167722 -2430 -80149 -18794 -173439 -306775 101302
15205H5873J13976q0242Q7093l9041J01647N1767A54284B5632Q6003m1449K55797
$$ 85873 199849 119607 206700 167659 269306 321073 154284 25632 111635 70186 325983
15194C25983b99508d1344j0614B5555J97843b0855E33892A96352L729D2092c80052
$$ 325983 -299508 -41344 -51958 25555 223398 -20855 533892 196352 200081 42092 -380052
15182B47865J53674a20402F9743f4151A31625J16717m9172r7850a92013C1618
$$ 247865 401539 -120402 69743 -64151 131625 248342 199170 101320 -192013 31618
15171F0930a39674m1988D9032J79972d8274l39970a13535B76509b42787e458n8046
$$ 60930 -139674 -181662 49032 229004 -48274 -388244 -113535 276509 -242787 -5458 -63504
15160f3504C0963K3434b52668p5399C49571B1326b4369A01812K82887A1226L29174
$$ -63504 30963 54397 -252668 -328067 349571 21326 -24369 101812 384699 11226 340400
15149C40400o8214A21487D4534M4600K85441A05172e416m7180n3329l6447G1651
$$ 340400 272186 121487 44534 89134 374575 105172 -5416 -52596 -105925 -142372 71651
15137D32402G6538a14860C8943K01084c988A6422N5744L20101l6849A18792N5039
$$ 432402 76538 -114860 38943 240027 -3988 16422 72166 392267 355418 118792 173831
15126A73831C0419g1220A21247F291a10009k22481B66931j05906C8175b80277
$$ 173831 30419 -71220 121247 6291 -110009 -332490 266931 161025 38175 -280277
15115D92826C6758J80249G1865L31378A10585D5845J5974L0671d151j6990m8301
$$ 492826 36758 217007 71865 403243 110585 45845 61819 92490 -4151 -21141 -69442
15104f9442B55327E4970N7868Q507a96069E73919B3232J6552a27141q5143E4510
$$ -69442 255327 54970 112838 121345 -196069 573919 23232 39784 -127141 -212284 54510
15092B13419K36450E8328J87913G9318J05768o9617J60627O676A16910M8219e6282
$$ 213419 449869 58328 246241 79318 185086 115469 276096 282772 116910 165129 -56282
15080D72721B10301K22946A37515O274J41896o8427J88155J2923A06100a12733
$$ 472721 210301 433247 137515 143789 285685 217258 405413 418336 106100 -112733
15069I2126H873M2445b74394F4839K14614j34541L1027O6692P6499D4553M12451
$$ 92126 8873 51318 -274394 64839 279453 144912 175939 242631 319130 44553 457004
15058D57004A12251B7573K0540a40571a465A326K09412b12564D6911J52798K0288
$$ 457004 112251 27573 48113 -140571 -1465 1326 210738 -212564 46911 199709 219997
15047B19997J23236e3023A22171L94778B02637b3275A16055K19954A41794K6676
$$ 219997 343233 -53023 122171 516949 202637 -23275 116055 336009 141794 168470
15037A68470K29876C2825J80790e4710B49619k464r0282C3986a14990C11119A7934
$$ 168470 398346 32825 213615 -54710 249619 247155 156873 33986 -114990 311119 17934
15025A63807n0907k2440J40868j2873A038N7526b02639B4488L15133A65115N7568
$$ 163807 112900 90460 231328 218455 1038 58564 -202639 24488 339621 165115 222683
15014B22683o9423j9410n0842H33g696B20310a6054C49360J07318A22088L5931
$$ 222683 153260 133850 83008 833 -7696 220310 -16054 349360 456678 122088 158019
15003A58019a1181j80824B08469J31234p2400C5087J99363K28718A34954K20332
$$ 158019 -11181 -192005 208469 339703 267303 35087 234450 463168 134954 355286
14993C55286K0685k1494j19183P3625A34518J73043F8294J09031H5244J19673
$$ 355286 375971 354477 235294 308919 134518 307561 68294 177325 85244 204917
14983B04917J63142j13610q0464J60082Q176A68515K61181N769j87512J20412
$$ 204917 368059 254449 173985 334067 342243 168515 429696 435465 247953 368365
14973C68365m8861H4207L04251j58929R6471a62381A77650B8715J77444L2235
$$ 368365 319504 84207 388458 229529 326000 -162381 177650 28715 206159 238394
14963B38394J72806C0444L7083K07570A14314J88709A30103K45925A58971K61845
$$ 238394 411200 30444 67527 275097 114314 303023 130103 376028 158971 420816
14953D20816j04570C1739K79416o9965H1930N34317k63294n6453j19130K57011
$$ 420816 316246 31739 311155 241190 81930 616247 352953 296500 177370 434381
14943D34381A74393j2846L84043B19577k4308J28807A24293J02935Q1810K3976
$$ 434381 174393 161547 545590 219577 195269 324076 124293 227228 309038 333014
14933C33014A10513J83486p1318L08903j82662A03251B7649L87995J3336j1504
$$ 333014 110513 293999 222681 531584 348922 103251 27649 415644 428980 417476
14923D17476j93849J72404o3076j54347J29268R9141D1709J72960Q7004a70924
$$ 417476 223627 396031 332955 178608 307876 407017 41709 214669 301673 -170924
14912A29471J87337K68796A91368n5613C174M30438n0221M2280M7442b3868C27071
$$ 129471 316808 585604 191368 135755 3174 433612 383391 425671 473113 -23868 327071
14900D34560p6499J10094m2777A94933J00968K78409j05650K31556B44496O7069
$$ 434560 358061 468155 425378 194933 295901 574310 468660 700216 244496 311565
14890C11565I0491K95620A92958N19361a04665H0169L14176Q3514r8814O5491
$$ 311565 90491 386111 192958 712319 -104665 80169 394345 477859 379045 444536
14880D44536o1198B2346N51255j25889p9953J21970j93766K78559k20699J19130
$$ 444536 383338 22346 573601 447712 367759 489729 295963 574522 353823 472953
14870D72953J1660R6991k55205J16129I7367D5408L59514r3310n1331K44217q2162
$$ 472953 484613 581604 326399 442528 97367 45408 404922 311612 260281 504498 422336
14859D22336P2378k17831L6101J45413k13629K1978J67792J8563K5708f2747B25024
$$ 422336 494714 276883 312984 458397 244768 266746 434538 453101 478809 -62747 225024
14847D59687k26892R9325m6441R9188J3514J08946k20402K42610j91837K99509
$$ 459687 232795 332120 285679 384867 398381 507327 286925 529535 337698 637207
14837F37207B01778N03692A72977K01921j10773Q5116M5045m9309R9453E9738
$$ 637207 201778 705470 172977 374898 264125 349241 394286 344977 444430 59738
14826B47735K59882L89179l63686k64707K13028J7767K206l2482J56039B86385
$$ 247735 507617 896796 533110 268403 481431 499198 501404 468922 624961 286385
14815C42118J89160O9492J0518K50910D11082M3908B25899L49917O4427k34737
$$ 342118 531278 600770 611288 862198 411082 454990 225899 575816 640243 405506
14805D05506P6824j15821J59523j88626N7511J33069j05896J20510k2268j64255
$$ 405506 482330 366509 526032 337406 394917 527986 422090 542600 520332 356077
14795C56077p1866L83905q5569B74652O67893m35606P5731Q2744k21867K8777
$$ 356077 284211 668116 582547 274652 942545 506939 582670 665414 443547 472324
14785D72324Q4898j56016K7751P111J41758r1284J85511j09967K18165k86142
$$ 472324 557222 401206 428957 436068 577826 486542 672053 562086 780251 494109
14775D94109L62216D25498J50206J22114P5139k38577j6909l336L0915n7936K49740
$$ 494109 856325 425498 575704 697818 772957 534380 517471 514135 545050 487114 736854
14764G36854j87851K7119p3998j42646L22645n4685J41578C46931n7992N53393
$$ 736854 549003 576122 502124 359478 682123 627438 769016 346931 288939 842332
14754H42332j89210K15319k50036L76994j88943j10032J641J54782k46494L07274
$$ 842332 653122 868441 618405 995399 806456 696424 698065 852847 606353 913627
14744I13627l08793m3902J93972j46286J47166N0309R7579k04919j54562K78283
$$ 913627 604834 560932 754904 608618 755784 806093 903672 698753 544191 822474
14734H22474q2558N8082K57945n03637J60434K88849j495m10272J82784j84592
$$ 822474 739916 797998 1055943 552306 712740 1001589 1000094 589822 772606 588014
14724E88014K97852k29902J60037k86397O31555m62721M07041n19062M37566j81349
$$ 588014 885866 655964 816001 529604 1161159 698438 1105479 586417 1023983 842634
14714H42634j59686J30736J37948p3903j75020j25750m9423J95520P6301j41818
$$ 842634 682948 813684 951632 877729 702709 576959 527536 723056 799357 657539
14704F57539n0181l6993M43486R612m67989L27527J23725K9860l71737N44742
$$ 657539 607358 570365 1013851 1023463 555474 883001 1006726 1036586 664849 1209591
14694A209591E72671L68005N3584k01714N798M7293r2618M46621l51453M86975
$$ 1209591 572671 940676 994260 792546 798344 845637 753019 1199640 848187 1335162
14684A335162o32145K66116j14787M09972l35234K17430O2563l35811M07585k93033
$$ 1335162 703017 969133 854346 1264318 929084 1146514 1209077 873266 1280851 987818
14674I87818j06611K91699l25013q41N39059o11408O53391k27750j20772L4760
$$ 987818 881207 1172906 847893 847052 1386111 774703 1428094 1200344 1079572 1114332
14664A114332J23497j4102J17802m56036N79292j69470j19007k32793J99119Q4712
$$ 1114332 1237829 1223727 1341529 885493 1464785 1295315 1176308 943515 1142634 1227346
14654A227346k0713j46375k07128K78138J54792l62598L04361j66880J52391j1217
$$ 1227346 1206633 1060258 853130 1131268 1286060 923462 1227823 1060943 1213334 1202117
14644A202117N1147j78201K20999j69741K14693j31796R5591L90999k99602k6919
$$ 1202117 1253264 1075063 1296062 1126321 1341014 1209218 1304809 1695808 1396206 1369287
14634A369287k35035Q8637Q1214P9678j41117K03281k09445k69007O11359k9j93013
$$ 1369287 1134252 1222889 1304103 1383781 1242664 1445945 1236500 967493 1578852 1578823 1385810
14623A385810j38322j12945Q0869O51294k26804l15841K51199n0599p0499k3583
$$ 1385810 1247488 1134543 1215412 1866706 1639902 1324061 1575260 1524661 1454162 1430579
14613A430579K36254J66112n1430k29872K02456j31278L6445N9565L1436k6041
$$ 1430579 1666833 1832945 1781515 1551643 1754099 1622821 1659266 1718831 1750267 1724226
14603A724226K5050L4160k53817J02855l3726M0332L01414n54508M94935k24805
$$ 1724226 1749276 1783436 1529619 1632474 1598748 1639080 1940494 1385986 1880921 1656116
14593A656116N44428m14942k01495M66873k10550J27087J43655k49303K83975
$$ 1656116 2200544 1785602 1584107 2050980 1840430 1967517 2111172 1861869 2145844
14584B145844R627l15280j72656L32957j85006L15434j84177L46882k49156l0066
$$ 2145844 2155471 1840191 1667535 2000492 1815486 2130920 1946743 2293625 2044469 2014403
14574B014403L15461K7674j60552j99991L50253l3820K27175j93883J50472M5828
$$ 2014403 2329864 2357538 2196986 1996995 2347248 2313428 2540603 2346720 2497192 2543020
14564B543020L5081j03248M24860j52172K63486k11945P5702M60222j22113K80127
$$ 2543020 2578101 2474853 2899713 2747541 3011027 2799082 2874784 3335006 3212893 3493020
14554C493020N31792L19084K31832N06786J923418J442728M879091R369667J3650574
$$ 3493020 4024812 4343896 4575728 5082514 7005932 8448660 13327751 22697418 36347992
14545C6347992P777422j9787037A0023138m897405j759129q86112n3872Q3485
$$ 36347992 44125414 24338377 10023138 5125733 3366604 2480492 2426620 2510105
14537B510105m68198L11712k42201l8659L86431m88123J87278K59525k20317J93738
$$ 2510105 2041907 2353619 2111418 2072759 2459190 1971067 2158345 2417870 2197553 2391291
14527B391291J82016n6768O4993k82274J09027K1964J94344j91474j67049L25144
$$ 2391291 2573307 2516539 2581532 2299258 2408285 2430249 2624593 2433119 2266070 2591214
14517B591214L01126l81182p9879J75534K81389m20180K37122J94622m1559J44873
$$ 2591214 2892340 2511158 2431279 2606813 2888202 2468022 2705144 2899766 2858207 3003080
14507C003080K79076l56363J39203L21568n81370K44221J26401j50584M76440
$$ 3003080 3282156 2925793 3064996 3386564 2805194 3049415 3175816 3025232 3501672
14498C501672j32903J98226j63289J10401n0031R8181J0998k23331N33066r0043
$$ 3501672 3368769 3566995 3403706 3514107 3464076 3562257 3573255 3349924 3882990 3792947
14488C792947k39663L12933O9598l73566K95643j27871K04491l3397J61857l8058
$$ 3792947 3553284 3866217 3935815 3562249 3857892 3730021 3934512 3901115 4062972 4024914
14478D024914O7471K33883p05992N48935l9996J21175K38575j00097M5157j79585
$$ 4024914 4092385 4326268 3620276 4169211 4129215 4250390 4488965 4388868 4434025 4254440
14468D254440J33275K89766J59340R9188j14429K0533p5446J81351R9658L04609
$$ 4254440 4387715 4677481 4836821 4936009 4821580 4842113 4766667 4948018 5047676 5352285
14458E352285l13493j9718N18948n619k3631l84716M66534K09002l2768P7128
$$ 5352285 5038792 5019074 5538022 5532403 5508772 5124056 5590590 5799592 5766824 5843952
14448E843952j69581P5830O3206M44459k44405M64179J08687n69396M73214M7287
$$ 5843952 5674371 5750201 5813407 6257866 6013461 6477640 6586327 6016931 6490145 6537432
14438F537432p9784L59600l00218M87643J24730j07838j07476M74308m10134N10590
$$ 6537432 6457648 6817248 6517030 7004673 7129403 7021565 6914089 7388397 6978263 7488853
14428G488853k13179J34323K22586K7556K8382N94870j74143J83745K07712n3070
$$ 7488853 7275674 7409997 7632583 7660139 7688521 8283391 8109248 8292993 8500705 8447635
14418H447635q4198L82776L08669j82135J72751L83075r3086K79835q9942J97025
$$ 8447635 8363437 8746213 9054882 8872747 9045498 9428573 9335487 9615322 9525380 9722405
14408I722405K32596k59502N60770r440L07040J65713j59422L57757M44603j53476
$$ 9722405 9955001 9695499 10256269 10246829 10553869 10719582 10560160 10917917 11362520 11209044
14398A1209044J74680L76574Q1748j9339L76072N22473l6793J72654M72962L65148
$$ 11209044 11383724 11760298 11842046 11822707 12198779 12721252 12684459 12857113 13330075 13695223
14388A3695223K71555j01700L1850O14369J78140J23304O25866p0875M63741N44022
$$ 13695223 13966778 13865078 13896928 14511297 14689437 14812741 15438607 15367732 15831473 16375495
14378A6375495o9399K08714Q95446r2725J68881Q12982o0229N9293O66035M30499
$$ 16375495 16306096 16514810 17410256 17317531 17486412 18299394 18239165 18298458 18964493 19394992
14368A9394992L17358N11596N97585J23976R75402j0520M80380O80485M79371
$$ 19394992 19712350 20223946 20821531 20945507 21920909 21910389 22390769 23071254 23550625
14359B3550625Q99840J27120K82412Q65378P03307K99997Q27914Q40864M12174
$$ 23550625 24450465 24577585 24859997 25725375 26428682 26728679 27556593 28397457 28809631
14350B8809631Q84284L95360J276239L02087J400581O46483Q12997O60141J143043
$$ 28809631 29693915 30089275 31365514 31667601 33068182 33714665 34527662 35187803 36330846
14341C6330846J136980J009625R12546J141786J167378R27899J702604J454265
$$ 36330846 37467826 38477451 39389997 40531783 41699161 42627060 44329664 45783929
14333D5783929J477084J012588J399467J749093J481142J808787J809597J620323
$$ 45783929 47261013 48273601 49673068 51422161 52903303 54712090 56521687 58142010
14325E8142010K180576J849660K284588K124142K336778K333175K613836K595034
$$ 58142010 60322586 62172246 64456834 66580976 68917754 71250929 73864765 76459799
14317G6459799L059848L150789K938900L316229L546567L687411L752811L768334
$$ 76459799 79519647 82670436 85609336 88925565 92472132 96159543 99912354 103680688
14309A03680688M825224M357906M799270N002328N808454N498765O176103O195016
$$ 103680688 108505912 112863818 117663088 122665416 128473870 133972635 140148738 146343754
14301A46343754O761702P335395P729239P972005Q632424Q776592R823580R889760
$$ 146343754 153105456 160440851 168170090 176142095 184774519 193551111 203374691 213264451
14293B13264451J0633748J1078173J1944064J2131324J2655063J3202147J4085039
$$ 213264451 223898199 234976372 246920436 259051760 271706823 284908970 298994009
14286B98994009J4259049J5080238J4953037J5179180J5670782J5496702J5312696
$$ 298994009 313253058 328333296 343286333 358465513 374136295 389632997 404945693
14279D04945693J4705022J3959066J2916340J1576892R781200O394839K732182
$$ 404945693 419650715 433609781 446526121 458103013 467884213 474279052 477011234
14272D77011234l34021k447888j093531R11234l686264n764738q111068r796017
$$ 477011234 476677213 474229325 473135794 474047028 470360764 464596026 456484958 446688941
14264D46688941j2017065j3102323j3734879j5474417j5574675j6543846j6172665
$$ 446688941 434671876 421569553 407834674 392360257 376785582 360241736 344069071
14257C44069071j5941338j5727370j4846218j4089409j3951563j3285804j2530225
$$ 344069071 328127733 312400363 297554145 283464736 269513173 256227369 243697144
14250B43697144j2206107j1348363j0865445j0276890r502064r057554q274132
$$ 243697144 231491037 220142674 209277229 199000339 189498275 180440721 172166589
14243A72166589p967946p874200p362134o583955o581748n308173n913196n181344
$$ 172166589 164198643 156324443 148962309 142378354 135796606 130488433 124575237 119393893
14235A19393893n138690m918126m429179m078579l576260l865841l769478l394770
$$ 119393893 114255203 109337077 104907898 100829319 97253059 93387218 89617740 86222970
14227H6222970l036620l233042l170303k482909k717058k636480k420239j962645
$$ 86222970 83186350 79953308 76783005 74300096 71583038 68946558 66526319 64563674
14219F4563674k385441j409615k048505k002520k081882j195491j832208j524052
$$ 64563674 62178233 60768618 58720113 56717593 54635711 53440220 51608012 50083960
14211E0083960j521015j269358j432628j256328n70341j029159j701583j080284
$$ 50083960 48562945 47293587 45860959 44604631 44034290 43005131 41303548 40223264
14203D0223264j225588j073897j045522k83305j242183j340604n19157j255752
$$ 40223264 38997676 37923779 36878257 36594952 35352769 34012165 33493008 32237256
14195C2237256k47102j094869k49635j267189o66220n97145j037635l91980n58094
$$ 32237256 31990154 30895285 30645650 29378461 28712241 28115096 27077461 26685481 26127387
14186B6127387m60521l57412q06833p65386n42471l44571L246r35557k07105m07162
$$ 26127387 25666866 25309454 24502621 23737235 23194764 22850193 22853439 21917882 21710777 21303615
14176B1303615n89695m2265q67632l59110n0042l25667n73808k97297l95688n40165
$$ 21303615 20713920 20671655 19804023 19444913 19394871 19069204 18495396 18198099 17802411 17262246
14166A7262246l36591j36993m11640k77784o33910K8528p4218l74830m18948j69068
$$ 17262246 16925655 16788662 16377022 16099238 15465328 15493856 15419638 15044808 14625860 14456792
14156A4456792k56782m33297k78124L51694o08672j28326o25754K52255k98086
$$ 14456792 14200010 13766713 13488589 13840283 13231611 13103285 12477531 12729786 12431700
14147A2431700j32229n80229J84420l15445k72601k27419k89364J75041L11365
$$ 12431700 12299471 11719242 11903662 11588217 11315616 11088197 10798833 10973874 11285239
14138A1285239o62135k64334o1931n4131J32987n41391J22596n23422J7473q8608
$$ 11285239 10623104 10358770 10296839 10242708 10375695 9834304 9956900 9433478 9450951 9362343
14128I362343Q2486J02826m64649k923m12828l43858R4354k38507p6480n5002
$$ 9362343 9444829 9547655 9083006 9080083 8667255 8323397 8417751 8179244 8102764 8047762
14118H047762J04964j14334k64931j77352k3485Q3930l59773M84848j83826j75795
$$ 8047762 8152726 8038392 7773461 7596109 7572624 7656554 7296781 7781629 7597803 7422008
14108G422008J42179m23991o4088j85874l08894K88962m18771n0949j1451p3228
$$ 7422008 7564187 7140196 7076108 6890234 6581340 6870302 6451531 6400582 6389131 6315903
14098F315903K14923n19748M33426l25712j41414k4177j21853k06272M42999o09460
$$ 6315903 6530826 6011078 6444504 6118792 5977378 5953201 5831348 5625076 6068075 5458615
14088E458615P9556J77735m19117J32792J17293l88272R8802k85576k11340M00782
$$ 5458615 5538171 5715906 5296789 5429581 5546874 5158602 5257404 4971828 4760488 5161270
14078E161270J73836l71534r3350J40620p6931m9302k35239J89235K8915k53970
$$ 5161270 5335106 4963572 4870222 5010842 4933911 4884609 4649370 4838605 4867520 4613550
14068D613550j61356M39800l35161m4313O7141k3668J29990l01890l94432N05169
$$ 4613550 4452194 4891994 4556833 4512520 4579661 4555993 4685983 4384093 3989661 4494830
14058D494830k4493M5170m89011L15103j84546J32146k80481o5210P9677O428
$$ 4494830 4470337 4515507 4026496 4341599 4157053 4289199 4008718 3943508 4023185 4029613
14048D029613l18054k9945L21838m62557J01118J27393j45772N522m00852J31162
$$ 4029613 3711559 3681614 4003452 3540895 3642013 3769406 3623634 3629156 3228304 3359466
14038C359466o5610P5732J08952j329k20646J07488M37131n76211n9830O1273
$$ 3359466 3293856 3369588 3478540 3477211 3256565 3364053 3801184 3224973 3165143 3226416
14028C226416K6853j22095l9152j45561j03640P9163k3849K95056j64341j09995
$$ 3226416 3253269 3131174 3092022 2946461 2842821 2921984 2898135 3193191 3028850 2918855
14018B918855K5724k66040J44429k04613j16251j13717L95766n34724M79116k09137
$$ 2918855 2944579 2678539 2822968 2618355 2502104 2388387 2784153 2249429 2728545 2519408
14008B519408p0827J82364K11541m15976J77083j05034J00145j12550l8360l27145
$$ 2519408 2448581 2630945 2842486 2426510 2603593 2498559 2598704 2486154 2447794 2120649
13998B120649J25960K80500l40933L17575J5039l35793M65471j57844P78856J953873
$$ 2120649 2246609 2527109 2186176 2503751 2518790 2182997 2648468 2490624 3269480 5223353
13988E223353K996004Q461459J3382902J3412718j5368741j3718227n526021k376037
$$ 5223353 8219357 16680816 30063718 43476436 28107695 14389468 8863447 6487410
13980F487410j366441p70660o07033l45484J76721m69869k26601l3509K43607
$$ 6487410 5120969 4350309 3743276 3397792 3574513 3104644 2878043 2844534 3088141
13971C088141j65562q5474Q6719j03342l29747J33209k85871K19923O6852l87611
$$ 3088141 2922579 2837105 2923824 2820482 2490735 2623944 2338073 2557996 2624848 2237237
13961B237237K27148r9244j91486k93580L60102M8090j26557j87035K70883j82683
$$ 2237237 2464385 2365141 2173655 1880075 2240177 2288267 2161710 1974675 2245558 2062875
13951B062875j64313M10078p860q665o3904o7777k35457M0650Q6613k49896K17940
$$ 2062875 1898562 2308640 2300780 2292115 2228211 2160434 1924977 1965627 2052240 1802344 2020284
13940B020284j33674j28302L91109k55162K05885l76832J64374k25075J75852
$$ 2020284 1886610 1758308 2149417 1894255 2100140 1723308 1887682 1662607 1838459
13931A838459k06408K71504k98040M39021k79554j30765J71714j23474j55194
$$ 1838459 1632051 1903555 1605515 2044536 1764982 1634217 1805931 1682457 1527263
13922A527263m8391r7089M53736k54683J8060n5840J98381n20933K97189j2380
$$ 1527263 1478872 1381783 1835519 1580836 1598896 1543056 1741437 1220504 1517693 1505313
13912A505313J86170q397l22739J23359P5658J13060J96492l17063M5018j82253
$$ 1505313 1691483 1683086 1360347 1483706 1559364 1672424 1868916 1551853 1596871 1414618
13902A414618k34047L1910N26299J08586o21215r4650M79551k46952L52997m14845
$$ 1414618 1180571 1212481 1738780 1847366 1226151 1131501 1611052 1364100 1717097 1302252
13892A302252M77832k72329j10026p1863J55238j51430j65248M4709k1284J29611
$$ 1302252 1780084 1507755 1397729 1325866 1481104 1329674 1164426 1209135 1187851 1317462
13882A317462k30190M73641l57538q034J20214p0041k36432M46870K30707l00841
$$ 1317462 1087272 1560913 1203375 1195341 1315555 1245514 1009082 1455952 1686659 1385818
13872A385818j28607K86036p0908k32449j3143k07600L49872j81263k03605J205
$$ 1385818 1257211 1543247 1472339 1239890 1226747 1019147 1369019 1187756 984151 985356
13862I85356K27617J64897j01321p896k16032J93968j14601k53445M77200j96328
$$ 985356 1212973 1377870 1276549 1268653 1052621 1246589 1131988 878543 1355743 1159415
13852A159415j56169M43445n9654n81066J23231R6962K38305l51576M44808m23602
$$ 1159415 1003246 1446691 1387037 805971 929202 1026164 1264469 912893 1357701 934099
13842I34099L40982n20638L82183l69522j3168L96705j34995J15500j78883j97408
$$ 934099 1275081 754443 1136626 767104 753936 1150641 1015646 1131146 952263 754855
13832G54855J87555o4363m9601K24290J83701m74356L89317k21128L55893j74493
$$ 754855 942410 878047 828446 1052736 1236437 762081 1151398 930270 1286163 1111670
13822A111670n8272j93586K76530R7604l78420o8504L12876j85466M22548l67454
$$ 1111670 1053398 859812 1136342 1233946 855526 787022 1099898 914432 1336980 969526
13812I69526L2607k45912J41665r8915L01250j66815L64854n07008l8957O7276
$$ 969526 1002133 756221 897886 798971 1100221 933406 1298260 791252 752295 819571
13802H19571K21412k69782r3350M11262N0353l15335M44384k32327D99949N61255
$$ 819571 1040983 771201 677851 1089113 1139466 824131 1268515 1036188 499949 1061204
13792A061204l08218j16510Q3621L9879K54512j51329K00223n1062l24515L63601
$$ 1061204 752986 636476 720097 759976 1014488 863159 1063382 1012320 687805 1051406
13782A051406k39465O9163j2347j05899J80429k29309J46207k7944o7347k4627
$$ 1051406 811941 881104 868757 762858 943287 713978 860185 832241 764894 740267
13772G40267M0808Q0979J26254O652J06195l03897L3499Q4934m1371j21108J5325
$$ 740267 781075 862054 988308 994960 1101155 797258 830757 915691 874320 753212 768537
13761G68537K46075r6276m49914L22052L3542j24028K09576j61646r575k30814
$$ 768537 1014612 918336 468422 790474 824016 699988 909564 747918 738343 507529
13751E07529K01563J09621N0135l22647j52693L16042j40158J41906j83802o0519
$$ 507529 709092 818713 868848 546201 393508 709550 569392 711298 527496 466977
13741D66977R7971K29446L052j9886M4266J31332k45112o51K11169k83710O6778
$$ 466977 564948 794394 797446 777560 821826 953158 708046 707395 918564 634854 701632
13730G01632j7843l742l30111k5002M18637L44981l72767J33678k15224K88462
$$ 701632 683789 680047 349936 324934 743571 1088552 715785 849463 634239 922701
13720I22701D09379L23742k37952L79982j07093J289l66774O74951m32576k0177
$$ 922701 409379 733121 495169 875151 768058 769347 402573 1077524 644948 624771
13710F24771j00481q6985r9346O55777B28681M49370j48559K560J36878l08426
$$ 624771 524290 437305 337959 993736 228681 678051 529492 532052 668930 360504
13700C60504J90707j36854K90658P2383k46733K63418j96469k2094M9052B47632
$$ 360504 551211 414357 705015 777398 530665 794083 597614 575520 624572 247632
13689D51497P8242K29939q6028j27524K1101P8898k0384j22301L30500l07999
$$ 451497 529739 759678 673650 546126 567227 646125 625741 503440 833940 525941
13679E25941B52025J83374j30965K03260m2540q3032n8088J49727B35282K12319
$$ 525941 252025 435399 304434 507694 465154 382122 324034 473761 235282 447601
13669D47601P2738n5302m0612L22270l9388C52279q9520M21150k01739J47985
$$ 447601 520339 465037 424425 746695 707307 352279 262759 683909 482170 630155
13659F30155j8817k7758K87665k51117j76532P3136j05247J47967j35076n850
$$ 630155 611338 583580 871245 620128 443596 516732 411485 559452 424376 418526
13649D18526Q0970J88684l3140k59974q6226L73899k99807J05642j09466A75041
$$ 418526 499496 688180 655040 395066 308840 682739 382932 488574 379108 175041
13638D49385K65018k23766j35570n1081J96773l571A99222O77619k26370p3506
$$ 449385 714403 490637 355067 303986 500759 497188 199222 876841 650471 576965
13628E76965l1153k19722O3134K28686l9594J5738B76483K87136J47666j50598
$$ 576965 545812 326090 389224 617910 578316 594054 276483 563619 711285 560687
13618E60687j39166M2277l9999R6666j41723R2273q3088l3467l1730q6557L46697
$$ 560687 421521 463798 423799 520465 378742 471015 387927 354460 322730 236173 582870
13607E82870o8605j5462J24472k22964O2922j96256l2588O15455B79253Q8529
$$ 582870 514265 498803 623275 400311 463233 266977 234389 849844 279253 367782
13597C67782m9213G8211J69206K65360j76757M12236j87865j21976K68701l06579
$$ 367782 318569 78211 247417 512777 336020 748256 560391 438415 707116 400537
13587D00537K58359N8116l50624r1253K87761A66271K30557o3958L0997K06206
$$ 400537 658896 717012 366388 275135 562896 166271 396828 332870 363867 570073
13577E70073o6329I160K83626K06006A54599J84825J32897M79653i3290E30929
$$ 570073 503744 9160 292786 498792 154599 339424 472321 951974 -93290 530929
13566E38441L5421B09177K14149A97200C2329L47143O2095A34734O36656B99657
$$ 538441 573862 209177 423326 197200 32329 379472 441567 134734 771390 299657
13555D98753o0538r2902j50744L26317j9063j54617A17684L42381A81276J69666
$$ 498753 438215 345313 194569 520886 501823 347206 117684 460065 181276 350942
13545C50942A65085J20771J88193p8679j17502P2331R6521j92398L29153j075
$$ 350942 165085 285856 474049 395370 277868 350199 446720 254322 583475 582400
13535E82400A95299J53281L44523B06309K26416a51676E24519j05321p4039k3299
$$ 582400 195299 348580 693103 206309 432725 -151676 524519 419198 345159 321860
13525C21860j00548a8065B31427K10624A63210o13J64159L38609B73678j0112
$$ 321860 221312 -18065 231427 442051 163210 162597 326756 665365 273678 263566
13515B63566A03904J30154e5707C63971J68735j97171a71253C58526L03430A99417
$$ 263566 103904 234058 -55707 363971 532706 335535 -171253 358526 661956 199417
13504D27240k7258J73543H1796J59249j8980K48655P4662q4515j10227j64197
$$ 427240 399982 573525 81796 241045 222065 470720 545382 460867 350640 186443
13494A86443L7605k0675k3753L43091n3287j88986r4306j0161K24418j62864L25232
$$ 186443 224048 203373 179620 522711 469424 280438 186132 175971 400389 237525 562757
13483E62757A60533J96634J07177J97660l06354L8592p0151K42399k79418K70361
$$ 562757 160533 357167 464344 662004 355650 394242 324091 566490 287072 557433
13473E57433k16725R3898j76090r3434E0096K97361j63378J4790p6804L7389J58106
$$ 557433 340708 434606 258516 165082 50096 347457 184079 198869 122065 159454 317560
13462C17560g8285D68597r1437D1110K01488J02260L28652A47521C4604N2415
$$ 317560 -78285 468597 377160 41110 242598 344858 673510 147521 34604 87019
13452H7019K54427A58382L20370j18569J4097i6844C22577M6402j54022q2483
$$ 87019 341446 158382 478752 360183 374280 -96844 322577 368979 214957 132474
13442A32474M0792P6844G141L79127j72789H0433j857L10370j21939J10612H8118
$$ 132474 173266 250110 7141 386268 213479 80433 78576 388946 267007 377619 88118
13430I4531K9031K66299j83702K12966n310H5191J14851J78060r7999j35431q08
$$ 94531 123562 389861 206159 419125 413815 85191 200042 378102 280103 144672 143864
13419A43864L10638f0279k5656B88989L58045A94227R5131l1634J682G1162N34219
$$ 143864 454502 -60279 -85935 288989 647034 194227 289358 257724 259406 71162 605381
13408F05381D700L31125j48047n8626C6357L14928J88762B17280o1016G3944L62315
$$ 605381 4700 335825 187778 129152 36357 351285 540047 217280 156264 73944 436259
13397D36259j84250j11422M03518r8829A80603J26970G4968N5557c682A06749
$$ 436259 252009 140587 544105 445276 180603 307573 74968 130525 -3682 106749
13386B76666K74029A49829L11620F8867J52895J25591A28957J36022A30381J27957
$$ 276666 550695 149829 461449 68867 221762 347353 128957 264979 130381 258338
13376B58338J49052n9461K64677B18104M6840j12144J84761L2138I8800Q0491
$$ 258338 407390 347929 612606 218104 264944 152800 337561 369699 98800 179291
13366A79291L01050f2082E74947A15165N22620B68724J28169A34322L45191j19890
$$ 179291 480341 -62082 574947 115165 637785 268724 396893 134322 479513 359623
13356C59623j4288e7155A58829J30140k7899O6565l8591D2465K24990J4466O163
$$ 359623 345335 -57155 158829 288969 261070 327635 289044 42465 267455 281921 288084
13345B88084o0400o3573L91973A71473k1013J69502Q1236j99267J58061f6201
$$ 288084 227684 164111 556084 171473 150460 319962 401198 201931 359992 -66201
13334C68972p8576J60719a7106A81591p0695a09584C36947j24025a25928A37072
$$ 368972 290396 451115 -17106 181591 110896 -109584 336947 212922 -125928 137072
13323D54538A54786K73383n4717O233A76062J82528E7537K41701n6497J19854
$$ 454538 154786 428169 373452 379685 176062 358590 57537 299238 242741 362595
13313C62595q9829K91775B20482J33297K2981F3032J72137K04492a24750p1263
$$ 362595 272766 564541 220482 353779 376760 63032 235169 439661 -124750 -196013
13303a96013C5222R3155K17274G3794J87441h6556E70107B67095H6336a36057
$$ -196013 35222 128377 345651 73794 261235 -86556 570107 267095 86336 -136057
13292a49236B32157P7836j27264N3046K51530e5344E6771P5069J78055H3764e5379
$$ -149236 232157 309993 182729 235775 487305 -55344 56771 131840 309895 83764 -55379
13280B37843q2623D4259M10131j99807J9871q6726j8276K28620a88207B11436
$$ 237843 155220 44259 454390 254583 274454 187728 169452 398072 -188207 211436
13269a32346A42736F8620K33183q1358a2918m7426K2470E08528j12823L709j67470
$$ -132346 142736 68620 301803 220445 -12918 -60344 -37874 508528 395705 399414 231944
13258B31944I5820R8110a7765A70286a3648q9671C03656A37458J18137k8698p0250
$$ 231944 95820 193930 -17765 170286 -13648 -103319 303656 137458 255595 226897 156647
13247A56647A1250N3873l2160a09994H637J15619M9552G8980M6752m9563N6061
$$ 156647 11250 65123 32963 -109994 8637 124256 173808 78980 125732 76169 132230
13236A32230P6758P5688J4432j13994j0078J59036a77195C58858a22844f3D7270
$$ 132230 208988 284676 299108 185114 175036 334072 -177195 358858 -122844 -63 47270
13224A99997L7534N3375G3140J78926A06253K2431K53241a59970A88257P015d1150
$$ 199997 237531 290906 73140 252066 106253 128684 381925 -159970 188257 195272 -41150
13212D5147d96116A94862D6417i7395F9371a62649Q0090C93551A5560J21421N8270
$$ 45147 -496116 194862 46417 -97395 69371 -162649 -82559 393551 15560 136981 195251
13201A95251o0782J29796b4121F9288L16729J7574m0567k3467A2120d12812D53828
$$ 195251 134469 264265 -24121 69288 386017 403591 363024 339557 12120 -412812 453828
13189A05546J56889q5528F2301L20939A00503m5600J45900k0559D9364A7198L39548
$$ 105546 262435 176907 62301 383240 100503 54903 200803 180244 49364 17198 356746
13178C56746q8144j22120i394A18303C8524N2606K11344a90613A00370N6468a798
$$ 356746 268602 146482 -9394 118303 38524 91130 302474 -190613 100370 156838 -1798
13166B10229O7148I6420J35770p2565K769J27568A5389K74251N0118A28788c51614
$$ 210229 277377 96420 232190 159625 162394 289962 15389 289640 339758 128788 -351614
13154B64044r0773c1904L084D9478g4470C36746p7254G9792f4506j7942E2007
$$ 264044 173271 -31904 -28820 49478 -74470 336746 259492 79792 -64506 -82448 52007
13142C43287h0416A32246E1178a61089D37124C4171e128F136K68561b10498B92678
$$ 343287 -80416 132246 51178 -161089 437124 34171 -5128 6136 274697 -210498 292678
13130A70225G3398K11505c48349B46831E5674J28489a55195B20368b1688j11406
$$ 170225 73398 284903 -348349 246831 55674 184163 -155195 220368 -21688 -133094
13120a33094C14999A53563E0805b9224B25260L7854P5830b06187H5357J66857
$$ -133094 314999 153563 50805 -29224 225260 263114 338944 -206187 85357 252214
13110B52214H7695g0643P074j04866C2823b0981k41127B99979m801j04354O2569
$$ 252214 87695 -70643 -63569 -168435 32823 -20981 -262108 299979 295178 190824 253393
13099B53393F4004J58257n794b10317G938b75374d9089E5968f2878A36355K73883
$$ 253393 64004 222261 216467 -210317 7938 -275374 -49089 55968 -62878 136355 410238
13088D10238o2884A03097a7516F4255L26494c5664j71307E6332J32031q8212d8374
$$ 410238 347354 103097 -17516 64255 390749 -35664 -206971 56332 188363 100151 -48374
13076B34240A05252k546K69733a39134H5976i4023q4598m4948h9059F1219c17651
$$ 234240 105252 102706 372439 -139134 85976 -94023 -178621 -223569 -89059 61219 -317651
13064a0000D82279e3909j42867A3631J80600a41533n7824B70214j22781a1642
$$ -10000 482279 -53909 -196776 13631 194231 -141533 -199357 270214 147433 -11642
13053E12780A17742A0565J50433J39925a07597A74510J06809D4557K08748j19306
$$ 512780 117742 10565 160998 300923 -107597 174510 281319 44557 253305 133999
13043A33999b46645C0655K19471i8776c2981A42291A9133e2551B96589A01321
$$ 133999 -246645 30655 250126 -98776 -32981 142291 19133 -52551 296589 101321
13032A29980N4282J90956A01217K91573j57374J94703j99164i2089A71527K06698
$$ 129980 184262 375218 101217 392790 235416 430119 230955 -92089 171527 378225
13022C78225A06870h0459B96984j47392L35162j48438J48A60993F234J06204L2321
$$ 378225 106870 -80459 296984 149592 484754 336316 336464 160993 6234 112438 144759
13011A44759a61524I1832J52815Q8424d6490I3905J66124a10104A50413j9939
$$ 144759 -161524 91832 244647 333071 -46490 93905 260029 -110104 150413 130474
13001A30474B899a0720r607B39276h6800C2556L34550R9615b58084A16238a54574
$$ 130474 2899 -10720 -20327 239276 -86800 32556 367106 466721 -258084 116238 -154574
12989A96459B1272P4488J33942J68945A700J54379a88933r3746B66335K75595
$$ 196459 21272 95760 229702 398647 1700 156079 -188933 -282679 266335 541930
12979E41930c36217b8711A27239e2434n2165B30827b4045P545D8482a74480B41802
$$ 541930 -336217 -28711 127239 -52434 -104599 230827 -24045 -16500 48482 -174480 241802
12967A52089Q6639r1594e6293A22820I344c4736a2104A14985a98158l3940g6003
$$ 152089 238728 147134 -56293 122820 9344 -34736 -12104 114985 -198158 -232098 -76003
12955D58423p4912A49928R7865G0455k9504J47823a40755I414J5145P4273N059
$$ 458423 383511 149928 247793 70455 40951 188774 -140755 9414 24559 98832 103891
12944A03891J85413L9598f5854m6751K5727C5976J41257M7623K19798e3146C1635
$$ 103891 289304 328902 -65854 -112605 -86878 35976 177233 224856 444654 -53146 31635
12932a44009A21152F487i6847k69317H25a19316m531j64561D13005r299a87609
$$ -144009 121152 6487 -96847 -366164 825 -119316 -123847 -288408 413005 403706 -187609
12920c19733e1583J5363A74186c55846a2607j74839d7245B59944a70868E7385
$$ -319733 -51583 -36220 174186 -355846 -12607 -187446 -47245 259944 -170868 57385
12909b19922d8280A05571J6015Q4065k8456b0929A70134J67775L8040A79640a84695
$$ -219922 -48280 105571 121586 205651 177195 -20929 170134 337909 375949 179640 -184695
12897D32035a67606E00224k37745g5160D835e3200B13320E7680J14264J80809
$$ 432035 -167606 500224 262479 -75160 4835 -53200 213320 57680 171944 352753
12887C52753h9145E2201J47163K9937i4027I1034J85444A08456a94351A63177
$$ 352753 -89145 52201 199364 229301 -94027 91034 276478 108456 -194351 163177
12876e0475A44857m0074p500B4419L45469Q069A4029N6133B7098i9891j11807
$$ -50475 144857 104783 97283 24419 369888 377957 14029 70162 27098 -99891 -211698
12865b11698A1168J29897a7444I1047a76466A7595J39728b83357E3555n557N36939
$$ -211698 11168 141065 -17444 91047 -176466 17595 157323 -283357 53555 47998 584937
12854E84937k54404a97842A00247J06343q4279a56731B50545h4932J9956H3832
$$ 584937 330533 -197842 100247 206590 122311 -156731 250545 -84932 -64976 83832
12843B77460b42273D4751A5898K31458j17150P6322a26557J8134A12818R637J85042
$$ 277460 -242273 44751 15898 247356 130206 206528 -126557 -108423 112818 122455 307497
12832C07497A7271K2100a52900N4856I2512a84626A36946a49586j63245A09179
$$ 307497 17271 39371 -152900 -98044 92512 -184626 136946 -149586 -312831 109179
12821b93092F0915K47093c5049l55F9120J65154f4026r6010c3516l0046C00253
$$ -293092 60915 308008 -35049 -35404 69120 234274 -64026 -160036 -33516 -63562 300253
12809b93445A31128c4377m2718B44334a74550D8325L02845A17553J1137n3113
$$ -293445 131128 -34377 -77095 244334 -174550 48325 351170 117553 128690 75577
12799G5577a70177G3974K00384L3269A10089L3212K98758j83496b73979A77791
$$ 75577 -170177 73974 274358 307627 110089 143301 442059 258563 -273979 177791
12788h0231k15973h5713K1629E6079N9235K3732e23304B44638b3208j2698E3283
$$ -80231 -296204 -85713 -64084 56079 115314 139046 -523304 244638 -23208 -35906 53283
12776F9269g6970b9128G212L68330D981b60543E0030A0846R4364a42458j13115
$$ 69269 -76970 -29128 7212 375542 4981 -260543 50030 10846 105210 -142458 -255573
12765b55573Q8489A99237C5178K6625k9403f395o1185B46530g366h84G3829k9284
$$ -255573 -167084 199237 35178 61803 32400 -6395 -67580 246530 -7366 -884 73829 44545
12753D4545K40549M2067a48584M5413D17408A16683a4649C89343a02500A34666
$$ 44545 285094 327161 -148584 -103171 417408 116683 -14649 389343 -102500 134666
12742a48688e1635C43274b8822m0730B9747Q7064l221c4714I6623c3611F3317
$$ -148688 -51635 343274 -28822 -69552 29747 116811 113590 -34714 96623 -33611 63317
12730A81022b2903j31873j73703h4489D6141e6035r4176c9125p959p7659B1569
$$ 181022 -22903 -154776 -328479 -84489 46141 -56035 -150211 -39125 -47084 -124743 21569
12718E1736a86633A69493i3429H3834A44J53701B879a4256D58510K54778B41724
$$ 51736 -186633 169493 -93429 83834 144 153845 2879 -14256 458510 713288 241724
12706E46035a4841A81439J51300k567N4387j84934C0601b49182A22056a58477
$$ 546035 -14841 181439 332739 330172 384559 199625 30601 -249182 122056 -158477
12695F155P0530O0583E5717e3460A5257a78490C77176j81587b9934H3968k4466
$$ 6155 76685 137268 55717 -53460 15257 -178490 377176 195589 -29934 83968 59502
12684E9502a70510j03246C47181b05617C54719Q0288B05583J09959J58850B32801
$$ 59502 -170510 -273756 347181 -205617 354719 435007 205583 315542 474392 232801
12673D10180q0414A20482E8050i0334A24643L21699b36586A80979J2733H2200
$$ 410180 329766 120482 58050 -90334 124643 446342 -236586 180979 193712 82200
12662D44459D7722J26608p0401L172l5862P439K79320j72104f0132A08568k8124
$$ 444459 47722 174330 103929 107101 71239 78678 357998 185894 -60132 108568 80444
12651H0444C1439a10152k9417a2527F7097f4504B6383K10207g4770C66598b55074
$$ 80444 31439 -110152 -139569 -12527 67097 -64504 26383 236590 -74770 366598 -255074
12639b8123C9221A6202J96159E3212K02040A6492a64265a6307E73266B28055J27453
$$ -28123 39221 16202 212361 53212 255252 16492 -164265 -16307 573266 228055 355508
12628C55508P468d1381C98382b4645j0474A94293R0885f1670A4943J53103b1984
$$ 355508 362976 -41381 398382 -24645 -35119 194293 285178 -61670 14943 168046 -21984
12616f7991C63066j43354k7908n5131f0010D60162j92003m2529I4959L7291a49
$$ -67991 363066 219712 191804 136673 -60010 460162 268159 225630 94959 132250 -149
12604A24099j7067J18090o5349K55770q2856j65478H0302r840J7936a58203A37747
$$ 124099 107032 225122 159773 415543 332687 167209 80302 70462 88398 -158203 137747
12592A10036K16523J27942B13572a19458C3610K4190a62679C10705A3131J00351
$$ 110036 326559 454501 213572 -119458 33610 57800 -162679 310705 13131 113482
12582A13482e9817B03686J6328E5380O9569J41475b97540j3176a11579B09841
$$ 113482 -59817 203686 220014 55380 124949 266424 -297540 -310716 -111579 209841
12571b76933c1154k264C3381J6264J4427h7519A43807n4718a37325A67883f7808
$$ -276933 -31154 -33418 33381 49645 64072 -87519 143807 89089 -137325 167883 -67808
12559a034A62951f6208r400A17990m6398H913K95432n6504L0111b2461F3065M5505
$$ -1034 162951 -66208 -75608 117990 71592 8913 304345 247841 277952 -22461 63065 108570
12547A08570J51232G2522K67073g572D2633A6603J63810R2282a60573g1277q2750
$$ 108570 259802 72522 339595 -7572 42633 16603 180413 272695 -160573 -71277 -154027
12536a54027Q043A41393K54250c0313j11505A37975Q4008G2313f2911a2193j9336
$$ -154027 -145984 141393 395643 -30313 -141818 137975 221983 72313 -62911 -12193 -31529
12525c1529A56483n0099j2126k7659J94971c22184b6167A18747f2446G7043L7322
$$ -31529 156483 106384 94258 66599 261570 -322184 -26167 118747 -62446 77043 114365
12514A14365G656L173c9038j78039A92768f0109H5045a36191A69005d7638B7283
$$ 114365 7656 10829 -39038 -217077 192768 -60109 85045 -136191 169005 -47638 27283
12502A1374J36238a0494G536L23038a19854N5179G0797A7478e4528J8213A72328
$$ 11374 147612 -10494 7536 330574 -119854 -64675 70797 17478 -54528 -36315 172328
12490a01647j92134a16613E1837a99047n4154B5305N8042l5394O9240J23168b03852
$$ -101647 -293781 -116613 51837 -199047 -253201 25305 83347 47953 117193 240361 -203852
12478C32601j43191b47930O4418A57533F3462L4371C3693f1308J4073G4501a99791
$$ 332601 189410 -247930 -183512 157533 63462 97833 33693 -61308 -47235 74501 -199791
12466D25680b23293A38841a03506k46812a28678A77766N5750G9316f2163m2225
$$ 425680 -223293 138841 -103506 -350318 -128678 177766 233516 79316 -62163 -104388
12456a04388A68608h555j6043j26651o3270P2848M4662B89042j17081J95896l962
$$ -104388 168608 -8555 -24598 -151249 -214519 -141671 -97009 289042 171961 367857 363895
12445C63895b47226J23285c8562j52984B73942b52868B27136M9895b29556B4148
$$ 363895 -247226 -123941 -38562 -191546 273942 -252868 227136 277031 -229556 24148
12434i2026j0215A8797c12785i5956a6206k05271A19562e2361H2738a34682D31966
$$ -92026 -102241 18797 -312785 -95956 -16206 -221477 119562 -52361 82738 -134682 431966
12422A76813m4017a32598b1481o1126D29475g2927C4006R306c07938A01366O4217
$$ 176813 132796 -132598 -21481 -82607 429475 -72927 34006 43312 -307938 101366 165583
12411A65583A5495J95080l7458k7978D3377b97235D47473d4618k41134B20772
$$ 165583 15495 210575 173117 145139 43377 -297235 447473 -44618 -285752 220772
12400D15115a64418L7756k69151J75470d2442k2411B3837Q7470i1018h406C3380
$$ 415115 -164418 -126662 -395813 -220343 -42442 -64853 23837 111307 -91018 -8406 33380
12388H6387K7859a15000A46928a06414j5725c4681j01453q5992C7b8886A53805
$$ 86387 114246 -115000 146928 -106414 -122139 -34681 -136134 -222126 37 -28886 153805
12376c2414j42166f1811m5396B68558E1326J24290f9808j33700B21926b32530
$$ -32414 -174580 -61811 -107207 268558 51326 175616 -69808 -203508 221926 -232530
12365B12198G0337a62515j3787E922b41214A02137k0177a49508J0719b1821I7302
$$ 212198 70337 -162515 -176302 5922 -241214 102137 81960 -149508 -138789 -21821 97302
12353a2998m9315A47726d12882f1750o5633H3618l5574j6480a04858A05790f0952
$$ -12998 -62313 147726 -412882 -61750 -127383 83618 48044 31564 -104858 105790 -60952
12341B26078a49560j46973f1258B70429b61451P1635j98868E0816l085N7751c8380
$$ 226078 -149560 -296533 -61258 270429 -261451 -189816 -388684 50816 47731 105482 -38380
12329a97940D66923a05416F5426a5164A27264b69830B29355f5213I2867R5905
$$ -197940 466923 -105416 65426 -15164 127264 -269830 229355 -65213 92867 188772
12319A88772l1320m8378a34286d1818A34858E7369d8452k2592B02543m5228m6111
$$ 188772 157452 109074 -134286 -41818 134858 57369 -48452 -71044 202543 157315 111204
12308A11204d922o321B39474B9395M7034J24623D1912L157K5862O1482g5741B30327
$$ 111204 -4922 -11243 239474 29395 76429 201052 41912 45069 70931 132413 -75741 230327
12295A70514h6449c3786B55105j162F6355J62084b45847a7764A26891R5768I1534
$$ 170514 -86449 -33786 255105 253943 66355 228439 -245847 -17764 126891 222659 91534
12283B71372k5639I1645b47197B72190A33757R3309b42330B85108P666j17061
$$ 271372 245733 91645 -247197 272190 133757 227066 -242330 285108 292774 175713
12273A75713E3871Q104L90238a32743q8257A08488P5861N7726a7885B12744g0552
$$ 175713 53871 61975 452213 -132743 -221000 108488 184349 242075 -17885 212744 -70552
12261a74980D64144I6965J1009Q4900p8273K2742A0553K89108A08245J39190a11112
$$ -174980 464144 96965 107974 192874 114601 137343 10553 299661 108245 247435 -111112
12249b91991B12651J37254a03619c407k0714A72094G9662c5193o6240c7348B04409
$$ -291991 212651 349905 -103619 -3407 -24121 172094 79662 -35193 -101433 -37348 204409
12237C20366A1436O3335J3208C1933a75584D0225J18076A2198J20955E6047J38787
$$ 320366 11436 74771 87979 31933 -175584 40225 158301 12198 133153 56047 194834
12226A94834J41364b5094B56836q2045F4024a21617C75490l6194J9462h2481j8965
$$ 194834 336198 -25094 256836 174791 64024 -121617 375490 339296 358758 -82481 -101446
12215a01446B39725J2789C4141J65986B5693J36677a1809B00824d7953C51923
$$ -101446 239725 252514 34141 200127 25693 162370 -11809 200824 -47953 351923
12204e2472C33081m02q0295J10107J12682j00794A22176K15648A59672K09019
$$ -52472 333081 332679 252384 362491 475173 374379 122176 337824 159672 368691
12194C68691j05973K12352j48688B4690Q019o58f9809C2433e3047A42386L06054
$$ 368691 262718 475070 326382 24690 32709 32051 -69809 32433 -53047 142386 448440
12183D48440A52639d9393F0825N7042J29791q3152a44106A51573C7704L4894Q0316
$$ 448440 152639 -49393 60825 117867 247658 164506 -144106 151573 37704 72598 152914
12172A52914m7596j2987k1094a13520A71060F2145P9883p696b33727C811L45058
$$ 152914 105318 92331 71237 -113520 171060 62145 142028 134332 -233727 3811 348869
12161C48869j54298b1941j71155K71g6081a5421j95366a8052j9956B20161c0705
$$ 348869 194571 -21941 -193096 -192825 -76081 -15421 -210787 -18052 -38008 220161 -30705
12149b35706A39700a37877I3019K4887n2225c35793a07380A56986B2420J8793
$$ -235706 139700 -137877 93019 117906 65681 -335793 -107380 156986 22420 41213
12139D1213a06811n2191O8329B80205G7960j4238J5966K54619a08279B1157J64160
$$ 41213 -106811 -159002 -90673 280205 77960 63722 79688 334307 -108279 21157 185317
12128A85317J82752a29961C22277k4178C3610K300d6953A39926d21269a16565
$$ 185317 368069 -129961 322277 298099 33610 35910 -46953 139926 -421269 -116565
12117B27348d1023k99575a54571b8189B26026o0286c5497A88616k955I0787j7306
$$ 227348 -41023 -340598 -154571 -28189 226026 165740 -35497 188616 185661 90787 73481
12106G3481A9733f9395A78404d3179j73081B05637A3743K49022B9082b65066B5688
$$ 73481 19733 -69395 178404 -43179 -216260 205637 13743 262765 29082 -265066 25688
12094A4306a00697C63561c76949B07365b80515G7748J33402c7315j39799j27336
$$ 14306 -100697 363561 -376949 207365 -280515 77748 211150 -37315 -177114 -304450
12084c04450A6481h1164f856B69392i0400A84090b67364B2780M1148J42968f2454
$$ -304450 16481 -81164 -6856 269392 -90400 184090 -267364 22780 63928 206896 -62454
12072B81045E5393J44841L64198L2484P60616E74704k46225j56459K7326F0823
$$ 281045 55393 200234 564432 596916 1357532 574704 328479 172020 199346 60823
12061H7053M35790d3853A49450K33036A68189N8130i75o0349H3285b37524H4972
$$ 87053 522843 -43853 149450 382486 168189 226319 -975 -61324 83285 -237524 84972
12049a61846c850j39843c6262E68832b88603N8594F21948F6080p001f8209B88503
$$ -161846 -3850 -143693 -36262 568832 -288603 -230009 621948 66080 59079 -68209 288503
12037A9470e6721A72707E4450e3289a683k9484a46B13596q8463a7465A90567a78060
$$ 19470 -56721 172707 54450 -53289 -1683 -31167 -146 213596 125133 -17465 190567 -178060
12024B67248C4582K40753b5827A01604J80433a69909D24049d9496j55091E5091
$$ 267248 34582 275335 -25827 101604 282037 -169909 424049 -49496 -204587 55091
12013a98974A07393a00454A21326i6278i35j13855l7901K8005A94576g7169C02534
$$ -198974 107393 -100454 121326 -96278 -935 -114790 -152691 -124686 194576 -77169 302534
12001a78122L2693B2153K53360b13397j94892C07357b44498k213C414M4715b3726
$$ -178122 -145429 22153 275513 -213397 -408289 307357 -244498 -246711 3414 48129 -23726
11989A70317i0807k3575B0928a82791j42930A79160a76148H9517i5778A04868
$$ 170317 -90807 -114382 20928 -182791 -325721 179160 -176148 89517 -95778 104868
11978a55052A504e59096a92543D4691M4800b75D5024a50350J8040H4551l62K74495
$$ -155052 1504 -559096 -192543 44691 89491 -275 45024 -150350 -132310 84551 84189 358684
11966C58684e6564d741l02108H3180a55695l32287B43061c9010a8029n4539k49647
$$ 358684 -56564 -4741 -306849 83180 -155695 -487982 243061 -39010 -18029 -72568 -322215
11955c22215G6268L7162a13482A514d6368j02981A31886b24440i9018D42925B923
$$ -322215 76268 113430 -113482 1514 -46368 -149349 131886 -224440 -99018 442925 2923
11943D4503g8218b673A09371J2061a90849B8110M9338k3194a06415H0745a47416
$$ 44503 -78218 -2673 109371 121432 -190849 28110 77448 54254 -106415 80745 -147416
11931b22342c5550B1050d6586a3304p0117G9993g7643j26867e4868k41177H5038
$$ -222342 -35550 21050 -46586 -13304 -83421 79993 -77643 -204510 -54868 -296045 85038
11919a92999p8221A76108a11168l4968E0294a93282A24809D1422F93e2165D085
$$ -192999 -271220 176108 -111168 -146136 50294 -193282 124809 41422 693 -52165 4085
11907e01488a24201C6797K6455a90162b0248H474P3669a7525A920K2540J49105
$$ -501488 -124201 36797 63252 -190162 -20248 8474 82143 -17525 1920 24460 173565
11896A73565c44580a4245j72472I6429j1933a29457n2743G9430a51765A20845
$$ 173565 -344580 -14245 -186717 96429 84496 -129457 -182200 79430 -151765 120845
11885c6476k1927A09082A8340m233a39157B83628a4551l96504B9662b25396m5242
$$ -36476 -58403 109082 18340 14107 -139157 283628 -14551 -411055 29662 -225396 -270638
11874b70638J01204G8733c27432J07642M4964e8951m47439H7084k2675b04668
$$ -270638 -169434 78733 -327432 -219790 -174826 -58951 -506390 87084 64409 -204668
11863c4509A10586M6685a19166j818a1919m1704B24264B9669a88002e5705J9140
$$ -34509 110586 157271 -119166 -120984 -11919 -53623 224264 29669 -188002 -55705 -36565
11852c6565A20578K50208a35307f2F291J35297g7324n1331k61545b5994a2085
$$ -36565 120578 370786 -135307 -62 6291 141588 -77324 -128655 -390200 -25994 -12085
11840E7915R0341J5117D2486i8316o8825Q1843j34300F4529a77457B06706d4607
$$ 57915 148256 163373 42486 -98316 -167141 -85298 -219598 64529 -177457 206706 -44607
11828g472m4299F3010a02493A96571o8086b01169f765o5014J7342A49273a4570
$$ -7472 -51771 63010 -102493 196571 128485 -201169 -6765 -71779 -54437 149273 -14570
11816F6312c35406a44709O7235A5475h0351A12396m0318R3861d751D2872a23897
$$ 66312 -335406 -144709 -77474 15475 -80351 112396 72078 165939 -4751 42872 -123897
11804e293A02243a6439O48m3595b5093A13016Q4880E8506J83533a3313A32496
$$ -5293 102243 -16439 -15791 -59386 -25093 113016 197896 58506 242039 -13313 132496
11792a57350n0133d1505F365a26378j61101B86467C629a55605A43277J32171A699
$$ -157350 -207483 -41505 6365 -126378 -287479 286467 3629 -155605 143277 275448 1699
11780A15302b26784Q374A84716c34223C3381a35914O4770o008B58846d3981j36473
$$ 115302 -226784 -218410 184716 -334223 33381 -135914 -71144 -77152 258846 -43981 -180454
11769a80454E8114K46612b05654J1596d8392G7c02603b4967D4481g035A93462
$$ -180454 58114 304726 -205654 -194058 -48392 77 -302603 -24967 44481 -7035 193462
11757e8820k91303A7497J42199m9958e61504A6156a05771H9930a6518j80110A15518
$$ -58820 -350123 17497 159696 109738 -561504 16156 -105771 89930 -16518 -196628 115518
11745b70428f2018l61669a79620A69003J013K1128N0345a14023M0839B2632f0479
$$ -270428 -62018 -423687 -179620 169003 170016 191144 241489 -114023 -73184 22632 -60479
11733A60840G3337M7467B6791a35299A06012J49657H2248a17481J5066j03796
$$ 160840 73337 120804 26791 -135299 106012 255669 82248 -117481 -102415 -206211
11723b06211H964h7856C22210c2173C08025a16726d4064o8578M2942e679B65145
$$ -206211 8964 -87856 322210 -32173 308025 -116726 -44064 -112642 -69700 -5679 265145
11711E20770B5479d8386J3477A15952C3819m668R7101b68419C55625A02968J54662
$$ 520770 25479 -48386 -34909 115952 33819 29151 126252 -268419 355625 102968 257630
11700B57630p8558a68804G7733l0700J68150m5651E5475f8571o9930B7108d2945
$$ 257630 179072 -168804 77733 47033 215183 169532 55475 -68571 -138501 27108 -42945
11688B00452Q059a77182C01342A32450j1708E8690f6853A39151i6567B40773p1246
$$ 200452 208511 -177182 301342 132450 120742 58690 -66853 139151 -96567 240773 169527
11677A69527D9506a51735A90080a75165A18093E5035d0811I2749P6397h4598j83368
$$ 169527 49506 -151735 190080 -175165 118093 55035 -40811 92749 169146 -84598 -267966
11666b67966B32357N5680b02350H3114K87510E7738J87673f3447B31764h1535
$$ -267966 232357 288037 -202350 83114 370624 57738 245411 -63447 231764 -81535
11655B71921m5631r859e6432r0846f4867n0042D4972J31570C4810M1999K06612
$$ 271921 226290 216431 -56432 -147278 -64867 -114909 44972 176542 34810 76809 283421
11644B83421L4472A55541G5925b93371J08701c9425H2518K38524G4413M3597A4523
$$ 283421 317893 155541 75925 -293371 -184670 -39425 82518 321042 74413 118010 14523
11632a30872b570D05166A30709a46943A06784k444D9726b54300A25419Q6301c0628
$$ -130872 -2570 405166 130709 -146943 106784 104340 49726 -254300 125419 211720 -30628
11620E1502J625a17870D1012Q0457h3347E9479h8605K2365B3246P0503c4018j74017
$$ 51502 53127 -117870 41012 121469 -83347 59479 -88605 -66240 23246 93749 -34018 -208035
11608b08035r8902J22214A36139g6636b381C43709b51995H8686M862Q8953A3954
$$ -208035 -306937 -184723 136139 -76636 -2381 343709 -251995 88686 93548 182501 13954
11596G9152J3652a63565A62190a81159A51756a3964C08934c1956B65010b2382
$$ 79152 92804 -163565 162190 -181159 151756 -13964 308934 -31956 265010 -22382
11585D01555A54500K92758a8235B70698p2807B1634K75207E1728b2856j60932
$$ 401555 154500 447258 -18235 270698 197891 21634 296841 51728 -22856 -183788
11575a83788A28542M2266a76593f5154G4906L7143K34301b20096C49790a20203
$$ -183788 128542 170808 -176593 -65154 74906 112049 346350 -220096 349790 -120203
11564D1017K28619C9798L56960C0206g49G2709K06528K4614q0756j09382q440
$$ 41017 269636 39798 396758 30206 -749 72709 279237 303851 223095 113713 105273
11553A05273R8215a98637I0476k0491c89500C0J25522J00399a60943A12680M5766
$$ 105273 203488 -198637 90476 69985 -389500 30 125552 225951 -160943 112680 158446
11542A58446a52948b3855p3643k560E06076j74909D3629c82713C17100o6162O3069
$$ 158446 -152948 -23855 -97498 -100058 506076 331167 43629 -382713 317100 250938 314007
11531C14007K4096c78806b9584D6918B609L2242J91182c29109B7467K14375i985
$$ 314007 338103 -378806 -29584 46918 2609 34851 226033 -329109 27467 241842 -9985
11519b9827C03890m2876a11170E2518J04593a50617B21750d037G026P260Q9999
$$ -29827 303890 261014 -111170 52518 157111 -150617 221750 -4037 7026 14286 104285
11508A04285l3136h6655A64803c24747C14656j24570j3979b04795C38784M122
$$ 104285 71149 -86655 164803 -324747 314656 190086 176107 -204795 338784 342906
11498C42906j33984q8093E0152a57257C62856j80547M6045A08834J0465a00333
$$ 342906 208922 120829 50152 -157257 362856 182309 228354 108834 119299 -100333
11487B87597A386J18347J04470l1048K3778K36723B23044M2674O9290b0249B46054
$$ 287597 1386 119733 224203 193155 216933 453656 223044 265718 335008 -20249 246054
11475B13801q2884P599E7898J13627K0715J58067j16318P2923k4735j17968M6739
$$ 213801 130917 138516 57898 171525 192240 350307 233989 306912 282177 164209 210948
11464B10948m6508K68225l2078H2076c077B09302L6896A1403O7847R2578l6634
$$ 210948 164440 432665 400587 82076 -3077 209302 246198 11403 79250 171828 135194
11453A35194K50150A09796B0764J46571a63643g8676B29262E3970R2810b3944
$$ 135194 385344 109796 20764 167335 -163643 -78676 229262 53970 146780 -23944
11442B15040d1379C6847d4953A79138a08966m2910L0724e1082o9628e2369j37087
$$ 215040 -41379 36847 -44953 179138 -108966 -151876 -121152 -51082 -120710 -52369 -189456
11431a89456e5712I630N2676h5141B66417c2297l27662e1528B59110a4848p6099
$$ -189456 -55712 9630 62306 -85141 266417 -32297 -359959 -51528 259110 -14848 -90947
11420i0947A76979f3233b3937j49507B19156e8924A42392D1343J12609Q0719r353
$$ -90947 176979 -63233 -23937 -173444 219156 -58924 142392 41343 153952 234671 225318
11409B25318h5101C37213I1554J68078I0793N2189L90488A57857l5471L09032
$$ 225318 -85101 337213 91554 259632 90793 142982 533470 157857 122386 431418
11399D31418A61554L7591g5623o1312a5190k08934C3832b05036Q051e4559n2941
$$ 431418 161554 199145 -75623 -136935 -15190 -224124 33832 -205036 -196985 -54559 -107500
11388a07500j06072B77128g4805B46703b8980P45A5046O804N2619a82636E0022
$$ -107500 -213572 277128 -74805 246703 -28980 -28235 15046 21850 74469 -182636 50022
11376a41578B45823k8918a00111i488A02530D4995a03797a3180k01218Q2873B79183
$$ -141578 245823 216905 -100111 -9488 102530 44995 -103797 -13180 -214398 -131525 279183
11364f7040F2073a07139A10853c35477A4670b48750a05548H0332J7872b5827k56146
$$ -67040 62073 -107139 110853 -335477 14670 -248750 -105548 80332 98204 -25827 -281973
11353b81973A93463m8475J58732A14127n2404A6015O2149m343B902K08a17587
$$ -281973 193463 144988 303720 114127 61723 16015 78164 73821 2902 3110 -117587
11341b5982B14364i2023A27459f1580j07974f1527F6086d3820A06884l1191c3823
$$ -25982 214364 -92023 127459 -61580 -169554 -61527 66086 -43820 106884 75693 -33823
11329b89183a01901k09427A06757b88235a13619C24809A7014Q3287N1114C6859
$$ -289183 -101901 -311328 106757 -288235 -113619 324809 17014 100301 151415 36859
11318f7744j54691B660a67211q1134a9264p0610e130p7241A3820a78655C1309
$$ -67744 -222435 2660 -167211 -248345 -19264 -89874 -5130 -82371 13820 -178655 31309
11306B12300b24290A68331a28966H8772c63633F7040K42748G5815a8075B3658
$$ 212300 -224290 168331 -128966 88772 -363633 67040 309788 75815 -18075 23658
11295C84224a37026A534K3753J10497F3298a0438D8306a45802A43165J883G226
$$ 384224 -137026 1534 25287 135784 63298 -10438 48306 -145802 143165 145048 7226
11283B2830b76770Q5620k14045C73736a44896j38494R5327M9565M763A52412O1109
$$ 22830 -276770 -191150 -405195 373736 -144896 -283390 -188063 -138498 -133735 152412 213521
11272B13521H1033L39961d9637j7934k80605B65233b6537A32663A2986d68318
$$ 213521 81033 420994 -49637 -67571 -348176 265233 -26537 132663 12986 -468318
11261a07617A91081a87956b7296k808C5202a29222j26094G8748m042c37612J03048
$$ -107617 191081 -187956 -27296 -30104 35202 -129222 -255316 78748 74706 -337612 -234564
11250b34564B32758a51995j00092A72627C7532K42378E5145b5476k16335I0623
$$ -234564 232758 -151995 -252087 172627 37532 279910 55145 -25476 -241811 90623
11239b92566H6197k0596a90157q8343A96273b12970J8974n893c5472A99874C9816
$$ -292566 86197 65601 -190157 -278500 196273 -212970 -193996 -199889 -35472 199874 39816
11227e931H4384c05948A13741a00847A17711B3204a75492C19196E3390M4509F143
$$ -5931 84384 -305948 113741 -100847 117711 23204 -175492 319196 53390 97899 6143
11215A33214b1803k90616j0824R9134D19174a46379a3682j95660A4106C959a65043
$$ 133214 -21803 -312419 -323243 -224109 419174 -146379 -13682 -209342 14106 3959 -165043
11203A88325b72953R140Q6233E9468J03153N0373g6434B47286a55950A46499m8946
$$ 188325 -272953 -263813 -177580 59468 162621 212994 -76434 247286 -155950 146499 97553
11192I7553b9686A13086h8074A81075i3342L0903L818j30702B24274n9227a47047
$$ 97553 -29686 113086 -88074 181075 -93342 -62439 -58621 -189323 224274 165047 -147047
11180b46149D5657a6056d871j66379A36800c3455l9942p3078O6804C73176i7255
$$ -246149 45657 -16056 -4871 -171250 136800 -33455 -73397 -146475 -79671 373176 -97255
11168g5317j067J3819a1363E5854b8374A14784m8974C2028c7755j92454L8260
$$ -75317 -76384 -62565 -11363 55854 -28374 114784 65810 32028 -37755 -230209 -191949
11157a91949I1411b20670A35381m4707c35658h5898A14621C6476O1526f0895j3006
$$ -191949 91411 -220670 135381 90674 -335658 -85898 114621 36476 98002 -60895 -73901
11146g3901B23737a96168d035A40910b52917N5941k9563A30960a53038A75752
$$ -73901 223737 -196168 -4035 140910 -252917 -196976 -226539 130960 -153038 175752
11135B94180C298M732f0306j14687a160j37353A19061d6988A55194k6134L71116
$$ 294180 3298 8030 -60306 -174993 -1160 -138513 119061 -46988 155194 129060 500176
11124E00176H0345J37629F5614L4485L3719K5689l7450F0465B9963a3877K972
$$ 500176 80345 217974 65614 100099 133818 159507 122057 60465 29963 -13877 -10905
11113a0905G3713K06847K5392A12903l3566f8527A79197E6708p54L85106j76438
$$ -10905 73713 280560 305952 112903 79337 -68527 179197 56708 55954 441060 264622
11102B64622g2704K3934n9185H272K97120H4967K1215K04328L3454j59128h4989
$$ 264622 -72704 -48770 -107955 8272 305392 84967 106182 310510 343964 184836 -84989
11090D26893d017p2452d303C08071g4141E41400B7063r835M11072r1461J02362
$$ 426893 -4017 -76469 -4303 308071 -74141 541400 27063 17228 428300 336839 439201
11079D39201L6035I598M69306k16042C4811K3433K65131r7050O21172k32538j96746
$$ 439201 475236 9598 478904 262862 34811 58244 323375 226325 847497 614959 418213
11068D18213q7367K90334j72501J16091K22067k71570q5066L9849k6878P9530
$$ 418213 330846 621180 448679 564770 786837 515267 430201 470050 443172 522702
11058E22702k16875O34479k9978l9039J2541l10892N8106j53127K81102L79914
$$ 522702 305827 940306 910328 871289 883830 572938 631044 477917 759019 1138933
11048A138933E15064M16038k9677J54280k71961k075j51664O678C17110M28974
$$ 1138933 515064 931102 901425 1055705 783744 781669 630005 636683 317110 746084
11038G46084N9215l32782J43448M04940l71424o4973J23979k20186N87014l15847
$$ 746084 805299 472517 615965 1020905 649481 584508 708487 488301 1075315 759468
11028G59468j90950K94701j87514K91608l92263L06925D35011M93716k07282K2188
$$ 759468 568518 863219 675705 967313 575050 881975 435011 928727 721445 743633
11018G43633j88875K35336J36883k52613j33751M23014k36753J08514k67923J95588
$$ 743633 554758 790094 926977 674364 540613 963627 726874 835388 567465 763053
11008G63053p5937J08818l56395K85997C45792N83121j45267J52439j28401j07012
$$ 763053 687116 795934 439539 725536 345792 928913 783646 936085 807684 700672
10998G00672J14531l94778L10267l4616J49429J49257k99828N15179E34210K59603
$$ 700672 815203 420425 730692 696076 845505 994762 694934 1210113 534210 793813
10988G93813L5499K27817O1075j39562J97554J1688K10075j65911K55398J73296
$$ 793813 829312 1057129 1118204 978642 1176196 1187884 1397959 1232048 1487446 1660742
10978A660742J68003J29901J72117Q4428M12461L49758k55213N42921m08281k08704
$$ 1660742 1828745 1958646 2130763 2215191 2627652 2977410 2722197 3265118 2856837 2648133
10968B648133O7438n02474j23602q0602l41994J68270p4731K75169m07385L35263
$$ 2648133 2715571 2213097 2089495 2008893 1666899 1835169 1760438 2035607 1628222 1963485
10958A963485M4059j75502M8991m2566k38559m63029n7215j00684L1812l61888
$$ 1963485 2007544 1832042 1881033 1838467 1599908 1136879 1079664 978980 1010792 648904
10948F48904k27572J60049k59760L21606B69108K25457B25619a636C54340A72784
$$ 648904 421332 581381 321621 643227 269108 494565 225619 -1636 354340 172784
10937C22941r2983M9912J45420a74826h0734L9116B90629h2481A52286E4661a40807
$$ 322941 229958 279870 425290 -174826 -80734 -41618 290629 -82481 152286 54661 -140807
10925a22841j78660d2133J5584D17812a19391B31363B6494i0181A63217b93553
$$ -122841 -301501 -42133 -26549 417812 -119391 231363 26494 -90181 163217 -293553
10914B15033A6518a38017a6152A23815a14853C86447A62975D1254a1163A85630
$$ 215033 16518 -138017 -16152 123815 -114853 386447 162975 41254 -11163 185630
10903b45336o5308A22517k0427J22353c78457A85712B4659f4681j91097P3541
$$ -245336 -310644 122517 102090 224443 -378457 185712 24659 -64681 -255778 -182237
10893a82237F2760c13571B18572l9870K86698d7307D5647d2546B5440i2287L8024
$$ -182237 62760 -313571 218572 178702 465400 -47307 45647 -42546 25440 -92287 -54263
10882e4263n8471E0155Q0874m153J07786i5988C727b13848h3128p1786f1776j20046
$$ -54263 -112734 50155 131029 126876 234662 -95988 3727 -213848 -83128 -154914 -61776 -181822
10870a81822i513o2112D07483b11046A94498c96130A77358h5280N6G4966k328
$$ -181822 -9513 -71625 407483 -211046 194498 -396130 177358 -85280 -85224 74966 72638
10859G2638g4296B43750c0974A30564D4708b03576b8883j31721b2845B9332a04573
$$ 72638 -74296 243750 -30974 130564 44708 -203576 -28883 -160604 -22845 29332 -104573
10847a32170n7431B01805b80329A85390b9048k44076A05468e5599B03348a98678
$$ -132170 -189601 201805 -280329 185390 -29048 -273124 105468 -55599 203348 -198678
10836a63807Q0836M426K8806j00609F4547P8969a08642J2396j6478L8273C59519
$$ -163807 -82971 -78545 -49739 -150348 64547 143516 -108642 -96246 -112724 -74451 359519
10824a04417c0982j77803J9574E2672b15109B15788G8188a13238R387A40062c4122
$$ -104417 -30982 -208785 -189211 52672 -215109 215788 78188 -113238 -103851 140062 -34122
10812e3950k45416F6300a34390A65736C1120b4617q9692B5914b3414j37289P4403
$$ -53950 -299366 66300 -134390 165736 31120 -24617 -114309 25914 -23414 -160703 -86300
10801h6300K2064q7215E8511P3164d11615A93192c1482o9038j47296j1701A44109
$$ -86300 -64236 -151451 58511 131675 -411615 193192 -31482 -100520 -247816 -259517 144109
10789C86102G8128B7664J56467b77231e806l15026H120J26263g9074j25833a7345
$$ 386102 78128 27664 184131 -277231 -5806 -320832 8120 134383 -79074 -204907 -17345
10777B48499H7304M8582D7344b62891H5291p336a6676A18410R4486A00110J84360
$$ 248499 87304 135886 47344 -262891 85291 77955 -16676 118410 212896 100110 284470
10766B84470C0722K00097b15615B01972b0207A89984a07698A35274b7842F5458
$$ 284470 30722 230819 -215615 201972 -20207 189984 -107698 135274 -27842 65458
10755c55076d8285o8992M0196D9351a24483B00141d10861A73337N116a81903d1553
$$ -355076 -48285 -117277 -77081 49351 -124483 200141 -410861 173337 178453 -181903 -41553
10743c13454c7418d083j9155j82794B54666F5606a84665J1966j1761A139K21561
$$ -313454 -37418 -4083 -23238 -206032 254666 65606 -184665 -172699 -184460 1139 222700
10732B22700d37912A6620K02217i7774C5730A3557h0648j20315I5547J59522b94470
$$ 222700 -437912 16620 218837 -97774 35730 13557 -80648 -200963 95547 255069 -294470
10720A43267i1969q8805k0217g8976l7064j41527P2228n7178B17280d70380b07104
$$ 143267 -91969 -180774 -200991 -78976 -116040 -257567 -185339 -242517 217280 -470380 -207104
10708a24700C7307h2024c6553k12776B23768c4484Q611j86472G1412f3986A19744
$$ -124700 37307 -82024 -36553 -249329 223768 -34484 -25873 -212345 71412 -63986 119744
10696b13103A56500d2665k55859i129C4285J69084E1766L2497j8473L4317a08438
$$ -213103 156500 -42665 -298524 -9129 34285 203369 51766 84263 65790 100107 -108438
10684B08129b38786A28983L2332o3880e0731n3768a4268j95710C18427e7594j37649
$$ 208129 -238786 128983 161315 97435 -50731 -104499 -14268 -209978 318427 -57594 -195243
10673a95243B9059J01969b18768N5155B28751J37779h7527m7286l5719A54187
$$ -195243 29059 131028 -218768 -163613 228751 366530 -87527 -134813 -170532 154187
10662A21927a07373F1950J01387a9835A09182b9458I7768d7730Q522o3097p6403
$$ 121927 -107373 61950 163337 -19835 109182 -29458 97768 -47730 -39208 -102305 -178708
10651a78708A9412b84066g1501j36446j51546F0638j6415a31487B12994h7893
$$ -178708 19412 -284066 -71501 -207947 -359493 60638 44223 -131487 212994 -87893
10640e5156J0294j27791C89060B4526a67029J9546K9735M8355k248B84890C0389
$$ -55156 -44862 -172653 389060 24526 -167029 -147483 -117748 -69393 -71641 284890 30389
10628H9169b38098A51341b72386E4536K8581f158l32668J07174c0186j3232j05344
$$ 89169 -238098 151341 -272386 54536 83117 -6158 -338826 -231652 -30186 -43418 -148762
10617a48762B5208P2298b34111J02565j94774M8958R3168c2844j7516E5229J16682
$$ -148762 25208 97506 -234111 -131546 -326320 -277362 -184194 -32844 -50360 55229 171911
10606A71911m9825f7945j1041J6707A6786a7007D1516e711l28135a50394B52380
$$ 171911 122086 -67945 -78986 -62279 16786 -17007 41516 -5711 -333846 -150394 252380
10594a4929l25031c6678l13437i9251J5087A45916J65059d1878j5890j62235B99236
$$ -14929 -339960 -36678 -350115 -99251 -84164 145916 310975 -41878 -57768 -220003 299236
10582a92184p8587A31796O5334a935k23198I725a99777r9889E5112J08459a13725
$$ -192184 -270771 131796 197130 -1935 -225133 9725 -199777 -299666 55112 163571 -113725
10570A06995a59949C5406J82660q5491C6593J40626p8201d2841A66963c61230
$$ 106995 -159949 35406 218066 132575 36593 177219 99018 -42841 166963 -361230
10559c0122G7217a07246B42612b11242j7953f372A44526A7070L97400j06161A9705
$$ -30122 77217 -107246 242612 -211242 -229195 -6372 144526 17070 414470 308309 19705
10547a12990A6359K32735J0211a11303j0397I1729M8966b51702f5301A43177a48772
$$ -112990 16359 249094 259305 -111303 -121700 91729 140695 -251702 -65301 143177 -148772
10535D5699J61487i6686A23130D4979c28887C11987b02371A50908c18166A83364
$$ 45699 207186 -96686 123130 44979 -328887 311987 -202371 150908 -318166 183364
10524H4813N2354E2270O4293a84026j03998f0648H3291L72629h5434l88739d4390
$$ 84813 137167 52270 116563 -184026 -288024 -60648 83291 455920 -85434 -474173 -44390
10512a52669A22728d6525j35501B71005e8843A95786a97190e6485A83896b8602
$$ -152669 122728 -46525 -182026 271005 -58843 195786 -197190 -56485 183896 -28602
10501B11633o0457g9868A09928J29868q8787b3262o2700A28190E244i9846o6262
$$ 211633 151176 -79868 109928 239796 151009 -23262 -85962 128190 5244 -99846 -166108
10490a66108f9574j5216G4998P5797d0488A2051L57417A65952A1823O34378k12345
$$ -166108 -69574 -84790 74998 150795 -40488 12051 369468 165952 11823 646201 433856
10479D33856q0346o7950F7768b30105A31710h7709B1247b98877H7194l9981Q9405
$$ 433856 353510 285560 67768 -230105 131710 -87709 21247 -298877 87194 47213 136618
10468A36618J44228A26455A6908R2297a07154b9954j78525M5180k8248j1231G2853
$$ 136618 280846 126455 16908 109205 -107154 -29954 -208479 -163299 -191547 -202778 72853
10456a3959A43075j8429i1303A95574K1132g0560B95988q8038i5432j20248O6954
$$ -13959 143075 124646 -91303 195574 216706 -70560 295988 207950 -95432 -215680 -148726
10445a48726g1331l5737c7859j68589A40842a68126C3267a3079C48767b73052
$$ -148726 -71331 -107068 -37859 -206448 140842 -168126 33267 -13079 348767 -273052
10434F5496a14100A59506J34630C3227n874N9790Q0985p3394B8842b84736A84437
$$ 65496 -114100 159506 294136 33227 27353 87143 168128 94734 28842 -284736 184437
10422b06505d3185J0936j07096B7891c116D72163b14155J01746a0842j16346A78821
$$ -206505 -43185 -32249 -139345 27891 -3116 472163 -214155 -112409 -10842 -127188 178821
10410b81641a39703a6673B1625a42219M9517b8127B01677l2312J0878q1560a93379
$$ -281641 -139703 -16673 21625 -142219 -92702 -28127 201677 169365 180243 98683 -193379
10398A41183N7742Q5142J11573F2175b854A47285e1458C42901R5003k3893g3766
$$ 141183 198925 284067 395640 62175 -2854 147285 -51458 342901 437904 414011 -73766
10386B6544J35921J09865l6749J08228K57324k46561M4096e3173A90586i8715
$$ 26544 162465 272330 235581 343809 601133 354572 398668 -53173 190586 -98715
10375h6752C21475O8913m4710b28192C3251J22809K85415J61012j59743j16919
$$ -86752 321475 390388 345678 -228192 33251 156060 441475 602487 442744 325825
10365C25825J08063P6203o2161p1440j46627L5759a35370F1390J3623b88483C74217
$$ 325825 433888 510091 447930 376490 229863 265622 -135370 61390 75013 -288483 374217
10353A82715J96053j7169j1550K53572k14589r1575J72623D0185J06422L52274
$$ 182715 378768 361599 350049 603621 389032 297457 470080 40185 146607 498881
10343D98881r4569r7353A07604J16046A11422J24521E3603J5297J38560a23037
$$ 498881 404312 306959 107604 223650 111422 235943 53603 68900 207460 -123037
10332C09287b05251d4861D4638A7204d9808A03040h6049Q365E45782r9039G0380
$$ 309287 -205251 -44861 44638 17204 -49808 103040 -86049 -77684 545782 446743 70380
10320B33295K48621B3881J55336k1690i4465C19925F0898a260p4505j27121c4176
$$ 233295 481916 23881 179217 157527 -94465 319925 60898 -1260 -75765 -202886 -34176
10308G8633A122a60564A33746g6134J8076I3004d66602D29708h9439F050J36975
$$ 78633 1122 -160564 133746 -76134 -58058 93004 -466602 429708 -89439 6050 143025
10297A43025J00834g3665j08004A32143O3037D7623i9659M9067D2374j4279a8440
$$ 143025 243859 -73665 -181669 132143 195180 47623 -99659 -50592 42374 28095 -18440
10285A2709M7386Q1466b48204J19164A21952d02098a70814j2714A43280B8790
$$ 12709 60095 141561 -248204 -129040 121952 -402098 -170814 -183528 143280 28790
10274i9404A89704K35015g488B90398b04984C14621D047J1258i7337B9079K77268
$$ -99404 189704 424719 -7488 290398 -204984 314621 4047 15305 -97337 29079 306347
10263C06347a02921D83305B37166I8623J18470K66560D614a0429n7120j10B15533
$$ 306347 -102921 483305 237166 98623 217093 483653 4614 -10429 -67549 -67659 215533
10251e2600j37614G6891l0473k3179a87694g3283r3283q461A02919c51297h0244
$$ -52600 -190214 76891 46418 23239 -187694 -73283 -166566 -175027 102919 -351297 -80244
10239F7829K20880a01603o8554B178j28a70244O3296A65737a61549H49K05931
$$ 67829 288709 -101603 -170157 2178 2050 -170244 -106948 165737 -161549 849 206780
10228B06780b19192l10653E3002a28295A39391a98929A3185J53092c0026D188
$$ 206780 -219192 -529845 53002 -128295 139391 -198929 13185 166277 -30026 4188
10217E6279i0949l57n9590A35526N772b90235A70575b18409A07914c67613a58507
$$ 56279 -90949 -91306 -150896 135526 141298 -290235 170575 -218409 107914 -367613 -158507
10205a147q7744p1643j21113c473A16746b54506J17702e4746A08465g4934A27991
$$ -1147 -88891 -160534 -281647 -3473 116746 -254506 -136804 -54746 108465 -74934 127991
10193f165l992j07323k178l9839O8817K6369B93596r8070G166L0170K26784e69653
$$ -6165 -10157 -117480 -119658 -159497 -90680 -64311 293596 195526 7166 37336 264120 -569653
10180B04424l8212a21468E5595a36682C27917G5923g1517k34501B2863f8790b1914
$$ 204424 166212 -121468 55595 -136682 327917 75923 -71517 -306018 22863 -68790 -21914
10168b31897d5262j05975F8432K91638i3960A5034c10670a13319k2904A01221
$$ -231897 -45262 -151237 68432 360070 -93960 15034 -310670 -113319 -136223 101221
10157a14942F179b3302B4699J59304a810A27750a01101C15185g6734j98896A0266
$$ -114942 6179 -23302 24699 184003 -1810 127750 -101101 315185 -76734 -275630 10266
10145a15153A01487a70208A39481a16948G7938a5480q0899A84366c9725O117j63667
$$ -115153 101487 -170208 139481 -116948 77938 -15480 -96379 184366 -39725 -33608 -197275
10134a97275d4927A51174G4299b03826A52981a31346C18095a42677k21640J56012
$$ -197275 -44927 151174 74299 -203826 152981 -131346 318095 -142677 -364317 -208305
10124b08305d1217k44917C5417a03322j03027f9482k6135M6113A19068b7928m0164
$$ -208305 -41217 -286134 35417 -103322 -206349 -69482 -95617 -49504 119068 -27928 -68092
10113f8092j87116a3521j37404o7292A74213C3115b64846h4176D5496d0235C20738
$$ -68092 -255208 -13521 -150925 -218217 174213 33115 -264846 -84176 45496 -40235 320738
10101e7739F4424a14457A01332i6250b795j87456g6988c6982E16686a4494k3296
$$ -57739 64424 -114457 101332 -96250 -2795 -190251 -76988 -36982 516686 -14494 -37790
10090c7790A40784E9198M4836G279a2002q3908B62521a18624k8879j2962D4988
$$ -37790 140784 59198 104034 7279 -12002 -95910 262521 -118624 -147503 -160465 44988
10078A2656a59731C7948b68480e5031b2211C2197e3402A25873j1620a18661c3860
$$ 12656 -159731 37948 -268480 -55031 -22211 32197 -53402 125873 114253 -118661 -33860
10066c46565A8431J33682a63897R627N8681a3754k27797A38235B1505i6281e494
$$ -346565 18431 152113 -163897 -154270 -95589 -13754 -241551 138235 21505 -96281 -5494
10054A8709g0035G8513p396g5329A27007b0329C23954a98420j34353J44137Q692
$$ 18709 -70035 78513 71117 -75329 127007 -20329 323954 -198420 -332773 -188636 -179944
10043a79944Q9826B52718b61168J16981D5031b92032h8011k55814a962j47461
$$ -179944 -90118 252718 -261168 -144187 45031 -292032 -88011 -343825 -1962 -149423
10033a49423P521a7803G2429c25620h1982i985j24039n8230j14587a02364j98657
$$ -149423 -141902 -17803 72429 -325620 -81982 -9985 -134024 -192254 -306841 -102364 -301021
10022c01021I4486h723m01811E9197b62173J09478a1692p5286k66041N7535F71
$$ -301021 94486 -8723 -410534 59197 -262173 -152695 -11692 -86978 -353019 -295484 671
10010b50385B20553a50494L807i482G7179a51518e9220K4797n7067d1848i460
$$ -250385 220553 -150494 -146687 -9482 77179 -151518 -59220 -34423 -91490 -41848 -9460
9998b51157g7785K3112j63517d5428k13049F8716d0921a7949H0168c17733a39333
$$ -251157 -77785 -54673 -218190 -45428 -258477 68716 -40921 -17949 80168 -317733 -139333
9986b79266e4251j25681k45812g6449a7461j99764F7495c02000P9262g1232j75262
$$ -279266 -54251 -179932 -425744 -76449 -17461 -217225 67495 -302000 -222738 -71232 -246494
9975b46494g8889H3411j5146R1733c19750a51374j48552g6835D2461b21796j92657
$$ -246494 -78889 83411 68265 159998 -319750 -151374 -299926 -76835 42461 -221796 -414453
9964d14453f5079q7677O6940a9576j65786A18831a44213r293j9154B14899a99420
$$ -414453 -65079 -152756 -85816 -19576 -185362 118831 -144213 -153506 -172660 214899 -199420
9952D52249b97D3714K55436e8180r5403j7502j76188I6275e6494A10308d2970
$$ 452249 -297 43714 299150 -58180 -153583 -171085 -347273 96275 -56494 110308 -42970
9940e62193D1166J34522e7214j46G0112b72999C68000b00596F9416b42919P9396
$$ -562193 41166 175688 -57214 -57360 70112 -272999 368000 -200596 69416 -242919 -163523
9929a63523B2934c7648A85663g1681C32211D7307f4681C5747b53527a8565B66792
$$ -163523 22934 -37648 185663 -71681 332211 47307 -64681 35747 -253527 -18565 266792
9917e58014C1073b10090h8755B8871b08346f3142B26905c3560D7602k3398g78
$$ -558014 31073 -210090 -88755 28871 -208346 -63142 226905 -33560 47602 24204 -778
9905e0162j36560O2163j32965R6279D5635a34262G1242c1793m7430B2233c40388
$$ -50162 -186722 -124559 -257524 -161245 45635 -134262 71242 -31793 -79223 22233 -340388
9893c4143G838N1454j4429K2253b39286G3823L262J42994a3939k63851i1335q5922
$$ -34143 7838 59292 44863 67116 -239286 73823 77085 220079 -13939 -277790 -91335 -177257
9881a77257G7782J05048J08932A4249b5186j02539K1287K2203K0659b0328I3707
$$ -177257 77782 182830 291762 14249 -25186 -127725 -106438 -84235 -63576 -20328 93707
9869B3087b35588A9512c45727F7999A2490L61427a88313O122c4736p467j11608
$$ 23087 -235588 19512 -345727 67999 12490 373917 -188313 -182191 -34736 -42203 -153811
9858a53811L2332p2936C45661c59800E2757J1544a41821j33359J27585l8403A4183
$$ -153811 -121479 -194415 345661 -359800 52757 64301 -141821 -275180 -147595 -185998 14183
9846C89823a34885L5663k03379J23364B7886d01579J87869A6006b9510j92334
$$ 389823 -134885 -99222 -302601 -179237 27886 -401579 -213710 16006 -29510 -221844
9836b21844o0658a07257B6870b7137D03681g9268I6264D3834b8454l4111A72689
$$ -221844 -282502 -107257 26870 -27137 403681 -79268 96264 43834 -28454 -62565 172689
9824A08513N3559g0806C099a6855q8882A71638a17880l34089a08788A91137c0473
$$ 108513 162072 -70806 3099 -16855 -105737 171638 -117880 -451969 -108788 191137 -30473
9812a82910A8450a21573q8672o3896b6863j69718o7325b4924A8194A734d3178
$$ -182910 18450 -121573 -210245 -274141 -26863 -196581 -263906 -24924 18194 1734 -43178
9800A0083L045b62734I1110c51611C08596b03930H1104N8725b67226b2000m4992
$$ 10083 13128 -262734 91110 -351611 308596 -203930 81104 139829 -267226 -22000 -66992
9789f6992k0568r1949j08217B671i5480H6280c9383k5899F8321b30007H6989a7017
$$ -66992 -87560 -179509 -287726 2671 -95480 86280 -39383 -65282 68321 -230007 86989 -17017
9776A85597d9824j21137A28969j5914a34685d6480F9517f2291n0748A38742l6600
$$ 185597 -49824 -170961 128969 113055 -134685 -46480 69517 -62291 -113039 138742 102142
9765A02142L02240f6488C6972c94018a23190A12173h1373A79009c43244A75859
$$ 102142 404382 -66488 36972 -394018 -123190 112173 -81373 179009 -343244 175859
9754d679k87828B02569P0779e6286m7143F8586a47156j04448Q2379r3721A821
$$ -4679 -292507 202569 273348 -56286 -103429 68586 -147156 -251604 -169225 -262946 1821
9742f6181j2941R629j56836N1999I7382c13066J31369c7725j00069D54239b8282
$$ -66181 -79122 -69493 -226329 -174330 97382 -313066 -181697 -37725 -137794 454239 -28282
9730c5476J2824A91919C6919P1943c1003j57421j46519p304a20129J2559C23849
$$ -35476 -22652 191919 36919 108862 -31003 -188424 -334943 -342247 -120129 -107570 323849
9718B8509g4076J5587B59285a2651B46731d1380k01864A0693a12925j09252e9440
$$ 28509 -74076 -58489 259285 -12651 246731 -41380 -243244 10693 -112925 -222177 -59440
9706A56640l3513g4696H6757K14174j31899a4003F1407d9722o6079A09121l1988
$$ 156640 123127 -74696 86757 300931 169032 -14003 61407 -49722 -115801 109121 77133
9695G7133b23365d3107B03058m0404a29907K9044k12121a34874H3508a13255A810
$$ 77133 -223365 -43107 203058 162654 -129907 -100863 -312984 -134874 83508 -113255 1810
9683A49082b1666j88888j21860H4231b26723G9276a849l2112H4873a43615N0429
$$ 149082 -21666 -210554 -332414 84231 -226723 79276 -1849 -33961 84873 -143615 -93186
9672i3186k29259a1355k11052i2838L5138l61448O4858a08590D3022a4989j99212
$$ -93186 -322445 -11355 -222407 -92838 -57700 -419148 -354290 -108590 43022 -14989 -214201
9661b14201f258k41760E3685g3400B6956b97433J32837g9266k2393B36345k7973
$$ -214201 -6258 -248018 53685 -73400 26956 -297433 -164596 -79266 -101659 236345 208372
9650B08372a40987J0603j53775H684c8594k4798A40775b32798C84248f372A25794
$$ 208372 -140987 -130384 -284159 8684 -38594 -63392 140775 -232798 384248 -6372 125794
9638h5435I1133h6068k69832B16157G609b25469K0349a4861m13126D5575A4619
$$ -85435 91133 -86068 -355900 216157 7609 -225469 -205120 -14861 -427987 45575 14619
9626i6306J0701I5502m7526b10764p9886B1546a35751c1217E9692a82252A12874
$$ -96306 -85605 95502 47976 -210764 -290650 21546 -135751 -31217 59692 -182252 112874
9614b15772A75295g0593k23477e2801I1407A2160R5664c8039j05316C47554b26362
$$ -215772 175295 -70593 -294070 -52801 91407 12160 107824 -38039 -143355 347554 -226362
9602d2384A33081a49451j0126B66465c44083c2615o4441b6422j03149k21913a50127
$$ -42384 133081 -149451 -159577 266465 -344083 -32615 -97056 -26422 -129571 -351484 -150127
9590c4314b314A12725k2872c13985a9423j32385I8098e6596F7626L8755h5596
$$ -34314 -2314 112725 89853 -313985 -19423 -151808 98098 -56596 67626 106381 -85596
9578B6778a95870L1505A626i7490M4263I695a30600B31929f9070G9623b30080
$$ 26778 -195870 -164365 1626 -97490 -53227 9695 -130600 231929 -69070 79623 -230080
9566a41553B44119a49228H2903i0001C5755O5801J23186b3503m0647C923a56702
$$ -141553 244119 -149228 82903 -90001 35755 101556 224742 -23503 -64150 3923 -156702
9554b52434b3914j06378P214j15289N2390J6059J7604B18930a83704J8152L6076
$$ -252434 -23914 -130292 -123078 -238367 -185977 -169918 -152314 218930 -183704 -165552 -129476
9543a29476j23917K8585A29932i0244n4782b8347C8741f7553a9600A15846N3783
$$ -129476 -253393 -224808 129932 -90244 -145026 -28347 38741 -67553 -19600 115846 169629
9532A69629e1045k00096a11671C05192A28533e2451D6715e1229l60643a02595
$$ 169629 -51045 -251141 -111671 305192 128533 -52451 46715 -51229 -411872 -102595
9521b87080d2236C5324Q8081b16636a01232B1292L1408e75142A53067b3580A72608
$$ -287080 -42236 35324 123405 -216636 -101232 21292 52700 -575142 153067 -23580 172608
9509A35459a21621m7409e4856r4088O5116d0279q1217A50890J00314E538a92153
$$ 135459 -121621 -169030 -54856 -148944 -83828 -40279 -121496 150890 251204 5538 -192153
9497c01364i664A1465f3994A21319d36266A39595O2774K07495b48267j2746B61270
$$ -301364 -9664 11465 -63994 121319 -436266 139595 202369 409864 -248267 -261013 261270
9485A26080a50886e3577a847k45683B56065e8819B88651e6377E8594J94541j23825
$$ 126080 -150886 -53577 -1847 -247530 256065 -58819 288651 -56377 58594 253135 129310
9474A29310a91366M7460l75j10233A64281c2371b049m15021h9980C86594a45429
$$ 129310 -191366 -143906 -144281 -254514 164281 -32371 -2049 -417070 -89980 386594 -145429
9462b76145k54774G7788f3383B31134a59662J7160j76820Q0370E4423J42039A4249
$$ -276145 -530919 77788 -63383 231134 -159662 -142502 -319322 -238952 54423 196462 14249
9450G6176a81726k0128A33992D034e8814l9279M740j16650m7277G6544b63357
$$ 76176 -181726 -201854 133992 4034 -58814 -98093 -93353 -210003 -257280 76544 -263357
9438c87698A2007c09770R0117c6143j46631B7153k054J84031a84687l7599A74294
$$ -387698 12007 -309770 -219653 -36143 -182774 27153 25099 209130 -184687 -222286 174294
9426a66653B43548a5606m8729k08104D04264b418j91927L689Q0364D02605j88828
$$ -166653 243548 -15606 -64335 -272439 404264 -2418 -194345 -190656 -110292 402605 213777
9415B13777o9701d88684a3126B83688A20706b74354A33009d58561A03849a31544
$$ 213777 144076 -488684 -13126 283688 120706 -274354 133009 -458561 103849 -131544
9404c89529a51477A32316n9084c68670a37771L7837B01128d07333D5563b35817
$$ -389529 -151477 132316 73232 -368670 -137771 -99934 201128 -407333 45563 -235817
9393C51411A00266a00230B31886a98110A78845a91563k91974K18841A082h9795
$$ 351411 100266 -100230 231886 -198110 178845 -191563 -483537 -264696 1082 -89795
9382F5274a14245j17131O5774r1429J1052j4506B14993F6825a61310c0655n29178
$$ 65274 -114245 -231376 -165602 -257031 -245979 -260485 214993 66825 -161310 -30655 -559833
9371e59833c0257q6690o9448b9937j63198d8996C16395A881d983r6239B75920
$$ -559833 -30257 -116947 -186395 -29937 -193135 -48996 316395 1881 -4983 -101222 275920
9359h3846k3173j23232l881a11916l862j99585B90088a38182K2594j55122a03753
$$ -83846 -107019 -230251 -234132 -111916 -115778 -315363 290088 -138182 -115588 -270710 -103753
9347B5142a34956j29880I9977J0784f741A14237a38922l1858A43478d4477B7255
$$ 25142 -134956 -264836 99977 110761 -6741 114237 -138922 -170780 143478 -44477 27255
9335c1309n8023h870j5998k73326a23238l091d9133k95104d2615B5978e1361j58375
$$ -31309 -89332 -8870 -24868 -298194 -123238 -126329 -49133 -344237 -42615 25978 -51361 -209736
9323b09736g5362n3692j16016A87561b8607k86957g1011A4766e2088A65321Q0050
$$ -209736 -75362 -129054 -245070 187561 -28607 -315564 -71011 14766 -52088 165321 245371
9312B45371c34867J44040B1112g0601A66635L696f3470l5709F7382R9023D9558
$$ 245371 -334867 -190827 21112 -70601 166635 170331 -63470 -99179 67382 166405 49558
9300i2759E3932b25121K0038A44417M845g5003a3294j17665l55j11609P3774M9947
$$ -92759 53932 -225121 -205083 144417 149262 -75003 -13294 -130959 -131314 -242923 -169149 -119202
9288a19202H2126a3014C0240N2724J39533A07155J43398i4329d1033A00074d282
$$ -119202 82126 -13014 30240 82964 222497 107155 250553 -94329 -41033 100074 -4282
9276e3443r2225D9652a69094l1200E026K47196A08509b22924G4874a0531l0991
$$ -53443 -145668 49652 -169094 -200294 5026 252222 108509 -222924 74874 -10531 -41522
9265d1522k886j9187o454C12975d67900D7463C147c90869J49588i9093K4928p1548
$$ -41522 -44408 -63595 -70049 312975 -467900 47463 3147 -390869 -241281 -99093 -74165 -145713
9253a45713L8984k27248J41302d8624h082A22636d9619j69639G0740a39760M4021
$$ -145713 -106729 -333977 -192675 -48624 -8082 122636 -49619 -219258 70740 -139760 -95739
9242i5739B948J38613p888k9190O0936a5677n5333A57003b14292a03553o3314
$$ -95739 2948 141561 133673 104483 165419 -15677 -71010 157003 -214292 -103553 -166867
9231a66867A06611b03190c0572C1925J45824g1154p2066D4425b9807A59019a43198
$$ -166867 106611 -203190 -30572 31925 177749 -71154 -143220 44425 -29807 159019 -143198
9219c282E2163e9351q2628C29169b26098c588l46941a41669F6904f822j05065
$$ -3282 52163 -59351 -141979 329169 -226098 -3588 -350529 -141669 66904 -6822 -111887
9208a11887K7700A04751b93501O2617E1109a60733P952p5649C17929b13401m5597
$$ -111887 -84187 104751 -293501 -230884 51109 -160733 -152781 -228430 317929 -213401 -258998
9197b58998Q9852A2082d64148R0263A31556n5348f881A2842i0454I8194g5915
$$ -258998 -169146 12082 -464148 -373885 131556 76208 -6881 12842 -90454 98194 -75915
9185D6544J0640J59877q1908i1525A23123B1571b11630j56654D8913b43167J16244
$$ 46544 57184 217061 135153 -91525 123123 21571 -211630 -368284 48913 -243167 -126923
9174a26923j44072A60835a7455p9275j09062J68f0655J3278l41368a88756B19295
$$ -126923 -270995 160835 -17455 -96730 -205792 -205624 -60655 -47377 -388745 -188756 219295
9162a15687k08948B7819d98628K23305M9244a06317A67125b02644Q7418J831p163
$$ -115687 -324635 27819 -498628 -275323 -226079 -106317 167125 -202644 -115226 -113395 -120558
9151a20558B23345b74503A59688a06838k34960a7585C7359a99749C483c6050l04756
$$ -120558 223345 -274503 159688 -106838 -341798 -17585 37359 -199749 3483 -36050 -340806
9140c40806B5600a9587l994F136Q761Q5877K3021d73968d5450n5128a9942n0622
$$ -340806 25600 -19587 -23581 6136 14897 100774 123795 -473968 -45450 -100578 -19942 -70564
9128g0564A54182R8061a71871j39288K3255K6507O0224A00098a10040b1694m29614
$$ -70564 154182 252243 -171871 -311159 -287904 -261397 -201173 100098 -110040 -21694 -451308
9117d51308D3906J5898b26811j05714p6720F6751a063F3538c22082I1651N4536
$$ -451308 43906 59804 -226811 -332525 -409245 66751 -1063 63538 -322082 91651 146187
9106A46187d927A75263L3390C8314f0498B49994F8723Q3832g7399o9737n3944
$$ 146187 -4927 175263 208653 38314 -60498 249994 68723 152555 -77399 -147136 -201080
9095b01080O8268k11715a71578D79209j52960b4970d426k5661D6777J03915i785
$$ -201080 -132812 -344527 -171578 479209 326249 -24970 -4426 -30087 46777 150692 -9785
9083G7165b40858A467b17525i309k1886j66394j76870J02863A19456K48504b76467
$$ 77165 -240858 1467 -217525 -9309 -31195 -197589 -374459 -271596 119456 367960 -276467
9071C22111i2222q5361j2583D5069K16346o6550a61390q5849M8254B42268A20560
$$ 322111 -92222 -177583 -190166 45069 261415 194865 -161390 -247239 -198985 242268 120560
9059B3708J5627b04583j52086f3028j22889B81493p4399e4642j477J9088j6907
$$ 23708 39335 -204583 -356669 -63028 -185917 281493 207094 -54642 -56119 -37031 -53938
9048e3938l7044m529r3642n5173H172c60247J01575c9169C7584a43395j21811
$$ -53938 -90982 -95511 -189153 -244326 8172 -360247 -258672 -39169 37584 -143395 -265206
9037b65206j27268b8193B85105f9442b0062j74046N9895f2972j1095j72252F8251
$$ -265206 -392474 -28193 285105 -69442 -20062 -194108 -134213 -62972 -74067 -246319 68251
9025A7380b24025b8134o6445G5069b70295B5215a77967A07183E147a87620c9306
$$ 17380 -224025 -28134 -94579 75069 -270295 25215 -177967 107183 5147 -187620 -39306
9013c58755c1007H765J70970a39012k9557A7090K02515p3076A2879P0276A7648
$$ -358755 -31007 8765 179735 -139012 -168569 17090 219605 146529 12879 83155 17648
9001B84922i2931k4688d5619j13092A31349i162j37882B14591c87379f8089k71585
$$ 284922 -92931 -117619 -45619 -158711 131349 -9162 -147044 214591 -387379 -68089 -339674
8990c39674E1367b26656A28427a81161N4245A60602A1340a65163B46070a41986
$$ -339674 51367 -226656 128427 -181161 -126916 160602 11340 -165163 246070 -141986
8979B55437h017j62715A13935a79186Q8768j99777a39612k37659J06656j6466
$$ 255437 -8017 -170732 113935 -179186 -90418 -290195 -139612 -377271 -270615 -287081
8969b87081K4112O1549J6466l7291k0987A78670d848k39770E1208J53654h8110
$$ -287081 -262969 -201420 -184954 -222245 -243232 178670 -4848 -244618 51208 204862 -88110
8957b21111J7418Q2142A21568a3071E3148a04050j82496a30418e3011j67276l2670
$$ -221111 -203693 -121551 121568 -13071 53148 -104050 -286546 -130418 -53011 -220287 -252957
8946b52957f999k8761Q851A6643J37889f5558A06349K9453a24372A67729C1892
$$ -252957 -6999 -35760 -26909 16643 154532 -65558 106349 135802 -124372 167729 31892
8934A23576K74345g5555A57366Q2552m3047l5630a3157C42092K04046K92239Q52556
$$ 123576 397921 -75555 157366 239918 196871 161241 -13157 342092 546138 838377 1690933
8923A690933L745245N568595m131647A553022p25122j77391j87270A24419F119
$$ 1690933 5436178 11004773 6873126 1553022 827900 650509 463239 124419 6119
8913C4012g8171j62456A16443a53304I7610d4722l5608B57096A27673c53103a66007
$$ 34012 -78171 -240627 116443 -153304 97610 -44722 -80330 257096 127673 -353103 -166007
8901B5467J40623a67366c916k36156a06419B9484a42333D5106G394B540e5797
$$ 25467 166090 -167366 -3916 -240072 -106419 29484 -142333 45106 7394 2540 -55797
8889c01242B76701h79B3137h0667K1377E1334b26883F3509a94045M8821A25850
$$ -301242 276701 -879 23137 -80667 -59290 51334 -226883 63509 -194045 -145224 125850
$$ [...]
##END NTUPLES=NMR SPECTRUM
##END=
