
##TITLE=AC1233_PERAH12114_6519287_kQ2xMY586G
##JCAMPDX= 6.0         $$ Bruker NMR JCAMP-DX V2.0
##DATA TYPE= NMR SPECTRUM
##DATA CLASS= NTUPLES
##ORIGIN= BRUKER
##OWNER= Administrator
$$ 1.72 TOPSPIN		Version 2.1
$$ 2012-07-13 16:42:53.015 -0500  Administrator@TOPSPIN
$$ Compression mode = diff/dup
##.OBSERVE FREQUENCY= 400.02188249412
##.OBSERVE NUCLEUS= ^1H
##.ACQUISITION MODE= SIMULTANEOUS (DQD)
##.ACQUISITION SCHEME= undefined
##.AVERAGES= 64
##.DIGITISER RES= 22
##SPECTROMETER/DATA SYSTEM= spect
##.PULSE SEQUENCE= noesygpps1d.comp
##.SOLVENT NAME= COFFEE_meoh
##.SHIFT REFERENCE= INTERNAL, COFFEE_meoh, 1, 14.9607
##AUDIT TRAIL= $$ (NUMBER, WHEN, WHO, WHERE, PROCESS, VERSION, WHAT)
$$ ##TITLE= Audit trail, TOPSPIN		Version 2.1
$$ ##JCAMPDX= 5.01
$$ ##ORIGIN= Bruker BioSpin GmbH
$$ ##OWNER= Administrator
$$ $$ C:\Bruker\TOPSPIN/data/COFFEE/nmr/AC1233_PERAH12114_6519287_kQ2xMY586G/52/pdata/1/auditp.txt
$$ ##AUDIT TRAIL=  $$ (NUMBER, WHEN, WHO, WHERE, PROCESS, VERSION, WHAT)
(   1,<2012-07-13 16:42:48.296 -0500>,<Administrator>,<TOPSPIN>,<go>,<TOPSPIN 2.1>,
      <created by zg
	started at 2012-07-13 16:31:17.671 -0500,
	POWCHK enabled, PULCHK disabled,
       configuration hash MD5:
       6B 1B 68 BB D9 2E 58 E2 7F 35 AD 54 07 DF 0E 41
       data hash MD5: 64K
       E5 37 AF 08 A9 DD 9E 32 87 56 2E 77 0D D0 25 F2>)
(   2,<2012-07-13 16:42:51.031 -0500>,<Administrator>,<TOPSPIN>,<proc1d>,<TOPSPIN 2.1>,
      <Start of raw data processing
       efp LB = 0.3 FT_mod = 6 PKNL = 1 PHC0 = 0 PHC1 = 0 SI = 128K 
       data hash MD5: 128K
       1F 5C A0 FF 91 69 61 CB 44 D4 B4 AF F0 CF A9 DA>)
(   3,<2012-07-13 16:42:52.234 -0500>,<Administrator>,<TOPSPIN>,<proc1d>,<TOPSPIN 2.1>,
      <pk PHC0 = -0.1538086 PHC1 = 0 
       data hash MD5: 128K
       AD B3 49 5E D8 6C C5 9F 32 10 B7 82 B8 EC 9D 98>)
(   4,<2012-07-13 16:42:52.500 -0500>,<Administrator>,<TOPSPIN>,<proc1d>,<TOPSPIN 2.1>,
      <abs ABSG = 1 
       data hash MD5: 128K
       56 8A CC 64 51 9F 36 7A 39 EF E8 AD D4 AA 25 8C>)
(   5,<2012-07-13 16:42:52.578 -0500>,<Administrator>,<TOPSPIN>,<proc1d>,<TOPSPIN 2.1>,
      <abs ABSG = 2 
       data hash MD5: 128K
       4F 82 E2 77 F5 D2 AA C1 A8 AE DB CD 78 B0 97 45>)
(   6,<2012-07-13 16:42:52.625 -0500>,<Administrator>,<TOPSPIN>,<proc1d>,<TOPSPIN 2.1>,
      <abs ABSG = 3 
       data hash MD5: 128K
       48 FF 42 61 CD BA AB 31 AA 21 D1 A5 B8 11 41 85>)
(   7,<2012-07-13 16:42:52.703 -0500>,<Administrator>,<TOPSPIN>,<proc1d>,<TOPSPIN 2.1>,
      <abs ABSG = 4 
       data hash MD5: 128K
       BC 17 1B AC 45 5B DD D8 77 12 A0 36 AC 17 D3 1F>)
(   8,<2012-07-13 16:42:52.765 -0500>,<Administrator>,<TOPSPIN>,<proc1d>,<TOPSPIN 2.1>,
      <abs ABSG = 5 
       data hash MD5: 128K
       27 E8 DE B4 17 94 02 EE 45 8A 11 6F 7C 22 63 77>)
$$ ##END=
$$ 
$$ $$ hash MD5
$$ $$ 34 1B DD A8 02 9E 8E 9D 2B AF 93 35 14 13 A7 58
##$RELAX= 
##$RELAX= 
##$RELAX= 
##$RELAX= 
##$RELAX= 
##$RELAX= 
##$RELAX= 
##$RELAX= 
##$RELAX= 
$$ [...]
##$TP07= 0
##$TPNAME0= <>
##$TPNAME1= <>
##$TPNAME2= <>
##$TPNAME3= <>
##$TPNAME4= <>
##$TPNAME5= <>
##$TPNAME6= <>
##$TPNAME7= <>
##$TPOAL= (0..7)
0.5 0.5 0.5 0.5 0.5 0.5 0.5 0.5
##$TPOFFS= (0..7)
0 0 0 0 0 0 0 0
##$TUNHIN= 0
##$TUNHOUT= 0
##$TUNXOUT= 0
##$USERA1= <user>
##$USERA2= <user>
##$USERA3= <user>
##$USERA4= <user>
##$USERA5= <user>
##$V9= 5
##$VALIST= <valist>
##$VCLIST= <CCCCCCCCCCCCCCC>
##$VD= 0
##$VDLIST= <DDDDDDDDDDDDDDD>
##$VPLIST= <PPPPPPPPPPPPPPP>
##$VTLIST= <TTTTTTTTTTTTTTT>
##$WBST= 2048
##$WBSW= 25
##$XGAIN= (0..3)
0 0 0 0
##$XL= 0
##$YL= 0
##$YMAX_a= 12188255
##$YMIN_a= -9672882
##$ZGOPTNS= <>
##$ZL1= 120
##$ZL2= 120
##$ZL3= 120
##$ZL4= 120
##$ABSF1= 14.9607
##$ABSF2= -5.597482
##$ABSG= 5
##$ABSL= 3
##$ALPHA= 0
##$AQORDER= 0
##$ASSFAC= 0
##$ASSFACI= 0
##$ASSFACX= 0
##$ASSWID= 0
##$AUNMP= <proc_prof1d_extract.lims>
##$AXLEFT= 0
##$AXNAME= <>
##$AXNUC= <1H>
##$AXRIGHT= 0
##$AXTYPE= 0
##$AXUNIT= <>
##$AZFE= 0.1
##$AZFW= 0.1
##$BCFW= 0
##$BC_mod= 0
##$BYTORDP= 0
##$COROFFS= 0
##$CY= 15
##$DATMOD= 1
##$DC= 0
##$DFILT= <>
##$DTYPP= 0
##$F1P= 0
##$F2P= 0
##$FCOR= 0.5
##$FTSIZE= 131072
##$FT_mod= 6
##$GAMMA= 0
##$GB= 0
##$INTBC= 1
##$INTSCL= 1
##$ISEN= 128
##$LB= 0.3
##$LEV0= 0
##$LPBIN= 0
##$MAXI= 10000
##$MC2= 0
##$MEAN= 0
##$ME_mod= 0
##$MI= 0
##$NCOEF= 0
##$NC_proc= -2
##$NLEV= 6
##$NOISF1= 0
##$NOISF2= 0
##$NSP= 0
##$NTH_PI= 0
##$NZP= 0
##$OFFSET= 14.9607
##$PC= 1
##$PHC0= -0.1538086
##$PHC1= 0
##$PH_mod= 1
##$PKNL= yes
##$PPARMOD= 0
##$PPDIAG= 0
##$PPIPTYP= 0
##$PPMPNUM= 2147483647
##$PPRESOL= 1
##$PSCAL= 4
##$PSIGN= 0
##$PYNMP= <proc.py>
##$REVERSE= no
##$SF= 400.020009756335
##$SI= 131072
##$SIGF1= 0
##$SIGF2= 0
##$SINO= 400
##$SIOLD= 131072
##$SPECTYP= <>
##$SREGLST= <1H.CDCl3>
##$SSB= 0
##$STSI= 131072
##$STSR= 0
##$SW_p= 8223.68421052631
##$SYMM= 0
##$S_DEV= 0
##$TDeff= 65536
##$TDoff= 0
##$TI= <>
##$TILT= no
##$TM1= 0
##$TM2= 0
##$TOPLEV= 0
##$USERP1= <user>
##$USERP2= <user>
##$USERP3= <user>
##$USERP4= <user>
##$USERP5= <user>
##$WDW= 1
##$XDIM= 131072
##$YMAX_p= 390564317
##$YMIN_p= -12322
##$CURPLOT= <Network HP LaserJet P1505>
##$CURPRIN= <$Network HP LaserJet P1505>
##$DFORMAT= <normdp>
##$LAYOUT= <+/1D_H.xwp>
##$LFORMAT= <normlp>
##$PFORMAT= <normpl>
##$SURQMSG= 1
$$ End of Bruker specific parameters
$$ ---------------------------------
##NTUPLES= NMR SPECTRUM
##VAR_NAME=  FREQUENCY,     SPECTRUM/REAL,   SPECTRUM/IMAG
##SYMBOL=    X,             R,               I
##VAR_TYPE=  INDEPENDENT,   DEPENDENT,       DEPENDENT
##VAR_FORM=  AFFN,          ASDF,            ASDF
##VAR_DIM=   131072,        131072,          131072
##UNITS=     HZ,            ARBITRARY UNITS, ARBITRARY UNITS
##FACTOR=    0.0627417313425164, 1,          1
##FIRST=     8223.62146879497, -3064,        -61746
##LAST=      0,             -2201,           -63122
##MIN=       0,             -12322,          0
##MAX=       8223.62146879497, 390564317,    0
$$ Real data points
##PAGE= N=1
##DATA TABLE= (X++(R..R)), XYDATA
$$ [...]
65137 257327 269296 280840 291453 300912 309359 317238 325130 333331 341465 348660 354277 358338 361173
65124 361173 362818 362974 361467 358622 355137 351494 347457 342286 335613 327920 319875 311396 301856 291111
65110 291111 279802 268568 257640 247430 238777 231983 225988 219216 211155 202666 194895 188393 183156
65097 183156 178854 174873 170682 166416 162786 160188 158224 156298 154434 153262 153306 154456 156018 157158 157409
65082 157409 156895 156059 155219 154516 154171 154432 155127 155576 155176 153997 152670 151834 151781 152409 153312 153989 154121 153632
65064 153632 152517 150910 149354 148639 149031 149933 150602 150996 151492 152050 152214 151979 152009 152769 153906 154844 155589 156502
65046 156502 157485 157918 157443 156403 155317 154220 152765 150851 148887 147387 146500 145993 145581 145078 144346 143326
65030 143326 142169 141096 140007 138494 136481 134650 133858 134169 134786 134944 134559 133938 133224 132322 131193 130101
65014 130101 129641 130404 132320 134453 135907 136982 138817 141709 144456 145859 146298 147178 149247 152188 155546
64999 155546 159137 162559 165196 166936 168281 169525 170471 171127 171992 173229 174193 174284 173822 173509 173415 173114 172612
64982 172612 172509 173294 174938 177154 179620 181930 183736 185016 185915 186320 185907 184627 182785 180563 177792
64967 177792 174330 170433 166586 163159 160339 158194 156577 155169 153801 152747 152469 153001 153719 153830 153109
64952 153109 152064 151388 151313 151525 151533 150978 149724 147925 146008 144391 143166 142212 141573 141384 141424 141127 140213 139061
64934 139061 138271 138123 138611 139694 141300 143300 145674 148433 151212 153307 154375 154684 154419 153233 150978
64919 150978 148382 146345 144876 143453 142185 141769 142302 142962 143074 142856 142898 143446 144408 145587 146721 147729
64903 147729 149036 151223 154258 157621 161202 165381 170055 174346 177685 180575 183876 187943 192925 199205
64889 199205 206802 214725 221672 227155 231449 234823 237517 240190 243536 247384 250756 252873 253705 253578 252734
64874 252734 251253 249029 245851 241818 237547 233548 229633 225447 221371 218215 216121 214482 212962 211831
64860 211831 211107 210125 208338 206005 203710 201637 199589 197322 194509 190807 186307 181617 177195 172961 168860
64845 168860 165381 163064 161781 160943 160160 159297 158209 156959 156133 156298 157154 157691 157222 155867 154109 152409
64829 152409 151308 151294 152243 153387 154170 154774 155541 156208 156303 156092 156580 158387 161076 163823 166432 169337 172775
64812 172775 176423 179930 183480 187505 192077 196949 202123 207966 214575 221352 227564 233122 238434 243558
64798 243558 247938 251112 253230 254567 254837 253453 250363 246160 241307 235701 229228 222382 216013 210658
64784 210658 206432 203378 201500 200443 199598 198613 197604 196826 196454 196724 197835 199533 201145 202340 203535
64769 203535 205300 207657 210392 213763 218346 224219 230793 237475 244021 250231 255790 260724 265597 270947
64755 270947 276694 282299 287282 291459 294911 297983 301088 304274 307132 309339 311077 312594 313551 313229 311451
64740 311451 308875 306225 303438 299845 295043 289303 283119 276565 269394 261705 254221 247716 242332 237727
64726 237727 233773 230709 228535 226683 224611 222478 220833 219801 218965 218077 217535 217926 219366 221466 223863
64711 223863 226596 229969 234177 239005 243805 247744 250227 251179 250969 250047 248697 247042 245134 242883 240022
64696 240022 236322 231888 227116 222351 217763 213553 209977 207009 204231 201345 198613 196504 195117 194298
64682 194298 194192 195131 196935 198794 200049 200771 201452 202508 204218 206759 210027 213715 217735 222296 227430
64667 227430 232927 238921 245959 253957 261568 267300 271018 273708 275938 277199 276680 273999 269164 262535
64653 262535 255069 248023 242134 237409 233723 231054 229034 227019 224989 223803 224013 224960 225630 226075 227299
64638 227299 229921 233574 237673 242193 247591 254379 262928 273349 285309 298089 310949 323363 334965
64625 334965 345427 354418 361518 366163 367853 366446 362141 355254 346171 335469 323802 311608 299160
64612 299160 286955 275829 266415 258585 251562 244676 237925 231796 226565 221899 217250 212600 208591 205861
64598 205861 204442 203931 204019 204588 205466 206464 207681 209453 211898 214719 217558 220373 223401 226910 231110 236116
64582 236116 241795 247733 253503 258999 264496 270375 276835 283770 290825 297545 303537 308580 312669 315903
64568 315903 318287 319649 319871 319096 317442 314498 309527 302473 294480 286929 280045 272886 264736 256033 247785
64553 247785 240463 233810 227530 221811 217112 213631 211076 208958 207026 205310 203845 202602 201792 201889 203052
64538 203052 204847 206868 209315 212365 215241 216714 216543 215633 214591 213001 210455 207464 204742 202240 199649
64523 199649 197307 195827 195168 194841 194767 195137 195630 195679 195481 195926 197393 199354 201288 203276 205437 207448 208941
64506 208941 209848 210176 210013 210049 211444 214685 218942 222992 226504 230146 234749 240657 247601 254899 262042
64491 262042 269156 276537 283641 289116 292115 292998 292434 290491 287210 283415 280154 277644 275476 273570 272138
64476 272138 270930 269344 267335 265521 264229 262961 260942 257787 253634 249060 244909 241830 239954 239204
64462 239204 239653 241143 242912 244292 245643 247816 250822 253780 256168 258236 260081 261288 261834 262443 263560
64447 263560 264694 265359 266002 267409 269719 272689 276449 281284 286955 292896 298926 305289 312222 319973 329016
64432 329016 339734 352070 365952 381844 400426 421986 446623 474816 507236 544268 586360
64421 586360 634603 690227 753558 824143 901801 986763 1078632 1175861 1276336 1377743 1477162
64410 1477162 1571250 1657488 1734862 1802881 1860218 1904719 1934372 1947868 1944629 1924965 1890310
64399 1890310 1842848 1784660 1717153 1641085 1557024 1465873 1369201 1269177 1168397 1069874 976763
64388 976763 891294 813747 743043 678598 621165 571633 529651 494010 463857 438805 418109
64377 418109 400570 385308 372017 360374 349814 340109 331608 324524 318266 311867 304919 297843 291248
64364 291248 285257 279433 273358 267206 261662 257089 252936 248270 242973 238033 234453 232191 230434 228700
64350 228700 227264 226581 226750 227723 229740 233203 238200 244338 251046 257751 263727 268061 270140 270147 268825 266704
64334 266704 263777 259979 255687 251504 247775 244584 242101 240529 239698 239074 238351 237774 237732 238230 238981 239767
64318 239767 240426 240606 239976 238815 238094 238720 240696 243140 245072 246088 246329 245971 244899 242858 239830 236153
64302 236153 232226 228202 224059 219896 215953 212304 208739 205127 201767 199153 197451 196372 195527 194664 193609
64287 193609 192389 191544 191934 193868 196659 199404 202058 205288 209391 213919 218458 223165 228211 233192 237641
64272 237641 241845 246620 252371 258817 265589 272548 279402 285467 290069 292919 294007 293466 291749 289590
64258 289590 287471 285402 283470 282244 282205 282969 283604 283612 283092 281909 279344 274888 268979 262559 256136 249640
64242 249640 243019 236581 230757 225850 222051 219434 217766 216505 215227 214065 213599 214168 215286 215924 215563
64227 215563 214846 214793 215419 215552 214297 212250 210819 210636 211157 211661 211998 212219 212035 210974 208843 205869 202634
64210 202634 199923 198252 197346 196408 195148 194201 194302 195342 196563 197432 197964 198427 199109 200250 201839 203553
64194 203553 205173 206924 209087 211482 213780 216224 219588 224390 230597 238136 247265 258199 270630 283743
64180 283743 296528 308053 317703 325227 330444 332972 332447 328891 322610 313902 303312 291974 281115
64167 281115 271106 261585 252571 244821 238805 233911 229112 224031 218989 214384 210445 207357 205212 203973
64153 203973 203674 204362 205662 206801 207403 207913 208892 210349 212143 214546 217777 221334 224548 227577 231085
64138 231085 234980 238225 240085 240948 241773 243134 244872 246193 246064 244037 240898 238053 236175 234824 233427
64123 233427 232045 231017 230476 230595 231800 234298 237728 241654 246167 251619 257940 264598 271155 277653 284561
64108 284561 292509 301873 312413 323325 333710 342866 350248 355559 359024 361261 362708 363517 364093 365312
64094 365312 367905 371936 377089 383051 389309 394970 399259 402003 403295 402944 400613 396259 390101 382399
64080 382399 373627 364556 355683 346773 337395 327670 318105 309004 300614 293526 288142 283813 279351 274520
64066 274520 270362 267859 266885 266746 267122 268110 269764 271981 274541 276965 278674 279593 280345 281661 283782 286601
64050 286601 289986 293711 297480 301369 306024 312075 319517 327895 336821 346077 355562 365469 376225 387812
64036 387812 399367 409851 418898 426551 432398 435710 436539 436009 435135 433622 430167 423901 415390 406354
64022 406354 398495 392487 387925 384187 381215 379385 378790 378907 378962 378345 376677 373788 369813 365157 360160
64007 360160 354842 349090 343072 337384 332733 329385 326919 324570 321875 318897 315831 312639 309324 306389
63993 306389 304685 304702 306203 308554 311250 314111 317217 320783 324989 329801 334969 340178 345187 349952 354756
63978 354756 360098 366258 373045 380178 387783 396199 405422 415173 425474 436589 448284 459733 470590
63965 470590 481665 494055 507910 522704 538508 556252 576584 599143 623330 649392 678358
63954 678358 711228 748669 791430 840531 896923 961319 1034600 1118233 1214002 1323320 1446896
63943 1446896 1584991 1737669 1904644 2085037 2277499 2480482 2692149 2909971 3130603
63934 3130603 3350157 3564352 3768306 3956560 4123813 4265845 4379778 4463690 4516308 4537005
63924 4537005 4525691 4482501 4407791 4302653 4169341 4011095 3831777 3635871 3428570 3215320
63914 3215320 3000961 2789313 2583449 2385957 2198852 2023551 1861261 1713141 1579728
63905 1579728 1460345 1353553 1258282 1174191 1100903 1037382 982342 934876 894292 859599 829596
63894 829596 803361 780318 759963 741941 726238 712791 700930 689802 679364 670370 663111 656826
63882 656826 650753 645213 641039 638314 636366 634864 634311 635470 638910 645100 654343 666390 680634 696932
63868 696932 715788 737427 761080 785557 810208 834975 859774 884400 908909 933459 957519
63857 957519 979616 998288 1013139 1024720 1033424 1038846 1040265 1037488 1030979 1021293 1008693 993277 975183
63844 975183 954523 931367 905933 878608 849599 818834 786515 753574 721188 689877 659444
63833 659444 629752 601134 573941 548120 523456 499965 477859 457356 438650 421770 406324
63822 406324 391700 377772 365138 354395 345392 337435 329923 322468 314785 306967 299695 293609 288505
63809 288505 283651 278841 274566 271082 267959 264843 262112 260362 259612 259433 259554 259784 259541 258111 255468
63794 255468 252362 249409 246461 243161 239744 236838 234568 232310 229557 226666 224414 222890 221286 219008
63780 219008 216619 215283 215309 215717 215420 214436 213662 213653 214083 214328 214190 213878 213589 213269 212700 211752 210686 210199 210815
63761 210815 212121 212930 212517 211438 210750 210697 210659 210323 210246 211044 212567 214242 215862 217594 219438 221145 222585
63744 222585 223832 224919 225784 226411 226784 226835 226796 227430 229430 232537 235731 238355 240650 243060 245578 248061
63728 248061 250739 253948 257555 261004 263824 265951 267860 270547 274980 281069 287427 292595 296411 299815
63714 299815 303528 307340 310585 312725 313484 312896 311375 309361 306831 303543 299814 296593 294484 293068 291473
63699 291473 289417 287427 286152 285716 285679 285592 285640 286666 289340 293292 297336 300608 303223 305779 308595 311609
63683 311609 314682 317730 320715 323641 326355 328287 328753 327794 326435 325810 326207 327208 328415 329641 330632
63668 330632 331150 331399 332020 333556 336049 339026 341612 342811 342138 340049 337470 334797 331635 327484 322358
63653 322358 316660 310836 305373 300818 297386 294619 291715 288291 284753 281934 280456 280412 281525 283427 285714
63638 285714 287868 289419 290383 291392 293129 295698 298755 302209 306460 311833 318076 324655 331446 338855
63624 338855 347244 356407 365670 374505 382994 391763 401468 412393 424552 438028 453041 469681 487820
63611 487820 507451 528944 552717 578647 606038 634290 663452 693951 725795 758147 789623
63600 789623 818805 844470 865637 881688 892396 897680 897448 892061 882947 872399 862426 853768 845938
63587 845938 837854 828264 815969 800226 781020 758825 734170 707714 680586 654176 629403 606412
63575 606412 585112 565738 548753 534437 522818 513873 507473 503223 500663 499712 500634 503410 507409
63562 507409 511990 517315 524173 532857 542592 552362 562046 572324 583632 595790 608711 622982 639438
63549 639438 658574 680704 706281 735615 768479 804456 843505 885673 930207 975146 1017576
63538 1017576 1053890 1080235 1093890 1094896 1086168 1071740 1055005 1038347 1023448 1011080 1000720 990921
63526 990921 980270 967873 953074 935060 912885 885893 854241 819091 782180 745061 708719
63515 708719 673756 640593 609395 580089 552684 527490 504959 485415 468940 455174 443197
63504 443197 432043 421553 412360 404811 398330 392214 386597 382069 378578 375333 371737 367870 364047 360475
63490 360475 357507 355742 355544 356645 358343 359953 361144 362136 363606 366102 369473 373111 376697 380371 384191
63475 384191 387956 391691 395765 400201 404214 406777 407440 406340 403727 399837 395046 389798 384478 379534
63461 379534 375434 372194 369232 366104 363148 360938 359340 357819 356635 356911 359129 362164 364376 365407
63447 365407 366439 368910 373417 379739 387334 395661 404395 413668 424028 436073 450129 466250 484331
63434 484331 504246 526091 550462 578274 609977 644722 680170 713146 740723 761229 774693
63423 774693 782543 786873 789837 793405 799268 808703 822545 841205 864568 891947 922529 955999 992265
63410 992265 1030187 1066894 1098947 1124192 1142160 1152915 1156343 1152866 1144184 1132605 1119797 1106494
63398 1106494 1093056 1079634 1065677 1049833 1030671 1007419 980003 948762 914361 877782 840112
63387 840112 802310 765309 730212 698104 669454 643822 620349 598691 579426 563462 551074
63376 551074 541634 534242 528500 524683 523361 524840 528785 534312 540705 548138 557501 569395 583582 599537
63362 599537 617121 636426 657396 680233 705895 735428 768683 804258 840887 878348 916807
63351 916807 955844 994444 1031478 1065647 1095252 1118604 1134764 1143676 1145822 1142084 1133836 1122680
63339 1122680 1109900 1096256 1082190 1067915 1053223 1037341 1019093 997310 971353 941498 908750
63328 908750 874240 838893 803701 769959 738904 711275 687385 667382 651165 638365 628846 622920
63316 622920 620509 620095 619008 614801 606096 592457 574347 553360 531721 510953 491289 472536 455006
63303 455006 439363 426089 415471 407601 401859 396833 391436 385935 381342 377963 375132 372174 369004
63290 369004 365742 362428 359222 356382 353844 351295 348834 347063 346256 345830 344981 343504 341747 340111 338907
63275 338907 338431 338685 339154 339183 338575 337612 336646 335876 335431 335384 335727 336492 337784 339504 341244 342737 344304 346547
63257 346547 349672 353376 357278 361098 364495 367198 369463 372111 375969 381363 388076 395518 402979 410172
63243 410172 417640 426350 436760 448611 461652 476110 492129 509243 526849 544958 564038 584297
63231 584297 605594 627970 651741 676950 703047 729200 754653 778809 801395 822793 843932
63220 843932 865642 888169 911361 935050 959057 983028 1006397 1028392 1047908 1063639 1074602
63209 1074602 1080454 1081147 1076450 1066105 1050285 1029550 1004482 975761 944628 912760 881408 850990
63197 850990 821803 794794 771175 751438 735165 721770 711046 703044 697894 695940 697622 702927
63185 702927 711233 721913 734894 750315 767898 787009 807232 828471 850496 872774 894828 916431
63173 916431 937399 957470 976545 994760 1012167 1028410 1042813 1054601 1063022 1067491 1067712 1063499
63161 1063499 1054466 1040191 1020771 996924 969388 938524 904702 868738 831733 794751 758873
63150 758873 725181 694201 665598 638877 614210 592151 572736 555455 540056 526719 515314
63139 515314 505157 495853 487868 481812 477404 473632 469793 466035 462921 460846 459904 460011 460927 462281 463750
63124 463750 465280 467114 469532 472551 475941 479565 483566 488131 493156 498279 503120 507353 510746 513407
63110 513407 515881 518674 521729 524712 527613 530597 533356 535296 536568 538239 541040 544420 547296 549258
63096 549258 550513 551090 550804 549897 548992 548445 548275 548669 549927 551741 553183 553709 553801 554328 555650 557608 560044
63079 560044 562930 566214 569925 574290 579474 585273 591395 597964 605434 613988 623308 633080 643484 654983
63065 654983 667749 681568 696342 712512 730794 751556 774608 799623 826589 855813 887734
63054 887734 922915 961977 1005148 1051845 1101030 1152058 1205002 1260119 1317298 1376161 1436374
63043 1436374 1497550 1558953 1619631 1678885 1736570 1793087 1849283 1906145 1964139 2022695 2080500
63032 2080500 2136335 2189394 2238759 2282905 2319966 2348288 2366377 2372533 2365094 2343322 2307908 2260489
63020 2260489 2202974 2137417 2066122 1991289 1914585 1837472 1762015 1690913 1626401 1569314 1519432
63009 1519432 1476589 1441221 1414015 1395316 1384883 1381952 1385483 1394585 1408853 1428323 1453036 1482595
62997 1482595 1516020 1551930 1589005 1626455 1664093 1701925 1739774 1777363 1814501 1850894 1885830
62986 1885830 1918298 1947481 1972872 1993866 2009409 2018143 2018760 2010180 1991644 1962890 1924279 1876674
62974 1876674 1821210 1759242 1692430 1622736 1552126 1482061 1413219 1345917 1280938 1219781 1163841
62963 1163841 1113426 1067871 1026545 989341 956074 925836 897353 869949 843915 819947 798337
62952 798337 778688 760202 742172 724260 706491 689168 672803 657852 644181 630885 617018
62941 617018 602639 588824 576490 565479 555068 545094 536087 528381 521549 514958 508597 503052 498741
62928 498741 495444 492576 489705 486707 483586 480396 477313 474604 472443 470818 469574 468414 466940 465013
62914 465013 463155 462187 462203 462164 460946 458626 456361 454994 454206 453046 450908 447855 444382 441040 438061 435231
62898 435231 432353 429889 428694 428930 429610 429595 428852 428342 428800 429977 431103 431751 432106 432492 432916 433186 433435
62881 433435 434173 435598 437083 437778 437686 437679 438327 439223 439621 439301 438473 437339 436182 435542 435717 436212 436114 435019
62863 435019 433294 431587 430387 429843 429620 429058 427859 426546 425856 425872 426172 426618 427412 428431 429165 429440 429655
62846 429655 430078 430415 430336 430026 429918 430165 430618 431016 431013 430309 429050 427881 427359 427481 427938 428536 429184 429709 430034
62827 430034 430371 430987 431863 432837 433972 435549 437740 440442 443344 446068 448376 450422 452672 455451 458670
62812 458670 462131 465936 470351 475411 480924 486805 493179 500106 507429 514945 522637 530739 539626 549628
62798 549628 560835 573093 586237 600245 615162 630971 647688 665558 685051 706678 730837
62787 730837 757827 787957 821712 859827 903115 952132 1006978 1067388 1133016 1203758 1279943
62776 1279943 1362049 1449945 1542367 1637428 1733522 1829321 1922775 2010660 2089581 2157170 2212002
62765 2212002 2252622 2277255 2284576 2274435 2247761 2206075 2151111 2084652 2008562 1925039 1836753
62754 1836753 1746427 1656086 1566821 1479347 1394636 1313806 1237505 1165637 1097890 1034500 976283
62743 976283 923766 876432 833139 793338 757563 726545 700039 676797 655518 635618 617236
62732 617236 600874 587034 575888 567107 560103 554434 549892 546286 543432 541378 540379 540559 541763 543813
62718 543813 546751 550700 555650 561572 568697 577542 588590 601987 617627 635510 655906 679082 705000
62705 705000 733561 765188 800869 841418 886865 936761 990874 1049328 1112203 1179377 1250712
62694 1250712 1326020 1404691 1485508 1566866 1646956 1723740 1795112 1859232 1914516 1959204 1991189
62683 1991189 2008587 2010485 1997094 1969294 1928193 1875042 1811422 1739412 1661441 1579827 1496406
62672 1496406 1412699 1330365 1251179 1176436 1106523 1041267 980579 924646 873625 827347 785379
62661 785379 747257 712663 681454 653486 628410 605720 585090 566572 550307 536060 523199
62650 523199 511215 500137 490278 481622 473683 466037 458843 452590 447378 442789 438529 434895 432277 430459
62636 430459 428802 427090 425789 425324 425442 425541 425392 425201 425016 424433 423048 420989 418776 416741 414921 413574
62620 413574 413421 414931 417494 419859 421506 423168 425733 429185 433066 437523 443168 450059 457603 465563
62606 465563 474471 484796 496295 508557 521708 536153 552028 569460 589072 611658 637395 665861
62594 665861 696922 731180 769346 811340 856125 902327 948846 994798 1038991 1079782 1115739
62583 1115739 1146245 1170981 1188880 1198245 1198168 1189269 1172634 1148598 1117279 1079870 1038543 995084
62571 995084 950404 905392 861398 819462 779667 741737 705952 673045 643450 617049 593502
62560 593502 572515 553882 537509 523353 511198 500635 491387 483471 476860 471163 465809 460421 454882
62547 454882 449296 444085 439877 436966 434999 433485 432419 432111 432577 433565 435034 437077 439357 441236 442695
62532 442695 444595 447627 451421 455177 458852 463107 468236 473944 480414 488903 500686 515647 532475
62519 532475 550262 569481 591270 616194 644006 674458 707945 745141 786093 829787 874702
62508 874702 919805 964927 1010103 1054586 1096621 1134149 1165560 1189842 1206377 1214980 1216045 1210296
62496 1210296 1198302 1180410 1157297 1130403 1101664 1072825 1045113 1019422 996575 977335 962262
62485 962262 951718 945977 945219 949390 958234 971550 989349 1011561 1037620 1066525 1097379 1129643
62473 1129643 1162654 1194989 1224511 1249035 1266884 1277064 1279311 1274088 1262165 1243942 1219266 1187965
62461 1187965 1150389 1107347 1059862 1009301 957515 906355 856944 809658 764852 723266 685626
62450 685626 652151 622688 597169 575639 557996 543899 532875 524319 517540 512118 508220 506225
62438 506225 505991 506769 507921 509345 511041 512648 513854 514885 516032 516768 515984 513248 509222 504579 499028
62423 499028 491979 483756 475443 467553 459597 451179 442949 435969 430442 425543 420456 415173 410261 406218
62409 406218 403170 400910 398998 397001 394880 393050 391883 391209 390565 389895 389650 390044 390538 390474 390095 390499 392447
62392 392447 395549 398823 401756 404511 407282 409907 412199 414313 416637 419427 422668 426170 429767 433564
62378 433564 438055 443785 450770 458407 466121 473984 482505 491927 502052 512847 524911 539031 555284
62365 555284 572802 590632 608814 628511 651053 677049 706486 739458 776409 817707 863381
62354 863381 913364 967584 1025463 1085550 1146024 1205381 1262263 1314739 1360412 1397439 1425112
62343 1425112 1443276 1451692 1450348 1440027 1422049 1397553 1367399 1332554 1293946 1251900 1206356 1157974
62331 1157974 1108625 1060499 1014995 972710 934046 899263 868112 840019 814689 792114 771955
62320 771955 753374 735653 718537 701727 684473 666140 647009 628117 610270 593456 577187
62309 577187 561169 545620 531123 518254 507227 497864 489873 483041 477081 471610 466557 462456 459938
62296 459938 458942 458713 458538 458173 457581 456732 455840 455423 455844 457025 458771 461097 463980 467119 470282 473728
62280 473728 477918 482955 488549 494417 500380 506258 512076 518305 525451 533403 541584 549802 558489 568123
62266 568123 578857 590918 604809 620892 639193 659986 684129 712390 744727 780738 820546
62255 820546 864761 913723 967301 1025207 1086802 1150554 1214271 1276004 1334188 1386852 1431500
62244 1431500 1466220 1490412 1504091 1507107 1499733 1483462 1460180 1430524 1393774 1349434 1298268 1241758
62232 1241758 1181412 1119072 1057132 997586 941069 887492 837504 792617 753709 719985 689790
62221 689790 662090 636806 614041 593619 575467 559923 547289 537185 528665 520924 513736 507236
62209 507236 501528 496626 492635 489811 488410 488420 489372 490592 491823 493616 496837 501790 508142 515710 524768
62194 524768 535312 546563 557791 569286 581850 595470 609327 623071 637215 651938 666344
62183 666344 679519 691733 703908 716215 727852 737964 746073 751835 755176 756811 757954 759313 760914
62170 760914 763111 767210 774706 786261 801783 821231 844956 873414 906835 945026 987155 1031768
62158 1031768 1077170 1121675 1163386 1200059 1229654 1251125 1264531 1270469 1269557 1262332 1249316 1231030
62146 1231030 1207965 1180509 1148901 1113509 1075324 1035969 996935 958950 922400 888152 857414
62135 857414 830703 807468 787030 769542 755718 745849 739426 735587 733554 732650 732351 732555 733609 735844
62121 735844 739203 743531 749129 756613 766032 776351 786120 794571 801697 807300 810510 810668 808302 804715
62107 804715 800729 796438 792054 788122 784461 779617 772177 762520 752628 744278 737925 733281 730235 728958
62093 728958 729672 732701 738282 745844 753805 760651 766236 771724 778362 786615 796281 806900 817975 829228
62079 829228 840944 853880 868651 885262 903243 922170 942070 963437 986719 1011548 1036661
62068 1036661 1060969 1084610 1108536 1133094 1157687 1182051 1207182 1234447 1264084 1295155 1326694
62057 1326694 1358229 1389061 1417584 1441633 1459466 1470468 1475203 1474819 1470141 1461129 1447135 1427540
62045 1427540 1402132 1371150 1335303 1295616 1252956 1207800 1160704 1112818 1065505 1019489 974832
62034 974832 931786 891191 853901 820113 789409 761113 734566 709545 686697 667164 651392
62023 651392 638467 626918 615910 605418 595495 585855 576124 566148 556053 546221 537167 529151 521904
62010 521904 514914 508028 501588 496061 491715 488632 486761 485874 485681 486095 487285 489381 492204 495347 498489
61995 498489 501565 504646 507696 510475 512686 514135 514682 514098 512129 508671 503787 497591 490246 482078 473456
61980 473456 464604 455745 447406 440206 434213 428816 423417 418019 412987 408605 405120 402828 401762 401509
61966 401509 401679 402348 403622 405061 406001 406355 406584 406986 407550 408447 410045 412319 414802 417339 420343 424106
61950 424106 428369 432898 437995 443925 450156 455734 460374 464809 470146 477184 486239 497245 509948 524204
61936 524204 540071 557429 575639 593864 611683 629090 645946 661790 676238 689248 700851
61925 700851 710914 719287 725934 730687 733171 733272 731567 728917 725673 721583 716465 710679 704849 699444
61911 699444 694912 692035 691826 695038 701880 712042 724713 738630 752541 765863 778683 790930 801684
61898 801684 809519 813498 813638 810439 804231 795143 783616 770699 757565 744615 731255 716753 701232
61885 701232 685557 670379 655787 641991 629691 619282 609988 600424 589892 578748 567659 557008
61873 557008 546947 537390 527904 518167 508713 500667 494539 489815 485992 483392 482472 482925 484190 486516
61859 486516 490750 497126 505023 513993 524405 536853 551450 567967 586287 606436 628542 653016
61847 653016 680386 710462 741871 772818 802240 829910 855574 878500 897963 913682 925496
61836 925496 932883 935229 932561 925819 916438 905841 895276 885732 877859 872071 868910 869139 873243 880855
61822 880855 890951 902668 915722 929847 943943 956060 964290 967623 965958 959528 948482 932987
61810 932987 913500 890782 865668 838838 810783 781886 752619 723751 696314 671179 648556
61799 648556 628040 609215 592130 577102 564180 552988 543029 533975 525672 517984 510747 503836 497347
61786 497347 491650 487054 483292 479561 475261 470526 465799 461150 456450 452083 448881 447190 446435 445828 445130
61771 445130 444493 443936 443328 442614 441702 440365 438637 437130 436593 437235 438826 441289 444705 448789 452838 456356
61755 456356 459383 462132 464712 467380 470625 474546 478308 480599 480767 479363 477592 476282 475313 473899 471397
61740 471397 467937 464339 461450 459559 458318 457082 455364 453211 451249 450192 450183 450721 451321 452087 453465 455576
61724 455576 458056 460526 462919 465299 467598 469748 471963 474610 477746 480952 483742 486079 488364 490916
61710 490916 493556 495722 496918 496978 495940 493849 490760 486935 482911 479326 476604 474787 473566 472433 470873
61695 470873 468554 465481 461952 458354 454991 452020 449423 447028 444724 442756 441627 441487 441741 441510 440467
61680 440467 438970 437416 435782 433833 431513 429020 426759 425330 425147 425894 426617 426646 426131 425487 424748 423867
61664 423867 423231 423202 423344 422788 421384 419807 418490 417208 415979 415588 416597 418365 419769 420640 421800 423768
61648 423768 426059 427910 429151 430164 431327 432729 434251 435757 437322 439269 441816 444706 447456 449934
61634 449934 452324 454431 455447 454680 452224 448642 444278 439310 434294 430083 427051 424752 422529 420252
61620 420252 418259 416786 415730 414900 414256 413803 413394 412737 411604 409935 407701 404757 400985 396646 392362
61605 392362 388538 384884 380798 376196 371685 367802 364424 361105 357695 354288 350781 346905 342725 338702
61591 338702 335176 332056 329128 326388 323892 321495 319002 316476 314155 312086 310018 307696 305199 302915
61577 302915 301210 300068 299051 297721 296136 294861 294372 294529 294683 294267 293277 292218 291644 291658 291819 291605 290990
61560 290990 290476 290535 291158 291992 292728 293253 293568 293677 293529 293060 292448 292287 293181 294982 296720 297602 297862 298355
61542 298355 299526 301133 302805 304328 305387 305601 305062 304524 304756 305852 307307 308545 309256 309511 309759 310510
61526 310510 311712 312575 312306 310987 309574 309016 309500 310442 310934 310263 308310 305658 303158 301249 299648 297816
61510 297816 295666 293758 292782 292918 293767 294852 295978 297057 297774 297711 296819 295518 294307 293443 293017 293054 293318
61493 293318 293353 292990 292641 292730 292905 292293 290640 288799 287907 288342 289723 291584 293594 295286 296179 296353 296523
61476 296523 297243 298272 298986 299259 299623 300616 302296 304396 306616 308615 310001 310587 310613 310526 310581 310747 310934 311164
61458 311164 311497 311886 312145 312069 311607 310942 310318 309820 309402 309122 309192 309757 310761 312048 313451 314721 315590 316127
61440 316127 316853 318322 320592 323240 325821 328182 330419 332652 334854 336891 338803 340927 343412 345632
61426 345632 346590 346174 345545 345826 346805 347510 347700 347979 348611 349172 349619 350840 353623 357562 361475 364518 366490
61409 366490 367482 367756 367761 367726 367359 366327 364885 363608 362603 361428 359752 357717 355666 353902 352711 352215
61393 352215 352090 351764 351097 350640 351070 352470 354218 355428 355485 354433 352990 352099 352307 353530 355276 356986
61377 356986 358269 359156 360175 361904 364296 366615 368168 369006 369784 371028 372616 373908 374295 373701 372623
61362 372623 371721 371361 371578 372355 373744 375691 377911 380033 381847 383491 385528 388765 393694 400032 407010
61347 407010 414219 421866 430092 438322 445666 451796 457072 461789 465653 468247 469834 471553 474662 479523
61333 479523 485280 490574 494695 497946 500824 503127 504176 503806 502641 501313 499815 497865 495530 493186
61319 493186 491132 489608 488961 489345 490379 491567 492980 495104 498091 501741 506265 512357 520206 529053 538136
61304 538136 547579 557834 568728 579729 590777 602037 612961 622361 629407 633852 635359 633599 629251
61291 629251 623978 618779 613061 605954 597880 589991 582530 574843 566897 559743 554111 549316 544080 537990
61277 537990 531700 526040 521442 518112 516245 515842 516528 517753 519236 521123 523613 526443 528933 530714 532250
61262 532250 534338 537190 540388 543812 548108 553863 560654 567456 573937 580787 588559 596616 603669 609196
61248 609196 613824 618298 622499 625639 627103 626778 624861 621831 618540 615819 613766 611725 609120 606106
61234 606106 603228 600734 598504 596486 594872 593847 593446 593714 594815 596929 600090 604179 609002 614365 620180
61219 620180 626460 633163 639978 646359 651914 656867 662043 668086 674595 680349 684646 688148 691937 695952
61205 695952 699060 700681 701558 702601 703754 704632 705633 707596 710687 714543 719442 726411 736007 747703
61191 747703 760665 774403 788318 801346 812662 822316 830593 837120 841263 843217 843981 844231 843852 842731
61177 842731 841404 840446 839552 837751 834496 830160 825390 820340 814771 808664 802357 796045 789422 781951 773296
61162 773296 763425 752490 740855 729066 717512 706156 694832 683712 673099 662741 651909 640520
61150 640520 629884 621790 616834 613977 611798 609759 608091 606863 605606 603700 600727 596427 590739 584074
61136 584074 577258 570958 565321 560324 556231 553484 552336 552870 555120 558774 562985 567047 571288 576802
61122 576802 584235 593321 603704 615633 629519 645306 662681 681623 702295 724605 748260 773076
61110 773076 798874 825213 851462 877010 901244 923670 944413 964310 984027 1003173 1020599
61099 1020599 1035400 1047272 1056102 1061692 1063856 1062458 1057406 1048841 1037172 1022699 1005525 986128
61087 986128 965603 944790 923552 901505 879128 857389 836550 816204 796350 777448 759420
61076 759420 741600 723926 707248 692149 678354 665656 654594 645661 638585 632945 628790 625999
61064 625999 623682 621035 618389 616703 616327 616969 618577 621544 626086 631991 638913 646496 654426 662821 672369
61049 672369 683556 695910 708548 721387 735302 751119 768929 788360 809114 831222 855104
61038 855104 881360 910163 940994 973255 1006956 1042451 1079756 1118656 1159342 1202345 1247852
61027 1247852 1295569 1345229 1396727 1449720 1503653 1558410 1614686 1673765 1737358 1807625 1886777
61016 1886777 1976418 2077595 2191553 2320162 2465764 2631394 2821550 3042505 3301834 3608301
61006 3608301 3972691 4408669 4932913 5565086 6327697 7244341 8335791 9616219 11091417
60997 11091417 12755730 14580966 16496610 18374110 20036335 21303752 22063156 22321511
60989 22321511 22209336 21928393 21673711 21569863 21641037 21809497 21913826 21750652 21142861
60980 21142861 20012838 18418575 16526019 14536022 12614730 10863364 9325563 8008068
60972 8008068 6897239 5969525 5198920 4561216 4034669 3599556 3238697 2937931 2685332
60963 2685332 2470379 2284438 2121565 1978016 1850883 1737426 1635398 1543517 1461432 1389217
60953 1389217 1326623 1272599 1225603 1184340 1147933 1115350 1085113 1055811 1026774 998186 970744
60942 970744 945178 921690 899813 879157 860231 843877 829810 816438 802532 788414 774948
60931 774948 762015 748835 735458 722919 711817 701553 691328 681314 672357 664820 658188 651743
60919 651743 645299 639139 633493 628311 623475 618928 614471 609758 604887 600837 598726 598577 599329 600289 601972
60904 601972 605124 609488 614272 619485 625942 633941 642767 651727 661020 671172 682142 693492 705085
60891 705085 717086 729429 741884 754565 767941 782156 796676 810738 823924 836216 847922
60880 847922 859761 872676 887088 902418 917693 932496 946881 960528 972629 982856 991779 999820
60868 999820 1006256 1009899 1010534 1008993 1005855 1000831 993630 984778 975123 964963 954083 942330 929694
60855 929694 915980 900912 884579 867456 849953 832249 814585 797413 781090 765512 750165
60844 750165 734502 718315 701879 685779 670455 655834 641407 626671 611499 596148 581025
60833 581025 566471 552657 539593 527228 515610 504998 495733 487928 481344 475706 471084 467663 465077
60820 465077 462280 458398 453559 448697 444650 441699 439687 438171 436613 434920 433783 433974 435263 436551
60806 436551 437156 437336 437359 436803 435359 433804 433365 434304 435722 436742 437292 437751 438343 439090 439916 440534 440472 439442
60788 439442 437636 435595 433926 433056 433000 433229 432992 431914 430185 428104 425612 422466 418804 415247 412284
60773 412284 409659 406612 402799 398739 395229 392518 390325 388454 386942 385643 384172 382425 380756 379415
60759 379415 378189 376766 375125 373391 371753 370744 370994 372209 372964 372182 370502 369487 369799 370972 372707
60744 372707 375275 378527 381573 383931 386170 388810 391279 392609 392630 391770 390110 387557 384794 383063 382713
60729 382713 382618 381430 379021 376342 374158 372331 370232 367489 364277 361086 358311 355927 353487 350492 346872
60714 346872 343145 340027 337860 336383 335022 333334 331174 328587 325728 322877 320424 318739 318002 318060 318408
60699 318408 318426 317843 316936 316180 315746 315516 315495 315925 316949 318409 320085 321863 323526 324683 325220 325626 326510
60682 326510 327867 329205 330413 332060 334632 337832 341046 344310 348316 353369 358757 363464 367280 370870
60668 370870 374826 379013 382931 386386 389513 392299 394431 395727 396465 397098 397676 397770 397054 395832 394859 394670
60652 394670 395184 395984 396786 397576 398431 399362 400247 400815 400802 400231 399419 398547 397405 395731 393590 391071 387854
60635 387854 383598 378716 374150 370309 366755 363179 360028 357798 356246 354812 353461 352554 352189 352213 352612
60620 352612 353289 353663 353203 352297 351936 352471 353339 354075 354952 356328 357985 359438 360434 360766 360089 358404 356455
60603 356455 355161 354795 355051 355743 356971 358690 360535 362211 363735 365181 366435 367450 368675 370861 374171
60588 374171 377581 379588 379695 378886 378369 378199 377614 376479 375645 375787 376638 377656 378895 380713 383084 385699
60572 385699 388558 391995 396282 401537 407920 415522 424161 433549 443585 454231 465160 475715 485077
60559 485077 492335 496715 498092 497122 494548 490484 484705 477491 469873 463141 458335 455972 455858 457323 460014
60544 460014 464285 470481 478109 486323 495066 505078 516786 529847 543797 558357 572800 585737
60532 585737 596000 603362 608016 609856 608733 605075 599694 593215 586153 579315 573553 569116 565600 562514
60518 562514 559558 556472 553078 549612 546727 545073 544944 546242 548526 551211 554018 557276 561583 567229
60504 567229 574208 582652 592947 605478 620724 639566 662909 690755 722121 756214 793306 833932
60492 833932 877428 921691 964385 1003905 1039142 1068708 1090709 1103218 1104906 1095424 1075378 1045939
60480 1045939 1008522 964893 917431 868849 821322 775988 733446 694498 659999 629999 603499
60469 603499 579422 557634 538722 522907 509594 498030 487947 479306 471693 464429 457218 450340
60457 450340 444187 438905 434523 431036 428113 425054 421385 417410 413892 411196 408991 406764 404352 401919
60443 401919 399711 397997 397009 396660 396418 395709 394537 393542 393342 393860 394403 394320 393532 392417 391356 390455 389607
60426 389607 388689 387709 386866 386420 386364 386254 385662 384876 384855 386193 388257 389645 389503 388203 386860 386449 387350 389331
60408 389331 391758 394009 395878 397495 398890 399897 400518 401036 401568 401877 401926 402338 403829 406318 409054 411633
60392 411633 414405 417762 421461 424907 427751 429930 431392 432248 433045 434420 436406 438460 440339 442551 445618
60377 445618 449141 452080 453959 455407 457334 459893 462489 464627 466424 468344 470656 473233 475697 477734
60363 477734 479308 480511 481188 480968 479959 479201 479963 482553 486196 490135 494407 499378 505045 511214 518002
60348 518002 525614 533805 542069 550282 558596 566584 572967 576536 577181 575781 573202 569615 564732 558473
60334 558473 551321 544059 537304 531301 526032 521324 516871 512367 507718 503024 498393 493986 490266 487767
60320 487767 486334 484912 482520 479304 476323 474390 473512 473399 474134 476214 480131 485950 493204 501299 510168
60305 510168 520423 532704 547213 564040 583472 605281 627851 648627 665503 677379 683653 683994
60293 683994 678737 668662 654089 634970 612330 588942 567777 550064 535354 523139 513651 507096
60281 507096 502777 499317 495639 491653 488062 485425 483390 480986 477673 473785 469895 466216 462875 460244
60267 460244 458452 456876 454657 451604 448207 444943 442026 439685 438119 437062 435837 433962 431474 428750
60253 428750 426298 424695 424268 424758 425565 426435 427623 429378 431514 433598 435262 436288 436646 436603 436632 437096 438035
60236 438035 439229 440303 440891 440914 440724 440789 441302 442230 443628 445578 447917 450341 452806 455468 458226 460617
60220 460617 462339 463598 464817 466185 467647 469273 471504 474976 479947 485859 491722 497138 502729 509217
60206 509217 516345 523082 528811 533853 538912 544483 550744 557473 563970 569529 574168 578517 582908 587027
60192 587027 590563 593683 596675 599503 601935 603670 604293 603581 602005 600304 598302 594888 589603 583599 578376
60177 578376 574090 569856 565286 560860 556936 553235 549377 545305 541125 537075 533651 531185 529302 527345
60163 527345 525298 523634 522231 520242 517356 514426 512409 511244 510330 509643 509731 510799 512442 514187 515869
60148 515869 517448 518905 520319 521803 523288 524661 526136 528199 531118 534621 538118 541175 543873 546837
60134 546837 550851 556145 562057 567572 572174 576026 579357 582019 583784 584814 585583 586434 587394 588368 589354
60119 589354 590457 591828 593567 595650 597936 600333 602872 605505 607853 609450 610326 611212 612888 615312 617539
60104 617539 618534 618009 616523 614937 613796 612977 611814 609728 606907 604225 602290 600764 598919 596764 595174
60089 595174 594809 595317 595948 596679 598277 601260 605150 608938 612052 614658 617108 619370 621083 621918 621650 619917
60073 619917 616355 611164 605254 599391 593304 586094 577582 568761 560709 553501 546555 539668 533141 527097
60059 527097 521229 515219 508957 502401 495696 489517 484707 481315 478503 475717 473549 472935 473792 475011 475760
60044 475760 476239 477119 478734 481140 484579 489373 495307 501521 507274 512658 518263 524168 529626 533855 536783
60029 536783 538647 539275 538333 536154 533586 530840 527166 522017 515922 509735 503559 497088 490643 485044 480475
60014 480475 476187 471443 466268 461171 456635 452978 450224 447944 445607 443239 441351 440096 438961 437447
60000 437447 435681 434111 432986 432368 432255 432406 432360 431967 431590 431564 431854 432568 434355 437715 442112 446348 449740
59983 449740 452537 455254 458099 461046 463965 466528 468294 469073 469016 468313 466974 464990 462482 459630 456585
59968 456585 453500 450541 447861 445661 444188 443567 443689 444398 445616 447149 448556 449542 450331 451352 452612
59953 452612 453735 454624 455660 457148 458907 460584 462020 463113 463590 463366 463048 463707 465924 469254 472768
59938 472768 475928 478597 480348 480364 478415 475569 473336 472153 471213 469786 468078 466692 465895 465731 466255 467217
59922 467217 468066 468766 470069 472378 474885 476603 477845 479695 482372 485212 488179 492167 497484 503140 508078
59907 508078 512256 515976 518992 520985 522237 523121 523410 522833 521879 521288 521046 520591 519835 519294 519322 519859 520846
59890 520846 522301 524046 525971 528565 532504 537606 542766 547117 550859 554782 559391 564650 570155 575365
59876 575365 579942 584003 587732 590761 592392 592539 591880 590853 589023 585841 581508 576600 571287 565596 560109
59861 560109 555547 551684 547563 543007 539227 537487 537754 539111 541025 543546 546664 550296 554906 561318
59847 561318 569667 579005 588179 596689 604360 610689 614972 616900 616713 614984 612586 610599 609704 609653 609573 608721
59831 608721 606698 603190 598043 591628 584720 577922 571479 565541 560177 555084 549817 544411 539349 534753
59817 534753 530152 525296 520695 516861 513486 509936 506387 503751 502484 502073 501906 502113 503078 504383 504882
59802 504882 503927 502094 500359 498857 496979 494613 492594 491617 491221 490412 488999 487674 486889 486330 485598 484764
59786 484764 484046 483468 483130 483295 483848 484021 483093 481131 478751 476407 474192 472076 469987 467840 465758 464074
59770 464074 462973 462437 462704 464262 466973 469687 471353 472248 473453 475287 476984 477918 478437 479330 481045 483637
59754 483637 487014 490890 494826 498589 502307 506140 510044 514009 518216 522796 527678 532833 538369 544066
59740 544066 549179 553104 556232 559662 563928 568269 571331 572444 572068 571179 570488 570232 570350 570633 570833 570893
59724 570893 571057 571630 572650 573843 574793 575054 574336 572897 571636 571359 571953 572549 572532 572030 571533 571459 572107 573421
59706 573421 574652 574850 574004 573198 573303 574082 574977 576147 578045 580448 582723 584802 587140 589789 592261 594320
59690 594320 596237 598135 599643 600346 600171 599237 597760 596164 594836 593670 592264 590612 589134 587965 586706
59675 586706 585080 583285 581452 579156 575868 571650 567109 562775 558704 554550 549925 544848 539949 536039
59661 536039 533424 531793 530736 530153 530148 530775 531918 533211 534191 534831 535813 537874 540873 543941 546549 548954
59645 548954 551491 553903 555605 556202 555591 553904 551499 548685 545329 541161 536562 532574 529817 527848 525786
59630 525786 523229 520306 517370 514979 513627 512965 511741 509116 505765 503017 501145 499186 496384 493043
59616 493043 489728 486331 482399 477989 473696 469952 466754 464089 462214 461331 461289 461929 463537 466413 469975
59601 469975 472863 474308 475016 476180 477954 479452 480042 479838 478967 477230 474836 472792 472040 472569 473695 474816
59585 474816 475622 476017 476214 476503 476596 475697 473656 471508 470239 469452 467999 465618 463075 460763 458133 454833
59569 454833 451647 449731 449233 449070 448024 445860 443451 441974 441906 442746 443645 444154 444305 444219 444009 443916 444211 444911
59551 444911 445833 446943 448446 450557 453386 456993 461283 465901 470546 475421 481124 488044 496070 504973
59537 504973 514911 526476 540241 556151 573092 589046 601778 609543 611359 607218 598473 587764
59525 587764 577926 570676 566421 565008 566131 568998 572289 574966 576983 578944 581168 583238 584287 583444
59511 583444 580090 574103 566113 557419 549309 542203 535484 528316 520602 512986 506015 499674 493772 488345
59497 488345 483480 479067 475051 471613 468758 466061 463244 460749 459194 458498 458128 458066 458799 460315 461887
59482 461887 463166 464855 467836 472069 476747 481232 485472 489770 494530 499961 505621 510441 513645 515553
59468 515553 517141 518971 520942 522859 524606 525746 525640 524381 523189 523410 525285 528064 531158 534738 539191
59453 539191 544516 550425 556698 563178 569648 575995 582356 588838 595234 601289 607015 612301 616264 617535
59439 617535 615430 610497 603791 596019 587583 578945 570507 562413 554909 548668 544226 541168 538452 535599
59425 535599 533254 532476 533787 536964 541451 546810 553021 560473 569673 581057 595186 612749 633837
59412 633837 657299 681372 705122 728726 752011 773031 788429 795189 792180 780699 764043 746315
59400 746315 730882 719425 712229 709089 709687 713065 716911 717693 711975 698270 677917 654158 630238
59387 630238 608206 588985 572776 559199 547586 537590 529389 523088 518293 514562 511999 510940 511198
59374 511198 512082 513126 514364 515834 517277 518570 520200 522958 527146 532220 537264 541801 546132 550857
59360 550857 556077 561240 565861 570246 575303 581707 589477 598259 607726 617678 628086 639210 651472
59347 651472 665024 679581 694840 710868 727820 745482 763384 781244 798874 815642 830551
59336 830551 843090 853588 862356 868870 872281 872473 869904 864515 855709 843743 830327 817134 804096
59323 804096 789907 773962 757082 740499 724935 710846 698721 688626 679882 671640 663599 655954
59311 655954 649027 643300 639404 637596 637391 638099 639576 642225 646513 652895 661854 673316 686130 698768
59297 698768 710601 721810 731901 738982 740960 737052 727932 715019 700211 685706 673118 662643
59285 662643 653602 645722 639333 634452 630508 627252 625218 624785 625334 625944 626692 628590 632255 637099 641988
59270 641988 646437 651056 656979 664831 674132 683756 692969 701714 709710 715723 718388 717622 714635 710505
59256 710505 705329 698811 691017 682210 672500 662196 652131 643083 635042 627501 620331 613933 608610 604270
59242 604270 600860 598668 597964 598548 599797 601101 602231 603434 605262 608099 611736 615422 618363 620202 621060
59227 621060 621214 620839 620042 618987 617814 616267 613634 609324 603508 596992 590507 584444 579171 575077 572030
59212 572030 569266 566228 563294 561293 560505 560502 560806 561275 561879 562487 562959 563249 563413 563639 564154 564945 565775 566711
59194 566711 568350 571114 574476 577404 579572 581700 584651 588561 592932 597162 600867 603989 606840 609853
59180 609853 613193 616735 620333 623810 626722 628520 629129 629108 629144 629682 631064 633574 637027 640660 643872 646995
59164 646995 650962 656201 662166 668102 673946 680136 686570 692222 696049 698027 698901 699030 698026 695557 691873
59149 691873 687238 681417 674267 666416 658769 651612 644835 638839 634409 631596 629374 626617 623015 618921
59135 618921 614857 611364 608881 607392 606366 605206 603571 601297 598350 594947 591459 588171 585411 583840
59121 583840 584111 586147 589181 592649 596705 601797 608058 615207 622704 629986 636907 643920 651367 658722
59107 658722 665120 670596 676066 682025 688093 693998 700028 706020 710849 713711 715295 716875 718651 719802
59093 719802 719851 719170 718231 717094 715654 713898 711902 709931 708414 707449 706486 704800 702092 698305 693247 686961
59077 686961 680066 673085 665612 656894 647162 637612 628992 620973 613128 605797 599486 593885 588140 582003
59063 582003 576298 572077 569497 567614 565308 562324 559308 556882 554929 552849 550228 547120 543921 541170
59049 541170 539162 537527 535520 533040 531014 530314 530625 530947 530961 531218 532062 533149 534163 535352 537020 538938
59033 538938 540595 541744 542489 543127 544127 546060 549246 553513 558406 563573 569009 575164 582790 592392 603716
59018 603716 615949 628442 640941 653127 664279 673645 680956 686384 690161 692380 693049 692235 690232
59005 690232 687692 685466 684135 683663 683541 683295 682959 683151 684592 687466 691255 695266 699157 702912 706528
58990 706528 709972 713219 715942 717374 716930 714985 712565 710130 707115 702902 697876 693198 689725 687503
58976 687503 686222 685814 686486 688376 691388 695457 700881 708203 717569 728274 739190 749708 760089 770764
58962 770764 781488 791432 800044 807555 814546 821211 827229 832179 835730 837395 836439 832350 825293 815900
58948 815900 804711 792048 778305 763983 749473 735051 721098 707976 695690 684047 673275
58937 673275 664092 656986 651725 647736 644682 642452 640902 639807 638875 637692 635963 633980 632478 631775 631381
58922 631381 630678 629662 628739 628093 627603 627088 626312 625003 623190 621329 619886 619018 618820 619488 620991 623046
58906 623046 625731 629675 635247 642035 649531 657825 667089 676935 686958 697491 709028 721251 733375
58893 733375 745177 756876 768297 779071 789568 800781 813308 827183 842600 859833 878334
58882 878334 896792 914278 930645 945687 958693 969069 976688 981400 982899 981288 977173 970939 962524
58869 962524 952025 939941 926708 912700 898737 885741 873647 861524 849165 837665 827895 819189
58857 819189 810202 800475 790461 780484 770366 759852 748894 737645 726553 716185 706747 698054
58845 698054 690069 682960 676435 669689 662395 655186 648734 642907 637236 631632 626128 620462 614464 608469
58831 608469 602866 597718 593240 590067 588445 587625 586676 585421 584080 582612 581210 580793 582068 584439 586785
58816 586785 589050 592100 596216 600727 605137 609595 614154 618386 621934 624753 626706 627669 628166 629105 630563
58801 630563 631525 631138 629598 627495 624867 621376 616927 611658 605679 599244 592985 587502 582860 578717 574851
58786 574851 571408 568790 567447 567595 568951 570840 572695 574451 576491 579360 583388 588347 593479 598126
58772 598126 602217 605815 608291 608521 606038 601528 596038 590178 584269 578684 573518 568313 562644 556805
58758 556805 551394 546384 541216 535872 531314 528565 527681 527964 528908 530606 533261 536645 540106 542989 545058
58743 545058 546683 548698 551880 556366 561642 567181 572939 579121 585670 592293 598920 605748 612690 619157
58729 619157 624629 629241 633522 637720 641687 645366 648994 652641 655851 658078 659488 661040 663621 667252
58715 667252 671345 675648 680576 686522 693238 700202 707278 714587 721775 727890 732054 733965 733735 731579
58701 731579 727648 721803 713471 702168 688338 673306 658230 643346 628375 613214 598055 583243
58689 583243 569363 557107 546706 537771 529951 523426 518356 514172 509925 505186 500235 495560 491568
58676 491568 488572 486582 485194 484120 483695 484377 485834 487141 487944 488907 490872 494146 498828 505237 513420
58661 513420 522508 531184 538787 545482 551228 555036 555626 552672 547090 540158 532766 525531 519160 514205
58647 514205 510607 507859 505599 503765 502224 500653 498872 496988 495127 493331 491795 490870 490659 490878 491257
58632 491257 491792 492548 493509 494764 496478 498474 500153 501116 501580 501947 502257 502307 502084 501815 501810 502435 503978 506312
58614 506312 508998 511917 515516 520209 525899 532351 539545 547208 554393 560152 564432 567782 570377 571886
58600 571886 572209 571743 570814 569369 567494 565816 565061 565258 565610 565252 564156 563190 563174 564048 565278 566969 570024
58583 570024 575035 581536 588675 596162 604141 612509 620871 628988 636844 644401 651614 658591 665496 672471
58569 672471 679846 688083 697309 707270 718047 730366 744873 761607 780596 802331 826881 852985
58557 852985 878867 903686 927412 949509 968684 983984 995314 1002794 1006352 1006194 1003051 997727 990901
58544 990901 983471 976409 969874 962954 954675 944952 934229 922423 908672 892193 873198 852867 832478
58531 832478 812628 793387 774982 757938 742560 728811 716903 707451 700661 695844 692206 689716
58519 689716 688684 688908 689813 691080 692447 693266 692982 691868 690562 689068 686997 684637 682890 682064 681502 680511
58503 680511 678972 676966 674501 671859 669557 667719 665956 663978 661916 659959 658176 656773 656009 655825 656102
58488 656102 657240 659752 663219 666438 668976 671907 676576 683126 690754 699079 708736 720610 734754 750101
58474 750101 765303 779879 794313 808780 822033 832077 837831 839691 838595 835120 829515 822051 813212
58461 813212 803931 795633 789588 786057 784400 783999 784834 787302 791892 798864 807761 817407 826838 836023 845127
58446 845127 853332 859094 861428 860280 855854 848433 838876 828472 818158 808418 799868 793130 788166 784433
58432 784433 781763 780413 780318 781149 783079 786678 791942 798267 805413 813637 822771 832121 841455 851223 861490
58417 861490 871435 880057 886557 889930 889281 884994 878766 872059 865198 858149 851221 844595 838059 831690
58403 831690 826069 821416 817252 813280 809919 807628 806483 806651 808458 811666 815600 820298 826577 834520
58389 834520 842882 850509 857401 863806 869296 873407 876312 878156 878635 877994 877475 877842 878158 876996 874292
58374 874292 871170 868530 866734 866124 866887 868706 871377 875505 881862 890296 899917 910166 921162 933241
58360 933241 946626 961314 976876 992598 1008078 1023347 1038234 1052176 1064856 1076383 1086525
58349 1086525 1094459 1099738 1102986 1105314 1107671 1110975 1115971 1122514 1129767 1137577 1146766 1157607 1169055
58336 1169055 1180248 1191939 1205461 1220917 1237236 1253531 1269684 1285976 1302776 1320228 1337802
58325 1337802 1354582 1370320 1385561 1400411 1413926 1425167 1434166 1441530 1447899 1454096 1460819 1467743
58313 1467743 1473977 1479830 1486984 1496389 1507302 1519082 1532489 1548149 1565100 1582223 1600078 1619900
58301 1619900 1641509 1663587 1685483 1707586 1730239 1753280 1776360 1799084 1821277 1843594 1867158
58290 1867158 1892160 1917757 1943767 1971246 2000773 2031505 2062761 2095173 2129250 2164135 2198899
58279 2198899 2233815 2269263 2304726 2340059 2376360 2414238 2452605 2490676 2529783 2571602 2615944
58268 2615944 2662115 2711271 2765429 2824968 2888822 2956281 3026912 3099660 3173872 3250522 3330782
58257 3330782 3414102 3499177 3585780 3674040 3762971 3851520 3940155 4029718 4119792 4209991 4301849
58246 4301849 4397530 4497630 4602091 4712230 4829972 4956048 5090687 5234831 5388811 5551249
58236 5551249 5721423 5901411 6093771 6298586 6515045 6744439 6989151 7250239 7528572
58227 7528572 7826695 8146754 8488178 8850391 9236370 9650739 10096226 10575227 11092942
58218 11092942 11655384 12266146 12928998 13651987 14445207 15316663 16274940 17334328 18512980
58209 18512980 19828372 21300308 22957518 24836924 26979400 29433317 32261628 35539730
58201 35539730 39348116 43774421 48923226 54920889 61918439 70104750 79722569 91069536
58193 91069536 104488830 120362739 139088972 161003858 186264780 214744895 245946544
58186 245946544 278872550 311839008 342358391 367305777 383487313 388496936 381511402
58179 381511402 363601040 337346114 305966600 272466880 239184876 207745088 179164212
58172 179164212 153940653 132148554 113582654 97906457 84739666 73696694 64419379
58165 64419379 56603511 49998331 44391480 39605448 35500759 31967256 28909973 26247300
58157 26247300 23915948 21866597 20054671 18440717 16996101 15700252 14533012 13475135
58149 13475135 12514072 11642738 10853075 10135624 9483980 8894203 8360290 7874698 7432683
58140 7432683 7031766 6667276 6332287 6021589 5732192 5460519 5202814 4958177 4727945
58131 4727945 4512120 4309053 4118135 3939938 3773898 3618414 3472927 3337599 3211368
58122 3211368 3092528 2980636 2875653 2775981 2679705 2587128 2499728 2417206 2337953 2261870 2190313
58111 2190313 2123535 2060448 2000684 1944838 1892831 1843861 1797677 1754252 1712669 1672067 1633047
58100 1633047 1596285 1560448 1523452 1485211 1447091 1409198 1370396 1330697 1291593 1254211 1219056
58089 1219056 1187238 1159865 1136273 1114804 1095262 1078793 1065418 1053537 1041801 1029692 1016344
58078 1016344 1000801 983690 966815 950794 934646 917850 901155 885116 869499 854514 841036
58067 841036 829018 817074 804247 791180 779063 768364 758864 750064 741273 732098 722958 714421 706154
58054 706154 697405 688241 679269 670290 660413 649519 638579 628541 619788 612517 606638 601451 596400
58041 596400 591935 588569 585437 581084 575503 570029 565283 560551 555218 549485 543519 537118 530399 523681
58027 523681 516557 508241 498997 490111 482282 475120 468297 462021 456193 450312 444492 439489 435407 431505
58013 431505 427567 424372 422373 420978 419609 418514 417981 417558 416641 415249 413794 412627 412059 412285 412976 413400
57997 413400 413028 411628 408932 404828 399751 394162 387867 380687 373579 368016 364272 361369 358721 356741
57983 356741 355650 354816 353641 352250 351005 350115 349824 350169 350452 349793 348268 346596 344795 342250 339172 336675
57967 336675 335216 334242 333682 334325 336075 337270 336675 335133 334241 334294 334553 334845 335683 337144 338573 339295 339023
57950 339023 337754 335783 333693 332000 330970 330929 332257 334740 337443 339651 341643 344218 347855 352651 358673
57935 358673 365943 374241 383237 392670 402303 411924 421368 430251 437789 443331 447009 449355 450339 449428 446623
57920 446623 442746 438557 434079 428889 422473 414374 404651 394384 385069 377381 371001 365472 360537 355776
57906 355776 350841 346094 342147 338735 335035 331110 327932 325797 323902 321829 320192 319304 318373 316776 315162
57891 315162 314511 314944 316178 318309 321303 324403 326872 328734 330178 330922 330974 331307 332874 335319 337418 338387
57875 338387 338187 337050 335488 334342 334027 333938 333136 331333 328775 325705 322463 319587 317173 314590 311476
57860 311476 308460 306357 305212 304829 305565 307746 310823 314117 317906 322734 327927 331983 334375 335958 337504
57845 337504 338772 339230 338876 338080 337130 336136 334959 333173 330583 327765 325608 324278 323108 321520 319571
57830 319571 317567 315645 313895 312538 311810 311855 312709 314188 315906 317689 319913 323127 327357 331992 336299
57815 336299 339922 342994 345879 348613 350517 350704 349093 346519 343656 340344 336337 332139 328571 325896
57801 325896 323869 322298 321087 320057 319285 319257 320134 321192 321613 321492 321434 321482 321264 320987 321410 322763 324454
57784 324454 325965 327411 329048 330825 332642 334620 336894 339391 341899 344197 346160 347965 350041 352545
57770 352545 355097 357359 359504 361686 363368 363858 363284 362334 361064 358746 355015 350546 346371 342961 340150
57755 340150 337560 334955 332470 330571 329558 329196 329135 329509 330654 332343 333823 334569 334534 333722 332153 330231
57739 330231 328489 326834 324600 321551 318302 315537 313301 311321 309596 308362 307796 308009 308989 310370 311510
57724 311510 312078 312320 312624 313074 313559 314017 314364 314357 313742 312416 310363 307634 304458 301182 298003 294883 291733
57707 291733 288541 285356 282378 280004 278517 277701 277018 276172 275332 274869 275137 276364 278369 280418 281770 282409
57691 282409 282871 283407 283709 283546 283215 283176 283602 284429 285555 286876 288458 290783 294484 299730 306200 313838
57675 313838 323311 335536 351043 370020 392655 419219 449971 485149 524745 567955 612863 656606
57663 656606 695510 725099 740717 739230 720699 688540 648031 604426 561744 522443 487675 457755
57651 457755 432550 411683 394659 380960 370104 361605 354986 349789 345621 342234 339572 337623 336171
57638 336171 334888 333717 332953 332815 333171 333855 334968 336587 338481 340410 342451 344581 346233 346810 346547 346285
57622 346285 346432 346676 346648 346260 345374 343865 342175 341107 340734 340121 338560 336539 334957 333874 332726 331462
57606 331462 330647 330411 330062 329076 328010 327984 329415 331656 333832 335690 337437 339046 340107 340439 340439 340600 340907
57589 340907 341035 340997 341238 342040 343130 343964 344254 344241 344603 345977 348285 350574 351858 352108 352117 352420 352804 352968
57571 352968 353177 353888 355048 356122 356689 356736 356449 356028 355737 355949 357031 359180 362280 365879 369432 372722
57555 372722 376004 379664 383709 387665 390967 393467 395568 397877 400694 403810 406701 408861 410031 410311
57541 410311 410130 409973 410116 410726 412066 414300 417096 419830 422309 424877 427695 430359 432509 434354 436226
57526 436226 438052 439733 441615 444016 446556 448589 450061 451397 452714 453754 454478 455101 455636 455986 456417
57511 456417 457309 458517 459653 460964 463231 466694 470771 474917 479167 483679 488438 493605 499598 506561
57497 506561 514140 521773 528733 534118 537627 540392 544136 549348 555091 560704 566646 573263 579860 585639
57483 585639 590745 595700 600571 605420 610838 617183 623810 629810 634997 639525 643203 646013 648744 652097
57469 652097 655617 658468 660930 664034 667959 671920 675604 679599 684229 688960 693314 697571 702204 707286
57455 707286 712769 718720 724959 730954 736407 741529 746565 751498 756438 761779 767673 773808 780053 786860
57441 786860 794612 802899 810941 818552 826263 834517 843092 851351 858859 865751 872679 880399 889215 898652
57427 898652 907715 915624 922469 929144 936574 944947 953803 962752 971807 981005 990082 998759 1007056 1015049
57413 1015049 1022640 1029916 1037470 1045908 1055131 1064525 1073766 1083090 1092848 1103207 1114187 1125531 1136561
57400 1136561 1146667 1155992 1165223 1174656 1183990 1193177 1202852 1213530 1224757 1235566 1245618 1255523 1266118
57387 1266118 1277772 1290346 1303518 1316971 1330446 1343765 1356882 1369905 1383007 1396250 1409447
57376 1409447 1422307 1434748 1447053 1459652 1472740 1486055 1499009 1511157 1522618 1534039 1546088
57365 1546088 1559046 1572889 1587568 1602991 1618837 1634643 1650175 1665552 1680998 1696601 1712425
57354 1712425 1728727 1745813 1763592 1781402 1798539 1814999 1831401 1848061 1864508 1880297 1895979
57343 1895979 1912574 1930136 1947564 1964102 1980320 1997186 2014754 2032369 2049801 2067391 2085217
57332 2085217 2102794 2119802 2136634 2153969 2172036 2190417 2208491 2226004 2243311 2261043 2279488
57321 2279488 2298393 2317390 2336416 2355627 2375133 2394981 2415203 2435763 2456652 2478020 2499877
57310 2499877 2521703 2542903 2563823 2585608 2608722 2632230 2655025 2677118 2699194 2721545 2744223
57299 2744223 2767603 2791857 2816280 2840133 2863825 2888200 2912917 2936725 2959339 2981858 3005130
57288 3005130 3028865 3052684 3076966 3102103 3127733 3153301 3178719 3204036 3229109 3254019 3279164
57277 3279164 3304488 3329311 3353407 3377674 3403076 3429397 3455569 3480803 3504966 3528357 3551689
57266 3551689 3575884 3601315 3627521 3654027 3680933 3708211 3735069 3760735 3785526 3810349 3835468
57255 3835468 3860493 3885378 3910584 3936251 3961854 3986730 4010460 4032784 4053722 4073816 4093781
57244 4093781 4113836 4133714 4153252 4172576 4191878 4211475 4231963 4253654 4275841 4297248 4317396
57233 4317396 4337053 4357225 4378155 4399553 4421252 4443251 4465373 4487241 4508468 4528678 4547499
57222 4547499 4564755 4580620 4595393 4609129 4621559 4632385 4641715 4650225 4658754 4667556 4676052 4683469
57210 4683469 4689613 4694780 4699111 4702462 4704991 4707410 4710335 4713600 4716522 4718821 4720983 4723578 4726418 4728704
57196 4728704 4730112 4731359 4733404 4736255 4739076 4741484 4744171 4747965 4752760 4757745 4762345 4766447 4769959 4772744
57182 4772744 4774977 4777111 4779453 4782035 4784793 4787482 4789539 4790523 4790723 4790887 4791257 4791273 4790325 4788424 4785963 4783214
57166 4783214 4780300 4777448 4775012 4773360 4772851 4773740 4775963 4779128 4782776 4786546 4790084 4793063 4795340 4796915
57152 4796915 4797620 4796973 4794333 4789006 4780276 4767615 4751017 4730864 4707330 4680066 4648518 4612419 4571980
57139 4571980 4527943 4481540 4434188 4387071 4341184 4297751 4258210 4223606 4194249 4170167 4151601
57128 4151601 4138789 4131469 4128925 4130405 4135210 4142487 4151292 4160953 4171321 4182743 4196145 4213206 4236240
57115 4236240 4267627 4309255 4362452 4428341 4508147 4603162 4714701 4844451 4995104 5170576
57105 5170576 5375698 5616110 5898802 6232598 6627963 7096968 7654405 8319155 9113960
57096 9113960 10063715 11194384 12533322 14109287 15950692 18082833 20525092 23287561
57088 23287561 26366910 29743651 33382609 37234774 41236870 45307708 49344050 53219444
57080 53219444 56788505 59898347 62406236 64197736 65197924 65373548 64730765 63313064
57072 63313064 61198289 58491333 55312892 51788767 48042679 44191725 40342452 36587235
57064 36587235 33001511 29642132 26546861 23735283 21211214 18966142 16983111 15240361
57056 15240361 13713967 12379192 11211447 10187666 9287563 8493611 7790154 7163159 6600998
57047 6600998 6094771 5637462 5222988 4846241 4503430 4191701 3908390 3650886 3416934
57038 3416934 3204660 3012467 2839365 2685304 2550758 2435852 2340098 2262825 2203448 2161348
57028 2161348 2135921 2126712 2132758 2151032 2175133 2195169 2198983 2174877 2115790 2023028 1906289 1778996
57016 1778996 1652333 1532525 1422166 1322616 1234781 1158602 1092867 1035813 985773 941450 901937
57005 901937 866667 835225 807199 782200 759905 739937 721762 704987 689727 676448 665318
56994 665318 655971 648103 642029 638291 636867 637161 638758 641759 646259 652069 659154 667799 677698 687139
56980 687139 693704 695731 692717 684504 670956 652704 631584 609814 588974 569937 553208 538785
56968 538785 526005 514250 503905 496178 491906 490970 492909 497656 505387 516027 529293 544969 562571
56955 562571 580601 596566 608005 613430 612207 604078 589437 569990 548409 526843 506060 486291
56943 486291 468474 454080 443876 437462 434062 433293 435194 440046 448396 460745 476975 496386 518398
56930 518398 542568 567472 590024 606508 614177 611730 598993 577154 549073 518288 487188 456585
56918 456585 427179 400584 378287 360076 344317 329772 316559 305268 295856 287839 281118 275909
56906 275909 271931 268282 264414 260856 258631 258198 259299 261639 265205 270001 275964 283239 292101 302452
56892 302452 313777 325899 339473 355474 374389 396116 420263 445988 471557 494492 512435
56881 512435 523916 528489 526431 518505 505986 490757 475083 460900 449210 440258 434199 431317 431728
56868 431728 435434 442849 454824 471901 493932 520736 552604 589710 631358 676242 722794 768383
56856 768383 808322 836787 849482 845462 826706 796641 759235 718733 679239 644042 615118 593156
56844 593156 578145 570117 569371 576079 590200 612184 643445 685451 738302 800607 870620 946697
56832 946697 1026198 1104123 1173027 1224318 1250394 1247108 1215452 1161094 1091977 1015817 938972 866208
56820 866208 800614 743805 696656 659849 633625 617402 610141 611212 620781 639462 667650 705041
56808 705041 750421 801822 856716 911728 962048 1001536 1024089 1025548 1004972 964780 910041 847150
56796 847150 782238 720008 663482 614333 573209 539865 513436 493036 478319 469574 467262 471409
56784 471409 481473 496692 516373 539737 565589 592186 617134 637174 648506 648071 634969 610629
56772 610629 577714 539070 497558 456145 417442 382851 352228 324614 299596 278044 261261
56761 261261 249305 240454 232578 224739 217206 210406 204489 199633 195984 193214 190688 188135 185688 183333
56747 183333 180942 178837 177634 177326 177122 176390 175226 173937 172630 171488 170836 170588 170251 169750 169591 169939
56731 169939 170271 170388 170947 172293 173550 173699 173070 172824 173417 174478 175905 177938 180224 181813 182325 182346 182505
56714 182505 182861 183388 184312 185643 186907 187717 188189 188553 188819 189149 190115 192177 195139 198455 201823 205123
56698 205123 208016 210068 211298 212290 213662 215614 218074 221083 224780 228997 233104 236494 239159 241559
56684 241559 243927 246058 247827 249546 251454 253192 254175 254363 254337 254657 255462 256549 257495 257762 257079 255792
56668 255792 254549 253591 252603 251209 249345 247187 245030 243307 242382 242171 242168 241926 241347 240463 239216 237560 235632
56651 235632 233658 231791 230067 228413 226584 224156 220729 216287 211507 207577 205347 204502 203872 202760 201659
56636 201659 201338 201617 201618 201069 200718 201340 202849 204559 205906 206629 206596 205823 204579 203236 201908 200318 198055
56619 198055 195080 191986 189578 188023 186610 184613 182256 180507 180058 180786 182115 183445 184202 183963 182754
56604 182754 181045 179311 177794 176657 176109 176239 176944 178062 179440 180917 182520 184557 187168 189761 191279
56589 191279 191146 189751 188022 186873 186984 188505 190757 192613 193535 194023 194891 196369 198081 199543 200478 200965
56573 200965 201604 203279 206316 210007 213276 215809 218286 221609 226134 231653 237861 244798 252885 262477
56559 262477 273357 284857 296604 308912 322033 335078 346106 353526 357374 359109 360300 361615
56547 361615 362936 364002 364731 365069 364897 364190 363053 361410 358842 354977 350021 344708 339694 335104 330627
56532 330627 325906 320817 315443 309892 304209 298543 293226 288418 283677 278311 272367 266908 262971 260429
56518 260429 258184 255225 251185 246164 240538 234940 229939 225689 222128 219389 217633 216580 215674 214637
56504 214637 213471 211987 209933 207650 206005 205460 205658 206073 206598 207197 207472 207012 205995 205091 204887 205525 206750
56487 206750 208115 209268 210138 210791 211234 211572 212258 213745 215809 217620 218604 218922 219020 219091 219141 219220 219326 219349 219307
56468 219307 219463 220095 221323 223208 225671 228246 230269 231460 231991 231902 230869 228808 226361 224481 223713 224018
56452 224018 225048 226393 227762 229059 230135 230520 229799 228341 227252 227395 228660 230245 231372 231707 231535
56437 231535 231616 232509 233958 235320 236496 237836 239162 239685 239146 238247 237583 236874 235731 234519 233825 233587 233353
56420 233353 232941 232222 230753 228350 225727 223840 222754 221734 220260 218374 216224 213938 211915 210687 210463
56405 210463 211140 212674 215045 218023 221320 224837 228431 231711 234492 237147 240094 243127 245713 247672
56391 247672 249093 249898 250099 250192 250592 250831 250092 248496 247173 246913 247361 247662 247350 246420 245018 243359 241677
56374 241677 240073 238539 237179 236248 236024 236735 238404 240598 242662 244451 246449 248819 250843 251852 252268
56359 252268 252997 254147 255187 256136 257620 259723 261688 262985 263911 264894 265865 266613 267203 267751 268219 268643 269172
56342 269172 269754 270186 270561 271301 272678 274682 277290 280369 283427 286070 288668 291930 295808 299589 303063
56327 303063 306765 310895 314974 318858 323156 328055 332559 335578 337154 337960 338189 337753 337111 336988 337406 337746
56311 337746 337716 337660 337896 338329 338854 339716 341330 343912 347297 350949 354207 356716 358642 360470 362747 365969
56295 365969 370239 374867 378787 381685 384335 387496 390948 394117 397261 401311 406674 412879 419415 426277
56281 426277 433549 441023 448464 455915 463531 471451 480037 489873 501218 513647 526454 539241 551962
56268 551962 564737 578032 592740 609527 628090 647595 667987 690381 715941 744883 776977
56257 776977 812532 852209 896172 944285 997107 1055885 1121358 1193426 1272343 1359435 1455923
56246 1455923 1561549 1675025 1795353 1921853 2053168 2187156 2321718 2454933 2584219
56237 2584219 2706088 2817065 2914360 2995405 3057198 3096711 3112143 3103852 3074091 3025631 2960404
56226 2960404 2879555 2784807 2679235 2566363 2448938 2329067 2208973 2090753 1975631 1864287
56216 1864287 1757798 1657444 1563643 1475992 1394398 1319274 1250480 1187054 1128309 1074384 1025333
56205 1025333 980515 939398 902229 869284 839948 813107 788085 764790 743375 724197 707689
56194 707689 693765 681655 670666 660815 652407 645386 639426 634269 629574 624894 620232 616281 613666
56181 613666 612186 611138 610081 608916 607627 606412 605780 605999 606714 607514 608678 610854 614144 617956 621704
56166 621704 625317 629138 633587 638836 644596 650372 656141 662597 670426 679612 689716 700657 712810
56153 712810 726509 741840 758918 777942 798973 821955 847189 875634 908523 946616 989921
56142 989921 1038325 1092500 1153847 1223311 1300371 1383412 1470759 1560835 1651389 1739186 1820767
56131 1820767 1893512 1956227 2009244 2054184 2093334 2128954 2162740 2195153 2224712 2248328 2263057
56120 2263057 2267648 2262413 2248393 2227275 2201184 2171056 2135110 2089963 2033405 1965528 1887698 1801933
56108 1801933 1711504 1620851 1534242 1454890 1385047 1325657 1275753 1233428 1197788 1169018 1146572
56097 1146572 1128706 1114167 1102910 1094651 1088151 1082686 1078921 1077499 1077976 1079924 1083789 1089603 1096063
56084 1096063 1102111 1108431 1116165 1125028 1133931 1142743 1152135 1162275 1172877 1184081 1196150 1208697 1221208
56071 1221208 1233950 1247435 1261415 1275330 1289398 1304388 1320684 1338362 1357755 1379114 1401981
56060 1401981 1425535 1449282 1473041 1496831 1521171 1546726 1573212 1599470 1625011 1650417 1675780
56049 1675780 1700188 1723542 1747424 1773066 1799795 1826697 1854446 1884058 1915064 1946506 1978575
56038 1978575 2011633 2044704 2076746 2108558 2141669 2176169 2211374 2247851 2286959 2329080 2374047
56027 2374047 2422570 2475307 2531200 2588695 2648044 2710450 2775559 2841948 2909621 2979860 3052857
56016 3052857 3127625 3204082 3283149 3364869 3448413 3533960 3622756 3715398 3811796 3912583 4018651
56005 4018651 4129575 4244422 4363928 4489972 4623237 4763381 4911142 5068019 5234055
55996 5234055 5408168 5590559 5782700 5985262 6198389 6423865 6664653 6922374 7197390
55987 7197390 7491088 7805588 8141541 8498843 8879482 9287345 9725577 10196767 10705226
55978 10705226 11256225 11853477 12500494 13204093 13973609 14817563 15744920 16769226 17907912
55969 17907912 19178577 20601036 22203428 24022644 26100430 28485874 31242943 34450499
55961 34450499 38194674 42567483 47674873 53643070 60621945 68796831 78406296 89747354
55953 89747354 103164767 119038153 137759533 159669866 184952292 213523241 244936423
55946 244936423 278247236 311806296 343095048 368838932 385570763 390564317 382770212
55939 382770212 363268858 334946295 301535421 266541707 232569940 201202056 173209141
55932 173209141 148816025 127903067 110159369 95198935 82626021 72061365 63161094
55925 63161094 55634533 49245490 43799251 39133927 35119222 31650723 28639835 26010597
55917 26010597 23702619 21669027 19869688 18269595 16841984 15566851 14425331 13398982
55909 13398982 12473720 11639666 10886602 10203188 9580581 9013018 8494448 8017892 7578424
55900 7578424 7173591 6800510 6455272 6135328 5839596 5565872 5310757 5072388 4850779
55891 4850779 4645247 4453922 4276014 4112034 3961262 3821242 3690244 3568246 3455027
55882 3455027 3349101 3248818 3152619 3057976 2962032 2864025 2765682 2669003 2575079 2484995 2399996
55871 2399996 2320202 2244588 2172575 2104321 2039396 1976795 1916595 1860124 1808030 1759467 1713474
55860 1713474 1669858 1628342 1588129 1548773 1510367 1472479 1433999 1394485 1354792 1316030 1278751
55849 1278751 1243422 1210806 1181423 1155117 1131231 1108788 1086711 1064594 1043094 1022945 1003874
55838 1003874 985221 967110 950037 933712 917468 901572 886980 873975 862083 851097 841080
55827 841080 831550 821872 812330 803623 795438 786747 777369 767903 758089 746676 733298 719217 705805
55814 705805 693304 681529 670827 661803 654632 648934 643921 638743 633241 628236 624500 621774 619546
55801 619546 618290 618909 621274 624491 628298 632887 637520 640729 642110 642727 643591 644852 646517 648707 650887
55786 650887 652006 651785 650909 649732 647712 644287 639231 631885 621113 606536 589098 570232 551269
55773 551269 533716 519083 508005 500179 495231 492892 492411 492740 493313 493752 493010 490005 485105 479723 474415
55758 474415 468538 461818 454758 447306 438602 428446 417608 406286 393752 380031 366519 354298
55746 354298 343257 333539 326253 321748 318595 315466 312830 311654 311496 311201 310579 310107 309666 308845 307885 307170
55730 307170 306288 304698 302818 301354 299981 297785 294614 290913 286593 281278 275564 270875 267854 265722
55716 265722 263433 260868 258831 258305 259691 262414 265347 267935 270634 273941 277495 280603 283192 285536
55702 285536 287364 287982 287167 285319 282796 279630 275809 271396 266445 261191 256253 252241 249147 246382 243386
55687 243386 240155 237284 235544 235133 235366 235489 235696 236797 238963 241622 244595 248327 252634 256310 258560
55672 258560 259898 260877 260868 259054 255961 253007 250987 249852 249431 249411 249056 248023 247200 247712 249282 250545 250855
55655 250855 250829 251117 251675 252381 253471 255029 256676 258041 259053 259567 259199 257776 255632 253286 251032 248898
55639 248898 246773 244531 242111 239343 235702 230678 224564 218412 212817 207316 201460 195927 191867 189489
55625 189489 188054 186966 186129 185442 184716 184037 183505 182704 181132 179111 177577 176928 176671 176225 175452 174368 172934
55608 172934 171287 169635 167824 165431 162401 159240 156591 154893 154300 154391 154127 152680 150353 148267 147200
55593 147200 147175 147964 149307 150642 151330 151308 151037 150770 150393 150018 150083 150690 151404 151880 152281 152906 153843 155085 156625
55574 156625 158304 160030 162164 165242 169209 173383 177312 181187 185184 188868 191588 193170 193936 194242 194176
55559 194176 193579 192200 189937 187005 183841 180840 178184 175698 172838 169195 165240 162135 160443 159455 158300
55544 158300 157179 156740 156679 156053 154822 153964 153915 153891 153148 152013 151176 150716 150435 150536 151331 152580 153707 154485
55526 154485 155103 155748 156438 157168 157981 159013 160507 162510 164523 165756 165829 164869 162948 159934 156055 152030
55510 152030 148358 144900 141475 138423 136192 134712 133570 132579 131807 131236 130664 129834 128463 126399 123940
55495 123940 121799 120500 119968 119793 119704 119635 119577 119559 119596 119558 119278 118851 118579 118600 118782 118968 119001 118635 117881 117337 117539
55474 117539 117965 117452 115826 114318 113946 114199 113869 112561 110749 108872 107124 105781 104977 104335 103485 102756
55458 102756 102746 103359 103902 104008 103793 103205 101968 100324 99163 99138 100022 101103 101827 101938 101461 100708 100017 99333
55440 99333 98408 97488 97297 98084 99150 99690 99808 100238 101319 102771 104375 106314 108621 110739 111992 112321
55424 112321 112257 112233 112256 112168 111916 111436 110633 109715 109300 109849 111073 112251 113042 113658 114245 114533 114204 113248 111758
55405 111758 109708 107186 104595 102381 100689 99522 98941 98878 98938 98796 98691 99173 100304 101426 101793 101227 100149
55388 100149 99231 99098 100078 101954 103994 105427 105952 105801 105359 104868 104398 103934 103336 102392 101109 99893 99216
55371 99216 99061 98958 98597 98068 97327 95933 93752 91633 90717 91166 92105 92870 93653 94762 95845 96299 96043
55354 96043 95475 94883 94297 93756 93356 93133 93116 93430 94145 95079 95888 96302 96176 95551 94762 94301 94416 94951 95612
55335 95612 96123 96120 95354 94192 93454 93392 93242 92249 90808 89996 90201 90790 91095 91139 91283 91678 92304 93180 94314
55316 94314 95590 96852 97994 98942 99703 100380 100996 101350 101246 100766 100132 99383 98478 97623 97141 97052 97127 97290 97631
55297 97631 98058 98458 99185 100816 103136 104944 105328 104726 104311 104582 105157 105719 106465 107532 108591 109315 109843
55280 109843 110437 110986 111209 111118 110840 110091 108351 105727 103198 101697 101163 100831 100296 99895 100012 100391 100392 99784
55262 99784 99053 98925 99703 101059 102356 103177 103568 103874 104337 104873 105190 105105 104791 104720 105240 106141 106750 106582 105847
55243 105847 105191 104988 105015 104762 103911 102584 101207 100145 99379 98674 98097 98056 98642 99238 99196 98728 98627 99210 100024
55224 100024 100569 100758 100646 100290 100076 100571 101739 102822 103310 103589 104211 105012 105488 105638 105847 106164 106289 106160
55206 106160 105991 105834 105615 105541 105939 106636 106998 106717 106118 105563 104965 104151 103335 102926 102999 103243 103368 103399 103520 103713
55186 103713 103648 103042 102141 101636 101975 102832 103434 103335 102708 102027 101625 101465 101238 100809 100624 101346 102865 104067 104047
55167 104047 103258 102920 103476 104315 104989 105905 107514 109420 110764 111133 110723 109879 108939 108342 108378 108777 108835 108133
55149 108133 106992 106102 105811 105833 105620 104909 103874 102880 102297 102516 103824 105983 108137 109459 109924 110210 110871
55132 110871 111817 112573 112760 112352 111728 111534 112196 113422 114383 114504 113976 113410 113186 113204 113118 112666 111856 110926 110123
55113 110123 109562 109315 109482 109978 110392 110336 109916 109612 109713 110165 110916 112016 113199 113778 113283 112070 111069 110950
55095 110950 111670 112771 113979 115411 117155 118738 119363 118927 118463 119118 120767 122194 122661 122687 123076 123794 124253
55078 124253 124299 124348 124714 125253 125657 125757 125628 125616 126133 127101 127775 127488 126527 125833 125827 125976 125668 125108 125021 125663 126483
55057 126483 126727 126118 124897 123456 122130 121262 121146 121723 122437 122620 122064 121065 119887 118478 116896 115738
55041 115738 115735 116868 118188 118685 118235 117545 117306 117577 117965 118168 118186 118123 117986 117758 117531 117437 117512 117750 118284 119351
55021 119351 120946 122514 123161 122337 120369 118252 116779 115983 115500 115274 115514 116051 116303 116191 116546 118064 120163
55004 120163 121510 121628 121339 121543 122207 122828 123323 123973 124869 125908 127163 128767 130497 131859 132614 132919 132968
54987 132968 132790 132461 132210 132130 131965 131423 130597 129863 129359 128756 127711 126390 125295 124606 124048 123545 123593 124590
54969 124590 126059 127113 127619 128303 129565 130779 131108 130557 129769 129104 128414 127563 126708 126114 126061 126789 128163
54952 128163 129398 129542 128368 126528 124903 124007 123955 124510 125069 125004 124312 123649 123513 123640 123436 122835 122447 122887
54934 122887 124167 125746 127036 127866 128505 129251 130023 130494 130667 131115 132499 134907 137790 140439 142475 144028
54918 144028 145665 148061 151473 155557 159814 164157 168753 173333 177036 179140 179674 179080 177520 174873 171326
54903 171326 167486 163811 160222 156470 152650 149157 146346 144427 143506 143412 143551 143233 142247 140924 139675 138706
54887 138706 138188 138364 139199 140106 140369 139907 139441 139736 140837 142225 143642 145406 147804 150496 152973 155486
54871 155486 158947 163743 169090 173923 178086 182156 186286 189688 191236 190214 186610 181229 175544 170816
54857 170816 167057 163183 158432 153269 148672 144970 141772 138793 136215 134325 133124 132341 131578 130502 129126
54842 129126 127845 127042 126725 126716 127014 127682 128439 128749 128341 127487 126686 126242 126088 125835 125074 123854 122750 122221
54824 122221 122028 121645 121161 121222 121994 122767 122919 122780 123010 123491 123460 122640 121586 120884 120663 121104 122660 125244
54806 125244 127675 128665 128227 127473 127084 126681 125811 124865 124594 125153 126096 127058 128008 128978 129927 130833 131655 132290
54788 132290 132765 133316 134040 134722 135240 135801 136412 136459 135479 134161 133825 134896 136574 138101 139576 141230 142695
54771 142695 143583 144279 145534 147534 149936 152631 155941 160042 164583 168930 172637 175819 179206 183585 188865
54756 188865 193890 197465 199380 200101 199719 197773 194073 189210 184058 179113 174416 169873 165443 161164 157137
54741 157137 153474 150279 147711 145984 145177 145070 145299 145581 145765 145806 145844 146194 147021 148086 148899 149157 148948 148744
54723 148744 149250 151006 153905 157201 160169 162671 165032 167635 170775 174605 178927 183220 187077 190371
54709 190371 192705 193081 190695 185974 180390 175173 170533 166058 161483 156995 153039 149986 147840 146296
54695 146296 145078 144064 142993 141424 139311 137326 136218 135988 136045 135998 135937 136073 136518 137214 137774 137628 136753
54678 136753 135954 135929 136374 136620 136838 137702 139092 140099 140380 140535 140915 141000 140334 139212 137979 136440 134570
54661 134570 133084 132607 132775 132782 132384 131766 130920 129918 129423 130067 131409 132259 132093 131517 131266 131284 130986 130080 128939
54642 128939 128340 128858 130343 132013 133194 133815 134081 134005 133599 133248 133398 133967 134514 134911 135428 136178 136884 137288
54624 137288 137445 137581 137874 138397 139043 139508 139571 139294 138770 137822 136374 134960 134358 134663 135118 135050 134590 134307 134428
54605 134428 134745 135092 135593 136417 137444 138307 138732 138769 138591 138208 137584 136987 136788 136792 136169 134451 132309 130895
54587 130895 130605 130903 131200 131337 131270 130895 130327 129893 129692 129600 129821 130886 132757 134451 135054 134888 135104 136187
54569 136187 137334 137457 136480 135404 135262 136231 137761 139247 140401 141083 141214 140984 140889 141261 141914 142468 142834
54552 142834 143083 143061 142590 142008 141999 142783 143858 144623 144845 144470 143532 142582 142737 144729 148003 151144 153193 154302
54534 154302 155199 156287 157323 157800 157533 156882 156329 155958 155516 154949 154508 154227 153710 152673 151413 150408 149690
54517 149690 148948 148070 147220 146518 146019 145920 146400 147286 148178 148918 149556 149892 149506 148411 147327 146989 147366 147719
54499 147719 147329 146056 144376 143010 142379 142292 142255 142188 142573 143709 145016 145465 144688 143416 142747 143224 144700
54482 144700 146754 148939 150733 151682 151738 151301 150824 150538 150676 151657 153648 155983 157461 157480 156676 156224 156608
54465 156608 157377 158042 158866 160542 163123 165574 166595 165981 164922 164771 165641 166496 166537 165991 165404 164768 163814
54448 163814 162791 162254 162128 161616 160215 158338 156706 155525 154560 153737 153266 153251 153531 153892 154272 154659 154860
54431 154860 154484 153341 151878 151010 151273 152305 153419 154471 155695 156883 157463 157461 157680 158602 159786 160746 161712
54414 161712 162905 163746 163695 163459 164263 166034 167280 166957 165602 164450 164232 165081 166733 168324 168733 167776 166546
54397 166546 166060 166069 165794 165262 165151 165652 166388 167324 168917 171280 173877 176155 177889 178798 178509 177199 175739
54380 175739 174836 174356 173789 173019 172274 171644 171050 170540 170241 170081 169897 169825 170330 171739 173903 176358 178700 180673
54362 180673 182052 182671 182737 182950 183999 185842 187688 188858 189411 189742 189898 189700 189381 189521 190278 191124 191577
54345 191577 191845 192539 193957 195761 197201 197573 196782 195546 194770 194517 193881 192020 189108 186066 183628 181876
54329 181876 180486 179126 177746 176649 176126 175953 175487 174401 173052 171914 171032 170280 169784 169669 169677 169504 169256
54312 169256 169063 168475 166923 164726 162927 161985 161243 160012 158616 157912 158160 158828 159351 159564 159428 158781 157591
54295 157591 156321 155824 156740 158896 161274 162711 162696 161560 160031 158825 158545 159546 161593 163835 165361
54280 165361 165897 165882 165921 166238 166567 166518 166037 165523 165375 165476 165264 164359 162907 161288 159746 158486 157900 158362
54262 158362 159809 161727 163589 165163 166444 167466 168289 169057 169980 171218 172756 174273 175199 175036 173778
54247 173778 172037 170733 170489 171221 172247 172857 172764 171986 170506 168398 166314 165359 166035 167459 168058 167093 165217
54230 165217 163506 162368 161627 161238 161443 162225 163046 163291 162828 162035 161459 161500 162245 163399 164404 164834 164735 164571
54212 164571 164779 165386 166026 166365 166481 166798 167552 168392 168671 168164 167320 166664 166126 165236 163902 162702 162293 162673
54194 162673 163201 163245 162708 161988 161556 161584 161880 162082 161899 161230 160166 159000 158117 157769 157913 158351 159029 160073
54176 160073 161464 162764 163253 162434 160534 158566 157739 158544 160359 162020 162745 162440 161346 159797 158376 157833
54160 157833 158494 159907 161328 162381 163053 163229 162689 161555 160397 159702 159429 159235 159017 159058 159680 160891 162376
54143 162376 163686 164392 164180 163038 161385 159867 158930 158617 158771 159239 159765 159999 159918 160050 160909 162333 163760
54126 163760 165026 166329 167487 167943 167722 167677 168337 169078 168947 167926 166830 166345 166716 168026 170067 172109
54110 172109 173470 174254 174943 175432 175190 174295 173522 173308 173337 173319 173390 173531 173336 172767 172465 172838 173430 173749 174149
54091 174149 175209 176649 177614 177838 177831 178018 178290 178413 178328 177995 177444 177065 177351 178219 178964 179108 178994 179370 180595
54072 180595 182416 184361 186109 187511 188361 188335 187407 186401 186739 189210 193045 196600 198990 200757 202958
54057 202958 205969 209318 212393 215193 218510 223358 229951 237228 243783 249307 254644 260206 264867 266896
54043 266896 265775 262647 259150 256319 254502 253694 253653 254060 254865 256364 258825 262215 266412 271345 276682
54028 276682 281637 285472 288105 289971 291413 292571 293732 295196 296641 297141 296137 294065 291734 289452
54014 289452 287172 285098 283448 281770 279260 275869 272412 269308 265895 261478 256571 252378 249303 246649
54000 246649 243776 240909 238590 236846 235223 233347 231181 228870 226627 224670 223082 221740 220518 219511
53986 219511 218869 218472 217908 216874 215444 213935 212585 211514 210859 210734 210959 211039 210548 209496 208226 207094
53970 207094 206371 206294 206873 207703 208261 208472 208714 209228 209853 210422 211085 212051 213337 215005 217278 220093 222891
53953 222891 225297 227674 230464 233223 235118 236400 238570 242778 248685 255304 262303 269825 277467 284289
53939 284289 289791 294206 297764 300332 302054 303743 306116 308907 311193 312504 313209 313881 314690 315571 316623
53924 316623 318112 320225 322954 326110 329357 332446 335629 339648 345017 351393 357939 364299 370912 378410
53910 378410 386997 396492 406497 416281 424915 432006 438239 444878 452768 461949 471990 482265 491949
53897 491949 500098 505747 507674 504283 494473 478935 460193 440969 422613 405220 388767 373573
53885 373573 359809 347145 335111 323610 312993 303772 296248 290238 285155 280468 276074 272098 268504
53872 268504 265170 262266 260114 258588 256990 254769 252059 249329 246747 244174 241604 239251 237314 235940
53858 235940 235234 234940 234244 232397 229632 226995 225126 223634 221906 219978 218254 216789 215418 214330 213849
53843 213849 213753 213493 213097 213176 213851 214347 214061 213469 213425 214002 214630 215126 215837 216849 217724 218168 218352 218366 217950 217169
53823 217169 216887 217963 220142 222230 223345 223627 223763 224267 225325 226926 228823 230560 231819 232720 233675 235080
53807 235080 237215 240201 243833 247633 251377 255444 260297 265687 270817 275336 279704 284350 288888 292591
53793 292591 295373 297851 300524 303324 305998 308470 310686 312419 313434 313748 313582 313145 312510 311587 310217
53778 310217 308338 306041 303297 299780 295188 289705 283837 277854 271753 265825 260747 256905 253924 251171
53764 251171 248471 246045 243962 241987 239935 237898 236060 234397 232585 230246 227409 224655 222611 221352
53750 221352 220590 220322 220752 221530 221748 221070 220282 220253 220779 221091 221057 221185 221634 222020 222156 222284 222503 222654 222926
53731 222926 223920 225788 227838 229316 230248 231177 232422 233914 235452 236804 237790 238563 239653 241418 243568
53716 243568 245447 246715 247582 248504 249848 251736 253955 256036 257581 258608 259540 260868 262773 264963 266938
53701 266938 268550 270296 272864 276363 280168 283527 286166 288361 290714 293843 297885 302125 305449 307420
53687 307420 308639 309833 310838 310868 309606 307683 306034 305089 304656 304360 303970 303380 302503 301334 300061 298902
53671 298902 297811 296603 295465 295022 295522 296209 295999 294690 293061 291777 290767 289776 288883 288187 287461 286553
53655 286553 285776 285538 285818 286361 287068 287822 288209 287894 287060 286144 285340 284807 285096 286742 289458 292257 294425
53638 294425 295988 297251 298394 299616 301174 303033 304878 306665 308779 311392 314009 316034 317550 319242
53624 319242 321623 324647 327905 330885 333172 334877 336901 340270 344920 349505 352877 355568 359258 364767
53610 364767 371105 376729 381200 385168 389159 393100 396916 400859 404970 408758 411681 413689 415105 416288
53596 416288 417595 419307 421330 423274 424996 426816 428965 431263 433538 435860 437936 438690 437065 433072
53582 433072 427656 421797 416152 411217 407168 403621 400120 396808 394150 392122 390218 388134 385881 383369
53568 383369 380576 378109 376855 376909 377493 378018 378605 379412 380219 380949 381872 382919 383521 383613 384120 385785 387981
53551 387981 389441 389837 390077 391241 393771 397472 401671 405514 408617 411425 414626 418430 422814 428099 434615
53536 434615 441975 449380 456621 464163 472274 480715 489445 498976 509747 521597 534103 547019 560193
53523 560193 573497 587150 601776 617805 635013 652896 671272 690348 710424 731716 754238
53512 754238 777698 801717 826266 851550 877319 902751 927379 951759 976749 1002398 1028045
53501 1028045 1053288 1078274 1103002 1127002 1149925 1172014 1193705 1215023 1235700 1255717 1275433
53490 1275433 1295205 1315098 1334946 1354565 1373836 1392711 1411209 1429440 1447594 1465805 1483935
53479 1483935 1501501 1517883 1532606 1545380 1555973 1564193 1569968 1573231 1573759 1571305 1565958 1558182 1548411
53466 1548411 1536812 1523533 1508920 1493242 1476444 1458549 1440243 1422600 1406002 1389601 1372038
53455 1372038 1352548 1331260 1308751 1285685 1262735 1240378 1218598 1197090 1175906 1155627 1136708
53444 1136708 1118930 1101901 1085999 1072367 1061794 1053862 1047410 1041675 1036797 1033341 1031563 1031149 1031496
53431 1031496 1032229 1033622 1036553 1041899 1049818 1059562 1070048 1080680 1091748 1104100 1118388 1134569 1152132
53418 1152132 1170746 1190547 1211785 1234445 1258389 1283703 1310678 1339556 1370588 1404221 1440865
53407 1440865 1480334 1521834 1564639 1608580 1653807 1700426 1748606 1798811 1851507 1906688 1963847
53396 1963847 2022377 2081794 2141619 2201295 2260352 2318673 2376613 2434710 2493012 2550630 2606305
53385 2606305 2659507 2710606 2759751 2806101 2848610 2887113 2922015 2953193 2979982 3002050 3019425
53374 3019425 3031651 3037910 3038283 3033874 3025116 3010718 2989113 2960225 2924926 2883303 2834835 2780301
53362 2780301 2722263 2663120 2603436 2542703 2481093 2419800 2360005 2302219 2246579 2193234 2142275
53351 2142275 2093527 2046545 2000805 1955971 1912031 1868995 1826424 1783611 1740497 1698096 1657634
53340 1657634 1619482 1583402 1549625 1518919 1491409 1466122 1442223 1420184 1401072 1384910 1370479
53329 1370479 1356608 1342861 1328905 1314139 1298470 1282792 1267992 1253954 1240231 1227290 1216145
53318 1216145 1206877 1198460 1190197 1182487 1175919 1170573 1166740 1165482 1167534 1172057 1177369 1182763 1188914 1196619
53304 1196619 1205965 1216792 1229236 1243460 1259363 1276827 1295948 1316805 1339290 1363379 1389254
53293 1389254 1416910 1445888 1475552 1505457 1535229 1564327 1592171 1618428 1642969 1665602 1686000
53282 1686000 1703881 1719141 1731795 1741793 1748900 1752795 1753355 1750731 1745047 1736181 1724112 1709365 1692750
53269 1692750 1674561 1654345 1631558 1606310 1579342 1551473 1523106 1494143 1464283 1433526 1402318
53258 1402318 1371029 1339416 1306989 1273940 1241310 1210062 1180307 1151652 1123952 1097352 1071733
53247 1071733 1046518 1021113 995396 969708 944442 919672 895227 871065 847456 824715 802999
53236 802999 782522 763722 746925 732071 719106 708341 699802 692437 684727 676153 667334 658642 649512
53223 649512 639437 628674 617377 604867 590620 575377 560357 545748 530962 516107 502147
53212 502147 489529 477686 466183 455491 446142 437789 429663 421573 413836 406392 398553 389838 380818
53199 380818 372799 366507 361121 354984 347406 339448 332672 327520 323379 319781 316722 313951 310879 307409
53185 307409 304150 301483 299041 296385 293638 291033 288462 285970 284193 283641 283792 283480 282155 280332 278903
53170 278903 278352 278510 278697 278186 276847 275255 273919 272578 270704 268511 266963 266665 267124 267254 266341 264420
53154 264420 261995 259577 257439 255663 254380 253821 254020 254609 255091 255212 254914 254116 252858 251579 250895 251052
53138 251052 251863 253106 254632 256047 256752 256581 256159 256360 257465 259001 260269 260921 261079 261060 261011 260834 260542
53121 260542 260585 261562 263499 265648 267176 267935 268401 269000 269651 269931 269495 268375 266994 265880 265232 264756 264027
53104 264027 262995 261984 261182 260308 258953 257184 255617 254799 254602 254367 253598 252418 251328 250691 250519 250640
53088 250640 250876 251134 251469 252085 253121 254429 255627 256423 256830 257094 257481 258079 258706 259021 258833 258277 257584 256758
53070 256758 255676 254515 253852 254160 255279 256445 256830 256108 254631 253075 251824 250728 249557 248556 248246
53055 248246 248707 249396 249753 249743 249665 249800 250433 251895 254187 256715 258702 259816 260116 259540 257863 255249 252563
53038 252563 250919 250894 252097 253360 253500 252132 249887 247788 246504 246157 246513 247046 247150 246788 246854 248350 251105
53021 251105 253754 255124 255266 254907 254377 253465 252084 250634 249728 249805 250932 252687 254175 254427 253117 250959
53005 250959 249284 248960 249661 250375 250645 250978 251805 252617 252743 252623 253347 254950 256177 256266 256008 256440 257348 257923
52987 257923 258283 259282 261074 262902 264223 265193 265977 266448 266780 267540 268889 270296 271304 272086 273008 274153
52971 274153 275549 277263 279015 280229 280871 281737 283478 285794 287963 289741 291209 292181 292421 292234 292166 292208
52955 292208 291810 290690 289160 287607 286062 284336 282331 280158 278153 276720 275947 275510 275117 274768 274291 273038
52939 273038 270650 267942 266261 265905 265821 265020 263695 262627 262065 261636 261022 260192 259155 257944 256832 256207
52923 256207 256168 256416 256546 256267 255435 254137 252805 252011 252008 252445 252655 252275 251587 251254 251641 252466 253152 253470 253698
52904 253698 254127 254573 254551 253876 252986 252526 252633 252762 252375 251706 251571 252317 253243 253315 252267 250730 249419 248568
52886 248568 248152 248293 249207 250871 252810 254222 254470 253707 252915 252995 253787 254314 254073 253697 254165 255662 257476
52869 257476 258824 259584 260277 261533 263470 265501 266843 267279 267239 267128 266922 266568 266409 266789 267401 267457 266528 264989
52851 264989 263637 263027 263061 262996 261910 259466 256205 252913 249762 246408 242840 239741 237813 237053 236846 236524
52835 236524 235706 234386 233053 232521 233252 234790 236133 236689 236704 236769 237173 237811 238405 238660 238401 237820 237456 237674
52817 237674 238235 238620 238680 238700 238881 239144 239436 239783 239920 239415 238482 238249 239588 241907 243685 244149 243847 243530
52799 243530 243110 242012 240080 237701 235268 232936 230831 229200 228311 228248 228733 229132 228895 228079 227212 226592 226007
52782 226007 225331 225028 225710 227353 229248 230622 231150 231085 231114 231831 233027 233758 233531 233155 233841 235558 236923
52765 236923 236835 235646 234470 233877 233651 233480 233350 233375 233577 233848 233925 233507 232598 231663 231251 231478 232062 232780 233695
52746 233695 234954 236547 238302 239973 241329 242284 242958 243531 244017 244372 244864 246153 248781 252538 256459 259524
52730 259524 261354 262324 263122 264227 265642 266924 267495 267098 265996 264661 263286 261772 260142 258655 257399
52715 257399 256110 254692 253656 253561 254098 254227 253402 252206 251508 251316 250816 249432 247472 245726 244755 244630 245116
52698 245116 245910 246749 247499 248202 249034 250134 251410 252543 253259 253566 253669 253704 253713 253903 254632 255960 257359 258157
52680 258157 258161 257631 256692 255168 253100 251082 249759 249157 248795 248453 248471 249175 250295 251210 251645 251847 252112 252477
52662 252477 252928 253574 254373 254917 254863 254484 254418 254918 255745 256853 258643 261294 264273 266920 269175 271181 272462
52645 272462 272257 270760 269271 268754 268779 268343 267278 266213 265394 264290 262484 260344 258555 257408 256863 257015
52629 257015 258071 259979 262434 265238 268411 271859 275153 277738 279306 279941 279987 279744 279195 277986 275814
52614 275814 272911 270015 267755 266076 264486 262845 261738 261809 262790 263502 263004 261596 260489 260528 261464 262490
52598 262490 263204 263883 264940 266374 267780 268823 269571 270285 270865 270727 269470 267586 266176 265912 266573 267711
52582 267711 269331 271573 274021 275880 276804 277141 277302 277253 276765 275845 274739 273697 272924 272622 272900 273646 274565
52565 274565 275266 275363 274712 273681 273028 273292 274234 274978 274785 273698 272432 271583 271024 270203 268989 267859 267091
52548 267091 266218 264766 263233 262690 263409 264539 265228 265483 265664 265803 265909 266379 267410 268282 267935 266246 264216
52531 264216 262854 262378 262526 263109 264014 264998 265813 266402 266856 267250 267569 267727 267686 267666 268087 269084 270214 270975 271557
52512 271557 272715 274884 277820 281109 284532 287758 290261 291944 293491 295578 297893 299431 299638 298807 297303
52497 297303 294967 291622 287797 284484 282176 280491 278797 276883 274840 272618 270169 268000 267073 267859 269732
52482 269732 271593 272918 273882 274703 275340 275901 276830 278389 280190 281512 282046 282186 282645 283803 285357 286606
52466 286606 287215 287677 288800 290853 293488 296502 300140 304384 308378 311017 311925 311517 310241 308190 305382
52451 305382 302017 298395 294851 291757 289284 287097 284625 281771 279131 277324 276285 275403 274265 273094
52437 273094 272446 272553 273001 273074 272474 271637 271226 271377 271626 271533 271132 270686 270256 269756 269322 269366 270202 271728 273512
52418 273512 275184 276763 278642 281183 284307 287483 290219 292569 295167 298792 303840 310100 316961 323906
52404 323906 330925 338484 347028 356400 365564 372882 376839 376821 373308 367320 359759 351402 343274 336408 330987
52389 330987 326129 320933 315597 311137 308189 306592 306047 306560 308001 309771 311376 313073 315535 319011 323143
52374 323143 327496 331865 336138 340191 344018 347712 351328 354977 358983 363559 368245 372048 374272 375004
52360 375004 374754 374017 373272 372917 372816 372340 371283 370452 370796 372199 373699 374855 376223 378354 380994 383614
52344 383614 386234 389230 392622 396119 399771 404080 409344 415312 421694 428782 437252 447359 458571 470122
52330 470122 481881 494489 508604 524170 540611 557669 575814 595696 617379 640254 663541
52319 663541 686714 709527 731886 753800 775322 796428 816952 836680 855466 873299 890325
52308 890325 906821 923014 938811 953804 967646 980400 992368 1003571 1013625 1022215 1029500 1035800
52296 1035800 1041039 1044862 1047235 1048528 1048835 1047619 1044212 1038480 1030767 1021575 1011548 1001452 991729 982299
52282 982299 973235 965384 959747 956416 954763 954610 956448 960392 965791 972206 980095 990003 1001651 1014449
52268 1014449 1028413 1043875 1060557 1077638 1094597 1111323 1127491 1142543 1156389 1169583 1182585
52257 1182585 1195243 1207130 1218034 1227963 1236937 1244960 1252061 1258317 1263873 1268690 1272004 1272424 1269082
52244 1269082 1262558 1254129 1244302 1232776 1219721 1206120 1192615 1178930 1164864 1151070 1138173 1125802
52232 1125802 1113246 1100688 1089010 1078702 1069659 1061889 1055631 1050763 1046747 1043225 1040231 1037830 1036070
52219 1036070 1035242 1035592 1036747 1037984 1039202 1041130 1044396 1048888 1054166 1060001 1066244 1072635 1079056 1085666
52205 1085666 1092539 1099513 1106504 1113548 1120244 1125656 1129218 1131497 1133698 1136607 1140301 1144563 1149128 1153676
52191 1153676 1157930 1161719 1164788 1166882 1168267 1169830 1172178 1174883 1176964 1177858 1177488 1175773 1172729 1168793
52177 1168793 1164312 1158762 1151291 1142104 1132523 1123463 1114621 1105576 1096955 1089887 1084677 1080671 1077222 1074365
52163 1074365 1072633 1072630 1074608 1078176 1082484 1086945 1091646 1096828 1102174 1106886 1110285 1112083 1112356 1111601 1110660
52148 1110660 1110182 1110158 1110230 1110260 1110327 1110414 1110587 1111338 1113219 1116116 1119276 1122126 1124655 1127017 1129239 1131585 1134795
52131 1134795 1139697 1146734 1155994 1167510 1181380 1197776 1216955 1239043 1263744 1290483 1319025 1349668
52119 1349668 1382595 1417163 1452042 1486027 1518579 1549612 1578937 1606010 1630241 1651461 1669924
52108 1669924 1685799 1698839 1708729 1715525 1719473 1720616 1719095 1715739 1711769 1707663 1702790 1696476 1689076
52095 1689076 1681628 1674692 1667913 1660575 1652203 1642613 1631780 1619796 1606840 1593064 1578530 1563245
52083 1563245 1547344 1531444 1516868 1505202 1497305 1492751 1490402 1489567 1490538 1494122 1500748 1510010 1521012
52070 1521012 1533177 1546623 1561673 1578163 1595538 1613490 1631909 1650140 1666953 1681721 1695184
52059 1695184 1708375 1721028 1731633 1739018 1743238 1744942 1744562 1742426 1739124 1735132 1730234 1723684 1715009
52046 1715009 1704404 1692281 1678538 1662426 1643231 1621105 1597100 1572273 1546954 1521104 1495232
52035 1495232 1470537 1447986 1427550 1408584 1390754 1374349 1359747 1346817 1335028 1324053 1314136
52024 1314136 1305619 1298118 1290423 1281479 1271321 1260735 1250113 1239138 1227644 1216208 1205481 1195280
52012 1195280 1184885 1174058 1163169 1152241 1140437 1126826 1111313 1094484 1076809 1058426 1039566
52001 1039566 1020654 1001837 982807 963323 943616 924009 904432 884731 865405 847573 832088
51990 832088 818891 807344 796914 787412 778755 770744 763043 755308 747386 739347 731160 722323 712091
51977 712091 700222 687264 673982 660721 647531 634661 622538 611386 601225 592330 585306 580547
51965 580547 577756 576211 575496 575913 578191 582768 589288 596767 604285 611483 618370 624749 629988 633388 634688
51950 634688 634131 632074 628606 623651 617409 610573 604079 598818 595651 595310 597848 602400 608046 614931 623971
51935 623971 635345 647909 660413 672575 684418 695091 703218 708206 710383 709881 706169 698887 688454
51922 688454 675489 660185 642696 623890 605190 587716 571758 557054 543368 530874 520105
51911 520105 511513 505064 500286 496732 494369 493571 494861 498554 504525 512457 522385 534770 549673 566108
51897 566108 582604 598217 612437 624186 631697 633712 630332 622353 610303 594618 576388 557263
51885 557263 538622 521186 505429 491952 481268 473451 468151 464913 463505 464019 466638 471211 477043
51872 477043 483179 488951 494323 499741 505545 511428 516489 519944 521700 522043 520892 517768 512621 506338
51858 506338 500190 494939 490653 487191 484584 482958 482335 482674 484070 486746 490651 495048 498736 500857 501336
51843 501336 500422 498129 494500 490097 485661 481320 476682 471728 467048 463034 459427 455838 452272 448929
51829 448929 446027 444054 443593 444471 445590 446072 446131 446296 446265 445242 443083 440373 437523 434520 431575 429238
51813 429238 427710 426591 425549 424865 425132 426705 429534 433198 436992 440265 442808 444714 445864 445903 444706
51798 444706 442539 439751 436644 433706 431467 429931 428427 426221 423043 419055 414702 410814 408290 407185
51784 407185 406405 404813 402626 401320 402059 404466 406984 408255 408067 407146 406288 405752 405407 405220 405401 406159 407585
51767 407585 409860 413401 418605 425469 433577 442416 451697 461351 471249 480882 489366 495831 499767 500950
51753 500950 499206 494538 487459 478947 469989 461306 453476 446965 441885 437919 434691 432058 429976 428405
51739 428405 427582 428155 430677 435048 440742 447448 455141 463595 472259 480697 488721 495964 501700 505459 507585
51724 507585 508889 509914 510761 511364 511443 510285 507090 501692 494697 486969 479414 473164 469198 467323 466060
51709 466060 464030 461148 457991 454512 450225 445497 441806 440444 441575 444686 449293 454817 460296 464716
51695 464716 467504 468541 468060 466741 465476 464740 464445 464569 465393 466761 467610 466814 464198 460243 455179 449019
51679 449019 442275 435931 430683 426760 424381 423716 424423 425883 428053 431446 436088 441168 446080 451242 457404
51664 457404 464611 472478 481096 490807 500884 509064 512912 511576 506084 498139 489065 479918 472052 466923
51650 466923 465222 466504 469829 474475 479892 485291 489650 492010 491629 488139 481900 474026 465641 457219
51636 457219 448872 441000 434121 428235 422940 418154 414188 411033 408195 405415 403040 401411 400294 399270
51622 399270 398359 397894 397953 398236 398362 398130 397505 396509 395112 393291 391328 389847 389164 388744 387814 386564 386122
51605 386122 387095 388733 390021 391149 393301 397102 401882 406594 411101 416297 423067 431307 440056 448508
51591 448508 456614 464541 471845 477570 480983 481770 479716 474903 468352 461854 456812 453606 452100 452139 453380
51576 453380 455433 458692 464484 473811 486377 501278 518045 536370 555345 573933 592093 610668
51564 610668 630238 650639 671489 692466 713182 733615 754856 778772 806623 838333 873008
51553 873008 909479 946072 980384 1009671 1031338 1043218 1044118 1034508 1016301 991547 961441 926605
51541 926605 887967 847122 806034 766458 729353 694809 662804 633994 609310 588718 571037
51530 571037 555177 540982 528535 517333 506729 496788 487974 480205 472882 465818 459528 454515 450650
51517 450650 447338 443925 439954 435455 431093 427677 425353 423562 421838 420293 419183 418385 417656 417148 417276
51502 417276 418136 419367 420640 422106 424300 427672 432113 436839 440849 443703 445784 447589 448821 448513 446124
51487 446124 442254 438185 434973 433040 432230 431844 430892 428771 425736 422396 418829 414569 409406 403718 397900
51472 397900 391954 385899 380164 375210 370988 367163 363628 360493 357759 355416 353728 352951 352795 352591 352055
51457 352055 351544 351466 351812 352457 353566 355411 357969 360987 364336 368067 372195 376700 381845 388260 396535
51442 396535 406748 418509 431466 445578 460702 475970 489793 500533 507167 509501 508211 504857
51430 504857 501359 498905 497245 495200 491771 486590 479605 470867 460842 450567 441230 433515 427338 422107
51416 422107 417297 412880 409218 406500 404449 402739 401447 400829 400852 401298 402275 404161 407035 410520 414255
51401 414255 418179 422308 426615 431217 436293 441611 446570 450945 455276 460174 465539 470844 476061 481891
51387 481891 489128 498107 508876 521625 536791 554778 575773 599901 627591 659599 696495 738186
51375 738186 784086 833607 886069 940050 993115 1042298 1084660 1117541 1138989 1148420 1146590 1134541
51363 1134541 1112722 1081472 1042161 997269 949264 899615 848995 798122 748237 700858 657246
51352 657246 618125 583791 554290 529393 508524 490994 476298 464050 453691 444606 436521 429442
51340 429442 423155 417211 411539 406639 402900 400120 397919 396192 394834 393452 391871 390487 389502 388139
51326 388139 385367 381324 377321 374364 372306 370532 368844 367407 366286 365348 364364 363096 361556 360254 359775
51311 359775 360050 360442 360665 361135 362251 363763 365208 366539 368025 369758 371579 373301 374810 376159 377677
51296 377677 379673 381853 383382 383770 383378 382761 381945 380721 379311 378205 377499 376835 375907 374761 373750 373446
51280 373446 374347 376312 378561 380607 382917 386130 389908 393177 395370 396775 397713 398107 398014 397900 398044 398186
51264 398186 398084 398033 398527 399753 401621 403836 405677 406116 404695 402109 399535 397535 395852 394090 392191
51249 392191 390249 388196 385788 382870 379738 377186 375931 375858 376094 375965 375570 375263 375000 374591 374285 374599 375639
51232 375639 376996 378217 379065 379344 378899 377860 376590 375366 374301 373547 373247 373268 373221 372838 372199 371624 371488
51215 371488 372053 373228 374562 375663 376561 377418 378083 378295 378255 378556 379567 381191 383271 385810 388679 391498
51199 391498 394000 396319 398798 401672 404927 408202 410893 412655 413773 414638 414929 413903 411600 409141 407510
51184 407510 406514 405307 403466 401176 398736 396432 394640 393540 392793 391952 391081 390637 390785 391220 391568 391657 391432
51167 391432 390944 390454 390272 390455 390835 391345 392198 393808 396611 400756 405762 410712 415035 418841 422208 424431
51151 424431 424541 422503 419397 416327 413582 410946 408361 405990 403876 401919 400143 398781 398000 397582 397050
51136 397050 396254 395746 396229 397607 398953 399587 399749 399926 400004 399582 398767 397967 397147 396045 395047 395067 396379 398295
51118 398295 400199 402257 404709 407116 408883 410172 411745 414022 416695 419230 421443 423604 426177 429382
51104 429382 432930 436278 439229 442106 445300 448878 452679 456456 459685 461591 461768 460805 460059 460648 462529
51089 462529 464485 465119 464166 462765 462208 462479 462434 461325 459574 457963 456684 455555 454635 454159 454148 454521 455331
51072 455331 456567 457964 459403 461241 463841 467010 470300 473695 477592 482309 488083 495380 504625 515621
51058 515621 527698 540523 554203 568417 581866 592957 601027 606852 612219 619077 628757 641531
51046 641531 656599 672462 687511 700627 711430 719905 725774 728422 727519 723455 717076 709266 700900
51033 700900 692708 684662 675698 664470 650397 633767 615231 595738 576823 560254 547048 537054
51021 537054 529533 523917 520135 518524 519412 522526 526898 531736 537176 543747 551218 558724 566031 573954
51007 573954 583111 592890 602147 610520 618553 626765 635181 643828 653221 664125 676829 690678 704322
50994 704322 716647 727597 738005 748601 759347 769784 779709 789254 798462 807081 814768 821465 827637
50981 827637 834233 842257 852148 863578 875894 888659 901750 915124 928729 942671 957514 974454
50969 974454 995060 1020560 1051240 1086753 1127028 1172623 1223977 1280563 1341058 1404273 1469714
50958 1469714 1537277 1606669 1677193 1747935 1817906 1885899 1950305 2009354 2061752 2107082 2145481
50947 2145481 2177101 2202142 2221259 2235501 2245687 2252121 2255129 2255598 2254690 2252999 2250127 2245137 2237414
50934 2237414 2227163 2215053 2201384 2185784 2167758 2147189 2123940 2097250 2066129 2030332 1990411
50923 1990411 1946794 1899380 1848152 1793510 1735781 1675089 1612204 1549023 1487571 1428857 1373162
50912 1373162 1321019 1273174 1229759 1190159 1153729 1120250 1089795 1062638 1039107 1018993 1001151
50901 1001151 984244 967852 952374 938012 924579 912312 901982 893778 886724 879668 872471 865863
50889 865863 860552 856902 855104 855118 856546 858951 862198 866228 870697 875182 879602 884127 888823 893700 898975
50874 898975 904913 911511 918718 926872 936513 947782 960449 974591 990738 1009172 1029548 1051528
50862 1051528 1075455 1101987 1131329 1163345 1198365 1237287 1280768 1328854 1381841 1441093 1508409
50851 1508409 1584589 1669179 1761746 1862908 1973699 2094273 2223740 2361096 2505708 2656756
50841 2656756 2812741 2971919 3132872 3294134 3453248 3606507 3749761 3879369 3992479
50832 3992479 4086795 4160536 4212803 4243997 4255807 4250751 4231676 4201588 4163733 4121564 4078536
50821 4078536 4037926 4002671 3974981 3955762 3944358 3938832 3936413 3933739 3927032 3912538 3887031 3848052
50809 3848052 3793886 3723554 3636873 3534499 3417932 3289412 3151579 3007048 2858377 2708496
50799 2708496 2560862 2418929 2285435 2162216 2050429 1950618 1862609 1785613 1718549 1660327
50789 1660327 1610242 1568310 1534974 1510040 1492018 1478871 1469196 1462210 1456849 1451835 1446725 1442070
50777 1442070 1438051 1433617 1427512 1419671 1410925 1401695 1391645 1380400 1367909 1354091 1338708 1321702
50765 1321702 1303195 1283238 1261957 1239953 1218019 1196402 1174877 1153630 1133538 1115400 1099368
50754 1099368 1085368 1073677 1064767 1058919 1056182 1056374 1058913 1063101 1068864 1076940 1088072 1102350 1119623
50741 1119623 1140147 1164481 1193080 1226377 1264910 1308929 1358213 1412724 1473007 1539260 1610332
50730 1610332 1684501 1761172 1840931 1923884 2008805 2094192 2179309 2263664 2346115 2425182 2499819
50719 2499819 2569291 2632558 2688354 2735620 2773143 2798897 2810528 2806898 2788890 2758756 2719242
50708 2719242 2673614 2625917 2580377 2540242 2507237 2481971 2464458 2454178 2449929 2449999 2452616 2456150
50696 2456150 2458927 2458830 2453136 2438819 2413343 2375466 2325413 2264329 2193801 2116077 2034427 1952586
50684 1952586 1873454 1798562 1728878 1665698 1610259 1562870 1523068 1490659 1466085 1449672 1441061
50673 1441061 1439644 1445141 1457380 1475730 1499072 1526238 1556221 1588049 1620678 1652952 1683589 1711333
50661 1711333 1735376 1755695 1773010 1788543 1803671 1819318 1835394 1851112 1866160 1881388 1898003
50650 1898003 1916314 1935735 1955895 1977197 2000214 2025132 2052139 2081974 2115563 2153231 2194616
50639 2194616 2239359 2287422 2338599 2392023 2446451 2500921 2554896 2607757 2658438 2705675 2748608
50628 2748608 2787152 2821977 2854067 2883890 2910521 2931392 2942904 2941379 2923867 2889079 2838673
50617 2838673 2777926 2714396 2654964 2603529 2561112 2527609 2503019 2487132 2478705 2475600 2475887 2478464
50605 2478464 2482220 2484728 2482385 2472128 2452616 2423351 2383281 2331309 2268226 2197165 2121628 2043657
50593 2043657 1964314 1885170 1808335 1735296 1666574 1602570 1543995 1491254 1444062 1402022 1365203
50582 1365203 1333813 1307491 1285223 1265794 1248177 1231761 1216531 1202937 1191356 1181731 1173909 1168207
50570 1168207 1165342 1165702 1168934 1174325 1181479 1190427 1201196 1213527 1227142 1242155 1259041 1278220 1299797
50557 1299797 1323701 1349991 1378976 1410997 1446050 1483543 1522554 1562395 1602790 1643332 1683006
50546 1683006 1720708 1756169 1790009 1822832 1854818 1886381 1918782 1953690 1992460 2036113 2085588
50535 2085588 2141484 2203784 2272423 2348043 2431603 2523242 2622121 2727531 2839689 2959156 3085806
50524 3085806 3218608 3356091 3496635 3638367 3779043 3916102 4046864 4168825 4279843
50515 4279843 4377952 4461018 4526680 4572657 4597026 4598387 4576183 4531061 4464821 4379960 4279341
50504 4279341 4166236 4044361 3917771 3790913 3668705 3556057 3456911 3373773 3308217 3261591
50494 3261591 3234908 3228146 3239824 3267177 3306481 3353143 3401683 3445959 3479839 3497995 3496237 3471328
50482 3471328 3421096 3345402 3247045 3131129 3003082 2867207 2726918 2585618 2446793 2313395
50472 2313395 2187487 2070330 1962505 1863987 1774518 1693975 1622252 1558870 1502981 1453773 1410612
50461 1410612 1372762 1339295 1309460 1283063 1260343 1241552 1226761 1216015 1209413 1206868 1207795 1211250
50449 1211250 1216541 1223632 1232782 1243852 1256197 1269217 1282651 1296165 1309045 1320702 1331374 1341849
50437 1341849 1352352 1361984 1369479 1374459 1377824 1380978 1384831 1389534 1395011 1401484 1409398 1418982 1430124
50424 1430124 1442773 1457279 1474224 1493981 1516524 1541695 1569653 1601123 1637152 1678485 1725127
50413 1725127 1776606 1832506 1892515 1956032 2022213 2090571 2161136 2233652 2306908 2379185 2449073
50402 2449073 2515391 2576631 2631219 2678315 2717687 2748557 2769232 2778210 2775088 2759875 2731981 2690728
50390 2690728 2636734 2572046 2498937 2419371 2335853 2251926 2171112 2095754 2027359 1967628 1918334
50379 1918334 1880301 1853291 1836998 1831393 1835787 1848178 1865948 1886736 1908204 1927441 1941390 1947770
50367 1947770 1945065 1931872 1907024 1870585 1824131 1769842 1709721 1645855 1580799 1517019 1455944
50356 1455944 1397834 1342487 1289880 1240225 1193659 1150047 1109128 1070938 1035984 1004817 977494
50345 977494 953676 933174 916051 902154 890980 882147 875684 871707 870170 871125 874791 881063 889306
50332 889306 898962 910058 922838 937288 953383 971382 991163 1011531 1030804 1047993 1062829 1074714
50320 1074714 1082402 1084934 1082471 1076127 1067438 1058025 1049068 1040779 1032759 1025116 1018742 1014216 1010987 1008153
50306 1008153 1005741 1004625 1005341 1007488 1010307 1013430 1016974 1021193 1026173 1031750 1037694 1044100 1051549 1060672
50292 1060672 1071485 1083284 1095221 1107020 1119132 1132325 1147143 1163802 1182589 1204162 1229167
50281 1229167 1257568 1288625 1321385 1354530 1385196 1408349 1418311 1411716 1389480 1356280 1318215 1280348
50269 1280348 1245405 1214051 1186208 1162098 1142087 1125928 1112621 1101130 1091001 1082251 1074927 1068908
50257 1068908 1063916 1059580 1055696 1052548 1050797 1050857 1052523 1055328 1059095 1063929 1069881 1076941 1085315 1095388
50243 1095388 1107377 1121318 1137376 1155877 1176838 1199792 1224329 1250606 1278917 1308782 1338831
50232 1338831 1367605 1394201 1418086 1438787 1456196 1470920 1483837 1495228 1504740 1512192 1517902 1521856
50220 1521856 1522842 1518830 1508193 1490363 1465548 1434363 1397875 1357644 1315401 1272776 1231425 1193109
50208 1193109 1159299 1130705 1107310 1088759 1074454 1063345 1053896 1044363 1032985 1018124 998802 975510
50196 975510 950294 925605 902840 882014 862647 844669 828420 814113 801551 790315 780016
50185 780016 770302 760788 751150 741375 731858 723120 715360 708332 701719 695511 689845 684538 679073 673176
50171 673176 667210 661835 657441 654124 652079 651634 652796 655002 657565 660243 663224 666607 670147 673562
50157 673562 677011 681131 686606 693657 701964 711076 720947 731998 744619 758553 772874 786533 798860
50144 798860 809528 818230 824653 828747 830831 831350 830740 829672 829242 830522 833935 839307 846623 856395 869071
50129 869071 884374 901637 920725 942250 966827 994583 1025635 1060608 1100190 1144268 1191964
50118 1191964 1242576 1296094 1352530 1411018 1469817 1527125 1581763 1633375 1682408 1729921 1777016
50107 1777016 1824101 1870573 1915086 1955873 1990755 2017063 2031924 2032940 2018969 1990643 1950178
50096 1950178 1900359 1843437 1780983 1714661 1646784 1579841 1515791 1456104 1402257 1355527 1316156
50085 1316156 1283129 1255149 1231674 1212704 1197699 1185169 1173562 1162340 1151877 1142314 1132923 1122835
50073 1122835 1112103 1101625 1092015 1082988 1073941 1064670 1055217 1045474 1035435 1025559 1016293 1007258 997474
50060 997474 986485 974851 963413 952619 942683 933883 926286 919530 913316 907946 904063 902076 902168 904584
50046 904584 909383 915949 923230 930616 938325 946850 956266 966168 976051 985619 994800 1003616 1012078 1020189
50032 1020189 1028029 1035682 1042992 1049490 1054702 1058465 1060864 1061977 1061821 1060436 1057902 1054356 1050121 1045614
50018 1045614 1040985 1036017 1030611 1025187 1020284 1015920 1011690 1007445 1003449 999896 996743 994214 993106 994338
50004 994338 998327 1005030 1014448 1026953 1043211 1063929 1089595 1120248 1155385 1194035 1234939 1276754
49992 1276754 1318232 1358240 1395656 1429505 1459444 1485984 1509908 1531311 1549246 1562139 1568256
49981 1568256 1565832 1553225 1529333 1494025 1448291 1394155 1334324 1271610 1208557 1147605 1091171
49970 1091171 1040917 996903 957975 923233 892683 866267 842913 821192 800785 782700 767970
49959 767970 756439 746864 737957 729312 721547 715671 712256 711221 712387 715886 721765 729355 737536 745757
49945 745757 754505 764581 776019 787819 798576 807331 813933 818813 822430 824860 825801 824810 821438 815221
49931 815221 805812 793226 777884 760367 741329 721703 702775 685673 670724 657542 645857 636056
49919 636056 628773 624088 621387 619970 619545 620076 621332 622723 623590 623755 623920 625347 628754 633572 638681
49904 638681 643917 650270 658380 667531 676683 685989 696556 708938 722649 737000 751517 765439 777634
49891 777634 787383 794649 799321 800924 799509 796169 792028 787091 780652 772406 762575 751307 738679 725111
49877 725111 711072 696476 681053 665349 650662 637828 626616 616520 607546 599937 593605 588373
49865 588373 584511 582628 583067 585576 589522 594273 599485 605165 611351 617753 623959 630186 637542 647137
49851 647137 658989 672000 685031 697751 710392 722913 734669 744858 753059 759210 763187 764735
49839 764735 763946 761599 758701 755564 751430 745118 736108 725041 713275 701936 691368 681462 672373
49826 672373 664749 659196 655751 654047 653875 655367 658626 663411 669238 675756 682976 691222 700805 711661
49812 711661 723279 735012 746420 757337 767758 777633 786583 793760 798350 800509 801526 802681 803982
49799 803982 804316 802725 799131 793962 787571 780143 771704 761941 750324 736671 721507 705803 690652
49786 690652 677185 666274 657845 650777 643930 637235 631442 626995 623607 620900 618819 617201 615467 613260
49772 613260 611167 610330 611365 614052 618055 623447 630272 638012 645955 653921 662248 671061 679910 688141
49758 688141 695260 700882 704759 707138 708830 710528 712099 712701 711471 707909 701816 693276 682861 671604
49744 671604 660600 650572 641808 634462 628804 625011 622724 621092 619604 618675 618880 619690 619694 618360 616968
49729 616968 617274 619706 623353 627262 631061 634653 638165 642138 647099 652926 659240 666356 675089 685552
49715 685552 696939 708668 720906 733551 745356 754618 760354 762488 761433 757944 752950 746964 740023
49702 740023 732594 726027 721432 718325 715120 710922 706273 702150 698766 695452 691283 685681 678761 671350
49688 671350 664582 659355 656104 654845 655259 656901 659620 663760 669788 677833 687700 699117 711776 725409
49674 725409 740094 756281 774157 793035 811535 828084 841074 849058 851645 850190 847091 844220
49662 844220 842246 841239 841281 842487 844956 848901 854342 860327 864625 864390 857297 842507 821230 796366
49648 796366 771076 747310 725772 706972 691586 679673 670201 661886 654298 647932 643440 641018 640313
49635 640313 640699 641739 643330 645184 646363 645851 643639 640640 637439 633759 629421 624970 620807 616329 610736
49620 610736 604253 597828 591939 586559 582100 579370 578448 578411 578480 578785 579643 580738 581591 582448 584051 586632
49604 586632 589626 592371 594747 596982 599126 600904 602055 602692 603249 604072 605138 606254 607432 608885 610662
49589 610662 612450 613863 614860 615868 617451 619789 622371 624313 625163 625387 625916 627268 629197 631144 632833
49574 632833 634445 636441 639177 642619 646488 650850 656282 663163 671004 679021 687253 696479 706914 717608
49560 717608 727373 735697 742374 746877 748770 748338 746100 741950 735579 727661 719830 713282 708051 703864
49546 703864 701013 699956 700533 702149 704416 707173 710081 712683 714842 716741 718541 720361 722555 725616
49532 725616 729715 734685 740556 747817 756979 768114 780979 795405 811355 828719 847283 866699
49520 866699 886146 904061 918659 929034 935673 939673 941696 941999 941300 941010 942306 945372 949918 956091
49506 956091 964253 973828 983049 990066 993887 993938 989236 978744 962547 942220 919933 897488 876185
49493 876185 857012 840480 826362 813943 802678 792558 783901 776920 771579 767719 765163 763605 762598
49480 762598 761846 761470 761685 762246 762637 762964 764172 766801 769884 771790 772186 772424 773751 775869 777693 779004
49464 779004 780616 783203 786701 790817 795424 800243 804666 808235 810965 812959 813983 813749 812344 810000
49450 810000 806572 801682 795395 788420 781442 774551 767546 760623 754465 749581 745774 742458 739432 737137
49436 737137 736077 736143 736767 737772 739777 743572 749203 755975 763365 771697 781821 794396 809627 827488
49422 827488 847783 870044 893720 918586 944689 971636 997960 1021234 1038715 1047971 1047581 1037998
49410 1037998 1022026 1004025 988122 976762 970623 969501 973148 981451 994115 1010254 1028270 1046234
49398 1046234 1062592 1076761 1089118 1100354 1110732 1119893 1127357 1133117 1137560 1140855 1142713 1142841 1141349
49385 1141349 1138383 1133510 1125954 1115557 1103246 1090404 1077913 1065881 1054095 1042576 1031760 1022242
49373 1022242 1014344 1008022 1003296 1000627 1000582 1003112 1007427 1012580 1017905 1022933 1027330 1031036 1034063 1035978
49359 1035978 1036022 1034028 1030707 1026644 1021485 1014723 1006966 999679 993725 988859 984716 981530 979555 978339
49345 978339 977136 975824 975049 975407 976667 977839 978051 977426 976923 977102 977232 976042 973245 969698 966002 961681
49329 961681 956139 949876 944141 939675 936326 933700 931676 930341 929906 930680 932750 935738 939201 943102 947470
49314 947470 951804 955488 958904 963364 969616 976924 984069 990737 997346 1003889 1009717 1014504 1018822 1023598
49300 1023598 1029429 1036538 1044975 1054578 1065048 1076386 1089045 1103383 1119033 1135042 1150508 1164876
49288 1164876 1177662 1188108 1195134 1197571 1194689 1186928 1176183 1165017 1155240 1147095 1139687 1132009 1123677
49275 1123677 1114988 1106507 1098499 1090744 1083009 1075648 1069452 1064896 1061819 1059908 1059104 1059319 1060206 1061598 1063850
49260 1063850 1067232 1071220 1075063 1079045 1084540 1092612 1103086 1115296 1129204 1145312 1163750 1183929
49248 1183929 1204944 1225806 1245262 1261750 1273655 1279476 1277982 1268718 1252562 1231490 1207576 1182330
49236 1182330 1157028 1133208 1112359 1095086 1080974 1069468 1060767 1055610 1054223 1055686 1058526 1061826
49224 1061826 1065617 1070210 1075429 1080697 1085774 1091076 1097119 1103817 1110576 1117098 1123921 1131983 1141750 1152877
49210 1152877 1164647 1176546 1188411 1200282 1212258 1224392 1236576 1248708 1261090 1274422 1289159
49199 1289159 1304962 1321027 1336765 1351914 1366188 1379402 1391885 1404176 1416112 1426760 1435565
49188 1435565 1443156 1450627 1458335 1465851 1472829 1479527 1486572 1494618 1504171 1515426 1528451 1543769 1562472
49175 1562472 1585296 1611811 1641157 1673524 1710239 1752275 1799235 1849889 1902859 1956149 2006277
49164 2006277 2048586 2078737 2094238 2095303 2084782 2067134 2046937 2027954 2013053 2004140 2001621 2004237
49152 2004237 2009975 2017225 2025011 2032549 2039160 2044663 2049509 2054437 2060095 2066820 2074550 2083012 2092145 2102185
49138 2102185 2113193 2124887 2137260 2150985 2166650 2183822 2201475 2219294 2237902 2257758 2278399
49127 2278399 2298954 2318871 2338027 2356626 2375249 2394531 2414494 2434636 2454828 2475628 2497464
49116 2497464 2520133 2543631 2568948 2597371 2629382 2664958 2704867 2751003 2805482 2869959 2945796
49105 2945796 3034246 3136046 3250729 3375711 3505396 3631822 3748059 3852210 3947412 4036399
49095 4036399 4115103 4171608 4192068 4169199 4107016 4018492 3917991 3814018 3707269 3594455
49085 3594455 3473888 3348427 3224651 3109979 3009937 2926791 2859786 2806401 2763658 2728963
49075 2728963 2700586 2677727 2659879 2645948 2634249 2623429 2613015 2602880 2592711 2582422 2572625
49064 2572625 2564000 2556333 2548777 2541064 2533904 2528100 2523760 2520478 2517866 2515608 2513320 2510712 2507908 2505443
49050 2505443 2503933 2503630 2504108 2504477 2504073 2502909 2501304 2499348 2497174 2495621 2495981 2498854 2503714 2509869 2517456
49035 2517456 2527105 2538882 2551922 2564946 2576825 2586745 2594243 2599181 2601610 2601657 2599603 2595930 2591087
49022 2591087 2585369 2579139 2573061 2567812 2563665 2560560 2558580 2558075 2559290 2562103 2566223 2571459 2577634 2584392
49008 2584392 2591341 2598441 2606013 2614201 2622555 2630405 2637651 2644814 2652106 2658698 2663321 2665479 2665728 2664812
48994 2664812 2662945 2659996 2655915 2650737 2644491 2637467 2630322 2623552 2616898 2609583 2601188 2592159 2583507 2576139
48980 2576139 2570403 2566150 2563155 2561439 2561086 2561908 2563643 2566472 2570824 2576452 2582163 2586925 2590941 2595145
48966 2595145 2599819 2604212 2607484 2609532 2610862 2612104 2613816 2616424 2620083 2624697 2630115 2636254 2643172 2651241
48952 2651241 2661120 2673240 2687429 2703372 2721348 2742001 2765441 2791063 2818412 2847651 2878919
48941 2878919 2911695 2945192 2979082 3013571 3049023 3085913 3124867 3166377 3210523 3257190 3306394
48930 3306394 3358105 3412037 3467949 3525947 3586065 3647723 3710054 3772730 3835985 3899823 3963695
48919 3963695 4027122 4090192 4153179 4215939 4277904 4338414 4396850 4452663 4505540 4555437 4602301
48908 4602301 4645973 4686562 4724679 4760952 4795438 4827766 4857718 4885310 4910407 4932791 4952674
48897 4952674 4970621 4986664 5000000 5009996 5017196 5022699 5026635 5027883 5025453 5019599 5011263 5000850 4987943
48884 4987943 4971905 4952210 4928344 4899984 4867423 4831475 4792840 4751952 4709493 4666544 4623765
48873 4623765 4580637 4535868 4488448 4437977 4384250 4327149 4267112 4205278 4142848 4080588 4019115
48862 4019115 3959301 3901895 3846961 3794241 3744176 3697996 3656534 3619373 3585551 3554864 3527914
48851 3527914 3504970 3485345 3468075 3452812 3439745 3428960 3420212 3413274 3408299 3405823 3406568 3411042 3419193
48838 3419193 3430480 3444305 3460193 3477542 3495634 3514223 3533808 3554907 3577218 3599895 3622497
48827 3622497 3645178 3667965 3690455 3712382 3734026 3755811 3777845 3800056 3822485 3845166 3867967
48816 3867967 3890733 3913427 3936023 3958483 3980937 4003557 4026169 4048386 4070327 4092729 4116042
48805 4116042 4139879 4163806 4188278 4214134 4241404 4269290 4297339 4326024 4356010 4387250 4418954
48794 4418954 4450084 4479751 4507477 4533268 4557274 4579301 4598813 4615375 4628870 4639379 4647147
48783 4647147 4652593 4655918 4656603 4653571 4645806 4632482 4612621 4585281 4550341 4508744 4461859 4410913
48771 4410913 4357053 4301273 4243924 4184770 4123884 4062145 4000526 3939384 3878818 3819270 3761203
48760 3761203 3704549 3649094 3595218 3543630 3494572 3447882 3403837 3363283 3326847 3294464 3265743
48749 3265743 3240377 3218149 3198972 3183017 3170354 3160495 3152745 3147105 3144301 3144729 3147810 3152594 3158545
48736 3158545 3165477 3173150 3181251 3189512 3197559 3204910 3211369 3217132 3222275 3226402 3229100 3230472 3231032 3231286
48722 3231286 3231609 3232114 3232402 3231846 3230494 3229239 3228640 3227995 3226178 3223075 3219512 3216064 3212742 3209736 3207478
48707 3207478 3205763 3203584 3200275 3196311 3192648 3189744 3187519 3185758 3184182 3182596 3181433 3181698 3183839 3186966
48693 3186966 3189810 3192306 3195624 3200677 3207173 3214211 3221194 3227832 3233638 3237988 3240632 3241922 3242454 3242610
48679 3242610 3242463 3241918 3240782 3238759 3235576 3231221 3225827 3219132 3210186 3197938 3182119 3163311 3142221
48666 3142221 3119260 3094872 3069731 3044284 3018356 2991497 2963442 2933977 2902764 2869785 2835754
48655 2835754 2801557 2767241 2731898 2694531 2654798 2613176 2570925 2529831 2491417 2456244 2424254
48644 2424254 2395657 2370808 2349167 2329089 2309094 2288865 2268646 2248221 2227085 2205299 2183494
48633 2183494 2162188 2141617 2122100 2103866 2086452 2068889 2050784 2032706 2015282 1998341 1981320
48622 1981320 1964112 1947030 1930199 1913578 1897540 1882848 1869984 1858912 1849691 1842768 1838319 1835642
48610 1835642 1833725 1832310 1831999 1833342 1836197 1839986 1844134 1848048 1851084 1852886 1853651 1853855 1853807 1853595 1853286 1853000
48594 1853000 1852854 1853021 1853685 1854711 1855467 1855120 1852988 1848453 1840838 1829809 1815897 1800347 1784371 1768726
48580 1768726 1753785 1739636 1726184 1713528 1702292 1693177 1686162 1680548 1675946 1672731 1671344 1671566 1672847
48567 1672847 1675071 1678608 1683783 1690589 1698740 1707632 1716402 1724291 1730897 1735820 1738248 1737287 1732677 1724863
48553 1724863 1714485 1702190 1688914 1675807 1663652 1652617 1642656 1633779 1625696 1617570 1608513 1598199
48541 1598199 1586732 1574104 1560167 1545131 1529711 1514702 1500632 1487871 1476707 1467111 1458758 1451640
48529 1451640 1446534 1444436 1445480 1448823 1453767 1460694 1470531 1483406 1498067 1512422 1524218 1531259 1531636
48516 1531636 1524351 1509822 1489700 1466317 1442294 1420140 1401590 1387162 1376562 1369581 1366419 1367272
48504 1367272 1372064 1380796 1393763 1411033 1431784 1454558 1478145 1501802 1524389 1543585 1556345 1560270
48492 1560270 1554585 1540204 1519358 1495131 1470665 1448086 1427943 1409665 1392476 1375903 1359774
48481 1359774 1344132 1329181 1315069 1301711 1288946 1276871 1265840 1256181 1248046 1241452 1236240 1231996
48469 1231996 1228258 1224830 1221788 1219290 1217589 1217035 1217710 1219128 1220798 1223061 1226883 1232680 1239864 1247689
48455 1247689 1255976 1264661 1273184 1280858 1287450 1292856 1296570 1298079 1297547 1295458 1291760 1286172 1279299 1272644
48441 1272644 1267215 1262711 1258281 1253427 1247829 1240937 1232385 1222494 1211786 1200246 1187639 1174462 1161927
48428 1161927 1150899 1141245 1132390 1124080 1116406 1109369 1102776 1096431 1090235 1084187 1078433 1073173 1068212 1062704
48414 1062704 1055708 1047274 1038737 1031675 1026593 1022806 1019461 1016284 1013301 1010340 1007211 1004163 1001754 1000223
48400 1000223 999263 998460 997649 996804 995841 994639 993099 991013 988123 984402 980109 975396 970079 964035 957627
48385 957627 951427 945641 940185 935321 931672 929363 927555 925266 922535 920299 919151 918599 917693 916010 913807
48370 913807 911478 909168 906829 904390 901881 899501 897468 895672 893700 891410 889343 888258 888303 888904 889388
48355 889388 889418 888882 887738 886089 884188 882323 880852 880167 880284 880571 880395 880011 880359 881920 884327 887200
48339 887200 890710 895034 899889 905036 910843 917901 926449 936562 948420 961930 976482 991641 1007775
48326 1007775 1025437 1044347 1063410 1081394 1097076 1109258 1117590 1123357 1128701 1134933 1142008 1149518
48314 1149518 1157574 1166720 1177560 1190563 1205810 1223019 1242231 1264304 1290278 1320468 1354780 1393696
48302 1393696 1438310 1489594 1548365 1615850 1693602 1783072 1886131 2006046 2147206 2314024
48292 2314024 2510950 2743397 3017902 3341826 3724448 4178790 4721949 5374545 6161631
48283 6161631 7113156 8259191 9620765 11203612 12997103 14968809 17044093 19076324
48275 19076324 20833413 22030865 22418929 21888999 20533372 18610823 16436516 14270956
48267 14270956 12271753 10509130 9001622 7739549 6696825 5841224 5142205 4572292
48259 4572292 4106007 3721492 3402468 3136797 2914054 2725668 2565659 2429147 2310874
48250 2310874 2206590 2114728 2034840 1965012 1902354 1845404 1794370 1749281 1709318 1673774 1642257
48239 1642257 1613970 1587939 1563970 1542422 1523112 1505388 1489147 1474778 1462110 1450356 1439091
48228 1439091 1428458 1418372 1408383 1398449 1389047 1380411 1372157 1363583 1353600 1340498 1322614 1299492 1271958
48215 1271958 1241282 1208922 1176801 1146649 1118792 1092329 1066712 1042359 1019605 997942 976725
48204 976725 955950 935880 916516 897820 879968 863007 846771 831427 817586 805507 794644
48193 794644 784343 774552 765474 757029 749107 741925 735609 729686 723595 717530 712352 708731 706608 705323
48179 705323 704000 702044 699649 697737 697080 697590 698548 699252 699239 698285 696684 695367 695225 696298 697876 699279
48163 699279 700229 700660 700669 700719 701445 703033 705005 706691 707783 708413 708880 709404 709996 710508 710827 710985 711041 711036 711194
48144 711194 711964 713488 715108 715785 715187 714096 713537 713689 713880 713527 712798 712322 712531 713495 715203 717616 720353
48127 720353 722756 724610 726666 729954 734522 739226 742936 745664 748364 751961 756863 763092 770333 777856
48113 777856 784921 791534 798580 806993 816853 827494 838379 849625 861578 874131 886881 899991
48101 899991 914476 931210 949823 968949 987527 1005424 1022820 1039697 1056211 1073026 1090641
48090 1090641 1108634 1126081 1142552 1158248 1173326 1187676 1201425 1215053 1228812 1242381 1255254
48079 1255254 1267124 1277733 1286743 1294058 1300083 1305411 1310489 1315708 1321501 1327983 1334681 1341018 1347006
48066 1347006 1353102 1359401 1365365 1370478 1374947 1379546 1384873 1390822 1396560 1400819 1402354 1400528 1395655 1388710
48052 1388710 1380664 1372071 1363099 1353518 1342568 1329314 1313620 1296539 1279208 1261463 1242221 1221273
48040 1221273 1199872 1179109 1158476 1136837 1114268 1091896 1070121 1048171 1025633 1003395 982574
48029 982574 963328 945370 928886 914037 899947 885174 869223 852874 837048 822056 808045
48018 808045 795403 784257 774000 763814 753503 743558 734550 726595 719291 712134 705131 699004 694484
48005 694484 691390 688780 686109 683778 682346 681708 681450 681587 682317 683280 683727 683451 682994 682853 682991 683292 683946
47988 683946 685048 686217 687010 687458 687783 687802 687111 685853 684837 684677 685055 685050 684069 682341 680557 679119 677743
47971 677743 675816 673155 670344 668183 666863 665903 664883 663962 663486 663367 663146 662622 662109 662008 662377 663109 664415
47954 664415 666857 670860 676278 682523 689040 695564 701992 708251 714440 721039 728729 737852 748070 758581
47940 758581 768683 778166 787230 796109 804788 813093 821035 828873 836659 843775 849203 852399 853740 854025
47926 854025 853716 852769 850984 848192 844196 838879 832401 825106 817196 808756 800078 791601 783373 774903 765841
47911 765841 756621 748102 740655 733933 727542 721577 716361 711990 708433 705918 704834 705149 706218 707416
47897 707416 708821 711052 714423 718522 722732 726934 731505 736808 742989 750190 758545 767806 777260 786289
47883 786289 794925 803680 812870 822243 831231 839389 846629 853121 858971 863928 867468 869225 869306 868091 865825
47868 865825 862458 857777 851573 843821 834876 825413 815948 806501 796921 787415 778408 769863 761132 751696
47854 751696 741801 732236 723630 716103 709377 703044 696917 691345 687063 684529 683548 683677 684753 686732 689233
47839 689233 691701 693956 696215 698598 701047 703770 707202 711299 715279 718455 721025 723669 726631 729562
47825 729562 732062 733879 734754 734632 734126 734243 735438 737302 739289 741369 743762 746546 749951 754697 761511
47810 761511 770445 781109 793487 807984 824663 842987 862550 883586 906345 930181 953701 975822
47798 975822 996435 1015956 1034402 1051002 1064589 1074266 1079702 1081031 1078718 1073566 1066540 1058267 1048750
47785 1048750 1037834 1025938 1014094 1003191 993379 984299 975662 967486 959891 952882 946244 939615 932725
47772 932725 925626 918628 911991 905788 899999 894534 889205 883944 879077 875080 871937 869057 865989 862929
47758 862929 860359 858476 857218 856542 856277 855954 855168 854091 853312 853252 853945 855300 857286 860001 863781 869118
47742 869118 876154 884406 893256 902593 912701 923738 935673 948590 962607 977542 992974 1008451
47730 1008451 1023358 1036870 1048592 1058973 1068507 1076753 1082909 1087121 1090235 1092219 1091907 1088609 1082947
47717 1082947 1075608 1066295 1054689 1041644 1028389 1014960 1000394 984326 967598 951387 936326 922395
47705 922395 909095 895827 882659 870689 861155 854297 849487 846263 844637 844563 845818 848397 852485 858016
47691 858016 864818 873110 883257 894994 907503 920314 933571 947380 961555 976115 991330 1006997
47679 1006997 1022235 1036257 1048827 1059765 1068699 1075688 1081466 1086559 1090563 1092736 1092884 1091157 1087353
47666 1087353 1081043 1072193 1061193 1048437 1034246 1018996 1002813 985404 966759 947941 930536 915199
47654 915199 901232 887801 875121 864076 854929 846836 838776 830691 823537 818278 815114 813697 813690 814790
47640 814790 816578 818947 822534 828033 835013 842071 848362 854351 860866 868227 876698 886873 898812 911472
47626 911472 924047 937519 953832 973725 996360 1020952 1047566 1076028 1105165 1133687 1161106
47615 1161106 1187251 1211500 1233033 1251277 1265522 1274519 1277138 1273214 1263296 1247838 1227126 1201750
47603 1201750 1172534 1140123 1105086 1068325 1030845 993199 955667 918971 884228 851982 821841
47592 821841 793395 767134 743996 724235 707129 691811 677934 665459 654171 643798 634437 626462
47580 626462 619892 614166 608818 604092 600509 597903 595333 592139 588728 586093 584753 584392 584330 584057 583414
47565 583414 582552 581749 581097 580364 579265 577792 576148 574477 572889 571575 570662 569946 569091 568109 567362 567062 567044
47548 567044 567156 567584 568548 569860 571056 571870 572373 572646 572508 571651 569976 567790 565709 564306 563761 563795 563979
47531 563979 564061 564042 564037 564174 564494 564852 564982 564816 564700 565118 566216 567707 569215 570536 571566 572221 572520 572567 572322
47512 572322 571559 570230 568683 567324 566182 565054 563951 563053 562285 561269 559834 558276 557027 556313 556205
47497 556205 556626 557091 556832 555594 554102 553330 553483 554107 554994 556334 557949 559098 559378 559356 559841 560906 562044
47480 562044 563021 564072 565386 566972 568994 571730 575028 578279 581157 584051 587467 591252 594712 597335
47466 597335 599070 599998 600099 599457 598394 597279 596256 595288 594384 593695 593442 593805 594828 596352 598029 599533
47450 599533 600818 602192 604103 606873 610687 615759 622350 630545 640217 651385 664336 679095 694969
47437 694969 711224 728367 748101 771477 797465 823964 849985 876115 902862 929458 954650
47426 954650 977873 998933 1017014 1030919 1040195 1045287 1046518 1043657 1036770 1026812 1014830 1000947 984683
47413 984683 966139 946365 926587 907473 889221 871910 855539 840025 825462 812292 800963
47402 800963 791390 782928 774916 767209 760182 754303 749725 746216 743497 741689 741423 743298 747149 751980
47388 751980 756837 761706 767405 774622 783283 792837 802781 812653 821808 829661 836214 842046 847614 852686
47374 852686 856549 858649 858958 857755 855183 851097 845372 838246 830152 821216 811177 799891 787619 774565
47360 774565 760521 745344 729599 714247 699806 686309 673910 662818 652559 642095 631070
47349 631070 620377 611120 603507 597112 591676 587047 582817 578678 574900 571817 569065 565982 562642 559807
47335 559807 557963 557102 557367 559086 562017 565312 568554 572209 576764 581994 587381 592617 597299 600750 602803
47320 602803 604294 606109 608056 609370 610079 611052 612666 614102 614195 612537 609618 606318 603471 601530 600354
47305 600354 599467 598695 598340 598706 599736 601276 603395 606210 609630 613545 618168 623875 630739 638366 646206
47290 646206 653895 661424 669153 677601 686928 696564 705600 713698 721428 729522 737969 746093 753494 760550
47276 760550 767855 775379 782464 788567 793806 798683 803435 807798 811330 813858 815459 816065 815356 813238 810270
47261 810270 807230 804159 800170 794448 787224 779601 772735 767470 764379 763475 763932 764699 765594 767446 771057
47246 771057 776453 783259 791251 800155 809256 817515 823844 827028 825944 820555 812574 804560 798194 793684
47232 793684 790681 789230 789714 792325 796906 803073 810317 818136 826286 834844 843949 853546 863374 873007
47218 873007 881834 889225 894939 899219 902293 903835 903200 900272 895847 890945 885821 879916 872774 864695
47204 864695 856349 848069 839875 831963 824626 817711 810731 803737 797666 793482 791305 790733 791673 794430 799125
47189 799125 805502 813256 822195 832111 842852 854551 867511 881869 897641 915003 934159 954840
47177 954840 976211 997338 1017664 1037169 1056330 1075747 1095385 1114229 1131061 1145499 1157878
47166 1157878 1168235 1176102 1181391 1184738 1186583 1186436 1183536 1177815 1169783 1159908 1148679 1137010 1125871
47153 1125871 1115499 1105429 1095257 1084994 1074741 1064559 1054730 1045704 1037630 1030357 1023968 1018916
47141 1018916 1015406 1013109 1011876 1012349 1015278 1020313 1026071 1031541 1036998 1043256 1050340 1057300 1063166 1067630
47127 1067630 1070758 1072479 1072629 1071147 1067858 1062274 1054027 1043506 1031629 1018958 1005489 991418 977591
47114 977591 964814 953005 941482 929885 918335 906915 895559 884539 874443 865331 856344 846601
47102 846601 836275 826355 817462 809326 801534 794345 788446 784045 780545 777214 773990 771495 770329 770527
47088 770527 771735 773737 776602 780365 784739 789292 793804 798333 803028 808009 813410 819305 825486 831452
47074 831452 836760 841314 845201 848364 850618 851894 852177 851242 848875 845560 842609 841186 841315 842150 843116
47059 843116 844365 846176 848443 851008 854104 858133 863166 868948 875248 881945 888906 896040 903411 911059
47045 911059 918810 926493 934272 942486 951199 960165 969188 978188 986952 995163 1002816 1010279 1017830 1025449
47031 1025449 1033193 1041427 1050409 1059887 1069339 1078350 1086487 1093125 1097839 1100896 1102961 1104352 1104823 1103906
47017 1103906 1101122 1096130 1089309 1082100 1076019 1071085 1065835 1059217 1051846 1045020 1039137 1033809 1028996 1025115
47003 1025115 1022153 1019609 1017485 1016549 1017303 1019269 1021690 1024465 1027978 1032322 1037139 1042060 1046996 1052153
46989 1052153 1057983 1064925 1072942 1081489 1090190 1099347 1109507 1120722 1132596 1144892 1157731 1171224
46977 1171224 1185226 1199496 1213853 1228165 1242335 1256249 1269637 1282125 1293635 1304581 1315388
46966 1315388 1325867 1335344 1343285 1349520 1353989 1356676 1357834 1357943 1357335 1356105 1354420 1352681 1351376 1350976
46952 1350976 1351911 1354341 1357848 1361642 1365217 1368710 1372684 1377752 1384307 1392279 1401149 1410451 1420213 1430626
46938 1430626 1441399 1451907 1461997 1472186 1482983 1494474 1506561 1519044 1531208 1541921 1550515
46927 1550515 1557164 1562094 1564825 1564637 1561443 1555755 1548060 1538595 1527531 1514898 1500485 1484222 1466597
46914 1466597 1448450 1430478 1413175 1396980 1382079 1368302 1355591 1344331 1334874 1327088 1321025 1317737
46902 1317737 1318588 1323693 1331741 1341550 1353167 1367256 1384054 1403378 1425104 1449084 1474839 1501709
46890 1501709 1529176 1556722 1583617 1609211 1633267 1655697 1676175 1694416 1710704 1725643 1739295
46879 1739295 1751005 1760241 1767287 1772889 1777500 1781224 1784385 1787747 1792015 1797355 1803509 1810259 1817616 1825760
46865 1825760 1835055 1846055 1859106 1873847 1889403 1905302 1921971 1940003 1959128 1978218 1996269
46854 1996269 2012946 2028064 2040973 2050871 2057657 2062108 2065045 2066473 2065681 2062125 2056042 2048162 2039069
46841 2039069 2029084 2018638 2008414 1998955 1990387 1982711 1976177 1971154 1967750 1965833 1965403 1966733 1970137 1975749
46827 1975749 1983565 1993518 2005368 2018549 2032227 2045670 2058662 2071504 2084421 2097024 2108496 2118225
46815 2118225 2125946 2131307 2133844 2133574 2131167 2127205 2121603 2114136 2105131 2095217 2084682 2073614 2062398
46802 2062398 2051415 2040423 2028868 2016831 2004965 1993472 1981855 1969939 1958518 1948637 1940685 1934537
46790 1934537 1930198 1927822 1927291 1928060 1929366 1930519 1931311 1932225 1933960 1936562 1939342 1941772 1944067 1946652 1949513
46775 1949513 1952371 1955198 1958199 1961607 1965792 1971242 1978021 1985506 1993061 2000786 2009254 2018726 2029114 2040480
46761 2040480 2053040 2066673 2080934 2095624 2111005 2127379 2144709 2162668 2180809 2198684 2216048
46750 2216048 2232963 2249465 2265145 2279359 2291878 2303050 2313251 2322314 2329630 2334704 2337601 2338959
46738 2338959 2339534 2339708 2339526 2339181 2339151 2339720 2340668 2341759 2343291 2345772 2349270 2353466 2358216 2363629 2369654 2376047
46722 2376047 2382772 2389931 2397200 2403704 2408631 2411688 2412883 2412166 2409453 2404727 2397950 2389049 2378064 2365118
46708 2365118 2350224 2333289 2314258 2293066 2269588 2244057 2217437 2190825 2164372 2137266 2108966
46697 2108966 2080003 2051326 2023418 1996369 1970342 1945404 1921137 1896977 1872905 1849504 1827480
46686 1827480 1807415 1789750 1774488 1760924 1748068 1735461 1723353 1712146 1701935 1692567 1683835 1675568
46674 1675568 1667840 1661135 1656024 1652602 1650469 1649352 1649485 1651282 1654909 1660368 1667777 1677203 1688287 1700338
46660 1700338 1712865 1725817 1739143 1752293 1764465 1775333 1785261 1794595 1802971 1809602 1814130 1816884
46648 1816884 1818354 1818892 1818979 1819196 1819545 1819247 1817823 1816183 1816110 1818687 1823765 1830995 1840769 1853805 1870204
46633 1870204 1889301 1910356 1933043 1957286 1982701 2008257 2032551 2054551 2074018 2090983 2104921
46622 2104921 2114872 2120467 2122350 2121272 2117091 2109058 2096845 2080839 2061568 2039377 2014789 1988763
46610 1988763 1962257 1935666 1908894 1881947 1855387 1830198 1807246 1786786 1768417 1751481 1735514
46599 1735514 1720423 1706387 1693630 1682111 1671429 1661196 1651514 1642779 1634874 1626943 1618266 1609043
46587 1609043 1599921 1591005 1581915 1572676 1563916 1556067 1548873 1541866 1534863 1527804 1520589 1513350 1506534 1500509
46573 1500509 1495451 1491780 1490109 1490345 1491349 1492045 1492439 1493030 1493685 1493984 1494386 1496007 1499066 1502440 1505109 1507303
46557 1507303 1509801 1512760 1515880 1519293 1523518 1528669 1534275 1540015 1546198 1553355 1561535 1570218 1578899 1587731
46543 1587731 1597465 1608653 1620994 1633753 1646780 1660766 1676408 1693780 1712664 1733033 1754788
46532 1754788 1777416 1800516 1824564 1850559 1878872 1908876 1939800 1971501 2004173 2037594 2070984
46521 2070984 2103494 2134657 2164410 2192777 2219557 2244316 2266723 2286771 2304577 2320037 2332877
46510 2332877 2343013 2350622 2355868 2358800 2359642 2358999 2357582 2355663 2352836 2348372 2341966 2334203 2326147 2318330
46496 2318330 2310287 2301257 2291186 2280706 2270187 2259175 2246858 2232742 2216725 2198733 2178571 2156054
46484 2156054 2131220 2104484 2076556 2047959 2018541 1987641 1954886 1920653 1885631 1850222 1814644
46473 1814644 1779439 1745451 1713307 1683225 1655445 1630531 1609028 1590993 1576115 1564293 1555837
$$ [...]
##END NTUPLES=NMR SPECTRUM
##END=
