
##TITLE=AC1233_PERAH12114_6519287_kQ2xMY586G
##JCAMPDX= 6.0         $$ Bruker NMR JCAMP-DX V2.0
##DATA TYPE= NMR SPECTRUM
##DATA CLASS= NTUPLES
##ORIGIN= BRUKER
##OWNER= Administrator
$$ 1.72 TOPSPIN		Version 2.1
$$ 2012-07-13 17:35:08.031 -0500  Administrator@TOPSPIN
$$ Compression mode = diff/dup
##.OBSERVE FREQUENCY= 400.02188249412
##.OBSERVE NUCLEUS= ^1H
##.ACQUISITION MODE= SIMULTANEOUS (DQD)
##.ACQUISITION SCHEME= undefined
##.AVERAGES= 8
##.DIGITISER RES= 22
##SPECTROMETER/DATA SYSTEM= spect
##.PULSE SEQUENCE= zg30
##.SOLVENT NAME= COFFEE_meoh
##.SHIFT REFERENCE= INTERNAL, COFFEE_meoh, 1, 14.98509
##AUDIT TRAIL= $$ (NUMBER, WHEN, WHO, WHERE, PROCESS, VERSION, WHAT)
$$ ##TITLE= Audit trail, TOPSPIN		Version 2.1
$$ ##JCAMPDX= 5.01
$$ ##ORIGIN= Bruker BioSpin GmbH
$$ ##OWNER= Administrator
$$ $$ C:\Bruker\TOPSPIN/data/COFFEE/nmr/AC1233_PERAH12114_6519287_kQ2xMY586G/40/pdata/1/auditp.txt
$$ ##AUDIT TRAIL=  $$ (NUMBER, WHEN, WHO, WHERE, PROCESS, VERSION, WHAT)
(   1,<2012-07-13 17:35:01.296 -0500>,<Administrator>,<TOPSPIN>,<go>,<TOPSPIN 2.1>,
      <created by zg
	started at 2012-07-13 17:33:54.859 -0500,
	POWCHK enabled, PULCHK disabled,
       configuration hash MD5:
       6B 1B 68 BB D9 2E 58 E2 7F 35 AD 54 07 DF 0E 41
       data hash MD5: 64K
       88 CD 5C 1B 4A 28 11 7A 6D C7 9D 40 7D 58 CB 83>)
(   2,<2012-07-13 17:35:03.937 -0500>,<Administrator>,<TOPSPIN>,<proc1d>,<TOPSPIN 2.1>,
      <Start of raw data processing
       efp LB = 0 FT_mod = 6 PKNL = 1 PHC0 = 0 PHC1 = 0 SI = 32K 
       data hash MD5: 32K
       61 E9 25 00 FC BF 1A 32 19 E3 A4 FA 35 0C EE 5B>)
(   3,<2012-07-13 17:35:04.312 -0500>,<Administrator>,<TOPSPIN>,<proc1d>,<TOPSPIN 2.1>,
      <pk PHC0 = 178.6432 PHC1 = 0 
       data hash MD5: 32K
       6E FB 96 17 14 2D B5 40 01 BE 4E AE 7F 1D CC 8D>)
(   4,<2012-07-13 17:35:04.406 -0500>,<Administrator>,<TOPSPIN>,<proc1d>,<TOPSPIN 2.1>,
      <abs ABSG = 1 
       data hash MD5: 32K
       AF 7A AA EB 1D 2F E4 2F 32 ED 75 50 96 04 66 BF>)
(   5,<2012-07-13 17:35:04.468 -0500>,<Administrator>,<TOPSPIN>,<proc1d>,<TOPSPIN 2.1>,
      <abs ABSG = 2 
       data hash MD5: 32K
       1B 94 84 DA EE D8 5F 86 55 3C A2 F9 16 45 65 CC>)
(   6,<2012-07-13 17:35:04.500 -0500>,<Administrator>,<TOPSPIN>,<proc1d>,<TOPSPIN 2.1>,
      <abs ABSG = 3 
       data hash MD5: 32K
       19 B4 78 72 E3 3D F7 31 E7 BB 91 2E 89 6A 45 1C>)
(   7,<2012-07-13 17:35:04.531 -0500>,<Administrator>,<TOPSPIN>,<proc1d>,<TOPSPIN 2.1>,
      <abs ABSG = 4 
       data hash MD5: 32K
       A0 C8 86 63 C4 7E 44 B0 FE 4B 42 6E 2C AE 3A A8>)
(   8,<2012-07-13 17:35:04.562 -0500>,<Administrator>,<TOPSPIN>,<proc1d>,<TOPSPIN 2.1>,
      <abs ABSG = 5 
       data hash MD5: 32K
       CE FD D9 7D 16 E0 14 1B 2A A9 99 D0 13 9A 60 BD>)
$$ ##END=
$$ 
$$ $$ hash MD5
$$ $$ 87 D9 F1 BE 79 27 7B C1 6E E9 B0 A1 DA 0B F9 14
##$RELAX= 
##$RELAX= 
##$RELAX= 
##$RELAX= 
##$RELAX= 
##$RELAX= 
##$RELAX= 
##$RELAX= 
$$ Bruker specific parameters
$$ [...]
150 150 150 150 150 150 150 150
##$TP07= 0
##$TPNAME0= <>
##$TPNAME1= <>
##$TPNAME2= <>
##$TPNAME3= <>
##$TPNAME4= <>
##$TPNAME5= <>
##$TPNAME6= <>
##$TPNAME7= <>
##$TPOAL= (0..7)
0.5 0.5 0.5 0.5 0.5 0.5 0.5 0.5
##$TPOFFS= (0..7)
0 0 0 0 0 0 0 0
##$TUNHIN= 0
##$TUNHOUT= 0
##$TUNXOUT= 0
##$USERA1= <user>
##$USERA2= <user>
##$USERA3= <user>
##$USERA4= <user>
##$USERA5= <user>
##$V9= 5
##$VALIST= <valist>
##$VCLIST= <CCCCCCCCCCCCCCC>
##$VD= 0
##$VDLIST= <DDDDDDDDDDDDDDD>
##$VPLIST= <PPPPPPPPPPPPPPP>
##$VTLIST= <TTTTTTTTTTTTTTT>
##$WBST= 2048
##$WBSW= 25
##$XGAIN= (0..3)
0 0 0 0
##$XL= 0
##$YL= 0
##$YMAX_a= 494558
##$YMIN_a= -631105
##$ZGOPTNS= <>
##$ZL1= 120
##$ZL2= 120
##$ZL3= 120
##$ZL4= 120
##$ABSF1= 14.98509
##$ABSF2= -5.573092
##$ABSG= 5
##$ABSL= 3
##$ALPHA= 0
##$AQORDER= 0
##$ASSFAC= 0
##$ASSFACI= 0
##$ASSFACX= 0
##$ASSWID= 0
##$AUNMP= <proc_prof1d_extract_pilot.lims>
##$AXLEFT= 0
##$AXNAME= <>
##$AXNUC= <1H>
##$AXRIGHT= 0
##$AXTYPE= 0
##$AXUNIT= <>
##$AZFE= 0.1
##$AZFW= 0.1
##$BCFW= 0
##$BC_mod= 0
##$BYTORDP= 0
##$COROFFS= 0
##$CY= 15
##$DATMOD= 1
##$DC= 0
##$DFILT= <>
##$DTYPP= 0
##$F1P= 0
##$F2P= 0
##$FCOR= 0.5
##$FTSIZE= 32768
##$FT_mod= 6
##$GAMMA= 0
##$GB= 0
##$INTBC= 1
##$INTSCL= 1
##$ISEN= 128
##$LB= 0
##$LEV0= 0
##$LPBIN= 0
##$MAXI= 10000
##$MC2= 0
##$MEAN= 0
##$ME_mod= 0
##$MI= 0
##$NCOEF= 0
##$NC_proc= -8
##$NLEV= 6
##$NOISF1= 0
##$NOISF2= 0
##$NSP= 0
##$NTH_PI= 0
##$NZP= 0
##$OFFSET= 14.98509
##$PC= 1
##$PHC0= 178.6432
##$PHC1= 0
##$PH_mod= 1
##$PKNL= yes
##$PPARMOD= 0
##$PPDIAG= 0
##$PPIPTYP= 0
##$PPMPNUM= 2147483647
##$PPRESOL= 1
##$PSCAL= 4
##$PSIGN= 0
##$PYNMP= <proc.py>
##$REVERSE= no
##$SF= 400.02
##$SI= 32768
##$SIGF1= 0
##$SIGF2= 0
##$SINO= 400
##$SIOLD= 32768
##$SPECTYP= <>
##$SREGLST= <1H.CDCl3>
##$SSB= 0
##$STSI= 32768
##$STSR= 0
##$SW_p= 8223.68421052631
##$SYMM= 0
##$S_DEV= 0
##$TDeff= 65536
##$TDoff= 0
##$TI= <>
##$TILT= no
##$TM1= 0
##$TM2= 0
##$TOPLEV= 0
##$USERP1= <user>
##$USERP2= <user>
##$USERP3= <user>
##$USERP4= <user>
##$USERP5= <user>
##$WDW= 1
##$XDIM= 32768
##$YMAX_p= 459752408
##$YMIN_p= -776154
##$CURPLOT= <Network HP LaserJet P1505>
##$CURPRIN= <$Network HP LaserJet P1505>
##$DFORMAT= <normdp>
##$LAYOUT= <+/1D_H.xwp>
##$LFORMAT= <normlp>
##$PFORMAT= <normpl>
##$SURQMSG= 1
$$ End of Bruker specific parameters
$$ ---------------------------------
##NTUPLES= NMR SPECTRUM
##VAR_NAME=  FREQUENCY,     SPECTRUM/REAL,   SPECTRUM/IMAG
##SYMBOL=    X,             R,               I
##VAR_TYPE=  INDEPENDENT,   DEPENDENT,       DEPENDENT
##VAR_FORM=  AFFN,          ASDF,            ASDF
##VAR_DIM=   32768,         32768,           32768
##UNITS=     HZ,            ARBITRARY UNITS, ARBITRARY UNITS
##FACTOR=    0.250966925370066, 1,           1
##FIRST=     8223.43324360094, -206474,      204769
##LAST=      0,             -54972,          -171100
##MIN=       0,             -776154,         0
##MAX=       8223.43324360094, 459752408,    0
$$ Real data points
##PAGE= N=1
##DATA TABLE= (X++(R..R)), XYDATA
$$ [...]
19534i3422q3565q0330h6919m90499K66545G4221a99587B2300K41018G3624k6103
19523D7521p286b69015g4920l03093m085H7912a51932a4126j46407b0945k50171
19512b71116F5876a20382c6627G5031F242a42697K9055A02081c01745e0145j07826
19501a57971B07511d61712f282l12792a02816j43476E789d6404o9447a3973r1680
19490a05653A0144d7609A84634b2213p0838k96452b9068j45567A85208c03517
19479B6830f3679p0960A28903N3709H4438J99259c00596J31767j54418a03368
19468b50753B67597g5368J282a3088F4933a54914j78246n8965B3101a15966M8670
19457f7296k08344J04672j08624k7342J02494R7841D04423b07914a00782H5350
$$ plain form
19534 -93422 -176987 -257317 -86919 -577418 -310873 74221 -199587 22300 263318 73624 47521
19523 47521 40235 -269015 -74920 -378013 -382098 87912 -151932 -14126 -160533 -20945 -271116
19512 -271116 65876 -120382 -36627 75031 6242 -142697 -113642 102081 -301745 -50145 -157971
19501 -157971 207511 -461712 -6282 -319074 -102816 -246292 5789 -46404 -115851 -13973 -105653
19490 -105653 10144 -47609 184634 -22213 -93051 -389503 -29068 -174635 185208 -303517
19479 26830 -63679 -134639 128903 182612 84438 283697 -300596 -168829 -323247 -103368
19468 -250753 267597 -75368 -74086 -13088 64933 -154914 -333160 -392125 23101 -115966 -67296
19457 -67296 -275640 -170968 -279592 -306934 -204440 -106599 404423 -207914 -100782 85350
19446e37441f070k11714e8060A6315a41990O5768K0235D32a5940A12222B1529
19434b50561B06530a2048c711A3739a06407C8683O499a04066j32423B2470j77
19423B2293d7335o4281k46928J71685P3998n9532o3736i2476J4747j8634j00386
19412a96749b3911C2354O9377G246a86960I476a45640A54119c39401B28950J06118
19401C35068o2136D7471a3750B35971a99635B66843b23756h0657a62k37596A48799
19389C30205D2070a1525k63680C00617q1802c6807C6578P973M4897L14Q5038q1493
19377I3307b4268B70a33173A36152b49826C33468a64888A57887Q6095F5957c1261
19365a90222k31104A77573a75471f1547j67560q6997a30798D1826b43961N3171
$$ plain form
19446 -537441 -6070 -217784 -58060 16315 -141990 -76222 -55987 432 -15940 112222 21529
19434 -250561 206530 -12048 -3711 13739 -106407 38683 45182 -104066 -236489 22470 22293
19423 22293 -47335 -111616 -358544 -186859 -112861 -172393 -236129 -92476 -77729 -96363 -196749
19412 -196749 -23911 32354 101731 7246 -186960 9476 -145640 154119 -339401 228950 335068
19401 335068 272932 47471 -13750 235971 -199635 266843 -223756 -80657 -162 -237758 148799
19389 330205 42070 -11525 -275205 300617 218815 -36807 36578 44551 89448 89762 174800 93307
19377 93307 -24268 270 -133173 136152 -249826 333468 -164888 157887 243982 65957 -31261
19365 -190222 -421326 177573 -175471 -61547 -229107 -316104 -130798 41826 -243961 -190790
19355a90790A94226H3783J48971e6099n7661A40882D337b08783D8984J14071D1883
19343b11726K9054H302N6970b6258j45580e1945k27476D6775b53920H7284a76770
19331d3331G1505b71073D29106a20289j1318c2147j34805b008A8091J27798j0544
19320A35345a54677p555E8055h5713B25581a53076J804b2531j45858F4977O4292
19309A29269F4002a80022l7363M6341L0562J3812m0650B6158b92774d0220k24937
19298b65157b358k22506D7103c2040G8122O1390a59095j0460Q1153H869a33924
19286a19742o4963N2419C91335H2929h2386b1759A46969B4183K8338a82286b6380
19274a6998G0294b98487E5673h8192c0102a4994k24681I2912K1551F011J0090
$$ plain form
19355 -190790 194226 83783 232754 -56099 -113760 140882 4337 -208783 48984 163055 41883
19343 -211726 -182672 8302 65272 -26258 -171838 -51945 -279421 46775 -253920 87284 -176770
19331 -43331 71505 -271073 429106 -120289 -131607 -32147 -166952 -2008 18091 145889 135345
19320 135345 -154677 -162232 58055 -85713 225581 -153076 -151272 -22531 -168389 64977 129269
19309 129269 64002 -180022 -217385 -171044 -140482 -126670 -167320 26158 -292774 -40220 -265157
19298 -265157 -2358 -224864 47103 -32040 78122 139512 -159095 -169555 -88402 8869 -133924
19286 -119742 -184705 -132286 391335 82929 -82386 -21759 146969 24183 52521 -182286 -26380
19274 -16998 70294 -298487 55673 -88192 -30102 -14994 -239675 92912 114463 6011 16101
19263A6101a29600m7411a8691r1908n0772j29785C20097c28099H5191e6192k67180
19252c23372A07959J408B1740a85156n4016H6429b74946A97771d8894j76393J10257
19241a15030D08812D9034c980q5521p3706I6010a51200O001l81304E2627d77296
19229c78541H2660b32609B1563K51042b45177e0178l1280J1505b7773a3797l15058
19218c28855L108J21508A6822K5501b59326f6506A11700d98391b00278a1946j67565
19207a79511a8734F4492c1719A12455c60570G9257a32578I5648a16733A90739
19196D2486Q8225b89970b902j52889o9604B26386K9434d8341F8302c24191A59931
19184G8394c1908j50695a0014A48556a15065B39142C5533b35374f394r12n1612
$$ plain form
19263 16101 -129600 -177011 -18691 -110599 -161371 -291156 320097 -328099 85191 -56192 -323372
19252 -323372 107959 109367 21740 -185156 -239172 86429 -274946 197771 -48894 -225287 -115030
19241 -115030 408812 49034 -3980 -89501 -163207 96010 -151200 -145199 -526503 52627 -477296
19229 -378541 82660 -232609 21563 272605 -245177 -50178 -81458 -69953 -27773 -13797 -328855
19218 -328855 -325747 -204239 16822 42323 -259326 -66506 111700 -498391 -200278 -11946 -179511
19207 -179511 -18734 64492 -31719 112455 -360570 79257 -132578 95648 -116733 190739
19196 42486 130711 -289970 -2902 -155791 -225395 226386 255820 -48341 68302 -324191 159931
19184 78394 -31908 -182603 -10014 148556 -115065 239142 35533 -235374 -6394 -7306 -58918
19173e8918A08821a4647A65882b6593R686p2481H8522l6920A5576K5923a85935
19161b66467D42698a35149e4001p0008o0176q3914m0249I2211R6717a45715B32952
19149c45650P8752e9648j44884M5889j95647I6639c59771a10533k40612k5725
19139c76870a56299A2052d00191P3024G0031k9460c3821j77307E6230b21243B765
19127d9563B69286r3050L42838k21827a38134M0539c3029B61727a83434j46170
19117c29604G3987K39766f6684n4583j70322G0830J33186j4746a34051A19873
19106g0287D8961B2486b44076N6431A49139h1282F0338O8024J37370M1604a21435
19094b02207N3245k04934F2734N2591K28941a39373f8418k27289k5045f6194j81933
$$ plain form
19173 -58918 108821 -14647 165882 -26593 -16907 -89388 88522 51602 15576 41499 -185935
19161 -266467 442698 -135149 -54001 -124009 -184185 -268099 -308348 92211 188928 -145715 232952
19149 -345650 -266898 -59648 -204532 -158643 -354290 96639 -359771 -110533 -351145 -376870
19139 -376870 -156299 12052 -400191 -327167 70031 40571 -33821 -211128 56230 -221243 2765
19127 -49563 269286 176236 519074 297247 -138134 -97595 -33029 261727 -183434 -329604
19117 -329604 73987 313753 -66684 -121267 -291589 70830 204016 189270 -134051 119873
19106 -70287 48961 22486 -244076 -187645 149139 -81282 60338 128362 265732 307336 -121435
19094 -202207 -148962 -353896 62734 115325 344266 -139373 -68418 -295707 -320752 -66194 -248127
19083b48127o2754H3409b73430O9390m798A923f2310H2439A9519N07a63612A52892
19070B25108b06577R3822A77549a41452j81321A9056a4755A7352g6060P63K77
19059g5020m4674n7152M9236b3263j88952F3764f2141J1954D721L10482d3239
19047a8324E7922a13034A02364j7286B1568P296e95353D5790i8874p9034c5440
19035A78849D8229M1036K26778D5782R7517m5122a00935K1094J4035F7484b95766
19023A00547b75779a06244A17665J34291g988j85347B62944b13882A55474b35299
19012i6280o6675K1663o2166g9460a5458j0399e07I9898b50741a7664k12904A21632
18999a1773j709I1397P2021j9435g5046E6335c2524A92078b55000B05281n8315
$$ plain form
19083 -248127 -310881 83409 -273430 -204040 -208838 1923 -62310 82439 19519 20026 -163612 152892
19070 225108 -206577 -112755 177549 -141452 -322773 19056 -14755 17352 -76060 -75297 -75020
19059 -75020 -119694 -176846 -127610 -23263 -212215 63764 -62141 -50187 4721 315203 -43239
19047 -18324 57922 -113034 102364 85078 21568 28864 -595353 45790 -98874 -177908 -35440
19035 178849 48229 89265 316043 45782 143299 98177 -100935 -79841 -65806 67484 -295766
19023 100547 -275779 -106244 117665 251956 -7988 -193335 262944 -213882 155474 -235299
19012 -96280 -162955 -141292 -203458 -79460 -15458 -25857 -507 99898 -250741 -17664 -230568 121632
18999 -11773 -13482 91397 163418 143983 -75046 56335 -32524 192078 -255000 205281 146966
18988A46966F0551i8019E7868a42706C81510A14407a34654E3245N4596B3989c68753
18976G2714f3969A65149C8264b34126A35272c24651J51580P3268I8410a86600
18965a03705o0151B17875O9219b6705B08179l8329g0836j31866C2683O1348L5147
18954A29178o2633J86072g2783j26563N6427n0268R5511q9794A98520F6032b91540
18942a42739d2079o9887F9931Q7799a67812K9985j78269I4105b6500B91356A30255
18930E9824a29842a8379r2227L8018n3190F0831g2551Q761q2851a9522b439B91289
18917A19724i7561A06028d5431H5820b27221I9333f2458o9308A25576a79196N6689
18906a22507p7274f038B04728a50261j68286A26249c8873k23396P9234Q4418l4269
$$ plain form
18988 146966 60551 -98019 57868 -142706 381510 114407 -134654 53245 107841 23989 -368753
18976 72714 -63969 165149 38264 -234126 135272 -324651 -173071 -99803 98410 -186600
18965 -103705 -163856 217875 287094 -26705 208179 169850 -70836 -202702 32683 94031 129178
18954 129178 66545 252617 -72783 -199346 -142919 -193187 -97676 -187470 198520 66032 -291540
18942 -142739 -42079 -111966 69931 157730 -167812 -137827 -316096 94105 -26500 291356 130255
18930 59824 -129842 -18379 -110606 -72588 -125778 60831 -72551 -63790 -146641 -19522 -2439 291289
18917 119724 -97561 106028 -45431 85820 -227221 99333 -62458 -131766 125576 -179196 -122507
18906 -122507 -199781 -6038 204728 -150261 -318547 126249 -38873 -262269 -183035 -98617 -132886
18895a32886E103f9093k40855d516p3209A33303f6676E4600a05391d7745q3420
18884a31165H0098f79516e0009j72794A40108b18119A08741b64131A07608D441
18873E0230d409E8866g4025l1606C10276a70867K0719e6566G5889a05707j14645
18862b20352i3134I4705c6602j89540Q8534l48635A78829P0112F1609c13302f4342
18850F3854J21581o1278K6651L1665b1441j37781J5863A27665c6406B51872p3115
18839A78757E0421N35J01941n7351c44060f0094m3882A69319g4335j94211A95853
18827b13741l4560E7487b03306I9821b79664J27268B03003Q3390J29693A28556
18816C78523k1362r2833a28368D75187j51203a3566j03698D0665R1638a11754
$$ plain form
18895 -132886 5103 -69093 -309948 -4516 -77725 133303 -66676 54600 -105391 -47745 -131165
18884 -131165 80098 -679516 -50009 -222803 140108 -218119 108741 -264131 107608 4441
18873 50230 -4409 58866 -74025 -105631 310276 -170867 -150148 -56566 75889 -105707 -220352
18862 -220352 -93134 94705 -36602 -226142 -137608 -486243 178829 248941 61609 -313302 -64342
18850 63854 185435 124157 150808 182473 -21441 -159222 -143359 127665 -36406 251872 178757
18839 178757 50421 50956 152897 95546 -344060 -60094 -103976 169319 -74335 -268546 195853
18827 -213741 -248301 57487 -203306 99821 -279664 -152396 203003 286393 416086 128556
18816 378523 357161 264328 -128368 475187 323984 -13566 -117264 40665 132303 -111754
18805A46074p2952a58550C0001M4759J06187i401j08673E80623c3553m47677I800
18793a8486C3048c50000h1885L9186j24892j80622C1583a11476o3938B71241c65112
18781E866J43125b1449j27783K4843M9929j9263B11390a55417m18M8420n1778
18770a59193f8038q5019m8589C8469a62133f5401j07967k45617H8423c7123I7235
18758c49138I1673f2039A11977E193a64824b9901D25085g5897a1921F089d8535
18746h0571G7955a7521l11319P2281i8576i062B32062f45267a77529M9488A98032
18734d26742F088h9118j46609B55374b12718i1690j89966B4410b28941b1628k29522
18723b51150P6823M1004A8420b91975e6947J3774B97136A06141a84042B27942
$$ plain form
18805 146074 73122 -158550 30001 74760 180947 -9401 -118074 580623 -33553 -481230 9800
18793 -18486 33048 -350000 -81885 -42699 -167591 -348213 31583 -111476 -175414 271241 -365112
18781 5866 148991 -21449 -149232 -124389 -74460 -93723 211390 -155417 -155835 -107415 -159193
18770 -159193 -68038 -153057 -201646 38469 -162133 -65401 -173368 -418985 88423 -37123 97235
18758 -349138 91673 -62039 111977 5193 -164824 -29901 425085 -75897 -11921 6089 -48535
18746 -80571 77955 -17521 -328840 -256559 -98576 -9062 232062 -645267 -177529 -128041 198032
18734 -426742 6088 -89118 -235727 255374 -212718 -91690 -281656 24410 -228941 -21628 -251150
18723 -251150 -174327 -133323 18420 -291975 -56947 -43173 297136 106141 -184042 227942
18712b32397A32818a63239C91207j57885b13345I6582J0447R3015a10405B86770
18701B28685b54034B4203J73118k1036l8808a92890P7419G4059b54498L3190B2087
18689c60589a06737D50821C2629f0981D1492a9560l01293a02644J8694M1767n9741
18678a01924J0553L2948l3926k41538b0432q5414m646L4318F4336f538H6867c0889
18665c03597B6709b48124H7410O8197g0041l28087B04069f1376K6691p2129n2853
18654a59667A4880N778K81735A25630J6038c44586a03849I1880a87271j14761
18644c02032e3296m1294L3320j29271D5124f9062C62870p6037a96978d8158B46216
18632f00830H4515g9382B6349K5327c1989F6941a33575I3105J99820b596k7255
$$ plain form
18712 -232397 132818 -163239 391207 233322 -213345 96582 107029 200044 -110405 286770
18701 228685 -254034 24203 197321 176285 137477 -192890 -115471 74059 -254498 -221308 22087
18689 -360589 -106737 450821 32629 -60981 41492 -19560 -320853 -102644 -83950 -42183 -101924
18678 -101924 -91371 -58423 -92349 -333887 -20432 -105846 -110492 -76174 64336 -6538 86867 -30889
18665 -303597 26709 -248124 87410 155607 -70041 -398128 204069 -61376 -34685 -106814 -159667
18654 -159667 14880 20658 302393 125630 141668 -344586 -103849 91880 -187271 -302032
18644 -302032 -53296 -94590 -61270 -190541 45124 -69062 362870 286833 -196978 -48158 246216
18632 -600830 84515 -79382 26349 51676 -31989 66941 -133575 93105 292925 -2596 -29851
18621b9851q6596o7891E1868a1881b416F3659M517l1636K40834a69747D1767a48048
18608A01573h8048p8609h2330c7747k56184H501e1239k7550E110a09704B93797
18596b62951g1653C15306B507g9419j5913A52078J0634m7211e1370n235A15052
18584C6719Q2437a96280p9455A29415a23048j31105G3728g5000k03431f2757B39144
18572c58691a2813B92601A20950B1454J29829m4494b42859Q5742c3012B94507
18561h5021J2740l119o8763m6200l6512C07206A28221h3518B58377m0211b52516
18549d39350a75938A9100b70578H4528a68959K3654H0525a4965k15003A14050
18538d5840A3007a4534q3183l9869A52533O3146h6682C621J03530c588k2030A74946
$$ plain form
18621 -29851 -116447 -184338 51868 -11881 -2416 63659 68176 36540 277374 -169747 41767 -148048
18608 101573 -88048 -166657 -82330 -37747 -293931 8501 -51239 -78789 5110 -109704 293797
18596 -262951 -71653 315306 2507 -79419 -95332 152078 162712 115501 -51370 -56605 115052
18584 36719 119156 -196280 -275735 129415 -123048 -254153 73728 -75000 -278431 -62757 239144
18572 -358691 -12813 292601 120950 21454 151283 106789 -242859 -157117 -33012 294507
18561 -85021 -72281 -75400 -144163 -190363 -226875 307206 128221 -83518 258377 218166 -252516
18549 -439350 -175938 19100 -270578 84528 -168959 -145305 80525 -14965 -229968 114050
18538 -45840 13007 -14534 -97717 -137586 152533 215679 -86682 3621 107151 -3588 -25618 174946
18525a36399k38581I0145a02423M7552H2455c74912L7858J45985b711B23097e01856
18513d1407A52110o4840b2702H9309d7809m4757A14908e2522l76062a08966j9886
18502a28852j04496c0283j23656B79559d5424r0150j884M500N8964A62901Q0185
18491B43086d84046a78869g6373B18082F7817k2063c3323D463g1351k15052G038
18479a78890I7853O6189i0806j3555I5138A4636o325a70618A99976J10172B7241
18467b04841n6715g2164r3972D9741a10973j19408d9065k93027g9294I6637b53302
18455b60465j6139c4404b266A64779f6480k26193d7356k3476M629I890b43316
18443I2358N2937b39342A96851b94832A24284a2327l011k28887O2089c2579k89206
$$ plain form
18525 -136399 -374980 90145 -102423 -54871 82455 -374912 -337054 -191069 -2711 223097 -501856
18513 -41407 152110 87270 -22702 89309 -47809 -92566 114908 -52522 -428584 -108966 -128852
18502 -128852 -233348 -30283 -153939 279559 -45424 -135574 -137458 -132958 -73994 162901 243086
18491 243086 -484046 -178869 -76373 218082 67817 45754 -33323 4463 -71351 -286403 7038
18479 -178890 97853 164042 -90806 -104361 95138 14636 8311 -170618 199976 310148 27241
18467 -204841 -261556 -72164 -166136 49741 -110973 -230381 -49065 -342092 -79294 96637 -253302
18455 -260465 -276604 -34404 -2266 164779 -66480 -292673 -47356 -70832 -66203 9890 -243316
18443 92358 145295 -239342 196851 -294832 124284 -12327 -15338 -244225 -182136 -32579 -321785
18432c21785d54k75920J16787L9068C2487J22466a54958G0368h7277r6808j52901
18421c36986H4320g193k09366p7277a12118a1305D7197A2354M6135b772B9344
18409D33523F3645h9653B83192G6298J37453a04529C14124g3183B516R0447c6443
18397e2233j39350k35319J17232j05675G605d5554r1305c9860k26058j62519A14042
18385b1326D7490f3544A06547l0271b03991e3943a2082b305A15733B3525O8097
18374I1622e5837j9167e806B04625b4627r6979J2286j275E9624B3788P6824a19120
18361A17496a14756d3408k0766D9850b54749A78272b22019O3383j57758M7333
18351b69061J34369C9353a49814N6875K4460k09461g6432K5429B58064b57297
$$ plain form
18432 -321785 -454 -276374 -159587 -120519 32487 154953 -154958 70368 -87277 -184085 -336986
18421 -336986 84320 -7193 -216559 -293836 -112118 -11305 47197 12354 58489 -2772 29344
18409 433523 63645 -89653 283192 76298 213751 -104529 314124 -73183 2516 92963 -36443
18397 -52233 -191583 -426902 -309670 -415345 7605 -45554 -136859 -39860 -265918 -428437 114042
18385 -21326 47490 -63544 106547 76276 -203991 -53943 -12082 -2305 115733 23525 91622
18374 91622 -55837 -75004 -5806 204625 -24627 -121606 -109320 -110595 59624 23788 100612 -119120
18361 117496 -114756 -43408 -64174 49850 -254749 178272 -222019 -158636 -316394 -269061
18351 -269061 -134692 39353 -149814 -92939 -68479 -277940 -76432 -51003 258064 -257297
18340b39107H1320b83730d8323B09776c37446B41066a26048D44992h6399B25234
18329a85094N5007B8821L4487J91527a43858q8801A19919K14460F9353a80523
18318A35444a42388A44278a67863B7756J6155K3920b20809E3211Q7323b95939
18307a24312j14274d2439r9777j28575G8418f4225f681k71554a11161M1459k10565
18296b80267a9926H8006b7169A23571f3735j567k42920B57183a97039d1702B47606
18284F1037b68379J5862i2346L1665B8502b59996q576A12026f3898A62266a79816
18272c6878A3070a77128K9634b3954l14595a56578a6603B56739f7931q6871A38316
18260A20717R5114C4331h8597k00230A77157C6856c13451B2888M4499K8100e4273
$$ plain form
18340 -239107 81320 -283730 -48323 209776 -337446 241066 -126048 444992 -86399 225234
18329 -185094 -130087 28821 63308 254835 -143858 -232659 119919 334379 69353 -180523
18318 135444 -142388 144278 -167863 27756 43911 67831 -220809 53211 140534 -295939
18307 -124312 -238586 -42439 -142216 -270791 78418 -64225 -6681 -278235 -111161 -69702 -280267
18296 -280267 -19926 88006 -27169 123571 -63735 -65302 -308222 257183 -197039 -41702 247606
18284 61037 -268379 -252517 -92346 -60681 28502 -259996 -268572 112026 -63898 162266 -179816
18272 -36878 13070 -177128 -147494 -23954 -338549 -156578 -16603 256739 -67931 -154802 138316
18260 120717 215831 34331 -88597 -288827 177157 36856 -313451 22888 67387 95487 -54273
18248B5527J2229b94509A48127F6720a61307f9172A62919o5509a88133A04544
18237b29959A70170a97398h686r2616D7976P954J29643m5006b83487C14364i3359
18225a02628I5475f7221j14238c5971o4906p1148H656K07676a04990K2129k8697
18214a11558A58863J14242L44800a2065k1570j19155g6365H5918a69006B13763
18203B50110A7435c00370a102F7923k1940b69854C6488a96096M4351j02140A77397
18191c61825B22179b70538B53902a04527F1450B9134a60548a4060B31848O5675
18181B97523h0511c9496j89067A35630a17538B47340a02227l82221B266Q1668
18171H3934l3482b13540c4367k20976A31111J9182a32894m1420g7548r217b7251
$$ plain form
18248 25527 37756 -294509 148127 66720 -161307 -69172 162919 97410 -188133 104544
18237 -229959 170170 -197398 -8686 -101302 47976 55930 185573 140567 -283487 314364 -93359
18225 -102628 95475 -67221 -181459 -35971 -100877 -172025 8656 216332 -104990 -82861 -111558
18214 -111558 158863 273105 617905 -12065 -33635 -152790 -76365 85918 -169006 213763
18203 250110 17435 -300370 -1102 67923 45983 -269854 36488 -196096 -151745 -253885 177397
18191 -361825 222179 -270538 253902 -104527 61450 29134 -160548 -14060 231848 297523
18181 297523 -80511 -39496 -228563 135630 -117538 247340 -102227 -484448 2266 83934
18171 83934 50452 -213540 -34367 -255343 131111 150293 -132894 -174314 -77548 -86765 -27251
18159I9978g7089A17436j97J5420b90710k1062R8482j438A98664H0145a00777
18147h4993j9923B53692a58941j90331n2195e5279m494m6977A6480O8031C2557
18135F4862a32472e322j66499A62455c6370E4672f6973K8627j8435n0448j9781
18124a27010o727k99172b5543I234A313a61795k2856A21371i6051D8847c0535
18112A62088a40386a3313j79499h5020o4312d7145A89307n0246m6827a82564A92427
18100c58293G3495K68306b3458B4115M4053j3747L5297h4055J9277A51614c6102
18088b29181R3205p0763M2301C26694b9892k03320A9118g8950A43498a54985C53264
18076I0954e3162K3703m9610k23978L1128B16238e6910l08272J04276b960k39131
$$ plain form
18159 99978 -77089 117436 117239 132659 -290710 -311772 -213290 -214728 198664 80145 -100777
18147 -84993 -104916 253692 -158941 -349272 -401467 -55279 -59773 -106750 16480 84511 32557
18135 64862 -132472 -5322 -171821 162455 -36370 54672 -66973 -38346 -56781 -107229 -127010
18124 -127010 -133737 -432909 -25543 9234 1313 -161795 -184651 121371 -96051 48847 -30535
18112 162088 -140386 -13313 -192812 -85020 -149332 -47145 189307 139061 92234 -182564 192427
18100 -358293 73495 341801 -23458 24115 68168 54421 89718 -84055 -64778 151614 -36102
18088 -229181 -135976 -206739 -164438 326694 -29892 -233212 19118 -78950 143498 -154985 353264
18076 90954 -53162 -29459 -79069 -303047 -271919 216238 -56910 -365182 -260906 -2960 -242091
18065b42091c2681A49254J0876R1913A17044a00034k975j31297o6157a41055E486
18053A02740B9426a47159k03792a26521j85349Q7599B9373M3001a06597j22444
18043b29041i8896r8357B40532a58641K353A14175a73587D7836A501c57961f4289
18031g3182B5372a30761A54355J7014b24181i5394j74997J01760L3247j73919
18021c09303f9372A18000c84655B32454c30777g5471K0048B11398e00584a3874
18010F2102J30280K20250d9190A11722N5429b49478f5792A12447a01872i584l8581
17999d8165r6956A43135n7211B6338b75748f5610K9933A0149J51873a98992F763
17987g4273A00140l4884J28054L7757a83619I1053D008d7291A7144O9541h6678
$$ plain form
18065 -242091 -32681 149254 160130 252043 117044 -100034 -103009 -234306 -300463 -141055 5486
18053 102740 29426 -147159 -350951 -126521 -311870 -224271 29373 72374 -106597 -229041
18043 -229041 -98896 -197253 240532 -158641 -156288 114175 -173587 47836 1501 -357961 -64289
18031 -73182 25372 -130761 154355 171369 -224181 -95394 -270391 -168631 -135384 -309303
18021 -309303 -69372 118000 -384655 232454 -330777 -75471 -55423 211398 -500584 -13874
18010 62102 192382 412632 -49190 111722 167151 -249478 -65792 112447 -101872 -9584 -48165
17999 -48165 -145121 143135 85924 26338 -275748 -65610 -35677 10149 162022 -198992 6763
17987 -74273 100140 65256 193310 231067 -183619 91053 4008 -47291 17144 86685 -86678
17975B08205r8789a19368e6463j37232G656e4969E9932a24796N4109j9502d3402
17963i9435n7666f6980B6450a6148j88577j91529l5536g8918J1174D55360k23973
17952B31387A12224a0298n9413n3235m2286o7107E6568P4926D9046J87915a44851
17940I0040c4117D8055N557R7406a9455j8989B60896c9105j75564K8383B92903
17928c8496A41420e5585A38290a60108j33679a38668j2793K61H0391C5780c37969
17916C16237e0201r0555C9561f7051L2573G4604J37560j4378c53455J52195N7306
17905a43954k59624I5535c34730a07930C21161a77546e4020K6269q1934C41477
17894c80949F7708J05870o67c2326A92940b5229j41579c0980n34402f3523n500
$$ plain form
17975 208205 109416 -119368 -56463 -193695 7656 -54969 59932 -124796 -70687 -90189 -43402
17963 -99435 -157101 -66980 26450 -16148 -204725 -396254 -431790 -78918 -67744 455360 231387
17952 231387 112224 -10298 -69711 -122946 -165232 -232339 56568 131494 49046 236961 -144851
17940 90040 -34117 48055 53612 151018 -19455 -38444 260896 -39105 -214669 -186286 292903
17928 -38496 141420 -55585 138290 -160108 -293787 -138668 -151461 -151200 80391 35780 -337969
17916 316237 -50201 -140756 39561 -67051 -34478 74604 212164 197786 -353455 -201260 -143954
17905 -143954 -403578 95535 -334730 -107930 321161 -177546 -54020 -27751 -109685 341477
17894 -380949 67708 173578 172911 -32326 192940 -25229 -166808 -30980 -565382 -63523 -69023
17883f9023A43713K83032D6346b55327a14592b5803A21550b21527H0036c03027
17872E3981h3816A30344K24405c3616l5962A62927J00823j00018C9633a63046
17861E1554i0499E856J29759a33077B03666M2005a60804P1261B72955G5495i8502
17849e438A06976k4733f7793C3021a24059K8944k32258e2663A23989K5234a16924
17837A98808p0472c63192C0190a3399d05B12772J07241j32568a73498F9359n436
17826F3923f4759F4608a33827L6245j72548A58378n1355K37759b45921C6652K13372
17815B50024j16933d80773d1797C04965a03970B33465a2063k18174A06382i4643
17804h0003a7577I5523C4139J0161b02189h0661A78160a10595A22720C222c98200
$$ plain form
17883 -69023 143713 426745 46346 -255327 -114592 -25803 121550 -221527 80036 -303027
17872 53981 -83816 130344 354749 -33616 -69578 162927 263750 163732 39633 -163046
17861 51554 -90499 5856 135615 -133077 203666 245671 -160804 -89543 272955 75495 -98502
17849 -5438 106976 82243 -67793 33021 -124059 -95115 -327373 -52663 123989 149223 -116924
17837 198808 128336 -363192 30190 -13399 -405 212772 320013 187445 -173498 69359 63923
17826 63923 -64759 64608 -133827 -97582 -270130 158378 107023 344782 -245921 36652 250024
17815 250024 133091 -480773 -41797 304965 -103970 233465 -12063 -230237 106382 -94643
17804 -80003 -17577 95523 34139 44300 -202189 -80661 178160 -110595 122720 3222 -398200
17792c29098c708j01566A5668M1864L24436d1009B37762E6968b93669B3329D664
17780d667k46048a12277j1349A3869a20575I58a02698H4182C29Q6830c32904A25768
17767b24904B0910J27309a25047B9769M9672R2783c55176D70265A31275l7557
17757I3718F021a1399j86291A02481a09126c5286A85230a14378A51890a71912
17746E2835K96957a82398A4221e6170B17229b548o6495C86014a4999B0296K381
17735B2677a69835j69973A44568a07190C8727a29241C20889G6966k6879d07800
17724a33693E4595a02506n779j36525B12426a92448i5051D3972Q3617J08177M5956
17713B81722j09507a70819B14868J37024j67309b65759G8853K7646a84235a4766
$$ plain form
17792 -329098 -3708 -105274 15668 57532 381968 -41009 237762 56968 -293669 23329 4664
17780 -4667 -250715 -112277 -123626 13869 -120575 958 -102698 84182 329 87159 -332904 125768
17767 -224904 20910 148219 -125047 29769 79441 172224 -355176 470265 131275 93718
17757 93718 6021 -11399 -197690 102481 -109126 -35286 185230 -114378 151890 -171912
17746 52835 349792 -182398 14221 -56170 217229 -2548 -69043 386014 -14999 20296 22677
17735 22677 -169835 -339808 144568 -107190 38727 -129241 320889 76966 50087 -407800
17724 -133693 54595 -102506 -108285 -244810 212426 -192448 -95051 43972 127589 235766 281722
17713 281722 172215 -170819 214868 351892 184583 -265759 78853 106499 -184235 -14766
17702A45342j7182e8972j15356P1783b0839C3739c10933A21265J07804a95540
17691A92429a6764G7674b02117m6578j7449B70634b78158b919j468l88319a45346
17679b66618a6459j44422D30488b52786a02567C21694j07002b08989o1178k87492
17669e57659A334P8259J14398p1479j5577L1671J79169A26085J23501a38460L4717
17658a03743B07601q4489E8974a56552B90240A03184J61238a55564p8924J10074
17648a24414a5829E150a1444n3459A39777g2820b9114q3775G0949L26225A95600
17636b29171I85a16018B11724f5782A99251P9325a12566A01441i1095k01320D068
17624H8654a67646O1529E0870K9370K0445J56057i4693C21224h2167D5460R8163
$$ plain form
17702 145342 128160 -58972 -174328 -102545 -20839 33739 -310933 121265 229069 -195540
17691 192429 -16764 77674 -202117 -248695 -266144 270634 -278158 -2919 -4387 -392706 -145346
17679 -266618 -16459 -160881 430488 -252786 -102567 321694 214692 -208989 -270167 -557659
17669 -557659 1334 79593 193991 122512 106935 138606 317775 126085 249586 -138460 -103743
17658 -103743 207601 123112 58974 -156552 290240 103184 264422 -155564 -234488 -124414
17648 -124414 -15829 5150 -11444 -64903 139777 -72820 -29114 -112889 70949 397174 195600
17636 -229171 985 -116018 211724 -65782 199251 278576 -112566 101441 -91095 -292415 4068
17624 88654 -167646 -106117 50870 80240 100685 256742 -94693 321224 -82167 45460 143623
17613A43623a85092C4908K30937b9882k01955C92037F5801P3413I949a4152j61979
17602a76131A41134D3064a15205B26007j12793m2000N6022l4105J31022G6060
17591D7963R7219a87654C45104a71228B51712l5090b50754Q6570A0326M0666M48304
17580D99296b93708A94338c35407D4063J32040a40031G9604a50179N8363J8958
17570g2858E0822c55839A4113a79406D4179B1158N1558K44399A07451J23566a12508
17558e6817B32565F1943j4569Q8697J57636o6662a70948H5986J43094r1034b03112
17546F4490J62556K8889f5772A39813b59632e6979C90121A71812c227n2827a7495
17534D24038A27104K14832a20963I3860f3923j48395B92131a44776m8711A53389
$$ plain form
17613 143623 -185092 34908 265845 -29882 -231837 392037 65801 139214 9949 -14152 -176131
17602 -176131 141134 43064 -115205 226007 113214 71214 127236 93131 224153 76060
17591 47963 145182 -187654 345104 -171228 251712 216622 -250754 -164184 10326 50992 499296
17580 499296 -293708 194338 -335407 44063 176103 -140031 79604 -150179 -91816 -72858
17570 -72858 50822 -355839 14113 -179406 44179 21158 72716 317115 107451 231017 -112508
17558 -56817 232565 61943 47374 136071 293707 227045 -170948 85986 229080 138046 -203112
17546 64490 227046 255935 -65772 139813 -259632 -56979 390121 171812 -3227 -56054 -17495
17534 424038 127104 341936 -120963 93860 -63923 -212318 292131 -144776 -193487 153389
17523a00905G6336N2636J1191C5843K34716n3941F2747A4507i8144j1882C57504
17511b47474A41820J86743i7253D50658i8660A35948B9207a77791M4111D2577
17500A75070j071g5206j5139B0712J90635q4543D5258J46P1546K02780j49228
17489A70502a4369A01189a23311b2545H3786e9008D50415A17127g1550l6484E1666
17477A89825b7780A12954j2264J16010j07441G829J24544L6173d5359B2620J76858
17466A99478P3585a15989A32003c9156G8358J45305o5100J89843a09933A80780
17455a88472D2529M75859A27531L35278e1290C43301F7881L68720A41666M2851
17445A84517K85837A9044M46699J67412r5357B25343q6584J55540j45951K12253
$$ plain form
17523 -100905 76336 128972 140163 35843 270559 216618 62747 14507 -98144 -110026 357504
17511 -247474 141820 328563 -97253 450658 -98660 135948 29207 -177791 -133680 42577
17500 175070 173999 -75206 -90345 20712 211347 126804 45258 45404 116950 319730 170502
17489 170502 -14369 101189 -123311 -22545 83786 -59008 450415 117127 -71550 -108034 51666
17477 189825 -27780 112954 100690 216700 109259 7829 132373 168546 -45359 22620 199478
17466 199478 273063 -115989 132003 -39156 78358 223663 158563 348406 -109933 180780
17455 -188472 42529 518388 127531 462809 -51290 343301 67881 436601 141666 184517
17445 184517 470354 19044 465743 633155 537798 225343 138759 294299 148348 360601
17435C60601j37983o1382P0779q262n4171R5874n1034a45899K5920A50249J7597
17424A67846k0475K17636C0237N4026L39888H8269K94708A55417K22612J27913
17414E05942A11893J76712g9001o1750A64840J60376g5290E0378A765L107d6572
17402a52900A05002f8673C9396J86411m1520o4478a76918A80087a14874C65742
17391D47865j2706j35961m7059J75742j28595L4131a84675c7012C03730r3502
17381B10228n4551K86814a82816E81192A24669R2332b44927E086L08924K40499
17371E54509A6405N7979b16514b6288A58090a04184A63036J34667M1832E0131
17360A0396a17449C89017l4999r0315n0546k2602g0791D2068J40373b33822B69733
$$ plain form
17435 360601 222618 161236 232015 223753 169582 265456 214422 -145899 -119979 150249 167846
17424 167846 147371 365007 30237 84263 424151 88269 382977 155417 378029 505942
17414 505942 111893 288605 -79001 -140751 164840 325216 -75290 50378 1765 4872 -46572
17402 -152900 105002 -68673 39396 225807 184287 119809 -176918 180087 -114874 365742
17391 447865 435159 299198 252139 427881 299286 333417 -184675 -37012 303730 210228
17381 210228 155677 442491 -182816 581192 124669 217001 -244927 5086 314010 554509
17371 554509 16405 74384 -216514 -26288 158090 -104184 163036 297703 339535 50131
17360 10396 -117449 389017 354018 263703 213157 190555 -70791 42068 182441 -233822 269733
17348b02067A90182A2446h3756E9014a42400B02035J12445e7922C73435A42008
17337D83511G7323L07349E8400a77532j73342C7239K2087K26908k9893E2382A7201
17325I8070b37711e4287a3725j4611A83279b57578B92231k1938j7686a67312L4959
17314a32353M2926B03014k8857m269J24384I4690L6794E9698M7473K33459j58088
17303A82542D7495J16616G3740j3826N4708m5034Q8863K44566h6485A18922L75221
17292D94143A72129c9264A47192J35221J2352m7937P2477g0950A99383a24127
17281B03984L60371A31272a1596A52358d6342D14591J19934C2122M67571k12649
17271B87044p9113a66481B66463J40693a49955B39518N7420G9398J51446n8112
$$ plain form
17348 -202067 190182 12446 -83756 59014 -142400 202035 314480 -57922 373435 142008
17337 483511 77323 384672 58400 -177532 -350874 37239 59326 286234 256341 52382 17201
17325 98070 -237711 -54287 -13725 -28336 183279 -257578 292231 270293 252607 -167312 -132353
17314 -132353 -89427 203014 174157 169888 294272 94690 131484 59698 107171 340630 182542
17303 182542 47495 164111 73740 59914 114622 69588 158451 403017 -86485 118922 494143
17292 494143 172129 -39264 147192 282413 294765 246828 319305 -70950 199383 -124127
17281 203984 564355 131272 -11596 152358 -46342 414591 534525 32122 499693 287044
17271 287044 207931 -166481 266463 407156 -149955 239518 296938 79398 230844 172732
17261A72732J49709B5858g6161R200F5862J79171A09293j8026K67019a21284g926
17249g3657B87886J88302A58152L13050B26962I8138J57022M721K7191p8936L3617
17238B41753G3770J4332K15111a39695b025A41286o9068N6422c9876J6249C16681
17226C05189l0112j4325N1328G2558l052K66178J59811A95858h4615H6959M74553
17215E61512j54814f1971C01319J05524j95405K8738a6349D37751j17924j6459
17205C03368k3587a3881F4044L09900A13011C8119J34838R7991b31390A68461
17194A38236K6920J19818A12451K5201J97940n5555j35894Q3599K71292j12602
17184C86432A34973b6974p5983D30863o0604e5789D38423j63397n0541N2989j13177
$$ plain form
17261 172732 322441 25858 -76161 -66961 65862 245033 109293 91267 358286 -121284 -7926
17249 -73657 287886 476188 158152 471202 226962 98138 255160 259881 287072 208136 241753
17238 241753 73770 88102 303213 -139695 -2025 141286 72218 128640 -39876 -23627 316681
17226 305189 275077 260752 312080 72558 69506 335684 495495 195858 -84615 86959 561512
17215 561512 406698 -61971 301319 406843 211438 240176 -16349 437751 319827 303368
17205 303368 279781 -13881 64044 373944 113011 38119 172957 270948 -231390 168461
17194 138236 165156 284974 112451 137652 335592 280037 144143 227742 499034 386432
17184 386432 134973 -26974 -102957 430863 370259 -55789 438423 275026 224485 277474 164297
17173A64297K17998j13624J70712j0752j01540D2115J27196M43423a54774D49031
17162A47069K75937j99749k6868g8279E25523h366B10223K13486r8706j2499J22455
17151D34959q1885j25993J82433j19842O6075J78724E6305J92240a04615G834
17140A35026K84111E8344N8637J05807k7281L33129B42281J07941q0509M18795
17130F88508B46862J63822a8094C43521j28194e3263B73414L40370b5161E76661
17119E07098B2060M94171k00381j05937P370l2925J98151A55406M52458j29355
17109D78509j59103J08490p7521a9319C46013A2481M84784l3309j09748j04058
17099B50150J25259K58925B12760J44037O8579p503j80538K65747n1153P5049
$$ plain form
17173 164297 382295 268671 439383 428631 327091 42115 169311 612734 -154774 449031
17162 147069 423006 223257 196389 -78279 525523 -8366 210223 423709 325003 312504 434959
17151 434959 353074 227081 409514 289672 355747 534471 56305 248545 -104615 7834
17140 135026 419137 58344 116981 222788 195507 528636 242281 350222 269713 688508
17130 688508 246862 410684 -18094 343521 215327 -53263 273414 613784 -25161 576661
17119 507098 22060 516231 315850 209913 217283 184358 382509 155406 607864 478509
17109 478509 319406 427896 350375 -19319 346013 12481 497265 463956 354208 250150
17099 250150 375409 634334 212760 356797 425376 417873 237335 503082 451929 526978
17089E26978j55512j37728J8419L18710p8304j79762k0648n6612L30879k61141
17079C05279M41870B18254L39912B34348J92502j03277J26375Q6846m8140r3723
17069C94931D0291N45961k09659J12039q4658J89206H5832L61332j27983J30273
17059D49454A53903J58209k4564K36478k20523j03459K79346A20722N58287k9936
17049F49073j4296j14296P1085J40077A72382L96136j29980J64703B94858M76025
17039G70883r6182k57034J19865P6286L5655R3516l09557L17022B67948K34724
17029E02672R7510p0143O8340o2503K35755k84511Q9234B45809K45546m565K28581
17018G15371j86455M48873m46395k6799A33053L61100K63108l02145J72523n117
$$ plain form
17089 526978 371466 233738 252157 570867 492563 312801 292153 235541 566420 305279
17079 305279 747149 218254 558166 234348 426850 323573 449948 536794 488654 394931
17069 394931 40291 586252 376593 488632 403974 593180 85832 447164 319181 449454
17059 449454 153903 312112 287548 524026 303503 200044 479390 120722 679009 649073
17049 649073 634777 520481 591566 731643 172382 568518 438538 603241 294858 770883
17039 770883 674701 417667 537532 613818 649473 742989 433432 750454 267948 502672
17029 502672 600182 530039 598379 535876 771631 487120 576354 245809 491355 486790 715371
17018 715371 528916 977789 531394 504595 133053 494153 757261 455116 627639 622522
17008F22522Q5087n6002k8778J19479P8327k12561Q2393k9966k9252J44191r3812
16997F81628j29299P3534J06310l50737J65131J08340j46370K38084j29773r4631
16987E22217L8101L82292l01058k07460L76370L6942j75289M6674J62611j92801
16977F88599O102J12721j88119M09053j82016k8610L11k13455L98950k01833P55
16966H02458J02975j27729k82648O20768k09645m2280l05417M27896j38435J14579
16956I62522l5504K5500j86444j00128L38655j70639J1472P7824j01212J41247
16946I63293K10100R1327k66092K19576n06468K59047K56257l74404K70926k9269
16936A094293K70792j2138r6135N4328l39350M96710n58618M69665K4190l05786
$$ plain form
17008 622522 707609 651607 622829 742308 820635 608074 690467 660501 631249 775440 681628
16997 681628 552329 625863 732173 381436 546567 654907 508537 746621 616848 522217
16987 522217 560318 942610 641552 434092 810462 847404 672115 718789 881400 688599
16977 688599 694701 807422 619303 1028356 846340 817730 818041 604586 1003536 801703 802458
16966 802458 905433 777704 495056 1115824 906179 863899 558482 986378 847943 962522
16956 962522 927018 952518 766074 665946 1004601 833962 845434 923258 822046 963293
16946 963293 1173393 1264720 998628 1218204 711736 970783 1227040 852636 1123562 1094293
16936 1094293 1365085 1352947 1256812 1311140 971790 1468500 909882 1379547 1403737 1097951
16926A097951N5866J71702J27719J61712l77172j32858M81313j0548k55215K31598
16916A552068L5647m27522J15637M81099n39142J28832K07240j05301j74324J95747
16906A469981q5578J57206n2730J0064J1070K73516l0092J46622k05790K48128
16896A942397m56964M80797n8554j23211j3491j8375J10565l10828K99559J69453
16886B021348r5884J0344k58202Q8841L0092n2929L02008K162o5531J60431L7370
16875B180050j91349R4966L49846j89364j96307M80410n77695L67391K35398N2193
16865B605539J42767j37841j11883L80937j74810m25619K74329J62615l02994
16856B413040M01850r2486J67719Q3422j25314M34050k7380k01427O7492J35825
$$ plain form
16926 1097951 1153817 1325519 1453238 1614950 1237778 1104920 1586233 1575685 1320470 1552068
16916 1552068 1587715 1160193 1275830 1756929 1217787 1346619 1553859 1448558 1274234 1469981
16906 1469981 1384403 1541609 1488879 1498943 1510013 1783529 1753437 1900059 1694269 1942397
16896 1942397 1485433 1966230 1907676 1784465 1770974 1752599 1863164 1552336 1851895 2021348
16886 2021348 1925464 1935808 1677606 1766447 1796539 1743610 2045618 2047780 1982249 2142680 2180050
16875 2180050 1988701 2083667 2433513 2244149 2047842 2528252 1950557 2317948 2553346 2605539
16865 2605539 2748306 2610465 2498582 2879519 2704709 2279090 2553419 2716034 2413040
16856 2413040 2814890 2722404 2890123 2973545 2848231 3282281 3254901 3053474 3120966 3256791
16846C256791p906J33261P0033K75383l89400k12364M45541p4400Q270J39011
16836C644220O3448J56344M54746k19770k17460J51156P4829J25220q6180L83815
16826D530368j32698P4166K86514M51218n30121M85982l62896M23400K44011j71486
16816E298458n2929O30941l31147O2961O98956j90697K36310K3755J85801K73121
16806F835530o3134O1471j46810N68811J66216L57573q9138L15065J75761J56841
16796H338186J30722K36494L18330J94780J73136K65191R5126M30518j86502O80933
16786A0676914L22793Q8609M44890K25328M35102J58910N55411N70218r2974P86219
16776A4171420O06318m5838Q15966N64816M21880O94795N34686N77685M49801
$$ plain form
16846 3256791 3248885 3382146 3452179 3727562 3338162 3125798 3571339 3496939 3505209 3644220
16836 3644220 3707668 3864012 4318758 4098988 3881528 4032684 4107513 4232733 4146553 4530368
16826 4530368 4397670 4471836 4758350 5209568 4679447 5165429 4802533 5225933 5469944 5298458
16816 5298458 5245529 5876470 5545323 5608284 6307240 6116543 6352853 6376608 6562409 6835530
16806 6835530 6772396 6833867 6687057 7255868 7422084 7779657 7690519 8005584 8181345 8338186
16796 8338186 8468908 8705402 9023732 9218512 9391648 9656839 9751965 10182483 9995981 10676914
16786 10676914 10999707 11088316 11533206 11758534 12193636 12352546 12907957 13478175 13385201 14171420
16776 14171420 14777738 14731900 15547866 16112682 16534562 17229357 17764043 18341728 18791529
16767A8791529R63810L83011P82175R88657Q09993P06434J286700M82028J248522
16758B6442859J015324J372072J425645R51449J500141J271749J958769J262199
16750C7200207K373044J598611K171585K125747K612382K445904K813256K735465
16742E6076201L216852L465202L721425L933581L891221M896936M567468N190457
16734H8959343O065345N650325O228504O422335P401712P613921P720303P897464
16726A43959252Q551390Q195945Q026346P941917P204966O897653N378688M102892
16718B00259049L551305J504475L20041j575626k979022m010632n719195o573733
16710A84776662p506027p921748q147705q801494q471982q020677q088850p787022
$$ plain form
16767 18791529 19755339 20138350 20920525 21909182 22719175 23425609 24712309 25194337 26442859
16758 26442859 27458183 28830255 30255900 31207349 32707490 33979239 35938008 37200207
16750 37200207 39573251 41171862 43343447 45469194 48081576 50527480 53340736 56076201
16742 56076201 59293053 62758255 66479680 70413261 74304482 79201418 83768886 88959343
16734 88959343 95024688 100675013 106903517 113325852 120727564 128341485 136061788 143959252
16726 143959252 152510642 160706587 168732933 176674850 183879816 190777469 196156157 200259049
16718 200259049 203810354 205314829 205634870 204059244 201080222 197069590 191350395 184776662
16710 184776662 177270635 169348887 161201182 152399688 143927706 135907029 127818179 120031157
16702A20031157p624761p116236o715665n835418o136423n207145m884105m581996
16694G1929408m317108l902978m161073l179834l205304k613475l058998k598635
16686D4892003k204221k348987k019654j521842k118230j519138j780299j467930
16678B9911702j246097j574994j023239r26542j061093r46709r39306r34534j186106
16669B0073082p41641m93789q53018o02997p66904n05120m21542p37479l39829
16660A4610763l06089q96961k31502o84926M4417l01247o15941n34207m23509
16651A0660798R4010k8418j121381q3631J9377j47903l19165l78553m39032o2974
16641H193128j87428J3723p21266j24999J54119m80215j10482j92462n1260j96661
$$ plain form
16702 120031157 112406396 105290160 98574495 92739077 86602654 81395509 76511404 71929408
16694 71929408 67612300 63709322 59548249 56368415 53163111 50549636 47490638 44892003
16686 44892003 42687782 40338795 38319141 36797299 34679069 33159931 31379632 29911702
16678 29911702 28665605 27090611 26067372 25140830 24079737 23133028 22193722 21259188 20073082
16669 20073082 19331441 18837652 17984634 17381637 16614733 16109613 15688071 14950592 14610763
16660 14610763 14304674 13407713 13176211 12491285 12535702 12234455 11618514 11084307 10660798
16651 10660798 10754808 10726390 9605009 9521378 9540755 9392852 9073687 8695134 8256102 8193128
16641 8193128 8005700 8019423 7298157 7173158 7327277 6847062 6736580 6544118 6492858 6296197
16631F296197l32385L38453l26673m01511O8714k62023J20205k72925j44965n407
16621E077680l29601r7723K10519P9500n27235L40836m49478m04024J81622K09321
16611D291417l18286q343k12972k58550J77611j01872K1084J00444j65687P4708
16601C599554r2955m26304j02953J73576j47810j85995J51733J45364j40564k17360
16591B756286k16275J8965K45102k21226J72345L8781o27677L33625L22170m09621
16581B412475J48780l00991J91841k60626K30189j52351j80289L06797K583l72504
16571B025904j187k2427R153j98914J08002K06326k90264o6651L54208J33887
16561B258037m51875J29489j79143J91727k70334o4059Q7197J4595j84498m9520
$$ plain form
16631 6296197 5963812 6302265 5975592 5574081 5642795 5380772 5500977 5228052 5083087 5077680
16621 5077680 4748079 4650356 4860875 4940375 4413140 4753976 4304498 3900474 4082096 4291417
16611 4291417 3973131 3964788 3751816 3493266 3670877 3569005 3590089 3690533 3524846 3599554
16601 3599554 3506599 3080295 2977342 3150918 3003108 2817113 2968846 3114210 2973646 2756286
16591 2756286 2540011 2558976 2804078 2582852 2755197 2793978 2166301 2499926 2822096 2412475
16581 2412475 2561255 2260264 2452105 2191479 2421668 2269317 2089028 2395825 2398408 2025904
16571 2025904 2024717 2002290 2011443 1812529 1920531 2126857 1836593 1769942 2124150 2258037
16561 2258037 1806162 1935651 1756508 1948235 1677901 1613842 1701039 1715634 1531136 1481616
16551A481616J07569l4722K55759l15646m5718m04777N62068j14482l72885N2195
16541A170977J86986q6825J15848o3794K33496l42034K1378r9131P8004l8478
16531A176427r1451j1468M02145n40749J91869j31477P6554q6391L67684k24670
16521A128473m01360L21441Q5675k28450L4091J45058l18870J52495o3620r8675
16511G56258L58571j47021j02577O6374R8901J5290p6754l15457K62288l75205
16501E40668j23415O34873l09070Q6566j6568k24990N1241M80084k08171k76715
16491F34503L39166r4034k82258K04994l90749M68042O2446j60482L0423J05795
16481I17846j58353j94270K13153k36869o4330M04535l81198J60268r1802p294
$$ plain form
16551 1481616 1589185 1554463 1810222 1494576 1448858 1044081 1606149 1491667 1118782 1170977
16541 1170977 1357963 1271138 1386986 1323192 1556688 1214654 1236032 1136901 1214905 1176427
16531 1176427 1084976 1073508 1475653 934904 1126773 995296 1071850 985459 1353143 1128473
16521 1128473 727113 1048554 1134229 905779 939870 1084928 766058 918553 854933 756258
16511 756258 1114829 967808 865231 931605 1030506 1045796 969042 653585 915873 540668
16501 540668 417253 1052126 743056 829622 813054 588064 639305 1119389 911218 634503
16491 634503 973669 879635 597377 802371 411622 879664 942110 781628 812051 917846
16481 917846 759493 565223 778376 541507 477177 881712 500514 660782 568980 561686
16471E61686q846J94457k62609P0589j20153M5787k7794L11638K4932E3737N86235
16460F39972R3317k73536J35387L1217J0079n9741K34872p7592j71626m0518J8563
16449E40394J40497j28239K84277D14495J87096Q0216B91278J08536k959J71281
16439E68136K43814l95229L94144j75078L8864k26794K7075O2406k10721J88098
16429E14715k50008K26605L5174k09383R4837J84048k61021A25256K66232K87737
16419F79225k2202B47943j21759M23177m4155n6801J10180k6688p2244M1683j33652
16408C67684J89467k0962J27135A96404K04227P9617J30334j77533K06952H1162
16397E08896j26509I6893J85838C7515Q6548N42193l32214a55705B51028J46935
$$ plain form
16471 561686 552840 747297 484688 555277 435124 480911 453117 764755 789687 53737 639972
16460 639972 733289 459753 595140 626357 636436 576695 811567 733975 562349 521831 540394
16449 540394 680891 552652 836929 414495 601591 681807 291278 399814 396855 568136
16439 568136 811950 416721 810865 635787 674651 447857 474932 537338 326617 514715
16429 514715 264707 491312 526486 317103 411940 595988 334967 125256 391488 679225
16419 679225 657023 247943 126184 549361 505206 448405 558585 531897 459653 501336 367684
16408 367684 557151 536189 663324 196404 400631 480248 610582 433049 640001 81162
16397 508896 382387 96893 282731 37515 124063 666256 334042 -155705 251028 397963
16387C97963A91728O325J00383Q3819j70292Q2385J01386o2951k9751J61526j17708
16376C46850J83497I3973L94885a2614B49603J50390A23368B2082L74955A18858
16365C33987m647A5736M81552j47345j02184A02097M10691a9507A45286K45112
16355C90398n9547j38292o4188M36746b67951d3143A68878b2352E45938D5175
16344A87621N0416j6135b77614b8822C69713A75669G2559M00701k10777J53319
16334D15802A97761b3958A41797J37588A11605a55564A40403c9855A84650J08124
16324B92774l5226J57850A90185K63214A43801K19579D7588j6096J61728J41517
16314C34737k7688A24484c00870E7051B3959a62295C47137j61526R4637G2550
$$ plain form
16387 397963 191728 198053 298436 382255 211963 294348 395734 332783 303032 464558 346850
16376 346850 530347 93973 488858 -12614 249603 399993 123368 22082 397037 118858
16365 333987 329340 15736 497288 349943 247759 102097 512788 -19507 145286 390398
16355 390398 330851 192559 128371 565117 -267951 -43143 168878 -22352 545938 45175
16344 187621 238037 221902 -277614 -28822 369713 175669 72559 473260 262483 415802
16334 415802 197761 -23958 141797 279385 111605 -155564 140403 -39855 184650 292774
16324 292774 257548 415398 190185 453399 143801 363380 47588 31492 193220 334737
16314 334737 307049 124484 -300870 57051 23959 -162295 347137 185611 280248 72550
16303I3878P4663c45308A72057N3417d1121A35152J17111i6943A94463N3556I0866
16291A43207e6071a5240o7544B02886A870J98289d1660p2719A37304a64152l6627
16280b00779C19707D1736J96051a5991k06247D670N29388a47139A45485A7742
16269D564J31292k7058R2881a36096C3708P5429d1019q4551I7006M5234M8548
16258A90788q4575J2242h5554l8869A34144K33361q4775n0633P4739I4899j7924
16247G6975l4999J47064F8592f9948A68966Q7769O814f0129C5859g2768C4816
16235B54089A26636j3008d7376D77197b93347C7106f2951E7745L34251A07765
16224I2987j3056J85318D1726b43762A05242k2474n896D38f5947C71251d8866
$$ plain form
16303 93878 168541 -345308 172057 225474 -41121 135152 252263 -96943 194463 248019 90866
16291 143207 -56071 -15240 -82784 202886 1870 200159 -41660 -114379 137304 -164152 -200779
16280 -200779 319707 41736 237787 -15991 -222238 4670 534058 -147139 145485 17742
16269 4564 135856 108798 201679 -136096 33708 109137 -41019 -125570 97006 142240 190788
16258 190788 106213 118455 -85554 -124423 134144 367505 282730 232097 306836 94899 76975
16247 76975 41976 189040 68592 -69948 168966 256735 263549 -60129 35859 -72768 34816
16235 254089 126636 113628 -47376 477197 -293347 37106 -62951 57745 391996 107765
16224 92987 79931 265249 41726 -243762 105242 82768 76872 438 -65947 371251 -48866
16212c24052c6119j05296A28576J69241a51342m1018n4651B73300a54065B61079
16201E5657b44604a12149C3277a45374E8203N2881a31267O0987F0813d12897C26318
16189b90698A0511M07395a4437H9597B9861A84N5845b18550h8559J7768A03473
16177B6499g3568j62152B25457j08520D2879a84280P3785A30545D0823a68626
16166C15723e8876j19915B46079d9060A09028E4189K09162g4807l359A01871c1704
16154B00930r4958H829K18895a3311j56288E9883Q0255j4002c0981A05629G641
16142I9988B2918a62013B10107R386b8766j32106I450J09574M0459F3874E576
16130h2772m34921G6917e0030A0914J46488b9907c72A34305c7686B91613j34323
$$ plain form
16212 -324052 -36119 -141415 128576 297817 -151342 -192360 -247011 273300 -154065 261079
16201 55657 -244604 -112149 33277 -145374 58203 111084 -131267 -70280 60813 -412897 326318
16189 -290698 10511 417906 -14437 89597 29861 184 56029 -218550 -88559 -70791 103473
16177 26499 -73568 -235720 225457 116937 42879 -184280 -110495 130545 40823 -168626
16166 315723 -58876 -178791 246079 -49060 109028 54189 263351 -74807 -78166 101871 -31704
16154 200930 105972 8829 227724 -13311 -169599 59883 140138 126136 -30981 105629 7641
16142 99988 22918 -162013 210107 219493 -28766 -160872 9450 119024 159483 63874 5576
16130 -82772 -517693 76917 -50030 10914 157402 -29907 -372 134305 -37686 291613 157290
16119A57290o2167b46397A56719i7114E9305a37247A72866c6982B04780K4653
16109B29433i959C11182a99594d190B40207b4281F1324b08857A69606l2612C8339
16097a23539B90930A562J24354e8672D77406f5896j53743A58327o678c8749B9628
16085a9137F9085b76802c6149j63002B17815E4362R8653b8844j20679A44672i473
16073d10229i3583A78629E5698c31094f9609b6625j43300A41111i7425L8018k40721
16062c00128B09929a44702A51322b8811E9670a9242E4759J56703F5931D179O636
16051A0815M2356J71128j02389d4278C40984a38389e1593m9776k4673A0962Q5943
16040I6905b63819B63994g7188l0541C25303j34599i872F4675J93203o5824n6005
$$ plain form
16119 157290 95123 -246397 156719 -97114 59305 -137247 172866 -36982 204780 229433
16109 229433 -9959 311182 -199594 -4190 240207 -24281 61324 -208857 169606 136994 38339
16097 -123539 290930 1562 125916 -58672 477406 -65896 -219639 158327 151649 -38749 29628
16085 -19137 69085 -276802 -36149 -199151 217815 54362 153015 -28844 -149523 144672 -9473
16073 -410229 -93583 178629 55698 -331094 -69609 -26625 -169925 141111 -97425 -59407 -300128
16062 -300128 209929 -144702 151322 -28811 59670 -19242 54759 211462 65931 4179 10815
16051 10815 53171 224299 121910 -44278 340984 -138389 -51593 -101369 -126042 10962 96905
16040 96905 -263819 263994 -77188 -107729 325303 190704 -9872 64675 257878 192054 136049
16029A36049a8842B24896m5439i641k8632A08620O877a7838f050E8269a37344
16017d9298n3793k27675D70568a5774B3365J49855c0918k35544a28081k41497
16007c69578a00852C03902b57344A03619e7953k05320f7135j47632L65e2978G2058
15995d32159J87667D0704P679a01605A64877g0749B09631B3644P1485B9715a13924
15983B89596H1177h4124A22846L802P001J05161M0913G7422a18954a320p6704
15972g8024A76260N8171I755a88494H2252a7585b215A36698b4439A16146i9564
15960A30401D8875O2661K46081j19950c01190C3045b97677Q8474K4138C31489
15949F3088a29765l7985e3981a6810j61834Q3152A38175a23615j2861a6973q4672
$$ plain form
16029 136049 -18842 224896 179457 -9641 -38273 108620 115497 -17838 -6050 58269 -137344
16017 -49298 -103091 -330766 470568 -15774 23365 173220 -30918 -266462 -128081 -369578
16007 -369578 -100852 303902 -257344 103619 -57953 -263273 -67135 -214767 -214402 -52978 72058
15995 -432159 -244492 40704 48383 -101605 164877 -70749 209631 23644 95129 29715 -113924
15983 289596 81177 -84124 122846 126648 133649 238810 279723 77422 -118954 -1320 -78024
15972 -78024 176260 234431 9755 -188494 82252 -17585 -2215 136698 -24439 116146 -99564
15960 130401 48875 111536 357617 237667 -301190 33045 -297677 -209203 -185065 331489
15949 63088 -129765 -167750 -53981 -16810 -178644 -95492 138175 -123615 -136476 -16973 -101645
15938a01645A36571b06052b9052G6627J81757n8093I9124a5742r6369c1459j29783
15927a61242e8304j65739a5668l2422o2261j77745A36391d8620C62675c75040
15916A48154i9158J0593k49638a2045r4745E8502N1763a18680k03979B94100r7166
15905A96934a53529k38525I5705b39599H0785a42080a7433A98421b93610C20429
15894a17375j72813A18832m4217h6255j89791B38550b21148j19213F168J67302
15884A73470l5493C0239a32922j88683F2744N8835A9119h8264D9229g3086l08160
15873c81246a4790f979j04287B22940c69222A7335b73795g4317A21787n9729j0389
15862E1669g6553k83833A62477d3836C44901B9071K88798i3960n0290k19191a3841
$$ plain form
15938 -101645 136571 -206052 -29052 76627 258384 200291 99124 -15742 -112111 -31459 -161242
15927 -161242 -58304 -224043 -15668 -48090 -110351 -288096 136391 -48620 362675 -375040
15916 148154 -99158 -88565 -338203 -12045 -106790 58502 110265 -118680 -322659 294100 196934
15905 196934 -153529 -392054 95705 -239599 80785 -142080 -17433 198421 -293610 320429
15894 -117375 -290188 118832 74615 -86255 -276046 238550 -221148 -340361 6168 173470
15884 173470 137977 30239 -132922 -321605 62744 121579 19119 -88264 49229 -73086 -381246
15873 -381246 -14790 -6979 -111266 222940 -369222 17335 -273795 -74317 121787 62058 51669
15862 51669 -76553 -360386 162477 -43836 344901 29071 317869 -93960 -144250 -363441 -13841
15850B48865b89051D7095L163b43976B15953b64720J20429M6122o6149j70904
15840c35222E7467j0367K86952A52852K3558p1215i1890q9896j87670d1162J4590
15829b6572J0850m4792l3707A28798L5798a36325k7590n8772O8754N7664m3437
15818a39706A31583b72819i9250k299k33147C52691b66867R4943P7312l7511C8020
15806C6724L4406M8277g530r9359N805A47378J3597M652e4545j08477B62393a10276
15793b01199M4898F5574a33258A37888K31005c8014f801j12305j5326B32176a99211
15781c98226H5683a57767J7859r4611A899b57580R1486A35800b67898l1133A64885
15769a98892g5093j43588i2336C1978e1917j75833A43821L187a31662A18489h7086
$$ plain form
15850 248865 -289051 47095 50258 -243976 215953 -264720 -144291 -98169 -164318 -335222
15840 -335222 57467 47100 334052 152852 176410 105195 -91890 -181786 -369456 -41162 -26572
15829 -26572 -15722 -60514 -94221 128798 164596 -136325 -163915 -222687 -153933 -96269 -139706
15818 -139706 131583 -272819 -99250 -101549 -334696 352691 -266867 -171924 -94612 -132123 38020
15806 36724 71130 119407 -7530 -106889 -101084 147378 160975 165627 -54545 -163022 262393 -110276
15793 -201199 -156301 65574 -133258 137888 368893 -38014 -6801 -119106 -134432 232176 -199211
15781 -398226 85683 -157767 -139908 -234519 1899 -257580 -166094 135800 -267898 -299031 164885
15769 -198892 -75093 -218681 -92336 31978 -51917 -227750 143821 147008 -131662 118489 -87086
15757C06415A42275c0546B15964p8935i183k7908J1568A8687e6620B31516B3835
15745a72658A30241n2286j3060P9721a92948C75961n3235g2594A85490b91154
15734d149F3192K31178D5278N3612J04252b95264e7555j73827i8208G1017R0242
15723A61259c34708a38207F8566a52949P0670c0790a1134A7145N6587B8499J52842
15712A81341p8598d5707l86112A19246J07226c50256C8669c21121a40115A045
15701A59609a57642A32452c4634k18426A53522a27651b7829j21257j31748J32275
15691a48559C04470c5892A14458J17913R8182j50662d9395q2627C45729j22936
15681B22793i0789j84264a0388k46680B19779g2215A82888a58333M7058D80408
$$ plain form
15757 306415 142275 -30546 215964 137029 -9183 -37091 -25523 18687 -56620 231516 23835
15745 -172658 130241 77955 64895 144616 -192948 375961 322726 -72594 185490 -291154
15734 -4149 63192 294370 45278 98890 203142 -295264 -57555 -231382 -98208 71017 161259
15723 161259 -334708 -138207 68566 -152949 -82279 -30790 -11134 17145 73732 28499 181341
15712 181341 102743 -45707 -431819 119246 226472 -350256 38669 -321121 -140115 1045
15701 159609 -157642 132452 -34634 -253060 153522 -127651 -27829 -149086 -280834 -148559
15691 -148559 304470 -35892 114458 232371 330553 179891 -49395 -132022 345729 222793
15681 222793 -90789 -275053 -10388 -257068 219779 -72215 182888 -158333 -111275 480408
15670b09600A78870d2956k40999c1854J3446A88414a19985N1318j6352K1287j6105
15659g9837C41014b94614A90901b13637i2507A3444b99648Q9454a02960G2632
15648I5237b3348E7472j202J57732a83599h206k30825j3493e940k29324A20385
15636a87230e7425k48810f7328l14740F4062J6575a32070o6092B8574J34807A1290
15624f3360B9162O2133e5401K5045n7456A31667b8539E4264a5823l086I4856l2571
15612F2285a15099H0619k9358h4786l0235B6856a53048l29658i437A09671C7140
15600B6862J25335a30589B8958a38407D8860A3418a24581A52634j2042h2854C737
15588B00750k9051G9896b02985G9763g2337F8133b1459k07802C27761b9942k46694
$$ plain form
15670 -209600 178870 -42956 -283955 -31854 -18408 188414 -119985 -68667 -85019 -63732 -79837
15659 -79837 341014 -294614 190901 -213637 -92507 13444 -299648 -210194 -102960 72632
15648 95237 -23348 57472 56270 214002 -183599 -8206 -239031 -252524 -5940 -235264 120385
15636 -187230 -57425 -306235 -67328 -382068 64062 80637 -132070 -198162 28574 163381 11290
15624 -63360 29162 91295 -55401 -30356 -87812 131667 -28539 54264 -15823 -18909 94856 62285
15612 62285 -115099 80619 51261 -84786 -115021 26856 -153048 -482706 -9437 109671 37140
15600 26862 152197 -130589 28958 -138407 48860 13418 -124581 152634 140592 -82854 3737
15588 200750 171699 79896 -202985 79763 -72337 68133 -21459 -229261 327761 -29942 -276636
15577b76636A92012N1187c1417p3095G4362P5491i1015F6317N9768b50423Q3082
15566a67341q6494J351E9721a12467j8048B50397a56564D11621I0449b143A51870
15554a93363k8176e1382I8147b3389B08338d854j37816B75130I8547r849e191
15542b41726d7832j9917F1208h8298o878o1775A98533f6229b4814A77498D1368
15530A68930M1548B5499J11373K32311C2876J24415B8530b52126i9808B59519
15519f0815H938d93909A30002J83230a60783d6864A45582G1945a06056A51503
15508b21799A91567I0407E201a81242Q5207k3921G007b10746k6975h5061r5903
15497a80964B65763a63519H086a95115A00884b85697a00038a4723m72644I0266
$$ plain form
15577 -276636 192012 243199 -31417 -104512 74362 149853 -91015 66317 126085 -250423 -167341
15566 -167341 -253835 -252484 59721 -112467 -130515 250397 -156564 411621 90449 -2143 151870
15554 -193363 -221539 -51382 98147 -23389 208338 -4854 -142670 275130 98547 88698 -5191
15542 -241726 -47832 -67749 61208 -88298 -95176 -156951 198533 -66229 -24814 177498 41368
15530 168930 210478 25499 136872 369183 32876 157291 28530 -252126 -99808 259519
15519 -60815 8938 -493909 130002 313232 -160783 -46864 145582 71945 -106056 151503
15508 -221799 191567 90407 5201 -181242 -96035 -119956 7007 -210746 -237721 -85061 -180964
15497 -180964 265763 -163519 8086 -195115 100884 -285697 -100038 -14723 -487367 90266
15486B53560a679D5376a12037e3799A22917L6503P7438p4026g6505j19027E595
15474A49404A1073N1570a93504B94008a29986e5932A44181g6820L402o7535A55235
15462h166j07752j1358K3792I2103B5684P3248b36097A07107q520b67245P2094
15451a95151i6808k18158G9485a89224A57145F6755j4361b92895A26594a81434
15440A78305j9320a30756D30503A75072e47190J33214i3364A62022Q3595p7053
15430A68564J3033p9889a17752c0105A65114J4533b11193h6301a7440B96228g8752
15418C59150e48725A17523b17335h7341A83007E4023c12527j5791F7355P1173
15408A38528c02058C87248a3170A40177J73508A652c2882A61269h7381p0654d1773
$$ plain form
15486 253560 -1679 45376 -112037 -53799 122917 159420 236858 162832 -76505 -195532 5595
15474 149404 11073 62643 -193504 294008 -129986 -55932 144181 -76820 -73418 -140953 155235
15462 -8166 -115918 -127276 -103484 92103 25684 98932 -236097 107107 98587 -267245 -195151
15451 -195151 -96808 -314966 79485 -189224 157145 66755 52394 -292895 126594 -181434
15440 178305 158985 -130756 430503 175072 -547190 -413976 -93364 162022 245617 168564
15430 168564 181597 101708 -117752 -30105 165114 179647 -211193 -86301 -17440 296228 -78752
15418 359150 -548725 117523 -217335 -87341 183007 54023 -312527 -328318 67355 138528
15408 138528 -302058 387248 -13170 140177 313685 1652 -32882 161269 -87381 -158035 -41773
15396A53665d5704k88209A15305L765c40720A29095a66496B36471A02398a47832
15385f4325D1021R6357a09936C3863a63764A05813f5632K4597j86605H6594b06783
15373g1533L2548k1213k79841A39396i9104j86932f8531A81758B8213c3700j11422
15362a45122F061J18915D3973R978a02761A65625d13219B75065a20887C12834
15351b28380J05688p3488A31702d2007C87736i9486A52704K86777A11432j7338
15341I4094a2575C20913c11455B79441H4047a22614g086j55590E9103b34747A8881
15329E9416O383A0445b18437F6995c0016a4496A24133D6820J83257o7172E1055
15317I2910b75453B28763a75699B11336n4018Q540F3304D100J93774b91766J10708
$$ plain form
15396 153665 -45704 -333913 115305 119070 -340720 129095 -166496 236471 102398 -147832
15385 -64325 41021 137378 -109936 33863 -163764 105813 -65632 -41035 -227640 86594 -206783
15373 -71533 -38985 -60198 -340039 139396 -99104 -286036 -68531 181758 28213 -33700 -145122
15362 -145122 6061 124976 43973 53951 -102761 165625 -413219 275065 -120887 312834
15351 -228380 -122692 -196180 131702 -42007 387736 -99486 152704 439481 111432 94094
15341 94094 -12575 320913 -311455 279441 84047 -122614 -7086 -162676 59103 -234747 18881
15329 59416 65799 10445 -218437 66995 -30016 -14496 124133 46820 230077 162905 51055
15317 92910 -275453 228763 -175699 211336 157318 165858 63304 4100 197874 -291766 -181058
15306a81058A32379C3413c05351k5279N669h3047A06046P2749J06532c2086A10144
15294F1471j3311K53252a10017l4506C19561h2684l6683E8631Q0524e8810A23724
15282A86049q1554a99368d1295l2239p433E22766I0952h0411H8621J30507J1546
15271B30674c03652b5248A3715N1517f0190J2158A36496D7095f3069m1841I1966
15259A46015h9057D93063f9452A45700B0767g6737A53639J68829A1097K77998
15249B89095J13397J224561l95985r9941K72135F35734A40371h2478B02262n6294
15239A45968l5327F122K47872o1862H6103c59D87331j31673C0098J07079Q0129
15228B17306F814J05661b77586I3480J41121a66899B30604I2363a50897g122E3020
$$ plain form
15306 -181058 132379 33413 -305351 -330630 -324961 -83047 106046 178795 285327 -32086 110144
15294 61471 48160 301412 -110017 -144523 319561 -82684 -119367 58631 139155 -58810 123724
15282 186049 104495 -199368 -41295 -73534 -80967 522766 90952 -80411 88621 219128 230674
15271 230674 -303652 -25248 13715 65232 -60190 -48032 136496 47095 -63069 -104910 91966
15259 146015 -89057 493063 -69452 145700 20767 -76737 153639 322468 11097 289095
15249 289095 402492 1627053 1231068 1131127 1403262 635734 140371 -82478 202262 145968
15239 145968 110641 6122 253994 192132 86103 -359 487331 355658 30098 137177 217306
15228 217306 6814 112475 -277586 93480 234601 -166899 230604 92363 -150897 -7122 53020
15216a523A95477E0401R3453J23925b09357C9922J20637N2651D2639b2760B00131
15204i3378B42288b53084B04479p0696Q2038F4245A2227c45490A72694b2821B3835
15192a16298A96085C8214M40188a6959F6396P6032n629M8666b08216j70228D78201
15180a80401A20572a68254I9835L02528a84057B7588h3203k22351a40798B8482
15169h1557c5722H1905b62812H0246a22709A4743b613k77993F4765J19300r216
15158A74849M4919E7913J39886q6692J22942A1938J6258J27355P5578I7554i9802
15146A55342o8917J61918a49177D9155L0878a6984B39783n9793K21659H6013J2360
15135I8373a69347E19508r3015R1296A60240L03233E553J92214J18262J1424J59575
$$ plain form
15216 -1523 195477 50401 143854 267779 -209357 39922 160559 213210 42639 -22760 200131
15204 -93378 242288 -253084 204479 133783 215821 64245 12227 -345490 172694 -22821 23835
15192 -116298 196085 38214 478402 -16959 66396 142428 136799 185465 -208216 -378444 478201
15180 -180401 120572 -168254 99835 402363 -184057 27588 -83203 -305554 -140798 28482
15169 -81557 -35722 81905 -262812 80246 -122709 14743 -2613 -280606 64765 184065 174849
15158 174849 219768 57913 197799 111107 234049 11938 28196 155551 231129 97554 -99802
15146 155342 86425 248343 -149177 49155 80033 -16984 239783 179990 401649 86013 98373
15135 98373 -169347 519508 426493 517789 160240 463473 5553 197767 316029 327453 487028
15124D87028j82451F6879b1602A33633a43590C8746K80874H2872K0638q115A6175
15112a4512B21771H4216J33687d4639B3645J12552J25277p2670F8729K2482A4964
15100g5160B71163C4301J70441a2086A95101J2065F220a14626F91870A56748E2861
15088G0860d7932o0769C15958D0908K37658J0569B9883J29592o5446J69086p6986
15077A86129l5779b6111k0224C90172A84838L4461I0241l3877e1360b3072A04229
15065C10944j25379J87678j65054J06901f8305A30561J3890g7752B75346q0632
15055A94714D8632J20608B8524J47596K5413N2373a35143D84774B06670l2062
15045A74608b09114e6109A45363a12898B81714c175A00265O6078l3145L76940
$$ plain form
15124 487028 304577 66879 -21602 133633 -143590 38746 319620 82872 103510 95395 16175
15112 -14512 221771 84216 217903 -44639 23645 136197 261474 188804 68729 91211 14964
15100 -75160 271163 34301 204742 -12086 195101 207166 6220 -114626 691870 156748 52861
15088 70860 -47932 -108701 315958 40908 278566 289135 29883 159475 94029 263115 186129
15077 186129 150350 -26111 -46335 390172 184838 219299 90241 56364 -51360 -23072 104229
15065 310944 185565 373243 208189 315090 -68305 130561 144451 -77752 275346 194714
15055 194714 48632 169240 28524 176120 201533 253906 -135143 484774 206670 174608
15045 174608 -209114 -56109 145363 -112898 281714 -3175 100265 166343 133198 510138
15035E10138B10171p047J32J42934K11145A71515j1355a60634C4098J89506n3923
15024A69681h6136C00687C7579c4080B19677a65709B73483R9823G0241K36766
15014C07007I1932j4320B3457i2258A29280N21285G6339N3155a19621D05389A76850
15002C93742A30310C9061L4961M12970j80750A44040K47590j1034J57132A1934
14991C30547j3565A71K18314o3788J92770j14010D0346L5424a36025A53043J91100
14980C44143j07786j2092J77897j25191K9454j4621a83737A26837L06558j10462
14970C22933l0591r1884a41965C91119O0253o5638a1150D275L95209A02423K6664
14959A29087c2601m6656C05262B5341J44407M5315D784J60812K70883K9727p5522
$$ plain form
15035 510138 210171 203124 203256 346190 557335 171515 160160 -160634 34098 223604 169681
15024 169681 -86136 300687 37579 -34080 219677 -165709 273483 373306 70241 307007
15014 307007 91932 77612 23457 -92258 129280 650565 76339 129494 -119621 405389 176850
15002 393742 130310 39061 74022 486992 306242 144040 391630 380596 537728 11934
14991 330547 316982 171 218485 154697 347467 233457 40346 75770 -136025 153043 344143
14980 344143 236357 224265 402162 276971 306425 291804 -183737 126837 433395 322933
14970 322933 292342 200458 -141965 391119 451372 385734 -11150 4275 399484 102423 129087
14959 129087 -32601 -79257 305262 25341 169748 215063 4784 165596 436479 466206 390684
14948C90684j58538H4711K80909p4398o0199K68247k19189j18414M370J58046
14938C24083J08745A89901B3590J41876L81390B08293r0753m1100O0561e8143
14927D22960Q6444q5467M7013K1304c02619C95006K29128B13152J84460h5058
14916G05624B63497N8100L56127j49181n6579D6500K17561R5772A45526K52522
14906C98048K5809A54873L68755j96905J64006J02305q8887A88890M49838j84962
14896D53766J41436B12355p5675K54599j59065J0349L07690B26434L2319m5714
14886B13039J86591Q704K43042B6765L06953a1498D52302J59989B59808J04182
14876C63990A46771Q1034K31731j33657A42574K45682L2398j46158J23611p7796
$$ plain form
14948 390684 232146 84711 365620 291222 231023 499270 280081 161667 166037 324083
14938 324083 432828 189901 23590 165466 546856 208293 117540 76440 137001 -58143
14927 422960 509404 423937 470950 492254 -302619 395006 624134 213152 397612 -85058
14916 705624 263497 321597 677724 528543 471964 46500 264061 359833 145526 398048
14906 398048 423857 154873 523628 326723 490729 593034 504147 188890 638728 453766
14896 453766 595202 212355 136680 391279 232214 242563 550253 226434 258753 213039
14886 213039 399630 408334 651376 26765 333718 -11498 452302 612291 259808 363990
14876 363990 146771 227805 459536 325879 142574 388256 420654 274496 398107 320311
14866C20311r533K5727p4392J27079J02060j1049q6116J98942J06917l37925j00182
14855B61839o4497j4315J60094K92710k27278j72092M25330C10212J44127A67837
14844B79429M10418j76706j86293O1577L6571J10868n9554A72180J89024n6548
14834C04656K6136j0632K81081k01221j29510K96532A27713L56665K57669A93695
14823F99995j00396J48146j83082q6481M7258j03081j33994n7607N07475l42215
14813C96018j05535L51684A35998L30840O8898K29288k06193k70443J03817J1376
14803D03581j37881L3434J59944K6864n1809j14971K80838C9410L32801K53277
14793F25488q7321J75591j74806l6543J07009R1537n0521m5263M0315K16413B04976
$$ plain form
14866 320311 310778 336505 262113 389192 491252 480203 394087 593029 699946 362021 261839
14855 261839 197342 183027 343121 635831 408553 236461 661791 310212 454339 167837
14844 279429 689847 513141 326848 388425 424996 535864 476310 172180 361204 304656
14834 304656 330792 320160 601241 400020 270510 567042 127713 484378 742047 193695
14823 699995 599599 747745 564663 478182 525440 422359 288365 230758 738233 396018
14813 396018 290483 642167 135998 466838 535736 765024 558831 288388 392205 403581
14803 403581 265700 299134 459078 485942 434133 319162 600000 39410 372211 625488
14793 625488 538167 713758 538952 502409 609418 700955 650434 605171 645486 861899 204976
14781B47876L48342N5685q372j35814J08090k05901K30574k38451J11511Q5846
14771E99386N5733J68601k15738K58627p0231l4119C79873L83967K48491k96396
14761G15935j87960J85731N861j7386j83685J29978J07037k8509C39772K32969
14751E72741n6563a6086A033518l65677J16772j33019L08820j70631J34031k7715
14741H96099l83041K33077k75773L99941K4281Q2588l25010B98634N58613j83036
14731F74211M41017k93505j31893J90679k52022J79327m8484J12050N6221k99726
14721F27875K71388q9098j50402J91707j2669k21266j58034M25696k37524J61157
14711H08830j58086L34478k44616M0988j5400j09408J57905K52380m97920K03892
$$ plain form
14781 247876 596218 651903 643531 507717 615807 409906 640480 402029 513540 599386
14771 599386 655119 823720 607982 866609 796378 762259 379873 763840 1012331 715935
14761 715935 527975 713706 719567 702181 518496 648474 755511 727002 339772 572741
14751 572741 516178 -16086 1033518 667841 784613 651594 960414 789783 923814 896099
14741 896099 513058 746135 470362 870303 894584 977172 652162 298634 857247 674211
14731 674211 1115228 821723 689830 880509 628487 807814 759330 871380 927601 627875
14721 627875 899263 810165 659763 851470 838801 617535 459501 885197 647673 808830
14711 808830 650744 985222 740606 781594 766194 656786 814691 1067071 569151 773043
14701G73043L06391k00668J64614k95715J80672K41537m44385K72519r5202j74251
14691G28555L4324j9493k69176O91915k27141m7588O6935L00323n28741M60881
14681A190794k42652M5198L18038m39575R4572m6046l28694K38375J43595k3520
14671I50085L67895n1877l74940J19787J13994l38609J53829J09801j30452J39559
14661A059072J27659r2868k9985J45140m30838M22148J8451l5692k35330K08936
14651A156693J2111j84493N24293k35247J79236l11136J90230j13776K56682n73475
14641I01118L23461j35988L30010K1993j8099P5530m40686J95961K29097p0505
14631A411892l22639K2189O28775m46109K88687k00489L53392m58447L25226j02906
$$ plain form
14701 773043 1079434 878766 1043380 747665 928337 1169874 725489 998008 902806 728555
14691 728555 762879 743386 474210 1166125 938984 891396 958331 1258654 729913 1190794
14681 1190794 948142 993340 1311378 871803 966375 920329 591635 830010 973605 950085
14671 950085 1317980 1266103 891163 1010950 1124944 786335 940164 1049965 919513 1059072
14661 1059072 1186731 1093863 1063878 1209018 778180 1200328 1218779 1183087 947757 1156693
14651 1156693 1168804 984311 1508604 1273357 1452593 1141457 1331687 1217911 1474593 901118
14641 901118 1224579 1088591 1418601 1440594 1422495 1498025 1057339 1253300 1482397 1411892
14631 1411892 1089253 1111442 1740217 1294108 1582795 1382306 1735698 1277251 1602477 1499571
14621A499571J4356q8376J31420R8151m01435O2068M29816l88442K25599K90891
14611A873619r76k70226k32749L37193j84116J09793K93683q7293m52494Q3042
14601A469476J34447M8267l05402M55016j63914j48706Q2922J22132K43209j30003
14591A807444o7728j31827K53933J6932L33407k69572K92778o25543J07840K41657
14581A959321k20117J58075J48917K9810M04444k51715K01759k72347p8579K78842
14571B358410k14542J34469j10631J12376J04625P4818K6203K77655l81235L13913
14561B696061L4770Q9950J42024m7481K11831j42640M16600M84207P2486N87290
14551D545098N38764J237438K125708M943487R293837J6639642K008564k0067675
$$ plain form
14621 1499571 1513927 1425551 1556971 1655122 1253687 1315755 1745571 1357129 1582728 1873619
14611 1873619 1872643 1602417 1369668 1706861 1522745 1632538 1926221 1838928 1386434 1469476
14601 1469476 1603923 1652190 1346788 1801804 1637890 1489184 1572106 1694238 1937447 1807444
14591 1807444 1739716 1607889 1861822 1878754 2212161 1942589 2235367 1609824 1717664 1959321
14581 1959321 1739204 1897279 2046196 2076006 2480450 2228735 2430494 2158147 2079568 2358410
14571 2358410 2143868 2278337 2167706 2280082 2384707 2459525 2485728 2763383 2382148 2696061
14561 2696061 2730831 2820781 2962805 2915324 3127155 2984515 3401115 3885322 3957808 4545098
14551 4545098 5083862 6321300 8447008 13390495 22684332 39323974 41332538 21264863
14543B1264863I087527m536768j344787q10400O5310j08135k90901N7923M86627
14534B606396k64872l55353J74494J67802n52444K61433K70475o54j24984M61605
14524B643898k90895J56322l26529L92077k41407J35318J98142q8909k7641Q8986
14514B639362J19634P2735r1109q7275P1444J23218K37199k8705k85898K0431
14504B791036O23717l62381R7576P1962k28826J9752R4604K16657M5262j86675
14494C182684L86877k29033m8819q9251J39264J93601M0067M40498p50139L16308
14484C582057K30356M2826R502M30150j75062q2404k61691L34806K31413m67086
14474C874867M79572k88651K62742j19021K14933p3192L89186k89222J12632Q1610
$$ plain form
14543 21264863 9087527 4550759 3205972 2395572 2460882 2352747 2061846 2119769 2606396
14534 2606396 2341524 1986171 2160665 2328467 1776023 2037456 2307931 2307277 2182293 2643898
14524 2643898 2353003 2509325 2182796 2574873 2333466 2468784 2666926 2578017 2550376 2639362
14514 2639362 2758996 2831731 2740622 2653347 2724791 2848009 3085208 3056503 2770605 2791036
14504 2791036 3414753 3052372 3149948 3221910 2993084 3012836 3107440 3324097 3369359 3182684
14494 3182684 3569561 3340528 3291709 3202458 3341722 3535323 3575390 4015888 3265749 3582057
14484 3582057 3812413 3855239 3864741 4294891 4119829 4037425 3775734 4110540 4341953 3874867
14474 3874867 4354439 4065788 4328530 4209509 4424442 4351250 4740436 4451214 4563846 4645456
14464D645456R4663p4529L87345q6686n2598J02527l3029K12365J34079J07752
14454E437345m26963N48046k58922L89568J20876k5598L8155J08632j56012P3316
14444E848443J01181J80107r7795N17828k47665j78034K87178N3831k7288M95347
14434F933133j9407k11210l6344K34238K78778j43241L92839r4797L39408r5139
14424G578258K68685M2066M18944R3691o11742O49526k24255J20943M38508l50789
14414H423835L67214M52861M6701K7339L79976l22026N87616r8097J72286K86949
14404A0324654M23703r5596k51569M81326J16716L10860K79480J64653J74180
14395A1928407J99922M130K82337K50843j22732L38701O22366l6512J41119M51922
$$ plain form
14464 4645456 4740119 4665590 5052935 4966249 4913651 5016178 4983149 5195514 5329593 5437345
14454 5437345 5010382 5558428 5299506 5689074 5809950 5784352 5822507 5931139 5775127 5848443
14444 5848443 5949624 6129731 6031936 6549764 6302099 6124065 6411243 6465074 6437786 6933133
14434 6933133 6913726 6702516 6666172 6900410 7179188 7035947 7428786 7333989 7673397 7578258
14424 7578258 7846943 7889009 8307953 8401644 7789902 8439428 8215173 8336116 8774624 8423835
14414 8423835 8791049 9243910 9290611 9317950 9697926 9375900 9963516 9865419 10037705 10324654
14404 10324654 10748357 10652761 10401192 10882518 10999234 11310094 11589574 11754227 11928407
14395 11928407 12128329 12132459 12414796 12665639 12542907 12881608 13503974 13467462 13608581 14060503
14385A4060503M61176J18538j07350L89479M34937q9791P52199K12273M25912
14376A6657876K14363J12813O17090K03261J50839M38026N53980P35853k00466
14367A9483635L68252O54168N62997K94223O14290K51104N05237R42596K22111
14358B3898613J79316P66024N11664L32462J427102O5176M48470Q79161Q45472
14349B9353460O26469Q58965O89061P51045R87176O54988O96197R70874Q20859
14340C6409094J257990J352938P15814R96059J636242Q56071J308831J557016
14332D6090055J074381J595721J382375J445028K162468J256977J783572K377506
14324E9168083J754900J788661K620350K317131K118581K498141K912940J907155
$$ plain form
14385 14060503 14521679 14640217 14532867 14922346 15357283 15267492 16019691 16231964 16657876
14376 16657876 16872239 16985052 17602142 17805403 17956242 18394268 18948248 19684101 19483635
14367 19483635 19851887 20506055 21069052 21363275 21977565 22228669 22733906 23676502 23898613
14358 23898613 24077929 24843953 25355617 25688079 27115181 27180357 27628827 28507988 29353460
14349 29353460 29979929 30838894 31527955 32279000 33266176 33921164 34617361 35588235 36409094
14340 36409094 37667084 39020022 39735836 40731895 42368137 43224208 44533039 46090055
14332 46090055 47164436 48760157 50142532 51587560 53750028 55007005 56790577 59168083
14324 59168083 60922983 62711644 65331994 67649125 69767706 72265847 75178787 77085942
14316G7085942L185942L262888L206169L539311L096985M371123L598984M075632
14308A05422976N199572M314746M814661N358948N536432O186795O077917O488610
14300A49400657P132869P686703P660573Q212420Q925665R126969R658632J0516650
14292B18321138J0617409J1141347J2210661J2109654J2912671J3332575J3568287
14285C04213742J4289401J4502326J4733358J4550479J4524735J4201477J3775541
14278D04791059J3177225J1796395J0864684R241471O396192L485382l43121j008895
14270D58400392j309014r48148l394209o060857q668984j0004004j1257763j2633675
14262D04123738j3658806j4635549j5120184j5474272j5441630j5369760j5094310
$$ plain form
14316 77085942 80271884 83534772 86740941 90280252 93377237 97748360 101347344 105422976
14308 105422976 110622548 114937294 119751955 125110903 130647335 136834130 142912047 149400657
14300 149400657 156533526 164220229 171880802 180093222 189018887 198145856 207804488 218321138
14292 218321138 228938547 240079894 252290555 264400209 277312880 290645455 304213742
14285 304213742 318503143 333005469 347738827 362289306 376814041 391015518 404791059
14278 404791059 417968284 429764679 440629363 449870834 456267026 459752408 459409287 458400392
14270 458400392 457091378 456143230 452749021 446688164 438019180 428015176 416757413 404123738
14262 404123738 390464932 375829383 360709199 345234927 329793297 314423537 299329227
14255B99329227j3726372j3747190j3403529j2840313j2165351j1537175j0889246
14248B11020051j0577644r743878r197053q806174p955033p637297p623089o433552
14240A43046331o608519o412738m940526n453534n247138n147152m510231m132851
14232A00593642m063814l502019l775404l340215l667124k910992k898871k761917
14224G3673286l046614k034743k525044k268947k051081j926049k070846j948970
14216E5800992j910031j673405j314036j489834j637238j273992j443562j377917
14208D3680977r56551r50284j027548j454087j421899p20110j172724r50418n46878
14199C4480478r05382j214375p90249q23157p45532k10172j086706j089459n37888
$$ plain form
14255 299329227 285602855 271855665 258452136 245611823 233446472 221909297 211020051
14248 211020051 200442407 190698529 181501476 172695302 164740269 157102972 149479883 143046331
14240 143046331 136437812 130025074 125084548 119631014 114383876 109236724 104726493 100593642
14232 100593642 96529828 93027809 89252405 85912190 82245066 79334074 76435203 73673286
14224 73673286 70626672 68591929 66066885 63797938 61746857 59820808 57749962 55800992
14216 55800992 53890961 52217556 50903520 49413686 47776448 46502456 45058894 43680977
14208 43680977 42724426 41774142 40746594 39292507 37870608 37150498 35977774 35027356 34480478
14199 34480478 33575096 32360721 31570472 30747315 30001783 29791611 28704905 27615446 27077558
14190B7077558l13222q10627n26346o70080o74896n09007o97782q1423n66272
14181B2227903p37801k85913n30518o04093j14394l80414j50026o10619l25590
14172A8488535o67025j12814n54482l03944j80331n46671k68909K9164p96578
14163A5086945J35603l20769m38535n9115l35660r9548l78906m16444m0109J41655
14153A3275117m49490m0696p55113M08257k94694l87272J06121o60252j32826
14144A1069152j68449o1681m6197k54305q8183k26326j0930j18318k80041k07952
14134I606770L57703q02697j95600R6213j0186l18290J3734j59986n40077J60685
14124H208269j59206K22138j86296r7585j0952j11892m22958r2323L62654n51183
$$ plain form
14190 27077558 26764336 25953709 25427363 24757283 24082387 23573380 22875598 22794175 22227903
14181 22227903 21490102 21204189 20673671 20069578 19955184 19574770 19424744 18814125 18488535
14172 18488535 17821510 17708696 17154214 16850270 16669939 16123268 15854359 15883523 15086945
14163 15086945 15222548 14901779 14463244 14404129 14068469 13968921 13590015 13173571 13133462 13275117
14153 13275117 12825627 12784931 12029818 12438075 12143381 11756109 11862230 11201978 11069152
14144 11069152 10900703 10839022 10792825 10538520 10450337 10224011 10213081 10094763 9814722 9606770
14134 9606770 9964473 9161776 8966176 9062389 9052203 8733913 8747647 8587661 8047584 8208269
14124 8208269 8049063 8271201 8084905 7987320 7976368 7864476 7441518 7349195 7711849 7160666
14114G160666L55448l77810N1378m02435j7428L0486J69234n67175j3751J56406
14104F545019q5352L1413l42541j4632R9191k62313M7721n8939N4753k72935j50821
14093E590564j35378N1350n8042J90834j63930J21839J52078m98506J06766l71782
14083D985793Q1269m9127p604K6788K4402k37645p7846K97590n04835J12833m9059
14072D602559q4888J50226R1334m58153M7256k00861J13620Q852k2673K780q1589
14061D168463J77949j33247K1520j30055l5716j52614K97423k46255n47905K97917
14051C717480k56870L58486j00749J78898k94723l1226l20756L49196k57341l90013
14041B952382K73415m4949K33971j99069j928j71609K26519k00825J86635m6901
$$ plain form
14114 7160666 7516114 7138304 7189682 6787247 6769819 6800305 6969539 6402364 6388613 6545019
14104 6545019 6459667 6491080 6148539 6133907 6233098 5970785 6018506 5959567 6014320 5741385 5590564
14093 5590564 5455186 5506536 5448494 5639328 5475398 5597237 5749315 5250809 5357575 4985793
14083 4985793 5067062 5017935 5010331 5037119 5061521 4823876 4746030 5043620 4538785 4651618 4602559
14072 4602559 4517671 4667897 4759231 4301078 4348334 4147473 4261093 4269945 4247272 4250052 4168463
14061 4168463 4346412 4213165 4234685 4104630 4068914 3916300 4213723 3967468 3419563 3717480
14051 3717480 3460610 3819096 3718347 3897245 3602522 3571296 3250540 3599736 3342395 2952382
14041 2952382 3225797 3180848 3414819 3215750 3213822 3042213 3268732 3067907 3254542 3207641
14031C207641J60569N4014l30813K38563m11725K24083j21114k05295L58364l69777
14021B804510J99578q15986N47160k32912K59212p6806l82453K46533k33340Q6143
14011B401639K42497k88709P1467L34946l17450k16044J47373J8122L08589n09941
14001B192489J17346J92891j61040n7562j38287L41188n3354R4415j33912K38074
13991B632248N1946P59554J175358L493403P503851J7544849Q611055j7209635
13983B4562629j1703092m631191j907483r64555r16145q14723r9233q21203L35718
13974C040722p8247k23697k06872k3106j9180L79853o22100L51919k03025j59047
13964B237220M3954m7103J84036k05605O8552o5140k67361o272L48044n37288
$$ plain form
14031 3207641 3368210 3422224 3091411 3329974 2918249 3142332 3021218 2815923 3174287 2804510
14021 2804510 3004088 2188102 2735262 2502350 2761562 2684756 2302303 2548836 2315496 2401639
14011 2401639 2644136 2355427 2426894 2761840 2444390 2228346 2375719 2393841 2702430 2192489
14001 2192489 2309835 2502726 2341686 2284124 2145837 2487025 2433671 2528086 2394174 2632248
13991 2632248 2684194 3443748 4619106 8112509 15616360 33161209 41772264 24562629
13983 24562629 12859537 8228346 6320863 5356308 4440163 3625440 3526207 2705004 3040722
13974 3040722 2962475 2738778 2531906 2508800 2489620 2869473 2247373 2599292 2396267 2237220
13964 2237220 2281174 2234071 2418107 2212502 2281054 2215914 1948553 1942281 2290325 1753037
13954A753037O42042j01062l21883j52402M81830m60311N3555M62642l94168j97276
13944A766004J45862k93256K25241j69875O5067J57896j8339r8603J52258j55927
13934A776328K78699q0715J08257m73819K90865l79349J87890l56424L31355j60227
13924A522860j18084O9794q8732L7358J67106P7800l40584M25348p2591k00714
13914A479561L7001j7207k17737L25435j6661M5007j09726r375k60329M23452
13904A679421R3950n03832N18536l31588L55Q1426k80671L38301k15143P021j41002
13893A246774K71764j84308J27084j17707j47068L10735l11784K41288l00283
13884A136495J81345l59883L73698J8376j69924K68664l19945K12532l66826M00749
$$ plain form
13954 1753037 2395079 2294017 1972134 1819732 2301562 1841251 1894806 2357448 1963280 1766004
13944 1766004 1911866 1618610 1843851 1673976 1739043 1896939 1878600 1779997 1932255 1776328
13934 1776328 2055027 1974312 2082569 1608750 1899615 1520266 1708156 1351732 1683087 1522860
13924 1522860 1404776 1474570 1385838 1423196 1590302 1668102 1327518 1752866 1680275 1479561
13914 1479561 1516562 1499355 1281618 1607053 1590392 1635399 1525673 1516298 1255969 1679421
13904 1679421 1773371 1269539 1788075 1456487 1456842 1538268 1257597 1595898 1380755 1387776 1246774
13893 1246774 1518538 1334230 1461314 1343607 1196539 1507274 1195490 1436778 1136495
13884 1136495 1317840 957957 1331655 1350031 1180107 1448771 1128826 1341358 974532 1375281
13874A375281Q7167m71049K4923L72140j41460j76592q2961M17868l64892N2938
13864A093363o1793J04164q6308j20743J57926o5036N3641P5254j31454K64091
13854A283105j55415E17937N76363K66315F14137N66571j07765j55011K88548
13845A206480l04288J73096j61845O812L13136k76860J13233k03196q7997J43117
13835I21688q7025K33225K99183k15725l14633R4595m6255j75297J34502J05974
13825I50232m747o9595j80061L71968Q8449k08735l2833j30562L89569n40674
13815F33011N80269j39598m80769Q2641K15089l57721N80444E54702L25300k42432
13805F37570J67318o3103l8474O3437N8332l85562L56977J23325k05361k15528
$$ plain form
13874 1375281 1462448 991399 1016322 1388462 1247002 1070410 987449 1405317 1040425 1093363
13864 1093363 1031570 1135734 1049426 928683 1086609 1021573 1075214 1150468 1019014 1283105
13854 1283105 1127690 517937 1094300 1360615 614137 1180708 1072943 917932 1206480
13845 1206480 902192 1075288 913443 920255 1233391 956531 1069764 866568 778571 921688
13835 921688 834663 1067888 1367071 1151346 836713 931308 885053 709756 844258 950232
13825 950232 945485 875890 695829 1067797 1156246 947511 914678 784116 1173685 633011
13815 633011 1213280 1073682 592913 675554 890643 532922 1113366 554702 880002 637570
13805 637570 804888 741785 703311 766748 825080 439518 796495 919820 714459 498931
13795D98931m6074O94471D42049M12186j92808K57702K6744p8803P8562k36629
13785G09003j7257k07665J60634K97723K0644k03399j30772R4320J34955r4366
13775G63820J12749j31238J35507j81846j57316K21236l00617j0637L79994k05050
13765F26602k78710M69119m05856L80582K44279l47265J02071j64733k51769R5027
13755D69347Q5007P2517O8150q1649J86861k77090m1923N97829D05067L39160
13745G44227j71560R0419L14819j34462k19851K35124q8721l36594K95777n5859
13735F73319l14602M74634n3664j43550M49320D77704J59543Q484K768J18948
13725G67447k35310O2459J43062k22661K60455j26453L7544j31078q4782K34570
$$ plain form
13795 498931 452857 1147328 442049 854235 661427 919129 945873 867070 945632 709003
13785 709003 691746 484081 644715 942438 963082 759683 628911 723231 858186 763820
13775 763820 876569 745331 880838 698992 541676 762912 462295 451658 831652 626602
13765 626602 347892 817011 411155 791737 1036016 688751 790822 626089 374320 469347
13755 469347 554354 626871 695021 613372 800233 523143 481220 1079049 405067 744227
13745 744227 572667 663086 977905 843443 623592 858716 769995 433401 729178 673319
13735 673319 358717 833351 779687 636137 1085457 477704 637247 645731 648499 767447
13725 767447 532137 594596 737658 514997 775452 648999 686543 555465 470683 705253
13715G05253p0579k51493K06085j35569J52741K4479J40134j83925k3469J98293
13705G61950l3700C44457m7815P4852R8888M2230p4500L81598R843k99982R4069
13694F23640k62678M82930C26937n3425J44846L6656L93103B75198J6283J49751
13684D41232L807r4060l9677P2240O2135r3968J42072P2920B31205P4850K58831
13673E64886M7668A18109K69639J77126j41273R2010M19194C94635L14693j48830
13663E60498R4711j8753k38259b0596F82476j80451K34891C50894l9452K78115
13653E89557K73918C96844J96315j83879l1551K73314j16150k54397J79333K15228
13643F75057k94461j28646K54241k42961J56187p8273J79853l3367J57295J05882
$$ plain form
13715 705253 634674 383181 589266 453697 606438 630917 771051 587126 563657 761950
13705 761950 728250 344457 296642 371494 470382 512612 438112 819710 829553 529571 623640
13694 623640 360962 843892 326937 273512 418358 455014 848117 275198 291481 441232
13684 441232 445039 350979 311302 383542 445677 351709 493781 566701 231205 306055 564886
13673 564886 612554 118109 387748 564874 423601 515611 934805 394635 709328 560498
13663 560498 655209 636456 398197 -20596 682476 502025 736916 350894 311442 589557
13653 589557 863475 396844 593159 409280 377729 651043 534893 280496 459829 675057
13643 675057 380596 251950 506191 263230 419417 341144 520997 487630 644925 750807
13633G50807j87346j85186j23146M47689l47055K0517N2388P436r3989N9305J91281
13622E92701j99596L65835l19952j72099J13683A26177K32490j51076J32665M195
13612C44451M25543C50131J7632K89492l01201J3843j23378K04268N5695m944
13602E01538n6178J71962k55284M8823J3613j1090A61545L95890q6452J19277
13592E90260k73087L5228P1503J821j01636A36851O4878L41538j83545J63160
13582E22882O740j62826O2578M40882B50600k2482O1515D4156L66468j54908F899
13570E26331j24285j85005I0360L55968A46683J77290j15723J59770J18052j15968
13560C70104A49342J28608J26725r2060K36894j02152J92393k64159j14378J21949
$$ plain form
13633 750807 563461 378275 255129 702818 355763 376280 428668 436104 342115 401420 592701
13622 592701 393105 758940 438988 266889 380572 126177 358667 207591 340256 344451
13612 344451 769994 350131 367763 657255 356054 369897 246519 450787 506482 501538
13602 501538 445360 617322 362038 410861 424474 413384 161545 557435 470983 590260
13592 590260 317173 352401 423904 425725 324089 136851 201729 543267 359722 522882
13582 522882 529622 366796 429374 870256 250600 228118 289633 44156 410624 255716 6899
13570 526331 402046 217041 90360 446328 146683 323973 208250 368020 486072 370104
13560 370104 149342 277950 404675 312615 549509 447357 639750 375591 261213 383162
13550C83162P5041j04637p9865C4183M19251P6410k0707K611B36193J81273j51202
13539B66264J04450r2052K13895j66446K21156B28380J21580p8686p8682J73108
13529C65700A12281L8103D7625J40294J06713j37811J70065j22585m9422J9750
13519A74629K1121K91721q1026A59330K99876A74203M3854J99570j86093O1007
13509B92541a360D71168k01220L19274B15188M6912n830J67299j21775B2541L05047
13498C27588I4744K51367E5961K23190r0987j9303a47734G37218C67929A03849
13487B72631J47403j03364j26341J28741o1339A06082B7549M21881M1598A36139
13476A69061J64238F6533O2987J40778E7074I615K70183I7236a4622D12461J8958
$$ plain form
13550 383162 458203 353566 273701 34183 453434 529844 509137 511748 236193 417466 266264
13539 266264 370714 278662 492557 326111 547267 228380 349960 271274 192592 365700
13529 365700 112281 150384 47625 187919 294632 156821 326886 204301 154879 174629
13519 174629 195750 487471 406445 159330 459206 174203 218057 417627 231534 292541
13509 292541 -1360 471168 269948 589222 215188 262100 256270 423569 301794 22541 327588
13498 327588 94744 346111 55961 279151 188164 168861 -147734 737218 367929 103849
13487 272631 420034 316670 190329 319070 257731 106082 27549 449430 491028 136139
13476 169061 333299 66533 129520 270298 57074 9615 279798 97236 -14622 412461 431419
13465D31419F4586K78358j48856K75987F6355h3518A73968k2583J29640b00854
13454A64740n9531q997O8210o3416K01475J55657j98135K68322k53806j23525
13444A50994l6627l5283L29424n5119A38927J5554p1704G627L04377a247D06047
13432B81176o6569J82517A86592j6390N3076J76520A32203J01346b2373I7644
13421D09657A42830L44705A98115k3361G7737K00182A03460K71209j12811I0597
13410B91560K7899M4558a36875A80325p1601j441L40538A25399L06507k02802
13400B29104K7758k7617R39A3191K74718C4929K37651j04456G2473L67386A72566
13388G5425Q1263N84299k46486k08091E5566a8351C66575H3693J6437K41881p8912
$$ plain form
13465 431419 64586 342944 194088 470075 66355 -83518 173968 151385 281025 -200854
13454 164740 105209 96212 164422 101006 302481 458138 260003 528325 274519 150994
13444 150994 114367 79084 408508 353389 138927 154481 82777 7627 312004 -1247 406047
13432 281176 214607 397124 186592 170202 223278 399798 132203 233549 -22373 97644
13421 409657 142830 487535 198115 174754 77737 277919 103460 374669 261858 90597
13410 291560 319459 364017 -136875 180325 108724 107283 447821 125399 431906 229104
13400 229104 256862 229245 230184 13191 287909 34929 272580 168124 72473 439859 172566
13388 75425 156688 740987 494501 286410 55566 -18351 366575 83693 100130 342011 263099
13377B63099I0590M70388A62637L22921r8927p6395K4822j04975J63335j1487
13367C81931I5521L91219k18428p9036k6995M8747E870Q8886J44249b2405A84743
13355B5812O8888j1602K41341J13963l5385K56683k83800M3402q2415a45644F1884
13343B53985J14683j80110I3459K28604l6222J3961i4799A98993Q5742A35069
13332A55294E7571j1306K89278A35205J80609A00326N3407K4521J71110O4269
13322D13633A25176J14236m0599O8433F7286K65559J47272A38259d7349a8382
13311D27742I7479L0323B3853M52628j76966j34226C5435M10290A02565C796K85809
13300B89605F8594J38438F1158K73014a9153B96072F884K59652a15196c353B28833
$$ plain form
13377 263099 90590 560978 162637 485558 386631 310236 335058 230083 393418 381931
13367 381931 95521 486740 268312 189276 162281 211028 5870 94756 239005 -22405 184743
13355 25812 94700 83098 324439 438402 403017 659700 375900 419302 336887 -145644 61884
13343 253985 368668 188558 93459 322063 285841 299802 -94799 198993 284735 135069
13332 155294 57571 46265 335543 135205 315814 100326 153733 178254 349364 413633
13322 413633 125176 239412 198813 267246 67286 332845 480117 138259 -47349 -18382
13311 427742 97479 127802 23853 476481 299515 165289 35435 445725 102565 3796 289605
13300 289605 68594 207032 61158 334172 -19153 296072 6884 266536 -115196 -3353 228833
13288D45501a57082k42367A73206N5457A6391g7485D35875A61532J12343r2968
13278A80907j7413J14392K937j10680a8198A45636L3022a2141C58960A78883G3489
13266F1589L28884B4795J46641K17638b7408D80718j95506F250M74136A61854
13255h3025A25189K32368B8252K56933C5823h2648A24174K38770G9154G305N24855
13244E32160A00817K2326L6439b4811B22389J78487A52248j8269b7680A31054
13233A65020c8961B862N31301E3296b16652F9973J29947C5514L2578K62007D4079
13221A68708K5652H7936a91144c1625A62823C4992J09524M7902a76698O517E35010
13209b57964D6589K55122G8255c37957A7875M9476J84838A01188K98623j59004
$$ plain form
13288 445501 -157082 -399449 173206 228663 16391 -77485 435875 161532 273875 180907
13278 180907 163494 277886 280823 170143 -18198 145636 178658 -12141 358960 178883 73489
13266 61589 390473 24795 171436 389074 -27408 480718 285212 6250 480386 161854
13255 -83025 125189 357557 28252 285185 35823 -82648 124174 362944 79154 7305 532160
13244 532160 100817 123143 159582 -24811 222389 400876 152248 133979 -27680 131054
13233 165020 -38961 2862 534163 53296 -216652 69973 199920 35514 68092 330099 44079
13221 168708 194360 87936 -191144 -31625 162823 34992 144516 192418 -176698 -170181 535010
13209 -257964 46589 301711 78255 -337957 17875 67351 252189 101188 399811 240807
13199B40807n0555k3136o0654B9014Q117L617J72983F5227a07001K3877B17031
13187A15096a05471A95039b67604a15340C57560a47845A38711B0417b9100A84883
13176i6162c8579k85204J36400I8776l3223l1119K1134P7812a08871B1389J77678
13165A99067i0569A38146a92172A01539k7116i242q6734D1915J50073h32C76614
13153B17043D1976P3575e2887B80205A07427J23405J33799a74586A66464K22412
13143C88876A44918M4561P5655c52495E8436K12920i6149B98169d23445A69150
13132I1096K68366G7273A0907J54411G0568J39503b8089j89381B20817a61264
13121B98358I5644K26899A43312D1636J77502L4717P5187f3890B21440F2131N794
$$ plain form
13199 240807 190252 167116 106462 29014 37131 40748 213731 65227 -107001 -83124 217031
13187 115096 -105471 195039 -267604 -115340 357560 -147845 138711 20417 -29100 184883
13176 -96162 -38579 -323783 -187383 98776 65553 34434 55568 133380 -108871 21389 199067
13165 199067 -90569 138146 -192172 101539 74423 -9242 -95976 41915 191988 -832 376614
13153 217043 41976 115551 -52887 280205 107427 230832 364631 -174586 166464 388876
13143 388876 144918 189479 265134 -352495 58436 271356 -96149 298169 -423445 169150
13132 91096 359462 77273 10907 165318 70568 210071 -28089 -217470 220817 -161264
13121 298358 95644 322543 143312 41636 219138 253855 329042 -63890 221440 62131 67925
13110F7925J31599L8762K05063m5989o6569L6026j8341H6154L5863L07402N029
13099D34448e8289j23767P6837K5020A83197G4072C0542J60930b79883g340A77335
13087E3866a56907B86332H0036a21721C02956a15245H8272L30189A93632J50419
13077C44051J84638c2125H3895L35221j11303j14777c06902H664a9978A33606
13066H800R9654a9521D7080K09776i2797A74194P5792a92911K316A14426h2444
13054A37284P04b6550j17559j50495g3608A34305b68423e1256C33896H4446K171
13043H6617J044k5382L03092A3083J17001O8558l0525c7663E09957d2016A44951
13031B03521O3953l8570h221A76691b33233D12259q4181h2573I5209J21213D2809
$$ plain form
13110 67925 199524 238286 443349 397360 330791 366817 348476 86154 122017 429419 434448
13099 434448 -58289 -182056 -105219 -80199 183197 74072 30542 191472 -279883 -7340 177335
13087 53866 -156907 286332 80036 -121721 302956 -115245 88272 418461 193632 344051
13077 344051 528689 -32125 83895 419116 307813 193036 -306902 8664 -19978 133606
13066 8800 108454 -19521 47080 256856 -92797 174194 249986 -192911 -190595 114426 -82444
13054 137284 137988 -26550 -144109 -294604 -73608 134305 -268423 -51256 333896 84446 86617
13043 86617 87661 62279 365371 13083 130084 198642 168117 -37663 509957 -42016 144951
13031 203521 267474 228904 -8221 176691 -233233 412259 328078 -82573 95209 216422 42809
13019E6256J54460p3172a63695p6525d6984N780C17937c5521C38599j9476A04011
13007A77579L92389A31869E7422j5563J3970L3896h7762A47046a54133I3474K68815
12996C62289m8830j00613J55025a2887A07766r735J04940m1558R6809j05782c20969
12984a20690A26901J05225J06939E1217J63782N8887A15389f0642B12815q8482
12974A24333a35379D095J79502b2201A53751G0731J70820o7840e0413A91632l443
12963A88189o6707a03631D2463P0236C7247P0912d2917A65710b60511A2662L07867
12952C20529f9031B89934K2722b32116P7196A17052K79691c1869B7224M56112
12942D83336b06896n316Q3583B3377i0685m5761d5860J4376j55054f7041d523
$$ plain form
13019 56256 210716 137544 -163695 -240220 -46984 -41204 317937 -35521 338599 319123 104011
13007 177579 569968 131869 57422 41859 55829 89725 -87762 147046 -154133 93474 362289
12996 362289 313459 212846 367871 -12887 107766 98031 202971 161413 258222 152440 -320969
12984 -120690 126901 232126 339065 51217 214999 273886 115389 -60642 212815 124333
12974 124333 -135379 4095 183597 -22201 153751 70731 241551 173711 -50413 191632 188189
12963 188189 121482 -103631 42463 112699 37247 108159 -42917 165710 -260511 12662 320529
12952 320529 -69031 289934 312656 -232116 -154920 117052 396743 -31869 27224 483336
12942 483336 -206896 -212212 -128629 23377 -90685 -136446 -45860 -31484 -186538 -67041 -4523
12930C819a16569E2798L5244l6464j2269L54624A47460k6166D2158G17h2763r6455
12918a79218Q6455A32500Q753f9327A41374k1978K36630F1755J74857b02612A83165
12906B75732e5104l5342M2111B4770b07469I6581k0415j6666h285j64390B99580
12894a29313a8531p7503B53738j0147l2580K89022j39558j76915f8801p3303G8148
12882b63466A85091c272B17601J73881j57410d8072J0418E725J58099F1906L6213
12871I8119b55967A04084d4428j18431H7002M7047i9421q4431K6932H0142N7424
12860A37566a19831G2813O3997J22900c48749I6503h9004F6778n594a25838l01358
12849d27196G0347c4260B49339A12394N3996a64358A31958K90129e2320A12360
$$ plain form
12930 3819 -116569 52798 88042 51578 39309 393933 147460 121294 42158 717 -82763 -179218
12918 -179218 -92763 132500 141253 -69327 141374 119396 356026 61755 236612 -202612 183165
12906 275732 -55104 -90446 -48335 24770 -207469 96581 76166 59500 -8285 -172675 299580
12894 -129313 -18531 -96034 253738 243591 211011 500033 360475 183560 -68801 -142104 78148
12882 -263466 185091 -3272 217601 391482 234072 -48072 -37654 5725 163824 61906 98119
12871 98119 -255967 104084 -44428 -162859 87002 134049 -99421 -183852 -156920 80142 137566
12860 137566 -119831 72813 136810 259710 -348749 96503 -89004 66778 61184 -125838 -427196
12849 -427196 70347 -34260 249339 112394 166390 -164358 131958 422087 -52320 112360
12838a50126A57390b09922K3350C3863A1529O2063A9604a5706C1985a40697A64358
12826F1393a21189H5011b48489J11056E940h7342m393o7088b1379o5413R647c3941
12813i8211A08981b92753i4711B68650i3836p4233C13490p9420b90707a17738
12802a25243A06415J87602F4189a44901A67337P6399c788B47018b35973D16933
12791H1149a54665f1750j19150A74128L1043a82459A73074H1747d4678k77682
12781c22360c3520E33932C5986K21364I5516c31287C4194a39451d7043K1354A16133
12769A16940a5100k90714A10607B3510L40449G9893K02115j18364J93045f1230
12758e1873q9949O6582q6522C8075K45944b9635j46932f156m8111C6212a39962
$$ plain form
12838 -150126 157390 -209922 -186572 33863 11529 73592 19604 -15706 31985 -140697 164358
12826 61393 -121189 85011 -248489 -137433 5940 -87342 -91735 -158823 -21379 -86792 -77145 -33941
12813 -98211 108981 -292753 -94711 268650 -93836 -168069 313490 234070 -290707 -117738
12802 -125243 106415 294017 64189 -144901 167337 243736 -3788 247018 -235973 416933
12791 81149 -154665 -61750 -180900 174128 205171 -182459 173074 81747 -44678 -322360
12781 -322360 -33520 533932 35986 257350 95516 -331287 34194 -139451 -47043 -25689 116133
12769 116940 -15100 -305814 110607 23510 363959 79893 282008 163644 356689 -61230
12758 -51873 -141822 -75240 -161762 38075 284019 -29635 -176567 -6156 -54267 36212 -139962
12746A60300P1416I5464b8548a177k46751e7109O792A09779D0039g9372E86942
12734c31D30493J58674A26071P4278D4602j0824K48573j24590o0016a95715B71230
12722A30026D6852e1582A13487j9318L51327i792j15678C99429A00282m5675f4625
12710C585K67129P9454n7825n8636K23997A66875O9119M32a03711A92680q3763
12699A08917d7777A53323b02270A26579K1080a66278A66653i9006A28398P10O8300
12688A97408f9987j6122I0964C5090c57517A52252F7513L65429k7551F1623A9673
12676C65869j63342l7070A338K95474a69089C60850a6321H2472K17765B2704a01927
12664B5413h7028B53008c2428H7127i3025l372E865K14455j09084l2188L2531
$$ plain form
12746 160300 231716 95464 -28548 -1177 -247928 -57109 -50317 109779 40039 -79372 586942
12734 -331 430493 589167 126071 200349 44602 33778 282351 157761 97745 -195715 271230
12722 130026 46852 -51582 113487 94169 445496 -9792 -125470 399429 100282 54607 -64625
12710 3585 270714 350168 292343 233707 457704 166875 235994 236426 -103711 192680 108917
12699 108917 -47777 153323 -202270 126579 147659 -166278 166653 -99006 128398 129108 197408
12688 197408 -69987 -86109 90964 35090 -357517 152252 67513 432942 405391 61623 19673
12676 365869 202527 165457 1338 296812 -169089 360850 -16321 82472 300237 22704 -101927
12664 25413 -87028 253008 -32428 87127 -93025 -96397 5865 220320 111236 79048 111579
12653A11579P4736a4574A8292J02426M6233c2079I9137J78529F2923b35092a10901
12641b0227F8893K18008A15617K70889b0875A17596L8571b07519I0981J28529
12631B19510n8054J26831n6845D1094R5995J74306j02838a90243I7039J7432C6274
12619D63355A28700Q9801f1794A51808K8524o7953J31978A22058a09118r0301
12609a99419Q3837l0298d1367H9057M67923B18278J3173a35613B46533p5328J19527
12598B90732g8319K492m489a5708k03131G5910L4584o024D0611a12458k81371
12587c93829a23151l453o6472A22333l0976P9729a38259f8009I3451k7292A5699
12575F6841j3906b19493b3653q7960e3823k7669A75901J12094a10689N4154j16774
$$ plain form
12653 111579 186315 -14574 18292 120718 166951 -32079 99137 277666 62923 -235092 -110901
12641 -20227 68893 286901 115617 386506 -20875 117596 156167 -207519 90981 219510
12631 219510 161456 288287 231442 41094 137089 311395 208557 -190243 97039 114471 36274
12619 463355 128700 218501 -61794 151808 180332 112379 244357 122058 -109118 -199419
12609 -199419 -115582 -145880 -41367 89057 556980 218278 231451 -135613 246533 171205 290732
12598 290732 -78319 -75827 -80316 -15708 -218839 75910 110494 104470 40611 -112458 -393829
12587 -393829 -123151 -126604 -193076 122333 91357 171086 -138259 -68009 93451 66159 15699
12575 66841 52935 -219493 -23653 -111613 -53823 -81492 175901 287995 -110689 -56535 -173309
12564a73309A26715a13362C57536A21264e390A07191b87950B56841i6574A17193
12553C10448a41281F9440f5886F8912O1376C3055b27701A51472b9586j89659h7621
12541B21733a38483A45795J0733a69823Q2117B4090Q366O581a8339j84299A42135
12529A0873M0900f435G4412a67161B02749e9902i043B30481a41231I8128e9130
12517a33334O389C23935e6767A80258J04545g3922k21199L2793r2916B68506F7995
12505A49697L1901o7233M8892f2359G840L3162J79439h0623A99452b811m0819
12494d3630A27916a1775A01723C8345a0849j6980j44410d4261A08612a48125A5836
12482A60121a75650A49882Q5608c19551J15841i4578B89356E5985f2733j58873
$$ plain form
12564 -173309 126715 -113362 357536 121264 -5390 107191 -287950 256841 -96574 117193
12553 310448 -141281 69440 -65886 68912 130288 33055 -227701 151472 -29586 -219245 -87621
12541 221733 -138483 145795 156528 -169823 -87706 24090 32456 39037 -18339 -202638 142135
12529 10873 51773 -6435 74412 -167161 202749 -59902 -9043 230481 -141231 98128 -59130
12517 -133334 -126945 323935 -56767 180258 284803 -73922 -295121 -262328 -355244 268506 67995
12505 149697 181598 114365 163257 -62359 7840 41002 220441 -80623 199452 -2811 -43630
12494 -43630 127916 -11775 101723 38345 -10849 -27829 -172239 -44261 108612 -148125 15836
12482 160121 -175650 149882 235490 -319551 -203710 -94578 289356 55985 -62733 -221606
12472b21606H9255b36663A17Q4122N2141b58k76657O9128P4372B35547o9177J01789
12460B68159B2688a61253H3035K94599A32213O3167G2669a13392C77949H9057
12449a28257G9218N1487B703R644N8259H532J67432J40956c3219C2145P0968k7566
12437G5547k053J89577c1923j16158C73749b8394A18402a96034L9534B8787J86432
12426B15219a00380k34668J39958B44025o4573h8181j08928h7328a5443A44941
12415c32550i8314o7578n3916A97138b7464C2312m871R7932C1393d4238B38033
12403G9133b06320B97333f3118L0559C1156R7504J08162a01567A48444a57165
12392a48676m2251o615A18151a67605i93B09940B918a6104G5114f731G0095R7102
$$ plain form
12472 -221606 89255 -236663 117 84239 136380 -258 -276915 -207787 -133415 235547 166370 268159
12460 268159 22688 -161253 83035 377634 132213 195380 72669 -113392 377949 89057
12449 -128257 79218 130705 2703 12347 70606 8532 175964 316920 -33219 32145 103113 75547
12437 75547 73494 263071 -31923 -148081 373749 -28394 118402 -196034 -156500 28787 215219
12426 215219 -100380 -335048 -195090 244025 179452 -88181 -197109 -87328 -15443 144941
12415 -332550 -98314 -165892 -219808 197138 -27464 32312 27441 125373 31393 -44238 238033
12403 79133 -206320 297333 -63118 -32559 31156 128660 236822 -101567 148444 -157165
12392 -148676 -190927 -197542 118151 -167605 -993 209940 2918 -16104 75114 -6731 70095 167197
12380A67197J84132a74391k39956I3223Q9542a52287l548A7362b83224A09361
12369d13682A77062o4112a47596B06880R5091a58176A03063J32102a26634L1326
12359i5308J4545o3994E7029B7529f001A79306i9369l4894A66418d2000B7463
12347D903a34568N5350A51993R9738O715d2958E0350J77953L9137b35392C96354
12335a73651k2891I2654J592g5806p5557C73999J40155i6985l17386J91449p4872
12324b97794H709J9896J19739a33759B18233O419I3653a89225A75172E1497E25
12312g5843C34108b98421B55516h4477j4681D3191L1805a87410B2727a52404O6937
12301h5467A27915l9441A1366J40677o5672a49431M9314M4838f629A76115j7552
$$ plain form
12380 167197 351329 -174391 -414347 93223 182765 -152287 -155835 17362 -283224 109361
12369 -413682 177062 112950 -147596 206880 301971 -158176 103063 235165 -126634 -95308
12359 -95308 -80763 -144757 57029 27529 -6001 179306 -99369 -134263 166418 -42000 27463
12347 4903 -134568 -79218 151993 251731 258446 -42958 50350 228303 267440 -235392 396354
12335 -173651 -196542 92654 94246 -75806 -151363 373999 514154 -96985 -414371 -222922 -297794
12324 -297794 8709 28605 148344 -133759 218233 224652 93653 -189225 175172 51497 525
12312 -75843 334108 -298421 255516 -84477 -99158 43191 74996 -187410 22727 -152404 -85467
12301 -85467 127915 88474 11366 152043 86371 -149431 -100117 -55279 -6629 176115 158563
12290A58563k5484a14003j70102E4887b8637P766C29980I0281C015K85587j17787
12279A70815J60990j14355j04471J54736a3163C87636A41563C8297Q5606C5639
12268A67237c0487A76759h5200j44717B63661r5541f853D24290J1925g2546B63140
12256h839B54096o8414O4188d3273H2591J27676r5823a7578k09797B75273H537
12244A20085B7314c3333m3946a5661C15166A29361a64265g0668A47470l5215N885
12233A18140K32472a13739C52033A43874C5329M07379a48386H1459K54220q5320
12223B50359r4877G6971M6096K39579m3556j06767p2459K32534E0769J05593M19100
12212E75462A9620L12145a01239A67982N4565r5201K7006p4340M3586k8679a2780
$$ plain form
12290 158563 133079 -114003 -284105 54887 -28637 -20871 329980 90281 3015 288602 170815
12279 170815 331805 217450 112979 267715 -13163 387636 141563 38297 123903 35639
12268 167237 -30487 176759 -85200 -229917 263661 168120 -6853 424290 436215 -72546 263140
12256 -8839 254096 185682 249870 -43273 82591 210267 114444 -17578 -227375 275273 8537
12244 120085 27314 -33333 -77279 -15661 315166 129361 -164265 -70668 147470 112255 118140
12233 118140 350612 -113739 352033 143874 35329 442708 -148386 81459 335679 250359
12223 250359 155482 76971 123067 362646 319090 212323 139864 372398 50769 156362 575462
12212 575462 19620 331765 -101239 167982 222547 127346 154352 80012 123598 94919 -12780
12200B26386q7064N9841E4710K70362L67656B42600I5061K79928d6385G9462J01155
12189A80617J96760g0528B94573a82959C03494a34548A63196b0317F3300a3221
12178b47748E3509a72428I1207K9154c5173A34831c1736A14595b1113q7233c5620
12166B76072b10649A94652J32935C3967c8687H3666M7749i4605K4675H9953b03500
12154H3176R1840j6360J51433A25409b55184B88899a81405E9263k1358i7255C60633
12142b66536b6484A44464b74073B2557J44492m572J50519H045a81746P7993J911
12131a01842d7101k8670A91164a00860B1795J03062k2472e148j05892A28362K38132
12120C66494a51688f4052r2992E8661a29488j06149i8684C19269j51698R6011
$$ plain form
12200 226386 139322 199163 54710 325072 692728 242600 95061 374989 -46385 79462 180617
12189 180617 377377 -70528 294573 -182959 303494 -134548 163196 -20317 63300 -13221
12178 -247748 53509 -172428 91207 120361 -35173 134831 -31736 114595 -21113 -108346 -35620
12166 276072 -210649 194652 327587 33967 -38687 83666 131415 -94605 -69930 89953 -203500
12154 83176 175016 158656 310089 125409 -255184 288899 -181405 59263 37905 -97255 360633
12142 -266536 -26484 144464 -274073 22557 167049 162477 312996 8045 -181746 -103753 -101842
12131 -101842 -47101 -75771 191164 -100860 21795 124857 102385 -5148 -111040 128362 366494
12120 366494 -151688 -64052 -157044 58661 -129488 -235637 -98684 319269 167571 263582
12110B63582d00589E5177e2150A7287f8648C57904A63268c5107p6583o210H3567
12098a27501B75942d7750k31884d6659K2597L339B48330b54986A18582E05J06781
12087A07286K31494C7236K62955H3745d4554h733k41177I2759D763J00668d3863
12075D37828k07609g0603a08B23799o6148M34725P99539n8950l47075A67407l5742
12064A31665A7652J19204J60918j06612d0502C2897a73506k14790C4692c8847
12053c1996F148c338B15008F1489N2065b41054G5344g8604B29803E3557f8517
12041b8070H0536a65742g4364A06112a72575A43209m5539c240B9323i3146A39736
12029E3336a58784A35143c130j9393j88263j08233A49334K42p3383q317J52363
$$ plain form
12110 263582 -400589 55177 -52150 17287 -68648 357904 163268 -35107 -111690 -117900 83567
12098 -127501 275942 -47750 -279634 -46659 -24062 -20723 248330 -254986 118582 505 107286
12087 107286 338780 37236 300191 83745 -44554 -8733 -249910 92759 4763 105431 -43863
12075 437828 230219 -70603 -108 223799 157651 592376 1391915 1332965 985890 167407 131665
12064 131665 17652 136856 297774 191162 -40502 32897 -173506 -388296 34692 -38847
12053 -31996 6148 -3338 215008 61489 113554 -241054 75344 -78604 229803 53557 -68517
12041 -28070 80536 -165742 -74364 106112 -172575 143209 97670 -3240 29323 -93146 139736
12029 53336 -158784 135143 -3130 -22523 -210786 -319019 149334 149576 76193 67876 220239
12018B20239a27146A077d0822A69364P450o4838b9640j71477m7637a7463k4933
12007d2396A47097L05433c832C5934L91605A7442J4622a2378A6606M4744Q4404
11996A45754K966c16353A6977K22759b83312g1370o5823A35410A1404b91662j70608
11985d62270A34502J93913j20614e5373A61079O2235J024o3179h5652C303b53077
11973H577N1408P3286c50976J74839D05163d4036a4414C4911b35144g2889D3642
11961e9474B33199D8752B1837a54790n8388j59844F0245i884q8198B68361c09492
11949A09668d38427a92401D976c21762d7183C02448a48941a3814I5014J99629
11939B94643a1459j52750k18628c8800m7663r2323A5739R9047f547m2891C51741
$$ plain form
12018 220239 -127146 1077 -40822 169364 176814 111976 -29640 -201117 -248754 -17463 -42396
12007 -42396 147097 452530 -3832 35934 427539 17442 32064 -12378 16606 61350 145754
11996 145754 148720 -316353 16977 239736 -283312 -71370 -137193 135410 11404 -291662 -462270
11985 -462270 134502 328415 207801 -55373 161079 223314 224338 161159 -85652 3303 -253077
11973 8577 59985 133271 -350976 -176137 405163 -44036 -14414 34911 -235144 -72889 43642
11961 -59474 233199 48752 21837 -154790 -213178 -373022 60245 -9884 -98082 268361 -309492
11949 109668 -438427 -192401 4976 -321762 -47183 302448 -148941 -13814 95014 294643
11939 294643 -11459 -164209 -382837 -38800 -86463 -178786 15739 114786 -6547 -49438 351741
11927a41900F5791a95339B76732A9122J63826f29j22976k46A0334b13683B02140
11915C14766a48942D5591j7448d7941r5128N448n5594L7848k1762A96231A6698
11903B40748a84031p9614f8446A71468p7781c1054q5353N38l11624a68658j23828
11892b92486a35254B83797f0792o6916A91727k2599J3831p1292d30722J42634
11882b88088J06776N0421B0613d45029d9629j16608A19256c7983I7663a01697
11871C46096C3846b97328B67485E8987b63449h8684A0638A5b898j61028B31148
11859h0185n818q8691h4028A17798J65644a06595A94978a43961G5522k2939f81929
11847b51874a4884D25976a38207B19292c46578d3280j41974J1226B09731d1842
$$ plain form
11927 -141900 65791 -195339 276732 19122 182948 -629 -123605 -123851 10334 -213683 202140
11915 314766 -148942 45591 28143 -47941 -143069 -137621 -193215 -155367 -177129 196231 16698
11903 240748 -184031 -263645 -68446 171468 93687 -31054 -116407 -115869 -427493 -168658 -292486
11892 -292486 -135254 283797 -60792 -127708 191727 169128 182959 111667 -430722 -288088
11882 -288088 -181312 -130891 20613 -445029 -49629 -166237 119256 -37983 97663 -101697
11871 346096 33846 -297328 267485 58987 -263449 -88684 10638 15 -2898 -163926 231148
11859 -80185 -86003 -174694 -84028 117798 283442 -106595 194978 -143961 75522 52583 -681929
11847 -251874 -14884 425976 -138207 219292 -346578 -43280 -185254 -174028 209731 -41842
11836a25283k19349A26958a58010l04781C4939J37103a06142B87562c16281A94384
11825A40191a06051C9073a56285A1784J18922a78289e4161K2244j8658F6659J43174
11814B09833G003a01783B2203a52815m8384D71814b97835g4980b0232A95083o8608
11803A26475e7828m0030A75100a99058A9526O1229d53972A70539g4242p2803H7031
11791C59678p2776i1370C2354a62508b7045I5044k9094C82J88097K25246f1357
11779D5439d0893k3493H7077a27254j1621j83404C03781d6564I5383b53993A2533
11767G8684e7674B27940D7742a2079j80122f7794r3904j76040B00572m7743Q1332
11756B34161a84088e4314j41437A83584O854a27172c6197E6019a38441B4246J11011
$$ plain form
11836 -125283 -344632 126958 -158010 -462791 34939 172042 -106142 287562 -316281 194384
11825 140191 -106051 39073 -156285 11784 130706 -178289 -54161 -31917 -50575 66659 209833
11814 209833 7003 -101783 22203 -152815 -201199 471814 -297835 -74980 -20232 195083 126475
11803 126475 -57828 -97858 175100 -199058 19526 80755 -453972 170539 -74242 -147045 87031
11791 359678 286902 -91370 32354 -162508 -27045 95044 65950 382 188479 413725 -61357
11779 45439 -40893 -64386 87077 -127254 -138875 -322279 303781 -46564 95383 -253993 12533
11767 78684 -57674 227940 47742 -12079 -192201 -67794 -161698 -337738 200572 152829 234161
11756 234161 -184088 -54314 -195751 183584 190438 -127172 -36197 56019 -138441 24246 135257
11745A35257C6142O9994c13525K4109E6219K3729a8112M336A38833c22100f0900
11733I8788j2119A7234a22330k016C4783i2310r8975A19448D6955R0887L04752
11722D42594M9075h3689A8458c1820r3057F7253O5951R3098n3332P754a17265
11710g4079G2222k5587b2692B5707N309J1427a81077e2713p6074O3150A1408a64114
11697b70726A72920J35219b02853G3128K039b82449c6357A2543J07476R5854d5409
11685F9517K05290m0376k5202F1187a53956f6365G2038K52387b8949A76365n3533
11674A22832J36945l3048C7161i0075K7119B31637a01548q5477I6565M6513a98306
11662E0381i7819L0728A00069C1972L34318e9542B94798o8522a66635A28832C8800
$$ plain form
11745 135257 36142 106136 -313525 -289416 56219 79948 -18112 -13776 138833 -322100 -60900
11733 98788 86669 17234 -122330 -124346 34783 -92310 -191285 119448 46955 137842 442594
11722 442594 491669 -83689 18458 -31820 -124877 67253 133204 226302 172970 180724 -117265
11710 -74079 72222 46635 -22692 25707 31016 42443 -181077 -52713 -128787 -65637 11408 -164114
11697 -270726 172920 308139 -202853 73128 75167 -282449 -36357 12543 120019 215873 -45409
11685 69517 274807 234431 209229 61187 -153956 -66365 72038 324425 -28949 176365 122832
11674 122832 259777 226729 37161 -90075 -62956 231637 -101548 -187025 96565 143078 -198306
11662 50381 -97819 -67091 100069 31972 366290 -59542 294798 226276 -166635 128832 38800
11650A17417a6546r1910A21568a20566K292L9770D4297a51796C26353H8156f1214
11638b07762A06790E2980J9458K49976b56153A08052l9960J66307a54256A05511
11627B48736h9361K5682A76497A8521D376a73700B68681A08534c15565b9620n6446
11616h6066k26356A15417D5974j6017O274b17909B18657m1669b15868O3144l222
11605a55946G5592Q2786g5728A20461C1468L47958B50N2995j3002K95581K4645
11594C60469h1781A28242D5631R1525a88784N8502B07370r6643K46119I722P6961
11583H6683O2401E9665a01524B3485J26067J42565j29970J32433D2054d1579D36022
11571E00281e5837A4755J74649c2044A25838j5746g9539k3240r576E41771b9570
$$ plain form
11650 117417 -16546 -108456 121568 -120566 -118274 -78504 44297 -151796 326353 88156 -61214
11638 -207762 106790 52980 72438 322414 -256153 108052 68092 234399 -154256 105511
11627 248736 -89361 -63679 176497 18521 4376 -173700 268681 108534 -315565 -29620 -86066
11616 -86066 -312422 115417 45974 29957 36231 -217909 218657 176988 -215868 -152724 -155946
11605 -155946 75592 158378 -75728 120461 31468 379426 250 53245 40243 335824 360469
11594 360469 -81781 128242 45631 137156 -188784 -130282 207370 110727 356846 9722 86683
11583 86683 149084 59665 -101524 23485 149552 292117 162147 294580 42054 -41579 436022
11571 500281 -55837 14755 189404 -32044 125838 110092 -79539 -102779 -112355 541771 -29570
11559e4346L762B64735N5531D0936a88326C10881j30280B4652J73100g7684E8696
11547A93541A6906Q3581e5167A10523g8388A99361F9693L8428B5156a29496B50387
11535B18882g0326C39527e5206l9109G15747c6558E54582F9547A1064a44260E5485
11523B49098j10673K79958a19521D6784L41107A88361a59306C52734a33120B75272
11512D01224j07744b22030N75B56286q2824K14639A21256Q2740O0610p8038b78349
11500B43662E7489B5629J55509q1025L43099I544K56688g7942I6943J18960F181
11488g5994j02753A12408Q7982J00959B0251d0489C23711M2882A17446a4359B41826
11476g4578B02246J748b15745B61343j15318p1048J25948G3646d5554B3571K55159
$$ plain form
11559 -54346 -50584 264735 320266 40936 -188326 310881 180601 24652 197752 -77684 58696
11547 193541 16906 100487 -55167 110523 -78388 199361 69693 108121 25156 -129496 250387
11535 218882 -70326 339527 -55206 -94315 715747 -36558 554582 69547 11064 -144260 55485
11523 249098 138425 418383 -119521 46784 387891 188361 -159306 352734 -133120 275272
11512 401224 293480 -222030 -221455 256286 173462 388101 121256 203996 264606 186568 -278349
11500 243662 57489 25629 181138 100113 443212 9544 266232 -77942 96943 215903 6181
11488 -75994 -178747 112408 200390 301349 20251 -40489 323711 366593 117446 -14359 241826
11476 -74578 202246 203994 -215745 261343 146025 74977 200925 73646 -45554 23571 278730
11465B78730P9701d1516p1320A48786C3316j5816P9341i3979d0616j28845E2923
11453A47738d5433B41614l6649j3715q1659K16170G3784J90177A23733c1195B56958
11441b54147F7878Q8407N2238K52140A22600i7915I9011K39237a85139A69450
11430C0449c2260I8537B019P3953J14685b74178C4397L957G308a67857c2299j1097
11418d3396r0057A06285i4087A51073M2696l5050b47910H9384a28137j74004B8637
11406G7609a03705d5475j57773C6809Q824b38553B0491a75942b9994B60540a45984
11394D9127a2490I6624J74355K3318a8033E1900L72957A31383a9372o5549L085
11383h1836B28390g5155r916j2157D8309A2787a23633C4905a22147j41188A33914
$$ plain form
11465 278730 358431 -41516 -112836 148786 33316 17500 96841 -93979 -40616 -169461 52923
11453 147738 -45433 241614 204965 191250 109591 325761 73784 263961 123733 -31195 256958
11441 -254147 67878 156285 208523 460663 122600 -97915 99011 338248 -185139 169450
11430 30449 -32260 98537 2019 75972 190657 -274178 34397 38354 7308 -167857 -32299 -43396
11418 -43396 -133453 106285 -94087 151073 193769 158719 -247910 89384 -128137 -302141 28637
11406 77609 -103705 -45475 -203248 36809 45633 -238553 20491 -175942 -29994 260540 -145984
11394 49127 -12490 96624 270979 294297 -18033 51900 424857 131383 -19372 -84921 -81836
11383 -81836 228390 -75155 -85071 -97228 48309 12787 -123633 34905 -122147 -263335 133914
11371F7976J02273b34710h8359A23792b67919h8331o0074I9761a22816m8324A45082
11359b79733J01394C05290c1895M881M407j20655C41959a14500B30971j3739e3720
11347A41398J28250J01770A56165d3651n9579B44722a13111q9427P9501j22320
11337b45357D85594A6350B997R7517a08676E1001a83124C79165j34224a6859C36192
11325a39712a6670m4535m09865A09309M6530f6017A49534F2062M0307C4905J48630
11314A83535J42080b50224A84259c2148j4160A16020b22165B43493a3920e139
11303a47376B2141K18614a57882j41612I5958B7956O721a11456m8682A84051q9135
11292I4916m5344d0222j92143c2630p5684M0849A2894a61540c1026j17636A85262
$$ plain form
11371 67976 170249 -234710 -88359 123792 -267919 -88331 -148405 99761 -122816 -171140 145082
11359 -279733 -178339 305290 -31895 -27014 -22607 -143262 341959 -114500 230971 217232 -53720
11347 141398 269648 371418 156165 -43651 -103230 244722 -113111 -202538 -123037 -245357
11337 -245357 485594 16350 2997 100514 -108676 51001 -183124 379165 244941 -16859 336192
11325 -139712 -16670 -61205 -471070 109309 155839 -66017 149534 62062 102369 34905 183535
11314 183535 325615 -250224 184259 -32148 -46308 116020 -222165 243493 -13920 -5139
11303 -147376 22141 240755 -157882 -299494 95958 27956 34677 -111456 -160138 184051 94916
11292 94916 49572 -40222 -232365 -32630 -108314 -67465 12894 -161540 -31026 -148662 185262
11280b11595R3593N0967a9187E462a06487k6039D7286c9156A55464E5457a36136
11268A47161h6300A95949b38751E3128R792A8814c08165A27332B8810a24115C5463
11256C2802a17883j93318A18953c13558c2295E4102i1877A83459O4577b74797
11245f6227K022j80262a02911k10140O1383A17497a65992C8231a15950N3008k14932
11234b77874R7390C18949c5052j12844l1107B04115Q0496b8503D1248a9083j69389
11223a88472b4970j16715j22659A21491g2638B23845r3943M9098c22707B6344
11212G4096O12j1480c58022B2751b84171B35530c41464R5588f530m8573B99913
11200A01517c34729A66432E1667i0349j45408h4438L918l1227k79504A23769a82063
$$ plain form
11280 -211595 -118002 -67035 -19187 5462 -106487 -132526 47286 -39156 155464 55457 -136136
11268 147161 -86300 195949 -238751 53128 62920 18814 -308165 127332 28810 -124115 35463
11256 32802 -117883 -311201 118953 -313558 -32295 54102 -91877 183459 248036 -274797
11245 -66227 -64205 -244467 -102911 -313051 -251668 117497 -165992 38231 -115950 -62942 -277874
11234 -277874 -180484 318949 -35052 -147896 -179003 204115 284611 -28503 41248 -19083 -188472
11223 -188472 -24970 -141685 -264344 121491 -72638 223845 129902 179000 -322707 26344
11212 74096 74708 63228 -358022 22751 -284171 235530 -341464 -245876 -6530 -55103 299913
11200 101517 -334729 166432 51667 -90349 -235757 -84438 -80520 -111747 -391251 123769 -182063
11188i9507C0126b03725B39301C0522b45290A12087K80058A78011a7459j73790
11178a91249L5135p380m0559N7507P3107m4858M6631R236j16349j23409J36867
11167a65321A0334b1364A52133c36403A74519b25079B71850F1719e4744n02I1761
11155a57573A7780D385J42468f2663F4229c023l77558F7434M2707a19176B58538
11143b06235l6147A68850J01743h4100K502A87040c0868A91350b26749A9115h3657
11131A42939b40820r4306A64142D6380A7170K32336o2513k321p8159d8019k7771
11120g5790j44227A14119J13596a8029A19459k9171g5077F7942N0318j7198A2850
11108E6279g7470k19093A23876Q287L5105j6857g7070A5707L21880L1948j40248
$$ plain form
11188 -99507 30126 -203725 239301 30522 -245290 112087 392145 178011 -17459 -191249
11178 -191249 -156114 -163494 -204053 -146546 -73439 -118297 -71666 -62430 -178779 -302188 -165321
11167 -165321 10334 -21364 152133 -336403 174519 -225079 271850 61719 -54744 -55246 91761
11155 -157573 17780 4385 146853 -62663 64229 -3023 -380581 67434 110141 -119176 258538
11143 -206235 -242382 168850 270593 -84100 -81598 187040 -30868 191350 -226749 19115 -83657
11131 142939 -240820 -335126 164142 46380 17170 249506 186993 184672 106513 -48019 -75790
11120 -75790 -220017 114119 227715 -18029 119459 90288 -75077 67942 118260 101062 12850
11108 56279 -77470 -296563 123876 132163 167268 150411 -77070 15707 337587 369535 229287
11097B29287J64397A41198C6239B879Q8417J4478J2677J16223k65O3774j4719
11086B83464A00751M4538d002C04647j18366J28652l6340O864G5204L96226A79825
11074D23481J7097F8160f24D90422k17636j31475M01570O4559H0439K79703J25572
11063D85714j33391J79214J42580B97628R0651J99999j3342M3198J13399j67891
11053E63642J84974j53237J90576K62848k03507q1795J19530j83456J06075Q5949
11043H91599k46567J70023J1579j81241m7106M52921m27210O203J19119K20213
11033I69533k75839J07353k29086R1207J75302k19113j1042J65023P2511k09052
11023F36797L19154l45550p7179N44673k80413l608l0153k43137O1330j73048
$$ plain form
11097 229287 393684 141198 36239 2879 91296 105774 118451 234674 234409 298183 283464
11086 283464 100751 145289 -4002 304647 186281 314933 278593 285457 75204 471430 179825
11074 423481 440578 68160 -624 490422 272786 141311 542881 607440 80439 360142 485714
11063 485714 352323 531537 674117 297628 388279 588278 574936 618134 731533 563642
11053 563642 748616 595379 785955 1048803 845296 763501 883031 699575 805650 891599
11043 891599 645032 815055 826634 645393 598287 1051208 623998 630201 749320 969533
11033 969533 693694 801047 571961 663168 838470 619357 608315 773338 845849 636797
11023 636797 955951 610401 533222 1077895 797482 793874 763721 520584 581914 408866
11013D08866L601M38493l41079K42022k1069K25558m47174L95280k30624j67017
11003E06857K3526k40793L94096N6481K96386m28061k21272R5604J42944k00750
10993D25018J54052L1746j06355J85992N5620J59471k28658K48306j78862N28786
10983A275116n5323R6581m099r4162j61557N67753K48452L3473M07441K39254
10973B552929J55915J15504K1473j74414m7773q3620m79841N5718k79427Q4084
10963A920548m52045L53192O5026J73j57503j08782J78049j66095M4614l47946
10953A329231j94357o8433k13148j08893j47821R8773L9277A13919j0804K14042
10943C17157J39817k04181L1096m3732j04551f371j15133B0754a96277b1756j06353
$$ plain form
11013 408866 412467 850960 509881 751903 730834 956392 509218 904498 673874 506857
11003 506857 530383 289590 683686 740167 1036553 608492 387220 482824 625768 425018
10993 425018 579070 610816 504461 690453 746073 905544 676886 925192 746330 1275116
10983 1275116 1219793 1316374 1312275 1218113 1056556 1624309 1872761 1906234 2313675 2552929
10973 2552929 2708844 2824348 2845821 2671407 2623634 2540014 2060173 2115891 1836464 1920548
10963 1920548 1468503 1821695 1886721 1886894 1729391 1620609 1798658 1632563 1677177 1329231
10953 1329231 1134874 1066441 853293 744400 596579 695352 734629 113919 103115 317157
10943 317157 456974 252793 283889 240157 135606 -6371 -121504 20754 -196277 -21756 -128109
10932a28109H2473d5792C72500i9774J6620B05834D08J33861L43541a13950C1498
10920C6269a06333l87477b27386H2730k9230J42316J62341a53575b4949m4682
10910f9631b7104A60167o3991g6033L830C0052P1558a80091F1800a19622j60833
10899b80455J23835A03817J82355A7681M9619L2387g2547C64588a76725h0048
10888a10171r2625H9433b09393H9894a2745B02522m7129a67723A80514j709p0861
10877A07944a35769N6677B07105b25482R6871r1604b6386J106D71668A44706k0945
10866A23761b85446B99627I3763e4996E80984a46609L2082a8508k53994A63962
10855D4128g2807j24895E3493O7574a43874A13727J11914E7327a9951O098A3990
$$ plain form
10932 -128109 82473 -45792 372500 -99774 -83154 205834 408 134269 477810 -113950 31498
10920 36269 -106333 -493810 -227386 82730 53500 195816 358157 -153575 -24949 -69631
10910 -69631 -27104 160167 96176 -76033 -72203 30052 101610 -180091 61800 -119622 -280455
10899 -280455 -156620 103817 286172 17681 67300 99687 -72547 364588 -176725 -80048
10888 -110171 -202796 89433 -209393 89894 -12745 202522 155393 -167723 180514 178805 107944
10877 107944 -135769 -79092 207105 -225482 -128611 -220215 -26386 -25280 471668 144706 123761
10866 123761 -285446 299627 93763 -54996 580984 -146609 -114527 -18508 -272502 163962
10855 44128 -72807 -197702 53493 121067 -143874 113727 225641 57327 -19951 -13853 13990
10843E4674H113i5565B70362A1515K71106j17189k6448f1010j00493m5825A56134
10831A67953B4727g1553J257a6423m645j76619A93252c33821A66001b18939A56207
10819B922i3402I9679l864J37557g0619j29012j40758C7769b64212A1728b60493
10807b73745b286I1426C9354J08511e6727n6519I8977b73347a8095A78498a02190
10795A84006a51569B70060d7000B5917b94884A06190a21862j70332E1410a83421
10784d23179a09581m3950G4108Q2543b374G9265d04864a03561M9246j43705b9276
10772g7591o8898B78266J07466A54639b80917B0451L39528F8237L6729P0422K0975
10761A96363h4514K7401k22738E1984c32054B78465H1521N8215a97144p4870a3876
$$ plain form
10843 54674 8113 -95565 270362 11515 282621 165432 138984 -61010 -161503 -207328 156134
10831 167953 24727 -71553 -70296 -16423 -21068 -197687 193252 -333821 166001 -218939 156207
10819 2922 -93402 99679 95815 233372 -70619 -199631 -340389 37769 -264212 11728 -260493
10807 -273745 -2286 91426 39354 147865 -56727 -113246 98977 -273347 -18095 178498 -102190
10795 184006 -151569 270060 -47000 25917 -294884 106190 -121862 -292194 51410 -183421
10784 -423179 -109581 -153531 74108 156651 -2374 79265 -404864 -103561 -54315 -198020 -29276
10772 -77591 -146489 278266 385732 154639 -280917 20451 359979 68237 104966 175388 196363
10761 196363 -84514 -57113 -279851 51984 -332054 278465 81521 139736 -197144 -272014 -13876
10749a67229A91329b33722L7415f1906D22070f4482q6345j9365e3079A16054E3168
10737H8242b28327j5182C29838C1077c53865a36106E5411M09199d2056B67717
10726a46788B26342H7898a35011j56252M920J03727e3456p5158q7424A27227l1681
10715I5546Q713d9061E726d0355l7994j70665A64662d06097A4585a10810C3078
10703b18581D9950c39649J8736B70795D8508c5099G618f945I2336g826H1700d0035
10690b11468C578R5985d85479b9379k36050Q1663A4760c2928m9936m3606j19439
10679b45909f2232A15764B8683c36219a40163k09158i5913d6847A25530e7621
10668b02890A223N201b8022A0365K4097R7105b82282a01180G9390a32188A90991
$$ plain form
10749 -167229 191329 -233722 -196307 -61906 422070 -64482 -150827 -170192 -53079 116054 53168
10737 88242 -228327 -243509 329838 31077 -353865 -136106 55411 464610 -42056 267717
10726 -146788 226342 87898 -135011 -291263 -286343 -182616 -53456 -128614 -216038 127227 95546
10715 95546 104259 -49061 5726 -40355 -78349 -249014 164662 -406097 14585 -110810 33078
10703 -218581 49950 -339649 -320913 270795 48508 -35099 7618 -6945 92336 -7826 81700 -40035
10690 -211468 3578 99563 -485479 -29379 -265429 -183766 14760 -32928 -82864 -126470 -245909
10679 -245909 -62232 115764 28683 -336219 -140163 -349321 -95913 -46847 125530 -57621
10668 -202890 1223 6424 -28022 10365 34462 131567 -282282 -101180 79390 -132188 190991
10656D3351i6303p8965j63439Q8186A01040p933B3607Q9769a31043l5295L0285
10645a36053F3507K51393a08539B60335b03143j20298j93683a19583I5423a05593
10634b08380J3397G5702b74345j60184A07509d36037a59773A67906N7186a89743
10623c7123p5599l08674J22886A1927a19818A2714e8206C5908B212M0234N4265
10612I6711M2530a64014k81862A03125k8819e3873K442b4246C93700g0054k21181
10601b91235B61911A0652b28449R6690J125E6488b84984B02433i7789M087A83829
10589A9419a46880j19173i1872b2558r6328B1079c06754c2618k24090A37392a91496
10577C22627n5609b80088J688b6815r1933A28821a374j03912b3583q1820A31305
$$ plain form
10656 43351 -96303 -175268 -338707 -250521 101040 93107 23607 113376 -131043 -166338 -136053
10645 -136053 63507 314900 -108539 260335 -203143 -323441 -517124 -119583 95423 -105593
10634 -208380 -194983 75702 -274345 -434529 107509 -436037 -159773 167906 225092 -189743
10623 -37123 -112722 -421396 -298510 11927 -119818 12714 -58206 35908 2212 42446 96711
10612 96711 139241 -164014 -445876 103125 74306 -53873 -51431 -24246 393700 -70054 -291235
10601 -291235 261911 10652 -228449 -131759 -130634 56488 -284984 202433 -97789 -93702 183829
10589 19419 -146880 -266053 -91872 -22558 -118886 21079 -306754 -32618 -256708 137392 -191496
10577 322627 267018 -280088 -278400 -26815 -118748 128821 -1374 -105286 -23583 -105403 131305
10565b46053A30562a03671k2910H5022k5722O8716d1451A17057b23374j03106
10555c26480A39541d9513G9307a13500A63750D3652c94154D3211b7258A59681
10544F0978a07673I5439J9758C5101r927J5932J11527d31458B53321e2576j64332
10533b16908g4338o2751O3462K6467n3901I7038i4138c1558D90966b96658A92903
10521A4232J35471f0520j14612k3159H9854b27756g3488H0153b24376c8722q4003
10510a22725K1429o230A59394d3871r9008e9157A67096b54786e3077j02335b8995
10498c78865d526B09687E7479i826B59917d6552C03725a68604A38362l2017O9353
10487A75698a51128C6153a16668o4490C32587J35921j81648J00506A73829D2704
$$ plain form
10565 -246053 130562 -103671 -126581 85022 59300 128016 -41451 117057 -223374 -326480
10555 -326480 139541 -49513 79307 -113500 163750 43652 -394154 43211 -27258 159681
10544 60978 -107673 95439 115197 35101 25174 41106 152633 -431458 253321 -52576 -216908
10533 -216908 -74338 -137089 -73627 -47160 -101061 97038 -94138 -31558 490966 -296658 192903
10521 14232 149703 -60520 -175132 -198291 89854 -227756 -73488 80153 -224376 -38722 -122725
10510 -122725 -101296 -107526 159394 -43871 -142879 -59157 167096 -254786 -53077 -155412 -28995
10498 -378865 -4526 209687 57479 -9826 259917 -46552 303725 -168604 138362 106345 175698
10487 175698 -151128 36153 -116668 -181158 332587 468508 286860 387366 173829 42704
10476f097j7812q2526A37238J07502n7324M9712D7661J72885e5585j21162k75105
10465d51852a18576C22110e2493A04627C7519J5582c0642D2215Q3702R566a5233
10453c11192B46994b2993j52608A14941b7653k8378h392A67437M4092a84911Q055
10442a76856F3886c59906d3484A17968j3316J8218a33252B41849b14823B40493
10431F7282C0139A2882a94960g2130A21211J530b86304F1146f7147B41030c30210
10419B57584B9674a47764B1433a14504M8410o2016j15121Q6745A50930a15493
10408A24996J01741E5788g2257b1634C218L3249b14791E4126K99580a97911D01950
10396b46936A6865J31054F0398a47291B05878b2267E981K10028K02469j98640
$$ plain form
10476 -6097 -23909 -106435 137238 244740 187416 237128 47661 220546 -55585 -176747 -451852
10465 -451852 -118576 322110 -52493 104627 37519 53101 -30642 42215 125917 135483 -15233
10453 -311192 246994 -22993 -175601 114941 -27653 -56031 -8392 167437 211529 -184911 -176856
10442 -176856 63886 -359906 -43484 117968 104652 122870 -133252 241849 -214823 240493
10431 67282 30139 12882 -194960 -72130 121211 122741 -286304 61146 -67147 241030 -330210
10419 257584 29674 -147764 21433 -114504 -66094 -128110 -243231 -156486 150930 -115493
10408 124996 226737 55788 -72257 -21634 3218 36467 -214791 54126 353706 -197911 401950
10396 -246936 16865 147919 60398 -147291 205878 -22267 5981 216009 418478 219838
10386B19838r6977R7742n6974J24487B5632J8816J62873J51388B228P547L91179
10375D00954j83756O8750q70K94363g056F10524B57389M64640C22755N59540l69055
10364E13240k38685l8267k0O7922r8572g37D6048N0667i8140D66206B18077J38149
10352C56226L16798J89122j28894o4486k82193J1462j91816K67168k9500N7645
10342E01532A85177J11769K01338j34200a6390C4022K04521K37615i9279A23298
10331C04816j29345E4601L23339a43509H3835P9819E3553K89726A31698a23280
10320i4262A91911a48735K0203C48103b5383A54221K67294E450K90375r8627c18480
10308b56825P1527F6973e2880D910a08129r1597A42370a6733E9049j069a85817
$$ plain form
10386 219838 122861 220603 163629 288116 25632 44448 207321 358709 2228 9775 400954
10375 400954 217198 285948 285078 579441 -7056 610524 257389 722029 322755 882295 513240
10364 513240 274555 236288 236268 304190 205618 -737 46048 96715 -98140 466206 218077 356226
10352 356226 673024 862146 733252 668766 386573 398035 206219 473387 443887 501532
10342 501532 185177 296946 498284 364084 -16390 34022 238543 476158 -99279 123298
10331 304816 175471 54601 377940 -143509 83835 163654 53553 343279 131698 -123280
10320 -94262 191911 -148735 -128532 348103 -25383 154221 421515 5450 295825 197198 -318480
10308 -256825 -185298 66973 -52880 4910 -108129 -199726 142370 -16733 59049 57980 -185817
10296A046P7481a81805c7049B9639e6550q1447A40528o6132L4189L11323j93120
10285B26788a80179A52007C0766g3494m2418B31801h1140G1285d41360b07653
10274a1553B5081J09067a45602k99984e5932j03097C80268a84367E11390a06864
10263B34013K39212C6192N35750m1215A80305p4179J98214a42479E7313b0789
10252B4253J04714C0905c23310I3676d9917l2075B19248A6680L2070K73734a75966
10240A34513a16249c5864E6693J09583h7047l9636j7439m1427Q8779A47607b67857
10228A85628b05352d4322j59745d6969k19337A07075g7223n0869b1363m11941
10218d33304f0878k8792I8144c48405a64751B36451a5069j94385A93661l4380
$$ plain form
10296 1046 78527 -181805 -37049 29639 -56550 -137997 140528 74396 108585 419908 226788
10285 226788 -180179 152007 30766 -73494 -115912 231801 -81140 71285 -441360 -207653
10274 -11553 25081 134148 -145602 -445586 -55932 -159029 380268 -184367 511390 -106864
10263 234013 473225 36192 571942 530727 180305 106126 304340 -142479 57313 -20789
10252 24253 128967 30905 -323310 93676 -49917 -81992 219248 16680 48750 322484 -175966
10240 134513 -116249 -35864 56693 166276 -87047 -126683 -144122 -185549 -96770 147607 -267857
10228 185628 -205352 -44322 -204067 -46969 -266306 107075 -77223 -128092 -21363 -433304
10218 -433304 -60878 -89670 98144 -348405 -164751 236451 -15069 -209454 193661 159281
10208A59281J97158d29556c8458A53840a93364l3067B8618N1333L00647F9705
10197a06036I5162a73950k3234i2389M1376B4283a20699p033j30586E3465J1175
10186F4640k3623f9632j56264H3997b4033A15976a95752B04250O5305b19960A42667
10174b72313d7616D08436B8746e8020E1931b60827R3688H783a03104l1033e2223
10162a20762I0460O6728d60869G7509J32595p5886n2722a0615k12223a3933C926
10150A19977c99091h1030r2950Q0252m9899D0027a91982f4556k37932J47968l8268
10139a92788o4249L37a24511j24399L1371m9243i4867O782F1711K4146g3387k9653
10127a03040c9235G8753b16115E2530a30417m5466O1022A8589a08402c62H3638
$$ plain form
10208 159281 356439 -429556 -38458 153840 -193364 -226431 28618 79951 380598 69705
10197 -106036 95162 -173950 -197184 -92389 -51013 24283 -120699 -127732 -258318 53465 64640
10186 64640 41017 -69632 -225896 83997 -24033 115976 -195752 204250 269555 -219960 142667
10174 -272313 -47616 408436 28746 -58020 51931 -260827 -167139 8783 -103104 -134137 -52223
10162 -120762 90460 157188 -460869 77509 210104 134218 81496 -10615 -222838 -13933 3926
10150 119977 -399091 -81030 -173980 -93728 -143627 40027 -191982 -64556 -302488 -154520 -192788
10139 -192788 -257037 -256700 -124511 -248910 -217539 -266782 -94867 -88085 61711 85857 -73387 -103040
10127 -103040 -39235 78753 -216115 52530 -130417 -175883 -114861 18589 -108402 -362 83638
10115D7955J28435b07852A93412h9189l9346M0424k30534a2813N414k26932j41633
10104c75964B4607a18548j45640b5645k57736L6003B94368d14841B10077F6120
10093D6977b26644g6715c7245D0471K70574i9761G943c6033m1968l01771k2479
10082d02251e9873r6674O6105b1311A10959B7516g3532k24186R5807c5933A46707
10070a97858k14217E4995a23165E6575a64648p4330h4944K4359B200L1219i2258
10058d4032C18464c98395h9143k17366g7661A4268b05862Q160B7776h1590A84134
10046e6292C469e0818A8046a63671M3931A15416K05912b37858M3035j51718J31383
10035b15158J01899K4469j34236c8087P062B31617a58720E0994c39622d7201A77903
$$ plain form
10115 47955 176390 -207852 193412 -89189 -128535 -88111 -318645 -12813 -7399 -234331 -375964
10104 -375964 24607 -118548 -264188 -25645 -283381 -247378 294368 -414841 210077 66120
10093 46977 -226644 -76715 -37245 40471 311045 -99761 7943 -36033 -78001 -379772 -402251
10082 -402251 -59873 -156547 -90442 -21311 110959 27516 -73532 -297718 -201911 -35933 146707
10070 -197858 -412075 54995 -123165 56575 -164648 -238978 -84944 -60585 2200 33419 -92258
10058 -44032 318464 -398395 -89143 -306509 -77661 14268 -205862 -197702 27776 -81590 184134
10046 -56292 3469 -50818 18046 -163671 -119740 115416 321328 -237858 -194823 -346541 -215158
10035 -215158 -113259 -88790 -223026 -38087 -31025 231617 -158720 50994 -339622 -47201 177903
10023b0160j87597h5170G2396K14690j32994L6718i3880j17663L8181B7733b72113
10011d58445F9905M51797A6880b23365C333d3999j22077B37868G6657K40705A6743
9999A57659D5365b62583A86286P9311d38311a63976m3441A63975M3742i0853r8259
9988a89112d456n7581A71466b96872c9921A40886a3944j53299A53337d24342a59627
9976a68223l0890B23736f51147a0933q0958k00070F0676N5609c5409I3177a36665
9964D1413a00679G677R5918a82072n9992E9806b14263Q8434D0555e8024A69058
9952a05530J2660m0636k5482k41783a27566B078K16418E8641K20331H6272f148
9940E7137g9393E6636d24470a76813Q7738J7869k27856A70597a02957j85206j75232
$$ plain form
10023 -20160 -207757 -85170 72396 287086 154092 190810 -93880 -211543 -173362 27733 -272113
10011 -458445 69905 521702 16880 -223365 3333 -43999 -166076 237868 76657 317362 16743
9999 157659 45365 -262583 186286 265597 -438311 -163976 -207417 163975 207717 -90853 -189112
9988 -189112 -4456 -62037 171466 -296872 -39921 140886 -13944 -167243 153337 -424342 -159627
9976 -168223 -199113 223736 -651147 -10933 -91891 -291961 60676 116285 -35409 93177 -136665
9964 41413 -100679 7677 103595 -182072 -242064 59806 -214263 -125829 40555 -58024 169058
9952 -105530 -92870 -133506 -158988 -400771 -127566 2078 218496 58641 278972 86272 -6148
9940 57137 -79393 56636 -424470 -176813 -89075 -71206 -299062 170597 -102957 -288163 -463395
9929d63395b29225G8632L404M37604A58403b70874J08800j04412c8245j99923
9919b38168m0158K8510Q3022k7546k9850H4750M8993b49160A67308a52562B6998
9907A0340b50148J23043r8488G6037e3645n4943j6838I2559B3487a47640j20072
9896b67712m1687b018m9500j02732l2695A27124N8652c90907a21324p1825A93679
9884b25739i9865M485I654a97083j26994a20661M2986k5787m39136A45987k4065
9873A21922b24081j13581F8984b28889a00449C9423a9784o8249A21475D8790a05619
9861a52631k1123A46988o4150l1729a99307M4976C3443a92392J8267j31689A3426
9849B50570A04097L8689c2300k15442l3921h7045j04887L2443k19913J73054D57409
$$ plain form
9929 -463395 -229225 78632 82036 519640 158403 -270874 -162074 -266486 -38245 -238168
9919 -238168 -278326 -249816 -166794 -194340 -224190 84750 133743 -249160 167308 -152562 26998
9907 10340 -250148 -127105 -225593 76037 -53645 -108588 -125426 92559 23487 -147640 -267712
9896 -267712 -309399 -2018 -51518 -154250 -186945 127124 185776 -390907 -121324 -193149 193679
9884 -225739 -99865 -95380 9654 -197083 -324077 -120661 -77675 -103462 -542598 145987 121922
9873 121922 -224081 -337662 68984 -228889 -100449 39423 -19784 -88033 121475 48790 -105619
9861 -152631 -173754 146988 82838 51109 -199307 -154331 33443 -192392 -174125 -305814 13426
9849 250570 104097 142786 -32300 -247742 -281663 -87045 -191932 -159489 -379402 -206348 457409
9837b89684K552c1150A29462a87255J9755j43282E0161c40753f084H4497c18927
9825I8390a8568l79237a35712O1491I967b55574D0777a36731F1969K03983q4458
9814A81494c8890k24746C3872e28397b35625c696B8447a59107f8425A46303k5615
9803A20688A8621a80181P3812B4620a73070N3279k56072A74771C7200a72712A8038
9791a4707l2439l1547A87230a25516k95358I2041a66122m1818F0636c90203a85931
9779g4639a2316n6971A36545D7436b24480D9739a24090m5968p133p2573c1011
9767A26913a18970L3172l1020p636B77785o1581q4168b14009G9233c15966A1247
9755h740A54415a56473A31264f166n4416B71527a009o9335k5616k54159C50373
$$ plain form
9837 -289684 -287132 -31150 129462 -187255 -167500 -310782 50161 -340753 -6084 84497 -318927
9825 98390 -18568 -397805 -135712 -74221 9967 -255574 40777 -136731 61969 265952 181494
9814 181494 -38890 -263636 33872 -528397 -235625 -3696 28447 -159107 -68425 146303 120688
9803 120688 18621 -180181 -106369 24620 -173070 -119791 -375863 174771 37200 -172712 18038
9791 -14707 -47146 -78693 187230 -125516 -420874 92041 -166122 -207940 60636 -390203 -185931
9779 -74639 -12316 -69287 136545 47436 -224480 49739 -124090 -170058 -177191 -249764 -31011
9767 126913 -118970 -85798 -116818 -124454 277785 216204 132036 -214009 79233 -315966 11247
9755 -8740 154415 -156473 131264 -6166 -60582 271527 -1009 -70344 -95960 -350119 350373
9743c1721m28884J78604E324g5458j32099P8421l7677j04843I0337d0955B58094
9731b79844B19220H7500b18623B91140a5103A56949a78386Q1707C5744d3658j13005
9720a56663k4537A15978a23747I4587k3258J68369c14725a37438l50836G0389
9709c96365e8922C15196e8901B04111g4414l89267a93541B42735D0992f33266
9698a21509p9852e7787o8735H7066l9871h0546k59662a37440B05597H9186i1804
9686c726l1582a2824A32598I364O2657b23563B37284P22D1973j3939b51509k63112
9674e14621G160b03897F7131l0222b26513M8876c0780D9799h3472P499b2520D27000
9661c3686n4981C6011J77901d49924J34691g9084o9775D16799H4536J9972b1686
$$ plain form
9743 -31721 -460605 -282001 5324 -75458 -207557 -129136 -166813 -271656 90337 -40955 258094
9731 -279844 219220 87500 -218623 291140 -15103 156949 -178386 -96679 35744 -43658 -156663
9720 -156663 -181200 115978 -123747 94587 71329 239698 -314725 -137438 -488274 70389
9709 -396365 -58922 315196 -58901 204111 -74414 -463681 -193541 242735 40992 -633266
9698 -121509 -201361 -57787 -126522 87066 47195 -80546 -340208 -137440 205597 89186 -91804
9686 -3726 -35308 -12824 132598 9364 72021 -223563 237284 238006 41973 28034 -251509 -514621
9674 -514621 7160 -203897 67131 36909 -226513 -177637 -30780 49799 -83472 -75973 -22520 427000
9661 -33686 -88667 36011 213912 -449924 -315233 -79084 -148859 416799 84536 104508 -21686
9649B8237J03447a93401q8271d8033k95580d9596j79412A00623a36855c9636j09767
9638a49403k4408n0628e5736b2045l19213l6116A3772a97993A71337C9779a11136
9626a84267e1317B22644D9481c6450k4566B7976e5211J5381r812j64512b4345
9614a24884m2278f7098J6980p9502A64134c42153L1251a46819I1131a83116j59459
9603c42575K2938e3633H6211k0984A0681d06568a01933K5729j23169A45751a03910
9591c9321j35659O1220Q32k12848a31684b8345n2819A01278O076j5661c54625
9579c35665m6993J50717F2698b5218m5414A25392J35309b82291b2045m11844a48092
9567b65117a8174j00142C4060a78702I1916N0606b3656a1337m2203B61022b58229
$$ plain form
9649 28237 131684 -193401 -281672 -48033 -343613 -49596 -229008 100623 -136855 -39636 -149403
9638 -149403 -173811 -224439 -55736 -22045 -341258 -377374 13772 -197993 171337 39779 -111136
9626 -184267 -51317 222644 49481 -36450 -61016 27976 -55211 -39830 -49642 -214154 -24345
9614 -124884 -167162 -67098 -50118 -129620 164134 -342153 -310902 -146819 91131 -183116 -342575
9603 -342575 -319637 -53633 86211 65227 10681 -406568 -101933 -76204 -199373 145751 -103910
9591 -39321 -174980 -113760 -112928 -325776 -131684 -28345 -81164 101278 107354 91693 -354625
9579 -335665 -382658 -231941 62698 -25218 -70632 125392 260701 -282291 -22045 -433889 -148092
9567 -265117 -18174 -118316 34060 -178702 91916 142522 -23656 -11337 -53540 261022 -258229
9555b6015j9868o5696F145P0371b13734M8368A96412b69592H4435a60567k7788
9544a88355C54020I5920c48343N2314a16937j11961C9774J15766a02377j46067
9534b48444c0742o8254k0761f193m5284R337B31548d5444b1859k096j54821C7371
9521e52566b16610r961C216a69427A10513b43398d3123j58155d5024p8199a8662
9509A87048a57567A3137R604a5155I1596h8335A29791B3866i6371M3299A82666
9497d214k38905g6002q9817p1231A28027a59727A546a08554I3824L5576c55334
9485a20921j10050j15510A67694K11481A02749C0799b26221L3058A6090a19387
9474b8924j05967O2561j48872R0853B4519e3026Q296q0086F93K4388b71475q9786
$$ plain form
9555 -26015 -45883 -111579 6145 76516 -213734 -165366 196412 -269592 84435 -160567 -188355
9544 -188355 354020 95920 -348343 -296029 -116937 -228898 39774 155540 -102377 -248444
9534 -248444 -30742 -98996 -119757 -6193 -51477 -42140 231548 -45444 -21859 -23955 -178776 37371
9521 -552566 -216610 -226571 3216 -169427 110513 -243398 -43123 -201278 -45024 -123223 -18662
9509 187048 -157567 13137 22741 -15155 91596 -88335 129791 23866 -96371 -53072 182666
9497 -4214 -243119 -76002 -165819 -237050 128027 -159727 1546 -108554 93824 129400 -355334
9485 -120921 -230971 -346481 167694 379175 102749 30799 -226221 -193163 16090 -119387
9474 -28924 -134891 -72330 -221202 -130349 24519 -53026 -44730 -124816 693 25081 -271475 -361261
9462c61261B69760A31434a87843D0206b98315c9551o3165A07753b46304k1923
9452b68227D0746K41918H464O053J27002a80588A5243b20048A59234a3442r916
9441b3358o0697k6230N383B11848b07652O7512c8642q199B42615A2539a98606
9429C2150b09461B27074b21572j96520B09993c7038a6879L44j60248c5461m130
9418c9591q4254c1396l57234J58056n3063O9450M7695h0961j04313K1704C8341
9406a70200A87b14903o1207p458i5095C2893L03672b6433m4092n8838F4181a69158
9393d4380q2267C7877d9560I6827C4026P5524b09718b0590B93053C6436b70292
9381b94814B85968a44282A64503a30680j59944a26800k86417Q9690E2494J12228
$$ plain form
9462 -361261 269760 131434 -187843 40206 -298315 -39551 -102716 107753 -246304 -268227
9452 -268227 40746 282664 8464 14517 141519 -180588 15243 -220048 159234 -13442 -23358
9441 -23358 -84055 -110285 -104902 211848 -207652 -140140 -38642 -46841 242615 12539 -198606
9429 32150 -209461 227074 -221572 -418092 209993 -37038 -16879 -16535 -176783 -35461 -39591
9418 -39591 -123845 -31396 -388630 -230574 -283637 -214187 -166492 -80961 -185274 -163570 38341
9406 -170200 187 -214903 -276110 -283568 -95095 32893 336565 -26433 -70525 -129363 64181 -169158
9393 -44380 -126647 37877 -49560 96827 34026 109550 -209718 -20590 293053 36436 -270292
9381 -294814 285968 -144282 164503 -130680 -290624 -126800 -413217 -323527 52494 164722
9371A64722b30947R9727B07830a43962A7434M4811b74432f1795p3348A64053i4627
9359H1101b26941A49219D679b36221j2017H945c43287F8958e6592J6750F7091
9347b12173M9442J3688A40380E5664R9129a17998b0071j3035B40212c18889B97304
9335B27664f9923b1894A74897I057K40745g2491b801I8264g0327l23723G3888
9323C1377d6384k75052B27058e8375A49570k2188N5324q3555c0023l09288J12493
9312b26818d5757m59393a43249e8290A01229N3384E4823e8234q6629B13510d7269
9300a08466F7713f1042o2130c904A55723m0341J85912a25857F5211e9028C67562
9288A26328c17705l0374O1000f7134j74024j21686A08440b64062O2055b3511A34381
$$ plain form
9371 164722 -230947 -131220 207830 -143962 17434 62245 -274432 -61795 -135143 164053 -94627
9359 81101 -226941 149219 4679 -236221 -248238 8945 -343287 68958 -56592 -39842 67091
9347 -212173 -162731 -149043 140380 55664 154793 -117998 -20071 -33106 240212 -318889 297304
9335 227664 -69923 -21894 174897 9057 249802 -72491 -2801 98264 -70327 -394050 73888
9323 31377 -46384 -321436 227058 -58375 149570 127382 182706 99151 -30023 -339311 -226818
9312 -226818 -45757 -505150 -143249 -58290 101229 154613 54823 -58234 -144863 213510 -47269
9300 -108466 67713 -61042 -123172 -3904 155723 115382 301294 -125857 65211 -59028 367562
9288 126328 -317705 -348079 -287079 -67134 -241158 -362844 108440 -264062 -202007 -23511 134381
9276B03560m5369b75786A09138L3390a19102k32476C2792f3443k30466i8998r4378
9265a93376L7563C6535b6621A63697l4004B5186a27427c4626B36162c39394g4094
9253a15583F2067p65a68668m5530e1152k33773E04280d2317D4080J23588L5370
9242B03038c57664J36816b3154O754j24267K3635A07714a07911a2624H4790b2265
9230I6620P1043a54531H411Q8063g76154c82060O1834C19897O4957b0234j96310
9219b16544f7361A37246J81325g7911l8292A85381a24687q6382f2069D5587a7426
9207b15421F261b11315k8466E1814b3975A45025a6641j96546a01363A1060N8287
9196F9347c6493D43990a97545B76480A5936J68087c33358b2885k39920A48437
$$ plain form
9276 203560 158191 -275786 109138 142528 -119102 -351578 32792 -63443 -293909 -98998 -193376
9265 -193376 -155813 36535 -26621 163697 129693 25186 -127427 -34626 236162 -339394 -74094
9253 -115583 62067 61302 -168668 -214198 -51152 -284925 504280 -42317 44080 167668 203038
9242 203038 -357664 -220848 -23154 -16400 -140667 -117032 107714 -107911 -12624 84790 -22265
9230 96620 167663 -154531 8411 96474 -776154 -382060 -320226 319897 384854 -20234 -216544
9219 -216544 -67361 137246 318571 -77911 -116203 185381 -124687 -211069 -62069 45587 -17426
9207 -215421 6261 -211315 -239781 51814 -23975 145025 -16641 -213187 -101363 11060 69347
9196 69347 -36493 443990 -197545 276480 15936 184023 -333358 -22885 -262805 148437
9185f6097H6986e6937A91235e5293A9868c14317a21608b5063k65765i8677j80719
9174b79396i7966M6622A04375D7246q117d66994A89599a91319e6525b2261p8454
9163a00715j01420C41554a21400q6932N5322K9821b5506G490a43767B2394b55706
9151B8694K9779a7281j91577I3807c52234e3365k73467F0706j3787e6979J2318
9140d4661E831b88907e7791F0849f854q0852b7111j32854f2258K2595k76090b7127
9127a70193j40004i0770j55115A25648d51632a48347F6658L49854d9963D9578
9116E9243c2406A52651b53449N3930L9158P0319l39426A13621A8859c1046k88278
9105c19324K5415d0702O510j74684K8177C7106a03052A66884m7387n1896a5896
$$ plain form
9185 -66097 86986 -56937 191235 -55293 19868 -314317 -121608 -25063 -290828 -98677 -279396
9174 -279396 -97966 -51344 104375 47246 39129 -466994 189599 -191319 -56525 -22261 -100715
9163 -100715 -202135 341554 -121400 -208332 -153010 -123189 -25506 7490 -143767 22394 -255706
9151 28694 58473 -17281 -208858 93807 -352234 -53365 -326832 60706 46919 -56979 -44661
9140 -44661 5831 -288907 -57791 60849 -6854 -87706 -27111 -159965 -62258 -39663 -315753 -27127
9127 -170193 -310197 -90770 -245885 125648 -451632 -148347 66658 416512 -49963 49578
9116 59243 -32406 152651 -253449 -199519 -160361 -90042 -429468 113621 18859 -31046 -319324
9105 -319324 -293909 -40702 -34192 -208876 -180699 37106 -103052 166884 119497 67601 -15896
9093c36537D8896b94589B06408a8918A67973a79387o4339I3784b03139D7203g3373
9081I7339N0256a09374F6703K84820a14620A93397b24608a3819j2110M22k96457
9070c21964A56588g0045A18118a00754j07843D4327h1718B28507b0149k38450
9060b58599h4451A58611a52910n6304A56194J05260d99655I4358J52152g9496
9049b56909j40082J64804i2171j03708h7088L4307A9238J99203b57683N7154n0035
9038b50564E4449L511a6676A60476J54370A37639b0851B63195i2367j09066e4086
9026a07733B30273i5257B6700b57326h5072p209A89745g639k40625A70917c80751
9014A61792J84935j08185a5980j83312f5394A0490M2101b7122A82519b31142P6767
$$ plain form
9093 -336537 48896 -294589 206408 -18918 167973 -179387 -243726 93784 -203139 47203 -73373
9081 97339 147595 -109374 66703 351523 -114620 193397 -224608 -13819 -25929 -25507 -321964
9070 -321964 156588 -70045 118118 -100754 -208597 44327 -81718 228507 -20149 -258599
9060 -258599 -84451 158611 -152910 -209214 156194 261454 -499655 94358 246510 -79496
9049 -256909 -396991 -232187 -92171 -195879 -87088 -52781 19238 218441 -257683 -200529 -250564
9038 -250564 54449 57960 -16676 160476 314846 137639 -20851 263195 -92367 -201433 -54086
9026 -107733 230273 -95257 26700 -257326 -85072 -92281 189745 -7639 -248264 170917 -380751
9014 161792 346727 238542 -15980 -199292 -65394 10490 52591 -27122 182519 -231142 -154375
9003a54375k15135l194a8812F3847c52756a49529c0588m5100A1542c21764B48175
8991B64721a7344F8447a45834q8840B98051j41838a78132p8960C35632c48319
8980b72351i8713B63961f4883r2103g1175c3807k4590J7768G1088b52084k3588
8969b75672B39641a39826j2081M8744m6797A8524a05066A57927f4732A61315G8860
8957G6370a8661o2084m06k00998b4066p7211B01119D1104b48306d7716K0428l98161
8945d25449D9712a90974I0423b94348a8478F8889N490b710E7242J67976L06031
8934E31249C1647a1572k23633c7647A75512J10800C9232L62855l5884N52565R95699
8923A914467K997082O641838n586950A331002o33410B61079K20442j50695l4491
$$ plain form
9003 -154375 -369510 -372704 -18812 63847 -352756 -149529 -30588 -75688 11542 -321764 248175
8991 264721 -17344 68447 -145834 -234674 298051 156213 -178132 -257092 335632 -348319
8980 -272351 -98713 263961 -64883 -156986 -71175 -33807 -58397 -40629 71088 -252084 -275672
8969 -275672 239641 -139826 -151907 -103163 -149960 18524 -105066 157927 -64732 161315 78860
8957 76370 -18661 -80745 -81151 -282149 -24066 -101277 201119 41104 -248306 -47716 -27288 -425449
8945 -425449 49712 -190974 90423 -294348 -18478 68889 74379 -2710 57242 225218 531249
8934 531249 31647 -11572 -235205 -37647 175512 286312 39232 402087 366203 918768 1914467
8923 1914467 4911549 11553387 5966437 1331002 697592 261079 481521 330826 296335
8914B96335D9875a89102A12121m5029K11301o192M3287e8634A81115K24813e3313
8902A65381B6769J10784a10610k67095h8279A56254a18271c2144o8089H0616J7979
8891I8595d82053G1858f7322D840a82901e1099j94704p3452G7431B4716c5293
8879a05023n6623L57k25341a34521B11i5255k05553D7654J72613f3812j08932
8868a72744O9669l0426J0409A48443d5373D7659L4846a72952H1521b4014E807
$$ plain form
8914 296335 49875 -189102 112121 67092 278393 272201 315488 -58634 181115 405928 -53313
8902 165381 26769 137553 -110610 -377705 -88279 156254 -118271 -32144 -100233 80616 98595
8891 98595 -482053 71858 -67322 4840 -182901 -51099 -245803 -319255 77431 24716 -35293
8879 -105023 -161646 -161289 -386630 -134521 211 -95255 -300808 47654 220267 -63812 -172744
8868 -172744 -103075 -133501 -123092 148443 -45373 47659 82505 -172952 81521 -24014 5807
$$ [...]
##END NTUPLES=NMR SPECTRUM
##END=
