
##TITLE=AC1233_PERAH12114_6519287_kQ2xMY586G
##JCAMPDX= 6.0         $$ Bruker NMR JCAMP-DX V2.0
##DATA TYPE= NMR SPECTRUM
##DATA CLASS= NTUPLES
##ORIGIN= BRUKER
##OWNER= Administrator
$$ 1.72 TOPSPIN		Version 2.1
$$ 2012-07-13 17:48:12.453 -0500  Administrator@TOPSPIN
$$ Compression mode = diff/dup
##.OBSERVE FREQUENCY= 400.02188249412
##.OBSERVE NUCLEUS= ^1H
##.ACQUISITION MODE= SIMULTANEOUS (DQD)
##.ACQUISITION SCHEME= undefined
##.AVERAGES= 64
##.DIGITISER RES= 22
##SPECTROMETER/DATA SYSTEM= spect
##.PULSE SEQUENCE= noesygpps1d.comp
##.SOLVENT NAME= COFFEE_meoh
##.SHIFT REFERENCE= INTERNAL, COFFEE_meoh, 1, 14.96066
##AUDIT TRAIL= $$ (NUMBER, WHEN, WHO, WHERE, PROCESS, VERSION, WHAT)
$$ ##TITLE= Audit trail, TOPSPIN		Version 2.1
$$ ##JCAMPDX= 5.01
$$ ##ORIGIN= Bruker BioSpin GmbH
$$ ##OWNER= Administrator
$$ $$ C:\Bruker\TOPSPIN/data/COFFEE/nmr/AC1233_PERAH12114_6519287_kQ2xMY586G/42/pdata/1/auditp.txt
$$ ##AUDIT TRAIL=  $$ (NUMBER, WHEN, WHO, WHERE, PROCESS, VERSION, WHAT)
(   1,<2012-07-13 17:48:07.437 -0500>,<Administrator>,<TOPSPIN>,<go>,<TOPSPIN 2.1>,
      <created by zg
	started at 2012-07-13 17:36:37.062 -0500,
	POWCHK enabled, PULCHK disabled,
       configuration hash MD5:
       6B 1B 68 BB D9 2E 58 E2 7F 35 AD 54 07 DF 0E 41
       data hash MD5: 64K
       AF 5F 80 3F 85 5B 6E 87 49 0C 4B BC 14 F2 77 96>)
(   2,<2012-07-13 17:48:10.562 -0500>,<Administrator>,<TOPSPIN>,<proc1d>,<TOPSPIN 2.1>,
      <Start of raw data processing
       efp LB = 0.3 FT_mod = 6 PKNL = 1 PHC0 = 0 PHC1 = 0 SI = 128K 
       data hash MD5: 128K
       56 BD 6A 9F 04 33 C6 5E AB F0 C9 B2 57 47 31 17>)
(   3,<2012-07-13 17:48:11.656 -0500>,<Administrator>,<TOPSPIN>,<proc1d>,<TOPSPIN 2.1>,
      <pk PHC0 = -0.1373291 PHC1 = 0 
       data hash MD5: 128K
       04 B8 F8 AC E0 8C 5E 5C EF 02 16 C9 E5 13 32 FB>)
(   4,<2012-07-13 17:48:12.140 -0500>,<Administrator>,<TOPSPIN>,<proc1d>,<TOPSPIN 2.1>,
      <abs ABSG = 1 
       data hash MD5: 128K
       F2 92 F5 04 F5 D2 77 D6 5C D1 8D C8 6F DA 35 44>)
(   5,<2012-07-13 17:48:12.218 -0500>,<Administrator>,<TOPSPIN>,<proc1d>,<TOPSPIN 2.1>,
      <abs ABSG = 2 
       data hash MD5: 128K
       6D 35 C3 96 43 78 CA F1 51 C6 85 40 44 DC DC 16>)
(   6,<2012-07-13 17:48:12.265 -0500>,<Administrator>,<TOPSPIN>,<proc1d>,<TOPSPIN 2.1>,
      <abs ABSG = 3 
       data hash MD5: 128K
       7E 37 D1 8A 9A 42 14 6B CD 04 9D 2D 32 03 12 7E>)
(   7,<2012-07-13 17:48:12.312 -0500>,<Administrator>,<TOPSPIN>,<proc1d>,<TOPSPIN 2.1>,
      <abs ABSG = 4 
       data hash MD5: 128K
       9A BD 13 B8 48 50 21 27 A9 AE 82 E7 6B B9 00 8D>)
(   8,<2012-07-13 17:48:12.375 -0500>,<Administrator>,<TOPSPIN>,<proc1d>,<TOPSPIN 2.1>,
      <abs ABSG = 5 
       data hash MD5: 128K
       74 3C A0 3C 17 3E C4 76 76 A5 1D 1E EB 68 22 18>)
$$ ##END=
$$ 
$$ $$ hash MD5
$$ $$ C8 38 14 A3 64 C2 7A 78 D5 3F BD D9 7E 60 35 DB
##$RELAX= 
##$RELAX= 
##$RELAX= 
##$RELAX= 
##$RELAX= 
##$RELAX= 
##$RELAX= 
##$RELAX= 
##$RELAX= 
$$ [...]
##$TP07= 0
##$TPNAME0= <>
##$TPNAME1= <>
##$TPNAME2= <>
##$TPNAME3= <>
##$TPNAME4= <>
##$TPNAME5= <>
##$TPNAME6= <>
##$TPNAME7= <>
##$TPOAL= (0..7)
0.5 0.5 0.5 0.5 0.5 0.5 0.5 0.5
##$TPOFFS= (0..7)
0 0 0 0 0 0 0 0
##$TUNHIN= 0
##$TUNHOUT= 0
##$TUNXOUT= 0
##$USERA1= <user>
##$USERA2= <user>
##$USERA3= <user>
##$USERA4= <user>
##$USERA5= <user>
##$V9= 5
##$VALIST= <valist>
##$VCLIST= <CCCCCCCCCCCCCCC>
##$VD= 0
##$VDLIST= <DDDDDDDDDDDDDDD>
##$VPLIST= <PPPPPPPPPPPPPPP>
##$VTLIST= <TTTTTTTTTTTTTTT>
##$WBST= 2048
##$WBSW= 25
##$XGAIN= (0..3)
0 0 0 0
##$XL= 0
##$YL= 0
##$YMAX_a= 11970982
##$YMIN_a= -9487457
##$ZGOPTNS= <>
##$ZL1= 120
##$ZL2= 120
##$ZL3= 120
##$ZL4= 120
##$ABSF1= 14.96066
##$ABSF2= -5.597522
##$ABSG= 5
##$ABSL= 3
##$ALPHA= 0
##$AQORDER= 0
##$ASSFAC= 0
##$ASSFACI= 0
##$ASSFACX= 0
##$ASSWID= 0
##$AUNMP= <proc_prof1d_extract.lims>
##$AXLEFT= 0
##$AXNAME= <>
##$AXNUC= <1H>
##$AXRIGHT= 0
##$AXTYPE= 0
##$AXUNIT= <>
##$AZFE= 0.1
##$AZFW= 0.1
##$BCFW= 0
##$BC_mod= 0
##$BYTORDP= 0
##$COROFFS= 0
##$CY= 15
##$DATMOD= 1
##$DC= 0
##$DFILT= <>
##$DTYPP= 0
##$F1P= 0
##$F2P= 0
##$FCOR= 0.5
##$FTSIZE= 131072
##$FT_mod= 6
##$GAMMA= 0
##$GB= 0
##$INTBC= 1
##$INTSCL= 1
##$ISEN= 128
##$LB= 0.3
##$LEV0= 0
##$LPBIN= 0
##$MAXI= 10000
##$MC2= 0
##$MEAN= 0
##$ME_mod= 0
##$MI= 0
##$NCOEF= 0
##$NC_proc= -2
##$NLEV= 6
##$NOISF1= 0
##$NOISF2= 0
##$NSP= 0
##$NTH_PI= 0
##$NZP= 0
##$OFFSET= 14.96066
##$PC= 1
##$PHC0= -0.1373291
##$PHC1= 0
##$PH_mod= 1
##$PKNL= yes
##$PPARMOD= 0
##$PPDIAG= 0
##$PPIPTYP= 0
##$PPMPNUM= 2147483647
##$PPRESOL= 1
##$PSCAL= 4
##$PSIGN= 0
##$PYNMP= <proc.py>
##$REVERSE= no
##$SF= 400.020009771041
##$SI= 131072
##$SIGF1= 0
##$SIGF2= 0
##$SINO= 400
##$SIOLD= 131072
##$SPECTYP= <>
##$SREGLST= <1H.CDCl3>
##$SSB= 0
##$STSI= 131072
##$STSR= 0
##$SW_p= 8223.68421052631
##$SYMM= 0
##$S_DEV= 0
##$TDeff= 65536
##$TDoff= 0
##$TI= <>
##$TILT= no
##$TM1= 0
##$TM2= 0
##$TOPLEV= 0
##$USERP1= <user>
##$USERP2= <user>
##$USERP3= <user>
##$USERP4= <user>
##$USERP5= <user>
##$WDW= 1
##$XDIM= 131072
##$YMAX_p= 398551141
##$YMIN_p= -12474
##$CURPLOT= <Network HP LaserJet P1505>
##$CURPRIN= <$Network HP LaserJet P1505>
##$DFORMAT= <normdp>
##$LAYOUT= <+/1D_H.xwp>
##$LFORMAT= <normlp>
##$PFORMAT= <normpl>
##$SURQMSG= 1
$$ End of Bruker specific parameters
$$ ---------------------------------
##NTUPLES= NMR SPECTRUM
##VAR_NAME=  FREQUENCY,     SPECTRUM/REAL,   SPECTRUM/IMAG
##SYMBOL=    X,             R,               I
##VAR_TYPE=  INDEPENDENT,   DEPENDENT,       DEPENDENT
##VAR_FORM=  AFFN,          ASDF,            ASDF
##VAR_DIM=   131072,        131072,          131072
##UNITS=     HZ,            ARBITRARY UNITS, ARBITRARY UNITS
##FACTOR=    0.0627417313425164, 1,          1
##FIRST=     8223.62146879497, -717,         -63408
##LAST=      0,             1651,            -63551
##MIN=       0,             -12474,          0
##MAX=       8223.62146879497, 398551141,    0
$$ Real data points
##PAGE= N=1
##DATA TABLE= (X++(R..R)), XYDATA
$$ [...]
63909B276664j82708j67991j52292j36920j22966j10390r8440q6889p6269o6901
63899A074898n8357n0198m2682l6326l1216k7154k4010k1486j8913j5916j3090
63888G35550j1369j0786j0471r822r054q420p542n906l645j438K17J271J903K376
63874F62864L178M921P830J1396J4761J7522J9936K2331K4507K6007K6736K6979
63862H68968K6882K6376K5605K4834K3842K1938J8968J5712J2887J0194O919L058
63850A086183p63m231p586j1083j4780j8785k3007k6768k9314l0751l1894l3205
63838H54016l4398l5055l5018l4179l2615l0988l0032k9510k8406k6381k4216
63827E13218k2499k0781j8593j6489j5233j4547j3562j2194j1215j1000j1026
$$ y = [2276664, 2093956, 1925965, 1773673, 1636753, 1513787, 1403397, 1304957, 1218068, 1141799, 1074898, 1016541, 966343, 923661, 887335, 856119, 828965, 804955, 783469, 764556, 748640, 735550, 724181, 713395, 702924, 693102, 684048, 675628, 668086, 662180, 658535, 657097, 657314, 658585, 660488, 662864, 666042, 670963, 678793, 690189, 704950, 722472, 742408, 764739, 789246, 815253, 841989, 868968, 895850, 922226, 947831, 972665, 996507, 1018445, 1037413, 1053125, 1066012, 1076206, 1083125, 1086183, 1085420, 1081189, 1073603, 1062520, 1047740, 1028955, 1005948, 979180, 949866, 919115, 887221, 854016, 819618, 784563, 749545, 715366, 682751, 651763, 621731, 592221, 563815, 537434, 513218, 490719, 469938, 451345, 434856, 419623, 405076, 391514, 379320, 368105, 357105, 346079]
63816C46079j0623r641q347p110o305n995n737n056m124l542l442l273k659j965
63802B68260j770k073k347k217j776j324j070j136j618k412l092l184k672k063
63788B39506j807j825j789j604j333q66j80K35j47r71j238o81j82m53r92r70n52
63771B24151n32j012j319j142r62j217j643j649r77J37J067J149L12n97o34J21
63755B15253O80M98O7OJ00k36r51j336q74K07J258J797J812J689J876K476L136
63738B27458L403L136K577K086J895K038K387K773L104L368L526L526L443L519
63724B68239L930M537M952M896M491M096L950L989M030L947L644K989K007R81
63710C20678J41o67j743l017m028m398m102l287k216j371j168j476j716j530r48
$$ y = [346079, 335456, 325815, 317468, 310358, 304053, 298058, 292321, 287265, 283141, 279599, 276157, 272884, 270225, 268260, 266490, 264417, 262070, 259853, 258077, 256753, 255683, 254547, 252929, 250517, 247425, 244241, 241569, 239506, 237699, 235874, 234085, 232481, 231148, 230282, 230102, 230337, 230190, 229219, 227981, 227300, 227118, 226665, 225673, 224703, 224151, 223619, 222607, 221288, 220146, 219184, 217967, 216324, 214675, 213698, 213835, 214902, 216051, 216363, 215766, 215132, 215253, 215933, 216431, 216498, 216504, 216604, 216368, 215417, 214081, 213207, 213414, 214672, 216469, 218281, 219970, 221846, 224322, 227458, 230861, 233997, 236574, 238660, 240555, 242593, 244980, 247753, 250857, 254225, 257751, 261277, 264720, 268239, 272169, 276706, 281658, 286554, 291045, 295141, 299091, 303080, 307110, 311057, 314701, 317690, 319697, 320678, 320819, 320152, 318409, 315392, 311364, 306966, 302864, 299577, 297361, 295990, 294822, 293346, 291630, 290100, 289152]
63695B89152LJ281K349K514K012J978K905L892L993L595L591L863L675L062K711
63680C30576K627K111J094L06mm46j216j503p54L56Q46P33P53J264K026K690K959
63663C44418K577J573L33q58k105l384m255m429m268m307m599m916n174n230m695
63648C00681l495k290j791j873j934j723j288m39Q70J899J785Q82N70J447K660
63633B95961L318L741M644N758O152N700N362N975P308Q527R076Q990Q680Q668
63619C87860R269J0349J1534J2750J4312J6305J8193J9417K0210K1363K3267K5621
63607E90450K8053L0518L2886L4576L4992L4033L1874K8537K4038J8735J3205
63596I01897P887L101q37l896o382q301r104q692q286r366j1884j4555j6848j9530
$$ y = [289152, 289155, 290436, 292785, 295299, 297311, 299289, 302194, 306086, 310079, 313674, 317265, 321128, 324803, 327865, 330576, 333203, 335314, 336408, 336714, 336710, 336264, 335048, 333545, 332791, 333147, 333993, 334726, 335479, 336743, 338769, 341459, 344418, 346995, 348568, 348901, 348043, 345938, 342554, 338299, 333870, 329602, 325295, 320696, 315780, 310606, 305376, 300681, 297186, 294896, 293105, 291232, 289298, 287575, 286287, 285848, 286718, 288617, 290402, 291284, 291854, 293301, 295961, 299279, 303020, 307664, 313422, 319574, 325274, 330636, 336611, 343919, 352446, 361522, 370512, 379192, 387860, 397129, 407478, 419012, 431762, 446074, 462379, 480572, 499989, 520199, 541562, 564829, 590450, 618503, 649021, 681907, 716483, 751475, 785508, 817382, 845919, 869957, 888692, 901897, 909784, 912885, 912048, 908152, 901770, 893469, 884365, 875673, 867387, 858021, 846137, 831582, 814734, 795204]
63582G95204k2858k5538k6321k5744k5219k5029k4260k2375j9767j6870j3718
63571E47505j0508p790n844m425l204j974m36J597L651M962N542O210P433Q737
63557E51456R646J0412J1394J2330J2942J3748J5514J8171K1044K3990K7552L1917
63545G60116L6423M0302M3204M4703M3998M0628L5144K8388K0514J1376J820o208
63533A100408j1229j3407j3925j3651j2803j1663j0890j1161j2789j5785j9944
63522I53161k4695k9197l2793l5354l7110l8202l8432l7431l5081l1833k8511
63511E84522k5651k3198k0949j9097j7887j6935j5409j3074j0613q745p439o398
63499C99127n755n775o100n982n214m260l454k637j732j088q89p74m42j99l61
$$ y = [795204, 772346, 746808, 720487, 694743, 669524, 644495, 620235, 597860, 578093, 561223, 547505, 536997, 529207, 523363, 518938, 515734, 513760, 513324, 514921, 518572, 523534, 529076, 535286, 542719, 551456, 561102, 571514, 582908, 595238, 608180, 621928, 637442, 655613, 676657, 700647, 728199, 760116, 796539, 836841, 880045, 924748, 968746, 1009374, 1044518, 1072906, 1093420, 1104796, 1106616, 1100408, 1089179, 1075772, 1061847, 1048196, 1035393, 1023730, 1012840, 1001679, 988890, 973105, 953161, 928466, 899269, 866476, 831122, 794012, 755810, 717378, 679947, 644866, 613033, 584522, 558871, 535673, 514724, 495627, 477740, 460805, 445396, 432322, 421709, 412964, 405525, 399127, 393372, 387597, 381497, 375515, 370301, 366041, 362587, 359950, 358218, 357130, 356241, 355467, 355025, 354826, 354465]
63484C54465m03N09K141L203L039K578L078M389N259N055M374L918L574K929J981
63469D00089R62p8j072j698j869k076k785l730m263m159l643k885k020j380j164
63454C68229r88l97L87Q63J180J862K747L081K814K906L997N599O944Q001R235
63439D16460J0886J2949J5316J7726K0044K2772K6483L0532L3194L3554L2382
63428F72298L0622K7962K3781J8610J3610R235N551L339L573O048R662J3980J9320
63415H57591K5373L0903L5034L7768L8995L8045L4660K9557K3543J6851R721K941
63403A180982k697o991j0006j1782j2645j3256j3994j4878j6335j9240k3682k8438
63391A007038l2306l5326l7953l9679l9530l7567l4888l2231k9466k6499k3698
$$ y = [354465, 354062, 354571, 356712, 359915, 362954, 365532, 368610, 372999, 378258, 383313, 387687, 391605, 395179, 398108, 400089, 401051, 400973, 399901, 398203, 396334, 394258, 391473, 387743, 383480, 379321, 375678, 372793, 370773, 369393, 368229, 367241, 366844, 367231, 368094, 369274, 371136, 373883, 376964, 379778, 382684, 386681, 392280, 399224, 407225, 416460, 427346, 440295, 455611, 473337, 493381, 516153, 542636, 573168, 606362, 639916, 672298, 702920, 730882, 754663, 773273, 786883, 796118, 801669, 805008, 808581, 814629, 824291, 838271, 857591, 882964, 913867, 948901, 986669, 1025664, 1063709, 1098369, 1127926, 1151469, 1168320, 1178041, 1180982, 1178285, 1171294, 1161288, 1149506, 1136861, 1123605, 1109611, 1094733, 1078398, 1059158, 1035476, 1007038, 974732, 939406, 901453, 861774, 822244, 784677, 749789, 717558, 688092, 661593, 637895]
63380F37895k1254j8828j6273j3921j1806r279n971k665m05R85K664N111P497
63367E53750Q990R957J1323J3277J5279J7096J9062K1400K3909K6469K9161L1804
63355G81477L4001L5931L8294M0962M2395M1151L7573L3141K8461K2833J5855
63344A152074Q466K098k653o209r221j1912j3908j4697j4477j4509j6149j9536
63332A039367k3614k7350l0422l2768l4205l4698l4422l3312l1050k7760k4138
63321G05628k0594j6789j2445q216n243m093m451n720p639j0384j4134j8392k1831
63308E55697k3219k2529k0725j8540j6067j3487j1351r801q357o933o201o410
63296C92077o607n891m741m168m080l589k664k220k581l012k969k829k946k922
$$ y = [637895, 616641, 597813, 581540, 567619, 555813, 546534, 540563, 537898, 537493, 538478, 541142, 546253, 553750, 562740, 572697, 584020, 597297, 612576, 629672, 648734, 670134, 694043, 720512, 749673, 781477, 815478, 851409, 889703, 930665, 973060, 1014211, 1051784, 1084925, 1113386, 1136219, 1152074, 1160540, 1162638, 1159985, 1153776, 1144555, 1132643, 1118735, 1104038, 1089561, 1075052, 1058903, 1039367, 1015753, 988403, 957981, 925213, 891008, 856310, 821888, 788576, 757526, 729766, 705628, 685034, 668245, 655800, 647584, 642341, 638248, 633797, 628077, 620438, 610054, 595920, 577528, 555697, 532478, 509949, 489224, 470684, 454617, 441130, 429779, 419978, 411621, 404688, 398487, 392077, 385470, 379579, 374838, 370670, 366590, 363001, 360337, 358117, 355536, 352524, 349555, 346726, 343780, 340858]
63282C40858k400j837j859k264k333j902j402j066o63o2N01Q34J074J304J240
63267C30023O99J26K31J075J932K184K040K063K401K819L248L740L980L561K813
63252C62935K743L788N101N574N157M813N330O662Q259R635J0647J1513J2536
63239D54693J3716J4774J5677J6841J8519K0290K1530K2152K2515K2806K2963
63228F66476K3085K3411K3895K4170K4072K3870K3899K4248K4806K5452K6052
63217I33436K6404K6207K5088K2862J9838J6620J3359R482M467j340p046j2177
63205A077200j6949k1605k5898k9274l1289l1881l1358l0164k8497k6238k3298
63194G80749j9887j6314j2769r456o476l527o3L808P213R690J1901J4527J7040
$$ y = [340858, 338458, 336621, 334762, 332498, 330165, 328263, 326861, 325795, 325132, 325070, 325571, 326405, 327479, 328783, 330023, 330722, 330848, 331079, 332154, 334086, 336270, 338310, 340373, 342774, 345593, 348841, 352581, 356561, 360122, 362935, 365678, 369466, 374567, 380141, 385298, 390111, 395441, 402103, 410362, 419997, 430644, 442157, 454693, 468409, 483183, 498860, 515701, 534220, 554510, 576040, 598192, 620707, 643513, 666476, 689561, 712972, 736867, 761037, 785109, 808979, 832878, 857126, 881932, 907384, 933436, 959840, 986047, 1011135, 1033997, 1053835, 1070455, 1083814, 1093296, 1097763, 1096423, 1089377, 1077200, 1060251, 1038646, 1012748, 983474, 952185, 920304, 888946, 858782, 830285, 804047, 780749, 760862, 744548, 731779, 722323, 715847, 712320, 712257, 716065, 723278, 732968, 744869, 759396, 776436]
63181G76436J8423J8780J9114J9789K0300K0561K1163K2019K2026K0698J9148
63170I98457J8576J8504J7441J4793J1222P365L158j535o429j1220j5914k0580
63158A033838k5043k9019l2303l4662l5858l5985l5569l5094l4374l2725k9890
63147F73316k6583k3840k1826j9772j7195j4700j3131j2320j1306r673p933o627
63135D88410n686m897m338l959l279j985m57O82J333J817K256K522K720L226M186
63120D82551N218N759N611N047M355L501K444J716K147L671M906M601L244K440
63106E37211K810L410L379L009K823K551J852J247J366J790J609Q97N85R70J305
63091E66814J007M19J33K26N16R77J448J416O09l67m92N63K104L232L779M301
$$ y = [776436, 794859, 813639, 832753, 852542, 872842, 893403, 914566, 936585, 958611, 979309, 998457, 1017033, 1035537, 1052978, 1067771, 1078993, 1086358, 1089516, 1087981, 1081552, 1070332, 1054418, 1033838, 1008795, 979776, 947473, 912811, 876953, 840968, 805399, 770305, 735931, 703206, 673316, 646733, 622893, 601067, 581295, 564100, 549400, 536269, 523949, 512643, 502970, 495037, 488410, 482724, 477827, 473489, 469530, 466251, 464266, 463809, 464491, 465824, 467641, 469897, 472419, 475139, 478365, 482551, 487769, 493528, 499139, 504186, 508541, 512042, 514486, 516202, 518349, 522020, 526926, 531527, 534771, 537211, 540021, 543431, 546810, 549819, 552642, 555193, 557045, 558292, 559658, 561448, 563057, 563954, 564539, 565509, 566814, 567821, 568240, 568373, 568599, 569115, 570092, 571540, 572956, 573565, 573198, 572706, 573269, 575373, 578605, 582384, 586685]
63075E86685N259O473P465Q109Q663R263R790J0295J1127J2439J3899J5176J6375
63062G21018J7655J8843J9870K1329K3987K7823L1953L5538L8428M0971M3588
63051A041003M6500M9567N2372N4697N6749N8635N9938O0228N9819N9451N9371
63040A658330N9279N9118N9183N9441N9400N8856N8158N7427N6051N3270M8825
63029B287338M2678L4606K4507J2869N51j1824k4005l5848m7136n7476o6206p2569
63017B087485p6180p7138p5714p2242o7369o1907n6166m9808m2579l4793k6853
63006A446736j8748j0446k392M903J1448J7500K2912K7252L0400L2625L4212L5448
62994A631850L6745L8192L9162L8948L7748L6487L5569L4445L2414K9255K4861
$$ y = [586685, 591944, 598417, 605882, 613991, 622654, 631917, 641707, 652002, 663129, 675568, 689467, 704643, 721018, 738673, 757516, 777386, 798715, 822702, 850525, 882478, 918016, 956444, 997415, 1041003, 1087503, 1137070, 1189442, 1244139, 1300888, 1359523, 1419461, 1479689, 1539508, 1598959, 1658330, 1717609, 1776727, 1835910, 1895351, 1954751, 2013607, 2071765, 2129192, 2185243, 2238513, 2287338, 2330016, 2364622, 2389129, 2401998, 2402549, 2390725, 2366720, 2330872, 2283736, 2226260, 2160054, 2087485, 2011305, 1934167, 1858453, 1786211, 1718842, 1656935, 1600769, 1550961, 1508382, 1473589, 1446736, 1427988, 1417542, 1415150, 1420053, 1431501, 1449001, 1471913, 1499165, 1529565, 1562190, 1596402, 1631850, 1668595, 1706787, 1745949, 1784897, 1822645, 1859132, 1894701, 1929146, 1961560, 1990815, 2015676]
62983B015676J8959J1638L668m257j2330k1187l0781m0168m8419n5365o1284o6205
62971A709945o9740p1561p1728p0483o7862o3807n8744n3709m9569m6136m2457
62960A044149l8033l3460k9735k7234k5561k4201k2969k1889k0935j9988j8977
62949G61167j7957j7073j6426j5983j5653j5399j5166j4764j4015j3058j2297
62938E93376j1936j1699j1088r863q227o706n867n906o354o355n462m035k771
62925D97107j952j354p65l20l06q10j520j883j524p07k34o78j803k860l335l264
62909D73792k906k480k168k085k194k386k637k853k740k176j658j833k487k570
62895D40619j517q6N81L45k5r6j62m22m92o1M37L53k69p18m93K29J013J663K189
$$ y = [2015676, 2034635, 2046273, 2049941, 2045684, 2033354, 2012167, 1981386, 1941218, 1892799, 1837434, 1776150, 1709945, 1640205, 1568644, 1496916, 1426433, 1358571, 1294764, 1236020, 1182311, 1132742, 1086606, 1044149, 1006116, 972656, 942921, 915687, 890126, 865925, 842956, 821067, 800132, 780144, 761167, 743210, 726137, 709711, 693728, 678075, 662676, 647510, 632746, 618731, 605673, 593376, 581440, 569741, 558653, 548790, 540563, 533857, 527990, 522084, 515730, 509375, 503913, 499878, 497107, 495155, 493801, 493036, 492716, 492410, 491600, 490080, 488197, 486673, 485966, 485732, 485054, 483251, 480391, 477056, 473792, 470886, 468406, 466238, 464153, 461959, 459573, 456936, 454083, 451343, 449167, 447509, 445676, 443189, 440619, 439102, 439016, 439597, 439942, 439917, 439821, 439659, 439237, 438745, 438684, 439121, 439474, 439205, 438487, 437994, 438223, 439236, 440899, 443088]
62876D43088K517K455J892R82J41j05M87J501J992J281l23j786k329k049j522
62861D48222j122r10r21j160j330j006k05M84O07M05M53Q84J228J044M31p5LO45
62843D47677J298J354P98K65K72N69N15m6o87j089j352j502j244n36Q1J10j83
62826D46300j37L94J057J710K575L535L952L476K685K500L124L914M172L778L107
62811D86142K719L090M309N782O560O248N568N670O835Q144Q593Q336Q441R582
62797E76019J1332J2834J3809J4580J5482J6645J8205K0315K2937K5907K9246
62786G77311L3066L7238M1514M5943N0726N5698O0570O5755P2195P9806Q6884
62775A406706R1746R4596R6759R8333R7614R3088Q5059P4915O3429N0419L5651
$$ y = [443088, 445605, 448060, 449952, 450934, 451075, 450970, 451457, 452958, 454950, 456231, 455908, 454122, 451793, 449744, 448222, 447100, 446190, 445269, 444109, 442779, 441773, 441568, 442052, 442659, 443064, 443517, 444401, 445629, 446673, 447104, 447029, 447032, 447677, 448975, 450329, 451127, 451392, 451664, 452233, 452748, 452702, 452015, 450926, 449574, 448072, 446828, 446292, 446373, 446483, 446300, 446163, 446557, 447614, 449324, 451899, 455434, 459386, 462862, 465547, 468047, 471171, 475085, 479257, 483035, 486142, 488861, 491951, 496260, 502042, 508602, 514850, 520418, 526088, 532923, 541067, 549660, 557996, 566437, 576019, 587351, 600185, 613994, 628574, 644056, 660701, 678906, 699221, 722158, 748065, 777311, 810377, 847615, 889129, 935072, 985798, 1041496, 1102066, 1167821, 1240016, 1319822, 1406706, 1498452, 1593048, 1689807, 1788140, 1885754, 1978842, 2063901, 2138816, 2202245, 2252664, 2288315]
62764B288315J9434K487j4315l0121m4404n7073o8130p7271q4060q8332r0291
62753A756239r0379q9274q7654q5595q2418p7544p1489o5587o0723n6608n2383
62742I36585m7596m2547l7985l4478l1881k9328k6036k2195j8762j6319j4433
62731F15025j2332r982q117p300p162o705n290l242j432l29L88J271K413L550
62717E60756M618N823P213Q577R852J1306J3180J5427J7854K0331K2786K5257
62705G22980K8080L1709L6189M1007M5657N0177N4933O0084O5406P0530P5118
62694A281870P8870Q1519Q2744Q2179P9613P5252O9511O2436N3570M2481K9220
62683B019265J4279j575j7265l1692m4366n5519o5257p3007p8151q0983q2376
$$ y = [2288315, 2307749, 2310236, 2295921, 2265800, 2221396, 2164323, 2096193, 2018922, 1934862, 1846530, 1756239, 1665860, 1576586, 1488932, 1403337, 1320919, 1243375, 1171886, 1106299, 1045576, 988968, 936585, 888989, 846442, 808457, 773979, 742098, 712770, 686734, 664539, 645777, 629458, 615025, 602693, 592711, 584594, 577294, 570132, 563427, 558137, 554895, 553463, 553134, 553522, 554793, 557206, 560756, 565374, 571197, 578410, 586987, 596839, 608145, 621325, 636752, 654606, 674937, 697723, 722980, 751060, 782769, 818958, 859965, 905622, 955799, 1010732, 1070816, 1136222, 1206752, 1281870, 1360740, 1442259, 1525003, 1607182, 1686795, 1762047, 1831558, 1893994, 1947564, 1990045, 2019265, 2033544, 2031969, 2014704, 1983012, 1938646, 1883127, 1817870, 1744863, 1666712, 1585729, 1503353]
62672A503353q2679q1514p8715p4843p0524o5749o0304n4594m9526m5515m1978
62661G97412l8095l3877l0167k7533k5498k3115k0142j7232j5067j3687j2718
62650E40281j1888j1067j0193r381q859q571q126p381o713o396o073n264m098
62637D36271l035k034o94Q59J925K126J852J576J227N46l05q83j016r46r73j115
62621D35381j122p56o5O41J146J590K257L138L920M349M500M718N443O880Q704
62606D80724J0233J1094J1577J2175J3065J4335J6307J9126K2293K5175K7843
62595F63947L0791L3992L6956L9625M2367M4995M6624M6833M6022M4285M0742
62584A117179L4823K7471K0137J2961M938m155j3034k0363k6231l1647l6949m1303
$$ y = [1503353, 1420674, 1339160, 1260445, 1185602, 1115078, 1049329, 989025, 934431, 884905, 839390, 797412, 759317, 725440, 695273, 667740, 642242, 619127, 598985, 581753, 566686, 552999, 540281, 528393, 517326, 507133, 497752, 488893, 480322, 472196, 464815, 458102, 451706, 445633, 440369, 436271, 433236, 431202, 430508, 431367, 433292, 435418, 437270, 438846, 440073, 440619, 440314, 439431, 438415, 437469, 436496, 435381, 434259, 433503, 433438, 434079, 435225, 436815, 439072, 442210, 446130, 450479, 454979, 459697, 465140, 472020, 480724, 490957, 502051, 513628, 525803, 538868, 553203, 569510, 588636, 610929, 636104, 663947, 694738, 728730, 765686, 805311, 847678, 892673, 939297, 986130, 1032152, 1076437, 1117179, 1152002, 1179473, 1199610, 1212571, 1217509, 1213354, 1200320, 1179957, 1153726, 1122079, 1085130, 1043827]
62572A043827m3736m4241m3655m2683m1337l9374l6869l4148l1375k8598k6010
62561F31801k3722k1436j8844j6253j4292j2936j1493r696q133p277o722n898
62549D75099m978m524m539m409l653k342r79j68j23k89J78J285K093K004J597
62534D56252J645K013K152K119K309K612K842L588N518P956R367R400R493J1072
62520E28338J4067J7517K0817K3842K6545K9062L1881L5345L9184M2775M5552
62509H54925M7110M7323M6606M5557M4064M1216L6384K9972K2805J5296P607J37
62497A239002o710j2927j8585k3309k6576k8270k8637k7811k5823k2851j9090
62486I98413j4532r275l833J320O294J1450J6684K1563K5955K9954L3179L4782
$$ y = [1043827, 1000091, 955850, 912195, 869512, 828175, 788801, 751932, 717784, 686409, 657811, 631801, 608079, 586643, 567799, 551546, 537254, 524318, 512825, 503129, 494996, 487719, 480997, 475099, 470121, 465597, 461058, 456649, 452996, 450654, 449675, 449507, 449384, 449095, 449273, 450558, 452651, 454655, 456252, 457897, 459910, 462062, 464181, 466490, 469102, 471944, 475532, 481050, 489006, 498373, 507773, 517266, 528338, 542405, 559922, 580739, 604581, 631126, 660188, 692069, 727414, 766598, 809373, 854925, 902035, 949358, 995964, 1041521, 1085585, 1126801, 1163185, 1193157, 1215962, 1231258, 1238865, 1239002, 1232292, 1219365, 1200780, 1177471, 1150895, 1122625, 1093988, 1066177, 1040354, 1017503, 998413, 983881, 974606, 970773, 972093, 978387, 989837, 1006521, 1028084, 1054039, 1083993, 1117172, 1151954]
62474A151954L4371L2447K9731K6436K2288J6865R776J038q415j6990k3698k8977
62462A246826l4060l9635m5360n0309n3554n4507n3273n0723m7810m4726m1008
62451G31861l6491l1727k7368k3518j9977j6774j4106j1866r663p333n153l458
62439E24427k233j215k62N09Q85Q63P17P20P99N87p4r69k000l484n571p560q409
62422D97730q010p363p293p526p342o704o145n891n649n216m762m478m292l987
62408D13072l385k421j322o12o28j092j416j393j255j085o40J72J047J645J902
62393D02589J917J789J731J981K463K821K938L059L239L072K336J617J779K882
62379D36213M109M832N339O220P382Q070P957P762Q465J0077J1644J2500J3073
$$ y = [1151954, 1186325, 1218772, 1248503, 1274939, 1297227, 1314092, 1323868, 1324906, 1316491, 1299501, 1275803, 1246826, 1212766, 1173131, 1127771, 1077462, 1023908, 969401, 916128, 865405, 817595, 772869, 731861, 695370, 663643, 636275, 612757, 592780, 576006, 561900, 550034, 540371, 533038, 527885, 524427, 522194, 520979, 520717, 521226, 522111, 522974, 523691, 524411, 525210, 525797, 525723, 524754, 522754, 519270, 513699, 506139, 497730, 489720, 482357, 475064, 467538, 460196, 453492, 447347, 441456, 435807, 430591, 425829, 421351, 417059, 413072, 409687, 407266, 405944, 405332, 404704, 403612, 402196, 400803, 399548, 398463, 397823, 397995, 399042, 400687, 402589, 404506, 406295, 408026, 410007, 412470, 415291, 418229, 421288, 424527, 427599, 429935, 431552, 433331, 436213, 440322, 445154, 450493, 456713, 464095, 472165, 480122, 487884, 496349, 506426, 518070, 530570, 543643]
62366E43643J4113J5601J6990J8319K0378K3613K7502L1358L5236L9631M4474
62355H30858M9000N2631N5611N8517O1227O2594O1247N6777M9998M2028L3348
62344A413836K3992J4390N464k285r297j6315k3445l0120l5782m0303m3828m6421
62332A209886m7895m7968m6633m4323m1540l8324l4449l0175k6378k3775k2247
62321H06179k1230k0373j9654j9104j8801j8870j9156j9095j8354j7395j6930
62310E97217j6955j6715j5667j3998j2188j0525r163q197p440o440n049l719k983
62297D68178k788k662k356j984j602j014j79O23J141J502J896K204K265K394L047
62282D70665M037M529M173L682L970M994N971O411O409O223O133O626P985R645
$$ y = [543643, 557756, 573357, 590347, 608666, 629044, 652657, 680159, 711517, 746753, 786384, 830858, 879858, 932489, 988100, 1046617, 1107844, 1170438, 1231685, 1288462, 1338460, 1380488, 1413836, 1437828, 1452218, 1457682, 1455397, 1446100, 1429785, 1406340, 1376220, 1340438, 1300135, 1256307, 1209886, 1161991, 1114023, 1067390, 1023067, 981527, 943203, 908754, 878579, 852201, 828426, 806179, 784949, 764576, 744922, 725818, 707017, 688147, 668991, 649896, 631542, 614147, 597217, 580262, 563547, 547880, 533882, 521694, 511169, 502006, 493809, 486369, 479929, 474880, 471161, 468178, 465390, 462728, 460372, 458388, 456786, 455772, 455593, 456216, 457357, 458859, 460755, 462959, 465224, 467618, 470665, 474702, 479231, 483404, 487086, 491056, 496050, 502021, 508432, 514841, 521064, 527197, 533823, 541808, 551453]
62268E51453J0637J0834J1170J2414J4402J6671J9188K2036K5047K8246L2119
62257G54217L6910M2067M6940N1545N6090O0178O3118O4585O4350O1831N6788
62246A358619N0064M2713L4572K4786J3603K534p390j6443k5072l3020m0075m6657
62234A358234n2933n8088o1201o2240o1607n9338n5584n1337m7676m4522m0942
62223G62766l6602l2124k8099k4540k1407j8917j7055j5340j3382j1318r459p856
62211E26667o451n351m709m438m255l873l079j749L4J896L268L727L470L434M578
62196E13169O901R406J1251J2521J3562J4155J3992J3604J3924J4943J5666J5480
62184F68574J4810J4170J3379J2068J0315Q342O199M195K940K467J935Q70J01
$$ y = [551453, 562090, 572924, 584094, 596508, 610910, 627581, 646769, 668805, 693852, 722098, 754217, 791127, 833194, 880134, 931679, 987769, 1047947, 1111065, 1175650, 1240000, 1301831, 1358619, 1408683, 1451396, 1485968, 1510754, 1524357, 1526891, 1519501, 1503058, 1477986, 1444966, 1404891, 1358234, 1305301, 1247213, 1186012, 1123772, 1062165, 1002827, 947243, 895906, 848230, 803708, 762766, 726164, 694040, 665941, 641401, 619994, 601077, 584022, 568682, 555300, 543982, 534523, 526667, 520216, 514865, 510156, 505718, 501463, 497590, 494511, 492762, 492796, 494692, 497960, 501687, 505157, 508591, 513169, 520070, 529476, 540727, 553248, 566810, 580965, 594957, 608561, 622485, 637428, 653094, 668574, 683384, 697554, 710933, 723001, 733316, 741658, 747857, 752052, 754992, 757459, 759394, 760264, 760365]
62171G60365P35K728N364Q609J2887J7765K2225K6232L0738L5821M0081M2452
62159A006002M3476M3902M3018L9596L3893K7499K1355J5028P982N16o783j3709
62147A261775k0058k5254k8935l1577l4008l6442l8343l9125l8662l7087l4530
62136H97754l1209k7544k3882k0190j6302j2545r638p719n883l293n25J012J009
62123G41045Q06J708L577N631P726R958J1584J1546R931P881O044M074J716n10
62109H22717k084l109l784m024l981m309n319o450p047p207p343p365o914o046
62095G47735n017l640j480J322L954N688O474O854P527Q789J0163J0829J0625
62082H09823J0307J0512J1018J1423J2133J3811J6255J8550K0295K1787K3099
$$ y = [760365, 761100, 763828, 769192, 777801, 790688, 808453, 830678, 856910, 887648, 923469, 963550, 1006002, 1049478, 1093380, 1136398, 1175994, 1209887, 1237386, 1258741, 1273769, 1281751, 1282267, 1275484, 1261775, 1241717, 1216463, 1187528, 1155951, 1121943, 1085501, 1047158, 1008033, 969371, 932284, 897754, 866545, 839001, 815119, 794929, 778627, 766082, 756444, 748725, 742842, 739549, 739024, 740036, 741045, 741851, 743559, 747136, 752767, 760493, 770451, 782035, 793581, 803512, 811393, 817437, 821511, 823227, 822717, 820633, 817524, 813740, 809716, 805735, 801426, 796107, 789657, 782610, 775403, 768060, 760695, 753781, 747735, 742718, 739078, 737598, 738920, 742874, 748562, 755036, 761890, 769417, 778206, 788369, 799198, 809823, 820130, 830642, 841660, 853083, 865216, 879027, 895282, 913832, 934127, 955914, 979013]
62071I79013K3751K3546K2966K2529K2358K2623K3690K5500K7355K8754K9946
62060A252031L1241L2226L2207L1065K9121K6454K2839J8237J2832O773L05n915
62048A489416j1307j6088k1032k6379l1501l5794l9383m2688m5647m7775m8718
62037A123104m8485m7265m5344m3014m0386l7384l4210l1429k9289k7160k4255
62026G14883k0798j7858j5921j4341j2509j0895j0352j0783j1187j0870j0014
62015E69355r147q586q405q395q045p039n812n061m672l772k064m03L41M70R69
62000D99734K153L434M141M160L779L350L026K623J803N85n71j401k212l290m358
61985E16956m992n325n783o426p074p808q652r010q206o637n490n192m963m154
$$ y = [979013, 1002764, 1026310, 1049276, 1071805, 1094163, 1116786, 1140476, 1165976, 1193331, 1222085, 1252031, 1283272, 1315498, 1347705, 1378770, 1407891, 1434345, 1457184, 1475421, 1488253, 1495026, 1495331, 1489416, 1478109, 1462021, 1440989, 1414610, 1383109, 1347315, 1307932, 1265244, 1219597, 1171822, 1123104, 1074619, 1027354, 982010, 938996, 898610, 861226, 827016, 795587, 766298, 739138, 714883, 694085, 676227, 660306, 645965, 633456, 622561, 612209, 601426, 590239, 579369, 569355, 560208, 551622, 543217, 534822, 526777, 519738, 513926, 508865, 504193, 500421, 498357, 497954, 498295, 498765, 499734, 501887, 505321, 509462, 513622, 517401, 520751, 523777, 526400, 528203, 528788, 528217, 526816, 524604, 521314, 516956, 511964, 506639, 500856, 494430, 487356, 479548, 470896, 461886, 453680, 447043, 441553, 436361, 431398, 427244]
61971D27244l233k891k901k577j873j259p85p4P88J134P54L73P46J633K178K091
61955D21348J947K279K869L153L045L015L396L995M463M721M917N237N958P376
61941D77719R354J1131J2014J2270J2919J4534J6541J7859J7995J7330J6540J5956
61929F52162J5508J5006J4273J3096J1267Q872O416M397K800J182p01k674m481
61916G37123n960o736o312m780k988j567j25K011M619O827Q378R888J1731J3365
61902G65474J4013J3546J2345J0694Q548N723K074k266o711j0452j2997j4391
61890G85600j4988j5237j5518j5829j5717j4899j3815j3112j2724j2043j1005
61879F30713j0255j0178j0431j0704j1206j1984j2455j2116j1203j0083q556o400
$$ y = [427244, 424011, 421120, 418219, 415642, 413769, 412510, 411725, 411651, 412439, 413573, 414327, 414700, 415446, 417079, 419257, 421348, 423295, 425574, 428443, 431596, 434641, 437656, 441052, 445047, 449510, 454231, 459148, 464385, 470343, 477719, 487073, 498204, 510218, 522488, 535407, 549941, 566482, 584341, 602336, 619666, 636206, 652162, 667670, 682676, 696949, 710045, 721312, 730184, 736600, 740997, 743797, 744979, 744278, 741604, 737123, 731163, 724427, 718115, 713335, 710347, 708780, 708655, 710666, 715285, 722112, 730490, 740378, 752109, 765474, 779487, 793033, 805378, 816072, 824620, 830343, 832417, 830151, 823440, 812988, 799991, 785600, 770612, 755375, 739857, 724028, 708311, 693412, 679597, 666485, 653761, 641718, 630713, 620458, 610280, 599849, 589145, 577939, 565955, 553500, 541384, 530181, 520098, 511542, 505142]
61867E05142m204k836k240j531k41J193K288L208M372N821P281Q658J0214J2293
61853E49418J4948J7797K0260K2092K3585K5151K6794K8159K9004K9324K9068
61842H15600K7967K5815K2729J9100J5286J1370P177K607k029o036q796j0142
61830I20648j0281r496p948n697k802N68M142P715J1175J4136J5798J5535J3596
61817I67089J0791P458L223k094p839j3102j7483k0991k3632k5530k7134k8710
61805H22046k9824k9771k8438k6364k4056k1698j9429j7402j5585j3860j2468
61794E83151j1884j2072j2153j1184r177p144o023n765n622n231n087n678o537
61781D79594o585n426l785k611k180k193k229j921j151l97l72j042j492j104l99
$$ y = [505142, 500938, 498102, 495862, 494331, 494090, 495283, 497571, 500779, 505151, 510972, 518253, 526911, 537125, 549418, 564366, 582163, 602423, 624515, 648100, 673251, 700045, 728204, 757208, 786532, 815600, 843567, 869382, 892111, 911211, 926497, 937867, 945044, 947651, 945622, 939586, 930790, 920648, 910367, 900871, 892923, 887226, 884424, 884992, 889134, 896849, 908024, 922160, 937958, 953493, 967089, 977880, 985338, 988561, 986467, 978628, 965526, 948043, 927052, 903420, 877890, 850756, 822046, 792222, 762451, 734013, 707649, 683593, 661895, 642466, 625064, 609479, 595619, 583151, 571267, 559195, 547042, 535858, 526681, 519537, 513514, 507749, 502127, 496896, 491809, 486131, 479594, 473009, 467583, 463798, 461187, 459007, 456814, 454585, 452664, 451513, 451116, 450744, 449702, 448210, 447106, 446707]
61766D46707j76l03mR88K140K830K787K168J632K021L335M371M068K905K166K099
61750D79734J850J075N04N63N76j89j488k592l217l387k954j922q87o22j267k232
61734D63545k698k114o04Q92J361R09P03J438K404K611K273K416L288M013L835
61719D84272L054K478K524L006L547L829L671L021J944N82p68j720k088k101k217
61704E03034k703l412l872l591k541j427j212k108l260l701l408l092l169l400
61690D62138l474l400l184k654j824j135r57j075r98p27p70j358j976j928j258
61675D35420p39r12j371j277m32M50O27J90j87j84j60n29j113j360j067o01l48
61658D26407k61j08J8j52m41j96Q64K063K450J927J307J246J558J700J558J429
$$ y = [446707, 446531, 446228, 446224, 447212, 449352, 452182, 454969, 457137, 458769, 460790, 464125, 468496, 472564, 475469, 477635, 479734, 481584, 482659, 483163, 483726, 484302, 484113, 482625, 480033, 476816, 473429, 470475, 468553, 467666, 467044, 465777, 463545, 460847, 458733, 458129, 459021, 460382, 461291, 461994, 463432, 465836, 468447, 470720, 473136, 476424, 480437, 484272, 487326, 489804, 492328, 495334, 498881, 502710, 506381, 509402, 511346, 511928, 511160, 509440, 507352, 505251, 503034, 500331, 496919, 493047, 489456, 486915, 485488, 484276, 482168, 478908, 475207, 471799, 468707, 465538, 462138, 458664, 455264, 452080, 449426, 447602, 446467, 445510, 444435, 443437, 442710, 441940, 440582, 438606, 436678, 435420, 434681, 433769, 432398, 431121, 430689, 431139, 431766, 431956, 431769, 431585, 431425, 430896, 429783, 428423, 427356, 426755, 426407, 426146, 426038, 426056, 425904, 425463, 425267, 426131, 428194, 430644, 432571, 433878, 435124, 436682, 438382, 439940, 441369]
61642D41369J477J539J479J457J761K388K893K720J765N32m11j064j815k695l217
61627D50178l116k835k950l329l307k626j787j396j485j642j596j475j550j875
61613D19209k196k208j964j912k353k948l045k616k496l389m840n668n393m768
61599C73413m667m927m734l893l148l152l658l936l641k995k381k033j954j856
61585C26438j363n54j43o90j805k493k299j668j198j013j048j381j954k294j995
61570C04540j326r51j065j200r44m92k86l83m94n50p95j192j185m23N41Q40N05
61553B95140M60J107J634J232L71J46O89J148J051P50N24K26O7O88J937K545J768
61536C11483O39O17J596K230J924J361J143J028O65J70l98j281k366k946k632
$$ y = [441369, 442846, 444385, 445864, 447321, 449082, 451470, 454363, 457083, 458848, 459380, 458969, 457905, 456090, 453395, 450178, 447062, 444227, 441277, 437948, 434641, 432015, 430228, 428832, 427347, 425705, 424109, 422634, 421084, 419209, 417013, 414805, 412841, 410929, 408576, 405628, 402583, 399967, 397471, 394082, 389242, 383574, 378181, 373413, 368746, 363819, 359085, 355192, 352044, 348892, 345234, 341298, 337657, 334662, 332281, 330248, 328294, 326438, 325075, 324521, 324378, 323688, 321883, 319390, 317091, 315423, 314225, 313212, 312164, 310783, 308829, 306535, 304540, 303214, 302263, 301198, 299998, 299054, 298562, 298276, 297893, 297399, 296849, 296054, 294862, 293677, 293254, 293795, 294635, 295140, 295600, 296707, 298341, 299573, 299944, 300090, 300779, 301927, 302978, 303728, 304252, 304478, 304545, 305233, 307170, 309715, 311483, 312122, 312739, 314335, 316565, 318489, 319850, 320993, 322021, 322686, 322856, 322458, 321177, 318811, 315865, 313233]
61521C13233j943j500j214p75m42p04j397j782j414m41P36J605J554M16j045j716
61505C03171j322n88k50l60n88o98n38n2M97O57L53o0l63o42p70l52M76Q46K78
61486B99695n13n74n5K03J17M39J382K108J883J068N24N95J017J405J445J014
61470C11753M59M33J064J644J493Q56M47M32L72M6k71l44l74o69j230j716j693
61453C12702r36K67J207J365R72P14R28J325J464J239Q49N29M24N92J005J550
61437C26196K049K279K112J729J500J633J951K136K019J626J179J021J234J354
61423C50018R56N08J010K443L456L102K152J834J942J329l0q10k19R85J630J381
61407C71687N83l03p78n75k37n94j443j622q34l08j012k115k196j238l72j51k06
$$ y = [313233, 311290, 309790, 308576, 307801, 307359, 306655, 305258, 303476, 302062, 301621, 302357, 303962, 305516, 305932, 304887, 303171, 301849, 301261, 301011, 300651, 300063, 299365, 298827, 298775, 299272, 299929, 300282, 300222, 299859, 299217, 298447, 298095, 298571, 299417, 299695, 299182, 298608, 298553, 298756, 298873, 299312, 300694, 302802, 304685, 305753, 306277, 306872, 307889, 309294, 310739, 311753, 312212, 312645, 313709, 315353, 316846, 317702, 318149, 318581, 318953, 318999, 318728, 318384, 318010, 317341, 316111, 314395, 312702, 311766, 312033, 313240, 314605, 315577, 316291, 317219, 318544, 320008, 321247, 322096, 322625, 323049, 323641, 324646, 326196, 328245, 330524, 332636, 334365, 335865, 337498, 339449, 341585, 343604, 345230, 346409, 347430, 348664, 350018, 350974, 351482, 352492, 354935, 358391, 361493, 363645, 365479, 367421, 368750, 368720, 367910, 367691, 368676, 370306, 371687, 372270, 371967, 371189, 370614, 370377, 369783, 368340, 366718, 365884, 365576, 364564, 362449, 360253, 359015, 358643, 358492, 358286]
61390C58286k37l13k58K22Q10Q72N03L98O90P94N64O08J126J406R75M10L90N86
61372C67832K87l51n14R5R88J726K261K488K135J347P58P18R09J011J321K195
61356C85206L216L510K957K492K984M201N286N929O531P339P929P812P135O454
61342D58981O025N645N087M314L363K317J547J560K437L495L821L156K098J455
61328E05301J400J378P91l32j400j895j846j659j581j509j291j031r53r10k21
61313D94242J657M250O204O618O078N935O689P628Q114Q501R384J0489J0992J0710
61299E97491J0203R731Q824P099M946K947J027j299m009o381p754q127p993p817
61285E98888p802p907p939p700p163o487n808n115m353l521k633j688q61m54m32
$$ y = [358286, 358049, 357736, 357478, 357700, 358510, 359382, 359885, 360283, 360973, 361767, 362331, 362939, 364065, 365471, 366446, 366856, 367246, 367832, 368119, 367768, 367254, 367349, 368337, 370063, 372324, 374812, 376947, 378294, 379052, 379770, 380679, 381690, 383011, 385206, 388422, 391932, 394889, 397381, 400365, 404566, 409852, 415781, 422312, 429651, 437580, 445392, 452527, 458981, 465006, 470651, 475738, 480052, 483415, 485732, 487279, 488839, 491276, 494771, 498592, 501748, 503846, 505301, 506701, 508079, 508870, 508538, 507138, 505243, 503397, 501738, 500157, 498648, 497357, 496326, 495373, 494463, 494242, 495899, 500149, 506353, 512971, 519049, 524984, 531673, 539301, 547415, 555916, 565300, 575789, 586781, 597491, 607694, 617425, 626249, 633348, 638294, 641241, 642268, 640969, 636960, 630579, 622825, 614698, 606705, 598888, 591086, 583179, 575240, 567540, 560377, 553890, 548082, 542967, 538614, 535093, 532460, 530772, 529911, 529457, 529025]
61270E29025j90Q37K285L071K684J871J731K388L082L343L512M007M697N250N790
61255E73383O673P790Q451Q064O754N248M246L878L735L342K636J869J164L09
61241F37542q47k028k790l084l261l504l521l036k345k051k217k195j436j83R86
61226F06030K050L433N108O368O731O554O427O359O067N707N727O065O070N435
61212F84131M668M439M723M849M302L269K375J975J784J330O63L38O19J146J631
61197G22242K439M029O158Q207J0045J1883J3447J4017J3410J2247J1039R687
61185H38850Q052O485N355M500L458K058M79r76j996k416k489k747l518m662n846
61170H44587o780p247p235p070p045p065p028p363q544j0120j1059j1138j1157
$$ y = [529025, 528835, 529672, 531957, 535028, 537712, 539583, 541314, 543702, 546784, 550127, 553639, 557646, 562343, 567593, 573383, 580056, 587846, 596297, 604361, 611115, 616363, 620609, 624487, 628222, 631564, 634200, 636069, 637233, 637542, 636695, 634667, 631877, 628793, 625532, 622028, 618507, 615471, 613126, 611075, 608858, 606663, 605227, 605044, 606030, 608080, 611513, 616621, 622989, 629720, 636274, 642701, 649060, 655127, 660834, 666561, 672626, 678696, 684131, 688799, 693238, 697961, 702810, 707112, 710381, 712756, 714731, 716515, 717845, 718508, 718846, 719465, 720611, 722242, 724681, 728710, 734868, 743075, 753120, 765003, 778450, 792467, 805877, 818124, 829163, 838850, 846902, 853387, 858742, 863242, 866700, 868758, 869237, 868261, 866265, 863849, 861360, 858613, 855095, 850433, 844587, 837807, 830560, 823325, 816255, 809210, 802145, 795117, 787754, 779210, 769090, 758031, 746893, 735736]
61157G35736j1598j1934j1632j0966j0302r419q178p141o684o089m421k059m74
61144F34839n33j697k910l739m541n781p282q155p711o374n252m729m167l090
61130E68878j813o14Q13K485L657M054M746O812R741J2198J3842J5291J6680J7620
61116F74390J8317J9523K1294K2833K3719K4245K4526K4323K3882K3893K4279
61105I25224K3999K2557K0862J9929J9417J8058J5230J1521P928M804J592k487
61093A088634p349j1767j4546j5837j6819j8221j9738k0948k2004k3097k3808
61082H94500k3538k2322k0864j9797j9085j8263j7141j6140j5595j4911j3039
61071F93805j0055p506o670o967o834n642l986k449j084M0P66J350K284L588M783
$$ y = [735736, 724138, 712204, 700572, 689606, 679304, 669885, 661707, 654566, 647882, 641793, 637372, 635313, 634839, 634306, 632609, 629699, 625960, 621419, 615638, 608356, 600201, 592490, 586116, 580864, 576135, 571968, 568878, 567065, 566451, 567264, 569749, 573406, 577460, 582206, 589018, 598759, 610957, 624799, 640090, 656770, 674390, 692707, 712230, 733524, 756357, 780076, 804321, 828847, 853170, 877052, 900945, 925224, 949223, 971780, 992642, 1012571, 1031988, 1050046, 1065276, 1076797, 1084725, 1089529, 1091121, 1088634, 1081285, 1069518, 1054972, 1039135, 1022316, 1004095, 984357, 963409, 941405, 918308, 894500, 870962, 848640, 827776, 807979, 788894, 770631, 753490, 737350, 721755, 706844, 693805, 683750, 676244, 669574, 662607, 655773, 650131, 646145, 643696, 642612, 642652, 643418, 644768, 647052, 650640, 655423]
61056F55423N606O156O461O596O973P920R185J0485J2172J4489J6641J7686J8058
61043G93851J9041K0904K2784K4335K6102K8225L0092L1598L3474L5982L8427
61032A104815M0392M2388M4849M7405M9530N1088N2087N2738N3763N5636N7721
61021A652412N9468O2200O7965P6527Q5415R3316J01486J11498J23790J39169
61011B573246J59524J85996K18677K58997L09947L73010M48152N38500O51345
61002E717394P92542R64429J170724J411832J661467J852946J910888J810263
60994A7292485J595641J331132J040880P17738L86958J29887J8869L5296P5250
60985B2624136M1485q5557k72146n01311p90121j138810j489452j753068j872322
$$ y = [655423, 661029, 667185, 673646, 680242, 687215, 695135, 704320, 714805, 726977, 741466, 758107, 775793, 793851, 812892, 833796, 856580, 880915, 907017, 935242, 965334, 996932, 1030406, 1066388, 1104815, 1145207, 1187595, 1232444, 1279849, 1329379, 1380467, 1432554, 1485292, 1539055, 1594691, 1652412, 1711880, 1774080, 1842045, 1918572, 2003987, 2097303, 2198789, 2310287, 2434077, 2573246, 2732770, 2918766, 3137443, 3396440, 3706387, 4079397, 4527549, 5066049, 5717394, 6509936, 7474365, 8645089, 10056921, 11718388, 13571334, 15482222, 17292485, 18888126, 20219258, 21260138, 21977876, 22364834, 22494721, 22513590, 22548886, 22624136, 22665621, 22580064, 22307918, 21806607, 21016486, 19877676, 18388224, 16635156, 14762834]
60976A4762834j850182j727241j547302j343805j141445r56403p95072o57608
60968D743776n43042m49913l74760l13445k63637k24342j93867j69789j50290
60959B060691j34081j19645j05908r3222q2557p3847o5944n8036n0450m4121l9631
60948A193249l6675l4259l1670k9161k7384k6294k5273k4139k3142k2066k0289
60937H92897j7922j5867j4626j3895j3468j3502j3700j3359j2487j1866j1707
60926G40498j1375j0720j0400j0464r993q761p905q109q388p668o428n647n171
60913F29469m334l321k620j937q64L0J91M39J930M130N411N518N903P478R389
60898F56812J0423J0539J0466J0623J0928J1180J1244J1157J1192J1490J1715
$$ y = [14762834, 12912652, 11185411, 9638109, 8294304, 7152859, 6196456, 5401384, 4743776, 4200734, 3750821, 3376061, 3062616, 2798979, 2574637, 2380770, 2210981, 2060691, 1926610, 1806965, 1701057, 1607835, 1525278, 1451431, 1385487, 1327451, 1277001, 1232880, 1193249, 1156574, 1122315, 1090645, 1061484, 1034100, 1007806, 982533, 958394, 935252, 913186, 892897, 874975, 859108, 844482, 830587, 817119, 803617, 789917, 776558, 764071, 752205, 740498, 729123, 718403, 708003, 697539, 687546, 678785, 670880, 662771, 654383, 646715, 640287, 634640, 629469, 625135, 621814, 619194, 617257, 616393, 616423, 616614, 617053, 618983, 623113, 628524, 634042, 639945, 647423, 656812, 667235, 677774, 688240, 698863, 709791, 720971, 732215, 743372, 754564, 766054, 777769]
60887G77769J1497J1062J0939J1220J1607J2068J2784J3565J3978J3955J3664
60876I14108J2897J1390R682Q764Q740Q587P551N968M420K856J074n95j804k960
60862I90678m698o785q267q812r284j0605j2514j3924j4383j4611j5437j6664
60850H54694j7411j7337j6921j6619j6307j5725j4966j4261j3715j3431j3532
60839F84469j3822j3837j3536j3418j3673j3801j3414j2908j2701j2422j1541
60828E39396j0393r675r279q493p212o048n295m622l852l268k925k460j814j489
60814D62571j781k307k498k182j450n30J37J74j84l27j59j44l53k64K40M71K3
60797D51437m48j78N59R27P09L38P1r0J0L86M23m77j832k499k213j871k068k251
$$ y = [777769, 789266, 800328, 811267, 822487, 834094, 846162, 858946, 872511, 886489, 900444, 914108, 927005, 938395, 948077, 956841, 965581, 974168, 981719, 987687, 992107, 994963, 996037, 995442, 993638, 990678, 985980, 979195, 970928, 962116, 952832, 942227, 929713, 915789, 901406, 886795, 871358, 854694, 837283, 819946, 803025, 786406, 770099, 754374, 739408, 725147, 711432, 698001, 684469, 670647, 656810, 643274, 629856, 616183, 602382, 588968, 576060, 563359, 550937, 539396, 529003, 519328, 510049, 501556, 494344, 488296, 483001, 478379, 474527, 471259, 468334, 465874, 464060, 462571, 460790, 458483, 455985, 453803, 452353, 451823, 451960, 452134, 451950, 451623, 451464, 451320, 450967, 450703, 450943, 451414, 451437, 450989, 450811, 451370, 452297, 453006, 453344, 453415, 453325, 453335, 453721, 454144, 453667, 451835, 449336, 447123, 445252, 443184, 440933]
60779D40933j805j225j402k218k701k478k303k992m388n564n716m700l080j825
60765C98536j555j893j851j099l63l72q40j080j085j270j478j168n64m98q74m68
60749C82078J182K712K647J492R41J516K169K136J865J865J738R65j12q10j116
60734D01268j568k377l124l245k594j577r25j057j643j937j683j321j302j609
60720C75306k052k572l008l042k667k373k547l016l428l678l679l182k281j659
60706C36122j793k209k073j316o48o14j110j728k061j778r19k8M04N14O86Q39
60690C22288O79M16N66J036J204R54Q93J394K097K635L126L656L909L827L933
60675C52613M519M998M749M134L987M332M382L679K667K015J931K164K291J964
$$ y = [440933, 439128, 437903, 436501, 434283, 431582, 429104, 426801, 423809, 419421, 413857, 408141, 403441, 400361, 398536, 396981, 395088, 393237, 392138, 391775, 391403, 390563, 389483, 388398, 387128, 385650, 384482, 383918, 383420, 382546, 382078, 383260, 385972, 388619, 390111, 391052, 392568, 394737, 396873, 398738, 400603, 402341, 403306, 403194, 402384, 401268, 399700, 397323, 394199, 390954, 388360, 386783, 385858, 384801, 383158, 381221, 379538, 378217, 376915, 375306, 373254, 370682, 367674, 364632, 361965, 359592, 357045, 354029, 350601, 346923, 343244, 340062, 337781, 336122, 334329, 332120, 330047, 328731, 328083, 327469, 326359, 324631, 322570, 320792, 319873, 319845, 320249, 320763, 321449, 322288, 322967, 323383, 323949, 324985, 326189, 327143, 328036, 329430, 331527, 334162, 337288, 340944, 344853, 348680, 352613, 357132, 362130, 366879, 371013, 375000, 379332, 383714, 387393, 390060, 392075, 394006, 396170, 398461, 400425]
60661D00425J194M13L1n0j81l82l55OM55O99N92J69k30o0Q14J785K112J672P01
60642D09810p51k506l718l593k615k186k900m009m693m937m861m216l112k373
60628C63340k412k462j696n32l0l74q47r19n87R6R71J452J108M00Q3J3m86j243
60610C55875j317n68L1JJ94J318K592K787J967J237J086J010O84N78J117J884
60594C70476K137J769J372J424J742J781J361Q49O36O12L96j6k26j08j24o57j267
60577C82157r95N77K760M339M668M153L782M221N418O934Q457R841J0912J1501
60563D58725J1538J0973R676P690N369L042O82j760l923n350o094o436o212n037
60549D72883l158j402j19J126K704M418O074P772R347J0330J0887J1910J3580
$$ y = [400425, 401619, 402032, 402063, 402013, 401832, 401450, 401095, 401101, 401556, 402255, 402847, 403016, 402786, 402726, 403540, 405325, 407437, 409109, 409810, 409059, 406553, 402835, 399242, 396627, 394441, 391541, 387532, 382839, 377902, 373041, 368825, 365713, 363340, 360928, 358466, 356770, 356238, 356208, 355834, 354987, 354068, 353481, 353577, 354548, 356000, 357108, 357508, 357591, 357604, 357118, 355875, 354558, 353990, 354021, 354022, 354216, 355534, 358126, 360913, 362880, 364117, 365203, 366213, 366897, 367475, 368592, 370476, 372613, 374382, 375754, 377178, 378920, 380701, 382062, 382911, 383547, 384159, 384555, 384539, 384313, 384205, 384081, 383424, 382157, 381162, 381739, 384499, 388838, 393506, 397659, 401441, 405662, 411080, 418014, 426471, 436312, 447224, 458725, 470263, 481236, 490912, 498602, 503971, 507013, 507695, 505935, 502012, 496662, 490568, 484132, 477920, 472883, 469725, 468323, 468204, 469330, 472034, 476452, 482526, 490298, 499645, 509975, 520862, 532772, 546352]
60536E46352J4655J4044J2381J0980R826P831M806J777o61l030n553p293p406
60523E98709o458n679n428n137m405l458k610j934j409r69l75N45J484J814J357
60508E66047Q21J201K764M808O487P869R947J3501J8160K2762K6577K9839L3142
60495G43925L6663M0053M2781M4338M4330M2588L9144L4009K7053J8237P880l258
60483A117743j4155k3828l1773l8137m3263m6954m8489m7477m4540m0872l7303
60472G00952l3939l0579k7127k3627k0173j7006j4551j3109j2430j1751j0485
60461D86175q798p351o440n727m931m403m563n037m947m104l252k977k942k589
60447D18114k082j928k025j813j268j112j714k412k315j449o50m44m87k20K54
$$ y = [546352, 561007, 575051, 587432, 598412, 608238, 616069, 620875, 622652, 621991, 618961, 613408, 606115, 598709, 592251, 586572, 581144, 576007, 571602, 568144, 565534, 563600, 562191, 561222, 560847, 561392, 562876, 564690, 566047, 566868, 568069, 570833, 575641, 582128, 589997, 599944, 613445, 631605, 654367, 680944, 710783, 743925, 780588, 820641, 863422, 907760, 952090, 994678, 1033822, 1067831, 1094884, 1113121, 1121001, 1117743, 1103588, 1079760, 1047987, 1009850, 966587, 919633, 871144, 823667, 779127, 738255, 700952, 667013, 636434, 609307, 585680, 565507, 548501, 533950, 520841, 508411, 496660, 486175, 477377, 470026, 463586, 457859, 452928, 448525, 443962, 438925, 433978, 429874, 426622, 423645, 420703, 418114, 416032, 414104, 412079, 410266, 408998, 407886, 406172, 403760, 401445, 399996, 399346, 398902, 398415, 398195, 398449]
60432C98449K97l44j048r91j43O66P12J42l53m10k03k3J4j37m31n25J3J103K054
60413C98842K246J794J328J343J828K319K206J249N3l73J98Q36O72L7j61K17O26
60396D15260J000J835L008L588L169K518K407K575K467K259K376K603K553K490
60382D50108K795K992K338J221Q60J619K564K832K528K104J752J681K152K845
60368D80391K981K481K176K529K916K729K349K348K418J994J360J299J914K668
60354E12553L296L916M420M625M874N663O759P411P466P455P524P089N755L855
60340E92661J729p30l430n564o390o132n624n310n093m941n034n336n532n529
60326E29745n644o064o372n902m560l034k107j905j996k015j874j396k37J515
$$ y = [398449, 398746, 398402, 397354, 396363, 396220, 396886, 397598, 397740, 397387, 396977, 396774, 396751, 396765, 396628, 396197, 395672, 395685, 396788, 398842, 401088, 402882, 404210, 405553, 407381, 409700, 411906, 413155, 413208, 412835, 413033, 413869, 414541, 414578, 414417, 414634, 415260, 416260, 418095, 421103, 424691, 427860, 430378, 432785, 435360, 437827, 440086, 442462, 445065, 447618, 450108, 452903, 455895, 458233, 459454, 460314, 461933, 464497, 467329, 469857, 471961, 473713, 475394, 477546, 480391, 483372, 485853, 488029, 490558, 493474, 496203, 498552, 500900, 503318, 505312, 506672, 507971, 509885, 512553, 515849, 519765, 524185, 528810, 533684, 539347, 546106, 553517, 560983, 568438, 575962, 583051, 588806, 592661, 594390, 593660, 590230, 584666, 578276, 572144, 566520, 561210, 556117, 551176, 546142, 540806, 535274, 529745, 524101, 518037, 511665, 505763, 501203, 498169, 496062, 494157, 492161, 490146, 488272, 486876, 486639, 488154]
60312D88154L040L597L524L995N711Q230J0738J3062J5569J8258K0401K1233K0731
60299F36243J9412J7452J4356R666L772k319p858j2650j6567j9292k0675k0862
60287F00678j9867j7517j4177j0995q914p716o532n065l717k738j932j292j220
60274D98996j908k958l826m337m565m530m276l951l658l279k690j917j108m72
60260D55521k90p01j445k001k131k060k044k009j757j321r46p70p32o84n19k09
60244D35902J79N44Q24J049J257J435J546J557J484J383J312J312J434J730K111
60229D55059K370K417K385K306J884J016L45O70J805K660K660K382K452K567K302
60214D85280K189L102M803O064O221N891N979O616P268P422O984O300N885N968
$$ y = [488154, 491194, 494791, 498315, 502310, 508021, 516251, 526989, 540051, 555620, 573878, 594279, 615512, 636243, 655655, 673107, 687463, 697129, 700901, 698582, 690724, 678074, 661507, 642215, 621540, 600678, 580811, 563294, 549117, 538122, 529208, 521492, 514960, 509895, 506178, 503440, 501508, 500216, 498996, 497088, 494130, 490304, 485967, 481402, 476872, 472596, 468645, 464987, 461708, 459018, 457101, 455993, 455521, 455231, 454530, 453085, 451084, 448953, 446893, 444849, 442840, 441083, 439762, 438816, 438046, 437314, 436630, 436111, 435902, 436081, 436625, 437449, 438498, 439755, 441190, 442736, 444293, 445777, 447160, 448472, 449784, 451218, 452948, 455059, 457429, 459846, 462231, 464537, 466421, 467437, 467782, 468452, 470257, 472917, 475577, 477959, 480411, 482978, 485280, 487469, 490571, 495374, 501438, 507659, 513550, 519529, 526145, 533413, 540835, 547819, 554119, 560004, 565972]
60200E65972O228O182N695M960M227L798L927M348M242L220J956J309J157P82
60186F18003J02m14q14j674l032m175m642m635m359l833l492l991n110n759n471
60171E66704m985m877m570l444k119j686k113k377j954j367j200j370j476j391
60157E31775j278j237j178r99p63n86l06M29J524K213J913J105Q03J242J790K070
60141E38517K330K667K805K870L537M950O280O758O508N940N079M015L210K821
60127E98287K339J543J041J156J132K89o54m97O66J674K008K162K456K583K408
60112F18593K293K473K779L071L286L027J876K53p77p78m21n77j350k238k709
60097F28801k549k012j740k091k526k132q00O64J574J979K122J980J600J380J562
$$ y = [565972, 572200, 578382, 584077, 589037, 593264, 597062, 600989, 605337, 609579, 612799, 614755, 616064, 617221, 618003, 618105, 617691, 616877, 615203, 612171, 607996, 603354, 598719, 594360, 590527, 587035, 583044, 577934, 572175, 566704, 561719, 556842, 552272, 548828, 546709, 545023, 542910, 540533, 538579, 537212, 536012, 534642, 533166, 531775, 530497, 529260, 528082, 527083, 526320, 525734, 525428, 525857, 527381, 529594, 531507, 532612, 533415, 534657, 536447, 538517, 540847, 543514, 546319, 549189, 552726, 557676, 563956, 570714, 577222, 583162, 588241, 592256, 595466, 598287, 600626, 602169, 603210, 604366, 605498, 605787, 605133, 604636, 605302, 606976, 608984, 611146, 613602, 616185, 618593, 620886, 623359, 626138, 629209, 632495, 635522, 637398, 637651, 636874, 636096, 635675, 635098, 633748, 631510, 628801, 626252, 624240, 622500, 620409, 617883, 615751, 614951, 615615, 617189, 619168, 621290, 623270, 624870, 626250, 627812]
60082F27812J840J783J427J121R98Q56L78n86j874l026l733m297n321o835q112
60067F02431q535q361q278q469q475p991p379p252p621p794p153n955n045m814
60053D99309m774m275l269k121r75K14J245J796J999K404L258M181M697M787M737
60038E13213M706M693M765N039N399N423M796L713K688J879Q28q78k904m529n544
60023E43287o247o607o220n255m701n129n878o044n759n711n813n289l991k728
60009D67915k183k156k111j903j663j395r72m50p5j11n50j029j171j084j256j770
59993D48036j979j283J08J501K447K829K654K256K325L083L779L580K705J995
59979D74036J749J669J650J711J424L33j107j966k205k590l285l525k947k180
$$ y = [627812, 629652, 631435, 632862, 633983, 634981, 635837, 636215, 635629, 633755, 630729, 626996, 622699, 617378, 610543, 602431, 593896, 585535, 577257, 568788, 560313, 552322, 544943, 537691, 530070, 522276, 515123, 509168, 504123, 499309, 494535, 490260, 486991, 484870, 483895, 484109, 485354, 487150, 489149, 491553, 494811, 498992, 503689, 508476, 513213, 517919, 522612, 527377, 532416, 537815, 543238, 548034, 551747, 554435, 556314, 557142, 556264, 553360, 548831, 543287, 537040, 530433, 524213, 518958, 514257, 509128, 503250, 497206, 491447, 485736, 479923, 474634, 470643, 467915, 465732, 463576, 461465, 459562, 457899, 456504, 455532, 455082, 455007, 454896, 454346, 453317, 452146, 451062, 449806, 448036, 446057, 444774, 444882, 446383, 448830, 451659, 454313, 456569, 458894, 461977, 465756, 469336, 472041, 474036, 475785, 477454, 479104, 480815, 482239, 482572, 481465, 479499, 477294, 474704, 471419, 467894, 464947, 462767]
59965D62767j816j635j286q27k50P04J832K339J966J502J693K285K656K712K599
59950D77241K196J488R15P65P51O79R05J537J856J297M76M27J162J782J694R59
59934D96130k30j591k493k456j858j562j804k085j955j367m29N63J057Q27N48
59919D81295J056K149K807K661K484L057M218N267N798N854N619N219M598L582
59905E35664K250J117N73K57m45j419j904j650j281j312j368q02M07J705K659
59890E34451L271L705M016M107L895L586L561L881M154M210M509N311N784M952
59876E93393L352K668L364L863K714N88q62j355k012l402m742n179m861m474m394
59861E78661m558m668m379l630k863k443j941o40J264K752L477M367O239Q516
$$ y = [462767, 460951, 459316, 458030, 457203, 456953, 457657, 459489, 461828, 463794, 465296, 466989, 469274, 471930, 474642, 477241, 479437, 480925, 481840, 482605, 483356, 484035, 484940, 486477, 488333, 489630, 490106, 490533, 491695, 493477, 495171, 496130, 495900, 494309, 491816, 489360, 487502, 485940, 484136, 482051, 480096, 478729, 478300, 478863, 479920, 480747, 481295, 482351, 484500, 487307, 489968, 492452, 495509, 499727, 504994, 510792, 516646, 522265, 527484, 532082, 535664, 537914, 539031, 539604, 539861, 539416, 537997, 536093, 534443, 533162, 531850, 530482, 529680, 530087, 531792, 534451, 537722, 541427, 545443, 549550, 553445, 557031, 560592, 564473, 568627, 572837, 577346, 582657, 588441, 593393, 596745, 599413, 602777, 606640, 609354, 609942, 609080, 607725, 605713, 602311, 597569, 592390, 587529, 583055, 578661, 574103, 569435, 565056, 561426, 558563, 556120, 554179, 553539, 554803, 557555, 561032, 565399, 571638, 580154]
59847E80154R914R938R004P570N864M232K974J873N96n05o90m8L27l22j549k553
59831F26779l361m561o158p343p456o730n878n232m596l931l764m563n835o435
59817E50936n934n092m629m164l084j921j732k281k108o70P86R64J30p36j377
59802E19088j912j986j361q52j388k488k838k187j562j579j754j617j369j128
59788D95067n97J19L77J01P6N80P02k20j351j484p55k70m69q77j179j481j618
59771D86721j183l50J41M3q2J84N24N17L24L39N80Q86J335K063K842L261L251
59754E01396L117L087L138L253L590M205M846N222N405N698O083O027N084L537
59740E63688K227J737J918K222K295K141J966J948K066K044J596Q22J91K0J47
$$ y = [580154, 590068, 600006, 609010, 616580, 622444, 626676, 629650, 631523, 632119, 631614, 630924, 630876, 631203, 630881, 629332, 626779, 623418, 618857, 612699, 605356, 597900, 591170, 585292, 580060, 575464, 571533, 567769, 563206, 557371, 550936, 545002, 539910, 535281, 531117, 528033, 526112, 524380, 522099, 519991, 519321, 520107, 521071, 521201, 520465, 519088, 517176, 515190, 513829, 512977, 511589, 509101, 506263, 504076, 502514, 500935, 499181, 497564, 496195, 495067, 494470, 494589, 494966, 495067, 495143, 495723, 496425, 496205, 494854, 493370, 492615, 492345, 491876, 490999, 489820, 488339, 486721, 485538, 485188, 485329, 485372, 485290, 485474, 485998, 486515, 486839, 487178, 487758, 488644, 489979, 492042, 494884, 498145, 501396, 504513, 507600, 510738, 513991, 517581, 521786, 526632, 531854, 537259, 542957, 549040, 555067, 560151, 563688, 565915, 567652, 569570, 571792, 574087, 576228, 578194, 580142, 582208, 584252, 585848, 586670, 586861, 586881, 587028]
59725E87028K29K00K17K78J70k16o60p99m39K62Q43Q49K53m93q66q04o61o89o84
59706E84018l21L01O82O52P59J584K797L340K796K039K148L030L669L532L004
59691F14030K527J956J113L10l7oM2n6k99p62j456k099k377k366k398k645l062
59674F02415l589m128m438m386m230m335m591m492l863l192k993l023k562j455
59660E51138m95m75j073j200l83N76P18J87l6N75J609K445K889K993K774K310
59644E64552J763J104J36j072k118k769l223l697m103m292m277m051l468k610
59630E31875j884j590j617j770j977k040j639r37p13j409k382k647k161j805k189
59615E05115k992l547l619l483l493l606l353k301p07N38Q24M54J27J38L96Q96
$$ y = [587028, 587257, 587457, 587674, 587952, 588122, 587906, 587246, 586447, 586008, 586270, 587113, 587962, 588215, 587722, 586856, 586052, 585391, 584702, 584018, 583697, 583998, 584680, 585332, 586091, 587675, 590472, 593812, 596608, 598647, 600795, 603825, 607494, 611026, 614030, 616557, 618513, 619626, 619936, 619899, 619893, 619935, 619879, 619580, 618818, 617362, 615263, 612886, 610520, 608122, 605477, 602415, 598826, 594698, 590260, 585874, 581644, 577309, 572718, 568226, 564363, 561171, 558178, 555155, 552593, 551138, 550643, 550168, 549095, 547895, 547512, 548088, 548806, 548993, 548957, 549532, 551141, 553586, 556475, 559468, 562242, 564552, 566315, 567419, 567555, 566483, 564365, 561596, 558373, 554676, 550573, 546281, 542004, 537953, 534485, 531875, 529991, 528401, 526784, 525014, 523037, 520997, 519358, 518421, 517708, 516299, 513917, 511270, 509109, 507304, 505115, 502123, 498576, 494957, 491474, 487981, 484375, 481022, 478721, 478014, 478552, 479376, 479830, 479957, 480095, 480491, 481387]
59599D81387J590J982J582P32M21J013J694J495N04l46m76j99q8k40l59l74n27
59582D89791q90j139j105j170j760k579k915k677k507k750k942k672k290k275
59568D60120k342j870r25j75M4oj15l47n77l94K80R54J190J160J320J785K236
59551D62338K330K009J533J295J630K604L971N213N785N577N219N675P411J0045
59537E22635J2885J5383J6890J6586J4246J0780P327L988J00m217p625q943q356
59524E91679o852m966k644pK380L996M692M429L258J627L65j52o02k046m588p060
59508E83509q268q232p941q087q463q511q039p211o255n315m499l861l407l172
59494D92248l103k950k486j815j217p57l15N2K05L65R15J732K253K348K578L265
$$ y = [481387, 482977, 484959, 486541, 487273, 487694, 488707, 490401, 491896, 492400, 492054, 491578, 491379, 491291, 491051, 490692, 490318, 489791, 488901, 487762, 486657, 485487, 483727, 481148, 478233, 475556, 473049, 470299, 467357, 464685, 462395, 460120, 457778, 455908, 454983, 454808, 454852, 454846, 454731, 454384, 453807, 453413, 453693, 454647, 455837, 456997, 458317, 460102, 462338, 464668, 466677, 468210, 469505, 471135, 473739, 477710, 482923, 488708, 494285, 499504, 505179, 512590, 522635, 535520, 550903, 567793, 584379, 598625, 609405, 616732, 620720, 620820, 616603, 608978, 600035, 591679, 584827, 579861, 577217, 577210, 579590, 583586, 588278, 592707, 595965, 597592, 597957, 597805, 597203, 595157, 590569, 583509, 575241, 567009, 559068, 550981, 542518, 534007, 525968, 518757, 512502, 507187, 502688, 498827, 495420, 492248, 489145, 486195, 483709, 481894, 480677, 479920, 479605, 479657, 479862, 480227, 481142, 482874, 485127, 487475, 490053, 493318]
59478D93318L964M225M299M619M978M842M178L448K923K508K109J787J593J511
59464E40302J455J224P30L97Q28J805K281J772J213J848L701N791P372Q309Q619
59449E87647Q531Q666R339R793Q996P078N112L522J605j140m119o387p631q045
59435F22967p824p188o573o356o571o926o995o388n050l321j533L33K263L848
59421E64686M823N643O979Q792J0621J2530J4992J7959K0892K3578K5899K6799
59409G44193K4800J9963J4222R067L885k496r417j4630j6504j5049j1107n801
59397G41126q03K017J933q6k680n687r944j5632k1361k5056k5611k3465j9903
59384E94848j6132j2881j0321q137o010m170l093k594j812l90Q95J207Q19O21
$$ y = [493318, 497282, 501507, 505806, 510425, 515403, 520245, 524423, 527871, 530794, 533302, 535411, 537198, 538791, 540302, 541757, 542981, 543711, 544108, 544936, 546741, 549022, 550794, 552007, 553855, 557556, 563347, 570719, 579028, 587647, 596178, 604844, 614183, 623976, 632972, 640050, 645162, 648684, 650289, 649149, 645030, 638643, 631012, 622967, 615143, 607955, 601382, 595026, 588455, 581529, 574534, 568146, 563096, 559775, 558242, 558575, 560838, 564686, 569509, 575152, 582131, 590923, 601544, 614074, 629066, 647025, 667917, 691495, 717394, 744193, 768993, 788956, 803178, 812245, 816130, 813634, 804217, 789587, 773083, 758034, 746927, 741126, 740323, 742340, 744273, 744187, 741507, 735820, 725876, 710244, 688883, 663827, 638216, 614751, 594848, 578716, 565835, 555514, 547377, 541367, 537197, 534104, 531510, 529698, 529308, 530203, 531410, 532229, 532850]
59370E32850R22J506K402L683M720M717L943L504L825M329M653N162N956O460
59356E88632O441O636P698R215J0395J1145J1884J2747J3583J4447J5511J6650
59344G24984J7512J7920J7937J7718J7390J6877J5808J3917J1542R237O944M148
59332H91934Q73k190m722p194r912j2400j4088j5011j5374j5131j4465j3985j3899
59319G54436j3540j2355j0904j0187j0316j0473r888q362o175l992k543j895j331
59306F52475k75J062K353L915O169Q854J1396J3626J5326J5563J3395R189M363
59293G57411j28m297q164j1184j2851j3275j2850j1792j0216q337o443m817l688
59280F49369k990k302j333l18L97J066K290M162O054P322P856P891P746P735Q010
$$ y = [532850, 533772, 535278, 537680, 541363, 546083, 550800, 554743, 558247, 562072, 566401, 571054, 576216, 582172, 588632, 595073, 601709, 609407, 618622, 629017, 640162, 652046, 664793, 678376, 692823, 708334, 724984, 742496, 760416, 778353, 796071, 813461, 830338, 846146, 860063, 871605, 880842, 887786, 891934, 892807, 890617, 885895, 878701, 868789, 856389, 842301, 827290, 811916, 796785, 782320, 768335, 754436, 740896, 728541, 717637, 707450, 697134, 686661, 676773, 668411, 662236, 658244, 655701, 653806, 652475, 652200, 653262, 655615, 659530, 665699, 674553, 685949, 699575, 714901, 730464, 743859, 753048, 757411, 757283, 752986, 744822, 733638, 720787, 707512, 694662, 682870, 672654, 664317, 657874, 653057, 649369, 646379, 644077, 642744, 642426, 642823, 643889, 646179, 650341, 656395, 663717, 671573, 679464, 687210, 694945, 702955]
59265G02955Q301Q107P173N649L788J770j92j898l436n137p195r342j1048j1886
59251F87609j1789j1050j0057r035q044p137o299n296l894k254p82M02J483K391
59237F16248K750K604K566K933L186K849K308K199K322J913P62n61j508k034k361
59222F36176k732l388m342n205n607n661n683n560m955l960l045k354j549m80
59208E81655M24O09lr17j426j118k68L41K62j33j62L35R97J530J876K016K093
59191E88111K564L687M902N278M642L786L411L313K872K065J613K101L161L692
59177F35198L068J960J618K263K812K384J524J371K074K796L040L210L835M865
59163F72018N855O430O456O169O029O145N950M886L261J856P65o82k806n036o628
$$ y = [702955, 711256, 719363, 726536, 732185, 735973, 737743, 737551, 735653, 732217, 727080, 719885, 710543, 699495, 687609, 675820, 664770, 654713, 645678, 637634, 630497, 624198, 618902, 615008, 612754, 611972, 612374, 613857, 616248, 618998, 621602, 624168, 627101, 630287, 633136, 635444, 637643, 639965, 641878, 642640, 642079, 640571, 638537, 636176, 633444, 630056, 625714, 620509, 614902, 609241, 603558, 597998, 593043, 589083, 586038, 583684, 582135, 581655, 582079, 582688, 582685, 581768, 580342, 579224, 578956, 579297, 579559, 579426, 579264, 579599, 580596, 582126, 584002, 586018, 588111, 590675, 594362, 599264, 604542, 609184, 612970, 616381, 619694, 622566, 624631, 626244, 628345, 631506, 635198, 638266, 640226, 641844, 644107, 646919, 649303, 650827, 652198, 654272, 657068, 660108, 663318, 667153, 672018, 677873, 684303, 690759, 696928, 702957, 709102, 715052, 719938, 723199, 725055, 725820, 725138, 722332, 717296, 710668]
59148G10668p394p522p232o825o585o419n996n404n109n098m679l533k372k029
59134F34471k270k241j760j487j814k367k669k748k704k218j076P8K29o11j064
59119F09749J33K592M706N458N306N262N700O285O648O758O826P129P702Q107
59105F88361P773O777N889N563N334M584L522K788K436J924R68j76j237k098k525
59090G29883k281j628j162j049r28o63o87j295k153k837l491m526n876o985p497
59075F86825p621p761q016q196q191q110q005p652o794n597m565m010l775l587
59061E94945l401l324l407l654l989m129l810l225k897k966l000k725k437k368
59047E49613k159j425m70J04J75jl19p33q68l73N18J268J653J660J174M02K31
$$ y = [710668, 703274, 695752, 688520, 681695, 675110, 668691, 662695, 657291, 652182, 647084, 642405, 638872, 636500, 634471, 632201, 629960, 628200, 626713, 624899, 622532, 619863, 617115, 614411, 612193, 611117, 611195, 611424, 610813, 609749, 609882, 612474, 617180, 622638, 627944, 633206, 638906, 645191, 651839, 658597, 665423, 672552, 680254, 688361, 696134, 702911, 708800, 714363, 719697, 724281, 727803, 730591, 733027, 734951, 735919, 735743, 734506, 732408, 729883, 727602, 725974, 724812, 723763, 722835, 722172, 721485, 720190, 718037, 715200, 711709, 707183, 701307, 694322, 686825, 679204, 671443, 663427, 655231, 647040, 638930, 630925, 623273, 616479, 610882, 606317, 602307, 598532, 594945, 591544, 588220, 584813, 581159, 577170, 573041, 569231, 566006, 563109, 560143, 557143, 554418, 551981, 549613, 547454, 546029, 545559, 545663, 545838, 545837, 545518, 544785, 543917, 543544, 544062, 545330, 546983, 548643, 549817, 550219, 550450]
59030E50450J274K821L572L367L240L849M817N795P159R125J1064J2273J2845
59017F31651J3235J3335J2634J1010Q923O832M812K729O71q73j458j315j278j721
59003F99187j976j345l09J66L08J402L744N849O305N528M876M670M084K699J158
58988G36346J80l61j071k151l192l741l842l962m335m594m199l158j977q67N33
58973F99609K501M668O384P445Q138Q772R450J0183J0924J1499J1661J1342J0780
58960H13356J0380J0317J0235R407P404M498J330j658m272o395q198j0244j2722
58947H23438j4714j4967j3573j2135j1889j2331j2244j1427j0609j0025r089p551
58935F82884o079n267m688l532j893p53p27j407k000k195k086j742j283j046j243
$$ y = [550450, 551724, 554545, 558117, 561484, 564724, 568573, 573390, 579185, 586344, 595469, 606533, 618806, 631651, 644886, 658221, 670855, 681865, 690788, 697620, 702432, 705161, 705832, 704959, 703501, 702186, 700908, 699187, 697211, 695866, 695557, 695723, 696031, 697433, 701177, 707026, 713331, 718859, 723735, 728405, 732489, 735188, 736346, 736526, 736165, 735094, 732943, 729751, 726010, 722168, 718206, 713871, 709277, 705078, 701920, 699943, 699076, 699609, 702110, 706778, 713162, 720607, 728745, 737517, 746967, 757150, 768074, 779573, 791234, 802576, 813356, 823736, 834053, 844288, 853695, 861099, 865597, 866927, 865269, 860997, 854602, 846404, 836160, 823438, 808724, 793757, 780184, 768049, 756160, 743829, 731585, 720158, 709549, 699524, 690435, 682884, 676805, 671538, 666850, 663318, 661425, 660672, 659945, 658538, 656538, 654343, 652257, 650515, 649232, 648186, 646943]
58920F46943j549j575j519j808k154j744m96O34R13P04O47P34P73J153K320L902
58904F47878N191O226P602R396J1067J2322J3267J3782J3523J2696J2035J1813
58892G76798J1576J1100J0928J1565J2763J4061J5580J7670J9901K1067K0303
58881I43312J8009J5445J3449J1738R464O293K646j029m617p872j0196j1351j1996
58868I73295j2978j4299j5254j5313j4473j3041j1525j0505j0119r910r586r532
58856H26760j0030j0518j0397j0133j0600j1565j1879j1168j0276r832r321q087
58844G02954o480n489n596o359o887o616n810n301n553o111o302o083n796n432
58830F19139m808m190l922l618k590j070j13k07o56n56K09J118J673J818K038
$$ y = [646943, 645394, 643819, 642300, 640492, 638338, 636594, 636098, 636732, 637645, 638349, 638996, 639730, 640503, 641656, 643976, 647878, 653069, 659295, 666897, 676293, 687360, 699682, 712949, 726731, 740254, 752950, 764985, 776798, 788374, 799474, 810402, 821967, 834730, 848791, 864371, 882041, 901942, 923009, 943312, 961321, 976766, 990215, 1001953, 1011417, 1017710, 1020356, 1019327, 1014710, 1006838, 996642, 985291, 973295, 960317, 946018, 930764, 915451, 900978, 887937, 876412, 865907, 855788, 845878, 836292, 826760, 816730, 806212, 795815, 785682, 775082, 763517, 751638, 740470, 730194, 720362, 711041, 702954, 696474, 690985, 685389, 679030, 672143, 665527, 659717, 654416, 648863, 642752, 636450, 630367, 624571, 619139, 614331, 610141, 606219, 602601, 600011, 598941, 598828, 598621, 597965, 597409, 597618, 598736, 600409, 602227, 604265]
58815F04265K897M180M847M334L380K930K772K206J448J210J285R32M04O46J484
58800F39220J570L62j224k404l421m489n120n086m991n289n606n460m858l936
58786E89268k840k112k127k131j037Q05J994K352L131M588N275M489L557L549
58772F08761L375J653r17k700l599m701o129o929o764o312o023n651m951m015
58758E55098k962j919j109n22J36Q62J234J287J654K466K958K779K669L125L478
58743E71234L133K750L088L712L948M189M959N589N276M726N111N962N799M607
58729F34083L903M355M955M834M424M343M362M106L840L981M399M717M853M912
58715F96067M959N073N392N904O506P098P439P071N762L860J869r9k146m149n924
$$ y = [604265, 607162, 611342, 616189, 620523, 623903, 626833, 629605, 631811, 633259, 634469, 635754, 636686, 637090, 637736, 639220, 640790, 641152, 639928, 637524, 634103, 629614, 624494, 619408, 614417, 609128, 603522, 598062, 593204, 589268, 586428, 584316, 582189, 580058, 579021, 579826, 581820, 584172, 587303, 591891, 597166, 601655, 605212, 608761, 612136, 613789, 612872, 610172, 606573, 601872, 595743, 588814, 582050, 575738, 569715, 564064, 559113, 555098, 552136, 550217, 549108, 548586, 548722, 549584, 550818, 552105, 553759, 556225, 559183, 561962, 564631, 567756, 571234, 574367, 577117, 580205, 583917, 587865, 592054, 597013, 602602, 607878, 612604, 617715, 623677, 629476, 634083, 637986, 642341, 647296, 652130, 656554, 660897, 665259, 669365, 673205, 677186, 681585, 686302, 691155, 696067, 701026, 706099, 711491, 717395, 723901, 730999, 738438, 745509, 751271, 755131, 757000, 756901, 754755, 750606, 744682]
58700G44682p628r539j1657j3751j5511j6475j6277j5320j4602j4491j4227j3077
58688E82127j1372r843q654p693p145p038o716n643m305l557l433l307k867k232
58674D98322j514q86p28j013r36J53J855L353M505N735P201Q684R869J0237R296
58659E54133P422N864N233M687L275J285n06k084l716m978n321n097m987n002
58645E50208m920n046n495n497m552l563l549l856l116j404j7N58R16J288J357
58630E13312J431K285L657M284L665K671K252K479K978L360L149K281J656K254
58616E51714L754M912N222N216N294N277N130N080M942M281L215K237J349K42
58602F07865q11j305j508k145l140l742l807l872m044l913l526l315l069k100
$$ y = [744682, 737054, 727515, 715858, 702107, 686596, 670121, 653844, 638524, 623922, 609431, 595204, 582127, 570755, 560912, 552258, 544565, 537420, 530382, 523666, 518023, 513718, 510161, 506728, 503421, 500554, 498322, 496808, 495922, 495194, 494181, 493245, 493398, 495253, 498606, 503111, 508846, 516047, 524731, 534600, 544837, 554133, 561555, 567419, 572652, 577339, 580614, 581899, 581393, 579309, 575593, 570615, 565294, 560197, 555210, 550208, 545288, 540242, 534747, 529250, 524698, 521135, 517586, 513730, 510614, 509210, 509193, 509751, 510667, 511955, 513312, 514743, 517028, 520685, 524969, 528634, 531305, 533557, 536036, 539014, 542374, 545523, 547804, 549460, 551714, 555468, 560380, 565602, 570818, 576112, 581389, 586519, 591599, 596541, 600822, 604037, 606274, 607623, 607865, 607054, 605749, 604241, 602096, 598956, 595214, 591407, 587535, 583491, 579578, 576052, 572737, 569668, 567568]
58588E67568m83R88K147L564N232O329O640P090Q400J0088J1182J1206J0232Q686
58574F58869P378P016P469P975Q169Q367Q956J0112J2007J4567J7114J8985K0334
58561H07318K1698K3040K3932K4393K4689K4473K3059K0422J7143J3512R489N347
58549A038515J554j799m782p082q383q886q871q283p489p578r040j0917j2320
58536I44639j3841j6204j8562j9734k0270k1385k2477k1780j9110j6016j3350
58525G41910j0711q187o556n580m020j792k52j2j07K14M98L68K77M28K93l24r08
58508G05539j267j767k304k259j716j454j637j704j622j969k669k973k706k275
58494F77217j566l29O02J40j048j175J6J179J903L223N282O691O891P138Q320
$$ y = [567568, 567085, 568073, 570220, 573784, 579016, 585345, 591985, 599075, 607475, 617563, 628745, 639951, 650183, 658869, 666247, 673263, 680732, 688707, 696876, 705243, 714199, 724311, 736318, 750885, 767999, 786984, 807318, 829016, 852056, 875988, 900381, 925070, 949543, 972602, 993024, 1010167, 1023679, 1033168, 1038515, 1040069, 1038270, 1033488, 1026406, 1018023, 1009137, 1000266, 991983, 984494, 976916, 967876, 956959, 944639, 930798, 914594, 896032, 876298, 856028, 834643, 812166, 790386, 771276, 755260, 741910, 731199, 723012, 716456, 710876, 706856, 705064, 704812, 704800, 704693, 704907, 705405, 705773, 706050, 706478, 706771, 706447, 705539, 704272, 702505, 700201, 697942, 696226, 694772, 693135, 691431, 689809, 687840, 685171, 682198, 679492, 677217, 675651, 675322, 675924, 676064, 675016, 673841, 673857, 675036, 676939, 680162, 685444, 692135, 699026, 706164, 714484]
58479G14484R636J0308J0964J2317J3855J4728J4745J3958J2368J0454Q734O632
58467H53183L195r86m179o018p649r157r092p141n133m320l608j646J079L407
58453H01935N376P593R874J1478J1897J0884Q631O193M493K804k90m416p619r158
58439H59675j0061j0713j0193q512p157o545n241k658l18P53J660L394N034N604
58425H14722N840O661P629Q309R425J1169J2016J0741Q169N625L076J71k412m037
58411H97104n244o534p341p340p378p986q378q017p632p537o645m329j816m28
58397H10499J21N57P11N22Q33J981L020L376L752M407M328L164K192K209K331
58382H44003K044K398L830M875M624M450N632P107P411P022P055P231O968O945
$$ y = [714484, 724120, 734428, 745392, 757709, 771564, 786292, 801037, 814995, 827363, 837817, 846551, 853183, 856378, 855392, 851213, 845195, 837546, 828389, 819297, 812156, 807023, 802703, 799095, 797449, 798528, 801935, 807311, 814904, 824778, 836256, 848153, 859037, 867668, 873861, 878354, 881158, 880868, 876452, 868833, 859675, 849614, 838901, 828708, 820196, 813039, 806494, 801253, 798595, 798277, 799030, 800690, 804084, 809118, 814722, 820562, 827223, 834852, 843161, 852586, 863755, 875771, 886512, 894681, 900306, 903382, 903553, 901141, 897104, 891860, 885326, 877985, 870645, 863267, 855281, 846903, 838886, 831254, 823717, 817072, 812743, 810927, 810499, 810620, 811177, 811888, 812410, 813243, 815224, 818244, 821620, 825372, 829779, 834107, 837271, 839463, 841672, 844003, 846047, 848445, 852275, 857150, 861774, 866224, 871856, 878963, 886374, 893396, 900451, 907682, 914650, 921595]
58368I21595P835Q906R378R750J0368J0451R956J0490J2760J4915J5218J4552
58356A056174J4492J4707J4208J3428J3043J2223J0050P312N190L586K265K032
58344A168710L159M358M847N675P454Q822Q869Q999J0452J2054J2478J2725J4130
58331A282732J5861J6621J6973J7782J8145J7064J5545J4819J4231J2866J1482
58320A454121J0789R783P808O338O575P312P302P580R231J1047J1760J2349J3800
58307A575795J4792J4181J3553J4664J6481J7340J7960J9661K1666K2756K3540
58296A772389K4670K4965K3813K3040K3924K4889K4613K4719K6660K8792K9391
58285B051865K9729L1222L2515L2479L2953L5257L7177L6889L6653L8974M2291
$$ y = [921595, 929430, 938336, 947714, 957464, 967832, 978283, 988239, 998729, 1011489, 1026404, 1041622, 1056174, 1070666, 1085373, 1099581, 1113009, 1126052, 1138275, 1148325, 1155637, 1160827, 1164413, 1166678, 1168710, 1171869, 1176227, 1181074, 1186749, 1194203, 1203025, 1211894, 1220893, 1231345, 1243399, 1255877, 1268602, 1282732, 1298593, 1315214, 1332187, 1349969, 1368114, 1385178, 1400723, 1415542, 1429773, 1442639, 1454121, 1464910, 1474693, 1482501, 1488839, 1495414, 1502726, 1510028, 1517608, 1526839, 1537886, 1549646, 1561995, 1575795, 1590587, 1604768, 1618321, 1632985, 1649466, 1666806, 1684766, 1704427, 1726093, 1748849, 1772389, 1797059, 1822024, 1845837, 1868877, 1892801, 1917690, 1942303, 1967022, 1993682, 2022474, 2051865, 2081594, 2112816, 2145331, 2177810, 2210763, 2246020, 2283197, 2320086, 2356739, 2395713, 2438004]
58274B438004M4290M6188M9744N3194N4494N5503N8699O2657O4946O6504O9051
58263C063274P1405P2508P4606P9051Q2712Q3095Q3092Q5896Q9294R0204R0615
58252C965752R3402R6537R7431R8792J03919J10272J14202J17889J24923J33260
58242E056379J39580J46308J56939J68639J77262J85392J97486K11281K22437
58233F661703K33422K49004K67079K82921K98490L18289L40240L60164L80995
58224I392307M07858M38483M68461N01125N41792N87455O33279O83774P45807
58215A4400341Q16453Q90307R72510J071386J184907J308730J450550J621449
58207B3716633J820926K046748K311315K631225L011051L457457L998885M670056
$$ y = [2438004, 2482294, 2528482, 2578226, 2631420, 2685914, 2741417, 2800116, 2862773, 2927719, 2994223, 3063274, 3134679, 3207187, 3281793, 3360844, 3443556, 3526651, 3609743, 3695639, 3784933, 3875137, 3965752, 4059154, 4155691, 4253122, 4351914, 4455833, 4566105, 4680307, 4798196, 4923119, 5056379, 5195959, 5342267, 5499206, 5667845, 5845107, 6030499, 6227985, 6439266, 6661703, 6895125, 7144129, 7411208, 7694129, 7992619, 8310908, 8651148, 9011312, 9392307, 9800165, 10238648, 10707109, 11208234, 11750026, 12337481, 12970760, 13654534, 14400341, 15216794, 16107101, 17079611, 18150997, 19335904, 20644634, 22095184, 23716633, 25537559, 27584307, 29895622, 32526847, 35537898, 38995355, 42994240, 47664296]
58199D7664296N489017O473069P664000R113430J0862827J2968325J5520458J8595401
58191A34350823K2190679K6192887L0275772L3707111L5382179L4366578L0562313
58184C47028342K4698900J7544702R279197j62429j0239855j9607815k6862242
58177C41678800l1354466l3263574l3119791l1448381k8742968k5495281k2118943
58170A36135396j8884732j5949413j3397436j1243463r447448p959769o741216
58163E2511919n746317m922263m233056l662756l192194k793669k450243k159675
58155B3351746j916373j706661j523090j366744j233825j114588j006188r12764
58147A2571513q32416p57113o85290o22053n67310n15662m67494m28187l96657
$$ y = [47664296, 53153313, 59626382, 67290382, 76403812, 87266639, 100234964, 115755422, 134350823, 156541502, 182734389, 213010161, 246717272, 282099451, 316466029, 347028342, 371727242, 389271944, 398551141, 398388712, 388148857, 368541042, 341678800, 310324334, 277060760, 243940969, 212492588, 183749620, 158254339, 136135396, 117250664, 101301251, 87903815, 76660352, 67212904, 59253135, 52511919, 46765602, 41843339, 37610283, 33947527, 30755333, 27961664, 25511421, 23351746, 21435373, 19728712, 18205622, 16838878, 15605053, 14490465, 13484277, 12571513, 11739097, 10981984, 10296694, 9674641, 9107331, 8591669, 8124175, 7695988, 7299331]
58138G299331l66110l35939l11937k94748k78671k61865k47641k35597k21265
58129D745558k04739j90517j78791j65743j52183j42893j37461j30573j21510
58120C321148j14783j11135j06408r9753r4786r1894q7368q1004p6938p5854p3641
58109B307584o8781o4335o1470n7759n2849m9510m8004m5449m1603l9387l8946
58098A739491l7158l3760l2042l2683l2625l0927l0147l0925l0731k8932k7829
58087A391732k7690k6059k2924k1419k2318k2860k2010k1871k2862k2592k0774
58076A138353k0313k2056k3120k1963k0597k0303j9469j7415j6121j6468j6527
58065I24001j5169j3854j3397j2495j0779r932j0448j0549r536r063r958j0834
$$ y = [7299331, 6933221, 6597282, 6285345, 5990597, 5711926, 5450061, 5202420, 4966823, 4745558, 4540819, 4350302, 4171511, 4005768, 3853585, 3710692, 3573231, 3442658, 3321148, 3206365, 3095230, 2988822, 2889069, 2794283, 2702389, 2615021, 2534017, 2457079, 2381225, 2307584, 2238803, 2174468, 2112998, 2055239, 2002390, 1952880, 1904876, 1859427, 1817824, 1778437, 1739491, 1702333, 1668573, 1636531, 1603848, 1571223, 1540296, 1510149, 1479224, 1448493, 1419561, 1391732, 1364042, 1337983, 1315059, 1293640, 1271322, 1248462, 1226452, 1204581, 1181719, 1159127, 1138353, 1118040, 1095984, 1072864, 1050901, 1030304, 1010001, 990532, 973117, 956996, 940528, 924001, 908832, 894978, 881581, 869086, 858307, 848375, 837927, 827378, 817842, 808779, 798821, 787987]
58053G87987j0862j0938j1244j0619r135q349q406p843o650o324o597n588l669
58040F81763l558n768p615p610p292p721p642o523o052p158q429q790r010r516
58026E79079r449q885r174j0136r756p653n977n888n994n269m681m840m780m190
58012D82407m179m845m717l562k987l401l247k197k106l529m378l445k352k439
57998D35023k543j593p67j170j630p55Q50K015K887L780M097L673L547M072M002
57983D55488K554O63q30k316l834m318l575l023l411l686l158k750l034l080k426
57968D19264k135k688k809j659l16K01N09J198J488Q48K55M00M04m42j273j331
57952D11914j407k162k598j712l12K21p5k75o2M05J164K157L120M247N922P502
$$ y = [787987, 777125, 766187, 754943, 744324, 735189, 726840, 718434, 710591, 703941, 697617, 691020, 685432, 681763, 678205, 672437, 664822, 657212, 649920, 642199, 634557, 628034, 621982, 614824, 606395, 597605, 588595, 579079, 569630, 560745, 551571, 541435, 531679, 524026, 518049, 512161, 506167, 500898, 496217, 491377, 486597, 482407, 478228, 473383, 468666, 465104, 462117, 458716, 455469, 453272, 451166, 447637, 443259, 439814, 437462, 435023, 432480, 430887, 430120, 428950, 427320, 426565, 427415, 429430, 432317, 436097, 440194, 443867, 447414, 451486, 455488, 458042, 458705, 457875, 455559, 451725, 447407, 443832, 440809, 437398, 433712, 430554, 427804, 424770, 421690, 419264, 417129, 414441, 411632, 409973, 409657, 409858, 410367, 411565, 413053, 413901, 414156, 414556, 414960, 414518, 413245, 411914, 410507, 408345, 405747, 404035, 403723, 403944, 403869, 403594, 403532, 403937, 405101, 407258, 410378, 414625, 420547, 428049]
57936D28049P822P226P385Q687R649R437R018R058Q674P254N609M312K656L07
57922E25143j816l271m947p174q787r141r287r985j0332r577q596q251p888o829
57908D19262n784n443n140m191l252l045l035k638k423k915l403l101k375j820
57894C70697j280o87n80r19o52O22J882K354K574K997L134K826K889L512L653
57879C93022K869K149K045J734Q16J67l9j132l547n533n715n070m907m738l843
57864C68278l036l099l053j897o16n19q78k01J315K500L321M433N427N357M384
57849C81716L399K608J772J158R75O55k39j169j669k230l155l761l728l952m922
57834C67458n591n043l931l058k025n84J96l10q42j91Q51J116J237K321L729M110
$$ y = [428049, 435871, 443097, 450482, 459169, 468818, 478255, 487273, 496331, 505005, 512259, 517868, 522180, 524836, 525143, 523327, 520056, 515109, 507935, 499148, 490007, 480720, 470735, 460403, 450826, 442230, 433979, 426091, 419262, 413478, 408035, 402895, 398704, 395452, 392407, 389372, 386734, 384311, 381396, 377993, 374892, 372517, 370697, 369417, 368730, 368150, 367231, 366579, 367201, 369083, 371437, 374011, 377008, 380142, 382968, 385857, 389369, 393022, 395891, 398040, 400085, 401819, 402635, 402802, 402763, 401631, 398084, 392551, 386836, 381766, 376859, 372121, 368278, 365242, 362143, 359090, 357193, 356577, 356058, 355180, 354979, 356294, 358794, 362115, 366548, 371975, 377332, 381716, 385115, 387723, 389495, 390653, 391628, 392283, 392044, 390875, 389206, 386976, 383821, 380060, 376332, 372380, 367458, 361867, 356824, 352893, 349835, 347810, 347226, 347422, 347112, 346270, 346079, 346930, 348046, 349283, 351604, 355333, 359443]
57818C59443L652L481L681L693L672L816L283J487n11j568k331l891n622o200
57804C66085n711n004l953k309j148j440k095j525k68J00k32J50J168J475R33
57789C46226O51P91M95j18N1J097J896J864J355N65l73n71N76J913J786M50n06
57772C58148o81r30j307j051m74p93j936k463j894j393j810k591k987k953k585
57757C32300j877j178q63o52j91J01j38j39Q69K051K166J619J595J711O91j003
57741C37062j458k97P71O20q4o19j205j749j490m76J06l13r50j158j332j844k307
57724C23277k342k089j699j289j376k191k748j863j1J194J271J099J034N35k65
57709C12537l76L19P31K93m37j118k023k767k339q57K23J64j98p2K34L97P66J338
$$ y = [359443, 363095, 366576, 370257, 373950, 377622, 381438, 384721, 386208, 385697, 384129, 381798, 377907, 372285, 366085, 360374, 355370, 351417, 349108, 347960, 346520, 344425, 342900, 342632, 342732, 342500, 342650, 343818, 345293, 346226, 346877, 347668, 348163, 348045, 348096, 349193, 351089, 352953, 354308, 354873, 354500, 353929, 354505, 356418, 358204, 358654, 358148, 357467, 356537, 355230, 354179, 353705, 352912, 350976, 348513, 346619, 345226, 343416, 340825, 337838, 334885, 332300, 330423, 329245, 328382, 327730, 327539, 327640, 327502, 327363, 328232, 330283, 332449, 334068, 335663, 337374, 338065, 337062, 335604, 335307, 336078, 336698, 336614, 335995, 334790, 333041, 331551, 331075, 331181, 330868, 329918, 328760, 327428, 325584, 323277, 320935, 318846, 317147, 315858, 314482, 312291, 309543, 307680, 307669, 308863, 310134, 311233, 312267, 312802, 312537, 312161, 312480, 313211, 313504, 313067, 311949, 309926, 307159, 304820, 303963, 304186, 304350, 304152, 304080, 304314, 304711, 305477, 306815]
57691C06815J405P93K64J98J09j05J93R39J047K15k17R40L191N346P041Q562J0204
57674C46940J2456J5964K0677K5822L1144L7161M3621M8611M9842M6240L8140
57663G16618K6851J4270J873j0234k2334l3173m0338m2870m2130l9728l5986l1082
57651D61737k6062k1737j7675j3343r351o650n276m591m076l316k058q47p26j728
57637C44301k511k095r77k0P06J315J388Q21M58R41J644J675J209R37Q35L98l37
57620C50688r02j212j463j559j234o07p7J10o1m65p11l47N45J352J697J753J711
57603C49218J517J303J419J770J782J215N01R1LJ45M02L64l11j232j664j643j741
57586C53139j866j327k22M81M58M93J046J490J188L38o64j639k039j178M68J350
$$ y = [306815, 308220, 309013, 309277, 309475, 309584, 309479, 309672, 310611, 311658, 311873, 311656, 312596, 315787, 321133, 328174, 336736, 346940, 359396, 375360, 396037, 421859, 453003, 490164, 533785, 582396, 632238, 678478, 716618, 743469, 757739, 759612, 749378, 727044, 693871, 653533, 610663, 568533, 528805, 492819, 461737, 435675, 413938, 396263, 382920, 373569, 366919, 361643, 357052, 352976, 349660, 347602, 346755, 346029, 344301, 341790, 339695, 338718, 338698, 339404, 340719, 342107, 342928, 343386, 344327, 345971, 347646, 348855, 349792, 350627, 351025, 350688, 349786, 348574, 347111, 345552, 344318, 343711, 343634, 343744, 343683, 343218, 342507, 342160, 342705, 344057, 345754, 347507, 349218, 350735, 352038, 353457, 355227, 357009, 358224, 358725, 358816, 358819, 358964, 359366, 359730, 359419, 358187, 356523, 354880, 353139, 351273, 349946, 349724, 350205, 350663, 351156, 352202, 353692, 354880, 355218, 354554, 352915, 350876, 349698, 350166, 351516]
57570C51516R17L53O85J309J276R15J064J600J805J594J404J361J391J610K028
57555C70828K338K565L244M415N169M823L810K857K067J379J093J167Q42j68q92
57540D05537m08P48J431J481J530J743J796J732J950K469K918L066K869K341J818
57525D33021J944K794L604L774L659L806M070M082L969M004M090M210M724N562
57511D87313N857N139M223M050M224L692K414J280P29L88j5k91l40l61m65n24
57495E17313m22j14L70P73Q24P62J175K063K712K886L372M756O367P164P053O635
57479E63689O190N752N595N813N801M998L898L462L774M049L776L178K607K200
57465F24782K074K356K911L445L793L934L947M104M637N215N116M241L438L503
$$ y = [351516, 352433, 352786, 353471, 354780, 356056, 356971, 358035, 359635, 361440, 363034, 364438, 365799, 367190, 368800, 370828, 373166, 375731, 378975, 383390, 388559, 393382, 397192, 400049, 402116, 403495, 404588, 405755, 406597, 406429, 405537, 405129, 405877, 407308, 408789, 410319, 412062, 413858, 415590, 417540, 420009, 422927, 425993, 428862, 431203, 433021, 434965, 437759, 441363, 445137, 448796, 452602, 456672, 460754, 464723, 468727, 472817, 477027, 481751, 487313, 493170, 498309, 502532, 506582, 510806, 514498, 516912, 518192, 518921, 519309, 519294, 519003, 518663, 518302, 517837, 517313, 516891, 516777, 517147, 517920, 518744, 519506, 520681, 522744, 525456, 528342, 531714, 536470, 542837, 550001, 557054, 563689, 569879, 575631, 581226, 587039, 592840, 597838, 601736, 605198, 608972, 613021, 616797, 619975, 622582, 624782, 626856, 629212, 632123, 635568, 639361, 643295, 647242, 651346, 655983, 661198, 666314, 670555, 673993, 677496]
57451F77496M279N058N411N258M733M290M465N140N599N583N633O072O440O369
57437G51826O226O351O394O019N602N604N893O208O655P199P387P079O799O803
57423H42045O664O246O173O715P155O999O810P068P284P133P327Q300R093Q804
57409I43816Q207Q494R330R528R057Q756Q732Q530Q476R224J0255J0353R495Q797
57395A071050Q758Q858Q921R420J0410J1339J2030J2729J3212J2947J2208J1854
57383A203736J1991J1943J1600J1558J1892J1911J1405J1006J1095J1341J1504
57372A330982J1777J2057J1836J1081J0415J0265J0519J1083J1975J2806J3023
57361A457819J2764J2682J2906J2992J2926J3166J3697J3990J4005J4260J4797
$$ y = [677496, 681775, 686833, 692244, 697502, 702235, 706525, 710990, 716130, 721729, 727312, 732945, 739017, 745457, 751826, 758052, 764403, 770797, 776816, 782418, 788022, 793915, 800123, 806778, 813977, 821364, 828443, 835242, 842045, 848709, 854955, 861128, 867843, 874998, 881997, 888807, 895875, 903159, 910292, 917619, 925919, 935012, 943816, 952023, 960517, 969847, 979375, 988432, 997188, 1005920, 1014450, 1022926, 1032150, 1042405, 1052758, 1062253, 1071050, 1079808, 1088666, 1097587, 1107007, 1117417, 1128756, 1140786, 1153515, 1166727, 1179674, 1191882, 1203736, 1215727, 1227670, 1239270, 1250828, 1262720, 1274631, 1286036, 1297042, 1308137, 1319478, 1330982, 1342759, 1354816, 1366652, 1377733, 1388148, 1398413, 1408932, 1420015, 1431990, 1444796, 1457819, 1470583, 1483265, 1496171, 1509163, 1522089, 1535255, 1548952, 1562942, 1576947, 1591207, 1606004]
57350A606004J5059J4947J4999J5264J5092J4402J4074J4573J5089J4723J3820
57339A768046J3454J4063J5206J6265J6861J6887J6538J6227J6230J6514J6878
57328A943169J7132J7224J7384J7944J8687J8856J8195J7554J7832J8737J9395
57317B142109J9731K0305K1062K1354K1052K0624K0200J9614J9337K0106K1541
57306B367035K2236K1660K0839K0831K1430K1949K2311K2746K3107K3077K2708
57295B609929K2305K2132K2379K3045K3653K3652K3155K2822K2987K3372K3713
57284B863144K3961K3952K3548K3185K3544K4546K5369K5576K5601K6052K7051
57273C135529K8334K9343K9363K8287K7140K7090K8025K8964K9634L0509L1381
$$ y = [1606004, 1621063, 1636010, 1651009, 1666273, 1681365, 1695767, 1709841, 1724414, 1739503, 1754226, 1768046, 1781500, 1795563, 1810769, 1827034, 1843895, 1860782, 1877320, 1893547, 1909777, 1926291, 1943169, 1960301, 1977525, 1994909, 2012853, 2031540, 2050396, 2068591, 2086145, 2103977, 2122714, 2142109, 2161840, 2182145, 2203207, 2224561, 2245613, 2266237, 2286437, 2306051, 2325388, 2345494, 2367035, 2389271, 2410931, 2431770, 2452601, 2474031, 2495980, 2518291, 2541037, 2564144, 2587221, 2609929, 2632234, 2654366, 2676745, 2699790, 2723443, 2747095, 2770250, 2793072, 2816059, 2839431, 2863144, 2887105, 2911057, 2934605, 2957790, 2981334, 3005880, 3031249, 3056825, 3082426, 3108478, 3135529, 3163863, 3193206, 3222569, 3250856, 3277996, 3305086, 3333111, 3362075, 3391709, 3422218, 3453599]
57262C453599L1260L0007K8876K8844K9372K9395K8666K7659K6797K6281K6073
57251C766829K5767K5057K4397K4493K5089K5147K4388K3618K3347K3209K3048
57240D034389K3433K4501K5423K5606K5473K5460K5277K4801K4727K5396K5916
57229D310402K5394K4272K3511K3043K2121K0689J9437J8685J8112J7460J6833
57218D539959J6370J6017J5590J4867J3885J3267J3675J4801J5577J5671J5925
57207D705604J6966J8262J9164K0020K1357K2676K3054K2555K2056K1935K1783
57196D935432K1295K0724K0409K0327K0153J9518J8310J6874J5725J4971J4461
57185E138199J4443J5413J7098J8334J8282J7051J4888J1725Q005M954L147J608
$$ y = [3453599, 3484859, 3514866, 3543742, 3572586, 3601958, 3631353, 3660019, 3687678, 3714475, 3740756, 3766829, 3792596, 3817653, 3842050, 3866543, 3891632, 3916779, 3941167, 3964785, 3988132, 4011341, 4034389, 4057822, 4082323, 4107746, 4133352, 4158825, 4184285, 4209562, 4234363, 4259090, 4284486, 4310402, 4335796, 4360068, 4383579, 4406622, 4428743, 4449432, 4468869, 4487554, 4505666, 4523126, 4539959, 4556329, 4572346, 4587936, 4602803, 4616688, 4629955, 4643630, 4658431, 4674008, 4689679, 4705604, 4722570, 4740832, 4759996, 4780016, 4801373, 4824049, 4847103, 4869658, 4891714, 4913649, 4935432, 4956727, 4977451, 4997860, 5018187, 5038340, 5057858, 5076168, 5093042, 5108767, 5123738, 5138199, 5152642, 5168055, 5185153, 5203487, 5221769, 5238820, 5253708, 5265433, 5273438, 5278392, 5281539, 5283147]
57173E283147q36l931o616q603j0431j2334j4113j5730j7177j7991j7810j7137
57161E140438j6741j6562j6036j5267j4881j4865j4526j3620j2692j2137j1711
57150D981400j1100j0376r694r083q694q817r566j0884j2882j5720j9176k2738
57138D832670k6155k9539l2895l5859l7882l8488l7569l5660l3667l1961l0011
57127D462984k7239k3948k0955j8723j7343j7009j7705j8701j9127j8955j8674
57116D244605j8014j5906j1818o421o56N130J0945J6743K2788K9862L8558M8823
57104D364639O0757P5565R5089J20503J52118J90453K36893K93069L59998M38011
57094F387095N26939O25919P33103Q45851R60843J073433J176948J263076J323574
$$ y = [5283147, 5282311, 5278380, 5271764, 5263161, 5252730, 5240396, 5226283, 5210553, 5193376, 5175385, 5157575, 5140438, 5123697, 5107135, 5091099, 5075832, 5060951, 5046086, 5031560, 5017940, 5005248, 4993111, 4981400, 4970300, 4959924, 4950230, 4941147, 4932453, 4923636, 4914070, 4903186, 4890304, 4874584, 4855408, 4832670, 4806515, 4776976, 4744081, 4708222, 4670340, 4631852, 4594283, 4558623, 4524956, 4492995, 4462984, 4435745, 4411797, 4390842, 4372119, 4354776, 4337767, 4320062, 4301361, 4282234, 4263279, 4244605, 4226591, 4210685, 4198867, 4192446, 4191790, 4196920, 4207865, 4224608, 4247396, 4277258, 4315816, 4364639, 4425396, 4500961, 4596050, 4716553, 4868671, 5059124, 5296017, 5589086, 5949084, 6387095, 6914034, 7539953, 8273056, 9118907, 10079750, 11153183, 12330131, 13593207, 14916781]
57085A4916781J352687J349566J318800J266379J192214J086429R35620P34342
57077B4152818M89831K16030p3829l67147o48349r00629j112169j278226j396987
57068A9081343j466399j486350j461627j400946j314014j210250j098619r86559
57060H656579q79095p79285o88824o07833n35403m71345m16661l71667l34708
57051C571758l03419k76230k51941k29153k07288j87207j69692j54019j39007
57042A653802j24606j11410r9432q8392p8444o9531o0795n1684m2839l4803k6722
57031H65144j7453o960M517J7194K9749L7936L7980L1002K1489J1207k638k2276
57019A006891m4713o3745p5259p9151p7281p1443o3193n4200m5955l9230l3897
$$ y = [14916781, 16269468, 17619034, 18937834, 20204213, 21396427, 22482856, 23418476, 24152818, 24642649, 24858679, 24784850, 24417703, 23769354, 22868725, 21756556, 20478330, 19081343, 17614944, 16128594, 14666967, 13266021, 11952007, 10741757, 9643138, 8656579, 7777484, 6998199, 6309375, 5701542, 5166139, 4694794, 4278133, 3906466, 3571758, 3268339, 2992109, 2740168, 2511015, 2303727, 2116520, 1946828, 1792809, 1653802, 1529196, 1417786, 1318354, 1229962, 1151518, 1081987, 1021192, 969508, 926669, 891866, 865144, 847691, 840731, 845248, 862442, 892191, 930127, 968107, 999109, 1020598, 1031805, 1029167, 1006891, 962178, 898433, 823174, 744023, 666742, 595299, 532106, 477906, 431951, 392721, 358824]
57008C58824k9374k5361k2054j9507j7203j4708j2409j0930j0113r239q001o569
56996A73356m985l324k124j743j448j94J837L572M824O495Q841J0838J1648J1637
56982B19230J1343J0436Q382N398K069j420n036q216j0154j0622j0150r414q597
56969A93249p370n430l178j449l82R90L503O673R442J1679J3889J5712J5992J4482
56955B67802J2329J0388Q031M233q73o082j0254j2844j3802j3462j2373j0838
56943B22255q758o072l095l49J775L269M670O841J0173J4088J7648K0360K2020
56930C04825K2114K0110J6141J0704M000l670j1034j6439j9383k0701k1180k0841
56918B64646j9615j7819j5772j3677j2002j1149j0686r619p634n367l417j944
$$ y = [358824, 329450, 304089, 282035, 262528, 245325, 230617, 218208, 207278, 197165, 187926, 179925, 173356, 168371, 165047, 162923, 161180, 159732, 159538, 161375, 164947, 169771, 176266, 185107, 195945, 207593, 219230, 230573, 241009, 249391, 254789, 256858, 255438, 250402, 242186, 232032, 221410, 211260, 201846, 193249, 185879, 180449, 177271, 175822, 175440, 176430, 179933, 186606, 196048, 207727, 221616, 237328, 253320, 267802, 280131, 290519, 298550, 302783, 301910, 295828, 285574, 272730, 258928, 245466, 233093, 222255, 213497, 207425, 204330, 203981, 205756, 209025, 213695, 220536, 230709, 244797, 262445, 282805, 304825, 326939, 347049, 363190, 373894, 377894, 374224, 363190, 346751, 327368, 306667, 285487, 264646, 245031, 227212, 211440, 197763, 185761, 174612, 163926, 154307, 146673, 141306, 137889, 135945]
56906A35945j153j210j576j455r93r91j232m24J772L949M886N133N847P079Q204
56891A63781R329J1141J3750J6513J8729J9910J9705J8159J5756J2804R124M706
56879C33407J05m140p903j0757j1631r947o670l459j042J061L546O703J0521J4757
56865C14551J9024K3271K7954L3295L8491M1996M2498L9444L3077K4334J4398
56854F52333M074o268j5992k3897k8956l0941l0123k6843k1756j5885r997m066
56842D41683K277R220J6919K5594L5065M4577N3393O0917O5938O6541O1681N2370
56830I36175M0465K6609J0197q658k7903m4473n6054o1950o2768n9562n3256m4757
56818E94065l5329k6259j8069j0421k911M509J2100K0495K9724L8407M4478M6534
$$ y = [135945, 134792, 133582, 132006, 130551, 129558, 128567, 127335, 126911, 128683, 132632, 137518, 142651, 148498, 155577, 163781, 173110, 184251, 198001, 214514, 233243, 253153, 272858, 291017, 306773, 319577, 328701, 333407, 333512, 329372, 321469, 310712, 299081, 289134, 282464, 279005, 277963, 279024, 282570, 289273, 299794, 314551, 333575, 356846, 384800, 418095, 456586, 498582, 541080, 580524, 613601, 637935, 652333, 656407, 650139, 634147, 610250, 581294, 550353, 520230, 493387, 471631, 455746, 445749, 441683, 443960, 453180, 470099, 495693, 530758, 575335, 628728, 689645, 755583, 822124, 883805, 936175, 976640, 1003249, 1013446, 1004788, 976885, 932412, 876358, 814408, 751640, 692078, 638822, 594065, 558736, 532477, 514408, 503987, 501076, 505585, 517685, 538180, 567904, 606311, 650789, 697323]
56806F97323M4319L8289K9234J7955M925r447k3998l6670m5676n0542n1744m9842
56794E64126m5454l9625l3436k7314k1172j5077r414m453n2M310R289J5062K0649
56781D17439K4248K4602K1822J6823J0401L134m466j2221k0148k7558l2771l4442
56769C86863l2975l0027k6895k3873k0878j8000j5397j3148j1280r759q491p495
56757A68645o865o488o031n340m510l553k476j718j802k371k342j398n19n62j096
56742A21574j313j271j409j533j210p39o71p09j25Q98J329P40k02p68r54j047
56726A12590j002n84K55J260K064K456K565K606K423J712P97N51J201J836J583
56711A32313P00Pj67R2P13J333J144l7j151j115k27N00Q13R95Q16m6q82n61P74
$$ y = [697323, 741642, 779931, 809165, 827120, 832045, 822598, 798600, 761930, 716254, 665712, 613968, 564126, 518672, 479047, 445611, 418297, 397125, 382048, 372634, 368181, 368129, 372439, 381728, 396790, 417439, 441687, 466289, 488111, 504934, 515335, 518469, 514003, 501782, 481634, 454076, 421305, 386863, 353888, 323861, 296966, 273093, 252215, 234215, 218818, 205670, 194390, 184631, 176140, 168645, 161780, 155292, 149261, 143921, 139411, 135858, 133382, 131664, 129862, 127491, 125149, 123751, 123232, 122670, 121574, 120261, 118990, 117581, 116048, 114838, 114099, 113428, 112719, 112594, 113492, 114821, 115561, 115359, 114591, 113637, 112590, 111588, 111004, 111259, 112519, 114583, 117039, 119604, 122210, 124633, 126345, 127142, 127693, 128894, 130730, 132313, 133013, 133020, 132853, 132945, 133658, 134991, 136135, 136098, 134947, 133832, 133605, 134105, 134918, 135913, 136729, 136683, 135801, 135240, 136014]
56692A36014J864K118K092K173J977J364Q74Q31R16R07R96J138R61N22L33L54
56676A55434l6q97j469j482j684k608l694m260m451m590m362l425k253j602j460
56661A17161j210m61P36K166L413L931L646L161K932K675K115J770K252L087L098
56646A50472J948O35L32J168K345L011K919K444K119K055J887J396R28R25J235
56631A75819J341J102Q36O42J69p17j551j855j817j992k439k643k302j776j605
56616A61212j865k197k261j894j075l8O71O13q7q54j241j165p66k74P4K92O90
56599A49835J348J753J438P60M36M54J83m39p31l91P4L26O69J107Q59m51j877
56582A55353k188j314q6R25J595J840J786J987K637L009K443J500J263J806K317
$$ y = [136014, 137878, 139996, 142088, 144261, 146238, 147602, 148476, 149307, 150223, 151130, 152126, 153264, 154225, 154747, 155080, 155434, 155398, 154501, 153032, 151550, 149866, 147258, 143564, 139304, 134853, 130263, 125901, 122476, 120223, 118621, 117161, 115951, 115490, 116226, 118392, 121805, 125736, 129382, 132543, 135475, 138150, 140265, 142035, 144287, 147374, 150472, 152420, 153055, 153387, 154555, 156900, 159911, 162830, 165274, 167393, 169448, 171335, 172731, 173659, 174584, 175819, 177160, 178262, 179098, 179740, 179909, 179192, 177641, 175786, 173969, 171977, 169538, 166895, 164593, 162817, 161212, 159347, 157150, 154889, 152995, 151920, 151882, 152553, 153166, 153079, 152225, 150984, 149819, 149053, 148779, 148853, 149145, 149835, 151183, 152936, 154374, 155134, 155570, 156024, 156207, 155768, 155037, 154646, 154720, 155046, 155715, 156822, 157681, 157230, 155353, 153165, 151851, 151765, 152690, 154285, 156125, 157911, 159898, 162535, 165544, 167987, 169487, 170750, 172556, 174873]
56567A74873K489K820L632M730O080P896R895J1307J1816J1897J2011J1997J1403
56554B82846J0000P916N634L798K675J950J363J147J373J303K78j132j814j709
56540C15628j798k566l535m316n137o064o638o648o512o498o236n394m326l747
56526B46213l966m693n222m897l714k438j785j706j819k180k903l480l304k718
56512B01388k544k733k456j496n32J4L67N41J74n27p11j45L82K67j40l85o30r91
56494A89843j055o36l08n84j078j062m25M11J000J017L35o08j005o38k46n85j478
56477A82898k100j850p78N46J357J327R00P78J093J516J950K437K590J996J080
56462A95740P04Q41O42p6n04k04K32K76K21L58L48n5m61n19m43l75m1N37P86N23
$$ y = [174873, 177362, 180182, 183814, 188544, 194624, 202520, 212415, 223722, 235538, 247435, 259446, 271443, 282846, 292846, 300762, 306396, 310194, 312869, 314819, 316182, 317329, 318702, 320005, 320283, 319151, 317337, 315628, 313830, 311264, 307729, 303413, 298276, 292212, 285574, 278926, 272414, 265916, 259680, 254286, 249960, 246213, 242247, 237554, 232332, 227435, 223721, 221283, 219498, 217792, 215973, 213793, 210890, 207410, 204106, 201388, 198844, 196111, 193655, 192159, 191627, 191641, 192008, 192549, 192723, 192196, 191485, 191340, 191722, 191989, 191849, 191464, 190834, 189843, 188788, 188152, 187844, 187260, 186182, 185120, 184695, 185106, 186106, 187123, 187458, 186850, 185845, 185207, 184961, 184376, 182898, 180798, 178948, 178170, 178716, 180073, 181400, 182300, 183078, 184171, 185687, 187637, 190074, 192664, 194660, 195740, 196444, 197285, 197927, 197851, 197347, 197143, 197375, 197651, 197872, 198230, 198578, 198523, 198062, 197543, 197100, 196725, 196684, 197221, 198007, 198530]
56442A98530L85P65J111Q41K83P1K29L80L25j3o12r96n51M64J026P80N19Q27J280
56423B05644J443J588J772J324Q6q81p31n0K94N46J155J476P46k74j72R36J532
56406B16434R09%j63K27L24k07r04j069m67L80P18N05L62N33N18R7j07M49J405
56387B19944K181K735L067K691J412jo82n86LJ056K185K350J223M5K8O87R06Q84
56369B40128J604K926L733L668L284K678J400k59j274j296r29n56MN44L96m41
56353B55610j224j637k035k346j900o70L78O98R11J587K196J958J109N72P81J430
56337B57418K107K663L088L410L692L914L943L714L343L064L093L485L998M242
56323C05174M087L743L319K604J484L13m19n00P0J052J675R92q77k425k335r85
$$ y = [198530, 198915, 199680, 200791, 201632, 201915, 201986, 202215, 202595, 202920, 202907, 202295, 201299, 200748, 201212, 202238, 203018, 203537, 204364, 205644, 207087, 208675, 210447, 211771, 211857, 210976, 210245, 210195, 210489, 211035, 212190, 213666, 214412, 214138, 213966, 214902, 216434, 217343, 217343, 217180, 217407, 217731, 217524, 216620, 215551, 215084, 215464, 216182, 216687, 217049, 217582, 218100, 218197, 218090, 218539, 219944, 222125, 224860, 227927, 230618, 232030, 232029, 231347, 230761, 230764, 231820, 234005, 236355, 237578, 237623, 237651, 238338, 239244, 240128, 241732, 244658, 248391, 252059, 255343, 258021, 259421, 259162, 257888, 256592, 255663, 255107, 255111, 255655, 256051, 255610, 254386, 252749, 250714, 248368, 246468, 245798, 246176, 246874, 247785, 249372, 251568, 253526, 254635, 255207, 255988, 257418, 259525, 262188, 265276, 268686, 272378, 276292, 280235, 283949, 287292, 290356, 293449, 296934, 300932, 305174, 309261, 313004, 316323, 318927, 320411, 320724, 320305, 319805, 319875, 320927, 322602, 323594, 322717, 320292, 317957, 316972]
56307C16972K03N36M68N65Q81J313J948K908M109N140N322M342L016K787M013
56292C54523N378N546M725L932L457K928K460K651L602M730N485N684N479N432
56278D16012O248P905R493J0476J1388J2683J3710J3774J3451J3753J4602J5275
56266E58770J5866J6987J8403J9346K0029K1547K4248K7354L0246L3164L6543
56255H22503M0633M5697N1741N8123O4308P0879P8780Q7679R6113J03312J09834
56244A629602J16338J22561J27629J30623J30776J27837J22225J14231J03260
56235B725082Q8682P1136N2125L2421J1876r323l0094m9256o6145q0425r1971
56224B654108j00976j07701j12145j14355j14677j13349j10338j06017j01176
$$ y = [316972, 317175, 317711, 318179, 318744, 319625, 320938, 322886, 325794, 329903, 335043, 340365, 344707, 347723, 350510, 354523, 359901, 365447, 370172, 374104, 377561, 380489, 382949, 385600, 389202, 393932, 399417, 405101, 410580, 416012, 422260, 430165, 439658, 450134, 461522, 474205, 487915, 501689, 515140, 528893, 543495, 558770, 574636, 591623, 610026, 629372, 649401, 670948, 695196, 722550, 752796, 785960, 822503, 863136, 908833, 960574, 1018697, 1083005, 1153884, 1232664, 1320343, 1416456, 1519768, 1629602, 1745940, 1868501, 1996130, 2126753, 2257529, 2385366, 2507591, 2621822, 2725082, 2813764, 2884900, 2937025, 2969446, 2981322, 2971999, 2941905, 2892649, 2826504, 2746079, 2654108, 2553132, 2445431, 2333286, 2218931, 2104254, 1990905, 1880567, 1774550, 1673374]
56215A673374r5915q9505q2099p5393p0487o6262o1193n5615n0671m6186m1443
56204I38605l7112l4290l2308k9714k6837k5099k4116k1992j8545j5711j4411
56193F58470j3347j1500r641q588p868o937o103n429m298k766j901k150k682k837
56179E72423k821k545j384L79J409J268J086J643K235K187K055K547L410M133
56165E88025M701N142N297N382N805O330O553P100Q827J0915J1599J0912J0725
56152F87313J1838J3107J3996J5713J8942K2550K5698K9373L4625M0969M7718
56141I61842N5335O4229P3462Q1754Q8527R3160R4648R2959Q9243Q3953P6350
56130A855462O6747N7457N0203M4228L8216L2507K7842K3336J7427J0003K173
$$ y = [1673374, 1577459, 1487954, 1405855, 1330462, 1259975, 1193713, 1132520, 1076905, 1026234, 980048, 938605, 901493, 867203, 834895, 805181, 778344, 753245, 729129, 707137, 688592, 672881, 658470, 645123, 633623, 623982, 615394, 607526, 600589, 594486, 589057, 584759, 581993, 580092, 577942, 575260, 572423, 569602, 567057, 565673, 566052, 567461, 568729, 569815, 571458, 573693, 575880, 577935, 580482, 583892, 588025, 592726, 597868, 603165, 608547, 614352, 620682, 627235, 634335, 643162, 654077, 665676, 676588, 687313, 699151, 712258, 726254, 741967, 760909, 783459, 809157, 838530, 873155, 914124, 961842, 1017177, 1081406, 1154868, 1236622, 1325149, 1418309, 1512957, 1605916, 1695159, 1779112, 1855462, 1922209, 1979666, 2029869, 2074097, 2112313, 2144820, 2172662, 2195998, 2213425, 2223428, 2225601]
56119B225601n331j2408j9030k5457l2416m0295m8828n7806o7049p5332q0808
56108A760841q2922q2538p9825p3937o5358n6519m9016m2119l5031k8736k4191
56097A140649k0490j6410j2333r193o783m479k411p64Q76K529L413L455L740M657
56083A086456N230N198N828P658R315R812J0137J1226J2235J2311J2307J3194
56071A200907J4383J5067J5662J6509J6807J6166J5666J6134J6982J7775J9042
56060A381100K0589K1128K0728K1228K3042K4120K3536K3249K4524K5474K4379
56049A633097K2748K2582K3159K3073K3106K4401K5975K6634K7389K9317L1089
56038A912570L1254L1033L2335L4746L7016L9498M2705M5414M6720M7983N0412
$$ y = [2225601, 2220270, 2207862, 2188832, 2163375, 2130959, 2090664, 2041836, 1984030, 1916981, 1841649, 1760841, 1677919, 1595381, 1515556, 1441619, 1376261, 1319742, 1270726, 1228607, 1193576, 1164840, 1140649, 1120159, 1103749, 1091416, 1082223, 1075440, 1070961, 1068550, 1067786, 1068662, 1071191, 1074604, 1078059, 1081799, 1086456, 1091686, 1096884, 1102712, 1110370, 1119685, 1129497, 1139634, 1150860, 1163095, 1175406, 1187713, 1200907, 1215290, 1230357, 1246019, 1262528, 1279335, 1295501, 1311167, 1327301, 1344283, 1362058, 1381100, 1401689, 1422817, 1443545, 1464773, 1487815, 1511935, 1535471, 1558720, 1583244, 1608718, 1633097, 1655845, 1678427, 1701586, 1724659, 1747765, 1772166, 1798141, 1824775, 1852164, 1881481, 1912570, 1943824, 1974857, 2007192, 2041938, 2078954, 2118452, 2161157, 2206571, 2253291, 2301274, 2351686]
56027B351686N2875N4397N6344N9631O2351O3024O3500O5757O8416O9508P0078
56016C037567P1871P4068P5606P8056Q2794Q7956R1636R5366J01004J06996J11459
56005D014379J15997J22633J29872J35755J41824J50030J58800J66256J74150
55996E309696J84360J94904K03811K13449K26397K40737K54156K68752K86802
55987G383064L06037L24377L44824L70049L97041M23094M51992M87736N27694
55978A1015908N68933O15451O71352P33142P97283Q69140R55262J053702J161969
55969A8442142J287499J439220J616296J817432K053835K340322K682497L087574
55961C4766817L579174M186023M925852N817374O896876Q205664R778159J1665618
$$ y = [2351686, 2404561, 2458958, 2515302, 2574933, 2637284, 2700308, 2763808, 2829565, 2897981, 2967489, 3037567, 3109438, 3183506, 3259112, 3337168, 3419962, 3507918, 3599554, 3694920, 3795924, 3902920, 4014379, 4130376, 4253009, 4382881, 4518636, 4660460, 4810490, 4969290, 5135546, 5309696, 5494056, 5688960, 5892771, 6106220, 6332617, 6573354, 6827510, 7096262, 7383064, 7689101, 8013478, 8358302, 8728351, 9125392, 9548486, 10000478, 10488214, 11015908, 11584841, 12200292, 12871644, 13604786, 14402069, 15271209, 16226471, 17280173, 18442142, 19729641, 21168861, 22785157, 24602589, 26656424, 28996746, 31679243, 34766817, 38345991, 42532014, 47457866, 53275240, 60172116, 68377780, 78155939, 89821557]
55953H9821557J3951330J6708240J9944840K3576700K7334567L0580969L2297932
55946B54216135L1522594K7977992K2224869J5100206P081209j675269j0744834
55939C45702902j9123443k5622133k9522150l0837257l0087667k7950984k5054950
55932A57504318k1894066j8797398j5947208j3433504j1289621r499554q015987
55925E8626980o791584n788186m964652m278279l700650l217604k813622k469438
55917B4602965k173557j922181j707655j518595j350727j206162j082302r71674
55909A2670112q72073p86622p14130o48719n88849n37716m94805m55369m18169
55900G153660l85866l57828l30104l02576k78990k59771k41466k23263k07608
$$ y = [89821557, 103772887, 120481127, 140425967, 164002667, 191337234, 221918203, 254216135, 285738729, 313716721, 335941590, 351041796, 358123005, 356447736, 345702902, 326579459, 300957326, 271435176, 240597919, 210510252, 182559268, 157504318, 135610252, 116812854, 100865646, 87432142, 76142521, 66642967, 58626980, 51835396, 46047210, 41082558, 36804279, 33103629, 29886025, 27072403, 24602965, 22429408, 20507227, 18799572, 17280977, 15930250, 14724088, 13641786, 12670112, 11798039, 11011417, 10297287, 9648568, 9059719, 8522003, 8027198, 7571829, 7153660, 6767794, 6409966, 6079862, 5777286, 5498296, 5238525, 4997059, 4773796, 4566188]
55891D566188j94336j80474j65971j53723j43810j33415j22468j13914j08204
55882C249873j02805r7272r3798r2573r1355q9612q8622q7690q4900q1251p9384
55871B260611p8523p5456p0309o6554o5172o3535o0280n6846n3760m9761m5015
55860A575400m1237l8299l4534l0510k8543k8411k7532k5641k5126k6451k7233
55849A241883k6479k5862k6145k6038k5313k5428k6355k6186k4650k3710k3865
55838I61852k3191k0839j8418j7030j5848j4432j3626j3413j2574j1126j0486
55827G90869j0768j0556r736r797j0921j1574j1409j1726j2655j2757j1915j1675
55815F55380j2170j1683r899q681q759q577p303o191n971n532m288l224k592j121
$$ y = [4566188, 4371852, 4191378, 4025407, 3871684, 3727874, 3594459, 3471991, 3358077, 3249873, 3147068, 3049796, 2955998, 2863425, 2772070, 2682458, 2593836, 2506146, 2421246, 2339995, 2260611, 2182088, 2106632, 2036323, 1969769, 1904597, 1841062, 1780782, 1723936, 1670176, 1620415, 1575400, 1534163, 1495864, 1461330, 1430820, 1402277, 1373866, 1346334, 1320693, 1295567, 1269116, 1241883, 1215404, 1189542, 1163397, 1137359, 1112046, 1086618, 1060263, 1034077, 1009427, 985717, 961852, 938661, 917822, 899404, 882374, 866526, 852094, 838468, 825055, 812481, 801355, 790869, 780101, 769545, 759809, 750012, 739091, 727517, 716108, 704382, 691727, 678970, 667055, 655380, 643210, 631527, 621628, 612947, 604188, 595611, 588308, 582117, 576146, 570614, 566326, 563102, 560510, 559389]
55801E59389J405L241L447L236L478L234J846L20m99r87j194l86R28R23o55j831
55785E75895j665j811l560n734o962p887r521j1330j2511j3422j4268j4020j2085
55772D61119r539p505n735l956k976l213l670l554l479l997m487m654n446p213
55758C91695q474p905o202m729l638k588k005k209k441k010j468j582k157k796
55744C41491l688m713m982m198l365l232l290l108l235l862l993l127k339k509
55730B91850k823k341j796k342l637m527m778m790m418l465k576k434k596k188
55716B47139j232l62J39L01J35N0P10J892K481K218K280L272L933K915O79j460
55700B65090l137m549n339n274n195n935o881o790n572m190l278k776k509k212
$$ y = [559389, 560794, 564035, 567482, 570718, 574196, 577430, 579276, 579596, 579097, 578110, 576916, 576530, 577458, 578381, 577726, 575895, 574230, 572419, 568859, 563125, 556163, 548276, 538755, 527425, 514914, 501492, 487224, 473204, 461119, 451580, 444075, 438340, 434384, 431408, 428195, 424525, 420971, 417492, 413495, 409008, 404354, 398908, 391695, 383221, 375316, 369114, 364385, 360747, 358159, 356154, 353945, 351504, 349494, 348026, 346444, 344287, 341491, 337803, 333090, 328108, 323910, 320545, 317313, 314023, 310915, 307680, 303818, 299825, 296698, 294359, 291850, 289027, 286686, 284890, 282548, 278911, 274384, 269606, 264816, 260398, 256933, 254357, 251923, 249327, 247139, 245907, 245545, 245684, 245985, 246120, 246170, 246880, 248772, 251253, 253471, 255751, 259023, 262956, 265871, 266550, 265090, 261953, 257404, 252065, 246791, 241596, 235661, 228780, 221990, 216418, 212228, 208950, 206174, 203665, 201453]
55686B01453j478l02Q13J730K845L977M203L371K590K537K501J896J335J199O66
55671B29336o78j674j432r52j354j800r89M28R05N28N07Q39O21J76O88J953K476
55654B29578J841J135R02N54l4r8M30N03l07j072j035o81p10j087j621k498l631
55637B22169m344m308m157m610n536o215o122n182l771k606k197k263k163j845
55623A66850j811k137k255j788j032m14q8j80q30j721k116j663p79j19N9j76p11
55606A49089j310j626j559j444j656k084k248j932j517j496j763j684j040m43
55592A27287m54o77l59L59O37K62p9N0K85L46N08Q62R35N74M13R68J845K428K644
55573A38834K718K747K968L730M725N048M445L682L182K322P53o53j150j395k322
$$ y = [201453, 199975, 199673, 200486, 202216, 205061, 209038, 213241, 216612, 219202, 221739, 224240, 226136, 227471, 228670, 229336, 228658, 226984, 225552, 224600, 223246, 221446, 220457, 220885, 221790, 222318, 222825, 223664, 224285, 224461, 225149, 227102, 229578, 231419, 232554, 233456, 234010, 233976, 233878, 234308, 234811, 234504, 233432, 232397, 231716, 231006, 229919, 228298, 225800, 222169, 217825, 213517, 209360, 204750, 199214, 192999, 186877, 181695, 177924, 175318, 173121, 170858, 168695, 166850, 165039, 162902, 160647, 158859, 157827, 157413, 157325, 157145, 156315, 154594, 152478, 150815, 150036, 149917, 149976, 149800, 149089, 147779, 146153, 144594, 143150, 141494, 139410, 137162, 135230, 133713, 132217, 130454, 128770, 127730, 127287, 126833, 126156, 125797, 126156, 126793, 127055, 126976, 127026, 127311, 127657, 128165, 129027, 129962, 130536, 130949, 131917, 133762, 136190, 138834, 141552, 144299, 147267, 150997, 155722, 160770, 165215, 168897, 172079, 174401, 175154, 174501, 173351, 171956, 169634]
55558A69634l498l882l537l364l492l217k333j408q96q08j105j611j754j164k70
55543A37295L90J005J857K336J631K6j406k158k432k285j695j210j499k307k769
55528A26779k629k313k015j655j471j726j993j705j214j280j776j929j682j625
55514A01766j643r84K23Q00K16o82j007r22q95q29n20k16j87k08L4M43P22P61
55496I6872N92L51L34O59Q90M51n32j365j726j914k195k500k806l203l507l390
55480G7011k952k584k245j513m00N15R28J179J570J900J846J402P63J73p1R8K54
55463G7874k1m56l88K64Q98J090J039J022J025R79R55R59R23R32J089J211J003
55446I0398M96Mk38j34K47M69l1j027j369m89N80N31l66q10n07l79q29j137p84
$$ y = [169634, 166136, 162254, 158717, 155353, 151861, 148644, 146311, 144903, 144007, 143199, 142094, 140483, 138729, 137565, 137295, 137685, 138690, 140547, 142883, 144514, 144540, 143134, 140976, 138544, 136259, 134564, 133354, 131855, 129548, 126779, 124150, 121837, 119822, 118167, 116696, 114970, 112977, 111272, 110058, 108778, 107002, 105073, 103391, 101766, 100123, 99139, 99362, 100162, 100378, 99696, 98689, 97767, 96872, 96043, 95523, 95307, 95120, 94912, 94946, 95389, 96111, 96872, 97464, 97815, 98149, 98808, 99698, 100149, 99617, 98252, 96526, 94612, 92417, 89917, 87111, 83908, 80401, 77011, 74059, 71475, 69230, 67717, 67317, 67832, 68760, 69939, 71509, 73409, 75255, 76657, 77420, 77593, 77522, 77620, 77874, 77853, 77397, 77009, 77273, 78171, 79261, 80300, 81322, 82347, 83326, 84281, 85240, 86163, 87095, 88184, 89395, 90398, 90894, 90898, 90660, 90526, 90773, 91242, 91211, 90184, 88815, 88326, 88906, 89437, 89071, 88261, 87754, 87375, 86546, 85409, 84625]
55427H4625k37KJ41M42P09Q13J043J482J703J455J099R70Q59M68j00n77q54q22
55409I3221l41L74P60M73k76j017j302q93j06J76n62j614j816j039k05O4j4j80
55391H5703m99p71m60M71J335J543J080Q4j206k019j540j61O79L06l86m25j42
55374H3592l63r87j185o40K33J037J725K234K309J804R28J48j69j12j02k79k59
55357H9914K16P21P18L92K34O4o41j607j888j163j00O86J126J100L37p98j308
55340H8003p96O0N66P78Q92O77Kp38j127j151q51k17L72K97l57p60n32k02k03
55321H4713k18Q8M48N27M28K99J48K79J005J656J047o38j579p89L54P1j268j860
55303H4711j082l9K82P2j00j70l44o21p70n50O5P23J022J085J392J914J939J154
$$ y = [84625, 84388, 84390, 84531, 84973, 85682, 86495, 87538, 89020, 90723, 92178, 93277, 94247, 95106, 95574, 95474, 94897, 94043, 93221, 92880, 93254, 94014, 94487, 94211, 93194, 91892, 90999, 90893, 91069, 90507, 88893, 87077, 86038, 85833, 85897, 85883, 85703, 85204, 84433, 83973, 84444, 85779, 87322, 88402, 88486, 87280, 85261, 83721, 83560, 84239, 84545, 84159, 83734, 83592, 83229, 82242, 81057, 80417, 80650, 81687, 83412, 85646, 87955, 89759, 90687, 90835, 90666, 90554, 90452, 90173, 89914, 90130, 90851, 91569, 91961, 92195, 92259, 91618, 90011, 88123, 86960, 86860, 87546, 88672, 89772, 90109, 89311, 88003, 87207, 87267, 87833, 88611, 89503, 90180, 90182, 89444, 88317, 87166, 86315, 86098, 86470, 86767, 86410, 85650, 85118, 84916, 84713, 84495, 84583, 85031, 85558, 85986, 86285, 86433, 86712, 87717, 89373, 90420, 89782, 88203, 87414, 87768, 87839, 86571, 84711, 83629, 83590, 83872, 83944, 83844, 83674, 83330, 82709, 81939, 81389, 81454, 82177, 83199, 84284, 85676, 87590, 89529, 90683]
55285I0683K21j17P3L72O65P74K15r40j574p63Q54J769J344J91q36j234q74j00
55267I0723L11K3l52j62K14J4n61n90J51Q94J054Q61P14N76K60j27k96q5L69O24
55247I4615K67m74p94l88p2p21j881k203j240PM45J51p8L3l6o64j337j113J52
55228H4669J365J271j54j687k191j562m46M89Q70P66O68R55J257Q70j27p94n56
55211H5663J11N08N18L75K10J95N35J002J066P49N67M96j21j244j776j117j36
55194H7601J11k50n85p80p65r2J047J345J76j007n46R09J316K48p44o03J9K08
55176H7608lk26l52k06M90J445J906J640J134P84N70N19O72O39R5l81M8J050J404
55157I8836Q07L10N90J016P87J21l14l44j41K66P10P31J38o00r22p83m55j85j45
$$ y = [90683, 90904, 90787, 90860, 91232, 91897, 92671, 92886, 91946, 90372, 89609, 90463, 92232, 93576, 93767, 92931, 91697, 90823, 90723, 91034, 91057, 90705, 90543, 90757, 90771, 90210, 89620, 89771, 90665, 91719, 92580, 93294, 93870, 94130, 94003, 93707, 93622, 93991, 94615, 94882, 94408, 93614, 93226, 93154, 92433, 90552, 88349, 87109, 87116, 87561, 87712, 87634, 87667, 87631, 86967, 85630, 84517, 84669, 86034, 87305, 87151, 85464, 83273, 81711, 81265, 81754, 82624, 83390, 84058, 85013, 86270, 87140, 87013, 86219, 85663, 85774, 86282, 86800, 87175, 87385, 87580, 88115, 89117, 90183, 90932, 91499, 91995, 91874, 90630, 88854, 87737, 87601, 87712, 87462, 86877, 86097, 85332, 85240, 86287, 87632, 87808, 86801, 86255, 87164, 88480, 88728, 87984, 87381, 87400, 87608, 87605, 87379, 87027, 86821, 87311, 88756, 90662, 92302, 93436, 94220, 94790, 95309, 95981, 96620, 96715, 96334, 96382, 97432, 98836, 99643, 99953, 100543, 101559, 102346, 102467, 102153, 101809, 101668, 101934, 102644, 103375, 103513, 102913, 101991, 101208, 100753, 100568, 100423]
55138A00423l59n31m12l55q85j619j448m1J452J728P92k42m81oM72L92p0k11L03
55119I8902R09Q92L61q5l80q81j362j111j43N70M12j69n19n74m40N3Q44J396J405
55100A00080J208J032N08n14j303j150m46j14k60j84M10R57R20N07K58K69J74
55083A02352j71l67L1Q17J308J235J027R99P87Q4n36l12M22O12qo34p95r67j457
55064A04427j670j097k51R4P5L68R83J268R63N66N67Q48R37N86n2o65j079j321
55046A05547j428j346j125j048j231j292q47j80Q5m0O5N76Q86O09K14K61N40N19
55028A00765K16O0J84L48M44N90Q09R51Q83N42j48j099j888j995j272r0R21J307
55010A01528J108P97Q21J133J346J220P93J86l77m58K13J164J436O36n60j127
$$ y = [100423, 100064, 99533, 99121, 98766, 97881, 96262, 94814, 94773, 96225, 97953, 98745, 98503, 98022, 98016, 98488, 98880, 98810, 98599, 98902, 99811, 100703, 101064, 100979, 100599, 99718, 98356, 97245, 97102, 97672, 98084, 97915, 97396, 96822, 96382, 96435, 97279, 98675, 100080, 101288, 102320, 102828, 102314, 101011, 99861, 99415, 99301, 99041, 98857, 99267, 100224, 101144, 101651, 101909, 102178, 102352, 102181, 101814, 101845, 102662, 103970, 105205, 106232, 107231, 108018, 108102, 107566, 107254, 107676, 108288, 108280, 107646, 106851, 105884, 104427, 102757, 101660, 101409, 101503, 101578, 101946, 102929, 104197, 105160, 105726, 106293, 107141, 108078, 108664, 108612, 107947, 106868, 105547, 104119, 102773, 101648, 100600, 99369, 98077, 97230, 97050, 97135, 97095, 97160, 97736, 98622, 99231, 99445, 99706, 100246, 100765, 100981, 101041, 101225, 101573, 102017, 102607, 103416, 104367, 105250, 105792, 105644, 104545, 102657, 100662, 99390, 99300, 100221, 101528, 102636, 103433, 104254, 105387, 106733, 107953, 108746, 108932, 108555, 108097, 108310, 109474, 110910, 111546, 110986, 109859]
54994A09859p21J25N67K39m07n82j67O3m45j028o74M22J052P04K03K91N85L98
54976A10484r6k23J67O35Q20O83L63J61M40J129J662J691J515J470J269M83n94
54959A22059j127p66p8J59k20p49r73r31r54j059q84l02K59M20M09N76O80L44
54941A16863j11j23Ln00j365j334l5J269J407P34K36Q1n4O9R20K124K684K207
54923A25075J280P11Q94J799L073M243N078N551N385M142K175Q07R85K100K806
54908A66104K571J761N87j158l298n016n601n125m302l913m249m809m679l477
54894A25396j774m13K71M02J48k37l79j94m8j05L6O93J522K051K321K519K449
54877A34658K005J648J749J896J669J633K588M139N073M995M553M001K706L95
$$ y = [109859, 109138, 109263, 109830, 110069, 109662, 109080, 108913, 108976, 108531, 107503, 106829, 107251, 108303, 109007, 109210, 109501, 110086, 110484, 110388, 110165, 110332, 110967, 111787, 112470, 112833, 112994, 113434, 114563, 116225, 117916, 119431, 120901, 122170, 122653, 122059, 120932, 120166, 120088, 120247, 120027, 119278, 118305, 117374, 116420, 115361, 114477, 114175, 114434, 114854, 115263, 115839, 116519, 116863, 116752, 116629, 116632, 116132, 114767, 113433, 113398, 114667, 116074, 116808, 117044, 117125, 117071, 117140, 118060, 120184, 122868, 125075, 126355, 127066, 127960, 129759, 132832, 137075, 142153, 147704, 153089, 157231, 159406, 160213, 161198, 163298, 166104, 168675, 170436, 171023, 169865, 166567, 161551, 155950, 150825, 146523, 142610, 138361, 133552, 128873, 125396, 123622, 123209, 123480, 123882, 124030, 123793, 123414, 123220, 123172, 123067, 123103, 123796, 125318, 127369, 129690, 132209, 134658, 136663, 138311, 140060, 141956, 143625, 145258, 147846, 151985, 157058, 162053, 166606, 170607, 173313, 173708]
54863A73708k093l746m479m800m962m831m324l568k881k590k670k598j980j245
54849A26941j148j682k073j926j647j565j379q57m16m51o17l17L89Q94Q38L34
54833A15318l80j033j179n75K86N03j69r15q58j01N30O52P00J064J352R24j38
54816A15981j045j300j152j055j100j093q33j29J037K201K632K147J369R54Q79
54801A19493P22L25j17l14l1P11J365J292O05J09J47J67k08m53j03L09J34k81
54783A23872k67q9m35r96q34K8O13O23P98J391J536P13k14r0J055K320L132L558
54765A36714L826M068M293M257L730L107L216M177M936M451K896J239Rr73j954
54750A77992k878l598l994l970l581l100k720k333j856j519j571j872k088k158
$$ y = [173708, 171615, 167869, 163390, 158590, 153628, 148797, 144473, 140905, 138024, 135434, 132764, 130166, 128186, 126941, 125793, 124111, 122038, 120112, 118465, 116900, 115521, 114664, 114248, 113797, 113180, 112863, 113252, 114146, 114984, 115318, 114938, 113905, 112726, 112151, 112437, 112940, 112771, 111856, 110998, 110897, 111427, 112079, 112779, 113843, 115195, 116119, 115981, 114936, 113636, 112484, 111429, 110329, 109236, 108403, 108274, 109311, 111512, 114144, 116291, 117660, 118614, 119493, 120215, 120540, 120423, 120109, 120078, 120789, 122154, 123446, 124051, 124160, 124307, 124474, 124266, 123813, 123710, 124019, 124153, 123872, 123605, 123516, 123081, 122085, 121251, 121279, 121892, 122515, 123313, 124704, 126240, 126953, 126739, 126649, 127704, 130024, 133156, 136714, 140540, 144608, 148901, 153158, 156888, 159995, 163211, 167388, 172324, 176775, 179671, 180910, 180919, 179946, 177992, 175114, 171516, 167522, 163552, 159971, 156871, 154151, 151818, 149962, 148443, 146872, 145000, 142912, 140754]
54736A40754k271k456k480k160j497o30K31Q06Q98O13L61N89J397K342K792K603
54720A41892K383K741L464L823L633L423L521L512K941J992J083J93r12k045k764
54705A68880l035l332l952m634m884m475l604k708k138j824j339m35N07Q03K17
54690A34047p67j487j676j543j402j378j350j157q16n84o92j008j085o13K34R29
54674A19652J073O58j8n58n83N1R43J311Q10N8q0L35L80m07j344j538r44o7Q64
54655A20596J755K103J434K05n34m34j21n6L2L67M86J4n47m34K78Q05P01K20l12
54636A26558q72j419j643j295n28K40O87P11M12M7j94l99p32j010p08L62J570
54619A21787J985J349K93m01m92k43j8r2n49j097j204p46k61k22k76K83J338J919
$$ y = [140754, 138483, 136027, 133547, 131387, 129890, 129260, 129491, 130297, 131195, 131808, 132169, 132758, 134155, 136497, 139289, 141892, 144275, 147016, 150480, 154303, 157936, 161359, 164880, 168392, 171333, 173325, 174408, 174601, 173689, 171644, 168880, 165845, 162513, 158561, 153927, 149043, 144568, 140964, 138256, 136118, 134294, 132955, 132520, 133027, 133830, 134047, 133280, 131793, 130117, 128574, 127172, 125794, 124444, 123287, 122471, 121887, 121195, 120187, 119102, 118489, 118723, 119652, 120725, 121383, 121365, 120807, 120224, 120275, 121218, 122529, 123339, 123397, 123317, 123652, 124032, 123625, 122281, 120743, 119799, 119732, 120596, 122351, 124454, 125888, 126093, 125559, 125125, 125004, 124948, 124980, 125347, 125833, 125847, 125300, 124866, 125144, 125949, 126650, 126870, 126558, 125686, 124267, 122624, 121329, 120801, 121041, 121728, 122439, 122851, 122898, 122704, 122305, 121573, 120563, 119855, 120217, 121787, 123772, 125121, 125414, 125013, 124521, 124278, 124260, 124168, 123619, 122522, 121318, 120572, 120311, 120089, 119813, 120096, 121434, 123353]
54601A23353J474N86O8r7m62j085j401j028k26N06Q96Q75L69o10j665k051j302
54584A18200R2J014R53O17Q57J347J117K05k23M19J278J384R15M71l3q74j524
54567A26215j202j36O98R20J006J276J438J209P61M35M13O37P10J17r82j555r08
54550A31052K07N21nk77K61J042J475J660J753J546J039P07Q63J198J278J009
54534A45329N16K5p8L90R23Q10J41l13l22m72j079j565j352o85j62L3N0j6q3j9
54514A42071J39J83L7j84m60p35o63p3M10Or80j401q67k51l42r02j341j470j275
54495A31902o57J04M21K43J71M15M71K10K33P43J004O02K28M61O81J55o61q96
54477A35830o25m26j81N24J253J242P82R21J820K507K277J455O05j61q26j094
$$ y = [123353, 124827, 125413, 125481, 125384, 124922, 123837, 122436, 121408, 121182, 121688, 122584, 123459, 123828, 123218, 121553, 119502, 118200, 118292, 119306, 120259, 120876, 121733, 123080, 124197, 124402, 124179, 124598, 125876, 127260, 128175, 128646, 128613, 127739, 126215, 125013, 124877, 125575, 126495, 127501, 128777, 130215, 131424, 132185, 132620, 133033, 133670, 134380, 134497, 133515, 131960, 131052, 131259, 131780, 131775, 131498, 131759, 132801, 134276, 135936, 137689, 139235, 140274, 140981, 141844, 143042, 144320, 145329, 145845, 145870, 145792, 146182, 147105, 147915, 148056, 147743, 147421, 146949, 145870, 144305, 142953, 142268, 142106, 142139, 142189, 142173, 142090, 142071, 142210, 142393, 142430, 142246, 141786, 141051, 140388, 140315, 140725, 140731, 139751, 138350, 137483, 137232, 136890, 135988, 134647, 133177, 131902, 131245, 131349, 131770, 132013, 132184, 132599, 133070, 133280, 133513, 134256, 135260, 135862, 136090, 136551, 137232, 137387, 136726, 135830, 135205, 134779, 134598, 135122, 136375, 137617, 138399, 139320, 141140, 143647, 145924, 147379, 147984, 147823, 146997, 145903]
54461A45903p33P9R02J301J033K67m65p48n64j2Q29J534J403M02n56p44n00m38
54443A48893m23j69j29q28j684j694r72n05n47m17J04L62P6j42R3K90N6q9M71
54424A42746J402J858J640J278J187J142P03j21p53o74r4K17p0m66m99m75q14
54407A48207j122p37N6K47l53p27p3J140J888J821J400J205J413J749J721J147
54391A58982M73K54L85K39m14j064j132n90J98Q60J169J132R74P41P1j183k310
54374A58785k339j323l67j86l25kQ40J672K030J748Q96n1m03M8P13R13O40L69
54356A63658L95O01Q02R67J151J371J585J752J853J831J550R95O02R83K035K736
54340A84867K241R51q8n93j183k163k973l064k654k292k174k238k481k782k646
$$ y = [145903, 145170, 145249, 146151, 147452, 148485, 148752, 148287, 147539, 146975, 146963, 147792, 149326, 150729, 151131, 150575, 149831, 149331, 148893, 148470, 148301, 148172, 147344, 145660, 143966, 142994, 142489, 141942, 141525, 141629, 141991, 142067, 141925, 142018, 142308, 142364, 142275, 142746, 144148, 146006, 147646, 148924, 150111, 151253, 151956, 151835, 151082, 150408, 150314, 150531, 150461, 149995, 149496, 149021, 148207, 147085, 146348, 146404, 146651, 146298, 145571, 145498, 146638, 148526, 150347, 151747, 152952, 154365, 156114, 157835, 158982, 159455, 159709, 160094, 160333, 159919, 158855, 157723, 157133, 157331, 158191, 159360, 160492, 161466, 162207, 162278, 161095, 158785, 156446, 155123, 154756, 154570, 154245, 154243, 155083, 156755, 158785, 160533, 161429, 161378, 160975, 161023, 161736, 162649, 163289, 163658, 164053, 164654, 165456, 166423, 167574, 168945, 170530, 172282, 174135, 175966, 177516, 178511, 179113, 180096, 182131, 184867, 187108, 188059, 187971, 187378, 186195, 184032, 181059, 177995, 175341, 173049, 170875, 168637, 166156, 163374, 160728]
54325A60728j661j48R29Q06k95j341j527j115r81j306j290m27N49O26o8n54m19
54308A52506n7K96P74J199J130P54Q01J317J428O33m94j266j719k056k081j713
54292A51452j368j204o54O28J877K031J050j48q34r33o45k13J42M11Q00J211J131
54275A54734L71m72p74o35m44j31M13O59O8p86p06M49J431J208K37l22r1L41L97
54256A55947J92J34L28N04M31J72n1j00P0M19O84M50l34j053j015l06M00O77N78
54237A58127Q9q81j822j825q29M9K2k30L49J498J967J318M15P8J12o0m10m44J7
54218A57540O39R71Q80M94qm91p48n14J80P83P30K06%M42R57Q62K00n11r91j233
54198A60388j196q99o14n18m09j14J03Kj62o2N0k55p88r88p72m89k03K09L46l81
$$ y = [160728, 159067, 158919, 159848, 160654, 160359, 159018, 157491, 156376, 155395, 154089, 152799, 152372, 152921, 153547, 153479, 152925, 152506, 152449, 152745, 153519, 154718, 155848, 156602, 157403, 158720, 160148, 160781, 160287, 159021, 157302, 155246, 153165, 151452, 150084, 148880, 148226, 148854, 150731, 152762, 153812, 153664, 152830, 151897, 151252, 151039, 151181, 151592, 152392, 153603, 154734, 155105, 154633, 153859, 153224, 152780, 152649, 153062, 153721, 153789, 153003, 152297, 152746, 154177, 155385, 155622, 155300, 155209, 155550, 155947, 156139, 156273, 156601, 157105, 157536, 157708, 157657, 157557, 157627, 158046, 158730, 159180, 158846, 157793, 156778, 156472, 156872, 157549, 158127, 158216, 157335, 155513, 153688, 152859, 152908, 152930, 152700, 153049, 154547, 156514, 157832, 158247, 158325, 158437, 158377, 157967, 157523, 157540, 158179, 159150, 160030, 160524, 160516, 160025, 159277, 158763, 158943, 159726, 160456, 160662, 160662, 161104, 162061, 162923, 163123, 162612, 161621, 160388, 159192, 158293, 157679, 157161, 156752, 156638, 156741, 156743, 156581, 156519, 156569, 156314, 155526, 154538, 153766, 153277, 153074, 153283, 153629, 153248]
54178A53248j567j878p67O66J065M81n0m6N1q7j64J25N59P33N46J08n26j162j357
54159A49978q77j66Q4j08k3O44J154P15l27q36l49M88R22R01O82L31k8k1M68R06
54139A54538P52J50l97p13q21m93M30J442J705R77j73j055j337r75k20L81M44
54122A54635K42L35P60J053R98Q11O55M74L77N65Q31P06K38O5M81J058J353J429
54104A67066J393J016K74l03l44k97p45j409j491q09k6L09L21L96O22Q56R88R97
54086A68814Q78O28K44k23n21l01L94R31P33N2k67J93R98J484J449J095O74M30
54068A77685N70J036J419J383J050P97P62Q76J170J755K435K705K346J797J753
54053A99539K513L886N556P214Q383Q468P282N356L518K121Q68n14j694k011j338
$$ y = [153248, 151681, 149803, 149036, 149702, 150767, 151248, 151198, 151152, 151203, 151116, 150952, 151077, 151636, 152369, 152915, 153023, 152497, 151335, 149978, 149101, 148935, 149019, 148911, 148888, 149532, 150686, 151401, 151074, 150238, 149889, 150377, 151299, 152200, 152882, 153213, 153185, 153164, 153632, 154538, 155290, 155440, 155043, 154330, 153509, 153016, 153446, 154888, 156593, 157570, 157397, 156342, 155005, 154030, 153810, 154191, 154635, 154877, 155212, 155972, 157025, 158023, 158834, 159489, 159963, 160340, 160905, 161736, 162442, 162680, 162745, 163226, 164284, 165637, 167066, 168459, 169475, 169749, 169446, 169102, 168805, 168060, 166651, 165160, 164351, 164325, 164634, 164955, 165351, 165973, 166829, 167817, 168814, 169692, 170320, 170564, 170341, 169820, 169519, 169913, 170844, 171577, 171629, 171362, 171555, 172553, 174037, 175486, 176581, 177255, 177685, 178255, 179291, 180710, 182093, 183143, 183940, 184702, 185578, 186748, 188503, 190938, 193643, 195989, 197786, 199539, 202052, 205938, 211494, 218708, 227091, 235559, 242841, 248197, 251715, 253836, 254704, 254190, 252496, 250485, 249147]
54038B49147l66J24J32L05J086K234L271M023M502M578M104L296K606K234J991
54023B83267J686J281P36l8q65j280j034m48j04k65q14j578k509l556m541n166
54007B64772n202m726m169l904l808l460k832k406k453k548k162j462j091j300
53993B23249j666j670j279r10j079j907k820k869j759m02Po09j189r27j31M30
53977B04469N16L56N6n11j308k013k264j835p71N20J430J693J595J469J227O77
53961B05306P4q2K89Q12J254J705K139K250J939J565J590K222L576N543P304P596
53945B45082O157M513M514O186P798P945O771N076L290J766J131J491J855J295
53931C04870K45k20r0l39j182j522m96J310K706L274L420L583L926M466M968N085
$$ y = [249147, 248781, 248905, 249037, 249342, 250428, 252662, 255933, 259956, 264458, 269036, 273140, 276436, 279042, 281276, 283267, 284953, 286234, 286970, 286932, 286067, 284787, 283753, 283305, 283201, 282936, 282122, 280544, 278035, 274479, 269938, 264772, 259570, 254844, 250675, 246771, 242963, 239503, 236671, 234265, 231812, 229264, 227102, 225640, 224549, 223249, 221583, 219913, 218634, 217724, 216645, 214738, 211918, 209049, 207290, 206888, 206895, 206286, 205097, 204170, 204039, 204469, 204985, 205341, 205397, 204886, 203578, 201565, 199301, 197466, 196695, 197215, 198645, 200338, 201933, 203402, 204629, 205306, 205380, 205298, 205587, 206399, 207653, 209358, 211497, 213747, 215686, 217251, 218841, 221063, 224639, 230182, 237486, 245082, 251239, 255752, 260266, 266452, 274250, 282195, 288966, 294042, 297332, 299098, 300229, 301720, 303575, 304870, 305115, 304895, 304805, 304466, 303284, 301762, 301266, 302576, 305282, 308556, 311976, 315559, 319485, 323951, 328919, 334004]
53915C34004M977N363O534P722Q059P743P559P585P267O654O534P211P997Q385
53901D33594Q852R938J1021J0888R133O289K714j807p144j2182j5633j7179j7488
53888D20996j7305j6924j6376j5597j4391j2567j0353q383p090o337n791n404
53876B84478n241n113m752m260l983l919l719l287l000l148l496l588l228k498
53862B31246j603q92p30j060j303r92l82j29n67j489k471l086l014k308j516j128
53846B08576r91n64J82N49k2j176j948j735p92J17M40K17p2m1K64N23N56N27P27
53827B05337J267J974K528K619K127J251N15M54J111J869K000J475R95J102J488
53812B28112J451Q47K18J00N38J278K005K443K526K541K786L116L217L214L546
$$ y = [334004, 338981, 344344, 350878, 358600, 366659, 374402, 381961, 389546, 396813, 403467, 410001, 417212, 425209, 433594, 442446, 452384, 463405, 474293, 483426, 489715, 492429, 490622, 483478, 471296, 455663, 438484, 420996, 403691, 386767, 370391, 354794, 340403, 327836, 317483, 309100, 302010, 295673, 289882, 284478, 279237, 274124, 269372, 265112, 261129, 257210, 253491, 250204, 247204, 244056, 240560, 236972, 233744, 231246, 229643, 228751, 228021, 226961, 225658, 224666, 224284, 224155, 223588, 222099, 219628, 216542, 213528, 211220, 209704, 208576, 207585, 207021, 207203, 207752, 207730, 206554, 204606, 202871, 202079, 202196, 202636, 202853, 202781, 202740, 203004, 203527, 204083, 204610, 205337, 206604, 208578, 211106, 213725, 215852, 217103, 217618, 218072, 219183, 221052, 223052, 224527, 225522, 226624, 228112, 229563, 230410, 230628, 230728, 231266, 232544, 234549, 236992, 239518, 242059, 244845, 247961, 251178, 254392, 257938]
53797B57938M213M725M846M788M500L606K299J575J967K734K845K257J516O92
53783C00501m36j523j900j590j294j385j684k125k899l883m634n001n189n125
53769B61833m548l744l477l882m138l630k752k214k072j944j731j558j382j128
53755B23633j043j338j682j514q21j78Qj18k51l53m51m02j26O5k42q96j195p55
53737B12341q3J13o4R6P53J267J276J317J857K335J936R74O05J257K141K411K100
53720B32632J713J474J321J145Q16K67j73J1Q25J639J957J995K211K640L001L159
53704B56633L127K788K042J194Q36J270K120K669K561K164K172K791L514L744
53690B89625L440K942K455K014J742J621J219J71j129j905k025k055k235k080
$$ y = [257938, 262151, 266876, 271722, 276510, 281010, 284616, 286915, 288490, 290457, 293191, 296036, 298293, 299809, 300501, 300065, 298542, 296642, 295052, 293758, 292373, 290689, 288564, 285665, 281782, 277148, 272147, 266958, 261833, 257285, 253541, 250064, 246182, 242044, 238414, 235662, 233448, 231376, 229432, 227701, 226143, 224761, 223633, 222590, 221252, 219570, 218056, 217235, 217057, 217065, 216947, 216696, 216343, 215892, 215490, 215364, 215429, 215187, 214291, 213096, 212341, 212258, 212371, 212307, 212403, 213156, 214423, 215699, 217016, 218873, 221208, 223144, 224118, 224723, 225980, 228121, 230532, 232632, 234345, 235819, 237140, 238285, 239101, 239368, 239195, 239206, 240031, 241670, 243627, 245622, 247833, 250473, 253474, 256633, 259760, 262548, 264590, 265784, 266620, 267890, 270010, 272679, 275240, 277404, 279576, 282367, 285881, 289625, 293065, 296007, 298462, 300476, 302218, 303839, 305058, 305229, 304100, 302195, 300170, 298115, 295880, 293800]
53676B93800j301m81l22o57p27k47K43O5q19j791k179j891j421j201j129r53q04
53659B78185r34j078p28LM02K29R1M91J078J210Q89O84J009J728K277K042R65
53642B88543j01j23R03J864J931J425J131J319J779K301K579K206J288O26P64
53627C08435J243J378J328J695K397K777K696K684L028L384L439L377L496L749
53613C45106L912L884L697L489L465L684L932M010M053M261M444M247L723L278
53599C99185L041K708K110J570J548K091K769L003K506J538O76K33kl52q30j361
53583D20433k120l226m281m676m380l969l858l901l809l561l225k706j898r59
53569C73864k65j58o87j460j808j330l17N30P96O95O94J025J547J911J840J361
$$ y = [293800, 292499, 292018, 291696, 291039, 290312, 290065, 290308, 290373, 289554, 287763, 285584, 283693, 282272, 281071, 279942, 278989, 278185, 277251, 276173, 275445, 275448, 275850, 276079, 276170, 276661, 277739, 278949, 279838, 280522, 281531, 283259, 285536, 287578, 288543, 288442, 288319, 289222, 291086, 293017, 294442, 295573, 296892, 298671, 300972, 303551, 305757, 307045, 307671, 308435, 309678, 311056, 312384, 314079, 316476, 319253, 321949, 324633, 327661, 331045, 334484, 337861, 341357, 345106, 349018, 352902, 356599, 360088, 363553, 367237, 371169, 375179, 379232, 383493, 387937, 392184, 395907, 399185, 402226, 404934, 407044, 408614, 410162, 412253, 415022, 418025, 420531, 422069, 422745, 422978, 422976, 422624, 421794, 420433, 418313, 415087, 410806, 406130, 401750, 397781, 393923, 390022, 386213, 382652, 379427, 376721, 374823, 373864, 373599, 373441, 372754, 371294, 369486, 368156, 367839, 368369, 369165, 369860, 370554, 371579, 373126, 375037, 376877, 378238]
53553C78238P90M34M06P51J496K415K992K916K499K315K586L160L875M618N181
53538D14672N513N946O781P719Q265Q587R395J0798J1951J2194J1978J2198J2964
53525E38961J3548J3432J2941J2810J3487J4860J6404J7524J7982J8162J8736
53514G08847J9997K1611K3063K4159K4946K5421K5611K5875K6611K7510K7618
53503I81269K6478K4905K4132K4323K4490K3834K2590K1478K0844K0612K0583
53492A235538K0482K0039J9325J8708J8307J7903J7536J7658J8343J8947J9009
53481A441795J8871J8835J8281J6483J3911J1699J0023Q029N348K635L14k176
53469A564048n353q675j1173j2640j3620j4613j5751j6943j7844j7983j7393j6948
$$ y = [378238, 379028, 379462, 379868, 380619, 382115, 384530, 387522, 390438, 392937, 395252, 397838, 400998, 404873, 409491, 414672, 420185, 426131, 432912, 440631, 448896, 457483, 466878, 477676, 489627, 501821, 513799, 525997, 538961, 552509, 565941, 578882, 591692, 605179, 620039, 636443, 653967, 671949, 690111, 708847, 728844, 750455, 773518, 797677, 822623, 848044, 873655, 899530, 926141, 953651, 981269, 1007747, 1032652, 1056784, 1081107, 1105597, 1129431, 1152021, 1173499, 1194343, 1214955, 1235538, 1256020, 1276059, 1295384, 1314092, 1332399, 1350302, 1367838, 1385496, 1403839, 1422786, 1441795, 1460666, 1479501, 1497782, 1514265, 1528176, 1539875, 1549898, 1557927, 1563275, 1565910, 1566224, 1564048, 1558695, 1550020, 1538847, 1526207, 1512587, 1497974, 1482223, 1465280, 1447436, 1429453, 1412060, 1395112]
53457A395112j7560j9183k0946k2123k2577k2435k1878k1275k1029k1055k0781
53446A164270j9827j8406j6953j5583j4155j2603j0975r232p334n491m003k858
53434A026850j665j87J331K539L504M529N676O781P942R470J1256J2727J3681
53421A104434J4796J6753J9160K0886K1432K1484K2034K3427K5443K7906L0745
53410A348500L3615L5879L7161L7825L8680M0235M2283M4379M6515M9031N1846
53399A805949N4212N5533N6157N6923N8100N9137N9499N9322N9111N9036N8773
53388B441752N7881N6244N4129N1921M9752M7413M4622M1283L7508L3524K9594
53377B945623K5816K1875J7224J1686N682k81o119j1960j7760k3495k9426l5714
$$ y = [1395112, 1377552, 1358369, 1337423, 1315300, 1292723, 1270288, 1248410, 1227135, 1206106, 1185051, 1164270, 1144443, 1126037, 1109084, 1093501, 1079346, 1066743, 1055768, 1046536, 1039202, 1033711, 1029708, 1026850, 1025185, 1024998, 1026329, 1028868, 1032372, 1036901, 1042577, 1049358, 1057300, 1066770, 1078026, 1090753, 1104434, 1119230, 1135983, 1155143, 1176029, 1197461, 1218945, 1240979, 1264406, 1289849, 1317755, 1348500, 1382115, 1417994, 1455155, 1492980, 1531660, 1571895, 1614178, 1658557, 1705072, 1754103, 1805949, 1860161, 1915694, 1971851, 2028774, 2086874, 2146011, 2205510, 2264832, 2323943, 2382979, 2441752, 2499633, 2555877, 2610006, 2661927, 2711679, 2759092, 2803714, 2844997, 2882505, 2916029, 2945623, 2971439, 2993314, 3010538, 3022224, 3027906, 3027625, 3021506, 3009546, 2991786, 2968291, 2938865, 2903151]
53365B903151m1906m7289n1715n5475n8482o0170o0408n9858n9133n8061n6235
53354B294419n3879n1667m9817m8030m6282m5146m5058m5589m5828m5354m4449
53343A773320m3367m1883l9761l7349l5233l3452l1471k8984k6234k3533k0907
53332A411146j8413j6352j4892j3854j3097j2794j2957j3175j3120j3059j3373
53321A256060j3894j4066j3486j2013r739p317n738n174m475k572J2J947K998
53308A172543M054N484O701P528Q718J0644J2554J3815J5019J7046J9696K2109
53296A315911K4042K5888K7641K8734K8872K8464K8082K7879K7645K7094K6097
53285A616349K4695K2940K0696J7886J4853J2176R874P228L642n92m663q087j0920
$$ y = [2903151, 2861245, 2813956, 2762241, 2706766, 2648284, 2588114, 2527706, 2467848, 2408715, 2350654, 2294419, 2240540, 2188873, 2139056, 2091026, 2044744, 1999598, 1954540, 1908951, 1863123, 1817769, 1773320, 1729953, 1688070, 1648309, 1610960, 1575727, 1542275, 1510804, 1481820, 1455586, 1432053, 1411146, 1392733, 1376381, 1361489, 1347635, 1334538, 1321744, 1308787, 1295612, 1282492, 1269433, 1256060, 1242166, 1228100, 1214614, 1202601, 1192862, 1185545, 1179807, 1174633, 1170158, 1167586, 1167598, 1169545, 1172543, 1176597, 1182081, 1188782, 1196310, 1205028, 1215672, 1228226, 1242041, 1257060, 1274106, 1293802, 1315911, 1339953, 1365841, 1393482, 1422216, 1451088, 1479552, 1507634, 1535513, 1563158, 1590252, 1616349, 1641044, 1663984, 1684680, 1702566, 1717419, 1729595, 1739469, 1746697, 1750339, 1749747, 1745084, 1736997, 1726077]
53272A726077j3341j5436j7298j9062k0850k2736k4626k6191k7225k8103k9443
53261A481766l1188l2472l2656l2065l1433l1083l0948l0943l0841l0191k8889
53250A139057k7551k6848k6694k6595k6471k6523k6549k6065k5091k4172k3551
53239H52947k2871k1767k0283j8665j7062j5571j4176j2677j1041r719r203r195
53227F70717q949q413q408r379j0660j1470j2029j3027j4385j5283j5327j4914
53215E28473j4409j3653j2582j1655j1221j0883j0068r004q465q615q693q075
53203D01150p118o667p025p789q412q565q105p120n988n116m569m215m080m275
53189C12106m601m638m240l641l030k354j672j272j292j516j729j992k341k520
$$ y = [1726077, 1712736, 1697300, 1680002, 1660940, 1640090, 1617354, 1592728, 1566537, 1539312, 1511209, 1481766, 1450578, 1418106, 1385450, 1353385, 1321952, 1290869, 1259921, 1228978, 1198137, 1167946, 1139057, 1111506, 1084658, 1057964, 1031369, 1004898, 978375, 951826, 925761, 900670, 876498, 852947, 830076, 808309, 788026, 769361, 752299, 736728, 722552, 709875, 698834, 689115, 679912, 670717, 661768, 653355, 644947, 635568, 624908, 613438, 601409, 588382, 573997, 558714, 543387, 528473, 514064, 500411, 487829, 476174, 464953, 454070, 444002, 434998, 426533, 417918, 409225, 401150, 394032, 387365, 380340, 372551, 364139, 355574, 347469, 340349, 334361, 329245, 324676, 320461, 316381, 312106, 307505, 302867, 298627, 294986, 291956, 289602, 287930, 286658, 285366, 283850, 282121, 280129, 277788, 275268]
53175B75268k265j734j338j291j463j581j345n99M17J020O57l98j137p96L18J080
53159B64813O81n33j477j567j217j086j143r29m59k79o05r81r67p08n36l89rN70
53141B53179J057J287J264R50L73j79k95N6M48M16o4o35r38r23p65o37o45q75
53123B53074j212j187l85Q80J705J721J545J758J945J459O40L75O75P36L16Kk4
53106B64023l43j066j388r44o14j168j947j909j272j076j498j729j381r68q80
53091B45840q06m56j85m89j274j885j800j115m79m12o87n54L12J345J799J520
53075B40674Q28N5m48k78N09J200J179O04l4o36j233j494j168o73n25m74J7O95
53057B38798P59J43l05jO96J127J008M04l62o98k20O65J150R85N21m0p24j221
$$ y = [275268, 273003, 271269, 269931, 268640, 267177, 265596, 264251, 263652, 264069, 265089, 265746, 265348, 264211, 263415, 263733, 264813, 265494, 264961, 263484, 261917, 260700, 259614, 258471, 257542, 257083, 256804, 256199, 255218, 254251, 253543, 253007, 252618, 252609, 253179, 254236, 255523, 256787, 257737, 258110, 257931, 257636, 257692, 258140, 258556, 258492, 257857, 256919, 255996, 255231, 254594, 253949, 253074, 251862, 250675, 250290, 251170, 252875, 254596, 256141, 257899, 259844, 261303, 261943, 262318, 262993, 263729, 264045, 264047, 264023, 263680, 262614, 261226, 260282, 259668, 258500, 256553, 254644, 253372, 252296, 250798, 249069, 247688, 246720, 245840, 245034, 244578, 244393, 243904, 242630, 240745, 238945, 237830, 237351, 236939, 236252, 235698, 236010, 237355, 239154, 240674, 241502, 241557, 241109, 240831, 241340, 242540, 243719, 244323, 244289, 243653, 242420, 240926, 239758, 239085, 238560, 238086, 238103, 238798, 239557, 239700, 239395, 239394, 240090, 241217, 242225, 242629, 242267, 241569, 241349, 242014, 243164, 244149, 244670, 244630, 243906, 242685]
53039B42685j061n27m76j119j724j796j664j560j016K41J528K028J870J669J552
53024B40630J256Q61O82O57M90L11N28J106J465J184M19l38o88n35j79j34n41
53007B47174r64r53o89n93n61p2R03J622J474P46K10K45N95Q77R07O13Jo31p56
52988B50148k00N18P27M54L33O87J119J157Q72N63K96J27M21J416K646L324L128
52971B67736K348J391O70O10J208J721J527J013R52J148P75o1l14K27M10l95j091
52954B79875m75Q41J206J65j227j898j587n05P33R79n33k969m480m223l034j996
52938B60872j287p01m21o64j130j384j415j358j101o06k12j81k49n9K58L47K77
52921B50986L13L33l1o89j087q79k60M24Q85Q20R0q94j412j265r39q21p12l83
$$ y = [242685, 241624, 241097, 240621, 239502, 237778, 235982, 234318, 232758, 231742, 231983, 233511, 235539, 237409, 239078, 240630, 241886, 242747, 243429, 244086, 244576, 244887, 245415, 246521, 247986, 249170, 249589, 249251, 248563, 248028, 247849, 247715, 247174, 246210, 245257, 244568, 243975, 243414, 243342, 244245, 245867, 247341, 248087, 248297, 248542, 249137, 250014, 250921, 251534, 251535, 250904, 250148, 249948, 250466, 251193, 251647, 251980, 252667, 253786, 254943, 255815, 256378, 256674, 256801, 257222, 258638, 261284, 264608, 267736, 270084, 271475, 272145, 272755, 273963, 275684, 277211, 278224, 279176, 280324, 281099, 281038, 280724, 280951, 281361, 280966, 279875, 279400, 280241, 281447, 281612, 280385, 278487, 276900, 276395, 277128, 278107, 277574, 274605, 270125, 265902, 262868, 260872, 259585, 258884, 258463, 257799, 256669, 255285, 253870, 252512, 251411, 250805, 250593, 250412, 250163, 250104, 250362, 250709, 250986, 251299, 251632, 251601, 250912, 249825, 248946, 248686, 249110, 249995, 250815, 250905, 250011, 248599, 247334, 246395, 245574, 244862, 244479]
52903B44479j85n59j224j334n18O25J122N67m92j018m43O80J194O36k15l23L99
52886B43391J186J516J466J244Q93N63M40L14k38j138j680j433q11m28l44j77
52870B44764L02J040J837K347K259J731J317J245J154P90M44L32J08m35p14j72
52854B58349O38O47k00r54j123j238j777k382k577k498k458k340k015j883k394
52839B35795l188l317k388j036j72k5q4J22M15K67l98r34p02J73R90J261J023
52822B27802M77j97p23q19n49k25M8L62N07L9q94j336n90Q24J776J907J851K106
52804B32366K287J771O56l15p08q06j050j404j571j574j680j883j883j611j301
52789B21294r25j65P93J003n2j510j971j167n5N67Q51J247J765K155K242J859
$$ y = [244479, 244294, 243735, 242511, 241177, 240659, 241284, 242406, 242973, 242481, 241463, 241020, 241700, 242894, 243530, 243315, 242992, 243391, 244577, 246093, 247559, 248803, 249696, 250259, 250699, 251013, 250775, 249637, 247957, 246524, 245713, 245285, 244941, 244764, 245066, 246106, 247943, 250290, 252549, 254280, 255597, 256842, 257996, 258786, 259230, 259562, 259670, 259235, 258521, 258349, 258987, 259634, 259434, 258480, 257357, 256119, 254342, 251960, 249383, 246885, 244427, 242087, 240072, 238189, 235795, 232607, 229290, 226902, 225866, 225694, 225669, 225585, 225707, 226122, 226389, 225991, 225057, 224355, 224528, 225518, 226779, 227802, 228279, 228082, 227359, 226540, 225991, 225766, 225814, 226176, 226683, 226722, 225828, 224492, 223902, 224726, 226502, 228409, 230260, 232366, 234653, 236424, 237080, 236765, 236057, 235251, 234201, 232797, 231226, 229652, 227972, 226089, 224206, 222595, 221294, 220369, 220204, 220997, 222000, 221948, 220438, 218467, 217300, 217245, 217812, 218663, 219910, 221675, 223830, 226072, 227931]
52773B27931R25j63o44k49L32K38n65j313j362p63k5M28M78K17j91m38j02R27
52755B25661K003K174J302K69j45j48k41k72M5K45k70r31n31Q92J853J498P57
52738B34161R10J874K640K716K342J864J586J885K676L080K316P84l88o75m70
52723B57301k05R6L40J52n68j315j544j328j165j276j378j139o48k77k25m67j010
52706B45344j763k158j462J36J303J013k01j075j229j088o10O17K024K235J009
52691B44095k05k24L73M36k6j72K91J029J803K412K373J500M79J23K92L02m3m78
52673B54360r77j607k004j760j121o01k07K52M89K23l2L27P88L77o21q23K67J569
52655B48899K083K029J983J873J550J416J755J998J482M95j34k42m72j264k276
$$ y = [227931, 228856, 228693, 228049, 227800, 228132, 228370, 227805, 226492, 225130, 224367, 224342, 224770, 225248, 225465, 225274, 224836, 224734, 225661, 227664, 229838, 231140, 231409, 231264, 231116, 230875, 230603, 230648, 230893, 230623, 229692, 229161, 230053, 231906, 233404, 234161, 235071, 236945, 239585, 242301, 244643, 246507, 248093, 249978, 252654, 255734, 258050, 258834, 258446, 257771, 257301, 257096, 257192, 257532, 257684, 257116, 255801, 254257, 252929, 251764, 250488, 249110, 247971, 247323, 247046, 246821, 246354, 245344, 243581, 241423, 239961, 240097, 241400, 242413, 242212, 241137, 239908, 238820, 238210, 238827, 240851, 243086, 244095, 243890, 243666, 244039, 244475, 244449, 244277, 244568, 245597, 247400, 249812, 252185, 253685, 254164, 254287, 254579, 254881, 254838, 254360, 253383, 251776, 249772, 248012, 246891, 246290, 246083, 246335, 246824, 247047, 247015, 247342, 248130, 248507, 247886, 247063, 247330, 248899, 250982, 253011, 254994, 256867, 258417, 259833, 261588, 263586, 265068, 265563, 265429, 265187, 264715, 263451, 261175]
52640B61175k855k755k249j743j358q76j26O85J156J176J007R99J364K108K862
52625B60570K973K227J332J216J832K207J691O14l93j121j581j718j648j694j828
52610B64679j533o49J05no39p82j55M35K66k65k06O36J306Q27n31j487j262m55
52592B60285j75n45o35K17J551K396K301J539O36N7K2K91K92k69r44r97k41P90
52574B66571J469J609J362Q61J55o12j151j287j175j103j132j068q16n33l33j43
52558B62674M1j2l45n19j54M14M89Pm00l66k68m86p38n86k12j37l67l68Q5N85
52538B59337P23N75L22j35p98j179q34k01j68q07j208p89j15R0P5M65J046J061
52520B57460M88L2n6j65k59K09J073J340Q32Q18K129L698M045L387L066L410L541
$$ y = [261175, 258320, 255565, 253316, 251573, 250215, 249339, 249213, 249898, 251054, 252230, 253237, 254236, 255600, 257708, 260570, 263543, 265770, 267102, 268318, 270150, 272357, 274048, 274662, 274269, 273148, 271567, 269849, 268201, 266507, 264679, 263146, 262497, 262602, 262597, 261958, 261176, 261021, 261456, 261722, 261457, 261251, 261887, 263193, 264020, 263489, 262002, 260740, 260285, 260110, 259565, 258930, 259147, 260698, 263094, 265395, 266934, 267570, 267627, 267649, 267940, 268232, 267963, 267019, 266022, 265781, 266571, 268040, 269649, 271011, 271872, 272027, 271415, 270264, 268977, 267802, 266699, 265567, 264499, 263683, 263150, 262817, 262674, 262715, 262703, 262358, 261839, 261685, 262099, 262588, 262595, 262195, 261829, 261561, 261075, 260337, 259751, 259539, 259402, 259035, 258667, 258752, 259337, 260060, 260635, 260957, 260822, 260024, 258845, 258011, 257810, 257642, 256835, 255627, 254838, 254723, 254813, 254888, 255353, 256399, 257460, 257948, 257980, 257924, 257759, 257500, 257709, 258782, 260122, 260954, 261772, 263901, 267599, 271644, 275031, 278097, 281507, 285048]
52503B85048L004K254J534M95r17k183k997l426l244k158q33n15j310j878j348
52488B71526n10m48r30j033o39l73m63n76n45m80l11J79Q88J473J765J772J450
52471B72745R24O76J024J558J633J252R75J076J375J847K665L529L599K511J001
52456B98390P9j39l38r94j901k633k952k758k100j470j602k597l544l512k673
52441B69256j951j667j252l54M98O81L37K5k5Q2K76M75N08M98Q51J490J623Q55
52423B72206LK7O02O64O7k53K91J317K220K686K481J645J050J747L572N280O267
52406C01872P148Q406R492R836R660R129P613M668J116j803l850n603p196q091
52392C42397p926o920n583m479l966l691k744q67Q42J090L7r02p29L23J467K260
$$ y = [285048, 288052, 290306, 291840, 292335, 291418, 289235, 286238, 282812, 279568, 277410, 276577, 276062, 274752, 272874, 271526, 271016, 270568, 269638, 268605, 267966, 267593, 267130, 266554, 266009, 265529, 265218, 265397, 266285, 267758, 269523, 271295, 272745, 273669, 274345, 275369, 276927, 278560, 279812, 280787, 281863, 283238, 285085, 287750, 291279, 294878, 297389, 298390, 298469, 298330, 297992, 296998, 295097, 292464, 289512, 286754, 284654, 283184, 281582, 278985, 275441, 271929, 269256, 267305, 265638, 264386, 264032, 264530, 265211, 265548, 265573, 265548, 265630, 265906, 266381, 266889, 267387, 268238, 269728, 271351, 272206, 272209, 272236, 272838, 273502, 273569, 273316, 273607, 274924, 277144, 279830, 282311, 283956, 285006, 286753, 290325, 295605, 301872, 309020, 317426, 326918, 336754, 346414, 355543, 363156, 367824, 368940, 367137, 363287, 357684, 350488, 342397, 334471, 327551, 321968, 317489, 313523, 309832, 307088, 306221, 307063, 308153, 308190, 307288, 306559, 306882, 308349, 310609]
52376C10609K677K876L004L050K927K811L067L678M143M299M693N542N913M726
52362C64015K348K61p26j034j163r63l58J70L17M76R84J325Q56nm5J223K907L794
52344C74382L709L476L766M350M639M598M822N701O893P739Q057Q236Q740R715
52330D58823J1091J2788J4688J6480J7746J8369J8777J9610K0971K2256K2882
52319F54481K2914K2751K2432K1771K0971K0533K0465K0122J9082J7714J6687
52308H79923J6255J6204J6160J5803J5070J4291J3744J3070J1654R576P609O121
52296A035480M710L088J584L29j185l196n037o115o869p959r090r511r225q755
52282I78249q071o793n174l857k682q05J902M518O394P906R569J1182J2328J3055
$$ y = [310609, 313286, 316162, 319166, 322216, 325143, 327954, 331021, 334699, 338842, 343141, 347834, 353376, 359289, 364015, 366363, 366624, 365898, 364864, 363701, 362738, 362380, 362550, 362867, 363343, 364327, 365652, 366508, 366503, 366458, 367681, 370588, 374382, 378091, 381567, 385333, 389683, 394322, 398920, 403742, 409443, 416336, 424075, 432132, 440368, 449108, 458823, 469914, 482702, 497390, 513870, 531616, 549985, 568762, 588372, 609343, 631599, 654481, 677395, 700146, 722578, 744349, 765320, 785853, 806318, 826440, 845522, 863236, 879923, 896178, 912382, 928542, 944345, 959415, 973706, 987450, 1000520, 1012174, 1021750, 1029359, 1035480, 1040190, 1043278, 1044862, 1045191, 1044006, 1040810, 1035773, 1029658, 1022789, 1014830, 1005740, 996229, 987004, 978249, 970178, 963385, 958211, 954354, 951672, 950867, 952769, 957287, 963681, 971587, 981156, 992338, 1004666, 1017721]
52268A017721J3596J3950J4117J4401J4964J5426J5276J4451J3318J2252J1553
52257A171025J1433J1760J1922J1249R595P455N580M456L932L315J963j13k425
52244A251147m671o933r162j0860j1601j1653j1843j2702j3926j4661j4334j3186
52232A115615j1988j1235j0707r828q404o850n745n245m906m164k999k010j593
52219A029941j308m33R38K000K451K934L942M992N434N523N932O636P001O836
52205A082819O604O595O535O075N166L978K876K414K821L546L821L644L647M062
52191A144603M452M511M439M334L860K886J946J604J630J196k00k304m432o042
52177A162483p016p559p929q272q689r169r361q777p405n848m552l251j622p7
$$ y = [1017721, 1031317, 1045267, 1059384, 1073785, 1088749, 1104175, 1119451, 1133902, 1147220, 1159472, 1171025, 1182458, 1194218, 1206140, 1217389, 1226984, 1234439, 1240019, 1244475, 1248407, 1251722, 1253685, 1253572, 1251147, 1246476, 1239543, 1230381, 1219521, 1207920, 1196267, 1184424, 1171722, 1157796, 1143135, 1128801, 1115615, 1103627, 1092392, 1081685, 1071857, 1063453, 1056603, 1050858, 1045613, 1040707, 1036543, 1033544, 1031534, 1029941, 1028633, 1028200, 1029138, 1031138, 1033589, 1036523, 1040465, 1045457, 1050891, 1056414, 1062346, 1068982, 1075983, 1082819, 1089423, 1096018, 1102553, 1108628, 1113794, 1117772, 1120648, 1123062, 1125883, 1129429, 1133250, 1136894, 1140541, 1144603, 1149055, 1153566, 1158005, 1162339, 1166199, 1169085, 1171031, 1172635, 1174265, 1175461, 1175261, 1172957, 1168525, 1162483, 1155467, 1147908, 1139979, 1131707, 1123018, 1113849, 1104488, 1095711, 1088306, 1082458, 1077906, 1074655, 1073033, 1072956]
52163A072956P33R39J283K024K749L257L864M657N062M535L240J808P54K01j23
52148A107939o34j311j435m93Q10J191N49K38J293L010L833L110J582N60R78K835
52132A124055N188O948Q039R459J1946J5035J7785J9982K2153K4626K7097K9068
52120A321381L0338L1101L1743L2408L2664L1882L0046K7919K6097K4314K1967
52109A641860J9006J5883J2838R734O514L445Q84r89k234l131m044n110o073o619
$$ y = [1072956, 1073689, 1074628, 1075911, 1077935, 1080684, 1083941, 1087805, 1092462, 1097524, 1102059, 1105299, 1107107, 1107861, 1108062, 1107939, 1107305, 1105994, 1104559, 1104066, 1104876, 1106067, 1106616, 1106854, 1108147, 1111157, 1114990, 1118100, 1119682, 1120242, 1121220, 1124055, 1129243, 1136191, 1144230, 1153689, 1165635, 1180670, 1198455, 1218437, 1240590, 1265216, 1292313, 1321381, 1351719, 1382820, 1414563, 1446971, 1479635, 1511517, 1541563, 1569482, 1595579, 1619893, 1641860, 1660866, 1676749, 1689587, 1699321, 1705835, 1709280, 1710164, 1709175, 1706941, 1703810, 1699766, 1694656, 1688583, 1681964]
$$ [...]
##END NTUPLES=NMR SPECTRUM
##END=
