
##TITLE=AC1233_PERAH12114_6519287_kQ2xMY586G
##JCAMPDX= 6.0         $$ Bruker NMR JCAMP-DX V2.0
##DATA TYPE= NMR SPECTRUM
##DATA CLASS= NTUPLES
##ORIGIN= BRUKER
##OWNER= Administrator
$$ 1.72 TOPSPIN		Version 2.1
$$ 2012-07-13 17:56:49.187 -0500  Administrator@TOPSPIN
$$ Compression mode = diff/dup
##.OBSERVE FREQUENCY= 400.02188249412
##.OBSERVE NUCLEUS= ^1H
##.ACQUISITION MODE= SIMULTANEOUS (DQD)
##.ACQUISITION SCHEME= undefined
##.AVERAGES= 8
##.DIGITISER RES= 22
##SPECTROMETER/DATA SYSTEM= spect
##.PULSE SEQUENCE= zg30
##.SOLVENT NAME= COFFEE_meoh
##.SHIFT REFERENCE= INTERNAL, COFFEE_meoh, 1, 14.98509
##AUDIT TRAIL= $$ (NUMBER, WHEN, WHO, WHERE, PROCESS, VERSION, WHAT)
$$ ##TITLE= Audit trail, TOPSPIN		Version 2.1
$$ ##JCAMPDX= 5.01
$$ ##ORIGIN= Bruker BioSpin GmbH
$$ ##OWNER= Administrator
$$ $$ C:\Bruker\TOPSPIN/data/COFFEE/nmr/AC1233_PERAH12114_6519287_kQ2xMY586G/80/pdata/1/auditp.txt
$$ ##AUDIT TRAIL=  $$ (NUMBER, WHEN, WHO, WHERE, PROCESS, VERSION, WHAT)
(   1,<2012-07-13 17:56:42.203 -0500>,<Administrator>,<TOPSPIN>,<go>,<TOPSPIN 2.1>,
      <created by zg
	started at 2012-07-13 17:55:35.671 -0500,
	POWCHK enabled, PULCHK disabled,
       configuration hash MD5:
       6B 1B 68 BB D9 2E 58 E2 7F 35 AD 54 07 DF 0E 41
       data hash MD5: 64K
       FB 5F 18 11 D7 66 E5 81 49 1A 6D 36 5B 81 95 AF>)
(   2,<2012-07-13 17:56:44.765 -0500>,<Administrator>,<TOPSPIN>,<proc1d>,<TOPSPIN 2.1>,
      <Start of raw data processing
       efp LB = 0 FT_mod = 6 PKNL = 1 PHC0 = 0 PHC1 = 0 SI = 32K 
       data hash MD5: 32K
       2D C6 9B BB F3 40 91 A7 27 71 7E 0F 91 D8 70 E7>)
(   3,<2012-07-13 17:56:45.062 -0500>,<Administrator>,<TOPSPIN>,<proc1d>,<TOPSPIN 2.1>,
      <pk PHC0 = 180.6262 PHC1 = 0 
       data hash MD5: 32K
       00 1C D0 B7 F3 C1 EC F0 F5 EC A5 01 5B 27 7A B5>)
(   4,<2012-07-13 17:56:45.140 -0500>,<Administrator>,<TOPSPIN>,<proc1d>,<TOPSPIN 2.1>,
      <abs ABSG = 1 
       data hash MD5: 32K
       84 0D 6E E1 69 04 81 60 A0 5F C2 38 D9 53 75 61>)
(   5,<2012-07-13 17:56:45.250 -0500>,<Administrator>,<TOPSPIN>,<proc1d>,<TOPSPIN 2.1>,
      <abs ABSG = 2 
       data hash MD5: 32K
       3A 5E 6B B4 52 73 03 DD 04 AD 7F A8 F9 C0 8D 17>)
(   6,<2012-07-13 17:56:45.312 -0500>,<Administrator>,<TOPSPIN>,<proc1d>,<TOPSPIN 2.1>,
      <abs ABSG = 3 
       data hash MD5: 32K
       B5 F7 B3 73 B1 2F 41 12 71 77 CD 07 40 24 41 BC>)
(   7,<2012-07-13 17:56:45.375 -0500>,<Administrator>,<TOPSPIN>,<proc1d>,<TOPSPIN 2.1>,
      <abs ABSG = 4 
       data hash MD5: 32K
       9C 0A CE 4A 9B B6 DF AB ED 5C 26 DB 15 A2 EE 89>)
(   8,<2012-07-13 17:56:45.406 -0500>,<Administrator>,<TOPSPIN>,<proc1d>,<TOPSPIN 2.1>,
      <abs ABSG = 5 
       data hash MD5: 32K
       49 75 C2 B7 99 4B 6A 47 8B 8C D3 CC 24 F4 D9 84>)
$$ ##END=
$$ 
$$ $$ hash MD5
$$ $$ E2 3A 89 23 B8 8A A4 9C 2C 08 31 59 6C 07 2B 7D
##$RELAX= 
##$RELAX= 
##$RELAX= 
##$RELAX= 
##$RELAX= 
##$RELAX= 
##$RELAX= 
##$RELAX= 
$$ Bruker specific parameters
$$ [...]
##$TP= (0..7)
150 150 150 150 150 150 150 150
##$TP07= 0
##$TPNAME0= <>
##$TPNAME1= <>
##$TPNAME2= <>
##$TPNAME3= <>
##$TPNAME4= <>
##$TPNAME5= <>
##$TPNAME6= <>
##$TPNAME7= <>
##$TPOAL= (0..7)
0.5 0.5 0.5 0.5 0.5 0.5 0.5 0.5
##$TPOFFS= (0..7)
0 0 0 0 0 0 0 0
##$TUNHIN= 0
##$TUNHOUT= 0
##$TUNXOUT= 0
##$USERA1= <user>
##$USERA2= <user>
##$USERA3= <user>
##$USERA4= <user>
##$USERA5= <user>
##$V9= 5
##$VALIST= <valist>
##$VCLIST= <CCCCCCCCCCCCCCC>
##$VD= 0
##$VDLIST= <DDDDDDDDDDDDDDD>
##$VPLIST= <PPPPPPPPPPPPPPP>
##$VTLIST= <TTTTTTTTTTTTTTT>
##$WBST= 2048
##$WBSW= 25
##$XGAIN= (0..3)
0 0 0 0
##$XL= 0
##$YL= 0
##$YMAX_a= 514382
##$YMIN_a= -660926
##$ZGOPTNS= <>
##$ZL1= 120
##$ZL2= 120
##$ZL3= 120
##$ZL4= 120
##$ABSF1= 14.98509
##$ABSF2= -5.573092
##$ABSG= 5
##$ABSL= 3
##$ALPHA= 0
##$AQORDER= 0
##$ASSFAC= 0
##$ASSFACI= 0
##$ASSFACX= 0
##$ASSWID= 0
##$AUNMP= <proc_prof1d_extract_pilot.lims>
##$AXLEFT= 0
##$AXNAME= <>
##$AXNUC= <1H>
##$AXRIGHT= 0
##$AXTYPE= 0
##$AXUNIT= <>
##$AZFE= 0.1
##$AZFW= 0.1
##$BCFW= 0
##$BC_mod= 0
##$BYTORDP= 0
##$COROFFS= 0
##$CY= 15
##$DATMOD= 1
##$DC= 0
##$DFILT= <>
##$DTYPP= 0
##$F1P= 0
##$F2P= 0
##$FCOR= 0.5
##$FTSIZE= 32768
##$FT_mod= 6
##$GAMMA= 0
##$GB= 0
##$INTBC= 1
##$INTSCL= 1
##$ISEN= 128
##$LB= 0
##$LEV0= 0
##$LPBIN= 0
##$MAXI= 10000
##$MC2= 0
##$MEAN= 0
##$ME_mod= 0
##$MI= 0
##$NCOEF= 0
##$NC_proc= -8
##$NLEV= 6
##$NOISF1= 0
##$NOISF2= 0
##$NSP= 0
##$NTH_PI= 0
##$NZP= 0
##$OFFSET= 14.98509
##$PC= 1
##$PHC0= 180.6262
##$PHC1= 0
##$PH_mod= 1
##$PKNL= yes
##$PPARMOD= 0
##$PPDIAG= 0
##$PPIPTYP= 0
##$PPMPNUM= 2147483647
##$PPRESOL= 1
##$PSCAL= 4
##$PSIGN= 0
##$PYNMP= <proc.py>
##$REVERSE= no
##$SF= 400.02
##$SI= 32768
##$SIGF1= 0
##$SIGF2= 0
##$SINO= 400
##$SIOLD= 32768
##$SPECTYP= <>
##$SREGLST= <1H.CDCl3>
##$SSB= 0
##$STSI= 32768
##$STSR= 0
##$SW_p= 8223.68421052631
##$SYMM= 0
##$S_DEV= 0
##$TDeff= 65536
##$TDoff= 0
##$TI= <>
##$TILT= no
##$TM1= 0
##$TM2= 0
##$TOPLEV= 0
##$USERP1= <user>
##$USERP2= <user>
##$USERP3= <user>
##$USERP4= <user>
##$USERP5= <user>
##$WDW= 1
##$XDIM= 32768
##$YMAX_p= 483565059
##$YMIN_p= -808869
##$CURPLOT= <Network HP LaserJet P1505>
##$CURPRIN= <$Network HP LaserJet P1505>
##$DFORMAT= <normdp>
##$LAYOUT= <+/1D_H.xwp>
##$LFORMAT= <normlp>
##$PFORMAT= <normpl>
##$SURQMSG= 1
$$ End of Bruker specific parameters
$$ ---------------------------------
##NTUPLES= NMR SPECTRUM
##VAR_NAME=  FREQUENCY,     SPECTRUM/REAL,   SPECTRUM/IMAG
##SYMBOL=    X,             R,               I
##VAR_TYPE=  INDEPENDENT,   DEPENDENT,       DEPENDENT
##VAR_FORM=  AFFN,          ASDF,            ASDF
##VAR_DIM=   32768,         32768,           32768
##UNITS=     HZ,            ARBITRARY UNITS, ARBITRARY UNITS
##FACTOR=    0.250966925370066, 1,           1
##FIRST=     8223.43324360094, 197017,       -53687
##LAST=      0,             23364,           9483
##MIN=       0,             -808869,         0
##MAX=       8223.43324360094, 483565059,    0
$$ Real data points
##PAGE= N=1
##DATA TABLE= (X++(R..R)), XYDATA
$$ [...]
$$ plain form
19531 993 -99672 -5695 60303 -16081 -59440 78673 91576 176360 90168 -232256 -230105 -5378
19518 -207131 -227629 -167778 114063 -72448 -394196 -74023 54838 -248269 -165236 -19708 -345262
19507 -345262 -59220 96842 40132 -182064 2441 355239 -140607 81497 -256297 -116546 -82265
19496 -82265 -37365 34283 -22242 -137584 78249 -90300 133508 -331927 -127456 -110943 40659
19484 -136178 33020 -9691 -279104 -120655 -67794 -4428 354566 -125588 127202 -71684 75940
19472 86617 58173 24114 25929 -99264 -237639 -130977 -62231 10759 158181 -111298 -142437
19461 -142437 -73739 15889 -13524 -107385 -104104 -154976 119866 137935 16153 235100 56729
19449 -88923 -416834 -46202 -261571 45705 -67661 253147 92185 -156840 -136003 -107299 -216381
$$ packed form
19531I93i9672e695F0303a6081m3359G8673J2903Q4784q6192b32256K151e378
19518b07131k0498N9851A14063g2448l21748g4023E4838b48269Q3033a9708l25554
19507c45262e9220I6842D0132a82064B441L52798a40607H1497b56297a16546L4281
19496h2265c7365C4283b2242j15342G8249i0300A33508c31927a27456J6513D0659
19484a36178C3020i691k69413a20655N2861d428C54566a25588A27202g1684G5940
19472H6617k8444B4114J815i9264j38375J06662f2231A0759J47422a11298l1139
19461a42437O8698A5889a3524r3861L281n0872A19866J8069A6153K18947E6729
19449h8923l27911d6202k15369D5705f7661B53147I2185a56840K0837K8704j09082
$$ plain form
19438 -216381 -308594 -123649 160941 -336004 -99556 -121679 74144 117824 136417 59381 -111547
19426 151171 39668 87067 208617 -297704 -337072 24062 -355523 13115 -51308 -82591 -179884
19415 -179884 -102529 -159327 -214904 -94565 -57427 -74195 -29362 -324452 -220872 -104327 102119
19403 15165 -265384 -159303 -227314 -44737 -19968 -87128 -238140 -95160 -194333 -64216 -487962
19392 -487962 -306876 -162701 97864 137740 -35424 13121 -70978 -122268 93667 -54136 -164263
19381 -164263 93749 5980 -222988 -311326 15905 52401 -10078 21761 -326323 -215821 -196471
19370 -196471 -181075 -81973 -109129 127136 -36424 -213709 -71262 -77188 -117183 -127257 155360
19358 -234143 -158789 43285 118979 -277840 -293155 -227896 571216 -356999 -15630 -219564 149872
$$ packed form
19438b16381r2213a23649A60941c36004i9556k2123G4144M3680J8593E9381a11547
19426A51171C9668M7399J21550b97704l9368B4062c55523A3115e1308l1283r7293
19415a79884P7355n6798n5577i4565L7138j6768b9362k95090J03580a04327A02119
19403A5165b65384J06081o8011d4737a9968o7160j51012i5160r9173f4216m23746
19392d87962J81086J44175I7864L9876c5424A3121g0978n1290I3667e4136j10127
19381a64263I3749E980b22988q8338A5905L6496a0078B1761c26323J10502J9350
19370a96471J5396h1973k7156A27136c6424j77285g1262n926l9995j0074A55360
19358b34143P5354D3285P5694b77840j5315O5259E71216c56999a5630k03934A49872
$$ plain form
19346 207535 -133882 310313 189782 3821 -61880 -142687 29828 -243054 -86681 -535177 -426007
19335 -426007 -56314 -121091 -211010 -245183 68821 -197415 -39166 -139536 -63379 -13384 -150992
19324 -150992 -68728 116811 -91315 -161610 -84750 -164914 -250288 -146602 37638 -141064 265282
19312 59215 -91202 -77431 -429625 -63159 101591 -301623 42675 -191910 -224817 7474 60151
19301 60151 231462 10784 -256094 -81906 -304216 -198093 -84460 -8975 -46007 165406 132789
19290 132789 151684 -2291 -56 152689 -48173 27054 24693 -199568 -45018 -11479 -295940 -208163
19278 -208163 21192 -25368 76868 -55167 -197329 38305 87817 -95412 42822 -248558 -13927
19266 -33284 306517 403156 -116012 -70993 -152356 -14497 -198595 163875 323719 -297519
$$ packed form
19346B07535a33882C10313j20531C821f1880q0807B9828b43054h6681m48496J09170
19335d26007e6314o4777q9919l4173F8821a97415c9166j00370f3379a3384j37608
19324a50992f8728A16811i1315p0295P6860q0164q5374J03686C7638a41064B65282
19312E9215i1202J3771l52194f3159A01591c01623D2675a91910l2907G474N2677
19301F0151J71311A0784b56094h1906k22310J06123h4460h975l7032A65406l2617
19290A32789J8895b291e6A52689d8173B7054k361a99568d5018a1479k84461Q7777
19278b08163B1192b5368G6868e5167j42162C8305M9512i5412D2822b48558a3927
19266c3284C06517R6639a16012M5019q1363a4497j84098A63875J59844b97519
$$ plain form
19255 -51744 -80738 27137 -213491 -38354 -92865 -343292 145085 -179977 -208407 63907 -186582
19243 -177692 -75380 42506 181421 345133 112166 34869 -259280 -236768 -95774 -139884 -79814
19232 -79814 -125280 -141703 -297541 -92879 -155796 221028 -161194 -40497 -151357 -109761 -29788
19220 -30636 128202 -184250 -72888 -194379 -24854 -244229 14685 411967 110470 -149993
19209 -300719 173489 11746 159005 122898 -66913 -33481 -232600 42641 41807 -222923 17897
19197 78007 36051 -78020 116576 -61882 57889 59452 -71233 221286 -60933 -72957 -93323
19186 -93323 39396 165087 42793 -142872 37337 46151 145003 -171209 14433 28159 -207317
19174 -102679 -569120 119560 -93895 359844 -118792 -231488 -200228 -316846 -157338 53572
$$ packed form
19255e1744k8994B7137b13491c8354n4511k50427A45085a79977k8430F3907a86582
19243a77692g5380D2506J38915J63712A12166C4869b59280K2512i5774m4110O0070
19232g9814m5466j6423j55838i2879o2917B21028a61194d0497j10860M1596b9788
19220c0636A28202a84250g2888j21491b4854k19375A4685L97282A10470a49993
19209c00719A73489A1746J47259l6107f6913L3432j99119D2641q34b22923A7897
19197G8007C6051g8020A16576f1882E7889J563g1233B21286f0933j2024k0366
19186i3323C9396J25691D2793a42872C7337Q814R8852a71209A4433J3726b07317
19174a02679m66441A19560i3895C59844a18792j12696L1260j16618a57338E3572
$$ plain form
19163 60303 124301 -51532 -46860 -384350 -134332 -133103 -13412 42127 -31885 319395 -166376
19151 -83215 -111697 -121329 -150637 -298678 -160709 127654 -327305 -221702 63656 -22025 167320
19139 -256422 -22724 -41873 -45289 46549 -196650 162189 -32030 -89832 -230041 -64687 -80637
19128 -80637 1252 140632 -421887 -78698 -318215 -4088 -130223 22247 -183067 59121 -29764
19116 187801 -197144 10242 129724 -196783 -207435 50407 -355126 287666 5057 210451
19106 210451 -51391 174946 -256783 -142393 -83718 -230238 -20541 -62478 -106186 -3666 -72001
19095 -72001 317639 -207486 172404 -225010 31826 180753 -267369 -57853 58729 -156654
19084 122222 -165957 -305239 -9910 -77294 -77722 -27675 64967 -158086 -252160 -310244 6999 -540174
$$ packed form
19163F0303O3998e1532M672l37490a34332J229a3412D2127c1885C19395a66376
19151h3215k8482r632k9308j48041J37969A27654c27305J05603F3656b2025A67320
19139b56422b2724j9149l416D6549a96650A62189c2030n7802j40209f4687j5950
19128h0637A252J39380d21887g8698k39517d088j26135B2247a83067E9121b9764
19116A87801a97144A0242J19482a96783j0652E0407c55126B87666E057K05394
19106B10451e1391A74946b56783J14390N8675j46520b0541m1937m3708c666o8335
19095g2001C17639b07486A72404b25010C1826J48927b67369e7853E8729a56654
19084A22222a65957j39282i910o7384m28b7675F4967a58086r4074n8084F999e40174
$$ plain form
19071 -1615 60903 15581 18402 -174156 -355008 -147132 70212 233142 -230097 62901 263516
19060 263516 -24257 178086 17267 213925 -70396 -107578 139597 136536 -197400 -55232 9266
19048 -66288 -56689 269442 -16310 -29107 110201 -211005 -22571 -121575 382042 -273042 -33613
19036 -22126 -191183 82975 -54872 -102401 -65436 24542 -17516 81778 -119263 44723 234557
19025 234557 -100476 253129 396582 292791 86 228406 -176298 121241 127573 -21559 -200939
19014 -200939 -263519 193575 -257857 -88470 -629260 39270 -140033 -293915 -94503 81252
19003 191563 312294 -369877 -53881 -335137 -151580 -26403 -206124 56225 -156518 144203
18992 26352 57404 -331041 -85871 331957 -117062 127956 -216966 -454724 103908 -142962
$$ packed form
19071a615F0903A5581K821a74156j80852a47132G0212J62930b30097F2901K00615
19060B63516b4257A78086A7267J96658g0396l7182A39597l061a97400e5232I266
19048f6288R599B69442a6310j2797A10201b11005b2571r9004C82042b73042c3613
19036b2126j69057H2975e4872m7529L6965B4542a7516H1778a19263D4723J89834
19025B34557a00476B53129J43453j03791H6K28320a76298A21241O332b1559j79380
19014b00939o2580A93575b57857h8470n40790C9270a40033j53882i4503H1252
19003A91563J20731c69877e3881k81256a51580b6403j79721E6225a56518A44203
18992B6352L1052c31041h5871C31957a17062A27956b16966k37758A03908a42962
$$ plain form
18981 9768 79674 22931 12263 -328054 -76041 -114739 -29766 -227416 93526 3007 -240267
18969 -96850 -5063 -230858 -80506 -128821 75666 65682 -33444 -356551 190566 7095 273569
18958 273569 60991 138356 -351183 -128713 -184354 237089 -138650 -175018 -107640 -35991 -131954
18947 -131954 -323036 -187965 69367 -225554 255025 239978 209388 174686 259441 -155452
18936 35776 -104014 107551 -179393 233556 -232734 27524 -129895 -132030 -49760 55043 282640
18925 282640 -182916 -103123 -80792 -194044 108722 -381849 -3923 -289710 145594 -44416
18914 -28213 400223 -166867 -80888 -31709 -10450 -156347 46694 -152919 -246509 -138493 -83712
18903 -83712 39005 -100261 -205090 -123679 332944 108930 201147 18263 -127359 50845 104141
$$ packed form
18981I768O9906B2931j0668c28054g6041l8698b9766j97650I3526C007b40267
18969i6850e063k25795h0506m8315G5666r984c3444l23107A90566G095K66474
18958B73569F0991P7365c51183a28713n5641B37089a38650l6368O7378c5991r5963
18947a31954j91082J35071F9367b25554B55025j5047l0590l4702Q4755a55452
18936C5776a04014A07551a79393B33556b32734B7524a29895k135d9760E5043K27597
18925B82640a82916P9793K2331j13252A08722c81849c923k85787A45594d4416
18914b8213D00223a66867h0888c1709a0450j45897D6694a52919r3590J08016N4781
18903h3712C9005a00261j04829Q1411C32944A08930R2217A8263a27359E0845N3296
$$ plain form
18892 104141 -41382 -430386 105745 139980 -184293 74687 193893 -190418 184642 -33075
18881 143982 -239091 -242096 -92522 159351 -158846 89994 7555 -57404 222225 -33913 62543
18869 -12818 -136063 -269747 167623 -267895 -270381 150754 17358 66355 -169014 -118091 -43624
18857 -142226 -147497 -117490 188570 -322407 -343889 -239376 62401 230289 -105689 -161011 236013
18845 328736 40014 42644 132801 -137696 192850 -163943 -385912 -123284 -33084 114728
18834 15610 200001 -300553 -117754 -247581 103623 -295719 22697 32659 -157681 -117408
18824 -117408 -413566 -332867 156703 -79677 -105321 132638 -65696 123055 145813 139460 104758
18813 104758 88831 -233890 51521 39916 66984 186396 -40211 354191 221987 129789 -2628
$$ packed form
18892A04141d1382l89004A05745L4235a84293G4687J19206a90418A84642c3075
18881A43982b39091l005i2522A59351a58846H9994G555e7404B22225c3913F2543
18869a2818j23245j33684A67623b67895k486A50754A7358M8997a69014N0923d3624
18857a42226n271L0007A88570c22407k1482J04513F2401J67888a05689n5322B36013
18845C28736D0014K630R0157a37696A92850a63943k21969a23284c3084A14728
18834A5610J84391c00553a17754j29827A03623b95719B2697R962a57681M0273
18824a17408k96158Q0699A56703g9677k5644A32638f5696A23055K2758o353l4702
18813A04758j5927b33890E1521j1605K7068J19412d0211C54191j32204r2198b628
$$ plain form
18801 -158818 -210845 -363058 6655 -58138 -31541 205101 -115027 -198879 259909 -197277 158593
18789 -34302 188734 -190835 -139098 6000 20097 -65301 70999 -27386 -87971 -161164 8112 -69993
18776 -348096 -358448 -59020 -169420 -340061 245333 14004 -5589 -30842 174331 -157599 -394250
18765 -394250 -49519 115218 -111043 116640 -148888 -165751 -2300 -261863 82375 -442762
18754 -117692 -253325 345836 -66867 -24749 40093 -134358 -290596 9640 -210508 -63186 205395
18742 -138645 47924 -77071 -280778 -86561 -233978 -306797 -221285 35276 -52311 -51036 -398224
18731 -398224 -148745 -26243 -17102 312109 47624 -255425 98551 -133421 -29308 -152797 -279217
18720 -279217 340101 -394512 76072 -15328 -35469 146781 82502 -190982 -76613 45542 -164869
$$ packed form
18801a58818n2027j52213F655e8138K6597B05101a15027q3852B59909a97277A58593
18789c4302A88734a90835N1737F000J4097f5301G0999b7386o0585p3193H112f9993
18776c48096j0352e9020j10400j70641B45333A4004e589k5253A74331a57599k36651
18765c94250d9519A15218a11043A16640a48888j6863b300k59563H2375d42762
18754a17692j35633C45836f6867b4749D0093a34358j56238I640b10508f3186B05395
18742a38645D7924g7071k03707h6561j47417p2819Q5512C5276e2311J275l47188
18731c98224a48745b6243R141C12109D7624b55425I8551a33421b9308j23489j26420
18720b79217C40101c94512G6072a5328k0141A46781o4279a90982g6613D5542a64869
$$ plain form
18708 114127 -69703 -333793 -181310 124224 30971 -255993 -231196 334792 -34362 373935
18697 122703 -92952 29451 316786 -116345 -143895 -115159 10477 367719 -479410 -249510
18687 -249510 -87922 -221103 -90217 69102 153550 195776 245017 261507 -268583 -260948 -265444
18676 -265444 -207194 113108 351 -191624 -417789 -242098 199278 -92731 -373302 -23651 -44329
18665 -44329 -380114 262979 119670 187337 71778 149606 379391 -26675 -79683 -297930 174411
18653 23709 -109576 -137597 -185183 -36945 -212080 -205423 -1783 -265060 -286124 -252708 37095
18641 -37822 -54131 -14041 -204866 55191 38829 127834 -213493 -353019 -124906 63115 -130999
18629 319939 174129 44156 139069 -178672 -36781 -184281 -57639 180996 -135719 46074
$$ packed form
18708A14127f9703k64090J52483A24224C0971b55993K4797C34792c4362C73935
18697A22703i2952B9451K87335a16345k7550K8736A0477L57242d79410K29900
18687b49510h7922j33181i0217F9102Q4448M2226M9241J6490b68583P635m496
18676b65444N8250A13108C51a91624k26165J75691A99278i2731k80571b3651k0678
18665d4329l35785B62979A19670O7667G1778P7828K29785b6675n3008k18247A74411
18653B3709a09576k8021m7586c6945j75135O657a783k63277k1064L3416C7095
18641c7822j6309a4041j90825E5191j6362Q9005b13493j39526a24906F3115a30999
18629C19939j45810D4156R4913a78672c6781j47500e7639A80996a35719D6074
$$ plain form
18618 107016 -143593 93094 -149634 -100807 -22690 -15408 -88192 -91249 216514 62556 -155407
18606 -119229 224107 19276 -97169 -154792 -257461 -21081 -5810 100300 353 -100859 -119580
18595 -119580 -96677 -428563 -136003 -294976 171138 -216862 -102157 -2356 285177 -340827
18584 -287922 185352 -105575 -78555 29208 -269384 -157681 428120 27588 -243595 -239912
18574 -239912 -265859 177182 -131979 83218 -46417 -121697 377860 -46159 -303204 -183997
18564 -183997 -181477 -194261 180679 -18168 326874 -32395 -230005 -75570 15019 -299283 -308629
18553 -308629 -474657 -115675 82624 -19310 12109 78693 -145989 -299169 -211587 6926 183227
18542 183227 -417680 35763 46495 214005 -29954 -232267 -244757 -289663 -169023 204017
$$ packed form
18618A07016a43593I3094a49634M8827b2690P282p2784l057B16514F2556a55407
18606a19229B24107A9276i7169n7623j02669b1081e810A00300C53a00859j8721
18595a19580K2903l31886a36003j58973A71138b16862a02157b356B85177c40827
18584b87922A85352a05575K7020B9208b69384J11703D28120B7588b43595L683
18574b39912k5947A77182a31979H3218d6417p5280C77860d6159k57045J19207
18564a83997K520j2784A80679a8168C26874c2395j97610g5570A5019b99283r346
18553c08629j66028a15675H2624a9310A2109O6584a45989j53180Q7582F926J76301
18542A83227d17680C5763J0732J67510b9954k02313j2490m4906J20640B04017
$$ plain form
18531 -99916 -54416 -169533 31193 -73721 125278 488701 -124561 -49969 35234 -62638 -78524
18520 -78524 68346 -21774 130815 242575 -11052 -20226 47146 -121687 -255250 81296 -202822
18508 -322561 207668 -192699 -304177 -128170 -110333 201560 -13759 -54494 254524 -443793
18497 -9277 -27048 22374 163221 -10446 -184746 126656 152547 -12480 85686 -114528 -30796
18485 -168308 84481 -268816 181703 284995 -179178 -396599 189478 221672 -11415 -149777
18475 -149777 49312 14014 32697 -111490 -632864 -157670 153077 -386166 177210 263040
18465 263040 -86548 -50831 96261 -197383 43240 236511 -221842 -195110 -126381 51143 -140192
18453 31678 -186432 -184799 -228355 151733 -26094 -181430 -206877 -357339 -47628 78877 400037
$$ packed form
18531i9916M5500j15117C1193g3721A25278L63423a24561d9969C5234f2638j5886
18520g8524F8346b1774A30815J11760a1052r174D7146a21687j33563H1296b02822
18508c22561B07668a92699j11478a28170J7837B01560a3759m0735B54524d43793
18497i277j7771B2374J40847a0446j74300A26656K5891a2480H5686a14528c0796
18485a68308H4481b68816A81703J03292a79178k17421A89478L2194a1415j38362
18475a49777D9312A4014J8683a11490n21374a57670A53077c86166A77210Q5830
18465B63040h6548L5717I6261a97383D3240J93271b21842K6732O8729E1143a40192
18453C1678a86432J633m3556A51733b6094j55336k5447j50462d7628G8877L21160
$$ plain form
18442 400037 -88292 12143 70065 -20105 125601 -23570 -47536 -31365 171026 -162762 103335
18430 -25895 -9665 -309086 -45012 -265323 -175213 94091 114128 18223 -457058 163528 8957
18418 -25392 -66783 -377409 -288203 -336142 -50739 -95921 -86026 -36262 -46399 -455923 -73487
18406 102184 45655 77508 -126655 -21020 -102995 -229820 488707 -441849 54681 -77020 -78181
18395 -78181 139347 -90591 380718 2221 -314000 25192 78967 159083 52702 -205627 125041
18383 -20697 -219655 -282432 -237283 162849 -114379 -65191 -206851 -377410 -116024 106200
18372 -153530 -454 -311438 -244822 -127330 199957 -15443 295154 -96931 -251298 -123217 175476
18360 -19073 111540 198611 243321 29588 91996 126787 -30863 -147958 10711 -194795 -5492
$$ packed form
18442D00037h8292A2143N7922b0105A25601b3570k3966J6171A71026a62762A03335
18430b5895i665k99421d5012k20311R0110I4091K0037A8223d57058A63528H957
18418b5392m1391l10626Q9206m7939e0739m5182R895c6262j0137m09524g3487
18406A02184D5655L1853a26655b1020q1975j26825D88707d41849E4681g7020j161
18395g8181A39347i0591C80718B221c14000B5192N3775Q0116E2702b05627A25041
18383b0697j98958o2777M5149A62849a14379M9188j41660j70559a16024A06200
18372a53530d54l10984O6616J17492A99957a5443B95154i6931j54367a23217A75476
18360a9073A11540Q7071M4710B9588O2408L4791c0863j17095A0711a94795e492
$$ plain form
18348 117481 286741 137078 4571 -126116 38139 -1374 38589 -396275 265165 -96442 -188959
18337 -188959 265386 5086 -280318 5581 -188539 -196986 215531 -142070 -117409 -67546 13303
18325 -15011 197758 -283101 -62495 -162483 4047 57411 -366531 117914 -58406 5675 -65780
18313 126138 -444312 22495 -139771 -154783 179518 -148185 28353 110244 -88855 -38393 -422637
18302 -422637 -90040 -182517 120338 35055 -55894 224363 -156364 -42675 -202525 263321
18291 -31500 -174985 -95367 -222784 213210 -83548 -130130 -207056 180303 334636 -105844
18280 11519 -221598 -286540 150641 37810 24710 371947 246999 -341799 270135 -176809
18269 210336 -14591 -337908 18341 -126837 -16936 -208047 -245557 17716 -128045 -269730
$$ packed form
18348A17481J69260A37078D571a26116C8139a374C8589c96275B65165i6442r2517
18337a88959B65386E086b80318E581a88539q447B15531a42070K4661M9863A3303
18325a5011A97758b83101f2495r9988D047N3364c66531A17914e8406E675f5780
18313A26138d44312B2495a39771j5012A79518a48185B8353Q1891h8855c8393l84244
18302d22637i0040r2477A20338C5055e5894B24363a56364d2675j59850B63321
18291c1500j43485P9618j27417B13210h3548m6582p6926A80303J54333a05844
18280A1519b21598o4942A50641C7810j3100L47237j24948c41799B70135a76809
18269B10336a4591l23317A8341a26837a6936j91111l7510A7716a28045j41685
$$ plain form
18259 -269730 -31546 3945 237993 385490 -250473 -25274 -105815 -147832 -256144 -37868 -52410
18248 -52410 -83508 4378 125882 -231392 213031 -248141 -112040 -91369 -225978 -132735 -370331
18237 -370331 -154720 73941 -310984 243298 479 -107589 153385 133907 -39072 23699 -32500
18225 -235691 -278555 -231260 -140763 -415681 -185673 -148328 106801 -344277 -178470 66784
18214 148300 -71227 158061 87493 241941 -1952 18586 117508 21547 -23809 217652 160862
18203 160862 -120093 -182058 287621 150043 -178359 -121219 -97134 69342 -410508 -203251
18192 155326 -149420 -185073 30286 204679 -28134 -231957 -234405 -221993 47956 -181715 57283
18180 -162957 -73563 -390609 -291665 166330 9112 71867 -6671 -13330 -233975 63355 227148
$$ packed form
18259b69730c1546C945K34048J47497b50473b5274q0541m2017j08312c7868j4542
18248e2410l1098D378J21504b31392B13031b48141a12040K0671j34609R3243k37596
18237c70331a54720G3941c10984B43298D79a07589A53385j9478c9072B3699c2500
18225b35691m2864M7295R0497k74918a85673L7345A06801c44277J65807F6784
18214A48300g1227A58061p0568J54448a952A8586R8922B1547b3809B17652n6790
18203A60862a20093o1965B87621j37578a78359N7140K4085F9342d10508b03251
18192A55326a49420l5653C0286J74393b8134k03823k448J2412D7956a81715E7283
18180a62957g3563l17046R8944A66330I112O2755f671o659k20645F3355J63793
$$ plain form
18169 227148 220736 -155480 -28560 -97223 -213260 -83881 -73799 140674 80026 -21702 -155128
18158 -155128 60127 -99602 222131 142031 -26684 -241487 178605 -61484 -76123 -26314 4264
18146 -246264 -37360 -184279 214058 -67518 -132454 93581 -103005 -48445 -69189 -52076 -132912
18135 -132912 -128111 54305 66728 -64359 -209204 -212446 13161 50890 144575 317372 -77704
18123 88700 171842 -135595 75072 -222003 26312 207174 450108 -550685 -37282 35699 198935
18112 198935 230939 -105486 -25899 133622 29452 -268687 -58235 -131319 -250730 -34878 -222499
18101 -222499 -49358 9995 -64031 -18789 319465 71664 -311821 175500 73207 36031 -105582
18089 -147036 -78079 -243692 -52761 -55505 -30596 -237972 -47892 -51030 -162616 110534 -178059
$$ packed form
18169B27148o412a55480b8560o8663j16037h3881J0082A40674o0648b1702j33426
18158a55128F0127i9602B22131q0100b6684k14803A78605f1484j4639b6314D264
18146b46264c7360j46919B14058f7518o4936I3581a03005d8445k0744J7113q0836
18135a32912M801E4305J2423f4359j44845l242A3161L7729R3685J72797g7704
18123H8700Q3142a35595G5072b22003B6312J80862K42934e50685c7282C5699J63236
18112A98935L2004a05486b5899A33622B9452b68687e8235p3084j19411c4878j87621
18101b22499d9358I995f4031a8789C19465G1664c11821A75500G3207C6031a05582
18089a47036O8957j65613e2761k744K4909k07376d7892l138j11586A10534a78059
$$ plain form
18077 -63470 103672 228583 -218588 -191121 250857 -62945 -295973 28736 58189 -134856
18066 -90587 63106 75331 -31271 -142468 411171 -212792 -44318 -104912 347517 -144609 -214196
18055 -214196 -242433 -93398 -208814 -63366 -172277 -40647 -157978 -228576 233534 166153 -48055
18043 -19815 -144953 -54560 112590 -85703 279506 -40888 -296441 -335022 142812 -102382
18032 -87834 -161637 -368355 117276 -83313 79348 267641 -214709 -89842 8377 -51475 -190755
18021 -190755 177951 46102 250305 86002 23653 98243 -190010 -50241 -294150 74622 -97365
18009 -179998 -113254 -117052 -156262 -130142 -365569 -71719 4554 171970 393596 18857 115321
17998 115321 -208038 41906 -261130 -179344 24089 -76727 -87571 -27025 70555 10713 -138142
$$ packed form
18077f3470A03672J24911b18588K7467B50857f2945k33028B8736K9453a34856
18066i0587F3106J2225c1271j11197D11171b12792d4318o0594C47517a44609o9587
18055b14196k8237i3398j15416f3366j08911d0647j17331p0598B33534o7381d8055
18043a9815j25138e4560A12590h5703B79506d0888k55553l8581A42812a02382
18032h7834p3803k06718A17276h3313G9348J88293b14709h9842H377e1475j39280
18021a90755A77951D6102K04203H6002B3653P4590a90010e0241k43909G4622i7365
18009a79998O6744l798l9210K6120k35427g1719D554J67416K21626A8857R6464
17998A15321b08038D1906b61130Q1786B4089g6727j0844b7025G0555A0713a38142
$$ plain form
17986 -134976 1748 -298368 -47031 10967 61380 161184 201068 -101042 195640 -68508 15412
17974 34194 10717 6921 12878 13826 -6278 -125712 97990 35783 -87497 68565 -9755 138391
17961 -349307 247186 -215431 268460 301421 112452 -168282 -349749 226963 -7509 -12758
17951 -12758 -14708 -282364 147797 -12641 329592 -25645 106549 -146510 -62206 168561 243708
17940 243708 80119 51977 -5705 -104400 -395389 -83406 17687 115054 -106299 109023 -34336
17928 28024 -6141 -66082 -322608 54550 -159062 -125005 35938 44412 -231012 137325 -227501
17916 -312647 19162 -136901 -190627 -72973 7312 -186289 235261 -127274 233088 -406447
17905 255665 -41367 108425 30521 125240 -151742 -203798 30603 112807 -107065 84736 214490
$$ packed form
17986a34976A748b98368d7031A0967N0413R9804L9884a01042A95640f8508A5412
17974C4194A0717l796N957R48f278j19434I7990C5783h7497F8565i755A38391
17961c49307B47186b15431B68460L2961A12452a68282j81467B26963g509n249
17951a2758j950k67656A47797a2641C29592b5645A06549a46510f2206A68561P5147
17940B43708H0119k8142e705r8695k90989h3406A7687R7367a06299A09023c4336
17928B8024f141n9941k56526E4550a59062L4057C5938Q474b31012A37325b27501
17916c12647A9162a36901n3726g2973G312a86289B35261a27274B33088d06447
17905B55665d1367A08425C0521R4719a51742n2056C0603Q2204a07065H4736J29754
$$ plain form
17894 214490 -53268 398354 17304 -24340 -76147 2216 40250 222977 296190 -286448 -257971
17883 -257971 30182 -254412 185447 62475 275824 195597 94682 -239671 147407 -206873
17872 -209392 55483 38054 873 -38734 -206064 73 -143419 -365606 -134465 -179792 -95072 -22372
17859 -73062 245425 115912 101856 181957 146909 11632 -290116 76098 -201765 177845 197485
17848 197485 -108072 -67807 170505 168490 61012 256062 239713 -165444 -3002 -32979 251906
17836 -96984 -116242 -5950 -369942 -5329 441029 -130967 41909 -125209 -206218 -101451 -279625
17825 -279625 37372 44099 -91869 -82748 -16094 -78497 70869 46428 -243305 -240972 260197 157242
17813 157242 229264 112138 -49457 144658 40531 243604 -274725 -40945 199560 -59488
$$ packed form
17894B14490e3268C98354A7304b4340n1807B216L8034J82727P3213b86448K8477
17883b57971C0182b54412A85447F2475K13349q0227I4682b39671A47407b06873
17872b09392E5483j7429H73c8734j67330G3a43419k22187a34465m5327Q4720b2372
17859g3062B45425A15912j4056Q0101l5048A1632b90116G6098b01765A77845J9640
17848A97485a08072M0265A70505k015F1012J95050j6349a65444c002k9977B51906
17836i6984j9258e950l63992e329D41029a30967D1909a25209q1009a01451j78174
17825b79625C7372O727i1869R121a6094o2403G0869k4441b43305K333B60197j02955
17813A57242P2022A12138d9457A44658D0531K03073b74725d0945A99560e9488
$$ plain form
17802 -92992 255919 42305 119244 -234048 96049 -44488 -17490 153439 201656 126951 169657
17791 169657 165462 83337 -277202 -22401 -12352 -125017 131349 131507 -18406 -121746 199587
17779 -212143 -100657 247509 8981 -67668 -205954 -330859 227976 -5643 262887 -318931
17768 146726 -69742 -293962 161342 269250 102046 57447 -53178 50593 147557 -503326
17757 165053 34634 -78277 -77880 403298 148176 -431230 67090 96937 -202903 -10380 -5889
17746 -5889 75570 153461 -423253 -389194 194888 95985 80273 -431175 -306553 107030 23063
17734 59710 -57977 28238 131529 101415 -128533 115487 29832 137790 52110 -195587 32583
17722 320824 -37535 -70680 -385683 279500 110057 -293720 159343 -284772 -7640 -265054
$$ packed form
17802i2992B55919D2305P6939b34048I6049d4488a7490A53439M8217p4705M2706
17791A69657m195q2125b77202b2401J0049j12665A31349J58a8406j03340A99587
17779b12143a00657B47509H981f7668j38286j24905B27976e643B62887c18931
17768A46726f9742k24220A61342J07908A02046m4599e3178E0593R6964e03326
17757A65053C4634g8277L97D03298A48176d31230F7090K9847b02903a0380M491
17746e889G5570P7891d23253L4059A94888I5985j5712d31175J24622A07030B3063
17734E9710e7977B8238J03291l0114a28533A15487B9832J07958E2110a95587C2583
17722C20824c7535l3145l15003B79500A10057b93720A59343b84772g640k57414
$$ plain form
17712 -265054 61794 -11292 163042 -72540 -197617 -19191 -118817 -33322 67572 -55754 135316
17700 -132947 178654 20571 -162526 -39564 -431022 189907 210737 53511 73627 276472
17690 276472 71768 -28630 -36105 -320979 -15075 5893 219530 291900 -148243 173190 -93944
17678 -169666 -240444 13461 -51558 -68450 -177127 -11999 169466 127384 84544 -150541 -177972
17667 -177972 -150675 155565 92895 318636 -34788 200217 -86721 -64620 -51451 -122635 -5887
17655 267590 -20508 167501 257 -16848 65085 124339 -219404 54086 224639 211172 -115094
17643 -58387 -107808 137311 -174228 364862 229892 -32237 246348 -4742 253562 -142935
17632 -11294 166237 -96398 -141565 109046 27231 53390 194794 -13918 158674 148196 -9808
$$ packed form
17712b65054F1794a1292A63042g2540j25077a9191r9626c3322F7572e5754A35316
17700a32947A78654B0571a62526c9564l91458A89907K0830E3511K0116K02845
17690B76472G1768b8630p475k84874a5075E893K13637P2370a48243A73190i3944
17678a69666p0778A3461e1558j6892j08677a1999A69466m2082m2840a50541k7431
17667a77972K7297A55565o2670K25741c4788B00217h6721K2101J3169p1184e887
17655B67590b0508A67501B57a6848F5085N9254b19404E4086J70553j3467a15094
17643e8387m9421A37311a74228C64862j34970c2237B46348d742B53562a42935
17632a1294A66237i6398m5167A09046B7231K6159J41404a3918A58674j0478i808
$$ plain form
17620 -82208 -12214 -106013 337751 227202 -148684 -22822 109404 -14016 -149500 342714
17609 1253 300825 -1230 -158557 -450929 24993 -95336 -217649 266182 -97163 118952 494243
17598 494243 134723 30932 -311355 48214 -93412 -54947 57204 -12233 75066 -5329 123841
17586 11780 155593 -18434 98776 85800 -44369 51623 51164 -98158 -317234 109524 50798
17574 205494 66872 109876 104239 389085 29415 160411 119637 104839 -5294 311456 -172545
17562 79304 -54056 -193679 206481 148158 75205 -115964 585370 383676 73866 330983
17552 330983 261779 155778 153498 218193 94590 -32333 54120 211657 42400 248007 49507
17540 -232967 -254462 155150 -164634 226380 -246266 259565 20696 58804 250542 -243146
$$ packed form
17620h2208a2214r3799C37751j10549a48684b2822A09404a4016j35484C42714
17609A253K99572a230j57327k92372B4993i5336j22313B66182i7163A18952L75291
17598D94243A34723C0932c11355D8214i3412L8465E7204a2233G5066e329A23841
17586A1780J43813a8434I8776j2976d4369E1623m59i8158k19076A09524E0798
17574B05494F6872M3004n637K84846B9415J30996m0774j4798e294C11456a72545
17562G9304e4056j39623B06481n8323p2953a15964E85370k01694G3866K57117
17552C30983o9204j06001k280O4695I4590c2333E4120J57537D2400K05607D9507
17540b32967k1495A55150a64634B26380b46266B59565B0696L8108J91738b43146
$$ plain form
17529 274284 110970 173463 33119 -302631 -34432 -206565 159012 321774 452431 -202112
17518 42548 129410 120069 50677 -384396 458837 97798 -102112 63558 122518 -83967 -25591
17506 86767 193540 118933 100268 60809 72031 201627 -31641 128419 62427 424290 -3725
17494 -54833 -84942 439620 336997 219857 37386 368309 92698 392719 55100 27096 258365
17483 258365 -112484 7071 170906 -68581 -34418 148132 281596 225823 94629 270013 36631
17471 140958 46752 120909 377752 272320 216826 -73345 444124 175871 105334 371211
17461 371211 -89041 293841 31614 547199 233685 -114088 341768 -13244 57162 249269
17451 249269 48331 167461 296158 191955 240417 423961 213578 -81108 275203 587068
$$ packed form
17529B74284A10970O2493C3119c02631c4432j72133A59012J62762J30657b02112
17518D2548Q6862r341E0677c84396D58837I7798a02112F3558N8960h3967b5591
17506H6767J06773p4607j8665l9459J1222J29596c1641A28419F2427L61863c725
17494e4833l0109D39620j02623j17140C7386L30923I2698L00021E5100B7096K31269
17483B58365a12484G071J63835f8581L4163A48132J33464n5773I4629J75384C6631
17471A40958D6752P4157K56843j05432n5494g3345D44124A75871p0537K65877
17461C71211h9041B93841C1614N15585B33685a14088C41768a3244E7162J92107
17451B49269D8331J19130J28697j04203M8462J83544k10383h1108B75203L11865
$$ plain form
17441 587068 427111 584011 328634 498669 240552 126183 296680 354352 91841 -70808
17430 418940 220969 311799 224094 35519 382296 621107 484209 445967 420380 327078 442500
17419 442500 379739 332937 611103 176716 205701 524863 118246 498365 -7306 641026
17408 280047 205485 -290599 -87138 289475 305249 60734 306013 72424 125306 333529 15653
17396 205871 302948 272148 24233 237881 120139 -56513 212864 153641 127690 282575 51471
17384 263462 420483 369733 -18277 -47420 144494 -68179 238379 -59911 -82898 273322 267635
17373 267635 132129 -45932 193069 740 258842 132053 448498 438733 375545 226709 383015
17362 383015 215335 31648 156098 -86930 309201 -2246 308055 312192 169736 255537 313381
$$ packed form
17441E87068j59957J56900k55377J70035B40552j14369J70497N7672I1841g0808
17430D18940j97971R0830q7705C5519L46777K38811j36898l8242k5587r3302J15422
17419D42500o2761m6802K78166A76716K8985L19162A18246L80119g306F41026
17408B80047p4562b90599h7138B89475J5774F0734K45279G2424N2882K08223A5653
17396B05871R7077l0800B4233K13648j17742e6513B12864n9223k5951J54885E1471
17384B63462J57021n0750a8277k9143A44494f8179B38379e9911k2987B73322n687
17373B67635A32129d5932A93069G40K58102j26789L16445r765o3188j48836J56306
17362C83015j67680C1648J24450h6930C09201b246C08055M137j42456Q5801N7844
$$ plain form
17351 313381 -104168 292540 231320 310859 524113 263268 5180 -50414 179055 466889
17341 466889 113759 96192 -554 481820 -159641 108165 161873 318652 -31660 -85313 315104
17329 -110344 -62140 286479 165518 282861 -136975 57366 306836 225271 395234 169288
17318 226957 85221 487222 104056 50840 129141 222319 58687 224427 223846 -46429 96391
17306 149380 308223 106097 -21519 40327 352312 361670 589911 -196906 178165 340499
17296 340499 196829 135951 327068 87101 76319 108384 54761 285575 256530 -75957 197302
17284 8059 214960 229078 339909 235965 116116 -120068 116151 -93268 192408 236555
17274 236555 39407 242179 114625 164671 280524 398819 206372 116566 -59080 212044
$$ packed form
17351C13381a04168B92540o1220P9539K13254k60845E180e0414A79055K87834
17341D66889A13759j7567e54D81820a59641A08165N3708J56779c1660n3653C15104
17329a10344M8204B86479j20961J17343a36975E7366K49470q1565J69963A69288
17318B26957H5221M02001A04056E0840P8301R3178E8687J65740n81d6429I6391
17306A49380J58843A06097b1519D0327L11985R358K28241a96906A78165J62334
17296C40499j43670o0878J91117H7101j0782L2065n3623K30814k9045g5957A97302
17284H059K06901J4118J10831j03944A16116a20068A16151i3268A92408M4147
17274B36555C9407K02772A14625N0046J15853J18295j92447q9806e9080B12044
$$ plain form
17263 263352 449979 514685 -267649 175016 289594 369590 464817 119518 206279 -61803
17252 -165965 243761 268976 280069 282106 98146 164708 97453 393882 220412 404087 428077
17241 428077 182495 287200 79489 179168 163663 265524 56405 356875 204145 56518
17230 304603 183237 460264 188299 23948 262451 289948 317517 285097 -96401 849555
17219 120218 102573 191156 371838 451540 250639 84355 443134 590783 276102 49413
17208 78280 364690 431997 374073 239780 321994 245623 421791 194555 288990 270159 -92195
17196 -64277 235750 255148 119851 -43508 442618 418503 306921 517907 428641 535866
17186 535866 154345 177260 452953 551125 280147 368662 212601 349901 -138808 510442
$$ packed form
17263B63352J86627O4706b67649A75016J14578P9996R5227A19518Q6761f1803
17252a65965B43761K5215J1093K037I8146O6562o7255K96429j73470J83675K3990
17241D28077A82495J04705G9489R9679j5505J01861E6405L00470j52730E6518
17230C04603j21366K77027A88299B3948K38503K7497K7569l2420i6401H49555
17219A20218j7645Q8583J80682P9702k00901H4355L58779J47649B76102D9413
17208G8280K86410O7307n7924j34293Q2214p6371J76168A94555R4435j8831i2195
17196f4277B35750J9398A19851d3508D42618k4115j11582K10986q9266J07225
17186E35866A54345K2915K75693R8172k70978Q8515j56061J37300a38808E10442
$$ plain form
17175 84862 197446 300341 151574 146677 463082 317490 541430 233528 222138 539952
17165 539952 346434 305030 167614 489553 175712 440383 304997 58741 489527 204941
17154 746549 136993 471720 501677 295084 180717 582122 596691 659638 489782 207274
17143 586878 240384 454943 125008 595261 432679 586383 175303 276718 441947 733277
17133 733277 263045 372424 267416 452553 716536 364285 462295 421449 474130 572714
17123 572714 212040 565910 309591 364943 -1744 437995 370762 176054 402919 -8841 408954
17111 509360 549771 390828 334711 269456 556709 357676 223624 258117 364432 686999
17101 686999 216499 120591 278094 541748 247199 411341 442835 754516 786487 331642
$$ packed form
17175H4862J12584J02895j48767m897L16405j45592K23940B33528j1390L17814
17165E39952j93518m1404j37416L21939A75712K64671j35386E8741M30786B04941
17154G46549A36993L34727K9957k06593j14367M01405J4569O2947j69856B07274
17143E86878B40384K14559A25008M70253j62582J53704A75303J01415J65229K91330
17133G33277B63045J09379j05008J85137K63983l52251R8010m0846N2681R8584
17123E72714B12040L53870k56319N5352a744D37995o7233A76054K26865h841D08954
17111E09360M0411j58943n6117o5255K87253j99033j34052L4493J06315L22567
17101F86999B16499r5908J57503K63654B47199J64142L1494L11681L1971C31642
$$ plain form
17090 500885 676288 259892 296660 465110 428363 316269 468651 436422 564320 853602
17080 853602 303569 451318 536199 372204 670162 530116 365363 229248 390950 646526
17070 646526 528181 560806 625444 208129 1033154 795485 849355 480926 611820 819669
17060 819669 450185 393617 448824 670353 832199 850035 348235 760712 719265 544612
17050 544612 887789 855337 883625 443974 771212 583428 591069 518947 682953 535666
17040 535666 638305 917121 608893 881812 842708 323447 356859 535411 648059 417967
17030 417967 685165 701575 636902 512694 642640 715208 819001 801925 918861 791162
17020 791162 898984 926071 828737 313560 622652 1040675 825063 701849 809687 914039
$$ packed form
17090E00885J75403B59892L6768J68450l6747j12094J52382l2229J27898K89282
17080H53602C03569J47749Q4881j63995K97958j40046j64753j36115J61702K55576
17070F46526j18345L2625O4638B08129Q25025k37669N3870l68429J30894K07849
17060H19669l69484n6568N5207K21529J61846J7836C48235M12477m1447j74653
17050E44612L43177l2452K8288m39651L27238j87784P641p2122J64006j47287
17040E35666J02639K78816l08228K72919l9104C23447L3412J78552J12648k30092
17030D17967K67198J6410o4673j24208J29946P2568J03793j7076J16936j27699
17020G91162J07822K7087r7334C13560L09092M18023k15612j23214J07838J04352
$$ plain form
17010 914039 869836 845491 517606 579425 1228921 893982 958982 591107 1210879 826456
17000 826456 806641 820553 873739 1024681 818750 715827 1016861 1229212 1027665 1010821
16990 1010821 944369 936696 1021803 1106406 940690 627104 1172205 890792 1268548 827358
16980 827358 1384625 1260212 1189902 1329599 928774 1203187 1188625 991813 1114747 1218487
16970 1218487 917254 1049180 1030321 954327 1063763 1104463 980171 1127745 910750 1069210
16960 1069210 885623 1090740 1290526 974508 1123970 1383293 1553152 1456850 1413282 1202108
16950 1202108 1126960 1136254 1233334 1554294 1431677 1013635 1275377 1239948 1703632 1558745
16940 1558745 1206135 1535848 1396063 1645779 1318831 1474045 1189828 1579907 1400075
$$ packed form
17010I14039m4203k4345l27885O1819O49496l34939O5000l67875O19772l84423
17000H26456j9815J3912N3186J50942k05931j02923L01034K12351k01547j6844
16990A010821o6452p673Q5107Q4603j65716l13586N45101k81413L77756m41190
16980H27358N57267j24413p0310J39697m00825K74413j4562j96812J22934J03740
16970A218487l01233J31926j8859p5994J09436M0700j24292J47574k16995J58460
16960A069210j83587K05117J99786l16018J49462K59323J69859r6302m3568k11174
16950A202108p5148R294R7080L20960j22617m18042K61742l5429M63684j44887
16940A558745l52610L29713j39785K49716l26948J55214k84217L90079j79832
$$ plain form
16931 1400075 1683914 1362384 1367272 1740575 1547945 1548999 1698374 1510227 1609568 1481474
16921 1481474 1614091 1591981 1544783 1813313 1754314 1632371 1704232 1541907 1966030 1888454
16911 1888454 2094368 1845991 1414133 1762047 1640739 1760250 1924817 2111125 1807943
16902 1807943 1696876 2095068 2170473 1873047 2051694 2220678 2091224 1947924 2037465 1763270
16892 1763270 1881706 1947784 2326574 2409968 2558165 2436945 2247300 2579254 2237617 2391174
16882 2391174 2358139 2243309 2416853 2562090 2640558 2471903 2752471 2865197 2758911 3043109
16872 3043109 2755993 2350741 2666802 2643856 3023065 2929406 2951723 3237694 2878991 3161485
16862 3161485 2967893 3130135 3227392 3249729 3305355 3182977 3229685 3533912 3698634 3431378
$$ packed form
16931A400075K83839l21530M888L73303j92630J054J49375j88147R9341j28094
16921A481474J32617k2110m7198K68530n8999j21943P1861j62325M24123p7576
16911A888454K05914k48377m31858L47914j21308J19511J64567J86308l03182
16902A807943j11067L98192P5405k97426J78647J68984j29454j43300Q9541k74195
16892A763270J18436O6078L78790Q3394J48197j21220j89645L31954l41637J53557
16882B391174l3035j14830J73544J45237P8468j68655K80568J12726j06286K84198
16872C043109k87116m05252L16061k2946L79209r3659K2317K85971l58703K82494
16862C161485j93592J62242R7257K2337N5626j22378M6708L04227J64722k67256
$$ plain form
16852 3431378 3501874 3278673 3370221 3985243 4003977 3804285 3848468 3861786 4195245 3819803
16842 3819803 4178727 4087351 4497844 3825807 4412175 4451396 4421137 4220774 4396452 4574533
16832 4574533 4850308 4861992 4996450 4843991 5057561 5036871 5414395 5171190 5343029 5518083
16822 5518083 5163430 5473029 5710519 5938160 5965766 6172189 6058425 6012969 6551584 6682842
16812 6682842 6804340 6729358 7130865 7350338 7425777 7550220 7722106 8252669 7967268 8164440
16802 8164440 8097104 8776968 9184998 9082702 9225982 9333064 9462274 9997298 9914089 10421105
16792 10421105 10447724 10762772 11114996 11352716 11572662 12102495 12125752 12729553 12960670 12927066
16782 12927066 13819170 13845217 14286982 15007905 15018469 15598002 16196092 16593198 17130681 17695388
$$ packed form
16852C431378P0496k23201R1548O15022J8734j99692M4183J3318L33459l75442
16842C819803L58924r1376M10493o72037N86368L9221l0259k00363J75678J78081
16832D574533K75775J1684J34458j52459K13570k0690L77524k43205J71839J75054
16822E518083l54653L09599K37490K27641K7606K06423j13764m5456N38615J31258
16812F682842J21498p4982M01507K19473P5439J24443J71886N30563k85401J97172
16802H164440o7336O79864M08030j02296J43280J07082J29210N35024q3209N07016
16792A0421105K6619L15048L52224K37720K19946N29833K3257O03801K31117l3604
16782A2927066Q92104K6047M41765P20923J0564N79533N98090L97106N37483N64707
$$ plain form
16772 17695388 18457837 18665814 19545848 20144775 21069146 21806850 22289762 23096504 24075793
16763 24075793 25106802 25905009 26668014 27978319 29019773 30107924 31665536 32697120
16755 32697120 33834426 35841052 37154111 38791197 40264147 42664472 44425951 46627534
16747 46627534 48436386 51179474 53973644 56719646 59442920 62573347 65943152 69360546
16739 69360546 73382456 77244272 81674427 86515459 91496894 96470092 101914595 107381887
16731 107381887 114202702 120775040 127075211 134054187 141453736 148307349 155421080 162658570
16723 162658570 169403753 175598307 181625770 186193506 190785841 193704798 195658989 196450299
16715 196450299 196060542 193787862 190779429 186842830 181888141 176418223 170185727 163055739
$$ packed form
16772A7695388P62449K07977Q80034N98927R24371P37704M82912Q06742R79289
16763B4075793J031009P98207P63005J310305J041454J088151J557612J031584
16755C2697120J137306K006626J313059J637086J472950K400325J761479K201583
16747D6627534J808852K743088K794170K746002K723274L130427L369805L417394
16739F9360546M021910L861816M430155M841032M981435M973198N444503N467292
16731A07381887O820815O572338O300171O978976P399549O853613P113731P237490
16723A62658570O745183O194554O027463M567736M592335K918957J954191P91310
16715A96450299l89757k272680l008433l936599m954689n469918o232496p129988
$$ plain form
16707 163055739 155868548 148478818 140761275 133584369 126094111 118799942 112377417 106008423
16699 106008423 100140161 94253698 88612321 83958320 79256789 74599259 70357980 66348125
16691 66348125 62713907 59410452 55880813 53355058 50595301 48034427 45372833 43168397
16683 43168397 41357015 39575127 37194799 35756287 33958233 32463920 30878525 29893692
16675 29893692 28436219 27386771 26190899 25167509 24007816 22897098 22110145 21234026
16667 21234026 20689002 19488523 19333890 18287888 17889680 17253475 16544681 16311546 15374591
16658 15374591 14876870 14728259 13967360 13440038 12991996 12959856 12661721 11990530 11328695
16649 11328695 11247843 10942128 10695256 10628840 9721977 9880610 9729861 9120426 9169249 8832706
$$ packed form
16707A63055739p187191p389730p717543p176906p490258p294169o422525o368994
16699A06008423n868262n886463n641377m654001m701531m657530m241279m009855
16691F6348125l634218l303455l529639k525755k759757k560874k661594k204436
16683D3168397j811382j781888k380328j438512j798054j494313j585395r84833
16675B9893692j457473j049448j195872j023390j159693j110718p86953q76119
16667B1234026n45024j200479j54633j046002l98208o36205p08794k33135r36955
16658A5374591m97721j48611p60899n27322m48042l2140k98135o71191o61835
16649A1328695q0852l05715k46872o6416r06863J58633j50749o09435M8823l36543
$$ plain form
16639 8832706 8405599 8424788 8029258 8048604 7675620 7860976 7464391 7275371 6898606 7012116
16629 7012116 6546773 6557938 6515165 5951968 6187736 5838718 6048454 5822210 5908746 5536173
16619 5536173 5240085 5248955 5138947 5065231 4861056 4783080 4560020 4791835 4440565 4484325
16609 4484325 4289072 3874762 4463119 4114977 4035830 4219081 3777732 3690501 3710159 3623657
16599 3623657 3225314 3505004 3217512 3496244 3258659 3036328 3395227 2937286 3249294
16590 3249294 3000748 2982459 2940601 2673836 2765659 2943510 2596255 2759025 2713055 2453691
16580 2453691 2298122 2486871 2245657 2393892 2166746 2289064 2145254 2266277 2177238 2214943
16570 2214943 1919513 2119677 2076532 2223430 2228221 2029875 1762813 2005768 1801064 1719276
$$ packed form
16639H832706m27107J9189l95530J9346l72984J85356l96585j89020l76765J13510
16629G012116m65343J1165m2773n63197K35768l49018K09736k26244Q6536l72573
16619E536173k96088Q870j10008p3716k04175p7976k23060K31815l51270M3760
16609D484325j95253m14310N88357l48142p9147J83251m41349q7231J9658q6502
16599C623657l98343K79690k87492K78732k37585k22331L58899m57941L12008
16590C249294k48546j8289m1858k66765R1823J77851l47255J62770m5970k59364
16580B453691j55569J88749k41214J48235k27146J22318j43810J21023q9039L7705
16570B214943k95430K00164m3145J46898M791j98346k67062K42955k04704q1788
$$ plain form
16560 1719276 1937430 1925007 1771171 2104822 1958959 1892907 1881904 1978793 1595989 1648194
16550 1648194 1679830 1771282 1601199 1700383 1259083 1477754 1336844 1349704 1417645 1275406
16540 1275406 1557770 1713780 1481047 1208529 1449097 1073809 1446485 1350033 1114491 1128418
16530 1128418 1372997 1215883 1205134 1090432 1047223 657585 1473600 1302090 1024860 951373
16520 951373 885238 1216730 775700 1179016 947461 949427 772862 835522 659166 803410
16510 803410 748716 756701 762877 1270653 889378 851137 939856 828196 867520 610386 621814
16499 621814 750242 1275701 898644 572679 797803 693310 736799 427394 692663 591928
16489 591928 724753 797499 204758 612410 396228 559816 516918 584621 801971 704638
$$ packed form
16560A719276K18154j2423j53836L33651j45863o6052j1003R6889l82804N2205
16550A648194L1636R1452j70083R9184m41300K18671j40910J2860O7941j42239
16540A275406K82364J56010k32733k72518K40568l75288L72676r6452k35542J3927
16530A128418K44579j57114j0749j14702m3209l89638Q16015j71510k77230p3487
16520I51373o6135L31492m41030M03316k31555J966j76565O2660j76356J44244
16510H03410n4694P985O176N07776l81275l8241Q8719j11660L9324k57134J1428
16499F21814J28428N25459l77057l25965K25124j04493M3489l09405K65269j00735
16489E91928J32825P2746B04758M07652k16182J63588m2898O7703K17350r7333
$$ plain form
16479 704638 696995 659965 669785 721976 296415 796583 536961 520552 605659 633468 482068
16468 482068 604818 386810 279249 682047 726412 486687 409667 563693 459359 288530
16458 288530 730313 829555 566211 821182 453927 730881 384882 377738 91574 520118
16448 520118 823002 521257 300269 247134 433220 289710 534333 625635 566099 179825
16437 265198 514975 627242 608571 609347 269880 487219 365947 480826 612886 204899
16426 329764 191876 165615 434200 382555 372002 227241 471297 346748 395984 405645 672780
16415 672780 418931 134127 257083 407283 601126 301289 283305 256779 596454 551852
16405 551852 4955 64620 11958 261523 656819 777710 91177 357696 413091 216418 159591
$$ packed form
16479G04638p643l7030R820N2191B96415N00168k59622j6409Q5107K7809j51400
16468D82068J22750k18008j07561M02798M4365k39725p7020J54026j04334j70829
16458B88530M41783R9242k63344K54971l67255K76954l45999p144I1574M28544
16448E20118L02884l01745k20988n3135J86086j43510K44623R1302n9536A79825
16437B65198K49777J12267j8671P76B69880K17339j21272J14879J32060B04899
16426C29764j37888k6261K68585n1645j0553j44761K44056j24549M9236R661K67135
16415F72780k53849A34127J22956J50200J93843k99837j7984k6526L39675m4602
16405E51852D955N9665A1958K49565L95296J20891I1177K66519N5395j96673n6827
$$ plain form
16394 159591 238495 235070 100053 231859 372441 447749 309875 444483 130054 234810
16384 234810 172139 364559 331183 191472 219370 64323 110453 386166 21127 134466 201512
16373 201512 154209 318753 13897 123815 312587 687100 241948 326035 148947 366354
16363 366354 -56488 -20660 202216 49851 -159047 285573 -51677 55038 164148 115464 144909
16352 144909 301440 232109 260427 313166 103663 217808 134756 -85631 -50219 112233 -21123
16340 485444 6336 192620 108214 139647 156708 329257 198470 427219 198697 433891
16330 433891 241288 101455 274578 -55440 272434 320173 239410 -85509 -126355 333582
16319 75871 -102880 105154 249007 36663 132213 323515 -44468 -21770 227888 263613 245129
$$ packed form
16394A59591P8904l425A00053J31806J40582P5308j37874J34608A30054J04756
16384B34810o2671J92420l3376j39711K7898F4323M6130K75713B1127J13339O7046
16373B01512m7303J64544A3897J09918J88772L74513B41948Q4087A48947K17407
16363C66354e6488b0660B02216D9851a59047B85573e1677E5038J09110m8684K9445
16352A44909J56531o9331K8318N2739A03663J14145q3052h5631L5412A12233b1123
16340D85444F336J86284q4406L1433J7061J72549j30787K28749A98697K35194
16330D33891j92603A01455J73123e5440B72434M7739q0763h5509m0846C33582
16319G5871a02880A05154J43853C6663R5550J91302d4468b1770B27888L5725j8484
$$ plain form
16308 245129 -63633 178055 116673 255668 172159 363082 133434 283821 -200646 -85258
16297 209686 135604 249471 83395 121707 33517 81019 -58489 241797 139577 -9491 152807
16285 108694 347171 123308 -291340 -8749 106066 111359 -189376 -104506 20208 -69803 -9738
16273 -65832 451484 -43209 117624 -15040 444614 -15399 249978 23608 24163 97267 226783
16262 226783 -273888 -57333 113578 29692 -37324 408802 23772 236055 -91649 -202138
16252 -202138 -67560 -206192 80757 282902 31053 78217 143477 -32565 301252 -90430 -9180
16240 -325279 -49567 -137305 281798 -132675 237144 -135360 -52681 279550 -77274 -68648 -481176
16229 -481176 174969 122219 -36583 70255 4757 118823 -33632 60682 -132745 -171815 -187342
$$ packed form
16308B45129f3633A78055o1382J38995q3509J90923A33434J50387b00646h5258
16297B09686p4082J13867H3395L8312C3517M7502e8489B41797j02220i491A52807
16285A08694K38477A23308b91340h749A06066N293a89376Q4870B0208f9803i738
16273f5832D51484d3209A17624a5040D44614a5399B49978B3608N55P3104J29516
16262B26783b73888e7333A13578B9692c7324D08802B3772K12283i1649j10489
16252b02138f7560j38632H0757K02145C1053M7164O5260c2565C01252i0430i180
16240c25279d9567q7738B81798a32675B37144a35360e2681B79550g7274Q626m12528
16229d81176A74969n2750c6583G0255D757J14066c3632F0682a32745l9070j5527
$$ plain form
16218 -187342 -52710 8990 -78505 -258465 53586 -54889 -319107 -142551 70443 167133 -85168
16206 121103 251683 257160 88746 199489 181729 288583 193600 140094 -14163 -105 188041
16194 -9251 186873 -35010 -172278 -113966 296464 -218631 202134 -183000 46001 87632 179639
16183 179639 397260 -61478 1638 -123153 156697 211393 121334 141826 31885 199339 245936
16172 245936 -264720 -22243 -336317 47379 -110937 306831 -205702 -218640 -239514 60190
16161 174558 4676 29271 132988 302172 -210004 -41042 -264768 -158101 116615 260712
16151 260712 -55725 -72237 72668 -1366 223300 210022 91423 -227754 -72149 -159732 76143
16139 310368 -152797 246242 -30382 312006 -148897 -94479 228628 50215 -280595 270818
$$ packed form
16218a87342e2710H990g8505j79960E3586e4889k64218a42551G0443R6690h5168
16206A21103J30580N477H8746J10743j7760J06854r4983n3506a4163a05A88041
16194i251A86873c5010j37268N8312B96464b18631B02134a83000D6001M1631R2007
16183A79639K17621f1478A638a23153A56697N4696r0059K0492C1885J67454M6597
16172B45936b64720b2243l14074D7379a10937C06831b05702j2938k0874F0190
16161A74558D676K4595J03717J69184b10004d1042k23726J06667A16615J44097
16151B60712e5725j6512G2668a366B23300j3278I1423b27754g2149q7583G6143
16139C10368a52797B46242c0382C12006a48897N4418B28628E0215b80595B70818
$$ plain form
16128 -46263 18661 183945 -233655 166083 -73606 -120896 339122 118651 -414966 -106959
16117 -90941 -157441 -42288 -182338 -88840 -392288 -123636 40289 22521 -232890 17572 81018
16106 81018 -34452 15013 91585 127266 572326 56465 258643 323420 38605 -91917 -211095
16095 -211095 -11025 118824 85069 8863 -85402 -30917 9591 95213 -77675 -121051 -475130
16084 -475130 -6353 130192 -149983 -205345 -196269 218365 39618 88208 -262235 83984 -65162
16072 60120 -247230 160719 330063 -34904 110076 -9983 -186336 63039 -216349 -49135 33641
16060 -263821 -243682 -414613 -201734 -180807 -103429 -46836 95184 -152924 -40636 -43230 -338171
16049 -338171 -202791 252749 -89045 -220547 -29686 -97096 78989 95239 -205637 9322 60275
$$ packed form
16128d6263A8661J65284b33655A66083g3606m7290C39122A18651d14966a06959
16117i0941o6500d2288j40050h8840l03448a23636D0289j7768b32890A7572O3446
16106H1018c4452A5013P6572L5681M45060E6465K02178O4777C8605i1917j19178
16095b11095a1025A18824l3755H863h5402c0917I591Q5622g7675m3376l54079
16084d75130f353A30192a49983n5362R076B18365C9618M8590b62235H3984f5162
16072F0120b47230A60719J69344c4904A10076i983j76353F3039b16349d9135C3641
16060b63821K0139j70931b01734K0927P7378d6836I5184a52924d0636k594k94941
16049c38171J35380B52749h9045j31502b9686o7410G8989J6250b05637I322N0953
$$ plain form
16038 60275 146483 -366356 140548 208505 23348 -294972 167598 6097 -15863 141656 113907
16027 113907 -51265 -117535 169606 -143530 -329976 12096 32413 113940 -259293 358805
16016 61380 10311 -281791 18276 147641 -266027 -101627 -135767 -168313 223414 -140926
16005 -98859 95046 168736 -11096 -199437 -274325 -18567 -280014 -190457 77711 -114386 -112516
15994 -112516 -42764 -92373 131988 69854 -127347 -36728 323103 -110170 -17705 -271887
15984 -271887 150777 260549 320547 280232 656197 111652 -85284 -181248 241668 -161973
15973 50699 -178116 67625 248947 -147297 -5476 -236173 -100161 -280885 160590 270335
15963 270335 -36268 391675 245979 69562 -30385 -65688 350685 70653 -131522 -126465 78856
$$ packed form
16038F0275Q6208c66356A40548O7957B3348b94972A67598F097a5863A41656k7749
16027A13907e1265o6270A69606a43530j86446A2096K0317Q1527b59293C58805
16016F1380A0311b81791A8276J29365b66027a01627l4140l2546B23414a40926
16005i8859I5046P3690a1096j88341p4888a8567k61447Q9557G7711a14386J870
15994a12516d2764m9609A31988o2134a27347c6728C23103a10170a7705k54182
15984b71887A50777J09772N9998m0315L75965A11652h5284r5964B41668a61973
15973E0699a78116F7625J81322a47297e476k30697a00161j80724A60590J09745
15963B70335c6268C91675j45696F9562c0385l5303C50685G0653a31522N057G8856
$$ plain form
15951 6136 -65193 110611 215557 -120049 -186389 -32104 -424387 -49968 28124 -211480 -39002
15939 -56920 -79649 -119400 15033 -277288 81125 4405 -382324 -43853 160806 -79548 176290
15927 -99735 -275500 6082 -267611 -63870 217069 -98791 -33140 -92781 52000 -208689 -52535
15915 245147 -296964 -208394 100739 86162 164120 156499 115794 81653 -14718 66182 14822
15903 -75304 57644 75563 -85614 135942 153157 114024 -456651 -381630 -11936 301318 151386
15892 151386 -378885 99862 -205122 182656 75205 -46046 -460964 -27090 -87875 222343
15881 79521 -170770 -35009 95069 -62076 -185917 78634 17857 1607 228679 247162 192280
15870 192280 66619 -252764 -69216 22363 -133727 -32570 -42078 -893 -387588 203300 -365298
$$ packed form
15951F136f5193A10611J04946a20049o6340c2104l92283d9968B8124b11480c9002
15939e6920k2729l9751A5033b77288H1125D405c82324d3853A60806g9548A76290
15927i9735j75765F082b67611f3870B17069i8791c3140n9641E2000b08689e2535
15915B45147b96964Q8570A00739j4577P7958p621m0705l4141a4718F6182A4822
15903g5304E7644J7919h5614A35942J7215l9133d56651P5021a1936C01318j49932
15892A51386c78885I9862b05122A82656G5205d6046m14918b7090o0785B22343
15881G9521a70770c5009I5069f2076j23841G8634A7857A607K27072J8483n4882
15870A92280F6619b52764f9216B2363a33727c2570r508h93l86695B03300c65298
$$ plain form
15858 -97582 -262322 -230691 -12947 -74276 -197014 -271923 -183220 305509 -381279 102553 -151575
15846 142764 -196134 199756 -24620 -444993 136121 40449 269104 -98683 257393 151799
15836 151799 -149485 -55762 -96489 -136797 -203383 109528 -121607 -338409 197603 208862
15826 208862 -147396 132679 272078 186835 113284 -74903 -93191 -21676 161514 -348173
15815 -120805 147303 -133960 -287369 -43987 -528542 -200536 -198856 122247 -440150 481187
15804 122251 220224 189208 106291 -19967 -173478 -148946 -17098 57324 67345 -241383 -439
15792 -155488 -279527 294964 29201 -202681 89796 117433 -120684 26956 -48610 87001 -126506
15780 103168 -120466 214782 6716 -20159 24045 420630 -55817 -73455 -202394 74072 -309052
$$ packed form
15858i7582j64740L1631a2947o1329j22738p4909Q8703C05509c81279A02553a51575
15846A42764a96134A99756b4620m20373A36121D0449K28655i8683B57393j05594
15836A51799a49485e5762m0727m0308o6586A09528a21607k16802A97603J1259
15826B08862a47396A32679J39399q5243p3551g4903j8288b1676A61514c48173
15815a20805A47303a33960j53409d3987m84555b00536J680A22247d40150D81187
15804A22251R7973l1016q2917a9967j53511K4532a7098E7324J0021b41383d39
15792a55488j24039B94964B9201b02681H9796K7637a20684B6956d8610H7001a26506
15780A03168a20466B14782F716b0159B4045L96585e5817j7638j28939G4072c09052
$$ plain form
15768 -160266 -9550 -33030 -133547 79209 91629 -128118 188151 114633 -210158 12633 245191
15757 245191 -68534 -45087 234635 52338 -126836 -113926 94852 24190 276295 217429 -87942
15745 242906 6898 74828 51320 104328 -446213 17978 221264 152902 68009 22795 -118034
15733 81909 208700 -299613 -347567 265265 64943 -346799 30800 -172656 -103577 66010 -40100
15721 9951 60250 118443 -98610 -131865 1641 -271901 -159508 -153406 4537 55609 -13702 -37582
15709 -37582 77670 171040 -24340 -323814 -232802 -164164 -39195 100163 48795 -252118 39118
15697 -229664 -411132 -78441 35590 105535 65497 109844 7582 93123 153757 157689 268280
15686 268280 173405 153069 288181 -226850 -293974 -36262 -134447 46935 -167515 85329 309671
$$ packed form
15768a60266i550k3480j00517G9209J2420a28118A88151p3518b10158A2633K32558
15757B45191f8534K3447B34635E2338a26836J2910I4852B4190K52105n8866h7942
15745B42906F898O7930k3508N3008d46213A7978K03286o8362F8009B2795a18034
15733H1909J26791b99613m7954B65265F4943c46799C0800a72656O9079F6010d0100
15721I951N0299N8193i8610l3255A641b71901J12393O102D537N1072a3702k3880
15709c7582G7670R3370b4340k99474R1012O8638c9195A00163D8795b52118C9118
15697b29664j81468g8441C5590O9945m0038M4347G582Q5541O0634L932J10591
15686B68280r4875k0336J35112b26850o7124c6262r8185D6935a67515H5329K24342
$$ plain form
15675 309671 65974 -8277 -39971 -143615 201504 237123 -118684 50936 464746 250842 -211178
15663 -235113 155642 -15690 -100280 189716 -197348 63083 -9191 59290 -28348 115340 -248449
15651 -135226 -296012 132586 79622 -238146 -43848 -6827 -212872 -141156 90805 361235 -94187
15639 -98390 -14704 -150191 -240261 -164850 -125797 -355720 -136 -41217 245873 -174349 -190787
15628 -190787 21242 -167908 145010 234330 163833 -130950 230671 -175601 400362 167748
15617 -98344 84011 -88610 -121235 -4639 -51665 -152795 -400577 -240733 146181 -237489 -221505
15606 -221505 -41805 245850 134517 -166269 -361094 -157803 -111392 29448 -79802 -350980
15596 -350980 -183593 111308 -159097 137758 -170809 103265 186324 -189155 -22516 -116633
$$ packed form
15675C09671F5974h277l1694j03644B01504L5619a18684E0936M13810k13904b11178
15663b35113A55642a5690q4590A89716a97348F3083i191E9290b8348A15340b48449
15651a35226j60786A32586n2964b38146d3848f827k06045P1716I0805K70430i4187
15639i8390a4704j35487r0070P5411L9053k29923a36m1081B45873a74349j6438
15628a90787B1242a67908A45010Q9320p0497a30950B30671a75601D00362A67748
15617i8344H4011h8610l2625d639m7026j01130k47782J59844A46181b37489J5984
15606b21505d1805B45850j11333a66269j94825a57803M6411B9448g9802k71178
15596c50980J67387A11308a59097A37758a70809A03265Q3059a89155b2516r4117
$$ plain form
15586 -116633 -171859 -216864 426079 -179802 -73178 -247851 148764 -253709 -145175 126956
15575 47914 282185 -220919 101071 -96753 41091 -183188 66307 3475 130678 -186563 -113020
15564 -113020 78564 44153 137582 -15709 351651 435687 334819 108530 93446 35184 -28947
15552 -69331 -131138 81595 -284685 -135641 274374 -147214 -142074 46875 -49429 -185088 -143795
15541 -143795 98367 80662 -220499 365578 284185 207191 336318 134820 -202531 3554 76400
15530 76400 102341 -432914 109471 21150 212286 -115530 -2977 59865 -53081 -233531 -207113
15519 -207113 190504 -88400 117830 267443 142865 308695 -72908 -11771 -61282 -38726
15509 -38726 -108039 -141809 -103276 -106459 91815 -123656 123894 395807 63303 121322 -390552
$$ packed form
15586a16633n5226m5005D26079a79802g3178j74673A48764b53709J08534A26956
15575D7914K34271b20919A01071i6753D1091a83188F6307C475J27203a86563P3543
15564a13020G8564l4411R3429a5709C51651Q4036j00868A08530j5084C5184b8947
15552f9331o1807H1595b84685a35641B74374a47214N140D6875d9429j35659M1293
15541a43795I8367j7705b20499C65578q1393p6994J29127A34820b02531C554P2846
15530G6400K5941d32914A09471B1150J91136a15530b977E9865e3081j80450K6418
15519b07113A90504h8400A17830J49613j24578J65830g2908a1771m9511K2556
15509c8726o9313l3770L8533l183I1815a23656A23894K71913F3303N8019c90552
$$ plain form
15497 -365846 -10529 -62331 -63014 -238162 56118 168079 -56074 188887 -255730 155392 -78680
15485 -32501 57281 290278 82451 130092 134726 352333 29811 111201 -4110 138914 20765
15473 22101 -112482 -2931 131503 -178194 156703 -55908 125390 384179 -162511 -28622
15462 172486 167237 467033 -266164 268089 -40321 165386 -306072 -109259 34270 322630
15452 322630 208744 28662 -144145 54484 -179168 -296650 -267124 -93094 -104080 -95322 -303506
15441 -303506 65869 -372972 158746 -240115 -12391 168412 312414 -222884 282754 46930
15430 102413 -66982 65516 -198554 -234224 -29094 72039 -20716 122569 9859 16415 -34259
15418 25003 3980 -183352 -18862 66084 -336388 -236229 -10741 -204158 -151693 12086 -9461
$$ packed form
15497c65846a0529n1802o83j75148E6118J11961e6074A88887b55730A55392g8680
15485c2501E7281K32997H2451M7641M634K17607B9811Q1390d110A38914B0765
15473B2101a12482b931A31503a78194A56703e5908A25390K58789a62511b8622
15462A72486n249K99796b66164B68089d0321A65386c06072a09259C4270K88360
15452C22630j13886B8662a44145E4484a79168j17482K9526i3094j0986Q758k08184
15441c03506F5869c72972A58746b40115a2391A68412J44002b22884B82754D6930
15430A02413f6982F5516a98554l5670b9094G2039b0716A22569I859O556c4259
15418B5003C980a83352a8862F6084c36388J00159a0741j93417N2465A2086i461
$$ plain form
15406 -131492 -160618 -337057 272832 183624 -141844 8041 216110 167630 288313 -53027 -95206
15395 -95206 -41581 -149968 -142778 238388 119560 85851 -133627 264353 -201826 71908 26744
15383 -454336 99517 -50128 31999 28046 223750 -61094 -101299 92364 -473554 -246816 79825
15371 46577 5399 9838 99044 -48359 281223 -151879 17870 75152 -115442 -45497 38876
15359 -40234 -262278 -133192 69429 -173681 -96581 307967 -89640 173379 104696 77277 -118919
15347 353 219823 86554 -161017 10347 45729 172579 139183 5977 67689 -126943 -5660 175228
15334 -377427 58958 -253856 131552 -20857 54804 287638 218939 311025 -155765 492164
15323 358508 575322 262218 -93204 -207161 -160293 -167770 -210080 156351 23421 209857 -302690
$$ packed form
15406a31492k9126j76439B72832q9208a41844H041K08069m8480J20683e3027m2179
15395i5206d1581j08387P190B38388j18828l3709a33627B64353b01826G1908B6744
15383d54336I9517e0128C1999l953J95704f1094m0205I2364d73554K26738G9825
15371D6577E399M439Q9206d8359B81223a51879A7870N7282a15442d5497C8876
15359d0234k22044J29086F9429a73681P7100C07967h9640A73379o8683k7419a18919
15347C53K19470H6554a61017A0347L5382J26850l3396E977O1712a26943e660A75228
15334c77427E8958b53856A31552b0857E4804K32834o8699R2086a55765D92164
15323C58508K16814B62218i3204j13957M6868p477m2310A56351B3421J86436c02690
$$ plain form
15311 -114043 42884 -100598 -167866 77502 34205 -104453 172727 -62370 -94374 260415 -8416
15299 -246092 329294 114611 126054 407577 -121271 -46747 142170 210460 179575 -12088
15288 187744 -96689 5776 396112 -173257 2371 366445 -47968 77672 154571 397459 197590
15276 174966 335158 147388 -202643 107869 212317 216772 -206414 -95774 -167198 241563
15265 -17342 5442 233777 -145292 -357337 191647 220229 44272 -224614 -26432 59335 233534
15254 233534 106411 277999 -90895 43347 131322 319403 214182 -81488 675670 82366
15243 658388 1663383 2829814 2669586 2007984 2754750 659565 522430 459051 288339
15234 288339 103449 310053 -27389 -66071 97441 523219 42600 11400 102448 -3997 168254
$$ packed form
15311a14043D2884a00598o7268G7502C4205a04453A72727f2370l2004B60415h416
15299b46092C29294A14611J1443K81523a21271d6747A42170O8290l0885a2088
15288A87744i6689E776L90336a73257B371L64074d7968G7672P6899K42888A97590
15276A74966J60192A47388b02643A07869J04448M455b06414i5774p1424B41563
15265a7342E442K28335a45292k12045A91647K8582D4272b24614b6432E9335J74199
15254B33534A06411J71588i0895D3347Q7975J88081j05221h1488F75670H2366
15243F58388J004995J166431j60228o61602P46766F59565j37135o3379j70712
15234B88339A03449K06604b7389l8682I7441M25778D2600A1400R1048c997A68254
$$ plain form
15222 158855 23671 17806 494045 244646 124315 25373 -101841 449926 43042 -263482
15211 -33452 279610 71808 -193375 76873 -176619 314579 69914 1765 228415 222845 79030
15199 118227 161940 55521 200225 243292 68289 -250882 15927 -33817 802 150994 84266
15188 84266 -64855 -349779 -148197 -247127 42372 310899 -175952 -148792 90687 358541 131631
15176 -177930 274439 210113 -58107 12712 -6158 -234949 170603 10672 -293591 -50476 -72734
15165 -72734 14136 179110 181415 65904 8180 276963 108733 235114 211320 47955 -38329
15153 176852 -56987 351779 228358 413387 92552 -73423 114968 -433542 -380171 -77739
15142 28609 117915 53709 186213 221709 231592 436658 69872 203642 340843 217051 -27198
$$ packed form
15222A58855B3671n865M76239B44646j20331B5373a01841D49926D3042b63482
15211c3452B79610G1808a93375G6873a76619C14579F9914A765K26650n570G9030
15199A18227M3713E5521J44704M3067F8289b50882A5927c3817H02J50192o6728
15188H4266f4855k84924a48197r8930D2372K68527a75952K7160I0687K67854A31631
15176a77930B74439o4326e8107A2712f158k28791A70603A0672b93591e0476k2258
15165g2734A4136J64974K305F5904H180K68783A08733J26381k3794D7955c8329
15153A76852e6987C51779j23421J85029I2552g3423A14968d33542N3371g7739
15142B8609Q9306E3709J32504L5496R883K05066F9872J33770J37201j23792b7198
$$ plain form
15130 97252 -73601 -186209 484661 25900 -1792 304262 51763 101723 252516 -216432 1164
15118 -79434 204310 40039 -6610 451076 129318 151642 57370 -472 454236 219999 43916
15106 56299 146059 92439 -3624 210864 58025 123572 -39805 80214 142185 298508 326228
15095 326228 389774 142141 267225 330120 315633 207434 257805 39570 398197 41811 -51925
15083 -5294 214691 29217 192003 84656 182219 364664 -108093 -138984 217170 -8306 562462
15071 272923 408942 140326 -80846 385072 316016 231153 -88271 82197 410268 82087 88594
15060 88594 -194662 167009 339184 113380 455658 187556 -114267 189107 142922 446281
15050 446281 187106 48105 229676 -101199 -212242 153685 136007 411410 -45491 618340
$$ packed form
15130I7252g3601j12608D84661B5900a792C04262E1763M9960J50793b16432A164
15118g9434B04310D0039f610D51076A29318K2324E7370d72D54236B19999D3916
15106E6299Q9760n3620c624B10864E8025O5547c9805H0214O1971J56323K7720
15095C26228O3546A42141J25084O2895j4487j08199N0371C9570L58627D1811e1925
15083e294B14691B9217J62786H4656R7563J82445a08093l0891B17170h306E62462
15071B72923J36019A40326h0846C85072o9056q4863h8271H2197L28071H2087O507
15060H8594a94662A67009J72175A13380L42278A87556a14267A89107m6185L03359
15050D46281A87106D8105J81571a01199j11043A53685j7678K75403d5491F18340
$$ plain form
15039 232185 189601 463077 132177 171254 254574 436532 553217 78218 195028 -86811
15028 187852 402416 136155 381807 91905 472302 164124 220054 139678 95091 377047
15018 377047 -6874 334636 119919 301907 209887 271471 148349 54992 306443 191844
15008 191844 350674 229253 491358 334510 506650 342327 454357 448749 357237 185099
14998 185099 -68014 168663 444500 405944 -142721 210488 179888 -12859 328856 94872
14987 93555 277876 304152 482927 -3406 188392 304230 199227 295523 279573 342400 386272
14976 386272 273794 14577 190436 293641 50569 88387 6222 270432 410360 597141
14966 597141 -28879 72261 354324 61854 26185 488959 441541 188518 37978 216447 121857
$$ packed form
15039B32185m2584K73476A32177L9077Q3320J81958J16685G8218J16810h6811
15028A87852K14564A36155K45652I1905L80397A64124N5930q0376m4587K81956
15018C77047f874C34636A19919J81988r2020O1584j23122E4992K51451j14599
15008A91844J58830j21421K62105j56848J72140j64323J12030n608r1512j72138
14998A85099f8014A68663K75837l8556a42721B10488l0600a2859C28856I4872
14987I3555J84321K6276J78775c406A88392J15838j05003R6296j5950O2827M3872
14976C86272j12478A4577J75859J03205E0569L7818F222K64210J39928J86781
14966E97141b8879G2261K82063F1854B6185M62774m7418A88518C7978J78469r4590
$$ plain form
14955 121857 504188 330699 53316 479517 330013 342439 164311 290269 230122 27805
14944 271642 169334 -97366 300235 314786 213269 332570 -8624 441406 -187 241991 369421
14933 369421 317431 492393 482602 378336 304653 458828 -294242 265636 259082 224885 20065
14921 419808 310272 471229 545581 228640 424079 422024 450711 288314 286540 -118296 382441
14909 177695 90061 389393 640109 528587 158912 379841 603129 404024 54128 51779
14899 51779 471690 149728 568722 695100 33733 249521 539589 280773 297348 265335
14889 265335 54146 417741 433901 283742 697766 340542 256352 386319 330186 275931
14879 275931 66521 471752 359660 14588 58878 87576 640817 398487 248335 623929
$$ packed form
14955A21857L82331j73489E3316M26201j49504J2426A64311J25958o0147B7805
14944B71642j02308i7366C00235J4551j01517J19301h624D41406a87B41991J27430
14933C69421n1990J74962r791j04266p3683J54175b94242B65636o554l4197B0065
14921D19808j09536J60957P4352B28640J95439k055K8687j62397j774a18296C82441
14909A77695q7634K99332K50716j11522A58912K20929K23288j99105E4128k349
14899E1779M19911A49728M18994J26378C3733K15788K90068k58816J6575l2013
14889B65335E4146L63595J6160j50159M14024C40542q4190J29967n6133n4255
14879B75931F6521M05231j12092A4588M4290K8698N53241k42330j50152L75594
$$ plain form
14869 623929 -331109 342925 240343 514673 367788 420957 369516 210627 395131 420646
14859 420646 536586 650364 297675 246756 541427 477985 653985 351591 577611 697117
14849 697117 447677 727879 424047 419751 543531 391571 465978 252368 616922 482469
14839 482469 250973 1023093 396517 861272 549638 653794 465570 636092 718248 203347
14828 425723 294407 321026 362757 774880 388591 632467 293091 542895 16712 690411
14818 690411 513425 478355 793511 520407 689935 493589 759902 367790 547076 672421
14808 672421 266880 181907 504705 472498 687391 694168 419445 590396 782364 756733
14798 756733 361673 404595 417492 762077 486535 503093 507503 511295 672145 580339 504325
$$ packed form
14869F23929c31109C42925j02582K74330j46885N3169n1441j58889J84504K5515
14859D20646J15940J13778B97675n0919K94671o3442J76000l02394K26020J19506
14849F97117k49440K80202l03832m296J23780j51960P4407k13610L64554j34453
14839D82469k31496P72120C96517M64755l11634J04156j88224J70522Q2156B03347
14828D25723j31316K6619M1731M12123l86289K43876B93091K49804A6712O73699
14818F90411j76986l5070L15156k73104J69528j96346K66313C67790J79286J25345
14808F72421B66880q4973L22798l2207K14893O777k74723J70951J91968k5631
14798G56733C61673M2922J2897L44585k75542J6558M410L792J60850r1806p6014
$$ plain form
14787 504325 713135 693044 661227 857203 464879 809240 515929 670778 530208 531411
14777 531411 1042006 628871 549991 842001 727783 625569 434474 578613 544637 521867
14767 521867 623425 691650 818016 864254 748052 528617 530368 699651 287617 429054
14757 429054 874764 785613 657596 741127 671750 975038 460396 780857 1073711 913077
14747 913077 626411 699735 439597 788848 625853 815087 829499 878111 733715 850243
14737 850243 814984 738196 671820 733354 768185 804102 482156 646629 717805 600950 641369
14726 641369 909352 781287 727600 1002827 1002354 898687 931032 818038 926798 1036522
14716 1036522 621013 716371 553768 710512 840815 843725 918928 943016 757968 1017539
$$ packed form
14787E04325K08810k0091l1817J95976l92324L44361k93311J54849j40570J203
14777E31411N10595m13135p8880K92010j14218j02214j91095J44139l3976k2770
14767E21867J01558O8225J26366M6238j16202k19435J751J69283B87617J41437
14757D29054M45710q9151j28017Q3531o9377L03288D60396L20461K92854j60634
14747I13077k86666P3324k60138L49251j62995J89234J4412M8612j44396J16528
14737H50243l5259p6788o6376O1534L4831L5917l21946J64473P1176j16855M0419
14726F41369K67983j28065n3687K75227m73j03667L2345j12994J08760J09724
14716A036522m15509R5358j62603J56744J30303K910P5203K4088j85048K59571
$$ plain form
14706 1017539 592818 1089413 1016573 973926 823336 551445 1055963 1114800 1145087 890509
14696 890509 748613 889571 943832 1131889 911844 885142 981646 1038323 957853 1140993
14686 1140993 1376154 937410 1009104 920992 1182657 997038 1164443 843961 1081251 860430
14676 860430 1103577 877164 998626 888818 1111048 1017200 1101326 979451 996794 1021384
14666 1021384 1260405 1042500 1103018 1125704 924512 1044166 1203872 1499613 1287331 893704
14656 893704 1189520 1150884 1254664 1504211 948467 835513 1476338 1173615 1365280 1151494
14646 1151494 1142077 1273092 1530671 1549802 924771 1469082 1528305 1234723 1532091 1274785
14636 1274785 1346322 1318997 1200556 1299549 1581229 1560710 1588315 1637539 1349410 1326864 1180771
$$ packed form
14706A017539m24721M96595p2840m2647j50590k71891N04518N8837L0287k54578
14696H90509j41896J40958N4261J88057k20045k6702R6504N6677q0470J83140
14686A140993K35161m38744P1694q8112K61665j85619J67405l20482K37290k20821
14676H60430K43147k26413J21462j09808K22230r3848Q4126j21875J7343K4590
14666A021384K39021k17905O0518K2686k01192J19654J59706K95741k12282l93627
14656H93704K95816l8636J03780K49547n55744j12954O40825l02723J91665k13786
14646A151494r417J31015K57579J9131o25031N44311N9223k93582K97368k57306
14636A274785P1537k7325j18441R8993K81680k0519K7605M9224k88129k2546j46093
$$ plain form
14625 1180771 1246139 1588653 1795316 1320661 1413339 1541800 1417886 1296188 1812523 1300952
14615 1300952 1593996 1408055 1477290 1381681 1312902 1558162 1852274 1315158 1783043 1602488
14605 1602488 1840168 1327173 1518873 1717911 1795257 1400590 1518280 1718022 1883538 1630256
14595 1630256 1854268 2049406 1774840 1599704 1968275 1953513 1650500 1583104 1829514 2090206
14585 2090206 1773979 1750044 2095188 2296837 2150255 2346682 1965890 2000192 1722530 2143017
14575 2143017 2020998 2379101 2554495 2371351 2209232 2172475 2035163 2271019 2490978 2499596
14565 2499596 2359768 2627807 2460093 2411047 2676499 2811870 2795342 2975877 2996313 3005907
14555 3005907 3174174 3321950 3404520 4094767 4312666 5208124 7614647 12502840 23274039
$$ packed form
14625A180771O5368L42514K06663m74655R2678J28461j23914j21698N16335n11571
14615A300952K93044j85941O9235r5609o8779K45260K94112n37116M67885j80555
14605A602488K37680n12995J91700J99038P7346l94667J17690J99742J65516k53282
14595A630256K24012J95138k74566j75136L68571j4762l03013o7396K46410K60692
14585B090206l16227k3935L45144K01649j46582J96427l80792L4302k77662M20487
14575B143017j22019L58103J75394j83144j62119l6757j37312K35856K19959Q618
14565B499596j39828K68039j67714m9046K65452J35371j6528J80535K0436R594
14555C005907J68267J47776Q2570O90247K17899Q95458K406523M888193J0771199
$$ plain form
14546 23274039 39318261 57342288 17586099 6184086 3526072 3000570 2753095 3485225
14538 3485225 4843915 8053364 3919066 2360774 2451593 2337804 1981781 1943527 2089319
14529 2089319 2290995 2602159 2339392 2403219 2266171 2335117 2423943 2438602 2275205 2609555
14519 2609555 2713124 2758934 2735443 2520185 2540877 2925559 2529161 2750464 2678936 2639055
14509 2639055 2703102 3104950 2852970 3042463 2888141 3031483 3000280 2916926 2815139 3270607
14499 3270607 3379032 2985786 3292522 3141172 3213118 3527136 3399090 3676906 3435223 3598021
14489 3598021 3678119 3766366 3428397 3855955 3693020 3722582 4032350 4001224 3995214 4135163
14479 4135163 4231911 4003884 4192166 4378529 4380003 4192979 4489996 4388892 4396550 4733377
$$ packed form
14546B3274039J6044222J8024027A7586099F184086k658014n25502k47475P32130
14538C485225J358690L209449C919066j558292R0819j13789l56023l8254J45792
14529B089319K01676L11164k62767O3827j37048O8946Q8826J4659j63397L34350
14519B609555J03569M5810k3491k15258K0692L84682l96398K21303p1528l9881
14509B639055O4047M01848k51980J89493j54322J43342l1203q3354j01787M55468
14499C270607J08425l93246L06736j51350P1946L14018j28046K77816k41683J62798
14489C598021Q0098Q8247l37969M27558j62935K9562L09768l1126o010J39949
14479D135163R6748k28027J88282J86363J474j87024K97017j01104P658L36827
$$ plain form
14469 4733377 4510451 4738154 4649640 4660550 4867102 4732092 4829864 5044610 4994489 4969484
14459 4969484 5259892 5051885 5479499 5001638 5439341 5430407 5339611 5534658 5103094 5533849
14449 5533849 5786937 5824432 5872189 5679064 5867177 6643162 6205662 6731453 6354555 6148087
14439 6148087 6731815 6302871 6311587 6549329 6515847 6924748 7102879 6992947 7226828 7164961
14429 7164961 7380103 7685862 7389760 7309194 7563336 8138568 7573887 7988052 7941518 8253499
14419 8253499 7868080 8493843 8804251 8974566 8857465 8942189 9420320 8849731 9264708 9603502
14409 9603502 9585009 9420988 10145153 10164928 10031654 10195131 10832489 10555237 10888859 11022917
14399 11022917 11072489 11431641 11508601 11668409 11847649 11827271 12391037 12538925 12422522 13019433
$$ packed form
14469D733377k22926K27703q8514J0910K06552j35010R7772K14746n0121k5005
14459D969484K90408k08007M27614m77861M37703q934r0796J95047m31564M30755
14449E533849K53088L7495M7757j93125J88113P75985m37500N25791l76898k06468
14439F148087N83728m28944Q716K37742l3482M08901J78131j09932K33881o1867
14429G164961K15142L05759k96102q0566K54142N75232n64681M14165m6534L11981
14419H253499l85419O25763L10408J70315j17101Q4724M78131n70589M14977L38794
14409I603502j8493j64021P24165J9775j33274J63477O37358k77252L33622J34058
14399A1022917M9572L59152P6960J59808J79240k0378N63766J47888j16403N96911
$$ plain form
14389 13019433 12642865 12840189 13562988 13840101 13967989 14044870 14409750 14316561 14830542 15179764
14379 15179764 15449767 15584936 16032807 16187784 16420873 16995833 17061466 17502027 17763620
14370 17763620 18257048 18730632 18880950 19417619 19854041 19865760 20651672 21480780 21838172
14361 21838172 22181472 22543978 23099542 23470372 23959096 24624586 25048128 26096407 26366309
14352 26366309 27333928 27539876 28498232 29074180 29595334 30609694 31345761 32349086 33030680
14343 33030680 33839663 34907828 35660702 36345413 38050020 38680070 40092396 40857370 42025519
14334 42025519 43459376 44679976 46124916 47487884 48856841 50679958 52254688 53684611
14326 53684611 55752002 57517890 59470593 61397595 63595057 66049196 68066643 70657043
$$ packed form
14389A3019433l76568J97324P22799K77113J27888P6881L64880r3189N13981L49222
14379A5179764K70003J35169M47871J54977K33089N74960O5633M40561K61593
14370A7763620M93428M73584J50318N36669M36422J1719P85912Q29108L57392
14361B1838172L43300L62506N55564L70830M88724O65490M23542J048279K69902
14352B6366309R67619K05948R58356N75948N21154J014360P36067J003325O81594
14343C3030680Q08983J068165P52874O84711J704607O30050J412326P64974J168149
14334D2025519J433857J220600J444940J362968J368957J823117J574730J429923
14326E3684611K067391J765888J952703J927002K197462K454139K017447K590400
$$ plain form
14318 70657043 73290327 75689181 78693398 81786702 84678482 88282432 91808771 95649732
14310 95649732 99234752 103469841 107777698 112573021 117203283 122413389 128020400 134169587
14302 134169587 139931087 146160912 152979245 160443262 168225163 176746380 185334285 194542435
14294 194542435 204493247 214808424 225420504 236792315 249123995 261635168 275128214
14287 275128214 288961481 303020742 317906880 333194684 348843929 364907802 380661398
14280 380661398 396537482 412224517 427151281 441486513 454510202 466168254 475886869
14273 475886869 481095233 482535662 478595794 479235766 483565059 478248909 474565560 466511143
14265 466511143 456556056 445043372 431853229 417885046 402735103 386677377 370515195
$$ packed form
14318G0657043K633284K398854L004217L093304K891780L603950L526339L840961
14310I5649732L585020M235089M307857M795323M630262N210106N607011O149187
14302A34169587N761500O229825O818333P464017P781901Q521217Q587905R208150
14294A94542435R950812J0315177J0612080J1371811J2331680J2511173J3493046
14287B75128214J3833267J4059261J4886138J5287804J5649245J6063873J5753596
14280C80661398J5876084J5687035J4926764J4335232J3023689J1658052R718615
14273D75886869N208364J440429l939868O39972M329293n316150l683349q054417
14265D66511143r955087j1512684j3190143j3968183j5149943j6057726j6162182
$$ plain form
14258 370515195 354300897 337839194 321684424 306011304 290770143 275830294 262053856
14251 262053856 248639071 235935580 223855549 214210982 204691912 194135261 184449103
14244 184449103 175833321 166955293 159218966 151539910 144617341 137646627 132087088 126456126
14236 126456126 120755733 115285839 110415888 105869987 101533796 98178707 94010321 90383872
14228 90383872 86611056 83389928 80078330 77087613 74349702 71652348 69170109 67142836
14220 67142836 64779131 62568629 60177451 58379010 56333485 54740667 53394592 51878813
14212 51878813 49831071 48185864 46932915 45507662 44685499 43832464 42363233 40787993
14204 40787993 39541221 38447899 37451593 36735721 36157188 35002322 33875004 32981431 32280188
$$ packed form
14258C70515195j6214298j6461703j6154770j5673120j5241161j4939849j3776438
14251B62053856j3414785j2703491j2080031r644567r519070j0556651r686158
14244A84449103q615782q878028p736327p679056o922569o970714n559539n630962
14236A26456126n700393n469894m869951m545901m336191l355089m168386l626449
14228I0383872l772816l221128l311598k990717k737911k697354k482239k027273
14220F7142836k363705k210502k391178j798441k045525j592818j346075j515779
14212E1878813k047742j645207j252949j425253q22163q53035j469231j575240
14204D0787993j246772j093322r96306p15872n78533j154866j127318q93573p01243
$$ plain form
14195 32280188 31615265 30937283 30168456 29407667 28880026 27709074 27157343 26559219 25734044
14186 25734044 25278492 24697186 24180701 23731790 23181580 22629906 22044737 21776137 21383106
14177 21383106 20986776 20392149 20087437 19713665 19322334 18544993 18549186 18158071 17935124 17370423
14167 17370423 17144507 16709934 16481007 16279355 15809994 15863028 15292149 15021786 14813886
14158 14813886 14396034 14328075 13934512 13493567 13575803 13377056 13360822 12900783 12353050 12327792
14148 12327792 12231707 12112739 11924473 11597539 11112153 11246181 10702512 10883972 10751648
14139 10751648 10149323 10387333 10037089 9883708 9810155 9867121 9362690 9472579 9285267 9189242
14129 9189242 8939253 8738952 8870838 8570288 8426379 8701424 8562790 8062312 7687788
$$ packed form
14195C2280188o64923o77982p68827p60789n27641j170952n51731n98124q25175
14186B5734044m55552n81306n16485m48911n50210n51674n85169k68600l93031
14177B1383106l96330n94627l04712l73772l91331p77341M193l91115k22947n64701
14167A7370423k25916m34573k28927k01652m69361N3034n70879k70363k07900
14158A4813886m17852o7959l93563m40945Q2236j98747j6234m60039n47733k5258
14148A2327792r6085j18968j88266l26934m85386J34028n43669J81460j32324
14139A0751648o02325K38010l50244j53381p3553N6966n04431J09889j87312r6025
14129I189242k49989k00301J31886l00550j43909K75045j38634n00478l74524
$$ plain form
14120 7687788 8150190 7891063 7623647 8140600 7728959 7361746 7308014 7375003 7023811 6848909
14110 6848909 7220063 6873149 6875572 6664322 6547122 6597675 6382957 6608884 6332000 6457758
14100 6457758 6199385 6033555 6297703 6145727 5841874 6006644 6036306 5680314 5764988 5385947
14090 5385947 5777900 5378005 5392598 5585336 5293954 5157745 5001550 5077617 5092605 4864790
14080 4864790 4517732 4933508 4727708 4682662 4595930 4842161 4600400 4624560 4521270 4332172
14070 4332172 4337671 4536852 4563252 4457447 4341368 4120646 4042647 4544173 4252192 4125820
14060 4125820 4485653 4171113 4378812 4344440 3990132 4109175 3949127 3758012 3948741 3757775
14050 3757775 3778543 3750786 3537026 3327057 3369303 3279799 3794353 3457227 3672044 3382558
$$ packed form
14120G687788M62402k59127k67416N16953m11641l67213n3732O6989l51192j74902
14110F848909L71154l46914K423k11250j17200N0553k14718K25927k76884J25758
14100F457758k58373j65830K64148j51976l03853J64770K9662l55992Q4674l79041
14090E385947L91953l99895J4593J92738k91382j36209j56195P6067J4988k27815
14080D864790l47058M15776k05800m5046q6732K46231k41761K4160j03290j89098
14070D332172N499J99181K6400j05805j16079k20722p7999N01526k91981j26372
14060D125820L59833l14540K07699l4372l54308J19043j60048j91115J90729j90966
14050C757775K0768k7757k13760k09969M2246q9504N14554l37126K14817k89486
$$ plain form
14040 3382558 3255536 3348597 3198528 3408716 3351900 3199803 3388503 3212570 3156045 3282787
14030 3282787 2941954 3264584 3385048 3380016 3332973 2789222 3207634 2778252 2590754 2825280
14020 2825280 2686357 2543132 2478668 2595052 2787657 2858106 2476091 2467006 2797926 2723758
14010 2723758 2298287 2383005 2071096 2586871 2217929 2287579 2220044 2228841 2422969 2607421
14000 2607421 2203093 1907896 2172591 2039945 2306091 2005276 1901432 2442277 2062167
13991 2062167 1894705 2278599 3173807 6545875 15566263 31403402 59540285 26274229
13982 11965255 7064240 5505811 4567917 3871805 3768963 3348148 3076316 3113619 2774526
13973 2774526 2836916 2807722 2640707 2096141 2145257 2467538 2509334 2467318 2656583 2213428
$$ packed form
14040C382558j27022R3061j50069K10188n6816j52097J88700j75933n6525J26742
14030C282787l40833L22630J20464n032m7043n43751M18412m29382j87498K34526
14020B825280j38923j43225o4464J16384J92605P0449l82015r085L30920p4168
14010B723758m25471Q4718l11909N15775l68942O9650o7535Q797J94128J84452
14000B607421m04328k95197K64695j32646K66146l00815j03844N40845l80110
13991B062167j67462L83894Q95208L372068R020388J5837139K8136883B6274229
13982A1965255m901015j558429r37894o96112j02842m20815k71832L7303l39093
13973B774526O2390k9194j67015n44566M9116L22281M1796m2016J89265m43155
$$ plain form
13963 2213428 2451755 2301399 2262550 2221709 2267108 2339604 2166576 2382670 2224116 1873137
13953 1873137 2049984 1831964 1832459 2097439 1943140 1841761 2095343 1786234 1678455 1527881
13943 1527881 1777726 1797138 1903385 2007765 1826428 1843738 2239485 1737692 1516784 2091231
13933 2091231 2028551 1825800 2012299 1855593 1488717 1553847 1705536 1647803 1553371 1728964
13923 1728964 1572959 1732968 1502898 1369841 1862907 1677350 1805214 1242030 1446401
13914 1446401 1406930 1437655 1506403 1271674 1382344 1291966 1811153 1281875 1187362 1479834
13904 1479834 1499586 1432553 1311812 1595415 1143629 1376568 1228147 1361652 1293610 1336125
13894 1336125 1309361 1187675 1444333 1218606 1156136 1430286 1342387 1219452 1145987 1518727
$$ packed form
13963B213428K38327j50356l8849m0841M5399P2496j73028K16094j58554l50979
13953A873137J76847k18020M95K64980j54299j01379K53582l09109j07779j50574
13943A527881K49845J9412J06247J04380j81337J7310L95747n01793k20908N74447
13933B091231o2680k02751J86499j56706l66876O5130J51689n7733r4432J75593
13923A728964j56005J60009k30070j33057M93066j85557J27864n63184K04371
13914A446401l9471L0725O8748k34729J10670r0378N19187n29278r4513K92472
13904A479834J9752o7033j20741K83603m51786K32939j48421J33505o8042M2515
13894A336125k6764j21686K56658k25727o2470K74150q7899j22935p3465L72740
$$ plain form
13884 1518727 1574185 1345881 1658862 1234791 1314062 1218646 1246620 1429037 917703 1137629
13874 1137629 1004936 1008591 941331 1429300 1505337 1278894 927667 903940 1108482 1042722
13864 1042722 1298484 1118265 903673 1076089 1297866 1190599 1062407 1183501 1294808
13855 1294808 958981 1024442 1062132 843791 1261298 1006135 902283 1050247 955694 1024069
13845 1024069 1000171 1089167 1211554 1135538 1116207 830909 1042706 875539 1062767 871272
13835 871272 617206 1097946 728078 959586 846240 955454 930440 917193 985399 1039268
13825 1039268 936303 851948 662361 1325052 821454 1273061 1138164 520943 947037 1167547
13815 1167547 1132317 859937 812541 647240 717187 949525 999988 631539 851810 942305
$$ packed form
13884A518727N5458k28304L12981m24071P9271r5416K7974J82417n11334K19926
13874A137629j32693L655o7260M87969P6037k26443l51227k3727K04542o5760
13864A042722K55762j80219k14592J72416K21777j07267j28192J21094J11307
13855A294808l35827O5461L7690k18341M17507k55163j03852J47964r4553O8375
13845A024069k3898Q8996J22387p6016j9331k85298K11797j67167J87228j91495
13835H71272k54066M80740l69868K31508j13346J09214k5014j3247O8206N3869
13825A039268j02965q4355j89587O62691n03598M51607j34897E20943M26094K20510
13815A167547l5230k72380m7396j65301O9947K32338N0463l68449K20271R0495
$$ plain form
13805 942305 1015870 711722 750692 817396 1043016 750857 607118 674049 670642 750002 1036840
13794 1036840 812171 1005126 917590 988313 951963 864557 740707 548517 575583 744611
13784 744611 568752 562084 982271 540607 565662 978798 884242 777197 432871 675602
13774 675602 722621 967081 827843 726102 541296 357254 504318 354080 1038558 500951
13763 207349 520951 675994 573463 641879 935025 738027 704559 956978 758494 575140
13753 575140 638764 844920 684125 718327 715525 510204 873917 678885 466432 753636
13743 753636 784537 383023 708482 427128 822333 523783 336053 596287 470767 406018
13733 406018 613304 928200 558820 761716 413052 694075 777178 620858 775439 493351
$$ packed form
13805I42305P3565l04148L8970O6704K25620k92159j43739O6931l407P9360K86838
13794A036840k24669J92955q7536P0723l6350q7406j23850j92190K7066J69028
13784G44611j75859o668M20187m41664K5055M13136r4556j07045l44326K42731
13774F75602M7019K44460j39238j01741j84806j84042J47064j50238O84478E00951
13763B07349L13602J55043j02531O8416K93146j96998l3468K52419j98484j83354
13753E75140O3624K06156j60795L4202k802k05321L63713j95032k12453K87204
13743G53636L0901C83023L25459k81354L95205k98550j87730K60234j25520o4749
13733D06018K07286L14896l69380K02896l48664K81023Q3103j56320J54581k82088
$$ plain form
13723 493351 606819 161904 772252 194817 473593 606653 334394 572361 480156 467195
13713 467195 846462 574540 449603 704695 527811 633923 729552 424368 533416 714702
13703 714702 536885 882987 429497 449150 802945 639234 572973 533529 612167 630365
13693 630365 459491 671092 476651 630860 419492 303851 449500 607503 432990 443533
13683 443533 568252 614011 400928 561170 773568 240343 632890 724855 625404 375592
13673 375592 451567 697471 692620 -16031 536082 625960 344901 337627 333736 283985 603263
13662 603263 603506 388514 308909 412717 105370 398910 250270 258618 377726 450111 520360
13651 520360 388309 494814 318873 308461 318261 196242 263510 728280 308414 419266
$$ packed form
13723D93351J13468A61904O10348A94817K78776J33060k72259K37967r2205j2961
13713D67195L79267k71922j24937K55092j76884J06112R5629l05184J09048J81286
13703G14702j77817L46102D29497J9653L53795j63711o6261l9444P8638J8198
13693F30365j70874K11601j94441J54209k11368j15641J45649J58003j74513J0543
13683D43533J24719M5759k13083J60242K12398B40343L92547R1965r9451k49812
13673C75592P5975K45904m851a6031E36082Q9878k81059p274l891m9751L19278
13662F03263K43k14992p9605J03808A05370K93540j48640Q348J19108P2385P0249
13651E20360j32051J06505j75941j0412R800j22019O7268M64770C08414J10852
$$ plain form
13641 419266 344532 598272 486800 328356 446912 380132 208254 397347 364449 750863
13631 750863 333386 492422 355315 645025 646322 828522 622843 474506 220892 192279
13621 192279 398888 484727 250852 611959 407776 152532 374689 -54851 443777 445873
13611 445873 256812 533407 263045 564374 348300 259585 346388 301585 305242 320818 -13061
13599 405400 275517 613418 649250 535988 65336 739654 394120 277082 343187 436212
13589 436212 110059 543335 454901 338987 194227 316189 23552 340467 695346 243603
13578 546334 418383 470419 138092 377459 -212662 236003 136465 665213 318439 284184
13568 284184 679364 410362 303460 173865 319954 222982 563458 257360 320373 540824
$$ packed form
13641D19266p4734K53740j11472j58444J18556o6780j71878J89093l2898L86414
13631G50863C33386J59036j37107K89710J297J82200k05679j48337B20892k8613
13621A92279K06609Q5839k33875L61107k04183A52532K22157e4851D43777K096
13611D45873j89061K76595B63045L01329k16074q8715Q6803m4803L657J5576a3061
13599D05400j29883L37901L5832j13262F5336O74318l45534j17038O6105R3025
13589D36212A10059M33276q8434j15914j44760J21962B3552L16915L54879B43603
13578E46334j27951N2036A38092K39367b12662B36003r9538N28748C18439l4255
13568B84184L95180k69002j06902j29595J46089r6972L40476B57360O3013K20451
$$ plain form
13558 540824 357312 475551 357953 377323 331572 128661 24385 204655 566165 247951
13547 131283 337662 117283 83963 253240 207262 318971 286063 385889 101625 -15298
13536 657449 392890 174264 136785 566498 260300 528229 460983 239252 178988 598319
13526 598319 173375 521946 -219409 284028 375680 174979 49604 456592 115147 374697
13516 374697 363552 317823 175633 262170 131898 194046 264220 394231 -316848 356759
13505 79210 693225 386437 101493 184958 363410 441569 256099 311486 240364 266523 212524
13494 212524 343253 447549 156879 -30814 174421 161410 346867 -61665 96043 316372
13484 316372 221025 201331 629307 489556 113802 383627 394844 400741 76635 391783 436887
$$ packed form
13558E40824j83512J18239j17598J9370m5751A28661B4385J80270L61510B47951
13547A31283K06379A17283l3320J69277m5978J11709l2908R9826A01625a5298
13536F57449k64559A74264l7479M29713B60300K67929o7246k21731o0264M19331
13526E98319A73375L48571b19409B84028R1652A74979D9604M06988A15147K59550
13516C74697j1145m5729j42190Q6537j30272O2148P0174J30011c16848C56759
13505G9210O14015l06788A01493Q3465J78452P8159j85470N5387p1122K6159n3999
13494B12524J30729J04296A56879c0814A74421j3011J85457f1665I6043K20329
13484C16372r5347j9694M27976j39751A13802K69825J1217N897G6635L15148M5104
$$ plain form
13473 436887 45564 670083 101724 461951 624565 54370 190274 280180 483616 328769
13463 328769 375055 412827 149898 -74494 193203 320652 283628 -13021 -41780 489685 400280
13452 400280 303043 92511 -15676 523087 363374 155582 375946 124185 177014 197706
13442 197706 234891 280149 293203 76517 5874 54195 -141635 289594 252814 287149 554742
13431 554742 175259 -54715 467276 363518 263113 266592 323343 183508 105673 -88809 -57203
13420 -57203 31526 319628 -119165 -36428 389044 316890 243673 244285 193405 256109 709091
13409 709091 413003 573689 66172 -118552 306829 -125015 427205 176271 17357 2617
13398 173571 494754 151683 -52402 -57901 81489 155160 198559 263041 225608 334403 178388
$$ packed form
13473D36887D5564O24519A01724L60227J62614E4370J35904Q9906K03436j54847
13463C28769M6286L7772A49898g4494A93203J27449l7024a3021k8759D89685q9405
13452D00280r7237I2511a5676E23087j59713A55582K20364A24185N2829K0692
13442A97706L7185M5258J3054G6517E874M8321a41635B89594l6780L4335K67593
13431E54742A75259e4715D67276j03758j00405L479N6751j39835p7835h8809L1606
13420e7203C1526K88102a19165c6428C89044p2154p3217O12n0880O2704M52982
13409G09091k96088J60686F6172a18552C06829a25015D27205A76271A7357B617
13398A73571L21183A51683e2402n499H1489P3671M3399O4482l7433J08795j56015
$$ plain form
13387 178388 12133 80149 -151243 309562 253398 188954 -59433 92114 -166560 54496 58557
13376 58557 464031 -47340 339146 433601 222517 127375 149045 397986 143158 210145 621503
13365 621503 127058 179978 513033 261868 335735 442557 47827 -104818 295002 212578
13355 212578 130775 131074 245674 -96303 256529 102970 249140 382282 598760 356556
13345 356556 346062 218160 227775 586365 431017 724508 376925 627740 79105 -113618
13334 258405 238059 459980 2513 -77069 436546 344455 374159 -109681 -58101 291374 565887
13323 565887 501113 33540 196799 473732 -65870 181516 -35180 133771 190891 588072
13313 588072 99104 8741 347676 117819 225213 210324 275476 -6408 131797 364123 23433
$$ packed form
13387A78388A2133O8016a51243C09562n6164o4444e9433I2114a66560E4496M061
13376E8557M05474d7340C39146R4455k11084r5142K1670K48941A43158O6987M11358
13365F21503A27058N2920L33055k51165P3867J06822D7827a04818B95002q2424
13355B12578q1803K99J14600i6303B56529A02970J46170J33142K16478k42204
13345C56556j0494j27902R615L58590j55348K93491l47583K50815G9105a13618
13334B58405k0346K21921B513g7069D36546r2091K9704a09681N1580B91374K74513
13323E65887o4774C3540J63259K76933f5870A81516c5180A33771N7120L97181
13313E88072I9104H741L38935A17819J07394j4889O5152f408A31797K32326B3433
$$ plain form
13301 243479 156975 7512 -35829 -102957 -93186 6261 280914 105897 98752 49507 -83215 293504
13288 77849 319203 -92829 -123078 251474 -13428 325321 -212049 -241984 -59917 -133264 381391
13276 144263 -240474 10650 338074 214270 27715 214877 487038 -88458 271019 130624
13265 -39583 238916 -102304 292055 -73784 200624 525086 510212 -94009 264860 93449
13254 -207202 235932 205835 171607 178637 254191 -12256 103321 64518 91181 121317 128848
13243 128848 74912 177239 -106645 -55395 140748 -206085 37961 -69472 160796 -144879
13232 28871 264509 -49669 -49298 97810 293591 398929 54879 287157 -98742 -111520 -91864
13221 -91864 46142 149224 60147 28945 160867 407706 65602 236406 126032 182982 223823
$$ packed form
13301B43479q6504G512c5829o7128R771F261K74653A05897p145m9245h3215B93504
13288G7849K41354i2829l0249B51474a3428C25321b12049k9935e9917p3347C81391
13276A44263b40474A0650L27424j23804B7715J87162K72161h8458B71019A30624
13265c9583B38916a02304B92055g3784B00624L24462j4874i4009B64860I3449
13254b07202B35932l0097l4228P030P5554a2256A03321l8803K6663L0136P531
13243A28848n3936J02327a06645N1250A40748b06085C7961f9472A60796a44879
13232B8871K35638d9669L71I7810J95781J05338E4879K32278i8742j2778J9656
13221i1864D6142J03082F0147B8945J31922K46839F5602J70804j10374N6950M0841
$$ plain form
13210 223823 23919 255756 224354 274403 162244 193078 120583 186044 -24192 56686 97065
13199 97065 416976 109086 -209778 -196586 62779 160673 478084 213448 32646 28594 53618
13188 53618 238843 93156 -316932 -7113 -268289 -52160 403523 428969 -179491 -89559 81399
13176 429568 -75498 238556 -133619 219003 96500 206242 -188001 393763 40266 187358
13166 187358 140252 -117872 104997 200786 -22715 -120337 67697 265135 47064 -99773 -90778
13155 -90778 169398 -60825 148505 -95318 163605 188181 82870 165059 -59471 -8836 -90374
13144 -90374 -136521 75809 201348 -120109 -247645 204880 28102 -166945 -403868 129811
13133 251606 128894 173061 -41635 127013 -105943 2618 67140 -72316 -49696 353898 127858
$$ packed form
13210B23823B3919K31837l1402N0049j12159L0834p2495O5461b4192E6686M0379
13199I7065L19911A09086b09778J3192F2779R7894L17411B13448C2646m052K5024
13188E3618J85225I3156c16932g113k61176e2160D03523K5446a79491h9559H1399
13176D29568g5498B38556a33619B19003I6500J09742a88001C93763D0266J47092
13166A87358m7106a17872A04997R5789b2715r7622F7697J97438D7064i9773Q995
13155i0778A69398f0825A48505i5318A63605K4576H2870Q2189e9471h836q1538
13144i0374m6147G5809J25539a20109j27536B04880B8102a66945k36923A29811
13133B51606j22712M4167d1635A27013a05943B618O4522g2316K2620C53898A27858
$$ plain form
13121 247430 147750 120323 -196496 -20178 -142224 -198811 39603 -159933 75652 60239 198938
13110 198938 249712 1671 272227 305843 244967 134623 -5186 13914 69677 -104584 -58960
13099 -58960 -48527 190487 278426 -159955 -224267 -29103 -219857 -162574 198521 481065 133728
13087 -129059 16479 9262 -128407 -56185 -32806 39655 -248698 136660 -13107 74804 204330
13076 204330 -9839 -110806 -4135 114981 65850 112431 114630 281899 147588 240731 332478
13065 332478 173689 -18582 407968 -315011 368134 230254 248411 297497 532068 12152
13054 45290 427610 150853 302202 -56744 -247301 -244426 534930 1574 41523 347185 153045
13042 29875 106735 -59179 277404 145225 142575 103534 248016 208467 -117085 334380 227052
$$ packed form
13121B47430r9680k7427a96496b0178j22046n6587C9603a59933G5652j5413J38699
13110A98938N0774A671K70556L3616o0876j10344e186A3914N5763a04584M5624
13099e8960J0433A90487Q7939a59955o4312b9103j90754N7283A98521K82544A33728
13087a29059A6479p217a28407e6185K3379C9655b48698A36660a3107G4804J29526
13076B04330i839j00967d135A14981m9131M6581K199J67269j34311R3143R1747
13065C32478j58789a8582D07968c15011C68134j37880J8157M9086K34571A2152
13054D5290L82320A50853J51349e6744j90557K875E34930A574L9949L05662A53045
13042B9875P6860e9179B77404j32179k650l9041J44482l9549a17085C34380j07328
$$ plain form
13031 227052 217832 -102814 -190388 288586 238555 412138 225383 331053 254101 220873 50242
13019 264513 270988 176906 -35820 -176420 -136342 231571 373057 78959 612864 205134 -103920
13007 160312 327054 268123 94138 307775 -118248 -239336 216185 -23375 476033 -92239
12996 65656 -169633 193535 94593 144712 301372 85029 113106 216776 346754 154094
12985 -200706 43527 127436 483864 -212325 7882 -222716 -158605 -85006 58639 -124814 44008
12973 404281 -97300 77827 -104746 131688 92524 -53585 211833 197276 134204 375902 -113556
12961 327778 -37964 280942 -322986 127881 -82820 235825 196225 -446454 -417009 133100
12950 -139508 -192900 42363 187792 85169 -41147 -256960 321633 -195857 353564 193204
$$ packed form
13031B27052r220a02814q7574B88586n0031J73583j86755J05670p6952l3228E0242
13019B64513O475r4082c5820j40600M0078B31571J41486G8959N33905B05134a03920
13007A60312J66742n8931I4138K13637a18248j21088B16185b3375D76033i2239
12996F5656a69633A93535I4593N0119J56660H5029K8077J03670J29978A54094
12985b00706D3527Q3909L56428b12325G882b22716O4111P3599E8639a24814D4008
12973D04281i7300G7827a04746A31688l9164e3585B11833j4557o3072K41698a13556
12961C27778c7964B80942c22986A27881h2820B35825l9600d46454K9445A33100
12950a39508n3392D2363J45429H5169d1147k15813C21633a95857C53564j60360
$$ plain form
12940 193204 -138211 381189 -154621 197902 -95452 -10737 209323 -229099 -7460 -150418
12930 -150418 19154 -168446 -183593 145093 106484 12990 169582 153295 21900 -20638 324799
12918 -56450 37202 -56065 -283772 -5467 12834 -77812 237893 211227 287403 107628 7029
12906 319159 -50540 -139975 -36823 10180 -36809 82836 423530 177198 -198631 -20638 -175913
12895 -175913 -302509 133499 -520368 53396 212928 188571 -208947 64064 178413 6519
12884 182706 251653 45243 -382535 67030 -183505 -187362 36302 445865 77324 56651 -13940
12872 -2843 73121 -29845 -145719 93587 455251 -548059 -17670 143857 243876 235956 7997
12860 66184 22080 336851 -190248 -69101 -29190 304945 85965 43841 -12383 60097 120562
$$ packed form
12940A93204a38211C81189a54621A97902i5452a0737B09323b29099g460j42958
12930a50418A9154a68446j5147A45093l8609A2990J56592j6287B1900b0638C24799
12918e6450C7202e6065k27707e467A2834g7812B37893k6666P6176A07628G029
12906C19159e0540q9435c6823A0180c6809H2836L40694A77198a98631b0638j55275
12895a75913j26596A33499e20368E3396J59532k4357b08947F4064J14349F519
12884A82706O8947D5243c82535F7030a83505l857C6302M09563G7324k0673a3940
12872b843G3121b9845j15874I3587L61664e48059a7670A43857J00019p920G997
12860F6184B2080L14771a90248f9101b9190C04945H5965m2124a2383F0097O0465
$$ plain form
12849 120562 -531524 -17675 60026 -156058 190315 395050 -16047 433459 46719 74746
12839 74746 41481 119182 -355208 -61279 -267520 59435 -96787 -95327 44395 247343 -184771
12827 -145692 211119 -200018 -49338 -63162 -55873 -48539 204648 29347 -11920 -203190 -215760
12816 -215760 -67870 70603 -55936 96919 -73079 -130061 350049 -63938 -91132 280480 -72506
12804 95580 -58900 208357 -229818 43163 37106 -118458 82986 296731 405923 97806 264561
12793 264561 299557 -22330 -106832 -58451 84664 102857 132613 231759 193076 155192 -54351
12781 -41275 -410107 -36234 29811 213524 -38248 -99005 187991 49792 32802 -101023 135328
12769 -42918 -239397 -14946 158155 -74811 99138 -61900 -211497 -223187 107821 198783 172296
$$ packed form
12849A20562e31524a7675F0026a56058A90315K04735a6047D33459D6719K8027
12839G4746l3265P7701c55208f1279k06241E9435i6787J460D4395K02948a84771
12827a45692B11119b00018d9338j3824P289P334B04648B9347a1920j91270j2570
12816b15760f7870G0603e5936I6919g3079n6982C50049f3938k7194B80480g2506
12804I5580e8900B08357b29818D3163o057a18458H2986K13745J09192I7806J66755
12793B64561L4996b2330q4502M8381H4664J8193K9756R9146l8683l7884e4351
12781d1275l68832c6234B9811J83713c8248o0757A87991D9792j6990a01023A35328
12769d2918j96479a4946A58155g4811I9138f1900j49597j1690A07821R0962k6487
$$ plain form
12758 172296 152393 48220 281515 -134547 -19289 84452 33718 275382 -286601 376138
12747 -81638 28443 460424 60070 383061 -188583 215756 -182705 256772 330852 75969
12736 -273785 110600 -142027 274242 321378 145027 -84982 289114 424869 -23303 201200
12725 -252414 276507 64650 -69801 -407100 -68280 270430 -210563 27045 -29955 399388
12714 121413 192097 1854 156721 269793 30481 171660 204508 81679 409539 249204 103870
12702 116891 174464 270836 248452 173202 295108 257219 170791 -50636 125706 -77367 85336
12690 100683 145691 70621 -124117 46193 -271378 61419 -361712 -111033 23769 188049
12680 188049 -28752 360441 352074 612108 318755 123830 300042 -80484 92068 -15001 108617
$$ packed form
12758A72296j9903D8220K33295a34547a9289H4452C3718K41664b86601C76138
12747h1638B8443M31981F0070L22991a88583B15756a82705B56772P4080G5969
12736b73785A10600a42027B74242M7136A45027h4982B89114J35755b3303B01200
12725b52414B76507F4650f9801l37299f8280B70430b10563B7045b9955C99388
12714A21413P0684A854J54867J13072C0481J41179L2848H1679L27860j60335A03870
12702A16891N7573R6372k2384p5250J21906l7889q6428e0636A25706g7367H5336
12690A00683M5008G0621a24117D6193b71378F1419c61712a11033B3769J64280
12680A88049b8752C60441q367K60034k93353A23830J76212h0484I2068a5001A08617
$$ plain form
12668 145676 99423 310990 163589 -10684 217903 -60137 -9876 254849 6920 255010 118673
12656 183605 14892 556713 197203 535442 369099 348193 289073 213059 -47662 -211850
12646 -211850 27222 308369 21030 40715 230902 9746 200263 -109425 -32673 114805 492149
12635 492149 146231 -5739 -201004 193260 277047 -37340 238463 252544 44295 332469 -7633
12623 176339 120783 77236 406502 60035 -197724 123163 171300 273861 181282 167376 5094
12611 103854 -295250 -100796 -43735 719 219534 -41068 -92495 -72874 -236334 -80489 190885
12599 -68020 336540 45034 38524 403442 314950 155875 85613 50690 159188 122919 -270319
12587 121356 62250 97744 48311 127260 102280 -263596 -267801 -200217 28041 266969 -102305
$$ packed form
12668A45676m6253K11567j47401a0684B17903f0137i876B54849F920K48090A18673
12656A83605A4892N41821A97203L38239j66343k0906n9120p6014d7662j64188
12646b11850B7222K81147B1030J9685J90187I746J90517a09425c2673A14805L77344
12635D92149A46231e739j95265A93260Q3787c7340B38463J4081D4295K88174g633
12623A76339n5556m3547L29266F0035a97724A23163M8137J02561r2579j3906E094
12611A03854b95250a00796d3735G19K18815d1068n1427J9621j63460h0489A90885
12599f8020C36540D5034o510L64918q8492A55875p0262l4923J08498l6269b70319
12587A21356n9106L5494D8311P8949k4980b63596m205O7584B8041K38928a02305
$$ plain form
12575 214920 -189968 229337 173892 95872 -67587 -84725 48324 -139095 326722 112186
12564 -31863 -123229 -186718 76716 -66695 -86379 82879 -135926 368058 60805 161235 -39903
12552 24696 156460 -121333 161733 52384 -70568 89201 189128 34350 -182303 128772 -124086
12540 222858 18080 142549 144112 194706 58184 -46135 -210365 372007 -5299 -4756 -253644
12529 -253644 89860 -34279 236091 -19566 564193 218287 78874 -56624 -194787 -514071
12519 -514071 -117138 484559 85898 169472 210295 -230151 169761 187872 165084 39265 -49626
12507 -337295 -55218 162793 -210441 100574 -53501 -285446 311125 385848 -18696 -2877 61411
12495 417711 -117442 -54665 205828 -335751 3505 93543 332371 -203498 110649 269121
$$ packed form
12575B14920a89968B29337n5445p8020f7587j7138D8324a39095C26722A12186
12564c1863r1366o3489G6716f6695j9684H2879a35926C68058F0805J00430c9903
12552B4696J31764a21333A61733E2384g0568H9201R9927C4350a82303A28772a24086
12540B22858A8080J24469J563N0594E8184d6135j64230C72007e299N43k48888
12529b53644H9860c4279B36091a9566E64193B18287G8874e6624j38163l19284
12519e14071a17138D84559H5898Q3574M0823b30151A69761J8111k2788C9265d9626
12507c37295e5218A62793b10441A00574e3501k31945C11125P4723a8696b877F1411
12495D17711a17442e4665B05828c35751C505R0038K38828b03498A10649J58472
$$ plain form
12485 269121 163970 -6629 126107 -344414 38119 92188 -9395 25736 377071 -144439 -53962
12473 -168480 117847 -75403 152807 -19244 -117737 218372 329512 -100843 -4125 45555 6982
12461 292942 -82747 117691 -48359 90020 -156072 41116 37884 -140279 102825 502215 62812
12449 63782 129243 -56490 -149502 -45078 207387 26174 66391 366216 230501 -94784 206626
12437 -144773 191096 -168317 22405 3479 55160 -94015 -51300 -44221 270737 105999 -104074
12425 -11712 38048 368643 -33483 36067 -116462 -10429 216888 268219 128740 13283 76833
12414 76833 353025 16111 -80192 80742 10979 130939 -108156 -318307 -174679 62750 94471
12403 94471 160169 -287194 -104010 -98531 -184606 24968 154688 -45879 325686 10971 404788
$$ packed form
12485B69121j05151f629A26107c44414C8119N4069i395B5736L51335a44439e3962
12473a68480A17847g5403A52807a9244r8493B18372J11140a00843d125D5555F982
12461B92942h2747A17691d8359I0020a56072D1116l232a40279A02825L99390F2812
12449F3782O5461e6490r3012d5078B07387B6174M0217K99825j35715i4784B06626
12437a44773A91096a68317B2405C479N1681i4015M2715P079B70737A05999a04074
12425a1712C8048L30595c3483C6067a16462a0429B16888N1331A28740A3283O3550
12414G6833K76192A6111h0192H0742A0979J19960a08156k10151J43628F2750L1721
12403I4471O5698b87194a04010N479q6075B4968J29720d5879C25686A0971L93817
$$ plain form
12392 404788 -237239 -242549 237110 54658 -102607 -208346 -33357 -262476 -129791 -146302
12382 -146302 31222 -94286 63690 -133090 -116116 -250601 82829 -314216 65513 64747 236144
12371 236144 -131417 574 -72510 -43343 155899 184234 202577 -24215 -75173 187152 -127157
12359 21891 -51631 -207372 -198425 100064 179768 -246319 -58983 -167499 -29465 -113475 26388
12347 158896 135142 -20355 -250032 7319 5302 -73502 71128 -100358 95247 286092 247861
12336 247861 -207146 -245522 72092 143024 126818 77282 -70 -131162 260929 260598 5072 42961
12324 42961 68285 27926 86514 -84215 -314873 345376 108926 -93481 -247179 -226880 -172430
12313 -172430 15758 362487 -46173 384124 149370 -216382 241971 -145373 176771 106473
$$ packed form
12392D04788b37239n310B37110E4658a02607j05739c3357k29119a29791j6511
12382a46302C1222i4286F3690a33090J6974j34485H2829c14216F5513p66J71397
12371B36144a31417E74g2510K9167A55899K8335J8343b4215n0958A87152a27157
12359B1891e1631j55741Q947A00064P9704b46319e8983j08516b9465q4010B6388
12347A58896k3754b0355k29677G319k017g3502G1128a00358I5247J90845l8231
12336B47861b07146l8376G2092P0932j6206m9536g0j31092B60929l31E072L7889
12324D2961K5324B7926N8588h4215k30658C45376A08926i3481j53698K0299N4450
12313a72430A5758L46729d6173C84124A49370b16382B41971a45373A76771p0298
$$ plain form
12303 106473 -202569 31110 315273 -167188 83264 -109980 217190 258884 130383 -4886
12292 38452 154422 163449 268207 75595 74979 231508 -50711 101785 314879 155599 315349
12281 315349 -116048 286782 57568 219402 -57796 -77531 344454 343022 585327 269900
12270 257312 -86110 -12430 81759 341394 246087 183929 298955 106788 -82844 -10147 231070
12258 -151449 150644 99637 101880 366430 212397 220232 141151 217234 301583 11650 -158797
12246 -34410 27297 471694 151392 82682 408015 160472 70299 289469 215053 66819 289253
12235 289253 -4843 -4721 249031 -219456 347844 74009 -5118 361022 260253 70650 171232
12224 171232 6677 288960 474914 466199 538787 46501 371059 50583 274470 267550 513814
$$ packed form
12303A06473b02569C1110K84163a67188H3264a09980B17190M1694j28501d886
12292C8452J15970R027J04758G5595o16J56529e0711A01785K13094A55599J59750
12281C15349a16048B86782E7568J61834e7796j9735C44454j432K42305B69900
12270B57312h6110a2430H1759K59635r5307o2158J15026A06788h2844a0147B31070
12258a51449A50644n1007K243K64550j54033P835p9081P6083Q4349A1650a58797
12246c4410B7297M44397A51392o8710L25333A60472G0299K19170p4416F6819K22434
12235B89253d843J22B49031b19456C47844G4009e118C61022j00769G0650J00582
12224A71232F677K82283J85954q715P2588D6501L24558E0583K23887o920K46264
$$ plain form
12213 513814 28855 476917 411765 225599 214306 -12759 59613 -166542 294393 -168030
12202 136855 286129 289572 254542 561892 264770 321581 562818 605946 276765 592403
12192 592403 -32789 303255 245839 138920 296024 -61257 -199410 -9135 299194 202124 315923
12181 315923 53421 578951 347078 388846 -249143 77658 54105 62559 360330 365091 152459
12169 315728 25699 284965 451301 288086 209757 359496 169828 260176 422319 -99710
12158 198374 -154500 -192168 252250 56496 121084 -77097 300433 228977 466325 -90824 -241494
12147 -241494 122283 -101922 58350 -12194 -129583 33769 -25415 444050 271912 106894
12136 -302009 -191018 -46735 79138 13447 293406 344058 162446 354659 142704 -101450
$$ packed form
12213E13814B8855M48062o5152j86166j1293a2759E9613a66542B94393a68030
12202A36855J49274L443l5030L07350B64770N6811K41237M3128B76765L15638
12192E92403c2789C03255n7416j06919J57104f1257j38153i135B99194r7070J13799
12181C15923E3421N25530k31873M1768b49143G7658k3553Q454K97771M761A52459
12169C15728B5699K59266J66336j63215p8329J49739A69828R0348J62143i9710
12158A98374a54500l7668B52250E6496O4588g7097C00433p1456K37348i0824j50670
12147b41494A22283a01922E8350a2194j17389C3769b5415D44050j72138A06894
12136c02009J10991d6735G9138A3447K79959N0652A62446J92213A42704a01450
$$ plain form
12125 20974 97635 125493 321407 94848 270362 -44686 -321214 351359 -34307 -102598 236322
12113 -136898 74008 73758 93818 133519 37283 -96556 210360 -85013 106159 243317 -111766
12101 283149 185905 46602 151767 -274732 -426844 150293 112662 315738 -238976 -402437
12091 -402437 288291 251525 -99176 430387 193350 -16380 -705 147757 -156176 42933 -174111
12079 -246939 -62353 232521 15875 347239 372153 510159 1713572 3345023 2290315 731748
12068 233764 -98944 341308 39027 349545 -1761 106552 136956 221520 95576 -276252 31246
12056 119698 -38948 -112736 242084 -114448 181035 -190478 -176683 -20422 -20755 -33081 -210162
12045 -210162 -44989 183750 64442 -137290 152107 -328856 -148355 -278101 67481 -201976
$$ packed form
12125B0974P6661K7858J95914I4848J75514d4686k76528C51359c4307o8291B36322
12113a36898G4008k50K0060L9701C7283i6556B10360h5013A06159J37158a11766
12101B83149r7244D6602J05165b74732j52112A50293l7631K03076b38976j63461
12091d02437B88291l6766i9176D30387A93350a6380g05A47757a56176D2933a74111
12079b46939f2353B32521A5875L31364K4914J38006J203413J631451j054708G31748
12068B33764i8944C41308C9027L10518a761A06552L0404Q4564I5576b76252C1246
12056A19698c8948p3788B42084a14448A81035a90478J3795b0422l33j2326j77081
12045b10162d4989A83750F4442a37290A52107c28856a48355j29746F7481b01976
$$ plain form
12034 186970 188452 -279327 -2764 -295346 156590 173485 87953 9664 113997 -107725 -400108
12023 -400108 160123 30015 -152316 -163946 -87387 -172250 74165 -112001 130819 -442193
12012 -98087 -75374 -5561 380929 -67657 -34686 -214043 -151869 273235 30885 286810 -185893
12000 -6684 -249225 239820 -170397 41043 6394 61023 382384 167299 -100250 402238 43584
11988 165468 302678 17742 -135524 -126237 -95888 100090 -80591 -10322 322020 125133 204710
11977 204710 -70747 213412 171107 -14231 -361553 -182689 -555965 -383169 -198253 -446990
11967 -446990 -333829 120253 193099 103481 110300 -173650 -358949 -262948 73887 152432 134023
11956 134023 53699 -58786 279184 -123969 -266635 249029 -1761 33059 2337 100560 -9450
$$ packed form
12034A86970J482b79327b764k92582A56590J6895q5532I664J04333a07725k92383
12023d00108A60123C0015a52316j1630P6559q4863G4165a12001A30819d42193
12012i8087K2713e561C80929f7657L2971j79357O2174B73235C0885K55925a85893
12000f684k42541B39820a70397D1043F394N4629L21361A67299a00250D02238D3584
11988A65468J37210A7742a35524R287L0349A00090h0591a0322C22020A25133P9577
11977B04710g0747B13412m2305a4231l47322J78864l73276J72796J84916k48737
11967d46990J13161A20253P2846q9618O819a73650j85299R6001G3887P8545j8409
11956A34023E3699e8786B79184a23969j42666B49029a761C3059B337R8223i450
$$ plain form
11944 -111132 171737 -151845 -225360 -73673 -346904 -177479 230226 429523 -191201 -190097
11934 -190097 220997 -121550 -131464 89307 -201343 -158024 -106590 55542 113487 248336 123431
11922 -142438 -287287 281753 73733 188258 -228923 150030 -102312 -164932 -44582 304663
11911 67735 14131 125369 -101587 -96985 110146 -278832 -51339 -29211 134182 -78462 70846
11899 58872 61750 -170629 64303 126691 51830 -41127 -221592 -114455 219150 38511 -94562
11887 48318 -104739 -31042 -193719 -3053 160804 -49104 -51838 312980 -293375 -61782 -346366
11876 -346366 -348826 -263018 -365615 -93453 79110 -159475 -322688 113194 -176597 -302546
11866 -302546 81477 -17809 -46527 -53601 72249 15425 58591 -36638 191743 398219 70285
$$ packed form
11944a11132A71737a51845p3515g3673k73231J69425B30226J99297a91201J104
11934a90097B20997a21550r914H9307b01343M3319N1434E5542N7945J34849A23431
11922a42438j44849B81753G3733J14525b28923A50030a02312o2620d4582C04663
11911F7735A4131J11238a01587M602A10146b78832e1339K2128A34182g8462G0846
11899E8872K878a70629F4303O2388E1830d1127j80465J07137B19150C8511i4562
11887D8318a04739c1042j62677c053A60804d9104k734C12980b93375f1782k84584
11876c46366k460Q5808j02597i3453G9110a59475j63213A13194a76597j25949
11866c02546H1477a7809k8718p074G2249A5425M3166c6638A91743K06476G0285
$$ plain form
11854 127046 -21315 262452 62840 -419137 -208832 -6600 -349047 155951 80677 -85168 9161
11842 -105777 -26604 -215056 21263 156609 -214182 -90835 25266 89040 -178740 177363
11831 2604 83059 -71315 155646 -110653 -268598 -173959 148703 -137062 2580 -54181 119446
11819 -271125 147467 84447 -200917 123911 96415 129034 -155470 44123 9791 -195495 146197
11807 -382068 -30491 58875 97508 -129859 -216433 -92825 -41406 271580 -45588 -398735 -254531
11796 -254531 73768 43123 -373499 162082 -30601 -32730 -279603 -37099 1844 242383 -82277
11784 -452029 51585 42615 381764 -126279 -148126 -60800 -28147 -219244 -68972 401042 95300
11772 332155 -122029 297906 240069 -2137 157868 198378 -352070 208017 -65440 -56863 30205
$$ packed form
11854A27046b1315B62452F2840d19137b08832f600l42447A55951p5274h5168I161
11842a05777b6604j88452B1263J35346b14182i0835B5266O3774a78740A77363
11831B604Q0455g1315A55646a10653j57945R4639A48703a37062B580e4181A19446
11819b71125A47467o3020b00917A23911k7496L2619a55470D4123I791a95495A46197
11807c82068c0491E8875L8633a29859q6574i2825d1406B71580d5588l53147J44204
11796b54531G3768l0645c73499A62082c0601k129k46873c7099A844K40539h2277
11784d52029E1585q970L39149a26279k1847f0800b8147j91097f8972D01042I5300
11772C32155a22029B97906n7837b137A57868M0510c52070B08017f5440Q577C0205
$$ plain form
11760 139155 -208406 256482 71267 55873 -58650 -369028 -172870 149659 132676 34709
11749 -232889 155681 4664 -310054 -23234 315978 72568 -72269 119298 91635 45858 130547
11738 130547 169345 332013 16032 20111 -384524 -175590 266242 91751 -57210 -123837 -49443
11726 -75970 -91447 -194529 337874 222555 4726 -201797 -193576 329988 -303771 264256 316917
11715 316917 -118902 -29047 129985 196662 124954 -72860 -31886 -81787 238073 205856 151423
11704 151423 160732 112586 -96120 285296 40761 184272 94975 -30493 4998 -113793 474387
11692 254080 108730 178966 138508 18445 123623 -26337 -71261 -190740 -144736 -64800 112389
11680 147709 57627 202542 19880 52613 146227 -31185 169932 465709 207076 389032
$$ packed form
11760A39155b08406B56482G1267j5394e8650l10378a72870A49659j6983C4709
11749b32889A55681D664c10054b3234C15978G2568g2269A19298k7663m5777Q4689
11738A30547L8798J62668A6032M079c84524a75590B66242I1751e7210o6627d9443
11726g5970j5477j03082C37874j15319D726b01797Q221C29988c03771B64256N2661
11715C16917a18902b9047A29985O6677p1708g2860c1886m9901B38073l2217n4433
11704A51423R309m8146i6120B85296D0761J43511q9297c0493D998a13793D74387
11692B54080A08730P0236m0458A8445J05178b6337m4924j19479M6004f4800A12389
11680A47709E7627J44915A9880L2733R3614c1185A69932K95777B07076J81956
$$ plain form
11670 389032 180567 43880 -373460 94881 86799 -71067 50326 131125 187828 124035 -153645
11658 134630 70070 10579 247176 -99076 72250 344470 36163 344310 212797 -2882 130769
11646 116084 308315 -164198 209172 65636 -91841 176985 -167993 298637 131510 36501
11635 -244859 -96808 18105 -208959 -372279 179810 -105482 77077 -152671 -68855 173990
11624 -30377 -120297 -90595 219074 -65708 103872 -22224 257460 285749 654320 -85607 -30608
11612 10400 -16104 -113748 141553 42155 167531 153585 -157048 -268650 11590 -348267 362846
11600 125631 55540 86855 93480 -22214 286102 175656 540442 192627 314533 19226 300891
11589 300891 181670 212890 321950 248673 87084 333941 135213 125016 218288 126910 -80122
$$ packed form
11670C89032A80567D3880c73460I4881q082g1067E0326Q0799N6703o3793a53645
11658A34630o4560A0579K36597i9076G2250K72220C6163L08147j31513b882A30769
11646A16084J92231a64198B09172F5636i1841A76985a67993B98637A31510C6501
11635b44859i6808A8105b08959j63320A79810a05482G7077a52671f8855A73990
11624c0377q9920K9702B19074f5708A03872b2224B57460K8289L68571h5607c0608
11612A0400a6104r7644A41553D2155J25376j3946a57048j11602A1590c48267C62846
11600A25631E5540L1315O625b2214B86102j10446L64786A92627J21906A9226K81665
11589C00891j19221L1220J09060p3277H7084K46857A35213j0197R3272r1378h0122
$$ plain form
11577 -41634 45110 331940 29826 -54645 -61471 217475 94041 54272 145457 283210 421620
11566 421620 137338 243498 -15305 153779 -121155 -33358 152314 215567 -192254 240394
11555 -161067 130711 166567 296743 179508 -73989 -51731 136578 67934 131303 -79130 220300
11543 -54166 266357 150325 -437551 78193 202046 223524 -108067 393385 135691 323822
11533 323822 23965 125681 204233 474256 92942 131238 411427 47568 34467 538285 -1171
11521 87114 169640 128649 65507 339864 -102405 275684 209042 -127650 174105 4924 229406
11510 229406 425648 114801 92094 -51021 23874 -151774 370163 311689 144124 -191406
11499 261831 163296 29369 356979 291845 648385 81296 -107153 313297 247719 -21917 313078
$$ packed form
11577d1634D5110K86830B9826e4645o826B17475I4041l9769R1185J37753J38410
11566D21620A37338J06160a5305A53779a21155c3358A52314O3253a92254B40394
11555a61067A30711L5856J30176j17235g3989K2258A36578F7934O3369g9130B20300
11543e4166B66357j16032d37551G8193J23853K1478a08067C93385A35691J88131
11533C23822B3965J01716P8552K70023I2942L8296K80189D7568j3101N03818a171
11521H7114Q2526m0991o3142K74357a02405B75684o6642a27650A74105D924K24482
11510B29406J96242A14801k2707e1021B3874a51774C70163n8474A44124a91406
11499B61831r8535B9369L27610o5134L56540H1296a07153C13297o5578b1917C13078
$$ plain form
11487 -277393 288555 -35561 327659 774673 249965 232613 326352 345664 235749 231178 33281
11475 420245 401220 297359 510240 94590 359244 375112 188009 173244 241137 285941 -147525
11463 -154489 -81480 74640 322143 314430 231645 460185 -46947 143741 407474 126286 407292
11452 407292 173342 231642 398745 42478 530290 93101 -120774 -168792 319643 159306
11441 51391 147304 -73557 92056 382163 137574 -119630 164490 30397 -157997 184346
11430 502606 213791 156497 84671 188642 -32445 -23096 79408 85461 -161041 197409 -38793
11418 33713 220372 -185642 33693 -121141 130296 139563 -65071 310292 -127621 -117466 -218601
11407 -218601 37330 208634 -163694 -538 232831 -197571 29268 20532 230456 -155379 -378928
$$ packed form
11487b77393B88555c5561C27659M47014B49965j7352R3739J9312j09915m571C3281
11475D20245j9025j03861K12881I4590K64654J5868j87103j4765O7893M4804a47525
11463a54489P3009G4640K47503p713q2785K28540d6947A43741K63733A26286K81006
11452D07292A73342N8300J67103D2478M87812I3101a20774m8018C19643A59306
11441E1391R5913g3557I2056K90107A37574a19630A64490C0397a57997A84346
11430E02606B13791n7294p1826J03971c2445R349G9408O053a61041A97409c8793
11418C3713J86659a85642C3693a21141A30296R267f5071C10292a27621J0155j01135
11407b18601C7330J71304a63694e38B32831a97571B9268q736K09924a55379k23549
$$ plain form
11396 -378928 109363 57934 230741 62673 244457 27362 -34830 -149778 20118 -63642 -162166
11385 -162166 -163435 113220 -257350 178789 14157 131237 106228 13257 -49653 -20573 1865
11373 55725 221263 242907 185421 -94102 -401893 -235780 -7279 -181012 -8138 1871 -218573
11361 115762 27104 -314865 -36624 199280 45036 -106854 -36553 -207869 -180742 -124495 164803
11349 233259 21265 -42669 77309 -34041 45162 -34366 153761 251612 -89124 215280 142948
11338 142948 -159066 -90992 6522 79992 -101276 194475 -238387 -342374 -47781 444972
11327 -215694 -82043 -284514 -23524 400633 198282 45090 -54086 -24376 -76291 -97257 -111740
11316 -111740 -81056 101906 479573 161234 148538 66208 -5269 245846 192273 19143 -410143
$$ packed form
11396c78928A09363n1429J72807F2673J81784B7362c4830j14948B0118f3642r8524
11385a62166j269A13220b57350A78789A4157J17080k5009A3257d9653b0573A865
11373E5725J65538K1644n7486i4102l07791J66113g279j73733h138A871b18573
11361A15762B7104c14865c6624A99280D5036a06854c6553j71316K7127N6247A64803
11349B33259B1265d2669G7309c4041D5162c4366A53761R7851h9124B15280p2332
11338A42948a59066O8074F522P3470a01276A94475b38387j03987d7781D44972
11327b15694h2043k02471b3524D00633A98282D5090e4086b4376n1915k0966j4483
11316a11740L0684A01906L77667A61234j2696F6208e269B45846n3573A9143d10143
$$ plain form
11304 114090 52171 180195 -340608 -158456 -174738 206295 -101168 5212 -150869 -188434
11294 -188434 -70521 2848 -104075 100819 35543 -96152 228018 -34592 -43367 -36384 64401
11282 -42005 20400 227493 -105458 -33849 -9611 199914 12776 -84068 -134808 -257890 -252020
11271 -252020 -166901 195524 103168 14728 138521 -49949 113183 -196579 -59947 -141028 -29260
11259 -188692 38590 29349 -67885 208307 168412 -37580 110613 -88558 319206 175251 -195038
11247 -334 -79526 182766 -44071 -125780 -66922 359079 102620 -39107 -115156 8714 -273730
11235 81172 -170402 -317712 79082 -66863 127342 246474 324249 18662 -167730 -9109 -144328
11224 -144328 310120 116984 -381155 79021 22958 169906 1312 -138048 90140 -132116
$$ packed form
11304A14090E2171J28024c40608a58456j6282B06295a01168E212a50869l7565
11294a88434g0521B848a04075A00819C5543i6152B28018c4592q775O983F4401
11282d2005B0400K07093a05458c3849i611A99914A2776h4068n0740j23082N870
11271b52020Q5119A95524r2356A4728J23793d9949A13183a96579e9947q1081b9260
11259a88692C8590r241f7885B08307l9895c7580A10613h8558C19206j43955a95038
11247c34p9192A82766d4071q1709N8858C59079A02620c9107p6049H714b73730
11235H1172a70402j47310G9082f6863A27342J19132P7775A8662a67730i109j35219
11224a44328C10120A16984c81155G9021B2958J46948A312a38048I0140a32116
$$ plain form
11213 -243147 162514 136752 49150 123883 259583 -204748 252454 -93977 144169 73473
11203 73473 -349893 13627 -188502 45017 114825 104310 -319802 -362570 159426 162621 -90562
11191 47285 7361 -119444 14543 -259903 -97329 -50867 -478908 -191787 -27485 -487502 -320155
11180 -320155 149935 34174 133844 -184790 -226419 83404 -251470 100961 -131617 -181426
11170 -181426 -87462 158030 89988 -194013 177483 -285264 -198467 64961 -98711 51369 -185899
11158 -204761 -203572 33830 36202 39044 -152332 308387 177856 195761 -30849 -70070 -256144
11147 -256144 133797 147305 173319 165718 -274598 92777 48878 -164161 95940 -93360 20526
11135 -204614 -80648 208079 -47570 56943 371037 214764 -126418 -162838 186929 211042
$$ packed form
11213b43147A62514k5762D9150P4733J35700b04748B52454i3977A44169p0696
11203G3473c49893A3627a88502D5017O9808j0515c19802m2768A59426L195i0562
11191D7285G361a19444A4543b59903i7329M6462m28041a91787b7485m60017J67347
11180c20155A49935C4174R9670a84790m1629H3404b51470A00961a31617m9809
11170a81426h7462A58030o8042a94013A77483b85264Q6797F4961i8711E1369a85899
11158b04761J189C3830K372K842a52332C08387j30531J7905c0849l9221j86074
11147b56144A33797J3508K6014p601b74598I2777m3899a64161I5940i3360B0526
11135b04614h0648B08079d7570E6943L14094j56273a26418l6420A86929K4113
$$ plain form
11125 211042 142895 246705 305447 12734 199119 185655 68449 -59232 35757 332837 -408726
11113 23016 -16508 -152940 49442 -20744 138147 173522 180749 163387 51467 361436 430397
11102 430397 203352 46665 195457 104787 277807 262190 488163 155331 90741 104894
11092 104894 370563 89513 54298 93938 53997 579392 179508 575518 507272 401974
11082 401974 151092 312964 229446 365641 341046 334233 410100 337851 381518 305978 586464
11071 586464 140531 538816 436430 535805 312698 555950 603759 561465 368626 690034
11061 690034 637799 546080 968285 847045 630465 1042840 677058 916853 684344 965096
11051 965096 1204825 689117 935548 847977 996156 1374820 1233746 1400343 965706 829493
$$ packed form
11125B11042o8147J03810N8742A2734J86385j3464F8449e9232C5757K97080d08726
11113B3016a6508j36432D9442b0744A38147L5375P227j7362E1467L09969O8961
11102D30397B03352D6665J48792r0670J73020j5617K25973A55331o4590J4153
11092A04894K65669H9513l5215L9640l9941N25395A79508L96010o8246j05298
11082D01974A51092J61872q3518J36195k4595o813P5867p2249M3667p5540K80486
11071E86464A40531L98285j02386R9375k23107K43252M7809m2294j92839L21408
11061F90034n2235r1719M22205j21240k16580M12375l65782K39795k32509K80752
11051I65096K39729n15708K46431q7571J48179L78664j41074J66597m34637j36213
$$ plain form
11041 829493 1367814 1012347 1197864 1345767 779155 1135183 1294062 1188973 878589 933801
11031 933801 990951 1000023 1044695 904471 847909 1270902 1097708 1171138 821556 1434647 1310164
11020 1310164 1053619 909825 830332 948464 1057798 751945 644885 584037 740439 806778
11010 806778 937581 757653 1089493 919427 1042084 921759 893717 928159 757387 674848
11000 674848 989929 815013 1088941 1007999 1229385 730737 632318 1005416 812499 853657
10990 853657 1098314 777043 1003905 1501439 1395270 1198688 1299709 1401283 1532288 1400007
10980 1400007 1307025 1452287 1717285 1834344 2151803 1946323 2486253 2989853 3450110 3741670
10970 3741670 3955828 4223710 4604479 4419987 3935253 3676602 3751070 3032488 2449962 2498286
$$ packed form
11041H29493N38321l55467J85517J47903n66612L56028J58879j05089l10384N5212
11031I33801N7150R072M4672j40224n6562M22993j73194P3430l49582O13091j24483
11020A310164k56545j43794p9493J18132J09334l05853j07060o0848J56402O6339
11010H06778J30803j79928L31840j70066J22657j20325k8042L4442j70772q2539
11000F74848L15081j74916K73928q0942K21386m98648r8419L73098j92917M1158
10990H53657K44657l21271K26862M97534j06169j96582J01021J01574J31005j32281
10980A400007r2982J45262K64998J17059L17459k05480N39930N03600M60257K91560
10970C741670K14158K67882L80769j84492m84734k58651P4468p18582n82526M8324
$$ plain form
10960 2498286 2478644 2749005 2999960 2707266 3116436 3188056 2825628 2453948 2543733 2319525
10950 2319525 2020404 1523158 1623567 1310777 1276246 722401 1019398 415123 860172 457857
10940 457857 200759 260410 408055 335210 458308 382299 303470 550672 167906 23540
10929 454452 -109815 94131 112023 -87249 236967 63467 74015 82073 151280 130731 -27695
10917 377541 -15417 -204734 23002 88763 286861 -27023 171267 -144590 20535 355549
10907 355549 121022 -71257 -127524 88779 -209317 -381663 250242 210179 -21803 41862 -220877
10895 -119233 407364 194710 258935 72607 146098 -103676 -194619 -139901 137620 -193634
10884 276582 48988 -85483 128272 142207 -72763 186631 -149725 172766 226771 -216390
$$ packed form
10960B498286j9642K70361K50955k92694M09170P1620l62428l71680Q9785k24208
10950B319525k99121m97246J00409l12790l4531n53845K96997D15123M45049m02315
10940D57857B00759N9651J47645p2845J23098p6009p8829K47202A67906B3540
10929D54452a09815I4131J7892h7249B36967F3467J0548Q058O9207k0549b7695
10917C77541a5417j89317B3002O5761J98098b7023A71267a44590B0535L35014
10907C55549A21022g1257n6267H8779b09317j72346B50242m0063b1803D1862b20877
10895a19233D07364A94710O4225G2607P3491a03676r0943N4718A37620a93634
10884B76582D8988h5483A28272J3935g2763A86631a49725A72766N4005b16390
$$ plain form
10873 -91107 -58691 304948 -52746 31584 -175316 63483 17329 369424 53347 -73472 240997
10861 -54698 -145549 87426 -152060 160783 -1118 179620 509050 -190455 139023 410526
10851 410526 358436 42537 -74740 359406 5404 299216 -32951 -367039 -26501 -377802 391331
10839 22205 4621 63233 -229260 66506 -26173 -487 175722 37441 -138845 193276 -146793
10827 188104 377264 45663 -124289 130711 214519 -92640 -364799 6257 -35332 -118080 -205629
10816 -205629 -191793 -205380 -41613 -105200 246353 -214051 20887 -67216 -203223 -140388 -120619
10805 -120619 -36946 91985 97080 188288 3636 -30729 139351 96352 109925 -226895 271767
10793 128322 -25311 -290750 -216010 216766 -100335 -23594 -282824 -89038 254419 -163821
$$ packed form
10873i1107L2416C04948e2746C1584a75316F3483A7329L52095E3347g3472B40997
10861e4698r0851H7426a52060A60783a118A79620L29430a90455A39023K71503
10851D10526n2090D2537g4740C59406E404K93812c2951l34088b6501l51301C91331
10839B2205D621N8612b29260F6506b6173d87A75722C7441a38845A93276a46793
10827A88104J89160D5663a24289A30711Q3808i2640k72159F257c5332q2748q7549
10816b05629J3836j3587d1613o3587B46353b14051B0887f7216j36007O2835J9769
10805a20619c6946I1985N095R1208C636c0729A39351m2999J3573b26895B71767
10793A28322b5311k65439P4740B16766a00335b3594k59230h9038B54419a63821
$$ plain form
10782 -30153 -107206 -158543 -132973 117053 -264204 -30657 -189759 25403 -97134 -27637 -67394
10771 -67394 90027 219347 19563 67262 124772 -249104 -163145 186513 20127 75460 -45409
10759 -54650 -173257 -211224 51013 38261 3571 173682 -281052 120773 -137914 -295550 -177148
10748 -177148 -19300 34403 -94958 -211135 -172563 151058 -19516 -143946 -102665 66876 -139158
10736 209271 -112999 -229583 -53474 -321496 43147 271162 -38429 106010 -184933 121655
10725 67548 88997 -222449 -98167 -14120 6595 -199376 29444 43160 -295564 344675 240244
10714 240244 -9131 196629 -377004 -128789 210819 -37442 -26062 -96076 -176413 -58984 38325
10702 -64985 -150257 311773 -129053 114848 315716 -17951 -218380 -268943 -31225 -186924
$$ packed form
10782c0153p7053n1337K5570A17053b64204c0657j59102B5403i7134b7637l9757
10771f7394I0027J29320A9563M7699N7510b49104Q5959A86513B0127N5333d5409
10759e4650j18607l7967E1013j2752C571J70111b81052A20773a37914j57636J18402
10748a77148a9300C4403i4958j16177L8572A51058a9516j24430M1281F6876a39158
10736B09271a12999j16584e3474k68022D3147K28015c8429A06010a84933A21655
10725F7548K1449b22449i8167a4120F595a99376B9444J3716b95564C44675j04431
10714B40244i131A96629c77004a28789B10819c7442J1380p0014q0337e8984C8325
10702f4985q5272C11773a29053A14848K00868a7951k00429n0563c1225j55699
$$ plain form
10692 -186924 -226667 -259099 -138172 220546 -1700 -3226 -230024 -260600 -94697 -182858 92492
10680 81468 -273752 -159631 -170776 -97179 -52019 -172793 -30018 87225 -263717 -60788 -108953
10669 -108953 -8923 35699 189685 -250726 119314 149604 27462 145910 -57059 -68867 -328471
10658 -328471 264196 -75025 -287305 147614 233933 -316146 70361 4170 224446 154552 139053
10647 139053 130137 -291642 236995 81504 52714 -102830 -10042 169692 -158536 44147 190360
10636 190360 -74030 -145520 -389756 50254 -177997 167403 -324012 -188947 -51973 -137957
10626 -137957 106413 -169223 -248384 -83403 -30715 -81629 153370 62160 -64235 -314572 -434591
10615 -434591 -213098 218395 22324 -123690 -348537 -224802 350942 -141114 300374 11351
$$ packed form
10692a86924l9743l2432J20927B20546a700j526k26798l0576i4697q8161I2492
10680H1468b73752J14121j1145P3597M5160j20774c0018H7225b63717f0788m8165
10669a08953h923C5699J53986b50726A19314L0290B7462J18448e7059j1808k59604
10658c28471B64196g5025k12280A47614Q6319c16146G0361D170K20276o9894j5499
10647A39053q916b91642B36995H1504k8790a02830a0042A69692a58536D4147J46213
10636A90360g4030p1490k44236E0254a77997A67403c24012J35065e1973q5984
10626a37957A06413a69223p9161h3403c0715n0914A53370F2160f4235k50337j20019
10615d34591b13098B18395B2324a23690k24847J23735C50942a41114C00374A1351
$$ plain form
10604 47157 109467 -51238 -35174 1264 273742 17719 -98774 -17483 -50558 -26035 209963
10592 -133825 -164171 -3163 -68101 -355458 -19107 -405 194131 -169251 208613 22924 23646 167989
10580 167989 207918 182757 -147583 54291 56608 -83336 49172 -242935 -151579 2377 238649
10569 238649 45941 259310 39871 -367876 29507 -13559 -122422 279862 -79058 15902 -68835
10557 -156266 78632 52815 131218 -197270 160083 83648 147418 -99399 -79891 135717 -492388
10545 32717 -243780 -27040 -49342 90934 -126025 -363019 292023 30935 -134720 170840
10534 -295066 27438 -331517 -22553 -86803 266798 -117388 -20833 87629 -48963 135516 -178391
10522 -146329 -394513 50618 -215779 -49975 250934 -170104 100684 -8745 69763 -284374
$$ packed form
10604D7157O2310e1238J6064A264K72478A7719i8774a7483l3075K4523B09963
10592a33825l0346c163o4938k87357a9107d05A94131a69251B08613B2924P22J44343
10580A67989L9929k5161a47583E4291K317h3336D9172b42935R1356B377K36272
10569B38649D5941K13369C9871c67876B9507a3559j08863B79862g9058A5902f8835
10557a56266G8632k5817P8403a97270A60083p6435O3770i9399J9508A35717d92388
10545C2717b43780b7040k2302I0934a26025k36994B92023C0935a34720A70840
10534b95066B7438c31517b2553o4250B66798a17388b0833H7629d8963A35516a78391
10522a46329k48184E0618b15779d9975B50934a70104A00684h745F9763b84374
$$ plain form
10511 -173304 32607 -212986 199988 183880 -68436 6013 -134086 -41286 -76677 62745 -16503
10499 -187699 -1013 -243199 48305 168151 -257486 33276 100633 307861 259035 -147240 -124140
10488 -124140 -68540 -134867 40984 288910 144477 80947 -913 232689 135085 168179 229477
10477 229477 496916 752144 858780 864426 725592 5197 204671 294150 224181 163551 2823
10465 92542 -104211 225615 360597 210620 -49244 32861 -120918 105948 95355 -205261
10454 -25089 71476 -323901 -135464 -121442 -268673 -94256 -147199 -185055 -160830 -251064 16858
10442 211599 -196140 -254065 83858 -5126 -36390 323674 -41648 74729 45915 333756 12036
10430 65371 -21224 -157721 138015 271120 -67244 150814 84545 -71557 -234067 -25344 -47688
$$ packed form
10511a73304C2607b12986A99988j6108f8436F013a34086d1286l5391F2745a6503
10499a87699a013k42186D8305J19846b57486C3276O7357K07228m8826a47240K3100
10488a24140N5600o6327D0984K47926j44433o3530i13B32689r7604L3094O1298
10477B29477K67439K55228J06636N646j38834E197J99474Q9479o9969o0630B823
10465I2542a04211B25615J34982j49977d9244C2861a20918A05948j0593b05261
10454b5089G1476c23901a35464J4022j47231i4256n2943l7856K4225r0234A6858
10442B11599a96140n7925H3858e126l1264C23674d1648G4729k8814K87841A2036
10430F5371b1224j36497A38015J33105f7244A50814o6269g1557j62510b5344k2344
$$ plain form
10419 -47688 7180 96249 -102007 -124808 -59794 -17648 13820 179802 66650 16458 12675 9505
10407 9505 -102238 47970 -407922 149824 -115788 40357 259172 -18853 49829 141268 208649
10396 208649 -36643 -248012 262883 419761 213276 375803 310297 255972 232921 196189
10386 196189 284897 170565 -9026 9778 134605 -195812 160973 384548 260232 149604
10376 149604 373144 255368 787369 213392 140400 235971 572503 498942 544201 263674
10365 594927 452443 782452 599153 679508 284381 390402 457056 396017 163088 -43692
10354 277367 438376 292395 348945 400621 538829 543090 1117233 465333 581619 656985
10344 656985 423192 395106 784872 528335 399576 134892 336867 -29637 447767 286020
$$ packed form
10419d7688G180Q9069a02007k2801e9794a7648A3820J65982F6650A6458l783l170
10407I505a02238D7970d07922A49824a15788D0357K18815a8853D9829R1439O7381
10396B08649c6643k11369B62883J56878k06485J62527o5506n4325k3051l6732
10386A96189Q8708j14332i026I778J24827a95812A60973K23575j24316j10628
10376A49604K23540j17776N32001B13392p2992R5571L36532p3561M5259B63674
10365E94927j42484L30009j83299Q0355B84381J06021O6654o1039A63088d3692
10354B77367J61009j45981N6550N1676J38208M261N74143D65333J16286P5366
10344F56985k33793k8086L89766k56537j28759A34892K01975b9637D47767j61747
$$ plain form
10334 286020 166966 358172 255173 313432 40497 227346 -44644 7786 -255039 51881 420705
10323 420705 235661 262142 58947 331688 305607 25492 258508 164503 -73850 235160 -110965
10311 -243318 160489 56843 -3551 -10147 -415724 7020 -345553 85969 -108971 388216 276016
10300 276016 1213 -61646 -126526 234155 192849 -154881 -145030 467944 286687 15341 30970
10289 30970 -227294 142145 231745 42765 -171404 32047 52920 -285015 53033 140961 -233714
10277 115127 359012 165651 318797 -134685 -25649 104650 464821 -26347 11629 -77584
10266 402077 -86749 -56592 -199332 78730 -115121 83315 -78971 284846 -71869 230080 45268
10254 330661 529516 362391 267453 588446 108523 267345 219319 59853 -267073 -27688
$$ packed form
10334B86020j19054J91206j02999N8259D0497J86849d4644G786b55039E1881L68824
10323D20705j85044K6481E8947K72741k6081B5492K33016r4005g3850B35160a10965
10311b43318A60489E6843c551o596m05577G020c45553H5969a08971C88216j12200
10300B76016A213f1646o4880B34155m1306a54881R851D67944j81257A5341J5629
10289C0970b27294A42145Q9600D2765a71404C2047K0873b85015E3033Q7928b33714
10277A15127K43885A65651J53146a34685b5649A04650L60171b6347A1629g7584
10266D02077h6749L0157j42740G8730a15121H3315g8971B84846g1869B30080D5268
10254C30661J98855j67125r4938L20993A08523J58822m8026E9853b67073b7688
$$ plain form
10243 -291892 -59110 205324 -269726 -194507 22875 -84363 -81652 304209 63055 307332 -234270
10231 133526 -235546 7068 45244 -65239 78473 -81308 -185294 139579 -219410 174214 -37748
10219 -132853 187380 -172423 9824 174746 -91600 244506 -287153 -203 -301868 -92504 -120745
10208 -120745 -276604 -232028 -76799 -360078 57181 -175746 221241 28875 -52720 64091 182273
10197 182273 209920 -29546 -90622 -136366 169818 -224626 -20705 -174677 -436747 -157061
10186 -158460 -299518 -159609 22279 13453 -272538 -268067 -78691 82692 -63275 1931 -106727
10174 24654 219559 -13440 -131991 -80726 -80942 -318602 -54764 -150450 -211547 63412 -28180
10162 -214271 -190043 -257560 -232290 -149865 -133085 -300470 48145 -212105 91268 -238098 7220
$$ packed form
10243b91892e9110B05324b69726P5219B2875h4363K711C04209F3055K44277b34270
10231A33526b35546G068L8176f5239G8473h1308j03986A39579b19410A74214c7748
10219a32853A87380a72423I824J64922i1600B44506b87153b03l01665i2504k8241
10208a20745j55859M4576g6799k83279E7181a75746B21241B8875e2720F4091J18182
10197A82273K7647b9546o1076m5744A69818b24626b0705j53972k62070a57061
10186a58460j41058J39909B2279q826b72538M471g8691H2692f3275A931a06727
10174B4654J94905a3440j18551N1265k16k37660e4764r5686o1097F3412b8180
10162b14271K4228o7517K5270Q2425J6780j67385D8145b12105I1268b38098G220
$$ plain form
10150 163881 43650 -400870 82781 -49218 -228364 -217595 -52055 345460 -184873 -374993
10140 -374993 -34863 -65339 -273769 -488037 -152986 63088 74300 -141141 -277358 -206260
10130 -206260 -229634 -119121 -176026 63087 -201478 9540 -97197 -436933 -276747 -217914 -211214
10119 -211214 -51443 -165169 -196512 84652 66628 -87449 119837 65282 103745 -184040 194460
10107 216812 34816 -117084 -243149 -105136 213956 173150 107969 -199474 -6596 -153139
10097 -153139 -215356 174276 -133367 -116239 -93311 -159890 167164 -109424 -31825 127475
10086 -172311 -98088 -29066 126839 -20854 -268262 42453 -400 107749 80554 -227044 -20750
10074 17713 -209072 -427673 169646 -9284 179331 -89604 -287941 274510 -378642 -145980
$$ packed form
10150A63881D3650d00870H2781d9218j79146J0769e2055C45460a84873j90120
10140c74993c4863l0476k08430k14268a52986F3088J1212a41141j36217P1098
10130b06260k3374J10513n6905F3087b01478I540i7197l39736J60186N8833O700
10119b11214e1443j13726l1343H4652j8024h7449A19837n4555L8463a84040A94460
10107B16812C4816a17084j26065a05136B13956m0806o5181a99474f596j46543
10097a53139o2217A74276a33367J7128K2928o6579A67164a09424c1825A27475
10086a72311P4223b9066A26839b0854k47408D2453d00A07749k7195b27044b0750
10074A7713b09072k18601A69646i284A79331h9604j98337B74510c78642a45980
$$ plain form
10063 146877 -162557 -179229 -115489 -126293 93798 -285857 20787 249803 -324990 188766
10052 -107516 -154186 -283551 -84122 -426510 -53120 -114731 -188887 -21885 -350750 33211 -148150
10040 -172419 -196433 126718 -201380 -91329 258866 -142623 122558 4336 -68079 -494839
10030 -494839 107490 2040 -356163 46615 107048 -103769 5035 -187816 147261 27290 -146230
10018 -49618 51925 131273 157577 -16167 -80015 52499 -152701 -111747 194 -77344 117132 -34859
10005 -193882 -141902 -318298 -275259 -111409 -302712 -166625 -16546 109245 -177542 -134067
9995 -134067 149179 383825 -140880 -130758 -1491 -90590 -323550 -72715 4611 -35671 -36513 -92703
9983 -92703 170979 -100065 -83589 53379 125017 13916 -294161 -49009 -268880 -283815 148965
$$ packed form
10063A46877a62557j6672O3740j0804I3798b85857B0787K29016c24990A88766
10052a07516m6670j29365h4122l42388e3120o1611p4156b1885l28865C3211a48150
10040a72419k4014A26718b01380i1329B58866a42623A22558D336f8079m26760
10030d94839A07490B040c56163D6615O0433a03769E035a87816A47261B7290a46230
10018d9618E1925P9348K6304a6167o3848E2499a52701M0954A94g7344A17132c4859
10005a93882N1980j76396M3039a11409j91303J36087a6546A09245a77542M3475
9995a34067A49179K34646a40880J0122a491q9099k32960g2715D611c5671q42n6190
9983i2703A70979a00065J6476E3379P1638A3916b94161d9009k19871j4935A48965
$$ plain form
9971 73267 35953 -139243 -22966 -64585 175857 214736 -17973 -196016 -20713 -270908 -31375
9959 110206 9601 -187727 199612 15070 -207786 -258412 -266381 110473 -20577 -98266 -123824
9948 -123824 -317684 -311014 -342808 -479576 -18066 -133138 -90593 -129285 -219678 -30008 5660
9936 59019 -67673 -40930 241773 -165409 45840 -242639 -306009 59834 57489 -394142 68356
9924 -81592 59668 -16612 -239823 -16035 -379794 -302842 252126 -72242 -256947 -251285 -23694
9912 25644 23765 -59126 -160550 -65758 5918 -221236 -336968 -154712 -227841 90349 -64022
9900 288093 44033 -1583 92099 240726 -115091 123419 -13788 -247876 -310422 -27768 -359654
9889 -359654 -214551 -285563 -237259 -84178 167613 -39706 -212860 288021 -272180 -327966 101317
$$ packed form
9971G3267C5953a39243b2966m1619A75857L8879a7973j78043b0713k50195c1375
9959A10206I601a87727A99612A5070b07786n0626p969A10473b0577p7689k5558
9948a23824j93860O670l1794j36768a8066j15072M2545l8692r0393c0008E660
9936E9019f7673K6743B41773a65409D5840b42639o3370E9834k345c94142F8356
9924h1592E9668a6612k23211a6035l63759P6952B52126g2242j84705N662b3694
9912B5644j879e9126j01424f5758E918b21236j15732a54712p3129I0349f4022
9900B88093D4033a583I2099J48627a15091A23419a3788k34088o2546b7768l31886
9889c59654J45103p1012M8304h4178A67613c9706j73154B88021b72180n5786A01317
$$ plain form
9877 23777 -28279 -239938 35971 -212210 14389 -170619 168880 -3311 -116768 79626 -290415
9865 117615 -157485 -157767 -314384 101131 -148806 -88661 -69772 36126 -48415 -145985 -296743
9854 -296743 -192504 -58801 -140946 30556 -203723 -237964 -120210 -32813 95844 -125043 143780
9842 -245393 -265311 315449 -172199 -140387 113669 -302856 113632 -44394 -79121 132631
9831 43264 -29101 -274081 138368 -231651 -60091 -145259 -221234 25816 -110940 -187095 -373584
9820 -373584 178333 196298 -236610 6685 108435 2155 -175062 8756 -99973 141717 -426184
9808 -297613 -100269 25985 -252292 7642 205529 -195195 -62892 22856 -494494 -175939 17813
9796 -415997 -180091 -230718 -216435 -76831 -410279 166068 -92410 158018 175080 15210 -58283
$$ packed form
9877B3777b8279k11659C5971b12210A4389a70619A68880c311j13457G9626b90415
9865A17615a57485k82j56617A01131a48806O0145J8889C6126d8415r7570j50758
9854b96743J04239e8801q2145C0556b03723l4241J17754c2813I5844a25043A43780
9842b45393j9918C15449a72199L1812A13669c02856A13632d4394l4727A32631
9831D3264b9101k44980A38368b31651f0091q5168p5975B5816a10940p6155j86489
9820c73584A78333J7965b36610F685J01750B155a75062H756i9973A41717d26184
9808b97613a00269B5985b52292G642J97887a95195f2892B2856d94494a75939A7813
9796d15997a80091n0627J4283g6831l33448A66068i2410A58018J7062A5210e8283
$$ plain form
9784 -47187 285226 -138135 -95601 4305 45206 -163099 -195175 -286564 744 116022 161609 -414426
9771 -138521 -184206 -206244 -197169 -194449 30795 -129340 269192 -237153 129637 -47092 -256893
9760 -256893 -113020 -99167 -75947 112530 -2268 -129891 -341303 -157651 -205766 -288095 -67705
9748 -64467 -326819 -262565 46882 -130318 13777 -107572 -137854 39021 -112744 -64859 -110799
9737 -110799 271076 110567 113824 -398767 96817 -59890 -73835 171273 -411983 -118308 -79321
9726 -79321 -427518 -190107 -224177 61050 85011 -192013 -55367 92660 25294 -24558 -94892
9715 -94892 -12155 -202411 42854 19029 -224086 -12738 -183948 7921 -104505 -286301 -23108
9703 -212287 16325 -66520 -18228 48019 20162 -371318 -276194 -67382 38280 -199231 -85774
$$ packed form
9784d7187B85226a38135M2534D305M0901a63099l2076r1389G44J15278M5587d14426
9771a38521m5685k2038R075K720C0795a29340B69192b37153A29637d7092k09801
9760b56893a13020J3853K3220A12530b268j27623k11412a57651m8115q2329f7705
9748f4467k62352O4254D6882a30318A3777a07572l0282C9021a12744M7885m5940
9737a10799B71076A10567L257c98767I6817e9890j3945A71273d11983a18308L8987
9726g9321l48197a90107l4070F1050K3961a92013e5367I2660B5294b4558p0334
9715i4892a2155j90256D2854A9029b24086a2738j71210G921a04505j81796b3108
9703b12287A6325f6520a8228D8019B0162c71318R5124f7382C8280a99231h5774
$$ plain form
9691 -176532 -235999 -332059 -51406 -138159 -98672 328565 -217665 171628 -142287 -45362 -25681
9680 -25681 44353 -73985 -214458 -189860 324809 -147062 -335614 -122583 54696 -55410 136813
9668 44855 -155834 -95620 -141360 280308 44036 28441 77213 -181965 198707 -37746 150765
9656 -185567 -236063 -194011 -302848 -190943 -101254 -154143 -49678 -106437 -395269 -383534 109659
9644 59600 -98760 -277124 -72720 266569 -337944 193695 -34921 -153598 138751 38307 -59240
9632 -184839 38671 227813 -305519 -193514 -318499 -234966 -30086 -93235 -321496 43740 47388
9621 47388 -64574 228936 40530 193918 -15761 -252406 33461 -176931 209340 -315512 -124701
9609 -17560 352741 -414277 -94902 159448 -58624 -96611 -356554 -308823 139264 -50773 -331759
$$ packed form
9691a76532n9467r6060e1406q6753L9487C28565b17665A71628a42287d5362J9681
9680b5681D4353g3985j40473K4598C24809a47062j88552a22583E4696e5410A36813
9668D4855a55834O0214m5740B80308D4036j5595M8772a81965A98707c7746A50765
9656a85567n0496M2052j08837J11905Q9689n2889d9678n6759k88832J1735A09659
9644E9600i8760j78364g2720B66569c37944A93695c4921j18677A38751C8307e9240
9632a84839C8671J89142c05519J12005j24985Q3533c0086o3149k28261D3740L648
9621D7388f4574B28936D0530J53388a5761k36645C3461a76931B09340c15512a24701
9609a7560C52741d14277i4902A59448e8624l7987k59943M7731A39264e0773k80986
$$ plain form
9598 -331759 29963 -121939 22322 -218106 -183837 -91202 -194987 110555 -328805 7201 40468
9587 40468 -380654 -188809 189703 -47783 -231039 -385961 70557 43421 -295450 -83114 137788
9575 -8515 -171363 3718 -290026 121230 -163788 -267614 142353 194229 38894 -172690 27092
9563 257821 -100402 -38904 -10722 -64393 -153149 92558 170840 -156699 230479 248098 13502
9551 -164119 37817 -59542 -328759 338173 -117021 -30619 -159474 37398 -75788 -277107 187390
9539 155954 -337719 164740 38840 188143 -197666 133005 -112056 -206742 205959 -184212
9528 45660 140699 -49680 -303370 -372761 92968 -104848 64089 -79596 74033 -41613 -62293
9517 -62293 -269430 -245844 -129076 -162535 246726 -185604 -388500 -203203 112159 331505
$$ packed form
9598c31759B9963a21939B2322b18106L4269i1202j03785A10555c28805G201L3267
9587D0468c80654a88809A89703d7783j83256j54922G0557k7136b95450h3114A37788
9575h515j62848C718b90026A21230a63788j03826A42353N1876C8894a72690B7092
9563B57821a00402c8904a0722n3671q8756I2558P8282a56699B30479J7619A3502
9551a64119C7817e9542k69217C38173a17021c0619j28855C7398g5788k01319A87390
9539A55954c37719A64740C8840J49303a97666A33005a12056r4686B05959a84212
9528D5660R5039d9680k53690o9391I2968a04848F4089g9596G4033d1613k0680
9517f2293k07137K3586J16768l3459B46726a85604k02896J85297A12159K19346
$$ plain form
9507 331505 29900 10461 -71286 106897 -9771 57700 -232526 159302 -72515 -135691 -135822 122980
9494 -103105 -468898 -121729 -65063 -59492 -75116 -55700 -18550 55889 -214815 57482 127025
9483 127025 -104587 -178532 -280704 -86811 17887 -27457 -47737 114116 -383695 11951 -274533
9471 -213981 -220415 -87574 113254 9676 69064 -153930 -41228 150580 157288 -139733 -38830
9459 22916 -131744 285484 -48500 -86364 -63421 -69276 -174819 64924 43151 112670 157457
9448 157457 -11941 185230 -139343 48178 -252474 75433 -165608 191616 -108912 -174983
9438 -174983 -280758 -526015 -491306 -289371 179426 -134824 -194189 124911 -240727 -83878
9427 -77968 -447405 2486 -16762 -382600 -240016 8825 65530 -313356 -97854 -271418 -169476
$$ packed form
9507C31505B9900A0461g1286A06897i771E7700b32526A59302g2515o3176j31A22980
9494a03105l65793a21729N6666N571j5624J9416a8550E5889b14815E7482O9543
9483A27025a04587p3945j02172h6811A7887b7457k0280A14116c83695A1951b74533
9471b13981o434h7574A13254I676N9388a53930d1228A50580O708a39733c8830
9459B2916a31744B85484d8500l7864K2943n855j05543F4924k1773O9519M4787
9448A57457a1941A85230a39343D8178b52474G5433a65608A91616a08912o6071
9438a74983j05775k45257L4709K01935A79426a34824n9365A24911b40727h3878
9427g7968l69437B486a6762l65838J42584H825N6705c13356i7854j73564J01942
$$ plain form
9416 -169476 -355401 -187619 112565 -318645 -373684 -110975 -168903 -153206 -28548 -41821 112687
9404 41153 -68920 123289 -272867 -40024 216316 -402086 -149299 -302297 132617 -197663
9393 -123437 -369780 89834 -327451 226954 -252908 -148559 -280429 -366372 -146367 245315
9382 5704 172784 137131 -58374 42131 132183 -264924 -264342 -278191 -207816 -248591 202974 104093
9370 104093 -292192 11854 -261702 -229342 -333611 -29786 -67927 87426 362175 -154098 129282
9358 220833 -53781 113346 126161 -195001 -62461 16151 -10136 -197095 -230129 -283167 -425207
9347 -425207 -92833 -78733 -143513 -225443 -263886 228363 -6472 390946 66501 -289941 -63651
9335 33814 -116104 124569 -211738 -156829 -256365 7063 234877 65759 -124458 5994 -131229
$$ packed form
9416a69476j85925J67782A12565c18645n5039a10975n7928J5697b8548j3273A12687
9404D1153f8920A23289b72867d0024B16316d02086a49299j52998A32617a97663
9393a23437k46343H9834c27451B26954b52908J04349j31870q5943a46367B45315
9382E704J67080l5653e8374D2131R0052b64924N82j3849P0375m0775B02974r8881
9370A04093b92192A1854b61702L2360j04269b9786l8141H7426K74749a54098A29282
9358B20833e3781A13346J2815a95001f2461A6151a0136j86959l3034n3038j42040
9347d25207i2833J4100o4780q1930l8443B28363f472C90946F6501b89941f3651
9335C3814a16104A24569b11738N4909r9536G063K27814F5759a24458E994a31229
$$ plain form
9323 -1682 -14291 93323 -111132 -198543 89595 -118471 -6038 -426163 -136074 -71963 -20349
9311 45353 -77550 -294710 -240050 -180283 -224353 216838 269903 134395 -194419 237165 23827
9299 -86479 -74920 -79126 55623 135594 319606 52173 243900 -360754 -35831 -2605 -184688
9288 -184688 -296088 -50462 -99202 121318 -112055 -185681 -241400 -344803 84642 -50079 -66507
9277 -66507 -24342 -330199 -343172 -88131 208612 -79411 171692 -126646 -147761 -102182 124942
9265 158460 -112083 17136 -110377 87154 -225072 26990 197979 -106810 -171000 -167957 -160267
9254 -160267 -276569 -11337 -17245 -400447 -59022 5417 -191391 -184107 -354218 11740 -264561
9242 147184 -253817 -351327 -51402 173895 133426 -287537 -78301 177123 -361467 123479
$$ packed form
9323a682j2609I3323a11132q7411H9595a18471f038m20125a36074O4111b0349
9311D5353g7550k17160N4660N9767m4070B16838N3065A34395a94419B37165B3827
9299h6479J1559m206E5623P9971J84012E2173J91727c60754c5831b605j82083
9288a84688j11400e0462m8740A21318a12055p3626n5719j03403H4642e0079j6428
9277f6507b4342l05857j2973h8131B08612g9411A71692a26646k1115M5579A24942
9265A58460a12083A7136a10377H7154b25072B6990J70989a06810o4190L043P690
9254a60267j16302a1337n908l83202e9022E417a91391P284j70111A1740b64561
9242A47184b53817r7510e1402A73895m0469b87537g8301A77123c61467A23479
$$ plain form
9231 -38293 -153258 -204925 175929 39702 -280137 9805 73906 277166 18425 13169 261491
9220 261491 -163063 9106 299457 98930 141647 -167389 55562 71218 8318 -133479 -46592
9208 210356 -246969 239474 318347 -56491 -343091 -353494 47290 -28232 -96084 -341317 -292056
9197 -292056 121501 114382 -76504 -228998 19728 69097 1040 96428 -217321 -281562 61144
9185 120329 -202832 -90116 109939 -153878 -87300 -5903 -182887 75982 -84847 -57536 96465
9173 -447314 -43214 -408487 -58890 391219 -96204 103128 103033 150643 162909 -109584 -142971
9162 -142971 104769 -204346 -244211 14180 106181 21405 -43196 964 -199376 3689 386988
9151 386988 -255302 -154467 11612 -246131 -145277 -450365 143080 -348380 -442791 112012
$$ packed form
9231c8293j14965n1667A75929C9702b80137I805O4101K03260A8425n256K48322
9220B61491a63063I106K90351I8930M2717a67389E5562J5656H318a33479d6592
9208B10356b46969B39474P8873e6491k86600j0403D7290b8232o7852k45233M9261
9197b92056A21501p119g6504j52494A9728M9369A040R5388b17321o4241F1144
9185A20329b02832i0116A09939a53878O6578e903j76984G5982h4847K7311I6465
9173d47314d3214l65273e8890C91219i6204A03128r5M7610J2266a09584l3387
9162a42971A04769b04346l9865A4180R2001B1405d3196I64a99376C689L83299
9151C86988b55302J00835A1612b46131J00854l05088A43080c48380r4411A12012
$$ plain form
9140 96782 -168360 -245834 183942 -298015 -36314 -88700 -71354 -243892 24555 -388882 -109726
9128 -252856 84237 -89009 248146 -102659 16609 -273270 -296731 -253981 -25041 48913 -24880
9116 76354 -276109 299951 -211096 -142964 253645 40475 38774 -143320 24299 112104 -135326
9104 -60578 157644 -509837 -27420 -216098 117194 -421188 117443 150998 151674 -184459 -269319
9093 -269319 435208 -218466 67378 -338399 -443317 -43549 -20799 107567 -365013 154567
9082 -78453 -538869 -67450 -219693 220302 -287988 -4268 -331663 133377 -242252 44510 -273248
9070 -145735 40556 -23852 -610598 -70904 35943 -97749 -176241 30125 93204 7281 139424
9059 139424 -225925 37031 226050 -152599 62888 -166296 -309310 223264 80765 -99433
$$ packed form
9140I6782a68360p7474A83942b98015c6314n2386J7346j72538B4555c88882a09726
9128b52856H4237h9009B48146a02659A6609b73270k3461M2750b5041D8913b4880
9116G6354b76109B99951b11096O8132B53645D0475j701a43320B4299Q7805a35326
9104f0578A57644e09837b7420j88678A17194d21188A17443L3555O76a84459q4860
9093b69319D35208b18466F7378c38399j04918d3549b0799A07567c65013A54567
9082g8453m60416f7450j52243B20302b87988d268l27395A33377b42252D4510b73248
9070a45735D0556b3852n86746g0904C5943i7749p8492C0125O3079G281J32143
9059A39424b25925C7031J89019a52599F2888a66296j43014B23264H0765i9433
$$ plain form
9048 110992 -185537 -39066 -97214 -34701 -164286 -291545 92863 4845 -243734 32043 119537
9037 119537 -327114 -69727 29047 149724 105401 -157870 -134311 -42370 132455 66596 126501
9026 126501 -123802 359387 -140214 9792 -74888 70434 -130202 -155607 -17663 55421 -314378
9014 -233658 69401 9654 56067 -131012 53913 -118506 -77780 -44153 -233510 119673 -133319
9002 4673 -30651 21971 -160244 -365970 179161 23909 -153775 -13110 183949 -60763 -299536
8991 -299536 -211189 25774 -25355 12366 -169824 -193494 -93026 431150 -262819 57018 4528
8979 -50143 -226056 43049 215433 -112473 95399 -65712 105054 -161774 42997 -185090 192597
8967 -355245 67242 169356 40387 5662 232845 -174213 -329887 -20052 59560 158110 -269066
$$ packed form
9048A10992a85537c9066n8148c4701j29585j27259I2863D845b43734C2043Q7494
9037A19537c27114f9727B9047J20677m4323a57870K3559d2370A32455o5859N9905
9026A26501a23802C59387a40214I792g4888G0434a30202k5405a7663E5421c14378
9014b33658F9401I654M6413a31012E3913a18506M0726L3627j89357A19673a33319
9002D673c0651B1971a60244k05726A79161B3909a53775a3110A83949f0763k38773
8991b99536Q8347B5774b5355A2366a69824k3670i3026D31150b62819E7018D528
8979e0143j75913D3049J72384a12473I5399f5712A05054a61774D2997a85090A92597
8967c55245F7242J02114D0387E662K27183a74213j55674b0052E9560R8550b69066
$$ plain form
8955 123163 -90184 -216124 -5003 37446 -150082 2159 -196446 -123908 -276321 56781 55731
8944 55731 -304575 -491985 -65852 -36184 84353 -184305 -72317 34742 7497 209242 462349
8933 462349 -40417 -72514 59614 -331138 46203 354391 213209 2252 231138 123248 1766110
8922 1766110 4605626 10991194 7021445 1448234 602029 260506 96754 181084 62700
8912 -165083 -135951 50410 -91552 -369695 348455 287280 10059 44442 98316 -329693 -8191
8900 -1576 161597 -43540 170519 -115136 -307201 -52086 48536 263142 -46303 -326711 -150426
$$ packed form
8955A23163i0184j25940e003C7446a50082B159a96446P2538j52413E6781j050
8944E5731c04575j87410f5852K9668H4353a84305g2317C4742G497K01745K53107
8933D62349d0417l2097E9614c31138D6203L08188j41182B252K28886j07890J642862
8922A766110K839516O385568l969749A448234F02029B60506I6754Q4330F2700
8912a65083K9132E0410i1552k78143C48455o1175A0059L4383N3874c29693h191
8900a576A61597d3540A70519a15136j92065e2086D8536K14606d6303k80408a50426
$$ [...]
##END NTUPLES=NMR SPECTRUM
##END=
