
##TITLE=AC1233_PERAH12114_6519287_kQ2xMY586G
##JCAMPDX= 6.0         $$ Bruker NMR JCAMP-DX V2.0
##DATA TYPE= NMR SPECTRUM
##DATA CLASS= NTUPLES
##ORIGIN= BRUKER
##OWNER= Administrator
$$ 1.72 TOPSPIN		Version 2.1
$$ 2012-07-13 18:09:53.640 -0500  Administrator@TOPSPIN
$$ Compression mode = diff/dup
##.OBSERVE FREQUENCY= 400.02188249412
##.OBSERVE NUCLEUS= ^1H
##.ACQUISITION MODE= SIMULTANEOUS (DQD)
##.ACQUISITION SCHEME= undefined
##.AVERAGES= 64
##.DIGITISER RES= 22
##SPECTROMETER/DATA SYSTEM= spect
##.PULSE SEQUENCE= noesygpps1d.comp
##.SOLVENT NAME= COFFEE_meoh
##.SHIFT REFERENCE= INTERNAL, COFFEE_meoh, 1, 14.96155
##AUDIT TRAIL= $$ (NUMBER, WHEN, WHO, WHERE, PROCESS, VERSION, WHAT)
$$ ##TITLE= Audit trail, TOPSPIN		Version 2.1
$$ ##JCAMPDX= 5.01
$$ ##ORIGIN= Bruker BioSpin GmbH
$$ ##OWNER= Administrator
$$ $$ C:\Bruker\TOPSPIN/data/COFFEE/nmr/AC1233_PERAH12114_6519287_kQ2xMY586G/82/pdata/1/auditp.txt
$$ ##AUDIT TRAIL=  $$ (NUMBER, WHEN, WHO, WHERE, PROCESS, VERSION, WHAT)
(   1,<2012-07-13 18:09:48.796 -0500>,<Administrator>,<TOPSPIN>,<go>,<TOPSPIN 2.1>,
      <created by zg
	started at 2012-07-13 17:58:18.250 -0500,
	POWCHK enabled, PULCHK disabled,
       configuration hash MD5:
       6B 1B 68 BB D9 2E 58 E2 7F 35 AD 54 07 DF 0E 41
       data hash MD5: 64K
       8C 27 F2 89 92 F6 A3 F0 40 52 94 A4 55 3A B7 0F>)
(   2,<2012-07-13 18:09:51.687 -0500>,<Administrator>,<TOPSPIN>,<proc1d>,<TOPSPIN 2.1>,
      <Start of raw data processing
       efp LB = 0.3 FT_mod = 6 PKNL = 1 PHC0 = 0 PHC1 = 0 SI = 128K 
       data hash MD5: 128K
       47 3D 07 89 F7 42 43 56 77 69 6D 01 3F 30 06 60>)
(   3,<2012-07-13 18:09:52.828 -0500>,<Administrator>,<TOPSPIN>,<proc1d>,<TOPSPIN 2.1>,
      <pk PHC0 = 3.175049 PHC1 = 0 
       data hash MD5: 128K
       2B 35 16 3A A8 D5 E1 6B 46 74 B1 B1 66 93 97 44>)
(   4,<2012-07-13 18:09:53.312 -0500>,<Administrator>,<TOPSPIN>,<proc1d>,<TOPSPIN 2.1>,
      <abs ABSG = 1 
       data hash MD5: 128K
       1B 6B C6 2E 96 11 A1 AD 0D EF 74 0B 4D 79 E8 2C>)
(   5,<2012-07-13 18:09:53.390 -0500>,<Administrator>,<TOPSPIN>,<proc1d>,<TOPSPIN 2.1>,
      <abs ABSG = 2 
       data hash MD5: 128K
       A8 80 A7 71 56 32 1A 81 95 07 AC 49 BA 66 BE 71>)
(   6,<2012-07-13 18:09:53.453 -0500>,<Administrator>,<TOPSPIN>,<proc1d>,<TOPSPIN 2.1>,
      <abs ABSG = 3 
       data hash MD5: 128K
       4E E7 71 6F BF 6A 42 3B 3A 1B F0 50 BE F4 9C E1>)
(   7,<2012-07-13 18:09:53.500 -0500>,<Administrator>,<TOPSPIN>,<proc1d>,<TOPSPIN 2.1>,
      <abs ABSG = 4 
       data hash MD5: 128K
       D4 0E AE 23 7E B7 92 F4 CF 7A FA 93 31 00 07 4F>)
(   8,<2012-07-13 18:09:53.546 -0500>,<Administrator>,<TOPSPIN>,<proc1d>,<TOPSPIN 2.1>,
      <abs ABSG = 5 
       data hash MD5: 128K
       B0 43 5C E8 C2 35 83 70 7D 58 D5 5C 83 7A B4 38>)
$$ ##END=
$$ 
$$ $$ hash MD5
$$ $$ 9B 3C BF 6A BD 55 56 82 8D B1 2F 87 AC E1 A5 F4
##$RELAX= 
##$RELAX= 
##$RELAX= 
##$RELAX= 
##$RELAX= 
##$RELAX= 
##$RELAX= 
##$RELAX= 
##$RELAX= 
$$ [...]
##$TP07= 0
##$TPNAME0= <>
##$TPNAME1= <>
##$TPNAME2= <>
##$TPNAME3= <>
##$TPNAME4= <>
##$TPNAME5= <>
##$TPNAME6= <>
##$TPNAME7= <>
##$TPOAL= (0..7)
0.5 0.5 0.5 0.5 0.5 0.5 0.5 0.5
##$TPOFFS= (0..7)
0 0 0 0 0 0 0 0
##$TUNHIN= 0
##$TUNHOUT= 0
##$TUNXOUT= 0
##$USERA1= <user>
##$USERA2= <user>
##$USERA3= <user>
##$USERA4= <user>
##$USERA5= <user>
##$V9= 5
##$VALIST= <valist>
##$VCLIST= <CCCCCCCCCCCCCCC>
##$VD= 0
##$VDLIST= <DDDDDDDDDDDDDDD>
##$VPLIST= <PPPPPPPPPPPPPPP>
##$VTLIST= <TTTTTTTTTTTTTTT>
##$WBST= 2048
##$WBSW= 25
##$XGAIN= (0..3)
0 0 0 0
##$XL= 0
##$YL= 0
##$YMAX_a= 16962122
##$YMIN_a= -12680167
##$ZGOPTNS= <>
##$ZL1= 120
##$ZL2= 120
##$ZL3= 120
##$ZL4= 120
##$ABSF1= 14.96155
##$ABSF2= -5.596632
##$ABSG= 5
##$ABSL= 3
##$ALPHA= 0
##$AQORDER= 0
##$ASSFAC= 0
##$ASSFACI= 0
##$ASSFACX= 0
##$ASSWID= 0
##$AUNMP= <proc_prof1d_extract.lims>
##$AXLEFT= 0
##$AXNAME= <>
##$AXNUC= <1H>
##$AXRIGHT= 0
##$AXTYPE= 0
##$AXUNIT= <>
##$AZFE= 0.1
##$AZFW= 0.1
##$BCFW= 0
##$BC_mod= 0
##$BYTORDP= 0
##$COROFFS= 0
##$CY= 15
##$DATMOD= 1
##$DC= 0
##$DFILT= <>
##$DTYPP= 0
##$F1P= 0
##$F2P= 0
##$FCOR= 0.5
##$FTSIZE= 131072
##$FT_mod= 6
##$GAMMA= 0
##$GB= 0
##$INTBC= 1
##$INTSCL= 1
##$ISEN= 128
##$LB= 0.3
##$LEV0= 0
##$LPBIN= 0
##$MAXI= 10000
##$MC2= 0
##$MEAN= 0
##$ME_mod= 0
##$MI= 0
##$NCOEF= 0
##$NC_proc= -2
##$NLEV= 6
##$NOISF1= 0
##$NOISF2= 0
##$NSP= 0
##$NTH_PI= 0
##$NZP= 0
##$OFFSET= 14.96155
##$PC= 1
##$PHC0= 3.175049
##$PHC1= 0
##$PH_mod= 1
##$PKNL= yes
##$PPARMOD= 0
##$PPDIAG= 0
##$PPIPTYP= 0
##$PPMPNUM= 2147483647
##$PPRESOL= 1
##$PSCAL= 4
##$PSIGN= 0
##$PYNMP= <proc.py>
##$REVERSE= no
##$SF= 400.020009417628
##$SI= 131072
##$SIGF1= 0
##$SIGF2= 0
##$SINO= 400
##$SIOLD= 131072
##$SPECTYP= <>
##$SREGLST= <1H.CDCl3>
##$SSB= 0
##$STSI= 131072
##$STSR= 0
##$SW_p= 8223.68421052631
##$SYMM= 0
##$S_DEV= 0
##$TDeff= 65536
##$TDoff= 0
##$TI= <>
##$TILT= no
##$TM1= 0
##$TM2= 0
##$TOPLEV= 0
##$USERP1= <user>
##$USERP2= <user>
##$USERP3= <user>
##$USERP4= <user>
##$USERP5= <user>
##$WDW= 1
##$XDIM= 131072
##$YMAX_p= 347988441
##$YMIN_p= -12299
##$CURPLOT= <Network HP LaserJet P1505>
##$CURPRIN= <$Network HP LaserJet P1505>
##$DFORMAT= <normdp>
##$LAYOUT= <+/1D_H.xwp>
##$LFORMAT= <normlp>
##$PFORMAT= <normpl>
##$SURQMSG= 1
$$ End of Bruker specific parameters
$$ ---------------------------------
##NTUPLES= NMR SPECTRUM
##VAR_NAME=  FREQUENCY,     SPECTRUM/REAL,   SPECTRUM/IMAG
##SYMBOL=    X,             R,               I
##VAR_TYPE=  INDEPENDENT,   DEPENDENT,       DEPENDENT
##VAR_FORM=  AFFN,          ASDF,            ASDF
##VAR_DIM=   131072,        131072,          131072
##UNITS=     HZ,            ARBITRARY UNITS, ARBITRARY UNITS
##FACTOR=    0.0627417313425164, 1,          1
##FIRST=     8223.62146879497, -2309,        -82470
##LAST=      0,             -771,            -83291
##MIN=       0,             -12299,          0
##MAX=       8223.62146879497, 347988441,    0
$$ Real data points
##PAGE= N=1
##DATA TABLE= (X++(R..R)), XYDATA
$$ [...]
63634E03101K890M593N763N853N792O386P065O911O236O156P001Q017Q599R122
63620E93485J0314J2224J4094J5157J5452J5705J6478J7574J8495J9236K0225
63609G68439K1573K2842K3662K4105K4373K4454K4257K3738K2686K0754J7856
63598A018739J4426J1071Q126N474K675o68m371p603r580j0295j0257r831r285
63585I98621r196j0017j1296j2111j2370j2939j4191j5259j5153j4049j2884j2109
63573H47047j1331j0009q087o108m823m495m516m062l134k442k157j533r5J567
63559G85822K768L890N936R162J2815J6009J8331J9786K0764K1938K3715K5745
63547I66681K7363K8432K9465L0930L2840L4841L6431L7117L6759L5628L3673
$$ plain form
63634 503101 505991 510584 516347 522200 527992 534378 541443 548354 554590 560746 567747 575764 584363 593485
63620 593485 603799 616023 630117 645274 660726 676431 692909 710483 728978 748214 768439
63609 768439 790012 812854 836516 860621 884994 909448 933705 957443 980129 1000883 1018739
63598 1018739 1033165 1044236 1052362 1057836 1060511 1059843 1055472 1047869 1038289 1027994 1017737 1007906 998621
63585 998621 989425 979408 968112 956001 943631 930692 916501 901242 886089 872040 859156 847047
63573 847047 835716 825707 817620 811512 806689 802194 797678 793616 790482 788040 785883 784350 784255 785822
63559 785822 788590 792480 798416 807578 820393 836402 854733 874519 895283 917221 940936 966681
63547 966681 994044 1022476 1051941 1082871 1115711 1150552 1186983 1224100 1260859 1296487 1330160
63536A330160K9855K2773J2272J04j1219k0024k5814k8549k8348k6041k3338k1785
63524A210046k1571k1839k2199k3313k5724k8734l1091l2403l3152l3582l3309
63513I03129l2055l0055k7557k4625k1568j8988j7143j5744j4523j3517j2591
63502F74763j1400r997q917q340p791o953o122n515m822l900l176k736j804N3
63488E93343J774J957Q46J05O85J873K576K718K979L779M947O003O496O277N649
63473F42007N081M682M153L275K183J158L12m49j297k314l270l667l226k312j640
63458F44676j552j750j773j530j223q92j95J176K942M330M865M945N321O285P635
63443F73260R256J1209J3302J5175J6806J8421J9844K0686K1273K2598K4995K7588
$$ plain form
63536 1330160 1360015 1382788 1395060 1395164 1383945 1363921 1338107 1309558 1281210 1255169 1231831 1210046
63524 1210046 1188475 1166636 1144437 1121124 1095400 1066666 1035575 1003172 970020 936438 903129
63513 903129 871074 841019 813462 788837 767269 748281 731138 715394 700871 687354 674763
63502 674763 663363 653366 644449 636109 628318 621365 615243 609728 604906 601006 597830 595094 593290 593343
63488 593343 595117 597074 597920 598025 598710 600583 603159 605877 608856 612635 617582 623585 630081 636358 642007
63473 642007 647088 651770 655923 659198 661381 662539 662851 662402 661105 658791 655521 651854 648628 646316 644676
63458 644676 643124 641374 639601 638071 636848 635956 635761 636937 639879 644209 649074 654019 659340 665625 673260
63443 673260 682516 693725 707027 722202 739008 757429 777273 797959 819232 841830 866825 894413
63431H94413K9497L1010L2968L5649L8740M1701M3391M2004L6437K7628J7756
63420A271194Q410K29o084r579j0065q362n354j388L138P381J0629J2768J3822
63407A286739J3413J1044O768J320m252r021j2542j4911j6500j7525j8033j8172
63395A208328j8258j8584j9309k0557k2367k4568k6776k8515k9384k9305k8681
63384I42024k7996k7112k5327k2377j9011j6259j4352j2704j0700q179n395k796
63372G49816o31J436L959O808R133J0614J2096J4385J6963J8734J9576K0301K1351
63359I04541K2482K3621K5040K6621K7822K8550K9326L0309L0895L0565K9514
63348A209286K8011K5690K1963J6866J1150N646P50l607p578j0994j3377j4525
$$ plain form
63431 894413 923910 954920 987888 1023537 1062277 1103978 1147369 1189373 1225810 1253438 1271194
63420 1271194 1279604 1279833 1273749 1264170 1254105 1245743 1240389 1239001 1242139 1249520 1260149 1272917 1286739
63407 1286739 1300152 1311196 1317964 1319284 1315032 1306011 1293469 1278558 1262058 1244533 1226500 1208328
63395 1208328 1190070 1171486 1152177 1131620 1109253 1084685 1057909 1029394 1000010 970705 942024
63384 942024 914028 886916 861589 839212 820201 803942 789590 776886 766186 758007 752612 749816
63372 749816 749185 750621 754580 761388 770521 781135 793231 807616 824579 843313 862889 883190 904541
63359 904541 927023 950644 975684 1002305 1030127 1058677 1088003 1118312 1149207 1179772 1209286
63348 1209286 1237297 1262987 1284950 1301816 1312966 1318612 1319362 1315755 1308177 1297183 1283806 1269281
63336A269281j4878j5082j5357j5603j5970j6847j8356k0189k1826k2772k2811
63325A069590k2299k1871k1466k0177j7603j4795j3038j2162j0966r041o912m651
63313H94609j703J410K557q4o180j3776k1000k6710l0172l0978k9226k5518k0862
63300F92367j6511j3384j1424r933q593p673p235o810o085n304m700m172l759
63287E86784l781m219m483m131l293k215j038k73n92j675k084r93O26J235O49
63272E60517q0k07J28N96J001J021M54j96k0J182K550L087K640J929J868K882
63256E79352M531N827O086N538M960M823N036N409O022P054Q354R401R716R421
63242F71530R252R849J1061J2213J3045J4019J5642J7805J9963K1758K3242K4682
$$ plain form
63336 1269281 1254403 1239321 1223964 1208361 1192391 1175544 1157188 1136999 1115173 1092401 1069590
63325 1069590 1047291 1025420 1003954 983777 966174 951379 938341 926179 915213 906172 899260 894609
63313 894609 892906 894316 896873 896789 890609 876833 855833 829123 798951 767973 738747 713229 692367
63300 692367 675856 662472 651048 641115 632522 624849 617614 610804 604719 599415 594715 590543 586784
63287 586784 583003 578784 574301 570170 566877 564662 563624 563351 562759 561084 559000 558007 558633 559868 560517
63272 560517 560437 560230 560358 560954 561955 562976 563430 563234 563214 564396 566946 570033 572673 574602 576470 579352
63256 579352 583883 589710 595796 601334 606294 611117 616153 621562 627584 634638 642992 652393 662109 671530
63242 671530 680782 690631 701692 713905 726950 740969 756611 774416 794379 816137 839379 864061
63230H64061K6262K7908K9413L0748L2116L3509L4559L5156L5897L7264L8696
63219A225589L9199L8764L8232L7772L6516L4057L1277K9214K7854K6623K5277
63208A590374K3710K1511J8436J4829J0923O230K72o499j3201j9476k5323l0403
63196A591383l4320l7241l9519m0897m0809l9178l6296l2196k7011k1657j7240
63185A225019j3717r961n253nM994R347J2951J5912J8787K2213K5950K8865L0192
63172A365294L0355L0209K9910K9030K7433K5529K3712K1970K0098J7965J5466
63161A636971J2402Q686M600N82l362p774j3016j8614k3805k8519l3264l7942
63149A496945m1576m3543m4412m5033m5264m4331m2072l9133l6049l2828k9383
$$ plain form
63230 864061 890323 918231 947644 978392 1010508 1044017 1078576 1113732 1149629 1186893 1225589
63219 1225589 1264788 1303552 1341784 1379556 1416072 1450129 1481406 1510620 1538474 1565097 1590374
63208 1590374 1614084 1635595 1654031 1668860 1679783 1686013 1686285 1679786 1666585 1647109 1621786 1591383
63196 1591383 1557063 1519822 1480303 1439406 1398597 1359419 1323123 1290927 1263916 1242259 1225019
63185 1225019 1211302 1201341 1196088 1196083 1201077 1210424 1223375 1239287 1258074 1280287 1306237 1335102 1365294
63172 1365294 1395649 1425858 1455768 1484798 1512231 1537760 1561472 1583442 1603540 1621505 1636971
63161 1636971 1649373 1658059 1662659 1663241 1659879 1652105 1639089 1620475 1596670 1568151 1534887 1496945
63149 1496945 1455369 1411826 1367414 1322381 1277117 1232786 1190714 1151581 1115532 1082704 1053321
63138A053321k5841k2314j8815j5451j2375r615p157n086l321j512M22J945K630
63125I36831K956L773N011N702N342M565M294M705N246N247M344K731J129J57
63111I92033l78j179k368l193l066k490k508l472m673n188m789m028l585l599
63097I47517l707l534l014k249j323m05K92Q38J540K340K697K410K166K723L849
63082I52140M722N155N643O308O602O220N608N311N452O077P415R357J1196J2403
63068A049609J3302J4624J6569J8786K0971K3104K5153K7034K8886L1063L3737
63057A302838L6698L9647M2547M5533M8555N1396N4125N7240O1028O4881O7798
63046A872286O9653P1423P3809P6228P7717P8382P9162Q0374Q1284Q1160P9935
$$ plain form
63138 1053321 1027480 1005166 986351 970900 958525 948910 941753 936667 933346 931834 932256 934201 936831
63125 936831 939787 943560 948571 954273 959615 964180 968474 973179 978425 983672 988016 990747 991876 992033
63111 992033 991655 990476 988108 984915 981849 979359 976851 973379 968706 963518 958729 954701 951116 947517
63097 947517 943810 940276 937262 935013 933690 933285 933577 934415 935955 938295 940992 943402 945568 948291 952140
63082 952140 956862 962017 967660 973968 980570 986790 992398 997709 1003161 1009238 1016653 1026010 1037206 1049609
63068 1049609 1062911 1077535 1094104 1112890 1133861 1156965 1182118 1209152 1238038 1269101 1302838
63057 1302838 1339536 1379183 1421730 1467263 1515818 1567214 1621339 1678579 1739607 1804488 1872286
63046 1872286 1941939 2013362 2087171 2163399 2241116 2319498 2398660 2479034 2560318 2641478 2721413
63035B721413P7696P4321P0057O5780O2090N8528N4179M8866M3283L8078L3146
63024C347437K7812K1475J4071N987k503j1687k2058l3542m5328n6570o6815p5628
63012C102651q2232q6048q7390q7078q5388q1741p5667o7684n8953n0140m0979
63001B299351l1001k0427j0007k26Q963J7597K5408L2247L8345M3805M8185N1063
62989B503303N2761N4024N5093N5526N4876N3098N0326M6709M2458L7665L2131
62978C037970K5785J9081J2449N436k947j2906k3633l4433m5337n6267o6450p5212
62966B783536q2735q9318r4438r7387r8477r8690r8137r5858r1421q5939q0870
62955A770266p6344p1395o5671o0122n5698n2099m8359m4275m0507l7304l4002
$$ plain form
63035 2721413 2799109 2873430 2943487 3009267 3071357 3129885 3184064 3232930 3276213 3314291 3347437
63024 3347437 3375249 3396724 3410795 3416782 3414279 3402592 3380534 3346992 3301664 3245094 3178279 3102651
63012 3102651 3020419 2934371 2846981 2759903 2674515 2592774 2517107 2449423 2390470 2340330 2299351
63001 2299351 2268350 2247923 2237916 2237690 2246653 2264250 2289658 2321905 2360250 2404055 2452240 2503303
62989 2503303 2556064 2610088 2665181 2720707 2775583 2828681 2879007 2925716 2968174 3005839 3037970
62978 3037970 3063755 3082836 3095285 3100721 3097774 3084868 3061235 3026802 2981465 2925198 2858748 2783536
62966 2783536 2700801 2611483 2517045 2419658 2321181 2222491 2124354 2028496 1937075 1851136 1770266
62955 1770266 1693922 1622527 1556856 1496734 1441036 1388937 1340578 1296303 1255796 1218492 1184490
62944A184490l0148k6433k3849k2305k0793j8758j6603j4865j3528j2329j1195
62933I73684j0162r203q280p320o173m965m388n005o236o730n931m679l992l924
62919H86696m040m377n184o119o404n790m877m401m549m877m751l902k770k127
62905H22528k261k688k851k746k688k802l026l314l485l197k508k135k598l316
62891G82913l175k013q80p11j181j284o31J72L85l4n11o17m84m52n63n98n61o99
62873G69076j072j433j656j905k192k152j607r76p28o56k54L92O40K25l68n97
62857G54737m75l19k62l09n83j136j688j804j439j050j112j672k383k870k892
62842G34743k292j122O9M18l90j560j915j227l66o3k2M21J240J861K109K382K948
$$ plain form
62944 1184490 1154342 1127909 1104060 1081755 1060962 1042204 1025601 1010736 997208 984879 973684
62933 973684 963522 954319 946039 938719 932546 927581 923193 918188 911952 905222 899291 894612 890620 886696
62919 886696 882656 878279 873095 866976 860572 854782 849905 845504 840955 836078 831327 827425 824655 822528
62905 822528 820267 817579 814728 811982 809294 806492 803466 800152 796667 793470 790962 788827 786229 782913
62891 782913 779738 777725 776845 776134 774953 773669 773038 773210 773595 773561 773050 772433 771949 771497 770934 770336 769775 769076
62873 769076 768004 766571 764915 763010 760818 758666 757059 756083 755355 754699 754445 754837 755477 755702 755334 754737
62857 754737 754262 753943 753681 753372 752789 751653 749965 748161 746722 745672 744560 742888 740505 737635 734743
62842 734743 732451 731329 731398 731816 731426 729866 727951 726724 726358 726295 726273 726694 727934 729795 731904 734286 737234
62825G37234L567L986M288M583M697M537M438M823N527N851N358M448L909M032
62811H01278M336M215L672L302L621M561N583O156O202O235O989Q675J0633J1988
62797H87446J2672J3430J4769J6334J7618J8801K0363K2259K4069K5911K8479
62786A102151L2088L6243M0446M4900M9950N5311O0392O5192P0259P5730Q0991
62775A713653Q5529Q9545R3460R7134J00066J02117J03525J04259J03860J02039
62765B695187R8907R4481Q8286P9812O9022N6161M1282K4405O064j2641l0609
62754C210357m7310o2848p7564r1356j03330j12326j17881j20438j20574j18605
62744B238125j15110j11029j06621j00996r3622q5750p9190p3941o8375o1755
$$ plain form
62825 737234 740801 744787 749075 753658 758355 762892 767330 772153 777680 783531 788889 793337 797246 801278
62811 801278 805614 809829 813501 816803 820424 824985 830568 836724 842926 849161 856150 864825 875458 887446
62797 887446 900118 913548 928317 944651 962269 981070 1001433 1023692 1047761 1073672 1102151
62786 1102151 1134239 1170482 1210928 1255828 1305778 1361089 1421481 1486673 1556932 1632662 1713653
62775 1713653 1799182 1888727 1982187 2079321 2179387 2281504 2385029 2489288 2593148 2695187
62765 2695187 2794094 2888575 2976861 3056673 3125695 3181856 3223138 3247543 3253607 3240966 3210357
62754 3210357 3163047 3100199 3022635 2931279 2827949 2715623 2597742 2477304 2356730 2238125
62744 2238125 2123015 2011986 1905365 1804369 1710747 1624997 1545807 1471866 1403491 1341736
62734A341736n5170m9614m4524l9167l4211l0742k8386k5678k2020j8201j5098
62723I78925j2732j0648q440n876l092o35J151K725M722O962Q763J0172J2107
62710I84104J5095J8608K1837K4581K7113K9765L2913L6869M1451M6025N0233
62699A328594N4281N8379O2326O6022O9822P4019P8215Q1710Q4365Q6571Q8500
62688B132804Q9726Q9698Q8295Q5770Q2160P6876O9047N8517M6325L3760K0907
62677B873885O660r629k7011m3831n9235p3181q5358r4961j01623j05822j08065
62666B171829j08243j06149j02269r7491r2246q6431q0090p3770o7955o2475n6775
62655A237935n0692m4821m0009l6522l3724l0710k7192k3751k1089j9250j7673
$$ plain form
62734 1341736 1286566 1236952 1192428 1153261 1119050 1088308 1059922 1034244 1012224 994023 978925
62723 978925 966193 955545 947105 941229 938137 937502 938653 941378 946100 953062 961825 971997 984104
62710 984104 999199 1017807 1039644 1064225 1091338 1121103 1154016 1190885 1232336 1278361 1328594
62699 1328594 1382875 1441254 1503580 1569602 1639424 1713443 1791658 1873368 1957733 2044304 2132804
62688 2132804 2222530 2312228 2400523 2486293 2568453 2645329 2714376 2772893 2819218 2852978 2873885
62677 2873885 2880545 2870916 2843905 2800074 2740839 2667658 2582300 2487339 2385716 2279894 2171829
62666 2171829 2063586 1957437 1855168 1757677 1665431 1579000 1498910 1425140 1357185 1294710 1237935
62655 1237935 1187243 1142422 1102413 1065891 1032167 1001457 974265 950514 929425 910175 892502
62644H92502j5988j4429j3412j2884j2324j1269r700p947o388n195m276l449k711
62631G72530k319k453k946l551m298n279o059n842m468k934k387k755k798j631
62617G22810K62J650J891J348Q43R88J919L208M143M448M791O057Q142R969J0941
62602G83410J1794J3577J6227J8800K0818K2662K4736K6996K9377L2094L5201
62591A035692L8392M1439M4343M6931M8814M9976N0810N1324N0941M9460M7493
62580A555615M5447M2658L8282L2477K5923J8640J0159O46r121j8719k8108l6702
62568A677197m3429m7935n0971n3340n5081n5861n5494n3915n1193m7850m4519
62557A117609m1162l7258l2911k9007k5991k3230k0059j6882j4621j3525j2975
$$ plain form
62644 892502 876514 862085 848673 835789 823465 812196 802496 794549 788161 782966 778690 775241 772530
62631 772530 770211 767758 764812 761261 756963 751684 745625 739783 735315 732381 729994 727239 724441 722810
62617 722810 723072 724722 726613 727961 728804 729792 731711 734919 739062 743510 748301 754358 762500 772469 783410
62602 783410 795204 808781 825008 843808 864626 887288 912024 939020 968397 1000491 1035692
62591 1035692 1074084 1115523 1159866 1206797 1255611 1305587 1356397 1407721 1458662 1508122 1555615
62580 1555615 1601062 1643720 1682002 1714479 1740402 1759042 1769201 1769847 1760726 1742007 1713899 1677197
62568 1677197 1633768 1585833 1534862 1481522 1426441 1370580 1315086 1261171 1209978 1162128 1117609
62557 1117609 1076447 1039189 1006278 977271 951280 928050 907991 891109 876488 862963 849988
62546H49988j2189j0752q766o834n556m878m277l660l488l767l624k379m79J093
62532G80432J924K217K246K336K960M344O152Q011R940J1968J3823J5529J7793
62519H79675K1132K4959K8209L0665L3027L5910L9298M2883M6427M9887N3569
62508A285641N7905O2786O7438P1332P4703P7718P9696P9975P9060P8060P7173
62497B091487P5604P2818O9056O4675N9890N5173N1055M7344M3225L8349L3262
62486B701938K8583K4383K0576J7323J4649J1812P233q29j3008k7743m1867n3073
62474B689977o1811p0193p9397q8979r8248j06865j13745j16914j15415j10646
62464A727764j04904r9157r2917q5768p7969o9713o0794n1347m2271l4500k8132
$$ plain form
62546 849988 837799 827047 818281 811447 805891 801013 796736 793076 789588 785821 782197 779818 779339 780432
62532 780432 782356 784573 786819 789155 792115 796459 802611 810622 820562 832530 846353 861882 879675
62519 879675 900807 925766 953975 984640 1017667 1053577 1092875 1135758 1182185 1232072 1285641
62508 1285641 1343546 1406332 1473770 1545102 1619805 1697523 1777219 1857194 1936254 2014314 2091487
62497 2091487 2167091 2239909 2308965 2373640 2433530 2488703 2539758 2587102 2630327 2668676 2701938
62486 2701938 2730521 2754904 2775480 2792803 2807452 2819264 2826497 2825668 2812660 2784917 2743050 2689977
62474 2689977 2628166 2557973 2478576 2389597 2291349 2184484 2070739 1953825 1838410 1727764
62464 1727764 1622860 1523703 1430786 1345018 1267049 1197336 1136542 1085195 1042924 1008424 980292
62453I80292k2646j7780j3816j0962q775o556m191k210r64j39P71J841K857L693
62439I01415M202M018L048J898J328J355J297N61j043l511o567r454j1387j2314
62425H74846j2793j3178j3392j3442j3518j3530j3044j1847j0251q726p644p258
62413G36223p508p814p515o510n263m198l545l393l376k641q25J059J641R48L17
62398F87600N75J254J668J811J922K090K646M028N881P097P244P083P249P264
62384G45412O473N212M300L975M031M453N236N991O401O655O924O891O539O823
62370H25316Q690J1687J4413J6178J7506J9157K1380K4150K7368L0700L3718L6307
62358A086570L8642M0757M2532M4062M5609M7232M8693M9706M9996M9218M7188
$$ plain form
62453 980292 957646 939866 926050 915088 906313 899757 895566 893356 892392 892253 893024 894865 897722 901415
62439 901415 905617 909635 912683 914581 915909 917264 918561 919122 918079 914568 908001 898547 887160 874846
62425 874846 862053 848875 835483 822041 808523 794993 781949 770102 759851 751125 743481 736223
62413 736223 728715 720901 713386 706876 701613 697415 693870 690477 687101 684460 683635 684694 686335 687283 687600
62398 687600 688175 689429 691097 692908 694830 696920 699566 703594 709475 716572 723816 730899 738148 745412
62384 745412 751885 757097 761397 765372 769403 773856 779092 785083 791484 798139 805063 811954 818493 825316
62370 825316 834006 845693 860106 876284 893790 912947 934327 958477 985845 1016545 1050263 1086570
62358 1086570 1125212 1165969 1208501 1252563 1298172 1345404 1394097 1443803 1493799 1543017 1590205
62347A590205M4037L9923L4676K8078K0410J2428M901j689p206j1986j6696k1709
62335A715372k6731l1218l4983l8111m0570m2230m3080m3099m2137m0257l7962
62324A294994l5754l3674l1631k9858k8596k7593k6431k5182k4169k3281k2075
62313I86750k0492j8877j7327j5619j3822j2394j1442j0444q922p116n659m840
62301H39796m431m049l498k846k281j891j563j173p95o12o54p37o68m18j86l02
62285H13692q93j590j732j031J89J475K683L767M531M881N085N447N987O773Q236
62270H57500J0702J3787J6731J9273K1744K4459K7432L0644L4087L7563M0818
62259A134740M3924M7125N0375N3407N6153N8673O0696O1813O2150O2285O2223
$$ plain form
62347 1590205 1634242 1674165 1708841 1736919 1757329 1769757 1774658 1772969 1765763 1753777 1737081 1715372
62335 1715372 1688641 1657423 1622440 1584329 1543759 1501529 1458449 1415350 1373213 1332956 1294994
62324 1294994 1259240 1225566 1193935 1164077 1135481 1107888 1081457 1056275 1032106 1008825 986750
62313 986750 966258 947381 930054 914435 900613 888219 876777 866333 857411 850295 844636 839796
62301 839796 835365 831316 827818 824972 822691 820800 819237 818064 817269 816657 816003 815266 814598 814180 813994 813692
62285 813692 812799 811209 809477 808446 808635 810110 812793 816560 821091 825972 831057 836504 842491 849264 857500
62270 857500 868202 881989 898720 917993 939737 964196 991628 1022272 1056359 1093922 1134740
62259 1134740 1178664 1225789 1276164 1329571 1385724 1444397 1505093 1566906 1629056 1691341 1753564
62248A753564O1026N7702N2091M4593L5529K5237J4422L847o296j6253k5964l4817
62236A964681m2190m8028n2813n7137o1270o4851o6986o6931o4790o1369n7310
62225A321006n2693m7656m2938l9258l6319l3043k8879k4441k0642j7745j5523
62214I61869j3813j2402j0743q500o178m613l848l178k195j228n43J69J230K395
62200H98422L184L493L590L828M500N685P073Q188Q933R554J0095J0293J0159
62187I86997J0073J0128R980R544R293R541R999J0331J0613J0762J0191Q620O800
62174A112872N794N914O871Q512J0700J2870J4545J6146J8561K1867K5203K7877
62162A287732L0013L1910L3380L3942L3425L2105L0325K8037K4737J9997J4098
$$ plain form
62248 1753564 1814590 1872292 1924383 1968976 2004505 2029742 2044164 2048011 2041715 2025462 1999498 1964681
62236 1964681 1922491 1874463 1821650 1764513 1703243 1638392 1571406 1504475 1439685 1378316 1321006
62225 1321006 1268313 1220657 1177719 1138461 1102142 1069099 1040220 1015779 995137 977392 961869
62214 961869 948056 935654 924911 916411 910233 905620 901772 898594 896399 895171 894628 894797 896027 898422
62200 898422 901606 905099 908689 912517 917017 922702 929775 937963 946896 956450 966545 976838 986997
62187 986997 997070 1007198 1017178 1026722 1036015 1045556 1055555 1065886 1076499 1087261 1097452 1106072 1112872
62174 1112872 1118666 1124580 1131451 1139963 1150663 1163533 1178078 1194224 1212785 1234652 1259855 1287732
62162 1287732 1317745 1349655 1383035 1416977 1450402 1482507 1512832 1540869 1565606 1585603 1599701
62151A599701P861J818m007r385j3621j6433j8527k0794k3311k5673k7744k9382
62139A420503k9853k8469k5694k2913k1010j9716j8242j6014j2967r671p113n738
62127A203103m928l833k485j408n06P75K328L394L766M132M975N861O155N910
62113A227239N728O028O597O692N693L943K596K233K082J250J96N3R16K019L345
62098A276610N685Q976J2038J4346J6774J9945K3071K5206K6577K7696K8048K6773
62086A511745K4091K1037J8100J5175J2631J1400J1799J2880J3187J1889R264
62075A673198O402M388L574L668M456O014Q011R462R635Q885Q076P508O924O299
62061A766500N929N840N634N036M221L488K845K019O86j327m011p294j1095j5104
$$ plain form
62151 1599701 1607562 1609380 1605373 1595988 1582367 1565934 1547407 1526613 1503302 1477629 1449885 1420503
62139 1420503 1390650 1362181 1336487 1313574 1292564 1272848 1254606 1238592 1225625 1215954 1208841 1203103
62127 1203103 1198175 1194342 1191857 1190449 1189943 1190718 1193046 1196440 1200206 1204338 1209313 1215174 1221329 1227239
62113 1227239 1232967 1238995 1245592 1252284 1257977 1261920 1264516 1266749 1268831 1270081 1270277 1270330 1271246 1273265 1276610
62098 1276610 1282295 1291271 1303309 1317655 1334429 1354374 1377445 1402651 1429228 1456924 1484972 1511745
62086 1511745 1535836 1556873 1574973 1590148 1602779 1614179 1625978 1638858 1652045 1663934 1673198
62075 1673198 1679600 1683988 1687562 1691230 1695686 1701700 1709711 1719173 1728808 1737693 1745769 1753277 1760201 1766500
62061 1766500 1772429 1778269 1783903 1788939 1793160 1796648 1799493 1801512 1802198 1800871 1796860 1789566 1778471 1763367
62047A763367j8662k1232k3011k4744k6887k9339l1986l4957l8140m0965m2970
62036A430474m4173m4652m4263m3117m1857m0932l9951l8189l5465l2162k8703
62025I97010k5420k2650k0433j8262j5670j2891j0631r226q453p964p609p291
62013H30510o860o140m940l196j181O55K236L854N477O505O630O499O927P774
61999H54750Q160P654O662N682M728L521J830m01k894n050o459p441q696j0434
61985H51612j2138j3252j3749j3964j4131j4149j3725j2665j1165r722q660p901
61973G06391p238o616n906m750l029j243j1O35J090J470J534J260R77R05R77J205
61957F87651J829K997M547O190P676Q786R545J0393J1773J3427J4546J4792J4814
$$ plain form
62047 1763367 1744705 1723473 1700462 1675718 1648831 1619492 1587506 1552549 1514409 1473444 1430474
62036 1430474 1386301 1341649 1297386 1254269 1212412 1171480 1131529 1093340 1057875 1025713 997010
62025 997010 971590 948940 928507 910245 894575 881684 871053 861827 853374 845410 837801 830510
62013 830510 823650 817510 812570 809374 808193 808848 811084 814938 820415 826920 833550 840049 846976 854750
61999 854750 862910 870564 877226 882908 887636 891157 892987 892586 889692 884642 878183 870742 862046 851612
61985 851612 839474 826222 812473 798509 784378 770229 756504 743839 732674 722952 714292 706391
61973 706391 699153 692537 686631 681881 678852 677609 677598 678233 679323 680793 682327 683587 684564 685469 686446 687651
61957 687651 689480 692477 697024 703214 710890 719676 729221 739614 751387 764814 779360 794152 808966
61944H08966J5509J6949J8403J9301J9836K0546K1503K2172K2050K1278K0375
61933A026888J9535J8538J7272J5997J4825J3456J1756J0192R210Q380O778M128
61921A176955J060j656l569m361l946k958k431k562k341q04J752M262O225P931
61907A173557R637J1162J2261J2861J2831J1947J0219P980N486K639p73m764q945
61894A256098j2537j4679j5294j5517j6745j8916k0399j9924j8182j6852j6505
61883A070548j6267j5471j4624j4418j4600j4365j3420j2097j0659r143p736o728
61871I21020o027n098l501j214J605M771P906J0420J1999J3011J4209J6074J8521
61858A003696K1147K3637K5878K7787K9270L0366L1298L2206L2952L3337L3410
$$ plain form
61944 808966 824475 841424 859827 879128 898964 919510 941013 963185 985235 1006513 1026888
61933 1026888 1046423 1064961 1082233 1098230 1113055 1126511 1138267 1148459 1157669 1166049 1172827 1176955
61921 1176955 1178015 1176359 1172790 1168429 1164483 1161525 1159094 1156532 1154191 1153387 1155139 1159401 1165626 1173557
61907 1173557 1183194 1194356 1206617 1219478 1232309 1244256 1254475 1262455 1267941 1270580 1269807 1265043 1256098
61894 1256098 1243561 1228882 1213588 1198071 1181326 1162410 1142011 1122087 1103905 1087053 1070548
61883 1070548 1054281 1038810 1024186 1009768 995168 980803 967383 955286 944627 935484 927748 921020
61871 921020 914993 909895 906394 905180 906785 911556 919462 929882 941881 954892 969101 985175 1003696
61858 1003696 1024843 1048480 1074358 1102145 1131415 1161781 1193079 1225285 1258237 1291574 1324984
61847A324984L3254L2675L1455K9831K8201K6408K3881K0536J6862J2950Q310
61836A589347L020j801n335q080j0679j2463j2279j0382q239o596m912k784p72
61823A508045M65R05O70l89k279m726p736j1569j5950k0077k3774k7745l2192
61810A363648l5943l7595l7065l5430l3686l2183l0824k9281k7234k4782k2386
61799A017239k0228j8048j5815j3963j2693j1578j0304r212q644q242p461o410
61787H74641n608n222m928m338l285k003j184j424k416l176l258l108l084k877
61773H28730k267j591j020j78R65J673J629J646K397L251L335K903K679K519J969
61758H48640J458J647K037J604N19j79n04j580l658n538o282o305o313o278o015
$$ plain form
61847 1324984 1358238 1390913 1422368 1452199 1480400 1506808 1530689 1551225 1568087 1581037 1589347
61836 1589347 1592367 1590566 1585231 1577151 1566472 1554009 1541730 1531348 1523109 1516513 1511601 1508817 1508045
61823 1508045 1508510 1509415 1510085 1509696 1507417 1502691 1494955 1483386 1467436 1447359 1423585 1395840 1363648
61810 1363648 1327705 1290110 1253045 1217615 1183929 1151746 1120922 1091641 1064407 1039625 1017239
61799 1017239 997011 978963 963148 949185 936492 924914 914610 905398 896754 888512 881051 874641
61787 874641 869033 863811 858883 854545 851260 849257 848073 846649 844233 841057 837799 834691 831607 828730
61773 828730 826463 824872 823852 823674 824639 826312 827941 829587 831984 835235 838570 841473 844152 846671 848640
61758 848640 850098 851745 853782 855386 855905 855726 855222 853642 849984 844446 838164 831859 825546 819268 813253
61743H13253n777n681n262m253l139k492k179j688q01L63J592K546K890K730K611
61728G94713K871L311L563L544L459L598M079M502M165K989J881J616J770J495
61714H37556Q70M69l8j481l529m763m729m596n353o583p500q045q248p619o151
61699G70260m990n086n818n924n211m506m273m343m630n243n943o276o179n920
61685F95918n489m670l629k905k809l168l548l509k892k123j916k350k631k204
61671F52075j533j332j454j268p25k88pM50R55R92O36P06J639K809L294K913K241
61654F62103J887K078K686L424M026M359M343L883L049K226J830J897K076K006
61640G01873J538P59j3l91l25k14l74o48p94j022j676k549l089l242l530m128
$$ plain form
61743 813253 807476 801795 796533 792280 789141 786649 784470 782782 781981 782344 783936 786482 789372 792102 794713
61728 794713 797584 800895 804458 808002 811461 815059 819138 823640 827805 830794 832675 834291 836061 837556
61714 837556 838426 838895 838857 837376 833847 829084 824355 819759 814406 807823 800323 792278 784030 776411 770260
61699 770260 765270 760184 754366 748442 743231 738725 734452 730109 725479 720236 714293 708017 701838 695918
61685 695918 690429 685759 682130 679225 676416 673248 669700 666191 663299 661176 659260 656910 654279 652075
61671 652075 650542 649210 647756 646488 645763 645475 645468 645918 646873 647865 648501 649207 650846 653655 656949 659862 662103
61654 662103 663990 666068 668754 672178 676204 680563 684906 688789 691838 694064 695894 697791 699867 701873
61640 701873 703411 704170 704157 703766 703441 703227 702853 702205 701411 700389 698713 696164 693075 689833 686303 682175
61624F82175m463m001l066k408k265k229k041j983k410l142l655l751l816m271
61610F38674n047n745o179o464o613o461o064n836o017o272o110n525m910m478
61596E56953m090l577k936k203j506j178j511k284k840k773k338k081k209k413
61582E23014k233j511o51l57q36j352r01M60J435R42n27j504j296n25K2L72Q72
61565E15424J357J390J065R37J218J564J697J706J655J467J314J635K442L030
61551E37901K844K294K216K738L162K933K242J627J282R39L55k09n4J189K810
61536E64269L498K776J580J084J341J509J123M03m64j563k712l370l274k756k216
61521E61228j729j298j021q63o08k71j27j87r8K11J51p86k150k816k168p48K90
$$ plain form
61624 682175 677712 673711 670645 668237 665972 663743 661702 659719 657309 654167 650512 646761 642945 638674
61610 638674 633627 627882 621703 615239 608626 602165 596101 590265 584248 577976 571866 566341 561431 556953
61596 556953 552863 549286 546350 544147 542641 541463 539952 537668 534828 532055 529717 527636 525427 523014
61582 523014 520781 519270 518619 518262 517426 516074 515173 515633 517068 518010 517483 515979 514683 514158 514180 514552 515424
61565 515424 516781 518171 519236 520173 521391 522955 524652 526358 528013 529480 530794 532429 534871 537901
61551 537901 540745 543039 545255 547993 551155 554088 556330 557957 559239 560178 560533 560324 560270 561459 564269
61536 564269 567767 570543 572123 573207 574548 576057 577180 577583 577119 575556 572844 569474 566200 563444 561228
61521 561228 559499 558201 557180 556317 555709 555438 555311 555124 555026 555237 555388 554602 552452 549636 547468 546720 547010
61504E47010L48m3N8P57J087K71j141j879j501o80q1M06J061J649J714J245P21
61487E51002O35J076J586J531R00N43J203K369K799K084J013L55J46L16J075K211
61471E70844K871K607K030J842J828J500J051R38R43N04l10q59q20l74K24P51
61455E85570Q96O91P01J231J675J383P95Q22J392J690J665K143L261L980L619
61440F11514K890K774L165L364L256L218L257L058K700K618K974L510L960M054
61426F56312L379J882M47K07J156K081K130J766J744J871J444N44o9k03n92j756
61410F72343l210m186m533m533m245l632k986k719k788k786k524k136j754j476
61396F28835j442j523j109J51J547J882R58j69m64J33J154K232K940K792J975
$$ plain form
61504 547010 547358 547315 547373 548130 549217 549488 548347 546468 544967 544287 544206 544612 545673 547322 549036 550281 551002
61487 551002 551637 552713 554299 555830 556730 557273 558476 560845 563644 565728 566741 567096 567242 567558 568633 570844
61471 570844 573715 576322 578352 580194 582022 583522 584573 585511 586454 586958 586648 585789 584969 584595 584819 585570
61455 585570 586466 587157 587858 589089 590764 592147 592942 593764 595156 596846 598511 600654 603915 607895 611514
61440 611514 614404 617178 620343 623707 626963 630181 633438 636496 639196 641814 644788 648298 652258 656312
61426 656312 659691 661573 662020 662227 663383 665464 667594 669360 671104 672975 674419 674963 674894 674691 674099 672343
61410 672343 669133 664947 660414 655881 651636 648004 645018 642299 639511 636725 634201 632065 630311 628835
61396 628835 627393 625870 624761 624912 626459 628341 629299 629130 628666 628799 629953 632185 635125 637917 639892
61381F39892J539K208L320L613K861K057K091K845L688M227M320L842K915K178
61367F81596K317L201L890L751L340L673M852N950O396O684P351Q049Q324Q680
61353G58054R844J1308J1803J1164J0610J1026J2047J3057J3944J4393J3632J1614
61341I02496R497Q086O625M165J351l21o55q84j813k904l376l278l126l127l115
61326I09621k916k472j799q79M38K251M176N459N809N839O347P478Q932J0525
61312I58809J2047J2984J3127J3137J3808J4911J5413J4770J3390J1857J0364
61301A104617Q928P554O082M263K000q26m572r288j4058j7526j9108j9264j8606
61288A030196j7375j5849j4519j3584j2707j1477r803p736n372l013j052M97J956
$$ plain form
61381 639892 641431 643639 646959 650572 653433 655490 657581 660426 664114 668341 672661 676503 679418 681596
61367 681596 683913 687114 691004 694755 698095 701768 706620 712570 718966 725650 733001 741050 749374 758054
61353 758054 767898 779206 791009 802173 812783 823809 835856 848913 862857 877250 890882 902496
61341 902496 911993 920079 926704 930869 932220 931899 931244 930360 928547 925643 922267 918989 915863 912736 909621
61326 909621 906705 904233 902434 901555 901993 904244 908420 913879 919688 925527 931874 939352 948284 958809
61312 958809 970856 983840 996967 1010104 1023912 1038823 1054236 1069006 1082396 1094253 1104617
61301 1104617 1113545 1121099 1127181 1131444 1133444 1132618 1128046 1118758 1104700 1087174 1068066 1048802 1030196
61288 1030196 1012821 996972 982453 968869 956162 944685 934882 927146 921774 918761 917709 918206 920162
61275I20162L371M389M930N561O863Q652J0201J1143J1806J2650J3573J4010J3663
61262A040974J2956J2521J2514J2672J2916J3366J3805J3764J3252J2674J1752
61251A183166R387N122J07m193p645j0960j4056j5891j5803j4123j1563q849o780
61238A087919n703m832k992j78K396L896M689N414O129O758P579Q765J0011J1035
61224A140886J1934J2749J3177J3114J2909J2748J2223J1038R588Q383P241N825
61212A271815M653M785O387Q260R145R105R245J0216J1522J2349J2675J3133J4095
61199A397385J5386J6887J8727K0677K1959K2132K1633K1075K0438J9484J8420
61188A614203J7421J5812J2640P932K684k307o897j0914j3934j5929j7512j9206
$$ plain form
61275 920162 923533 927922 932852 938413 945276 953928 964129 975272 987078 999728 1013301 1027311 1040974
61262 1040974 1053930 1066451 1078965 1091637 1104553 1117919 1131724 1145488 1158740 1171414 1183166
61251 1183166 1192553 1197675 1197782 1193589 1185944 1174984 1160928 1145037 1129234 1115111 1103548 1094699 1087919
61238 1087919 1082216 1077384 1074392 1074214 1076610 1080506 1085195 1090609 1096738 1103496 1111075 1119840 1129851 1140886
61224 1140886 1152820 1165569 1178746 1191860 1204769 1217517 1229740 1240778 1250366 1258749 1265990 1271815
61212 1271815 1276468 1281253 1287640 1295900 1305045 1314150 1323395 1333611 1345133 1357482 1370157 1383290 1397385
61199 1397385 1412771 1429658 1448385 1469062 1491021 1513153 1534786 1555861 1576299 1595783 1614203
61188 1614203 1631624 1647436 1660076 1668008 1670692 1668385 1661488 1650574 1636640 1620711 1603199 1583993
61176A583993k0957k2495k3794k5043k6436k7980k9245k9590k8988k8319k8230
61165A292916k8124k7135k5657k4804k4430k3050k0020j6515j3883j2009j0057
61154A067232p872n858m091k409r61J02J112K465L899M888N529O416P676Q549
61140A086677Q140O312L866J981J454K361M307O934J0023J3388J6968K0888K5023
61127A208322K8738L1489L3601L5824L8221M0091M1028M1395M1656M1844M1817
61116A624026M1431M0305L8055L5000L2014K9445K6642K2826J7903J2292O540
61105A926479J243l263p420j1982j6889k1222k4573k7683l1327l5370l9378m3406
61093A665209m7409n0533n1796n1222m9686m7789m5502m2700l9538l6254l3009
$$ plain form
61176 1583993 1563036 1540541 1516747 1491704 1465268 1437288 1408043 1378453 1349465 1321146 1292916
61165 1292916 1264792 1237657 1212000 1187196 1162766 1139716 1119696 1103181 1089298 1077289 1067232
61154 1067232 1059360 1053502 1049411 1047002 1046041 1046143 1047255 1049720 1053619 1058507 1064036 1070452 1078128 1086677
61140 1086677 1094817 1101129 1104995 1106976 1108430 1110791 1115098 1122032 1132055 1145443 1162411 1183299 1208322
61127 1208322 1237060 1268549 1302150 1337974 1376195 1416286 1457314 1498709 1540365 1582209 1624026
61116 1624026 1665457 1705762 1743817 1778817 1810831 1840276 1866918 1889744 1907647 1919939 1926479
61105 1926479 1927722 1924459 1917039 1905057 1888168 1866946 1842373 1814690 1783363 1747993 1708615 1665209
61093 1665209 1617800 1567267 1515471 1464249 1414563 1366774 1321272 1278572 1239034 1202780 1169771
61082A169771k9912k7009k4262k1558j8722j5595j2396r816q328p497o425m898
61070I83353l408k228j092J90J473K794M321N820O894P868R500J1806J3999J5814
61056A057104J7766J9894K1464K2359K3560K5584K7552K8605K9242L0342L1815
61045A335287L3124L4297L5414L5835L4988L3356L1725L0064K8007K5816K3827
61034A681740K1557J8478J5237J2994J1877J1041R950Q595O857M778L216L147
61022A809467M294N448O091O882Q539J1058J4020J7050J9965K3096K7259L2858
61010A986027L9234M5491N1593N8034O4839P1779P9172Q7667R7349J07789J18743
60999B807717J30232J42502J56667J74877J98963K29361K66162L10391L63094
$$ plain form
61082 1169771 1139859 1112850 1088588 1067030 1048308 1032713 1020317 1010501 1002173 994676 988251 983353
61070 983353 979945 977717 976625 976815 978288 981082 985403 991223 998117 1005985 1015485 1027291 1041290 1057104
61056 1057104 1074870 1094764 1116228 1138587 1162147 1187731 1215283 1243888 1273130 1303472 1335287
61045 1335287 1368411 1402708 1438122 1473957 1508945 1542301 1574026 1604090 1632097 1657913 1681740
61034 1681740 1703297 1721775 1737012 1750006 1761883 1772924 1782874 1791469 1798326 1803104 1806320 1809467
61022 1809467 1813761 1819209 1825300 1832182 1840721 1851779 1865799 1882849 1902814 1925910 1953169 1986027
61010 1986027 2025261 2070752 2122345 2180379 2245218 2316997 2396169 2483836 2581185 2688974 2807717
60999 2807717 2937949 3080451 3237118 3411995 3610958 3840319 4106481 4416872 4779966
60990D779966M24142M93610N73757O67484P74233Q88556J002789J110483J208590
60981A1923610J299162J389296J486965J595190J710565J826811J938270K041737
60973B5211606K139484K239759K343813K420994K397284K182956J729645J073157
60965D1738698L27040l64726q79038j144848j158455r91632p81844o88214q23329
60956C5233652j201153j735713k287128k721240k952332k959240k778181k478608
60948A6120057k132839j794065j490990j234081j023197q52413p13743o00414
60940F278315n07991m33329l73516l25869k88124k58241k34259k14356j96972
60931C445658j80994j65991j51969j38797j26146j14070j03150r3923q6466q0700
$$ plain form
60990 4779966 5204108 5697718 6271475 6938959 7713192 8601748 9604537 10715020 11923610
60981 11923610 13222772 14612068 16099033 17694223 19404788 21231599 23169869 25211606
60973 25211606 27351090 29590849 31934662 34355656 36752940 38935896 40665541 41738698
60965 41738698 42065738 41701012 40821974 39677126 38518671 37527039 36745195 36056981 35233652
60956 35233652 34032499 32296786 30009658 27288418 24336086 21376846 18598665 16120057
60948 16120057 13987218 12193153 10702163 9468082 8444885 7592472 6878729 6278315
60940 6278315 5770324 5336995 4963479 4637610 4349486 4091245 3856986 3642630 3445658
60931 3445658 3264664 3098673 2946704 2807907 2681761 2567691 2464541 2370618 2284152 2203452
60921B203452p6511p3374p0402o7034o3261n9034n4071m8596m3567l9682l6672
60910A571248l3906l1231k8771k6542k4703k3660k3377k3121k2395k1642k1395
60899A290505k1265k0524j9291j8370j8086j8060j7889j7403j6355j4671j2905
60888A095686j1768j1186j0471r501q979r324r967j0075r550q873q362p948p538
60875I72144p156o831o666o924p748q808r493r578r452r523r618r175p937o236
60861H56999m648l619l302l471l537l041k171j483j119p28k22K8m1R3O27Q92M07
60844H31664j04L96J708K633K545J941J442J114P51J41r90k625l982m177l377
60829H29080k626k488k620k681k821l104l270l352l814m767n705o210o292n920
$$ plain form
60921 2203452 2126941 2053567 1983165 1916131 1852870 1793836 1739765 1691169 1647602 1607920 1571248
60910 1571248 1537342 1506111 1477340 1450798 1426095 1402435 1379058 1355937 1333542 1311900 1290505
60899 1290505 1269240 1248716 1229425 1211055 1192969 1174909 1157020 1139617 1123262 1108591 1095686
60888 1095686 1083918 1072732 1062261 1052760 1043781 1034457 1024490 1014415 1004865 995992 987630 979682 972144
60875 972144 964988 958157 951491 944567 936819 928011 918518 908940 899488 889965 880347 871172 863235 856999
60861 856999 852351 848732 845430 841959 838422 835381 833210 831727 830608 829880 829658 829686 829645 829738 830365 831257 831664
60844 831664 831560 831956 833664 836297 838842 840783 842225 843339 844090 844231 843241 840616 836634 832457 829080
60829 829080 826454 823966 821346 818665 815844 812740 809470 806118 802304 797537 791832 785622 779330 773410
60815G73410n040m160m004m332m082l079k520l253m506n082m935m755m754m778
60801G14130n021n663o206n999n200m474m079l878l877m073m066l587l067l026
60787F51914l172k872k303k276k969l577l318k296j256q53j141j494j136JJ179
60772F24431J820K141K509K736K576K465L021M057M772M739M139L193K086J303
60758F65988J372K201L155L726L763L216K221J264O93J98o93j748k255k039j677
60743F79385j738k302l173m100m847n457o303p408q023p505o384n811o068o360
60729F03906o027n129l859k219n33N19O47J45p23j889k828k685j436j94J75P1
60713E77941K83P02O63J53j24K30R31J605K221K746K921K565J958J673K103L107
$$ plain form
60815 773410 768370 764210 760206 755874 751792 748713 746193 742940 738434 733352 728417 723662 718908 714130
60801 714130 709109 703446 697240 691241 686041 681567 677488 673610 669733 665660 661594 658007 654940 651914
60787 651914 648742 645870 643567 641291 638322 634745 631427 629131 627875 627022 625881 624387 623251 623252 624431
60772 624431 626251 628392 630901 633637 636213 638678 641699 645756 650528 655267 659406 662599 664685 665988
60758 665988 667360 669561 672716 676442 680205 683421 685642 686906 687599 687797 687104 685356 683101 681062 679385
60743 679385 677647 675345 672172 668072 663225 657768 651465 644057 636034 628529 622145 616334 610266 603906
60729 603906 597879 592750 588891 586672 586139 586658 587305 587450 586727 584838 582010 579325 577889 577695 577870 577941
60713 577941 578224 578926 579589 579742 579618 579848 580779 582384 584605 587351 590272 592837 594795 596468 598571 601678
60697F01678M078M382L910L186K845L014L281L230K874K587K662L042L443L658
60683F47870L703L685L684L707L692L480K912K003R59J1o59q38m46K27O39N14
60667F75143K4n68j118j437j282p75m10m94r46j764l071m393m662l604k489k595
60651F45559l470l683k951k264k027j464k54N99K05q28j336j231j272j720k144
60636F21719k342k552k714k315j109M64J691K110J633N71l52m60K49J201J964
60621F19758K549K932K736J718L05p02r19o94o48j088j797k283k242j815j390
60606F16420j117q11l76q7k18n07l41N34J710K595K940K845K555K329K312K399
60590F33182K477K866M058N790O864O368M850L632L281L291L236L321L655L767
$$ plain form
60697 601678 605756 610138 614048 617234 620079 623093 626374 629604 632478 635065 637727 640769 644212 647870
60683 647870 651573 655258 658942 662649 666341 669821 672733 674736 675695 675706 675047 674209 673763 673990 674629 675143
60667 675143 675167 674599 673481 672044 670762 669987 669577 669083 668137 666373 663302 658909 654247 650643 648154 645559
60651 645559 642089 638406 635455 633191 631164 629700 629446 630045 630250 629422 628086 626855 625583 623863 621719
60636 621719 619377 616825 614111 611796 610687 611151 612842 614952 616585 617156 616804 616344 616593 617794 619758
60621 619758 622307 625239 627975 629693 629998 629296 628377 627683 627035 625947 624150 621867 619625 617810 616420
60606 616420 615303 614492 614116 614029 613811 613304 612963 613497 615207 617802 620742 623587 626142 628471 630783 633182
60590 633182 635659 638525 642583 648373 655237 661605 666455 670087 673368 676659 679895 683216 686871 690638
60576F90638L254K433J863J591J336J124J274J834K462K896L299M140N729P842
60562G31715R732J0718J0855J0778J0921J1166J1386J1820J2689J3738J4493J4724
60550H74735J4385J3397J1784R798P573M859J445k271n475p584q537q524p681
60537H97904o020l605p77J870L976N786P740R797J1583J3066J4423J5343J5350
60524I86436J4959J5417J6878J7813J7002J5127J3482J1932R375N724K072r19
60512A125298l562o053p979r108r640r491q250o121m117k870j937o09J253L499
60498A060313O153R109J1944J4423J6877J9713K2910K6223K9532L2693L5450L7818
60486A323158M0187M2807M5457M7769M9505N0293M9545M7027M3105L8090L1640
$$ plain form
60576 690638 693892 696325 698188 699779 701115 702239 703513 705347 707809 710705 714004 718144 723873 731715
60562 731715 741447 752165 763020 773798 784719 795885 807271 819091 831780 845518 860011 874735
60550 874735 889120 902517 914301 924099 931672 936531 937976 935705 930230 922646 914109 905585 897904
60537 897904 891884 888279 887502 889372 893348 899134 906874 916671 928254 941320 955743 971086 986436
60524 986436 1001395 1016812 1033690 1051503 1068505 1083632 1097114 1109046 1118421 1124145 1126217 1125298
60512 1125298 1121736 1115683 1107704 1098596 1088956 1079465 1071215 1065094 1060977 1058107 1056170 1055561 1056814 1060313
60498 1060313 1066466 1075575 1087519 1101942 1118819 1138532 1161442 1187665 1217197 1249890 1285340 1323158
60486 1323158 1363345 1406152 1451609 1499378 1548883 1599176 1648721 1695748 1738853 1776943 1808583
60475A808583K3239J3119K310q108j7583k6021l3466l9915m5330m9837n3792n7425
60463A515774o0452o2305o2682o1642n9148n5105m9905m4460l9380l4544k9796
60452I56355k5668k2909k1457k0341j8625j6151j3465j1261r880r075q205o881
60440G72437n394m423m241m390m187l445k574k005j696j350r60q46j110j319r88
60425G33509j69O55J102J101P74M39N60J295K103K212J493N84Q6M9K95P91J412
60408G48291J679J227M46K79J170K450L065K808K548L077M059M525M136L515L261
60393G86536L330L496L787M099L977L299K741K928L488L581L135K844L131L706
60379H34078M140M194L691K748K117K596L902M768M425L398K611K267K074K041
$$ plain form
60475 1808583 1831822 1844941 1847251 1839143 1821560 1795539 1762073 1722158 1676828 1626991 1573199 1515774
60463 1515774 1455322 1393017 1330335 1268693 1209545 1154440 1104535 1060075 1020695 986151 956355
60452 956355 930687 907778 886321 865980 847355 831204 817739 806478 796598 787523 779318 772437
60440 772437 767043 762620 758379 753989 749802 746357 743783 741778 740082 738732 737772 736926 735816 734497 733509
60425 733509 733340 733995 735097 736198 736972 737411 737971 739266 741369 743581 745074 745658 745744 745793 746088 746879 748291
60408 748291 749970 751197 751643 751922 753092 755542 758607 761415 763963 767040 771099 775624 779760 783275 786536
60393 786536 789866 793362 797149 801248 805225 808524 811265 814193 817681 821262 824397 827241 830372 834078
60379 834078 838218 842412 846103 848851 850968 853564 857466 862234 866659 870057 872668 874935 877009 879050
60365H79050K444L114L344K769K064K343L866N551O157N649M949M563M254M092
60351I34209M716O039O780O180N320N543O336O204N223N038O296P689Q014P645
60337A021232P354O924N896M669L804K835Q00k431o024r151j1428j2676j2913
60324I98891j2529j1982j1331j0338q910p196n421l745k219p94M44J205J467J829
60310I29371K896M410N653O583P829R548J1149J2380J3845J5956J8137J9529J9998
60297A077284K0096K0452K1495K3160K4642K4936K3805K1650J8440J3648P418
60286A297026O70o265j4009k2571l0468l6204l9632m1142m0507l7609l3434k9202
60274I66653k5120k0956j7153j4241j1774r170p111o711p562p997p178n729m333
$$ plain form
60365 879050 881494 884608 887952 890721 892785 895128 898994 904545 910702 916351 921300 925863 930117 934209
60351 934209 938925 944964 951744 957924 963244 968787 975123 981327 986550 991588 997884 1005573 1013587 1021232
60337 1021232 1028586 1035510 1041406 1046075 1049879 1052714 1053514 1051083 1045059 1035908 1024480 1011804 998891
60324 998891 986362 974380 963049 952711 943801 936605 931184 927439 925220 924426 924870 926075 927542 929371
60310 929371 932267 936677 942330 948913 956742 966290 977439 989819 1003664 1019620 1037757 1057286 1077284
60297 1077284 1097380 1117832 1139327 1162487 1187129 1212065 1235870 1257520 1275960 1289608 1297026
60286 1297026 1297696 1291431 1277422 1254851 1224383 1188179 1148547 1107405 1066898 1029289 995855 966653
60274 966653 941533 920577 903424 889183 877409 868239 861128 854417 846855 838858 831680 825951 821618
60261H21618l066k212k382l362l930l330k100j047k29N95J246J461J370J199R05
60246H06736N05K85L62M49L93N47J196K004K426K481K653L149L646L757L588L637
60230H37814M250N313O479P629Q820R914J0574J0811J1065J1570J2047J2292J2649
60217I61227J3464J4437J5049J5192J4974J4243J2931J1506J0391R256P662O042
60205A106374N186M894M167K746J510J063Q65P7j408l085m420n103n301n859p527
60190A094179r735j0940j0525r594r420r844r833q963p595o057m511l309k749
60177I91104k562k307k046k079k110j498l57L65J00o12r17o56k02K44P32J207
60161I78406J488J549J439J055L45l29m38J10R73J990L331M884N985O122N609
$$ plain form
60261 821618 818552 816340 813958 810596 806666 803336 801236 800189 799960 800555 801801 803262 804632 805831 806736
60246 806736 807241 807526 807888 808337 808730 809277 810473 812477 814903 817384 820037 823186 826832 830589 834177 837814
60230 837814 842064 847377 853856 861485 870305 880219 890793 901604 912669 924239 936286 948578 961227
60217 961227 974691 989128 1004177 1019369 1034343 1048586 1061517 1073023 1083414 1092670 1100332 1106374
60205 1106374 1111560 1116454 1120621 1123367 1124877 1125940 1126805 1126882 1125474 1122389 1117969 1112866 1107565 1101706 1094179
60190 1094179 1084444 1073504 1062979 1053385 1043965 1034121 1024288 1015325 1007730 1001673 997162 993853 991104
60177 991104 988542 986235 984189 982110 980000 978502 978145 978510 978610 977998 977081 976425 976223 976467 977199 978406
60161 978406 979894 981443 982882 983937 984282 983953 983515 983625 984598 986588 989919 994803 1000788 1006910 1012519
60146A012519N171N154N454N948O530O974P256P864R080J0258J0454R805R351
60133A111818R487R504Q988Q515Q466Q157P021N865N834O621O806N763M137K565
60119A209547R75o74j983k860l840n253o639p462p942q624r456r852r522q880
60105A127535q422q054p198n635l977l018k731k263j043N24J668K183K370K424
60091A094363K334K168J945J428M48p52j760k454k770k461j610j073j688l192
60077A084926m565n396o176p319q612r783j0912j2023j2789j2898j2395j1502
60065I70556j0425r338q271p064n727m638l898k879j019J153K605L199L670M263
60051I32187M519M483M964O158P123P212P103P569Q027P258N199L082J854J202
$$ plain form
60146 1012519 1017690 1022844 1028298 1034246 1040776 1047750 1055006 1062870 1071950 1082208 1092662 1102467 1111818
60133 1111818 1121305 1130809 1139797 1148312 1156778 1164935 1171956 1177821 1183655 1190276 1197082 1202845 1206982 1209547
60119 1209547 1210522 1209848 1207865 1205005 1201165 1195912 1189273 1181811 1173869 1165245 1155789 1145937 1136415 1127535
60105 1127535 1119113 1111059 1103861 1098226 1094249 1091231 1088500 1086237 1085194 1085718 1087386 1089569 1091939 1094363
60091 1094363 1096697 1098865 1100810 1102238 1102686 1101934 1100174 1097720 1094950 1092489 1090879 1089806 1088118 1084926
60077 1084926 1080361 1074965 1068789 1061470 1052858 1043075 1032163 1020140 1007351 994453 982058 970556
60065 970556 960131 950793 942522 935458 929731 925093 921195 918316 917297 918450 921055 924254 927924 932187
60051 932187 936706 941189 946153 952311 959434 966646 973749 981318 989345 996603 1001802 1004884 1006738 1007940
60037A007940J02k055m941p582r253j0184j1091j2034j2257j1418j0280r764r780
60024H97403r646r183q809q768q945r186r326r019q097o918n913m980l884k957
60010G91772k789l254l550l197k390j346J5J528K581K881L011L783N243O655P320
59995H08263P113O387N644N272N331N486N302M734M224M188M398M025K429j23
59981H72673k730m758o264p518q427q700q349p715p036o293n440m544l652k746
59967G88501j846j005j26R31K055K867L247L619M426N391N671M864L636L098L634
59952H28963M559M932M473L639K940K465K040J652J478J448J031k43k012l194
59938H54171l122k325j812j746j378k94R42J671K145L056M357N221N186M800M916
$$ plain form
60037 1007940 1008042 1005987 1001046 993464 984211 974027 962936 950902 938645 927227 916947 907183 897403
60024 897403 887757 878574 869765 860997 852052 842866 833540 824521 816424 809506 803593 798613 794729 791772
60010 791772 788983 785729 782179 778982 776592 775246 775261 776789 779370 782251 785262 789045 794288 800943 808263
59995 808263 815376 821763 827407 832679 838010 843496 848798 853532 857756 861944 866342 870367 872796 872673
59981 872673 869943 865185 858921 851403 842976 834276 825927 818212 811176 804883 799443 794899 791247 788501
59967 788501 786655 785650 785524 786455 788510 791377 794624 798243 802669 808060 813731 818595 822231 825329 828963
59952 828963 833522 838454 842927 846566 849506 851971 854011 855663 857141 858589 859620 859377 857365 854171
59938 854171 851049 848724 846912 845166 843788 843494 844436 846107 848252 851308 855665 860886 866072 870872 875788
59923H75788N654O297O177N429M844N037N840O591O800O329N147L411J783J003
59909I46130R87Q47J70l76j69K31j37j096j519r43r9L99R34K154L860N259N969
59892I62601O328O856P675Q479Q871Q779Q535Q479Q499Q158P238N997M938M504
59878A065937M880N730O189N474L588J227r78k863m452n744o880q186r721j1023
59864A043178j1557j1390j1179j1427j1844j1647j0524r142q414q366q124p023
59852I22541n270l409j613J49J772L145M319N151N316M971M918N549O132N861
59838I59532N154N113N983P037P817Q586R548J0478J1220J1924J2610J3099J3448
59825A081549J3823J3916J3105J1341R308P568N976L989J144k620o587r391j0226
$$ plain form
59923 875788 881442 887739 893916 899345 904189 909226 915066 921657 928457 934786 939933 943344 945127 946130
59909 946130 947117 947964 948134 947758 947589 947820 947683 946587 945068 944125 944026 944425 945359 947513 951373 956632 962601
59892 962601 968929 975785 983460 991939 1000810 1009589 1018124 1026603 1035102 1043260 1050498 1056495 1061433 1065937
59878 1065937 1070817 1076547 1082736 1088210 1091798 1093025 1092047 1089184 1084732 1078988 1072108 1063922 1054201 1043178
59864 1043178 1031621 1020231 1009052 997625 985781 974134 963610 954468 946054 937688 929564 922541
59852 922541 917271 913862 912249 912398 914170 917315 921634 926785 932101 937072 941990 947539 953671 959532
59838 959532 964686 969799 975782 982819 990636 999222 1008770 1019248 1030468 1042392 1055002 1068101 1081549
59825 1081549 1095372 1109288 1122393 1133734 1143042 1150610 1156586 1160575 1161719 1159099 1152512 1143121 1132895
59812A132895r767r261q965q322p526p669r214j1409j3472j5327j6765j6974j5598
59799I82626j3448j1528r923q266o752o035o400p438q263q008o511m708l698l412
59785H78236k925k099j866k499k809j808k42M75J39l74o15q32j011o78K46J118
59769H62456J398J331J667K800M344N497N916O076O536P067P010O459O327P144
59755I32028Q417R356R656R347Q528P541O766O133N310M439L903L375K064J49
59741A017012j152j283j019r90p32P3N91L8r96j487j425j341j071j46J087J850
59725A009009K070K218K415K493K627K997L259L115L044L574M248M186L415K756
59711A051426K694L131L917M825N281M971M437M369M629M716M744N092N468N297
$$ plain form
59812 1132895 1123128 1113867 1104902 1096580 1089054 1081385 1072171 1060762 1047290 1031963 1015198 998224 982626
59799 982626 969178 957650 947727 939461 932709 926674 920274 912836 904573 896565 890054 885346 881648 878236
59785 878236 875311 873212 871346 868847 866038 864230 863988 864463 864602 864228 863613 862781 861770 861092 861338 862456
59769 862456 863854 865185 866852 869652 873996 879493 885409 891485 898021 905088 912098 918557 924884 932028
59755 932028 940445 949801 959457 968804 977332 984873 991639 997772 1003082 1007521 1011424 1014799 1016863 1017012
59741 1017012 1015860 1014577 1013558 1012568 1011836 1011909 1012500 1012538 1011542 1010055 1008630 1007289 1006218 1006072 1007159 1009009
59725 1009009 1011079 1013297 1015712 1018205 1020832 1023829 1027088 1030203 1033247 1036821 1041069 1045255 1048670 1051426
59711 1051426 1054120 1057251 1061168 1065993 1071274 1076245 1080682 1085051 1089680 1094396 1099140 1104232 1109700 1114997
59697A114997M744M435M405M192L709L215K704K162K005K399K516J524r5j302
59683A151610k182l587n400o527o564o226o028n782n536n811o607p242p394p325
59669A069399p012o068m767l999l921l637k551j111J03J023J627J701J442J393
59655A043622J510J228O16M23O42K40j161k478k791k728l376m679n826o608p430
59640A011204q414r303r905j0054r465q218p023o493o426o264n798n047l968k845
59626I11981k503l402m823n558n268m592m133l899l676l391l001k368j366l6J333
59611H65298K306K663K676K746K822K597K220K250K721K875K188J115L65j33r84
59596H93725k310l539m164m223m014l685l246k799k543k557k629k471k106j756
$$ plain form
59697 1114997 1119741 1124176 1128581 1132773 1136482 1139697 1142401 1144563 1146568 1148967 1151483 1153007 1152912 1151610
59683 1151610 1149428 1145841 1140441 1133914 1127350 1121124 1115096 1109314 1103778 1097967 1091360 1084118 1076724 1069399
59669 1069399 1062387 1056319 1051552 1047553 1043632 1039995 1037444 1036333 1036436 1037459 1039086 1040787 1042229 1043622
59655 1043622 1045132 1046360 1046976 1047399 1048041 1048281 1047120 1044642 1041851 1039123 1035747 1031068 1025242 1018634 1011204
59640 1011204 1002790 993487 983582 973528 964063 955845 948822 942329 935903 929639 923841 918794 914826 911981
59626 911981 909478 906076 901253 895695 890427 885835 881702 877803 874127 870736 867735 865367 864001 863965 865298
59611 865298 867604 870267 872943 875689 878511 881108 883328 885578 888299 891174 893362 894477 894842 894709 893725
59596 893725 891415 887876 883712 879489 875475 871790 868544 865745 863202 860645 858016 855545 853439 851683
59582H51683j353o19J70Q1j246k758l166k627k325k668k981k966l151l616l455
59567H19003k254j016q29j313j353q07m93p53r95o60Q2P92J274J549J654J739
59551H15620K089K864L885M747N247N665O563Q113R817J1047J1765J2382J3118
59538I12922J3915J4780J5669J6193J6069J5929J6833J8758K0241J9826J7366
59527A098501J3691R668N898K762J70k304m759o829q406r976j1802j3394j4273
59514A058947j4773j5556j6644j7476j7617j6976j5617j3797j2017j0561r228
59503H98685p789o402n300m325l215k002q51K62J249J680J350P98P12J058J321
59488H77231J395J702K424L173L473L237K717K270K211K598L172L661M091M643
$$ plain form
59582 851683 850330 849711 849881 849962 848716 845958 842792 840165 837840 835172 832191 829225 826074 822458 819003
59567 819003 816749 815733 814904 813591 812238 811431 810938 810185 809190 808530 808612 809404 810678 812227 813881 815620
59551 815620 817709 820573 824458 829205 834452 840117 846680 854793 864610 875657 887422 899804 912922
59538 912922 926837 941617 957286 973479 989548 1005477 1022310 1041068 1061309 1081135 1098501
59527 1098501 1112192 1121860 1127758 1130520 1130690 1128386 1123627 1116798 1108392 1098416 1086614 1073220 1058947
59514 1058947 1044174 1028618 1011974 994498 976881 959905 944288 930491 918474 907913 898685
59503 898685 890896 884494 879194 874869 871654 869652 868801 869063 870312 871992 873342 874140 874852 875910 877231
59488 877231 878626 880328 882752 885925 889398 892635 895352 897622 899833 902431 905603 909264 913355 917998
59474I17998N319N998O698P518Q379R026R307R270R091Q972Q983Q910Q489P921
59460A031879P872Q741J0099J1173J1668J1825J1781J1282J0115Q484O766N024
59448A146709K977N18j927l760m946o039p379q636r445j0043j0763j1185j0612
59435A065469r261q073p195n541k418J221L833N192O399Q263J0419J2174J3534
59422A094016J5018J6797J8339J8905J8243J6780J5161J3716J2342J0835R101
59411A259253P100M832K591J084R84K151L333K870k2m664r575j3530j5771j5713
59397A224923j3321r693o301l340J06L829N519L134k508q593j3210j6202j7678
59384A146665j7302j5163j2080q724n354k468o41L54J219J865J635Q80R88K389
$$ plain form
59474 917998 923317 929315 936013 943531 951910 960936 970243 979513 988604 997576 1006559 1015469 1023958 1031879
59460 1031879 1039751 1048492 1058591 1069764 1081432 1093257 1105038 1116320 1126435 1134919 1141685 1146709
59448 1146709 1149686 1150204 1148277 1144517 1139571 1133532 1126153 1117517 1108072 1098029 1087266 1076081 1065469
59435 1065469 1056208 1048135 1040940 1035399 1032981 1034202 1038035 1043227 1049626 1057889 1068308 1080482 1094016
59422 1094016 1109034 1125831 1144170 1163075 1181318 1198098 1213259 1226975 1239317 1250152 1259253
59411 1259253 1266353 1271185 1273776 1274860 1275844 1277995 1281328 1284198 1284176 1279512 1269937 1256407 1240636 1224923
59397 1224923 1211602 1201909 1195608 1192268 1192374 1196203 1201722 1204856 1202348 1193755 1180545 1164343 1146665
59384 1146665 1129363 1114200 1102120 1093396 1088042 1085574 1084933 1085287 1086506 1088371 1090006 1090886 1091874 1094263
59370A094263L868M380M446M983N928O831P896R484J1255J2691J3945J5456J7248
59357A212674J9184K1305K3388K4767K5246K5511K6081K6488K6106K5094K3823
59346A479667K2050J9526J6769J4406J2166R312N602J158m094r982j5543j9810
59334A531227k2866k5417k7670k9353l0424l0978l0775k9657k8133k6809k5461
59323A223684k3475k0978j8775j7310j6307j5351j4229j2886j1562j0741j0489
59312A051581j0223r572r003q967q952q196o965o143n869n434m452l238k134j215
59298I61218o23m96m78K5J091K294L430M665O047P390Q691J0250J2322J4868J7535
59283A048229J9694K0882K1500K2530K4249K5793K6446K6679K7253K8021K8449
$$ plain form
59370 1094263 1098131 1102511 1106957 1111940 1117868 1124699 1132595 1142079 1153334 1166025 1179970 1195426 1212674
59357 1212674 1231858 1253163 1276551 1301318 1326564 1352075 1378156 1404644 1430750 1455844 1479667
59346 1479667 1501717 1521243 1538012 1552418 1564584 1573896 1579498 1580656 1576562 1566580 1551037 1531227
59334 1531227 1508361 1482944 1455274 1425921 1395497 1364519 1333744 1304087 1275954 1249145 1223684
59323 1223684 1200209 1179231 1160456 1143146 1126839 1111488 1097259 1084373 1072811 1062070 1051581
59312 1051581 1041358 1031786 1022783 1013816 1004864 996668 989703 983560 977691 972257 967805 964567 962433 961218
59298 961218 960595 960099 959621 959646 960737 963031 966461 971126 977173 984563 993254 1003504 1015826 1030694 1048229
59283 1048229 1067923 1088805 1110305 1132835 1157084 1182877 1209323 1236002 1263255 1291276 1319725
59272A319725K8633K8877K8749K7685K5919K3660J9763J2695K790p783j7334k5668
59260A467711l2614l7072l8183l6536l3398k9465k4938k0185j5736j1864q573
59249A179147n782l293q79J396L271M749O113P423Q433R083R618J0120J0290R822
59235A249511Q709P020M758K014r09l633n894p719r502j1653j3924j5433j5683
59222A187662j5315j5314j5771j5899j5070j3417j1505r851q651p661o519n394
59210A047295m943n366n927n875n282m509l443j915l46Q29J901L230M302M430
59196A024381M029M162M946N488N319N006N160N675O070O033N627N448O289Q052
59182A101685R299Q823P332O644P308Q163Q170P631P298P347P527P617P415O900
$$ plain form
59272 1319725 1348358 1377235 1405984 1433669 1459588 1483248 1503011 1515706 1518496 1510713 1493379 1467711
59260 1467711 1435097 1398025 1359842 1323306 1289908 1260443 1235505 1215320 1199584 1187720 1179147
59249 1179147 1173365 1170072 1169193 1170589 1173860 1178609 1184722 1192145 1200578 1209661 1219279 1229399 1239689 1249511
59235 1249511 1258220 1265240 1269998 1272012 1271103 1267470 1261576 1253857 1244355 1232702 1218778 1203345 1187662
59222 1187662 1172347 1157033 1141262 1125363 1110293 1096876 1085371 1075520 1066869 1059208 1052689 1047295
59210 1047295 1042352 1036986 1031059 1025184 1019902 1015393 1011950 1010035 1009689 1010518 1012419 1015649 1019951 1024381
59196 1024381 1028410 1032572 1037518 1043006 1048325 1053331 1058491 1064166 1070236 1076269 1081896 1087344 1093633 1101685
59182 1101685 1110984 1119807 1127139 1133783 1141091 1149254 1157424 1165055 1172353 1179700 1187227 1194844 1202259 1209159
59168A209159O479O520O537N631L723J597l08k384m990p928j0968j4073j6896
59155A182099j8787j9716k0503k1743k2892k2809k0935j7855j4878j3023j2170
59144I76788j1351j0035q763q083p544o442m992l804k687j086O56J642J920K353
59130I18572L189L935M627N945P834R300R902J0337J1239J2432J3659J5024J6361
59117A042356J7163J7419J7588J7598J6937J5912J5502J5591J4769J2481J0107
59106A213423R105R180R175Q706P961O792N095L408K169R22r00k909m301m970
59092A262856n236n035m253l535l735m779n876o758p941r720j1662j3230j4431
59079A166665j5560j6628j7255j7063j6078j4741j3520j2544j1610j0406q706
$$ plain form
59168 1209159 1215638 1222158 1228695 1234326 1238049 1239646 1239338 1236954 1231964 1224036 1213068 1198995 1182099
59155 1182099 1163312 1143596 1123093 1101350 1078458 1055649 1034714 1016859 1001981 988958 976788
59144 976788 965437 955402 946639 938556 931012 924570 919578 915774 913087 912001 912657 914299 916219 918572
59130 918572 921761 925696 930323 936268 944102 953402 963304 973641 984880 997312 1010971 1025995 1042356
59117 1042356 1059519 1076938 1094526 1112124 1129061 1144973 1160475 1176066 1190835 1203316 1213423
59106 1213423 1222528 1231708 1240883 1249589 1257550 1264342 1269437 1272845 1275014 1275936 1275036 1272127 1267826 1262856
59092 1262856 1257620 1252585 1248332 1244797 1241062 1236283 1230407 1223649 1215708 1205988 1194326 1181096 1166665
59079 1166665 1151105 1134477 1117222 1100159 1084081 1069340 1055820 1043276 1031666 1021260 1012554
59068A012554o660n022m603n192n578n075m469m671n156m809l834l496m055m376
59054I45558l778k992k871l185l208k609j416J17J294J479J113J371K507L490
59040I36870L580L264L250L494L772M361N537P133Q990J1119J3022J3776J3302
59027A031470J2755J3067J3853J4234J4039J3590J3031J2329J1451J0144Q187
59016A168150O106M812M242L281J460k38p75l50K98J064K270L995O137Q519J0518
59001A219489J1403J1413J1622J2296J2416J1298R611Q168O748M899K906J145
58989A323414o21k473l826m473n179o315o877n895l944k121l40K111N005P466
58975A295932R423J1485J3630J5136J5781J6146J6716J7349J7577J7028J5623
$$ plain form
59068 1012554 1005894 1000872 996269 991077 985499 980424 975955 971284 966128 961319 957485 953989 949934 945558
59054 945558 941780 938788 935917 932732 929524 926915 925499 925616 926910 928389 929502 930873 933380 936870
59040 936870 940450 943714 946964 950458 954230 958591 964128 971261 980251 991370 1004392 1018168 1031470
59027 1031470 1044225 1057292 1071145 1085379 1099418 1113008 1126039 1138368 1149819 1159963 1168150
59016 1168150 1174256 1179068 1183310 1186591 1188051 1187813 1187038 1186688 1186986 1188050 1190320 1194315 1200452 1208971 1219489
59001 1219489 1230892 1242305 1253927 1266223 1278639 1289937 1299548 1307716 1314464 1319363 1322269 1323414
58989 1323414 1322793 1320320 1316494 1312021 1306842 1300527 1293650 1287755 1283811 1281690 1281350 1283461 1288466 1295932
58975 1295932 1305355 1316840 1330470 1345606 1361387 1377533 1394249 1411598 1429175 1446203 1461826
58964A461826J3718J1754R671P107M237J563j239n185j0255j5026j8571k1501
58952A438099k4427k6658k7446k7227k6540k4910k2149j9509j7979j6480j3507
58941A191267r805p434o671n830l991k055q93k18L51M55j48j063k006l187m550
58926A144222n444n438m883m382m104l758k893j322M06J243Q89M50J276L413N865
58911A125540P950R716J1332J2877J4536J6295J7690J8483J9312K0984K3412K5883
58899A324010K8024K9878L1341L2345L3256L4442L5609L6155L5891L4866L3027
58888A688844L0583K8171K6015K3506K0164J6277J1954O522j93o866j2146j6307
58876A816524k0299k3950k6593k8619l0828l2673l2901l1661l0297k9187k7444
$$ plain form
58964 1461826 1475544 1487298 1496969 1504076 1508313 1509876 1508637 1503452 1493197 1478171 1459600 1438099
58952 1438099 1413672 1387014 1359568 1332341 1305801 1280891 1258742 1239233 1221254 1204774 1191267
58941 1191267 1181462 1174028 1167357 1161527 1157536 1155481 1154588 1154370 1154721 1155176 1155028 1153965 1151959 1148772 1144222
58926 1144222 1138778 1133340 1128457 1124075 1119971 1116213 1113320 1111998 1112404 1113647 1114536 1114986 1116262 1119675 1125540
58911 1125540 1133490 1143206 1154538 1167415 1181951 1198246 1215936 1234419 1253731 1274715 1298127 1324010
58899 1324010 1352034 1381912 1413253 1445598 1478854 1513296 1548905 1585060 1620951 1655817 1688844
58888 1688844 1719427 1747598 1773613 1797119 1817283 1833560 1845514 1852036 1851843 1844977 1832831 1816524
58876 1816524 1796225 1772275 1745682 1717063 1686235 1653562 1620661 1589000 1558703 1529516 1502072
58865A502072k4899k2631k1207j9907j8199j6758j6355j6716j6980j6608j5569
58854A296243j4295j3689j4267j5272j5385j4467j3719j4029j4985j5696j5717
58843A134722j4955j3532j1973j0897j0250r363p913o246m815l828l353l138k459
58830A032000q17J242K721L400L842M342M703M926N289N775O150O484O882O790
58816A093729N489L256J261K19k45q65j977l410m655n254n473o117p273p860p162
58801A053663o083n866o248o056n129m332l959l537l016k849k875k396j397m97
58787I99423L59J861L886N305N540N194M814M114K818J357K31n98j351k035k671
58772A028247l384m089m639n275o398p920r280j0050j0067r267p945o852o348
$$ plain form
58865 1502072 1477173 1454542 1433335 1413428 1395229 1378471 1362116 1345400 1328420 1311812 1296243
58854 1296243 1281948 1268259 1253992 1238720 1223335 1208868 1195149 1181120 1166135 1150439 1134722
58843 1134722 1119767 1106235 1094262 1083365 1073115 1063752 1055839 1049593 1044778 1040950 1037597 1034459 1032000
58830 1032000 1031183 1032425 1035146 1038546 1042388 1046730 1051433 1056359 1061648 1067423 1073573 1080057 1086939 1093729
58816 1093729 1099218 1102474 1103735 1103954 1103709 1102844 1100867 1097457 1092802 1087548 1082075 1075958 1068685 1060825 1053663
58801 1053663 1047580 1041714 1035466 1029410 1024281 1019949 1015990 1012453 1009437 1006588 1003713 1001317 999920 999423
58787 999423 999782 1001643 1005529 1010834 1016374 1021568 1026382 1030496 1033314 1034671 1034902 1034304 1032953 1030918 1028247
58772 1028247 1024863 1020774 1016135 1010860 1004462 996542 987262 977212 967145 957878 949933 943081 936733
58759I36733n760m271k094j17J245K154K788L411M425N681O364O357O845Q615
58745I72376J0661J1683J2013J2632J3193J2705J1591J1180J1592J1832J1662
58734A103120J1673J1785J1385J0759J0660J0722J0037R039Q940R447R111P836
58722A224514O925O588N608L784K463K019R43j751n098p924j0388j2848j4830
58709A200005j6030j7003j8146j9151k0007k1191k2367k2371k1089j9909j9685
58698I83056j9653j8962j7919j6987j5966j4791j3854j2920j1058q286n981n042
58686H21637m907m893n064n229m539k858j275m95NP57J553K454M072O141P347
58671H14706P341P419Q443R564R868R841J0175J0504J0308R856R257P767M946
$$ plain form
58759 936733 930973 926702 924608 924491 925736 927890 930678 934089 938514 944195 950559 956916 963761 972376
58745 972376 983037 994720 1006733 1019365 1032558 1045263 1056854 1068034 1079626 1091458 1103120
58734 1103120 1114793 1126578 1137963 1148722 1159382 1170104 1180141 1189180 1198120 1207567 1216678 1224514
58722 1224514 1231439 1238027 1243635 1247419 1249882 1251901 1252844 1251093 1245995 1238071 1227683 1214835 1200005
58709 1200005 1183975 1166972 1148826 1129675 1109668 1088477 1066110 1043739 1022650 1002741 983056
58698 983056 963403 944441 926522 909535 893569 878778 864924 852004 840946 832660 826679 821637
58686 821637 816730 811837 806773 801544 797005 794147 792872 792377 792382 793139 794692 797146 801218 807359 814706
58671 814706 822047 829466 837909 847473 857341 867182 877357 887861 898169 908025 917282 925049 929995
58658I29995J452k095n822r535j2247j3601j4354j4670j3526j0789q303p555p622
58645H11328o789n028l409k096m79J374K716L215L107K729K516K821L256K954
58631H18215J892R69M48m04j655k193j487l94N66K098M420O239O653O607P206
58616H49180Q012Q344Q848J0231J1512J1202R386P203N083K839P93n37j361k036
58602I28699k159j250K40J514K439L206L706M003M639N784O913P909R449J1650
58588I86742J3505J4536J5704J7688J9529K0047J9610J9267J9140J8722J7939
58577A182429J6988J5955J5412J6314J8457K0241K0789K1145K2451K4244K5642
58566A400067K6961K8819L0700L1646L1477L0360K8110K4820K1122J6976J1386
$$ plain form
58658 929995 931447 929352 923530 913995 901748 888147 873793 859123 845597 834808 826505 818950 811328
58645 811328 804539 799511 796102 794006 793527 794901 797617 800832 803939 806668 809184 812005 815261 818215
58631 818215 820107 821076 821524 821120 819465 817272 815785 815391 815957 818055 822475 828714 835367 841974 849180
58616 849180 857192 865536 874384 884615 896127 907329 916715 923918 929001 931840 932633 932096 930735 928699
58602 928699 926540 925290 925530 927044 929483 932689 936395 940398 945037 950821 957734 965643 975092 986742
58588 986742 1000247 1014783 1030487 1048175 1067704 1087751 1107361 1126628 1145768 1164490 1182429
58577 1182429 1199417 1215372 1230784 1247098 1265555 1285796 1306585 1327730 1350181 1374425 1400067
58566 1400067 1427028 1455847 1486547 1518193 1549670 1580030 1608140 1632960 1654082 1671058 1682444
58555A682444M141l422j0183j6279k1523k4516k4555k2884k0854j8445j5812j4513
58543A493599j5573j7904k0218k2944k6627l0042l1827l2575l3345l3458l1730
58532A197356k8683k5474k1747j6698j1279p271m867l100j863j577j565p68M04
58519A072868P10O6o77j376k452l681m570n379o406p034o793o455o677o560n068
58504A010516k995j840j628j353p59j29Q48K405L722M152M539N914P799R218J0411
58489A050820J2033J3724J4973J6252J7835J8712J8278J7859J8750K0019K0063
58478A239318J9076J8068J6595J3521R015L987j499p457j2725j6224j8265j9155
58466A244255j8028j4873j1782j0061p909l485J551M468N758P813J0556J1842
$$ plain form
58555 1682444 1686585 1683163 1672980 1656701 1635178 1610662 1586107 1563223 1542369 1523924 1508112 1493599
58543 1493599 1478026 1460122 1439904 1416960 1390333 1360291 1328464 1295889 1262544 1229086 1197356
58532 1197356 1168673 1143199 1121452 1104754 1093475 1086204 1081337 1078237 1076374 1074797 1073232 1072464 1072868
58519 1072868 1073578 1073644 1072967 1071591 1069139 1065458 1060888 1055509 1049103 1042069 1035276 1028821 1022144 1015584 1010516
58504 1010516 1007521 1005681 1004053 1002700 1001941 1001812 1002660 1005065 1008787 1012939 1017478 1023392 1031191 1040409 1050820
58489 1050820 1062853 1076577 1091550 1107802 1125637 1144349 1162627 1180486 1199236 1219255 1239318
58478 1239318 1258394 1276462 1293057 1306578 1315593 1319580 1318081 1310624 1297899 1281675 1263410 1244255
58466 1244255 1226227 1211354 1199572 1189511 1181602 1178117 1179668 1184136 1189894 1197707 1208263 1220105
58454A220105J1483J1441J2214J2054R782N892R62m668r829j3336j5603j7499
58442A222998j8228j6501j3062r764o813l256M92L049M421N650O753P208P724
58429A190671R139J0411J0087Q963Q810R329Q870P284N401K570k375q321j2876
58416A247963j5570j7496j8579j7978j6499j5732j5335j3875j1747j0435r655
58405A085062q084o187n449n419m501k964k191j733k57J446J587P97J079K070
58391A055256J788N01K52J031J001K32O21K239L278L450M102N163N340N156O314
58376A095724Q365R433R975J2051J5180J6631J5920J5286J5674J5894J5772J6547
58364A262452J7903J8078J7027J6170J5267J2930R926Q285P408M935J103j620
$$ plain form
58454 1220105 1231588 1243029 1255243 1267297 1277079 1282971 1283933 1279265 1269436 1256100 1240497 1222998
58442 1222998 1204770 1188269 1175207 1165443 1158630 1155374 1155866 1158915 1163336 1168986 1175739 1182947 1190671
58429 1190671 1199810 1210221 1220308 1229271 1238081 1247410 1256280 1263564 1268965 1271535 1269160 1260839 1247963
58416 1247963 1232393 1214897 1196318 1178340 1161841 1146109 1130774 1116899 1105152 1094717 1085062
58405 1085062 1076978 1070791 1065342 1059923 1055422 1052458 1050267 1048534 1048277 1049723 1051310 1052107 1053186 1055256
58391 1055256 1057044 1057545 1057797 1058828 1059829 1060061 1060682 1062921 1066199 1069649 1073751 1078914 1084254 1089410 1095724
58376 1095724 1104089 1113522 1123497 1135548 1150728 1167359 1183279 1198565 1214239 1230133 1245905 1262452
58364 1262452 1280355 1298433 1315460 1331630 1346897 1359827 1369753 1378038 1385446 1390381 1391484 1389864
58352A389864k906m475n963n195k540p09p8J590M701P345R242J1906J4833J5868
58338A433483J5424J5920J7075J6289J3724J2296J2428J1624R449Q098P671N768
58326A579249K216n40k041m034n929n181k409r41r85M45L538N228N078N929Q130
58311A587753Q946Q371R518J2479J3758J2783J2861J4735J5324J3987J3784J5396
58299A739695J5989J5219J5976J8111J8071J5941J5892J8436J9367J7884J8277
58288A928858K1700K3888K3240K3587K6486K8372K7944K8889L2515L5117L5386
58277B235982L6919M0698M2801M2291M3446M7356M9503M8622M9485N3672N6351
58266B747126N5710N6566O0814O3437O2197O1940O4712O5093O0377N6108N6138
$$ plain form
58352 1389864 1386958 1382483 1376520 1371325 1368785 1368076 1367998 1369588 1374289 1381634 1390876 1402782 1417615 1433483
58338 1433483 1448907 1464827 1481902 1498191 1511915 1524211 1536639 1548263 1557712 1565810 1573481 1579249
58326 1579249 1581465 1580925 1578884 1574850 1568921 1563740 1561331 1560390 1559405 1559850 1563388 1568616 1573694 1579623 1587753
58311 1587753 1596699 1605070 1614588 1627067 1640825 1653608 1666469 1681204 1696528 1710515 1724299 1739695
58299 1739695 1755684 1770903 1786879 1804990 1823061 1839002 1854894 1873330 1892697 1910581 1928858
58288 1928858 1950558 1974446 1997686 2021273 2047759 2076131 2104075 2132964 2165479 2200596 2235982
58277 2235982 2272901 2313599 2356400 2398691 2442137 2489493 2538996 2587618 2637103 2690775 2747126
58266 2747126 2802836 2859402 2920216 2983653 3045850 3107790 3172502 3237595 3297972 3354080 3410218
58255C410218N6391N3975N3281N7264O1693O3804O7697P5596Q2899Q7435R4032
58244D164285J04369J12314J15224J19519J29018J38388J44335J52169J64731
58235E344352J76288J84217J94915K11163K26078K36774K50963K72383K93534
58226G390667L10963L33086L64089L95644M24144M59789N08216N60158O10872
58217A1357628O72022P52057Q43613R43990J068704J230471J425839J658690J954605
58208B1907619K333143K787638L311086L919781M635488N474600O472979P675470
58200E8517804R054665J0464269J1715031J2686613J3355756J3774092J4068555
58193A43636785J4404215J4854771J5320278J5638556J5767869J5823546J6000852
$$ plain form
58255 3410218 3466609 3520584 3573865 3631129 3692822 3756626 3824323 3899919 3982818 4070253 4164285
58244 4164285 4268654 4380968 4496192 4615711 4744729 4883117 5027452 5179621 5344352
58235 5344352 5520640 5704857 5899772 6110935 6337013 6573787 6824750 7097133 7390667
58226 7390667 7701630 8034716 8398805 8794449 9218593 9678382 10186598 10746756 11357628
58217 11357628 12029650 12781707 13625320 14569310 15638014 16868485 18294324 19953014 21907619
58208 21907619 24240762 27028400 30339486 34259267 38894755 44369355 50842334 58517804
58200 58517804 67572469 78036738 89751769 102438382 115794138 129568230 143636785
58193 143636785 158041000 172895771 188216049 203854605 219622474 235446020 251446872
58186B51446872J6527434J7529190J8635409J8644993J5889912R314631o17793
58179C47370648j2024199k2540084l0278151l4302969l4682721l2274308k8288078
58172A52980138k3798663j9486655j5680324j2490894r886914p756664o000277
58165E7879747m571030l432490k524904j792943j205717p30261l22258L8739L38616
58156D3677499N70668P60551R42360J143020J386969J652394J792008J555739
58148E3481208P63712n30951k056519l474575m516259n042012n057115m689424
58140B8878065m116145l483232k878878k351306j920093j576666j300317j079156
58132A0172272r07431p71986o57709n61228m85386m25525l73801l31002l01183
$$ plain form
58186 251446872 267974306 285503496 304138905 322783898 338673810 347988441 347370648
58179 347370648 335346449 312806365 282528214 248225245 213542524 181268216 152980138
58172 152980138 129181475 109694820 94014496 81523602 71636688 63880024 57879747
58165 57879747 53308717 49876227 47351323 45558380 44352663 43622402 43300144 43338883 43677499
58156 43677499 44248167 45008718 45951078 47094098 48481067 50133461 51925469 53481208
58148 53481208 54244920 53713969 51657450 48182875 43666616 38624604 33567489 28878065
58140 28878065 24761920 21278688 18399810 16048504 14128411 12551745 11251428 10172272
58132 10172272 9264841 8492855 7835146 7273918 6788532 6363007 5989206 5658204 5357021
58123E357021k79951k59831k41753k29807k20133k06227j89959j76531j63866
58114C388963j47458j30451j18371j08801r6611q4572p8609p7100p4856p3219
58104B398915p6134q0338p9485p4636p1204o8814o3438n6461n2476n0712m7135
58093A678082m2513m0309l9228l5826l1842l1091l1727k9326k5177k3774k4469
58082A322800k3258k0721k0595k2285k2177k0717k1175k2797k2022j9217j7743
58071A090093j7635j6443j4850j5408j6934j6179j3805j3000j3531j2688j0776
58060I28844j0231j0603r762q631r468j0934j0105p942p577q643q432p164p013
58047H12339p322n949l998m148n570n416m057l957m824m637m162n557p828q489
$$ plain form
58123 5357021 5077070 4817239 4575486 4345679 4125546 3919319 3729360 3552829 3388963
58114 3388963 3241505 3111054 2992683 2883882 2787271 2702699 2624090 2546990 2472134 2398915
58104 2398915 2322781 2242443 2162958 2088322 2017118 1948304 1884866 1828405 1775929 1725217 1678082
58093 1678082 1635569 1595260 1556032 1520206 1488364 1457273 1425546 1396220 1371043 1347269 1322800
58082 1322800 1299542 1278821 1258226 1235941 1213764 1193047 1171872 1149075 1127053 1107836 1090093
58071 1090093 1072458 1056015 1041165 1025757 1008823 992644 978839 965839 952308 939620 928844
58060 928844 918613 908010 898248 889617 880149 869215 859110 851168 843591 834948 826516 819352 812339
58047 812339 805017 799068 795070 790922 785352 779936 775879 771922 767098 762461 758299 752742 744914 736425
58033G36425q292r560j1257j0627q379p350p393o445n269o076p745p451n868n728
58019F28985o403n141k635k010l067k819j133o10j309p98Q36J119J58M68J928
58004F07569J861J66m91K88J71j068j025O21J368N60M09J788K932K954K809K443
57988F23355P51j311j445q0j4j740k974k967l383m608n101m813n402o616o271
57973E77381m362l371l941l939k508j421j633j948j779j942k132r83Q25R22p35
57958E48434j564o61J11j02K08J611K485K140K033K810L229K938L383M946O059
57943E78060O124O514P811Q734Q755R126J0386J1339J1332J1185J1298J1132J0948
57930G02744J1552J2101J0804P988N704M114J416k392m996n621o097p298p773
$$ plain form
58033 736425 728133 718573 707316 696689 688310 680960 673567 667122 661853 655777 648032 640581 634713 628985
58019 628985 622582 617441 614806 612796 609729 606910 605777 605167 603858 603060 603896 605015 605173 605641 607569
58004 607569 609430 609596 609105 609393 609564 608496 607471 608092 609460 610020 610429 612217 615149 618103 620912 623355
57988 623355 624106 622795 621350 621270 621256 619516 616542 613575 610192 605584 600483 595670 590268 583652 577381
57973 577381 573019 569648 565707 561768 559260 557839 556206 554258 552479 550537 548405 547422 548247 549169 548434
57958 548434 546870 546209 546320 546218 546426 548037 550522 552662 554695 557505 560734 563672 567055 572001 578060
57943 578060 584184 590698 598509 607243 615998 625124 635510 646849 658181 669366 680664 691796 702744
57930 702744 714296 726397 737201 745189 750893 755007 756423 754031 749035 743414 737317 730019 722246
57917G22246o977o667p790q814q520p771p385o731n650n296n905o071n215m536
57903F28918m641m560m006m131n230o002n938o022o380n767m121k968k528j217
57889E65407J107K332J689J271K510L896L836L134K982K785J796Q47P59Q32M34
57874E95617K35O27P02O8j69O01J390J558J941K942L491L110K958L695M293M095
57858F27154M003M354L858K017N35P02J317Q06l91j155j656k382k748k305j943
57843F32166k435l052k968k734l121l777m167m546m952m614l378k389k324k399
57829E85310j990j693j870j741r64n24r75j389j134j059j778k337j830q69m12
57814E64745m81r83k222l711m083l190k635l246l807l282k433k020j367o6P80
$$ plain form
57917 722246 715269 708602 700812 691998 683478 675707 668322 661591 655941 650645 644740 638669 633454 628918
57903 628918 624277 619717 615711 611580 606350 600348 594410 588388 582008 576241 572120 569152 566624 565407
57889 565407 566514 568846 570535 571806 574316 578212 582048 585182 588164 590949 592745 593592 594351 595183 595617
57874 595617 595852 596479 597181 597249 597080 597681 599071 600629 602570 605512 609003 612113 615071 618766 623059 627154
57858 627154 631157 635511 639369 641386 641921 642623 643940 644746 644355 643200 641544 639162 636414 634109 632166
57843 632166 629731 626679 623711 620977 617856 614079 609912 605366 600414 595800 592422 590033 587709 585310
57829 585310 583320 581627 579757 578016 577052 576528 575553 574164 573030 571971 570193 567856 566026 565157 564745
57814 564745 564264 563281 561059 557348 553265 550075 547440 544194 540387 537105 534672 532652 531285 531219 531999
57799E31999N26M04J377K259J751Q17J212K863M517N821P086P898P561O317M890
57784E87298L535K455K165K506K439J770J777L142M576M667L800L076K553J789
57770F27548R92M71j35j085j983k697l681m794n180m910n161o090o404n731n364
57755E75796n649m836j970J118K314J896J206N15j40J66J673K780K362J674K205
57740E81110L106K716J311L46J08l8j25k4l09j185j676j280j159k150l162l106
57724E74483k819l294l702l180k845l834m937m625l938m670o025n931m675m239
57710E15769m741m534l505l272m109m434l639k980l199l479l217k981l158l291
57696D65230l164l029k604j240O37J748J736J502J689K107K700L841N488P150
$$ plain form
57799 531999 532525 532929 534306 536565 538316 539133 540345 543208 547725 553546 560632 568530 576091 582408 587298
57784 587298 590833 593288 595453 597959 600398 602168 603945 607087 611663 616330 620130 623206 625759 627548
57770 627548 628540 629011 628876 627791 625808 623111 619430 614636 609456 604546 599385 593295 586891 581160 575796
57755 575796 570147 565311 563341 564459 566773 568669 569875 570390 570250 570416 572089 574869 577231 578905 581110
57740 581110 584216 586932 588243 588589 588697 588659 588534 588510 588201 587016 585340 584060 582901 580751 577589 574483
57724 574483 571664 568370 564668 561488 558643 554809 549872 545247 541309 536639 530614 524683 520008 515769
57710 515769 511028 506494 502989 499717 495608 491174 487535 484555 481356 477877 474660 471679 468521 465230
57696 465230 462066 459037 456433 455193 455830 457578 459314 460816 462505 464612 467312 471153 476641 483791
57682D83791Q758J0664J2884J5292J8271K2188K6426K9912L2371L4190L5466L6125
57670G66338L6573L7262L8009L8514L9042L9844M0573M0854M0333L7224K8347
57659A182913J2222q663k9867m8281o2272p0233p1309o6885n9474n0620m1271
57648F86260l3139k7579k3736j9781j5556j2262j0104q254o628n757n234m208
57636E14022l090k851k984k169o95p8m22k63Q48J677J531J259J593K095K170J786
57620E14429R37l41j299j153l83j01k85m2M94K04j078k224k490k211j713r34k52
57603E01558l01r10j297j264j080n95K53N45m86j826j901j064j006j972k583k371
57587D83700k408l122l498k977k427k622l224l707m004l885k993j832j380j553
$$ plain form
57682 483791 492549 503213 516097 531389 549660 571848 598274 628186 660557 694747 730213 766338
57670 766338 802911 840173 878182 916696 955738 995582 1036155 1077009 1117342 1154566 1182913
57659 1182913 1195135 1186472 1156605 1108324 1046052 975819 904510 837625 778151 727531 686260
57648 686260 653121 625542 601806 582025 566469 554207 544103 535849 529221 523464 518230 514022
57636 514022 510932 508081 505097 502928 502233 502155 501733 501470 502318 503995 505526 506785 508378 510473 512643 514429
57620 514429 515366 515025 513726 512573 512190 512089 511804 511762 512256 512460 511382 509158 506668 504457 502744 501810 501558
57603 501558 501257 500347 499050 497786 496706 496111 496364 496909 496423 494597 492696 491632 490626 488654 486071 483700
57587 483700 481292 478170 474672 471695 469268 466646 463422 459715 455711 451826 448833 447001 445621 444068
57573D44068j359o98n69j291j990k092j936j677r57J5L92J6l29j77K61R55J917
57556D34549K373J519J73O1J382K625K957L064L426L479L014K866L526M418M980
57541D74412N298N297M520L051J587M09o47j287j108p09j027j728j750j345j694
57526D83279k613k581j255k0L50N91J084J046K64j97K28Q14J208K162L863N183
57510D93406N398N151N014M647M086M235N203N700N023M129L878L672K819J858
57496E54219J474J265N70m29j249j715j486j57J650K514K131J670J844K054K053
57481E66408K740M456N981O226N569M744L789K920K913L673L824K715J474J139
57467F18571J113N22k47n03m68m63q4Q07J451J501J784K809L819M255M727N543
$$ plain form
57573 444068 442709 442011 441442 440151 438161 436069 434133 432456 431499 431514 431906 431922 431593 431416 431677 432632 434549
57556 434549 436922 438441 438614 438675 440057 442682 445639 448703 452129 455608 458622 461488 465014 469432 474412
57541 474412 479710 485007 489527 492578 494165 494574 493927 492640 491532 490823 489796 488068 486318 484973 483279
57526 483279 480666 478085 476830 476810 477160 477751 478835 479881 480145 479948 480176 480990 482198 484360 488223 493406
57510 493406 498804 503955 508969 513616 517702 521937 527140 532840 537863 541992 545870 549542 552361 554219
57496 554219 555693 556958 557528 557099 555850 554135 552649 552492 554142 556656 558787 560457 562301 564355 566408
57481 566408 569148 573604 579585 585811 591380 596124 599913 602833 605746 609419 613243 615958 617432 618571
57467 618571 619684 620206 619959 619456 618988 618525 618441 619248 620699 622200 623984 626793 630612 634867 639594 645137
57451F45137N778N026M554N294O141N750M798M790N650O145N898N409M831M173
57437G19374M013M644N204M895M351M529N007M755L944L533L680L836L926M149
57423G79840M073L227K203K067K939M134N224O044O204N587M886M717M757M630
57409H40532M866N991P317P816P661P739Q030P737O778O059O269P198Q155Q522
57395I40670Q085P326P053P440P862P966Q165Q743R271R405R394R405R214Q996
57381A058995R398J0360J0955J0892J0927J1282J1051R868Q780Q509Q395P937
57369A177349P909Q721R256Q659P888Q038Q530Q487Q605R795J1160J1249J0447
57356A296093J0257J0924J1572J2111J3131J4307J4656J4166J3738J3741J3859
$$ plain form
57451 645137 650915 655941 660495 665789 671930 677680 682478 687268 692918 699063 704961 710370 715201 719374
57437 719374 723387 728031 733235 738130 742481 747010 752017 756772 760716 764249 767929 771765 775691 779840
57423 779840 783913 787140 789343 791410 794349 798483 803707 809751 815955 821542 826428 831145 835902 840532
57409 840532 845398 851389 858706 866522 874183 881922 889952 897689 904467 910526 916795 923993 932148 940670
57395 940670 948755 956081 963134 970574 978436 986402 994567 1003310 1012581 1021986 1031380 1040785 1049999 1058995
57381 1058995 1068393 1078753 1089708 1100600 1111527 1122809 1133860 1143728 1152508 1161017 1169412 1177349
57369 1177349 1185258 1193979 1203235 1211894 1219782 1227820 1236350 1244837 1253442 1263237 1274397 1285646 1296093
57356 1296093 1306350 1317274 1328846 1340957 1354088 1368395 1383051 1397217 1410955 1424696 1438555
57345A438555J4037J4361J4417J3873J3258J3110J3059J2778J2891J3715J4159
57334A588213J3359J2357J2536J3359J3484J3222J3827J5023J5391J4877J4834
57323A740482J5655J6304J6228J5967J5824J5581J5539J6285J7338J7564J6935
57312A919702J6547J6895J7513J8165J9019J9687J9636J9402K0042K1398K2295
57301B130301K2376K2359K2553K2594K2596K3108K3913K4162K3769K3435K3327
57290B384493K3090K2973K3635K4851K5721K6104K6512K6832K6534K5992K6087
57279B662824K6631K6609K5985K5757K6260K6879K7349K7890K8078K7260K6106
57268B957628K6164K7650K9215K9961L0281L0475L0227K9674K9584L0056L0375
$$ plain form
57345 1438555 1452592 1466953 1481370 1495243 1508501 1521611 1534670 1547448 1560339 1574054 1588213
57334 1588213 1601572 1613929 1626465 1639824 1653308 1666530 1680357 1695380 1710771 1725648 1740482
57323 1740482 1756137 1772441 1788669 1804636 1820460 1836041 1851580 1867865 1885203 1902767 1919702
57312 1919702 1936249 1953144 1970657 1988822 2007841 2027528 2047164 2066566 2086608 2108006 2130301
57301 2130301 2152677 2175036 2197589 2220183 2242779 2265887 2289800 2313962 2337731 2361166 2384493
57290 2384493 2407583 2430556 2454191 2479042 2504763 2530867 2557379 2584211 2610745 2636737 2662824
57279 2662824 2689455 2716064 2742049 2767806 2794066 2820945 2848294 2876184 2904262 2931522 2957628
57268 2957628 2983792 3011442 3040657 3070618 3100899 3131374 3161601 3191275 3220859 3250915 3281290
57257C281290L0298L0250L0127K9405K8477K8451K9374L0226L0758L1747L3200
57246C613603L3964L3590L3074L3238L3862L4743L6115L7540L7930L7328L7187
57235D002174L8214L9282L9182L8148L6951L5695L4351L3341L2816L2158L0936
57224D393248K9593K8797K8817K9718L1266L2477L2374L1410L1075L1840L2730
57213D733345L3118L3662L4945L6478L7614L8430L9146L9615L9831M0059M0187
57202E146430L9816L9121L8585L7842L6088L3752L2338L2243L2132L1003K9519
57191E528869K8607K8007K6985K5576K4315K3537K3410K4048K5168K6233K7117
57180E811872K8001K8679K8785K8538K8362K8046K7341K6967K7626K8487K8233
$$ plain form
57257 3281290 3311588 3341838 3371965 3401370 3429847 3458298 3487672 3517898 3548656 3580403 3613603
57246 3613603 3647567 3681157 3714231 3747469 3781331 3816074 3852189 3889729 3927659 3964987 4002174
57235 4002174 4040388 4079670 4118852 4157000 4193951 4229646 4263997 4297338 4330154 4362312 4393248
57224 4393248 4422841 4451638 4480455 4510173 4541439 4573916 4606290 4637700 4668775 4700615 4733345
57213 4733345 4766463 4800125 4835070 4871548 4909162 4947592 4986738 5026353 5066184 5106243 5146430
57202 5146430 5186246 5225367 5263952 5301794 5337882 5371634 5403972 5436215 5468347 5499350 5528869
57191 5528869 5557476 5585483 5612468 5638044 5662359 5685896 5709306 5733354 5758522 5784755 5811872
57180 5811872 5839873 5868552 5897337 5925875 5954237 5982283 6009624 6036591 6064217 6092704 6120937
57169F120937K7334K7378K8227K7973K5950K3762K2693K2148K1285K0520K0417
57158F388624K0564K0322J9512J7838J4862J0926O729J820m858j2719j9586k4426
57146F439608k8172l1446l3438l3738l3271l2511l0514k6688k1913j7039j1858
57135F139020o314j067L825R152J4678J8704K0239J9991J8522J5290J0249M613
57123F266902p08n592q971q741m271K916J1713K2403L4372M5434N4806O4575P7077
57110F551915R3092J13783J42011J80215K29109K89602L63401M50126N46179O48128
57100I607561P55367Q68332R85913J104403J215417J304804J358916J374513J359200
57091A9934426J321367J265005J195660J125154J069414J052178J116040J315838
$$ plain form
57169 6120937 6148271 6175649 6203876 6231849 6257799 6281561 6304254 6326402 6347687 6368207 6388624
57158 6388624 6409188 6429510 6449022 6466860 6481722 6492648 6499377 6501197 6496339 6483620 6464034 6439608
57146 6439608 6411436 6379990 6346552 6312814 6279543 6247032 6216518 6189830 6167917 6150878 6139020
57135 6139020 6132706 6131639 6135464 6144616 6159294 6177998 6198237 6218228 6236750 6252040 6262289 6266902
57123 6266902 6266194 6260602 6251631 6242890 6238619 6241535 6253248 6275651 6310023 6355457 6410263 6474838 6551915
57110 6551915 6645007 6758790 6900801 7081016 7310125 7599727 7963128 8413254 8959433 9607561
57100 9607561 10362928 11231260 12217173 13321576 14536993 15841797 17200713 18575226 19934426
57091 19934426 21255793 22520798 23716458 24841612 25911026 26963204 28079244 29395082
57083B9395082J682879K193140K775384L342998L807097M070344M039133L660817
57075E4966874K945206J947544P44319n65944j855636k989810l868752m451366
57067D6872435m744838m783405m616437m301810l896369l447508k991502k555184
57059A5535382k156385j804490j502788j250363j042601q72641p34120o22242
57051E549752n32553m60383m01968l54878l16857k85246k57910k33874k12632
57042B493451j93662j76794j62360j50635j41417j34099j27580j20310j11254
57033A175340j00959r1010q2287p4255o6171n8338n1682m6394m1605l6528l1363
57022D94748k6703k2388j7605j2180o917k333K228P628J3715J9835K6004L2710
$$ plain form
57083 29395082 31077961 33271101 36046485 39389483 43196580 47266924 51306057 54966874
57075 54966874 57912080 59859624 60603943 60037999 58182363 55192553 51323801 46872435
57067 46872435 42127597 37344192 32727755 28425945 24529576 21082068 18090566 15535382
57059 15535382 13378997 11574507 10071719 8821356 7778755 6906114 6171994 5549752
57051 5549752 5017199 4556816 4154848 3799970 3483113 3197867 2939957 2706083 2493451
57042 2493451 2299789 2122995 1960635 1810000 1668583 1534484 1406904 1286594 1175340
57033 1175340 1074381 983371 901084 826829 760658 702320 650638 604244 562639 526111 494748
57022 494748 468045 445657 428052 415872 408955 406622 408850 416478 430193 450028 476032 508742
57010E08742L9885M6990N3797O0334O6345P1558P6147Q0124Q2965Q4765Q6991
56999A258643R0826R5710J00977J07454J14136J13328R3125M7563j6435q3098
56989A922229j37617j72019j84915j79398j61309j37179j12130q9175o9738n4292
56979F24457m2920l5857l3087l3306l4142l3919l2525l0203k6594k1675j6653
56968B83576j2813j0124p766n441l301j187J032K797L489L609M390O403R181J2040
56954B85885J4346J5024J2690O847j329r627j6144k0129k1744k1334j9063j5257
56942B10165j0698o166j851K297N774P846Q742R791J1952J4678J6669J7412J7642
56929C04253J8390J9717K0180J7540J0429l96j2441k2960l0106l3208l2770l0125
$$ plain form
57010 508742 548627 595617 649414 709748 776093 847651 923798 1003922 1086887 1171652 1258643
56999 1258643 1349469 1445179 1546156 1653610 1767746 1881074 1974199 2021762 2005327 1922229
56989 1922229 1784612 1612593 1427678 1248280 1086971 949792 837662 748487 678749 624457
56979 624457 581537 545680 512593 479287 445145 411226 378701 348498 321904 300229 283576
56968 283576 270763 260639 252873 247432 244131 242944 243976 246773 250262 253871 258261 264664 273845 285885
56954 285885 300231 315255 327945 334792 333463 323836 307692 287563 265819 244485 225422 210165
56942 210165 199467 193301 191450 193747 199521 207367 216109 225900 237852 252530 269199 286611 304253
56929 304253 322643 342360 362540 380080 390509 390113 377672 354712 324606 291398 258628 228503
56917B28503k6555k2591j8478j4793j1955r475o673l958k452k311k428j900q92
56904A04042J71J237K216K834L274M195N752P350Q606R745J0813J1347J1253J1179
56890A94014J1559J1977J1943J1638J1520J1819J2765J4460J6089J5934J2874
56879C36592P415R72n179r918j2156j1399q058k816L721J0422J5697J8816K0697
56866C64806K2609K4659K6169K7032K7897K9267L1170L3524L6153L8273L8401
56855F99960L4875K6607J3781j763j6941k8653l4832l4796k9204j9810q799K054
56843F02479J1603J9172K4797K9468L4240L8880M2056M3114M3088M3740M6131
56832I78768N0256N5021N7877N4985M2942K1060p642l7519o2745p9467q6358q3753
$$ plain form
56917 228503 201948 179357 160879 146086 134131 124656 117983 114025 111573 109262 106834 104934 104042
56904 104042 104213 105450 107666 110500 113774 117969 123721 131071 139677 149422 160235 171582 182835 194014
56890 194014 205573 217550 229493 241131 252651 264470 277235 291695 307784 323718 336592
56879 336592 344007 344979 339800 329882 317726 306327 298269 295453 299174 309596 325293 344109 364806
56866 364806 387415 412074 438243 465275 493172 522439 553609 587133 623286 661559 699960
56855 699960 734835 761442 775223 773460 756519 727866 693034 658238 629034 609224 600425 602479
56843 602479 614082 633254 658051 687519 721759 760639 802695 845809 888897 932637 978768
56832 978768 1029024 1084045 1141922 1196907 1239849 1260909 1253267 1215748 1153003 1073536 987178 903425
56820I03425p3157n7675m1593k8057j7304q049K9O274J0952J5302J9574K2695
56808G52416K4361K6044K9228L3600L7263L7641L1862J7938l079k6752m7787o2678
56796H50057p0100p0233o4557n5359m4480l3008k2228j3744q003l839j99K704
56784D67011M580O184Q286J0554J2491J4490J6685J7564J4998Q207k143j4979
56772E63928k8598m0010m6301m6964m4005l9676l4908k9847k4843k0463j7031
56761A91282j4428j2240j0146q314p150o565n861m641l339k554k282k206k186
56748A09370k144j857j316q50n70j65M55Q41P18M61M87O71P66Q33R37R28Q43R69
56730A11377J231J201R70J252K230L127L341L261L488L971M421M782M848M215
$$ plain form
56820 903425 830268 772593 731000 702943 685639 677590 677619 683893 694845 710147 729721 752416
56808 752416 776777 802821 832049 865649 902912 940553 972415 990353 987274 960522 912735 850057
56796 850057 779957 709724 645167 589808 545328 512320 490092 476348 468345 464506 464307 467011
56784 467011 471591 477775 486061 496615 509106 523596 540281 557845 572843 581050 578907 563928
56772 563928 535330 495320 449019 402055 358050 318374 283466 253619 228776 208313 191282
56761 191282 176854 164614 154468 146154 139004 132439 126578 121937 118598 116044 113762 111556 109370
56748 109370 107226 105369 104053 103203 102633 102468 102923 103764 104482 104943 105430 106101 106867 107700 108637 109565 110408 111377
56730 111377 112608 113809 114779 116031 118261 121388 124729 127990 131478 135449 139870 144652 149500 153715
56716A53715L199K853L500M048L464K079P80k21j013j276q39l12k43k84K0J68
56700A69638o14k140l463l938l531k527j549j323j841k238j937j267o47l8L89
56685A42974Q2p52r51q8P66P95P40J397K007J481K88l22k31j64j92Q1L54P8k93
56666A48050J67J346K302K723L020L293L322L318L634M016M101M271M953N472
56652A93988M821L271K097J833J891J648R39k80j777k749k664k137k167k738l102
56637A92874k998k641k047j250q87j374k046k102j926k247k632k131j060n92q60
56622A66081r23n21l49o19p49n35l69j34O72J579J301l61j966k288j708j277j304
56605A56530j374j077l01P39J513J675J618J982K713L145K963K478K004J551J082
$$ plain form
56716 153715 156914 159767 163267 167315 170779 172858 173638 173417 172404 171128 170289 169977 169734 169450 169470 169638
56700 169638 169024 166884 163421 159483 155952 153425 151876 150553 148712 146474 144537 143270 142623 142585 142974
56685 142974 143056 142304 141353 141265 142031 142826 143566 144963 146970 148451 148739 148417 148186 148022 147830 147911 148265 148343 148050
56666 148050 148217 149563 151865 154588 157608 160901 164223 167541 171175 175191 179292 183563 188516 193988
56652 193988 198809 202080 204177 206010 207901 209549 210488 210208 208431 205682 203018 200881 198714 195976 192874
56637 192874 189876 187235 185188 183938 183051 181677 179631 177529 175603 173356 170724 168593 167533 166941 166081
56622 166081 165158 164637 164288 163669 162920 162385 162016 161882 162554 164133 165434 165073 163107 160819 159111 157834 156530
56605 156530 155156 154079 153778 154517 156030 157705 159323 161305 164018 167163 170126 172604 174608 176159 177241
56590A77241O16K10K18J130K659L546K991J845J529K235L035L360L442L605L943
56575B11605M546N276N687N724O023O846P481P449P496Q367R499J0064J0497J1577
56561C18137J2815J3271J3356J4216J5744J6830J7195J7369J7062J5294J2082
56550D83371Q457M901J263j826l147k717k022k203l224m807o826q679r551r547
56536D43443r476r570r509r506j0029j0692j0733j0508j1003j2007j2254j1389
56524C16767j0327r643r024q347p858p242n997m676m279m495m139l275l153l955
56510B30357m405l853l023k361j440l34M0m70q71o39k71O8Q92J948K134J297O17
56493B19686P45J045J106J381J832J601O06o3N5J34k92n62k86jJ22O41J375J253
$$ plain form
56590 177241 177857 178067 178285 179415 182074 185620 188611 190456 191985 194220 197255 200615 204057 207662 211605
56575 211605 216151 221427 227114 232838 238861 245707 253188 260637 268133 276500 285999 296063 306560 318137
56561 318137 330952 344223 357579 371795 387539 404369 421564 438933 455995 471289 483371
56550 483371 491828 496729 497992 496166 493019 490302 488280 486077 482853 478046 471220 462541 452990 443443
56536 443443 433967 424397 414888 405382 395353 384661 373928 363420 352417 340410 328156 316767
56524 316767 306440 296797 287773 279426 271568 264326 258329 253653 249374 244879 240740 237465 234312 230357
56510 230357 225952 222099 219076 216715 215275 214941 214981 214511 213640 213001 212730 212798 213690 215638 217772 219069 219686
56493 219686 220431 221476 222582 223963 225795 227396 228002 227939 227994 228128 227836 227274 226988 226987 227109 227750 229125 230378
56475B30378K52k26L73Q37L23l25l49l95r51j096q1J260J895K073K243J826L66
56458B38403j215j847j810j890j918j364n18OK96P54J287J661J972K144J730P97
56442B38488J91L34O29N43L93N21O56N79M89L74k9l26K27J301J649R69K39p9n67
56423B46581j219j041M7O66J50m10j58J93m2k18K19N83K99RK07K14m57j097j120
56404B43406r75q52j49Q99R24q1j8K036L864L274J416P58J332J408P84P78J590
56387B60394J997J576J174J198J085N30l3l12m04l07%K37K82N23J108J430J085
56370B71563O40P96J475K320L268M017L969L346L215L796L962L210K642K966L146
56355C14331K184R49P18J148J236J230J935K929L020K005P61M9J44R66J776J647
$$ plain form
56475 230378 230630 230404 230777 231614 231937 231612 231263 230868 229917 228821 228740 230000 231895 233968 236211 238037 238403
56458 238403 237188 235341 233531 231641 229723 228359 227841 227847 228143 228897 230184 231845 233817 235961 237691 238488
56442 238488 238679 239013 239642 240185 240578 241099 241755 242334 242823 243197 243168 242842 243069 244370 246019 246988 247227 247148 246581
56423 246581 245362 244321 244368 245034 245184 244774 244616 244809 244767 244549 244768 245351 245650 245659 245866 246080 245623 244526 243406
56404 243406 242431 241579 241430 242329 243253 243172 243154 245190 249054 252328 253744 254502 255834 257242 258026 258804 260394
56387 260394 262391 263967 265141 266339 267424 267954 267921 267609 267205 266898 266898 267135 267417 267940 269048 270478 271563
56370 271563 272203 272999 274474 276794 280062 284079 288048 291394 294609 298405 302367 305577 308219 311185 314331
56355 314331 316515 317464 318182 319330 320566 321796 323731 326660 329680 331685 332446 332495 332639 333605 335381 337028
56339C37028R47J264L106M933N396N109N115N067M323L426L059K714J849J262
56325C84598J821K865L234K973K682K214J346O98P19P46K47j37J30L89J39Q9O71
56308D05424R93O07P43K243L882M368M511N634P275Q333R047R947J0277R364Q366
56293D91014Q580R272R162Q778R263J0069J0022R630J0081J0955J1072J0761J1206
56280F19865J2315J3337J4580J6567J8334J8740J8643J9743K2075K4592K7305
56269H26096L0802L4562L7874M1571M6840N3061N8832O4246P0259P6836Q3705
56258A424684R1835J01958J12729J22473J31775J42030J52658J62174J70913J80118
56248B793347J89128J96129K00883K04196K05430K03134J97498J89724J79530
$$ plain form
56339 337028 337975 339239 342345 347278 352674 357783 362898 367965 372288 375714 378773 381487 383336 384598
56325 384598 386419 389284 392518 395491 398173 400387 401733 402431 403150 403896 404143 404006 404136 404525 404664 404753 405424
56308 405424 406417 407024 407767 410010 413892 418260 422771 428405 435680 444013 453060 463007 473284 482648 491014
56293 491014 499594 508866 518028 526806 536069 546138 556160 565790 575871 586826 597898 608659 619865
56280 619865 632180 645517 660097 676664 694998 713738 732381 752124 774199 798791 826096
56269 826096 856898 891460 929334 970905 1017745 1070806 1129638 1193884 1264143 1340979 1424684
56258 1424684 1516519 1618477 1731206 1853679 1985454 2127484 2280142 2442316 2613229 2793347
56248 2793347 2982475 3178604 3379487 3583683 3789113 3992247 4189745 4379469 4558999
56239D558999J65634J47992J27238J02762P3908M2269J0266k1781n4653q7114
56229E065520j16522j41907j63827j81856j94911k03427k08634k10299k07758
56220C436379k02363j96208j89167j79951j69248j58848j48511j36845j24633
56211A930605j14088j05273r6461q7669q0572p5134o9508o3225n7516n2589m7474
56200A081096m2424l8628l5693l2199k8392k5635k3687k1321j8995j7920j7195
56189G79007j5110j2539j1680j2019j1112q779o963n943m447l020l340m469l782
56176F75804j479j93k43N11K123K305J035J022K940M347M173M214N350O228O598
56161G14735Q045J0545J2064J2516J4223J7566K0007K0564K1493K4370K8016L1439
$$ plain form
56239 4558999 4724633 4872625 4999863 5102625 5176533 5218802 5229068 5207287 5152634 5065520
56229 5065520 4948998 4807091 4643264 4461408 4266497 4063070 3854436 3644137 3436379
56220 3436379 3234016 3037808 2848641 2668690 2499442 2340594 2192083 2055238 1930605
56211 1930605 1816517 1711244 1614783 1527114 1446542 1371408 1301900 1238675 1181159 1128570 1081096
56200 1081096 1038672 1000044 964351 932152 903760 878125 854438 833117 814122 796202 779007
56189 779007 763897 751358 739678 727659 716547 707768 700805 694862 690415 687395 684055 679586 675804
56176 675804 674325 674132 673889 674400 676523 678828 679863 680885 683825 688172 692345 696559 701909 708137 714735
56161 714735 722780 733325 745389 757905 772128 789694 809701 830265 851758 876128 904144 935583
56149I35583L5395L9999M4148M8135N3522N9858O5070O9531P5838Q4026R1152
56138A602257R6322J01856J08505J13944J17313J20951J26076J30596J32576J31997
56128B782393J27820J17479J00983Q2063O3851M6866L1880K0623J2337L640p105
56117C382830j8889l1792m7053o2696p4157q0470q5253r0601r5233r9745j07662
56106B589279j19200j29364j34627j36360j35501j29538j17669j03758r0924p7924
56096A414414o3832n1445m2780l5705k8244k1990j8220j4907j0644p352o217n011
56084A108067k279L0O85J646L869N123M569M870P174Q744Q193Q135R853J0504
56070A179183Q581O993P603P949O489N798P205P697N704M483O129P683O991O799
$$ plain form
56149 935583 970978 1010977 1055125 1103260 1156782 1216640 1281710 1351241 1427079 1511105 1602257
56138 1602257 1698579 1800435 1908940 2022884 2140197 2261148 2387224 2517820 2650396 2782393
56128 2782393 2910213 3027692 3128675 3210738 3274589 3321455 3353335 3373958 3386295 3389935 3382830
56117 3382830 3363941 3332149 3285096 3222400 3148243 3067773 2982520 2891919 2796686 2696941 2589279
56106 2589279 2470079 2340715 2206088 2069728 1934227 1804689 1687020 1583262 1492338 1414414
56096 1414414 1350582 1299137 1256357 1220652 1192408 1170418 1152198 1137291 1126647 1119295 1113078 1108067
56084 1108067 1105788 1105818 1106503 1108149 1112018 1117141 1121710 1126580 1133754 1142498 1150691 1158826 1168679 1179183
56070 1179183 1187764 1194757 1202360 1210309 1216798 1222596 1229801 1237498 1243202 1247685 1253814 1261497 1268488 1275287
56056A275287R113J1121J0829J1095J3837J5874J4947J4220J6281J8315J7872
56045A428791J7681K0009K1959K1288K1079K3696K5951K5429K5560K9071L2406
56034A692920L2244L1620L3915L6687L7175L7903M1062M3419M2797M3166M7386
56023B120294N1314N1455N1614N5430N9175N8983N8358O1250O4529O4774O5620
56012B762796P0581P5553P6364P6890Q1687Q7596R0761R4607J02460J09808J12648
56001C741751J15775J23843J32239J36184J40560J50850J62792J71093J79748
55992E054835J93237K06717K15874K26967K45621K65745K81535K99778L27306
55983G317615L57625L83979M13999M56319N04736N51830O06015O77911P62681
$$ plain form
56056 1275287 1284400 1295521 1306350 1317445 1331282 1347156 1362103 1376323 1392604 1410919 1428791
56045 1428791 1446472 1466481 1488440 1509728 1530807 1554503 1580454 1605883 1631443 1660514 1692920
56034 1692920 1725164 1756784 1790699 1827386 1864561 1902464 1943526 1986945 2029742 2072908 2120294
56023 2120294 2171608 2223063 2274677 2330107 2389282 2448265 2506623 2567873 2632402 2697176 2762796
56012 2762796 2833377 2908930 2985294 3062184 3143871 3231467 3322228 3416835 3519295 3629103 3741751
56001 3741751 3857526 3981369 4113608 4249792 4390352 4541202 4703994 4875087 5054835
55992 5054835 5248072 5454789 5670663 5897630 6143251 6408996 6690531 6990309 7317615
55983 7317615 7675240 8059219 8473218 8929537 9434273 9986103 10592118 11270029 12032710
55974A2032710Q54456R65112J109329J285539J493278J754198K091277K501328
55966B4087227K973158L518515M161374M918466N819879O917655Q218790R615553
55958G0230617J0926893J2010270J2813378J3357951J3736541J4096133J4531647
55951A61703430J4980542J5289777J5400126J5415382J5516072J5886760J6648468
55944B70840557J7592733J7833960J5925384J0679365K092663q462028j8888964
55937C07613670k7247773l2322097l3824829l2332564k8945124k4781765k0623718
55930A07535800j6879292j3717803j1160086r122288p490447o186084n155559
55923C7824241m334197l660960l108757k667162k310392k008796j754742j549944
$$ plain form
55974 12032710 12887166 13852278 14961607 16247146 17740424 19494622 21585899 24087227
55966 24087227 27060385 30578900 34740274 39658740 45478619 52396274 60615064 70230617
55958 70230617 81157510 93167780 105981158 119339109 133075650 147171783 161703430
55951 161703430 176683972 191973749 207373875 222789257 238305329 254192089 270840557
55944 270840557 288433290 306267250 322192634 332871999 334964662 326502634 307613670
55937 307613670 280365897 248043800 214218971 181886407 152941283 128159518 107535800
55930 107535800 90656508 76938705 65778619 56656331 49165884 42979800 37824241
55923 37824241 33490044 29829084 26720327 24053165 21742773 19733977 17979235 16429291
55915A6429291j380634j228869j094990r85916q93102q03249p19418o51044n93201
55906H078868n35166m80033m37059m02891l68012l34132l08480k87884k64437
55897D660774k40460k22910k09042j91895j74022j62122j53603j41609j28033
55888C037078j18997j12640j03542r4121q9665q7111q0356p2009o8373o7389o2893
55877B079982n6580n4327n4490n0940m4491m0661l9056l5157k9854k7476k6849
55866A620101k3774j9817j9584k1697k1218j8685j8251j9296j8213j6115j6624
55855A406827j8231j6857j3801j3498j5721j7509k0183k6676l4336l8230l9359
55844A152426m1868m4488m2641l7149l2916l0473k6512k1379j8505j7509j5167
$$ plain form
55915 16429291 15048657 13819788 12724798 11738882 10845780 10042531 9323113 8672069 8078868
55906 8078868 7543702 7063669 6626610 6223719 5855707 5521575 5213095 4925211 4660774
55897 4660774 4420314 4197404 3988362 3796467 3622445 3460323 3306720 3165111 3037078
55888 3037078 2918081 2805441 2701899 2607778 2518113 2431002 2350646 2278637 2210264 2142875 2079982
55877 2079982 2023402 1969075 1914585 1863645 1819154 1778493 1739437 1704280 1674426 1646950 1620101
55866 1620101 1596327 1576510 1556926 1535229 1514011 1495326 1477075 1457779 1439566 1423451 1406827
55855 1406827 1388596 1371739 1357938 1344440 1328719 1311210 1291027 1264351 1230015 1191785 1152426
55844 1152426 1110558 1066070 1023429 986280 953364 922891 896379 875000 856495 838986 823819
55833H23819j2037j1196j1530r323n440m062n199n156l488k859k919j011J777
55820G51376J854j81m51J241J585L54O42K803M170M439N563O729N163J614n49
55805G86352j275l333o594q416r129j1364j4420j5066j3631j3537j5046j5179
55793F59362j3681j3217j3714j2295r041p233p428o777m570l130k747j104J701
55780E66126K842K149K673N102O495N411L572J728j434n502p997q615r502j0855
55766E52193j0587q792p895p962o574m002l605o263r017j0214j1407j3093j3175
55753D39607j1035q950q114p265o148o267p211o475l995k762l693m155k814j755
55739C58968k319k866k296j925k251j552O12K032J551P77P09J08j382j936r53
$$ plain form
55833 823819 811782 800586 789056 779733 774293 770231 765032 759876 756388 753529 750610 749599 751376
55820 751376 753230 753049 752598 753839 755424 755778 756420 759223 763393 767832 773395 780124 785287 786901 786352
55805 786352 785077 781744 775150 766734 757605 746241 731821 716755 703124 689587 674541 659362
55793 659362 645681 632464 618750 606455 597414 590181 582753 575976 571406 568276 565529 564425 566126
55780 566126 568968 571117 573790 578892 585387 590798 594370 596098 594664 589162 581165 572550 563048 552193
55766 552193 541606 532814 524919 516957 510383 506381 502776 496513 487496 477282 465875 452782 439607
55753 439607 428572 419622 411508 404243 398095 391828 384617 378142 374147 371385 367692 363537 360723 358968
55739 358968 356649 353783 351487 349562 347311 345759 346371 348403 349954 350731 351440 351548 350166 348230 347277
55724C47277m16j293j926j423j383k591l202j974l48L11O49J091O55n33m68J395
55708C35821K890K680K217K696L017K423K329L654M847M360K860J459k2j614k282
55693C67335j775j245r84J71K202L216K483J641J836K168K058K410L337L370K295
55678C90518J977L089L733K807J948K508L152K317O77n05j429k467k942k620k449
55663D00314k592j886l43J28j220k639k930l294m701n916n886n700o450p236p096
55648C42553o831p201p295o344n319n137n114m609m322m552m184k806j782j813
55634B75244j607m30K04q54k259k474k265k966m032m200l610l088k670k305k547
55619B40141l293l331k283j353j160p69J54L61n50j021k09M83L7l82J68N55j27
$$ plain form
55724 347277 346861 345568 343642 342219 340836 338245 335043 333069 332721 333032 333681 334772 335427 334894 334426 335821
55708 335821 338711 341391 343608 346304 349321 351744 354073 357727 362574 366934 369794 371253 371231 369617 367335
55693 367335 365560 364315 363331 363502 365704 368920 371403 373044 374880 377048 379106 381516 384853 388223 390518
55678 390518 392495 395584 399317 402124 404072 406580 409732 412049 412726 412221 410792 408325 405383 402763 400314
55663 400314 397722 395836 395493 395621 394401 391762 388832 385538 380837 374921 369035 363335 356885 349649 342553
55648 342553 335722 328521 321226 314882 309563 304426 299312 294703 290381 285829 281645 278839 277057 275244
55634 275244 273637 273207 273411 272557 270298 267824 265559 262593 258561 254361 250751 247663 244993 242688 240141
55619 240141 236848 233517 231234 229881 228721 227952 228106 228467 227917 226896 226687 227170 227207 226825 226993 227548 227421
55602B27421p60n22o61j909k547j291J41j95j209r14J11R6o19m43N13R60Q26Q09
55584B19807O20j72o09J72J067P74K13R47K338K640J949J682J949J795J374J634
55568B38180K325K425K106K302K839K859K614K983L631L444K424J505Q76k8j141
55553B69344j887k231k465k377j769j155r24o22p9j44j167j895j264j31J43l41
55537B51036q65j663l017m004l881l513l816l879k552p38j80q25j339j367j431
55522B17966j332o60p3l63q88o67k15m88q86k40R82J391R23M59q0j270k475k555
55504B09529j811j360j137l99L78J06q94j409j437j817k239j630k69M72L03J15
55488A96501J08l52j162j497j299j150j012o14o06j624k686k379j182p12j051
$$ plain form
55602 227421 226661 226139 225478 223569 221022 219731 219872 219677 218468 217554 217665 217761 217142 216699 217212 218172 218998 219807
55584 219807 220427 220255 219646 219818 220885 221659 221872 222819 225157 227797 229746 231428 233377 235172 236546 238180
55568 238180 240505 242930 245036 247338 250177 253036 255650 258633 262264 265708 268132 269637 270513 270485 269344
55553 269344 267457 265226 262761 260384 258615 257460 256536 255914 255835 255691 254524 252629 251365 251234 251377 251036
55537 251036 250171 248508 245491 241487 237606 234093 230277 226398 223846 223108 222928 222103 220764 219397 217966
55522 217966 216634 215974 215901 215538 214650 213983 213768 213280 212394 212154 213136 214527 215450 215909 215829 214559 212084 209529
55504 209529 207718 206358 205221 204822 205200 205306 204412 203003 201566 199749 197510 195880 195611 196083 196386 196501
55488 196501 196609 196257 195095 193598 192299 191149 190137 189523 188917 187293 184607 182228 181046 180334 179283
55473A79283r30j93R2j26K05J028J041M2o51m63l83r89j446j079m15j11j29l81
55455A74395j015j678j642q98j23M15R17J171Q35L71M75P90N18j8O9M33m0j146
55437A73829j400l19R89J545J407P98j92r96j014o90p63p61K60J701J958R23J45
55420A77420M05R23J069J102R48J10q82p24N45J355J058P92J395K054J836J012
55404A90418K26m14p61m11L54N29j57q47r45p58n16l1L52q5j001j081l7Q76P73
55385A86484J68l41r17j443j130Q7J110J304J250J265O96n40j191n13L45pj288
55368A85339k355k901l152k847j833r81j213j971j856o08N89P45K08L8P26J730
55352A69658K110J557O86J56j74p55j317j124j45Q33J234J127O51j47q46r53o26
$$ plain form
55473 179283 178353 178160 178252 178126 178331 179359 180400 180442 179791 179328 178945 177956 176510 175431 175016 174905 174776 174395
55455 174395 173380 171702 170060 169162 169039 169454 170371 171542 172377 172748 173223 174013 174531 174513 174582 175015 174975 173829
55437 173829 172429 172110 173099 174644 176051 176849 176657 175661 174647 173957 173194 172433 172693 174394 176352 177275 177420
55420 177420 177825 178748 179817 180919 181867 181977 181095 180371 180916 182271 183329 184121 185516 187570 189406 190418
55404 190418 190644 190230 189469 189058 189412 189941 189784 188937 187992 187234 186718 186687 187039 186954 185953 184872 184835 185711 186484
55385 186484 186652 186311 185394 183951 182821 182908 184018 185322 186572 187837 188533 187993 186802 186289 186634 186627 185339
55368 185339 182984 180083 176931 174084 172251 171270 170057 168086 166230 165622 166211 166956 167164 167202 167928 169658
55352 169658 171768 173325 174011 174167 173993 173238 171921 170797 170652 171485 172719 173846 174497 174350 173504 172551 171925
55335A71925l92j99L17P75M19m63p22q8M69L49M3l0j99o07p74n66n54r02r43l24
55315A67534L72O49P53Q39N48p0k57K15M84j1n62l44K98N74M82N60Q53R60O99
55296A74576K09l38p17p29o01p27r18n29M08R69O13k4o5N12J132J405J246P30
55278A77152J74l7L9lk63m93o85j033j329j128n48j40M1L84P79P37M92Q59J763
55259A76761K012J002m08j129j063o92k65R8K47L14N73P99N33P6K27R88J467J276
55241A82816R25O55P0p68j098q22q26j442j732r98Q4N42L83O6l69r15j170r52
55223A74449o24l43K00Q23P25j63p51l84J89J56k6M64J344J710J250K99p52j375
55205A77191r90J58Q48L25o78j003n28Q1M15M64K96J82N33J210J440Q56L4l35
$$ plain form
55335 171925 171533 171334 171651 172426 172845 172382 171660 171572 172041 172390 172433 172403 172204 171597 170823 170257 169703 168801 167858 167534
55315 167534 167906 168555 169308 170147 170695 170625 170368 170583 171067 171056 170494 170150 170448 171022 171504 172064 172917 173877 174576
55296 174576 174785 174447 173730 173001 172400 171673 170755 170226 170634 171603 172216 172192 172127 172639 173771 175176 176422 177152
55278 177152 177326 177289 177328 177325 177062 176569 175884 174851 173522 172394 171846 171706 171747 172131 172910 173647 174139 174998 176761
55259 176761 178773 179775 179367 178238 177175 176483 176218 176316 176563 176877 177450 178249 178782 178858 179085 180073 181540 182816
55241 182816 183741 184396 184466 183698 182600 181778 180952 179510 177778 176780 176864 177406 177789 177855 177486 176571 175401 174449
55223 174449 173825 173482 173682 174505 175230 175067 174316 173932 174121 174277 174251 174715 176059 177769 179019 179318 178566 177191
55205 177191 176201 176359 177207 177532 176854 175851 175323 175404 175819 176283 176579 176761 177294 178504 179944 180800 180834 180499
55187A80499j87L25J108J697J447N55o4k15o78j585j837q24M45Q16M88K26J04
55170A82320k5J60P05Q77L63P8P45J600J573R06M63K50j49l67K08J139J407Q59
55152A93112J64l09o07o15k54K1k14o57q13p52o74l35L12N75l1q75j061o20j16
55133A86251K78N38L36k55m06K48P95M44r9J71Q98J137J006J130J168M80l05l1
55115A93784R18J074J83m91k65J84L24N69J170J567J358R44P60O44L92J99K57
55098B03571M72P27R48Q87M13q9j34J62L66M83O89O64O3n97m51L60Q27N21Rj82
55078B09709j38l8J35K07q0m72m47j17j32n73p40k46M02N34J31l86o46m76P2O24
55058B07323P45L84j50n46o07k53K31J86o30j561j749j180m93k3M06Q46R94O13
$$ plain form
55187 180499 180312 180637 181745 183442 184889 185444 185380 185165 184487 182902 181065 180241 180686 181502 181990 182216 182320
55170 182320 182295 182455 183160 184037 184400 184478 185223 186823 188396 189302 189765 190015 189866 189499 189707 190846 192253 193112
55152 193112 193276 192967 192360 191745 191491 191512 191298 190641 189828 189076 188402 188067 188379 188954 188923 188048 186987 186367 186251
55133 186251 186529 187067 187403 187148 186742 186990 187785 188229 188130 188301 189199 190336 191342 192472 193640 194120 193815 193784
55115 193784 194702 195776 195959 195468 195203 195387 195711 196280 197450 199017 200375 201319 202079 202723 203115 203314 203571
55098 203571 204043 204770 205718 206605 207018 206929 206795 206957 207323 207806 208495 209159 209222 208625 208174 208534 209361 209882 209891 209709
55078 209709 209571 209533 209668 209875 209795 209323 208876 208759 208627 208054 207314 207068 207470 208004 208135 207749 207103 206627 206699 207323
55058 207323 208068 208452 208302 207756 207149 206896 207127 207313 206683 205122 203373 202193 201700 201677 202083 202929 203923 204536
55040B04536j55q61r57k04Q65J275P24r5n23o90q49p39k06K08J24O7N77J174J178
55021B05449R09J032J230O89l82r77q12n17l85q0L92M78O6k86k84k66m29l91J64
55002B05600R56J425J303P79M16O76J328J599J246R12J087J291R56M05K10K17
54986B20406R8J63O62Q51N8r33p82M06J342J538J637J841J464K65r99j609j536
54969B24872q55L75J530J683Q11j38n32o69q82r37n35J89Q95J285J161P25N90
54952B29568R24R98L10l69q3P19Q56L82M07J165J714J664J756K481L291L572L355
54935B52710K847K245K124K935M081M508M328M603N461N817N195M427M076L503
54921C08860K102L53j062k247l578n040o437p535p773o756n277m736n266n518
$$ plain form
55040 204536 204381 203520 202563 202359 203224 204499 205223 205128 204605 203915 203066 202327 202121 202329 202453 202520 203097 204271 205449
55021 205449 206358 207390 208620 209309 208927 207950 207138 206621 206236 206156 206548 207026 207092 206806 206522 206256 205827 205436 205600
55002 205600 206556 207981 209284 210063 210479 211155 212483 214082 215328 216240 217327 218618 219574 219979 220189 220406
54986 220406 220504 220667 221329 222180 222238 221305 220523 220929 222271 223809 225446 227287 228751 229016 228017 226408 224872
54969 224872 224017 224392 225922 227605 228416 228278 227746 227077 226195 225258 224723 224912 225807 227092 228253 228978 229568
54952 229568 230492 231490 231800 231431 231348 232067 232923 233305 233712 234877 236591 238255 240011 242492 245783 249355 252710
54935 252710 255557 257802 259926 262861 266942 271450 275778 280381 285842 291659 296854 301281 305357 308860
54921 308860 310962 311315 310253 308006 304428 299388 292951 285416 277643 270887 265610 260874 255608 250090
54907B50090m651l273k123j103k03pn03o06K85J351J771K007K734L538L745L692
54891B56744M066M653M767M405M048L752L358L182L638M475M994M821L956K499
54877C13358P63p73k060l559n348o760p326p409p413p070o144n092m435l924l083
54862B43725k072j386j124j110j297j573j595j272j032j162j445j708k070k272
54848B22607j561J62J803K300J812J081L16n99j458j999k369k647k421j542p44
54833B14741p80j350j574j206o88l64k39j92j9M50R05Q06L94O47J700K209J129
54816B16569o98j618j246m02M01J199J711J487Q59O88J055J183P55M35Q43J690
54800B24911K238K142J595J027P92R37J183J283J227J047P07M00N92J356K110
$$ plain form
54907 250090 245439 242166 240043 238940 238737 238730 238227 237621 237906 239257 241028 243035 245769 249307 253052 256744
54891 256744 260810 265463 270230 274635 278683 282435 285793 288975 292613 297088 302082 306903 310859 313358
54877 313358 314121 313348 311288 307729 302381 295621 288295 280886 273473 266403 260259 255167 250732 246808 243725
54862 243725 241653 240267 239143 238033 236736 235163 233568 232296 231264 230102 228657 226949 224879 222607
54848 222607 221046 221208 223011 225311 227123 228204 228520 227921 226463 224464 222095 219448 217027 215485 214741
54833 214741 213961 212611 211037 209831 209143 208779 208540 208348 208329 208779 209684 210490 210884 211531 213231 215440 216569
54816 216569 215871 214253 213007 212605 213006 214205 215916 217403 218262 218950 220005 221188 221943 222378 223221 224911
54800 224911 227149 229291 230886 231913 232705 233642 234825 236108 237335 238382 239089 239489 240081 241437 243547
54785B43547K387K511L041L837M245M012L523L286L558M316N237N806N754N284
54771C00344M725M247L929L729L196J823j20j707k541l253m444n771o500o343
54757B91314n441m061k810k413k762k837k089j178q38q26o84o67r83r70r4R10
54741B63571J003M92M89J203J966K649L673M697M689L592K751L213M387M934M356
54726C07665L290K526K133J506J60j528k774l599m923p037q784q938p828o591
54712B65278n495m105k778k480l112l334k398j097m38l32j64J12J36j12k94k60
54696B39127j30OJ92M37O07M43j95j002j354j065p73j146j880k001j159j23J73
54679B30157l23q21o54qL15n2m68j06P43Q92o5j052r82j69L14J39j82l25l85m08
$$ plain form
54785 243547 245934 248445 251486 255323 259568 263580 267103 270389 273947 278263 283500 289306 295060 300344
54771 300344 305069 309316 313245 316974 320170 321993 321873 320166 317625 314372 309928 304157 297657 291314
54757 291314 285873 281812 279002 276589 273827 270990 268901 267723 266885 266059 265375 264708 263725 262755 262661 263571
54741 263571 264574 265066 265555 266758 268724 271373 275046 279743 284432 288024 290775 293988 298375 303309 307665
54726 307665 310955 313481 315614 317120 317280 315752 312978 309379 304456 297419 288635 279697 271869 265278
54712 265278 259783 255678 252900 250420 247308 243974 241576 240479 240041 239709 239545 239657 239793 239681 239387 239127
54696 239127 238997 239003 239195 239632 240239 240682 240487 239485 238131 237066 236293 235147 233267 231266 230107 229984 230157
54679 230157 229834 229013 228359 228351 228666 228614 228146 228040 228783 229675 229610 228558 227576 227407 227721 227860 227678 227353 226968 226560
54659B26560l55l92n74n39r2K74J04k06m6L02J81j61J57J164J885J679Q57p1q29
54640B29898j010k41R78J550J234R94J454J863J226j30q94n10J58l2j040j689
54624B33809j114J01O21N8o34n78p6J71K39N75R91R79P14Q17J219J190N33r0j47
54605B39378J84N22O94N51ko69r64p96m69j86n9l56j131j761j561p44p2K23M21
54586B33203M67L8n65o37j16M36Q81J534K096J758N52m61o78o32p88p77k82K04
54568B36233K15J13L58O40L96k91q62r28l42Q39K101K584J955P82k11p64q03k70
54550B41745N15R39J004J389K211K529J665L59j64K59Q02Q88O31L87M81J101J916
54533B58657K098J318L75K11N85M35n96j695j984j487q46n36n30n73n83p79j373
$$ plain form
54659 226560 226205 225813 225239 224700 224608 224882 224986 224780 224734 225036 225217 225056 225213 226377 228262 229941 230798 230727 229898
54640 229898 228888 228647 229625 231175 232409 233403 234857 236720 237946 237816 236922 236412 236570 236538 235498 233809
54624 233809 232695 232796 233417 233475 232841 232263 232187 232358 232597 233172 234163 235142 235856 236673 237892 239082 239615 239525 239378
54605 239378 239562 240084 240778 241329 241327 240658 239694 238898 238429 238243 238184 237828 236697 234936 233375 232631 232559 232782 233203
54586 233203 233670 233708 233143 232506 232390 232826 233707 235241 237337 239095 239647 239186 238508 237876 237088 236311 236029 236233
54568 236233 236448 236561 236919 237559 237955 237664 236802 235874 235532 236371 238472 241056 243011 243793 243582 242818 242015 241745
54550 241745 242260 243199 244203 245592 247803 250332 251997 252356 252192 252451 253253 254141 254772 255159 255640 256741 258657
54533 258657 260755 262073 262448 262659 263244 263679 263083 261388 259404 257917 257071 256535 256005 255432 254849 254070 252697
54516B52697k057k124j224J39J066J062L24n16q63n73o9J73K11M37P90P29J33
54499B50335l22l9O32P97Q5j011j643j343m28K11k3o81p67O9J156J644J288L92
54481B50352m06l28Q48K175K402J651J301J929K375J559K24j71M57J020J013R26
54465B67327J012Q80M07O4R0J31m0n2M77J335J969K010J394M13l21l48O5K08j55
54446B76866n54o03n49p98j328j855k204k208j617n43K66J02p89j413j197n30
54430B61046q8kQK0j05k61r8M41R36J044R09Q60R35R91J026J105J100Q65N53M49
54410B71734N35N53M18L18L43L85L80M00M58M73M79N91P84R01Q99Q82R23J059
54392B82515J357J736J867J569J147J036J202J246J039P72M81Jn90r40q61m35
$$ plain form
54516 252697 250640 248516 247292 247431 248497 249559 249883 249367 248504 247931 247862 248035 248246 248683 249473 250202 250335
54499 250335 250013 249974 250606 251403 251488 250477 248834 247491 247063 247274 247251 246570 245803 245872 247028 248672 249960 250352
54481 250352 249946 249618 250466 252641 255043 256694 257995 259924 262299 263858 264082 263911 264368 265388 266401 267327
54465 267327 268339 269219 269626 269690 269780 269911 269871 269819 270296 271631 273600 275610 277004 277417 277096 276748 276813 277021 276866
54446 276866 276312 275709 275160 274362 273034 271179 268975 266767 265150 264607 264873 264975 264186 262773 261576 261046
54430 261046 260958 260956 260964 260984 260879 260618 260520 260961 261897 262941 263850 264710 265645 266636 267662 268767 269867 270732 271285 271734
54410 271734 272269 272822 273240 273558 273901 274286 274666 275066 275524 275997 276476 277067 277851 278752 279651 280533 281456 282515
54392 282515 283872 285608 287475 289044 290191 291227 292429 293675 294714 295486 295967 295968 295378 294438 293577 293142
54376B93142K54J077J610J447P54R4l02n47n25L5R21J575J932K418L035L215K848
54359C12983K613K929L345L364L186L070K714J907J184J098J301J070L90k61r26
54344C39967k083l645m802m986m459l783l199k702k356k310k627l165l543l291
54330B93016k251q98l8j39q69j349r40P0O98K77q14j685j892j581r28o1N59M13
54312B81588l06q20q12o93p20n68j23M8m35j043j081p00n49p31p97n44k55j44
54294B71315l4L23Q85J268J077L87j24J22Q26J159R07O99R36J226J126P68L68
54277B83234j91q04q84k24M21L06k87o14n41l83j32L30O68N54L72O41R91O74p9
54258B84052j61Q28J970K252J717J109R51J235J678J942J758J020k39j746k813
$$ plain form
54376 293142 293396 294473 296083 297530 298284 298378 298076 297529 297004 297039 297960 299535 301467 303885 306920 310135 312983
54359 312983 315596 318525 321870 325234 328420 331490 334204 336111 337295 338393 339694 340764 341154 340893 339967
54344 339967 337884 334239 329437 324451 319992 316209 313010 310308 307952 305642 303015 299850 296307 293016
54330 293016 290765 289867 289829 289690 288821 287472 286532 286602 287300 287577 286763 285078 283186 281605 280677 280616 281175 281588
54312 281588 281282 280462 279650 278957 278237 277669 277546 277594 277159 276116 275035 274335 273786 273055 272258 271714 271459 271315
54294 271315 271281 271604 272489 273757 274834 275221 275097 275219 276045 277204 278111 278810 279746 280972 282098 282866 283234
54277 283234 283043 282239 281355 281131 281552 281858 281571 280957 280416 280033 279901 280231 280899 281453 281825 282466 283457 284131 284052
54258 284052 283891 284719 286689 288941 290658 291767 292718 293953 295631 297573 299331 300351 300112 298366 295553
54243B95553k638j249J91N21j64q85j163j320j547j447p43J87P67Q54O75M54K38
54226B88284L0q7J23Q33J728K046J367K35l85j66L54N11J43m55q38p07j78K62
54208B93100K39j62o26r60j009n78K07P61O79K75J05K16K85K60K69K14n3l07k67
54189B92648j54l65p06n92O6P11Q90N99Mo53r05m96pl05j290j848j326l98p9m40
54169B85354p88p07m08j60Q4M13O56M81k01j064j650j772j520r83k50K94J68m83
54151B77464p51q4Q53R33L9q68r90m25M12J336K160K479K143J658J647K031K142
54134B92179J670J167J378K183K662K331J870K126K690K316P80n94o46J63O19
54119C12894M33K01K04J80J40M31R72J134N97k52r26j241j046j16J350K520K574
$$ plain form
54243 295553 292915 291666 291857 292378 292214 291329 290166 288846 287299 285852 285109 285296 286063 286917 287592 288046 288284
54226 288284 288314 288227 288350 289183 290911 292957 294324 294559 294174 294008 294362 294873 295016 294561 293723 293016 292838 293100
54208 293100 293339 293177 292551 291591 290582 290004 290211 290972 291651 291926 292031 292247 292532 292792 293061 293275 293222 292915 292648
54189 292648 292494 292129 291423 290831 290897 291608 292498 293097 293101 292448 291543 291047 291040 290735 289445 287597 286271 285873 285794 285354
54169 285354 284566 283859 283451 283291 283375 283788 284444 284925 284724 283660 282010 280238 278718 277735 277485 277779 277947 277464
54151 277464 276713 276629 277482 278415 278454 277586 276596 276171 276583 277919 280079 282558 284701 286359 288006 290037 292179
54134 292179 293849 295016 296394 298577 301239 303570 305440 307566 310256 312572 313352 312758 312112 312275 312894
54119 312894 313327 313528 313732 313912 314052 314483 315455 316589 317186 316934 316008 314767 313721 313605 314955 317475 320049
54102C20049J534K87j55N22J716K558K761K687K656K610K558K833L532M183M321
54087C54652M043L621L119K760L086M106M908M818M438M693N253M870L053M46
54073D07866k254m805o920q195q599q370p480n928m353l449k945k131j176p98
54059C40463p57n2J220J673P73k33k27J53j57o93j18J640L149L356K753K568L334
54042C58845M536N357N543N538N823O344O842P423Q312R210R601R629R941J0551
54028D63495J0719J0162R556R457R436Q838P762O730N800M589K882Q40j137k520
54014E46609k959k718k411k170j589o53j04n22j630k793l729m374m628m695n172
53999E06462o308p553q193q066p411o595o199o650p358p054n471l927l526l649
$$ plain form
54102 320049 321583 321870 321715 322237 323953 326511 329272 331959 334615 337225 339783 342616 346148 350331 354652
54087 354652 358695 362316 365435 368195 371281 375387 380295 385113 389551 394244 399497 404367 407420 407866
54073 407866 405612 400807 393887 385692 377093 368723 361243 355315 350962 347513 344568 342437 341261 340463
54059 340463 339706 339654 340874 342547 343320 343087 342860 343013 342856 342163 342045 343685 346834 350190 352943 355511 358845
54042 358845 363381 368738 374281 379819 385642 391986 398828 406251 414563 423773 433374 443003 452944 463495
54028 463495 474214 484376 493932 503389 512825 521663 529425 536155 541955 546544 549426 550266 549129 546609
54014 546609 543650 540932 538521 536351 534762 534109 534005 533483 531853 529060 525331 520957 516329 511634 506462
53999 506462 500154 492601 484408 476342 468931 462336 456137 449487 442129 435075 429604 425677 422151 418502
53985D18502l161k312k203k828l069k552k156k433k701k214j364j033j337j649
53971C87490j552j260j165j330j435j156o63o14j376k330k377j239J51P97P99
53956C72740J028J939L127L928M089L813L510L617M343N442O312O592O468O293
53942D33241O168O077O270O999P992Q626Q748Q846R335J0045J0551J0629J0192
53929E43719R385Q845R265J0349J0896J0411R935J0671J2446J4281J5728J6612
53917F82543J6026J2958P837K309k477o359r033r794q624o488m152j664Q28K723
53903F76633L820M549N066N021M554M413M640M260K825J237L26l91j686l303m635
53888G07329n844p249q246q073p234o985p643q406q803r273j0205j1282j2001
$$ plain form
53985 418502 415341 413029 410826 407998 404929 402377 400221 397788 395087 392873 391509 390476 389139 387490
53971 387490 385938 384678 383513 382183 380748 379592 378929 378315 376939 374609 372232 370993 371144 371941 372740
53956 372740 373768 375707 378834 382762 386851 390664 394174 397791 402134 407576 413888 420480 426948 433241
53942 433241 439409 445486 451756 458755 466747 475373 484121 492967 502302 512347 522898 533527 543719
53929 543719 553104 561949 571214 581563 592459 602870 612805 623476 635922 650203 665931 682543
53917 682543 698569 711527 719364 721673 719196 712837 703804 694010 685386 678898 674746 673082 673910 676633
53903 676633 680453 685002 690068 695089 699643 704056 708696 712956 715781 717018 717344 716953 715267 711964 707329
53888 707329 701485 694236 685990 677917 670683 663698 656055 647649 638846 629573 619368 608086 596085
53875E96085j2209j1954j1272j0354r670r564r838r783q856p412o502o558o661
53862D75452n818m620m545n640o277n619m838n103n666n268m279m009m462m409
53848D04899l462k582k462k606k336j707j160r53j172j682j952j546q65p81j471
53833C78162k145k083j401o69k15O5M39J012J490J396O98nk11q1K4J04K40K51
53815C77071J24L87J352K376K569J987J377J080R68J223K200L559M395M385M135
53800D09188M239M625M955N145N332N670O286P112P847Q298Q595Q816Q736Q279
53786E03123P789P383O577N109L653K901K457J521K69m47n51q18j574k389l047
53771E31956l889n028o068o715o949o662n933n539o222p411p723o824n782n397
$$ plain form
53875 596085 583876 571922 560650 550296 540626 531062 521224 511441 502585 495173 488671 482113 475452
53862 475452 469634 465014 460469 454829 448552 442933 438095 432992 427326 422058 417779 413770 409308 404899
53848 404899 401437 398855 396393 393787 391451 389744 388584 387631 386459 384777 382825 381279 380414 379633 378162
53833 378162 376017 373934 372533 371864 371649 371714 372153 373165 374655 376051 376749 376744 376533 376452 376476 376580 376820 377071
53815 377071 377195 377582 378934 381310 383879 385866 387243 388323 389291 390514 392714 396273 400668 405053 409188
53800 409188 413427 418052 423007 428152 433484 439154 445440 452552 460399 468697 477292 486108 494844 503123
53786 503123 510912 518295 524872 529981 533634 536535 538992 540513 540782 540335 539784 538966 537392 535003 531956
53771 531956 528067 523039 516971 510256 503307 496645 490712 485173 478951 471540 463817 456993 451211 445814
53757D45814n340n203n255n583n563m854m077l797l636l075k457k349k502k265
53743C89858j677j294j218j015n97m08o90j053j017o24l28l85n35l92j7J05k24
53726C78489n60m54j16p4l98p30q85q20k96Q23J952K327K076K043K409K410J582
53709C89778N72K65Q04J797K916L872M245L870L057K274J840J993K743L546L702
53694D27274L285L119L639M366M765M857M683L898K455J112O59R52J204R79M57
53679D67704L2l0K93P31R42R19Q15M42m85j570j914j385q98j075j368j102n96
53662D61455n25p37n42J08N53M37O6r7J60P77J366J387Q16L32L81M65n2p61p10
53643D64879J13O55K71m84p65m81k2M44R90J459J542J229R19J005J469J900J859
$$ plain form
53757 445814 440474 435271 430016 424433 418870 414016 409939 406142 402506 399431 396974 394625 392123 389858
53743 389858 388181 386887 385669 384654 384057 383649 382959 381906 380889 380265 379937 379552 379017 378625 378608 378713 378489
53726 378489 377929 377475 377359 377285 376887 376157 375272 374452 374156 374979 376931 379258 381334 383377 385786 388196 389778
53709 389778 390350 390615 391419 393216 396132 400004 404249 408119 411176 413450 415290 417283 420026 423572 427274
53694 427274 430559 433678 437317 441683 446448 451305 455988 459886 462341 463453 464112 465064 466268 467247 467704
53679 467704 467736 467706 467999 468730 469672 470591 471406 471848 471363 469793 467879 466494 465596 464521 463153 462051 461455
53662 461455 460930 460193 459651 459759 460312 460749 460815 460718 460878 461655 463021 464408 465224 465556 465937 466402 466350 465589 464879
53643 464879 464992 465647 465918 465434 464669 464188 464166 464610 465600 467059 468601 469830 470749 471754 473223 475123 476982
53626D76982J348Q88J074J928K806L038K639K292K573L349L944L897L429L141
53612E13328L380L928M181L720K834K434L145M523N489N627N488N565N610N354
53598E74606N179N444N682N311M748M869N533N674M806L569K706K350K484L144
53584F36105L881L817K677J138j41j216k288l154l613l883m192m466m681n018
53570F14966n355n178m327l267k367j545q67q03j447k132k258j943j504r18k38
53555E80817J61K67O68J513J928J191j18q35o15J01R95J934K488K314J810J708
53539E96327K146K709L176L639M028M118L946L796L927M543N723P067P861Q009
53525F61015Q274R121R957J0179J0349J1486J3537J5481J6697J7432J8064J8706
$$ plain form
53626 476982 478330 479218 480292 482220 485026 488064 490703 492995 495568 498917 502861 506758 510187 513328
53612 513328 516708 520636 524817 528537 531371 533805 536950 541473 546962 552589 558077 563642 569252 574606
53598 574606 579785 585229 590911 596222 600970 605839 611372 617046 621852 625421 628127 630477 632961 636105
53584 636105 639986 643803 646480 647618 647477 646261 643973 640819 637206 633323 629131 624665 619984 614966
53570 614966 609611 604433 600106 596839 594472 592927 592060 591257 589810 587678 585420 583477 581973 581055 580817
53555 580817 580978 581245 581913 583426 585354 586545 586427 585592 584977 585078 586073 588007 590495 592809 594619 596327
53539 596327 598473 601182 604358 607997 612025 616143 620089 623885 627812 632355 638078 645145 653006 661015
53525 661015 669289 678410 688367 698546 708895 720381 733918 749399 766096 783528 801592 820298
53513H20298J9450K0326K1097K1657K2430K3826K5514K6893K7932K8854K9342
53502A087619K8929K8029K7678K8315K9460L0502L1077L0874K9896K8849K8462
53491A409690K8542K8463K8368K8851K9602K9612K8845K8448K8904K9154K8197
53480A726676K6602K5599K5387K5142K4298K3081K2034K1497K1417K1302K0588
53469A983623J9270J7898J6723J5316J3218J0565P773N010K377J00j872m128p117
53456B078756j0421j3200j5208j6911j8644k0139k0956k1079k0907k0879k1216
53445A879196k1882k2683k3440k4131k4790k5183k4840k3629k2250k1697k1966
53434A622705k1787k0040j7181j4602j2797j0976q483n706l292j340J86J087J564
$$ plain form
53513 820298 839748 860074 881171 902828 925258 949084 974598 1001491 1029423 1058277 1087619
53502 1087619 1116548 1144577 1172255 1200570 1230030 1260532 1291609 1322483 1352379 1381228 1409690
53491 1409690 1438232 1466695 1495063 1523914 1553516 1583128 1611973 1640421 1669325 1698479 1726676
53480 1726676 1753278 1778877 1804264 1829406 1853704 1876785 1898819 1920316 1941733 1963035 1983623
53469 1983623 2002893 2020791 2037514 2052830 2066048 2076613 2084386 2089396 2091773 2091873 2090001 2085873 2078756
53456 2078756 2068335 2055135 2039927 2023016 2004372 1984233 1963277 1942198 1921291 1900412 1879196
53445 1879196 1857314 1834631 1811191 1787060 1762270 1737087 1712247 1688618 1666368 1644671 1622705
53434 1622705 1600918 1580878 1563697 1549095 1536298 1525322 1516839 1511133 1507841 1506501 1506687 1507774 1509338
53421A509338K461M153N930P244Q745J1138J3717J5327J6245J7679J9753K1481
53409A653211K2702K4451K7061K9416L0636L1387L2777L4965L7506M0191M2853
53398B007156M5081M6848M8795N1286N3805N5875N7871O0311O2830O4641O5633
53387B620132O6323O7100O8045O9186P0350P1070P1099P0764P0407O9832O8710
53376C383018O7077O4975O2058N8152N3762M9428M4948L9930L4729K9981K5460
53365C913518K0247J4056P640J721l801r409j5331k1597k8246l5090m1604m7367
53353C754737n2529n7464o2066o5529o7075o6819o5842o5212o5057o4745o3781
53342C058618o2256o0394n8323n6351n4990n4345n3869n3073n2119n1361n0671
$$ plain form
53421 1509338 1511799 1515952 1521882 1529126 1537871 1549009 1562726 1578053 1594298 1611977 1631730 1653211
53409 1653211 1675913 1700364 1727425 1756841 1787477 1818864 1851641 1886606 1924112 1964303 2007156
53398 2007156 2052237 2099085 2147880 2199166 2252971 2308846 2366717 2427028 2489858 2554499 2620132
53387 2620132 2686455 2753555 2821600 2890786 2961136 3032206 3103305 3174069 3244476 3314308 3383018
53376 3383018 3450095 3515070 3577128 3635280 3689042 3738470 3783418 3823348 3858077 3888058 3913518
53365 3913518 3933765 3947821 3955461 3957182 3953381 3943972 3928641 3907044 3878798 3843708 3802104 3754737
53353 3754737 3702208 3644744 3582678 3517149 3450074 3383255 3317413 3252201 3187144 3122399 3058618
53342 3058618 2996362 2935968 2877645 2821294 2766304 2711959 2658090 2605017 2552898 2501537 2450866
53331B450866m9715m8479m7012m4917m1804l8136l4911l2462l0197k7705k5500
53320B030028k4310k3987k3591k2480k0997k0035k0074k0705k1041k0531j9286
53309A792991j7746j6161j4592j3134j1900j0726r143o771l773p76J694L710N767
53296A699440Q038J0063J1401J2420J3985J6416J9165K1589K3633K5492K7072
53285A888714K8057K8340K8111K7731K7596K7901K8341K8330K7658K6607K5351
53274B192737K3722K1720J9727J7817J5341J1756P522L639N12k253n126q208j1368
53261B287538j4410j7181j9842k2830k6199k9305l1597l3390l5275l7058l8035
53250A982416l8111l7929l7865l7647l7078l6481l6175l6039l5783l5184l4007
$$ plain form
53331 2450866 2401151 2352672 2305660 2260743 2218939 2180803 2145892 2113430 2083233 2055528 2030028
53320 2030028 2005718 1981731 1958140 1935660 1914663 1894628 1874554 1853849 1832808 1812277 1792991
53309 1792991 1775245 1759084 1744492 1731358 1719458 1708732 1699589 1692818 1689045 1688269 1689963 1693673 1699440
53296 1699440 1707478 1717541 1728942 1741362 1755347 1771763 1790928 1812517 1836150 1861642 1888714
53285 1888714 1916771 1945111 1973222 2000953 2028549 2056450 2084791 2113121 2140779 2167386 2192737
53274 2192737 2216459 2238179 2257906 2275723 2291064 2302820 2310342 2313981 2314493 2312240 2307114 2298906 2287538
53261 2287538 2273128 2255947 2236105 2213275 2187076 2157771 2126174 2092784 2057509 2020451 1982416
53250 1982416 1944305 1906376 1868511 1830864 1793786 1757305 1721130 1685091 1649308 1614124 1580117
53239A580117l2249l0579k9930l0438l1238l1551l1402l1128l0796l0411l0039
53228A240356k9381k7833k5457k3262k2001k1225k0132j8781j7710j6782j5457
53217A002335j3981j3321j3794j4603j4973j5043j5335j5986j6839j7852j8948
53206H31660j9786j9989j9426j8216j6674j5391j4879j4939j4683j3477j1615
53195F52585r941r068r089r681j0203j0127r570r162r156r133q737q170p635o912
53181E26001n935n212m990m644l684k798k911l589l579k754k208k389k520k184
53167D76604k092k616k920k395j945k620l835m145l283k206j537j172j152j635
53153D43051k078j679p94p08j708k531k135j078m99n58o53n52n37p18r10r82r14
$$ plain form
53239 1580117 1547868 1517289 1487359 1456921 1425683 1394132 1362730 1331602 1300806 1270395 1240356
53228 1240356 1210975 1183142 1157685 1134423 1112422 1091197 1071065 1052284 1034574 1017792 1002335
53217 1002335 988354 975033 961239 946636 931663 916620 901285 885299 868460 850608 831660
53206 831660 811874 791885 772459 754243 737569 722178 707299 692360 677677 664200 652585
53195 652585 642644 633576 624487 614806 604603 594476 584906 575744 566588 557455 548718 540548 532913 526001
53181 526001 520066 514854 509864 505220 501536 498738 495827 492238 488659 485905 483697 481308 478788 476604
53167 476604 474512 471896 468976 466581 464636 462016 458181 454036 450753 448547 447010 445838 444686 443051
53153 443051 440973 439294 438500 437792 436084 433553 431418 430340 429841 429283 428630 428078 427541 426823 425913 424931 424017
53136D24017o16n2N56R27R78P53L74K12O57J504J968J657J149J248J960K616K674
53119D42582K066J096M44Q32K163L257L138K310K000K315K052N39j275k108j937
53104D59474j678j707j666j563k034l178l986l555k377j643j601j492j026q92
53090D31076j416j709r32K51N18k31q36o58k89l06l81r2K23J46MK88O86M87k60
53071D26569p17l43N84J454J814J397K27j149j928j809j223p85p00p80p83o26
53055D21202m44n04q50j116q10M0Q16R17L91j94l77k04j4j7r9m0K46O46R72J069
53035D21630R42Q03Q89J130J173Q11K88r9l54m96j69R15K240K780K244J401J039
53018D37167J045Q96N91O10J118J651J601Q38j66p02m72J20M88N64P38J131J435
$$ plain form
53136 424017 423401 423349 423905 424832 425810 426563 426937 427149 427806 429310 431278 432935 434084 435332 437292 439908 442582
53119 442582 444648 445744 446188 447020 449183 452440 455578 457888 459888 462203 464255 464794 463519 461411 459474
53104 459474 457796 456089 454423 452860 450826 447648 443662 440107 437730 436087 434486 432994 431968 431076
53090 431076 429660 427951 427019 427270 427788 427557 426721 426063 425774 425468 425087 424995 425218 425364 425368 425656 426342 426829 426569
53071 426569 425852 425509 426093 427547 429361 430758 430985 429836 427908 426099 424876 424091 423391 422611 421828 421202
53055 421202 420758 420254 419404 418288 417478 417518 418334 419251 419642 419448 419071 418867 418853 418836 418737 418697 418943 419589 420561 421630
53035 421630 422572 423375 424264 425394 426567 427378 427666 427567 427213 426717 426548 427463 429703 432483 434727 436128 437167
53018 437167 438212 439108 439699 440309 441427 443078 444679 445517 445351 444649 444177 444297 444785 445349 446087 447218 448653
53001D48653J493J518J545J244O06K53O27J289J472J048M74J75L48J099K180K899
52985D66923K813K330K189K558L057L407L456K837J323n13j687j887j666j454
52971D83686j036j61Q93J633J869J688J214O81M96R72J967K894L089K299R68p1
52955E03081l67k16q6J2K73M56Jj153k333k846k639k194j972k028k018j609r45
52938D83417n67p22j082j310j551j913j941j241l57k35q81j348j119o87n61m97
52922D67405j57J23j78r25j527j747j761j606j030J6J068J486J004Np60p66r8
52905D60552P33J293J463J299R56O24L97J50k23n79p45q03q71p60k96J60N4n63
52887D62841j045j042q16o66n36l36j18J87P32J261J188M46k30j85M37J126J725
$$ plain form
53001 448653 450146 451664 453209 454453 455059 455312 455939 457228 458700 459748 460222 460397 460745 461844 464024 466923
52985 466923 469736 472066 474255 476813 479870 483277 486733 489570 490893 490380 488693 486806 485140 483686
52971 483686 482650 482489 483382 485015 486884 488572 489786 490467 490963 491935 493902 496796 499885 502184 503152 503081
52955 503081 502714 502498 502412 502424 502697 503153 503154 502001 499668 496822 494183 491989 490017 487989 485971 484362 483417
52938 483417 482850 482128 481046 479736 478185 476272 474331 473090 472733 472498 471617 470269 469150 468463 467902 467405
52922 467405 467248 467371 467193 466268 464741 462994 461233 459627 458597 458613 459681 461167 462171 462176 461416 460650 460552
52905 460552 461285 462578 464041 465340 466296 466920 467317 467467 467244 466665 465920 465117 464246 463486 463190 463350 463404 462841
52887 462841 461796 460754 459938 459272 458736 458400 458282 458469 459201 460462 461650 462096 461866 461681 462118 463244 464969
52870D64969K316K814L025K927K631K276K129K354K531J968O97l75o88p63j249
52855D87562j886k094k058k365k930l152k966k872l037l114k973k853k719k240
52841D50303j574j427k087k975l405l295k866k260j707j568j794j816j329p30
52827D21470m49l23p8O7j38k83K20J167J729J549J063P12M13k0n01q75j159j307
52809D23257j074l36O36J458J949K100J933J525R49J06j096k353l093l189l129
52794D19643l232l131k404j367p00n23l89j07K4k00n71q05q14n73j22K80M11M93
52776D05913Q96J413J476J080Q58J039J081P00M12O09P61L38j76M4R03J703K281
52759D21331K824K853J651l16j499j101J18J147J719J737P93r03j995j388K73
$$ plain form
52870 464969 467285 470099 473124 476051 478682 480958 483087 485441 487972 489940 490637 490262 489574 488811 487562
52855 487562 485676 483582 481524 479159 476229 473077 470111 467239 464202 461088 458115 455262 452543 450303
52841 450303 448729 447302 445215 442240 438835 435540 432674 430414 428707 427139 425345 423529 422200 421470
52827 421470 421021 420698 420620 420687 420549 420266 420486 421653 423382 424931 425994 426706 427119 427099 426598 425723 424564 423257
52809 423257 422183 421847 422483 423941 425890 427990 429923 431448 432397 432503 431407 429054 425961 422772 419643
52794 419643 416411 413280 410876 409509 408809 408286 407897 407790 407814 407614 407043 406238 405424 404851 404729 405009 405420 405913
52776 405913 406809 408222 409698 410778 411636 412675 413756 414456 414868 415477 416238 416576 416400 416444 417347 419050 421331
52759 421331 424155 427008 428659 428343 426844 425743 425861 427008 428727 430464 431257 430354 428359 426971 427244
52744D27244J310R63r6q25p24J29J210J775J544J094J076J290J079M78J71L85
52728D38103O03N49O39J187J797K040K187K687L280L219K311J224O96P22P06K28
52712D62178n28j100j422j859k502k715j887m46M30J90n11q29p21n42k38L85R13
52695D48796O78k00q07n90J9L57L57M03P47J353J978K250K001J683J985K737K800
52678D66547J492l51j367j347j138j216j266j145j218j486j276l94K66j52j154
52663D54795j548j006l01j47m61p43n64K83J582K602K716K222K046K525K958K594
52647D69553J639R19Q74J264J680J997K328K658K674J984O24p52j426j392j258
52632D83366j327j219n52L71R63J133J279J594J801J641J215O58j56j318k484
$$ plain form
52744 427244 428554 429517 429421 428596 427872 428001 429211 430986 432530 433624 434700 435990 437069 437547 437718 438103
52728 438103 438706 439255 439894 441081 442878 444918 447105 449792 453072 456291 458602 459826 460522 461244 461950 462178
52712 462178 461650 460550 459128 457269 454767 452052 450165 449719 450149 450339 449828 448999 448278 447736 447498 447883 448796
52695 448796 449474 449274 448467 447877 447896 448253 448610 449013 449760 451113 453091 455341 457342 459025 461010 463747 466547
52678 466547 468039 467688 466321 464974 463836 462620 461354 460209 458991 457505 456229 455835 456101 455949 454795
52663 454795 453247 452241 451940 451793 451332 450589 450025 450308 451890 454492 457208 459430 461476 464001 466959 469553
52647 469553 471192 472111 472985 474249 475929 477926 480254 482912 485586 487570 488194 487442 486016 484624 483366
52632 483366 482039 480820 480268 480639 481602 482735 484014 485608 487409 489050 490265 490923 490767 489449 486965
52617D86965l111l142l129l497l960l892l172k264j488o90J43M84mo15k02J277
52601D59703K496K348J254M26L09L73K82L50P08Q12K95j80L04J516K185J606N05
52584D75292KK39M88K59j95l33J04R00J390R72q6o20L8J047J119L74Q6O38R47
52565D82661L54k04K05Q45M02q97j598j158n32n70j001j246j299j430j618j674
52549D71240j478j015n30n95j373k048j694p06l13p03p59O4Q12O40J97M50J085
52532D63274J138O76O11J255K069K722L336L688L214J993R07N91R00J507K336
52517D90217L144L435L221L213L813M420M299L741L620M082M307L610K174N19
52503E37815j193l026m748n883o248o096n706n094m258l438k929k686k377j799
$$ plain form
52617 486965 483854 480712 477583 474086 470126 466234 463062 460798 459310 458620 458763 459247 459243 458628 458426 459703
52601 459703 462199 464547 465801 466227 466536 466909 467191 467541 468249 469061 469356 469176 469480 470996 473181 474787 475292
52584 475292 475294 475533 476021 476280 476085 475752 475856 476756 478146 479118 479032 478412 478450 479497 480616 480990 481076 481714 482661
52565 482661 483015 482811 483016 483861 484263 483366 481768 480610 480078 479508 478507 477261 475962 474532 472914 471240
52549 471240 469762 468747 468217 467622 466249 464201 462507 461801 461488 460785 460026 460090 460902 461542 461739 462189 463274
52532 463274 464412 465088 465699 466954 469023 471745 475081 478769 481983 483976 484883 485474 486374 487881 490217
52517 490217 493361 496796 500017 503230 507043 511463 515762 519503 523123 527205 531512 535122 537296 537815
52503 537815 536622 533596 528848 522965 516717 510621 504915 499821 495563 492125 489196 486510 484133 482334
52489D82334j101n82m73p86j197j041Q6J661K561K320J697J642K068K178J802
52474D93169J656K232L015L236K872K480K326K237K127K202K536K841K805K361
52460E28095J535L86q50j849k645l631m859n633n324m359l887m419n252n345m409
52445D77554k980j754j079r13j026j234j498j677j421n70M02P30K27n43j021j169
52429D62028j219j289j422j561j439q57j01L73O37J052J411J181O50P38J391J369
52413D62942K77m80L41K039L341M404N971P416P494O565O167O637O933O881P559
52398E34487R117J0105R698Q950Q945R222R028Q823R251R586Q476N582J575k832
52384F40013o953r882j1159j1225j0469q531n355k226o41n61p78o32l52l1N99
$$ plain form
52489 482334 481233 480651 480178 479392 478195 477154 477240 478901 481462 483782 485479 487121 489189 491367 493169
52474 493169 494825 497057 500072 503308 506180 508660 510986 513223 515350 517552 520088 522929 525734 528095
52460 528095 529630 530016 529166 527317 524672 521041 516182 510549 505225 500866 496979 492560 487308 481963 477554
52445 477554 474574 472820 471741 470828 469802 468568 467070 465393 463972 463402 463804 464534 464761 464218 463197 462028
52429 462028 460809 459520 458098 456537 455098 454241 454140 454513 455150 456202 457613 458794 459444 460182 461573 462942
52413 462942 463219 462739 463080 465119 468460 472864 478835 486251 493745 500310 506477 513114 520047 526928 534487
52398 534487 543604 553709 563407 572357 581302 590524 599552 608375 617626 627212 635688 641270 642845 640013
52384 640013 633060 623178 612019 600794 590325 581794 576439 574213 573572 573011 572233 571601 571249 571218 571817
52369E71817J402J745J288K32j098k454l491l981m075l948l432k403j203k38M74
52354E50635R55J004P52Q78J655K361K369K191K566L155L173K878L177M032M455
52339E86236M075L568L483L626L741L869L943L815L883M805O427P721Q040P777
52325F55009P684Q118Q961R646R277P555N544M724N216N810N839N916O598P441
52311G53338P932Q481R729J1498J3168J4563J5852J6947J7669J8287J9270K0582
52299I27316K1687K2278K2546K2702K2460K1237J8919J6343J4773J4760J5662
52288A140683J6486J6968J7509J8360J9358K0367K1412K2345K2833K2714K2217
52277A361252K1789K1850K2443K2874K2173K0398J8970J8967J9497J8765J6522
$$ plain form
52369 571817 573219 574964 576252 576484 575386 572932 569441 565460 561385 557437 554005 551602 550399 550161 550635
52354 550635 551590 552594 553346 554224 555879 558240 560609 562800 565366 568521 571694 574572 577749 581781 586236
52339 586236 590311 593879 597362 600988 604729 608598 612541 616356 620239 625044 631471 639192 647232 655009
52325 655009 662693 670811 679772 689418 698695 706250 711794 716518 721734 727544 733383 739299 745897 753338
52311 753338 761270 769751 779480 790978 804146 818709 834561 851508 869177 887464 906734 927316
52299 927316 949003 971281 993827 1016529 1038989 1060226 1079145 1095488 1110261 1125021 1140683
52288 1140683 1157169 1174137 1191646 1210006 1229364 1249731 1271143 1293488 1316321 1339035 1361252
52277 1361252 1383041 1404891 1427334 1450208 1472381 1492779 1511749 1530716 1550213 1568978 1585500
52266A585500J4361J3507J3402J2857J1581J0078Q671P315N959M667L531K685
52254A694114K120J442K53j218k289k719k896l091l098k757k194j360Q8K160M292
52239A682847O044P604R374J1355J3209J4593J5352J5696J6187J7220J8488J9359
52227A847328J9654J9639J9421J8962J8520J8327J7953J6763J4943J3272J1881
$$ plain form
52266 1585500 1599861 1613368 1626770 1639627 1651208 1661286 1669957 1677272 1683231 1687898 1691429 1694114
52254 1694114 1696234 1697676 1697929 1696711 1694422 1691703 1688807 1685716 1682618 1679861 1677667 1676307 1676395 1678555 1682847
52239 1682847 1688891 1696495 1705869 1717224 1730433 1745026 1760378 1776074 1792261 1809481 1827969 1847328
52227 1847328 1866982 1886621 1906042 1925004 1943524 1961851 1979804 1996567 2011510 2024782 2036663
$$ [...]
##END NTUPLES=NMR SPECTRUM
##END=
