
##TITLE=AC1233_PERAH12114_6519287_kQ2xMY586G
##JCAMPDX= 6.0         $$ Bruker NMR JCAMP-DX V2.0
##DATA TYPE= NMR SPECTRUM
##DATA CLASS= NTUPLES
##ORIGIN= BRUKER
##OWNER= Administrator
$$ 1.72 TOPSPIN		Version 2.1
$$ 2012-07-13 18:40:09.078 -0500  Administrator@TOPSPIN
$$ Compression mode = diff/dup
##.OBSERVE FREQUENCY= 400.02188249412
##.OBSERVE NUCLEUS= ^1H
##.ACQUISITION MODE= SIMULTANEOUS (DQD)
##.ACQUISITION SCHEME= undefined
##.AVERAGES= 8
##.DIGITISER RES= 22
##SPECTROMETER/DATA SYSTEM= spect
##.PULSE SEQUENCE= zg30
##.SOLVENT NAME= COFFEE_meoh
##.SHIFT REFERENCE= INTERNAL, COFFEE_meoh, 1, 14.98509
##AUDIT TRAIL= $$ (NUMBER, WHEN, WHO, WHERE, PROCESS, VERSION, WHAT)
$$ ##TITLE= Audit trail, TOPSPIN		Version 2.1
$$ ##JCAMPDX= 5.01
$$ ##ORIGIN= Bruker BioSpin GmbH
$$ ##OWNER= Administrator
$$ $$ C:\Bruker\TOPSPIN/data/COFFEE/nmr/AC1233_PERAH12114_6519287_kQ2xMY586G/90/pdata/1/auditp.txt
$$ ##AUDIT TRAIL=  $$ (NUMBER, WHEN, WHO, WHERE, PROCESS, VERSION, WHAT)
(   1,<2012-07-13 18:40:02.250 -0500>,<Administrator>,<TOPSPIN>,<go>,<TOPSPIN 2.1>,
      <created by zg
	started at 2012-07-13 18:38:55.343 -0500,
	POWCHK enabled, PULCHK disabled,
       configuration hash MD5:
       6B 1B 68 BB D9 2E 58 E2 7F 35 AD 54 07 DF 0E 41
       data hash MD5: 64K
       07 16 54 57 74 41 4A 1B 68 C9 FF 36 5A 5A 62 47>)
(   2,<2012-07-13 18:40:04.843 -0500>,<Administrator>,<TOPSPIN>,<proc1d>,<TOPSPIN 2.1>,
      <Start of raw data processing
       efp LB = 0 FT_mod = 6 PKNL = 1 PHC0 = 0 PHC1 = 0 SI = 32K 
       data hash MD5: 32K
       F9 47 5B EF 53 8C CF B0 76 14 26 32 B2 E5 05 AE>)
(   3,<2012-07-13 18:40:05.156 -0500>,<Administrator>,<TOPSPIN>,<proc1d>,<TOPSPIN 2.1>,
      <pk PHC0 = 178.8519 PHC1 = 0 
       data hash MD5: 32K
       F6 E6 18 93 63 D2 4B 7E B9 00 86 0C 87 14 53 FF>)
(   4,<2012-07-13 18:40:05.296 -0500>,<Administrator>,<TOPSPIN>,<proc1d>,<TOPSPIN 2.1>,
      <abs ABSG = 1 
       data hash MD5: 32K
       61 92 99 F2 BB 5C BB AA AD C1 41 75 3D EC 79 DC>)
(   5,<2012-07-13 18:40:05.375 -0500>,<Administrator>,<TOPSPIN>,<proc1d>,<TOPSPIN 2.1>,
      <abs ABSG = 2 
       data hash MD5: 32K
       FC 82 30 74 5D 90 80 95 53 7F EB C6 C5 ED 56 23>)
(   6,<2012-07-13 18:40:05.453 -0500>,<Administrator>,<TOPSPIN>,<proc1d>,<TOPSPIN 2.1>,
      <abs ABSG = 3 
       data hash MD5: 32K
       EC 84 8E 19 EC DE B2 45 F2 DB E9 A8 5E C9 D0 DA>)
(   7,<2012-07-13 18:40:05.484 -0500>,<Administrator>,<TOPSPIN>,<proc1d>,<TOPSPIN 2.1>,
      <abs ABSG = 4 
       data hash MD5: 32K
       F1 34 8E 14 BA 9F 4B B8 C1 6E 78 58 03 61 B0 81>)
(   8,<2012-07-13 18:40:05.515 -0500>,<Administrator>,<TOPSPIN>,<proc1d>,<TOPSPIN 2.1>,
      <abs ABSG = 5 
       data hash MD5: 32K
       7D F4 51 96 4A 98 E1 91 3E 83 41 ED 1D 90 13 82>)
$$ ##END=
$$ 
$$ $$ hash MD5
$$ $$ 78 59 91 A1 7D D5 1D 2C 2E 2D 9D 04 06 06 22 7E
##$RELAX= 
##$RELAX= 
##$RELAX= 
##$RELAX= 
##$RELAX= 
##$RELAX= 
##$RELAX= 
##$RELAX= 
$$ Bruker specific parameters
$$ [...]
##$TP= (0..7)
150 150 150 150 150 150 150 150
##$TP07= 0
##$TPNAME0= <>
##$TPNAME1= <>
##$TPNAME2= <>
##$TPNAME3= <>
##$TPNAME4= <>
##$TPNAME5= <>
##$TPNAME6= <>
##$TPNAME7= <>
##$TPOAL= (0..7)
0.5 0.5 0.5 0.5 0.5 0.5 0.5 0.5
##$TPOFFS= (0..7)
0 0 0 0 0 0 0 0
##$TUNHIN= 0
##$TUNHOUT= 0
##$TUNXOUT= 0
##$USERA1= <user>
##$USERA2= <user>
##$USERA3= <user>
##$USERA4= <user>
##$USERA5= <user>
##$V9= 5
##$VALIST= <valist>
##$VCLIST= <CCCCCCCCCCCCCCC>
##$VD= 0
##$VDLIST= <DDDDDDDDDDDDDDD>
##$VPLIST= <PPPPPPPPPPPPPPP>
##$VTLIST= <TTTTTTTTTTTTTTT>
##$WBST= 2048
##$WBSW= 25
##$XGAIN= (0..3)
0 0 0 0
##$XL= 0
##$YL= 0
##$YMAX_a= 515681
##$YMIN_a= -658428
##$ZGOPTNS= <>
##$ZL1= 120
##$ZL2= 120
##$ZL3= 120
##$ZL4= 120
##$ABSF1= 14.98509
##$ABSF2= -5.573092
##$ABSG= 5
##$ABSL= 3
##$ALPHA= 0
##$AQORDER= 0
##$ASSFAC= 0
##$ASSFACI= 0
##$ASSFACX= 0
##$ASSWID= 0
##$AUNMP= <proc_prof1d_extract_pilot.lims>
##$AXLEFT= 0
##$AXNAME= <>
##$AXNUC= <1H>
##$AXRIGHT= 0
##$AXTYPE= 0
##$AXUNIT= <>
##$AZFE= 0.1
##$AZFW= 0.1
##$BCFW= 0
##$BC_mod= 0
##$BYTORDP= 0
##$COROFFS= 0
##$CY= 15
##$DATMOD= 1
##$DC= 0
##$DFILT= <>
##$DTYPP= 0
##$F1P= 0
##$F2P= 0
##$FCOR= 0.5
##$FTSIZE= 32768
##$FT_mod= 6
##$GAMMA= 0
##$GB= 0
##$INTBC= 1
##$INTSCL= 1
##$ISEN= 128
##$LB= 0
##$LEV0= 0
##$LPBIN= 0
##$MAXI= 10000
##$MC2= 0
##$MEAN= 0
##$ME_mod= 0
##$MI= 0
##$NCOEF= 0
##$NC_proc= -8
##$NLEV= 6
##$NOISF1= 0
##$NOISF2= 0
##$NSP= 0
##$NTH_PI= 0
##$NZP= 0
##$OFFSET= 14.98509
##$PC= 1
##$PHC0= 178.8519
##$PHC1= 0
##$PH_mod= 1
##$PKNL= yes
##$PPARMOD= 0
##$PPDIAG= 0
##$PPIPTYP= 0
##$PPMPNUM= 2147483647
##$PPRESOL= 1
##$PSCAL= 4
##$PSIGN= 0
##$PYNMP= <proc.py>
##$REVERSE= no
##$SF= 400.02
##$SI= 32768
##$SIGF1= 0
##$SIGF2= 0
##$SINO= 400
##$SIOLD= 32768
##$SPECTYP= <>
##$SREGLST= <1H.CDCl3>
##$SSB= 0
##$STSI= 32768
##$STSR= 0
##$SW_p= 8223.68421052631
##$SYMM= 0
##$S_DEV= 0
##$TDeff= 65536
##$TDoff= 0
##$TI= <>
##$TILT= no
##$TM1= 0
##$TM2= 0
##$TOPLEV= 0
##$USERP1= <user>
##$USERP2= <user>
##$USERP3= <user>
##$USERP4= <user>
##$USERP5= <user>
##$WDW= 1
##$XDIM= 32768
##$YMAX_p= 481127141
##$YMIN_p= -715299
##$CURPLOT= <Network HP LaserJet P1505>
##$CURPRIN= <$Network HP LaserJet P1505>
##$DFORMAT= <normdp>
##$LAYOUT= <+/1D_H.xwp>
##$LFORMAT= <normlp>
##$PFORMAT= <normpl>
##$SURQMSG= 1
$$ End of Bruker specific parameters
$$ ---------------------------------
##NTUPLES= NMR SPECTRUM
##VAR_NAME=  FREQUENCY,     SPECTRUM/REAL,   SPECTRUM/IMAG
##SYMBOL=    X,             R,               I
##VAR_TYPE=  INDEPENDENT,   DEPENDENT,       DEPENDENT
##VAR_FORM=  AFFN,          ASDF,            ASDF
##VAR_DIM=   32768,         32768,           32768
##UNITS=     HZ,            ARBITRARY UNITS, ARBITRARY UNITS
##FACTOR=    0.250966925370066, 1,           1
##FIRST=     8223.43324360094, -30862,       3904
##LAST=      0,             44384,           -227075
##MIN=       0,             -715299,         0
##MAX=       8223.43324360094, 481127141,    0
$$ Real data points
##PAGE= N=1
##DATA TABLE= (X++(R..R)), XYDATA
$$ [...]
$$ plain form
19537 -198287 -141358 -294729 -59395 -95743 344485 -127428 -68992 -126229 99863 -75311 -301846
19526 -301846 -62908 -39872 -171762 120389 126726 31260 -165739 -174977 64338 201442 -311506
19514 -36821 103102 36875 -146983 -1383 4678 -106330 -237076 -230616 -78088 36853 -139780
19502 -28968 -158511 -343074 -236009 99020 139470 -373229 31365 -13903 -23418 -107575 7717
19490 -104816 -421891 -167332 60016 221579 -269544 4176 148685 75393 31255 133880
19480 133880 -117340 -97843 -103826 -41114 -113900 -268411 158674 136438 -107553 -19832 -45188
19469 -45188 82390 185307 -7788 209552 -175678 234815 -212552 -246979 113891 -194871
19458 -267524 22923 318 174211 -123753 173813 10349 59879 -182693 -235091 34900 29463
$$ packed form
19537a98287N6929j53371e9395l6348C44485a27428N8436n7237I9863g5311k26535
19526c01846f2908K3036j31890A20389O337C1260a65739r238F4338J37104c11506
19514c6821A03102C6875a46983a383D678a06330j30746O460g8088C6853a39780
19502b8968j29543j84563J07065I9020M0450c73229C1365a3903r515q4157G717
19490a04816l17075a67332F0016J61563b69544D176J44509p3292C1255J02625
19480A33880a17340J9497n983d1114p2786j54511A58674k2236a07553a9832k5356
19469d5188H2390J02917g788B09552a75678B34815b12552l4427A13891a94871
19458b67524B2923C18J73893a23753A73813A0349M9530a82693n2398C4900n437
$$ plain form
19447 29463 33845 -266892 -56825 70388 146188 -89066 -376408 -251553 -140468 91776 148267
19436 148267 -271999 379374 -392297 -108307 168727 -248504 -62039 -57708 140756 130034
19426 130034 -82645 315331 -286072 352375 -17243 112295 167567 -313497 -113182 -60686
19416 -60686 -281370 377007 -211499 -139795 -165912 57352 15905 -138124 -59150 79444 -9835
19404 84827 -60638 -370012 -188158 94606 223977 -172428 -45463 -129059 -214468 94381 112932
19393 112932 -254099 -193957 -162619 -269841 -326276 102042 165754 104069 -241457 -248737 -88517
19381 -282322 325824 -157163 -56362 21951 -8937 8672 -49581 -176403 -295397 51019 89614
19370 89614 -107142 57718 -89849 -163095 -11632 -54007 -211525 -307906 -148847 -490723 -188965
$$ packed form
19447B9463M382b66892e6825G0388P5800h9066k87342J24855J11085I1776N6491
19436A48267b71999C79374c92297a08307A68727b48504f2039M331A40756j0722
19426A30034h2645C15331b86072C52375a7243A12295N5272c13497a13182N2496
19416f0686k20684C77007b11499P1704k6117E7352A5905a38124e9150G9444i835
19404H4827f0638l09374J81854I4606J29371a72428d5463q3596q5409I4381J8551
19393A12932b54099O0142L1338j07222n6435A02042O3712o1685b41457p280h8517
19381b82322C25824a57163e6362B1951h937H672d9581j26822j18994E1019L8595
19370H9614a07142E7718h9849p3246a1632m2375j57518r6381a48847l41876a88965
$$ plain form
19358 -245644 -83043 -37130 329176 -53288 -332364 -176566 -166090 -178944 -412118 -365579 8467
19346 144346 -133688 254631 209198 -126534 -100368 -98875 -72281 131431 27503 -2477 -86739
19335 -86739 -246362 -174913 183832 -335490 65160 -405947 51509 -9812 93424 -212239 -603942
19324 -603942 210915 -147852 36954 145746 471306 -165040 19621 52295 -242427 175025
19313 377578 -259181 -329838 -263609 247009 -97958 -174633 -131665 213030 -157428 -294234
19303 -294234 16344 -107531 -55463 105590 186864 15945 -227212 -237080 132076 -224357 132896
19291 -133773 -227505 -185529 -264027 -288946 143196 -90160 -202011 -25322 -84250 -255417 -32962
19279 -83262 334909 15459 -220134 18093 53119 -52124 -158787 130968 -249496 -276221 19929
$$ packed form
19358b45644h3043c7130C29176e3288k79076J55798J0476j2854k33174M6539H467
19346A44346a33688B54631m5433a26534K6166J493K6594A31431B7503b477q4262
19335h6739j59623P1449A83832c35490F5160d05947E1509i812I3424b12239l91703
19324f03942B10915a47852C6954J08792L25560a65040A9621L2674b42427A75025
19313C77578b59181p0657O6229B47009i7958p6675M2968B13030a57428j36806
19303b94234A6344a07531N2068A05590Q1274A5945b27212r868A32076b24357A32896
19291a33773r3732M1976p8498k4919A43196i0160j11851b5322n8928j71167c2962
19279h3262C34909A5459b20134A8093L5026e2124j06663A30968b49496k6725A9929
$$ plain form
19267 71656 -169128 41559 -244543 -168153 -48552 195695 237274 -108507 -17047 -86381 268954
19255 24893 125298 252544 -200948 -85435 -24748 11623 -361851 -238219 -111391 -150110
19245 -150110 254094 -44263 -248455 -83270 -343213 6960 -174252 163946 -254147 192530
19234 -61787 332576 -369938 -9109 -157641 228039 -9848 156857 -147310 -339353 -193555
19224 -193555 -32549 -174533 75108 -87009 -126734 -199758 226571 21020 -42137 147977 -168388
19212 -235053 -110673 -86209 -178582 -292126 335545 -108030 135008 276304 -118046 -45039
19201 -89289 112189 -193871 -232278 -45181 -222589 -115186 -133958 175174 41578 84965 -350141
19189 78557 52455 -28220 -132622 -102616 -134981 -328703 -116253 79326 -141660 132091 61731
$$ packed form
19267G1656a69128D1559b44543P6390d8552A95695M1579a08507a7047o9334B68954
19255B4893J00405J27246b00948h5435b4748A1623c61851J23632a11391l8719
19245a50110B54094d4263k04192h3270k59943F960a74252A63946b54147A92530
19234f1787C32576c69938i109j48532B28039i848A56857a47310j92043J45798
19224a93555c2549j41984G5108h7009l9725p3024B26571B1020d2137A47977a68388
19212b35053a10673K4464r2373j13544C35545a08030A35008J41296a18046d5039
19201h9289A12189a93871l8407d5181j77408J07403j8772A75174D1578M3387c50141
19189G8557k6102b8220j04402L0006l2365j93722a16253G9326a41660A32091F1731
$$ plain form
19177 139856 88082 14169 -108307 -276117 -120509 139745 -79334 -386394 -224447 -112165
19166 -181128 61932 414964 -341118 -165995 -191415 -60844 248630 22234 113103 -90083 103297
19154 9818 -48953 198944 -136896 -153300 -210717 -305508 102163 -7760 29044 76377 -226287
19142 -207199 50856 -160539 -13764 -148670 -110651 17242 93679 429483 -168409 -140360 -249939
19131 -249939 73761 -17707 -105013 255814 -57710 163406 -182570 -204883 55874 22457 -136302
19119 102829 26660 -16434 266333 -387756 175815 64414 175709 243974 -399967 -226566
19109 -226566 79043 -42610 51187 34888 100526 -132890 -129826 -67325 -224034 69621 211425
19098 211425 -51885 -72122 -313557 -110905 38372 -27349 -168648 185970 -216907 -127433
$$ packed form
19177A39856n1774A4169a08307j67810a20509A39745g9334l07060J61947a12165
19166a81128F1932L53032c41118a65995k5420f0844B48630B2234R0869i0083A03297
19154I818d8953A98944a36896j6404n7417r4791A02163g760B9044M7333b26287
19142b07199E0856a60539a3764j34906L8019A7242P6437L35804a68409K8049j09579
19131b49939G3761a7707q7306B55814e7710A63406a82570k2313E5874B2457a36302
19119A02829B6660a6434B66333c87756A75815F4414J11295O8265c99967J73401
19109b26566G9043d2610E1187j6299O5638a32890L064O2501j56709F9621J41804
19098B11425e1885k0237k41435a10905C8372b7349j41299A85970b16907Q9474
$$ plain form
19088 -127433 -262978 128269 59328 -40650 -306754 -457 -164400 -308491 -94425 -308804 63307
19076 -278768 -155578 -51381 -213819 52232 240278 -136712 -50103 106193 93569 -152972
19065 -42225 -39779 27769 73220 168910 83827 31797 7927 151162 -167689 20192 -230814
19053 74886 -16591 -7588 -152286 221216 64054 16743 -161751 117263 431718 78848 -43921
19041 -322116 -127478 93653 -104118 -31156 -64463 47613 69464 -14574 -65302 69546 4329
19029 -32356 -118655 -169699 -212344 106843 -61985 431 269702 132298 -5318 268747 229366
19018 229366 219120 3748 -15916 18379 -34779 -139646 -10010 -105741 -6680 -366249 83130
19006 4077 25948 123794 225093 118961 -388723 -88837 -205172 -19462 -468963 -420030 -239754
$$ packed form
19088a27433j35545A28269E9328d0650k66104d57j63943j44091i4425k14379F3307
19076b78768J23190e1381j62438E2232J88046a36712e0103A06193j2624a52972
19065d2225K446B7769M5451R5690H3827C1797G927J43235a67689B0192b30814
19053G4886a6591g588j44698B21216F4054A6743a61751A17263L14455G8848d3921
19041c22116a27478I3653a04118c1156l3307D7613K1851a4574n0728F9546D329
19029c2356q6299n1044m2645A06843f1985D31K69271A32298e318B68747l9381
19018B29366j0246C748a5916A8379c4779j04867a0010r5731f680l59569H3130
19006D077K1871R7846J01299j06132c88723h8837j16335a9462m49501M8933J80276
$$ plain form
18995 -239754 -72116 203789 65224 64841 -472714 -196541 -319961 -131917 -307837 -59485 -910
18983 35979 -408612 52084 -416357 -105381 -82420 -68961 -202956 -265220 -65339 -470316 -57425
18971 39027 239371 149494 86724 -200705 -305872 -343200 107431 -110619 -149021 26597 -100507
18959 -20255 16020 -155085 113023 -109050 -28611 73344 -148727 -396336 -461964 292358
18948 -227042 172867 -209343 -167245 31950 -4422 274077 146952 -34495 137408 -225627
18937 222653 1879 -32120 108447 -189299 -281048 83114 -167484 181921 -97731 -305879 130490
18925 -259548 67713 312032 112787 37980 -143816 -137218 172521 -219312 -281404 52470 191296
18914 191296 -79977 -234124 -86087 49399 -387106 191907 -17989 268764 -180617 66570
$$ packed form
18995b39754g2116B03789F5224l83d72714a96541j23420a31917j75920e9485i10
18983C5979d08612E2084d16357a05381K2961J3459j33995o2264f5339m04977e7425
18971C9027K00344q9877o2770b00705j05167l7328A07431a10619l8402B6597a00507
18959b0255A6020a55085A13023a09050b8611G3344a48727k47609o5628B92358
18948b27042A72867b09343M2098C1950d422B74077j27125c4495A37408b25627
18937B22653A879c2120A08447a89299r1749H3114a67484A81921i7731k08148A30490
18925b59548F7713K44319A12787C7980a43816O598A72521b19312o2092E2470J38826
18914A91296g9977j54147h6087D9399c87106A91907a7989B68764a80617F6570
$$ plain form
18903 -181915 -50847 162488 -75374 -103542 -27925 33621 -576 14115 -325073 -148566 -201930
18892 -201930 33953 -225521 1599 -231137 21329 -181712 -108301 -302555 -89920 157538 80507
18881 80507 -103872 -240988 -328625 -349219 186151 32085 39989 -138071 -273125 10181 -105121
18869 -20691 -64661 -193813 -270329 25404 -95734 -120190 -102184 -169937 -152174 -126719 -120417 -259985
18857 -259985 -32049 192849 -103553 738 -45394 502859 44334 236669 -294218 263984 135095
18846 135095 75092 95870 -304318 38646 -40931 180202 -103673 -69947 92314 -388929 -106464
18834 -162231 167123 -226801 -332242 -133276 -205420 -284377 -612 16527 107047 -92440 -269236
18823 -269236 -291239 -206155 -114794 48300 74421 170221 -231694 187417 -14525 108887 256314
$$ packed form
18903a81915e0847A62488g5374k8168b7925C3621e76A4115c25073a48566n3364
18892b01930C3953b25521A599b31137B1329a81712P3411j94254h9920A57538p7031
18881H0507a03872j37116q7637k0594A86151C2085P904a38071j35054A0181a05121
18869b0691m3970j29152p6516B5404i5734k4456J8006o7753J7763K5455O302j39568
18857b59985c2049A92849a03553G38d5394E02859D4334J92335b94218B63984j28889
18846A35095o0003K0778c04318C8646d0931A80202a03673L3726I2314c88929a06464
18834a62231A67123b26801j05441a33276p2144p8957f12A6527R0520i2440j76796
18823b69236k2003Q5084R1361D8300K6121R5800b31694A87417a4525A08887J47427
$$ plain form
18812 256314 -87902 420910 365289 398793 -35233 -164222 -153595 -97653 69457 -235966 -123896
18801 -123896 -104223 -251397 -315807 138795 40901 -19550 173103 -149854 19708 -103221
18790 -175716 489415 -19032 110347 -266121 -69822 -238653 158973 -260920 35101 -84375
18779 -272083 40232 -217044 25414 65103 -421278 52639 85845 54895 146171 -147693 -206239
18768 -206239 -158987 -160915 -107608 90564 -40792 -285497 177123 -42722 67988 -130763 52471
18756 23843 238813 13911 -306390 -44947 170777 -402855 66984 37339 -162464 246088
18745 35529 -447116 -59110 -235511 -81944 151642 -86176 166113 -258316 92889 54792 282229
18734 282229 146499 -157226 -457562 -12390 -115824 -126057 -172470 181641 110325 -252202
$$ packed form
18812B56314h7902D20910n5621L3504c5233j28989J0627N5942F9457b35966J12070
18801a23896J9673j47174o4410A38795D0901a9550A73103a49854A9708a03221
18790a75716D89415a9032A10347b66121f9822j68831A58973b60920C5101h4375
18779b72083D0232b17044B5414L9689d21278E2639L3206l0950R1276a47693n8546
18768b06239M7252j928N3307I0564d0792k44705A77123d2722F7988a30763E2471
18756B3843K14970A3911c06390d4947A70777d02855F6984k9645a62464B46088
18745C5529d47116e9110j76401h1944A51642h6176A66113b58316I2889l8097K27437
18734B82229j35730a57226l00336a2390j03434j0233m6413A81641p1316b52202
$$ plain form
18723 114001 105885 -213755 -11187 94409 -77941 -292224 -103434 -218808 -71966 -217397 -270378
18712 -270378 -76188 -52143 -92643 266390 -30150 104439 -194953 -86324 -109068 -65068 -201613
18701 -201613 98928 72087 154531 206547 -8407 -75314 -378566 56278 -89354 10662 6736 72660
18689 72660 162913 -274519 48450 -241692 295112 150174 89902 -8193 149172 -42828 -282086
18678 -282086 -25363 126597 109036 -308747 -163935 102753 -208717 -108788 217136 103744
18667 -555926 36503 -79108 -39558 -50498 59501 134267 35223 9513 116584 3528 -89927 -131645
18655 -131645 -114819 -272600 -819 345932 -166257 -201930 -37899 -14876 31038 -94537 149251
18643 93415 -54490 136782 -201633 -106746 315015 89092 -220279 1996 -51485 -184329 182332
$$ packed form
18723A14001q116b13755a1187I4409g7941k14283a03434j15374g1966j45431n2981
18712b70378g6188K4045m0500B66390c0150A04439a94953h6324k2744M4000j36545
18701b01613I8928k6841Q2444N2016h407o6907l03252E6278h9354A0662l926O5924
18689G2660R0253b74519D8450b41692B95112j44938o0272h193A49172d2828k39258
18678b82086b5363A26597j7561c08747J44812A02753b08717R9929B17136A03744
18667e55926C6503g9108L9550j0940E9501P4766C5223I513J07071C528h9927m1718
18655a31645J6826j57781h19C45932a66257l5673c7899a4876C1038i4537A49251
18643I3415e4490A36782b01633R4887C15015H9092b20279A996e1485j32844A82332
$$ plain form
18631 -363070 -20812 -223226 353232 -216134 56364 -9029 -118074 -284611 75905 168081 -176714
18619 -161253 200166 57454 -401124 139946 2100 -76290 -65145 -114070 370364 2345 290303
18608 290303 -39848 -23251 53151 -396074 -103599 66302 55428 -201823 220519 -180843
18597 -209063 -249584 98158 176293 77221 -123818 83143 -551218 -185633 -96812 -302831 -179983
18586 -179983 -213702 5703 -169002 271673 -6230 -6876 36703 212304 -185788 -228023 153441
18574 -69511 -12942 -179411 -211496 -3024 91556 -136239 -86910 -248062 154492 -9768 262682
18562 2690 -182211 -160737 -329080 9752 -120123 38316 79430 -151231 -158500 15168 122084
18551 122084 -51984 62105 -249740 -187372 -39861 56703 253539 99673 -220048 116631 -9822
$$ packed form
18631c63070b0812k02414C53232b16134E6364i029j09045j66537G5905R2176a76714
18619a61253B00166E7454d01124A39946B100g6290J1145m8925C70364B345K87958
18608B90303c9848J6597E3151c96074a03599F6302j0874b01823B20519a80843
18597b09063m0521I8158P8135G7221a23818H3143e51218a85633Q8821k06019J22848
18586a79983l3719E703a69002B71673f230o46C6703J75601a85788m2235A53441
18574f9511a2942j66469l2085c024I1556a36239M9329j61152A54492i768B62682
18562B690a82211K1474j68343I752a20123C8316M1114a51231p269A5168J06916
18551A22084e1984F2105b49740O2368c9861E6703J96836I9673b20048A16631i822
$$ plain form
18539 -185312 -182357 155962 -182817 -309960 -11864 10235 37853 46510 -51739 -54065 -254956
18528 -254956 -23985 38146 29664 -11318 -254244 -68861 29566 -289428 43387 -242145 -166525
18517 -166525 197857 204086 -2948 -155161 -204637 -149564 -34676 336809 258678 -177870 64453
18505 -203654 -218142 187197 -385580 -58700 79273 91091 -192164 -322427 364901 -132372
18494 -174026 232525 -60124 -188892 -414946 14070 -43067 -115198 133077 -340816 -171213
18484 -171213 61882 311351 -129541 243192 6563 -99311 -55831 367820 147169 -82463 61108
18472 -184472 71869 50489 103320 90473 -40358 164460 37193 -27188 -176593 -127702 -292780
18461 -292780 292396 240213 -234061 -185090 -140777 -75542 43646 -159419 197892 -200409
$$ packed form
18539a85312K955A55962a82817j27143a1864A0235K7618Q657e1739k326k00891
18528b54956b3985C8146q482a1318k42926f8861B9566b89428D3387b42145P5620
18517a66525A97857O229b948j52213m9476N5073c4676C36809p8131a77870F4453
18505b03654j4488A87197c85580e8700G9273J1818a92164j30263C64901a32372
18494a74026B32525f0124j28768k26054A4070d3067p2131A33077c40816J69603
18484a71213F1882K49469a29541B43192F563i9311M3480C67820A47169h2463F1108
18472a84472G1869k1380N2831j2847d0358A64460C7193b7188j49405M8891j65078
18461b92780B92396n2183b34061M8971M4313O5235D3646a59419A97892b00409
$$ plain form
18450 -448467 -211404 -7876 305032 -31476 -289785 188682 -33548 -58027 -195172 107705
18439 94378 -43662 227336 138340 324322 145890 21567 -57102 -379288 178371 -107831
18428 -263702 -157263 -36966 10154 -71094 -331551 -57400 175522 -87024 -54472 -269037 -119803
18416 151305 -143363 -22309 -176856 350695 -16525 -32169 184210 17641 46024 24888 10192
18404 -73323 -176338 -115504 95697 -33123 239681 -57680 -279351 117031 32089 -22142 343316
18392 -344696 -185194 -213691 -132288 -5292 -68469 -177069 -267805 176038 2037 -53448 10726
18380 -6534 -157452 -115753 -127500 -72591 -28026 -99895 183366 193496 -140690 217327 -252761
18368 -160835 -405531 227551 -348516 -44482 -138844 183689 -30620 -12921 60521 91781 -165362
$$ packed form
18450d48467b11404g876C05032c1476k58309A88682c3548k4479j37145A07705
18439I4378d3662B27336q8996J85982A45890B1567e7102l22186A78371a07831
18428b63702J06439c6966A0154g1094k60457e7400A75522h7024L2552k14565a19803
18416A51305a43363b2309j54547C50695a6525j5644A84210A7641K8383k1136A0192
18404g3323j03015O0834I5697c3123B39681e7680k21671A17031C2089b2142C43316
18392c44696J59502k8497Q1403e292o3177j08600r0736A76038B037e3448A0726
18380f534j50918M1699j1747N4909b8026p1869A83366J0130a40690B17327b52761
18368a60835k44696B27551c48516d4482r4362A83689c0620a2921F0521L1260a65362
$$ plain form
18356 111697 226293 -269567 43815 -108180 122237 -293292 130658 -307881 -129350 259445
18345 -115431 -72719 191196 -250897 -364249 -100240 -65575 -123101 -334253 -104324 -48634
18334 -50470 143893 -236695 128324 35502 -41482 17573 -212858 214350 -255569 310150
18323 62537 -39692 -97827 -164364 446023 -79405 -219707 -297790 -177131 109822 24419 -474685
18311 -175567 30356 -269895 -115430 -217549 -155430 -61833 -144490 -22615 -68748 202380 -350870
18299 211101 194598 -188199 -339016 -258606 -59433 -107443 58307 267234 -439811 137732
18288 -93458 -239330 -238517 211544 -90600 -155195 60690 -119 -128101 -40496 -23959 -173734 -509935
18276 -509935 -58190 179495 420022 -56425 16044 135097 402263 -228299 -325424 -78728
$$ packed form
18356A11697J14596b69567D3815a08180A22237b93292A30658c07881a29350B59445
18345a15431M2712A91196b50897j13352a00240L4665n7526k11152a04324d8634
18334e0470A43893b36695A28324C5502d1482A7573b12858B14350b55569C10150
18323F2537c9692n8135o6537D46023g9405j40302p8083J20659A09822B4419d74685
18311a75567C0356b69895a15430j02119O2119f1833q2657b2615m6133B02380c50870
18299B11101j6503a88199j50817Q0410e9433m8010E8307K08927d39811A37732
18288i3458j45872Q13B11544i0600o4595F0690a19j27982d0496J6537j49775l36201
18276e09935e8190A79495K40527e6425A6044J19053K67166b28299r7125g8728
$$ plain form
18265 -344079 339150 -67595 -176638 86690 -81409 83948 234896 53728 -335288 -109760
18254 -104416 -38935 -314286 -288405 339709 -6959 -284518 94009 -66243 107826 -67241 405497
18242 31034 -371080 -72431 -42941 97338 -312715 153162 -314140 -104570 56950 -3154 -114508
18231 -114508 -75956 -118173 -77790 -98917 323835 112509 -126102 59884 168714 -76375 182272
18219 107553 -162228 -334719 -187773 -259020 -368943 -8474 131202 393816 -192623 -234336
18209 -234336 2378 -61397 -34196 203998 -17914 -137607 -388340 7084 -266649 -178440 164699
18197 -162061 59683 -405921 28166 -258868 -135603 -180141 -201760 88837 7672 -24679 232810
18185 236923 -327993 38981 89509 50022 -276397 121788 -147504 76218 22889 298879
$$ packed form
18265c44079C39150f7595j09043H6690h1409H3948J50948E3728c35288a09760
18254a04416c8935k75351K5881C39709f959k77559I4009f6243A07826f7241D05497
18242C1034c71080g2431K9490I7338c12715A53162c14140a04570E6950c154j11354
18231a14508L8552m2217M0383k1127C23835A12509a26102E9884J08830g6375A82272
18219A07553a62228j72491J46946p1247j09923h474A31202K62614a92623m1713
18209b34336B378f1397K7201B03998a7914j19693k50733G084b66649Q8209A64699
18197a62061E9683d05921B8166b58868J23265m4538k1619H8837G672b4679B32810
18185B36923c27993C8981N0528l9487b76397A21788a47504G6218B2889K75990
$$ plain form
18175 298879 20881 150222 115349 81003 -203911 -363104 -63721 83033 -21553 34472 -71136
18163 116035 -33657 114506 -228826 -327670 140949 304177 -110788 -130555 -170211 -34149
18152 -169255 72773 -139808 -169301 218956 -64622 351264 -68590 109713 -209013 73850
18141 81621 351684 -168717 37797 177796 65778 93514 -162533 93819 -91092 -27471 169200
18129 -151294 267777 -128942 11785 -86319 131903 131479 -286750 -202911 -70434 37046 -188902
18117 -17136 -259852 -264085 4583 -29933 -213772 -102727 104786 142777 -218547 -163810 -115867
18106 -115867 167398 -78604 -2550 53969 -285119 -135546 42959 -296888 -239234 -459511 187314
18094 -188244 36114 77807 -53030 73301 151961 -44959 271983 27289 157532 -160879 -86949
$$ packed form
18175B98879B0881J29341l4873l4346b03911j59193f3721H3033b1553C4472g1136
18163A16035c3657A14506b28826r8844A40949J63228a10788j9767l9656c4149
18152a69255G2773a39808k9493B18956f4622C51264f8590A09713b09013G3850
18141H1621K70063a68717C7797J39999F5778K7736a62533I3819i1092b7471A69200
18129a51294B67777a28942A1785h6319A31903m24b86750Q3839g0434C7046a88902
18117a7136k42716m233D583b9933j83839a02727A04786L7991b18547N4737M7943
18106a15867A67398g8604b550E3969b85119a35546D2959b96888N7654k20277A87314
18094a88244C6114M1693e3030G3301P8660d4959B71983B7289J30243a60879P3930
$$ plain form
18083 -86949 -100641 -103657 58431 -20491 -55887 -36815 -56142 -60615 227240 -108949 -248856
18072 -248856 -248869 -204242 -112863 -215755 197002 163318 -75614 -87823 -373808 -373953 141821 80255
18060 80255 -27592 -247992 147529 -166564 -65073 263691 -101367 170566 -279587 -111393
18049 -118846 -55269 274580 47431 70366 21681 -1001 -223842 -449614 68871 -206281 -50262
18037 42335 -244240 632205 -117090 -276517 19677 -116375 -159850 -92524 -188172 -36348 -133891
18026 -133891 108085 111569 -67159 65730 170356 -205784 587806 -125453 -200944 -283956 58476
18014 113271 -41626 186570 252243 -156926 -62111 -160220 -88338 -360834 154708 303734
18004 303734 62399 -267675 -39998 -163925 -121224 259083 4566 25369 -3668 22738 -117155
$$ packed form
18083h6949j3692l016E8431b0491l5396J9072j9327m473B27240a08949j39907
18072b48856j3M4627R1379j02892A97002l3684g5614j2209k85985j45A41821o1566
18060H0255b7592k20400A47529a66564f5073B63691a01367A70566b79587a11393
18049a18846e5269B74580D7431K2935B1681a001k22841k25772F8871b06281e0262
18037D2335b44240F32205a17090j59427A9677a16375m3475O7326r5648c6348r7543
18026a33891A08085L484f7159F5730J04626b05784E87806a25453p5491q3012E8476
18014A13271d1626A86570O5673a56926f2111r8109P1882k72496A54708J49026
18004C03734F2399b67675c9998j23927M2701B59083D566K0803c668B2738a17155
$$ plain form
17992 252663 258740 374975 -297257 -357510 -27236 316991 -330199 -136710 -93136 44642 -1848
17980 -18367 -38075 -164233 -279882 -61991 -107673 -76700 -77946 252183 66164 -64175 227381
17968 -81265 -200066 51287 -260837 -53395 44655 90437 -96922 -131333 109556 8632 81002
17957 81002 -27520 100826 30954 82753 -356020 -67715 -301358 45450 45704 181296 -26645
17945 357390 -8387 -19006 -139395 -108170 -308183 -223931 59976 -122604 -226112 92759 -186838
17933 51347 -44769 -147852 -28095 -170940 61670 -217108 -84425 -77555 -5824 29548 -250769
17921 -121291 -139284 -105467 -376744 55053 -120715 -255600 -446042 160825 -207508 210225
17910 -12075 -44838 82045 -81535 -40077 -92796 115159 -131599 -332787 -52004 225305 -118656
$$ packed form
17992B52663O077J16235b97257o0253b7236C16991c30199a36710M3574D4642a848
17980a8367j9708j26158j15649f1991m5682L0973j246B52183F6164f4175B27381
17968h1265j18801E1287b60837e3395D4655M5782i6922l4411A09556H632P2370
17957H1002b7520A00826C0954N1799c56020f7715k33643D5450K54J35592b6645
17945C57390h387j0619j20389L1225k00013Q4252E9976a22604j03508I2759a86838
17933E1347d4769j03083b8095j42845F1670b17108h4425O870e824B9548b50769
17921a21291j7993L3817k71277E5053a20715j34885j90442A60825b07508B10225
17910a2075l2763H2045h1535d0077n2719A15159a31599k01188e2004B25305a18656
$$ plain form
17898 -148449 -22141 208334 291166 -147662 73517 -223876 155264 -12182 -73919 6726 -146064
17886 155516 -29477 -79432 -288555 52279 207649 -203171 -265600 -301805 121363 -51850 -311354
17875 -311354 53083 -34219 109279 100301 96186 -175350 -137726 133991 254587 -155937 444885
17863 -92868 276493 65497 47260 -251012 27665 -90704 99994 39307 118631 79366 -189531
17851 10017 -80059 254048 52122 249632 -34048 108856 -15972 12699 -54613 72123 137563
17840 137563 129361 -37794 -156058 -279272 -159172 -232862 -190063 -232863 15553 141973 342082
17829 342082 172136 -297030 -261142 423945 -245548 73580 242408 -145905 -235343 -87754
17818 -98538 -128600 33048 -71236 280363 32931 -62873 -31621 220415 -132851 -287568 1335
$$ packed form
17898a48449b2141B08334Q2832a47662G3517b23876A55264a2182o1737F726a46064
17886A55516b9477m9955k09123E2279J55370b03171o2429l6205A21363e1850k59504
17875c11354E3083c4219A09279q978m115a75350L7624A33991J20596a55937D44885
17863i2868B76493F5497j8237b51012B7665i0704I9994C9307P9324l9265a89531
17851A0017h0059B54048E2122J97510c4048A08856a5972A2699e4613G2123O5440
17840A37563q202c7794j18264j23214J20100p3690M2799m2800A5553J26420K00109
17829C42082j69946b97030L5888D23945b45548G3580J68828a45905q9438h7754
17818i8538l0062C3048g1236B80363C2931f2873L1252B20415a32851j54717A335
$$ plain form
17806 -19760 73209 -36462 -97120 -86857 -81933 41312 40848 -201160 189063 138733 -137760 189069
17793 322966 -30179 92430 143048 231733 -287260 80791 200939 -220819 -131121 -330327 140197
17781 -196097 221702 51197 128746 -303895 183017 40425 -71583 -56984 69855 65882 -36706
17769 295369 -25850 -190769 -66275 103108 -35807 69607 -121806 132577 60438 205416
17759 205416 76872 -170733 -264988 62257 -312778 196242 298000 -111646 55723 -215978
17748 -151537 -37773 175361 -137880 -88639 -309452 163047 -245038 152592 -277787 245411
17737 -14409 -141695 -211490 -225622 478173 -13755 82910 18737 11694 248575 200753 -103842
17725 19195 -118838 242578 -26777 -41605 -47419 286282 179176 118118 -157291 -205083 66354
$$ packed form
17806a9760G3209c6462o0658J0263M924D1312m64b01160A89063n0330a37760A89069
17793C22966c0179I2430N0618Q8685b87260H0791J20148b20819Q9698j99206A40197
17781a96097B21702E1197P7549c03895A83017D0425g1583J4599F9855l973c6706
17769B95369b5850j64919f6275A03108c5807F9607a21806A32577F0438J44978
17759B05416G6872a70733r4255F2257c12778A96242J01758a11646E5723b15978
17748a51537c7773A75361a37880M9241k20813A63047b45038A52592b77787B45411
17737a4409j27286o9795j4132D78173a3755H2910A8737p043K36881m7822a03842
17725A9195a18838B42578b6777j4828n814B86282j07106o1058a57291m7792F6354
$$ plain form
17713 425572 97683 -448578 99538 150308 226860 -46585 -456874 5812 -260317 200692 -50016
17701 -164488 -160964 80980 28401 61194 143716 -406280 36469 -145629 281344 219875 53704
17689 419247 34599 54894 82718 9961 11279 -4444 58200 216438 4841 -367302 -249850 105232
17676 -169320 -225996 -153348 -67638 -15907 170038 -24194 -97145 -58551 190338 79553 10537
17664 -439151 -8972 243086 -77017 107296 -94319 -248278 149184 14095 80714 -30514 129441
17652 152185 -186177 -201124 -103800 -246376 -198465 159161 -281494 -2868 -121 -68334 -143256
17641 -143256 109079 -86320 -64853 377974 145745 -71094 90977 206188 -233840 90059
17630 -137398 224001 348685 56610 186794 -36774 278706 -537855 201123 244937 118878
$$ packed form
17713D25572I7683d48578I9538N0770P6552d6585m10289E812b60317B00692e0016
17701a64488L524H0980B8401L2793Q2522d06280C6469a45629B81344o1469E3704
17689D19247C4599K0295K7824I961J318d444E8200J58238D841c67302J17452A05232
17676a69320n6676P2648f7638a5907A70038b4194p2951L8594A90338G9553A0537
17664d39151h972B43086g7017A07296i4319j53959A49184A4095O6619c0514A29441
17652A52185a86177j4947R7324j42576M7911A59161b81494b868a21o8213p4922
17641a43256A09079h6320K1467C77974A45745g1094I0977J15211b33840I0059
17630a37398B24001J24684E6610J30184c6774B78706e37855B01123M3814A18878
$$ plain form
17619 -304697 -152744 167451 114572 70864 170713 -69400 180687 -34014 296980 -280192
17608 199166 -20155 74621 84596 375668 374511 -165665 -79943 185021 -243608 -49740 -54940
17597 -54940 202489 30083 -156765 -212970 -158234 -101593 129362 118559 356290 -152677 -147196
17586 -147196 108923 -235884 -18034 75339 -33808 158453 108211 196212 99451 29426 -17473
17574 199296 -20755 308810 43935 -168038 -25024 211266 -32286 67358 -107495 89781 -149041
17562 -278271 42773 158882 86006 482527 76945 158051 263816 -20369 78122 -163878 -33535
17550 243576 -38237 -36475 -7535 -146261 303776 27474 192930 84446 -182358 239819 173380
17539 173380 -74562 -495096 348105 442308 -153044 225211 -83409 -205695 -15012 169551
$$ packed form
17619c04697J51953A67451n2879m3708R9849f9400A80687c4014B96980b80192
17608A99166b0155G4621R975K91072j157a65665g9943A85021b43608d9740n200
17597e4940B02489C0083a56765n6205N4736N6641A29362j0803K37731a52677N481
17586a47196A08923b35884a8034G5339c3808A58453n0242Q8001r6761B9426a7473
17574A99296b0755C08810D3935a68038b5024B11266c2286F7358a07495H9781a49041
17562b78271D2773J16109p2876L96521G6945Q1106J05765b0369G8122a63878c3535
17550B43576c8237J762g535j38726C03776B7474J65456H4446a82358B39819o6439
17539A73380g4562m20534C48105R4203a53044B25211h3409j22286a5012A69551
$$ plain form
17528 215812 -39919 180997 4889 38863 117267 134020 48766 293328 -14505 -120684 -124991
17517 -124991 -327036 64043 151069 95275 -12287 56081 137129 221653 1248 64309 -13351
17505 88070 78726 -188319 -7653 -37856 -297731 -224768 302295 -263918 15306 83836 381825
17494 381825 213442 -100245 246573 253388 308744 152239 243080 389946 96234 -14666 321884
17482 -164106 225505 188816 -65457 -99871 74172 -347401 113816 57712 5173 146012 250867
17471 250867 -231948 19859 78991 257755 55607 268751 351778 226685 83751 294543
17461 294543 -299900 -1438 -289150 -19075 243688 41896 213209 228939 417242 418195 298367
17450 298367 265080 474055 -8596 210334 319222 420986 334580 161755 139460 364731
$$ packed form
17528B15812c9919A80997D889L3974P8404J6753D8766K44562a4505j06179m307
17517a24991k02045F4043Q7026n5794a2287E6081Q1048Q4524A248O3061a3351
17505H8070r344a88319g653l0203k59875P2963C02295b63918A5306O8530K97989
17494C81825j68383a00245B46573O815N5356A52239R0841J46866I6234a4666C21884
17482a64106B25505l6689f5457l4414G4172c47401A13816n6104E173J40839J04855
17471B50867b31948A9859N9132J78764E5607K13144Q3027j25093H3751K10792
17461B94543b99900a438k87712a9075B43688D1896J71313J5730J88303R53j19828
17450B98367l3287K08975h596B10334J08888J01764q6406A61755k2295K25271
$$ plain form
17440 364731 460393 97494 302679 -22228 667987 168908 109425 113982 350806 270605 321220
17429 321220 -49821 343801 130949 159979 409754 229466 290804 310154 109038 -127831
17418 185781 248575 50560 429260 594005 72020 66566 378426 287261 48418 -118640 241263
17406 462341 439905 244295 -42075 362823 793 61170 218488 357663 367943 -17308 314846
17394 -43729 135332 352860 -21548 331657 215883 618559 278363 156862 318055 22204
17383 -306179 66222 108384 189585 450838 151056 524459 254836 -287998 -101945 333215
17372 135176 -180525 33332 -122488 117284 58932 -152705 95184 138721 -80570 212145
17361 38403 445371 -28249 94378 9081 96608 55657 -180294 336213 64951 -27202 -25835
$$ packed form
17440C64731R5662I7494K05185b2228F67987A68908n9483M557K36824q0201N0615
17429C21220d9821C43801A30949K9030K49775j80288O1338J9350A09038a27831
17418A85781O2794E0560L78700J64745G2020n454L11860r1165D8418a18640B41263
17406D62341k2436j95610d2075C62823G93O0377J57318J39175J0280a7308C14846
17394d3729A35332K17528b1548C31657j15774M02676B78363j21501J61193B2204
17383c06179F6222M2162Q1201K61253A51056L73403B54836b87998a01945C33215
17372A35176a80525C3332a22488A17284n8352a52705I5184M3537h0570B12145
17361C8403M06968b8249I4378I081Q7527m0951a80294C36213F4951b7202J367
$$ plain form
17350 -25835 94515 2187 129176 121520 45485 186707 207193 212342 -121395 145257 175845
17339 175845 240855 50540 -49881 -283650 207550 243738 40709 220504 435697 260670
17329 260670 263968 -63546 418391 315935 -48545 -184210 294691 202091 -71436 169628 191064
17318 191064 212032 92957 216285 6420 74627 83060 55202 466979 91154 20924 -251282
17306 88921 270238 -132777 140283 -193489 414764 214157 330366 322270 324174 421560 197004
17294 368653 228792 -260283 148244 349856 478690 -59960 125074 218883 -31208 129300
17283 235929 436897 185617 -69760 334392 358720 -39730 140626 500731 72562 305773
17273 305773 232047 142529 439712 -76997 77651 93989 -109768 -3245 121088 325350 -28182
$$ packed form
17350b5835I4515B187J26989p656D5485J41222K0486N149a21395A45257L0588
17339A75845O5010E0540d9881k33769B07550L6188D0709J79795K15193j75027
17329B60670L298f3546D18391j02456d8545j35665B94691r2600g1436A69628K1436
17318A91064K0968I2957J23328F420O8207Q433k7858M11777I1154B0924b51282
17306H8921J81317a32777A40283a93489D14764k00607J16209q096J904R7386A97004
17294C68653j39861b60283A48244K01612J28834e9960A25074R3809c1208A29300
17283B35929K00968A85617f9760C34392K4328c9730A40626L60105G2562K33211
17273C05773p3726q9518K97183g6997G7651J6338a09768c245A21088K04262b8182
$$ plain form
17261 90372 36835 105873 178424 132883 107918 241769 160822 -158628 236070 153558 170488
17250 170488 212956 65279 225756 271960 252390 436160 46668 350949 287417 -105233 -8230
17238 87578 151372 143375 104275 183769 38520 167799 449444 102059 243187 195261 269656
17227 269656 122461 111903 124065 -25469 408467 219836 152002 166526 137144 248556 165992
17216 165992 225279 253089 205643 17631 255979 149402 5091 -19935 166216 212540 462215
17205 462215 48667 154453 212713 228731 129416 343135 -44141 208979 342804 145333
17194 198823 28878 281310 247012 257113 271996 90946 34027 146534 585192 204278 52078
17182 -63247 207151 -64812 417829 112689 301041 166462 -42176 241780 818819 43776
$$ packed form
17261I0372C6835O9038P2551m5541k4965J33851q0947a58628B36070q2512J6930
17250A70488M2468F5279J60477M6204j9570J83770D6668L04281o3532a05233h230
17238H7578O3794p997l9100P9494C8520J29279K81645A02059J41128m7926P4395
17227B69656A22461j0558J2162b5469D08467j88631o7834J4524k9382J11412q2564
17216A65992N9287K7810m7446A7631K38348j06577E091a9935A66216M6324K49675
17205D62215D8667J05786N8260J6018r9315K13719d4141B08979J33825A45333
17194A98823B8878K52432l4298J0101J4883I0946C4027J12507M38658B04278E2078
17182f3247B07151f4812D17829A12689J88352j34579d2176B41780N77039D3776
$$ plain form
17171 251309 168357 33074 97293 -41457 340467 186102 491435 205827 210617 395726 415547
17160 415547 29187 -48414 317157 30653 209440 337669 -102226 218523 554652 142307
17149 -54538 227033 179588 234419 635884 240120 489128 116921 280227 302838 227980
17139 227980 319809 359242 166318 116622 470063 656159 93544 341572 208006 564587
17129 564587 84349 434685 423346 419044 181918 183164 279110 174867 492686 -727 274730
17117 192802 368544 164628 414040 283501 293686 300188 767309 312616 209235 405563
17107 405563 209865 -17989 416026 540696 493325 444350 545238 -81702 338642 122707
17096 269625 311969 389224 429060 419714 408722 299535 482981 245287 630042 510371 800377
$$ packed form
17171B51309q2952C3074O4219d1457C40467j54365L05333B05827M790J85109J9821
17160D15547B9187d8414C17157C0653J78787J28229a02226B18523L36129A42307
17149e4538B27033m7445N4831M01465B40120K49008A16921J63306K2611p4858
17139B27980R1829L9433A66318m9696L53441J86096I3544K48028j33566L56581
17129E64587H4349L50336j1339m302A81918J246R5946j04243L17819g27B74730
17117A92802J75742A64628K49412j30539J0185O502M67121C12616j03381J96328
17107D05563j95698a7989D16026J24670m7371m8975J00888h1702C38642A22707
17096B69625M2344P7255L9836r346j0992j09187J83446k37694L84755j19671K90006
$$ plain form
17085 800377 579015 288276 320410 655461 629167 174843 240571 284590 329301 483490
17075 483490 687625 383003 155135 423104 445074 476936 361330 248891 607025 216479
17064 346295 404542 566130 422005 409126 251322 466752 712619 574416 458860 289444
17054 289444 530925 506410 400195 540979 628662 530999 502609 470242 427830 403981 415495
17043 415495 396210 734601 742099 509769 836125 397461 778271 316204 526663 403694
17033 403694 708805 439969 386461 455229 504607 537896 354215 591219 507357 811100
17023 811100 598049 527927 660205 267884 866319 798368 869066 427765 556168 983424
17013 983424 417733 926033 1171286 573066 532840 524252 244938 350208 485137 847699
$$ packed form
17085H00377k21362B88276L2134L35051k6294A74843O5728M4019M4711J54189
17075D83490K04135l04622A55135K67969K1970L1862j15606j12439L58134B16479
17064C46295N8247J61588j44125j2879j57804K15430K45867j38203j15556j69416
17054B89444K41481k4515j06215J40784Q7683r7663k8390l2367m2412k3849J1514
17043D15495j9285L38391P498k32330L26356C97461L80810C16204K10459j22969
17033D03694L05111k68836n3508O8768M9378L3289j83681K37004q3862L03743
17023H11100k13051p0122J32278B67884N98435o7951P0698D27765J28403M27256
17013I83424D17733N08300K45253E73066m0226q588B44938J05270J34929L62562
$$ plain form
17003 847699 606663 728357 728215 515261 605422 521080 730486 863344 439584 609675
16993 609675 751535 737407 615649 804750 653381 1119246 522950 904939 826942 717529
16983 717529 705449 701406 1196474 679102 927959 759633 798263 1026852 922299 652303
16973 652303 1059635 764787 618731 582083 947348 1047016 705262 815913 1149526 1016453
16963 1016453 737911 1168924 1011863 938036 947912 889603 1007697 1109811 1095318 942024
16953 942024 941039 1139427 1081199 1281772 992224 858111 891062 1007009 965453 777545 1107991
16942 1107991 848619 928421 673869 983534 969847 889846 1430170 1229753 926052 1300941
16932 1300941 866565 1219221 1012586 1351177 945424 1305375 1327851 1623199 1374713 1438165
$$ packed form
17003H47699k41036J21694j42k12954R0161q4342K09406J32858m23760J70091
16993F09675J41860j4128j21758J89101j51369M65865E22950L81989p7997j09413
16983G17529j2080m043M95068n17372K48857j68326L8630K28589j04553k69996
16973F52303M07332k94848j46056l6648L65265R9668l41754J10651L33613j33073
16963A016453k78542M31013j57061p3827R876n8309J18094J02114j4493j53294
16953I42024r85J98388n8228K00573k89548j34113L2951J15947m1556j87908L30446
16942A107991k59372P9802k54552L09665j3687q0001N40324k00417l03701L74889
16932A300941m34376L52656k06635L38591m05753L59951K2476K95348k48486O3452
$$ plain form
16922 1438165 1266348 1280961 1360841 1136316 1118659 1299730 1380938 1430121 1932391 1477385
16912 1477385 1605953 1383350 1518916 1671474 1353408 1791082 1566169 1470243 1630388 1775272
16902 1775272 1464201 1494259 1435962 1379990 1482418 1606981 2031437 1551706 1893972 1559316
16892 1559316 1980743 1836482 2304589 1949709 1834333 1667000 1741346 1963691 1895848 2370010
16882 2370010 1926313 2023584 1795067 2001417 2158156 1744075 1967639 2330632 2164132 2117425
16872 2117425 2500985 2460475 2449844 2041877 2249410 2398567 2378080 2731517 2284051 2774772
16862 2774772 2466507 2723557 2698447 2585496 2731131 3241243 3068208 2956985 2892314 2801098
16852 2801098 2697892 3043409 2911021 3083942 3447027 3416858 3344773 3132334 3331175 3462307
$$ packed form
16922A438165j71817J4613P9880k24525j7657J81071Q1208M9183N02270m55006
16912A477385J28568k22603J35566J52558l18066M37674k24913r5926J60145J44884
16902A775272l11071L0058n8297n5972J02428J24563M24456m79731L42266l34656
16892A559316M21427j44261M68107l54880j15376j67333P4346K22345o7843M74162
16882B370010m43697R7271k28517K06350J56739m14081K23564L62993j66500m6707
16872B117425L83560m0510j0631m07967K07533J49157k0487L53437m47466M90721
16862B774772l08265K57050k5110j12951J45635N10112j73035j11223o4671r1216
16852B801098j03206L45517j32388J72921L63085l0169p2085k12439J98841J31132
$$ plain form
16842 3462307 3546447 3523769 3989431 3622925 3787258 3777907 3619659 3621240 4110093 3897198
16832 3897198 4422252 4104553 4437531 3998923 4327767 4357326 4503285 4601135 4948772 4858060
16822 4858060 4821371 5188352 5195162 4949229 5653313 5622554 5695536 5794281 5912847 5976502 6300279
16811 6300279 6141539 6403752 6337803 6586668 6773185 6379687 6693938 7507582 7123160 7377447
16801 7377447 7681791 7911147 7772113 8114550 8233394 8480561 8940778 9131587 9507455
16792 9507455 9466086 9461100 9926831 10246868 10605573 10675365 11234772 11291099 11435015 12011745
16782 12011745 12436587 12651036 13224684 13225134 13642780 14214841 14607136 14909249 15743817 16436404
16772 16436404 16650028 17385463 17669020 18623027 18919500 19762005 20528203 21067472 21796000
$$ packed form
16842C462307Q4140k2678M65662l66506J64333r351j58248J581M88853k12895
16832C897198N25054l17699L32978m38608L28844K9559J45959R7850L47637r0712
16822D858060l6689L66981O810k45933P04084l0759P2982R8745J18566O3655L23777
16811F300279j58740K62213o5949K48865J86517l93498L14251Q13644l84422K54287
16801G377447L04344K29356j39034L42437J18844K47167M60217J90809L75868
16792I507455m1369m986M65731L20037L58705O9792N59407N6327J43916N76730
16782A2011745M24842K14449N73648M50M17646N72061L92295L02113Q34568O92587
16772A6436404K13624P35435K83557R54007K96473Q42505P66198N39269P28528
$$ plain form
16763 21796000 23121127 23528279 24791005 25605701 26796541 28030996 28903731 30433324
16755 30433324 31390213 32773293 34662377 35960951 37691313 39540693 41617855 43487865
16747 43487865 45775470 48305510 50919981 53767897 56560873 59939030 63269332 66702125
16739 66702125 70712713 74842724 79655151 84296420 89846940 95438076 101709149 107766233
16731 107766233 114864125 122257647 129687695 137636190 146036206 154954003 163541145 172273449
16723 172273449 180635753 188831557 196431237 202569455 208231597 212282871 214777246 215614361
16715 215614361 215033497 212480650 209118346 203845397 197278666 189658510 181730399 173269959
16707 173269959 164212485 155452510 146359782 137835077 129569749 121509737 114023819 107033353
$$ packed form
16763B1796000J325127M07152J262726Q14696J190840J234455Q72735J529593
16755C0433324R56889J383080J889084J298574J730362J849380K077162J870010
16747D3487865K287605K530040K614471K847916K792976L378157L330302L432793
16739F6702125M010588M130011M812427M641269N550520N591136O271073O057084
16731A07766233P097892P393522P430048P948495Q400016Q917797Q587142Q732304
16723A72273449Q362304Q195804P599680O138218N662142M051274K494375Q37115
16715B15614361n80864k552847l362304n272949o566731p620156p928111q460440
16707A73269959r057474q759975r092728q524705q265328q060012p485918o990466
$$ plain form
16699 107033353 100023326 93627209 88009143 82463628 77589686 72753102 68900737 64819677
16691 64819677 61049100 57350984 54476474 51432067 48548286 45856373 43223936 40990491
16683 40990491 39227514 37161160 35733313 33822803 31864075 30591161 29473752 27925885
16675 27925885 26955617 25705517 24868301 23721539 22648134 21661590 21131943 20268895 19125306
16666 19125306 18504349 18153093 17323623 16522167 15846748 15641021 14783837 14748242 13723926
16657 13723926 13740039 12841665 12578407 12272971 12050105 11500315 11499181 10838353 10667208 10330770
16647 10330770 9924893 9868056 9129947 9026428 8548969 9100962 8458589 8233118 8102012
16638 8102012 7703830 7760978 7646331 7123455 7004539 7206573 6661302 6747864 6076598 6208691
$$ packed form
16699A07033353p010027o396117n618066n545515m873942m836584l852365m081060
16691F4819677l770577l698116k874510l044407k883781k691913k632437k233445
16683D0990491j762977k066354j427847j910510j958728j272914j117409j547867
16675B7925885r70268j250100q37216j146762j073405r86544n29647q63048j143589
16666A9125306o20957l51256q29470q01456o75419k05727q57184l5595j024316
16657A3723926J6113q98374k63258l05436k22866n49790j134o60828j71145l36438
16647A0330770m05877n6837p38109j03519m77459N51993o42373k25471j31106
16638H102012l98182N7148j14647n22876j18916K02034n45271Q6562o71266J32093
$$ plain form
16628 6208691 5956161 5800745 5635651 5779108 5653490 5572255 4804665 5315042 5214576 5019607
16618 5019607 4780648 4367038 4867100 4659423 4617259 4183218 4452446 4210178 4221584 3989249
16608 3989249 4141510 3838930 3999736 3757389 3903373 3549452 3338748 3556743 3636990 3379993
16598 3379993 3475738 3440605 3468788 3326444 3065970 3271297 3183799 2891563 2935123 2861277
16588 2861277 3284861 2966354 2772513 2685978 2523251 2650351 2481409 2571320 2636420 2286887
16578 2286887 2411860 2223873 2076104 2840478 2445110 2328698 2350453 2134287 2415776 2510213
16568 2510213 2233507 2238158 2084378 1963886 2327082 2050029 1809741 2123657 1789794 1681602
16558 1681602 1755308 1595206 1958143 1751233 1527661 1703022 1488549 1758308 1598726 1904965
$$ packed form
16628F208691k52530j55416j65094J43457j25618q1235p67590N10377j00466j94969
16618E019607k38959m13610N00062k07677m2164m34041K69228k42268J1406k32335
16608C989249J52261l02580J60806k42347J45984l53921k10704K17995Q0247k56997
16598C379993R5745l5133K8183j42344k60474K05327q7498k92236M3560p3846
16588B861277M23584l18507j93841q6535j62727J27100j68942Q9911O5100l49533
16578B286887J24973j87987j47769P64374l95368j16412K1755k16166K81489R4437
16568B510213k76706M651j53780j20492L63196k77053k40288L13916l33863j08192
16558A681602P3706j60102L62937k06910k23572J75361k14473K69759j59582L06239
$$ plain form
16548 1904965 1564451 1437513 1435636 1568015 1511037 1278400 1860492 1401637 1357881 1247623
16538 1247623 1575203 1150775 1362357 1544656 1029014 1586050 1238483 1231891 1246482 1450264
16528 1450264 974562 1222893 1198973 1193467 827630 777072 1281305 1097745 1017946 1183727
16518 1183727 1182617 978290 914669 1140588 1116618 1038438 1073927 1169137 1173409 969599 1195603
16507 1195603 786129 517340 1106550 968703 1007964 942162 826792 639637 915787 749352
16497 749352 717149 1154114 1149161 624312 774499 776727 826994 624537 851142 575913 857987
16486 857987 698667 559687 833640 909056 634224 789346 936427 950520 865726 855046
16476 855046 608654 797033 967719 636755 368378 286569 517198 724421 700303 584081
$$ packed form
16548A904965l40514j26938j877J32379n6978k32637N82092m58855m3756j10258
16538A247623L27580m24428K11582J82299n15642N57036l47567o592J4591K03782
16528A450264m75702K48331k3920n506l65837n0558N04233j83560p9799J65781
16518A183727j110k04327o3621K25919k3970p8180L5489R5210M272k03810K26004
16507A195603m09474k68789N89210j37847L9261o5802j15370j87155K76150j66435
16497G49352l2203M36965m953n24849J50187K228N0267k02457K26605k75229K82074
16486H57987j59320j38980K73953P5416k74832J55122J47081J4093q4794j0680
16476H55046k46392J88379J70686l30964k68377q1809K30629K07223k4118j16222
$$ plain form
16466 584081 493777 592588 442034 437965 274548 346635 671486 349587 1080464 62400 792415
16455 792415 638250 614150 311791 823316 437579 348439 757635 612705 598438 416940
16445 416940 818416 470881 701929 504612 556408 459082 681975 361394 349564 337784
16435 337784 608472 1127701 324244 625621 584254 412641 512334 478070 656956 555029
16425 555029 536352 496637 334423 765946 412968 465288 802908 605815 59995 787597
16415 787597 756684 210918 282093 430990 476856 528051 666127 449624 468332 364639
16405 364639 236242 324001 658426 440143 757703 650239 207512 349229 454593 278440
16395 278440 208650 380982 178461 574492 160562 133681 206114 457894 346213 377087
$$ packed form
16466E84081r0304R8811j50554m069j63417P2087L24851l21899P30877F2400P30015
16455G92415j54165k4100l02359N11525l85737q9140M09196j44930j4267j81498
16445D16940M01476l47535K31048j97317N1796r7326K22893l20581j1830j1780
16435C37784K70688N19229C24244L01377m1367j71613R9693l4264J78886j01927
16425E55029j8677l9715j62214M31523l52978N2320L37620j97093E9995P27602
16415G87597l0913B10918P1175J48897M5866N1195J38076k16503J8708j03693
16405C64639j28397Q7759L34425k18283L17560j07464B07512J41717J05364j76153
16395B78440o9790J72332A78461L96031A60562k6881P2433K51780j11681L0874
$$ plain form
16385 377087 457699 -209122 444027 261590 353644 606825 496443 201986 360063 414067
16375 414067 164797 198553 182706 412200 202738 57813 322336 276109 72193 307120
16365 307120 160729 479409 -8774 412788 415613 223319 -107426 453585 234038 422211
16355 422211 117855 88451 286520 8804 317252 220583 331947 169076 201062 -249139
16344 241512 415820 151014 267776 365071 451862 133859 -110502 319242 157187 313797
16334 313797 -154352 268951 182153 302914 90815 157795 398838 424234 323864 92718
16323 106765 -94209 305022 149559 89041 125028 -22405 -146163 273531 36197 562640
16313 562640 -103489 64635 10693 323848 309523 230178 -10166 237751 199261 180492 143962
$$ packed form
16385C77087Q0612b09122D44027j82437R2054K53181j10382B01986J58077N4004
16375D14067A64797L3756j5847K29494B02738E7813K64523m6227G2193K34927
16365C07120j46391L18680h774D12788K825j92294a07426D53585k19547J88173
16355D22211A17855k9404J98069H804L08448r6669J11364j62871L1986b49139
16344B41512J74308A51014J16762R7295Q6791A33859a10502C19242A57187J56610
16334C13797a54352B68951q6798J20761I0815O6980K41043K5396j00370I2718
16323A06765i4209C05022A49559o0518L5987b2405j23758B73531C6197N26443
16313E62640a03489F4635A0693L13155j4325p9345a0166B37751l8490j8769l6530
$$ plain form
16302 143962 237397 244450 185767 250702 261557 -30718 281614 142806 348869 148558 219706
16291 219706 462032 255018 240937 68311 -47680 373510 63589 121539 141986 67481 290395
16280 290395 213086 321991 117750 -13418 164595 -289414 347573 110786 261164 316673
16270 316673 167314 246809 -27625 -63925 25064 248636 178991 54742 -15652 8816 -82 -125610
16258 -125610 230950 314150 67339 83713 54007 -395840 61835 -44372 159529 -166022 -94970
16247 -94970 -135404 135939 166463 279308 128024 210318 15770 -12493 214798 102493 -356630
16235 90614 115483 -8262 -85019 2127 -60265 -55340 -236276 23421 91916 -99625 -156263 -42350
16222 -242476 223555 353309 231425 -3320 260772 -28589 621340 30230 -260368 -78947
$$ packed form
16302A43962R3435P053n8683O4935J0855c0718B81614j38808K06063A48558P1148
16291B19706K42326k07014j4081F8311d7680C73510F3589N7950K0447F7481K22914
16280B90395p7309J08905A17750a3418A64595b89414C47573A10786J50378N5509
16270C16673j49359P9495b7625l6300B5064K23572o9645E4742a5652H816h2j25528
16258a25610B30950Q3200F7339J6374k9706c95840F1835d4372A59529a66022P1052
16247i4970m0434A35939L0524J12845A28024Q2294A5770a2493B14798A02493c56630
16235I0614K4869h262p6757B127f0265M925j80936B3421O8495i9625n6638d2350
16222b42476B23555J29754j21884c320B60772b8589F21340C0230b60368g8947
$$ plain form
16211 77453 25235 372061 222846 -118729 -97682 168656 -182078 129170 -53008 -60891 353982
16199 35805 62684 -163839 67396 -69639 118958 160763 326438 -6878 75887 -3294 245866
16187 100381 307642 12288 -76797 180 -357626 182857 171060 200871 -132653 136260 350007
16176 350007 -213035 -53324 119867 -91042 128758 155594 62833 320516 -117418 61426
16165 196222 -284517 505284 113922 78294 -78343 -73123 190017 215991 -15410 -35968 192806
16153 14420 -53744 168117 -13379 -74559 -38918 -6965 144678 -401505 -312162 116489 146100
16142 146100 -89317 -322472 174188 177062 -105887 -442712 12739 -166862 68940 -192879
16131 -30034 336180 245495 -174457 106596 227044 104445 -54297 -175715 46459 378301
$$ packed form
16211G7453B5235L46826j49215a18729K1047A68656a82078A29170e3008p883C53982
16199C5805K6879a63839F7396f9639A18958M1805J65675f878G5887c294B45866
16187A00381K07261A2288g6797A80c57626A82857j1797K9811a32653A36260K13747
16176C50007b13035e3324A19867i1042A28758K6836F2833K57683a17418F1426
16165A96222b84517E05284A13922l5628g8343N220A90017K5974a5410k0558A92806
16153A4420e3744A68117a3379o1180L5641f965A44678d01505Q9343A16489K9611
16142A46100h9317k33155A74188K874a05887l36825A2739a66862F8940a92879
16131c0034C36180r0685a74457A06596J20448A04445e4297j21418D6459L31842
$$ plain form
16121 378301 217864 227957 -170083 238684 58671 92040 330551 -109700 -6520 31707 287891
16110 287891 234744 -322413 182033 -202582 198321 42496 -160680 140986 96515 -36608
16099 203587 117890 173742 -212050 -245838 -44551 344647 50384 -161891 306210 13788 109845
16088 109845 9063 -12666 81526 17274 154934 -338755 -108821 63954 -347625 -323257 -210837
16077 -210837 90754 122135 119950 -118662 -281764 43332 -3480 -300074 -22397 132357 76677
16066 76677 143144 27312 -259200 -21277 32641 207547 -222652 -159237 -104962 -361252 134985
16054 -24991 -239738 -17659 121361 -22898 -103966 147562 129052 -203867 -81441 144723 54896
16042 27810 -27734 -57430 -315897 -120785 35675 -207654 -110058 42529 -266351 -320332 -93482
$$ packed form
16121C78301j60437J0093a70083B38684E8671L3369K38511a09700f520C1707K56184
16110B87891n3147c22413A82033b02582A98321D2496a60680A40986m4471c6608
16099B03587q5697N5852b12050l3788d4551C44647E0384a61891C06210A3788R6057
16088A09845I063a2666H1526A7274J37660c38755a08821F3954c47625K4368J12420
16077b10837I0754L1381k185a18662j63102D3332c480k96594b2397A32357n5680
16066G6677O6467B7312b59200b1277C2641J74906b22652O3415N4275k56290A34985
16054b4991k14747a7659A21361b2898q1068A47562j8510b03867h1441A44723E4896
16042B7810b7734k9696k58467a20785C5675b07654R7596D2529b66351n3981i3482
$$ plain form
16030 -86537 -254084 23275 188252 -133067 -21122 202637 -169592 -410925 154312 -104595
16019 283752 96467 236387 11886 116168 -239191 -92278 -139848 -163602 -202079 -22302 226070
16007 78309 -80495 -138336 -94880 138930 -221399 117034 -234897 158796 305474 -87169
15996 111410 158594 -84392 -163649 142379 165378 446622 107427 94194 -66077 233037 208296
15985 208296 -39686 -3646 232773 153924 376612 12530 -271263 282722 -51781 -150467 88312
15973 61455 326230 80962 -33834 -109844 100260 94351 -70282 -171938 -8000 91263 -71479
15961 -175196 -105181 -300452 310024 -19100 161259 205843 -78956 20684 115109 57248 -154873
15949 142370 -322172 -165205 -146435 104870 360948 -288890 -37985 -193299 -328832 -198165
$$ packed form
16030h6537j67547B3275J64977a33067b1122B02637a69592k41333A54312a04595
16019B83752I6467J39920A1886J04282b39191i2278m7570k3754l8477b2302B26070
16007G8309h0495n7841M3456A38930b21399A17034b34897A58796J46678h7169
15996A11410M7184h4392p9257A42379K2999K81244A07427j3233f6077B33037k4741
15985B08296c9686c646B32773p8849K22688A2530b71263B82722e1781r8686H8312
15973F1455K64775H0962c3834p6010A00260n909g0282j01656h000I1263g1479
15961a75196P0015j95271C10024a9100A61259M4584g8956B0684R4425E7248a54873
15949A42370c22172J56967J8770A04870K56078b88890c7985j55314j35533J30667
$$ plain form
15939 -198165 37081 2773 -193470 -81458 -51048 -160753 -220278 -119599 -171240 -29141 -294992
15928 -294992 116858 -103156 -289293 -203946 41070 34681 76076 -18321 -102571 154498 -194238
15916 313338 -51572 -6474 31182 -62914 -19705 55438 139664 -111353 382 -145793 -252756
15905 -252756 -60823 24895 -86374 -34045 -142865 6495 190150 -77516 -133009 -107911 -112160
15894 -112160 325246 -107071 -125963 89345 -136321 -28032 -29769 71087 123154 247086 187134
15883 187134 -26306 55414 65697 166818 -49153 -5717 -104772 54479 -242233 -247031 -173649
15872 -173649 212165 -214846 118052 -38985 262541 42507 -14617 160139 101969 163048
15862 163048 66912 -125148 145894 305177 17304 -361001 -165956 -164876 72727 -17338 -69931
$$ packed form
15939a98165C7081B773a93470h1458L0410j09705n9525J00679n1641b9141k65851
15928b94992A16858a03156j86137Q5347D1070o389M1395a8321q4250A54498a94238
15916C13338e1572f474C1182f2914a9705E5438Q4226a11353C82a45793j06963
15905b52756f0823B4895h6374c4045j08820F495J83655g7516n5493K5098m249
15894a12160C25246a07071j8892H9345a36321b8032j737G1087N2067J23932n9952
15883A87134b6306E5414J0283J01121d9153e717r9055E4479b42233m798P3382
15872a73649B12165b14846A18052c8985B62541D2507a4617A60139n8170O1079
15862A63048F6912a25148A45894J59283A7304c61001a65956J080G2727a7338n2593
$$ plain form
15851 -69931 -31946 -58789 157182 -211080 -236061 -6489 -418099 88747 -102337 42508 -136920
15839 127025 -45303 -7638 193576 7099 -150184 -85053 138323 -110850 -35829 -102588 -23898
15827 -138624 214821 116467 98071 33154 -44645 -165785 66205 148550 221625 -83353 -72396
15816 -72396 -203546 -78756 -33954 -62962 233670 -189239 -108346 -237849 -74161 -41680 51125
15804 23173 205543 -124481 -192276 -148818 -225580 -64912 -115531 124241 -360447 -168714 125483
15792 -550548 -225700 265313 -41461 249399 -366269 50577 -6138 -59984 43549 -14378 -3031
15780 -32856 -22290 81932 -137590 152464 -95167 -33600 -119752 -310983 -248612 -243095 221128
15768 -208344 -268162 -524581 -165200 -56358 -33691 -200682 -4256 258562 -36045 128800 300493
$$ packed form
15851f9931c1946k6843A57182b11080k4981f489m11610H8747a02337D2508a36920
15839A27025d5303g638A93576G099a50184O5131A38323a10850c5829o6759b3898
15827a38624B14821r8354j8396C3154d4645j21140F6205Q2345P3075h3353J0957
15816g2396j31150g8756c3954k9008B33670a89239Q0893j29503g4161L2481E1125
15804B3173J82370a24481o7795M3458p6762f4912n0619A24241c60447a68714A25483
15792e50548b25700B65313d1461B49399c66269E0577f138n3846D3549a4378c031
15780c2856J0566H1932a37590A52464i5167c3600q6152j91231O2371N517B21128
15768b08344n9818k56419a65200e6358K2667j66991d256B58562c6045A28800J71693
$$ plain form
15757 300493 -25160 -14563 -90283 155792 124153 -60387 -352738 -115824 100650 -233739
15746 -273798 132377 160060 -193853 305287 248669 130239 49838 -21573 42344 312687
15736 312687 155562 -52287 83751 -207759 146195 124821 29256 -371352 148895 -8943 -57191
15725 -57191 -47520 -312120 -123419 356433 -181786 -75999 -334861 -32155 -255284 189252
15714 -44433 -39432 -17357 -134900 19629 186614 -255809 -112217 -336909 -67922 369324 -84612
15702 59942 107750 -201185 -58723 392155 -40912 -142044 -31792 -8281 -210135 -47891 140243
15690 -44587 -93690 -47962 89341 -104884 -33737 116843 -79973 -55578 -40326 124763 264699
15679 264699 -85100 -115263 -499360 -197537 80411 182671 126300 -270593 126392 99121
$$ packed form
15757C00493b5160J0597p5720A55792l1639f0387k92351a15824A00650b33739
15746b73798A32377K7683a93853C05287n6618j18430D9838b1573D2344K70343
15736C12687A55562e2287H3751b07759A46195k1374B9256c71352A48895h943m8248
15725e7191R671k64600a23419C56433a81786g5999k58862c2155k23129A89252
15714d4433N001a7357j17543A9629J66985b55809a12217k24692f7922C69324h4612
15702E9942M7808b01185e8723C92155d0912j01132c1792h281k01854d7891A40243
15690d4587m9103M5728H9341a04884c3737A16843g9973K4395J5252A24763J39936
15679B64699h5100l0163l84097a97537H0411J02260n6371b70593A26392k7271
$$ plain form
15669 99121 9826 255294 233951 -59382 -237067 -61400 1605 61227 -87312 -127095 1673 -143358
15656 135569 53565 23821 -41997 350043 -14935 -140319 -107096 -964 -221193 9858 -213217
15644 -3450 144616 -92166 -120990 10951 169274 63856 -349315 -9233 -119837 -255913 -134635
15633 -134635 -112067 54993 -62921 30452 9622 -375856 52660 287941 -107549 24589 44592
15622 44592 -168762 -73849 -84640 275210 339565 -58734 28880 -96372 -351637 29106 -8076
15610 153504 229967 99490 177710 -7995 -20926 146173 -271592 -3920 -77911 -325005 188213
15598 190387 -137541 -56242 -102603 -168026 -123135 -267965 166718 51281 -5492 31991 -41055
15586 -172423 -32438 321553 291851 -120394 100899 76064 145213 -40534 -315803 -84531 11581
$$ packed form
15669I9121I826K45468k1343e9382j77685f1400A605N9622h7312l9783A673a43358
15656A35569E3565B3821d1997C50043a4935j25384L3223i64k20229I858b13217
15644c450A44616i2166k8824A0951J58323F3856c49315i233j10604j36076J21278
15633a34635K2568E4993f2921C0452I622c75856E2660K35281a07549B4589K0003
15622D4592a68762g3849j0791B75210O4355e8734B8880i6372k55265B9106h076
15610A53504P6463I9490P8220g995j2931A46173b71592c920p3991k47094A88213
15598A90387a37541e6242m6361o5423M4891j44830A66718E1281e492C1991d1055
15586a72423c2438C21553k9702a20394A00899k4835O9149d0534k75269h4531A1581
$$ plain form
15574 -144597 -174686 -164326 -76680 -118921 -196527 -183263 68528 186065 68247 -91917 -170583
15563 -170583 -275400 187271 51089 125478 26804 -206211 -203252 -8480 -26592 -99096 -163117
15552 -163117 17448 48067 -80803 37630 69670 4130 -18176 -6689 100925 -22993 47059 -112101
15539 -139017 141472 2732 166632 -164824 -138961 -61754 -21250 181673 205284 402818 -221098
15527 -105297 4523 -246759 143633 41691 33955 260746 257313 246274 -250396 210229 140424
15516 140424 306170 -284391 -55596 -59201 -135711 -5536 -266550 -346845 117656 25290 -143583
15504 130175 -285204 -26783 163706 -92752 222625 15320 104529 32068 -313335 -135028
15493 43520 25536 42639 -117741 67519 -192887 -325961 -137629 -177473 -428427 74796 -108107
$$ packed form
15574a44597l0089J0360g6680m2241p7606J3264F8528J17537F8247i1917p8666
15563a70583j04817A87271E1089P4389B6804b06211K959h480j8112p2504o4021
15552a63117A7448L0619h0803C7630L2040D130a8176f689A00925b2993D7059a12101
15539a39017A41472B732J63900a64824K5863f1754b1250A81673K3611J97534b21098
15527a05297D523b46759A43633D1691p736K26791l433j1039b50396B10229o9805
15516A40424J65746b84391e5596l605p6510e536k61014q0295A17656B5290a43583
15504A30175b85204b6783A63706i2752B22625A5320Q9209C2068c13335a35028
15493D3520j7984J7103a17741F7519a92887j33074a37629l9844k50954G4796a08107
$$ plain form
15481 145518 -664948 363803 -154049 -79933 393759 -74816 96110 960 219748 -100858 233034
15469 214680 -146241 127977 241400 -202745 -9199 -98436 -338898 -81769 208782 -178122
15458 -7250 -108603 -27603 -77975 91093 171664 144525 -225433 -55217 -253837 -148038 224675
15446 -174837 63337 149722 -404312 -130253 -43994 -125583 -41443 -188044 119971 223647
15436 223647 -114008 -91915 -165911 -163315 -151912 232080 23061 168764 -24665 35384 156729
15425 156729 11970 201864 -11808 190111 -27335 -251351 3180 -335122 127768 107554 42947
15413 -31211 -63145 18105 112043 -100676 -130815 -87164 59449 -81958 204840 284045 -39956
15401 -241181 -2243 18525 -82731 -163016 -182814 -39626 -256268 -7567 -135598 -17377 72532
$$ packed form
15481A45518f64948C63803a54049P4116C93759g4816I6110I60K18788a00858B33034
15469B14680a46241A27977J13423b02745i199q9237k40462h1769B08782a78122
15458g250j01353b7603n0372I1093Q0571k7139b25433e5217j98620J05799B24675
15446a74837F3337Q6385d04312a30253d3994q1589d1443j46601A19971J03676
15436B23647a14008K2093p3996K596J1403B32080B3061J45703b4665C5384J21345
15425A56729A1970J89894a1808A90111b7335k24016C180c35122A27768k0214D2947
15413c1211l1934A8105R3938a00676l0139M3651E9449h1958B04840P9205c9956
15401b41181b243A8525h2731q0285j9798c9626k16642g567j28031a7377G2532
$$ plain form
15389 -35142 68677 -140005 44784 36129 17209 178126 11824 -165131 427368 231147 205015
15378 205015 -99988 39319 181136 -79356 -194200 35209 -139305 36446 -100013 -102194 -388303
15367 -388303 -275527 -77833 7684 -37503 126612 76973 155394 -87153 -15377 -157591 -74141
15355 149202 395303 136281 -170651 183941 -74780 -262433 -39987 -125840 46452 37929 -100557
15343 -157363 15195 51351 -96381 -167226 -110968 201103 27090 -10193 117526 -293150 173132
15331 205744 45417 -117488 -194982 -67434 -344517 395334 37825 -64034 -68895 177069 260405
15320 260405 211399 31788 90066 -14622 -356523 333112 222722 -71494 -17412 -14787 384697
15308 -60475 7110 -115753 -56353 -357747 20242 -145073 47045 84653 -111450 -46282 -60001
$$ packed form
15389c5142F8677a40005D4784q655A7209J60917A1824a65131D27368j96221k6132
15378B05015i9988C9319J41817g9356j14844C5209a39305C6446a00013k181k86109
15367c88303J12776g7833G684c7503A26612m9639P8421h7153a5377j42214g4141
15355A49202K46101A36281a70651A83941g4780j87653c9987q5853D6452q523a00557
15343a57363A5195L6156i6381p0845N6258B01103B7090a0193A17526b93150A73132
15331B05744D5417a17488p7494f7434k77083C95334C7825f4034m861A77069Q3336
15320B60405m9006C1788N8278a4622l41901C33112j10390g1494a7412K625C84697
15308f0475G110a15753e6353l01394B0242a45073D7045L7608a11450d6282j3719
$$ plain form
15297 -60001 277700 164025 246746 -73528 -45616 110149 32930 -180493 -179252 -28807 109743
15285 -44093 77517 -60491 8909 -139450 -469692 83220 66934 293410 -18936 227310 367753
15274 367753 -113404 48835 203544 -45765 -22625 316374 71350 34947 -148448 116089
15263 225493 17990 176645 -160653 239805 185449 99625 160064 302884 139167 -209981
15252 11889 194104 -152528 217256 1034907 1683202 1209455 1182602 1650547 200433 -130696
15241 -5282 175921 238008 -323470 86001 -50146 241608 32709 22339 514930 -281037 -108698
15229 -70184 245411 93634 -113546 -58945 200883 64511 -141645 44152 359731 58643 252424
15218 252424 233075 9767 177781 -50872 43369 -231979 180245 461827 198660 157315 24416
$$ packed form
15297f0001B77700j13675Q2721g3528K7912A10149C2930a80493J241b8807A09743
15285d4093G7517f0491H909a39450l30242H3220j6286K26476a8936B27310J40443
15274C67753a13404D8835J54709d5765b2625C16374G1350C4947a48448A16089
15263B25493A7990J58655a60653B39805n4356q5824O0439J42820A39167b09981
15252A1889J82215a52528B17256Q17651O48295m73747k6853M67945B00433a30696
15241e282A75921O2087c23470H6001e0146B41608C2709j0370M92591b81037a08698
15229g0184B45411I3634a13546N4601B00883F4511a41645D4152L15579E8643J93781
15218B52424j9349I767J68014e0872D3369b31979A80245K81582A98660m1345B4416
$$ plain form
15206 -176635 19349 161124 349812 127703 279687 77775 159926 103201 141006 -270903
15195 69038 -67449 311475 -5875 -9920 72317 333610 59090 -29476 169427 20651 56863
15184 56863 -200676 -104161 -109697 -67290 163940 -109456 -283495 192038 151270 -116260 136733
15172 -1752 -239981 175539 -218518 286926 178742 120914 79199 277444 152487 11731
15161 -55043 178988 164187 -60974 -232001 -24147 -15346 60937 78951 -71872 122648 88156
15150 88156 69532 -18928 388125 91153 66413 -14301 51273 2248 76772 276814 -141833
15138 299300 -221145 246199 10036 293788 152380 165888 104035 -22008 -124565 418049
15127 4255 172182 195884 132474 -44258 261507 233933 671622 170977 -18413 129267 102189
$$ packed form
15206a76635A9349J41775J88688A27703J51984G7775Q2151n6725L7805b70903
15195F9038f7449C11475e875m045G2317K61293E9090b9476A69427B0651L6212
15184E6863b00676R6515n536M2407A63940a09456j74039A92038m0768a16260A36733
15172a752k38229A75539b18518B86926j08184n7828m1715J98245j24957A1731
15161e5043A78988j4801f0974j71027b4147Q801F0937J8014g1872A22648l4492
15150H8156j8624a8928C88125I1153k4740a4301E1273B248P4524K00042a41833
15138B99300b21145B46199A0036K83752j41408J3508o1853b2008j02557D18049
15127D255J67927K3702o3410d4258B61507k7574M37689A70977a8413A29267k7078
$$ plain form
15116 102189 11799 299139 -35478 245121 236980 -117859 147838 -17630 230428 84834 5350
15104 353042 265884 -9270 -258827 145528 286797 255469 529739 157663 -109292 225289
15093 -34919 -107732 -128563 87310 403478 246126 265664 -96818 41342 178132 194140 248300
15082 248300 61493 264358 -110160 245106 388396 92594 -199468 89689 158899 262814
15072 262814 102781 70573 420000 269688 11507 129015 190301 333539 -292057 -46790
15061 97556 390179 36228 60033 -164251 62227 125081 -227784 -9934 145613 124982 86218
15050 86218 209731 164716 -123502 323093 -80490 -44299 148297 -22523 -153979 140689
15039 -142610 42872 121272 420751 352420 133779 377776 -1963 288894 163196 738729
$$ packed form
15116A02189A1799K87340c5478B45121q141a17859A47838a7630B30428H4834E350
15104C53042q7158i270k49557A45528J41269l1328K74270A57663a09292B25289
15093c4919p2813k0831H7310L16168j57352J9538i6818D1342J36790J6008N4160
15082B48300F1493K02865a10160B45106J43290I2594a99468H9689O9210J03915
15072B62814A02781l2208L49427j50312A1507J17508O1286J43238b92057d6790
15061I7556K92623C6228K3805a64251F2227O2854b27784i934A45613k0631l8764
15050H6218J23513m5015a23502C23093h0490L6191A48297b2523j31456A40689
15039a42610D2872P8400K99479o8331A33779K43997a963B88894j25698N75533
$$ plain form
15029 738729 138666 75779 164822 254011 357665 256190 477649 82590 518419 172024
15018 342209 -15026 41604 245766 111833 -21068 95098 130974 104594 -25507 -15042 338661
15006 175662 -6201 201638 -202166 33732 120968 96742 312587 167035 430180 -71036 -45793
14995 -45793 495951 -12884 436455 121306 397183 177372 128187 361715 10228 268736
14985 268736 308054 18761 110664 335528 607716 29859 173824 288654 396565 196985
14974 91454 98218 184043 227211 285960 105263 231110 115220 -1249 182094 517871 313451
14963 313451 -116889 130728 386506 114372 73524 317070 313461 204220 211457 195010 638225
14952 638225 400683 282741 45051 -11733 260456 470929 293209 295886 592728 -83485
$$ packed form
15029G38729A38666o2887Q9043Q9189J03654j01475K21459H2590M35829A72024
15018C42209a5026D1604K04162A11833b1068I5098L5876k6380b5507J0465C38661
15006A75662f201B01638b02166C3732Q7236k4226K15845j45552K63145g1036K5243
14995d5793D95951a2884D36455A21306K75877A77372m9185K33528A0228K58508
14985B68736L9318A8761R1903K24864K72188B9859J43965J14830J07911A96985
14974I1454O764Q5825M3168N8749A05263J25847A15220a249A82094L35777k04420
14963C13451a16889A30728K55778A14372m0848K43546l609j09241P237j6447M43215
14952F38225k37542j17942D5051a1733B60456K10473j77720K677K96842h3485
$$ plain form
14941 210161 531656 429641 653923 -44444 133079 334296 227276 334120 342609 372906
14931 372906 229920 608210 223420 -77900 406052 -52404 253196 49693 126910 500662
14921 500662 263023 458494 318602 371939 266000 419871 73417 311081 426058 386992
14911 386992 275246 181805 92881 213934 469364 390900 230813 297059 447122 354852
14901 354852 164425 305010 363521 385404 412820 163574 139345 539450 586738 422145
14891 422145 257829 483347 729020 193608 155196 554636 306757 351779 353619 170856
14880 436980 396403 525327 17223 260001 570209 280996 758504 368548 488476 188440
14869 274626 478477 129673 436499 477413 401937 173533 275011 251077 339757 200721
$$ packed form
14941B10161L21495j02015K24282d4444A33079K01217j07020J06844Q489L0297
14931C72906j42986L78290B23420g7900D06052e2404B53196D9693P7217L73752
14921E00662k37639J95471j39892N3337j05939J53871G3417K37664J14977l9066
14911C86992j11746r3441q8924J21053K55430p8464j60087O6246J50063r2270
14901C54852A64425J40585N8511K1883K7416A63574k4229M00105M7288j64593
14891D22145j64316K25518K45673A93608l8412L99440k47879M5022J840A70856
14880D36980m0577J28924A7223K42778L10208B80996M77508C68548J19928A88440
14869B74626K03851A29673L06826M0914p5476A73533J01478k3934Q8680j39036
$$ plain form
14859 200721 107944 490373 449067 376654 230355 476911 467536 155768 723299 468549
14849 468549 419204 135301 8387 272038 417833 425966 184148 370525 338680 682788 656369
14838 656369 646083 177926 440082 591152 141921 527962 391136 577483 599176 479311
14828 479311 360865 245317 451481 110625 18677 766532 594735 480419 213009 489218
14818 489218 405266 382821 544700 436234 603147 385286 466926 189956 554288 352368
14808 352368 517776 746351 420180 268227 465621 510225 657889 635497 569492 569321 363161
14797 363161 736104 380177 432379 630085 787988 561350 748885 630395 559740 579618
14787 579618 666306 628930 630825 702549 875393 304612 236555 848715 599361 605976 561285
$$ packed form
14859B00721r2777L82429m1306p2413j46299K46556r375A55768N67531k54750
14849D68549m9345A35301H387K63651J45795Q133A84148J86377l1845L44108k6419
14838F56369j0286A77926K62156J51070A41921L86041j36826J86347K1693j19865
14828D79311j18446j15548K06164A10625A8677P47855j71797j14316B13009K76209
14818D89218q3952k2445J61879j08466J66913k17861Q1640A89956L64332k01920
14808C52368J65408K28575l26171j51953J97394M4604J47664k2392o6005j71k06160
14797C63161L72943l55927N2202J97706J57903k26638J87535j18490p0655J9878
14787E79618Q6688l7376J895P1724J72844C04612o8057O12160k49354O615m4691
$$ plain form
14776 561285 679859 426273 557330 625224 779858 563566 482002 672055 824932 642083
14766 642083 538060 305254 594513 670309 386130 461482 604941 551189 566535 424529
14756 424529 548011 811077 721046 620881 730786 910405 411136 613379 578182 817602
14746 817602 691847 733000 939257 684273 955377 706412 784249 630670 775990 514681
14736 514681 878943 713005 802211 962751 678628 793877 565445 659166 361798 936120
14726 936120 827765 1210066 503468 1054428 872806 831692 891969 1024290 939244 737981
14716 737981 781377 790823 773261 1047769 688546 760783 598442 758214 1071054 914821
14706 914821 795040 1152432 601186 582537 1046174 460308 978171 862897 1061409 837922
$$ packed form
14776E61285J18574k53586J31057O7894J54634k16292q1564J90053J52877j82849
14766F42083j04023k32806K89259P5796k84179P5352J43459n3752J5346j42006
14756D24529J23482K63066r0031j00165J09905J79619D11136K02243l5197K39420
14746H17602j25755M1153K06257k54984K71104k48965P7837j53579J45320k61309
14736E14681L64262j65938Q9206J60540k84123J15249k28432R3721k97368N74322
14726I36120j08355L82301E03468N50960j81622m1114O0277J32321q5046k01263
14716G37981M3396R446j7562K74508l59223P2237j62341J59772L12840j56233
14706I14821j19781L57392n51246j8649M63637D60308N17863j15274J98512k23487
$$ plain form
14696 837922 862871 1238344 870088 1162657 1131714 612527 925326 995625 1022494 869762
14686 869762 877138 967611 1086422 839991 937950 920435 861740 1303014 744855 1422008 874456
14675 874456 1155200 1185984 800010 1093806 658477 1148171 868799 750661 1066811 651106
14665 651106 1177442 1476570 962224 1253171 1084141 846753 1315651 1096878 864677 1158531
14655 1158531 1141097 824222 1449075 1142498 954844 941811 1399314 1009960 1242269 976050
14645 976050 1218371 1192719 1234651 1328456 1205541 1246159 1416794 1343713 1100864 1473123
14635 1473123 1681206 1291682 1310772 1278094 1008791 1391563 1605490 1452803 1494148 1483565
14625 1483565 1458474 1587775 1442439 1396525 1396970 1451501 1595711 1082545 1204831 1440523
$$ packed form
14696H37922K4949L75473l68256K92569l0943n19187L12799P0299K6869j52732
14686H69762P376R0473J18811k46431R7959j7515n8695M41274n58159O77153n47552
14675H74456K80744L0784l85974K93796m35329M89694k79372j18138L16150m15705
14665F51106N26336K99128n14346K90947j69030k37388M68898k18773k32201K93854
14655A158531j7434l16875O24853l06577j87654j3033M57503l89354K32309k66219
14645I76050K42321k5652M1932R3805j22915M0618J70635p3081k42849L72259
14635A473123K08083l89524J9090l2678k69303L82772K13927j52687M1345j0583
14625A483565k5091J29301j45336m5914M45N4531J44210n13166J22286K35692
$$ plain form
14615 1440523 1490935 1574419 1398061 1273333 1706851 1627389 1628100 1373481 1600106 1873079
14605 1873079 1639279 1740869 1760624 1576321 1621357 1477984 1750942 1567581 1446410 1790791
14595 1790791 2067803 1946879 1843530 1884020 1734074 2017565 2090939 1711282 1901593 1831506
14585 1831506 1551779 1974888 1524595 1912054 2074918 2041186 1669921 2184531 2243472 2220372
14575 2220372 1855224 2020012 2075525 2326063 2187331 2488247 2602150 2193647 2628742 2189583
14565 2189583 2502267 2466792 2524811 2747912 2464758 2748071 3307272 3108889 3227630 3279566
14555 3279566 3289277 3699080 4004083 4362915 5332747 6367630 8054143 12555359 22934173
14546 22934173 42625968 44793059 22610142 9426003 4868245 3612505 2772703 2605778
$$ packed form
14615A440523N0412Q3484j76358j24728M33518p9462P11k54619K26625K72973
14605A873079k33800J01590J9755j84303M5036j43373K72958j83361j21171L44381
14595A790791K77012j20924j03349M0490j49946K83491P3374l79657J90311p0087
14585A831506k79727M23109m50293L87459J62864l3732l71265N14610N8941k3100
14575B220372l65148J64788N5513K50538j38732L00916J13903m08503M35095m39159
14565B189583L12684l5475N8019K23101k83154K83313N59201j98383J18741N1936
14555C279566R711M09803L05003L58832R69832J034883J686513M501216J0378814
14546B2934173J9691795K167091k2182917I426003m557758j255740q39802j66925
$$ plain form
14538 2605778 2147533 2363996 2157593 2428473 2303358 2465888 2180829 2229319 2173951 2379572
14528 2379572 2715251 2191804 2378150 2583980 2506770 2452559 2302824 2464444 2894394 2860631
14518 2860631 2844883 2592822 2867239 2828593 2974133 2827620 2851168 2848264 3077983 2807889
14508 2807889 2933679 2977796 3069234 2851195 3106604 3256639 3157446 3268688 3376421 3058442
14498 3058442 3581691 3403979 3649054 3306435 3341552 3550839 3624149 4065610 3576218 3609953
14488 3609953 3281709 3598908 3689207 3966481 3956315 3733674 4129270 4129232 4048119 4004400 4100170
14477 4100170 4207612 4401239 4481760 4580213 4212547 4230282 4910630 4623070 4733152 4537508
14467 4537508 4465093 4724162 4797551 4789292 4941860 4854608 4812061 4948848 5347328 4970076
$$ packed form
14538B605778m58245K16463k06403K70880j25115J62530k85059M8490n5368K05621
14528B379572L35679n23447J86346K05830p7210n4211j49735J61620M29950l3763
14518B860631j5748k52061K74417l8646J45540j46513K3548k904K29719k70094
14508B807889J25790M4117R1438k18039K55409J50035r9193J11242J07733l17979
14498C058442N23249j77712K45075l42619L5117K09287P3310M41461m89392L3735
14488C609953l28244L17199R0299K77274j0166k22641L95596l8q1113m3719R5770
14477D100170J07442J93627Q0521R8453l67666J7735O80348k87560J10082j95644
14467D537508p2415K59069P3389q259J52568q7252m2547J36787L98480l77252
$$ plain form
14457 4970076 5694317 5388462 5394377 5063792 5312733 5520810 5755517 5595346 5828742 5916617
14447 5916617 5808910 6022641 6375008 6115959 6119571 6247488 6203015 6569101 6557366 6898474
14437 6898474 6914520 6752534 6645410 7011005 6964030 7151018 7383463 7240238 7565607 7442260
14427 7442260 7713406 7305356 7774304 7992857 8005967 7947670 8083632 8518968 8485677 8618660
14417 8618660 8625687 8902092 8853328 9055431 9034501 9633693 9610654 9709188 9821864 10262121
14407 10262121 10209976 10141199 10464131 10419220 10761611 10848832 11442178 11329112 11387308 11725403
14397 11725403 11789838 12030637 12240905 12333040 12420003 12825706 13199258 13654282 13474798 13630322
14387 13630322 13960107 14206203 14616414 14950584 15148880 15264086 15446424 15832101 15846589
$$ packed form
14457D970076P24241l05855N915l30585K48941K08077K34707j60171K33396Q7875
14447E916617j07707K13731L52367k59049L612J27917m4473L66086j1735L41108
14437F898474J6046j61986j07124L65595m6975J86988K32445j43225L25369j23347
14427G442260K71146m08050M68948K18553J3110n8297J35962M35336l3291J32983
14417H618660P027K76405m8764K02103k0930N99192k3039R8534J12676M40257
14407A0262121n2145o8777L22932m4911L42391Q7221N93346j13066N8196L38095
14397A1725403O4435K40799K10268R2135Q6963M05703L73552M55024j79484J55524
14387A3630322L29785K46096M10211L34170J98296J15206J82338L85677J4488
$$ plain form
14378 15846589 16425913 16811331 17270613 17641206 17975167 18160587 18460331 19206692 19216659 19735377
14368 19735377 20436571 20497191 20751853 21546613 21771732 22338332 22709133 23109320 23526960
14359 23526960 24170829 24617145 25590444 25909949 26593612 27134965 27797199 28864911 29334511
14350 29334511 29792104 30790070 31383056 32216033 32918586 33766349 34727975 35819292 36665628
14341 36665628 37783162 38866966 39506395 40779886 42103664 43176469 44419633 45471014
14333 45471014 47118070 48256848 50109049 51512968 52895067 54773413 56404601 57965283
14325 57965283 60113088 62217350 64359039 66625141 69009722 71247232 73590665 76555542
14317 76555542 79453499 82458273 85642139 88709248 92207741 95773869 99765060 103615794
$$ packed form
14378A5846589N79324L85418M59282L70593L33961J85420K99744P46361R967N18718
14368A9735377P01194O0620K54662P94760K25119N66600L70801M00187M17640
14359B3526960O43869M46316R73299L19505O83663N41353O62234J067712M69600
14350B9334511M57593R97966N92986Q32977P02553Q47763R61626J091317Q46336
14341C6665628J117534J083804O39429J273491J323778J072805J243164J051381
14333D5471014J647056J138778J852201J403919J382099J878346J631188J560682
14325E7965283K147805K104262K141689K266102K384581K237510K343433K964877
14317G6555542K897957L004774L183866L067109L498493L566128L991191L850734
$$ plain form
14309 103615794 108023770 112735445 117611104 122377470 127985850 133399236 139529606 145536955
14301 145536955 152205233 159511611 167163400 175023484 183432266 192341321 201607018 211299258
14293 211299258 222009909 233051465 244722129 256470225 269406385 282446925 295976579
14286 295976579 310480905 325098336 339967339 355231656 370337067 385449721 400784540
14279 400784540 415361422 429457280 442511000 454529878 464922032 473421970 479218209
14272 479218209 481127141 479942377 478077585 475955691 471130715 466176029 458028941 448587684
14264 448587684 437085701 424362433 410868348 396398047 381445763 365944525 350177005
14257 350177005 334536255 318870075 304382471 290068913 275888114 262416075 249494116
$$ packed form
14309A03615794M407976M711675M875659M766366N608380N413386O130370O007349
14301A45536955O668278P306378P651789P860084Q408782Q909055R265697R692240
14293B11299258J0710651J1041556J1670664J1748096J2936160J3040540J3529654
14286B95976579J4504326J4617431J4869003J5264317J5105411J5112654J5334819
14279D00784540J4576882J4095858J3053720J2018878J0392154Q499938N796239
14272D79218209J908932j184764j864792k121894m824976m954686q147088r441257
14264D48587684j1501983j2723268j3494085j4470301j4952284j5501238j5767520
14257C50177005j5640750j5666180j4487604j4313558j4180799j3472039j2921959
$$ plain form
14250 249494116 237189824 225351953 214409421 204070073 194412216 185059783 176870257
14243 176870257 168498109 160603956 153079201 146179731 139552667 133880953 128157152 122518856
14235 122518856 117405575 112519508 107518404 103428855 99859176 95471387 91985210 88591210
14227 88591210 85071225 81727938 79098543 75936835 72911688 70746234 68114114 66000579
14219 66000579 63936730 61680532 59634588 57692371 55901297 54532109 53012350 51115434
14211 51115434 49329187 48319234 46495379 45326839 44742920 43628347 41703724 40623298
14203 40623298 39414251 38419517 37932877 36884674 35824651 34771059 33805715 32753765
14195 32753765 32522259 31399889 30741635 29852030 29191845 28275081 27607353 27034105 26454982
$$ packed form
14250B49494116j2304292j1837871j0942532j0339348r657857r352433q189526
14243A76870257q372148p894153p524755o899470o627064n671714n723801n638296
14235A22518856n113281m886067n001104m089549l569679m387789l486177l394000
14227H8591210l519985l343287k629395l161708l025147k165454k632120k113535
14219F6000579k063849k256198k045944j942217j791074j369188j519759j896916
14211E1115434j786247j009953j823855j168540n83919j114573j924623j080426
14203D0623298j209047r94734m86640j048203j060023j053592r65344j051950
14195C2753765k31506j122370o58254q89605o60185r16764o67728n73248n79123
$$ plain form
14186 26454982 26017803 25364021 24390590 24159213 23802572 22855778 22932660 22029612 21860297
14177 21860297 21106839 21157032 20574478 19767045 19402196 19051174 19070962 18509642 18011853 17608551
14167 17608551 17634249 17122189 16819419 16681261 16499076 16022751 15624531 15701082 15081772 14938693
14157 14938693 15020267 14471059 14189120 14206414 13875720 13705551 13604396 13150877 13064740 12777863
14147 12777863 12529944 12195048 12063616 12066654 11897796 11534916 11189574 10987775 11316380 10867219
14137 10867219 10520638 10778944 10700130 9971813 10169025 9825089 9877157 9825304 9647769 9163908
14127 9163908 9430709 9329092 9220743 8886961 8625017 8734927 8883901 8206370 8665080
14118 8665080 7888378 8012895 8183951 8188588 7610792 7478427 7956978 7567729 7839515 7332012
$$ packed form
14186B6454982m37179o53782r73431k31377l56641r46794P6882r03048j69315
14177B1860297p53458N0193n82554q07433l64849l51022J9788n61320m97789m03302
14167A7608551K5698n12060l02770j38158j82185m76325l98220P6551o19310j43079
14157A4938693Q1574n49208k81939J7294l30694j70169j01155m53519q6137k86877
14147A2777863k47919l34896j31432L038j68858l62880l45342k01799L28605m49161
14137A0867219l46581K58306p8814p28317J97212l43936N2068n1853j77535m83861
14127I163908K66801j01617j08349l33782k61944J09910J48974o77531M58710
14118H665080p76702J24517J71056M637n77796j32365M78551l89249K71786n07503
$$ plain form
14108 7332012 7757227 7125889 6873476 7103703 6959959 7218870 6794796 6598797 6902794
14099 6902794 6370770 6699032 6363187 6183935 6263849 6042772 6127167 6139886 6094531 6023049
14089 6023049 5921913 5597413 5609993 5780270 5733063 5507444 5433368 5514477 5301122 5400705
14079 5400705 5455168 5537587 5062919 4981311 5469441 5236693 5267825 5262305 4875941 4505240
14069 4505240 4650754 4751951 4933158 4723427 4439842 4256067 4330853 4310360 4241784 4628868
14059 4628868 4421716 4243183 4322714 4550010 4003083 4012756 4104432 4344844 3935464 3836835
14049 3836835 3860815 3643004 4072058 3981668 3610213 3664748 3578484 3534582 3803636 3718695
14039 3718695 3496498 3190700 3617139 3117633 3583777 3480384 3575008 3425982 3659038 3168911
$$ packed form
14108G332012M25215o31338k52413K30227j43744K58911m24074j95999L03997
14099F902794n32024L28262l35845j79252P9914k21077Q4395J2719m5355p1482
14089F023049j01136l24500J2580J70277m7207k25619p4076Q1109k13355R9583
14079E400705N4463Q2419m74668q1608M88130k32748L1132n520l86364l70701
14069D505240J45514J01197J81207k09731k83585j83775P4786k0493o8576L87084
14059D628868k07152j78533P9531K27296n46927R673R1676K40412m09380r8629
14049C836835K3980k17811M29054r0390l71455N4535q6264m3902K69054q4941
14039C718695k22197l05798M26439m99506M66144j03393R4624j49026K33056m90127
$$ plain form
14029 3168911 3089315 3467368 3336188 3271196 3101435 3106295 3098340 2756244 3099033 2752479
14019 2752479 3148171 2896519 2991464 2482496 2892744 2822746 2947883 2761379 2616165 2710965
14009 2710965 2738788 2895193 2556155 2491726 2525789 2455804 2706134 2497767 2449203 2604579
13999 2604579 2311876 2629628 2286753 2409567 2416314 2427870 2513402 2529544 2802978 3072795
13989 3072795 4063379 7197082 15910061 35788057 45484405 26456233 13571886 8580140
13981 8580140 6342685 5659730 4226494 4235003 3827606 3605662 3033852 2971669 2977937 3061696
13971 3061696 2568277 3067016 2568837 2748561 2379269 2415379 2449044 2379260 2324400 2362243
13961 2362243 2287221 2367743 2489098 2546836 2429884 2047600 2367802 2253048 2230638 2393240
$$ packed form
14029C168911p9596L78053j31180o4992j69761M860p955l42096L42789l46554
14019B752479L95692k51652R4945n08968M10248o9998J25137j86504j45214R4800
14009B710965K7823J56405l39038o4429L4063o9985K50330k08367m8564J55376
13999B604579k92703L17752l42875J22814O747J1556Q5532J6142K73434K69817
13989C072795R90584L133703Q712979J9877996R696348j9028172j2884347m991746
13981H580140k237455o82955j433236Q509m07397k21944n71810o2183O268Q3759
13971C061696m93419M98739m98179J79724l69292L6110L3665o9784n4860L7843
13961B362243p5022Q0522J21355N7738j16952l82284L20202j14754k2410J62602
$$ plain form
13951 2393240 2168050 2075194 2167104 2134134 2237944 1941410 1934311 1724331 1880027 1940455
13941 1940455 2231203 1917759 1852971 1794169 1723981 1882214 1979793 1794512 1803430 1791921 2073172
13930 2073172 1912794 1726230 1854142 2052649 1809178 1761002 1776796 1745284 1969719 1920759
13920 1920759 1594811 1472585 1720848 1550962 1757479 1437094 1745185 1320764 1931418
13911 1931418 1347787 1800448 1395765 1455653 1846642 1681992 1282950 1666303 1478895 1554887
13901 1554887 1312409 1534136 1873097 1610478 1355547 1614578 1529567 1610610 1612770 1283423
13891 1283423 1278608 1520256 1198713 1376496 1158199 1369728 1455934 1266485 1342401 1193388
13881 1193388 1441277 1491082 1720117 1294224 1265839 1085452 1214187 1215679 1372562 1331523
$$ packed form
13951B393240k25190r2856R1910l2970J03810k96534p099k09980J55696O0428
13941A940455K90748l13444o4788n8802p0188J58233R7579j85281Q918j1509K81251
13930B073172j60378j86564J27912J98507k43471m8176J5794l1512K24435m8960
13920A920759l25948j22226K48263j69886K06517l20385L08091m24421O10654
13911A931418n83631M52661m04683N9888L90989j64650l99042L83353j87408P5992
13901A554887k42478K21727L38961k62619k54931K59031q5011Q1043K160l29347
13891A283423m815K41648l21543J77783k18297K11529Q6206j89449P5916j49013
13881A193388K47889M9805K29035m25893k8385j80387J28735J492J56883m1039
$$ plain form
13871 1331523 1303203 1315122 1187059 835088 1485086 1499815 1116248 1384039 1497413 1138725
13861 1138725 1580731 953318 1167454 1598689 879586 1247613 1472841 936986 1330665
13852 1330665 1424295 1113793 1000758 1239313 1156437 1022765 1204113 1129936 1227069 1116949
13842 1116949 874517 1418987 1031755 981602 1464286 1659950 940756 1041062 1283924 1395715
13832 1395715 1340290 1063689 1304451 1212286 1074982 1312123 819174 872577 1185779 995304
13822 995304 971915 1008593 856440 1034235 1225942 1106727 836536 936232 925078 1078224
13812 1078224 974003 902148 826580 753122 972305 847586 806662 997816 1293122 932496
13802 932496 723892 1004434 902752 705087 1079047 811197 1067471 1405449 911550 882947
$$ packed form
13871A331523k8320J1919j28063l51971O49998J4729l83567K67791J13374l58688
13861A138725M42006o27413K14136M31235p19103L68027K25228n35855L93679
13852A330665R3630l10502j13035K38555q2876j33672J81348p4177R7133j10120
13842A116949k42432N44470l87232n0153M82684J95664p19194J00306K42862J11791
13832A395715n5425k76601K40762r2165j37304K37141m92949N3403L13202j90475
13822I95304k3389L6678j52153J77795J91707j19215k70191R9696j1154J53146
13812A078224j04221p1855p5568p3458K19183j24719m0924J91154K95306l60626
13802I32496k08604K80542j01682j97665L73960k67850K56274L37978m93899k8603
$$ plain form
13792 882947 1173133 931511 677439 646373 752615 941174 647617 1061339 917963 1048911
13782 1048911 988925 1154636 1110191 672809 1187203 408004 793707 690893 789755 535333
13772 535333 739305 868074 824644 822164 874533 778724 413576 965347 679448 896750
13762 896750 498386 741525 427429 647643 754484 1000094 662024 737975 873796 547962
13752 547962 598771 582882 741258 813675 882565 637030 424505 797504 935809 623000
13742 623000 647864 820967 1049371 446845 608329 614798 1119748 774269 939158 727937
13732 727937 625220 881130 1324049 490930 865947 678626 786525 186412 600408 492397
13722 492397 666625 791386 561611 408323 861464 467126 692091 788943 409965 616000
$$ packed form
13792H82947K90186k41622k54072l1066J06242J88559k93557M13722j43376J30948
13782A048911n9986J65711m4445m37382N14394D08004L85703j02814R8862k54422
13772E35333K03972J28769m3430k480N2369r5809l65148N51771k85899K17302
13762H96750l98364K43139l14096K20214J06841K45610l38070P5951J35821l25834
13752E47962N0809j5889J58376P2417O8890k45535k12525L72999J38305l12809
13742F23000K4864J73103K28404D46845J61484O469N04950l45479J64889k11221
13732G27937j02717K55910M42919D90930L75017j87321J07899A86412M13996j08011
13722D92397J74228J24761k29775j53288M53141l94338K24965R6852l78978K06035
$$ plain form
13712 616000 429024 538438 719498 521669 557141 565471 638748 638436 729941 853220 1016012
13701 1016012 287003 627482 493177 590381 597162 728594 763726 528998 515887 429520
13691 429520 512478 460193 753532 572408 519380 581090 736181 687110 724556 681388 274220
13679 678879 436671 426522 417070 637112 960495 528018 624936 359564 767249 53343
13668 499535 559694 472002 458429 46638 443888 561164 583074 518722 566495 730549 418442
13657 418442 661055 467211 807252 665317 500317 491040 554051 608640 295501 678370
13647 678370 591994 297296 559140 609128 742213 809863 689834 131022 419561 67875
13636 780407 383628 575541 358275 513810 397573 234080 690530 492206 204365 527314
$$ packed form
13712F16000j86976J09414J81060j97829L5472Q330P3277l12R1505J23279J62792
13701A016012B87003L40479j34305R7204O781J31432L5132k34728j3111q6367
13691D29520Q2958n2285K93339j81124n3028O1710J55091m9071L7446m3168B74220
13679F78879k42208j0149r452K20042L23383m32477R6918k65372M07685E3343
13668D99535O0159q7692j3573D6638L97250J17276K1910o4352M7773J64054l12107
13657D18442K42613j93844L40041j41935j65000r277O3011N4589B95501L82869
13647F78370q6376k94698K61844M9988J33085O7650j20029A31022K88539F7875
13636G80407C83628J91913k17266J55535j16237j63493M56450j98324B04365L22949
$$ plain form
13626 527314 583491 562261 579151 798669 227832 304717 243790 452122 164524 684555
13616 684555 628765 894713 487860 617975 542953 538102 321079 196999 263856 195798 325896
13605 325896 508307 650034 255203 439879 724818 553179 295766 318966 65771 173254
13595 173254 542601 443038 541199 596339 601834 374231 627177 641660 169689 439873 118323
13583 456633 340008 333508 524975 152386 408407 472412 -64135 478804 615550 287066
13572 427288 668453 253718 439431 580476 132613 418438 473266 654861 275112 682769
13562 682769 617560 195632 758387 -33192 285350 88519 540144 582109 386086 472893
13552 472893 568263 298936 227623 104551 297704 216799 236404 142446 375442 595364
$$ packed form
13626E27314N6177k1230J6890K19518B27832P6885o0927K08332A64524N20031
13616F84555n5790K65948m06853J30115p5022m851k17023j24080O6857o8058J30098
13605C25896J82411J41727B55203J84676K84939j71639k57413K3200F5771J07483
13595A73254L69347r9563R8161N5140N495k27603K52946J4483A69689K70184A18323
13583D56633j16625o500J91467A52386K56021O4005f4135D78804J36746B87066
13572D27288K41165B53718J85713J41045A32613K85825N4828J81595B75112M07657
13562F82769o5209A95632N62755c3192B85350H8519M51625M1965j96023Q6807
13552D72893R5370k69327p1313A04551J93153q0905J9605r3958K32996K19922
$$ plain form
13542 595364 424000 -30147 220506 692720 203706 455667 376200 156820 169888 189017
13532 189017 738404 481870 261918 305214 127272 381027 401448 469112 218310 250448
13522 250448 537620 558283 424181 299065 301871 144209 468805 616495 26073 101775
13512 101775 236628 384081 192378 394599 245875 -5133 54051 -12944 404584 111554
13501 205294 163241 403034 321267 483779 283460 127001 49937 148138 143444 488348 263095
13490 263095 246448 569369 450986 66696 372164 417808 279112 534640 371704 340438
13480 340438 685309 213967 729974 313928 523256 216710 406248 249912 379638 246731
13470 246731 323348 -104453 467474 394891 89529 235520 607209 59843 428520 76518
$$ packed form
13542E95364j71364c0147B20506M72214B03706K51961p9467A56820J3068J9129
13532A89017N49387k56534k19952M3296A27272K53755K0421O7664B18310L2138
13522B50448K87172K0663j34102j25116K806A44209L24596J47690B6073P5702
13512A01775J34853J47453j91703K02221j48724e133E4051a2944D04584A11554
13501B05294m2053K39793q1767J62512k00319A27001D9937R8201m694L44904k25253
13490B63095j6647L22921j18383F6696L05468M5644j38696K55528j62936l1266
13480C40438L44871B13967N16007C13928K09328B16710J89538j56336J29726j32907
13470B46731P6617a04453D67474p2583H9529J45991L71689E9843L68677G6518
$$ plain form
13459 358960 246223 107726 295806 281676 215550 253906 510470 409826 -206460 295599
13448 515914 17822 369198 582018 271588 409403 -71677 705832 119598 -122588 157279
13437 68688 186497 283350 431378 229150 -55899 287934 346560 261195 252102 266066 290211
13426 290211 -133132 373095 218029 -6575 35715 126411 297739 492951 542255 196572
13415 337964 -204321 -80761 104395 305115 232599 24376 241277 139962 282710 137394
13404 -5265 210013 114913 346497 397588 -10384 98186 258124 406371 220396 282602 595878
13393 595878 161985 129382 260187 -99402 58622 245950 265411 126145 529902 84057
13382 -36892 362201 360468 73355 201211 -60847 -14174 22032 164146 -62776 573909 24578
$$ packed form
13459C58960j12737A07726J88080j4130o6126L8356K56564j00644b06460B95599
13448E15914A7822L51376K12820B71588J37815g1677G05832A19598a22588A57279
13437F8688J17809R6853J48028k02228e5899B87934N8626q5365r093J3964K4145
13426B90211a33132C73095j55066f575C5715R0696J71328J95212M9304A96572
13415C37964b04321h0761A04395K00720p2516B4376K16901j01315J42748A37394
13404e265B10013r5100K31584N1091a0384I8186J59938J48247j85975O2206L13276
13393E95878A61985l2603J30805i9402E8622J87328J9461A26145M03757H4057
13382c6892C62201j733G3355J27856f0847a4174B2032J42114f2776E73909B4578
$$ plain form
13370 235215 194369 204662 288296 474443 210730 345917 194397 110063 107267 761448 33186
13358 278960 127382 326494 -37623 149007 199128 378753 289301 212108 196125 169349 481025
13347 481025 374687 313678 128783 536778 357420 402817 510152 428164 290131 363080
13337 363080 154886 303396 473148 268509 180147 160081 -114164 284445 120196 188708
13327 188708 -19799 389762 190989 331507 337220 130706 380034 326904 9115 116633 223970
13316 223970 910331 237120 332710 332290 -174250 425235 297271 467812 454547 588332
13306 588332 -62660 -132114 321590 184358 483643 -47382 212251 172067 243188 90468 237424
13295 237424 389067 19297 436061 154951 134808 349386 170682 268719 184661 265214
$$ packed form
13370B35215m0846J0293Q3634J86147B10730J35187j51520q4334k796O54181C3186
13358B78960A27382J99112c7623A49007N0121J79625q9452p7193j5983k6776L11676
13347D81025j06338o1009A28783M07995j79358M5397J07335q1988j38033P2949
13337C63080A54886J48510J69752k04639q8362k0066a14164B84445A20196O8512
13327A88708a9799C89762A90989J40518N713A30706K49328n3130I115J07518J07337
13316B23970O86361B37120R5590m20a74250D25235j27964J70541j3265J33785
13306E88332f2660o9454C21590j37232K99285d7382B12251m0184P1121I0468J46956
13295B37424J51643A9297M16764A54951k0143K14578A70682R8037q4058Q0553
$$ plain form
13285 265214 50566 -25671 315938 90733 102240 352356 276093 -7622 56910 267794 47905
13273 148049 179171 -109228 554119 199423 164444 497704 -34729 460796 53774 28375
13263 28375 374612 208957 188803 78258 208713 282450 106221 256182 391455 467819
13253 467819 259306 32870 282361 69584 76696 406895 351518 -135181 124569 99502 69086
13242 69086 -53408 350553 361523 27937 113826 392655 -176932 166607 330338 32490 38848
13231 38848 -68809 172435 235502 243136 123887 244006 163240 68387 -36992 173721 207595
13220 207595 147457 -155707 71110 -184728 112105 193930 286591 185650 282376 19432 183173
13209 183173 -137445 -100967 259496 -154989 249339 128483 161411 -165528 147901 -193262
$$ packed form
13285B65214E0566b5671C15938I0733J1507K50116p6263g622E6910K10884D7905
13273A48049L1122a09228E54119A99423l4979L33260c4729D60796E3774k5399
13263B8375L46237j65655k0154G8258J30455P3737A06221J49961J35273P6364
13253D67819k08513C2870K49491F9584P112L30199n5377a35181A24569k5067l0416
13242F9086e3408C50553J0970B7937Q5889K78829a76932A66607J63731C2490O358
13231C8848f8809A72435O3067P634j19249J20119q0766F8387c6992A73721L3874
13220B07595o0138a55707G1110a84728A12105Q1825R2661j00941R6726A9432J63741
13209A83173a37445L6478B59496a54989B49339j20856L2928a65528A47901a93262
$$ plain form
13198 -32350 32744 557967 188467 -146299 283307 15079 -22750 133882 146754 99554 -52748
13186 433602 20837 32086 -63853 -65833 54203 -45647 161824 -82502 110483 85557 177551
13175 177551 -9208 577127 293010 -32491 183779 -21091 35058 -34053 -9396 146158 209986
13164 209986 134032 63389 103649 -92697 168354 -119489 152756 243527 293082 -3788 89009
13152 204088 60346 217430 314459 590103 26454 -99559 327679 88537 13167 320182 146231
13140 -89358 36897 -36569 208461 -149129 429921 143361 235250 259287 -55757 -14979 -207906
13129 -207906 358319 -49462 -271717 131611 -13452 150801 52137 59640 174736 174334 -125747
13117 -276163 238729 341041 269411 676029 57975 -143796 60309 86918 35614 241280
$$ packed form
13198c2350C2744N25223A88467a46299B83307A5079b2750A33882J2872m7200e2748
13186D33602B0837J1249f3853j980E4203d5647A61824h2502A10483k4926R1994
13175A77551i208E77127k84117c2491A83779b1091C5058c4053i396A46158O3828
13164B09986p5954F3389M0260i2697A68354a19489A52756R0771M9555c788H9009
13152B04088F0346J57084R7029K75644B6454i9559C27679H8537A3167L07015A46231
13140h9358C6897c6569B08461a49129D29921A43361R1889K4037e5757a4979j92927
13129b07906C58319d9462k22255A31611a3452A50801E2137P503J15096m02a25747
13117b76163B38729J02312p1630M06618E7975a43796F0309K6609C5614K05666
$$ plain form
13107 241280 192813 243565 -24370 421605 330885 -168211 10618 262293 -21406 68246 440883
13096 440883 -21687 -50342 -69719 261387 117450 235632 177320 141622 42462 145558 -226966
13084 33638 51819 8178 63099 -9132 173484 231183 132388 -407944 -38381 32536 122702 -160608
13071 94371 126217 143247 327341 262968 -232236 523769 113922 173058 127607 175735 230275
13060 230275 171252 271833 -79885 70157 332594 -203368 56166 422460 346437 106864
13049 567658 139869 -269907 69867 103117 111516 251519 79385 -102309 -102038 252025 -37011
13037 -141395 -191131 -59072 18338 158290 332747 377485 233919 97781 72303 606442 90044
13025 198314 108718 -231869 -89503 -9001 -54735 178151 400076 -247368 -8702 288379 365485
$$ packed form
13107B41280m8467N0752b4370D21605r0720a68211A0618K51675b1406F8246L72637
13096D40883b1687k8655j9377B61387A17450J18182n8312l5698D2462J03096b26966
13084C3638J8181H178N4921i132A73484N7699r8795d07944c8381C2536R0166a60608
13071I4371L1846J7030J84094o4373b32236E23769A13922N9136m5451M8128N4540
13060B30275n9023J00581g9885G0157K62437b03368E6166L66294p6023A06864
13049E67658A39869b69907F9867L3250Q399J40003G9385a02309K71B52025c7011
13037a41395m9736e9072A8338J39952J74457M4738j43566I7781k5478N34139I0044
13025A98314q9596b31869h9503i001m5734A78151K21925b47368h702B88379P7106
$$ plain form
13014 365485 57071 38564 157867 53973 48821 65119 -209574 -55550 157830 190585 19398
13002 34220 186358 495207 25350 -208169 340406 87282 132650 107656 415554 -247126
12991 300842 67509 273371 149519 -447778 151552 73524 70395 33797 121260 198066 -19564
12979 68428 55018 251149 134119 52113 269634 -9003 156898 171556 437429 -79355 255078
12967 -9234 255812 -107805 408752 292995 449216 -57753 319483 124337 -149590 49328
12956 357951 -48009 -248580 15013 78051 -243460 -214341 225667 363879 86193 -15947 358330
12944 82784 -116235 267354 537819 290243 130576 98765 -6690 129594 61130 190727
12934 190727 2288 214106 2376 426147 87127 176366 -109798 7745 222015 453582 -110568
$$ packed form
13014C65485E7071j8507J19303E3973n152J6298b09574e5550A57830L2755A9398
13002C4220J52138L08849B5350b08169C40406H7282M5368k4994L07898b47126
12991C00842F7509K05862j23852d47778A51552G3524l129C3797Q7463P6806a9564
12979F8428j3410J96131j17030E2113K17521i003A56898J4658K65873g9355B55078
12967i234B55812a07805D08752j15757J56221e7753C19483A24337a49590D9328
12956C57951d8009k00571A5013O3038b43460K9119B25667J38212H6193a5947C58330
12944H2784a16235B67354K70465k47576A30576l1811f690A29594F1130J29597
12934A90727B288K11818B376M23771H7127Q9239a09798G745K14270K31567a10568
$$ plain form
12922 127180 -448813 -324462 104295 -57119 -181628 -144846 314193 52737 189504 -125228
12911 86631 -21817 92504 76414 13847 140765 -171385 -322621 326343 339647 72508 143853
12900 143853 130274 321474 -73251 220398 60362 36511 -139319 221237 -26847 -96833 206147
12888 162863 309176 315031 199215 103260 86657 176822 -157508 106650 -324973 -139364
12877 -249534 193116 -22903 -21691 263275 271680 5444 6620 30512 284803 111467 72576
12866 72576 215068 112195 122411 -253993 -175387 117871 120082 -130951 111259 -120183
12855 108501 236714 257105 398720 335805 169760 -38089 226964 -152783 -23495 212594
12844 111502 371344 73160 -74207 61572 122008 269225 200194 220459 105284 109384 14725
$$ packed form
12922A27180d48813J24351A04295e7119j24509L6782C14193E2737J36767a25228
12911H6631b1817I2504j6090A3847J26918a71385j51236C26343J3304G2508P1345
12900A43853j3579J91200g3251B20398F0362k3851a39319B21237b6847o9986B06147
12888A62863J46313N855j15816r5955j6603R0165a57508A06650c24973a39364
12877b49534A93116b2903J212B63275Q405E444J176K3892K54291A11467l8891
12866G2576J42492j02873J0216b53993P8606A17871K211a30951A11259a20183
12855A08501J28213K0391J41615o2915j66045c8089B26964a52783b3495B12594
12844A11502K59842G3160g4207F1572O0436J47217o9031K0265A05284M100A4725
$$ plain form
12832 59873 452693 154089 -76798 -258407 -261473 257253 5317 98547 98121 -27875 77120 90494
12820 90494 22673 -170737 -390745 162391 -179724 218341 106592 30681 303287 -9048
12809 235035 -58052 276852 -59364 119519 215933 -246974 24409 -75676 -51571 175983 175693
12798 175693 184869 109455 -58174 32670 -218059 -156102 234240 213870 188850 -186988 252791
12786 230888 -88896 -5302 -305729 -107808 -45148 39593 -216302 103123 23707 86556 140613
12775 140613 141422 47687 238623 160447 -346923 39880 392982 -276025 -27681 -239514 33872
12763 226818 -42628 -183329 247948 172547 178144 277361 203328 199280 -70422 170599 -134515
12751 108464 -208870 136472 -164447 -422936 -328053 -260544 253974 345858 39487 35486 -111729
$$ packed form
12832E9873L92820A54089g6798j81609l066B57253E317R3230m26b7875G7120J3374
12820I0494B2673a70737k20008A62391a79724B18341A06592C0681K72606i048
12809B35035e8052B76852e9364A19519R6414b46974B4409g5676K4105A75983k90
12798A75693R176p5414e8174C2670b18059O1957B34240k0370k5020a86988B52791
12786B30888h8896e302l00427a07808d5148C9593b16302A03123B3707O2849N4057
12775A40613Q09D7687J90936p8176c46923C9880L53102b76025b7681k11833C3872
12763B26818d2628j40701B47948p5401N597R9217p4033m048g0422A70599a34515
12751A08464b08870A36472a64447k58489R4883O7509B53974R1884C9487m001a11729
$$ plain form
12739 45638 70159 366266 209262 88101 21220 166573 432823 384062 -120502 31480 141931
12728 141931 6848 155653 207638 2371 141742 -99994 102322 -10655 -112039 -314807 270644
12716 172918 -208949 -171695 313027 158300 174068 241884 205854 351046 190545 408481
12706 408481 211483 114761 420693 109769 40832 102897 326887 -22866 3972 50977 -236193
12694 238369 30300 -86570 190884 4792 -149181 68738 -136754 -125554 -11706 584622 206460
12682 -124294 215710 -7562 210743 481933 3940 138310 -392184 212579 193449 -39758 179982
12670 25353 -8946 52236 -171881 -97961 -35794 80834 218048 -1672 281320 274981 203749 -31669
12657 -36099 143337 41629 -171096 178083 -210704 -184805 166165 -55951 -83711 -6296 -135609
$$ packed form
12739D5638K4521K96107j57004H8101B1220J45353K66250m8761a20502C1480J10451
12728A41931F848J48805N1985B371J39371i9994A02322a0655j01384k02768B70644
12716A72918b08949L7254C13027j54727J5768O7816l6030J45192j60501K17936
12706D08481j96998r6722L05932A09769D0832O2065K23990b2866C972M7005b36193
12694B38369C0300h6570A90884D792a49181F8738a36754J1200a1706E84622B06460
12682a24294B15710g562B10743K71190C940J34370c92184B12579j9130c9758A79982
12670B5353h946E2236a71881P3920c5794H0834J37214a672B81320o339p1232c1669
12657c6099A43337D1629a71096A78083b10704K5899A66165e5951k7760f296j29313
$$ plain form
12646 -135609 254208 -94221 -87031 140492 -180518 177428 93065 -248918 472956 -298675
12635 112948 141371 154748 244476 27278 566140 -50057 -99031 245189 586806 -15651 237580
12623 198304 -71485 203664 62015 110237 -16938 1765 -58533 272796 -99320 109098 172008
12612 172008 287876 74090 218751 48569 -76632 -300087 24001 136197 -131373 197064
12601 182137 237734 25506 -41858 46772 -23715 -158359 198502 213961 122665 163392 -169282
12589 110979 450808 -340920 183313 -8054 122553 317598 369285 135674 -1963 53196 141538
12578 141538 242656 373158 -235688 -170412 27421 -84706 524410 194601 156010 154198 225072
12567 225072 243532 -247222 170650 71550 -164549 -56098 -169088 -136330 179169 -124125
$$ packed form
12646a35609B54208i4221P190A40492a80518A77428q4363b48918D72956b98675
12635A12948K8423J3377Q9728B7278N38862e0057m8974B45189L41617a5651B37580
12623A98304g1485B03664F2015M8222a6938A765e8533B72796i9320A09098O2910
12612A72008J15868G4090J44661D8569g6632k23455B4001J12196a31373A97064
12601A82137N5597B5506d1858D6772b3715j34644A98502J5459r1296M0727a69282
12589A10979L39829c40920A83313h054A22553J95045N1687A35674a963E3196Q8342
12578A41538J01118J30502b35688O5276B7421h4706E24410A94601l8591j812P0874
12567B25072J8460b47222A70650G1550a64549e6098j12990L2758A79169a24125
$$ plain form
12556 11233 -75082 373416 273498 131311 -124694 -47492 -227792 279677 277610 105131 -96342
12544 165390 329 29427 -21514 181084 -72390 -73490 -373245 -137439 -213477 -114294 102432
12532 47314 21126 130939 188345 198740 105352 239157 57167 -63822 -129157 -55897 -43325
12521 -43325 -25911 221905 85917 -4640 298614 131402 100640 197252 -10399 117953 218518
12510 218518 -12184 45694 77412 26147 -37879 -132132 16023 138879 97500 -142996 45149
12498 261294 101568 -267642 -162282 -43390 275565 128457 -2480 22707 110568 -274299
12487 103951 117806 53250 47549 -170484 -98462 227123 -84355 -131729 -33531 -129818 124421
12475 -224099 156893 15930 -244861 -339042 -4972 142099 173964 -45567 234085 -32983 -90923
$$ packed form
12556A1233g5082C73416r9918A31311a24694d7492j80300B79677k067A05131i6342
12544A65390C29K9098b1514A81084g2390j100k99755a37439p6038R9183A02432
12532D7314B1126J09813N7406J0395r3388J33805E7167f3822o5335e5897J2572
12521d3325J7414B21905H5917d640B98614A31402l0762R6612a0399A17953J00565
12510B18518a2184D5694L1718B6147c7879r4253A6023J22856m1379a42996D5149
12498B61294A01568b67642J05360d3390B75565A28457b480B2707Q7861b74299
12487A03951J3855E3250n701a70484P2022B27123h4355m7374c3531r6287A24421
12475b24099A56893A5930b44861r4181d972A42099L1865d5567B34085c2983n7940
$$ plain form
12464 -90923 115954 8289 281939 171762 -122652 52417 148778 -16776 218264 -253751 85984
12452 -195627 92146 -24689 -114315 14376 -145356 -53079 100600 -205787 297335 280862 -84048
12440 72179 -39656 198024 104593 198331 -236143 -138900 -103060 -77727 138810 -14722 -86820
12429 -86820 64179 -99777 260378 -277645 399018 134234 326969 -110515 -211577 206179
12418 -90788 -32947 -47378 -65176 -229599 -141826 -71427 -109410 -158487 -258691 -104193 -118252
12407 -118252 -14719 6362 -197675 54708 53464 -249734 56211 -151348 35651 155360 -84669
12395 37784 266576 69046 77778 -183176 -139624 375455 19039 -35129 180133 -63290 73830
12383 -219565 234654 55709 -81096 -140058 135036 222563 -213700 58343 -18101 -174435 -82811
$$ packed form
12464i0923A15954H289K73650j10177a22652E2417R6361a6776B18264b53751H5984
12452a95627I2146b4689q9626A4376a45356e3079A00600b05787B97335j6473h4048
12440G2179c9656A98024r3431R3738b36143R7243L5840K5333A38810a4722p2098
12429h6820F4179i9777B60378b77645C99018A34234J92735a10515j01062B06179
12418i0788c2947j4431j7798j64423Q7773P0399l7983m9077j00204a04193j4059
12407a18252a4719F362a97675E4708j244b49734E6211a51348C5651J19709h4669
12395C7784K28792F9046Q732a83176M3552C75455A9039c5129A80133f3290G3830
12383b19565B34654E5709h1096n8962A35036Q7527b13700E8343a8101j56334h2811
$$ plain form
12371 -132398 -92233 -156056 227065 159412 590 -308915 -176118 -113381 5668 -101015 -93442
12360 -93442 92589 -12433 235447 -61572 68446 -412183 -38055 303514 -48665 -161872 -156211
12349 -156211 -80990 -168871 93586 -151588 175589 92292 220038 -179779 71118 -72117 15100
12337 59134 -48625 61954 55828 118823 115142 -97883 -170572 121674 -13097 82778 152413 -168999
12324 112346 149732 -99686 51394 -43156 -509417 30581 31552 138700 58700 151122 325100
12313 325100 -162881 159149 307870 99864 135755 53399 181409 21286 163562 160055 456203
12302 456203 -8351 -22074 -165775 -54912 2577 -203651 296305 161670 112834 43546 142530
12291 142530 -24210 -251042 -29872 102065 105221 -40231 -432584 -33225 -20830 -100528 -131198
$$ packed form
12371a32398M0165o3823B27065o7653E90c08915J32797O2737E668a01015P573
12360i3442I2589a2433B35447f1572F8446d12183c8055C03514d8665j13207N661
12349a56211P5221q7881I3586a51588A75589q3297J27746a79779G1118g2117A5100
12337E9134d8625F1954o126O2995l681i7883p2689A21674a3097H2778O9635a68999
12324A12346L7386i9686E1394d3156m66261C0581R71J07148E8700R2422J73978
12313C25100a62881A59149J48721I9864L5891E3399J28010B1286J42276l507K96148
12302D56203h351j3723j43701e4912B577b03651B96305j34635m8836D3546R8984
12291A42530b4210k26832b9872A02065L156d0231l92353c3225J2395p9698l0670
$$ plain form
12280 -131198 -286709 -120796 -6691 -172635 -67347 -24195 396178 357528 -69853 30121 266835
12269 266835 125779 71774 166411 180539 -29614 95710 154848 69689 369589 -407646 145333
12257 393346 80065 5055 18334 141917 30853 211311 34272 97556 38511 -23039 7312
12245 -225603 -25733 134799 283429 -86093 257652 87824 -181796 21746 -157122 285236
12234 -41885 146912 427474 295534 41474 454057 75378 123490 99413 352555 -53704 310504
12222 173636 218102 355109 450072 162164 348835 298926 237754 33140 -11183 387642 224830
12211 224830 208315 210372 122263 174868 74086 58467 278249 270577 161621 378962 115997
12199 229426 137585 261713 243125 85671 296803 171549 143988 170046 401945 251141
$$ packed form
12280a31198j55511a20796f691j65944f7347b4195C96178l8650f9853C0121K36714
12269B66835A25779n4005R4637J4128b9614I5710N9138F9689K99900d07646A45333
12257C93346H0065E055J3279J23583C0853J80458C4272O3284C8511b3039G312
12245b25603b5733A34799J48630h6093B57652H7824a81796B1746a57122B85236
12234d1885A46912K80562j31940D1474M12583G5378M8112k4077K53142e3704C10504
12222A73636M4466J37007R4963A62164J86671m9909o1172C3140a1183C87642j62812
12211B24830j6515K057q8109N2605G4086j5619K19782p672j08956K17341A15997
12199B29426r1841J24128j8588H5671K11132j25254k7561K6058K31899j50804
$$ plain form
12189 251141 159879 88314 72152 157821 -104847 143172 -197045 297601 361097 114338
12178 393524 248479 73834 -12992 24398 251087 243594 -27621 78638 19804 89727 121691
12167 121691 246071 110730 170481 22742 281093 219231 309465 -139207 -200250 161591
12156 397969 153681 -248440 -55265 -226560 -200649 196887 -50145 -42026 88874 138159 149658
12145 149658 190115 -109089 129703 357067 -74958 -65238 -6020 83101 -150488 231344 101385
12133 -112422 300209 -189585 138808 -101726 472892 108485 -173619 -153580 -2240 246632
12122 82547 -380462 -248156 322136 228574 46105 -40889 -1634 -66166 188043 -80089 -87336
12111 -87336 279821 121359 24801 -101426 -85199 91466 -105147 -57436 -24396 241601 -14515
$$ packed form
12189B51141r1262p1565j6162Q5669a04847A43172a97045B97601O3496A14338
12178C93524j45045G3834a2992B4398K26689p493b7621G8638A9804O9923L1964
12167A21691J24380A10730N9751B2742K58351o1862R0234a39207o1043A61591
12156C97969A53681b48440e5265j71295K5911A96887e0145Q119H8874M9285J1499
12145A49658M0457a09089A29703K27364g4958R720f020H3101a50488B31344A01385
12133a12422C00209a89585A38808a01726D72892A08485a73619K0039b240B46632
12122H2547c80462J32306C22136r3562D6105d0889a634o4532A88043h0089p247
12111h7336B79821A21359B4801a01426J6227I1466a05147M7711b4396B41601a4515
$$ plain form
12099 209216 -7431 -273804 93789 91189 -26062 114113 77818 50662 -214065 191309 -126280
12087 36821 160169 -452658 -136038 283922 242183 -133886 188121 -189942 -227988 -209808
12077 -209808 -8241 -64466 -40564 -13675 125613 245575 201359 615809 1064689 1840363 659049
12065 392239 -365205 18654 25497 385283 -30889 -47071 70077 -187049 169957 330738 257325
12054 257325 -30627 -95570 -243444 54107 222836 -354772 89979 -161909 -85365 -140006 -31574
12042 251880 22684 -215018 -155095 96503 -204115 -135067 -22232 75106 -253902 224955 69892
12030 -1010 193546 -114665 75410 63783 15085 -111664 -84070 67203 -106789 -118291 225314
12018 377160 406573 -357523 -157945 -87493 -70910 -111515 -103363 84893 66383 324226 -128823
$$ packed form
12099B09216g431k66373I3789k600b6062A14113l6295k7156b14065A91309a26280
12087C6821J23348d52658a36038B83922m1739a33886A88121a89942l8046J8180
12077b09808h241n6225K3902a3675A25613J19962m4216M14450M48880P75674F59049
12065C92239c65205A8654O843L59786c0889j6182G0077a87049A69957J60781p3413
12054B57325c0627o4943j47874E4107J68729c54772H9979a61909P6544n4641c1574
12042B51880B2684b15018N9923I6503b04115O9048b2232G5106b53902B24955F9892
12030a010A93546a14665G5410j1627A5085a11664K7594F7203a06789j1502B25314
12018C77160K9413c57523a57945P0452J6583m0605Q152H4893j8510K57843a28823
$$ plain form
12006 -221814 -67597 73490 167886 40950 -210137 228514 229952 -92726 -72378 -236372 11815
11994 40767 -164893 -24612 -282685 48267 -337313 -45010 14582 -252476 -83303 -81062 -129590
11983 -129590 135324 -151847 -149971 81519 13959 219804 19807 -66060 -15352 -182311 -113123
11972 -113123 -133616 209968 -226517 -107674 2713 -24883 35066 -248155 594 -130394 -195643
11961 -195643 -73177 64714 148137 -36983 207359 249159 140321 -193308 -200857 -72698 -197749
11950 -197749 -96630 359677 -56938 119534 178947 -63432 7569 -109833 18825 -46609 -346205
11939 -346205 -272236 -87135 -107589 -230982 247714 404291 79689 121246 137439 -115738 21028
11927 -266421 4879 -78430 -44172 281587 84901 -241479 -17704 119810 -242274 31261 86249
$$ packed form
12006b21814f7597G3490R4396D0950b10137B28514J438i2726K0348j63994A1815
11994D0767a64893b4612k58073D8267c37313d5010A4582b52476h3303K241m8528
11983a29590A35324a51847J876H1519A3959K05845A9807f6060a5352j66959O9188
11972a13123k0493B09968b26517a07674B713b4883C5066b48155E94a30394o5249
11961a95643g3177F4714Q3423c6983B07359M1800j08838a93308p549g2698j25051
11950a97749i6630C59677e6938A19534N9413f3432G569a09833A8825d6609k99596
11939c46205P3969h7135k0454j23393B47714J56577G9689M1557J6193a15738B1028
11927b66421D879g8430L4258B81587H4901b41479a7704A19810b42274C1261N4988
$$ plain form
11916 86249 59418 76138 -238932 -39103 -157218 275031 -81235 -266177 -185689 226241 -394451
11904 91650 -74536 311149 283880 76029 306073 -95935 -69206 -244093 -81686 186500 -158047
11892 88187 196701 59400 -1124 -40543 -489620 197972 182190 -193466 177489 38466 -441155
11880 164298 -115336 -199598 63027 156833 -85655 33262 -316867 -54783 -119042 13025 -579804
11868 -367414 -82047 -332115 -303433 -272317 -262775 -205733 192118 -53300 -179890 186192 180424
11857 180424 -154989 469044 78977 -184999 -11066 97969 43717 143980 -276309 84430
11846 -347400 -18535 349939 -166506 181635 195621 -134024 203236 384816 -86700 -86877 94643
11834 473626 34828 -319183 23299 180363 66859 471141 224787 173740 236101 -89769 94350
$$ packed form
11916H6249k6831J6720b38932c9103j18115B75031h1235j84942Q0488B26241c94451
11904I1650g4536C11149k7269G6029K30044i5935K6729j74887h1686A86500a58047
11892H8187J08514E9400a124l9419m49077A97972j5782a93466A77489C8466d41155
11880A64298a15336q4262F3027R3806h5655C3262c16867e4783o4259A3025e79804
11868c67414h2047k50068K8682L1116R542N7042A92118e3300j26590A86192n768
11857A80424a54989D69044G8977a84999a1066I7969D3717J00263b76309H4430
11846c47400a8535C49939a66506A81635J3986a34024B03236J81580h6700j77I4643
11834D73626C4828c19183B3299J57064F6859M04282B24787n1047O2361h9769I4350
$$ plain form
11822 -14671 -58558 -137144 -35135 145067 -11381 -167101 -10294 -210298 211756 257467 -172358
11810 198070 -75079 182582 -110673 316098 342549 51458 196564 188206 -466440 54304 6589
11798 -305041 892 -3877 -120881 -19509 -293078 146402 -419777 -40216 239614 78343 73533
11787 73533 72063 -86942 101645 -166426 -79995 -45003 153779 -154598 -242233 27028 -173981
11775 -71499 2161 -183750 -377726 -80674 -148407 262695 103829 175902 -277980 -124763 10250
11763 7443 -448593 -269031 224972 -4482 313591 167498 -110612 -311680 -153949 -190212
11753 -190212 -34608 22103 279620 71526 -117188 -109807 116445 70807 111943 -81583 27101
11741 212397 -91256 -172883 126659 247350 219189 -538919 -411707 303125 -130401 -13413
$$ packed form
11822a4671m3887p8586c5135A45067a1381j55720a0294k00004B11756M5711a72358
11810A98070g5079A82582a10673C16098K6451E1458J45106q358d66440E4304F589
11798c05041H92c877j17004a9509k73569A46402d19777d0216B39614G8343m810
11787G3533j470h6942A01645a66426g9995L4992A53779a54598q7635B7028a73981
11775g1499B161a83750j93976h0674o7733B62695A03829P2073b77980a24763A0250
11763G443d48593J79562B24972d482C13591j46093a10612k01068a53949l6263
11753a90212c4608B2103K57517G1526a17188P381A16445m5638M1136h1583B7101
11741B12397i1256q1627A26659J20691k8161e38919J27212C03125a30401a3413
$$ plain form
11730 -429977 66369 -311767 -67933 124253 142376 7110 30353 93681 195535 9989 23080
11719 23080 -9800 -96856 -73338 -156931 207274 42277 242772 -170273 33535 25220 -118681
11707 -33402 104583 -293963 -16171 177040 249998 10948 25054 -245483 -155193 156571 -126340
11695 10232 123748 -41905 150663 91185 73668 -84384 239073 -53791 13296 342571 -145892
11683 -70416 -9891 -94023 397534 226022 -61336 120100 137825 210497 271321 268966 466580
11672 466580 -44016 45685 6672 -176827 226857 117037 -927 -117500 380484 375552 455980
11661 455980 130334 192684 -363773 -265368 99794 8189 209011 -75395 284565 -13466 25155
11649 155292 -136325 12689 48699 -266578 -23142 -284413 -275172 -156638 70505 -48780 -62328
$$ packed form
11730d29977F6369c11767f7933A24253J8123G110K3243O3328J01854I989J3091
11719B3080i800q7056K3518q3593B07274D2277K00495a70273C3535q315a18681
11707c3402A04583b93963a6171A77040P2958A0948J4106b45483R0290A56571a26340
11695A0232J13516d1905A50663n9478j7517h4384B39073e3791A3296L29275a45892
11683g0416i891q4132C97534j71512f1336A20100J7725P2672O0824k355J97614
11672D66580d4016D5685F672a76827B26857j09820i27j16573C80484m932Q0428
11661D55980A30334O2350c63773R8405I9794H189K00822g5395B84565a3466B5155
11649A55292a36325A2689L6010b66578b3142k61271R241J18534G0505d8780j3548
$$ plain form
11638 -62328 -54665 313548 -204923 134014 224762 462434 -135491 13830 207671 -203952
11627 -59448 101330 137892 122542 138357 9947 165033 255909 74598 -89744 81806 21128
11615 19426 57050 -285735 -151440 -316909 -99995 -37322 60324 41317 151850 -18158 -45658
11604 -45658 108522 127220 121196 4803 173117 -147878 413737 -7009 -164652 103141 173286
11593 173286 95130 73158 -161763 201241 257594 403852 62307 8454 330014 115830 252160
11582 252160 -106090 -82568 -90516 -169234 -137868 307247 132077 23491 131233 -220569 33987
11570 49372 -85886 -120788 130628 33688 -74336 -1133 14883 209516 55087 -99706 -281854
11559 -281854 283185 374139 60437 150444 -38855 -127239 139879 -214013 -50463 167313 91234
$$ packed form
11638f2328P663C13548b04923A34014R0748K37672a35491A3830J93841b03952
11627e9448A01330L6562j5350J5815I947J55086R0876G4598h9744H1806B1128
11615A9426L7624b85735J34295j65469i9995c7322F0324j9007J10533a8158k7500
11604d5658A08522J8698o024D803J68314a47878D13737g009j57643A03141P0145
11593A73286p8156k1972a61763B01241N6353J46258F2307H454L21560A15830J36330
11582B52160a06090K3522p948p8718L1366C07247A32077B3491J07742b20569C3987
11570D9372h5886l4902A30628C3688g4336a133A4883J94633E5087i9706j82148
11559b81854B83185R0954F0437R0007c8855q8384A39879b14013e0463A67313p6079
$$ plain form
11548 91234 77235 8101 -118983 -115688 -39270 -132122 35672 -38893 101559 318987 75861
11536 195253 27913 -117067 -23566 158126 -165563 -63273 -237468 241548 128571 -127431
11525 135714 200131 169495 -52408 27073 56213 172419 50748 147779 197977 -70958 98201
11513 38854 52552 -21996 -42019 -55358 105912 5794 45037 -67624 268669 223246 73703
11501 378616 193488 -182010 -86915 274216 -83360 186617 106457 232073 273739 18739
11490 328742 288262 138592 178634 302238 353058 46985 123284 256909 32211 143241 35013
11478 243980 70972 181601 183015 -159415 231797 -59332 443701 -43820 530411 262245
11467 29862 -31890 -109097 136779 495981 257579 263025 31828 -43946 -36532 73066 14139
$$ packed form
11548I1234j3999H101a18983L295c9270r2852C5672c8893A01559K17428G5861
11536A95253B7913a17067b3566A58126a65563f3273j74195B41548j12977a27431
11525A35714O4417l0636e2408B7073K9140J16206E0748R7031N0198g0958I8201
11513C8854J3698b1996k0023j3339A05912E794L9243f7624B68669m5423G3703
11501C78616j85128a82010h6915B74216h3360A86617q0160J25616M1666A8739
11490C28742m0480A38592M0042J23604N0820D6985P6299J33625C2211J11030C5013
11478B43980G0972J10629J414a59415B31797e9332D43701d3820E30411B62245
11467B9862c1890p7207A36779L59202k38402N446C1828d3946P414G3066A4139
$$ plain form
11455 400488 229971 64626 297407 284814 166324 232578 -57249 256581 183462 226065 318683
11444 318683 -62283 -71137 213800 191943 136210 -2548 55683 119720 -148045 160782 191864
11433 191864 -10231 387484 47296 190982 120792 14483 18746 76155 277123 153056 173684
11422 173684 92964 -58818 82501 -269733 40464 -24082 -263099 45009 -238134 127496 -100067
11410 178891 115439 79959 31614 -316847 -228615 -179908 374922 -55222 296054 149901 -172678
11398 446680 -213411 -171501 117619 41725 225949 116987 -75295 -329456 299179 -524912
11387 45084 -130701 212131 172507 -169047 -78301 70024 -25287 170822 189432 125374 148113
11376 148113 -321985 -108006 286190 50208 -281209 255286 194518 126060 -41773 -49957 86825
$$ packed form
11455D00488j70517F4626K32781j2593j18490O6254e7249B56581p3119M2603R2618
11444C18683f2283q854B13800k1857n5733b548E5683O4037a48045A60782L1082
11433A91864a0231C87484D7296J43686p0190A4483M263N7409K00968j24067K0628
11422A73684q0720e8818H2501b69733D0464b4082k39017D5009b38134A27496a00067
11410A78891o3452l5480C1614c16847Q8232M8707C74922e5222B96054j46153a72678
11398D46680b13411M1910A17619D1725J84224j08962g5295k54161B99179e24912
11387D5084a30701B12131l9624a69047g8301G0024b5287A70822J8610o4058K2739
11376A48113c21985a08006B86190E0208b81209B55286o0768o8458d1773q184H6825
$$ plain form
11364 120943 -23764 -44635 -117638 38592 -154559 38080 -126284 -73557 3876 -413760 115071
11352 -26775 96177 37914 61789 209053 -56596 221000 -277485 -128872 36038 -105491 214903
11340 250098 -7258 401786 -79003 284088 9308 -333518 92735 -28063 243439 -364290 -116735
11328 -23622 275765 -3291 130367 18181 38058 -77472 36068 71380 347379 -195683 -50872
11316 67611 142453 -27887 -25986 307674 265521 149907 157154 5055 -126892 -116231 225523
11304 -95151 -32318 -406374 96780 -51668 -51094 -204506 9952 43954 -210412 -148163 -110239 -269197
11292 -269197 406928 264334 140450 90901 -166903 -28025 211765 84090 -261088 240992
11281 -276697 207757 228207 -207772 31130 -193537 179102 -122425 189087 -20234 56920
$$ packed form
11364A20943b3764k0871p3003C8592a54559C8080a26284N2727C876d13760A15071
11352b6775I6177C7914K3875J47264e6596B21000b77485a28872C6038a05491B14903
11340B50098g258D01786g9003B84088I308c33518I2735b8063B43439c64290a16735
11328b3622B75765c291A30367A8181J9877g7472C6068L5312K75999a95683e0872
11316F7611P4842b7887J901C07674m2153j15614P247E055a26892J0661B25523
11304i5151c2318l74056I6780e1668N74j53412I952L4002b10412O2249L7924j58958
11292b69197D06928j42594j23884m9549a66903b8025B11765H4090b61088B40992
11281b76697B07757K0450b07772C1130a93537A79102a22425A89087b0234E6920
$$ plain form
11270 -167122 -135797 -57544 10539 -178510 -286932 188975 -123425 -78430 -310426 -96967
11259 65541 -117027 286376 43209 58884 -219691 -181819 31723 248143 -131974 -128400 -265673
11248 -265673 16923 -56352 304374 -406976 -51283 -139475 -283114 -265390 -22001 -332867 143977
11236 -192873 -298904 -234948 -288216 -34141 -38910 -158184 -114776 -385224 37751 -258633 -420871
11225 -420871 114907 -121418 -222282 -18619 -27642 2231 46630 -41915 -179787 -103426 -157522
11214 -157522 186984 97446 -166986 -96024 -170995 -115633 -139836 -45479 117186 71519 -163633
11202 -126278 -260117 -66485 93342 -44658 -52058 -18120 56365 -290352 157415 -32598 193317
11190 161194 93261 -133105 113646 -89057 -187753 -139407 -266761 -250201 -225277 -276696 -39526
$$ packed form
11270a67122L1325e7544A0539a78510j08422A88975a23425M4995k31996i6967
11259F5541a17027B86376D3209J5675b19691L7872C1723K16420a31974L574j37273
11248b65673A6923e6352C04374d06976e1283q8192j43639J7724b2001l10866A43977
11236a92873j06031O3956n3268c4141m769j19274M3408k70448C7751b58633j62238
11225d20871A14907a21418j00864a8619r023B231M4399d1915j37872P6361n4096
11214a57522A86984q9538a66986P0962p4971N5362k4203d5479A17186m5667a63633
11202a26278j33839f6485I3342d4658p400a8120E6365b90352A57415c2598A93317
11190A61194o7933a33105A13646h9057r8696M8346j27354J6560K4924n1419c9526
$$ plain form
11178 -591929 -99409 52039 -28402 -287783 337842 290977 -204455 -152839 255980 93648 -268270
11166 -222040 -85821 -302819 -258811 127028 70307 98264 -35297 -106964 13019 77498 -41800
11154 -180801 -142421 152593 -79217 18614 47511 134545 -258850 164350 -199727 -78570 -352568
11143 -352568 62454 -99452 -102205 98950 75522 -167237 -143898 117101 41445 -83738 8028
11131 -247492 300464 153620 207997 -216859 -89461 76012 -23319 377536 67281 49511 59616
11120 59616 224341 117656 46317 -28853 329356 28181 36475 -85821 335123 -124494 55582
11108 148360 352780 15435 130661 81251 22561 216060 156817 -9988 18135 375287 134155
11096 435389 340554 130558 394773 164060 240179 115014 464885 112243 209520 88327
$$ packed form
11178e91929i9409E2039b8402k59381C37842m6865b04455N1616B55980I3648b68270
11166b22040h5821k16998M4008A27028n6721K7957c5297p1667A3019O4479d1800
11154a80801L8380A52593g9217A8614K8897Q7034b58850A64350a99727g8570k73998
11143c52568F2454i9452k753I8950k3428a67237K3339A17101D1445h3738H028
11131b47492C00464j46844N4377b16859h9461G6012b3319C77536F7281j7770J0105
11120E9616J64725j06685D6317b8853C29356B8181Q294h5821C35123a24494E5582
11108A48360K04420A5435J15226m9410B2561J93499n9243i988A8135L57152A34155
11096D35389r4835A30558K64215A64060P6119A15014L49871A12243R7277H8327
$$ plain form
11085 640633 291032 160389 -18945 150746 170287 45648 553747 223354 219432 378240
11075 378240 302665 465862 172933 328030 270765 175116 320726 460160 517068 308882
11065 308882 316634 551922 487633 256680 264975 844072 608884 673551 664757 274264 582792
11054 582792 923632 477320 898651 799549 1032695 722594 961845 1380792 940501 780269
11044 780269 634604 749620 888441 916953 746482 433377 662663 642608 782303 855933
11034 855933 493527 672599 419821 435023 718046 734815 852485 618602 698598 899082
11024 899082 788997 937403 850344 694672 422838 534447 853669 872730 769476 367855
11013 614290 723642 582259 389208 531935 702352 600584 844350 430898 455919 801965
$$ packed form
11085F40633B91032j30643a8945A50746J9541D5648N08099B23354l922J58808
11075C78240p5575J63197A72933J55097n7265r5649J45610J39434N6908k08186
11065C08882P752K35288o4289k30953Q295N79097k35188O4667q794B74264L08528
11054E82792L40840m46312M21331r9102K33146l10101K39251M18947m40291j60232
11044G80269j45665J15016J38821K8512j70471l13105K29286k0055J39695P3630
11034H55933l62406J79072k52778J5202K83023J6769J17670k33883P9996K00484
11024H99082j10085J48406q7059j55672k71834J11609L19222J9061j03254C67855
11013F14290J09352j41383j93051J42727J70417j01768K43766m13452K5021L46046
$$ plain form
11003 801965 986042 731999 593389 638130 965560 509872 604445 653560 765786 650897
10993 650897 877779 670536 805269 442079 802015 1156691 861076 1138813 1124335 1009111
10983 1009111 1009454 1110121 1249663 1306574 1606441 1646071 2151256 2374891 2364701 2639984
10973 2639984 2828495 2846306 2703236 3381846 2721925 2731927 2613556 2262743 1975229 2115240
10963 2115240 1823910 1732934 2017526 1961646 1814357 1811725 1873670 1851004 1602790 1566228 1272548
10952 1272548 868349 1130793 679976 713907 926607 499065 413300 522880 304016 301017
10942 301017 193798 310942 361653 72582 98091 174697 332561 223010 -47339 169342
10931 341111 136356 38570 -109133 295420 187620 266570 195359 -36661 -102915 -334407
$$ packed form
11003H01965J84077k54043j38610M4741L27430m55688R4573M9115J12226j14889
10993F50897K26882k07243J34733l63190L59936L54676k95615K77737j4478j15224
10983A009111L43J00667J39542N6911K99867L9630N05185K23635j0190K75283
10973B639984J88511J7811j43070O78610o59921J0002j18371l50813k87514J40011
10963B115240k91330r0976K84592n5880j47289k632O1945k2666k48214l6562k93680
10952A272548m04199K62444m50817L3931K12700m27542q5765J09580k18864k999
10942C01017j07219J17144N0711G2582K5509P6606J57864j09551d7339A69342
10931C41111A36356C8570a09133B95420j07800P8950p1211c6661o6254k31492
$$ plain form
10921 -334407 -198320 289716 33332 23953 87077 -47566 119496 -40183 -54479 -236353 163556
10909 -156713 77963 134668 -32908 43882 60538 -176202 -44698 87873 324054 568975 231072
10897 -6216 -429684 -435705 -89415 -85977 -144337 -33443 -50753 223966 73459 89737 128822 152471
10885 152471 42417 73779 -86490 161524 -320197 31996 5006 7387 97502 238081 -283801
10873 76527 163533 36106 22353 154517 -334552 -165017 344383 192836 -97129 26414 184681
10862 184681 73962 48530 119691 -31481 440083 -298595 89867 45784 -310211 -109541 173197
10850 123965 -48721 -96118 -7988 59808 -1751 150072 -212252 -439050 -77606 274567 164075
10839 164075 -407122 -211878 -102489 98315 62631 -285710 -247578 48321 -142854 155430
$$ packed form
10921c34407J36087B89716C3332r379O3124d7566A19496d0183j4296j81874A63556
10909a56713G7963N6705c2908D3882J6656a76202d4698H7873K36181K44921B31072
10897f216m23468o021h9415L438n8360c3443j7310B23966G3459J6278L9085K3649
10885A52471D2417L1362h6490A61524c20197C1996E006K381R0115J40579b83801
10873G6527Q7006C6106j3753J32164c34552a65017C44383j51547i7129B6414J58267
10862A84681G3962k5432P1161c1481D40083b98595H9867m4083c10211a09541A73197
10850A23965d8721m7397g988E9808a751A50072b12252k26798g7606B74567j10492
10839A64075d07122J95244a02489I8315l5684b85710L8132D8321a42854A55430
$$ plain form
10828 -188629 82564 241269 -48393 -153107 88867 35687 105650 43327 -209585 -10565 -428044
10817 -428044 33885 179424 -226602 -29540 69371 -169427 22727 -159669 -153614 33042 292821
10806 292821 24257 -450966 -364905 185350 70931 -336384 -185259 46442 126618 135846 346104
10795 346104 -132825 124635 -39421 -187554 -220931 -241998 -274086 67793 -268355 -39247 -274614
10784 -274614 -17184 -15459 20965 -44219 -125674 17973 214948 -79726 344703 -317055 -7204
10772 -318037 -243391 90542 68751 156081 -96835 -177420 95078 -46402 -58530 46670 -26123
10760 94785 -260198 84744 238553 86366 -252937 -100886 -72541 54273 382571 -388309
10749 -202530 114997 -166521 -217026 -7859 91217 -17167 74374 -26125 364975 -113028 3245
$$ packed form
10828a88629H2564J58705d8393j04714H8867C5687O9963D3327b09585a0565m17479
10817d28044C3885J45539b26602b9540F9371a69427B2727a59669O055C3042K59779
10806B92821B4257d50966Q6061A85350G0931c36384J51125D6442Q0176R228K10258
10795C46104a32825A24635c9421j48133l3377k1067l2088F7793b68355c9247k35367
10784b74614a7184J725B0965d4219q1455A7973J96975g9726C44703c17055g204
10772c18037P4646I0542k1791Q7330i6835q0585I5078d6402j2128D6670b6123
10760I4785b60198H4744J53809H6366b52937a00886K8345E4273L28298c88309
10749b02530A14997a66521n0505g859I1217a7167G4374b6125C64975a13028C245
$$ plain form
10737 -128560 -254272 92543 16462 91706 -351720 -50674 -186991 1608 105408 -27395 238155
10725 17717 -591925 -151699 95112 -164257 209288 -13400 139509 -110455 -104309 -133601 -313302
10714 -313302 -185682 156274 -119605 -136122 17851 135522 27408 -411545 -233380 -152918
10704 -152918 213895 171941 213806 -12575 -36334 11429 273531 -127435 -45553 -289085 232375
10692 -5815 156746 -70087 -116451 76091 -140271 -92590 65089 -215966 -311299 188906 117352
10681 117352 -131939 -54823 438090 89755 -44797 328401 559434 -266243 232896 -91463
10670 -59510 -36096 194831 386534 118835 -180796 -63857 92344 -247804 208114 137372
10660 137372 46548 109065 107764 -209948 -190398 33654 42172 -35136 111599 -265020 -35514
$$ packed form
10737a28560j25712I2543A6462P5244c51720e0674j36317A608J03800b7395B38155
10725A7717e91925a51699I5112a64257B09288a3400A39509a10455O146k9292j79701
10714c13302J27620A56274a19605j6517A7851J17671B7408d11545J78165Q0462
10704a52918B13895m1954M1865a2575k3759A1429K62102a27435d5553k43532B32375
10692e815A56746g0087m6364G6091a40271M7681F5089b15966r5333A88906p1554
10681A17352a31939e4823D38090H9755d4797C28401K31033b66243B32896i1463
10670e9510K3414A94831J91703A18835a80796f3857I2344b47804B08114p0742
10660A37372D6548O2517j301b09948J9550C3654Q518c5136A11599b65020c5514
$$ plain form
10648 129821 383411 -120133 69903 -293067 74641 -167901 3089 -103653 283274 25732
10637 33427 25832 -307543 134406 222016 85570 2731 -61352 56065 -165578 -354486 -223489
10626 -223489 83740 11451 -355854 -113639 196206 -243798 -153919 175988 218185 47168
10615 -214587 58275 69560 131491 117524 -2128 -341341 -141186 -405565 150352 -169038 137944
10603 -69287 -106251 -38790 -1083 -158448 -147959 96986 -7571 -307950 -244436 134488 -225704
10591 65688 180983 -372318 -130275 147617 -150342 -147054 322656 13184 -141078 -104120
10581 -104120 50603 -250510 -79763 -166436 -31779 -78773 282006 91653 281939 236966 65651
10569 5935 140247 -29223 363779 228090 -132304 -430651 209821 -251272 -13705 -309709
$$ packed form
10648A29821K53590a20133F9903b93067G4641a67901C089a03653B83274B5732
10637C3427p595c07543A34406Q7610H5570B731f1352E6065a65578j88908J30997
10626b23489H3740A1451c55854a13639A96206b43798Q9879A75988M2197D7168
10615b14587E8275J1285O1931j3967b128l39213a41186k64379A50352a69038A37944
10603f9287l6964c8790a083j57365J0489I6986g571l00379O3514A34488b25704
10591F5688J15295c72318a30275A47617a50342L288C22656A3184a41078L6958
10581a04120E0603b50510g9763q6673c1779m6994B82006I1653J90286m4973F5651
10569E935J34312b9223C63779j35689a32304k98347B09821b51272a3705k96004
$$ plain form
10559 -309709 126335 184222 -118409 -66090 -51153 -140465 215413 126906 -158904 -293600
10549 -293600 -91100 -190150 -71710 -214531 24009 19911 166293 114322 163815 -199092 -55544
10537 -175091 73057 -282177 -29726 -90902 -116053 -274568 -273057 -112017 -30938 -15053 -63689
10526 -63689 176844 -203 -86301 -190493 -138593 103507 -82326 -163956 79344 -124061 -89107
10515 -89107 -95887 84067 8128 -79227 -235555 67045 -204677 9373 -20571 153711 16372 -66294
10502 346674 1385 -247515 -196604 -27269 16423 175230 -178695 83656 63743 105138 194285
10491 194285 -37887 -370420 63701 51627 -187720 -130456 -41248 166351 138337 385172 524828
10480 524828 498882 470775 369610 396879 129970 -328616 308198 -124013 271383 4633
$$ packed form
10559c09709A26335N7887a18409N2319J4937q9312B15413q8507a58904j34696
10549b93600i1100r9050g1710j42821B4009m098J46382n1971M9493a99092e5544
10537a75091G3057b82177b9726o1176k5151j58515J511a12017c0938a5053m8636
10526f3689A76844b03q6098j04192N1900A03507h2326q1630G9344a24061L4954
10515h9107o780H4067H128g9227j56328F7045b04677I373b0571A53711A6372f6294
10502C46674A385b47515N0911b7269A6423J58807a78695H3656j9913M1395Q9147
10491A94285c7887l32533F3701j2074a87720N7264d1248A66351k8014K46835J39656
10480E24828k5946k8107j01165K7269A29970c28616C08198a24013B71383D633
$$ plain form
10469 -125546 170929 -214217 39260 -274183 -69783 -118886 -261968 -142495 67540 81250
10459 81250 66597 14677 -309579 59585 -127501 -107332 -62141 104747 -107900 26076 -251295
10447 157524 -315271 107304 135223 58682 83003 11288 -44650 241157 -98182 -229616 114970
10435 103350 65326 1166 305607 288315 -205603 -238745 -393753 -231199 -193168 50077 56840
10424 56840 -167064 -96343 108696 247262 41476 41193 -147537 305798 240998 -19498 40533
10412 41495 187409 -8794 -141190 62432 174598 19330 -19963 26360 465873 -59114 -13237
10400 -107761 -316823 80012 207267 -23942 103460 261651 294177 209821 372024 -197153
10389 -228574 -260660 158951 89281 375914 292906 243652 -60401 -31232 150907 25170 441505
$$ packed form
10469a25546A70929b14217C9260b74183f9783m9103j43082J19473F7540J3710
10459H1250j4653A4677c09579E9585a27501K0169M5191A04747a07900B6076b51295
10447A57524c15271A07304K7919E8682K4321A1288d4650B41157i8182j31434A14970
10435A03350l8024A166L04441j7292b05603l3142j55008J62554L8031E0077O763
10424E6840a67064P0721A08696J38566D1476k83a47537C05798o4800a9498D0533
10412D1495J45914h794j32396F2432J12166A9330a9963B6360M39513e9114a3237
10400a07761k09062H0012J27255b3942A03460J58191L2526q4356J62203a97153
10389b28574l2086A58951o9670K86633q3008m9254f0401K9169A50907B5170M16335
$$ plain form
10378 441505 384066 247137 18911 188106 291193 99267 248216 333837 274766 502191
10368 502191 503749 900061 330978 472913 598041 328147 301724 446912 363178 371726 182824
10356 361879 -11147 -133945 269414 216308 690492 524167 477341 460027 331811 600703
10346 600703 348626 541334 604356 219512 354592 210248 73291 204948 574112 382091
10336 382091 183913 -333228 51511 416847 114359 -82109 84028 109361 141921 89141 386297
10325 386297 371108 256082 426419 -8241 620576 127670 11631 128544 351301 200279
10315 200279 200907 -86902 -41407 -206423 43729 161382 20459 172005 61445 -77851 93562
10303 94688 128820 -80993 323979 -354450 -14051 34 -69002 -83158 100478 -341835 -1139 -17546
$$ packed form
10378D41505n7439j36929A8911J69195J03087I9267J48949Q5621n9071K27425
10368E02191J558L96312C30978J41935J25128k69894k6423J45188q3734Q548A82824
10356C61879a1147j22798B69414n3106M74184j66325m6826j7314j28216K68892
10346F00703k52077J92708O3022B19512J35080j44344G3291J31657L69164j92021
10336C82091A83913c33228E1511L65336A14359h2109H4028K5333L2560n2780K97156
10325C86297j5189j15026J70337h241F20576A27670A1631J16913K22757j51022
10315B00279O28h6902d1407j65016D3729J17653B0459J51546F1445g7851I3562
10303I4688L4132h0993C23979c54450a4051C4f9002j4156A00478c41835a139j6407
$$ plain form
10291 -17546 172752 -68110 8397 -226834 -140889 42045 -171555 36934 -91466 47002 -167166
10279 55758 -179353 -68906 -82885 379747 -393480 70883 145783 -65470 -78711 49893 669
10267 358306 -38877 -69672 458415 268980 125747 253759 219573 106760 579217 358964
10257 358964 319029 248429 -93505 218878 64791 155689 72791 203407 128816 -141013 47700
10245 -236293 -12140 -167244 139100 -14493 -62436 186467 220641 103703 46201 11745 89351
10234 89351 148176 45608 106219 29188 -76837 -31954 -279907 -24702 -322110 -58366 -202447
10223 -202447 -151933 -201021 -19981 -36638 -112138 -114710 -241863 -161905 11554 111460 278852
10212 278852 101905 310873 186806 112506 168593 -27534 -143286 56906 65974 30500 -136170
$$ packed form
10291a7546A72752f8110H397b26834Q5945D2045a71555C6934i1466D7002a67166
10279E5758a79353f8906j3979C79747c93480G0883P4900f5470j3241D9893F69
10267C58306c8877l0795D58415j89435A25747J28012l4186A06760M72457k20253
10257C58964l9935p0600i3505B18878F4791R0898G2791J30616p4591a41013D7700
10245b36293a2140j55104A39100a4493m7943A86467L4174A03703D6201A1745P7606
10234H9351N8825D5608O0611B9188g6837c1954k47953b4702k97408e8366j44081
10223b02447N0514m9088a9981j6657p5500k572j27153P9958A1554R9906J67392
10212B78852A01905K08968j24067p4300N6087b7534j15752E6906R068C0500a36170
$$ plain form
10200 -201383 134901 -159595 -75943 11760 388411 142828 -4732 -125644 -137868 250204
10189 99354 139178 60157 151409 -387714 -200390 -294415 -7541 60609 -158375 -240918 -74759
10177 -344370 -138562 -201301 -230394 -451097 -93224 83873 -47077 210684 -117998 83206 187826
10166 187826 -316914 -10906 104599 -407415 -216122 -299599 159843 -43222 -95847 -23451
10155 15982 -188542 -171484 742 -172594 72939 222205 78076 -99569 363658 -136633 -66362
10143 -231836 208215 -73431 -97296 55186 -266614 -23836 -45011 -63678 43429 56402 -325334
10131 222133 -41334 -48913 69803 92131 -33704 154675 -279191 365910 -170859 -70765 -31178
10119 -85169 -34367 -267221 225312 -180999 206051 -52805 147463 -230293 -83228 -68107
$$ packed form
10200b01383A34901a59595g5943A1760L76651A42828d732j20912j2224B50204
10189I9354L9824F0157R1252c87714J87324r4025g541F0609a58375q2543g4759
10177c44370a38562o2739k9093k20703i3224H3873d7077B10684a17998H3206J04620
10166A87826c16914a0906A04599d07415J91293q3477A59843d3222n2625b3451
10155A5982a88542J7058G42a72594G2939J49266G8076i9569C63658a36633f6362
10143b31836B08215g3431k3865E5186b66614b3836k1175j8667D3429J2973c25334
10131B22133d1334p579F9803K2328c3704A54675b79191C65910a70859g0765c1178
10119h5169c4367k32854B25312a80999B06051e2805A47463b30293h3228J5121
$$ plain form
10109 -68107 -194666 10947 137573 18250 -89185 26974 203213 236382 131944 -6341 50858
10097 -28064 50050 170138 113705 -30757 -208050 -15562 -231788 31360 2565 -236698 -207686
10086 -207686 12008 -239624 -167644 -139254 -221257 -199376 36542 -180286 34491 -26463 246287
10074 142946 -118774 38691 -89652 56579 52073 -138615 -26662 127364 134250 142942 203445
10063 203445 -30400 63377 -48463 -291880 -81904 101050 72267 121757 -199543 -242235 -179912
10052 -179912 235833 -266272 -210247 -280157 127511 -397378 -174817 -231131 -294228 -613031
10042 -613031 39357 302262 -110480 272177 -397558 198636 -375776 -187959 73372 -96703
10031 -97884 -192280 -87067 -71219 -255767 -211134 66456 -85720 -115317 -216026 125294 -271612
$$ packed form
10109f8107j26559A0947J26626A8250h9185B6974J76239L3169j04438f341E0858
10097b8064E0050J20088n6433c0757j77293a5562k16226C1360B565b36698K9012
10086b07686A2008b39624P1980K8390q2003K1881C6542a80286C4491b6463B46287
10074A42946a18774C8691h9652E6579m506a38615b6662A27364O886Q692O0503
10063B03445c0400F3377d8463k43417h1904A01050k8783M9490a99543m2692O2323
10052a79912B35833b66272N6025o9910A27511c97378a74817n6314o3097l18803
10042f13031C9357K62905a10480B72177c97558A98636c75776J87817G3372i6703
10031i7884r4396h7067J5848j84548M4633F6456h5720k9597j00709A25294b71612
$$ plain form
10019 -476441 -87459 530125 73480 -111021 -187419 38581 60506 -270458 -137727 -184106 -307461
10008 -307461 64950 -20079 92194 -336880 -97889 -181979 -105809 -287437 -131845 -54781 157736
9996 118419 -347471 -293844 62522 -288045 -185662 133549 -83926 -192131 7642 -220556 -147489
9985 -147489 58055 -328920 64418 -264925 -62009 -224128 -349850 -61511 -73124 -118670 -186218
9974 -186218 -58446 -45456 -105259 -188408 -42024 150282 -410041 -20029 -29952 -163386 -208679
9963 -208679 -55755 38272 166223 -29317 -153511 -186676 -14066 80594 -74650 -344701 -87496
9951 -249958 256565 -379839 -558251 -207295 -111744 35628 -197230 -182446 -156995 39128 -149507
9939 -141702 -37200 227010 -80047 -98168 -83194 -45055 -354596 -102323 -287852 -212995 -57597
$$ packed form
10019d76441h7459E30125G3480a11021p6398C8581K1925b70458J32731m6379j23355
10008c07461F4950b0079I2194c36880i7889q4090P6170j81628a31845e4781A57736
9996A18419c47471N3627F2522b88045J02383A33549h3926j08205G642b20556P3067
9985a47489E8055c28920F4418b64925f2009j62119j25722f1511j1613m5546o7548
9974a86218e8446J2990n9803q3149d2024A50282d10041b0029r923j33434m5293
9963b08679e5755C8272J27951b9317j24194l3165a4066H0594g4650k70051h7496
9951b49958B56565c79839j78412b07295R5551C5628a97230J4784K5451C9128a49507
9939a41702c7200B27010h0047j8121J4974L8139l09541a02323j85529P4857e7597
$$ plain form
9927 -249664 -86018 -212147 109822 -199405 -301345 -257121 -153101 -10744 -13568 -24817 12268
9915 103061 34551 107878 -396339 -275784 132636 -513653 182036 -19355 -180935 111371
9904 84446 -183669 -128248 350242 111489 -290833 177675 -3316 -122101 -256619 240811
9893 399648 -59208 -251558 89382 70919 -270739 -112457 -110810 -114547 -43865 -45996 20338 -242276
9880 75381 -349845 201048 -248035 -1648 -253167 -1294 -77221 -30765 104263 -230388 -131219
9869 -131219 58099 -119965 -253512 131130 158779 -25900 -129045 -76129 -65282 -235782 151244
9857 11179 -293670 187796 -177369 -167856 -21796 -358499 434909 -437315 -149177 239736
9846 -328782 53559 -148682 -96337 -1296 166464 -63822 -215359 -133319 167407 -187056 -158862
$$ packed form
9927b49664h6018j26129A09822a99405j01940M4224J04020a0744k824j1249A2268
9915A03061C4551P3327c96339J20555A32636e13653A82036a9355j61580A11371
9904H4446a83669N5421C50242A11489b90833A77675c316j18785j34518B40811
9893C99648e9208j92350H9382j8463b70739a12457J647l737d3865k131B0338b42276
9880G5381c49845B01048b48035a648k51519a294p5927c0765A04263b30388R9169
9869a31219E8099a19965j33547A31130K7649b5900j03145N2916J0847j70500A51244
9857A1179b93670A87796a77369R513b1796l36703D34909d37315a49177B39736
9846c28782E3559a48682N2345a296A66464f3822j51537Q2040A67407a87056K8194
$$ plain form
9835 -158862 66876 161457 97430 -460113 -249583 236370 -340410 -74401 118307 -35849 -229842
9824 -229842 -238531 -2144 -2476 220442 14594 -270920 -143747 60750 -276488 -447823 7313 -333972
9811 232799 66197 -57825 137578 -64392 117928 152239 -91583 -35284 345451 -212333 -162585
9800 -162585 -307425 -297890 -308971 209939 -190919 -206304 -86304 1797 -96993 -157967 -74475
9788 -132522 116019 -87465 1618 186076 -20327 -126426 59660 149466 -107726 193120 14922
9776 118618 83825 -324655 -70498 -22497 -18360 11220 76580 298359 -132619 -67795 -213433
9765 -213433 85773 91714 -39305 13843 -320867 -201959 -25136 -77835 -136967 -17941 -188647
9754 -188647 -21523 107501 -130101 -53373 93351 -70213 -15843 48825 132938 71344 -238026
$$ packed form
9835a58862F6876R4581o4027d60113K10530B36370c40410g4401A18307c5849j93993
9824b29842q689b144l32B20442A4594b70920J27173F0750b76488j71335G313c33972
9811B32799F6197e7825A37578f4392A17928L4311i1583c5284C45451b12333M9748
9800a62585j44840R535j1081B09939a90919j5385h6304A797i6993o0974g4475
9788a32522A16019h7465A618J84458b0327j06099E9660Q9806a07726A93120A4922
9776A18618l4793c24655g0498b2497M137A1220O5360K21779a32619O4824j45638
9765b13433H5773N941c9305A3843c20867J18908b5136n2699n9132a7941j70706
9754a88647b1523A07501a30101e3373I3351g0213a5843D8825Q4113o1594b38026
$$ plain form
9742 -92855 71353 -41159 281638 -585966 -230764 -174630 -285994 -216734 405205 45848 23168
9731 23168 -146213 -121611 -312629 -268358 -141615 102307 167934 -592767 -49789 68342 112333
9720 112333 -137339 -130031 10724 -76743 -70755 278924 -126299 -42047 -3797 -433122 -55821
9708 -78270 -126480 252085 163147 -9086 87139 -131430 43651 -264843 -56132 -236853 -277445
9697 -277445 -96673 158574 -495260 13222 257589 68770 -266331 -38684 -187062 -431910
9687 -431910 -40043 -207057 -153778 -264397 -141864 90720 -217177 -66798 179401 -35603 -5940
9675 -169398 341188 -116827 61510 192114 313258 212651 74568 -352462 93940 -123266
9664 -49720 -170040 22542 131804 -157103 41251 55071 -271990 450930 -403192 -456984 -144376
$$ packed form
9742i2855G1353d1159B81638e85966b30764N6134j11364O9260D05205D5848k2680
9731B3168a46213K4602j91018M4271J26743A02307O5627e92767d9789F8342M3991
9720A12333a37339P308A0724g6743N988B78924a26299d2047c797m29325e5821
9708g8270m8210B52085q8938i086H7139a31430D3651b64843e6132j80721m0592
9697b77445i6673A58574d95260A3222K44367F8770b66331c8684j48378k44848
9687d31910d0043j67014N3279j10619J22533I0720b17177f6798A79401c5603e940
9675a69398C41188a16827F1510J30604J21144j00607G4568c52462I3940a23266
9664d9720j20320B2542J09262a57103D1251J3820b71990D50930d03192n3792a44376
$$ plain form
9652 -108654 -95579 -228223 -108376 -345936 -262509 125615 259867 -254468 -17124 126986
9641 -57409 -450743 -239973 -152285 -23683 15307 -66581 -117668 207089 -230438 -94161 -220872
9630 -220872 -145197 -167805 8983 56676 68857 -264558 -43197 113815 -230527 36857 69967
9619 69967 246331 -4456 171047 103133 -99442 -155294 -221670 153490 244703 99967 -2903 72227
9606 -307393 157064 -152521 -323492 -284884 -55591 -95153 470341 -107439 131654 -351227
9595 -76092 -78825 37415 -371216 53613 -255411 -180292 755 -106870 -87946 -240193 251679
9583 123877 -76001 15840 -46882 -53028 152227 -40586 116402 -59344 -149687 -35242 -425243
9572 -425243 -49141 286411 -43497 213131 -163945 139789 -168371 211089 -191230 -599080
$$ packed form
9652a08654J3075j32644a08376k37560Q3427A25615J34252b54468a7124A26986
9641e7409l93334K10770Q7688b3683A5307f6581n1087B07089b30438i4161j26711
9630b20872P5675k2608H983M7693J2181b64558d3197A13815b30527C6857L3110
9619F9967J76364d456A71047o7914i9442n5852o6376A53490R1213I9967b903G2227
9606c07393A57064a52521j70971L8608e5591l9562D70341a07439A31654c51227
9595g6092k733C7415c71216E3613b55411P5119G55a06870J8924j52247B51679
9583A23877g6001A5840d6882o146A52227d0586A16402e9344r0343c5242l90001
9572d25243d9141B86411d3497B13131a63945A39789a68371B11089a91230m07850
$$ plain form
9562 -599080 -208930 -8660 277299 -113923 97429 -179781 -95666 -167985 -278531 46619 -187362
9550 -110975 136959 100204 -229613 -304780 81917 -115774 10320 -212353 50543 101226 -103255
9538 -60902 237927 49184 -156371 4313 -287047 -459142 -73020 -46599 -117298 86499 -484632
9526 -124829 68061 -67178 -179950 139331 86074 -228894 -235855 57371 -13007 -23195 -68531
9515 -68531 -68916 -41274 -35661 -224917 83845 -241031 -74075 87788 -235915 -54532 -275419 285693
9502 -124160 10387 -116009 -1090 50883 41616 -165543 304994 -333576 -494093 308080 -366396
9490 -133627 -126501 29494 -49458 266840 217309 53976 -477534 -248606 -86945 -327303 -95747
9478 246555 -3032 -152971 22575 -272780 -20093 -26984 -127545 189158 -341250 -233009 126758
$$ packed form
9562e99080b08930h660B77299a13923I7429a79781Q4115p2319j10546D6619a87362
9550a10975A36959l6755b29613p5167H1917a15774A0320b12353E0543N0683a03255
9538f0902B37927D9184a56371D313b87047j72095g3020K6421p0699H6499d84632
9526a24829F8061f7178j12772A39331n3257b28894o961E7371a3007j0188m5336
9515f8531l85K7642N613j89256H3845b41031g4075H7788b35915e4532k20887B85693
9502a24160A0387a16009a090E0883r267a65543C04994c33576j60517C08080c66396
9490a33627P126B9494d9458B66840m9531E3976d77534K28928h6945k40358i5747
9478B46555c032j49939B2575b72780b0093o891j00561A89158c41250J08241A26758
$$ plain form
9466 -115519 -15438 190367 -131034 116872 131516 -18225 210528 -178086 -288376 78325
9455 -95498 57897 49378 -239006 155815 66792 121001 -90497 6205 252408 269293 134017
9443 -113323 -119487 66067 51105 -21483 -118877 -106063 -254205 -233365 -159309 -222192 275968
9431 288596 86080 -25243 114151 -276113 -279056 251317 147883 -135904 -404510 100821
9420 145130 97533 -104055 -83676 195000 -202190 190950 -426186 236 -5774 185734 -41957
9408 -248238 275580 -110308 -71784 -460330 -38415 -108655 -14000 -193232 -39898 -261571 -218188
9397 -218188 -59712 -146912 83078 -24171 -85968 71460 -85521 311871 19974 -120634 -133523
9386 -133523 -244748 -153914 -8689 -68562 260949 -230600 98386 -127228 -188863 -67175 -2065
$$ packed form
9466a15519a5438A90367a31034A16872J4644a8225B10528a78086j10290G8325
9455i5498E7897q519b39006A55815F6792N4209i0497F205K46203J6885A34017
9443a13323o164F6067j4962b1483r7394J2814j48142K0840P4056o2883B75968
9431B88596H6080b5243A14151b76113k943B51317j03434a35904k68606A00821
9420A45130m7597a04055K0379A95000b02190A90950d26186B36e774A85734d1957
9408b48238B75580a10308L8524l88546c8415p0240a4000j79232c9898k21673M3383
9397b18188e9712q7200H3078b4171o1797G1460h5521C11871A9974a20634j2889
9386a33523j11225R0834h689n9873B60949b30600I8386a27228o1635f7175b065
$$ plain form
9374 -18380 176255 -199724 48811 37933 378540 112358 -154237 133959 14548 -375922
9363 -156910 -276972 251348 -50856 -82367 -305827 -119739 -97961 -27206 32456 -40198 155442
9351 -152189 -24157 39725 148768 99984 -79495 107780 -298869 -2233 -182408 -91539 87007
9339 -90 142096 12884 -87594 -112179 66117 112005 58568 -336270 104093 -448806 54499 68809
9327 68809 -292247 69664 66686 -102323 95435 140095 -564777 -181074 72018 47742 33943
9316 33943 41587 368074 -2033 238138 28209 -81535 79911 -108295 -64675 64540 -338410
9304 -300605 47989 -56685 -265598 60901 -103418 -188175 -374910 -453901 33820 132963 -65266
9292 60772 6860 159084 26406 31968 -88800 -302256 -139167 -136051 -9640 77390 -61373 -252239
$$ packed form
9374a8380A76255a99724D8811j0878L40607A12358a54237A33959A4548c75922
9363a56910j20062B51348e0856l1511k23460a19739K1778b7206C2456d0198A55442
9351a52189b4157C9725J09043m8784g9495A07780b98869b233j80175R0869H7007
9339i0A42096A2884h7594k4585F6117M5888n3437c36270A04093d48806E4499J4310
9327F8809b92247F9664k978a02323I5435M4660e64777a81074G2018k4276j3799
9316C3943P644L26487b033B38138B8209h1535G9911a08295M3620F4540c38410
9304c00605D7989e6685k08913F0901a03418q4757j86735p8991C3820R9143f5266
9292F0772F860J52224B6406N562h8800k13456a39167L116i640G7390f1373j90866
$$ plain form
9280 -252239 -248698 -19448 -251940 -473657 71772 129495 701 -277626 -149587 -73354 -217002
9269 -217002 -227013 193218 -70589 -397031 -174479 10627 26382 -239133 -30502 54060 -14177
9257 173002 346396 86828 -297118 -38278 177774 1019 55594 158030 -252458 26134 -53758
9245 533933 67058 87401 -69722 -152817 104481 266145 -219260 115861 94675 -49889 -345245
9234 -345245 -426850 -99201 -51398 -622 92326 -131839 -177295 -90075 326147 -188021 -277322
9223 -277322 -289949 -131390 329072 35759 -154968 -122260 -189153 85620 -20109 -342735 19739
9211 50879 -185749 -654094 33477 -211759 -254628 -14939 -419140 -109321 -82079 -5859 -173067
9200 -173067 -125641 -270213 -18071 -161561 -118044 51930 -288258 -125047 49357 -29493 22343
$$ packed form
9280b52239L541a9448k32492k21717G1772N7723G01b77626J28039g3354j43648
9269b17002j0011A93218g0589l26442a74479A0627J5755b39133c0502E4060a4177
9257A73002J73394H6828b97118c8278A77774A019N4575J02436b52458B6134e3758
9245E33933F7058K0343f9722q3095A04481J61664b19260A15861k1186d9889k95356
9234c45245q1605i9201M7803f22I2326a31839m5456Q7220C26147a88021q9301
9223b77322j2627a31390C29072C5759a54968L2708o6893H5620b0109l22626A9739
9211E0879a85749m68345C3477b11759m2869a4939m04201a09321K7242e859j67208
9200a73067M7426j44572a8071j43490M3517E1930b88258a25047D9357b9493B2343
$$ plain form
9188 286605 -381980 -288047 -25162 132110 -3163 -84504 270452 -187648 -358854 -154773 90103
9176 96505 -97710 -148089 13453 -270300 -136159 -107123 -53085 6662 -155290 -92672 152634
9164 8335 -232039 12694 109330 -182536 -171397 -193696 -215802 -76655 -159498 -102972 112942
9152 162396 25570 8934 5727 -199088 92775 -88381 117044 -304305 18771 45753 -10284
9140 28610 53261 53859 -377812 62077 -172048 42957 -205404 119366 117731 122330 169877 -132535
9127 -122360 -68349 -185148 151381 20640 -24632 -274260 -105584 81543 -44884 52236 164835
9116 164835 -160257 -187773 112897 -267547 179394 -41048 70792 172044 -133622 237030
9105 359531 -224215 130863 -46397 140793 -128945 285149 -488791 -37612 44656 -66756
$$ packed form
9188B86605c81980R3933b5162A32110c163q1341B70452a87648j71206a54773I0103
9176I6505i7710n0379A3453b70300J34141K9036e3085F662a55290O2618A52634
9164H335b32039A2694R6636a82536J1139k2299k2106g6655q2843N6526A12942
9152A62396B5570H934l207a99088I2775h8381A17044c04305A8771K6982a0284
9140B8610K4651N98c77812F2077a72048D2957b05404A19366j635M599M7547a32535
9127a22360N4011j16799A51381B0640b4632k49628a05584H1543d4884E2236J12599
9116A64835a60257k7516A12897b67547A79394d1048G0792J01252a33622B37030
9105C59531b24215A30863d6397A40793a28945B85149d88791c7612D4656f6756
$$ plain form
9094 -260675 -155134 421560 -78334 -29586 203788 -83689 194369 4663 -9029 231505 248867
9083 248867 92526 -75025 25197 -61723 -30107 -90069 -15759 -37999 -145354 -233856 -349738
9072 -349738 46201 46283 55039 -88815 70105 -186168 89505 -152242 -189830 -387 -158800 -30083
9059 -130815 147616 -48557 -203652 -284560 -7137 -408665 204793 93654 -55000 54426 10710
9047 116973 269324 221467 86159 74050 194645 -59667 41348 -126944 15913 21224 -9928
9035 207649 26978 42579 121773 22808 -348220 -89130 5023 -179686 110938 184282 83644
9023 -427927 83868 261967 145807 142850 -180590 -262633 -377005 -236 71647 88906 134062
9012 134062 126776 194399 -179046 -45019 40148 122309 223544 -91920 -193918 -177096 11219
$$ packed form
9094b60675J05541D21560g8334b9586B03788h3689A94369D663i029B31505J7362
9083B48867I2526g5025B5197f1723c0107n9962a5759k2240j07355q8502j15882
9072c49738D6201Q2Q756h8815G0105a86168H9505a52242l7588c87j58413c0083
9059a30815A47616d8557j55095q0908g137m01528B04793I3654e5000E4426A0710
9047A16973J52351m7857H6159j2109J20595e9667D1348a26944A5913N311i928
9035B07649B6978J5601P9194B2808c48220h9130E023a79686A10938P3344H3644
9023d27927H3868J78099j16160k957a80590q2043j14372b36G1647J7259M5156
9012A34062p286O7623a79046d5019D0148Q2161J01235i1920j01998J6822A1219
$$ plain form
9000 -316410 -222426 -411036 -342373 143254 -23783 -225847 -30955 276303 -176753 -174963 -71712
8988 -121650 75853 -146426 -114813 -158373 -158376 176585 -16769 386159 -15597 16616 231529 -52538
8975 -62352 -227168 124995 741 -97362 -52429 89125 -157626 -120459 -48193 126789 -386191
8963 -96464 3489 -59078 140642 -369942 -276925 -119168 -52192 -193224 14739 -170682 -196855
8952 -196855 -60272 289956 -226259 -307267 191303 166216 -49643 -291941 -162707 9296 -254050
8940 -118255 260822 -234312 -82040 -59025 71501 173144 -59080 -40996 81485 64380 -319523
8928 339190 131208 262319 628859 693706 1629499 5062107 13585218 6143856 1514685
8918 381100 480612 322870 -125704 232896 318374 -121463 147114 100992 -143616 431671
$$ packed form
9000c16410R3984j88610O8663A43254b3783k02064c0955B76303a76753J790g1712
8988a21650G5853a46426L1613m3560lA76585a6769C86159a5597A6616K14913e2538
8975f2352j64816A24995G41i7362M4933H9125a57626L7167d8193A26789c86191
8963i6464C489e9078A40642c69942R3017a19168e2192j41032A4739a70682k6173
8952a96855f0272B89956b26259q1008A91303k5087d9643k42298J29234I296b54050
8940a18255B60822b34312h2040K3015G1501J01643e9080J8084H1485j7105c19523
8928C39190A31208J31111L66540O4847R35793L432608Q523111F143856A514685
8918C81100R9512j57742a25704B32896Q5478a21463A47114m6122a43616D31671
$$ plain form
8907 218463 140605 -3177 -320822 -121639 -359059 -213668 -30993 155186 172163 -52141 101963
8895 52275 -10531 31459 100215 260562 -339477 -263131 -276714 53968 -62874 -16739 -351772
8884 -351772 -124977 243896 121120 10647 106048 -180951 16888 86101 -273270 -348105 124762
8872 -84971 -2840 60649 431027 -62480 -76247 9254 -136906 29077 -349443 -38078 234425
$$ packed form
8907B18463p7858c177l17645a21639k37420J45391c0993A55186J6977e2141A01963
8895E2275a0531C1459O8756J60347c39477P6346j3583E3968f2874a6739l35033
8884c51772a24977B43896A21120A0647R5401a80951A6888O9213b73270p4835A24762
8872h4971b840F0649L70378f2480j3767I254a36906B9077c49443c8078B34425
$$ [...]
##END NTUPLES=NMR SPECTRUM
##END=
