
##TITLE=AC1233_PERAH12114_6519287_kQ2xMY586G
##JCAMPDX= 6.0         $$ Bruker NMR JCAMP-DX V2.0
##DATA TYPE= NMR SPECTRUM
##DATA CLASS= NTUPLES
##ORIGIN= BRUKER
##OWNER= Administrator
$$ 1.72 TOPSPIN		Version 2.1
$$ 2012-07-13 18:53:21.453 -0500  Administrator@TOPSPIN
$$ Compression mode = diff/dup
##.OBSERVE FREQUENCY= 400.02188249412
##.OBSERVE NUCLEUS= ^1H
##.ACQUISITION MODE= SIMULTANEOUS (DQD)
##.ACQUISITION SCHEME= undefined
##.AVERAGES= 64
##.DIGITISER RES= 22
##SPECTROMETER/DATA SYSTEM= spect
##.PULSE SEQUENCE= noesygpps1d.comp
##.SOLVENT NAME= COFFEE_meoh
##.SHIFT REFERENCE= INTERNAL, COFFEE_meoh, 1, 14.96065
##AUDIT TRAIL= $$ (NUMBER, WHEN, WHO, WHERE, PROCESS, VERSION, WHAT)
$$ ##TITLE= Audit trail, TOPSPIN		Version 2.1
$$ ##JCAMPDX= 5.01
$$ ##ORIGIN= Bruker BioSpin GmbH
$$ ##OWNER= Administrator
$$ $$ C:\Bruker\TOPSPIN/data/COFFEE/nmr/AC1233_PERAH12114_6519287_kQ2xMY586G/92/pdata/1/auditp.txt
$$ ##AUDIT TRAIL=  $$ (NUMBER, WHEN, WHO, WHERE, PROCESS, VERSION, WHAT)
(   1,<2012-07-13 18:53:16.421 -0500>,<Administrator>,<TOPSPIN>,<go>,<TOPSPIN 2.1>,
      <created by zg
	started at 2012-07-13 18:41:46.140 -0500,
	POWCHK enabled, PULCHK disabled,
       configuration hash MD5:
       6B 1B 68 BB D9 2E 58 E2 7F 35 AD 54 07 DF 0E 41
       data hash MD5: 64K
       0B D1 77 5E 14 22 92 19 B2 06 76 16 C9 09 41 FA>)
(   2,<2012-07-13 18:53:19.500 -0500>,<Administrator>,<TOPSPIN>,<proc1d>,<TOPSPIN 2.1>,
      <Start of raw data processing
       efp LB = 0.3 FT_mod = 6 PKNL = 1 PHC0 = 0 PHC1 = 0 SI = 128K 
       data hash MD5: 128K
       E8 F8 F3 D9 A9 B8 84 5B 1B 68 52 AF 5B 52 B6 9E>)
(   3,<2012-07-13 18:53:20.593 -0500>,<Administrator>,<TOPSPIN>,<proc1d>,<TOPSPIN 2.1>,
      <pk PHC0 = 1.455688 PHC1 = 0 
       data hash MD5: 128K
       F2 49 7A 48 7B F0 CB CB C1 EA 90 A1 3B 9E D7 60>)
(   4,<2012-07-13 18:53:20.843 -0500>,<Administrator>,<TOPSPIN>,<proc1d>,<TOPSPIN 2.1>,
      <abs ABSG = 1 
       data hash MD5: 128K
       66 6E 3B 43 9D B9 9B A5 A4 99 26 21 57 06 F8 95>)
(   5,<2012-07-13 18:53:21.015 -0500>,<Administrator>,<TOPSPIN>,<proc1d>,<TOPSPIN 2.1>,
      <abs ABSG = 2 
       data hash MD5: 128K
       D6 16 C4 F7 31 85 C4 47 01 FB 1D 22 E1 B9 02 41>)
(   6,<2012-07-13 18:53:21.171 -0500>,<Administrator>,<TOPSPIN>,<proc1d>,<TOPSPIN 2.1>,
      <abs ABSG = 3 
       data hash MD5: 128K
       1B 03 A6 AC F3 18 39 8F 0F 2E 54 13 D7 5F 32 0B>)
(   7,<2012-07-13 18:53:21.250 -0500>,<Administrator>,<TOPSPIN>,<proc1d>,<TOPSPIN 2.1>,
      <abs ABSG = 4 
       data hash MD5: 128K
       91 DA 7F A7 BF AC 19 7C E9 74 EB E5 0F 05 6A 12>)
(   8,<2012-07-13 18:53:21.343 -0500>,<Administrator>,<TOPSPIN>,<proc1d>,<TOPSPIN 2.1>,
      <abs ABSG = 5 
       data hash MD5: 128K
       4B 51 E7 C5 5A 10 FB D8 0E 26 9F 59 59 1E 75 64>)
$$ ##END=
$$ 
$$ $$ hash MD5
$$ $$ 21 38 33 D5 35 22 B5 4F 97 85 CF 89 84 93 F1 4D
##$RELAX= 
##$RELAX= 
##$RELAX= 
##$RELAX= 
##$RELAX= 
##$RELAX= 
##$RELAX= 
##$RELAX= 
##$RELAX= 
$$ [...]
##$TP07= 0
##$TPNAME0= <>
##$TPNAME1= <>
##$TPNAME2= <>
##$TPNAME3= <>
##$TPNAME4= <>
##$TPNAME5= <>
##$TPNAME6= <>
##$TPNAME7= <>
##$TPOAL= (0..7)
0.5 0.5 0.5 0.5 0.5 0.5 0.5 0.5
##$TPOFFS= (0..7)
0 0 0 0 0 0 0 0
##$TUNHIN= 0
##$TUNHOUT= 0
##$TUNXOUT= 0
##$USERA1= <user>
##$USERA2= <user>
##$USERA3= <user>
##$USERA4= <user>
##$USERA5= <user>
##$V9= 5
##$VALIST= <valist>
##$VCLIST= <CCCCCCCCCCCCCCC>
##$VD= 0
##$VDLIST= <DDDDDDDDDDDDDDD>
##$VPLIST= <PPPPPPPPPPPPPPP>
##$VTLIST= <TTTTTTTTTTTTTTT>
##$WBST= 2048
##$WBSW= 25
##$XGAIN= (0..3)
0 0 0 0
##$XL= 0
##$YL= 0
##$YMAX_a= 12334786
##$YMIN_a= -9568736
##$ZGOPTNS= <>
##$ZL1= 120
##$ZL2= 120
##$ZL3= 120
##$ZL4= 120
##$ABSF1= 14.96065
##$ABSF2= -5.597531
##$ABSG= 5
##$ABSL= 3
##$ALPHA= 0
##$AQORDER= 0
##$ASSFAC= 0
##$ASSFACI= 0
##$ASSFACX= 0
##$ASSWID= 0
##$AUNMP= <proc_prof1d_extract.lims>
##$AXLEFT= 0
##$AXNAME= <>
##$AXNUC= <1H>
##$AXRIGHT= 0
##$AXTYPE= 0
##$AXUNIT= <>
##$AZFE= 0.1
##$AZFW= 0.1
##$BCFW= 0
##$BC_mod= 0
##$BYTORDP= 0
##$COROFFS= 0
##$CY= 15
##$DATMOD= 1
##$DC= 0
##$DFILT= <>
##$DTYPP= 0
##$F1P= 0
##$F2P= 0
##$FCOR= 0.5
##$FTSIZE= 131072
##$FT_mod= 6
##$GAMMA= 0
##$GB= 0
##$INTBC= 1
##$INTSCL= 1
##$ISEN= 128
##$LB= 0.3
##$LEV0= 0
##$LPBIN= 0
##$MAXI= 10000
##$MC2= 0
##$MEAN= 0
##$ME_mod= 0
##$MI= 0
##$NCOEF= 0
##$NC_proc= -2
##$NLEV= 6
##$NOISF1= 0
##$NOISF2= 0
##$NSP= 0
##$NTH_PI= 0
##$NZP= 0
##$OFFSET= 14.96065
##$PC= 1
##$PHC0= 1.455688
##$PHC1= 0
##$PH_mod= 1
##$PKNL= yes
##$PPARMOD= 0
##$PPDIAG= 0
##$PPIPTYP= 0
##$PPMPNUM= 2147483647
##$PPRESOL= 1
##$PSCAL= 4
##$PSIGN= 0
##$PYNMP= <proc.py>
##$REVERSE= no
##$SF= 400.020009776432
##$SI= 131072
##$SIGF1= 0
##$SIGF2= 0
##$SINO= 400
##$SIOLD= 131072
##$SPECTYP= <>
##$SREGLST= <1H.CDCl3>
##$SSB= 0
##$STSI= 131072
##$STSR= 0
##$SW_p= 8223.68421052631
##$SYMM= 0
##$S_DEV= 0
##$TDeff= 65536
##$TDoff= 0
##$TI= <>
##$TILT= no
##$TM1= 0
##$TM2= 0
##$TOPLEV= 0
##$USERP1= <user>
##$USERP2= <user>
##$USERP3= <user>
##$USERP4= <user>
##$USERP5= <user>
##$WDW= 1
##$XDIM= 131072
##$YMAX_p= 413425985
##$YMIN_p= -14475
##$CURPLOT= <Network HP LaserJet P1505>
##$CURPRIN= <$Network HP LaserJet P1505>
##$DFORMAT= <normdp>
##$LAYOUT= <+/1D_H.xwp>
##$LFORMAT= <normlp>
##$PFORMAT= <normpl>
##$SURQMSG= 1
$$ End of Bruker specific parameters
$$ ---------------------------------
##NTUPLES= NMR SPECTRUM
##VAR_NAME=  FREQUENCY,     SPECTRUM/REAL,   SPECTRUM/IMAG
##SYMBOL=    X,             R,               I
##VAR_TYPE=  INDEPENDENT,   DEPENDENT,       DEPENDENT
##VAR_FORM=  AFFN,          ASDF,            ASDF
##VAR_DIM=   131072,        131072,          131072
##UNITS=     HZ,            ARBITRARY UNITS, ARBITRARY UNITS
##FACTOR=    0.0627417313425164, 1,          1
##FIRST=     8223.62146879497, 2339,         -62341
##LAST=      0,             3265,            -61851
##MIN=       0,             -14475,          0
##MAX=       8223.62146879497, 413425985,    0
$$ Real data points
##PAGE= N=1
##DATA TABLE= (X++(R..R)), XYDATA
$$ [...]
63904A504929j09371r7440q6099p5029o4642n5412m7383m0391l4406k9490k5642
63893H39624k2755k0511j8340j5839j3270j1392j0592j0448j0184r338p928o310
63881F82717n048m566m628m434l475k011l95J710M868Q815J2500J5327J7768K0510
63867G39658K3396K5675K7032K7903K8780K9623L0014K9624K8331K6151K3313
63856A039500K0247J7143J3682R479M851O87k652n886r864j4353j8289k1159k3475
63843A009911k5801k7943k9489l0639l1935l3331l4175l4069l3299l2329l1323
63832F65578l0294k9357k8554k7599k6077k3889k1398j9162j7536j6396j5258
63821D10058j3808j2325j1387j1083j0795r888q487p346p035p405p752p369o064
$$ plain form
63904 1504929 1395558 1298118 1212019 1136990 1072348 1016936 969553 929162 894756 865266 839624
63893 839624 816869 796358 778018 762179 748909 737517 726925 716477 706293 696955 689027 682717
63881 682717 677669 673103 668475 664041 660566 658555 658160 659870 664738 673553 686053 701380 719148 739658
63867 739658 763054 788729 815761 843664 872444 902067 932081 961705 990036 1016187 1039500
63856 1039500 1059747 1076890 1090572 1100051 1104902 1105589 1102937 1097051 1087187 1072834 1054545 1033386 1009911
63843 1009911 984110 956167 926678 896039 864104 830773 796598 762529 729230 696901 665578
63832 665578 635284 605927 577373 549774 523697 499808 478410 459248 441712 425316 410058
63821 410058 396250 383925 372538 361455 350660 340772 332285 324939 317904 310499 302747 295378 289314
63808B89314m307k884k235k111j992j685j446j549j945k310k302j815j143q22
63794B60768j117j704k040k011j995k328k899l345l394k969k241j597j318j170
63780B30640o58J78N60r5j309k033j867j305q27k96M83J083Q28k37j217j335p53
63763B21840k39j54j30K61Q54J160J032O95K45m55j230j485q95P8P39R33R08O68
63745B24825N8n87n79J78R45J121J021J249J717J840J559J502K103L058L812M221
63729B48043M382M235L720L184L142L571L867L699L539M007M922N471N267M753
63715C05802M468M275L619K246M20j371k669l178k998k708k846l328l491k809
63701B95432j444j57K87k03q75q50j21M62L79J75O07J523K244K754L577M646N176
$$ plain form
63808 289314 285007 282123 279888 277777 275785 274100 272654 271105 269160 266850 264548 262733 261590 260768
63794 260768 259651 257947 255907 253896 251901 249573 246674 243329 239935 236966 234725 233128 231810 230640
63780 230640 229982 230160 230720 230625 229316 227283 225416 224111 223284 222988 223471 224554 225382 225145 223928 222593 221840
63763 221840 221601 221447 221317 221578 222432 223592 224624 225319 225564 225109 223879 222394 221499 221577 222316 223249 224157 224825
63745 224825 224883 224296 223717 223895 224840 225961 226982 228231 229948 231788 233347 234849 236952 240010 243822 248043
63729 248043 252425 256660 260380 263564 266706 270277 274144 277843 281382 285389 290311 295782 301049 305802
63715 305802 310270 314545 318164 320410 320830 319459 316790 313612 310614 307906 305060 301732 298241 295432
63701 295432 293988 293831 294118 293915 293040 292190 292069 292531 292910 293085 293692 295215 297459 300213 303790 308436 313612
63684C13612M876M366M079L590K551J463Q25K29q05j590j005P21K033J980J308
63669C38233J183J667J949J631J134R36R55P37L9r41j823k472l140m090n131n721
63653C25146n531m820m155l862l787l565l037k349j683r85j84M79O77N69P64J436
63637B95113J931J638R75J030K280M145N742O625O765O343N795N655O069O633
63623C56739O897O914P181Q143R717J1299J2271J2705J3439J5144J7490J9624
63611D97563K1350K3239K5523K7595K8979L0132L1720L3470L4499L4502L3826
63600H22398L2325K8980K3166J5810Q713K940j674n487q185r274r036q539q733
63587H83404r829j1624j4008j6992k0397k3824k6838k9005k9842k9121k7181k4762
$$ plain form
63684 313612 318488 322854 326933 330523 333074 334537 335362 335591 334786 333196 332191 332912 334945 336925 338233
63669 338233 339416 341083 343032 344663 345797 346733 347688 348425 348464 347523 345700 343228 340088 335998 330867 325146
63653 325146 319615 314795 310640 306778 302991 299426 296389 294040 292357 291372 291188 291667 292344 292913 293677 295113
63637 295113 297044 298682 299657 300687 302967 307112 312854 319479 326244 332587 338382 344037 350106 356739
63623 356739 363636 370550 377731 385874 395591 406890 419161 431866 445305 460449 477939 497563
63611 497563 518913 542152 567675 595270 624249 654381 686101 719571 754070 788572 822398
63600 822398 854723 883703 906869 922679 931392 934332 932658 927171 918986 909712 900676 892137 883404
63587 883404 873575 861951 847943 830951 810554 786730 759892 730887 701045 671924 644743 619981
63575F19981k2349j9891j7136j4145j1301q937p046n281l260r34J310L004M078
63562E18093M921O010P519R236J0657J1258J0973J0446J0549J1562J3133J5094
63550F39451J7882K1801K6208L0033L3051L6088L9793M3697M6754M8297M7848
63539A030903M4341L6528K4667J1217p60r658j5508j8566j8812j6836j4194j2254
63527A041068j1237j0932j1820j4660j9217k4214k8645l2482l5997l8963m0801
63516G72100m1073l9679l6862l3202k9297k5402k1710j8879j7549j7230j6425
63505D74792j4377j2043j0728j0287r490p873o222n255m741m241l890l944m060
63492C77641l687k876k130j584r13p6M33L38J46N81J653K653L082L182L497M147
$$ plain form
63575 619981 597632 577741 560605 546460 535159 526222 519176 513895 510635 509701 511011 514015 518093
63562 518093 523014 529024 536543 545779 556436 567694 578667 589113 599662 611224 624357 639451
63550 639451 657333 679134 705342 735375 768426 804514 844307 888004 934758 983055 1030903
63539 1030903 1075244 1111772 1136439 1147656 1146896 1137238 1121730 1103164 1084352 1067516 1053322 1041068
63527 1041068 1029831 1018899 1007079 992419 973202 948988 920343 887861 851864 812901 772100
63516 772100 731027 691348 654486 621284 591987 566585 544875 525996 508447 491217 474792
63505 474792 460415 448372 437644 427357 417867 409994 403772 398517 393776 389535 385645 381701 377641
63492 377641 373954 371078 368948 367364 366451 366375 366808 367146 367292 367873 369526 372179 375261 378443 381940 386087
63476C86087M732M830M384L637K771J747M84q50j926k645l252l860m090l606k822
63461C85621k595l143l793l957l711l173k023k03J421J883J293N49J72K25J037
63446C69603K947N301O800P151P445Q507R866J0960J2347J4773J7717J9996K1561
63433E14974K3659K7147L1470L5345L7688L7685L4686K8688K0729J2560N898J892
63421H12421Q70K384N679J0197J5575K1264K6531L0898L4388L7164L9103L9692
63409A076166L8248L4300K7985K0124J1774L684l688r790j3895j5585j5223j3960
63397A140140j3236j4020j6337j9574k3351k7809l2845l7405m0156m0751m0007
63386H34649l8758l7023l4478l1210k7719k4404k1399j8697j6217j3775j1225
$$ plain form
63476 386087 390819 395649 400033 403670 406441 408188 408672 407822 405896 403251 399999 396139 392049 388443 385621
63461 385621 383026 379883 376090 372133 368422 365249 363226 363023 364444 366327 367620 368169 368341 368566 369603
63446 369603 372550 377851 384651 391802 399247 407754 417620 428580 440927 455700 473417 493413 514974
63433 514974 538633 565780 597250 632595 670283 707968 742654 771342 792071 804631 810529 812421
63421 812421 813291 815675 821354 831551 847126 868390 894921 925819 960207 997371 1036474 1076166
63409 1076166 1114414 1148714 1176699 1196823 1208597 1212281 1208593 1198803 1184908 1169323 1154100 1140140
63397 1140140 1126904 1112884 1096547 1076973 1053622 1025813 992968 955563 915407 874656 834649
63386 834649 795891 758868 724390 693180 665461 641057 619658 600961 584744 570969 559744
63375E59744q626o094l629j159J218L242M761N970P339R206J1494J3831J6019
63362F13316J8238K0745K3518K6360K9202L2016L4552L6502L7955L9320M0727
63351I52451M1710M1632M0172L7203L2515K6002J8082R667J681n200j0407j3504
63339A172004j4559j4366j3998j4160j5052j6742j9287k2534k6084k9663l3184
63328I52375l6192l7719l7163l5137l2797l0333k6846k1934j6651j2317q901n332
63316F51053j356J549J269l090j0383j8030k3541k5854k5535k3767k1386j8834
63304D82095j6494j4537j2655j0498q359o937o397o093n347m155l043k493k637
63291C82450l197l677l833l957m473n228n516m815l304j632m94l46j066j870j925
$$ plain form
63375 559744 551118 545024 541395 540236 541454 544696 549457 555427 562766 571972 583466 597297 613316
63362 613316 631554 652299 675817 702177 731379 763395 797947 834449 872404 911724 952451
63351 952451 994161 1035793 1075965 1113168 1145683 1171685 1189767 1199434 1201115 1195915 1185508 1172004
63339 1172004 1157445 1143079 1129081 1114921 1099869 1083127 1063840 1041306 1015222 985559 952375
63328 952375 916183 878464 841301 806164 773367 743034 716188 694254 677603 665286 656385 651053
63316 651053 649697 651246 652515 649425 639042 621012 597471 571617 546082 522315 500929 482095
63304 482095 465601 451064 438409 427911 419552 412615 406218 400125 394778 390623 387580 385087 382450
63291 382450 379253 375576 371743 367786 363313 358085 352569 347754 344450 342818 342324 341978 340912 339042 337117
63276C37117j182l25J39L59O79J094J397J460J217O66P8j59j1J48J33K27P04J440
63258C45181K178K825L258L313L194L481M357N185N377N289N800P079Q376Q942
63244D13835Q794Q534Q763R684J0987J2183J3161J4331J6036J8008J9738K1132
63232E75186K2421K3558K4205K4300K4262K4421K4666K4725K4519K4180K3856
63221H40299K3706K3801K4046K4224K4235K4123K3890K3370K2199J9885J6046
63210A089824J0877N168m36o086j2263j8721k4390k8461l1107l2899l3924l3827
63198H83755l2482l0168k7174k3583j9542j5480j1871q822n899k482J606N789
63186G13647R182J1434J2976J4440J6010J7539J8947K0205K1038K1150K0821K0856
$$ plain form
63276 337117 335935 335610 335749 336108 336787 337881 339278 340738 341955 342621 342699 342540 342529 342677 342810 343037 343741 345181
63258 345181 347359 350184 353442 356755 359949 363430 367787 372972 378349 383638 389438 396517 404893 413835
63244 413835 422629 431163 439926 449610 460597 472780 485941 500272 516308 534316 554054 575186
63232 575186 597607 621165 645370 669670 693932 718353 743019 767744 792263 816443 840299
63221 840299 864005 887806 911852 936076 960311 984434 1008324 1031694 1053893 1073778 1089824
63210 1089824 1100701 1105869 1105433 1099347 1087084 1068363 1043973 1015512 984405 951506 917582 883755
63198 883755 851273 821105 793931 770348 750806 735326 723455 714633 708734 706252 707858 713647
63186 713647 722829 734263 747239 761679 777689 795228 814175 834380 855418 876568 897389 918245
63174I18245K1684K2691K2827K1769K0194J8837J7595J5683J2496Q113L096j999
63162A101231o877j1528j6148k0973k6022l0935l5067l7819l8919l8485l6914
63151H01544l4759l2578l0730k9108k7262k4931k2428k0261j8402j6281j3583
63140E31221j0801q692p434o592n795n049m445l877l247k659k215j805j206l85
63126D67019M53J067J421J735K274L055L795M223M347M349M341M373M518M750
63112E11720M804M429L734L109K813K799K826K623K066J421J241J717K296K273
63098E49871J596P94L06K64P28J529K085J945J469J283J185M97n73r21j74P16
63082E62600R98J246K215L424L852L516L365L903M868O045P525R064R975R882
$$ plain form
63174 918245 939929 962620 985447 1007216 1027410 1046247 1063842 1079525 1092021 1100134 1103230 1101231
63162 1101231 1094354 1082826 1066678 1045705 1019683 988748 953681 915862 876943 838458 801544
63151 801544 766785 734207 703477 674369 647107 622176 599748 579487 561085 544804 531221
63140 531221 520420 511728 504294 497702 491907 486858 482413 478536 475289 472630 470415 468610 467404 467019
63126 467019 467472 468539 469960 471695 473969 477024 480819 485042 489389 493738 498079 502452 506970 511720
63112 511720 516524 520953 524687 527796 530609 533408 536234 538857 540923 542344 543585 545302 547598 549871
63098 549871 551467 552261 552567 552831 553559 555088 557173 559118 560587 561870 563055 563552 562979 562058 561884 562600
63082 562600 563598 564844 567059 570483 574335 577851 581216 585119 589987 596032 603557 612621 622596 632478
63068F32478R228Q933R772J1840J4372J6367J7700J9248K1549K4035K6131K8386
63056H40039L1549L5098L7938M0187M3035M6796N0485N3417N5980N8450O0252
63045A353226O0977O1117O1185O1066O0810O1092O2047O2476O1303N9252N8041
63034B022592N8151N8363N7312N4664N0609M5002L7327K7271J5180J999j1355
63023B417115k4631l7934n0769o1928p0565p6848q1045q2643q1062p6791p1031
63012A701868o4445n7063m9203m1485l3894k5713j6710p755Q8O640J2383J7620
63000A442331K2244K6157K9551L2707L5656L8061L9498L9935L9855L9769L9718
62989A825482L9355L8348L6525L3818L0347K6378K1830J5966P990j985j2868k3444
$$ plain form
63068 632478 641706 650639 660411 672251 686623 702990 720690 739938 761487 785522 811653 840039
63056 840039 871588 906686 944624 984811 1027846 1074642 1125127 1178544 1234524 1292974 1353226
63045 1353226 1414203 1475320 1536505 1597571 1658381 1719473 1781520 1843996 1905299 1964551 2022592
63034 2022592 2080743 2139106 2196418 2251082 2301691 2346693 2384020 2411291 2426471 2428470 2417115
63023 2417115 2392484 2354550 2303781 2241853 2171288 2094440 2013395 1930752 1849690 1772899 1701868
63012 1701868 1637423 1580360 1531157 1489672 1455778 1430065 1413355 1405600 1405688 1412328 1424711 1442331
63000 1442331 1464575 1490732 1520283 1552990 1588646 1626707 1666205 1706140 1745995 1785764 1825482
62989 1825482 1864837 1903185 1939710 1973528 2003875 2030253 2052083 2068049 2076039 2074054 2061186 2037742
62977B037742l3144m2093n0679n8977o6347p1674p4287p4542p3238p0794o7298
62966A354669o3080n8664n4285m9956m5862m2180l8621l4785l0939k7803k5585
62955H82909k3803k2018k0167j8305j6747j6337j7542j9186j9314j7684j6185
62944F75621j6164j6562j5677j3720j2239j1713j1291j0545r952r509q417o567
62932E33265n109m900n348n469n216m980m500l305j837j146j490j993j840j154
62918D84978n86n64j128k066k881k969k197j158o17p65j160j413j641k150k873
62903D60810l326l209k804k625k749k745k301j584r14l61J03K86O6j32L55J452
62887D40322K160J609J65r57j033m46M8K59M99Q53R34M51k77o08k72L79Q43R93
$$ plain form
62977 2037742 2004598 1962505 1911826 1852849 1786502 1714828 1640541 1565999 1492761 1421967 1354669
62966 1354669 1291589 1232925 1178640 1128684 1082822 1040642 1002021 967236 936297 908494 882909
62955 882909 859106 837088 816921 798616 781869 765532 747990 728804 709490 691806 675621
62944 675621 659457 642895 627218 613498 601259 589546 578255 567710 557758 548249 539832 533265
62932 533265 528156 523256 517908 512439 507223 502243 497743 494438 492601 491455 489965 487972 486132 484978
62918 484978 484392 483828 482700 480634 477753 474784 472587 471429 470812 470047 468887 467474 465833 463683 460810
62903 460810 457484 454275 451471 448846 446097 443352 441051 439467 438553 438192 438295 438581 438647 438515 438870 440322
62887 440322 442482 444091 444256 443299 442266 441820 441868 442127 442626 443479 444413 444864 444587 443979 443707 444086 444929 445922
62869D45922J039J052P95J51n34p81o53p39j330j908j803j166q25j141j468j032
62853D35579M3R44J238J198J141R93O56L81M29O12N66L23J93J64j30p10j027p34
62835D41859l57o77j573k017j351j44N23K95k41l96N2R65K055K803K676J784J039
62818D47295J270K309L267L651L788M110M470M456M119M022M602N729O893P675
62804E07656Q023Q190Q481Q948R381R673J0141J1271J3077J4896J5964J6166J6170
62791F58037J6839J8621K1331K4426K7569L0988L5246M0495M6124N1365N6243
62780A027284O1592O8069P5370Q2547Q8838R3973R7918J00623J01890J01194R7748
62769A997046R1029Q1236O8983N4617L8289K0634K795j4461l1151m7229o1768
$$ plain form
62869 445922 446961 448013 448808 448959 448425 447644 446991 446252 444922 443014 441211 440045 439220 438079 436611 435579
62853 435579 435622 436566 437804 439002 440143 441136 441792 442173 442602 443214 443780 444103 444296 444460 444330 443620 442593 441859
62835 441859 441502 440825 439252 437235 435884 435740 436263 436558 436317 435921 435973 436938 438993 441796 444472 446256 447295
62818 447295 448565 450874 454141 457792 461580 465690 470160 474616 478735 482757 487359 493088 499981 507656
62804 507656 515679 523869 532350 541298 550679 560352 570493 581764 594841 609737 625701 641867 658037
62791 658037 674876 693497 714828 739254 766823 797811 833057 873552 919676 971041 1027284
62780 1027284 1088876 1156945 1232315 1314862 1403700 1497673 1595591 1696214 1798104 1899298 1997046
62769 1997046 2088075 2169311 2238294 2292911 2331200 2351834 2354629 2340168 2309017 2261788 2200020
62758B200020p3499q2017q7922r1874r4056r4544r3668r1655q8366q3734p8259
62747A240426p2750o7642o2809n8053n3434m9070m4757m0064l4845k9619k5250
62736G02133k2205k0202j8632j7146j5644j3970j1961r812p984o617n348l855
62724E48757k326j135l02M88J444K542L742N055O389P563Q596R798J1493J3680
62710F15784J6055J8336K0534K2883K5539K8437L1569L5203L9649M4819N0324
62699I49132N5967O1775O7473P2392P6207P9379Q2439Q4994Q5896Q4350Q0437
62688A780441P4568O6751N6640M4107K9730J4629k46j4814k9569m4444n8176o9201
62676A850416p6997q2129q5159q6133q5113q2650p9423p5790p1816o7432o2449
$$ plain form
62758 2200020 2126521 2044504 1956582 1864708 1770652 1676108 1582440 1490785 1402419 1318685 1240426
62747 1240426 1167676 1100034 1037225 979172 925738 876668 831911 791847 757002 727383 702133
62736 702133 679928 659726 641094 623948 608304 594334 582373 572561 564577 557960 552612 548757
62724 548757 546431 545296 544994 545482 546926 549468 553210 558265 564654 572217 580813 590611 602104 615784
62710 615784 631839 650175 670709 693592 719131 747568 779137 814340 853989 898808 949132
62699 949132 1005099 1066874 1134347 1206739 1282946 1362325 1444764 1529758 1615654 1700004 1780441
62688 1780441 1855009 1921760 1978400 2022507 2052237 2066866 2066620 2051806 2022237 1977793 1919617 1850416
62676 1850416 1773419 1691290 1606131 1519998 1434885 1352235 1272812 1197022 1125206 1057774 995325
62665I95325n6804n0982m5819m1705l8275l5028l1838k8708k5477k2164j9212
62654E99313j7020j5456j4089j2769j1569j0545r785r509r708r950r805r278q465
62641D51365p175n331l479k303j773j264m28N09J218J519J296O49R8lk5n26j210
62624D33137j237n75j17k65l40K22R59J281J444J909K379K416K491L422N002O202
62608D58330O716P313Q485R697J0418J1054J2348J4362J6654J9084K1871K4987
62596F21319K8071L0956L3901L7271M1072M4803M7622M8857M8528M7275M5513
62585A075188M2826L8393L1925K3864J4798N094m827j4193k2174k8405l3206l7299
62573A091984m1169m4499m6269m5800m3699m1363l9463l7369l4378l0981k8278
$$ plain form
62665 995325 938521 887539 841720 800015 761740 726712 694874 666166 640689 618525 599313
62654 599313 582293 566837 552748 539979 528410 517865 508080 498571 488863 478913 469108 459830 451365
62641 451365 444190 438859 435380 433077 431304 430040 429612 430121 431339 432858 434154 434803 434901 434898 434873 434347 433137
62624 433137 431900 431325 431208 430943 430603 430825 431784 433065 434509 436418 438797 441213 443704 447126 452128 458330
62608 458330 465046 472359 480844 490541 500959 512013 524361 538723 555377 574461 596332 621319
62596 621319 649390 680346 714247 751518 792590 837393 885015 933872 982400 1029675 1075188
62585 1075188 1118014 1156407 1188332 1212196 1226994 1232088 1227261 1213068 1190894 1162489 1129283 1091984
62573 1091984 1050815 1006316 960047 914247 870548 829185 789722 752353 717975 686994 658716
62562F58716k6512k4881k2786k0467j8250j5914j3269j0792r079q014p055o100
62550D75597n470n177m889m545m392m300l684k331p92L15R53J342J495J409J387
62535D46918J701K211K646K986L173K875K019J346J781L359N324P223R259J1568
62521E04389J3830J5840J7956K0602K3748K7092L0446L3651L6557L9355M2541
62510H06007M6088M8992N0149M9498M7804M5508M2328L7918L2293K5468J7332
62499A249385Q227p62q567j4969k0348k4823k8057k9799l0154k9180k6700k2744
62487A021509j7937j3048q235l053K805R009J4954K0340K5145K9180L2095L3899
62475A146663L5147L6237L6635L5098L0794K4077J6093P809m09q525j6525k4450
$$ plain form
62562 658716 632204 607323 584537 564070 545820 529906 516637 505845 496766 488752 481697 475597
62550 475597 470127 464950 460061 455516 451124 446824 443140 440809 440017 440332 441285 442627 444122 445531 446918
62535 446918 448619 450830 453476 456462 459635 462510 464529 465875 467656 471015 476339 483562 492821 504389
62521 504389 518219 534059 552015 572617 596365 623457 653903 687554 724111 763466 806007
62510 806007 852095 901087 951236 1000734 1048538 1094046 1136374 1174292 1206585 1232053 1249385
62499 1249385 1257612 1256850 1248283 1233314 1212966 1188143 1160086 1130287 1100133 1070953 1044253 1021509
62487 1021509 1003572 990524 982289 979236 982041 991050 1006004 1026344 1051489 1080669 1112764 1146663
62475 1146663 1181810 1218047 1254682 1289780 1320574 1344651 1360744 1368553 1368144 1359619 1343094 1318644
62463A318644l2354l9932m6368n0934n3668n5199n5844n5249n3043m9587m5735
62452G80731m2052l8440l4501k9987k5039k0237j6320j3583j1504r259o638m157
62440E29014k349j232n47j00L38J029J902K418K224J632J105M69q06k672m402
62425E28023n561o523p759r012r610r341q640p988p456o911o365n973n764n498
62411D25622m883l887k886k335k339k583k675k471k000j356o91k92l64p93j141
62396C94926r32j2J224K029J998J634J895L034M191M446L922L411L195K921K496
62381D30378K423K985L832M608N478O527P280P445P663Q736J0301J1202J1212
62368E20070J1427J2708J4520J5897J6919J8497K1111K4483K8296L2502L6889
$$ plain form
62463 1318644 1286290 1246358 1199990 1149056 1095388 1040189 984345 929096 876053 826466 780731
62452 780731 738679 700239 665738 635751 610712 590475 574155 560572 549068 539809 533171 529014
62440 529014 526665 525433 524886 524786 525124 526153 528055 530473 532697 534329 535434 535903 535097 532425 528023
62425 528023 522462 515939 508180 499168 489558 480217 471577 463589 456133 449222 442857 436884 431120 425622
62411 425622 420739 416852 413966 411631 409292 406709 404034 401563 399563 398207 397516 397224 396860 396067 394926
62396 394926 393994 393982 395206 397235 399233 400867 402762 405796 409987 414433 418355 421766 424961 427882 430378
62381 430378 432801 435786 439618 444226 449704 456231 463511 470956 478619 487355 497656 508858 520070
62368 520070 531497 544205 558725 574622 591541 610038 631149 655632 683928 716430 753319
62357G53319M1100M5168M9485N3979N7860O0557O2340O3574O3639O1271N5910
62346A368202M8170L8974K8765J7850P015k763j1161j8627k5571l1844l7227m2068
62334A339715m6847n1133n3575n3259n0739m7316m3623l9455l4892l0759k7694
62323H60423k5381k3187k1141j9731j9004j8496j8098j8298j9321k0410k0426
62312F36930j9090j7369j6524j6751j6887j5613j2901j0066q279p425o634n535
62300D83856m439l581k879k406k398k627k409j497m54J80N35R00J080Q46O06J013
62284D66326K120L433M591N458N740N172M126L446L609M405N437O444P147P343
62270E34797P339P794Q885J0071J0947J1937J3779J6555J9652K2566K5441K8807
$$ plain form
62357 753319 794419 839587 889072 943051 1000911 1061468 1123808 1187382 1251021 1312292 1368202
62346 1368202 1416372 1455346 1484111 1501961 1508976 1506213 1495052 1476425 1450854 1419010 1381783 1339715
62334 1339715 1292868 1241735 1188160 1134901 1084162 1036846 993223 953768 918876 888117 860423
62323 860423 835042 811855 790714 770983 751979 733483 715385 697087 677766 657356 636930
62312 636930 617840 600471 583947 567196 550309 534696 521795 511729 503450 496025 489391 483856
62300 483856 479417 475836 472957 470551 468153 465526 463117 461620 461166 461346 461881 462781 463861 464707 465313 466326
62284 466326 468446 471879 476470 481928 487668 492840 496966 500412 504021 508426 513863 520307 527454 534797
62270 534797 542136 549930 558815 568886 579833 591770 605549 622104 641756 664322 689763 718570
62258G18570L2954L7690M2693M7946N3617N9441O4472O7682O8707O7684O4702
62247A326158N9834N3480M6061L7388K6994J5230L405p387j7053k5944l4130m1596
62235A442440m8533n4875n9933o2988o4043o3601o2014n9425n6050n2059m7460
62224H11459m2537l7964l4001k9930k5051k0024j6424j4879j4407j3663j2255
62213E50324j0606r127p917o897n881m664l264j957r87l67P5O53J732L379N110
62198E09606O373P235Q233R500J0592J1264J1921J2924J3926J4293J4017J3740
62186F43624J3891J4165J3909J2884J1539J0516R939R228P755N588L373J606L10
62173G58327m94l74J080L633O511R219J2047J5697K0537K6336L2544L8560M3649
$$ plain form
62258 718570 751524 789214 831907 879853 933470 992911 1057383 1125065 1193772 1261456 1326158
62247 1326158 1385992 1439472 1485533 1522921 1549915 1565145 1568550 1561163 1544110 1518166 1484036 1442440
62235 1442440 1393907 1339032 1279099 1216111 1152068 1088467 1026453 967028 910978 858919 811459
62224 811459 768922 730958 696957 667027 641976 621952 605528 590649 576242 562579 550324
62213 550324 539718 530591 522674 515777 509896 505232 501968 500011 499024 498657 498732 499385 501117 504496 509606
62198 509606 515979 523214 531447 540947 551539 562803 574724 587648 601574 615867 629884 643624
62186 643624 657515 671680 685589 698473 710012 720528 730467 739695 747450 753038 756411 758017 758327
62173 758327 757833 757459 758539 762172 768683 777902 789949 805646 826183 852519 885063 923623 967272
62160I67272M7030M8443M8461M7690M5651M1029L3276K3541J3607M512l465j0082
62148A306965j5254j9634k4207k9237l4114l8226m1343m3234m3591m2471m0202
62137I35452l6820l2210k6933k2204j8727j6055j3366j0383p331m567k503j406
62125G42947r38l29Q03K190L628N369P488R488J0896J1687J1751J0583P971M602
62111H28136J378j403l721n179n340m478l459l039l621n300p584r387r875r164
62097G57964p829o099l985j781K23K233M473O479P529P680P700Q079Q632R049
62083H00347R267R398R795J1003J3131J5351J6722J7325J8033J9238K0518K1492
62071I81620K2200K2646K2753K2884K3669K5017K6092K6579K7313K9145L1680
$$ plain form
62160 967272 1014302 1062745 1111206 1158896 1204547 1245576 1278852 1302393 1316000 1320512 1317047 1306965
62148 1306965 1291711 1272077 1247870 1218633 1184519 1146293 1104950 1061716 1018125 975654 935452
62137 935452 898632 866422 839489 817285 798558 782503 769137 758754 751423 746856 744353 742947
62125 742947 742009 741680 742483 744673 748301 753670 761158 770646 781542 793229 804980 815563 823534 828136
62111 828136 829514 828111 824390 819211 813871 809393 805934 802895 799274 793974 786390 777003 767128 757964
62097 757964 750135 744036 740051 738270 738493 740726 745199 751678 759207 766887 774587 782666 791298 800347
62083 800347 809614 819012 828807 839810 852941 868292 885014 902339 920372 939610 960128 981620
62071 981620 1003820 1026466 1049219 1072103 1095772 1120789 1146881 1173460 1200773 1229918 1261598
62060A261598L3700L4567L4627L4295L3175L0332K5392J9134J2784O790P17n552
62048A521559j1318j6242k1296k7522l4280l9846m3567m6324m8766n0349n0484
62037A131565m9519m8017m5964m3365m0806l8685l6463l3457k9904k6525k3482
62026G15378k0473j7566j5237j3661j2586j1783j1162j0620j0143r964j0188j0448
62014E61547j0298r758r097q330p326o208n237m436l687l016k343j295L50K129
62000D92995L332L811L926L884L633L315L218L260K990K176R81m63k193l990n240
61985E15635n542n278n351o381q124r643j0144r700r033q489p626o044m195k876
61971D17209k182j560p96k81k18k01J50N85O30K96L8J87O56J157J496J734K122
$$ plain form
62060 1261598 1295298 1329865 1364492 1398787 1431962 1462294 1487686 1506820 1519604 1526394 1527111 1521559
62048 1521559 1510241 1493999 1472703 1445181 1410901 1371055 1327488 1281164 1232398 1182049 1131565
62037 1131565 1082046 1034029 988065 944700 903894 865209 828746 795289 765385 738860 715378
62026 715378 694905 677339 662102 648441 635855 624072 612910 602290 592147 582183 571995 561547
62014 561547 551249 541491 532394 524064 516738 510530 505293 500857 497170 494154 491811 490516 490866 492995
62000 492995 496327 500138 504064 507948 511581 514896 518114 521374 524364 526540 527521 527058 524865 520875 515635
61985 515635 510093 504815 499464 493083 484959 475316 465172 455472 446439 437950 430324 424280 420085 417209
61971 417209 415027 413467 412671 412390 412172 411971 412121 412706 413336 413632 413670 413857 414513 415670 417166 418900 421022
61954D21022K764L338L331K680K007K003K652L347L735M215N387P189Q883R953
61940D82506J0724J1822J3349J4902J6243J7409J8215J8283J7693J7087J6771
61929F55004J6304J5284J4053J3070J2095J0647Q832O980M759J581k107m963o337
61916G45202o962p652q094p429n512k996m76J912M236O577Q963J1257J3121J4329
61902G66476J4921J4872J3873J1692Q486M516q1m884q885j1253j2352j3354j4798
61889G69229j6118j6645j6489j6050j5282j4027j2796j2414j2885j3155j2358
61878F11010j0905j0052j0543j1904j2944j2748j1264r229p546o614o134n546
61866D95581m543l196j734m10O82J780L318N321P224Q539R558J0975J2951J5105
$$ plain form
61954 421022 423786 427124 430455 433135 435142 437145 439797 443144 446879 451094 456481 463670 472553 482506
61940 482506 493230 505052 518401 533303 549546 566955 585170 603453 621146 638233 655004
61929 655004 671308 686592 700645 713715 725810 736457 745289 752269 757028 758609 756502 751539 745202
61916 745202 738240 730588 722494 715065 709553 706557 706081 707993 712229 718806 727769 739026 752147 766476
61902 766476 781397 796269 810142 821834 830320 834836 834755 829871 820986 809733 797381 784027 769229
61889 769229 753111 736466 719977 703927 688645 674618 661822 649408 636523 623368 611010
61878 611010 600105 590053 579510 567606 554662 541914 530650 521421 513875 507261 501127 495581
61866 495581 491038 487842 486108 485698 486380 488160 491478 496799 504023 512562 522120 533095 546046 561151
61852E61151J7324J9886K2672K4979K6429K7484K8580K9355K9309K8699K8030
61841H43898K6943K4506K0538J5935J1519P345L192q77m735q360j1387j2972j2592
61828I02953j0603p653l849Q99N994J0212J2820J4173J5010J5391J4591J1981
61816I81919P802K976j862o877j2438j8132k2796k5686k7285k8631l0046l0919
61804G88025l0674k9406k7494k5045k2127j9259j7157j5960j5073j3936j2589
61793E59305j1345j0212q992p758o844o339n996n632n342n195n041m785m519m213
61779D67092l578k564j733j712k370k923k843k287j634r76k91K29L45K19L77J108
61763D46459K026K435K151J752J918K610L201L314L184L115L011K616J953J218
$$ plain form
61852 561151 578475 598361 621033 646012 672441 699925 728505 757860 787169 815868 843898
61841 843898 870841 895347 915885 931820 943339 950684 953876 952999 948264 939904 928517 915545 902953
61828 902953 892350 884697 880848 881747 887741 897953 910773 924946 939956 955347 969938 981919
61816 981919 989721 992697 990835 983958 971520 953388 930592 904906 877621 848990 818944 788025
61804 788025 757351 727945 700451 675406 653279 634020 616863 600903 585830 571894 559305
61793 559305 547960 537748 528756 520998 514154 507815 501819 496187 490845 485650 480609 475824 471305 467092
61779 467092 463514 460950 459217 457505 455135 452212 449369 447082 445448 444472 444181 444410 444755 444974 445351 446459
61763 446459 448485 450920 453071 454823 456741 459351 462552 465866 469050 472165 475176 477792 479745 480963
61749D80963N18ro6L90P77M01o91j776k380k667k890k925k604k140j864j723j326
61732D59988m76N80J390J663J438J027Q64J232J990K570K464J828J487K067L189
61717D83301L848L613L120L153L569L507K477Q58n65j320j456j329j267j351j522
61702D98636j789k223k718l095l466m056m567m232k907j581j331k056k873l376
61688D58366l797m138m002l352k700k354k070j657j336j261j159q06m25k67j51
61673D28891K34P76R96N83l20j235j611j211l51L28M27P7k86l08jK57P2m60q28
61654D26030q17p74q84o45L52J560K114K032J960J950J544R71J192K451L765M188
61638D46989L767K927J822P13J28Q7r1p31j302j471j804k758l754m011l657l252
$$ plain form
61749 480963 481481 481472 481406 481796 482573 482974 482283 480507 478127 475460 472570 469645 467041 464901 463037 461314 459988
61732 459988 459512 460092 461482 463145 464583 465610 466474 467706 469696 472266 474730 476558 478045 480112 483301
61717 483301 487149 490762 493882 497035 500604 504111 506588 507446 506881 505561 504105 502776 501509 500158 498636
61702 498636 496847 494624 491906 488811 485345 481289 476722 472490 469583 468002 466671 464615 461742 458366
61688 458366 454569 450431 446429 443077 440377 438023 435953 434296 432960 431699 430540 429734 429309 429042 428891
61673 428891 429125 429901 430897 431480 431160 429925 428314 427103 426752 427080 427507 427584 427298 426990 426989 427246 427318 426858 426030
61654 426030 425213 424439 423555 422910 423262 424822 426936 428968 430928 432878 434422 435393 436585 439036 442801 446989
61638 446989 450756 453683 455505 456218 456346 456433 456342 455611 454309 452838 451034 448276 444522 440511 436854 433602
61622D33602k904k537k387k381j778l64P31M81m38p42o62j433l034m084m059l997
61606D04014m641n354n432n230n249n185m699m280m434m720m446l842l594l619
61592C39289l224k378k006k768m035m412l233j305j09k30q27q71n41q15j857k671
61576C08007k538j978j821j975j740r83l58m63j194j883j835q96K76P09Q3r47
61560B90464j472j071J26J572K370J795K17r67p59M21J516K130K504K649K221
61545C03716J229K47k00j22M5j50p12j017m08Q17J528J233Q04J183J932K003J407
61528C13535J036J045O18m96j431j515j190j125j265j350j572k037k215j669q57
61513B99512m81m40k12Q3j32q07j220j025o35l96p6N24J020Q36m7j019j309n92
$$ plain form
61622 433602 430698 428161 425774 423393 421615 421251 421982 422463 422025 421283 420621 419188 416154 412070 408011 404014
61606 404014 399373 394019 388587 383357 378108 372923 368224 363944 359510 354790 350344 346502 342908 339289
61592 339289 336065 333687 331681 328913 324878 320466 317233 315928 315819 315589 314762 313891 313350 312535 310678 308007
61576 308007 305469 303491 301670 299695 297955 296972 296614 296151 294957 293074 291239 290343 290619 291328 291411 290464
61560 290464 288992 287921 288047 289619 291989 293784 294001 293034 292275 292696 294212 296342 298846 301495 303716
61545 303716 304945 305192 304992 304870 304915 304765 304053 303036 302628 303445 304973 306206 307010 308193 310125 312128 313535
61528 313535 314571 315616 316234 315738 314307 312792 311602 310477 309212 307862 306290 304253 302038 300369 299512
61513 299512 299031 298591 298379 298462 298330 297523 296303 295278 294643 294247 294171 294695 295715 296551 296504 295485 294176 293584
61495B93584O07J163M44q62j445r13j00J97J59K53L48N4m14m34J65R18J370J463
61477B96557J355J212J193J288J214Q09L94L88O57O81L87K64O11J080J198R28
61461C10216N61K77Q3r1l89q65j222j004k14N85J018J333J832K192J855Q38k35
61444C16770q01o66J05J213K062K254K083K129K409K399J921J416J217J119R48
61429C36578R60J313J580J312P31L77L42M06P06J582K776L442L138K317J623J192
61413C60375Q88P86J033J514J917K026J661O91o36j652j968j937k091k332k180
61398C58095j633j204j083r30n76l60n38p66n77K8P06J205J382J138P01O05J005
61381C57198J297Q85J28J5Q70J954K373K027J456J138J073R31M68r1j87M04J107
$$ plain form
61495 293584 294191 295354 295798 294936 293491 292578 292478 292675 292834 293087 293435 293489 293075 292641 292806 293724 295094 296557
61477 296557 297912 299124 300317 301605 302819 303628 304022 304410 305067 305748 306135 306399 307010 308090 309288 310216
61461 310216 310777 311054 311137 311046 310657 309792 308570 307566 307352 307937 308955 310288 312120 314312 316167 317005 316770
61444 316770 315969 315303 315408 316621 318683 320937 323020 325149 327558 329957 331878 333294 334511 335630 336578
61429 336578 337538 338851 340431 341743 342474 342851 343193 343599 344305 345887 348663 352105 355243 357560 359183 360375
61413 360375 361263 362049 363082 364596 366513 368539 370200 370891 370255 368603 366635 364698 362607 360275 358095
61398 358095 356462 355258 354175 353245 352669 352309 351771 351005 350428 350456 351162 352367 353749 354887 355588 356193 357198
61381 357198 358495 359380 359508 359523 360393 362347 364720 366747 368203 369341 370414 371345 371813 371722 371535 371939 373046
61364C73046J140M88p7K6N63J021J382J975K773L269L178K965L368M409N251N248
61348D10025M890N214O361P320P288O633O119N740N038M110L505L318L162L006
61334D81729L224L821M300M417M337L917K690P83q47j558j768k118k585k815k788
61319D94739k598k019q93M22J421K002K288K334K416L104M531O041P113Q146R721
61304E38768J1468J2476J2532J2207J1829J1132R876Q182O180L838J224j436l890
61291F34386n741o540o403o268o898p959q642q927r360r837r573q263o474m745
61277E28756l159j896j338j293r44J07J344K141K455K451K121J682J690K269K838
61262E39224K933K849L069L582M253N250O613P781Q165P755O826N470L971L096
$$ plain form
61364 373046 374186 374674 374597 374623 375186 376207 377589 379564 382337 385606 388784 391749 395117 399526 404777 410025
61348 410025 414915 420129 426490 433810 441098 447731 453850 459590 464628 468738 472243 475561 478723 481729
61334 481729 484953 488774 493074 497491 501828 505745 508435 509218 508371 506813 505045 502927 500342 497527 494739
61319 494739 492141 490122 489229 489651 491072 493074 495362 497696 500112 503216 507747 513788 520901 529047 538768
61304 538768 550236 562712 575244 587451 599280 610412 620288 628470 634650 638488 639712 638276 634386
61291 634386 628645 622105 615702 609434 602536 594577 585935 577008 567648 557811 548238 539975 533501 528756
61277 528756 525597 523701 522363 521070 520126 520233 521577 523718 526173 528624 530745 532427 534117 536386 539224
61262 539224 542157 545006 548075 551657 555910 561160 567773 575554 583719 591474 598300 603770 607741 610837
61248F10837L306L973M047L284K190J063k13j536k554l235l797m077l657k727
61234F06904k102k139k274j900j209p17m07K20J441L019M480N452N861N960O087
61219F28676O291O357O259O254O401O402O121N889N852N453M127K306J054P33
61205F98175O61K20k92k24N15J524K501L424M405N633P208Q761R700J0157J1150
61190G63518J3193J5156J5322J3403J0625Q040N638L306J517O43L33R4q1j32l77
61175H50198j061j899k580l229m007m802n663o928q377r074q699q318q929r952
61161G66680j0229r955j0258j1255j1895j1742j1537j1673j1427j0186q441p004
61149F41078o006n147m288l358k268j297j057j763l032m554o282p827q510q281
$$ plain form
61248 610837 614143 618116 622163 625447 627637 628700 628487 626951 624397 621162 617365 613288 609631 606904
61234 606904 604802 602663 600389 598489 597280 596563 596156 596376 597817 600836 605316 610768 616629 622589 628676
61219 628676 634967 641324 647583 653837 660238 666640 672761 678650 684502 689955 694082 696388 697442 698175
61205 698175 698836 699056 698764 698540 699055 700579 703080 706504 710909 716542 723750 732511 742211 752368 763518
61190 763518 776711 791867 807189 820592 831217 839257 844895 848201 849718 850361 850694 850788 850707 850575 850198
61175 850198 849137 847238 844658 841429 837422 832620 826957 820029 811652 802578 793879 785561 776632 766680
61161 766680 756451 746496 736238 724983 713088 701346 689809 678136 666709 656523 648082 641078
61149 641078 635072 629925 625637 622279 620011 618714 617657 615894 612862 608308 602026 594199 585689 577408
61135E77408p833p440o540m876l147j928p74R20K842M370N586O864Q001Q647R211
61120E91311J0464J2460J4581J6506J8345K0111K1697K3256K4879K6045K6129
61109H05784K5399K4797K4748K4763K4292K3346K2180K0856J9256J7172J4349
61098A046942J0844P222M008J014k336o078r640j2689j5481j8204k0556k2200
61086I62846k3218k3810k3847k3146k2003k1118k0895k1002k0721j9685j8201
61075G25200j6803j5661j4507j3112j1529r921q402p166o403n923n108l538j506
61062F05621K19J088J235J378K192L612M838N289N395O006P245Q580R788J1118
61048F73604J2440J3215J3545J4266J5680J7085J8071J9368K1699K4580K7018
$$ plain form
61135 577408 569575 562135 555595 550719 547572 545644 544870 545790 548632 553002 558588 565452 573453 582100 591311
61120 591311 601775 614235 628816 645322 663667 683778 705475 728731 753610 779655 805784
61109 805784 831183 855980 880728 905491 929783 953129 975309 996165 1015421 1032593 1046942
61098 1046942 1057786 1065008 1069016 1070030 1067694 1061616 1051976 1039287 1023806 1005602 985046 962846
61086 962846 939628 915818 891971 868825 846822 825704 804809 783807 763086 743401 725200
61075 725200 708397 692736 678229 665117 653588 643667 635265 628099 621696 615773 610665 607127 605621
61062 605621 605840 606928 608163 609541 611733 615345 620183 625472 630867 636873 644118 652698 662486 673604
61048 673604 686044 699259 712804 727070 742750 759835 777906 797274 818973 843553 870571
61037H70571K8780L0285L1832L3670L6107L8826M0757M1558M2493M4845M8055
61026A287779N0495N1598N2097N2652N3409N4716N7138O0944O6490P4543Q5165
61015A947026R6757J07604J18125J30519J46835J68806J98971K40056K93774L62224
61005C810697M49866N61214O96117Q49604J016051J190720J368720J548167J732555
60996A3223711J915036K047540K034990J788653J307884P09923J67543j91169
60988B3004111l31052k83711j07369J13369K52964J77634j72555p27299j319768
60979B0606324j785341k040543k090718j988820j795511j561996j325735j108708
60971F908952r19318p58450o24510n14566m24705l51562k93078k47373k11943
$$ plain form
61037 870571 899351 929636 961468 995138 1031245 1070071 1110828 1152386 1194879 1239724 1287779
61026 1287779 1338274 1389872 1441969 1494621 1548030 1602746 1659884 1720828 1787318 1861861 1947026
61015 1947026 2043783 2151387 2269512 2400031 2546866 2715672 2914643 3154699 3448473 3810697
61005 3810697 4260563 4821777 5517894 6367498 7383549 8574269 9942989 11491156 13223711
60996 13223711 15138747 17186287 19221277 21009930 22317814 23027737 23195280 23004111
60988 23004111 22673059 22389348 22281979 22395348 22648312 22825946 22653391 21926092 20606324
60979 20606324 18820983 16780440 14689722 12700902 10905391 9343395 8017660 6908952
60971 6908952 5989634 5231184 4606674 4092108 3667403 3315841 3022763 2775390 2563447
60962B563447j84298j62417j44390j28543j14275j01918r1493q2237p3510o5276
60952A415090n7517n0050m3251l8141l5249l3892l2942l1808l0427k8799k6940
60941A006074k4983k3063k1339k0100j9442j8825j7562j5827j4600j4381j4527
60930H01425j4163j3206j2133j1261j0646j0310j0115r709q938q105p534p153
60918F78152o771o428o171n728m834l694k743k023j225k21P51J428J819K128K606
60903F47046L431M515N483O078O579P569R229J1049J2316J2835J2997J3234J3518
60890G65879J3516J3205J3092J3693J4869J5886J6129J5573J4621J3826J3684
60879I23973J4371J5380J5784J5081J3619J2042J0568R062P542O085M350J814
$$ plain form
60962 2563447 2379149 2216732 2072342 1943799 1829524 1727606 1636113 1553876 1480366 1415090
60952 1415090 1357573 1307523 1264272 1226131 1190882 1156990 1124048 1092240 1061813 1033014 1006074
60941 1006074 981091 958028 936689 916589 897147 878322 860760 844933 830333 815952 801425
60930 801425 787262 774056 761923 750662 740016 729706 719591 709882 700944 692839 685305 678152
60918 678152 671381 664953 658782 653054 648220 644526 641783 639760 638535 638314 639065 640493 642312 644440 647046
60903 647046 650477 654992 660475 666553 673132 680701 689930 700979 713295 726130 739127 752361 765879
60890 765879 779395 792600 805692 819385 834254 850140 866269 881842 896463 910289 923973
60879 923973 938344 953724 969508 984589 998208 1010250 1020818 1029880 1037422 1043507 1047857 1049671
60867A049671j441m488o426p266p812q854j0546j2447j3917j4641j4897j5291
60855I31645j6109j7069j7749j8056j8089j7764j6933j5797j4937j4766j5168
60844G49208j5685j5970j6005j5984j5999j5801j5027j3785j2824j2767j3258
60833E86103j3318j2615j1872j1779j1930j1334r758q045p033o573n840m440k912
60820D68654k111k207k535k488k318k656l401l622k737j292k43J59L28N35O82
60805D44748P53R13J123J166J114J366J957K287J760N48n20q21n19k92n18q49
60789D54216p59m20n73j395k039j747r86q33j473k055k065k022k588l571m241
60774D27449m199l715l377l615m232m406l514k002r91r32j190j176j144j472j805
$$ plain form
60867 1049671 1048230 1043742 1037316 1030050 1022238 1013384 1002838 990391 976474 961833 946936 931645
60855 931645 915536 898467 880718 862662 844573 826809 809876 794079 779142 764376 749208
60844 749208 733523 717553 701548 685564 669565 653764 638737 624952 612128 599361 586103
60833 586103 572785 560170 548298 536519 524589 513255 503497 495452 488419 481846 476006 471566 468654
60820 468654 466543 464336 461801 459313 456995 454339 450938 447316 444579 443287 443044 443203 443531 444066 444748
60805 444748 445501 446414 447537 448703 449817 451183 453140 455427 457187 457735 457215 456394 455875 455583 455065 454216
60789 454216 453457 453037 452464 451069 449030 447283 446297 445464 443991 441936 439871 437849 435261 431690 427449
60774 427449 423250 419535 416158 412543 408311 403905 400391 398389 397398 396466 395276 394100 392956 391484 389679
60759C89679j555r12o14q50j050q52o17p72j081r48k20O48J243J663K235K934
60743C88931L392L436L326L325L291K934K246J380L28r23k087k813l134l330l433
60728C96869l292l002k853k937l205l671m124l969l042k332k932m338m886m008
60714C48278k883k582k644k252j711j809k393k548j879q12O9L86J5o44p80j20
60698C25691N94N75m2p12j361k041k259j564m14L62O82R43J107R88J115K167L704
60681C29535M553M405L974L561K710J493R26J622K956M089M953N678N917N438
60667C81810M731M318L927L027J755P04Q1k65l18M5N72Q32P99P93Q62P06K69n1
60649D04597J14O39J107J287J273J220J067N44n40k044l510m497m894m956m977
$$ plain form
60759 389679 388124 387212 386598 385748 384698 383846 383229 382457 381376 380428 380208 380856 382099 383762 385997 388931
60743 388931 392323 395759 399085 402410 405701 408635 410881 412261 412589 411666 409579 406766 403632 400302 396869
60728 396869 393577 390575 387722 384785 381580 377909 373785 369816 366774 364442 361510 357172 352286 348278
60714 348278 345395 342813 340169 337917 336206 334397 332004 329456 327577 326765 326834 327220 327235 326591 325811 325691
60698 325691 326285 326860 326818 326106 324745 322704 320445 318881 318467 318829 319511 320454 321561 322549 323664 325831 329535
60681 329535 334088 338493 342467 346028 348738 350231 351157 352779 355735 359824 364777 370455 376372 381810
60667 381810 386541 390859 394786 397813 399568 400272 400353 400088 399770 399815 400387 401219 402018 402811 403673 404379 404648 404597
60649 404597 404711 405350 406457 407744 409017 410237 411304 411848 411308 409264 405754 401257 396363 391407 386430
60634C86430m944m553l748l040k922l057k588j426n72p90j500j661j196q20p24
60619C52889m20K09O13M94J98Rl04q71j326j325r97n29J50J001J687K050K312
60602C55840K484K138J150J80o0L22P66J119J587K103K336K309K364K480K104
60587C79222R44l74q01p0Q45P32m05j303r96j3N37O22J179K461L563L873M077
60570C94093N041O528P731Q536R379J0246J0730J0904J1203J1415J0605Q302N063
60557E09776J654j705m933p484q652q332p071n508l987k541r49J084L501N699
60543D70552O993P384P641Q583J0432J2804J5102J6667J6861J5456J2999J0397
60531F11871Q008N410K246j100l969o167p796q628q265o932n462m408l632k916
$$ plain form
60634 386430 381486 376933 373185 370145 367223 364166 361578 360152 359580 358790 357290 355629 354433 353613 352889
60619 352889 352469 352678 353291 353785 353983 353992 353688 352817 351491 350166 349169 348640 348790 349791 351478 353528 355840
60602 355840 358324 360462 361612 361792 361732 362054 362820 363939 365526 367629 369965 372274 374638 377118 379222
60587 379222 380166 379792 378991 378921 379766 380498 380093 378790 377794 377781 378318 378940 380119 382580 386143 390016 394093
60570 394093 399134 405662 413393 421929 431308 441554 452284 463188 474391 485806 496411 504713 509776
60557 509776 511430 509725 504792 497308 488656 480324 473253 467745 463758 461217 460268 461352 464853 470552
60543 470552 477545 484929 492570 501153 511585 524389 539491 556158 573019 588475 601474 611871
60531 611871 619879 625289 627535 626435 622466 616299 608503 599875 591610 584678 579216 574808 571176 568260
60517E68260k451k411k499k264j652r23k32M65J256K174L173M137N164O710R066
60502E87973J1787J4203J6615K0175K5236L0548L4655L7523M0091M2732M4939
60491I06477M6147M5912M3469L8078L0041K0548J0373n59j2114k3279l2968m0914
60479A031211m7182n1261n2351n0434m6598m2242l8219l4658l1266k7800k4357
60468E84843k1235j8467j5799j3190j1054r692q761p714o592n874n528m902l775
60455D52260l018l618n233o334n844m210k661j809j387j068r82j347j928k176
60441D10645j830j212q69j005j309j340j057q52j053j510j810j789j590j261o28
60426C91530L43J228J448Q17k57j131j383j013l56J98M52M77M85P00J230J984
$$ plain form
60517 568260 565809 563398 560899 558635 556983 556060 555828 556293 557549 559723 562896 567033 572197 578907 587973
60502 587973 599760 613963 630578 650753 675989 706537 741192 778715 818806 861538 906477
60491 906477 952624 998536 1042005 1080083 1110124 1130672 1141045 1140486 1128372 1105093 1072125 1031211
60479 1031211 984029 932768 880417 829983 783385 741143 702924 668266 637000 609200 584843
60468 584843 563608 545141 529342 516152 505098 495406 486645 478931 472339 466465 460937 456035 452260
60455 452260 449242 445624 440391 434057 428213 424003 421342 419533 418146 417078 416096 414749 412821 410645
60441 410645 408815 407603 406734 405729 404420 403080 402023 401171 400118 398608 396798 395009 393419 392158 391530
60426 391530 391873 393101 394549 395366 395109 393978 392595 391582 391226 391424 391876 392353 392838 393538 394768 396752
60410C96752K684L032K923K478J817R36j67j184j454n05J273K669K702J667P98
60395D16421R35J794K638L112L173K730J835J022Q52J249J699J939K052K061K013
60380D45525K274L053L775L624K819K507L208M078M144L565L167L245L460L492
60366D91936L212K469J296J89k73o2L77P03Q92J085J442K037K591K687K521L040
60350E16142M838P183Q747R106Q930Q779Q485P752O673N299L304N30k456m825
60336E88487o304p237p920q225p896o939n669m505l786l632l866m104m023l639
60322E10742l265l136l145k998k673k504k719k990k665j453K83J972L478N146
60308D94073P237R464J1296J2671J4180J6404J9174K1656K2984K2683K0655J7113
$$ plain form
60410 396752 399436 402468 405391 407869 409686 410622 410455 409271 407817 407312 408585 411254 413956 415623 416421
60395 416421 417356 419150 421788 424900 428073 430803 432638 433660 434512 435761 437460 439399 441451 443512 445525
60380 445525 447799 450852 454627 458251 461070 463577 466785 470863 475007 478572 481739 484984 488444 491936
60366 491936 495148 497617 498913 499102 498829 498767 499144 499847 500739 501824 503266 505303 507894 510581 513102 516142
60350 516142 520980 528163 536910 546016 554946 563725 572210 579962 586635 591934 595238 595768 593312 588487
60336 588487 582183 574946 567026 558801 550905 543966 538297 533792 530006 526374 522508 518404 514381 510742
60322 510742 507477 504341 501196 498198 495525 493021 490302 487312 484647 483194 483477 485449 488927 494073
60308 494073 501310 510774 522070 534741 548921 565325 584499 606155 629139 651822 672477 689590
60296F89590J2455O944N38o685j3924j9832k3371k4349k3193k0621j7493j4562
60284E45497j2049r741p588n930m974m363l551k428j442j131j665k647l391l504
60270D81093l241l068l027k873k642k598k677k495j972j400q82l35j33q87k322
60255D50541l180k728j669j033q65o74n01p08j061r91m76L4M16Q84J315J365J116
60238D41785R52Q61N18K5j50N4K24K72O33J500K389K724K463K001J794K106K820
60221D62971L452L680L696L710L379K378J317J296K514M027M988N423N632N661
60207E14124N699O215P232P995P898P273O785O549O305O052N896N565M760L806
60193F02154L294L189K832J957J110Q67J040R70L40n73j443k317l391m553n338
$$ plain form
60296 689590 702045 708989 709527 702842 688918 669086 645715 621366 598173 577552 560059 545497
60284 545497 533448 523707 516119 510189 505215 500852 497301 494873 493431 492300 490635 487988 484597 481093
60270 481093 477852 474784 471757 468884 466242 463644 460967 458472 456500 455100 454218 453883 453750 452863 450541
60255 450541 447361 444633 442964 441931 441066 440392 439891 439183 438122 437131 436655 436689 437105 437989 439304 440669 441785
60238 441785 442737 443598 444116 444141 443991 444045 444269 444541 445174 446674 449063 451787 454250 456251 458045 460151 462971
60221 462971 466423 470103 473799 477509 480888 483266 484583 485879 488393 492420 497408 502831 508463 514124
60207 514124 519823 526038 533270 541265 549163 556436 563221 569770 576075 582127 588023 593588 598348 602154
60193 602154 605448 608637 611469 613426 614536 615403 616443 617413 617753 617180 615737 613420 610029 605476 600138
60178F00138n453n117m813m788n013n400n785n792n088l860k706j967j532j385
60164E41439j807k774l572l537k918k454k273j843j007l39j92n6O34J560K032
60149E22893K139K468K836K270O51n88j20J520K682K744K565K948L604L937M034
60134E56583M368N006N547N596N084M288L686L457L176K365J302P23P39P60O14
60119F03294Q19J522K021J904J794K369L275L738L660L357K796J953J349J336
60105F35187J188m0j998l341l412k791k233j948j924k128k308k211j981j776j218
60090F07066R2J647K486K423K069J799J596J718K525L626M097L635K597J122q02
60075F37696k481l046k942l621n418p060p642p818q410r106r320r254r211q872
$$ plain form
60178 600138 594685 589568 584755 579967 574954 569554 563769 557977 552889 549029 546323 544356 542824 541439
60164 541439 539632 536858 533286 529749 526831 524377 522104 520261 519254 518915 518723 518667 519301 520861 522893
60149 522893 525032 527500 530336 532606 533257 532669 532549 534069 536751 539495 542060 545008 548612 552549 556583
60134 556583 560951 565957 571504 577100 582184 586472 590158 593615 596791 599156 600458 601181 601920 602680 603294
60119 603294 604113 605635 607656 609560 611354 613723 616998 620736 624396 627753 630549 632502 633851 635187
60105 635187 636375 636335 634337 630996 627584 624793 622560 620612 618688 616560 614252 612041 610060 608284 607066
60090 607066 607158 608805 611291 613714 615783 617582 619178 620896 623421 627047 631144 634779 637376 638498 637696
60075 637696 635215 632169 629227 625606 620188 613128 605486 597668 589258 580152 570832 561578 552367 543495
60061E43495q148p797q237q548p722o210n142m619l900k860k054j582r60o3P01
60046D76354J154J527J967K440L048L784M236M174M188M968O206O954O943O719
60032E34662O530N908M514K642P11j120k699l778m400m931n550o059o325o566
60018E13539p015p521p584o754n140l592l017l340l593l253k934l227l618l351
60004D49600k767k714k956k465j212l93o23j134j129q58p15k81Q88K266K993L013
59988D41513K829K575K142J888K310L194L816L934L840L580K870J888J203Q21
59974D78403Qj512k984l712m017m446m640l926k654j900j849j494k07J338K227
59959D48635K500K658K655K140J313P27M68K77K52P38J546K113K348K581K689
$$ plain form
60061 543495 535347 527550 519313 510765 503043 496833 491691 487072 483172 480312 478258 476676 475716 475653 476354
60046 476354 477508 479035 481002 483442 486490 490274 494510 498684 502872 507840 514046 521000 527943 534662
60032 534662 541192 547100 551614 554256 554967 553847 551148 547370 542970 538039 532489 526430 520105 513539
60018 513539 506524 499003 491419 484665 479525 475933 472916 469576 465983 462730 459796 456569 452951 449600
60004 449600 446833 444119 441163 438698 437486 437093 436470 435336 434207 433349 432634 432353 433241 435507 438500 441513
59988 441513 444342 446917 449059 450947 453257 456451 460267 464201 468041 471621 474491 476379 477582 478403
59974 478403 478411 476899 473915 470203 466186 461740 457100 453174 450520 448620 446771 445277 445070 446408 448635
59959 448635 451135 453793 456448 458588 459901 460628 461096 461373 461625 462363 463909 466022 468370 470951 473640
59944D73640K165J221Q54J424J939J388J27p02o57k74j82n75j367k248k596j917
59928D72240m14J127K028K121J659J056O43M33K13PJ89J014K217L336M123M561
59912D96553M712M805N106N487N383M508L323K483K058J577O89n34j714k390k295
59897E29751j646r87o39m78l02j0N78J640K923L872M343M676M971M950M724M898
59881E63264N513N712M957L886L338L284L377L730M285M126K510J60j601k629
59867F03912l846n559o980p402o913n954m936m262l985l546k518j353o72j36J022
59852E46872K676M068N132O342P492P985Q232R236J0510J0035O975L084N66l40
59838F28865p55j158j138n42R8J13r17k965n260o657o767o324o097n996n665n261
$$ plain form
59944 473640 475805 477026 477880 479304 481243 482631 482758 482056 481399 481125 480943 480368 479001 476753 474157 472240
59928 472240 471826 472953 474981 477102 478761 479817 480460 480893 481106 481113 481302 482316 484533 487869 491992 496553
59912 496553 501265 506070 511176 516663 522046 526554 529877 532360 534418 535995 536684 536150 534436 532046 529751
59897 529751 528105 527118 526479 526001 525699 525689 526267 527907 530830 534702 539045 543721 548692 553642 558366 563264
59881 563264 568777 574489 579446 583332 586670 589954 593331 597061 601346 605472 607982 608142 606541 603912
59867 603912 600066 594507 587527 580125 573212 567258 562322 558060 554075 550529 548011 546658 545986 545850 546872
59852 546872 549548 553616 558748 565090 572582 580567 588799 598035 608545 618580 625555 628639 629205 628865
59838 628865 628110 626952 625814 625272 625370 625483 624566 621601 616341 609684 602917 596593 590496 584500 578835 573574
59822E73574n069m933m717m782n400o108o254n768m875l627k265j487j612j920
59808E14757j554o46R6M74O50M45l17j050j048p01j095k399l580l779l142k167
59792D94944j173n46p02j372j608q78L24J177J366R36oj117j798j820j524j193
59776D85010o81n6nr70k224k559j756p32k97l71m89n05m28p3P14J632K102J917
59758D80229J478J414K027L130M247M907M888M320L674L556M295N585O624O803
59744E37177O291N720N348M767L654K461K015K551L414L791L364K325J076K6n57
59729E83423p51q22q43o96m14k13k6M80J251J636J217M21j40n13j036j481j296
59712E80197o10j77k92l89K2O70R94R15P56P72R68J212J335J367J652K389L120
$$ plain form
59822 573574 568505 563572 558855 554073 548673 542565 536311 530543 525668 522041 519776 518289 516677 514757
59808 514757 513203 512557 512653 513127 513777 514222 513905 512855 511807 511106 510011 507612 504032 500253 497111 494944
59792 494944 493771 493225 492523 491151 489543 488665 488989 490166 491532 492468 492462 491345 489547 487727 486203 485010
59776 485010 484329 484273 484268 483298 481074 478515 476759 476027 475730 475359 474870 474365 473937 473864 474578 476210 478312 480229
59758 480229 481707 483121 485148 488278 492525 497432 502320 506640 510314 513870 518165 523750 530374 537177
59744 537177 543468 549188 554536 559303 562957 565418 567433 569984 573398 577189 580553 582878 583954 583980 583423
59729 583423 582672 581850 581007 580311 579897 579684 579658 580138 581389 583025 584242 584663 584523 584010 582974 581493 580197
59712 580197 579587 579410 579118 578729 578751 579421 580415 581330 582086 582858 583826 585038 586373 587740 589392 591781 594901
59695E94901L118K439J978K263K787K893K722K713K617J724k3j768k665k617k083
59680F10999j527j203j164j330j663k261l126l919m231m106m105m661n513n881
59666E66309n245l930k891k806l387l712l242k344j636j126k89J081K473L213
59652E42468L169K780K532K607K954L356L411K742J446R8r99k251m035n654n832
59637E48792m462l036k812l269l130k377k124k688k992k214r77l51m59p39j047
59622E16115j708k700l454l540l103k685k813l663m808n418m920l502j877o67
59608D71257j00K1K04R02K035K989L256K861K073J084J10n34q20j108j598j950
59592D80682j781j231o74j56M39R09R70P35M94J50n53j356j623j280j009j431
$$ plain form
59695 594901 598019 600458 602436 604699 607486 610379 613101 615814 618431 620155 620132 618364 615699 613082 610999
59680 610999 609472 608269 607105 605775 604112 601851 598725 594806 590575 586469 582364 577703 572190 566309
59666 566309 561064 557134 554243 551437 548050 544338 541096 538752 537116 535990 535701 536782 539255 542468
59652 542468 545637 548417 550949 553556 556510 559866 563277 566019 567465 567563 566564 564313 560278 554624 548792
59637 548792 544330 541294 538482 535213 532083 529706 527582 524894 521902 519688 518711 518360 517901 517162 516115
59622 516115 514407 511707 508253 504713 501610 498925 496112 492449 487641 482223 477303 473801 471924 471257
59608 471257 471157 471178 471382 472284 474319 477308 480564 483425 485498 486582 486692 486158 485338 484230 482632 480682
59592 480682 478901 477670 476996 476840 477279 478188 479158 479893 480387 480537 479984 478628 477005 475725 474716 473285
59576D73285k431l449m001l821k968k005j637j901k067j624r57o90p59o57l71
59561D43947l80p22p07J39J298J840J533R68P19P50P28N94O42J131J989K833L329
59544D60631L570M064N238O982Q797J0318J1493J2407J3270J4557J6540J8427
59532E86294J8340J4760Q076N49n333q384q959q093o493m297j647P99K298K847
59518E90757L066L166K553Q30j391l105m025m567n132n870o882q025q685q396
59504E44294p541o954o906p028p012o812o301n389m363l564k863k071j582j783
59490D74125k046j334K24J426J692J581J466R43K6k62P46K313L380L911M409M887
59474D97487N189N623O345O606N605L754K218J492J223J155J326J436R82J08m34
$$ plain form
59576 473285 470854 467405 463404 459583 456615 454610 452973 451072 449005 447381 446424 445734 444975 444318 443947
59561 443947 443567 442845 442138 442277 443575 445415 446948 447916 448635 449385 450113 450707 451349 452480 454469 457302 460631
59544 460631 464201 468265 473503 480485 489282 499600 511093 523500 536770 551327 567867 586294
59532 586294 604634 619394 627470 628019 622686 614302 605343 597250 590757 586460 584813 585612 587910 590757
59518 590757 593823 596989 599542 600372 598981 595876 591851 587284 582152 576282 569400 561375 552690 544294
59504 544294 536753 529799 522893 515865 508853 502041 495740 490351 485988 482424 479561 477490 475908 474125
59490 474125 472079 470745 470969 472395 474087 475668 477134 478077 478103 477841 478587 480900 484280 488191 492600 497487
59474 497487 502676 508299 514644 521250 526855 530609 532827 534319 535542 536697 538023 539459 540441 540549 540115
59459E40115k07O03J843L585N533O907P315P329P847R072J0328J0777J0188Q956
59445F30191P556O127M685L477K607J373j277n328r329j1777j2436j1898j0540
59432E93431q621o890o154o244o109n095l595k355j542o06J090L602O272Q444
59418E65628J0244J2313J4777J7024J8767K0509K2514K4107K4710K4784K4648
59407G80025K2855J7224P621l293j2281j7692j9380j7800j3897r068m279M20M787
59394G35242P060M734k864j3137k1876k6422k7065k5595k3189k0082j6642j3658
59382E56506j1423r330o818m155j984n55K27N39P85J493K605L403L573L686M093
59367E42645M137L234K100J844K336K543K225K190K915L953M811N599O619P946
$$ plain form
59459 540115 539908 540511 542354 545939 551472 558379 565694 573023 580870 589942 600270 611047 621235 630191
59445 630191 637747 643874 648559 652036 654643 656016 654739 649411 640082 628305 615869 603971 593431
59432 593431 584810 577920 571766 565522 559413 554318 550723 548368 546826 546220 547310 550912 557184 565628
59418 565628 575872 588185 602962 619986 638753 659262 681776 705883 730593 755377 780025
59407 780025 802880 820104 827725 824432 812151 794459 775079 757279 743382 734314 730035 730455 735242
59394 735242 742302 747036 744172 731035 709159 682737 655672 630077 606888 586806 570164 556506
59382 556506 545083 535753 528935 524780 522796 522241 522468 523007 523792 525285 527890 531293 534866 538552 542645
59367 542645 546782 550016 552116 553960 556296 558839 561064 563254 566169 570122 574933 580532 587151 595097
59353E95097R507J1026J2005J2300J2551J3420J4656J5659J6539J7730J8865J9164
59341G68519J8795J8577J8373J7100J4567J1853R570O987L533p5k980n475q209
59328H71135j0919j2906j4159j5204j6210j6948j7273j7027j5887j3961j2050
59317G08591j0786r895q877p895p293o715n550l986k770k064j305j20J409L340
59303F46084N911Q741J0779J1520J1836J2994J4936J5878J3808Q236N85o917j2611
59290G41780j5883j6872j6054j4058j1476q735o212m321l332l100l218l246k740
59277F32533j326P57K481K982K620K562L437M987O845Q845J0467J0919J0122Q864
59263G07095P655O136M006J768o0j803l991o365q265r609j0727j1524j1644j1255
$$ plain form
59353 595097 604604 615630 627635 639935 652486 665906 680562 696221 712760 730490 749355 768519
59341 768519 787314 805891 824264 841364 855931 867784 877354 884341 887874 887799 884819 879344 871135
59328 871135 860216 847310 833151 817947 801737 784789 767516 750489 734602 720641 708591
59317 708591 697805 687910 679033 671138 663845 657130 651580 647594 644824 642760 641455 641335 642744 646084
59303 646084 651995 660736 671515 683035 694871 707865 722801 738679 752487 760723 761308 754391 741780
59290 741780 725897 709025 692971 678913 667437 658702 652490 648169 644837 641737 638519 635273 632533
59277 632533 631207 631964 634445 637427 640047 642609 646046 651033 657878 666723 677190 688109 698231 707095
59263 707095 714750 720886 724892 726660 726600 724797 720806 714441 706176 696567 685840 674316 662672 651417
59249F51417j0891j0543r634p925n892m041k439j074j29L96Q99J666K423K717
59235F06950K599K621L139L874M231L889L027K002J026J23p47j640k606l604m503
59220F20381n254n978o683p060o749n797m627l635k948k500k087j481p30j98n0
59205E64604Q5N61J018P83o7o39k71P71J704J986J654J318J768L089M268M234
59189E86866L317K884L509M287M286L800L683M040M270L954L185K267J518J115
59175F32981Q36L18k46j42Q46J990K611K899L262L571L749M491O359Q521R471
59160F81517Q931Q005P396O550M937L122J855P82r89l359n214n945o189o707p224
59145F87468o998o160n727o163o692o419n595n185n459n684n189m153l208k668
$$ plain form
59249 651417 640526 629983 620349 612424 606532 602491 600052 598978 598849 599245 600144 601810 604233 606950
59235 606950 609549 612170 615309 619183 623414 627303 630330 632332 633358 633481 632734 631094 628488 624884 620381
59220 620381 615127 609149 602466 595406 588657 582860 578233 574598 571650 569150 567063 565582 564852 564654 564604
59205 564604 564689 565250 566268 567051 566984 566345 566074 566845 568549 570535 572189 573507 575275 578364 582632 586866
59189 586866 590183 593067 596576 600863 605149 608949 612632 616672 620942 624896 628081 630348 631866 632981
59175 632981 633817 634135 633889 633747 634593 636583 639194 642093 645355 648926 652675 657166 663525 672046 681517
59160 681517 690448 698453 705849 712399 717336 720458 722313 723095 722106 718747 713533 707588 701399 694692 687468
59145 687468 680470 674310 668583 662420 655728 649309 643714 638529 633070 627386 622197 618044 614836 612168
59131F12168k392k078j593j115r92j221j265o70K19P22Q71J360K429L509M173
59116F14125M727N495O187O522O864P626Q376Q328P447O456N840N419M973M621
59102G03006M467M292L934L611L537L425K727J389N5o62q09q07p96o88o81j091
59086G24909j684j797j406j323j963k757l308m323o436q769r885r749r507r539
59072F52463r107q017p168p069p040o449n664n270n161n030m915m803m433l896
59058E68441l666l689l349k738k803l726m302l667k564j946j493n93J84l0p71
59043E33288q68k51J69L8k98q02j612k074j293L53J486J622J656K233K890L143
59027E39680L421M256N369O241P044Q373J0233J1867J2537J2285J1842J1833J2074
$$ plain form
59131 612168 609776 607698 606105 604990 603998 602777 601512 600842 601061 601783 602654 604014 606443 609952 614125
59116 614125 618852 624347 630534 637056 643920 651546 659922 668250 675697 682153 687993 693412 698385 703006
59102 703006 707473 711765 715699 719310 722847 726272 728999 730388 730443 729781 728972 728165 727369 726681 726000 724909
59086 724909 723225 721428 720022 718699 716736 713979 710671 706348 699912 691143 681258 671509 662002 652463
59072 652463 643356 635339 628171 621102 614062 607613 601949 596679 591518 586488 581573 576770 572337 568441
59058 568441 564775 561086 557737 554999 552196 548470 544168 540501 537937 535991 534498 533905 534089 534059 533288
59043 533288 532420 532169 532338 532376 532078 531276 529664 527590 526297 526650 528136 529758 531414 533647 536537 539680
59027 539680 543101 547357 552726 558967 566011 574384 584617 596484 609021 621306 633148 644981 657055
59014F57055J1758J0419Q383O179L928J583n97k276l354l737l222k059j088o85
59000F82287r4J431L330M444M706N060N807O169N524M214K840J553L48o48j426
58985G25545k169k857l305l633m189m893n246n032m419l288j245J397L443M184
58971F94293M457N695Q111J0440J1483J1416J1370J1929J2458J2014J0659R401
58959H13726Q873Q553P557N759L653J427j220m395p616j0226j1975j3144j4213
58946G86759j5344j6098j5825j4478j2766j1324j0076q633p005n570m602m108
58934F60930l925l769l376k826k431k201j827j269q66p47o75p49j392k450l046
58919F29381k826k467k429k135j152k72l54q42n93L51J013J142J439K324L476
$$ plain form
59014 657055 668813 679232 687615 693794 697722 699305 698708 696432 693078 689341 686119 684060 682972 682287
59000 682287 682193 683624 686954 691398 696104 701164 706971 713140 718664 722878 725718 727271 727619 726971 725545
58985 725545 723376 720519 717214 713581 709392 704499 699253 694221 689802 686514 685269 686666 690109 694293
58971 694293 698750 704445 712556 722996 734479 745895 757265 769194 781652 793666 804325 813726
58959 813726 822599 831152 838709 844468 848121 849548 848328 843933 836317 826091 814116 800972 786759
58946 786759 771415 755317 739492 725014 712248 700924 690848 682215 675210 669640 665038 660930
58934 660930 657005 653236 649860 647034 644603 642402 640575 639306 638440 637693 637018 636269 634877 632427 629381
58919 629381 626555 624088 621659 619524 618372 618100 617746 616904 616311 616662 617675 618817 620256 622580 626056
58904F26056M548N511O401P424R026J1141J2777J3171J2850J2734J2722J2273
58892G46634J1815J2191J3124J3601J3601J4085J5399J6995J8644K0458K1698
58881I18245K1085J8554J5336J2143Q623M834J675o06k959n930q828j1065j3072
58868I58035j5082j6230j5826j4575j3598j2951j1996j0630r348q642q861j0113
58856H10183j1714j2464j2011j1355j1407j1759j1513j0701j0026r708r318q543
58844F79664p480o415n693n602o009o362o287n932n608n500n744o192o154n051
58830E95635l515k886l381l726l007j920j473j403p97L54J236J567J930K823L971
58815E85408M709M704M277M065M259M319L809L250L383L739K990R68q24j207q42
$$ plain form
58904 626056 630604 636115 642516 649940 658966 670107 682884 696055 708905 721639 734361 746634
58892 746634 758449 770640 783764 797365 810966 825051 840450 857445 876089 896547 918245
58881 918245 939330 957884 973220 985363 993986 998820 1000495 999889 996930 991000 982172 971107 958035
58868 958035 942953 926723 910897 896322 882724 869773 857777 847147 837799 829157 820296 810183
58856 810183 798469 786005 773994 762639 751232 739473 727960 717259 707233 697525 688207 679664
58844 679664 672184 665769 660076 654474 648465 642103 635816 629884 624276 618776 613032 606840 600686 595635
58830 595635 592120 589234 585853 582127 579120 577200 575727 574324 573527 573881 575117 576684 578614 581437 585408
58815 585408 590117 594821 599098 603163 607422 611741 615550 618800 622183 625922 628912 629880 629056 627849 627007
58800F27007j027j911k757l308l901m598n059n136m933m519m080m027m434m707
58786E72610m305l394k363j149L85J878K926L752M702N429N332M587L926L523
58772E97839K811J433l04k042l799n536o799p113o573n800n344n275n285n111
58758E43102m743m260l614k759j815q40L88K028L642M468M180L123J863Q94O76
58743E46333J411K686L788M451M931N410N782O015O178O096N537M791M550N076
58729F13035N869O240N836M787L753L607M474N260M908L824L284L609L918L770
58715F76174L843M772O163P194P488P144O505N974N545M574K685N66j050k754
58701G34823n552q906j1271j2516j4061j6294j7784j7653j6978j6865j6716j5605
$$ plain form
58800 627007 625980 624069 621312 618004 614103 609505 604446 599310 594377 589858 585778 581751 577317 572610
58786 572610 568305 564911 562548 561399 561784 563662 566588 570340 575042 580471 585803 590390 594316 597839
58772 597839 600650 602083 601779 599737 595938 590402 583603 576490 569917 564117 558773 553498 548213 543102
58758 543102 538359 534099 530485 527726 525911 525071 525459 527487 531129 535597 539777 542900 544763 545657 546333
58743 546333 547744 550430 554218 558669 563600 569010 574792 580807 586985 593081 598618 603409 607959 613035
58729 613035 618904 625144 630980 635767 639520 643127 647601 652861 657769 661593 664877 668486 672404 676174
58715 676174 680017 684789 690952 698146 705634 712778 719283 725257 730802 735376 738061 738627 737577 734823
58701 734823 729271 720365 709094 696578 682517 666223 648439 630786 613808 596943 580227 564622
58689E64622j3969j2637j1339r496p562o345n659m858m028l591l344k958k767
58676D76069l084l287k622j409m91K6N88J301K053L074M454N628O174O604P583
58661E02661Q796R476R464Q922P543N080K198j84k060l923n485n872m976l765
58647E27875l203l496m224m799m859m582m394m231l562k375j381r63p24m19l87
58632D84276n16J40J877L436L526K477J522J145R92P86M13j92n67P8J506K289
58616E03188J874J685K970M745N279M709M511N016N245M814M314L854K783J029
58602E56016m91j100j117j254j918l000l801l507k279j343j368j426l85J492L252
58587E37771M754O214P100O891O342O619P570Q222Q548R219R992R867Q820P867
$$ plain form
58689 564622 550653 538016 526677 517181 509619 503274 497615 492757 488729 485138 481794 478836 476069
58676 476069 472985 469698 467076 465667 465176 465202 465790 467091 469144 472218 476672 482300 488474 495078 502661
58661 502661 511457 520933 530397 539319 546862 551942 554140 553956 551896 547973 542488 536616 531640 527875
58647 527875 524672 521176 516952 512153 507294 502712 498318 494087 490525 488150 486769 485806 485082 484663 484276
58632 484276 483760 483900 485777 489213 492739 495216 496738 497883 498875 499661 500074 499882 499315 499393 500899 503188
58616 503188 505062 506747 509717 514462 519741 524450 528961 533977 539222 544036 548350 552204 554987 556016
58602 556016 555525 554425 553308 552054 550136 547136 543335 539828 537549 536206 534838 533412 533027 534519 537771
58587 537771 542525 548739 555839 562730 569072 575691 583261 591483 600031 609250 619242 629109 637929 645796
58573F45796P431P006O510O646P693R032J0134J1161J2448J4137J6273J8605K0533
58560G93405K1931K3599K5940K7811K7655K5432K2271J8683J4435R770N433J608
58548A017973j938m816o352o860p346q093q669r146j0079j1434j2736j4141j6200
58535I00163j8628k0559k1880k3077k3877k3342k1319j8620j5733j2585r495p143
58523F83905n507l940k330j113k83N08R74N62k93n59k12k63j121k134k769l006
58507F62419k623j382k2J43j116k755l874m336m027k834j425q68j255j650j434
58492F32961p28L64J731K560K013O73J82J244L067M769O258P630Q765R718J0688
58477F91895J1602J2457J3746J5551J6681J5880J3566J1125Q831N867K116j565
$$ plain form
58573 645796 653227 660233 666743 673389 681082 690114 700248 711409 723857 737994 754267 772872 793405
58560 793405 815336 838935 864875 892686 920341 945773 968044 986727 1001162 1010932 1016365 1017973
58548 1017973 1016035 1011219 1004867 998007 990661 982568 973899 964753 954674 943240 930504 916363 900163
58535 900163 881535 860976 839096 816019 792142 768800 747481 728861 713128 700543 691048 683905
58523 683905 678398 674458 672128 671015 670732 671240 672214 672776 672483 671924 671712 671449 670328 668194 665425 662419
58507 662419 659796 658414 658392 658535 657419 654664 650790 646454 642427 639593 638168 637300 636045 634395 632961
58492 632961 632233 632597 634328 636888 638901 639574 639756 641000 644067 648836 655094 662724 671489 681207 691895
58477 691895 703497 715954 729700 745251 761932 777812 791378 802503 811334 817201 819317 817752
58465H17752m710p488r572j0210r428q027o371m340k207l79J494L901O274P709
58451G74398Q490R502J0520J0488R162P073M281O59l121o349r384j2395j3933
58438G89391j2773j0293q800q148o522l914k017r77P64L242M618M518M869O724
58424G60682Q838J0214J1565J3278J4220J3606J2049R922O692K658o94k836m812
58411H55382p013q402q655q964r818j0114r334q635q708q495p074n111l484k110
58397G49465q85j86K77J362K835L517L513M226N673O108M874L395K560J518q2
58382G88170j017o61JN55K006M376N860N691N576O818Q153Q018P060O777P337
58367H54720Q137Q995R652R558R175R809J1506J2768J3084J3634J4858J5503J4945
$$ plain form
58465 817752 813042 805554 795982 785772 776344 768317 761946 757606 755399 755020 756514 760415 766689 774398
58451 774398 782888 792390 802910 813398 822560 829633 833914 834573 831452 825103 815719 803324 789391
58438 789391 776618 766325 757525 749377 742855 738941 736924 735947 736711 739953 744571 749089 753958 760682
58424 760682 769520 779734 791299 804577 818797 832403 844452 854374 861066 863724 863030 860194 855382
58411 855382 848369 839967 831312 822348 812530 802416 793082 784447 775739 767244 760170 755059 751575 749465
58397 749465 748580 748394 748671 750033 752868 756385 759898 764124 769797 775905 780779 784174 786734 788252 788170
58382 788170 787153 786492 786493 787048 789054 793430 799290 804981 810557 817375 825528 833546 840606 847383 854720
58367 854720 862857 871852 881504 891062 900237 910046 921552 934320 947404 961038 975896 991399 1006344
58354A006344J4117J3304J1422Q462O111M915L375J020k63O56K290L151L750M655
58340A083309N195N540P301J0462J2484J2191J1802J3212J5023J5387J5159J5838
58328A222903J6755J6637J5937J5440J4524J2708J1020J0022Q594O357N028N554
58316A361479O349O177O255P540Q533P962P232P961R400J0438J1792J4022J5761
58303A480901J6140J6653J8467K0206K0492K0352K0995K1539K1123K0807K1371
58292A699046K1672K1053K0861K1748K2279K1942K2520K4614K6157K6296K7211
58281A955399K9916L2109L2462L3164L5556L7357L7068L7019L9004M1030M1705
58270B351789M3378M7423N0760N1159N1651N5334O0002O2404O3839O6822P0000
$$ plain form
58354 1006344 1020461 1033765 1045187 1053649 1059760 1064675 1068050 1069070 1068807 1069463 1071753 1074904 1078654 1083309
58340 1083309 1088504 1094044 1101345 1111807 1124291 1136482 1148284 1161496 1176519 1191906 1207065 1222903
58328 1222903 1239658 1256295 1272232 1287672 1302196 1314904 1325924 1335946 1344540 1350897 1355925 1361479
58316 1361479 1367828 1374005 1380260 1387800 1396333 1404295 1411527 1419488 1428888 1439326 1451118 1465140 1480901
58303 1480901 1497041 1513694 1532161 1552367 1572859 1593211 1614206 1635745 1656868 1677675 1699046
58292 1699046 1720718 1741771 1762632 1784380 1806659 1828601 1851121 1875735 1901892 1928188 1955399
58281 1955399 1985315 2017424 2049886 2083050 2118606 2155963 2193031 2230050 2269054 2310084 2351789
58270 2351789 2395167 2442590 2493350 2544509 2596160 2651494 2711496 2773900 2837739 2904561 2974561
58259B974561P1248P2223P5082P8116P9242Q0258Q3189Q6090Q7120Q8684R2871
58248C868684R7008R8715J00949J06735J13444J17897J22495J30366J39041J45281
58238E040615J51647J61730J73304J82903J92682K05885K20085K31938K44226
58229F805015K60912K79857K97760L17391L42402L69976L96491M25171M60020
58220I954995M97864N34884N75177O24004O78957P37029Q03526Q84204R76099
58211A6266739J076580J193361J334305J496597J678620J893009K154375K465045
58203B9558631K828669L267227L808628M471375N282393O298167P587146R203377
58195G2305613J1193555J3598600J6402080J9483706K2659323K5763941K8679220
$$ plain form
58259 2974561 3045809 3118032 3193114 3271230 3350472 3430730 3513919 3600009 3687129 3775813 3868684
58248 3868684 3965692 4064407 4165356 4272091 4385535 4503432 4625927 4756293 4895334 5040615
58238 5040615 5192262 5353992 5527296 5710199 5902881 6108766 6328851 6560789 6805015
58229 6805015 7065927 7345784 7643544 7960935 8303337 8673313 9069804 9494975 9954995
58220 9954995 10452859 10987743 11562920 12186924 12865881 13602910 14406436 15290640 16266739
58211 16266739 17343319 18536680 19870985 21367582 23046202 24939211 27093586 29558631
58203 29558631 32387300 35654527 39463155 43934530 49216923 55515090 63102236 72305613
58195 72305613 83499168 97097768 113499848 132983554 155642877 181406818 210086038
58188B10086038L1306642L3509401L4935815L4738633L1575911K4294542J2979003
58181D13425985o23853j3873424k4577255l1769364l5530828l6416789l5110113
58174B35524359l2334753k8777364k4974333k1280396j7915033j4990824j2520268
58167H2731388j0457628q754193p367084o240146n313219m547336l919444l400581
58159C2731757k960394k585689k274004k013974j788856j593124j428712j289787
58151A6797217j166140j056411r63655q82513q04323p30389o67266o13055n60610
58142I352855n10283m67449m30952l95635l63193l39202l21952l04707k86732
58133E932750k72077k59678k44535k27004k11772j98985j85021j70526j59382
$$ plain form
58188 210086038 241392680 274902081 309837896 344576529 376152440 400446982 413425985
58181 413425985 412802132 398928708 374351453 342582089 307051261 270634472 235524359
58174 235524359 203189606 174412242 149437909 128157513 110242480 95251656 82731388
58167 82731388 72273760 63519567 56152483 49912337 44599118 40051782 36132338 32731757
58159 32731757 29771363 27185674 24911670 22897696 21108840 19515716 18087004 16797217
58151 16797217 15631077 14574666 13611011 12728498 11924175 11193786 10526520 9913465 9352855
58142 9352855 8842572 8375123 7944171 7548536 7185343 6846141 6524189 6219482 5932750
58133 5932750 5660673 5400995 5156460 4929456 4717684 4518699 4333678 4163152 4003770
58124D003770j50968j41227j30274j21626j15219j08131j00778r5632r1373q5067
58114B863475p8468p5478p4951p2683o8907o7039o6472o3574n8734n5594n4152
58103B127423n1144m6753m4388m4173m2863m0087l8725l9061l8377l6424l5794
58092A669634l6628l6174l3947l2371l2035l1000k8989k7746k7105k5152k2408
58081A336079k1499k2606k3451k3640k4752k6177k5402k2686k1121k1580k1679
58070A081486k0242j8833j8280j7425j5933j4942j4392j2886j0678r649j0083
58059I18143j0448j0416j1029j1955j1790j1034j1565j3036j3129j1431r885r232
58047G83193q168o386n322n491n883o218p072p692o662m745m275n515o520o608
$$ plain form
58124 4003770 3852802 3711575 3581301 3459675 3344456 3236325 3135547 3039915 2948542 2863475
58114 2863475 2785007 2709529 2634578 2561895 2492988 2425949 2359477 2295903 2237169 2181575 2127423
58103 2127423 2076279 2029526 1985138 1940965 1898102 1858015 1819290 1780229 1741852 1705428 1669634
58092 1669634 1633006 1596832 1562885 1530514 1498479 1467479 1438490 1410744 1383639 1358487 1336079
58081 1336079 1314580 1291974 1268523 1244883 1220131 1193954 1168552 1145866 1124745 1103165 1081486
58070 1081486 1061244 1042411 1024131 1006706 990773 975831 961439 948553 937875 928226 918143
58059 918143 907695 897279 886250 874295 862505 851471 839906 826870 813741 802310 792425 783193
58047 783193 775025 768639 763317 757826 751943 745725 738653 730961 724299 719554 715279 709764 703244 696636
58033F96636p000p893p942p058o877p931r022r686j0638j1496j0809q751p281
58020E84252p144p125o581o297o538o536o223o276o371n593m471m289m569l747
58006E02492k179j687k223j836j36J026P14J0l61q72j282n14J100J990K038K505
57990E00785L086J925q96k761k346j333j397k036k439l036m031m515m147l882
57976D72977m079l771k602j610j380j256j049j511k502k634j521n45n88q06l77
57961D46746L04Q04J300J495N86j146k374k754l140l562l039j741j148j544j504
57946D29283n00K32J83O69K471M401N342N845O656P415P859Q630R911J0747J0655
57931E09799J0428J0539J0237Q908O924M622J979l49j403j814l350o085q119q617
$$ plain form
58033 696636 689636 681743 673801 666743 659866 651935 642913 633227 622589 611093 600284 591533 584252
58020 584252 577108 569983 563402 557105 550567 544031 537808 531532 525161 519568 515097 510808 506239 502492
58006 502492 500313 498626 496403 494567 494431 495457 496171 496181 495820 494948 493666 493152 494252 496242 498280 500785
57990 500785 503871 505796 504900 502139 499793 498460 497063 495027 492588 489552 485521 481006 476859 472977
57976 472977 468898 465127 462525 460915 459535 458279 457230 455719 453217 450583 449062 448517 447929 447123 446746
57961 446746 447050 447854 449154 450649 451235 450089 447715 444961 441821 438259 435220 433479 432331 430787 429283
57946 429283 428783 429015 429198 429867 432338 436739 442081 447926 454582 461997 469856 478486 488397 499144 509799
57931 509799 520227 530766 541003 549911 556835 561457 563436 563087 561684 559870 556520 550435 542316 533699
57917E33699q984j0134j0956j0559r859r632r031p474o122n978o130n384m152
57904D29304l365k955k636k786l285k975j548n47j093k053j856p91p5J33L48M58
57888D04278K82M52J402K420K810L069L706M017L259K098J504J166K78q93j501
57873D28347j611j951k627l097l075k803k761l468m900n920n308l592k563k702
57859C81969k577j365j25K46N93J742K854K985K863L494M184L665K253J194O18
57844D04593k21j248j671j466j403j787k298k844l583m244m291l667k849k310
57830C70711k228k291j737k52J172J311O67R38K344L208K833K823M405O247O454
57815C96605N345M505M183L411J891J31j802m121o334p674q142q109p369n713
$$ plain form
57917 533699 524715 514581 503625 493066 483207 473575 464544 457070 450948 444970 438840 433456 429304
57904 429304 425939 422984 420348 417562 414277 411302 409754 409207 408114 406061 404205 403414 403339 403472 403820 404278
57888 404278 404560 405012 406414 408834 411644 414713 418419 422436 425695 427793 429297 430463 430741 429848 428347
57873 428347 426736 424785 422158 419061 415986 413183 410422 406954 402054 396134 390826 387234 384671 381969
57859 381969 379392 378027 377902 378148 378741 380483 383337 386322 389185 392679 396863 400528 402781 403975 404593
57844 404593 404372 403124 401453 399987 398584 396797 394499 391655 388072 383828 379537 375870 373021 370711
57830 370711 368483 366192 364455 364203 365375 366686 367353 368291 370635 373843 376676 379499 383904 390151 396605
57815 396605 401950 406455 410638 414049 415940 416071 414269 410148 403814 396140 387998 379889 372520 366807
57801C66807l828k615k024j534j162j103r79m87j38m42r27r35o95p21p89m96j06
57784C47826Q5N08J536K696L580M644O090P020O823O417O740P015O027M283L215
57769D14505K865K159J018L65K21m10j700k588k556k483l239m388m758l769j976
57754C93266o00m16r00q57r8L58R7J65J267K261J788M58m3N70J053O23l65j486
57736C97141k669l584l784l404k961k570k189k185k752l253l032k416j971j413
57722C58958l63M89K46o53j074r47j029j332j208p54o88r44p54j15J57j85o12
57705C49192r70j615k396k606k145j626j294q48k54J77N12J046J537J534J226
57690C41470J026N79o37k051k547k076j484r18K00J761K968L813N149P188R306
$$ plain form
57801 366807 362979 360364 358340 356806 355644 354541 353562 353075 352937 352495 351568 350633 349938 349217 348428 347932 347826
57784 347826 347911 348419 349955 352651 356231 360875 366965 373985 380808 387225 393965 400980 407007 411290 414505
57769 414505 417370 419529 420547 420912 421133 420723 419023 416435 413879 411396 408157 403769 399011 395242 393266
57754 393266 392666 392250 391350 390493 390395 390753 390850 391015 392282 394543 396331 396789 396746 397316 398369 398992 398627 397141
57736 397141 394472 390888 387104 383700 380739 378169 375980 373795 371043 367790 364758 362342 360371 358958
57722 358958 358595 359084 359330 358677 357603 356656 355627 354295 353087 352333 351645 350701 349947 349832 349989 349804 349192
57705 349192 348222 346607 344211 341605 339460 337834 336540 335692 335438 335615 336127 337173 338710 340244 341470
57690 341470 342496 343075 342438 340387 337840 335764 334280 333362 333562 335323 338291 342104 347253 354441 363747
57675C63747J1452J4345J8066K1838K5537K9955L5148L9920M3571M6688M9240
57664F99507M8967M2794K9540J0888r574k7831m0893m7863m9663m7690m3082l6993
57652E28107l0630k4735j9553j5389j2430j0158p850n706m558m361m065l137k171
57639C83364j686j345p45n6N72J377K287K690K337J750J373J008M16k56r53j852
57623C90281k689k748j896q88l10OK01o1p56j107o48j4Rl88m77o9M03N52L16j27
57603C79590l44N0Q50J370J302R92O89J96n27j018j048j030j328j671j685j509
57587C74879j388j138n82j08k07o71p71j76O74J148J069Q00P29P68M94j35n36
57570C74849l20K7k57j062j542j244n25J34N98Q20P35M94L94M99P64J365K339
$$ plain form
57675 363747 375199 389544 407610 429448 454985 484940 520088 560008 603579 650267 699507
57664 699507 748474 791268 820808 831696 822122 794291 753398 705535 655872 608182 565100 528107
57652 528107 497477 472742 453189 437800 425370 415212 407362 401656 397098 392737 388672 385535 383364
57639 383364 381678 380333 379588 379532 380104 381481 383768 386458 388795 390545 391918 392926 393342 393086 392133 390281
57623 390281 387592 384844 382948 382060 381750 381756 381957 381896 381140 380033 379385 379371 379380 378992 378515 378446 378849 379401 379717 379590
57603 379590 379246 379296 380146 381516 382818 383810 384499 384695 384168 383150 382102 381072 379744 378073 376388 374879
57587 374879 373491 372353 371771 371663 371456 370785 370014 369838 370512 371660 372729 373529 374258 375026 375520 375385 374849
57570 374849 374529 374556 374299 373237 371695 370451 369926 370060 370658 371478 372213 372707 373101 373600 374364 375729 378068
57553C78068L127L158K772K805L339L687L503L061K497J737J149J233J557J173
57539D12866L28M40J993L624M028L580L257L008K295J434J183J421J385J037J108
57524D42987J770K193J740R71R57J916K955L163K698K438K647K581J699P34Q05
57509D72254J816K581K480K033J802J606J227R88J147J351J203R09R04J239J691
57494D95231K098K314K210J936J829J936K091K456L368M543N194N190N304N942
57480E41642O383N869M780M027L730L210K099Q54K19M77J215J733J792J939K742
57465E82711L862M412M207L959M122M341M246M059M043M067M124M561N293N435
57451F43442M373K738J689J653K310L369M595N420N300M567M208M660N206M844
$$ plain form
57553 378068 381195 384353 387125 389930 393269 396956 400459 403520 406017 407754 408903 410136 411693 412866
57539 412866 413194 413634 415627 419251 423279 426859 430116 433124 435419 436853 438036 439457 440842 441879 442987
57524 442987 444757 446950 448690 449661 450618 452534 455489 458652 461350 463788 466435 469016 470715 471449 472254
57509 472254 474070 476651 479131 481164 482966 484572 485799 486787 487934 489285 490488 491397 492301 493540 495231
57494 495231 497329 499643 501853 503789 505618 507554 509645 512101 515469 520012 525206 530396 535700 541642
57480 541642 548025 553894 558674 562701 566431 569641 571740 572594 572813 573290 574505 576238 578030 579969 582711
57465 582711 586573 590985 595192 599151 603273 607614 611860 615919 619962 624029 628153 632714 638007 643442
57451 643442 647815 650553 652242 653895 656205 659574 664169 669589 674889 679456 683664 688324 693530 698374
57437F98374L560K412K380L354M478N295O047O784O910O079M980M545M787N074
57423G65059N235N488N686N566N561O295P370P729P232O722O482N821M532L551
57409H48329L706M708N850O849P599P847P581P058O296N252M569N063O366P186
57395I34259P118O967P052O785O290O799Q536R803R326Q209Q196R157R746R692
57381A047935R857J0533J1080J1040J0535R761Q929Q394Q148P667O821O346O675
57368A163721P163P206P290P981Q775R088R459J0519J1573J1597J1007J0939J1263
57355A287581J0931R968R554J0136J0922J1336J1633J1898J1684J0915J0231J0135
57343A416924J0526J1117J1640J1724J1322J1059J1418J1954J2068J2130J2716
$$ plain form
57437 698374 701934 704346 706726 710080 714558 719853 725900 732684 739594 745673 750653 755198 759985 765059
57423 765059 770294 775782 781468 787034 792595 798890 806260 813989 821221 827943 834425 840246 844778 848329
57409 848329 852035 856743 862593 869442 877041 884888 892469 899527 905823 911075 915644 920707 927073 934259
57395 934259 941377 948344 955396 962181 968471 975270 983806 993609 1002935 1011144 1019340 1028497 1038243 1047935
57381 1047935 1057792 1068325 1079405 1090445 1100980 1110741 1119670 1128064 1136212 1143879 1150700 1157046 1163721
57368 1163721 1170884 1178090 1185380 1193361 1202136 1211224 1220683 1231202 1242775 1254372 1265379 1276318 1287581
57355 1287581 1298512 1308480 1318034 1328170 1339092 1350428 1362061 1373959 1385643 1396558 1406789 1416924
57343 1416924 1427450 1438567 1450207 1461931 1473253 1484312 1495730 1507684 1519752 1531882 1544598
57332A544598J3302J2954J2050J1831J2510J3192J3576J4190J4929J5002J4539
57321A692673J4647J5452J5677J4728J3687J3549J3867J3990J4252J4906J5168
57310A852596J4496J3851J4339J5452J5909J5666J5749J6462J7070J7089J6793
57299B025472J6391J5795J5287J5474J6337J7057J7099J6799J6670J6702J6718
57288B205801J6881J7354J7858J8006J7919J8017J8288J8247J7702J7178J7306
57277B400557J8089J9046J9875K0587K1103K1225K1087K1232K1936K2770K3092
57266B630599K2789K2308K2111K2258K2434K2273K1825K1709K2507K4021K5452
57255B880286K6369K6979K7439K7574K7508K7856K8735K9267K8686K7444K6555
$$ plain form
57332 1544598 1557900 1570854 1582904 1594735 1607245 1620437 1634013 1648203 1663132 1678134 1692673
57321 1692673 1707320 1722772 1738449 1753177 1766864 1780413 1794280 1808270 1822522 1837428 1852596
57310 1852596 1867092 1880943 1895282 1910734 1926643 1942309 1958058 1974520 1991590 2008679 2025472
57299 2025472 2041863 2057658 2072945 2088419 2104756 2121813 2138912 2155711 2172381 2189083 2205801
57288 2205801 2222682 2240036 2257894 2275900 2293819 2311836 2330124 2348371 2366073 2383251 2400557
57277 2400557 2418646 2437692 2457567 2478154 2499257 2520482 2541569 2562801 2584737 2607507 2630599
57266 2630599 2653388 2675696 2697807 2720065 2742499 2764772 2786597 2808306 2830813 2854834 2880286
57255 2880286 2906655 2933634 2961073 2988647 3016155 3044011 3072746 3102013 3130699 3158143 3184698
57244C184698K6250K6039K5742K5651K5822K5926K5804K5566K5248K4844K4585
57233C466175K4640K4691K4317K3640K3095K2790K2603K2664K3060K3348K3071
57222C724094K2560K2459K2629K2350K1529K0858K0637K0342J9547J8597J8086
57211C953688J8172J8696J9465K0224K0723K0987K1165K1185K0959K0905K1667
57200D177836K3198K4607K5048K4444K3283K2054K0955J9811J8306J6535J5138
57189D411215J4554J4408J4062J3566J3463J3862J4343J4627J4716J4573J4252
57178D567641J4215J4771J5385J5291J4666J4397J4676J4796J4394J4061J4374
57167D728667J5036J5321J4815J3538J1858J0395R576R127Q508P690P009O350
$$ plain form
57244 3184698 3210948 3236987 3262729 3288380 3314202 3340128 3365932 3391498 3416746 3441590 3466175
57233 3466175 3490815 3515506 3539823 3563463 3586558 3609348 3631951 3654615 3677675 3701023 3724094
57222 3724094 3746654 3769113 3791742 3814092 3835621 3856479 3877116 3897458 3917005 3935602 3953688
57211 3953688 3971860 3990556 4010021 4030245 4050968 4071955 4093120 4114305 4135264 4156169 4177836
57200 4177836 4201034 4225641 4250689 4275133 4298416 4320470 4341425 4361236 4379542 4396077 4411215
57189 4411215 4425769 4440177 4454239 4467805 4481268 4495130 4509473 4524100 4538816 4553389 4567641
57178 4567641 4581856 4596627 4612012 4627303 4641969 4656366 4671042 4685838 4700232 4714293 4728667
57167 4728667 4743703 4759024 4773839 4787377 4799235 4809630 4819206 4828333 4836841 4844531 4851540 4857890
57155D857890N288M048L441L627L714K962J684N89j77j019k343m327o837r471
57141D859069j2003j4826j8485k2830k7142l1071l4711l7786l9584l9853l9063
57130D541715l7581l5364l2629l0032k7789k5330k2295j9309j7179j5772j4165
57119D264270j1734q699n729l142m82L102P990J3801K0194K7504L6245M6367N7685
57106D447372P0636Q6059J04714J27844J57841J97331K47875L10465L86905M79592
57096F616634N90093P18923Q66069J030041J206034J385950J560060J717810J848361
57087A7539975J943174J998961K017227K001531J956088J883215J774978J605975
57079C2721124J342418R67972N03624Q31m84989r15561j272619j551019j753644
$$ plain form
57155 4857890 4863178 4867226 4870667 4874294 4878008 4880970 4882654 4883243 4883066 4882047 4879704 4875377 4868540 4859069
57141 4859069 4847066 4832240 4813755 4790925 4763783 4732712 4698001 4660215 4620631 4580778 4541715
57130 4541715 4504134 4468770 4436141 4406109 4378320 4352990 4330695 4311386 4294207 4278435 4264270
57119 4264270 4252536 4243837 4238108 4234966 4234484 4237586 4245576 4259377 4279571 4307075 4343320 4389687 4447372
57106 4447372 4518008 4604067 4708781 4836625 4994466 5191797 5439672 5750137 6137042 6616634
57096 6616634 7206727 7925650 8791719 9821760 11027794 12413744 13973804 15691614 17539975
57087 17539975 19483149 21482110 23499337 25500868 27456956 29340171 31115149 32721124
57079 32721124 34063542 35031514 35535138 35535969 35050980 34135419 32862800 31311781 29558137
57070B9558137j888972j967470j997702j985324j934701j850701j739516j608715
57062A4585036j466506j320431j176580j039663r13190p99403o99269o12609n38199
57053F019186m74237m19159l71957l31594k96692k66194k39725k16785j96213
57044C206630j77210j60316j46421j35143j25070j15352j06155r7686q9616q1572
57034A972089p3451o5150n6421m7018l6734k5454j3455j225J1048K2688L0479
57023A717396K8682J3291j3322m3041o7591q3054q9676q9291q3838p5336o5803
57012A148417n6758m8904m2278l6642l1918k8181k5307k2887k0735j9039j7768
57001G98000j6431j4928j3985j4119j4651j4527j3696j2799j1899j0546q875p496
$$ plain form
57070 29558137 27669165 25701695 23703993 21718669 19783968 17933267 16193751 14585036
57062 14585036 13118530 11798099 10621519 9581856 8668666 7869263 7169994 6557385 6019186
57053 6019186 5544949 5125790 4753833 4422239 4125547 3859353 3619628 3402843 3206630
57044 3206630 3029420 2869104 2722683 2587540 2462470 2347118 2240963 2143277 2053661 1972089
57034 1972089 1898638 1833488 1777067 1730049 1693315 1667861 1654406 1653181 1664229 1686917 1717396
57023 1717396 1746078 1759369 1746047 1703006 1635415 1552361 1462685 1373394 1289556 1214220 1148417
57012 1148417 1091659 1042755 1000477 963835 931917 903736 878429 855542 834807 815768 798000
57001 798000 781569 766641 752656 738537 723886 709359 695663 682864 670965 660419 651544 644048
56989F44048o356m788k777j131j15J016K646L815L230P28k799o464r874j2898
56975F08281j5387j7105j7733j7111j5537j3604j1689r756p675n420k965l26K302
56962D76275M691O832Q799J0550J2111J3709J5221J5643J3676Q926K269m846j1118
56949E72738j5688j8308j9288j8938j7209j4277j1069q554o618m374j497J529
56937D38447M479P804J1635J5156J7577J9224K1005K2896K3434K0827J4413N150
56925F22047n035j4275k1341k5726k7583k7595k6437k4237k0904j6976j3586j1323
56913C87029r708q177o935o342o069n600n126n088n186m689l530k291j212m8J161
56898C18189J998K497L294M794O725Q634J0306J1677J2854J4225J6069J7996J9283
$$ plain form
56989 644048 637692 632904 630127 628996 628881 629897 632543 636358 639588 640316 637517 631053 621179 608281
56975 608281 592894 575789 558056 540945 525408 511804 500115 490359 482684 477264 474299 473973 476275
56962 476275 480966 487798 496597 507147 519258 532967 548188 563831 577507 586433 588702 583856 572738
56949 572738 557050 538742 519454 500516 483307 469030 457961 449407 442789 438415 436918 438447
56937 438447 442926 450730 462365 477521 495098 514322 535327 558223 581657 602484 616897 622047
56925 622047 617012 602737 581396 555670 528087 500492 474055 449818 428914 411938 398352 387029
56913 387029 377321 369144 362209 355867 349798 344198 339072 333984 328798 324109 320579 318288 317076 317028 318189
56898 318189 320187 322684 325978 330772 337497 346131 356437 368114 380968 395193 411262 429258 448541
56885D48541J9592J8852J6596J2238O093m83o134j0209j2605j3614j3933j4043
56873D50891j3418j1026o737j757K596O030R199J3029J8128K4222L0066L4465
56861E55688L7470L9987M2143M2710M0154L3557K2591P732q897k3768l3886l8413
56849G17068l8323l5057k9888k3920j7842j1645m920K601J0900J9766K8867L7859
56837F55466M6500N4541O1565O7124P0854P1917O8451N8210M0200J5764j1619
56826A198973l7352n7160o8771p2653p0920o5478n7522m8230l8820k9755k0666
56815F31646j1326k046O957J5777K4147L1323L7032M1909M6446M9774M9737M3909
56803I65285L0828J1198j1543l2533m8053n7045o0380n9417n5414m9540m2715
$$ plain form
56885 448541 468133 486985 503581 515819 521912 521429 515295 505086 492481 478867 464934 450891
56873 450891 437473 426447 419710 417953 420549 426579 435778 448807 466935 491157 521223 555688
56861 555688 593158 633145 675288 717998 758152 791709 814300 822032 813135 789367 755481 717068
56849 717068 678745 643688 613800 589880 572038 560393 555473 558074 568974 588740 617607 655466
56837 655466 701966 756507 818072 885196 956050 1027967 1096418 1154628 1194828 1210592 1198973
56826 1198973 1161621 1104461 1035690 963037 892117 826639 769117 720887 682067 652312 631646
56815 631646 620320 618274 625231 641008 665155 696478 733510 775419 821865 871639 921376 965285
56803 965285 996113 1007311 995768 963235 915182 858137 797757 738340 682926 633386 590671
56792E90671l5491k8237k1197j4361p749j767L158P288J1316J5413J9169K2393
56780E60606K5013K5999K3439J6333N769o033j7273k6818l3791l7676l8604l7117
56768D59847l3892k9886k6194k3263k0619j7681j4616j2113j0639j0062r766q959
56756B42157p347n525m343l904l696l564l732l925l404k135j028p10q71j074j374
56741A95525j678j439n47K35L17N0n1j98p43j323j247l64Q44J663J444K12q25
56724A91875k83J533K750K338J293P95M82l94j320j344p42m53m48o5M46K70l66
56707A96367l21O23J351J101L70r8k82m23m56l19k18k61k81k28l06n35o57n39
56689A94888l48k39k32l61n77n90j80L56M72M0o25j279j856k224k278k210k202
$$ plain form
56792 590671 555180 526943 505746 491385 483636 481869 485027 492315 503631 519044 538213 560606
56780 560606 585619 611618 635057 651390 657159 651126 633853 607035 573244 535568 496964 459847
56768 459847 425955 396069 369875 346612 325993 308312 293696 281583 270944 260882 251116 242157
56756 242157 234810 229285 224942 221038 217342 213778 210046 206121 202717 200582 199554 198844 197973 196899 195525
56741 195525 193847 192408 191861 192096 192413 192463 192412 192214 191471 190148 188901 188537 189381 191044 192488 192700 191875
56724 191875 191592 193125 195875 198213 199506 200301 200783 200389 199069 197725 196983 196530 196082 196017 196463 196733 196367
56707 196367 196046 196669 198020 199121 199491 199393 199111 198688 198232 197913 197695 197434 197153 196925 196619 196084 195427 194888
56689 194888 194540 194301 194069 193708 193131 192541 192361 192717 193189 193229 192604 191325 189469 187245 184967 182757 180555
56672A80555k031j450q53r31j658k177j791o69N34J353J731J887K101K395K474
56657A81470K164J778J737J949J947J577J196J153J389J612J620J368R27L95j67
56642B02115o85r58q05m18k63n30q36p36k34L25P05Q93R27P72K74p09j894k551
56624A95392k323j901k196k959l062k185j259r72q62m09m9l08p43o64l36n60j351
56607A73253j908j729j058m13j26k53n03n04k75j38l3M09R37P90K7j97N88J266
56589A70133Q56J58M92J634K316K221K091K193K023J464J051J017J062J067J197
56574A90975J374J439J688K370K922K610J832J779K918M588O069P183P973Q641
56560B44361R706J1377J2915J3469J3285J3156J2859J1272Q070M278J069j107
$$ plain form
56672 180555 178524 177074 176221 175290 173632 171455 169664 168995 169529 170882 172613 174500 176601 178996 181470
56657 181470 183634 185412 187149 189098 191045 192622 193818 194971 196360 197972 199592 200960 201887 202282 202115
56642 202115 201430 200472 199667 199249 198986 198456 197620 196884 196650 196975 197680 198573 199500 200272 200546 199837 197943 195392
56624 195392 193069 191168 188972 186013 182951 180766 179507 178535 177673 177264 177215 176907 176164 175500 175164 174604 173253
56607 173253 171345 169616 168558 168145 168019 167766 167263 166759 166484 166346 166313 166722 167659 168449 168476 168279 168867 170133
56589 170133 170989 171147 171639 173273 175589 177810 179901 182094 184117 185581 186632 187649 188711 189778 190975
56574 190975 192349 193788 195476 197846 200768 203378 205210 206989 209907 214495 220564 227747 235720 244361
56560 244361 254067 265444 278359 291828 305113 318269 331128 342400 350470 354748 355817 354710
56548C54710k188k268j834j479j269j002r13j408k281l048l747m593n167n053
56534C18460m885n544o591o844o330o218o778o980o336n631n440n298m813m330
56520B36442m019l499k807k589k891k935k511k362k686k662k017j662k005k042
56506A99755j058N8L07J51L40L21o89j873j717l18O90M66j70k15K65P03Q97R35
56488A98848P93M27L6k2M25J060J238P07K7q4L02N84P31J193J725J340j43j455
56470B07732j448m95L21O45P62P34N03M28Q68J499J669J238N07k95r33r33j14
56453B12688R10J365J264J141J154R93N93L19M21O88O92K39m14o98k95L79N54
56436B21993P0m71n40k80o8J4O0J61M69R61J099L45q49j274m94N99J086J079J085
$$ plain form
56548 354710 352522 350254 348420 346941 345672 344670 343757 342349 340068 337020 333273 328680 323513 318460
56534 318460 313575 308031 301440 294596 288266 282048 275270 268290 261954 256323 250883 245585 240772 236442
56520 236442 232423 228924 226117 223528 220637 217702 215191 212829 210143 207481 205464 203802 201797 199755
56506 199755 198697 198755 199062 199213 199553 199874 199185 197312 195595 195277 195967 196433 196263 196048 196313 197016 197913 198848
56488 198848 199641 200068 200104 200082 200507 201567 202805 203512 203539 203455 203757 204341 205072 206265 207990 209330 209187 207732
56470 207732 206284 205789 206110 206755 207517 208251 208754 209182 210050 211549 213218 214456 214963 214668 213735 212802 212688
56453 212688 213598 214963 216227 217368 218522 219515 220108 220427 220848 221536 222228 222467 222053 221355 221060 221439 221993
56436 221993 222063 221592 221052 220772 220704 220718 220778 220939 221408 222369 223468 223813 222964 221690 221196 221795 222881 223960 225045
56417B25045J032O32O8l14m94m93n9Q19J559J731J594J474J137L44m78p68n88
56400B32241k54K63R62J291Q01n3m16j42K40M03M18L19P2r7L7K82L05K38N19J208
56380B38637J853K015J594Q53K53J29L09L08P3J12O63J220J251R20O77N29J83
56363B51579l18o10m07K90J203J799J757J509J848K713L097K542K022K662M104
56348B75790M917M345K960J717R88O05L62L19O88J388J866J684J245J385K180
56333C02439K771K594K205K438L279L959L871L079K188J876K226K512K029J069
56319C38535N27O57R14J001J137J239Q41M7l86k55j63l39k19L27N45J74J70J195
56301C45947K397K643K184K146K893L799M218M010L424K924K818K804K483K319
$$ plain form
56417 225045 226077 226709 226777 226463 225969 225476 225417 226236 227795 229526 231120 232594 233731 234075 233597 232829 232241
56400 232241 231987 232250 233212 234503 235304 235251 234835 234693 234933 235336 235754 236073 236145 236048 236085 236367 236672 236910 237429 238637
56380 238637 240490 242505 244099 244952 245205 245334 245643 245951 246024 246136 246799 248019 249270 250190 250867 251396 251579
56363 251579 251261 250651 250244 250534 251737 253536 255293 256802 258650 261363 264460 267002 269024 271686 275790
56348 275790 280707 285052 288012 289729 290717 291322 291684 292003 292691 294079 295945 297629 298874 300259 302439
56333 302439 305210 307804 310009 312447 315726 319685 323556 326635 328823 330699 332925 335437 337466 338535
56319 338535 339062 339719 340633 341634 342771 344010 344851 344898 344512 344257 344094 343755 343536 343863 344408 344582 344752 345947
56301 345947 348344 350987 353171 355317 358210 362009 366227 370237 373661 376585 379403 382207 384690 387009
56287C87009L160M656N419N097M930N705O607O904P319Q536R698R693R010Q892
56273D82635R520J0274J1054J2072J2974J3425J3970J5211J6725J7852J8914K0560
56261F55186K2578K4484K6615K9524L2964L6568M0824M6220N2203N8181O4847
56250A090194P3063Q2123R0566R8218J05991J14074J21659J28049J32789J35074
56240B171800J34378J31270J26366J18875J07477R2235P4456N5020L4100J2130
56230C058107j0155l2265n3354p1735q6242r7584j06981j14092j17778j18350
56220B249571j17362j15529j12463j08217j03401r7926r1197q3618p6476p0343
56210A273039o4824n9804n5605n2023m8400m4550m0623l6428l2008k8320k6025
$$ plain form
56287 387009 390169 394825 400244 405341 410271 415976 422583 429487 436806 445342 455040 464733 473743 482635
56273 482635 492155 502429 513483 525555 538529 551954 565924 581135 597860 615712 634626 655186
56261 655186 677764 702248 728863 758387 791351 827919 868743 914963 967166 1025347 1090194
56250 1090194 1163257 1245380 1335946 1434164 1540155 1654229 1775888 1903937 2036726 2171800
56240 2171800 2306178 2437448 2563814 2682689 2790166 2882401 2956857 3011877 3045977 3058107
56230 3058107 3047952 3015687 2962333 2890598 2804356 2706772 2599791 2485699 2367921 2249571
56220 2249571 2132209 2016680 1904217 1796000 1692599 1594673 1503476 1419858 1343382 1273039
56210 1273039 1208215 1148411 1092806 1040783 992383 947833 907210 870782 838774 810454 784429
56199G84429k4192k1607j8726j6804j5642j4033j1907j0246r177q003o865o490
56187F20737o490n738m335l341k772j709k97L50K11L08O89M70j20J01R40R09m9
56170E99864j88J172K552K767K481K538K667K715L414M974O359O828O928P298
56156F52369P813Q449R660J1352J2784J3943J5702J8239K0748K3042K6023L0138
56144H50262L4891M0277M7188N5825O5113P4119Q2687R0315R5834R8632R8801
56133A633944R5847Q8831P8248O6364N5275M5934L9117L5481L4037L2135K7688
56122B232901K0448J1128P35r092j6828k2575k7683l3007l8900m6507n6898o8816
56110A944906p9229q6283q9912q9803q5171p6821o7183n7742m8418l9594l2527
$$ plain form
56199 784429 760237 738630 719904 703100 687458 673425 661518 651272 642095 634092 627227 620737
56187 620737 614247 608509 604174 600833 598061 596352 596055 596405 596616 596924 597613 598083 597963 598064 599004 599913 599864
56170 599864 599676 600848 603400 606167 608648 611186 613853 616568 619982 624956 631315 638143 645071 652369
56156 652369 660182 668631 678291 689643 702427 716370 732072 750311 771059 794101 820124 850262
56144 850262 885153 925430 972618 1028443 1093556 1167675 1250362 1340677 1436511 1535143 1633944
56133 1633944 1729791 1818622 1896870 1963234 2018509 2064443 2103560 2139041 2173078 2205213 2232901
56122 2232901 2253349 2264477 2265212 2256120 2239292 2216717 2189034 2156027 2117127 2070620 2013722 1944906
56110 1944906 1865677 1779394 1689482 1599679 1514508 1437687 1370504 1312762 1264344 1224750 1192223
56099A192223k7270k2485j7778j4161j1849r768p580n918m411j920R38K149J706
56086A073876J954L910N860O483O656P300P889Q187R042J0504J1339J1239J1229
56073A175468J1473J1065J0434J1206J3193J4335J4131J4220J5091J5471J5549
56062A321636J7208K0178K1657K0903K0569K2125K3649K3627K3269K3391K2688
56051A560900K0908K0133K0994K1190J9668J8727J9919K1556K2314K3620K6214
56040A796143K8070K8097K8274K9796L0888L0817L2067L5832L9298M0360M1126
56029B160768M3764M6715M8172M9546N2201N4448N5048N6006N8678O0835O0916
56018B747097O1374O4438O8388P1392P4908P9930Q4035Q5935Q8572R3942R9346
$$ plain form
56099 1192223 1164953 1142468 1124690 1110529 1098680 1088912 1081332 1075414 1071003 1069083 1070021 1072170 1073876
56086 1073876 1075830 1079740 1085600 1092083 1098739 1106039 1113928 1122115 1131157 1141661 1153000 1164239 1175468
56073 1175468 1186941 1198006 1208440 1219646 1232839 1247174 1261305 1275525 1290616 1306087 1321636
56062 1321636 1338844 1359022 1380679 1401582 1422151 1444276 1467925 1491552 1514821 1538212 1560900
56051 1560900 1581808 1601941 1622935 1644125 1663793 1682520 1702439 1723995 1746309 1769929 1796143
56040 1796143 1824213 1852310 1880584 1910380 1941268 1972085 2004152 2039984 2079282 2119642 2160768
56029 2160768 2204532 2251247 2299419 2348965 2401166 2455614 2510662 2566668 2625346 2686181 2747097
56018 2747097 2808471 2872909 2941297 3012689 3087597 3167527 3251562 3337497 3426069 3520011 3619357
56007C619357J02631J06417J12815J18911J22189J25551J32057J39453J45019
55998D724400J51001J59929J69449J77282J86304J99005K12095K22585K33963
55989F436013K50085K68298K85196L03626L27039L52508L76687M03025M35510
55980I437987M71154N06515N45579N92836O45109O99077P60267Q35115R21195
55971A5414834J015199J123193J252536J401839J570606J770364K014103K304387
55963B7867061K646014L060927L576202M209564M985139N953140P175700Q705090
55955F8178837J0590835J2879292J5561952J8525949K1584744K4556059K7301477
55948A99179145K9724251L1730744L3052898L2931419L0041287K3108513J1997283
$$ plain form
56007 3619357 3721988 3828405 3941220 4060131 4182320 4307871 4439928 4579381 4724400
55998 4724400 4875401 5035330 5204779 5382061 5568365 5767370 5979465 6202050 6436013
55989 6436013 6686098 6954396 7239592 7543218 7870257 8222765 8599452 9002477 9437987
55980 9437987 9909141 10415656 10961235 11554071 12199180 12898257 13658524 14493639 15414834
55971 15414834 16430033 17553226 18805762 20207601 21778207 23548571 25562674 27867061
55963 27867061 30513075 33574002 37150204 41359768 46344907 52298047 59473747 68178837
55955 68178837 78769672 91648964 107210916 125736865 147321609 171877668 199179145
55948 199179145 228903396 260634140 293687038 326618457 356659744 379768257 391765540
55941C91765540j689977j5204997k6020958l2862616l5779750l5589427l3319778
55934B11298037k9910545k6082652k2298836j8812390j5750271j3155302j0999046
55927G4288995r216978p751351o556367n581184m775038m105400l553251l095457
55919B9653969k707163k375546k095739j857255j647410j463183j306859j173577
55911A5027237j054523r48276q57899p80384p09322o44737n90460n44660n02016
55902H394960m62437m28990l99887l70910l43177l20434l00972k80012k58032
55893E230109k39249k23683k07825j91569j77679j65762j53121j40307j29902
55884C601012j21112j11276j01367r4567r0710q7399q5112q5853q8006q7754q4738
$$ plain form
55941 391765540 390075563 374870566 348849608 315986992 280207242 244617815 211298037
55934 211298037 181387492 155304840 133006004 114193614 98443343 85288041 74288995
55927 74288995 65072017 57320666 50764299 45183115 40408077 36302677 32749426 29653969
55919 29653969 26946806 24571260 22475521 20618266 18970856 17507673 16200814 15027237
55911 15027237 13972714 13024438 12166539 11386155 10676833 10032096 9441636 8896976 8394960
55902 8394960 7932523 7503533 7103646 6732736 6389559 6069125 5768153 5488141 5230109
55893 5230109 4990860 4767177 4559352 4367783 4190104 4024342 3871221 3730914 3601012
55884 3601012 3479900 3368624 3267257 3172690 3081980 2994581 2909469 2823616 2735610 2647856 2563118
55873B563118q1589p8980p5749p2688p1600p1473o9875o7083o4820o2266n7528
55862A789467n1765m7568m4487m0336l5767l3310l2899l2410l1729l2259l3370
55851A373567l3214l2252l2203l2471l1293k9376k8633k8418k6862k4901k4883
55840A049061k6100k5761k3749k2391k2026k0838j8736j7453j6939j5435j3029
55829H26604j1554j1058r866q155p882r068r611r017r059j0395j1593j1904j2152
55816F95290j2571j2402j1772j1510j1192r883q413q237q452o935m138k567k567
55803E84651j925J56J894K182K000K084J949J738K386L399L043J241j98n59r20
55788F03121j537j309l65m75k010l114k792k522l856o516r727j3348j6665j8039
$$ plain form
55873 2563118 2481529 2402549 2326800 2254112 2182512 2111039 2041164 1974081 1909261 1846995 1789467
55862 1789467 1737702 1690134 1645647 1605311 1569544 1536234 1503335 1470925 1439196 1406937 1373567
55851 1373567 1340353 1308101 1275898 1243427 1212134 1182758 1154125 1125707 1098845 1073944 1049061
55840 1049061 1022961 997200 973451 951060 929034 908196 889460 872007 855068 839633 826604
55829 826604 815050 803992 794126 785971 778089 769021 759410 750393 741334 730939 719346 707442 695290
55816 695290 682719 670317 658545 647035 635843 625960 617547 609310 600858 593923 589785 587218 584651
55803 584651 582726 582882 584776 586958 588958 591042 592991 594729 597115 600514 603557 604798 604600 604041 603121
55788 603121 601584 600275 599910 599435 597425 594311 591519 588997 585141 578625 568898 555550 538885 520846
55774E20846j6794j4038j0950p803m961l077j770l4J623J257j582m880o769p424
55760D43644p745p853p670p487p208o329n141m619m727m426l633l657n031o503
55746C61615o840o326n817n494n161m760m113l068k038j561j356q47m05q27j810
55731C11192k280k107k076k400k704l155m111m870m514l720l918m895n151m402
55717B60889l724l335k463j352j103j344m42J641L116L368L784M922N343M230
55703B73530K860K284J608j79k476m411o133p632p958o827n526n008m612l702
55689B25818k985k976k704j329K36P70O30R24J748K457K859L030K755K125J819
55674B35177J990J745N58p96j444j561j588j362r19r76j705k050j249o0M73N39
$$ plain form
55774 520846 504052 490014 479064 471261 466300 463223 461453 461419 463042 464299 462717 457837 451068 443644
55760 443644 435899 428046 420376 412889 405681 399352 394211 389592 384865 380439 376806 373149 368118 361615
55746 361615 354775 348449 342632 337138 331977 327217 323104 320036 317998 316437 315081 314234 313829 313002 311192
55731 311192 308912 306805 304729 302329 299625 296470 292359 287489 282975 279255 275337 270442 265291 260889
55717 260889 257165 253830 251367 250015 248912 247568 247126 248767 251883 255251 259035 263957 269300 273530
55703 273530 276390 278674 280282 280103 277627 273216 267083 259451 251493 244666 239140 234132 229520 225818
55689 225818 222833 219857 217153 215824 216060 216830 217460 218384 220132 222589 225448 228478 231233 233358 235177
55674 235177 237167 238912 239470 238674 237230 235669 234081 232719 231800 230824 229119 227069 225820 225760 226233 226772
55658B26772Q77J455J883K243K635K595J919J375J657K249K183J342K96n98j277
55643B47606j715k067k554k892k617k174k673m224n620o129o362o746o576n391
55629A89866m077l600l696l712l649l496k659j131j72o36j571j657j128j001j206
55614A56475r44l31k93j042j813k031j869j730j828k124k215j678q30n15q37r85
55598A35410p13q73j809k393j633k35N31O09O13M37k63q72n39L33N79Rn46o32
55580A28013m79j66M35J067J392J766K756M014M538M038L229K824K926L252L333
55565A62938K656J206l14j334k115l038l709l583l046k914l157l075k560k285
55551A35670k605l101l284l084k542j616l79R73K244L160L402L171L311M335N572
$$ plain form
55658 226772 227649 229104 230987 233230 235865 238460 240379 241754 243411 245660 247843 249185 249481 248883 247606
55643 247606 245891 243824 241270 238378 235761 233587 230914 226690 221070 214941 208579 201833 195257 189866
55629 189866 185789 182189 178493 174781 171132 167636 164977 163846 163674 163038 161467 159810 158682 157681 156475
55614 156475 155531 155200 154907 153865 152052 150021 148152 146422 144594 142470 140255 138577 137747 137232 136395 135410
55598 135410 134697 133824 132015 129622 127989 127754 128285 128894 129507 129944 129681 128809 128270 128603 129182 129191 128645 128013
55580 128013 127534 127368 127803 128870 130262 132028 134784 138798 143336 147374 150603 153427 156353 159605 162938
55565 162938 165594 166800 166486 165152 163037 159999 156290 152707 149661 146747 143590 140515 137955 135670
55551 135670 133065 129964 126680 123596 121054 119438 119059 120032 122276 125436 128838 132009 135320 139655 145227
55536A45227N859M885L333J959J087P81Q18O70J4p97j261j504k018k737l042k640
55520A50634j980j718k104k864l504l699l535l218k621j525l17R6n85j567j986
55505A19507j938k009k237k090j323l53J61n0o57j058j093j198j558j504m45Q63
55489A03018J041O1o99m88n9j28k52P9L65K3n52p08n35l39Q0P95J199R60P41J097
55469A05699J437J039L41P6r8r00j877j936j098n24q56j638k187k123j174N05
55453I4686J900K019J160N13N61O91L33l33q80j096q95l34K40N10N24M19L3o35
55435I9416j041p76k75k45n93o72k78J92L85K33j65m16J6J009J625J323P35O12
55417A01085O47L01Q3Q25K095K599K002J172O98K43m59j058j279j430j891k617
$$ plain form
55536 145227 151086 155971 159304 161263 162350 163131 163949 164619 164633 163836 162575 161071 159053 156316 153274 150634
55520 150634 148654 146936 144832 141968 138464 134765 131230 128012 125391 123866 123549 123645 123060 121493 119507
55505 119507 117569 115560 113323 111233 109910 109557 109718 109668 109011 107953 106860 105662 104104 102600 102155 103018
55489 103018 104059 104120 103421 102933 102874 102746 102494 102573 102938 102961 102409 101701 101166 100827 100907 101702 102901 103861 104602 105699
55469 105699 107136 108175 108516 108592 108494 107594 105717 103781 102683 102159 101303 99665 97478 95355 94181 94686
55453 94686 96586 98605 99765 100278 100839 101530 101863 101530 100650 99554 98659 98325 98565 99075 99599 100018 100051 99416
55435 99416 98375 97599 97324 97079 96486 95814 95536 95728 96113 96346 96181 95765 95781 96790 98415 99738 100473 101085
55417 101085 101732 102033 102116 102941 105036 107635 109637 110809 111507 111750 111291 110233 108954 107524 105633 103016
55401A03016l216l156k074m17N83K46n88o69p3K9p91j675j714r36O1O85N57j67
55383H9701o29m5J315K415K614K056J146K68j60lK77K30R5K88N07P9r54j837k065
55364I5298j723j114o16o80j230j464q49kJ96o3L2N16O95L96J57K82N55Q27J109
55345I2322J240J150J174J360R75l41j496j184J77J044R11N41K39m59j346j406
55329I4901n24Q9k68p16k47Q16J439J230N32j71n46n08l52l95m66l03j68m26o83
55310I3234k63N73Q77L98k14n38p12p12l50J5j19l55J56J238J897J929J963J958
55292A00975J228R3j86M75O47j81o48J92J217J052J80j43J25K64L18O92Q94R6
55274A07290j365k244k010j234n67j96j37l45n70o16o01n74k38M66R79Q51M49
$$ plain form
55401 103016 99800 96644 94570 94153 94736 94982 94394 93725 93652 93681 92890 91215 89501 88565 88626 89311 89868 89701
55383 89701 89072 89027 90342 92757 95371 97427 98573 98841 98681 98678 98955 99185 99280 99568 100075 100154 99200 97363 95298
55364 95298 93575 92461 91845 91165 89935 88471 87622 87620 87816 87753 87785 88301 88996 89392 89549 89831 90386 91213 92322
55345 92322 93562 94712 95886 97246 98221 97880 96384 95200 95377 96421 97332 97873 98112 97653 96307 94901
55329 94901 94377 94466 94198 93482 93235 94051 95490 96720 97252 97081 96535 96027 95675 95280 94814 94511 94343 93917 93234
55310 93234 92971 93544 94421 94819 94605 94067 93355 92643 92293 92308 92189 91834 91990 93228 95125 97054 99017 100975
55292 100975 102203 102296 102110 102585 103232 103051 102403 102595 103812 104864 105044 104901 105026 105290 105608 106300 107194 107290
55274 107290 105925 103681 101671 100437 99870 99674 99537 99192 98622 98006 97405 96831 96593 97059 98038 98889 99338
55257I9338L85O07O89O38P72J005Q59K25l92m41nK14l83j475j978j378m93l46
55239I7841o14j78R76J575R23j89p77p83n27j29J1p08j876k014n49J100J319L97
55221I5798j65K19Q30R42N40L1r6M48J270J439O79j31j77J67R9l00l56M5M34O17
55201A02333P69Q81P58M39J12k18n49o41l69j8J72L18M45K40k92m97L1P37R01
55182A05552O29M80N40N60N74P48R24Q96P51M90k36j399k188j944j143p19q02
55165A03713q01l95K48R00J331J264Q63Q20J367J667R01m97j437j536j184o83
55149A06541k22k30q47j351j021k86j01n01p52o34n08l04L21Q85M41p30j053K07
55131I9855J845K273J345M2q74j168p70N4M91jq08q11J20R56R47N65O43J083J087
$$ plain form
55257 99338 99723 100330 101019 101657 102429 103434 104293 104518 104126 103685 103680 103894 103511 102036 100058 98680 98187 97841
55239 97841 97227 97049 98025 99600 100523 100334 99557 98774 98247 98118 98129 97421 95545 93531 92982 94082 95401 95798
55221 95798 95633 95852 96682 97624 98164 98195 98099 98547 99817 101256 101935 101804 101627 101794 101893 101593 101237 101282 101716 102333
55201 102333 103102 103983 104741 105180 105292 105074 104525 103884 103515 103497 103669 103987 104432 104672 104380 103883 103914 104651 105552
55182 105552 106181 106661 107201 107761 108335 109083 110007 110903 111654 112144 111908 110509 108321 106377 105234 104515 103713
55165 103713 102912 102517 102765 103665 104996 106260 107123 107943 109310 110977 111878 111381 109944 108408 107224 106541
55149 106541 106319 106089 105242 103891 102870 102584 102483 101982 101230 100596 100088 99784 100105 100990 101431 100701 99648 99855
55131 99855 101700 103973 105318 105360 104486 103318 102548 102602 103093 103092 102284 101473 101593 102549 103496 104061 104704 105787 106874
55112A06874M56j38k37k48n49o91j03Q03J166R48Q60J128J293J189J101R16J91
55095A14959p42q73r0M46N8m66k66L62Q67J485K349K585J559J48m26l91q05j657
55077A19102k014j624j044m30M54J154Q64j45p36o29o87j223j319l73Q24J212
55061A13386Q43M54K93J08j76l56m09n67r21j214j037k77O32J019O55K1k77j09
55043A12068K35L99Q9p51j644j848j198k66N04J177J600J191l7j047j120q51r82
55026A07519j046k55R60J471J092N03Nn38p79k21O55Q31K31k74k97k11j56J23
55008A09613L92R2n72o93j8P79J162J170Q27J91j13M87J359J387P67P41J511J898
54990A20980J342O79M73J34p01j262j015o39q20j117r17n06l77l58k06j64k08
$$ plain form
55112 106874 107330 107192 106955 106707 106158 105467 105364 106167 107333 108281 109141 110269 111562 112751 113852 114768 114959
55095 114959 114217 113344 113254 113700 113758 113292 113026 113388 114255 115740 118089 120674 122233 122381 121955 121564 120759 119102
55077 119102 117088 115464 114420 113990 114444 115598 116462 116317 115581 114952 114265 113042 111723 111350 112174 113386
55061 113386 114229 114683 114976 115084 114908 114552 114143 113576 112655 111441 110404 110127 110759 111778 112433 112454 112177 112068
55043 112068 112303 112702 112791 112040 110396 108548 107350 107084 107588 108765 110365 111556 111519 110472 109352 108501 107519
55026 107519 106473 106218 107178 108649 109741 110244 110249 109711 108932 108711 109366 110197 110428 110154 109857 109646 109490 109613
55008 109613 110005 110097 109525 108832 108814 109593 110755 111925 112752 112943 112830 113317 114676 116063 116830 117571 119082 120980
54990 120980 122322 123001 123474 123608 122907 121645 120630 119991 119171 118054 117137 116631 116254 115896 115690 115526 115318
54973A15318L82J725K615J998M73o75j138j335j221m82N43J192J426J576J559
54958A23956J184P84P06N37k43j231j614j351r41l79O57J760K014J213K5j000
54942A26077j712j806r56L66J067P06j08o88r35q93m73Q2J42m72j089j002k60
54925A18046O51J542K449L190L491L439L431L723M254M904N563N943N669M755
54911A71050L797L352L188K479Q35j176k769l813m678n415n673n306m643m020
54897A47208l496l106k924k814k520k060j632j065PJ264J667P94m06o88J0P53
54881A30992R53Q34Q24J050J489K102K735L247L748M356M767M517L754L243L390
54866A72001L620L074J702J92j013k157l446m470m706m385m225m385m273l543
$$ plain form
54973 115318 115700 117425 120040 122038 122511 121836 120698 119363 118142 117660 118203 119395 120821 122397 123956
54958 123956 125140 125924 126630 127167 126924 125693 124079 122728 121787 121408 122065 123825 125839 127052 127077 126077
54942 126077 124365 122559 121603 121969 123036 123742 123634 122946 122011 121118 120645 120727 120869 120397 119308 118306 118046
54925 118046 118697 120239 122688 125878 129369 132808 136239 139962 144216 149120 154683 160626 166295 171050
54911 171050 174847 178199 181387 183866 184701 183525 180756 176943 172265 166850 161177 155871 151228 147208
54897 147208 143712 140606 137682 134868 132348 130288 128656 127591 127598 128862 130529 131323 130917 130229 130239 130992
54881 130992 131945 132779 133603 134653 136142 138244 140979 144226 147974 152330 157097 161614 165368 168611 172001
54866 172001 175621 178695 180397 180589 179576 177419 173973 169503 164797 160412 156187 151802 147529 143986
54852A43986k670k212k021j710j401j470j785j875j601j133m32M95J054O04n05
54837A27324j197j108r29j121j184n83K47M45j81j015j343r08q4L82R7m65n75
54820A17802l42n27j191j393n68N85J124J057R78J043J072J160J467J641J170
54805A25078K14m87n05j15J64P3k56m18q3N95J060R93O16K15k16o81q82o34k27
54786A24504l3jJ40M15N98N39K07k39l48K85J339J855J352N02K96R26J845K517
54768A36699K723K479K158K398L410M602N302N575N862O127N919N125M162L426
54754A95967K876K143Q01j295l674n487o274o241n661m484k971k020k210k893
54740A58577l005k496k167k276k201j608j063j148j577j646j147m87o5P7J89N74
$$ plain form
54852 143986 141316 139104 137083 135373 133972 132502 130717 128842 127241 126108 125676 126171 127225 127829 127324
54837 127324 126127 125019 124090 122969 121785 121202 121449 121894 121713 120698 119355 118447 118363 118745 118842 118377 117802
54820 117802 117460 116933 115742 114349 113781 114366 115490 116547 117525 118568 119640 120800 122267 123908 125078
54805 125078 125292 124805 124300 124185 124349 124422 124166 123748 123665 124260 125320 126313 126929 127144 126928 126247 125365 124731 124504
54786 124504 124471 124470 124610 125025 125623 126162 126369 126130 125782 126067 127406 129261 130613 131115 131411 132337 134182 136699
54768 136699 139422 141901 144059 146457 149867 154469 159771 165346 171208 177335 183254 188379 192541 195967
54754 195967 198843 200986 201787 200492 196818 191331 185057 178816 173155 168671 165700 163680 161470 158577
54740 158577 155572 153076 150909 148633 146432 144824 143761 142613 141036 139390 138243 137756 137691 137768 137957 138531
54724A38531J291K012K229J867J550J984L106M037M080L561L387L775L925L069
54710A78404J464r4j354k633l930m723m676l998l013j949j201j151j543j640j241
54695A46722r61j264j820k118k094j838j279o15m67j096j845j949j427q12l53
54680A26784j2J72J78K21L47K16l47q93r10m92o8K15M05M54L47K40Q0m34j132
54661A25371j231m44L86L79j42k67J36M87N39N36M80Q3n85j075j147q80l60K42
54643A22508M98K64J37P42J772K364K255J862J327L15j144k295k365j366m9O75
54627A27500L81n14j117r62m34q0J1k2j59k64j3M97O75L75K58O04O61m0n70P4
54607A26861J204J354N18N3N32J105J051O37K39j77m12M8J005J429Q09j59o37
$$ plain form
54724 138531 139822 141834 144063 145930 147480 149464 152570 156607 160687 164248 167635 171410 175335 178404
54710 178404 179868 179774 178420 175787 171857 167134 162458 158460 155447 153498 152297 151146 149603 147963 146722
54695 146722 145761 144497 142677 140559 138465 136627 135348 134733 134266 133170 131325 129376 127949 127137 126784
54680 126784 126772 126944 127122 127343 127690 127906 127559 126666 125756 125264 125196 125411 125816 126270 126617 126857 126937 126503 125371
54661 125371 124140 123696 124082 124461 124319 124052 124188 124675 125214 125750 126230 126313 125728 124653 123506 122626 122266 122508
54643 122508 123006 123270 123407 124149 125921 128285 130540 132402 133729 134044 132900 130605 128240 126874 126825 127500
54627 127500 127881 127367 126250 125288 124854 124774 124785 124763 124604 124340 124327 124824 125499 125874 126132 126736 127397 127357 126787 126861
54607 126861 128065 129419 129937 129990 130522 131627 132678 133315 133554 133377 132965 133013 134018 135447 136256 136097 135460
54590A35460o63p26r54j154j146p70qP67J059Q70O10M03J13j16J9K84J62k62m12
54571A33536k43l13p61j033q05l70L4N12R34Q79L72k1oJ90M13O92P29J95m16k30
54551A34288O32J122R17P97J117J198O72J89J47o2o90p71L74J769K101J595J365
54534A46760J554J449R87Q35J022P63k08j111j157m91J36K00k53p49q01l86J03
54517A48653M94R82J453J182j46j609k000j390r55j324j835j594o72J44L28P0
54501A41781j00O8L68M11M1n49r87r54m07K39L39k34p22l33O60J227R42M00K37
54482A42427L72M39M13M90P65J187J488J145J5j075j104k64L04K82N83J644K485
54465A51596K191J287P35N11J21j79R2N12K80m64q80p41m96k39L19R75J151Q64
$$ plain form
54590 135460 134797 134071 133117 131963 130817 130047 130039 130806 131865 132735 133345 133748 133861 133745 133764 134048 134210 133948 133536
54571 133536 133293 132980 132219 131186 130381 130011 130045 130557 131491 132370 132742 132721 132715 132905 133318 134010 134739 134934 134518 134288
54551 134288 134920 136042 136959 137756 138873 140071 140743 140932 141079 141017 140327 139556 139930 141699 143800 145395 146760
54534 146760 148314 149763 150750 151585 152607 153370 153162 152051 150894 150403 150539 150739 150486 149737 148936 148550 148653
54517 148653 149147 150129 151582 152764 152618 151009 149009 147619 146664 145340 143505 141911 141239 141383 141711 141781
54501 141781 141681 141749 142117 142528 142569 142020 141033 140079 139672 139911 140250 140016 139294 138961 139621 140848 141790 142190 142427
54482 142427 142799 143238 143651 144141 144906 146093 147581 148726 148741 147666 146562 146298 146602 146884 147467 149111 151596
54465 151596 153787 155074 155809 156320 156441 156262 156354 156866 157146 156682 155802 155061 154565 154326 154645 155620 156771 157635
54447A57635O33M72r6r67j400j247j208j594j724j026N3P85J145J431J438P74
54431A55104k97j013j022o43k31K12O86R01N95J0k61J41J001J753J897J245O4
54414A60142r09r27j7Q75Q61J07m99n18k85j37j6J13O1q7R9O42R13N92L17P74
54394A62101J612J934J579J189J148J103O75N8k89k22J5N5l25j075j852k152j617
54377A63937m18O71Q38J49m23k00L56N20N70J233K107J943O92j23L96J196R83
54360A74427J95J25Q49J309J018N00K40K24L76O44P65O87R70J938K818K682J922
54343A91689J737K277K464J663M24n93j402k073k318k083j802j671j428j140j411
54328A84333k365l148k993k246j774j784j737j157j47P38Q93K47m74m40J60K20
$$ plain form
54447 157635 158268 158740 158644 157677 156277 155030 153822 152228 150504 149478 149531 150316 151461 152892 154330 155104
54431 155104 154807 153794 152772 152129 151898 152110 152796 153697 154292 154302 154041 154182 155183 156936 158833 160078 160142
54414 160142 159233 158306 158289 159164 160025 160132 159633 159115 158830 158693 158677 158790 158851 158764 158863 159505 160418 161010 161327 162101
54394 162101 163713 165647 167226 168415 169563 170666 171341 171399 171110 170888 170903 170958 170633 169558 167706 165554 163937
54377 163937 163519 164190 165028 165177 164754 164554 164910 165430 166000 167233 169340 171283 171975 171852 172248 173444 174427
54360 174427 174622 174747 175596 176905 177923 178423 178663 178887 179263 179907 180672 181359 182329 184267 187085 189767 191689
54343 191689 193426 195703 198167 199830 200254 199661 198259 196186 193868 191785 189983 188312 186884 185744 184333
54328 184333 181968 178820 175827 173581 171807 170023 168286 167129 166982 167720 168613 168860 168386 167946 168106 168326
54312A68326p95j984k058q72N12J015M35o67j555j811j521r83l57K95O60L60m76
54295A58524j186j380j316j330j229o19M22J366J777J575Q86l9q25j146r44l71
54279A54165L90J171J749J880J477P89L32M61R11R40J97p40j004n00L7Q2n1J83
54261A62469O98R65Q16O75Q78J149R64L63PK94P53O57R8r3M47J063R29O1r52j683
54241A70558j958j590p08n7l22j175j631j304p80o09n84k36L78P63N91%o03q36
54223A59897n99j81p0n06j170j311m10J166K214J863O13k17j33P1l08q04o34P7
54205A59558O61R86J342J596J362P80L05j67j001j793j623n02M38M47K9q0Kk30
54187A62110p32j017q78n57m01n62q56q55l64J77J84j96k34L16Q37P55K68o6l5
$$ plain form
54312 168326 167531 165547 163489 162617 163129 164144 164579 163912 162357 160546 159025 158042 157685 157980 158640 159000 158524
54295 158524 157338 155958 154642 153312 152083 151464 151886 153252 155029 156604 157490 157451 156626 155480 154536 154165
54279 154165 154555 155726 157475 159355 160832 161621 161953 162414 163325 164265 164462 163722 162718 162218 162255 162337 162286 162469
54261 162469 163167 164132 164948 165623 166501 167650 168614 168977 168984 169278 170031 170688 170786 170693 171140 172203 173132 173193 172241 170558
54241 170558 168600 167010 166302 166245 165923 164748 163117 161813 161033 160424 159840 159604 159982 160745 161336 161336 160733 159897
54223 159897 159298 159117 159047 158541 157371 156060 155650 156816 159030 160893 161506 161289 161156 161227 160919 160115 159481 159558
54205 159558 160219 161205 162547 164143 165505 166285 166590 166423 165422 163629 162006 161504 161942 162389 162418 162338 162340 162110
54187 162110 161378 160361 159483 158926 158525 157963 157107 156252 155888 156065 156249 156053 155819 156135 156972 157727 157995 157929 157894
54168A57894K16M35L48j38o40o34k08o9o32j457j818j450n59M25J046J127J062
54151A54948J342J730J454L58p24r83n42o5J31J63J78J33j39p18j281j170j86
54134A54629Q99J252J183J587K330K261R89m30r88q97p83o73m27k34m1O54J712
54117A63023J978R30j75J42J462K130J568O76J93j04m98p36o61n44n77n97m80
54100A67730k79N8N53Q51N84N5m5L97Q48R96J051J114R40M64Rk52m98p57p30l41
54080A72748pn8k18P5R81K030K519K125J315R36J244J577J315P97P38J114J327
54063A90558J243J264J398J271J078J559K737L711M050M461N457O352O444O342
54049B37925O937P577O623L727L84j901k967l294l047k383j799j399m73J395L283
$$ plain form
54168 157894 158110 158545 158893 158755 158115 157481 157273 157204 156572 155115 153297 151847 151288 151713 152759 153886 154948
54151 154948 156290 158020 159474 159832 159108 158125 157583 157518 157649 157812 157990 158123 157984 157266 155985 154815 154629
54134 154629 155528 156780 157963 159550 161880 164141 165130 164700 163712 162815 162032 161359 160932 160698 160657 161311 163023
54117 163023 165001 165931 165756 165898 167360 169490 171058 171734 171927 171823 171325 170589 169928 169384 168807 168210 167730
54100 167730 167451 167509 168062 168913 169497 169552 169507 169904 170752 171748 172799 173913 174853 175317 175326 175074 174576 173819 173089 172748
54080 172748 172741 172683 172465 172540 173521 175551 178070 180195 181510 182446 183690 185267 186582 187379 188117 189231 190558
54063 190558 191801 193065 194463 195734 196812 198371 201108 204819 208869 213330 218787 225139 231583 237925
54049 237925 244862 252439 259062 262789 263173 261272 258305 255011 251964 249581 247782 246383 245910 247305 250588
54034B50588L859L178K592K915L520L544L112K893L052L204L069K643J910R75
54020B91054L02L01P02P58J41p59j400j645j684j813k342l370m557n333n425m994
54004B59936m323l730l633m204m896m886m038l014k234j456o02k94r36j826j924
53989B17940j262q48j211j786j835j385r44p62o98n82l42J13Q15J454J474O59
53973B10800m09q03k88L31K02m93q09l45K95L92l7m61n09j09O21J348J674J612
53955B13012J636J979K308K419K808L964N400O048N655N108N309O207P095P446
53941B76394P195O476N383L997K469J104K52L0J96L74M27M91P03J018J232J196
53925C08937J050J232K056L206L931L901L637L894M835O001O938P578Q076Q503
$$ plain form
54034 250588 254447 257625 260217 263132 266652 270196 273308 276201 279253 282457 285526 288169 290079 291054
54020 291054 291356 291657 292359 293117 293258 292499 291099 289454 287770 285957 283615 280245 275688 270355 264930 259936
54004 259936 255613 251883 248250 244046 239150 234264 230226 227212 224978 223522 222920 222626 221690 219864 217940
53989 217940 216678 215830 214619 212833 210998 209613 208669 207907 207209 206627 206285 206398 207213 208667 210141 210800
53973 210800 210391 209588 209300 209631 209833 209340 208531 208186 208481 208873 208836 208375 207866 207757 208378 209726 211400 213012
53955 213012 214648 216627 218935 221354 224162 228126 233526 239574 245229 250337 255646 261853 268948 276394
53941 276394 283589 290065 295448 299445 301914 303018 303270 303300 303496 303870 304297 304788 305491 306509 307741 308937
53925 308937 309987 311219 313275 316481 320412 324313 327950 331844 336679 342680 349618 357196 365272 373775
53911C73775Q748Q698Q463Q296Q189P772O965O515P228Q786J0059J0648J1141
53898D85283J1481J0105N622j203q128j3648j7622k0140k0913k0005j8159j6094
53886C76579j4066j2301j1181j0687j0158r035p466n918m577l482k956l394m606
53873B76752n700n833n011m050l571l282k550j557j283k090l062l237k891k892
53859B29743l211l016k113j278j083j170j045q16p96q72p33l99j59j98m44o20
53843B11790m16J78O93O63K03j87l00k97k05K2P9l34p79m15P07J570J657J652
53825B16281K165K596K048P80r3MP16J498J977J741O22p44j285o52M74J307J719
53808B31154J954K106K169K318K796L561M286M638M560M311M219M339M410M260
$$ plain form
53911 373775 382523 391221 399684 407980 416169 423941 430906 437421 444649 453435 463494 474142 485283
53898 485283 496764 506869 512491 511288 503160 489512 471890 451750 430837 410832 392673 376579
53886 376579 362513 350212 339031 328344 318186 309151 301685 295767 291190 287708 284752 281358 276752
53873 276752 271052 265219 260208 256158 252587 249305 246755 245198 243915 241825 238763 235526 232635 229743
53859 229743 226532 223516 221403 220125 219042 217872 216827 216011 215215 214343 213610 213211 213052 212854 212410 211790
53843 211790 211374 211552 212245 212908 213111 212924 212624 212327 212122 212144 212223 211889 211110 210695 211402 212972 214629 216281
53825 216281 218446 221042 223090 223870 223777 223781 224497 225995 227972 229713 230335 229591 228306 227654 228128 229435 231154
53808 231154 233108 235214 237383 239701 242497 246058 250344 254982 259542 263853 268072 272411 276821 281081
53794B81081M049L928L638K846J824J346J769K523K755K186J173J39p08j295j614
53779C05640j758j849j933k127k730l898n245o084o113n641n113m692m400m301
53765B49756m250l825k851j792j241j166j084p76m35j91j4j19q51j994k741k632
53749B23794k068j648j438j234j039q42l46N06J079P68k6k83K70Q48P70L48L18
53732B19777Q39J388J465J105P00M99L86J98J73Q09K093L168L107J958P16K81
53716B38662O49J143J247J137J406K271L139L247K637K079J980J979J788J750
53702B65114K100K322J989J626J942K631K900K857L264M045M220L491K719K508
53688C03728K376J822J196Q22K59p59j412r01N6N0r58j595j135m50n34j023r76
$$ plain form
53794 281081 285130 289058 292696 295542 297366 298712 300481 303004 305759 307945 309118 309257 308549 307254 305640
53779 305640 303882 302033 300100 297973 295243 291345 286100 280016 273903 268262 263149 258457 254057 249756
53765 249756 245506 241681 238830 237038 235797 234631 233547 232771 232336 232145 232131 232012 231161 229167 226426 223794
53749 223794 221726 220078 218640 217406 216367 215525 215179 215685 216764 217532 217506 217223 217493 218341 219111 219459 219777
53732 219777 220616 222004 223469 224574 225274 225773 226159 226357 226530 227339 229432 232600 235707 237665 238381 238662
53716 238662 239311 240454 241701 242838 244244 246515 249654 252901 255538 257617 259597 261576 263364 265114
53702 265114 267214 269536 271525 273151 275093 277724 280624 283481 286745 290790 295010 298501 301220 303728
53688 303728 306104 307926 309122 309944 310203 309444 308032 307131 307187 307237 306279 304684 303549 303099 302565 301542 300566
53671C00566m60l83r64j311q01r3k31j150j810j661j244j180j322j228r60q49
53655B84919q88r03r75j094p20N39K006K501J877J179J163J444J360R39O11N48
53639B94506P36J228J855K117J835J550J798K295K260J466M47j62j71K70R32J646
53623C14608K320K900L299L473L554L733L999M198M341M592M915N046M841M434
53609C70253M005L691L700M070M337L927K972K247K192K532K920L337L602L281
53595D17066K472K045K493L067K738J611O49L04J76j38o30j375k627m158n110
53580D18583m974m326m104m346m167l053j712j255j786k324k158j647j431j446
53566C79854j261r06o72l83K72R35J044R61J540K471K357R09k60J94J465J951
$$ plain form
53671 300566 300106 299723 298759 297448 296647 296554 296323 295173 293363 291702 290458 289278 287956 286728 285768 284919
53655 284919 284031 283128 282153 281059 280339 280878 282884 285385 287262 288441 289604 291048 292408 293347 293958 294506
53639 294506 295242 296470 298325 300442 302277 303827 305625 307920 310180 311646 312093 311931 311760 312030 312962 314608
53623 314608 316928 319828 323127 326600 330154 333887 337886 342084 346425 351017 355932 360978 365819 370253
53609 370253 374258 377949 381649 385719 390056 393983 396955 399202 401394 403926 406846 410183 413785 417066
53595 417066 419538 421583 424076 427143 429881 431492 432141 432445 432621 432483 431853 430478 427851 423693 418583
53580 418583 413609 409283 405179 400833 396666 393613 391901 390646 388860 386536 384378 382731 381300 379854
53566 379854 378593 377687 377015 376632 376904 377839 378883 379844 381384 383855 386212 387121 386861 387055 388520 390471
53550C90471J544J336J694K030K190K658L333L411K801K526L283M468N223N682
53536D32650O539P851Q966R454R513R527R664R995J0661J1669J2631J2936J2439
53523E64495J1858J2246J3899J6013J7537J8178J8443J8966K0043K1531K2875
53512G56084K3484K3379K3349K4114K5465K6567K6946K6840K6643K6460K6201
53501A035532K5789K5239K4678K4254K3904K3346K2502K1708K1228K0809K0108
53490A289097J9354J9084J9322J9458J9098J8571J8454J8784J8985J8527J7550
53479A496284J6709J6288J5631J3727J0461O860L983K001M70r95k783n382q785
53466A564469j2072j4202j5140j5750j6718j8005j9160j9660j9246j8337j7968
$$ plain form
53550 390471 392015 393351 395045 397075 399265 401923 405256 408667 411468 413994 417277 421745 426968 432650
53536 432650 439189 447040 456006 465460 474973 484500 494164 504159 514820 526489 539120 552056 564495
53523 564495 576353 588599 602498 618511 636048 654226 672669 691635 711678 733209 756084
53512 756084 779568 802947 826296 850410 875875 902442 929388 956228 982871 1009331 1035532
53501 1035532 1061321 1086560 1111238 1135492 1159396 1182742 1205244 1226952 1248180 1268989 1289097
53490 1289097 1308451 1327535 1346857 1366315 1385413 1403984 1422438 1441222 1460207 1478734 1496284
53479 1496284 1512993 1529281 1544912 1558639 1569100 1575960 1579943 1581944 1582414 1581419 1578636 1573254 1564469
53466 1564469 1552397 1538195 1523055 1507305 1490587 1472582 1453422 1433762 1414516 1396179 1378211
53455A378211j8784k0332k1855k3328k4946k5991k5399k3435k1676k0965k0367
53444A131133j8689j6218j4132j2813j1551r701p377n011k846j009L00R18R47
53431A033951P80R29J794L469N675P881R566J0582J1354J2536J4372J6517J8633
53418A148039K0771K2915K4528K5142K5268K6059K7987L0373L2418L4136L6010
53407A453646L8136M0243M2337M4792M7644N0235N1843N2639N3619N5432N7557
53396A988123N8967N9421N9625O0174O0885O1347O1522O1439O0827N9440N7477
53385B649247N5215N2608M9576M6310M2884L9052L4876L0991K7595K3740J8447
53374C070541J2147O103O82m850j0952j7280k3599l0279l7569m5052n1937n7385
$$ plain form
53455 1378211 1359427 1339095 1317240 1293912 1268966 1242975 1217576 1194141 1172465 1151500 1131133
53444 1131133 1112444 1096226 1082094 1069281 1057730 1048029 1040652 1035641 1032795 1031786 1032086 1033004 1033951
53431 1033951 1034731 1035660 1037454 1040923 1046598 1054479 1064045 1074627 1085981 1098517 1112889 1129406 1148039
53418 1148039 1168810 1191725 1216253 1241395 1266663 1292722 1320709 1351082 1383500 1417636 1453646
53407 1453646 1491782 1532025 1574362 1619154 1666798 1717033 1768876 1821515 1875134 1930566 1988123
53396 1988123 2047090 2106511 2166136 2226310 2287195 2348542 2410064 2471503 2532330 2591770 2649247
53385 2649247 2704462 2757070 2806646 2852956 2895840 2934892 2969768 3000759 3028354 3052094 3070541
53374 3070541 3082688 3088791 3089473 3084623 3073671 3056391 3032792 3002513 2964944 2919892 2867955 2810570
53362B810570o0584o1382o0837o0427o0521o0361n9456n8073n6359n4026n1268
53351B167276m8969m7593m6729m6098m6050m6537m6599m5566m3994m2572m0898
53340A665671l8250l4964l2092l0020k8291k6560k4855k3021k0692j7924j5338
53329A373664j3527j2699j2743j3336j4005j4466j4734j4768j4229j2909j1162
53318A225086r621q603p952p231n967m068k103o64N90K538N073O887P311P515
53304A208791Q979J1521J3760J5114J6216J7633J9236K0864K2693K4732K6665
53293A406204K8308K9724L0761L1118L0860L0448L0088K9481K8172K5853K2518
53282A723535J8745J5561J3373J1258Q025L751m98m252p942j1601j4479j6291
$$ plain form
53362 2810570 2749986 2688604 2627767 2567340 2506819 2446458 2387002 2328929 2272570 2218544 2167276
53351 2167276 2118307 2070714 2023985 1977887 1931837 1885300 1838701 1793135 1749141 1706569 1665671
53340 1665671 1627421 1592457 1560365 1530345 1502054 1475494 1450639 1427618 1406926 1389002 1373664
53329 1373664 1360137 1347438 1334695 1321359 1307354 1292888 1278154 1263386 1249157 1236248 1225086
53318 1225086 1215465 1206862 1198910 1191679 1185712 1181644 1179541 1178877 1179467 1182005 1187078 1193965 1201276 1208791
53304 1208791 1217770 1229291 1243051 1258165 1274381 1292014 1311250 1332114 1354807 1379539 1406204
53293 1406204 1434512 1464236 1494997 1526115 1556975 1587423 1617511 1646992 1675164 1701017 1723535
53282 1723535 1742280 1757841 1771214 1782472 1790497 1794248 1793750 1789498 1781556 1769955 1755476 1739185
53270A739185j7861j9953k2288k4307k6122k7943k9247k9467k9132k9404l0573
53259A452888l1786l2281l2160l1898l1650l1328l0850l0119k9127k8234k7973
53248A115482k8339k8593k8110k7154k6459k6266k6155k5754k5076k4117k2667
53237H26792k0786j9042j7801j6620j4856j2712j1004r946q889p541o727p390
53225F73478r262j1125j2138j2397j2365j2440j2981j4140j5437j6052j5722j5012
53213E14407j4491j3982j2893j1078r087p672p180p367p602p381o770o254o176
53200C96474o410o695p019p478p857p654o658n325m411m216m345m258l962l895
53186C16291m224m531m333l710l114k748k378j805j170p83p56r98j331j550j450
$$ plain form
53270 1739185 1721324 1701371 1679083 1654776 1628654 1600711 1571464 1541997 1512865 1483461 1452888
53259 1452888 1421102 1388821 1356661 1324763 1293113 1261785 1230935 1200816 1171689 1143455 1115482
53248 1115482 1087143 1058550 1030440 1003286 976827 950561 924406 898652 873576 849459 826792
53237 826792 806006 786964 769163 752543 737687 724975 713971 704025 695136 687595 680868 673478
53225 673478 664216 653091 640953 628556 616191 603751 590770 576630 561193 545141 529419 514407
53213 514407 499916 485934 473041 461963 452876 445204 438024 430657 423055 415674 408904 402650 396474
53200 396474 390064 383369 376350 368872 361015 353361 346703 341378 336967 332751 328406 324148 320186 316291
53186 316291 312067 307536 303203 299493 296379 293631 291253 289448 288278 287495 286739 285741 284410 282860 281410
53171B81410r97m86l61q03j498j891j711j153n53l7M00N93K93m77j353j941k046
53154B67389j644r35l95l96o84o95m50o24j415j951j378j15O92P11O25Q35Q44
53137B60414J98o86j080q68m52j29k2k92q86j207o90L04P27J91m17l3J180K065
53119B58317J902J146O34O04P69R76J280J536J401Q44K56j06m44r85j534j741
53103B64855j623j499j472j325r18m67k68k91k36M0K06k13j178j955j802q34O5
53086B51085K03k91q07r24n96j2M42L64j86n18k4J005J593J186K43m02n03m98
53068B51360p66j086r79m20L4j25p85j409j601j271m93M82J140J069M35k23o70
53051B44692j042j224p66L80J532K027J943J733J533J150N12k95j154j777j742
$$ plain form
53171 281410 280413 279927 279566 278763 277265 275374 273663 272510 271957 271920 272320 272913 273206 272729 271376 269435 267389
53154 267389 265745 264810 264415 264019 263335 262640 262190 261566 260151 258200 256822 256707 257399 258110 258735 259570 260414
53137 260414 260612 259926 258846 257978 257526 257397 257375 257083 256197 254990 254300 254604 255331 255522 255105 255072 256252 258317
53119 258317 260219 261365 261999 262603 263372 264348 265628 267164 268565 269409 269665 269559 269115 268130 266596 264855
53103 264855 263232 261733 260261 258936 258018 257551 257283 256992 256756 256796 257002 256789 255611 253656 251854 251020 251085
53086 251085 251288 250997 250190 249266 248670 248658 249100 249464 249278 248760 248736 249741 251334 252520 252763 252361 251858 251360
53068 251360 250594 249508 248529 248109 248143 248018 247233 245824 244223 242952 242459 242941 244081 245150 245585 245362 244692
53051 244692 243650 242426 241660 242040 243572 245599 247542 249275 250808 251958 252470 252175 251021 249244 247502
53036B47502j019k12J07N0K2O8J2j3K43O25Q01Q24R08Q56K93n57j014q66o01o16
53016B47413p35o35k55L60J112J608J324K85p65j083o09J57O22L96m68j317j301
52999B46109j51J498K656K651J472j90j254j080p4Q08J180J410J766J992J834
52984B60627J471J156R46R70J418J955J757O04n72p74j56M31P69J330K177K642
52968B76751K348J865J955K533K838K419J557Q06M03K06Nk85o00q41j018j365
52952B89577k123l093l567l033j910j164j139j199q33n37j069k150k675k181j418
52937B61486j250j519j407n58M95R64N89j56n73m87m02q06j495j846j659j262
52921B50114q52k32O13J165R12L9o98p28j61L78L97P9M0M58P28L60j73n9N58P19
$$ plain form
53036 247502 246483 246271 246378 246428 246450 246518 246530 246517 246760 247385 248186 249010 249918 250774 251067 250510 249496 248630 248029 247413
53016 247413 246678 246043 245788 246148 247260 248868 250192 250477 249712 248629 248020 248177 248799 249195 248727 247410 246109
52999 246109 245958 247456 250112 252763 254235 254045 252791 251711 251637 252445 253625 255035 256801 258793 260627
52984 260627 262098 263254 264200 265170 266588 268543 270300 270904 270332 269558 269402 269833 270602 271932 274109 276751
52968 276751 279099 280964 282919 285452 288290 290709 292266 293072 293475 293681 293686 293401 292801 291960 290942 289577
52952 289577 287454 284361 280794 277761 275851 274687 273548 272349 271516 270979 269910 267760 265085 262904 261486
52937 261486 260236 258717 257310 256752 257247 258211 258800 258644 258071 257584 257182 256376 254881 253035 251376 250114
52921 250114 249262 249030 249643 250808 251720 251759 251061 250333 250172 250550 250947 251026 251066 251524 252252 252612 252439 252380 252938 253657
52901B53657J03n01m04O2K13m4l92o93q43n49K11Q86R73O85N61P32R61J053Q76
52882B57547K68n62r63o98m18q02j489j567q18J43P95J051R11M87L16R04J922
52865B57027K526K441K125J749R14m45j582j813j306o14M2N98P29J96o24j065
52849B60898r68p61q49j275j932k760l603m117l960l144k047j122n27j66j2k20
52833B33435p36j113r84n76l53k80J19R82J851K253K114J491M23p79j555j632
52817B34660j222n53L26J037R01m2o16J60J663K422K057J579J735J987J494M00
52801B47988m54o50m78l90o21j263k220l110l488l238k593j842j208q68q14p85
52785B23966n71l18k40j25M69J517K393K542J943Q43n47j835k386j902q45J13
$$ plain form
52901 253657 253760 253259 252855 252917 253130 253086 252694 252001 251158 250609 250820 251706 252679 253364 253925 254657 255618 256671 257547
52882 257547 257815 257253 256290 255592 255174 254372 252883 251316 250498 250641 251436 252487 253398 253885 254201 255105 257027
52865 257027 259553 261994 264119 265868 266782 266337 264755 262942 261636 261022 261064 261662 262391 262587 261963 260898
52849 260898 259930 259169 258320 257045 255113 252353 248750 244633 240673 237529 235482 234360 233833 233667 233655 233435
52833 233435 232699 231586 230602 230026 229673 229393 229512 230494 232345 234598 236712 238203 238626 237847 236292 234660
52817 234660 233438 232885 233211 234248 235149 235107 234491 234651 236314 238736 240793 242372 244107 246094 247588 247988
52801 247988 247534 246884 246406 246016 245395 244132 241912 238802 235314 232076 229483 227641 226433 225565 224751 223966
52785 223966 223395 223077 222837 222712 223181 224698 227091 229633 231576 232419 231872 230037 227651 225749 224904 225017
52769B25017Q33J492J874J549P60L82P31R90L27r25j716j701j474j511j525j024
52753B24079n2R55J655J884J615J066P05P44Q72P52O31R79J712K202K107J748
52737B43654J554J545J562J637J853K162K501K824K799J891J89j281j579r85m70
52722B59856l01M6O39P30r9j184j696j694j732j865j738j292q21n08l57m62q15
52705B46707j044p76k05J42K4m08q88r96k36J198K139J678M75m4L29N16P8k8Q76
52686B49537J918J888R78L43M76Q36Q32L32n51j482j823j254m30l30j025j653
52670B48592j642j264q78l42N23J377J757J658J374J001L89m37j075j007pJ542
52654B51561K777K959K174J278J038J411J755J584R54J67o16j381k052k420k382
$$ plain form
52769 225017 225850 227342 229216 230765 231525 231907 232638 233628 233955 233030 231314 229613 228139 226628 225103 224079
52753 224079 224027 224982 226637 228521 230136 231202 231907 232651 233523 234275 234906 235885 237597 239799 241906 243654
52737 243654 245208 246753 248315 249952 251805 253967 256468 259292 262091 263982 264171 262890 261311 260326 259856
52722 259856 259555 259601 260240 260970 260871 259687 257991 256297 254565 252700 250962 249670 248849 248341 247984 247522 246707
52705 246707 245663 244887 244682 244824 244848 244440 243552 242556 242320 243518 245657 247335 247810 247766 248095 248611 248689 248661 249537
52686 249537 251455 253343 254321 254664 255140 255976 256808 257140 256589 255107 253284 252030 251600 251270 250245 248592
52670 248592 246950 245686 244808 244466 244989 246366 248123 249781 251155 252156 252545 252108 251033 250026 250019 251561
52654 251561 254338 257297 259471 260749 261787 263198 264953 266537 267491 267658 267042 265661 263609 261189 258807
52639B58807k076j723j338p75qP42J229J426J487J559J693J846J962K124K581
52624B69536L435M256M263L040R93j000k275k735k707k583k432j997j188m75m16
52609B67715q04q25k33J97j81q02o02M00J048N07p49j611j551q65o0O42J245J665
52591B65136J615R97K73J73P86J249P48l83r76m51N86J160J006O38O75J229J812
52574B76273J740Q62k18q36j063j370j689j401m79J40k62j181j612j412j210j193
52558B65089q27Q6Q36P09o5p01q67q08o69l48Po4o53j157j004m01k8j51m20m63
52538B58101k77lL07N47N06J33k80l60MO21J164J353J168R09Q99J123J293J260
52520B68468J082P72L06q3r1J66K66K23N73J440K100J927J395J478K382L409L910
$$ plain form
52639 258807 256731 255008 253670 252895 252887 253629 254858 256284 257771 259330 261023 262869 264831 266955 269536
52624 269536 272971 277227 281490 284530 285523 284523 282248 279513 276806 274223 271791 269794 268606 268131 267715
52609 267715 266911 266086 265853 266050 265869 265067 264465 264865 265913 266420 265671 264060 262509 261644 261584 262226 263471 265136
52591 265136 266751 267748 268021 268194 268980 270229 270977 270594 269618 269167 269753 270913 271919 272557 273232 274461 276273
52574 276273 278013 278875 278657 277821 276758 275388 273699 272298 271819 271959 271697 270516 268904 267492 266282 265089
52558 265089 264262 264348 265184 265893 265828 265127 264260 263452 262783 262435 262442 262378 261725 260568 259564 259163 259135 258984 258564 258101
52538 258101 257824 257821 258128 258675 259181 259314 259034 258674 258678 259299 260463 261816 262984 263893 264792 265915 267208 268468
52520 268468 269550 270322 270628 270545 270454 270620 270886 271109 271682 273122 275222 277149 278544 280022 282404 285813 289723
52503B89723L749K985J674P6j461k867m156m925m603l397k368k257k597k373j317
52488B65886j56L49K28K6Rl3j89j3Q76J952K158J285M40O93J708K292J987J450
52470B80948J356J634J896K043K174K247K090J638J047P24J023J752K196J996
52456C04764J677J807J906R34j169l236m302m505m400m071l380k522j854j534
52442B80115j600k011k359k071j220o62r44j540j588r68j98L67O55N14m3m89k59
52425B65699M27P55M18RK53J166K084K324J773J033R35J696K681L138L047L047
52409B90485L674M881O219P251P875Q417R243J0122J0216Q836O004K174k069n761
52395C67567p764p858p276p298p645p092n438l818k986k380j292p4N08M30L35
$$ plain form
52503 289723 293472 296457 298131 298207 296746 293879 289723 284798 280195 276798 274430 272173 269576 267203 265886
52488 265886 265730 266079 266307 266333 266342 266309 266120 266107 266983 268935 271093 272378 272818 273511 275219 277511 279498 280948
52470 280948 282304 283938 285834 287877 290051 292298 294388 296026 297073 297797 298820 300572 302768 304764
52456 304764 306441 308248 310154 311088 309919 306683 302381 297876 293476 289405 286025 283503 281649 280115
52442 280115 278515 276504 274145 272074 270854 270192 269248 267708 266120 265152 264954 265321 265976 266490 266447 265958 265699
52425 265699 266126 266881 267299 267308 267561 268727 270811 273135 274908 275941 276876 278572 281253 284391 287438 290485
52409 290485 294159 299040 305259 312510 320385 328802 338045 348167 358383 367219 373223 375397 373328 367567
52395 367567 359803 351945 344669 337371 329726 322634 317196 313378 310392 308012 306720 306646 307154 307584 307919
52380C07919N92J011J299J324J177J251K022L386M538M847M563M335M371M503
52366C47138M670M789M471L506K408J764J273K65r80j353n92J98J63j26K27R54
52350C68775J182R50J073J692K091K024K155K844L431L386L405M497O397P759
52336D11661P892P502P591Q360R454J0699J2047J3144J3683J4074J5239J7462
52324E48808J9882K1408K1890K2074K2537K3157K3590K3729K3472K2523K0890
52313G93960J9304J8631J8874J9208J8949J8116J7004J5709J4346J3245J2588
52302I79934J2025J1076R750Q519P717P162O416N216L643J892o1k444n217p805
52288A037823r560j0460j0918j1000j0397r199q117p516o805n240k901m07J987
$$ plain form
52380 307919 308511 309522 310821 312145 313322 314573 316595 319981 324519 329366 333929 338264 342635 347138
52366 347138 351808 356597 361068 364574 366982 368746 370019 370284 369304 367951 367359 367557 367720 367594 367821 368775
52350 368775 369957 370907 371980 373672 375763 377787 379942 382786 386217 389603 393008 397505 403902 411661
52336 411661 419553 427055 434646 443006 452460 463159 475206 488350 502033 516107 531346 548808
52324 548808 568690 590098 611988 634062 656599 679756 703346 727075 750547 773070 793960
52313 793960 813264 831895 850769 869977 888926 907042 924046 939755 954101 967346 979934
52302 979934 991959 1003035 1012785 1021304 1029021 1036183 1042599 1047815 1051458 1053350 1053289 1050845 1045628 1037823
52288 1037823 1028263 1017803 1006885 995885 985488 976289 968172 960656 953851 948611 945710 945303 947290
52275I47290M399O753Q812J0639J2431J4021J5027J5482J5726J5775J5402J4800
52263A096557J4557J4808J4942J4392J3310J2300J1782J1734J1684J1011R547
52252A236624P939O986O666O168M876K825K34k785n909q597j0666j2355j3702
52239A218304j4386j4417j4394j4666j4754j4091j2938j2033j1542j0911r688
52228A074484q160p048o672o483n582l846k262j700j669r58O30K021K486K527
52214A037768K857L336L570L720M109M600N080N916P223Q229Q201P521O966O415
52200A115511N293M014L674M357M869M436L650L357L446L312K837K411K300K439
52186A165906K636K702K571K384K137J352m36k832m865o251p757r892j1890j2519
$$ plain form
52275 947290 951689 958442 967254 977893 990324 1004345 1019372 1034854 1050580 1066355 1081757 1096557
52263 1096557 1111114 1125922 1140864 1155256 1168566 1180866 1192648 1204382 1216066 1227077 1236624
52252 1236624 1244563 1251549 1258215 1264383 1269259 1272084 1272318 1269533 1263624 1255027 1244361 1232006 1218304
52239 1218304 1203918 1189501 1175107 1160441 1145687 1131596 1118658 1106625 1095083 1084172 1074484
52228 1074484 1066324 1059276 1052604 1046121 1040539 1036693 1034431 1032731 1031062 1030104 1030734 1032755 1035241 1037768
52214 1037768 1040625 1043961 1047531 1051251 1055360 1059960 1065040 1070956 1078179 1086408 1094609 1102130 1109096 1115511
52200 1115511 1120804 1124818 1128492 1132849 1137718 1142154 1145804 1149161 1152607 1155919 1158756 1161167 1163467 1165906
52186 1165906 1168542 1171244 1173815 1176199 1178336 1179688 1179252 1176420 1171555 1165304 1157547 1147655 1135765 1123246
52172A123246j1469r463p354n641m542l871k977j431K35J026Q43P41J634L221
52158A084198M541N149N283N135M541L424K065P78l78j330j772j530q66k01L26
52143A109363P49R37P80N56O85J093J332J340J602K441L653N001O554Q314J0006
52128A154406J1646J3793J6795K0154K3101K5518K7755K9867L1553L2692L3363
$$ plain form
52172 1123246 1111777 1102314 1094960 1089319 1084777 1080906 1077929 1076498 1076733 1077759 1078602 1079343 1080977 1084198
52158 1084198 1088739 1093888 1099171 1104306 1108847 1112271 1114336 1115114 1114736 1113406 1111634 1110104 1109238 1109037 1109363
52143 1109363 1110112 1111049 1111829 1112385 1113070 1114163 1115495 1116835 1118437 1120878 1124531 1129532 1136086 1144400 1154406
52128 1154406 1166052 1179845 1196640 1216794 1239895 1265413 1293168 1323035 1354588 1387280 1420643
$$ [...]
##END NTUPLES=NMR SPECTRUM
##END=
