
##TITLE=AC1233_PERAH12114_6519287_kQ2xMY586G
##JCAMPDX= 6.0         $$ Bruker NMR JCAMP-DX V2.0
##DATA TYPE= NMR SPECTRUM
##DATA CLASS= NTUPLES
##ORIGIN= BRUKER
##OWNER= Administrator
$$ 1.72 TOPSPIN		Version 2.1
$$ 2012-07-14 10:27:44.812 -0500  Administrator@TOPSPIN
$$ Compression mode = diff/dup
##.OBSERVE FREQUENCY= 400.02188249412
##.OBSERVE NUCLEUS= ^1H
##.ACQUISITION MODE= SIMULTANEOUS (DQD)
##.ACQUISITION SCHEME= undefined
##.AVERAGES= 8
##.DIGITISER RES= 22
##SPECTROMETER/DATA SYSTEM= spect
##.PULSE SEQUENCE= zg30
##.SOLVENT NAME= COFFEE_meoh
##.SHIFT REFERENCE= INTERNAL, COFFEE_meoh, 1, 14.98509
##AUDIT TRAIL= $$ (NUMBER, WHEN, WHO, WHERE, PROCESS, VERSION, WHAT)
$$ ##TITLE= Audit trail, TOPSPIN		Version 2.1
$$ ##JCAMPDX= 5.01
$$ ##ORIGIN= Bruker BioSpin GmbH
$$ ##OWNER= Administrator
$$ $$ C:\Bruker\TOPSPIN/data/COFFEE/nmr/AC1233_PERAH12114_6519287_kQ2xMY586G/70/pdata/1/auditp.txt
$$ ##AUDIT TRAIL=  $$ (NUMBER, WHEN, WHO, WHERE, PROCESS, VERSION, WHAT)
(   1,<2012-07-14 10:27:37.781 -0500>,<Administrator>,<TOPSPIN>,<go>,<TOPSPIN 2.1>,
      <created by zg
	started at 2012-07-14 10:26:31.187 -0500,
	POWCHK enabled, PULCHK disabled,
       configuration hash MD5:
       6B 1B 68 BB D9 2E 58 E2 7F 35 AD 54 07 DF 0E 41
       data hash MD5: 64K
       1B 1E 8B 11 D0 BE 97 5F F4 B2 69 0B D4 7C 04 C5>)
(   2,<2012-07-14 10:27:40.703 -0500>,<Administrator>,<TOPSPIN>,<proc1d>,<TOPSPIN 2.1>,
      <Start of raw data processing
       efp LB = 0 FT_mod = 6 PKNL = 1 PHC0 = 0 PHC1 = 0 SI = 32K 
       data hash MD5: 32K
       BC 31 C8 8F EC 59 22 00 20 8A EF 5B D9 8E 13 FD>)
(   3,<2012-07-14 10:27:41.015 -0500>,<Administrator>,<TOPSPIN>,<proc1d>,<TOPSPIN 2.1>,
      <pk PHC0 = 180.0824 PHC1 = 0 
       data hash MD5: 32K
       23 83 8B 3E 40 24 49 F7 21 E7 71 6C E4 02 1B AB>)
(   4,<2012-07-14 10:27:41.078 -0500>,<Administrator>,<TOPSPIN>,<proc1d>,<TOPSPIN 2.1>,
      <abs ABSG = 1 
       data hash MD5: 32K
       41 2C AC 24 20 F9 81 57 99 84 04 E1 6E 37 9C B4>)
(   5,<2012-07-14 10:27:41.109 -0500>,<Administrator>,<TOPSPIN>,<proc1d>,<TOPSPIN 2.1>,
      <abs ABSG = 2 
       data hash MD5: 32K
       EC A3 AC 02 86 41 8A B1 38 E8 9A 44 A3 9D AF A2>)
(   6,<2012-07-14 10:27:41.140 -0500>,<Administrator>,<TOPSPIN>,<proc1d>,<TOPSPIN 2.1>,
      <abs ABSG = 3 
       data hash MD5: 32K
       E7 93 98 E4 F1 29 BA 3B 2F 06 DD 44 F0 17 FC 0F>)
(   7,<2012-07-14 10:27:41.171 -0500>,<Administrator>,<TOPSPIN>,<proc1d>,<TOPSPIN 2.1>,
      <abs ABSG = 4 
       data hash MD5: 32K
       B8 EE 21 BC 5A F4 E2 E5 5F E5 E2 CD 69 67 7E C3>)
(   8,<2012-07-14 10:27:41.203 -0500>,<Administrator>,<TOPSPIN>,<proc1d>,<TOPSPIN 2.1>,
      <abs ABSG = 5 
       data hash MD5: 32K
       74 A5 12 FC 6D 01 78 9E 29 83 63 CF 96 70 3B 94>)
$$ ##END=
$$ 
$$ $$ hash MD5
$$ $$ 09 55 43 10 DE 3C 41 07 A3 F5 A6 FF 90 34 D1 1B
##$RELAX= 
##$RELAX= 
##$RELAX= 
##$RELAX= 
##$RELAX= 
##$RELAX= 
##$RELAX= 
##$RELAX= 
$$ Bruker specific parameters
$$ [...]
150 150 150 150 150 150 150 150
##$TP07= 0
##$TPNAME0= <>
##$TPNAME1= <>
##$TPNAME2= <>
##$TPNAME3= <>
##$TPNAME4= <>
##$TPNAME5= <>
##$TPNAME6= <>
##$TPNAME7= <>
##$TPOAL= (0..7)
0.5 0.5 0.5 0.5 0.5 0.5 0.5 0.5
##$TPOFFS= (0..7)
0 0 0 0 0 0 0 0
##$TUNHIN= 0
##$TUNHOUT= 0
##$TUNXOUT= 0
##$USERA1= <user>
##$USERA2= <user>
##$USERA3= <user>
##$USERA4= <user>
##$USERA5= <user>
##$V9= 5
##$VALIST= <valist>
##$VCLIST= <CCCCCCCCCCCCCCC>
##$VD= 0
##$VDLIST= <DDDDDDDDDDDDDDD>
##$VPLIST= <PPPPPPPPPPPPPPP>
##$VTLIST= <TTTTTTTTTTTTTTT>
##$WBST= 2048
##$WBSW= 25
##$XGAIN= (0..3)
0 0 0 0
##$XL= 0
##$YL= 0
##$YMAX_a= 514787
##$YMIN_a= -658833
##$ZGOPTNS= <>
##$ZL1= 120
##$ZL2= 120
##$ZL3= 120
##$ZL4= 120
##$ABSF1= 14.98509
##$ABSF2= -5.573092
##$ABSG= 5
##$ABSL= 3
##$ALPHA= 0
##$AQORDER= 0
##$ASSFAC= 0
##$ASSFACI= 0
##$ASSFACX= 0
##$ASSWID= 0
##$AUNMP= <proc_prof1d_extract_pilot.lims>
##$AXLEFT= 0
##$AXNAME= <>
##$AXNUC= <1H>
##$AXRIGHT= 0
##$AXTYPE= 0
##$AXUNIT= <>
##$AZFE= 0.1
##$AZFW= 0.1
##$BCFW= 0
##$BC_mod= 0
##$BYTORDP= 0
##$COROFFS= 0
##$CY= 15
##$DATMOD= 1
##$DC= 0
##$DFILT= <>
##$DTYPP= 0
##$F1P= 0
##$F2P= 0
##$FCOR= 0.5
##$FTSIZE= 32768
##$FT_mod= 6
##$GAMMA= 0
##$GB= 0
##$INTBC= 1
##$INTSCL= 1
##$ISEN= 128
##$LB= 0
##$LEV0= 0
##$LPBIN= 0
##$MAXI= 10000
##$MC2= 0
##$MEAN= 0
##$ME_mod= 0
##$MI= 0
##$NCOEF= 0
##$NC_proc= -8
##$NLEV= 6
##$NOISF1= 0
##$NOISF2= 0
##$NSP= 0
##$NTH_PI= 0
##$NZP= 0
##$OFFSET= 14.98509
##$PC= 1
##$PHC0= 180.0824
##$PHC1= 0
##$PH_mod= 1
##$PKNL= yes
##$PPARMOD= 0
##$PPDIAG= 0
##$PPIPTYP= 0
##$PPMPNUM= 2147483647
##$PPRESOL= 1
##$PSCAL= 4
##$PSIGN= 0
##$PYNMP= <proc.py>
##$REVERSE= no
##$SF= 400.02
##$SI= 32768
##$SIGF1= 0
##$SIGF2= 0
##$SINO= 400
##$SIOLD= 32768
##$SPECTYP= <>
##$SREGLST= <1H.CDCl3>
##$SSB= 0
##$STSI= 32768
##$STSR= 0
##$SW_p= 8223.68421052631
##$SYMM= 0
##$S_DEV= 0
##$TDeff= 65536
##$TDoff= 0
##$TI= <>
##$TILT= no
##$TM1= 0
##$TM2= 0
##$TOPLEV= 0
##$USERP1= <user>
##$USERP2= <user>
##$USERP3= <user>
##$USERP4= <user>
##$USERP5= <user>
##$WDW= 1
##$XDIM= 32768
##$YMAX_p= 473810476
##$YMIN_p= -741000
##$CURPLOT= <Network HP LaserJet P1505>
##$CURPRIN= <$Network HP LaserJet P1505>
##$DFORMAT= <normdp>
##$LAYOUT= <+/1D_H.xwp>
##$LFORMAT= <normlp>
##$PFORMAT= <normpl>
##$SURQMSG= 1
$$ End of Bruker specific parameters
$$ ---------------------------------
##NTUPLES= NMR SPECTRUM
##VAR_NAME=  FREQUENCY,     SPECTRUM/REAL,   SPECTRUM/IMAG
##SYMBOL=    X,             R,               I
##VAR_TYPE=  INDEPENDENT,   DEPENDENT,       DEPENDENT
##VAR_FORM=  AFFN,          ASDF,            ASDF
##VAR_DIM=   32768,         32768,           32768
##UNITS=     HZ,            ARBITRARY UNITS, ARBITRARY UNITS
##FACTOR=    0.250966925370066, 1,           1
##FIRST=     8223.43324360094, 59471,        -27134
##LAST=      0,             -124145,         -71204
##MIN=       0,             -741000,         0
##MAX=       8223.43324360094, 473810476,    0
$$ Real data points
##PAGE= N=1
##DATA TABLE= (X++(R..R)), XYDATA
$$ [...]
19535c75383J68866N6247n4544d4256B13382a96647j28523a01570F5499c6834
19524a20860p2328j22405P0871B41646E6763b94939H4694C3306a18870l26942
19514d45812D8489c51777C18422D4909g4777p8728C2903b7841A25717j6293K4832
19503A34256d15217J90823f5523C6894K62276B7654J87558E4842a17456c4125
19492G6000h9491A3784O0007i0470j14046P7452p7307B25624r5448a83291c4352
19480e2549D9945Q1032g4178A36194a48014E5672a15676M0389C9689d4164j28185
19469a72349A31471a81425o4461B1893b78109b7876m40354M3837F0425a25509
19458B14622c5302J051A01051a3880j70302c0588D9550h4965F6936a24964B22450
$$ y = [-375383, -206517, -150270, -204814, -44256, 213382, -196647, -325170, -101570, 65499, -36834, -120860, -193188, -315593, -244722, 241646, 56763, -294939, 84694, 33306, -118870, -445812, 48489, -351777, 318422, 44909, -74777, -153505, 32903, -27841, 125717, 109424, 134256, -415217, -224394, -65523, 36894, 299170, 27654, 215212, 54842, -117456, -34125, 76000, -89491, 13784, 73791, -90470, -204516, -127064, -204371, 225624, 130176, -183291, -34352, -52549, 49945, 130977, -74178, 136194, -148014, 55672, -115676, -75287, 39689, -44164, -172349, 131471, -181425, -245886, 21893, -278109, -27876, -468230, -424393, 60425, -125509, 214622, -35302, -34251, 101051, -13880, -184182, -30588, 49550, -84965, 66936, -124964, 222450]
19446D437c996F6618J59876d98924a52184f8829B77898a36644N9244l7454m971
19435a19825l54877A42311b94012F889R5232h5613A58004b36100D51e6848B50514
19423d5060c949l4066o623B6135b75640e2979A3483a98264N4784A15352a08010
19411B52329O8504m4618C0597N6548d5655l49244g6610m7951k6384c0205B72720
19399a5920j36045N0169k1274E2124J06210c58667A33548i0543l06416a4706j58173
19388a72879d8673r9650A25256c76078J76002l768d2791j3396D9671b57547A98365
19376b76795a14836r9904N2269b4814A35148D9278j6163J9424i9124K6838k93474
19365c65760A07204j5218b71338a03755o9526E3591b54206C2330f4574o3421q0603
$$ y = [4437, -3996, 66618, 226494, -498924, -152184, -68829, 277898, -136644, -77400, -114854, -119825, -474702, 142311, -294012, 6889, 102121, -85613, 158004, -236100, 451, -56848, 250514, -45060, -3949, -38015, -44638, 26135, -275640, -52979, 13483, -198264, -143480, 115352, -108010, 252329, 320833, 276215, 30597, 87145, -45655, -394899, -76610, -124561, -150945, -30205, 272720, -15920, -151965, -101796, -123070, 52124, 158334, -358667, 133548, -90543, -396959, -14706, -172879, -48673, -148323, 125256, -376078, -200076, -203844, -42791, -56187, 49671, -257547, 198365, -276795, -114836, -214740, -162471, -24814, 135148, 49278, 33115, 52539, -99124, -72286, -365760, 107204, 91986, -271338, -103755, -173281, 53591, -254206, 32330, -64574, -127995, -208598]
19354b08598Q2526k38248J67985H1527l5847c34049i9998I0786L7236J20798B8680
19342g8957l41002J40360j36A49746e1655q0682G6586a65577p5669O2418D8306
19330c01995A2955a56382f3470A09807n2712c5264l97519a07719n27353b50054
19319a15375l8720B91610d57671a09321j74189B61734a36914J2797B65943B4048
19308a83440B34346j04600b01341P578k4376C56474G7597J82027c3608j22033
19298a55641D0127a10084n1449C7654c25485J46152b012j08919C7071c07745A40394
19286B3234a10247A54631l6837P7228a16847j35356N5466n841A42354k9569E5160
19274b64506I8104F220N5302f6938j31738B5856c708C8790P983O5923J14442E3007
$$ y = [-208598, -126072, -364320, -196335, 81527, 45680, -334049, -99998, 90786, 128022, 248820, 28680, -78957, -419959, -279599, -279735, 149746, -51655, -132337, 76586, -165577, -241246, -178828, 48306, -301995, 12955, -156382, -63470, 109807, 57095, -35264, -432783, -107719, -635072, -250054, -115375, -154095, 291610, -457671, -109321, -283510, 261734, -136914, -124117, 265943, 24048, -183440, 234346, 129746, -201341, -193763, -218139, 356474, 77597, 259624, -33608, -155641, 40127, -110084, -161533, 37654, -325485, -179333, -2012, -110931, 37071, -307745, 140394, 23234, -110247, 154631, 117794, 195022, -116847, -252203, -196737, -202578, 142354, 112785, 55160, -264506, 98104, 6220, 61522, -66938, -198676, 25856, -3708, 38790, 46773, 112696, 227138, 53007]
19261a95291m4671D1784a09443C43646a47393f594B95031B4659b30074P9352k35609
19250c86331J86733m1725C6770a68723A62009a85244A21736a70344G0206b10018
19239A44133c7597j46472f2968j96226a14499B04061I396L12245h4757p3722j8792
19228a77271M4850A66143J0282e0268j44683D1787a90936A91477o0179d00714
19217C8958g1561j9399p6136A37707p605c70876B69545b29422a12760A06882J44957
19206B51839c23704J55002D07413j65726F148c79029f3988L0143p7931c3657l8294
19195g1951B52533p7329L0901h6555r630o0397k39567E0439d21718C50587b04433
19183b23196O608k17520B78826a14041M6429H336a74561A03674C7463K8996a28982
$$ y = [-195291, -239962, 41784, -109443, 343646, -147393, -6594, 295031, 24659, -230074, -150722, -386331, -199598, -241323, 36770, -168723, 162009, -185244, 121736, -170344, 70206, -210018, 144133, -37597, -184069, -62968, -259194, -114499, 204061, 9396, 321641, -84757, -158479, -177271, -132421, 166143, 176425, -50268, -194951, 41787, -190936, 191477, 131298, -400714, 38958, -71561, -90960, -167096, 137707, 130102, -370876, 269545, -229422, -112760, 106882, 251839, -323704, -168702, 407413, 241687, 6148, -379029, -63988, -33845, -111776, -33657, -71951, 252533, 175204, 206105, -86555, -96185, -156582, -396149, 50439, -421718, 350587, -204433, -223196, -216588, -434108, 278826, -114041, -67612, 8336, -174561, 103674, 37463, 66459, -128982]
19171E6168b34172B37482a59424J1137B52142B7670a57802m9903A31543j9347
19161A12196a71641q1840A75398c32552e1700E6387C637A133b42514n4116a44373
19149b00534P013A73509A7495a84219A02789e0541G4564K75J14254b30200A49215
19137G7394a28790E1680r307R4485c10808A02395a56383A58026A6174L01658a51094
19125a93190c9441A91165a91197m8541A47496a4056m21391d5147B46972a29216
19114h5914k68409J76403A17628A6760M3061c5287o5898i158j82983A71823G3462
19102a01760j35321j10529k47348b79507E2216A7077a14085A5493a64036F668
19091A50149J6546e00599G8382O0133h9413l6924B37500a13159C9095a42231A43242
$$ y = [56168, -234172, 237482, -159424, -148287, 252142, 27670, -157802, -207705, 131543, 112196, -171641, -253481, 175398, -332552, -51700, 56387, 3637, 1133, -242514, -296630, -144373, -200534, -193521, 173509, 17495, -184219, 102789, -50541, 74564, 74839, 189093, -230200, 149215, 77394, -128790, 51680, 42373, 136858, -310808, 102395, -156383, 158026, 16174, 317832, -151094, -193190, -39441, 191165, -191197, -239738, 147496, -14056, -435447, -45147, 246972, -129216, -85914, -354323, -177920, 117628, 16760, 59821, -35287, -101185, -9158, -192141, 171823, 73462, -101760, -237081, -347610, -594958, -279507, 52216, 17077, -114085, 15493, -164036, 6668, 150149, 166695, -500599, 78382, 138515, -89413, -126337, 237500, -113159, 39095, -142231, 143242]
19079h0460C3314o160a29547p4442N60N7656e509j42982k45035h7901j06530F6655
19066A59061n8878b2007A66533f7595a9197k18852R761J08483J1305m83473d4700
19054b07478l27349e1430j23289E7237K76736b47195I5925a62662A24279a6711
19043d02895D489a23061b4441f488k86785e6941C9972J10067b07850A34720n0509
19032H4211P7050d7158j25067N7032B50684i6486B07494a00038H0087c5796A23821
19020A74285m6404F596a70697j51589b8977A37710e9192b3369j71766D70887j67600
19009C03287b53333l09880h8927k1440A4175f6474A3961d5982k8577j55155M0115
18998a89599e6693j86430F3057K9481N5559R6273b05429A5164c28196a58726A03531
$$ y = [-80460, 33314, 27154, -129547, -203989, -203429, -145773, -5509, -148491, -393526, -87901, -194431, 66655, 159061, 100183, -22007, 166533, -67595, -19197, -238049, -228288, -119805, -108500, -591973, -44700, -207478, -534827, -51430, -174719, 57237, 333973, -247195, 95925, -162662, 124279, -16711, -402895, 4489, -123061, -24441, -6488, -293273, -56941, 39972, 150039, -207850, 134720, 84211, 161261, -47158, -172225, -115193, 250684, -96486, 207494, -100038, 80087, -35796, 123821, 174285, 127881, 6596, -170697, -322286, -28977, 137710, -59192, -23369, -195135, 470887, 303287, -253333, -563213, -88927, -110367, 14175, -66474, 13961, -45982, -74559, -229714, -189599, -56693, -243123, 63057, 92538, 148097, 244370, -205429, 15164, -328196, -158726, 103531]
18986h0564p6290A93401a86450N8461h05B86236a63881j7277C8846b44837A96665
18974b69248J20126D5695d18380a17112r5173c4550N268q5480m09799a63403A93572
18962A24425c1972c602B58364I2746b9123B68630a38417M1545q4546B2322d84841
18950I476c2288m9731A6940h4751m3742o58I5130a91917A56572J62804m2909c6928
18937A62727g2199k3634k15715a11218C9795a56579g5726j72630h5939j09153
18927a95092A87262H5111K51437A15b41605Q8006K1762A94927i0441m336J2388
18916h2389B7733d9711j36284B559Q3450c04007B37703H0780b41041A30906a82531
18904c531l33966G9259a4174l7096F5363F256f1034k4052n4665D6721a17113j44066
$$ y = [-80564, -156854, 193401, -186450, -127989, -805, 286236, -163881, -181158, 38846, -244837, 196665, -269248, -149122, 45695, -418380, -117112, -212285, -34550, -29282, -114762, -524561, -163403, 193572, 124425, -31972, -3602, 258364, 92746, -29123, 268630, -138417, -96872, -181418, 22322, -484841, 9476, -32288, -82019, 16940, -84751, -128493, -129151, 95130, -191917, 156572, 319376, 276467, -36928, 162727, -72199, -95833, -311548, -111218, 39795, -156579, -75726, -248356, -85939, -195092, 187262, 85111, 336548, 115, -241605, -153599, -131837, 194927, -90441, -94777, -82389, 27733, -49711, -185995, 2559, 86009, -304007, 237703, 80780, -241041, 130906, -182531, -3531, -337497, 79259, -14174, -51270, 65363, 6256, -61034, -85086, -139751, 46721, -117113, -261179]
18892b61179C37645A07091M347b47168e0198j29869H5914a89528a431k1539C72370
18880b56491D2157L9849f201A5325Q0331A1165d45628a53995j14202p5169a31390
18868c4356j2157G2603b5656o748B16955h2652j9975L0566j40390O4015j20309
18857b68745P6014B10128O0832o8394a70739n8001c5754A52497F4182l1190j6000
18846A6992L62772a67517j03000E8835N7541n7427i5926d6446J9087A10761a44935
18834a71792I4454J96458a43933n11298b21327B52866c75836a17181j34562A96565
18823a21629l3569A7104J9581N4672R5298C3693L15187A38112a10064D43898k21890
18812B22008m119E2965h6638A8190Q255H948a56508g1073j56899D3971d9219B29509
$$ y = [-261179, 337645, 107091, 111438, -247168, -50198, -180067, 85914, -189528, -1431, -22970, 372370, -256491, 42157, 82006, -6201, 15325, 95656, 11165, -445628, -153995, -268197, -343366, -131390, -34356, -46513, 72603, -25656, -32404, 216955, -82652, -102627, -72061, -212451, -148436, -268745, -192731, 210128, 270960, 202566, -170739, -228740, -35754, 152497, 64182, 32992, 16992, 379764, -167517, -270517, 58835, 116376, 58949, -95926, -46446, -27359, 110761, -144935, -171792, 94454, 290912, -143933, -655231, -221327, 252866, -375836, -117181, -251743, 196565, -121629, -155198, 17104, 36685, 91357, 186655, 33693, 348880, 138112, -110064, 443898, 222008, 217889, 52965, -86638, 18190, 26445, 8948, -156508, -71073, -227972, 43971, -49219, 229509]
18799B32808N2908h7565j14518p3811g969j68198j84989A96705N0179b48981I2959
18787A06047L6624a91838h9656G2284b18318m4550J27625l86075A52463E7774
18776A01288i3403j45221K9148A35367c62575A08538O795b5379k07758f1625j54937
18765b16562d1226G6491b96297J33984B22026a54022A04032n0494k5799M1702
18755F9441K7698D4360a20948c1027m8673m8952o5395B6065a76763g1160k59052
18744c30212A48277e3377m312A42254n7509k2362J0804a5913k08293D01114a39898
18732C3646c48214G9710c0784E6435P9598c31761A69718f3267j24191H9585J4480
18721A04065b28542i626c908j35744k3017P7499R24A42517c11442a32214f0273
$$ y = [232808, 285716, -87565, -202083, -275894, -7969, -176167, -361156, 196705, 246884, -248981, 92959, 106047, 142671, -191838, -89656, 72284, -218318, -262868, -135243, -521318, 152463, 57774, 101288, -93403, -238624, -209476, 135367, -362575, 108538, 115333, -25379, -233137, -61625, -216562, -41226, 76491, -296297, -162313, 222026, -154022, 104032, 53538, 27739, 69441, 97139, 44360, -120948, -31027, -79700, -128652, -194047, 26065, -176763, -71160, -330212, 148277, -53377, -57689, 142254, 84745, 62383, 73187, -15913, -224206, 401114, -139898, 33646, -348214, 79710, -30784, 56435, 136033, -331761, 169718, -63267, -187458, 89585, 104065, -228542, -9626, -3908, -139652, -162669, -85170, -84246, 142517, -311442, -132214, -60273]
18709c41356B07736a82387k00597F7749c39172K6484P5438Q1055N4540j08889
18699b10544A28741a97580i4643o973p0740j2144H685N124a16198e7334K2025
18688c5309A95592b99344A29741b22180Q1048D19688d20406J39064C28702a0569
18677b54861E3763h2395l5880j20727j5028j2037J07927a709A16002b30529d0024
18665b46028K5523B12359J0873a94879L3399A24402c22257a50763I265a44627
18654b55348P3866B5541J25124b21314B01183D9428j2221L7780O606a05612N700
18643i9912L5962J9484A55170c26685C0067c75641R0076J20842l10919c3363B5901
18631d03938J78421g8986C6147K3052c03876f4602A21052m8004q573O5516a26460
$$ y = [-341356, 207736, -182387, -382984, 67749, -339172, -312688, -237250, -156195, -101655, -210544, 128741, -197580, -94643, -101616, -172356, -184500, 8685, 13809, -116198, -57334, -35309, 195592, -299344, 129741, -222180, -141132, 419688, -420406, -281342, 328702, -10569, -254861, 53763, -82395, -118275, -239002, -254030, -266067, -158140, -1709, 116002, -230529, -40024, -246028, -220505, 212359, 223232, -194879, -161480, 124402, -322257, -150763, 9265, -144627, -255348, -181482, 25541, 150665, -221314, 201183, 49428, 37207, 74987, 81593, -105612, -99912, -63950, -44466, 155170, -326685, 30067, -375641, -285565, -164723, -475642, -33363, 25901, -403938, -225517, -78986, 36147, 59199, -303876, -64602, 121052, 73048, 64475, 129991, -126460]
18619a79026I2429a49479G6242k1636a0205C02551g350q8100I599L0557O8875
18608A09031a16652C26K4987a63652e581n34233h9449j91095F9202k7201P0481
18597A12482a04105M9255A3815c226A84475D5212K33715F5314b09387J201E9588
18585i4890C07140A31054E3416K04992f7335l1655l48173A34886a54241j0427
18575a64668q0395h8630a194A92348m9015J16532d7440D6809b45133a11023q0506
18564a91529B51973h5709D414a64161A6801a08738k35622A76653c05063P9629
18554b25434A74639k8459a21648A16298Q6625f9035k6012C5578Q5887a59414j76153
18543c35567a62227m8556I1036c19006b8828E5124a32355M1870j71854a23544
$$ y = [-179026, 92429, -149479, 76242, 54606, -10205, 302551, -7350, -95450, 9599, 40156, 109031, -116652, 326, 25313, -163652, -5581, -539814, -89449, -280544, 69202, 42001, 112482, -104105, -54850, 13815, -3226, 184475, 45212, 278927, 65314, -209387, -208186, 59588, -94890, 307140, 131054, 53416, 258408, -67335, -98990, -447163, 134886, -154241, -164668, -245063, -88630, -1194, 192348, 143333, 259865, -47440, 46809, -245133, -111023, -191529, 251973, -85709, 4414, -164161, 16801, -108738, -344360, 176653, -305063, -225434, 174639, 146180, -121648, 116298, 202923, -69035, -95047, 35578, 121465, -159414, -335567, -162227, -210783, 91036, -319006, -28828, 55124, -132355, -90485, -262339, -123544]
18532F5072a08983C0509J57112c773m1145q0120A43259b14210b4440E3135b99511
18520e6550H8908J15054b21338b0244j56439A29909E3790c53316a6005K555k02360
18509b15810M9630F2732a52969A1636b87636A00389Q8577f8907O784A31360a43851
18497B991O9371J03314a53138j16450B29409a6147k47268A30890a8245E126O7228
18486G2354a11965g388j70194B01636c12904E5278B3480a40862K0672K166A64652
18474B9794b65621A65355A2936b52134D0301J14560a87535j03836h5783c5946
18463g3459A15394A1737a09392k9178j5172D835c8116k9829B04158c9045K972
18452c6073I0943e7534k69344p376a56137K312I4376i1931C03511G0911b12059
$$ y = [65072, -108983, 30509, 187621, -3773, -44918, -125038, 143259, -214210, -24440, 53135, -299511, -56550, 88908, 203962, -221338, -20244, -176683, 129909, 53790, -353316, -16005, -13450, -215810, -166180, 62732, -152969, 11636, -287636, 100389, 188966, -68907, -62123, 131360, -143851, 2991, 72362, 175676, -153138, -269588, 229409, -16147, -263415, 130890, -18245, 5126, 72354, -111965, -7388, -177582, 201636, -312904, 55278, 23480, -140862, -120190, -118024, 164652, 29794, -265621, 165355, 12936, -252134, 40301, 154861, -187535, -291371, -85783, -35946, -73459, 115394, 11737, -109392, -138570, -153742, 4835, -38116, -67945, 204158, -39045, -36073, 90943, -57534, -326878, -334254, -156137, -153825, 94376, -91931, 303511, 70911, -212059]
18440G1590a08713F8463a68220C2451a76681Q6600m5993f6498A42890b19896N2670
18429a67226j23259G5856O0510C849a45814B35011a63305A64983K5409a37735
18418a91358d4703j5224A4029a84868l2583n323f98D8710B2292R2247h3336k4181
18406a07517I9826J58561J25882A50513R1896A13795P1178m6962l9466d95323
18395A9000a85889c6400l73483a46251o2013E7893c63944B13676G4260d10142
18384a3613A77514c50552O7559J23109k30658a3892p8274A1989b07849i6902B8040
18372b16290a00166a1234k43343D00508A71877a96668G5099h220F2946O9109f3939
18360a6109j6199B56185b01651p7016M4710P84r7253A97585b53978q0590H015
$$ y = [71590, -108713, 68463, -168220, 32451, -176681, -90081, -136074, -66498, 142890, -219896, -167226, -290485, 75856, 136366, 3849, -145814, 235011, -163305, 164983, 190392, -137735, -191358, -44703, -59927, 14029, -184868, -217451, -222774, -698, 48710, 22292, 114539, -83336, -107517, 99826, 258387, 384269, 150513, 242409, 113795, 184973, 138011, 98545, -495323, 19000, -185889, -36400, -409883, -146251, -208264, 57893, -363944, 213676, 74260, -410142, -13613, 177514, -350552, -282993, -159884, -390542, -13892, -92166, 11989, -207849, -96902, 28040, -216290, -100166, -11234, -254577, 400508, 171877, -196668, 75099, -8220, 62946, 132055, -63939, -16109, -32308, 256185, -201651, -278667, -233957, -233173, -330426, 197585, -253978, -334568, 8015]
18348a21242B05068e3033C03271i6516C009J47400c4032M711j42494g4339B76762
18336c16126a50395P467n7918o5389A26804a00808B56281h902k59296A14275K59800
18325C74075c30836h4576j47445G7245f4743F3929a86572a4179j16347b5655j69094
18314a94749N7294c0449r2456b1777A27953a03874j30304h9216A56941d5899m6562
18303i2461C22220h2162H9562b13438A2534g9394j87870a2849j21197q1763e0407
18291i7310D4141L8935a75587G8208J13000b17372o092I4237b44657I0774L28797
18280D19571a22851B9710A4243b05174G4028Q1183b91804d2891J6018I3510N6601
18269A50111b81299c9335j47299g0372j62189B7162J56213d935j21180B40177
$$ y = [-121242, 205068, -53033, 303271, -96516, 3009, 150409, -34032, -29321, -171815, -74339, 276762, -316126, -150395, -142928, -200846, -266235, 126804, -100808, 256281, -8902, -268198, 114275, 374075, -330836, -84576, -232021, 77245, -64743, 63929, -186572, -14179, -130526, -25655, -194749, -137455, -30449, -122905, -21777, 127953, -103874, -234178, -89216, 156941, -45899, -92461, 322220, -82162, 89562, -213438, 12534, -79394, -267264, -12849, -134046, -215809, -50407, -97310, 44141, 83076, -175587, 78208, 191208, -217372, -223464, 94237, -244657, 90774, 419571, -122851, 29710, 14243, -205174, 74028, 155211, -291804, -42891, -26873, 93510, 150111, -281299, -39335, -186634, -70372, -232561, 27162, 183375, -4935, -126115, 240177]
18258f7431j56898C91032a69153d7436j9695K8778H0058c94987c1992l8578H4302
18246a37613A41309a20869e4947L16n0125l435F2502L46468b43344g5749A90867
18234B4827O3159a35476m1298A50037e7039k10763D9406a48558N3566j80128A8495
18222B61254b86529c7947l09411J32312J1001c0355p6866a6552B67893E0841J5322
18211F6163L8315m6385J3615h946j67638n9941a16864A11524E2826a14738F275
18199F7215d6160o2717A06409a93956j09896N5895H3655j8841c2892l2327H8452
18187a04705I8136d79778B44128d25783R6960c4184A80883a16552l880j6798D71096
18175A8536a30798j85292B16803b0480E7713A2335J06260D1199a85776C71892
$$ y = [-67431, -224329, 391032, -169153, -47436, -67131, -38353, 80058, -394987, -31992, -70570, 84302, -137613, 141309, -120869, -54947, -54631, -104756, -108191, 62502, 408970, -243344, -75749, 190867, 24827, 87986, -135476, -176774, 150037, -57039, -267802, 49406, -148558, -94992, -275120, 18495, 261254, -286529, -37947, -347358, -215046, -204045, -30355, -107221, -16552, 267893, 50841, 66163, 104478, 58093, 71708, -8946, -176584, -236525, -116864, 111524, 52826, -114738, 6275, 67215, -46160, -108877, 106409, -193956, -303852, -247957, 83655, 64814, -32892, -65219, 88452, -104705, 98136, -479778, 244128, -425783, -328823, -34184, 180883, -116552, -120432, -137230, 471096, 18536, -130798, -316090, 216803, -20480, 57713, 12335, 118595, 41199, -185776, 371892]
18164b77266P3724C4288a2568m11270J84139p64a0647j44082b4334A49782K6320
18153A76102o5818c7318k88292a53484j45392e1510k47844h5453f97B84482o1234
18142B23248i5046m14775d2986d502j38439a3962n4291j3330B11516D7945a64820
18130f4034q8073C10196b07227G3655O7060M5174o3966L6808b61968A12702h5965
18118b71128e8462k9593N262B57167b11891C43585a32232I4730b0612C3051J75528
18107B08579l9217L8330Q2874e0412B58996c0205D53844A84627c88844J26378
18097b62466B03154a12121n3168A9982f3270A08471O7433c16378a299E1593c30307
18085b82098B4454b44972g3281i669j4796j58856N8354H5298L4223n909b86091
$$ y = [-277266, -203542, 34288, -12568, -423838, -239699, -240463, -10647, -154729, -24334, 149782, 176102, 110284, -37318, -325610, -153484, -298876, -51510, -299354, -85453, -697, 284482, 223248, -95046, -509821, -42986, -4502, -142941, -13962, -68253, -81583, 211516, 47945, -164820, -64034, -152107, 310196, -207227, 73655, 140715, 185889, 121923, 158731, -261968, 112702, -85965, -271128, -58462, -88055, -82793, 257167, -211891, 343585, -132232, 94730, -20612, 33051, 208579, 169362, 207692, 290566, -50412, 258996, -30205, 453844, 184627, -388844, -262466, 203154, -112121, -165289, 19982, -63270, 108471, 175904, -316378, -1299, 51593, -330307, -282098, 24454, -244972, -73281, -9669, -24465, -183321, -124967, 85298, 119521, 113612, -286091]
18073B07423G5500J01260L4471i6388M1474j67095j94605A72967h2183b2460l670
18062b6130k30329B26372j12284d0051B47686B0725L11788d5626G3133a06231
18051a2754A41250J16669n4606M8272f7493K0083n6256k49A7843a16754F292b49231
18038D6249P5600D4552J19978G627M8718b54682i1284c354j45889g2122I4202
18026A38201c72958h0896o5502p6219B31166F1162J796b2450j6389j89739h3960
18014a68259F5057d20863A57200P7397a58166C1736A0503a714A6007e3919o8473
18003a22392l2898H8801a61659A66543a81104K042C00866a10140A22300J6820
17993A39120E0416R9529g7451j39655j78100A49601b82170e1015H0880a46267
$$ y = [207423, 75500, 176760, 211231, -96388, -54914, -222009, -416614, 172967, -82183, -22460, -26130, -256459, 226372, 114088, -40051, 247686, 20725, 332513, -45626, 73133, -106231, -12754, 141250, 257919, 203313, 251585, -67493, -47410, -103666, -103915, 17843, -116754, 6292, -249231, 46249, 121849, 44552, 164530, 7627, 56345, -254682, -91284, -3354, -149243, -72122, 94202, 138201, -372958, -80896, -146398, -222617, 231166, 61162, 62958, -22450, -38839, -228578, -83960, -168259, 65057, -420863, 157200, 234597, -158166, 31736, 10503, -1714, 16007, -53919, -122392, -155290, 88801, -161659, 166543, -181104, -179062, 300866, -110140, 122300, 139120, 50416, 149945, -77451, -217106, -395206, 149601, -282170, -51015, 80880, -146267]
17982H4147p414b7299A32038f4806j94782B25011f7823B5191G861O3151b71335
17970e0183q8162O7583p8538K2658D6373K35418a12021A42415a70611o7394O2208
17959a75797L8353j4419G9671a14668C16164a94529F4203K01745q866h8018l04195
17948c92213a41677B09622a6454k50960d6741J3523j02790A5431J00198h5951
17937a99931I7397A4845P89g7851m9283A0558R1352d52880F1945j4623A8677D961
17924B05829b90424J40824e1652A94227a69427b2954l13510a10556k15300b143
17913a646j14630E5441L44067b82423a3740j0433m6592r4388a8968B90999a85395
17901A77153D7170h2207l8147B18500J6294c8112f046k7113j40244F5458k7362
$$ y = [84147, 76733, -27299, 132038, -64806, -259588, 225011, -67823, 25191, 7861, 71012, -271335, -50183, -138345, -70762, -149300, -126642, 46373, 281791, -112021, 142415, -170611, -238005, -175797, -137444, -151863, 79671, -114668, 316164, -194529, 64203, 265948, 257082, -88018, -392213, -141677, 209622, -16454, -267414, -46741, -33218, -136008, 15431, 115629, -85951, -199931, 97397, 14845, 15634, -77851, -127134, 10558, 101910, -452880, 61945, 47322, 18677, 4961, 205829, -290424, -149600, -51652, 194227, -169427, -22954, -336464, -110556, -325856, -2143, -1646, -116276, 55441, 399508, -282423, -13740, -24173, -70765, -165153, -18968, 290999, -185395, 177153, 47170, -82207, -120354, 218500, 234794, -38112, -6046, -33159, -173403, 65458, 38096]
17890C8096a32534k3769d2796j46318n4353b8456M256p2242D7205J71627a2219
17878a26655B06165a72080C0441h0848p3945A77414d19883a44506B9117J51551
17868A80668d3658j09570c5615D0035a63812B4983a44019A83637C7409J04278
17858A41687e1383j00979C55420i2366B36886d3247H2809M3264a07515m14166
17848e21681B92865B7644O4830a13134N4693p2926C7575J77533a30076p7397A844
17836A80026b04975r8530a05228A55171a75074H5295R7118a95585Q0303c3982
17825c73459D6639b0102p1821B96574D8686Q7157J44160b45305A03623J10789
17815B14412b22183B46212d8467j70832A4409P4143a72156D6766a14888C55994
$$ y = [38096, -132534, -156303, -42796, -189114, -243467, -28456, -24200, -96442, 47205, 218832, -12219, -126655, 206165, -172080, 30441, -80848, -154793, 177414, -419883, -144506, 29117, 180668, -43658, -153228, -35615, 40035, -163812, 24983, -144019, 183637, 37409, 141687, -51383, -152362, 355420, -92366, 236886, -43247, 82809, 126073, -107515, -521681, 292865, 27644, 92474, -113134, -58441, -131367, 37575, 215108, -130076, -207473, 1844, 180026, -204975, -303505, -105228, 155171, -175074, 85295, 182413, -195585, -115282, -33982, -373459, 46639, -20102, -91923, 296574, 48686, 135843, 280003, -245305, 103623, 214412, -222183, 246212, -48467, -219299, 14409, 88552, -172156, 46766, -114888, 355994]
17804H7329a16709j89158A8527i8609D7198N2384b88660g9527F6065c01218A39115
17792A68613h1901G048K48898a00834d0364A8402K38928j18334j7791M2101B1771
17780b82360a03606A7291f1248Fa17102E9883A6548K31156b36432F9804c32793
17768F3877a42226K5325j34912A54396d72882A6973J3830e4380F2753B2885a6240
17756i3785A7528g99p9928A83922J40028A35383K74764A04229f9933r5660D21016
17744I8691b22782A34289b72813A85961G307a81594d9642C820R5469J03923b56345
17732a60795j64189h00j83983B03046a54576j2046A33838l4602k0263N2943l3511
17721I8405d18011C34950E2451L56013j43122I1980i7888k62697B26435f3550
$$ y = [87329, -116709, -305867, 18527, -98609, 47198, 99582, -288660, -79527, 66065, -301218, 139115, 168613, -81901, 7048, 255946, -100834, -40364, 18402, 257330, 138996, 121205, 163306, 21771, -282360, -103606, 17291, -61248, 6, -117102, 59883, 16548, 247704, -236432, 69804, -332793, 63877, -142226, -116901, -251813, 154396, -472882, 16973, 30803, -54380, 62753, 22885, -16240, -93785, 17528, -799, -80727, 183922, 323950, 135383, 410147, 104229, -69933, -165593, 421016, 98691, -222782, 134289, -272813, 185961, 7307, -181594, -49642, 3820, 99289, 203212, -256345, -160795, -324984, -800, -184783, 203046, -154576, -166622, 133838, 99236, 78973, 131916, 98405, -418011, 334950, 52451, 408464, 265342, 91980, -97888, -360585, 226435, -63550]
17710E8005l105K94720A28831r332d4097j48054l62247H2970J32792G834M1698
17699D9532c55664f747H8736J33261H3700a50606a9811m7851B17619I6587N246
17688A01833M064M819J83450f5983k1537J0236j26170A1502P9622h1333j19749
17677b01082A94655f9481o0672N6271f776A34833J02505a92878C0360J06368C2380
17665e2601F4020M00599A7h1009l3521G645d0365H8209P3968J059j2341G3923
17652a53361A20234e7787A92762a7248o5443m2057E8840A294b42024A58915d782
17640b90581A01786f472A76088c35237a53484C37714q9746j11873J53041a2740
17629B26356D9010c90360b6313j70474I8712a47539L9637K6715j86966K8135A3015
$$ y = [58005, 54900, 349620, 128831, 119499, -44097, -192151, -554398, 82970, 215762, 7834, 49532, -355664, -6747, 88736, 221997, 83700, -150606, -19811, -67662, 217619, 96587, 101833, 105897, 110716, 294166, -65983, -87520, -77284, -203454, 11502, 91124, -81333, -201082, 194655, -69481, -130153, -73882, -6776, 134833, 237338, -192878, 30360, 136728, 32380, -52601, 64020, 464619, 17, -81009, -114530, 7645, -40365, 88209, 162177, 163236, 150895, 73923, -153361, 120234, -57787, 192762, -17248, -82691, -124748, 58840, 1294, -242024, 158915, -4782, -290581, 101786, -6472, 176088, -335237, -153484, 337714, 247968, 136095, 289136, -12740, 226356, 49010, -390360, -26313, -196787, 98712, -147539, -107902, -81187, -268153, -240018, 13015]
17617g29B39343A16603g1969H2373B0288a10798A79063b89860H4214Q630b41566
17605d8161A37801O4534H9693D360a49028D6386N7973b32976B39434b3361D3735
17593A03078J26391K22732A94271J50183A41784F1323c22617i4698j76548B02643
17582H3540k5923a04964a9111m9524K7404A5519b8921E338b94679a3430B83618
17570A03061J22853a09722B735J44327b41445A69972J55368A48823n1698b59521
17559A18156i0096A37263K2227L9270p7717c17637I1282l9181b7581F0545a03507
17547e8235A28549m4079l1752b36713B02606d5136l1780A85366l5677E6542J80655
17536B37197e0216m9061j44353A67887J27117B8497J22288j1747F8964P3484Q497
$$ y = [-729, 239343, 116603, -71969, 82373, 20288, -110798, 179063, -289860, 84214, 92844, -241566, -48161, 137801, 202335, 89693, 4360, -149028, 46386, 104359, -232976, 239434, -23361, 43735, 103078, 229469, 452201, 194271, 344454, 141784, 61323, -322617, -94698, -271246, 202643, 83540, 57617, -104964, -19111, -68635, -41231, 15519, -28921, 5338, -294679, -13430, 283618, 103061, 225914, -109722, 2735, 147062, -241445, 169972, 325340, 148823, 97125, -259521, 118156, -90096, 137263, 159490, 198760, 121043, -317637, 91282, 52101, -27581, 60545, -103507, -58235, 128549, 84470, 52718, -236713, 202606, -45136, -76916, 185366, 149689, 56542, 237197, -50216, -99277, -243630, 167887, 295004, 28497, 150785, 139038, 68964, 142448, 150945]
17525A50945L8505H1923c5459J1610H0246J60860i6377A90092L1926K02229H7952
17513b06337G9078B2532J20197K11785a9807k91570i2496L2463A66170b2864k32277
17502b55141k73198B32207H6926a83598B67421c86523A25558L0498A4470J28836
17492A43306j6389K16586c5049A40344a0976C081b3361m7401l0757l08183C88860
17480C6135J24511c5972D5047Q2018Q4017h908B09190J23730a1363k3889j25756
17469a61008B32424L2103a41275b6280C48236a9433A31090J43742b0754A22026
17458B14343M2286c5241J6383A51212K1014g6264B53758H626N0511M6916R5398
17447B01451R6436J18055j66789j07249a78759H4976C1692L33707R5105A86990
$$ y = [150945, 189450, 81923, -35459, -23849, 80246, 241106, -96377, 190092, 222018, 424247, 87952, -206337, 79078, 22532, 142729, 354514, -19807, -311377, -92496, -60033, 166170, -22864, -255141, -528339, 232207, 86926, -183598, 267421, -386523, 125558, 156056, 14470, 143306, 126917, 343503, -35049, 140344, -10976, 3081, -23361, -70762, -101519, -409702, 388860, 36135, 160646, -35972, 45047, 127065, 211082, -8908, 209190, 332920, -11363, -35252, -161008, 232424, 264527, -141275, -26280, 348236, -19433, 131090, 274832, -20754, 122026, 214343, 256629, -35241, -18858, 151212, 172226, -76264, 253758, 8626, 59137, 106053, 201451, 297887, 415942, 249153, 141904, -178759, 84976, 31692, 365399, 460504, 186990]
17436a14553E02481j85109b11463C96074j96398K8161a27439g469D9090b63585
17425C5053J71262Q0888r1140K48380B05369C3595K68516j4236j9871J45499j55415
17414B58088L6864I5595j9415L50030n0796G7558N0094J10204g7812J6276B10131
17402g4354j20860C59963a05635B10506b32910A04324B1276g0701j81449B36806
17391C07611F0734P0501m7388J67273j22691j1293L68876B33538e0938C85201
17380a47885D54888q0261A68122a9502B87012A9110K68454j29159a5685C21927
17369B87774c32056C90628E5564A4842M56358A95690p9005a4750B85873F4617
17358A38211m2234J29939j09335J8008J60527j29032m6170l8853J2902J86588
$$ y = [-114553, 502481, 317372, -211463, 396074, 199676, 227837, -127439, -7469, 49090, -263585, 35053, 206315, 287203, 196063, 444443, 205369, 33595, 302111, 287875, 268004, 413503, 258088, 294952, 95595, 76180, 426210, 375414, 77558, 127652, 237856, -77812, -61536, 210131, -74354, -195214, 359963, -105635, 210506, -232910, 104324, 21276, -70701, -252150, 236806, 307611, 60734, 131235, 83847, 251120, 128429, 117136, 486012, 233538, -50938, 385201, -147885, 454888, 374627, 168122, -19502, 287012, 19110, 287564, 158405, -15685, 321927, 287774, -332056, 390628, 55564, 14842, 471200, 195690, 116685, -14750, 285873, 64617, 138211, 95977, 225916, 116581, 134589, 295116, 166084, 119914, 81061, 93963, 280551]
17348B80551j31761N5719l5135n4586E2167J8878K59807j4203k2603J05493J05764
17337E05303p0440A13188K79688j85895N4936B7668A663O2376d3670C45787e1915
17325c20538A68208q3043j041J06517a5774B37577J21099J15941A55193b60084
17314A16808J59227b0786G4801f1254e74p7751B15878j7638k9454o6055J38094
17303B40825J19907h0665q5519e3491A89626R8417K02116k8239A57435J40339
17293B97774I0847J29721J24977Q3842A01182a32694c1341G9353K38878j09255
17283B08976f0089E56457A85417K19759A98857L56914A33310R0651k6322l8055
17273A59584k1693N9627K16127j07100A44175b2201C30785J6109i7615D07966
$$ y = [280551, 148790, 204509, 169374, 114788, 52167, 71045, 330852, 316649, 294046, 399539, 505303, 434863, 113188, 392876, 206981, 261917, 27668, 1663, 64039, -43670, 345787, -51915, -320538, 168208, 85165, 84124, 190641, -15774, 237577, 358676, 474617, 155193, -260084, 116808, 276035, -20786, 74801, -61254, -574, -78325, 215878, 198240, 168786, 102731, 240825, 360732, -80665, -166184, -53491, 189626, 288043, 490159, 461920, 157435, 297774, 90847, 220568, 345545, 429387, 101182, -132694, -31341, 79353, 318231, 208976, -60089, 556457, 185417, 405176, 198857, 555771, 133310, 223961, 197639, 159584, 137891, 197518, 413645, 306545, 144175, -22201, 330785, 346894, -97615, 407966]
17262A77591K68800G9140Q6995J55324j02606L824B5413K36133j26500e1837j26758
17251a78595B07260k0602b10824A10344M0720b20547C23172A43375J29530M3311
17241C16216J4344a62208B99120e111D08806B1553J08440O2689J20873r1454h8648
17229A11833L04446a3596n5627B02086k2674J48129K12285A80400n0185B0861
17218A82724n1309n3366B4825Q1840a59348A7631L69119j05414A28694a64059
17207D2665K07563L1120A09740P01063E9810K7744O7748K70352J29084A62021
17196C45580p0975A26354K48528j15303J34241A52737C574K82101L8264A60160
17185E07497j93149K7381q9221J9555j34337a51935A60064K14430e5938B25668
$$ y = [177591, 446391, 79140, 166135, 321459, 218853, 222677, 25413, 261546, 135046, -51837, -178595, 207260, 186658, -210824, 110344, 151064, -220547, 323172, 143375, 272905, 316216, 330560, -162208, 299120, -5111, 408806, 21553, 129993, 192682, 313555, 222101, -88648, 111833, 416279, -13596, -69223, 202086, 179412, 327541, 539826, 180400, 130215, 20861, 182724, 131415, 78049, 24825, 106665, -159348, 17631, 386750, 281336, 128694, -164059, 42665, 250228, 281348, 109740, 810803, 59810, 87554, 155302, 425654, 554738, 162021, 345580, 274605, 126354, 374882, 259579, 393820, 152737, 3574, 285675, 323939, 160160, 507497, 314348, 341729, 252508, 272063, 137726, -151935, 160064, 374494, -55938, 225668]
17174B00421Q5503j33879P0346b8134B05154G6820C8366L19187j39354J9881Q2999
17163C21079n5933K54136e9739B51591q4769B7742K21894J5213A5529J66982M89960
17152F72471j93860A33438D9649M09289B22358n5594O1768N4289J5208n2957N37386
17141G82458B25073E5402J52198n7652j1629m974J4816M56914J8597k46801P496
17130C84367r3285M05736E5742N61505k28637j87625q8988J98544A29146R7462
17120B26608J31482A32536K72024j71265J77493H9700m4795K91568M6170n8094
17110C24549j6354J87367B17553M13890R7526A83186l4580N24003B12719J4131
17100B26850L17557K95489A50704R4093J41242J31456l6863J05819A14754J79105
$$ y = [200421, 285924, 152045, 222391, -28134, 205154, 76820, 38366, 357553, 218199, 238080, 321079, 265146, 519282, -59739, 251591, 166822, 27742, 249636, 264849, 15529, 182511, 672471, 478611, 133438, 49649, 458938, 222358, 166764, 228532, 282821, 298029, 245072, 782458, 225073, 55402, 207600, 149948, 138319, 133345, 148161, 605075, 623672, 376871, 384367, 291082, 696818, 55742, 617247, 388610, 200985, 111997, 310541, 129146, 226608, 358090, 132536, 404560, 233295, 410788, 89700, 44905, 336473, 382643, 324549, 308195, 495562, 217553, 631443, 728969, 183186, 148606, 672609, 212719, 226850, 544407, 839896, 150704, 244797, 386039, 517495, 480632, 586451, 114754, 293859]
17090B93859Q1940K0082A33781K20206j25923J99320q8587J02035n7536j16428
17080B66868J12316j11313L24229B30280R8574Q9691l1312R7574j75706K99759
17070F08860k17046L42556q4951j41246r8592A85244J22282J29464a3393E42296
17059D41788k17583Q3012P4478M74488k42168K3293k21358J46450B73120K71607
17049E44727J60918k89924M18171k35327A60199J85937J05964J12714j25175n508
17039D34131J28787j12226K11053k72476L46488C29845K66627k18205J18071N5936
17029E52274J96556k19076J65691l19968J69925J07301q073K75233D55620J58065
17019F13685R3183j15599L01304k09108N4990j48772J02571j48094K5351n4530
$$ y = [293859, 375799, 395881, 133781, 353987, 228064, 427384, 338797, 440832, 383296, 266868, 379184, 267871, 592100, 230280, 328854, 418545, 387233, 484807, 309101, 608860, 391814, 734370, 649419, 508173, 409581, 185244, 307526, 436990, -13393, 542296, 441788, 224205, 307217, 381695, 856183, 614015, 637308, 415950, 562400, 273120, 544727, 705645, 415721, 833892, 598565, 160199, 346136, 452100, 564814, 439639, 434131, 562918, 450692, 661745, 389269, 735757, 329845, 596472, 378267, 496338, 552274, 748830, 529754, 695445, 375477, 545402, 652703, 644630, 919863, 455620, 613685, 706868, 591269, 892573, 683465, 738455, 589683, 692254, 544160, 569511, 514981]
17009E14981M78807C64817N66843m29413L23059j24865J1474l28261J34335J60530
16999F78519k37766P9815L02739r0190J1014m8900k53486K97103r7947j34293
16989E06608K72311K36536k21495N2070L9728j2517k1368J76814k95043K00203
16979I33847j19385r9441k18455L30585j17425j08289M46139m1779m7289m44025
16969E14483N5952K86194j88463K55049k97705J61890L31993m30531j55K18716
16959I07423n6396K14266K83051l88424l51324M2091M09503k10293J59118k95106
16949G13909k36789L61274N58123j75510j50931l40349N17035j32033k10058M76457
16939A381128o61879J83183L87840L1765n3748L30951l63826j65326j79060J91391
$$ y = [514981, 993788, 364817, 931660, 502247, 825306, 700441, 711915, 383654, 517989, 678519, 440753, 520568, 823307, 733117, 744131, 695231, 441745, 738848, 640901, 506608, 778919, 1015455, 793960, 846030, 885758, 873241, 851873, 1028687, 733644, 933847, 814462, 715021, 496566, 827151, 709726, 601437, 1047576, 1005797, 958508, 514483, 570435, 856629, 668166, 923215, 625510, 787400, 1119393, 688862, 688707, 907423, 851027, 1065293, 1348344, 959920, 608596, 650687, 1060190, 849897, 1009015, 713909, 477120, 838394, 1396517, 1221007, 1070076, 729727, 1246762, 1114729, 904671, 1381128, 719249, 902432, 1290272, 1322037, 1268289, 1599240, 1235414, 1070088, 891028, 1082419]
16929A082419N9856Q9984K08276k51283K20801j24097l68590K78722j00049K89387
16919A385426n751p1994K20271j71066p6808Q2420l2084J83899J37761k52112
16909A399962j427J92272k82938N39913m40008J15536J18719J84473k89895J59160
16899A695767l89958J55075M62668m32674K69551j0187K6419k23508K01209L15225
16889B069587l11863M24141k05198k05246Q9741J38768m637J37250o4194J15995
16879B184344j18117l55265O63664l16829J57084k1329k69483N24297k86832J97617
16869B359151k35605J8672K29019k38592M18816j90010K83550K15115j22772k16240
16859B521104R3298M84883k52036l6058k18828l8838M00390K48799P4316o8904
$$ y = [1082419, 1142275, 1232259, 1440535, 1189252, 1410053, 1285956, 917366, 1196088, 1096039, 1385426, 1379675, 1307681, 1527952, 1356886, 1280078, 1362498, 1330414, 1514313, 1652074, 1399962, 1398535, 1590807, 1307869, 1847782, 1407774, 1523310, 1642029, 1826502, 1536607, 1695767, 1305809, 1460884, 1923552, 1490878, 1760429, 1750242, 1776661, 1553153, 1754362, 2069587, 1757724, 2181865, 1976667, 1771421, 1861162, 1999930, 1995293, 2132543, 2068349, 2184344, 2066227, 1710962, 2374626, 2057797, 2214881, 2193552, 1924069, 2448366, 2161534, 2359151, 2123546, 2142218, 2371237, 2132645, 2551461, 2361451, 2645001, 2860116, 2737344, 2521104, 2614402, 3099285, 2847249, 2811191, 2592363, 2553525, 2953915, 3202714, 3277030, 3208126]
16849C208126j61018O756M45697k3028l18798m7616J79539K51780J23638o2131
16839C602945J90223K7092J33923o5562l0433p1344J91224j11782L05227l50769
16829C820744L79386J68960j48135Q056o3974J47154N23903k23314m5397M92778
16819E060161M3578j72876K29047p9318M35547O5297j66837M84632J7250j10080
16809E806401q7071L20915K89442J54935J98604j40033R6768O28350k20005K90781
16799G339087j94054O26542M32647p0833K62341J35576L21951o764M54119K68967
16789I569579J93382K34444J18361O70454J8522j03632R12886J97440J72297K67155
16779A2250888L64569N87162O7992M24619R11256N44373Q3725N76439O57293N01793
$$ y = [3208126, 3047108, 3053864, 3499561, 3476533, 3157735, 3110119, 3289658, 3541438, 3665076, 3602945, 3793168, 3820260, 3954183, 3888621, 3858188, 3786844, 3978068, 3866286, 4171513, 3820744, 4200130, 4369090, 4220955, 4229011, 4165037, 4312191, 4836094, 4612780, 4567383, 5060161, 5103739, 4930863, 5159910, 5080592, 5516139, 5581436, 5414599, 5899231, 5916481, 5806401, 5719330, 6040245, 6329687, 6484622, 6683226, 6543193, 6639961, 7268311, 7048306, 7339087, 7145033, 7771575, 8204222, 8133389, 8395730, 8531306, 8853257, 8846493, 9300612, 9569579, 9762961, 9997405, 10115766, 10786220, 10804742, 10701110, 11613996, 11811436, 11983733, 12250888, 12615457, 13202619, 13270611, 13695230, 14606486, 15150859, 15234584, 15811023, 16468316, 16970109]
16769A6970109N63249P22792O56403N27622R43989N35274Q52003J048558O79682
16760B3499681Q22372J138306R26294J271518J156237J002173J537432J537738
16752C2891751J523766J495326K145521J158774K015035K536744K090198K548247
16744D8405362K444046K857148K754212L309346L317196L903504L939785M761290
16736G5691889M523129N227782M903256O153329O021148P064561O771130P457226
16728A23813450P967212Q363280Q396604R078349Q449763Q697561Q633133P930476
16720A91329828P517267N926717N019261L751378J786498O74801j308918k483846
16712B12212986m205174n736637o871924p788714p914568q866606r179410r134484
$$ y = [16970109, 17533358, 18256150, 18912553, 19440175, 20384164, 20919438, 21771441, 22819999, 23499681, 24322053, 25460359, 26386653, 27658171, 28814408, 29816581, 31354013, 32891751, 34415517, 35910843, 38056364, 39215138, 41230173, 43766917, 45857115, 48405362, 50849408, 53706556, 56460768, 59770114, 63087310, 66990814, 70930599, 75691889, 80215018, 85442800, 90346056, 96499385, 102520533, 109585094, 116356224, 123813450, 131780662, 140143942, 148540546, 157618895, 166068658, 174766219, 183399352, 191329828, 198847095, 204773812, 209793073, 213544451, 215330949, 216005750, 214696832, 212212986, 208007812, 202271175, 195399251, 187610537, 179695969, 170829363, 161649953, 152515469]
16704A52515469q563297q651368q370512q103440p105708p152683o882215o329457
16696I1356789n464700n374098m863842m175525m553143l757987l798848l627231
16688E5741415k833890l066790k307931k918583k368689j976510j788683j790905
16680C6689434j948289j622633j686677j366852j426938j536936q77652r13620
16672B5309837j526900q66421o63572r61240r03576p54269n05767j011495o46349
16663A7470248j96737q76129m50326q73507l08688p92955o50767j4858m24181
16654A2882100m25986j88741m98613n93072m28366O2047l78540k05887l59774
16645I865168m9624l01917p41544k250m57420R7870k76621j15510l63874k61457
$$ y = [152515469, 143952172, 135300804, 126930292, 118826852, 111721144, 104568461, 97686246, 91356789, 85892089, 80517991, 75654149, 71478624, 66925481, 63167494, 59368646, 55741415, 52907525, 49840735, 47532804, 44614221, 42245532, 40269022, 38480339, 36689434, 34741145, 33118512, 31431835, 30064983, 28638045, 27101109, 26223457, 25309837, 23782937, 22916516, 22252944, 21291704, 20388128, 19633859, 19128092, 18116597, 17470248, 17273511, 16397382, 15947056, 15073549, 14764861, 13971906, 13321139, 13306281, 12882100, 12456114, 12267373, 11768760, 11175688, 10747322, 10809369, 10430829, 10224942, 9865168, 9815544, 9513627, 8772083, 8769833, 8312413, 8410283, 8133662, 8018152, 7654278, 7392821]
16635G392821k26621j15019j78529k57685j9791j90131j27243m12702J18300N7141
16625F040541l18538k69590k08072L49884k86870k99372L256J55679o90652K23217
16615D699483j43410j23816K9982n3996P5139l32827p6103J11120l89911M9475
16605C845136q6423N9090j76836l2439p3787j64014l36680m1465J86553k05516
16595B973619K17778l18948j99194L86595k29667p1562j01800N8647k18935L28188
16585B824721q2748q1296k42675J50464N599k94119L24460j34292o7906J61749
16575B563957p68465M56612J5611J42062K47810n49033l04218K32421l2457M624
16565B008924k02053J56602k2805Q1956j55367j13301J15951K22087n49311J51850
$$ y = [7392821, 7166200, 7051181, 6872652, 6614967, 6595176, 6405045, 6277802, 5865100, 5983400, 6040541, 5722003, 5452413, 5244341, 5594225, 5307355, 5007983, 5011239, 5166918, 4476266, 4699483, 4556073, 4432257, 4462239, 4408243, 4483382, 4150555, 4074452, 4185572, 3795661, 3845136, 3758713, 3817803, 3640967, 3608528, 3534741, 3370727, 3034047, 2992582, 3179135, 2973619, 3191397, 2872449, 2673255, 3059850, 2830183, 2758621, 2656821, 2715468, 2496533, 2824721, 2741973, 2660677, 2418002, 2568466, 2574065, 2279946, 2604406, 2470114, 2402208, 2563957, 1795492, 2252104, 2267715, 2409777, 2657587, 2108554, 1804336, 2036757, 2004300, 2008924, 1806871, 1963473, 1940668, 2022624, 1867257, 1753956, 1869907, 2091994, 1542683, 1694533]
16555A694533j47894J14042j04768L49283n9687J51148o02319O1267j79427K35041
16545A511219K028j61700M01368m92077K11870J68789k22913j7218k69021J77350
16535A309695R1534q7370k43863K13181k08251J47539k24583o0911L16535j95865
16525A057641J05094l4385L55641r8479k16684j09150k18058L45242l48827Q7931
16515I25966J85557m18754J24457M2588M6207K04034r9973m6378Q6461j08378
16505I41787k53956L55174j25305j1216J86383J31569n19825J73484k34946N898
16495F49047L57198k54862J99677j36776j51280J44787k25658j48454K99074Q9683
16485H22436p7480L0225l17908P06657n39963L14424Q1914m16144j64944J97669
$$ y = [1694533, 1546639, 1660681, 1555913, 1905196, 1845509, 1996657, 1394338, 1455605, 1276178, 1511219, 1513247, 1351547, 1752915, 1260838, 1472708, 1641497, 1418584, 1401366, 1132345, 1309695, 1401229, 1313859, 1069996, 1283177, 1074926, 1222465, 997882, 936971, 1253506, 1057641, 1162735, 1128350, 1483991, 1385512, 1168828, 1059678, 841620, 1186862, 838035, 925966, 1111523, 692769, 817226, 859814, 906021, 1110055, 1010082, 963704, 1050165, 941787, 687831, 1043005, 917700, 906484, 1092867, 1224436, 704611, 878095, 643149, 649047, 1006245, 751383, 951060, 814284, 663004, 807791, 582133, 433679, 732753, 822436, 744956, 775181, 457273, 1163930, 623967, 938391, 1020305, 604161, 439217, 636886]
16475F36886l3092J47529l00535K72872C31158J82350j16581M38907l38224j96790
16465C00820M25640k94155J99045k48910J32463j72161p3711L54028l9382j68714
16455D14963J97390j4515J18719k93838K02458O8999j66257k37511L66061j65652
16445D90817m7818J47820k94576K35544j39010n288J9205a0108E66865k21621
16435C45244q7915M74003B64511N8673A50746J54811N1392J60600J78458B85004
16424B02652Q3658A31482J61233A41925J14190K30302A66711J73769J64934m2905
16414D62509k03935L74362k01056b050C80283J40030B09884j475J00321m4098
16404B64632Q8196K00270L13480B48352R0174R588J71020j16680J0739M6960j36245
$$ y = [636886, 603794, 751323, 450788, 723660, 331158, 513508, 396927, 835834, 497610, 300820, 726460, 432305, 631350, 382440, 514903, 342742, 269031, 623059, 583677, 414963, 612353, 597838, 716557, 422719, 625177, 694176, 527919, 290408, 656469, 490817, 442999, 590819, 296243, 531787, 392777, 387489, 406694, -10108, 566865, 345244, 257329, 731332, 264511, 323184, 150746, 305557, 356949, 517549, 696007, 285004, 202652, 286310, 131482, 292715, 141925, 256115, 486417, 166711, 340480, 505414, 462509, 258574, 632936, 431880, -2050, 380283, 520313, 209884, 208409, 308730, 264632, 352828, 553098, 866578, 248352, 338526, 348114, 519134, 402454, 413193, 460153, 323908]
16393C23908J70544j77413L50276A33711Q5855K82818j79023J30570o7069A55478
16382A68371J1664K2365N8107n4240l8647J10050n1291j6423K36209K10547B05105
16370D18915N059A21279J11573p6318L00972A38147R1791j6218j06783M8185J07650
16359B62772J15026j77902b23128A80620M74559A53218J45720j21831m2166K27906
16349C62847j26106m0802l3748Q3492I7724J84374N342Q664i7038B94166J02031
16338C96197K8039j89975g8173A50454N8194J13097k4885a57990A11130O2271
16328A73401J44000G9274L64660F0245M40581C1493a29567j03224B95994j14410
16318A81584L21496k25359a9784A73242q2440l8560L6626L54990a74919A22105
$$ y = [323908, 494452, 317039, 667315, 133711, 219566, 502384, 323361, 453931, 386862, 155478, 168371, 180035, 202400, 260507, 206267, 167620, 277670, 226379, 209956, 446165, 656712, 205105, 418915, 423974, 121279, 232852, 156534, 457506, 138147, 229938, 213720, 106937, 155122, 262772, 377798, 199896, -223128, 180620, 655179, 153218, 298938, 177107, 134941, 362847, 236741, 195939, 162191, 245683, 97724, 282098, 287440, 296104, -97038, 294166, 396197, 424236, 234261, -78173, 150454, 208648, 321745, 296860, -157990, 111130, 173401, 317401, 79274, 443934, 60245, 500826, 31493, -129567, -232791, 295994, 181584, 503080, 277721, -19784, 173242, 90802, 52242, 88868, 443858, -174919, 122105]
16307A78483O9223o2466J28185I4457Q5968K43086A31852k2293P8455k087G3779
16295B6387K74580A27940a4502B51021j22473a04662B96483o3074j15935j7279
16285A00195j4287J28466q6574L99714A62952G4762J32612J64649C9556J98472
16275B38028A9001M40203C4458Q0225J48693q7519f9821B096h6276D27569H3470
16263c3800j54057g4636q5681k30328H9834m3768o557J62601h7823C76951A55493
16251C21913J23061B6225K0450E370b21205H0801P5735F9296J7976J0765J41177
16240B39214B3119b38751B44876p5714Q8449g7689G0098a36219B0388K42683H5044
16228f2886m5442n0998J8536c1958D19251A7882K41510b11294F501J89107m6334
$$ y = [178483, 247706, 185240, 313425, 94457, 180425, 423511, 131852, 109559, 188014, 185927, 73779, 26387, 300967, 127940, -14502, 251021, 128548, -104662, 296483, 233409, 117474, 100195, 85908, 214374, 127800, 527514, 162952, 74762, 207374, 372023, 39556, 238028, 19001, 459204, 34458, 114683, 263376, 175857, -69821, 2096, -86276, 427569, 83470, -33800, -187857, -74636, -160317, -390645, 89834, 46066, 39509, 202110, -87823, 376951, 155493, 321913, 444974, 26225, 46675, 5370, -221205, 80801, 156536, 69296, 87272, 98037, 239214, 23119, -238751, 244876, 169162, 257611, -77689, 70098, -136219, 20388, 263071, 85044, -62886, -108328, -159326, -140790, -31958, 419251, 17882, 259392, -211294, 6501, 195608, 149274]
16217A49274a2287m8770B80150a42329C18092r6148C3367O8126H531K28929L4681
16206B72141M947b87004G0491g8887H4247a10407n2236A19027l1077R1332C863
16194c66688E6541J33620a3097p0176C388J0959J53736a00091A2605J60039j6310
16183A56334a40928A4047a51787B5887a0865A72505F6605K42362f6999j07299
16173a74298f9607j85117B86456a48627I6517d6652a4780J567E7922j9517b30075
16161D27675l1205j34301a3092A8429J50385l4040J0639N2498p8597b30091K4691
16150b05400P2436D3673K41773h2223p4081A212J49749a99497d2471H4399K65219
16139C49618a21347A3413J5962i5242A25139h50A87610d761F9272K85208j9240
$$ y = [149274, -12287, -61057, 280150, -142329, 318092, 221944, 33367, 101493, 8531, 237460, 272141, 277088, -287004, 70491, -78887, 84247, -110407, -162643, 119027, 87950, 179282, 3863, -366688, 56541, 190161, -13097, -83273, 3388, 14347, 168083, -100091, 12605, 172644, 156334, -140928, 14047, -151787, 25887, -10865, 172505, 66605, 308967, -66999, -174298, -69607, -254724, 286456, -148627, 96517, -46652, -14780, -13213, 57922, 38405, -230075, 427675, 396470, 262169, -13092, 18429, 168814, 134774, 145413, 197911, 119314, -230091, -205400, -132964, 43673, 285446, -82223, -156304, 1212, 150961, -199497, -42471, 84399, 349618, -121347, 13413, 29375, -95242, 125139, -850, 187610, -4761, 69272, 354480, 335240]
16128C35240A25879b25024a1724A6044b09077e6551j76473A14113J08206J4793
16118B37112G2995M8922b56937c9371B31657e3968k3481I2147M7805a02222d9666
16106F4217P9902J5564c67035B9989Q3246N362k5688J77027r4256q4770C0680
16094d19638B93504A14734a31342F524J98027b31765B33089g3599j21691d1439
16083f5852a9610A85185a75484A15142b49048l8685j70886e5105k64369a46029
16072a99967D5095K24547a90078g0187F2102J1086O5518a08159l54677a92910
16061D2112c21515c8213m7106J3466i909j07161G790L5195c2323k17891a03323
16049B89120A27104P2542f1197j62298b1794A43184i7343j84199e9200b5181N638
$$ y = [335240, 125879, -225024, -11724, 16044, -209077, -56551, -233024, 114113, 222319, 237112, 72995, 121917, -256937, -39371, 231657, -53968, -77449, 92147, 139952, -102222, -49666, 64217, 144119, 159683, -367035, 29989, 113235, 118597, 92909, 269936, 175680, 90910, 30680, -419638, 293504, 114734, -131342, 6524, 204551, -231765, 233089, -73599, -195290, -41439, -65852, -19610, 185185, -175484, 115142, -249048, -287733, -458619, -55105, -319474, -146029, -199967, 45095, 269642, -190078, -70187, 62102, 73188, 138706, -108159, -462836, -192910, 42112, -321515, -38213, -85319, -71853, -9909, -117070, 7790, 42985, -32323, -250214, -103323, 289120, 127104, 199646, -61197, -223495, -21794, 143184, -97343, -281542, -59200, -25181, -19543]
16038a9543j92552d8870k3765c2023G1517M1936c0868B13012a67008j58056a1994
16026B1589J03610Q2675b94181E0907K22693a0659C5111J39391a28229k5230C8425
16014g6478q3832A81675c07819P6997H0425Q1742a2799r0777A14973J91209K5729
16003C31911A55041m2765a71448a010A8716a95699A21004b29159L3308H4974J02164
15992A87138d0669A01458i6610B60428a8995C24226E4959J0151R462J80309A4
15980C52705J30164H3497N5235J49726A27439L4181a90985A5707c53351J7007
15970c36344F0501c14449a53512E0408i7013j09836K0741A15964a90755P3443
15960a17312d8493H2890a80484a2566j42713k09686F2096a57565A34979e5605
$$ y = [-19543, -212095, -48870, -72635, -32023, 71517, 113453, -30868, 213012, -167008, -325064, -11994, 21589, 125199, 207874, -294181, 50907, 273600, -10659, 35111, 174502, -128229, -153459, 38425, -76478, -160310, 181675, -307819, -230822, 80425, 162167, -12799, -103576, 114973, 306182, 331911, 155041, 112276, -171448, -1010, 18716, -195699, 121004, -229159, -195851, 84974, 187138, -40669, 101458, -96610, 260428, -18995, 324226, 54959, 65110, 74572, 254881, 14, 352705, 482869, 83497, 138732, 288458, 127439, 161620, -190985, 15707, -353351, -336344, 60501, -314449, -153512, 50408, -97013, -206849, -186108, 115964, -190755, -117312, -48493, 82890, -180484, -12566, -155279, -364965, 62096, -157565, 134979, -55605]
15949b7824A54529J34526i4035j24035o7637F4634L6322K07126q5055K4333A11211
15937c18879J17498P9943L0125j1031d5998o7700o912A46636d2040k2193k10044
15926b74277b7712j8726m9552k00311F1622d90717A02044C7264b4329l10609A19495
15914B33406c26592C35261q6974j14716a24824d1836j78152c3117l7037A95098
15903A41098b24188B22763a10929j47733Q6789k2248h9583o3045M6329L0726H1652
15891A4198c3690l65051a55697M4305A49011f9151m3708d9953M887C211b63141
15879a56508A1565K45913r4857a09210e2532H7673g0849K6598A73646b90713i2194
15867d23j11830G9261i917j28820d9739j03861A26865J70060A20259i8269r0629
$$ y = [-27824, 154529, 289055, -94035, -218070, -285707, 64634, 100956, 308082, 223027, 247360, 111211, -318879, -201381, -121438, -91313, -102344, -45998, -113698, -120610, 146636, -42040, -64233, -274277, -27712, -46438, -95990, -296301, 61622, -490717, 102044, 37264, -24329, -334938, 119495, 233406, -326592, 335261, 248287, 133571, -124824, -41836, -219988, -33117, -70154, 195098, 141098, -224188, 222763, -110929, -258662, -171873, -194121, -89583, -152628, -106299, -75573, 81652, 14198, -33690, -398741, -155697, -111392, 149011, -69151, -112859, -49953, -45066, 3211, -263141, -156508, 11565, 257478, 162621, -109210, -52532, 87673, -70849, -44251, 173646, -290713, -92194, -423, -112253, 79261, -9917, -138737, -49739, -153600, 126865, 296925, 120259, -98269, -188898]
15856a88898e996j74037A37108E4727c1626F8461K20777a39477C66837B7066e6697
15844B22433I1652a84776d9917o9752D735b07777q3082d4070l9522B594b15288
15832d7007D7835c83037a05778k81679h7034D0641j4256i7630l447l39646F348
15820i1942k72127I3216a97682O5996c1105m640G5195d9358k29231f5105A20109
15808a97142D0857Q5430D5455a16388A36247b31247K214C58968A74700c92224
15797c0156B20848A003N762a19737d8I9817c35590J16515f7446H3791l8854M17048
15785D61985f3464l8424A11736P2197a30680j11302B04056a45211F4003K9772
15775I3775J85771i4242o8569b0709n674k74098F2056J7517b16313A12009a10994
$$ y = [-188898, -5996, -180033, 137108, 54727, -31626, 68461, 289238, -139477, 366837, 27066, -56697, 222433, 91652, -184776, -49917, -119669, 4735, -207777, -290859, -44070, -83592, 2594, -215288, -47007, 47835, -383037, -105778, -387457, -87034, 40641, 26385, -97630, -101077, -440723, 6348, -91942, -364069, 93216, -197682, -131686, -31105, -35745, 75195, -49358, -278589, -65105, 120109, -197142, 40857, 126287, 45455, -116388, 136247, -231247, -229033, 358968, 174700, -392224, -30156, 220848, 1003, 6765, -119737, -48, 99817, -335590, -219075, -67446, 83791, 44937, 461985, -63464, -101888, 111736, 183933, -130680, -241982, 204056, -145211, 64003, 93775, 279546, -94242, -162811, -20709, -26383, -300481, 62056, 79573, -216313, 112009, -110994]
15763d0949B46547r2619A8578J37049L3719E6981M6438j0217L61280a02660m8407
15752a51067I3115i4155d4327B23840C3520d950j83101A70118m5322Q3941m8023
15741A60714J0071m9454b28791A30919a75843a2284j37981K7841j78030A83134
15730a40678A38405g5200l7220j13659l2217M6504C17079a68517k04213G5685
15719b29341a13007A12839L6266i0874j35636H2888g1108A32445a00111l20727
15709d20838a377o7633m14319a59387A80249G6472c86276a52908E7835N1590f5068
15697A5635N6354l4948c70925J08099A50459M6415H7223a61862D35111a89255
15686b03373I6749h4836j65542A5230b26134D7507c21423i0447l3447F4474a33927
$$ y = [-40949, 246547, 153928, 18578, 155627, 189346, 56981, 103419, 93202, 454482, -102660, -151067, 93115, -94155, -44327, 223840, 33520, -4950, -188051, 170118, 124796, 208737, 160714, 170785, 121331, -228791, 130919, -175843, -12284, -150265, -122424, -300454, 183134, -140678, 138405, -75200, -112420, -226079, -258296, -211792, 317079, -168517, -372730, 75685, -229341, -113007, 112839, 149105, -90874, -226510, 82888, -71108, 132445, -100111, -420838, -1377, -69010, -483329, -159387, 180249, 76472, -386276, -152908, 57835, 109425, -65068, 15635, 71989, 37041, -370925, -262826, 150459, 196874, 87223, -161862, 435111, -189255, -203373, 96749, -84836, -250378, 15230, -226134, 47507, -321423, -90447, -123894, 64474, -133927]
15674A25433J3589B7210L4786J37080P990r3473J41090a6761j58823j52329E5590
15662A76007a08215G4658e9765j24577A97526d9634n6627m9354B0505K26207A04202
15650D7482A3108L00643r4132r8774a07475I5671C6526M7678a67764m1996L4063
15639a75697N9482j82705I6319d54070O4943b1361k52812L3239h5285A3388a80745
15627a38123A23374a27619B24590a08115c6262A64249h2317K7945m3950j29855
15617b28177r661N8676I5690j8150J27624i8963r1952g3446k8080L8319n3940
15606a17147D4218b10349F8770J98023B8427g1398b1133j40418H461a4194C2985
15594A94049I3822k1365B7360N63J09388f0511A91974h4698B25172c03693a50911
$$ y = [125433, 139022, 27210, 61996, 199076, 207066, 113593, 254683, -16761, -175584, -327913, 55590, 176007, -108215, 74658, -59765, -184342, 197526, -49634, -106261, -155615, 20505, 246712, 104202, 47482, 13108, 313751, 219619, 120845, -107475, 95671, 36526, 84204, -167764, -209760, -175697, -116215, -298920, 96319, -454070, -389127, -21361, -274173, -240934, -85285, 13388, -180745, -138123, 123374, -127619, 224590, -108115, -36262, 164249, -82317, -54372, -98322, -228177, -237838, -179162, 95690, 77540, 205164, -98963, -190915, -73446, -101526, -63207, -117147, 44218, -210349, 68770, 266793, 28427, -71398, -21133, -161551, 8461, -14194, 32985, 194049, 93822, 72457, 27360, 27923, 137311, -60511, 191974, -84698, 225172, -303693, -150911]
15582D19419A11439k8389b51378j46488c709j0899C50426A21092b20129H6209
15571B05129h5282c437k26027k21604B238a26194B21556c9698G2756c03202e0235
15559H6907J9527j2281K6900c63750O5471B51748E443K0231M4891R8178a45819
15547C44103b30779h9844K4596C3332b03531c3793j06447f3187A46331b80211
15536b2508k32696Q1129K2670O1577G5621b61404A27013b22640Q3252j3272G4109
15524a71902A67180O6680J1911h4856J6870K0840C5286c70554c9875D0414h3216
15512A5984i7891A94815J9985a15389B92889D0810e3932r1400B4493g6311a3721
15500h7630j44598E349N5548c61989d666r5244B65575a15459B13846F5254J11764
$$ y = [419419, 111439, 83050, -251378, -397866, -3709, -14608, 350426, 121092, -220129, 86209, 205129, -85282, -3437, -229464, -451068, 2238, -126194, 221556, -39698, 72756, -303202, -50235, 86907, 106434, 94153, 121053, -363750, -298279, 251748, 5443, 25674, 70565, 168743, -145819, 344103, -230779, -89844, -65248, 33332, -203531, -33793, -140240, -63187, 146331, -280211, -22508, -255204, -174075, -151405, -89828, 75621, -261404, 127013, -222640, -139388, -152660, 74109, -171902, 167180, 233860, 245771, -84856, -67986, -47146, 35286, -370554, -39875, 40414, -83216, 15984, -97891, 194815, 214800, -115389, 292889, 40810, -53932, -145332, 24493, -76311, -13721, -87630, -232228, 5349, 60897, -361989, -4666, -99910, 265575, -115459, 213846, 65254, 177018]
15489A77018b50046E091O5967O8983o2969a29427A03921D4477J40057d7655E0620
15477a54574n509P3307j09212I2519j3236b48205A03537a70828F2161K55780d7970
15465F2865K4751J34606i2703A22684e3607J5596C84685C0927b5407j02793G0993
15453A76627g2580j5520o5997O1172J1552k32114e1424A33297c9054C1335b01647
15441B14P6880a20905K6450n7927B67038b91487A61399b62871M3162E0678g7985
15429F498J30496b40730B0956L51788a42082M4369k31381R9325a0966k06378B38399
15417A63863a8521k42101i4869j13215A9071P2384g784C51504i36q4837B46446
15405B32446A13722a58689C0174c9459J3655A0178h9052A12467j1234f0898a8060
$$ y = [177018, -250046, 5091, 71058, 140041, 77072, -129427, 103921, 44477, 184534, -47655, 50620, -154574, -160083, -86776, -195988, 92519, 79283, -248205, 103537, -170828, 62161, 317941, -47970, 62865, 87616, 222222, -92703, 122684, -53607, -38011, 384685, 30927, -25407, -128200, 70993, 176627, -72580, -88100, -154097, -92925, -81373, -313487, -51424, 133297, -39054, 31335, -201647, 214, 77094, -120905, -94455, -152382, 267038, -291487, 161399, -262871, -219709, 50678, -77985, 6498, 136994, -240730, 20956, 372744, -142082, -97713, -329094, -229769, -10966, -217344, 238399, 163863, -18521, -260622, -94869, -208084, 19071, 91455, -7784, 351504, -936, -85773, 246446, 232446, 113722, -158689, 30174, -39459, -25804, 10178, -89052, 112467, 101233, -60898, -18060]
15393a13502B41582j10069d9304j90136L0127o6391F3841b13252A6223L8318O0077
15382A14618a20730L8205E7651A464J01034g0732j08506e126A20246b83897D9092
15370C94700a37554P063N0514A00081J8774a7673k14656c9850j2680A36492d08433
15358f2064A54781A284P2417K29580c95655J66554B39130a73070b8637m6713j79420
15347b54770D10153h8481A70830B6594a29203C50987I7429O4521a6155j9984k6964
15336f3103F7097J0091a49910d8357O955B3288a65617j17830J23186c5333l0722
15325f6055A48105m846d3441l06042a04579b1321H2893P8000e7620j24463Q1006
15314a01077A06317J54224a10430H6552d8095K217A35143a66655A27752a10534
$$ y = [-113502, 241582, 131513, -49304, -239440, -209313, -275704, 63841, -213252, 16223, 54541, 114618, -120730, -82525, 57651, 1464, 102498, -70732, -179238, -5126, 120246, -283897, 49092, 394700, -137554, -130491, -79977, 100081, 118855, -17673, -232329, -39850, -52530, 136492, -408433, -62064, 154781, 1284, 73701, 303281, -395655, -229101, 239130, -173070, -28637, -75350, -254770, 410153, -88481, 170830, 26594, -129203, 350987, 97429, 161950, -16155, -36139, -63103, 67097, 77188, -149910, -48357, -41402, 23288, -165617, -283447, -160261, -35333, -66055, 148105, 143259, -43441, -349483, -104579, -21321, 82893, 160893, -57620, -182083, -101077, 106317, 260541, -110430, 86552, -48095, -45878, 135143, -166655, 127752, -110534]
15303i7516m6956C1894J8285E714a89323R0527A62643J5949b5200A61413l3300
15292A28113R9763B2272g1097C9556a09553C06663k9799j06022K22093c6159A24119
15280b6149A81272j7000b6355n2092D5219A7226N0517d4582C0020K46008H1177
15268a06906B77845A12583i9109H2059b09105e5193A61411p4095a49687J6015
15258a33672A61417N1077B7640b65541I2976M7556N3069J72361K05826J04481
15248F76269R87937n03921J07236l7078n50076l01849j79183J1862d379B53041
15237B7919J74291J60299a34481k8640A57111J21674A24087a57282C2075J01871
15227A33946B5847L3449g7966Q364C68998d8770n6315B47727E7949N92043d263
$$ y = [-97516, -144472, 31894, 50179, 5714, -189323, -98796, 162643, 178592, -25200, 161413, 128113, 227876, 22272, -71097, 39556, -109553, 306663, 276864, 170842, 392935, -36159, 124119, -26149, 181272, 164272, -26355, -78447, 45219, 17226, 67743, -44582, 30020, 276028, 81177, -106906, 277845, 112583, -99109, 82059, -209105, -55193, 161411, 87316, -149687, -133672, 161417, 212494, 27640, -265541, 92976, 140532, 193601, 365962, 571788, 676269, 1664206, 1160285, 1267521, 1230443, 680367, 378518, 199335, 211197, -4379, 253041, 27919, 202210, 362509, -134481, -163121, 157111, 278785, 124087, -157282, 32075, 133946, 25847, 59296, -77966, -69602, 368998, -48770, -105085, 247727, 57949, 649992, -4263]
15215A47055K78729F7446L35170A95105C1911M76K7168h990r1258B65089E7887
15203B8677J90440g3574m0611B26766b47761D80683a65416B73966c0428B32911
15192c5269o0547J4632B93506B7177a57192A0516c7061A84980E9771c5431a873
15180A1814J34555A8017J88438J94855A00371r646d2703C17809j56553O7411g1939
15168b02467d8842n6390C06320m1675F4704a7432C14703E4838a63156A14363n0773
15157F3590a75207B88142n0523E823M1010c44857a07270j5620B37839A04982j8009
15146H6973C0018J89237r6091D3936a3951B22731a03801c9252B19661G8961a80147
15134B05338a35481A72418H1992K1311n578R3861q1627b97486A25639O6542C095
$$ y = [147055, 425784, 67446, 402616, 195105, 31911, 32387, 59555, -8990, -100248, 265089, 57887, 28677, 219117, -73574, -114185, 226766, -247761, 480683, -165416, 273966, -30428, 232911, -35269, -95816, -81184, 293506, 27177, -157192, 10516, -37061, 184980, 59771, -35431, -1873, 11814, 146369, 18017, 206455, 401310, 100371, 90725, -42703, 317809, 161256, 228667, -71939, -202467, -48842, -105232, 306320, 264645, 64704, -17432, 314703, 54838, -163156, 114363, 63590, -175207, 288142, 237619, 5823, 46833, -344857, -107270, -122890, 237839, 104982, 86973, 30018, 219255, 123164, 43936, -13951, 222731, -103801, -39252, 219661, 78961, -180147, 205338, -135481, 172418, 81992, 103303, 97725, 191586, 109959, -297486, 125639, 192181, 3095]
15122C74861C4525c21263A58371a31124A38801E1139J36379a49636I2877a5594
15111B2927J66059g3132B0382M25335G1758K00680a17000B80924b89541a14825
15100B98623L0173n1316F6501J13429J56387o788f5366K6513B26738b1484j72633
15089a94117A93409e8246B31716J78289j18061l8796J7288m7260N6531k1649p4045
15078A84013a90163A36456M57992d8007D45964B17481a85605A33826C257J83449
15068A86706i2332B01238K6275H1996R2381Q3479a70483A15380a5984C68682n4416
15057C14266a89877B52747G9076L5444K53541D3214J81520b94601D33249j73903
15047B59346H130K11960J21237j30158o8210C105R2627m0357M2289O3286B3036
$$ y = [374861, 34525, -321263, 158371, -131124, 138801, 51139, 187518, -149636, 92877, -15594, 22927, 188986, -73132, 20382, 445717, 71758, 272438, -117000, 280924, -289541, -114825, 298623, 328796, 277480, 66501, 179930, 336317, 329529, -65366, -38853, 226738, -21484, -194117, 193409, -58246, 231716, 410005, 291944, 253148, 270436, 223176, 279707, 258058, 184013, -190163, 136456, 594448, -48007, 445964, 217481, -185605, 133826, 3257, 186706, -92332, 201238, 227513, 81996, 174377, 257856, -170483, 115380, -15984, 368682, 314266, -189877, 252747, 79076, 114520, 368061, 43214, 224734, -294601, 433249, 259346, 8130, 220090, 341327, 211169, 142959, 3105, 95732, 55375, 97664, 160950, 23036]
15035f511B721a85758A52841J84841A54894G044J62879Q4515C3926L7493l3255
15024C8164j5883K31610j07751c9063C43755j59919N8257h5956B53285k0859R0266
15013C22692I4736J41726J03296j05889M8629r8030J79684l4541j51283l1123
15003A47205K34183c74179a33380C04768E9879J2326L47887j58378r5864P0681
14993B36531J28193j10989C9732L97191j65373e6400A32033L8076d75534B50743
14982B46926F0345J29083J38053o4355A27141P0893L03284A88506J59741N855
14972C54102A07948L89114A08019M52278F3773L72047A24576C2823J29718L1522
14962A94063R785L09235j60289A12561J24647H3879L16588j60556L13169B23070
$$ y = [-6511, 2721, -185758, 152841, 337682, 154894, 7044, 169923, 254438, 33926, 71419, 38164, 22281, 253891, 146140, -39063, 343755, 183836, 242093, -85956, 253285, 232426, 322692, 94736, 236462, 339758, 233869, 282498, 184468, 364152, 329611, 178328, 147205, 381388, -374179, -133380, 304768, 59879, 72205, 420092, 261714, 165850, 236531, 364724, 253735, 39732, 436923, 271550, -56400, 132033, 170109, -475534, 250743, 246926, 60345, 189428, 327481, 263126, 127141, 198034, 501318, 188506, 348247, 354102, 107948, 497062, 108019, 560297, 63773, 435820, 124576, 32823, 162541, 194063, 203848, 513083, 352794, 112561, 237208, 83879, 400467, 239911, 553080, 223070]
14951D17137o4144j37198Q1840j35488j9360J18427a46672D28687J36853B36785
14940D50955E8422J45432J89584G8582A7444J76079O5790J64476r481A90851P0493
14929B61344Q5095J18965o2113j25068K2638j07714K47011n5237A91061J74537
14919C65598j64036L49687k30534m2297J27588l5585p3542j10658M08445A99795
14908C72203A39061k798J06995j812n4740j2844M00070A45813J86235D6835M46396
14897D93231r307j77818K11805B13403L37946A48236N99028B03581O1647A12476
14886C47244j50247J32943I9754J96473K56944G6858M37058H7936K22727N7576
14876C68239o0139m1224K46977B0848L36540m5514K93309L919F2741M66983A92127
$$ y = [417137, 352993, 215795, 297635, 162147, 142787, 261214, -146672, 428687, 565540, 236785, 450955, 58422, 203854, 393438, 78582, 17444, 193523, 259313, 423789, 414308, 190851, 261344, 346439, 465404, 403291, 278223, 300861, 193147, 440158, 384921, 191061, 365598, 201562, 551249, 320715, 278418, 406006, 370421, 296879, 186221, 594666, 199795, 372203, 139061, 136263, 243258, 241446, 186706, 173862, 573932, 145813, 332048, 46835, 493231, 483924, 306106, 517911, 213403, 551349, 148236, 747264, 203581, 265228, 112476, 347244, 196997, 329940, 99754, 296227, 553171, 76858, 513916, 87936, 310663, 368239, 308100, 266876, 513853, 20848, 357388, 311874, 605183, 609102, 62741, 529724, 192127]
14864E28716k35505J55008j58453R307m3908K72366J15700M2483B65518P8598
14854C44116J25477E314N45386D3629L35301P5567K40654C44952J18060j0847
14844D52165j59633L70586j05456r2167A41902j8739K94206L2223R8649k72978
14834B75263f5403D45455K16606j42442J6026Q4389k76485J13073K16650j34191
14824E39081j25333N97064l28030l16784K74258k62686R6674Q2009O0073k6223
14814E90103B88024Q3417L12256J37447k46551L14285B93358K75083J7280j42184
14804D43537I5510L31270K9731J49720B58127q169J80214j61359L42318j1309
14794E99822K0513J62471l00787B38241J83380j10374K19290M04946k5647D16414
$$ y = [528716, 293211, 448219, 289766, 299073, 255165, 527531, 643231, 685714, 265518, 344116, 469593, 5314, 550700, 43629, 378930, 454497, 695151, 344952, 463012, 452165, 292532, 663118, 557662, 465495, 141902, 123163, 417369, 449592, 548241, 275263, -65403, 445455, 662061, 519619, 535645, 620034, 343549, 456622, 673272, 539081, 413748, 1010812, 682782, 365998, 640256, 377570, 474244, 556253, 616326, 590103, 288024, 371441, 683697, 821144, 574593, 888878, 293358, 568441, 585721, 443537, 95510, 426780, 456511, 606231, 258127, 249958, 430172, 268813, 611131, 599822, 620335, 782806, 482019, 238241, 421621, 311247, 530537, 935483, 909836, 416414]
14783F44282l7183j72130L71148j86088j82664M08236L7062l30138J2267J47339
14773G12131o1257J61085k47644M48917D85923L88918D34442N8131j06409K05131
14763E91295j30141R2218K02027q534l51787M40788j19724J44745k69335Q8268
14753F79820K8505N4503N5822j82742K81576j66795P9078l06928L35471D28927
14742G05977j1788R4091k14181J42539J12530k44666J78745J28814M735j31125
14732G65671J08118L20050j82909J10185m06966R2903K23751j37231m0769P8707
14722I31510k67497K61171K27955k97750J52029l72528J77568n1139J67159q4492
14712H43986J2740K08508r4714j2088L5122l37578Q1944Q1671K9397j0964K72538
$$ y = [644282, 607099, 434969, 806117, 620029, 437365, 845601, 882663, 552525, 564792, 712131, 650874, 811959, 564315, 1013232, 485923, 874841, 434442, 492573, 386164, 591295, 461154, 553372, 755399, 746865, 395078, 835866, 716142, 860887, 591552, 679820, 708325, 762828, 818650, 635908, 917484, 750689, 829767, 522839, 858310, 428927, 705977, 694189, 788280, 574099, 716638, 829168, 584502, 763247, 892061, 896796, 765671, 873789, 1193839, 1010930, 1121115, 714149, 807052, 1030803, 893572, 852803, 931510, 664013, 925184, 1153139, 855389, 1007418, 634890, 812458, 761319, 928478, 843986, 856726, 1065234, 970520, 958432, 993554, 655976, 737920, 819591, 848988, 838024, 1110562]
14701A110562m08890k26828M05907k8598k44663J62730k71164L41863j52072J38208
14691H27055Q4532k8907O0810j33774J13595n7466q6570J78081N9544J61617R1322
14680A269839k75786Q0352J18810l32542K33581L5879k30713K97560j54514J5680
14670A058146J16638J4290p1689k21209K98365k16658J10302o3388r1351L39960
14660A273406j75086J75123L8782o598k78422J36498j5509K79313m89295L8326
14650I76538K90844L6325j29683m08273M22255j06274P425J80476J3587K10291
14640A493511j29549q3794l5144j12751M00767n30477J62381j6129M1273j7625
14630A172463O7647L25277l14569l10o9870J81846q5059J1249j3017M19585j88263
$$ y = [1110562, 701672, 474844, 880751, 852153, 607490, 770220, 499056, 840919, 688847, 827055, 911587, 882680, 943490, 809716, 923311, 865845, 779275, 957356, 1016900, 1178517, 1269839, 994053, 1074405, 1193215, 860673, 1094254, 1130133, 899420, 1196980, 1042466, 1058146, 1174784, 1189074, 1117385, 896176, 1194541, 977883, 1088185, 1024797, 933446, 1273406, 1098320, 1273443, 1312225, 1305627, 1027205, 1163703, 1148194, 1427507, 938212, 976538, 1267382, 1303707, 1174024, 765751, 1188006, 1081732, 1089157, 1269633, 1283220, 1493511, 1363962, 1280168, 1245024, 1132273, 1533040, 1002563, 1164944, 1148815, 1190088, 1172463, 1240110, 1565387, 1250818, 1250508, 1180638, 1362484, 1277425, 1288674, 1275657, 1695242, 1506979]
14619A506979K46108l36948o0023K03446j71193l7459M65578k40079j34130J73402
14609A615681k61549l59608O26205r8170K21492q1432R3424J42869l86299J35838
14599A648451J87488J86368k87715m51428N79557j43916Q840J77212J00010K58283
14589B263150j14089k21956K6421Q4082k31801K31187k66975M34227j12092j21337
14579A970817l7013K30060l89884L67873l25479M43158k29927L90010m19894K58709
14569B258430r98J41933L4643j28162J42811p6792N46144r6301l97736N55201
14559B979173N4127l8677K18980N45933l07578J44980M16931J73660R69176J142017
14549F298722K340013M799420R581492J4005788P656081j9521878A0418576n011401
$$ y = [1506979, 1753087, 1416139, 1356116, 1559562, 1388369, 1350910, 1816488, 1576409, 1442279, 1615681, 1354132, 994524, 1620729, 1522559, 1744051, 1662619, 1756043, 1898912, 1512613, 1648451, 1835939, 2022307, 1734592, 1283164, 1862721, 1718805, 1727645, 1904857, 2004867, 2263150, 2149061, 1927105, 1953526, 2037608, 1805807, 2036994, 1770019, 2204246, 2092154, 1970817, 1933804, 2163864, 1773980, 2141853, 1816374, 2259532, 2029605, 2419615, 1999721, 2258430, 2257432, 2399365, 2434008, 2305846, 2448657, 2371865, 2918009, 2821708, 2423972, 2979173, 3033300, 2994623, 3213603, 3759536, 3451958, 3596938, 4013869, 4187529, 5156705, 6298722, 8638735, 13438155, 23019647, 37025435, 44681516, 25159638, 10418576, 5407175]
14541E407175j391681q69343p42285l1549p6606j8229j53512L48459l21577K75450
14531B426302j54023j99171R3918K93681j7121j14422L08437k04211J86938j81898
14521B438430L05160R3991j6445j52417j8262K13824j87988m9265K05720L09627
14511C142375n8937j50591o1591L90016l38021J49752K33186k67984L83582j03914
14501C317873r7924J02511k21652K47544j61677L05132R7771j78970j0438p4466
14491C325704J93521K79171k4443K09001l00836J21971N09027l53574R6812R4706
14481D151060J0045J73840N6999j74141M19109j65725m29662N56418l13010j45698
14471D139235K45826M32531m71813J78056L62627l75104K50826J29765k63770
$$ y = [5407175, 4015494, 3146151, 2403866, 2372317, 2295711, 2277482, 2123970, 2472429, 2150852, 2426302, 2272279, 2073108, 2167026, 2460707, 2443586, 2329164, 2637601, 2433390, 2620328, 2438430, 2743590, 2837581, 2821136, 2668719, 2650457, 2864281, 2676293, 2627028, 2832748, 3142375, 3083438, 2932847, 2871256, 3261272, 2923251, 3073003, 3306189, 3038205, 3421787, 3317873, 3219949, 3322460, 3100808, 3348352, 3186675, 3491807, 3589578, 3410608, 3400170, 3325704, 3519225, 3798396, 3773953, 3982954, 3682118, 3804089, 4313116, 3959542, 4056354, 4151060, 4161105, 4334945, 4391944, 4217803, 4636912, 4471187, 4041525, 4597943, 4284933, 4139235, 4385061, 4817592, 4345779, 4523835, 4886462, 4511358, 4762184, 4891949, 4628179]
14462D628179L11096Q9198J13394L01046m22759L75819J55077N9772m08039L67099
14452E569882K39542k28965M4141l1608L99581j85413N66028k41201r665k27095
14442E895227O26802j98401K99002k39716K01624j85781J92319J65620K5377K62181
14432G044254j56045M19600K7161J31010P6949J36547J80493q4620r052L18907
14422H085204p7760J25240J83145J88316K79364L8316l6989L47364j40325k3921
14412H967954O73637N1907J74685j72681M75409q7256K29343k4600l3311L67292
14402A0622379j0565M60021K4832O4695M26611J3950M80714J0940L19156j6219
14392A2396514K36667N58094K00614L96460K521O0095J14826M75295K17244K26176
$$ y = [4628179, 4939275, 5028473, 5141867, 5442913, 5020154, 5395973, 5551050, 5610822, 5202783, 5569882, 5809424, 5580459, 5624600, 5592992, 5992573, 5807160, 6373188, 6131987, 6122322, 5895227, 6522029, 6323628, 6622630, 6382914, 6584538, 6398757, 6591076, 6756696, 6782073, 7044254, 6888209, 7307809, 7334970, 7465980, 7542929, 7679476, 7859969, 7775349, 7766297, 8085204, 8007444, 8132684, 8315829, 8504145, 8783509, 8821825, 8784836, 9132200, 8991875, 8967954, 9641591, 9693498, 9868183, 9695502, 10170911, 10083655, 10312998, 10288398, 10255087, 10622379, 10611814, 11071835, 11096667, 11161362, 11587973, 11601923, 12082637, 12093577, 12412733, 12396514, 12633181, 13191275, 13391889, 13788349, 13790870, 13850965, 13965791, 14441086, 14658330, 14884506]
14382A4884506P3381O30804L60379L27816j3775L94714M7140M96507O30777K64384
14372A8096633n0107M78982P13536K31782K69705K33598L09364O99261M92036
14363B1474790M49093K81178L53612J003387K27244M42849K05586Q84657N56134
14354B5878530M34677J046380M74321N88156P80270P62910Q88526L54993R02913
14345C2111676O24203J048321J052979J109134P10556J029558R92888Q38812J121278
14336D0639405J411126J292655R45045J666117J204243J604244J363919J505192
14328E1631946J593858J898051J956040J728083K007549J542631K540653J964274
14320F6863085K613976K265167K890741K911355K431064L467340L005181L472518
$$ y = [14884506, 14957887, 15588691, 15949070, 16276886, 16263111, 16657825, 16704965, 17201472, 17832249, 18096633, 18046526, 18525508, 19239044, 19470826, 19740531, 19974129, 20283493, 20982754, 21474790, 21923883, 22205061, 22558673, 23562060, 23789304, 24232153, 24437739, 25322396, 25878530, 26313207, 27359587, 27833908, 28422064, 29202334, 29965244, 30853770, 31208763, 32111676, 32735879, 33784200, 34837179, 35946313, 36656869, 37686427, 38679315, 39518127, 40639405, 42050531, 43343186, 44288231, 45954348, 47158591, 48762835, 50126754, 51631946, 53225804, 55123855, 57079895, 58807978, 60815527, 62358158, 64898811, 66863085, 69477061, 71742228, 74632969, 77544324, 79975388, 83442728, 86447909, 89920427]
14312H9920427L258205L651940M354885M123167M558810M591719M911154N379140
14304A24749447N700415N733853O064987O606979P174675P011498Q206617Q193295
14296A79441766Q727919R245328R752451J0219632J1247492J1510189J2317689
14289B52462466J2399194J3206732J3747927J3757592J5124271J4814589J4962904
14282C50475675J5630758J5435284J5474206J4589187J4255883J3250753J2173887
14275D51285633J0709841P816999L171083Q26920q02937j125505J908053j778773
14267D72011314m688603p813260q951748j0748629j1755406j3214519j3834901
14260D01004248j4810971j5705244j6050653j6204952j5547537j4891797j4181651
$$ y = [89920427, 93178632, 96830572, 101185457, 105308624, 109867434, 114459153, 119370307, 124749447, 130449862, 136183715, 142248702, 148855681, 156030356, 163041854, 171248471, 179441766, 188169685, 197415013, 207167464, 217387096, 228634588, 240144777, 252462466, 264861660, 278068392, 291816319, 305573911, 320698182, 335512771, 350475675, 366106433, 381541717, 397015923, 411605110, 425860993, 439111746, 451285633, 461995474, 469812473, 472983556, 473810476, 473007539, 471882034, 473790087, 472011314, 467322711, 459509451, 450557703, 439809074, 428053668, 414839149, 401004248, 386193277, 370488033, 354437380, 338232428, 322684891, 307793094, 293611443]
14253B93611443j4465911j3678617j3010118j2685859j1331187j1378758j0718265
14246B06342728j0015403r298354q420464q560025q218326p359054p067368o463020
14238A40940714o039589n857094n667853n059042n070275m602200m081225l936370
14230A00627066m096437m036840l585292l439492l187703l212302k670452k762383
14222G3636165k545163k313149k609899j950083k380476k047124j531551k344070
14214E5914650j380961j331562j939930j580762j328373j505952j252959q08504
14206D4785647q84773j723195j305046j194880j167300r76576n43141j215492
14198C5775244o93603j383293p85138n11521r06145m68944j060913o30783p76310
$$ y = [293611443, 279145532, 265466915, 252456797, 239770938, 228439751, 217060993, 206342728, 196327325, 187028971, 178608507, 170048482, 161830156, 154471102, 147403734, 140940714, 134901125, 129044031, 123376178, 118317136, 113246861, 108644661, 104563436, 100627066, 96530629, 92493789, 88908497, 85469005, 82281302, 79069000, 76398548, 73636165, 71091002, 68777853, 66167954, 64217871, 61837395, 59790271, 58258720, 55914650, 54533689, 53202127, 51262197, 49681435, 48353062, 46847110, 45594151, 44785647, 43900874, 42177679, 40872633, 39677753, 38510453, 37533877, 36990736, 35775244, 35081641, 33698348, 32913210, 32401689, 31495544, 31026600, 29965687, 29334904, 28558594]
14189B8558594p19023r29610o25083k68101p34385n42101n03179l81170o14664
14180B3241278m96554o10096k84440p79901r7657l68849m58238m33014m48183
14171A9264346m19798k12141l49102n80402k76606j47699n94389p9585q8107o62897
14161A5853620j93154l68990J23579q23369J14466l79421m79864j15337o6437
14152A3665093n24600N9366j19294l76621p441m02071m94085k79853K93412j74533
14142A1639373l78555j60985j41690J63126o36622J34057j44450k09652K11056
14133A0475658n25483l01887L9372o5839L1326n06020j14065J2500r9553l99279
14123H546730L64328P011q29425M42331l45873j69051K37872l41632j46348n03273
$$ y = [28558594, 27839571, 26909961, 26284878, 26016777, 25282392, 24740291, 24237112, 23855942, 23241278, 22744724, 22134628, 21850188, 21070287, 20972630, 20603781, 20145543, 19712529, 19264346, 18844548, 18632407, 18283305, 17702903, 17426297, 17278598, 16684209, 16604624, 16516517, 15853620, 15660466, 15291476, 15415055, 14591686, 14706152, 14326731, 13846867, 13731530, 13665093, 13140493, 13199859, 13080565, 12703944, 12696503, 12294432, 11800347, 11520494, 11813906, 11639373, 11260818, 11099833, 10958143, 11121269, 10484647, 10618704, 10474254, 10264602, 10475658, 9950175, 9648288, 9687660, 9621821, 9653147, 9147127, 9033062, 9045562, 8946009, 8546730, 8911058, 8918069, 8088644, 8530975, 8185102, 8016051, 8253923, 7912291, 7765943, 7262670]
14113G262670J28041K43662l25345J51052m90924K83775m00552L0515l7648j35874
14103F709372N9237L66703n56893l25415K74106K0420n80297M28741m41575r4362
14093E860037k15161M42567k13692J6240l62047j17206L47835m52420J49378k3108
14083E432423K7942k96373J61185n3554j07040j40340j69590K390M46534l82011
14073D921566p6640r6349m54057P8816O6713J82915J54733l45421p8471j34464
14063D219341J09702k39499K70524J11910j9484j81896O4389k95567K00109l64745
14053C874784O23735l22990l06886j50255k36272O8672J64273j68104q7207K24552
14043C684302j18944j91494o2893K20858O4073P2362l35676J21295q9215j3299
$$ y = [7262670, 7390711, 7634373, 7309028, 7460080, 6969156, 7252931, 6852379, 6882894, 6845246, 6709372, 6768609, 7135312, 6578419, 6253004, 6527110, 6547530, 5967233, 6395974, 5954399, 5860037, 5644876, 6087443, 5873751, 5889991, 5527944, 5410738, 5758573, 5306153, 5455531, 5432423, 5460365, 5163992, 5325177, 5271623, 5164583, 5024243, 4854653, 4857043, 5303577, 4921566, 4844926, 4748577, 4294520, 4373336, 4440049, 4622964, 4777697, 4432276, 4353805, 4219341, 4329043, 4089544, 4360068, 4471978, 4452494, 4270598, 4334987, 4039420, 4239529, 3874784, 4498519, 4175529, 3868643, 3718388, 3482116, 3550788, 3715061, 3546957, 3459750, 3684302, 3565358, 3373864, 3310971, 3531829, 3595902, 3668264, 3332588, 3453883, 3364668, 3351369]
14033C351369o5083L0470j42683j71934J33382l07432L32216k13221o4145J09661
14023B992600k92041N47273n85385q5226K66970o6953O1192l26893J96308k58721
14013B449124J19910r2028J45577k101j27501j95536L3660l9864N4860P9921O2161
14002B488183L81558n94963L81699l20621K76275j38645k50855J60740k05450
13993B177921m2693M16317k97141R18556J641927L263162Q130823J4534997J2996412
13984D3740281j5016848A4237581n080850k914290p86351r25043k50673o78821
13976C601553m27115q7270j86870j36806k9881j25390J82577K50645o55174P1000
13966B457269N3627J40016M0237p9218m88287J94897R266j70876J1784K23083
$$ y = [3351369, 3286286, 3316756, 3174073, 3002139, 3135521, 2828089, 3160305, 2947084, 2882939, 2992600, 2700559, 3247832, 2662447, 2577221, 2844191, 2777238, 2838430, 2511537, 2707845, 2449124, 2569034, 2477006, 2622583, 2620482, 2492981, 2297445, 2331105, 2291241, 2346101, 2426022, 2488183, 2869741, 2274778, 2656477, 2335856, 2612131, 2473486, 2222631, 2383371, 2177921, 2135228, 2551545, 2254404, 3172960, 4814887, 8078049, 16208872, 30743869, 43740281, 28723433, 14237581, 9156731, 6242441, 5456090, 4531047, 4280374, 3601553, 3174438, 3087168, 2900298, 2763492, 2733611, 2608221, 2790798, 3041443, 2386269, 2457269, 2510896, 2650912, 2691149, 2611931, 2123644, 2318541, 2327807, 2156931, 2168715, 2391798]
13956B391798k99025N5220k43710K02276K30487j19320j75660J12348P8071l89228
13946A843257J4608j29530J50223k11979L49793K17014m41506j47359K56714L24543
13936B225778m80321L38556n91385L00718r8419p3352J64600K33887l65329K01070
13926A855803k19477L2360K57654k20519l3465j71099J91588j17016l1413p0576
13916A473840L42636l03536J77782m2630j61348j15433J37200j00813l5011K57922
13906A630609l6911L3409j37655l5853L64513m28611L32753n33414K635K20120
13896A411595j22629J66236K4229m86082J86752L11123l18519p8192O15224k94441
13886A415296J96851p00641J78421k1842k1305L79273k61k15010K33557q4957
$$ y = [2391798, 2092773, 2147993, 1904283, 2106559, 2337046, 2217726, 2042066, 2154414, 2232485, 1843257, 1857865, 1728335, 1878558, 1666579, 2016372, 2233386, 1791880, 1644521, 1901235, 2225778, 1745457, 2084013, 1492628, 1793346, 1694927, 1621575, 1786175, 2020062, 1654733, 1855803, 1636326, 1668686, 1926340, 1705821, 1672356, 1501257, 1692845, 1575829, 1544416, 1473840, 1816476, 1512940, 1690722, 1648092, 1486744, 1371311, 1508511, 1407698, 1372687, 1630609, 1593698, 1627107, 1489452, 1453599, 1818112, 1389501, 1722254, 1188840, 1191475, 1411595, 1288966, 1455202, 1479431, 993349, 1180101, 1491224, 1172705, 1094513, 1709737, 1415296, 1612147, 911506, 1089927, 1068085, 1046780, 1426053, 1425792, 1210782, 1444339, 1359382]
13876A359382r2625n341M1805P669l9072j04674P928m9768J31268r1122J21621
13865A287071q112M10723j91882k49069l4667m7502j41474J94975O1846j01334
13855A180575k64701J6527j0409M59437n21098N8691K38615O2561j43050M5407
13845A122555K01256r3434K87410l55841j26384J66666j47171K00785J03207l61763
13835I97286n4316o8067j3560N78059m07999j54551K56411l26468N8988K61056
13825A126839k62587q4479J55898K44993k04438M1658j10738K71264m10350J76238
13815I44298k044j44546n5572K45111K3196l70823J7901j15887O13697m39220
13805G16111K02247M02907j48098k20234j45580C65416M05923J4763M8085K61962
$$ y = [1359382, 1266757, 1261416, 1303221, 1310890, 1271818, 1167144, 1175072, 1125304, 1256572, 1165450, 1287071, 1278959, 1689682, 1497800, 1248731, 1214064, 1166562, 1025088, 1220063, 1281909, 1180575, 915874, 932401, 921992, 1381429, 860331, 919022, 1157637, 1220198, 1077148, 1122555, 1323811, 1230377, 1517787, 1161946, 1035562, 1202228, 1055057, 1255842, 1359049, 997286, 942970, 874903, 861343, 1439402, 1031403, 876852, 1133263, 806795, 865783, 1126839, 864252, 779773, 935671, 1180664, 976226, 1017884, 907146, 1178410, 768060, 944298, 942254, 797708, 742136, 987247, 1010443, 639620, 657521, 541634, 1155331, 716111, 918358, 1321265, 1173167, 952933, 807353, 365416, 771339, 786102, 834187, 1096149]
13795A096149k56194N9560n172R045j07647J84362j90354Q1467j49518J40240
13785H61938j2415r5083m7132j3962j48142K24993P6676k69002k5595J24540J62030
13774H38846j03488o0573L28252D57158L33869P8782q9653l60887O15712k64222
13764G70759j55425o3933p5014q1556J54005J38101K48875j45447q9430J24357
13754H25292O9479k10869q1454K43665k86248L0415K38871j88053j15145L78015
13744I03968D32376L97528l54901J97505L8743C30777M27363k57037J32444L42249
13734I75796m10642K28508l38682K43584J353k03743Q7772K39920Q460C55137
13723B35026L69688k18451M51899l00936J56259j05565J46885k62465K43355j15182
$$ y = [1096149, 839955, 899515, 894343, 903388, 795741, 980103, 789749, 871216, 721698, 861938, 849523, 754440, 707308, 693346, 545204, 770197, 846873, 577871, 552276, 676816, 838846, 735358, 674785, 1003037, 457158, 791027, 869809, 780156, 419269, 1034981, 770759, 615334, 551401, 476387, 394831, 548836, 686937, 935812, 790365, 700935, 825292, 894771, 683902, 602448, 846113, 559865, 590280, 829151, 641098, 525953, 903968, 432376, 829904, 475003, 672508, 711251, 330777, 758140, 501103, 633547, 975796, 565154, 793662, 454980, 698564, 699917, 496174, 583946, 823866, 832326, 355137, 235026, 604714, 386263, 838162, 537226, 693485, 587920, 734805, 472340, 715695, 600513]
13713F00513P2463k79600L76791k3671l12949j15533R3228J82127j16519K10211
13703F87061N1613j65741B59989N75176k1643j00376k34739L05023C72343K58017
13693F30360N169R2667J33719l16645j82001J98448J92991k68011L47458D00364
13682D15207J04051J68762B89487K88666J97141k95204k6212q6346L58277k38086
13672D87723J74853j71783R1113j33954j04398P7855Q3830l0649J00694j26502
13662D48782J21495J27696A18315O82047C92494J64505G2639L79150R5380J72270
13652G19439k51267J93991C08295L0440J42556M17616C20175K82357r2879R9180
13642F08833n8811k7877A93313J94972j42213J50510k6521j43636j0608K06903
$$ y = [600513, 672976, 393376, 770167, 746496, 433547, 318014, 411242, 593369, 476850, 687061, 738674, 572933, 259989, 835165, 813522, 713146, 478407, 783430, 372343, 630360, 635529, 728196, 861915, 545270, 363269, 561717, 754708, 486697, 834155, 400364, 415207, 519258, 688020, 289487, 578153, 775294, 480090, 453878, 367532, 725809, 487723, 662576, 490793, 581906, 447952, 343554, 421409, 505239, 474590, 575284, 448782, 570277, 697973, 118315, 800362, 392494, 556999, 72639, 451789, 547169, 719439, 468172, 662163, 308295, 338735, 481291, 898907, 320175, 602532, 509653, 608833, 550022, 522145, 193313, 388285, 246072, 396582, 370061, 226425, 215817, 422720]
13632D22720I2301K79045P6230F3044N69171B43877l9950M33043B73720L15250
13622E88970k17480K15030P2821j95276M1414A51562K23832j54032L05116r9542
13612D26936j37594J8003Q8294j93450N92889j22705k06981m9436l7149q636L16209
13601F86380A90245N91389k73380A60630M2053L32511m7929j20602k2076G9828
13590E74784k43437m8032k0232o3898P26770B14205O1119J3464J62039B17407
13579C01495L84830F7668N8798R7711K13872m6624J49902j48421J11998k06006
13569B98898Q7362A79635m8750J98682J70227P7057j02036B36666J10470L7592
13559C84728J23114J6444B57197k9771K66818j71829K41152g1736D56985A08832
$$ y = [422720, 92301, 371346, 447576, 63044, 632215, 243877, 203927, 636970, 273720, 588970, 371490, 586520, 659341, 464065, 505479, 151562, 375394, 221362, 526478, 426936, 289342, 307345, 395639, 202189, 795078, 672373, 465392, 415956, 378807, 370171, 686380, 190245, 781634, 508254, 160630, 202683, 535194, 487265, 366663, 344587, 79828, 574784, 331347, 283315, 263083, 199185, 925955, 214205, 275324, 288788, 450827, 217407, 301495, 686325, 67668, 126466, 224177, 438049, 391425, 541327, 392906, 504904, 298898, 386260, 179635, 130885, 329567, 499794, 576851, 474815, 236666, 347136, 384728, 507842, 524286, 257197, 227426, 494244, 322415, 563567, -71736, 456985, 108832]
13548A49624C9824K31111L115r0096J34554A31928J10709J2574M6945F3102K32783
13537B95885A44470J33189K59172j80999O781J12113j61386a38327A98858P66
13527A99624M10708j1895B51965L4046q8982j2633J51446J37710A50173p926a57
13515F7433M00456a01294C52707H8430R6518M1434p9797n8871J05863J19782K4672
13504C38031d7439E23580A77435L89747A93365K36400A90183D8388J77671p6748
13494A49311J27838I2957K62443j06767L00695k71642L21851H0622J89677j04171
13484A66128N3209R1395D90M12718A56733b6310A40858K65397j73781J0517K77323
13473E20314k53454j23421M59757B81098p0503K81914A68310n0459J52494K02746
$$ y = [149624, 39824, 270935, 274050, 183954, 318508, 131928, 242637, 255211, 302156, 63102, 295885, 144470, 277659, 536831, 355832, 362613, 474726, 313340, -138327, 198858, 199624, 610332, 598437, 251965, 286011, 197029, 184396, 335842, 473552, 150173, 142247, -157, 67433, 467889, -101294, 352707, 88430, 184948, 226382, 146585, 87714, 193577, 313359, 338031, -47439, 523580, 177435, 567182, 193365, 429765, 190183, 48388, 226059, 149311, 277149, 92957, 355400, 248633, 549328, 277686, 599537, 80622, 270299, 166128, 219337, 310732, 490, 413208, 156733, -26310, 140858, 406255, 232474, 242991, 520314, 266860, 143439, 603196, 281098, 210595, 492509, 168310, 117851, 270345, 473091]
13463D73091A16612J84011A11790J58194J73897A05171M25003A24167A2531L15756
13453C28287H4612K8931L72282A24708R8314O2675j05552J96382m409O8747A97627
13441B81275Q753J36242L3181A83879J34081e8818l5763B7819P3705K8759m5071
13430H5212J4585C8197b71292D09749j33432P1185j21216J0727q2207K59673A72203
13418A56671J12445K1923J88853a6774C88360c8474B03555C5491K21629A00441
13407D25748n5004I4834a27354A83625O5175P2698H8093L39203M3437B33346j2566
13396B20780K12683c2792D20949j64642a09913B78070H9570J51721L09532b3971
13385B97830N2798K09272A11194a7947A54709O8857A5310K46860L93816C12846
$$ y = [473091, 116612, 300623, 111790, 269984, 443881, 105171, 530174, 124167, 12531, 328287, 84612, 113543, 485825, 124708, 223022, 285697, 180145, 376527, 372118, 440865, 197627, 281275, 290028, 426270, 459451, 183879, 317960, -58818, -94581, 27819, 101524, 130283, 85212, 99797, 38197, -271292, 409749, 276317, 347502, 226286, 237013, 154806, 414479, 172203, 156671, 269116, 291039, 479892, -16774, 388360, -38474, 203555, 35491, 257120, 100441, 425748, 370744, 94834, -127354, 183625, 248800, 321498, 88093, 427296, 470733, 233346, 220780, 433463, -32792, 420949, 256307, -109913, 278070, 89570, 241291, 550823, -23971, 297830, 350628, 559900, 111194, -17947, 154709, 223566, 15310, 262170, 655986, 312846]
13374A26477M63743q7554A95055G9581J22551Q3164J37467j61339N6810N5191
13364C73425A84334g2375B42652J65065j90484a76424C46168o0811j08630L5256
13354B11983R0943J65298j31155o4004J51028l2884m0141j15768K55098Q7847
13344E78245k26714A32946L84877q3464A23680L7856M39175n3176A71766L55171
13334E26937A60037a9192r3771A79092O5116n9210D7915K69707P0914r5305a772
13322A86190L54597A19291K59092D5025J20934j9838n5693K37135J9020A36484
13311D47643g4604D2315J25512L23937n1148A44276D935L06055o9016D0251K91912
13300C32163O6386A52645d9325B7316K10765D8658M0041h186A73669R2152L17588
$$ y = [126477, 590220, 502666, 195055, 79581, 202132, 285296, 422763, 261424, 318234, 373425, 184334, -72375, 242652, 407717, 217233, -176424, 346168, 285357, 176727, 211983, 302926, 468224, 337069, 273065, 424093, 391209, 351068, 235300, 490398, 578245, 351531, 132946, 517823, 434359, 123680, 161536, 600711, 547535, 171766, 526937, 160037, -19192, -112963, 179092, 244208, 184998, 47915, 317622, 388536, 293231, -1772, 186190, 540787, 119291, 378383, 45025, 165959, 146121, 90428, 327563, 346583, 136484, 447643, -74604, 42315, 167827, 491764, 440616, 144276, 4935, 310990, 241974, 40251, 332163, 398549, 152645, -49325, 27316, 238081, 48658, 88699, -8186, 173669, 265821, 583409]
13289E83409B18842f2848C0956K6153c8511B24668j6240l7831F8709Q2262a13328
13277B291b8284n1191D70882E0289M1559O1422N6687b0300A38873J35683E3073
13265A67088L7913K6C2986J56015n2569a90039C2713c9928F5978N6573c5201E0819
13252A81169K4867J152B0342M50711A31353J24536j02103e4746k01084C36783
13241A79343f1959m1150B23263k607A8829J78247a64291E7204A3597K58864c1619
13229c9461p5937m7162C4780J33681D5729f2345E5502K56110K55033B509J08739
13218A11248R1654M0491I5436J15419P0868F6056P8099g4172A90360H8744P9894
13207A68638F4715f8645B46915J94345A0378Q5411J48017M2663k8696g1539F0362
$$ y = [583409, 218842, -62848, 30956, 57109, -38511, 224668, 208428, 170597, 68709, 150971, -113328, 2291, -28284, -79475, 470882, 50289, 91848, 153270, 209957, -20300, 138873, 274556, 53073, 167088, 205001, 205027, 32986, 189001, 136432, -190039, 32713, -39928, 65978, 122551, -35201, 50819, 181169, 206036, 207188, 20342, 471053, 131353, 255889, 153786, -54746, -255830, 336783, 179343, -61959, -103109, 223263, 220656, 18829, 197076, -164291, 57204, 13597, 272461, -31619, -39461, -115398, -162560, 34780, 168461, 45729, -62345, 55502, 311612, 566645, 2509, 111248, 202902, 243393, 95436, 210855, 281723, 66056, 144155, -74172, 190360, 88744, 168638, 64715, -68645, 246915, 441260, 10378, 95789, 243806, 286469, 257773, -71539, 60362]
13195C37033a92362g8271B62311o3715P6661A27444R3028d493A42745f9113j35284
13184b04397k27610a75784B46549E0488b3408p0838G4239R2067a09515C83835
13173e8917B26712p6419J38685r9645a3989F8235R0606a31920C23399A50437N6961
13162B07398g9087B74546p6282f1878j36j50856J05983I0177L41275A08481K2559
13151A31040L69282A80143c5053k4891j31070g7228A0740J98886n7846M5868A7335
13139B87999a09251B18149F5165j7149L94326F4481c4655l401k7204a4871A32440
13127A38184A1666K28929J88812H4105f0937h540B86006a74744b8347B93288F146
13115D15959C4401K33206D4452b29120C9129A760b36732F4626J41663c5600k11136
$$ y = [337033, -192362, -78271, 262311, 198596, 275257, 127444, 220472, -4493, 142745, -69113, -204397, -432007, -175784, 246549, 50488, -23408, -94246, 74239, 166306, -109515, 383835, -58917, 226712, 150293, 288978, 189333, -13989, 68235, 158841, -131920, 323399, 150437, 207398, -79087, 274546, 198264, -61878, -62014, -212870, -106887, 90177, 431452, 108481, 131040, 500322, 180143, -35053, -59944, -191014, -77228, 10740, 209626, 151780, 197648, 17335, 287999, -109251, 218149, 65165, 48016, 442342, 64481, -34655, -38056, -65260, -14871, 132440, 138184, 11666, 240595, 429407, 84105, -60937, -8540, 286006, -174744, -28347, 293288, 6146, 415959, 34401, 267607, 44452, -229120, 39129, 1760, -236732, 64626, 206289, -35600, -246736]
13104b46736B71917j4243D9498K48759F0037c48142a02897K3514A03282J83783
13094B87065a4321A37370o4991J26184f30l05161A12289l168e5735q2072C9696
13082B62014I1157k0495J12824L0548J52723c86880i561m881m8438B19230b6121
13070I1737d641C39173j29315I5934O9198a3057H1295J71310E9942O1255K3304
13059A44501F0203K69091a31879A25570f5549I5585K01989B1358K75130A25200
13048C01107b6009F7464A8875K99207I2026L6226O2125J23401M588C4852K11771
13037B46623J24338j37581j03389i9737A35187M9652e2100l589k13366a27083
13026a90823B51603E0340K55446F3579a00874B99039J76015A07386J27801n4213
$$ y = [-246736, 271917, 257674, 49498, 298257, 60037, -348142, -102897, -79383, 103282, 287065, -14321, 137370, 72379, 198563, -630, -305791, 112289, 109121, -55735, -137807, 39696, 262014, 91157, 70662, 183486, 214034, 366757, -386880, -9561, -14442, -62880, 219230, -26121, 91737, -4641, 339173, 209858, 95934, 165132, -13057, 81295, 252605, 59942, 121197, 144501, 60203, 329294, -131879, 125570, -65549, 95585, 297574, 21358, 296488, 125200, 301107, -26009, 67464, 18875, 318082, 92026, 128252, 190377, 313778, 318366, 34852, 246623, 370961, 233380, 129991, -99737, 135187, 184839, -52100, -55689, -269055, -127083, -190823, 251603, 50340, 305786, 63579, -100874, 299039, 475054, 107386, 235187, 180974]
13016A80974d0936A99427J84029A65575i5768A01727P9519L0800m6180J35668
13006C01534j23518K77334a26706k2249H0420J99076j06052N7369r371e0861A66270
12994d6757I508d76246A68865q0592a48984B41650j16399a05221A92907Q465a00137
12982H7592K79756B5479a34859a1228D54703h6228D836K14322b0945j96343E7090
12970a4338q2748A72992a63333A76481a16538C0639a59469B16571B841f6769j13729
12959a80498B65659a62892g1803A81252D2836e475k44284B73240c6335B41442
12948A34755d50497c8999r6202A92977a36493A28457c45446c4179A35476k1439
12938A14037f1687B13123a84940A27235b49299b3746F8574i0995B25062G7003
$$ y = [180974, -40936, 199427, 383456, 165575, -95768, 101727, 181246, 212046, 165866, 301534, 178016, 455350, -126706, -148955, 80420, 279496, 173444, 230813, 221442, -50861, 166270, -46757, 9508, -476246, 168865, 88273, -148984, 241650, 125251, -105221, 192907, 201372, -100137, 87592, 367348, 25479, -134859, -11228, 454703, -86228, 4836, 219158, -20945, -217288, 57090, -14338, -97086, 172992, -163333, 176481, -116538, 30639, -159469, 216571, 2841, -66769, -180498, 265659, -162892, -71803, 181252, 42836, -5475, -249759, 273240, -36335, 241442, 134755, -450497, -38999, -135201, 192977, -136493, 128457, -345446, -34179, 135476, 114037, -61687, 213123, -184940, 127235, -249299, -23746, 68574, -90995, 225062, 77003]
12927b13272r756H313Q21a50872A43003b0812B76905R3418b54505A66034o0862
12916A05172L8538C5051J67382g254q431A01678P8149c3527A12164b21293B89185
12904e1195A51785E5157i4268j38827A22710J56842m5042b4896k371j6004m6441
12893h9712B27133a598r7821C4711q658f8242C06964A34244a03969a7139B01243
12881C3468a33933C1280P5224a44958A4145J46724h0601j95547H6161J75135G0902
12869i6793A23966O228J09209h4731C59618F7974a25479D43h8467I9497O628a64915
12856B80784E6077A2074i9400H7213J10821a54293E3633M5275J05653j00612c8935
12844E6785L1495Q3264J2608a42222B37948e7833B56308j23090a88453M0551A7223
$$ y = [-213272, -223028, 8313, 9134, -150872, 143003, -20812, 276905, 370323, -254505, 166034, 105172, 143710, 35051, 202433, -7254, -15685, 101678, 179827, -33527, 112164, -221293, 289185, -51195, 151785, 55157, -94268, -233095, 122710, 279552, 234510, -24896, -27267, -43271, -89712, 227133, -1598, -99419, 34711, 26053, -68242, 306964, 134244, -103969, -17139, 201243, 33468, -133933, 31280, 106504, -144958, 14145, 160869, -80601, -276148, 86161, 261296, 70902, -96793, 123966, 130194, 239403, -84731, 359618, 67974, -125479, 443, -88467, 99497, 106125, -164915, 280784, 56077, 12074, -99400, 87213, 198034, -154293, 53633, 98908, 204561, 103949, -38935, 56785, 88280, 171544, 184152, -142222, 237948, -57833, 256308, 133218, -188453, -147902, 17223]
12832b09715a436G1921d0117j42793d5590p3767N1780C14503F8443j0140K5786
12821H4089b21536L9396N2562M8979n8021A33103M164K09313i8597k26917F3299
12809B45256a71354K5806A87283D9223b59227N6850i7523A30008B9373a9541m1930
12798f1471A18960I652b17785A85148g9426b6482B77721C3211L33652B0124d9388
12786a14399o9052D2674a28856p6343O2229a0459j55526A67274a43322D6098h9553
12774A55205n7018b19962R8926j06209c3636B56964b78429A91365a8422B37827
12763a85027B20928b06154A9199e095D9042a02503R480c5195A16654a83592e5438
12751G6822J06209p0851a38728D175K6502g4728D2666i5987A60620e6793B23437
$$ y = [-209715, -1436, 71921, -40117, -182910, -45590, -119357, -67577, 314503, 68443, 58303, 84089, -221536, -182140, -129578, -80599, -138620, 133103, 137267, 346580, -98597, -325514, 63299, 245256, -171354, -145548, 187283, 49223, -259227, -202377, -97523, 130008, 29373, -19541, -61471, 118960, 9652, -217785, 185148, -79426, -26482, 277721, 33211, 366863, 20124, -49388, -114399, -183451, 42674, -128856, -205199, -142970, -10459, -165985, 167274, -143322, 46098, -89553, 155205, 98187, -219962, -121036, -227245, -33636, 256964, -278429, 191365, -18422, 237827, -185027, 220928, -206154, 19199, -5095, 49042, -102503, -93023, -35195, 116654, -183592, -55438, 76822, 183031, 112180, -138728, 4175, 30677, -74728, 42666, -95987, 160620, -56793, 223437]
12739b14786C4275b46631D24466r7277a8804B76647E9405M0772Q1986J0776m1612
12728A51327B549R963a84493j67750J6106B9318b62999A94311G919N4466J11994
12717A74379a16918L9374A18082C9865L9637d9401a7938B44642J51317Q2350j48339
12706C29970C9530J86087J24764C6510L34465d1965a483l5610C56400A6246J84975
12695B01221i4531j07584H9166a6986G2262b03233B24117B7716J80242k8241l8754
12684A40963E3767Q8302c2625Q780C99682B4090Q5091J2259N7674J34141h2412
12672B33343D6252d3036I5101K75535B3356L5182D856Q4482K35594A09444N5860
12661A65304j2290a5911B8824a00236E8421c5826E8965J46037L9007n2941J04151
$$ y = [-214786, 34275, -246631, 424466, 327189, -18804, 276647, 59405, 100177, 182163, 192939, 151327, 2549, 12512, -184493, -352243, -336137, 29318, -262999, 194311, 7919, 62385, 174379, -116918, -77544, 118082, 39865, 79502, -49401, -17938, 244642, 395959, 478309, 329970, 39530, 225617, 350381, 36510, 370975, -41965, -1483, -37093, 356400, 16246, 201221, -94531, -202115, 89166, -16986, 72262, -203233, 224117, 27716, 207958, 179717, 140963, 53767, 142069, -32625, -23845, 399682, 24090, 109181, 121440, 179114, 313255, -82412, 233343, 46252, -43036, 95101, 370636, 23356, 58538, 4856, 89338, 324932, 109444, 165304, 153014, -15911, 28824, -100236, 58421, -35826, 58965, 205002, 244009, 191068, 295219]
12650B95219H1914J04725n4304a23377C2448J23739J06142b1349D40522k17695
12640B22827A07609b90406B09922n3612D816J06240K3768P8447k4543F8252P2034
12629A40286J20885I0788K1267J8672J20717a8263k8074j44936E6872J6156J20554
12618A93582O3332r549l8212b97049b6338f503A3220a864A99507r8454J56450
12607B57503k5827a13159A38359j5849J52450o4246r0353J34572B1323J34290
12597A55613e7339k8446C5168b8761B15014C5580c8901F2512c7110B81059a53831
12585C13466H2516f5084H2116O5890n2883C3516J43047a9770C1628M3825M5183
12574A20636g0584L510j60717d5547D01954e0026l6596l8321C66126j10526i3865
$$ y = [295219, 81914, 186639, 132335, -123377, 32448, 156187, 262329, -21349, 440522, 222827, 107609, -290406, 209922, 156310, 4816, 111056, 134824, 213271, 188728, 68252, 140286, 261171, 90788, 112055, 130727, 251444, -18263, -46337, -191273, 56872, 73028, 193582, 256914, 247365, 209153, -297049, -26338, -6503, 13220, -1864, 199507, 101053, 257503, 231676, -113159, 138359, 122510, 274960, 210714, 120361, 254933, 21323, 155613, -57339, -85785, 35168, -28761, 215014, 35580, -38901, 62512, -37110, 281059, -153831, 313466, 82516, -65084, 82116, 148006, 95123, 33516, 176563, -19770, 31628, 75453, 120636, -70584, -67074, -227791, -45547, 401954, -50026, -86622, -124943, 366126, 255600, -93865]
12562A5134g9231o8472M5370j3001A24212c75343A42570l739a69154j601f584
12550A9389I568a52452a2178A39637L21375b18290G5470P6493b6924A09074l3341
12539G5733J36424a52917D4339e5836I212M3124M0562e4632k67952a1957H4663
12527A72640B9467N8400K28887g3888B17545m7935n3317O6917a85273I3244A4456
12515A52260c2807A83086q2474B1976g809k35423d5846D0L19091I1083B7833N8531
12503H6364i4443j37025A23154O5382b02842B22168G9448K20894c11163h3620
12492a1023B38836D0754h0865C8440K9028a66820c892k174o6588B7165a08953
12480B2484b07147c1089p9330H8046p151J94521k6871a89987G0738b98628B41442
$$ y = [15134, -79231, -147703, -102333, -115334, 124212, -375343, 142570, 138831, -169154, -170755, -6584, 19389, 9568, -152452, -12178, 139637, 461012, -218290, 75470, 151963, -26924, 109074, 75733, 212157, -152917, 44339, -55836, 9212, 52336, 92898, -54632, -322584, -11957, 84663, 172640, 29467, 87867, 316754, -73888, 217545, 169610, 116293, 183210, -185273, 93244, 14456, 152260, -32807, 183086, 100612, 21976, -7809, -243232, -45846, 40, 319131, 91083, 27833, 86364, -94443, -231468, 123154, 188536, -202842, 222168, 79448, 300342, -311163, -83620, -11023, 238836, 40754, -80865, 38440, 67468, -166820, -3892, -6066, -72654, 27165, -108953, 22484, -207147, -31089, -110419, 88046, 80895, 275416, 248545, -189987, 70738, -298628, 241442]
12468A26651J16083A11709d01580A18253e9576K9316B74344a83612e2511k46886
12458b99397J22193r5357B95842B3533a78735B67555b32648B15093g0355H5343
12447B9131K92616a76821b1715B11090g6714A50550J1291a57153q1977A45057
12436B80089e2417k3452A03691J90969b46497E29310a97265j0371F7919i5153
12425A12381J06069c20483C4877i3926A58117i6663H7774d21295f4155a3685A40996
12413F8817f316k99598A83717a94311l8088A35977a30777A40783c23631A09607
12402a99796E6078b31703f7063H9328J5206e9984r5623B4785l733g5204E4275
12390d5840C07239a92081A03780i0416C0031J17371h0642n9354O9155j33406c1949
$$ y = [126651, 242734, 111709, -401580, 118253, -59576, -30260, 274344, -183612, -52511, -299397, -177204, -272561, 295842, 23533, -178735, 267555, -232648, 215093, -70355, 85343, 29131, 321747, -176821, -21715, 211090, -76714, 150550, 161841, -157153, -239130, 145057, 280089, -52417, -75869, 103691, 294660, -246497, 529310, -197265, -207636, 67919, -95153, 112381, 218450, -320483, 34877, -93926, 158117, -96663, 87774, -421295, -64155, -13685, 140996, 68817, -6316, -305914, 183717, -194311, -232399, 135977, -130777, 140783, -323631, 109607, -199796, 56078, -231703, -67063, 89328, 104534, -59984, -155607, 24785, 21052, -75204, 54275, -45840, 307239, -192081, 103780, -90416, 30031, 147402, -80642, -139996, -70841, -204247, -31949]
12378B85685i8513B50611a2239B31994i939r1916K8678j87390a02871B96869c61710
12366B50784a33037M2317L988H5638e1122A74070p5770a68224L5423E9434j8049
12355D1385L4907a18767A02606a00976k6799B0974K9630k2491M8255F537N2049
12344E8586b66754B23790j00421a12220j18160O8086n4846J01374F8301c9812
12333c2972j54282A2248O8051r482f8064m0449A66739A8392a67151A43241J67044
12322C10285j53112A1291a2279G475J37144b84302d2258B7630a84396l710A65765
12310A48905K2066A4053P0111J34117b01705P9932e2368n0227C35504j15177A7140
12298b6842C2202K23375c7709k89347B28830e6855C72373B1020i8044A66130k9677
$$ y = [285685, -98513, 250611, -12239, 231994, -9939, -101855, -73177, -260567, -102871, 296869, -361710, 250784, -133037, -90720, -86732, 85638, -51122, 174070, 98300, -168224, -132801, 59434, 41385, 76292, -118767, 102606, -100976, -127775, 20974, 50604, 28113, 76368, 6537, 58586, -266754, 223790, 123369, -112220, -230380, -162294, -217140, -115766, 68301, -39812, -32972, -187254, 12248, 80299, 70817, -68064, -108513, 166739, 18392, -167151, 143241, 310285, 157173, 11291, -12279, 7475, 144619, -284302, -42258, 27630, -184396, -188106, 165765, 148905, 170971, 14053, 84164, 218281, -201705, -121773, -52368, -102595, 335504, 220327, 17140, -26842, 32202, 255577, -37709, -327056, 228830, -56855, 372373, 21020, -98044, 166130, 136453]
12287A36453L406a32445A2636O696J17644f6426A43537A0793a03104A62034o2469
12276I9565K12085D7772L86801A59743J23463N2792f2724A46363a58466D9072
12265B05481K01857C7869L46380j82661E9762Q1567R4754C2801N7511l0762J60628
12254B20178p2361i3238b6241I9789B7150K80167M3361b2198A54325D0920M69271
12243E10191j17317K4822a0968I2087K21558A7436J31334l6053J24750E9573O4881
12232A24454B3402J27037L3521P484l6656E8228K97555A42129J89399H1095Q4365
12221A65460R5651J85000A47477C5127N926J51178L93190f7822A43290J72088
12211C15378K17662j26282j59828a1420H0766b31760B761d0719B15747J9882Q7491
$$ y = [136453, 139859, -132445, 12636, 19332, 136976, -66426, 143537, 10793, -103104, 162034, 99565, 311650, 47772, 434573, 159743, 283206, 335998, -62724, 146363, -158466, 49072, 205481, 407338, 37869, 384249, 201588, 59762, 141329, 236083, 32801, 90312, 59550, 220178, 147817, -93238, -26241, 99789, 27150, 307317, 350678, -22198, 154325, 40920, 510191, 392874, 417696, -10968, 92087, 313645, 17436, 148770, 112717, 237467, 59573, 124454, 23402, 150439, 183960, 191444, 154788, 58228, 355783, 142129, 331528, 81095, 165460, 261111, 446111, 147477, 35127, 41053, 192231, 585421, -67822, 143290, 315378, 533040, 406758, 246930, -11420, 80766, -231760, 2761, -40719, 215747, 235629, 323120]
12200C23120b7797B23291L0597A17736a42562D4897i7135B89395F2380f0381D39745
12188I2150f8491A19503k1340J98615E2321J58395a46992A11618a07913A34880
12177C79042c0882j4141F8159f2470K3377F5544c1484B15645A04588c35436B57297
12165A85225b37372O9988D09771A10788B280J13546P5766b50822A65617J84568
12155C50185f9153a9160C7043a08488A27145b4987C12237e2159A50309G3750J55880
12144B29630a26286C1741Q7633J7217D2185a18351c4369D7203K01905B0908c6334
12132B41590a95845J090A16032k9047M1292D8171a60883A62652E4685O8876b17364
12120B52297r0122e5584A6680b39324C7773J20713b10732A94480L7094h8354F2698
$$ y = [323120, -27797, 223291, 253888, 117736, -142562, 44897, -97135, 289395, 62380, -60381, 439745, 92150, -68491, 119503, 98163, 296778, 52321, 210716, -146992, 111618, -107913, 134880, 379042, -30882, -45023, 68159, -62470, -39093, 65544, -31484, 215645, 104588, -335436, 257297, 185225, -237372, -167384, 409771, 110788, 2280, 115826, 191592, -250822, 165617, 350185, -69153, -19160, 37043, -108488, 127145, -24987, 312237, -52159, 150309, 73750, 229630, -126286, 31741, 119374, 136591, 42185, -118351, -34369, 47203, 249108, 20908, -36334, 241590, -195845, -194755, 116032, 86985, 128277, 48171, -160883, 162652, 54685, 123561, -217364, 252297, 162175, -55584, 16680, -239324, 37773, 158486, -210732, 194480, 231574, -88354, 62698]
12108D1898R8417o9061f7011l34641C06724a22571a5656A70255A9266b02150F4238
12096e7154I6917J62126d5998H35J3718d528n8652A39482b22124J2526A26406
12084A18341f3852o0477D21934c09603C6398K79908a01225H3827e1472A23875
12073A9671P3221b7266E2965N97803L90853N78507F17158j84401r0748C9996J1977
12062E1973a95600c1548H8479J25065J5565r2688f7419k45538I0313h4851p0394
12051a55245d3947r9951n3465G7588a02551j12758b2126m117P065j38602A81740
12039A76417c70705d6121o504l3968A64130F8920R0429d3070r8448D4308J94524
12028B38832k0694M1039a09387k8366O3595P864j37049C08269g0655I904J42289
$$ y = [41898, 140315, 71254, -67011, -401652, 306724, -122571, -15656, 170255, 19266, -202150, 64238, -57154, 96917, 259043, -45998, 835, 14553, -4528, -63180, 139482, -222124, -209598, 126406, 118341, -63852, -124329, 421934, -309603, 36398, 316306, -101225, 83827, -51472, 123875, 19671, 92892, -27266, 52965, 650768, 1041621, 1620128, 617158, 432757, 342009, 39996, 51973, -195600, -31548, 88479, 213544, 229109, 136421, -67419, -312957, 90313, -84851, -155245, -43947, -143898, -197363, 77588, -102551, -215309, -22126, -26243, -19178, -157780, 181740, 176417, -370705, -46121, -52625, -86593, 164130, 68920, 159349, -43070, -141518, 44308, 238832, 218138, 259177, -109387, -137753, -74158, -66294, -203343, 308269, -70655, 9904, 152193]
12017A52193J20754a81314m6144a07707F7745M2286b40143A11969a7977l337p0539
12006i1853G8208P4007J14434a4748l29378a33839I8913c12354C0435b26855A02155
11994D9388g5224B22329G2145b54321K4319M2174b7880j97559A19804a02335A35508
11982d7354j3824G0754J55750h3423A28316K24901a21365e8448k4311A2273a43719
11970A92379J0054a41507A66169i09D5328b66501e3150A9425K70233g0315r278
11959g9593A35451E8588M4718c1738j08644A25288r309D2561P6605c5730j33087
11948a68817J9723M5009J3410q2329B4301P5218M7261a85970b6848A93414a49202
11936a22832A1799J66343a32181J6689m5968e4888j94060B99430H3681f1515k49284
$$ y = [152193, 272947, -181314, -227458, -107707, 67745, 110031, -240143, 111969, -17977, -21314, -91853, 78208, 152215, 266649, -14748, -344126, -133839, 98913, -312354, 30435, -226855, 102155, 49388, -75224, 222329, 72145, -254321, -230002, -187828, -27880, -225439, 119804, -102335, 135508, -47354, -61178, 70754, 226504, -83423, 128316, 353217, -121365, -58448, -82759, 12273, -143719, 192379, 202433, -141507, 166169, -909, 45328, -266501, -53150, 19425, 289658, -70315, -79593, 135451, 58588, 103306, -31738, -140382, 125288, 115979, 42561, 119166, -35730, -168817, -149094, -104085, -90675, -173004, 24301, 99519, 146780, -185970, -26848, 193414, -149202, -122832, 11799, 178142, -132181, -115492, -161460, -54888, -248948, 299430, 83681, -61515, -310799]
11925c10799A13827a43677A4199M47394c33043F508b70965A05880J5937J4835
11915A36652a1514H9187h6935I6835J5509e1733A95017p6845d75014G9314a3397
11903E7092b40665B18402o1418K5122D2872b2310j12852A82342F2948a75939D9352
11891d5358k2889D8972K07586r7720e43971J88203A3699a20290F7571a1151o359
11880a7510j76864B27279o7243a50722D0135d9862B2114Q21J09903a8679j16410
11869a35089A16076f7584d482j28424A20066J14465P2143a17157o5215r7187g1704
11857c8003j54201a4180j09282C22644b87921J19976B43780A7397L85962j98034
11847B05325J96642b8402A0066L0921a50491D0200K48739j16394f8715E814L03264
$$ y = [-310799, 113827, -143677, 14199, 461593, -333043, 6508, -270965, 105880, 121817, 136652, -11514, 89187, -86935, 96835, 112344, -51733, 195017, 118172, -475014, 79314, -13397, 57092, -240665, 218402, 156984, 182106, 42872, -22310, -135162, 182342, 62948, -175939, 49352, -45358, -68247, 48972, 256558, 158838, -543971, -355768, 13699, -120290, 67571, -11151, -17510, -194374, 227279, 160036, -150722, 40135, -49862, 22114, 22935, 132838, -18679, -135089, 116076, -67584, -4482, -132906, 120066, 234531, 306674, -117157, -182372, -279559, -71704, -38003, -192204, -14180, -123462, 322644, -287921, -167945, 243780, 17397, 403359, 205325, 401967, -28402, 10066, 40987, -150491, 40200, 288939, 172545, -68715, 5814, 309078]
11836C09078a90441j96476q119a50517B682L38336a52709K6280c9564C7103b95019
11824c08250a12247k5647n6288E2774f937B02071e2889q8452A26190b34371A59556
11812C60210b78529A76763a68220k4543A73456f8334a8869B92311c12655c2342
11801b35563G5258b45355H4440A6520J01837e6958a2622A55728a94537G8666g3556
11789a57694B69178A24187B714R5581a58968K654I8391K6987e8158m9113b7083
11777b74129B22819A07695J13819i9665a9516j05906r2659A06038Q5964b35930
11766d9946B13508f944j92118j54351C68048a4230G8751a83414D4131b36851F8487
11754F6160a50635E0575a5339j89939b4479q2561b314B21474d09243C89398d68990
$$ y = [309078, -190441, -386917, -395036, -150517, 2682, 341018, -152709, -126429, -39564, 37103, -295019, -308250, -112247, -137894, -194182, 52774, -6937, 202071, -52889, -141341, 126190, -234371, 159556, 360210, -278529, 176763, -168220, -192763, 173456, -68334, -18869, 292311, -312655, -32342, -235563, 75258, -245355, 84440, 16520, 118357, -56958, -12622, 155728, -194537, 78666, -73556, -157694, 269178, 124187, 2714, 98295, -158968, -156314, 98391, 125378, -58158, -107271, -27083, -274129, 222819, 107695, 221514, -99665, -19516, -125422, -218081, 106038, 192002, -235930, -49946, 213508, -6944, -199062, -353413, 368048, -14230, 78751, -183414, 44131, -236851, 68487, 66160, -150635, 50575, -15339, -205278, -24479, -107040, -2314, 221474, -409243, 389398, -468990]
11742h9982J5801n3449A47082e622k38733K1281A37550b49542B20025d4133H5609
11730A07222a22203m6524A42558a5934l01556A00460D9912b18942C092J64458
11720A67550Q898c38073C38398a40136c852D3590J95416N9197a92855B22459A2747
11708c3252B44477c9046r1030D2377J65558a48537C1454a7016p8340G5919a45477
11696B09917e1050J8903B38937a05662e614B43115a50966D3971J90892d4163F5797
11684f6178G9512K25479j12656i2866A1114J99088A6180d2396G0744P9832b0548
11672b93341I5618R4827b2397j60782H515J77162J81086b35184J09484e4850k22923
11661b77773B01614Q7890j09663g6955C00127f5709A47984D7807M6556a54495
$$ y = [-89982, -74181, -127630, 147082, -5622, -244355, -223074, 137550, -249542, 220025, -44133, 85609, 107222, -122203, -168727, 142558, -15934, -317490, 100460, 49912, -218942, 3092, 167550, 176448, -338073, 338398, -140136, -3852, 43590, 239006, 298203, -192855, 222459, 12747, -33252, 244477, -39046, -130076, 42377, 207935, -148537, 31454, -17016, -95356, 75919, -145477, 209917, -51050, -32147, 238937, -105662, -5614, 243115, -150966, 43971, 234863, -44163, 65797, -66178, 79512, 304991, 192335, -92866, 11114, 210202, 16180, -42396, 70744, 150576, -20548, -293341, 95618, 190445, -22397, -183179, 8515, 185677, 366763, -235184, -125700, -54850, -277773, 201614, 289504, 179841, -76955, 300127, -65709, 147984, 47807, 94363, -154495]
11650D6556b43886B16163l1791q8577N4897p0946P7819F5607d83680A16074J24743
11639B40817a65256B69400E3673a51516A95227D5904a34778A38945B6223K5727
11629E1950R4856f0390D1509a22060I3204D6059M1815B0892J36460A1815K22658
11618B34473j05691E6907g4250j76237G9634Q0382J41374d4619k16074i7293B17502
11606A80762a30149j47275c8758B32366i0395B37072j02003o6852J66707A04575
11595A6040D432M2784O8739f9818C9756K62754A37786m6629l5484M78369b298
11583h2638H095K75595c85941c0299q0194D3973c35282e1900B04120D9865J03572
11572A53437f2325b301m8502A51775p4194a41519b7620D37594A61159b8385m6752
$$ y = [46556, -243886, 216163, 184372, 95795, 150692, 79746, 157565, 65607, -483680, 116074, 240817, -165256, 269400, 53673, -151516, 195227, 45904, -134778, 138945, 26223, 51950, 146806, -60390, 41509, -122060, 93204, 46059, 87874, 20892, 157352, 11815, 234473, 128782, 56907, -74250, -250487, 79634, 160016, 301390, -44619, -260693, -97293, 217502, 180762, -130149, -277424, -38758, 232366, -90395, 237072, 135069, 68217, 234924, 104575, 16040, 4432, 47216, 115955, -69818, 39756, 302510, 137786, 91157, 55673, 534042, -2298, -82638, 8095, 283690, -385941, -30299, -110493, 43973, -335282, -51900, 204120, 49865, 153437, -62325, -2301, -50803, 151775, 77581, -141519, -27620, 437594, 161159, -28385, -75137]
11561g5137A10747B0799K8131a05856q1373B07485b10069B4964J15434a44513
11550D4435k1452a26509A41999i3304j34991B04850p4280E4255k1657K48021f7538
11538b21981b6724H1205l1575J52938L078a0892E3578R5559b64207J22361A7601
11526A37163i8774a1851r602k36282B6917O4255J19073a12626I3434J87645q7181
11515A93898A0324J95708c8449E8003K23242A36323A5992K87353F896P2080K6559
11504A05535K58461E1915K58835D9834M82127B08976G985J42188J13013K5202
11494B88388r3327e9775j63950a6800A25267d4685B38146q3826a83444c5625A31057
11482B38779K25950H3119j2995K14767A33653l0165J0970E827J37237b61860D8144
$$ y = [-75137, 110747, 20799, 48930, -105856, -187229, 207485, -210069, 24964, 140398, -144513, 44435, 22983, -126509, 141999, -93304, -228295, 204850, 130570, 54255, 32598, 280619, -67538, -221981, -26724, 81205, 49630, 202568, 205646, -10892, 53578, 149137, -264207, -141846, 17601, 137163, -98774, -11851, -21453, -257735, 26917, 91172, 210245, -112626, 93434, 281079, 193898, 10324, 206032, -38449, 58003, 281245, 136323, 15992, 303345, 6896, 78976, 105535, 363996, 51915, 310750, 49834, 531961, 208976, 7985, 150173, 263186, 288388, 195061, -59775, -223725, -16800, 125267, -44685, 238146, 154320, -183444, -35625, 131057, 238779, 464729, 83119, 70124, 284891, 133653, 103488, 114458, 5827, 143064, -261860, 48144]
11470A71624o9072b99728B52667F1156O0388M12071A21641D7087e6853D42801
11459e712B9703l176R7787K78335A45743i9523g623A42366O8689Q8197a6007A73646
11446F1306g3492E54793b8401H5886R321A6130K10754a55814A44161R1870A17519
11434A41832K20393G1182f7418A68621J20635A44220k4693i4744A86768P9909
11424B66677D5940c0938k46272F824N7799a79789B94186j40574D3898h8560k1594
11413a10154d4723j27506C18789j4608a01237j15204f6020k03700j235b2524B89155
11401A1472J32179J62263g621A29056Q0407O5538b13971a1470l5554C2114L3025
11390F5139b48467K433d0148n6375A71094A5681J20756a38095d9530D3124J58520
$$ y = [171624, 102552, -299728, 252667, 61156, 121544, 533615, 121641, 47087, -56853, 442801, -5712, 29703, 26527, 124314, 402649, 145743, -99523, -7623, 142366, 211055, 299252, -16007, 173646, 61306, -73492, 554793, -28401, 85886, 95207, 16130, 226884, -155814, 144161, 236031, 117519, 141832, 362225, 71182, -67418, 168621, 289256, 144220, 119527, -94744, 186768, 266677, 45940, -30938, -277210, 6824, 64623, -179789, 294186, 153612, 43898, -88560, -110154, -44723, -172229, 318789, 304181, -101237, -216441, -66020, -269720, -270955, -22524, 289155, 11472, 143651, 305914, -7621, 129056, 209463, 275001, -213971, -11470, -47024, 32114, 65139, -248467, -246034, -40148, -96523, 171094, 15681, 136437, -138095, -49530, 43124, 201644]
11379B01644J55547p3332N3793b30794d1919C51964F4805A0351R3325n532C3317
11367C04909b0822I841K34365a57442k41825C11661A49954k8464I095J25116a29211
11355d5080A53711d8848b2390n7325j54167J02739j9044K2384B93468o2542L2027
11344B62953b16462B30911c8581j377k42053b5084o8716l2056G3312d7011B03819
11332H9433f750m3769j73946o3640A78043d7263E5040J4458e1641B20923a12409
11320D27747B9787a32629A01841E0399N0820m2024d29114A77125d8198o1289A51216
11308A88019c15772b4825q9993a0683A05460b12171I1182h5674I5744b87223k0647
11297c07870A08384a98245R996H0327c94352B7826K86363A23696R775a49521A41961
$$ y = [201644, 357191, 283859, 337652, -230794, -41919, 351964, 64805, 10351, 103676, 98144, 33317, 304909, -20822, 9841, 244206, -157442, -399267, 311661, 149954, 121490, 9095, 134211, -129211, -45080, 153711, -48848, -22390, -79715, -233882, -131143, -150187, -127803, 293468, 230926, 262953, -216462, 230911, -38581, -39958, -282011, -25084, -93800, -125856, 73312, -47011, 203819, 89433, -6750, -50519, -224465, -288105, 178043, -47263, 55040, 69498, -51641, 220923, -112409, 427747, 29787, -132629, 101841, 50399, 101219, 59195, -429114, 177125, -48198, -109487, 151216, 188019, -315772, -24825, -114818, -10683, 105460, -212171, 91182, -85674, 95744, -287223, -307870, 108384, -198245, -188249, 80327, -394352, 27826, 314189, 123696, 133471, -149521, 141961]
11285A40227b70488N7188c3361q2698a437B74512d2049j52740P9251G6152a3203
11273A38943j5883b83377A35488K1188a38182q0906M2042Q0396k5452B942i2841
11261a33585A9588i7301B2355b86031c818l60473a54411e8206F7094J64027a48307
11249E4234K03572g4191k21976B91589F2574j0317L4248a39921A98597a067j56110
11238a57177L2693B7029a16094K482A37117n921P9396o3935c48866B65455C9979
11226A1415J6284a35218G0707J86999D288g3704K648I9599a2209l608r9727C6273
11213c65199J68710N567A33749b94309a43659O8483A84875i7870l8665B25603
11202E9129a75600g8638p4210N752k03144J40241i0391B47188B9652d02823g8384
$$ y = [140227, -270488, -213300, -33361, -116059, -1437, 274512, -42049, -194789, -115538, 76152, -13203, 138943, 123060, -283377, 135488, 156676, -138182, -219088, -177046, -96650, -122102, 2942, -92841, -133585, 19588, -97301, 22355, -286031, -3818, -364291, -154411, -58206, 67094, 231121, -148307, 54234, 257806, -74191, -296167, 291589, 62574, 52257, 86505, -139921, 198597, -1067, -157177, -124484, 27029, -116094, -113612, 137117, 131196, 210592, 146657, -348866, 265455, 39979, 11415, 27699, -135218, 70707, 257706, 4288, -73704, -71056, 99599, -12209, -15817, -115544, 36273, -365199, -196489, -190922, 133749, -294309, -143659, -75176, 184875, -97870, -136535, 225603, 59129, -175600, -78638, -152848, -147096, -350240, -209999, -90391, 247188, 29652, -402823, -78384]
11190c53790A42702L29282e1062k02743J18895C1636N2820B9662M11861D2705
11179e3837j9081D498a98514D25235c36391B7660H764g8519A00263a61497k9234
11168a90731G9057J59778B0434a74943j82208i2139E1715f32p9912l8840a3342
11156B758a37067b8656F4076J84027a47081B04118c73701a43357b1190B35683
11145B44440j04176D3360a06861A26805c5485C55362e6611j06278n5551B99196
11134F913b57279m4352A68258d6561C5419J39876a56522C5082M6383q992b06753
11122F9808M3605g0908I9904m7765A1968R1715b8743J714I7058P1376M8568f3284
11109B30988a58485M401c1939B11774K10425B5917L97104j88505j11257G273N9126
$$ y = [-353790, 142702, 471984, -51062, -253805, -134910, 31636, 84456, 29662, 441523, 42705, -53837, -72918, 4498, -198514, 425235, -336391, 27660, 8764, -78519, 100263, -161497, -190731, 79057, 238835, 20434, -174943, -357151, -92139, 51715, -632, -80544, -119384, -13342, 2758, -137067, -28656, 64076, 248103, -147081, 204118, -373701, -143357, -21190, 235683, 244440, 140264, 43360, -106861, 126805, -35485, 355362, -56611, -162889, -218440, 299196, 6913, -257279, -301631, 168258, -46561, 35419, 175295, -156522, 35082, 81465, 72473, -206753, 69808, 113413, -70908, 99904, 52139, 11968, 103683, -28743, -27029, 97058, 168434, 217002, -63284, 230988, -158485, -154084, -31939, 211774, 422199, 25917, 423021, 234516, 123259, 7273, 66399]
11098F6399R6697J88965j43788j2000J69065M816A10679M393J46146A28197L00135
11087D28332J49435j99914H5207J74393F9001J87431J39829j4086A4499g224B25333
11075D98924B17769R7080j525B7958L48137K15620k45741J34870G6360L00489
11065C76849J87706m6428R236K19880l32802J46173L6960j16373M27133l55426
11055E52908J98K21962l58916M30198J40067N1408l28434q9186K01799r9126O758
11044G29636C15879L33107L1103L0880R9375K89012l35281L495r6132k06723R7573
11033E62288J59177l6257J31063r0919k49110L21370J28210j49384Q8080M0561
11023I05079j95317L97965n51639J22885j73155J0486J61159M9392K17164o2205
$$ y = [66399, 163096, 352061, 208273, 196273, 365338, 370154, 110679, 115072, 261218, 128197, 428332, 577767, 377853, 85207, 259600, 69001, 256432, 396261, 382175, 14499, -7224, 225333, 498924, 217769, 314849, 313324, 27958, 376095, 591715, 345974, 480844, 76360, 376849, 564555, 518127, 527363, 747243, 414441, 560614, 597574, 481201, 908334, 552908, 553106, 775068, 416152, 846350, 986417, 1037825, 709391, 620205, 822004, 722878, 729636, 315879, 648986, 680089, 710969, 810344, 1099356, 764075, 767570, 671438, 464715, 562288, 721465, 685208, 816271, 725352, 476242, 797612, 925822, 776438, 864518, 905079, 709762, 1107727, 556088, 678973, 505818, 516304, 677463, 726855, 944019, 881814]
11013H81814k86701O0732n9953K05307l26999Q0647J20408p5670k24899K29510
11003F04196K32428j21995p7827k4255M78980l52692R113r9553k92992M31504
10993G86907p904j31585K83995j23166j3618L20347P6131l59186P4622K01238
10983A107781O2313L71023J91960m81511K49519L27312m7528K41765M14444L16700
10973B753778N89534k45486n4920M6319m12319k90393j69326k70504K77186l87879
10963A835990l05399J75242K99001k59972J55814n2395r9269J87541j38508k99085
10953A498960n35376J16947O238K75110F79794j54208J15028k15073N767l0543
10943D00765j06129M7108r7990J93660A85952e3665G6781K73570E2034b12971
$$ y = [881814, 595113, 655845, 595892, 801199, 474200, 554847, 675255, 599585, 374686, 604196, 836624, 714629, 636802, 612547, 1091527, 738835, 747948, 648395, 355403, 786907, 779003, 647418, 931413, 808247, 794629, 1114976, 1191107, 831921, 906543, 1107781, 1170094, 1541117, 1733077, 1251566, 1501085, 1828397, 1780869, 2022634, 2437078, 2753778, 3343312, 3097826, 3042906, 3089225, 2676906, 2386513, 2217187, 1946683, 2223869, 1835990, 1530591, 1705833, 2004834, 1744862, 1900676, 1848281, 1749012, 1936553, 1798045, 1498960, 963584, 1080531, 1086769, 1361879, 679794, 525586, 640614, 425541, 431308, 400765, 294636, 341744, 243754, 437414, 185952, -53665, 76781, 350351, 52034, -212971]
10932A51195K5926l5107J81622c834j65183D6560I481K3516R4059J43450c1929
10920C4943f2900k57628A12948a70473c2796A73133J15816H2291a59626b5646
10909a58176e261j69516j77706J27324A18812E2916M826K1549L1649A9299b92039
10897c01712B85674A04833a47871d9076l3986A33263e9788k70831C38032B1734
10886B29513j1473Q637I9199h5129D377P1910a53366D72590b9658j4245K1828
10875b2075j01249A82614b44004B0783F142a81523A15767b7756B07168i9280J6743
10864h2537l1365C61853a94849C1102f8136A76429L34751a38150B2634a24867
10853a16682C42174A06147e7855B17812a77547A22927a06700j54375e7736A06536
$$ y = [151195, 177121, 142014, 323636, -3834, -169017, 46560, 9481, 32997, 127056, 270506, -31929, 34943, -62900, -320528, 112948, -170473, -32796, 173133, 288949, 82291, -159626, -25646, -158176, -5261, -174777, -352483, -225159, 118812, 52916, 57742, 79291, 110940, 19299, -292039, -301712, 285674, 104833, -147871, -49076, -83062, 133263, -59788, -330619, 338032, 21734, 229513, 218040, 226677, 99199, -85129, 4377, 76287, -153366, 472590, -29658, -43903, -22075, -123324, 182614, -244004, 20783, 6142, -181523, 115767, -27756, 207168, -99280, -82537, -113902, 361853, -194849, 31102, -68136, 176429, 511180, -138150, 22634, -124867, -116682, 342174, 106147, -57855, 217812, -177547, 122927, -106700, -261075, -57736, 106536]
10842d44815b8186a2367C74496b17536k74455A27334e6877p3885A561J02228j1857
10831I1932K03424a95757Q4969k01759A24128b21420h6081F3367Q6038a41208
10820c39419A62828A3883b15838o5455d4030j09993d6383j8554j17393h0962A0010
10808A95477a37157C26911a58194g7918j34549E8258a73099A17639b76890B19534
10797b92974B7468a0777j54243D00758a25012j37477d5643B1079J26961m1130
10787A06910a12565a1858j78519g2157A06949P2069K9a51649M3099j00455c9552
10775E1994d12030a82210B5908a08362K4712c1505A80218a52832c9181A89278
10764B3536H549e5143C4079J48598a76794F7874a45121B01557i317p116r9708
$$ y = [-444815, -28186, -12367, 374496, -217536, -491991, 127334, -56877, -130762, 1561, 103789, 91932, 295356, -195757, -110788, -312547, 124128, -221420, -86081, 63367, 149405, -141208, -339419, 162828, 13883, -215838, -281293, -44030, -154023, -46383, -64937, -182330, -80962, 10010, 195477, -137157, 326911, -158194, -77918, -212467, 58258, -173099, 117639, -276890, 219534, -292974, 27468, -10777, -165020, 400758, -125012, -262489, -45643, 21079, 148040, 106910, -112565, -11858, -190377, -72157, 106949, 179018, 179047, -151649, -108550, -209005, -39552, 51994, -412030, -182210, 25908, -108362, -83650, -31505, 180218, -152832, -39181, 189278, 23536, 8549, -55143, 34079, 182677, -176794, 67874, -145121, 201557, -9317, -16433, -116141]
10753a16141b5431B08064G9561C2917h3201B31124l4165f6206j60251b2733j92108
10742b14841a4633o3164A50033a99105h0288a9339j32159M0889A21361J28724
10732B50085b88057N6795n4285O8419j52157e6220m878A32457J70045b29151K8016
10721b01135N1042m1530q0979O4220D8458N1190L5528i7253b9470A60361j7621
10710A42740G067a91172D2878a39310D892f9648F7055g9275A70010k0364b11603
10698c64403a45130k37895F044J08761a03036j5131p1699l5727f3936I7839a07090
10686d347A36212n3382a65588A31659A1355c31858j33354i3708c1317I568L35183
10675C44751H8825N2023F980Q6973a69122e8191B2548R1339b25329j27981A2643
$$ y = [-116141, -25431, 208064, 79561, 32917, -83201, 231124, 196959, -66206, -226457, -22733, -214841, -14633, -77797, 150033, -199105, -80288, -19339, -151498, -110609, 121361, 250085, -288057, -231262, -285547, -217128, -369285, -56220, -61098, 132457, 302502, -229151, -201135, -150093, -191623, -272602, -208382, 48458, 99648, 135176, -97253, -29470, 160361, 142740, 7067, -191172, 42878, -139310, 4892, -69648, 67055, -79275, 170010, 149646, -211603, -364403, -145130, -383025, 6044, 114805, -103036, -118167, -189866, -225593, -63936, 97839, -107090, -4347, 136212, 82830, -165588, 131659, 11355, -331858, -465212, -93708, -31317, 9568, 344751, 88825, 140848, 6980, 93953, -169122, -58191, 22548, 113887, -225329, -353310, 12643]
10663a23703D8348M1418Q1735b01725k44326B742a17888A0101L92764c43915a19732
10651a20451b8580F4569b74892J10254M3636M3432D2268M9010j7716h08j62452
10640a63260G1104C4405a7194j17412B69817f6601A9605d0867o4039p1680k00850
10629c77436a62530B86058f4296I336a93426G7656M8268d1691L745j13358g5100
10617c59535a16902C9496b37061P005O4912C677K46997D6611a57000h730j34171
10606a42901j34164A61883N1321G0613c29999I4109d2539D4623b40682g5607H1014
10594C2988c24162a10853n1082d4536m4486k4369k2867k09922b3790b00B7370
10582a10268A05768J18472b462o9784A60990c2066D5637j7759c55510a15730n0158
$$ y = [-123703, 48348, 89766, 171501, -201725, -446051, 2742, -117888, 10101, 402865, -343915, -119732, -120451, -28580, 64569, -274892, -164638, -121002, -77570, 42268, 91278, 73562, -808, -163260, 71104, 34405, -17194, -134606, 269817, -66601, 19605, -40867, -104906, -176586, -377436, -162530, 286058, -64296, 9336, -193426, 77656, 125924, -41691, -37946, -151304, -75100, -359535, -116902, 39496, -237061, -230056, -165144, 3677, 250674, 46611, -157000, -8730, -142901, -277065, 161883, 213204, 70613, -329999, 94109, -42539, 44623, -240682, -75607, 81014, 32988, -324162, -110853, -161935, -44536, -89022, -113391, -136258, -346180, -23790, -200, 27370, -110268, 105768, 224240, -2462, -72246, 160990, -32066, 45637, 27878, -355510, -115730, -165888]
10571a65888j66493a43973j69621A69190i4160l6129A86750K6275p3136c4972
10560B28022B6236b37321D806J68873d67047a50347l4449l5269b2386j48088j4721
10549a85195g3902p8737A51532c72690A83874b66187H002c8283r0736j65929o768
10538c01716E0872J07062L95816H0989a48117m2131I476J87603n6568a4067A48943
10526A89663k4325A5234a46828I6753m0714N7911a66002B28969r0213N7337a86607
10514E2702g181H8410O9723m6456R3208b18982O3680K2192f4737J7096C31973
10502a64434e7959E1922J16669a60465B48360a84863K5672K2996j6193e9604l11222
10491c70826E0756b27418e5671f35H051K2900O4864L9804L27858j72622K52373
$$ y = [-165888, -332381, -143973, -313594, 169190, -94160, -130289, 186750, 213025, 139889, -34972, 228022, 26236, -237321, 4806, 173679, -467047, -150347, -184796, -220065, -22386, -170474, -185195, -73902, -152639, 151532, -372690, 183874, -266187, 8002, -38283, -129019, -294948, -301716, 50872, 157934, 553750, 80989, -148117, -190248, 9476, 197079, 140511, -14067, 148943, 189663, 165338, 15234, -146828, 96753, 56039, 113950, -166002, 228969, 138756, 196093, -186607, 52702, -7181, 88410, 158133, 111677, 204885, -218982, -155302, -133110, -64737, -47641, 331973, -164434, -57959, 51922, 168591, -160465, 248360, -184863, -159191, -136195, -152388, -59604, -370826, 50756, -227418, -55671, -635, 8051, 30951, 95815, 135619, 463477, 290855, 543228]
10480E43228p727j66356J0803C1432b1829E7152L14039C1723J15065b3073G8410
10468B71647c27149J42229M6171i603D437b0872B5907a33585G9423g2558n9981
10457a32539A37690F7242Q0559b203A69626i5386j45178G0389B0280K57614l3327
10446B44567g6499D2827c7746l329A21547P8362d3802C39258a25969G9842k4768
10435E5074j2779K07563H2049b94440O3761D2441J23917d3178C01987A1861a44139
10423c35158N5792C591K2204b53924C08658j40294d025C27725B3616J19258a66927
10411d7703A11066b66985P1948P2935B56513e3406k74715a38272c9211k42634
10401b81845E1941i0294J4680F762b20314m4151B48475K25970e1342p097E7047
$$ y = [543228, 535501, 369145, 379948, 31432, -21829, 57152, 371191, 31723, 146788, -23073, 78410, 271647, -327149, -184920, -138749, -9603, 4437, -20872, 25907, -133585, 79423, -72558, -132539, 137690, 67242, 147801, -2203, 169626, -95386, -240564, 70389, 20280, 277894, 244567, -76499, 42827, -37746, -41075, 121547, 199909, -43802, 339258, -125969, 79842, 55074, 42295, 249858, 82049, -294440, -230679, 42441, 166358, -43178, 301987, 11861, -144139, -335158, -279366, 3591, 25795, -253924, 308658, 168364, -4025, 327725, 23616, 142874, -166927, -47703, 111066, -266985, -195037, -122102, 256513, -53406, -328121, -138272, -39211, -281845, 51941, -90294, -75614, 6762, -220314, -264465, 248475, 474445, -51342, -58439, 57047]
10389a69248C54212J11738E8946J2720J83008o5753Q3872B0128J73143L8658E9948
10377B35387K36387b23656A40251n3908M62212h794B77765J9522O8692P8886K67188
10366G12053J9923A04802J34543K08224j72293A30782m2566L52371B2379O6369
10356H8748L18560G8067K64939n5061L46340K6039l18493A64161J30465F9611
10345A99584K007K02494P2682J2352k22899b2528E16047B13868K08217F6118K19551
10334B85669H2065a19756A73826a64013A86063a32574N8676A71607J20446b73751
10323A46388P7793l7692k5764J169b2661C81630H4448M9624a63673H6302K17719
10312C04021H0257P2546b33015c9520k33671f064G837J18033Q9261l4445a18891
$$ y = [-169248, 354212, 465950, 58946, 71666, 254674, 188921, 272793, 20128, 193271, 231929, 59948, 235387, 471774, -223656, 140251, 86343, 548555, -8794, 277765, 297287, 365979, 444865, 712053, 731976, 104802, 239345, 447569, 275276, 130782, 88216, 440587, 22379, 88748, 407308, 78067, 343006, 287945, 634285, 660324, 341831, 164161, 294626, 69611, 199584, 201591, 404085, 476767, 489119, 266220, -22528, 516047, 213868, 422085, 66118, 285669, 82065, -119756, 173826, -164013, 186063, -132574, -73898, 171607, 292053, -273751, 146388, 224181, 186489, 160725, 161894, -22661, 381630, 84448, 134072, -163673, 86302, 304021, 80257, 152803, -233015, -39520, -273191, -6064, 7837, 125870, 215131, 180686, -118891]
10300A0897K22570R481a44771A22706N0984a2958m212j73540c2117B3348P5532
10289I8880K05890A10232d07555C6674c07603A6604f6543E1304J53904B7274c59562
10277a10053A22327a85702o6741C05644H2177d68220D7975a37177c7256r2513
10267a29769A80002E3806R4265B5297M9348J63684L4764A28391Q2400K71047m7269
10256D34569b35355B32672d6529E7916j8583J69173G3495i435A79580a97718B54200
10244A21678m815O3608a10399A11891c06068D08704c0237b920j34570r0570h8449
10232D9350a63779G1215L9356L2597J14568G6604c05188a4303k14873r209D0045
10220A24835d7679k14642n5856a07402j00239i9524l0822A88376G3594b71039
$$ y = [10897, 233467, 242948, -144771, 122706, 173690, -12958, -17170, -190710, -32117, 23348, 98880, 304770, 110232, -407555, 36674, -307603, 16604, -66543, 51304, 205208, 27274, -359562, -110053, 122327, -185702, -252443, 305644, 82177, -468220, 47975, -137177, -37256, -129769, 180002, 53806, 148071, 25297, 74645, 238329, 273093, 128391, 210791, 481838, 434569, -235355, 232672, -46529, 57916, 39333, 208506, 73495, -9435, 179580, -197718, 254200, 121678, 116863, 180471, -110399, 111891, -306068, 408704, -30237, -2920, -137490, -228060, -88449, 49350, -163779, 71215, 110571, 143168, 257736, 76604, -305188, -14303, -229176, -238385, 40045, 124835, -47679, -262321, -318177, -107402, -207641, -99524, -130346, 188376, 73594, -271039]
10209a34864p2142f0116k2526B62478L3568c65135l813j17045B55241f6892j8703
10198h5595b5434q127l22008C1788g6113l49119a07644j80806e3814B8288C63
10186A00257c5003J3903A98640b31123J2832K7073A37285c9639B51753i6222q2273
10175a78495O8479A60396f2224p4075M1055r598H3092O017j467B2776j0258c13280
10162D007R8462b14036g750j38667k18381J22600E0718h8612A72717E2380g5422
10150C18895a65608j70519A12916g9534C43815a93349j35826J55349b6673A25885
10139e1167K3276D5260k0878a31580l21875a73006D8742J31760b85633N9626a1463
10127c64665a4262m1551A49585i9389j28361A65796b3823p7133C7537j025g2136
$$ y = [-134864, -207006, -60116, -82642, 262478, 296046, -365135, -368948, -485993, 255241, -66892, -85595, -25434, -33561, -355569, 31788, -76113, -425232, -107644, -288450, -53814, 28288, 363, 100257, -35003, -21100, 198640, -231123, -218291, -191218, 137285, -39639, 251753, -96222, -178495, -110016, 160396, -62224, -136299, -95244, -104842, 83092, 89109, 87642, 22776, 12518, -313280, 4007, 102469, -214036, -7750, -146417, -364798, -242198, 50718, -88612, 172717, 52380, -75422, 318895, -165608, -336127, 112916, -79534, 343815, -193349, -329175, -173826, -26673, 125885, -51167, -27891, 45260, 24382, -131580, -453455, -173006, 48742, 180502, -285633, -226007, -11463, -364665, -14262, -55813, 149585, -99389, -227750, 165796, -23823, -100956, 37537, 36512, -72136]
10115H0160i0615K1378j20159d0630m8919A46133c59883A6835R1772D2283a30036
10103c6693J6956o28751B6543b26927q5494G7225J19182c1919l46433b3415j2766
10092c6181j29280j32538G1331c02412A44277a2529j094G8522b03434Q9873Q198
10081a05363d5596A25348D1760M4337m1231e863k45507l1851o9959A0647O9629
10070H0276f669j54674o8031H1323j8761B1978a14682D2544i8788c4225r8361
10059a32586F2044j6905a03843M573C5430g325k80490M2367a19698k7277c482
10047a58300P1261h017j14581j85580B5000a07330G0351L0535h8678M0142R071
10036c9465k97497a60305O6733i853j1510k83941h7407j4018B5269a82794k17770
$$ y = [80160, -90615, -69237, -189396, -40630, -89549, 146133, -359883, 16835, 108607, 42283, -130036, -36693, -19737, -648488, 26543, -226927, -312421, 77225, 196407, -31919, -378352, -23415, -36181, -165461, -297999, 71331, -302412, 144277, -12529, -13623, 78522, -203434, -113561, -105363, -45596, 125348, 41760, 86097, 44866, -5863, -251370, -283221, -353180, 10647, 80276, -6669, -161343, -229374, 81323, 62562, 21978, -114682, 42544, -98788, -34225, -132586, 62044, 45139, -103843, -99270, 35430, -7325, -287815, -245448, -119698, -146975, -3482, -158300, -87039, -8017, -122598, -308178, 25000, -107330, 70351, 100886, -88678, -48536, -39465, -336962, -160305, -93572, -9853, -21363, -305304, -87407, -101425, 25269, -182794, -400564]
10025d00564J30468B07502b12113a02960l34433I768a79609j02494a20182B5130
10014b0513D1307f1766j55627O893P3126N5228B49574A05170b68993c8494j1558
10003e0052C52803j18636b07812d9303b1773B66446j17361a24561A10444a42905
9992g5307E3214R1514K14459a05219j89432J27320D70042c06648M4521A35144
9981a59947l17196a2855j67314f7867L1230B75979B5966J49884H2873j1099j0201
9970F1573a69324M2179A05380b5914k618B45316n043M284M6936A03330J8978g542
9957b49945G738J59998c61749b6720D3642b13042l4598p7084m6582C9294a76760
9945i7490j01912k12479A44339o176D8617b33340C5773e867k23354D4303g1024
$$ y = [-400564, -270096, 207502, -212113, -102960, -437393, 9768, -179609, -282103, -120182, 25130, -20513, 41307, -61766, -217393, -210500, -137374, -82146, 249574, 105170, -268993, -38494, -50052, 352803, 234167, -207812, -49303, -21773, 266446, 149085, -124561, 110444, -142905, -75307, 53214, 144728, 359187, -105219, -294651, -167331, 470042, -306648, -262127, 135144, -159947, -477143, -12855, -180169, -67867, -36637, 275979, 25966, 175850, 82873, 71774, 61573, -169324, -127145, 105380, -25914, -28532, 245316, 240273, 244557, 291493, 103330, 122308, -7542, -249945, 7738, 167736, -361749, -26720, 43642, -213042, -247640, -324724, -371306, 39294, -176760, -97490, -199402, -411881, 144339, 138163, 48617, -233340, 35773, -5867, -229221, 44303, -71024]
9933a13300j95745b2092n31127f7579l20386A95875a0310m082k11319i854n23
9922a0377B7148a56187k2115d1711L709q6169b8421B19322b86321N2698J06469
9911a27154a5143r8381a6305j2888n9229o625R098k00690J9815A34767a91502
9899b7668B27209a58956N4133A24435b50114O5496F9337J87381f5621G2111e00749
9887a85869a9179A86480G2705f3053k43356J41855e834r5027M5178j76657a06133
9875A18869i5708K0872H413c5582R987B40752A03755a06065L1787o7990m9118
9864a91386d1949E2149j4842J78482a6394k16861e4442l2650H238a93750f6847
9852d30590a70744J8666j6630A4893a19814i538k74725g3778A70663E355L73013
$$ y = [-113300, -309045, -22092, -553219, -67579, -387965, 195875, -10310, -14392, -225711, -9854, -10377, 27148, -156187, -178302, -41711, -38002, -124171, -28421, 219322, -286321, -233623, -127154, -15143, -113524, -16305, -29193, -88422, -95047, -85949, -286639, -266824, 134767, -191502, -27668, 227209, -158956, -104823, 124435, -250114, -184618, 69337, 256718, -65621, 72111, -500749, -185869, -19179, 186480, 72705, -63053, -306409, -164554, -5834, -100861, -55683, -232340, -106133, 118869, -95708, -74836, 8413, -35582, -25595, 240752, 103755, -106065, -74278, -142268, -191386, -41949, 52149, 37307, 215789, -16394, -233255, -54442, -87092, 8238, -193750, -66847, -430590, -170744, -152078, -168708, 14893, -119814, -9538, -284263, -73778, 170663, 5355, 378368]
9841C78368F7770a60060P5591B2982E513J59025e67881C25959a64667N4395B0356
9829a04601b3185l10135a52348A1782g0229j96138a06838e1590p2668A48370b01712
9817a5969p5229F2541c60498E2375O4942g4285A16547L9252a81546E9682d10534
9805c70897g2570L1356q4501j07914A07855J67713B8659b74931D3744L10352B1095
9793b34897H057a36869L5699G7180i3573r5511K2928j0882B05534b47952a08217
9781a9741o4864K1043J7261j08986N2758M5458B04291B3494c49385H0980a00374
9769f0592j43025j01739j63582E8662a97217Q7152j40356R6600k28875f5546G8893
9757e644k16032M0368M2707F0106c08407J33683E0158J9347k2043P7936K55653
$$ y = [378368, 67770, -160060, -84469, 22982, 5513, 164538, -567881, 325959, -164667, -110272, 20356, -104601, -23185, -333320, -152348, 11782, -70229, -266367, -106838, -51590, -124258, 148370, -201712, -15969, -91198, 62541, -360498, 52375, 117317, -74285, 116547, 155799, -181546, 59682, -410534, -370897, -72570, -41214, -125715, -233629, 107855, 275568, 28659, -274931, 43744, 354096, 21095, -234897, 8057, -136869, -101170, 77180, -93573, -189084, -166156, -177038, 205534, -247952, -108217, -19741, -84605, -63562, -46301, -155287, -102529, -57071, 204291, 23494, -349385, 80980, -100374, -60592, -203617, -305356, -468938, 58662, -197217, -110065, -250421, -153821, -382696, -65546, 78893, -5644, -221676, -181308, -138601, 60106, -308407, -174724, 50158, 69505, 47462, 125398, 381051]
9746C81051p5794b47864G3651i6152a8468j52265a4283D7671O441K77872c7845
9734h1106k8684C1416f9488A98244d16674J87661R2202j74377A41981F2119b88162
9722G0278c6694J4640E2566b80636i4350a4655k30949K7504B59469D1974a9389
9710a57910j81197c7739A26984C557L7743i7082C3875f0246c0011o2379c7721
9698b9447k15257A2449o00a82191O1838A7486c2143H197N0701J09519F9712a39070
9685c5494E0838a53468o2091A28863n0965b0657k11652D708a03804I5349C1614
9673a84431L3164a4429k16668a02652j73130A42668a36331A06652b16143E9640
9662A00599a95864C36867a74039E5401a2724D9640b04071A75735h6462d3007k2644
$$ y = [381051, 305257, -247864, 73651, -96152, -18468, -170733, -14283, 47671, 54112, 331984, -37845, -81106, -109790, 31416, -69488, 198244, -416674, -229013, -136811, -311188, 141981, 62119, -288162, 70278, -36694, -22054, 52566, -280636, -94350, -14655, -245604, -218100, 259469, 41974, -19389, -157910, -339107, -37739, 126984, 3557, 41300, -97082, 33875, -60246, -30011, -92390, -37721, -29447, -244704, 12449, 11849, -182191, -120353, 17486, -32143, 8197, 58898, 168417, 69712, -139070, -35494, 50838, -153468, -215559, 128863, 77898, -20657, -232309, 4708, -103804, 95349, 31614, -184431, -151267, -14429, -231097, -102652, -275782, 142668, -136331, 106652, -216143, 59640, 100599, -195864, 336867, -174039, 55401, -12724, 49640, -204071, 175735, -86462, -43007, -65651]
9651f5651E4014a94417A88670h9290b4827k42066A17489a43653b6072J0556B2623
9639b15870r7835C957a53754e115j67507A04633g7193L5261L966l34405E0108
9627i3902A17366a84456P6365A13540j3312b49686A97877a32438f4821B37271
9616A12384a86866f0388J6592B60951b15445k4729m0025B85897D0703J8651i9588
9604B13585b9465A71599o1260Q3656c955k49988j14098A2440J04601b47842k909
9593b50751d263j7580E0695J01408g0679m49425i3795F0538d8534k37744j40256
9582d26534J95320c6302j35082A9011h39j36290I888a18846A7703C257a34207
9570G4660P8394b6860j15951o5968A48256k7238c06749P0023E42221B05321A0172
$$ y = [-65651, 54014, -194417, 188670, -89290, -24827, -266893, 117489, -143653, -26072, -15516, 22623, -215870, -313705, 3957, -153754, -5115, -172622, 104633, -77193, -41932, -37966, -372371, 50108, -93902, 117366, -184456, -108091, 113540, 100228, -249686, 197877, -132438, -64821, 237271, 112384, -186866, -60388, -43796, 260951, -215445, -240174, -280199, 285897, 40703, 59354, -99588, 213585, -29465, 171599, 110339, 193995, -3955, -253943, -368041, 12440, 117041, -247842, -250751, -4263, -21843, 50695, 152103, -70679, -520104, -93795, 60538, -48534, -286278, -426534, -231214, -36302, -171384, 19011, -839, -137129, 9888, -118846, 17703, 3257, -134207, 74660, 153054, -26860, -142811, -208779, 148256, 121018, -306749, -236726, 542221, 205321, 10172]
9558b6793j70332c9922A00285m5103c33041f1494A80585k4778a41579k2672n068
9547a69319A3963d3257p7275B08074m3669H92b3123j79365l9505N2527e0508E0595
9534d00394J94527C53687a8740j17266k84207a31486j6999j87851A14255k0051
9524I4204P9574a04179L8410j8055I1100J09002E6369J08766m2891O5850a66501
9512a48241F1246k8026M435h1062K5311B22305a51142E7693a64194E4062b29398
9500I7524a71388H7794d3262j61958m4986h6894B666i7151C9768J22326a00202
9488c09415B94094b716l08260A89684o2074B6813b80433A88737b69314A02278
9477F6998b01634A39146h1413b1136j175k4846J6144A6253b89293J05957l7714
$$ y = [-26793, -197125, -39922, 100285, 55182, -333041, -61494, 180585, 155807, -141579, -164251, -169319, 13963, -43257, -120532, 208074, 164405, 892, -23123, -202488, -241993, -189466, -50508, 50595, -400394, -205867, 353687, -18740, -136006, -420213, -131486, -148485, -336336, 114255, 94204, 173778, -104179, -65769, -83824, 91100, 200102, 56369, 165135, 122244, 188094, -166501, -148241, 61246, 33220, 37655, -81062, -55751, 222305, -151142, 57693, -164194, 54062, -229398, 97524, -171388, 87794, -43262, -205220, -250206, -86894, 2666, -97151, 39768, 162094, -100202, -309415, 294094, -2716, -310976, 189684, 127610, 26813, -280433, 188737, -269314, 102278, 66998, -201634, 139146, -81413, -21136, -22311, -47157, -31013, 16253, -289293, -183336, -221050]
9466b21050c7134A70285E3042g8733j57429B6308a45328g1798j28233g6384K1774
9455e4610j20929n2369i5059A15462c10601B7683b07814R2160r3298m9688a16006
9443A79753a95971r8941e8218j04137j34593A98225e6826j01640k293N2861j9805
9432a27703d0199k23808A8482Q5067C2794P2766c6872J7680B4934L61132A85379
9420A35614D5863N0728a23713q9085r6636A94323a325C31523b04997k10741Q5093
9409c30645l1056E3094a70648M7004l5627C14099b98905c0892m63991a99315A2296
9397B02321j1005d51837B4591L0044h7473k74892f2894F5386J26031a01369n9757
9386a61126O2139B20491b5046j85230D3887R3314g1642r3105A95682A1540c03385
$$ y = [-221050, -37134, 170285, 53042, -78733, -236162, 26308, -145328, -71798, -200031, -76384, -54610, -175539, -227908, -95059, 115462, -310601, 27683, -207814, -115654, -208952, -258640, -116006, 179753, -195971, -294912, -58218, -162355, -296948, 198225, -56826, -158466, -160759, -107898, -127703, -40199, -264007, 18482, 103549, 32794, 105560, -36872, -19192, 24934, 386066, 185379, 135614, 45863, 96591, -123713, -212798, -309434, 194323, -1325, 331523, -204997, -415738, -330645, -361701, 53094, -170648, -123644, -159271, 314099, -298905, -30892, -494883, -199315, 12296, 202321, 191316, -451837, 24591, 54635, -87473, -362365, -62894, 65386, 191417, -101369, -161126, -98987, 220491, -25046, -210276, 43887, 137201, -71642, -164747, 195682, 11540, -303385]
9374a05773M8730n5372N0030K1323j05383b2008D07368c22662j21181i1522m4861
9363a36383f185k66380A03362D5825a86120p9070f0020B16431J40076B8375J18440
9352A46815c10687C04075f207j01074j70489N7964n576D6995b72555J34707A78133
9340d22506A73955a1912p5269A92302g3269o8096e2387F060J45486J23851a33246
9328E7910a58269O7780D6114a09959D6179N7768Q1505C5285g2458A12027f3334
9316c82227A04359b45876J0925m0090C90760a99328q718B31690b6965j4572j77746
9305b19283A4668Q7536R7368o7560a68650B66615i4451j44750D2742P6085k8022
9294I0805b22044A01551a01866d8835a0799l03616A6954M2428K884a02007k20282
$$ y = [-105773, -57043, -112415, -62385, -41062, -146445, -22008, 407368, -322662, -443843, -91522, -136383, -6185, -272565, 103362, 45825, -186120, -265190, -60020, 216431, 356507, 28375, 146815, -310687, 304075, -6207, -107281, -277770, -219806, -225382, 46995, -272555, -137848, 178133, -422506, 173955, -11912, -87181, 192302, -73269, -141365, -52387, 6060, 151546, 275397, -133246, 57910, -158269, -90489, 46114, -109959, 46179, 103947, 185452, 35285, -72458, 112027, -63334, -382227, 104359, -245876, -234951, -275041, 390760, -199328, -208046, 231690, -26965, -41537, -219283, 14668, 102204, 199572, 132012, -168650, 266615, -94451, -239201, 42742, 118827, 90805, -222044, 101551, -101866, -48835, -10799, -314415, 16954, 59382, 62266, -102007, -322289]
9283c22289A42108b54490a25628M1558c770j96262R6176A07531e0355F1947J42458
9272B04405j01417b99413J43162c9820R226C7200c42434J10466r2802C2709R197
9261D1906K46533j35177d83381O4413I9566a27663l77470J30409J45447h6574
9250a76877i019j21786C7545b10634k02675A81369h0221k30975F3789b0810H0022
9238B33969b45634A91516e6008G12610h0629o5289G2571i7421A43338B0755J3141
9227C3896b37782P7478J1984B3327e55882K65984j02552d0648G7500Q4336B083
9215h6065C5303J54993q8715a90370e416A768c6946j42803B9335E392b56266P3939
9203a82327C00822a67273e9157n8959A22545B2413c05826A96755c14765i773j38434
$$ y = [-322289, 142108, -254490, -125628, -84070, -3770, -200032, -103856, 107531, -50355, 61947, 204405, 102988, -299413, -156251, -39820, -30594, 37200, -342434, -231968, -324770, 32709, 41906, 288439, 153262, -483381, -418968, 99566, -127663, -505133, -374724, -229277, -86574, -176877, -9019, -130805, 37545, -210634, -413309, 181369, -80221, -311196, 63789, -20810, 80022, 233969, -245634, 191516, -56008, 712610, -80629, -145918, 72571, -97421, 143338, 20755, 33896, -237782, -160304, -148320, 23327, -555882, -289898, -392450, -40648, 77500, 161836, 2083, -86065, 35303, 190296, 101581, -190370, -5416, 1768, -36946, -179749, 29335, 5392, -256266, -182327, 300822, -167273, -59157, -118116, 122545, 22413, -305826, 196755, -314765, -9773, -148207]
9192a48207a3110j53540j26865a43990O3681m0570j84355B5431a28677E7206a81417
9180c81C220a06528j41149e5271j4589j69213K3819I4915a18724K9123n040A03543
9167a85350c0431B8263g5932C15532j27226m6312e6393m3102G7571J93551d6485
9155a2631B03162B4288J28172n2369m2271c65617C4578N4709g3027r5768A2134
9143E857i8648E9635j5217c25269J7470F8290J52658c44939g5572F5905b02846
9131b9591A75056c7616k86592a12778B38379k9410I2467d15426J28294a36448
9120F4256M7906a9849j25156j15541M2428r8688A02986C9463N1685d844G3452
9108b22050R9396E3798a96390a2703I1809b59460d0889B22011q6384D1478g4247
$$ y = [-148207, -13110, -166650, -293515, -143990, -80309, -120879, -305234, 25431, -128677, 57206, -181417, -381, 3220, -106528, -247677, -55271, -69860, -239073, -215254, 94915, -118724, -89601, -94641, 103543, -185350, -30431, 28263, -75932, 315532, 188306, 141994, -56393, -99495, 77571, 271122, -46485, -12631, 203162, 24288, 152460, 100091, 57820, -365617, 34578, 89287, -73027, -168795, 12134, 5857, -98648, 59635, 44418, -325269, -307799, 68290, 220948, -344939, -75572, 65905, -202846, -29591, 175056, -37616, -324208, -112778, 238379, 208969, 92467, -415426, -287132, -136448, 64256, 112162, -19849, -145005, -260546, -218118, -316806, 102986, 39463, 91148, -4844, 73452, -222050, -122654, 53798, -196390, -12703, 91809, -259460, -40889, 222011, 135627, 41478, -74247]
9096a97197e8608l4053o016b1854B14342a71808Q5141M619m7438N4903n5694D8062
9083B7358K06578j16266f6624r6612M7640C75272A58944a941j58508A47865c69087
9071D1320M847K6556g6414B8870a03069c8499j88886A786b64438g1599L3097a7138
9058A63552g8493B10767b29567A51863K38961o793A6759g506H404i4196b629A54080
9045b9019j0022j32012L0977q3458p894a14390K2197c8505E7082e4273j75328
9034b29601a4238k33606a09620L6891k17522J25097c7437j05488a1212I5393a50738
9022a39760A2230K5443d9163O453D0574a32550D369K20473E8360a32875C857J0723
9010A4580e8259H0789b60166b6055g499F3344a76404o5627o039Q4809j14654i3514
$$ y = [-197197, -58608, -92661, -98677, -21854, 214342, -171808, -86667, -82048, -129486, -74583, -130277, 48062, 27358, 233936, 117670, -66624, -163236, -115596, 375272, 158944, -1941, -160449, 147865, -369087, 41320, 46167, 72723, -76414, 28870, -103069, -38499, -227385, 1786, -264438, -71599, -38502, -17138, 163552, -78493, 210767, -229567, 151863, 390824, 384031, 16759, -7506, 8404, -94196, -2629, 154080, -29019, -39041, -171053, -140076, -223534, -231428, -114390, -92193, -38505, 57082, -54273, -229601, -14238, -247844, -109620, -72729, -290251, -165154, -37437, -142925, -11212, 95393, -150738, -139760, 12230, 37673, -49163, -42710, 40574, -132550, 4369, 224842, 58360, -132875, 3857, 14580, -58259, 80789, -260166, -26055, -7499, 63344, -176404, -242031, -248070, -163261, -277915, -93514]
8997b85774E4467B3551f8985j9859b1049B648J4869N4128e675k30409E357M2466
8985D7823b49793F4619d4258m2077A75304G917c10775f8748m1883I8069g736r1654
8973i9390A57060o0463a18095A60352k4818c82670B8501K61686a06789l615H9728
8961i474k94387e8101k94390h1889j83942d6815k64559A72878a07044C93015c11258
8949c8746B08514a64110p7601K3846D6399b35047M5352L7881A21396a14614l1360
8938a45974O9856p4895K0036C22912f3109C59237j61359I7367J63916l3659i8507
8926B47843q5930J082583N11027K950256N364611k857657A667515q06790k15611
8917F45114B59587J82696h1133C28151b5096l7605K4106A95835L3385J09915a62273
$$ y = [-285774, 54467, 23551, -68985, -88844, -21049, 2648, 17517, 71645, -5675, -236084, 5357, 47823, -249793, 64619, -44258, -86335, 175304, 7917, -310775, -68748, -110631, 98069, -7736, -99390, 157060, 96597, -118095, 160352, 135534, -382670, 28501, 290187, -106789, -110404, 89728, -9474, -303861, -58101, -352491, -81889, -265831, -46815, -311374, 172878, -107044, 393015, -311258, -38746, 208514, -164110, -241711, -217865, 46399, -235047, -189695, -151814, 121396, -114614, -145974, -76118, -151013, -130977, 322912, -63109, 359237, 197878, 97367, 261283, 227624, -98507, 247843, 161913, 1244496, 1755523, 4705779, 10070390, 7212733, 1667515, 860725, 645114, 259587, 442283, -81133, 328151, -25096, -62701, -38595, 195835, 229220, 339135, -162273]
8905b12468f2556A28429b27781H6065c1290B2033N7005a02143j01648K5065q0035
8894b58761q4071B16176a27810l4132g7772l57207a05903L2563m8605N7020r0595
8883a55520f8820B23359j07814b15237f991B27252D6576c02101A8672e4423J6656
8872c7767C3707J48358c6936k08985b9445P370p2714C6039b75431d9670r8331
8861a48001C12668b64321B391b71467i6892K8526j32040N6961F7844a39199J5994
$$ y = [-212468, -62556, 128429, -227781, 86065, -31290, 22033, 79038, -102143, -203791, -178726, -258761, -342832, 216176, -127810, -161942, -77772, -434979, -105903, -73340, -121945, -64925, -155520, -68820, 223359, 115545, -215237, -6991, 227252, 46576, -302101, 18672, -54423, -37767, 33707, 182065, -36936, -245921, -29445, -22075, -94789, 36039, -275431, -49670, -148001, 312668, -264321, 2391, -271467, -96892, -68366, -200406, -143445, 67844, -139199, -123205]
$$ [...]
##END NTUPLES=NMR SPECTRUM
##END=
