
##TITLE=AC1233_PERAH12114_6519287_kQ2xMY586G
##JCAMPDX= 6.0         $$ Bruker NMR JCAMP-DX V2.0
##DATA TYPE= NMR SPECTRUM
##DATA CLASS= NTUPLES
##ORIGIN= BRUKER
##OWNER= Administrator
$$ 1.72 TOPSPIN		Version 2.1
$$ 2012-07-14 10:40:48.859 -0500  Administrator@TOPSPIN
$$ Compression mode = diff/dup
##.OBSERVE FREQUENCY= 400.02188249412
##.OBSERVE NUCLEUS= ^1H
##.ACQUISITION MODE= SIMULTANEOUS (DQD)
##.ACQUISITION SCHEME= undefined
##.AVERAGES= 64
##.DIGITISER RES= 22
##SPECTROMETER/DATA SYSTEM= spect
##.PULSE SEQUENCE= noesygpps1d.comp
##.SOLVENT NAME= COFFEE_meoh
##.SHIFT REFERENCE= INTERNAL, COFFEE_meoh, 1, 14.96076
##AUDIT TRAIL= $$ (NUMBER, WHEN, WHO, WHERE, PROCESS, VERSION, WHAT)
$$ ##TITLE= Audit trail, TOPSPIN		Version 2.1
$$ ##JCAMPDX= 5.01
$$ ##ORIGIN= Bruker BioSpin GmbH
$$ ##OWNER= Administrator
$$ $$ C:\Bruker\TOPSPIN/data/COFFEE/nmr/AC1233_PERAH12114_6519287_kQ2xMY586G/72/pdata/1/auditp.txt
$$ ##AUDIT TRAIL=  $$ (NUMBER, WHEN, WHO, WHERE, PROCESS, VERSION, WHAT)
(   1,<2012-07-14 10:40:43.890 -0500>,<Administrator>,<TOPSPIN>,<go>,<TOPSPIN 2.1>,
      <created by zg
	started at 2012-07-14 10:29:13.640 -0500,
	POWCHK enabled, PULCHK disabled,
       configuration hash MD5:
       6B 1B 68 BB D9 2E 58 E2 7F 35 AD 54 07 DF 0E 41
       data hash MD5: 64K
       BD 4D F9 D9 E1 E9 8B A6 30 B2 B8 52 FC 0F 55 A8>)
(   2,<2012-07-14 10:40:47.062 -0500>,<Administrator>,<TOPSPIN>,<proc1d>,<TOPSPIN 2.1>,
      <Start of raw data processing
       efp LB = 0.3 FT_mod = 6 PKNL = 1 PHC0 = 0 PHC1 = 0 SI = 128K 
       data hash MD5: 128K
       A4 1B 82 97 34 36 E7 2E EF D6 96 90 6C 0A 44 9B>)
(   3,<2012-07-14 10:40:48.109 -0500>,<Administrator>,<TOPSPIN>,<proc1d>,<TOPSPIN 2.1>,
      <pk PHC0 = 2.493896 PHC1 = 0 
       data hash MD5: 128K
       40 72 D8 F7 6A 42 83 1C 76 92 5F 49 16 33 47 6B>)
(   4,<2012-07-14 10:40:48.359 -0500>,<Administrator>,<TOPSPIN>,<proc1d>,<TOPSPIN 2.1>,
      <abs ABSG = 1 
       data hash MD5: 128K
       88 7F 88 10 2D 0E 20 A5 D9 5F 8C A5 ED 71 9E 8B>)
(   5,<2012-07-14 10:40:48.437 -0500>,<Administrator>,<TOPSPIN>,<proc1d>,<TOPSPIN 2.1>,
      <abs ABSG = 2 
       data hash MD5: 128K
       BD 0D 63 6C A3 E1 A1 72 09 2C B7 BB 66 E4 AE 76>)
(   6,<2012-07-14 10:40:48.484 -0500>,<Administrator>,<TOPSPIN>,<proc1d>,<TOPSPIN 2.1>,
      <abs ABSG = 3 
       data hash MD5: 128K
       12 8D C5 59 ED B7 F1 86 EA 64 94 CC D8 3C B6 BC>)
(   7,<2012-07-14 10:40:48.593 -0500>,<Administrator>,<TOPSPIN>,<proc1d>,<TOPSPIN 2.1>,
      <abs ABSG = 4 
       data hash MD5: 128K
       96 7C EF B4 D9 F5 E5 FC E1 4D 86 73 7D 22 38 12>)
(   8,<2012-07-14 10:40:48.781 -0500>,<Administrator>,<TOPSPIN>,<proc1d>,<TOPSPIN 2.1>,
      <abs ABSG = 5 
       data hash MD5: 128K
       9E 52 2C 86 2E C1 C1 1C D4 9A 00 63 D4 E0 BF A5>)
$$ ##END=
$$ 
$$ $$ hash MD5
$$ $$ 99 4A 8A 1C BD 4C 93 97 29 A6 D0 56 ED E3 0C 99
##$RELAX= 
##$RELAX= 
##$RELAX= 
##$RELAX= 
##$RELAX= 
##$RELAX= 
##$RELAX= 
##$RELAX= 
##$RELAX= 
$$ [...]
##$TP07= 0
##$TPNAME0= <>
##$TPNAME1= <>
##$TPNAME2= <>
##$TPNAME3= <>
##$TPNAME4= <>
##$TPNAME5= <>
##$TPNAME6= <>
##$TPNAME7= <>
##$TPOAL= (0..7)
0.5 0.5 0.5 0.5 0.5 0.5 0.5 0.5
##$TPOFFS= (0..7)
0 0 0 0 0 0 0 0
##$TUNHIN= 0
##$TUNHOUT= 0
##$TUNXOUT= 0
##$USERA1= <user>
##$USERA2= <user>
##$USERA3= <user>
##$USERA4= <user>
##$USERA5= <user>
##$V9= 5
##$VALIST= <valist>
##$VCLIST= <CCCCCCCCCCCCCCC>
##$VD= 0
##$VDLIST= <DDDDDDDDDDDDDDD>
##$VPLIST= <PPPPPPPPPPPPPPP>
##$VTLIST= <TTTTTTTTTTTTTTT>
##$WBST= 2048
##$WBSW= 25
##$XGAIN= (0..3)
0 0 0 0
##$XL= 0
##$YL= 0
##$YMAX_a= 12235044
##$YMIN_a= -9379016
##$ZGOPTNS= <>
##$ZL1= 120
##$ZL2= 120
##$ZL3= 120
##$ZL4= 120
##$ABSF1= 14.96076
##$ABSF2= -5.597422
##$ABSG= 5
##$ABSL= 3
##$ALPHA= 0
##$AQORDER= 0
##$ASSFAC= 0
##$ASSFACI= 0
##$ASSFACX= 0
##$ASSWID= 0
##$AUNMP= <proc_prof1d_extract.lims>
##$AXLEFT= 0
##$AXNAME= <>
##$AXNUC= <1H>
##$AXRIGHT= 0
##$AXTYPE= 0
##$AXUNIT= <>
##$AZFE= 0.1
##$AZFW= 0.1
##$BCFW= 0
##$BC_mod= 0
##$BYTORDP= 0
##$COROFFS= 0
##$CY= 15
##$DATMOD= 1
##$DC= 0
##$DFILT= <>
##$DTYPP= 0
##$F1P= 0
##$F2P= 0
##$FCOR= 0.5
##$FTSIZE= 131072
##$FT_mod= 6
##$GAMMA= 0
##$GB= 0
##$INTBC= 1
##$INTSCL= 1
##$ISEN= 128
##$LB= 0.3
##$LEV0= 0
##$LPBIN= 0
##$MAXI= 10000
##$MC2= 0
##$MEAN= 0
##$ME_mod= 0
##$MI= 0
##$NCOEF= 0
##$NC_proc= -2
##$NLEV= 6
##$NOISF1= 0
##$NOISF2= 0
##$NSP= 0
##$NTH_PI= 0
##$NZP= 0
##$OFFSET= 14.96076
##$PC= 1
##$PHC0= 2.493896
##$PHC1= 0
##$PH_mod= 1
##$PKNL= yes
##$PPARMOD= 0
##$PPDIAG= 0
##$PPIPTYP= 0
##$PPMPNUM= 2147483647
##$PPRESOL= 1
##$PSCAL= 4
##$PSIGN= 0
##$PYNMP= <proc.py>
##$REVERSE= no
##$SF= 400.020009734768
##$SI= 131072
##$SIGF1= 0
##$SIGF2= 0
##$SINO= 400
##$SIOLD= 131072
##$SPECTYP= <>
##$SREGLST= <1H.CDCl3>
##$SSB= 0
##$STSI= 131072
##$STSR= 0
##$SW_p= 8223.68421052631
##$SYMM= 0
##$S_DEV= 0
##$TDeff= 65536
##$TDoff= 0
##$TI= <>
##$TILT= no
##$TM1= 0
##$TM2= 0
##$TOPLEV= 0
##$USERP1= <user>
##$USERP2= <user>
##$USERP3= <user>
##$USERP4= <user>
##$USERP5= <user>
##$WDW= 1
##$XDIM= 131072
##$YMAX_p= 394910205
##$YMIN_p= -12378
##$CURPLOT= <Network HP LaserJet P1505>
##$CURPRIN= <$Network HP LaserJet P1505>
##$DFORMAT= <normdp>
##$LAYOUT= <+/1D_H.xwp>
##$LFORMAT= <normlp>
##$PFORMAT= <normpl>
##$SURQMSG= 1
$$ End of Bruker specific parameters
$$ ---------------------------------
##NTUPLES= NMR SPECTRUM
##VAR_NAME=  FREQUENCY,     SPECTRUM/REAL,   SPECTRUM/IMAG
##SYMBOL=    X,             R,               I
##VAR_TYPE=  INDEPENDENT,   DEPENDENT,       DEPENDENT
##VAR_FORM=  AFFN,          ASDF,            ASDF
##VAR_DIM=   131072,        131072,          131072
##UNITS=     HZ,            ARBITRARY UNITS, ARBITRARY UNITS
##FACTOR=    0.0627417313425164, 1,          1
##FIRST=     8223.62146879497, 4018,         -60418
##LAST=      0,             5072,            -60015
##MIN=       0,             -12378,          0
##MAX=       8223.62146879497, 394910205,    0
$$ Real data points
##PAGE= N=1
##DATA TABLE= (X++(R..R)), XYDATA
$$ [...]
67836 74542 75547 77068 78960 80682 81814 82719 84340 87336 91582 96349 100743 104156 106710 109224 112361
67821 112361 115833 118833 121181 123504 126136 128399 129325 128688 126921 124418 121405 118261 115288 112220 108541
67806 108541 104422 100792 98240 96265 93978 91286 88937 87495 86616 85432 83505 81277 79606 78889 78696
67791 78696 78346 77718 77148 76666 75828 74580 73753 74163 75483 76622 77082 77260 77393 77047 75998 74922 74607
67774 74607 74926 75241 75494 76213 77534 78931 79989 80864 81855 83026 84411 86032 87520 88266 88294 88551 89854
67757 89854 91865 93518 94209 94187 93952 93768 93625 93298 92472 91172 89998 89598 89996 90734 91559 92487 93284 93460
67739 93460 92928 92219 91803 91547 91046 90199 89153 87928 86421 84752 83322 82410 81765 80728 78900 76715
67723 76715 75107 74495 74324 73804 72808 71691 70561 69328 68318 68040 68258 68097 67409 67317 68831 71344 73155
67706 73155 73201 71760 69690 67648 66080 65337 65491 66215 66986 67344 67070 66367 65838 66001 66775 67583 67921 67736
67688 67736 67345 67188 67579 68494 69632 70746 71769 72486 72446 71548 70499 70177 70572 70813 70306 69460 69141 69698
67670 69698 70745 71650 72041 71941 71590 71170 70734 70401 70454 71044 71995 73122 74532 76205 77473 77506 76464 75568
67652 75568 75755 76664 77293 77269 77045 77088 77375 77617 77588 77168 76401 75562 74959 74686 74688 75013 75718 76550 77013 76866 76379
67631 76379 76078 76390 77530 79441 81698 83671 84970 85705 86239 86797 87371 87815 87914 87473 86517 85277 83969
67614 83969 82753 82059 82570 84486 86941 88615 88975 88571 88122 87771 87374 86960 86552 85862 84614 82991 81434
67597 81434 80159 79153 78451 77996 77399 76317 75005 74036 73516 73042 72506 72424 73262 74763 76153 76789 76571
67580 76571 76002 75876 76521 77336 77441 76801 76165 75860 75344 74234 73051 72434 72196 71773 71220 71066 71439 71939
67562 71939 72184 71946 71027 69605 68480 68271 68536 68346 67601 67011 66808 66410 65598 65117 65594 66475 66644 65810
67544 65810 64754 64385 64857 65549 65706 65202 64714 64962 65832 66587 66874 67016 67263 67364 67184 67107 67384 67615 67421
67525 67421 67273 67955 69374 70553 70831 70550 70424 70645 70832 70590 69934 69202 68700 68429 68221 68074 68180 68514
67507 68514 68654 68262 67613 67331 67596 67844 67397 66260 65223 65094 65884 66831 67278 67324 67473 67866 68217 68345 68300
67488 68300 67965 67119 66035 65457 65687 66236 66709 67522 69159 71154 72463 72682 72282 71775 71222 70580 69954 69439
67470 69439 69100 69158 69779 70655 71162 71002 70354 69449 68397 67432 66802 66358 65736 65131 65325 66669 68435 69565
67452 69565 69812 69847 70454 71924 73974 75948 77192 77548 77461 77503 77848 78280 78503 78319 77764 77251 77319 77996 78647
67433 78647 78783 78770 79347 80510 81374 81220 80343 79657 79725 80331 80902 81182 81517 82495 84231 85997 86692 85805 83860
67414 83860 81836 80237 78863 77442 76202 75592 75483 75086 73862 72329 71530 71756 72240 72199 71699 71217 70832
67397 70832 70440 70478 71610 73546 74903 74742 73809 73664 74789 76126 76471 75715 74520 73386 72529 72256 72753
67380 72753 73473 73406 72284 71096 71006 72074 73433 74442 75082 75360 75082 74458 74253 74880 75761 76101 75999 76214
67362 76214 77064 78124 78954 79500 79720 79435 78749 78132 77797 77465 76981 76709 76969 77502 77899 78205 78619 78923 78758
67343 78758 78205 77608 76984 76211 75581 75510 75750 75638 75186 75215 76254 77965 79877 81929 83992 85614 86794
67326 86794 88345 90818 93584 95688 97181 98746 100318 101026 100463 99207 97948 96849 95881 95088 94246 92897
67310 92897 91087 89591 89070 89399 90095 91002 92216 93639 95038 96287 97321 98035 98479 98935 99597 100444 101608
67293 101608 103468 105986 108224 109060 108338 107006 106128 105956 105849 104833 102382 98915 95555 93155 91633
67278 91633 90366 89071 88064 87784 88374 89632 91134 92454 93494 94548 95810 96954 97516 97649 98115 99459
67262 99459 101466 103493 105076 106045 106324 105902 104976 103951 103187 102745 102376 101772 100876 99898 99092 98590 98484 98870
67244 98870 99676 100527 100930 100652 99919 99305 99345 100046 100825 101143 101223 101757 102867 103760 103712 102982 102340 102004 101540 100674
67224 100674 99716 99137 99148 99651 100258 100352 99580 98363 97622 97883 98865 99962 100817 101439 102131 103337 105211 107206
67206 107206 108459 108692 108419 108163 107921 107569 107368 107660 108374 109234 110267 111646 113159 114239 114605 114544 114515 114737
67188 114737 115247 116075 117167 118298 119214 119792 119947 119493 118348 116870 115792 115692 116519 117688 118530 118669 118160
67171 118160 117460 117192 117720 118912 120410 122057 123828 125447 126452 126731 126701 126830 127211 127673 127979 127757 126654
67154 126654 124849 123088 121917 121229 120844 121087 122278 124046 125780 127506 129598 131794 133359 134206 135043
67139 135043 136232 137261 137671 137766 138006 138316 138536 139005 140118 141604 142790 143392 143615 143698 143766 143992 144468 145041
67121 145041 145612 146440 147813 149537 151079 152121 152704 153001 153220 153556 153963 154201 154395 155220 157019 159050 160215
67104 160215 160432 160644 161465 162538 163367 164101 165080 166114 166715 166811 166824 167143 167804 168578 169149 169332 169296 169418 169754
67085 169754 169870 169537 169381 170364 172523 174658 175545 175227 174867 175461 177028 178964 180821 182495 183954 185190
67069 185190 186414 188021 190184 192586 194625 195826 196105 195829 195712 196391 197978 200092 202411 204971 207739
67054 207739 210151 211453 211533 211150 211249 212197 213722 215377 216942 218449 220036 221812 223816 225931 227822 229104
67038 229104 229782 230495 232000 234300 236539 237957 238695 239430 240430 241426 242326 243548 245511 248133 251000 253791
67022 253791 256343 258554 260488 262424 264575 266846 269110 271623 274862 278888 283106 286748 289509 291615
67008 291615 293480 295428 297637 300104 302679 305274 308050 311191 314544 317751 320843 324340 328497 332712
66994 332712 336169 338927 341877 345557 349569 353358 357039 360978 364994 368576 371763 375212 379344 383924
66980 383924 388607 393458 398661 404063 409334 414413 419555 425002 430779 436720 442564 448159 453764 460019
66966 460019 467334 475315 483004 489697 495381 500427 505205 510099 515609 522086 529394 537083 544909 553023
66952 553023 561623 570651 579946 589484 599299 609317 619459 629872 640821 652364 664354 676715
66940 676715 689518 702701 716014 729359 742966 757065 771513 785954 800237 814508 828993
66929 828993 843941 859714 876676 894917 914190 934195 954815 976093 998084 1020758 1043964
66918 1043964 1067504 1091341 1115720 1140938 1166965 1193444 1220136 1247264 1275324 1304613 1335023
66907 1335023 1366293 1398332 1431264 1465244 1500342 1536596 1574068 1612790 1652755 1694057 1736924
66896 1736924 1781385 1826937 1872775 1918477 1964315 2010783 2057946 2105383 2152695 2199922 2247482
66885 2247482 2295746 2344641 2393626 2442135 2490028 2537449 2584244 2629763 2673428 2715240 2755465
66874 2755465 2793977 2830260 2864076 2895724 2925455 2952773 2976566 2995960 3010973 3022321 3030635
66863 3030635 3035887 3037553 3035230 3028942 3018913 3005261 2988035 2967377 2943461 2916408 2886442 2854041
66851 2854041 2819685 2783432 2744962 2704109 2661224 2616944 2571703 2525627 2478811 2431543 2384060
66840 2384060 2336159 2287236 2236872 2185341 2133509 2082321 2032449 1984162 1937214 1890947 1844868
66829 1844868 1799208 1754594 1711192 1668487 1626017 1583975 1542937 1503311 1465149 1428129 1391609
66818 1391609 1355182 1319495 1285951 1255100 1225692 1195956 1165561 1135820 1108073 1082502 1058391
66807 1058391 1034903 1011454 987870 964440 941585 919396 897683 876417 855777 835865 816678
66796 816678 798238 780343 762384 743995 725802 708880 693422 678614 663940 649869 636962
66785 636962 624962 613262 601709 590398 579077 567333 555241 543352 532111 521589 511632 502002
66773 502002 492497 483175 474302 465936 457821 449912 442593 436053 429762 423080 416117 409488 403325 397132
66759 397132 390631 384244 378530 373485 368618 363525 358225 353008 348089 343390 338692 333954 329387 325104
66745 325104 320888 316445 311797 307280 303278 299972 297179 294295 290714 286530 282576 279491 276935 274044
66731 274044 270416 266277 261934 257594 253663 250622 248387 246147 243104 239225 235214 231893 229607 228017
66717 228017 226421 224448 222410 220810 219614 218324 216650 214692 212482 209847 206913 204284 202382 200865
66703 200865 199011 196551 193852 191392 189286 187275 185046 182602 180386 178858 177872 176640 174524 171756
66689 171756 169228 167671 167113 166958 166357 164731 162249 159822 158255 157367 156145 153924 151178 148985 147829
66674 147829 147190 146265 144857 143428 142457 141982 141750 141554 141286 140815 140076 139232 138530 137927 137053 135649 133943
66657 133943 132460 131535 131122 130993 130961 130901 130738 130510 130355 130274 129952 128964 127263 125365 123882 122887 121884 120472
66639 120472 118920 117946 117957 118582 118939 118307 116681 114841 113833 114179 115410 116368 116059 114342 111964 109964
66623 109964 108871 108302 107475 106230 105331 105503 106353 106727 106130 105243 104850 104794 104428 103701 103160 103013 102839 102308
66605 102308 101642 101094 100444 99385 98150 97353 97294 97719 98198 98471 98519 98529 98775 99208 99249 98345 96807 95727 95843
66586 95843 96724 97307 97055 96319 95725 95453 95122 94176 92406 90282 88713 88310 88835 89498 89712 89359 88462 86983
66568 86983 85107 83407 82481 82446 82962 83611 84142 84382 84179 83539 82726 82134 81968 82077 82164 82116 82071 82164 82365 82625
66548 82625 82985 83310 83089 81855 79811 77823 76644 76353 76567 77002 77682 78791 80444 82481 84379 85516
66532 85516 85677 85215 84625 84073 83430 82602 81620 80519 79284 77933 76567 75321 74311 73607 73253 73379 74182
66515 74182 75578 76885 77220 76361 75016 74043 73616 73355 73037 72866 73125 73835 74742 75425 75491 74875 73967 73289
66497 73289 73082 73284 73740 74227 74460 74350 74223 74438 74807 74739 74046 73297 73196 73797 74532 74915 74984 75026 75057 74740
66477 74740 73906 72980 72609 72855 73052 72690 72115 72011 72355 72391 71700 70792 70440 70723 71103 71229 71302 71667 72366 73230
66457 73230 74173 75137 75823 75785 74980 74026 73598 73564 73085 71759 70339 69967 70823 71928 72295 71951 71687 72097 73074
66438 73074 74166 75136 76062 76961 77546 77541 77164 77024 77435 78108 78632 78955 79097 78663 77161 74808 72615 71546
66420 71546 71796 72840 73891 74294 73878 73071 72470 72216 72010 71746 71687 71848 71602 70341 68388 66872 66637 67501
66402 67501 68631 69462 70050 70591 70884 70559 69795 69418 70001 71107 71786 71692 71312 71157 71159 70940 70260 69089 67613
66383 67613 66300 65672 65851 66593 67796 69525 71415 72566 72443 71565 70942 71094 71926 73190 74572 75571 75845
66366 75845 75647 75497 75483 75269 74682 73890 73040 72179 71559 71493 71833 72024 71790 71316 70620 69300 67304 65482 64818
66347 64818 65296 66072 66624 67170 67877 68344 68213 67837 67872 68393 68937 69312 69812 70548 71083 71059 70770 70684 70641 70070
66327 70070 68950 68048 68089 69032 70272 71255 71787 72046 72475 73379 74467 74994 74457 72980 70959 68706 66568
66310 66568 64992 64231 64237 65034 66736 68922 70566 71126 71273 71861 72497 71959 69990 67787 66559 66325 66420 66517
66292 66517 66685 66935 67217 67625 68203 68755 69188 69749 70633 71570 72141 72282 72142 71718 71042 70550 70715 71346 71721
66273 71721 71476 70958 70619 70462 70296 70226 70591 71522 72735 73742 74254 74427 74691 75218 75666 75635 75255 74989 74974
66254 74974 74962 74911 75065 75308 75043 74115 73311 73382 73978 74268 74355 75172 76905 78364 78302 76760 74743 73103 72174
66235 72174 72041 72523 73165 73737 74514 75568 76146 75465 73975 73016 73158 73688 73920 74163 74845 75415 74913 73334
66217 73334 71689 70845 70918 71713 73074 74620 75664 75763 75119 74273 73669 73607 74270 75465 76509 76687 75843 74434
66199 74434 73084 72164 71641 71187 70463 69503 68764 68674 69156 69739 70149 70604 71475 72733 73891 74465 74437 74240 74352
66180 74352 74910 75683 76325 76645 76678 76583 76506 76593 77059 78042 79253 79906 79320 77711 76146 75572 76021 76903 77840
66161 77840 78885 80027 80889 81100 80718 80153 79770 79668 79739 79808 79835 80061 80831 82152 83489 84172 84014 83450 83096
66142 83096 83233 83637 83792 83277 82082 80614 79341 78417 77712 77156 76878 76999 77480 78322 79707 81636 83505
66125 83505 84461 84358 84047 84442 85461 86250 86337 86136 86193 86430 86375 85935 85579 85881 87087 89037 91166 92667
66107 92667 93014 92502 92063 92364 93206 93883 94028 93886 93874 94093 94354 94540 94765 95175 95733 96284 96755 97147 97389
66088 97389 97352 97067 96795 96827 97294 98168 99253 100102 100226 99583 98746 98347 98473 98789 99107 99538 100126 100645 100815
66069 100815 100493 99651 98445 97388 97119 97815 98956 99832 100158 100070 99711 99087 98328 97882 98266 99546 101113
66052 101113 102159 102568 103107 104483 106324 107510 107517 106921 106418 105945 105191 104493 104493 105027 105099 104186 103023 102765 103712
66033 103712 105205 106525 107494 108202 108594 108509 107991 107348 106904 106762 106884 107302 108112 109236 110342 111170 111872 112880
66015 112880 114417 116308 118228 119973 121421 122421 122847 122740 122378 122250 122836 124241 126052 127847 129788
66000 129788 132376 135540 138454 140589 142561 145436 149387 153574 157327 160866 164693 168761 172553 175752
65986 175752 178522 181330 184590 188275 191631 193569 193645 192512 191156 189835 188038 185274 181562 177269 172883
65971 172883 168911 165626 162873 160398 158257 156525 154674 151844 147931 143920 140855 138888 137594 136748
65957 136748 136360 136269 136283 136494 136943 137144 136551 135462 134866 135266 136224 137190 138232 139578 141002 142205 143499
65940 143499 145472 148080 150616 152649 154482 156578 158973 161501 164244 167327 170454 173009 174642 175509
65926 175509 175979 176378 177027 178161 179643 181048 182313 184112 187225 191572 196177 200170 203550 206894 210651
65911 210651 214859 219268 223457 226988 229815 232439 235397 238638 241733 244576 247437 250204 252076 252342
65897 252342 251177 249376 247572 246058 245100 244818 244780 244220 242789 240636 237640 233195 227152 220562 214824
65882 214824 210274 206173 201983 197970 194376 190661 186063 180600 175107 170429 166897 164437 162699 161126
65868 161126 159254 157119 155146 153595 152310 151024 149686 148379 147084 145680 144126 142619 141576 141333
65854 141333 141743 142143 141948 141261 140730 140896 141838 143315 144891 145956 146090 145587 145339 146046 147733 150071 152778
65837 152778 155517 157740 159011 159328 158973 158297 157860 158435 160359 163009 165288 166724 167859 169679 172918
65822 172918 177782 183922 190504 196623 201878 206559 211281 216468 222124 227874 233174 237589 240921 243082
65808 243082 243985 243641 242247 240013 236985 233200 228949 224725 220904 217575 214632 211958 209496 207172 204715
65793 204715 201744 198286 195163 193369 192903 192615 191516 189921 188975 189373 190977 193407 196483 200169 204503
65778 204503 209622 215613 222484 230559 240545 252686 266017 278983 290711 301141 310090 316889 321020
65765 321020 322510 321553 318236 312695 304979 294773 281968 267700 254038 242249 231926 222275 213652
65752 213652 207266 203811 203021 204342 207457 212264 218781 227079 237043 248321 260684 274173 288694
65739 288694 303768 318956 334169 349166 363084 374899 384138 390725 394386 394745 391820 385957 377390
65726 377390 366333 353393 339331 324395 308418 291642 274961 259178 244368 230175 216429
65715 216429 203363 191463 181275 173115 166809 161762 157372 153316 149555 146263 143686 141857 140493
65702 140493 139371 138704 138782 139288 139411 138768 137830 137297 137349 137760 138442 139482 140748 141812 142376 142561 142711 143036
65684 143036 143626 144704 146612 149387 152478 155152 157231 159286 162035 165715 170066 174747 179683 185230
65670 185230 192113 200957 211650 223359 235484 248419 263090 279803 297842 316168 334216 351972
65658 351972 369547 386808 403307 418463 431784 442880 451365 457037 460349 462434 464279 465975 467021
65645 467021 467272 467298 467860 469307 471457 473763 475598 476545 476401 474732 470618 463234 452653 439658 424723
65630 424723 407576 387945 366443 344445 323216 303232 284232 265841 248256 232346 218986
65619 218986 208258 199439 191680 184518 177817 171552 165755 160475 155701 151463 147971 145425 143653 142143
65605 142143 140540 138950 137747 137225 137453 138260 139302 140252 140949 141304 141192 140604 139754 138815 137683 136321 135185
65588 135185 134954 135860 137601 139826 142339 144903 147282 149507 151693 153658 155279 157234 160784 166548 173983
65573 173983 182309 191477 201967 214065 227672 242463 257916 273529 289356 305948 323404 340733
65561 340733 356535 370038 381191 389971 396035 398855 397894 392859 384128 372732 359593 344931 328704
65548 328704 311306 293484 275867 258959 243324 229216 216276 204198 193533 185205 179249 174707
65536 174707 170875 167960 166258 165288 164295 163289 163009 163911 165505 166838 167384 167309 166937 166195 164773 162691
65520 162691 160283 157531 153853 148982 143756 139550 136964 135453 134158 132686 131098 129666 128781 128690 129115
65505 129115 129401 129161 128563 127954 127543 127513 128077 129171 130393 131414 132251 133027 133801 134788 136359 138509 140635
65488 140635 142251 143763 146144 149868 154414 158805 162394 165175 167562 169937 172243 174008 174828 174747 174112
65473 174112 173209 172263 171580 171383 171433 171122 169976 167906 164951 161106 156609 152127 148332 145282 142478 139614
65457 139614 137071 135546 135281 135774 136199 135975 135002 133604 132324 131565 131261 130973 130442 129886 129611 129486 129129
65440 129129 128606 128566 129554 131384 133387 135082 136507 138006 139896 142224 144659 146679 148087 149337 151164
65425 151164 153799 156649 158819 159850 159857 159016 157177 154233 150793 148026 146555 145721 144427 142666 141687 142437
65409 142437 144354 146066 146897 147125 147049 146622 146117 146355 147745 149517 150507 150522 150390 150736 151301 151690 152302 154040
65391 154040 157275 161425 165561 169132 172034 174228 175501 175589 174501 172658 170702 169060 167739 166574 165586
65376 165586 164947 164634 164393 164061 163679 163165 162193 160695 159320 159074 160433 163053 166242 169410 172069 173935
65360 173935 175384 177545 181474 187185 193703 200053 206026 212100 218932 226978 236166 245672 254189 260742
65346 260742 265287 268443 270795 272613 274038 275129 275649 275158 273533 271128 268215 264466 259346 252940 246107
65331 246107 239756 234179 228997 223456 216824 208967 200729 193400 187577 182827 178696 175562 173986 173539
65317 173539 173017 171835 170579 169958 169762 169194 167860 166077 164455 163454 163087 162666 161118 158050 154441 151848
65301 151848 150846 150589 149948 148723 147625 147377 148150 149770 152208 155627 159886 164156 167380 169304 170794
65286 170794 172816 175277 177205 177899 177446 176210 174455 172503 170689 168859 166459 163470 160780 159244 158764
65271 158764 158754 159041 159659 160097 159627 158375 157284 156860 156567 155722 154387 153059 151982 151188 150860 151167 151898
65254 151898 152637 153241 153937 155033 156624 158406 159662 159739 158677 157105 155428 153577 151708 150474 150109 149801
65238 149801 148741 147375 146772 146897 146546 145071 143288 142349 142419 142870 143131 142855 141841 140446 139686 140287 141791
65221 141791 143074 143580 143586 143468 143286 142997 142555 141762 140513 139220 138533 138545 138740 138801 138981 139422 139666 139273 138627
65202 138627 138538 139173 139865 140000 139619 139001 138098 136788 135468 134920 135501 136798 138190 139466 140634 141388 141252
65185 141252 140296 139346 139259 140165 141528 142787 143786 144766 146119 148008 150055 151582 152344 152873 153845 155275 156652
65168 156652 157745 158833 160140 161431 162340 162821 163085 163352 163850 164910 166824 169611 172911 176091 178581
65153 178581 180421 182448 185546 189629 193749 197373 201105 205839 211663 218160 225485 234393 245206 257336
65139 257336 270015 282937 295976 308815 321188 333112 344504 354933 364188 372776 381297 389497
65127 389497 396502 401881 405820 408241 408517 406414 402748 398611 394300 389395 383509 376452 368002 358152
65113 358152 347497 336803 326166 315123 303573 292004 280744 269646 258789 248840 240314 232857
65101 232857 225791 218989 212758 207117 201716 196382 191259 186502 182219 178590 175611 172830 169853 167072
65087 167072 165338 164809 164668 164168 163446 163035 163041 163185 163326 163547 163925 164549 165567 166889 167988 168366 168120 167754
65069 167754 167518 167227 166670 165862 164873 163648 162079 160201 158412 157533 158344 160686 163225 164520 164302 163418
65053 163418 162743 162623 163191 164472 166073 167428 168612 170255 172298 173547 173038 171304 169556 168057 166182
65038 166182 163841 161814 160548 159494 157998 156162 154430 152905 151501 150252 149056 147480 145331 143093
65024 143093 141386 140248 139380 138752 138465 138293 137955 137633 137622 137576 136822 135452 134471 134678 135900 137534 139297
65007 139297 141195 143186 145200 147268 149390 151512 153783 156538 159844 163353 166702 169765 172385 174247
64993 174247 175310 176022 176852 177772 178400 178433 177863 177028 176583 177062 178343 179887 181570 183737 186317 188636 190478
64976 190478 192605 195544 198511 200282 200694 200373 199340 196990 193377 189512 186139 183058 179928 176960 174441
64961 174441 172178 169896 167729 165921 164344 162693 160878 158988 157114 155442 154283 153816 153887 154146 154200 153732
64945 153732 152854 152217 152276 152424 151487 149224 146753 145221 144661 144478 144455 144726 145241 145892 146884 148471 150489 152560
64927 152560 154567 156490 158003 158707 158723 158629 158819 159092 158774 157201 154423 151585 150141 150315 150865 150773 150587
64910 150587 151429 153225 154915 156069 157189 158392 158963 158658 158569 160061 163342 167528 171755 175800 179975
64895 179975 184797 190560 196912 203065 208576 213675 218750 223886 229066 234326 239415 243772 247241 250418
64881 250418 253876 257419 260576 263398 266093 268140 268574 267168 264674 261740 258235 253881 249017 244332
64867 244332 240188 236553 233299 230229 227062 223820 221122 219659 219270 218851 217354 214721 211725 209034 206585
64852 206585 203808 200238 195854 191021 186305 182251 179085 176508 173970 171260 168688 166511 164457 162133
64838 162133 159766 158072 157336 157063 156783 156766 157529 158873 159865 159774 158713 157347 156289 155842 156036 156731 157783
64821 157783 159172 160872 162656 164319 166064 168315 171054 173681 175806 177893 180771 184646 188952 193131
64807 193131 197252 201782 207036 213037 219733 227147 235196 243409 250959 257171 262000 265763 268379 269177
64793 269177 267721 264485 260333 255444 249274 241582 233103 225096 218479 213500 209856 206971 204437 202420
64779 202420 201467 201812 203067 204697 206451 208134 209363 209949 210373 211487 213729 216883 220535 224463 228638
64764 228638 233137 238170 243933 250335 256974 263445 269586 275423 280957 286073 290656 294814 298954 303409
64750 303409 307868 311449 313572 314648 315576 316774 318084 319449 321038 322519 322827 321098 317467 312542 306479
64735 306479 299207 291342 284050 277801 271888 265493 258730 252285 246551 241688 238133 236295 235796 235733 235692
64720 235692 235888 236189 235810 234374 232721 232117 233028 235101 237890 241081 244342 247608 251278 255525 259618
64705 259618 262578 264359 265641 266568 266559 265415 263712 261753 258929 254635 249190 243361 237462 231431 225378
64690 225378 219549 214102 209351 205871 203849 202661 201574 200567 199977 199698 199368 199139 199634 201179 203557
64675 203557 206452 209630 212803 215843 219156 223414 228934 235616 243290 251623 259880 267358 274040 280267
64661 280267 285808 289826 291811 291947 290519 287554 283224 278019 272292 266121 259808 254014 249132 244949
64647 244949 241208 238127 236070 235100 235110 236104 238028 240603 243585 247001 250992 255698 261444 268631 277182
64632 277182 286394 295579 304675 314077 324200 335298 347277 359352 370163 378534 383886 385911 384400
64619 384400 379695 372735 364128 353653 341227 327947 315411 304168 293525 282854 272347 262498
64607 262498 253546 245785 239828 236029 233838 232131 230200 228221 226722 225738 224597 222630 220009 217700
64593 217700 216556 216695 217827 219808 222564 225741 228904 232006 235325 239067 243342 248372 254180 260119
64579 260119 265350 269967 275131 281745 289413 297090 304387 311672 319004 325567 330447 333585 335645 337048
64565 337048 337454 336212 333002 327917 321175 313112 304302 295270 286002 276135 265799 255935 247482 240506
64551 240506 234420 228811 223704 219251 215612 213057 211668 211004 210523 210372 211240 213295 215770 217858 219529
64536 219529 221134 222631 223772 224770 226137 227768 228661 227774 224946 220891 216491 212262 208387 205031 202497
64521 202497 201000 200308 199796 199035 198254 198064 198764 200084 201555 202901 204075 205244 206807 209158 212205 215318
64505 215318 218012 220481 223232 226381 229656 233013 236796 241211 246083 251299 257147 263858 271089 278207
64491 278207 284968 291591 298206 304502 309876 313704 315553 315433 313897 311656 309067 306146 302983 299854
64477 299854 296991 294572 292875 291995 291328 289775 286746 282672 278402 274438 270958 268180 266259 265023 264171
64462 264171 263680 263765 264554 265983 267825 269683 271193 272465 273991 275822 277148 277147 276022 274718 273855 273556
64446 273556 274182 276420 280393 285252 290041 294649 299615 305322 311701 318524 325739 333625 342725 353480
64432 353480 365864 379618 394934 412594 433325 457397 485103 517209 554515 597246 645483
64421 645483 700138 762937 835244 917160 1007859 1106389 1211813 1322731 1436971 1551771 1664129
64410 1664129 1771022 1869622 1957552 2033047 2094863 2142018 2173588 2188674 2186465 2166391 2128475
64399 2128475 2073797 2004649 1924008 1834565 1738025 1635176 1526679 1414057 1300212 1188943
64389 1188943 1083667 986373 897684 817664 746354 683630 628998 581757 541189 506487 476757
64378 476757 451286 429679 411525 396105 382684 370987 361087 352830 345611 338712 331664 324265 316538
64365 316538 308804 301581 295176 289362 283525 277134 270108 262888 256249 250859 246882 244040 242065 240954
64351 240954 240693 240946 241319 241833 242890 244785 247513 251047 255361 260018 264100 267000 269069 271035 272795
64336 272795 273289 271784 268861 265755 262929 259806 255925 251908 248996 247851 248093 248908 249731 250305 250535 250625
64320 250625 251104 252224 253357 253437 252159 250333 248868 247844 246926 246237 246171 246547 246686 246357 245919 245334 243796
64303 243796 240839 237255 234230 231830 229032 225168 220738 216610 212986 209491 206023 203079 201175 200170
64289 200170 199460 198846 198948 200431 202944 205306 206846 208076 209821 212203 214979 218427 223148 229071 235334
64274 235334 241254 246884 252448 257832 262933 268150 274044 280627 287241 293049 297430 300039 300827 300147 298755
64259 298755 297461 296592 295785 294505 292853 291639 291506 292232 293096 293564 293215 291299 287129 280943 273833 266670
64243 266670 259541 252377 245536 239462 234188 229560 225643 222604 220431 219096 218765 219570 221294 223484 225662
64228 225662 227278 227821 227313 226462 225933 225581 224799 223473 222253 221828 222221 222884 223299 223405 223439 223357 222574 220616
64210 220616 217973 215820 214657 213753 212317 210771 210186 210689 211202 210850 209969 209438 209555 209955 210332 210845 211848
64193 211848 213517 215774 218501 221809 226015 231274 237299 243698 250608 258729 268604 280013 292197 304474
64179 304474 316410 327472 336829 343612 347324 347918 345503 340210 332399 322882 312661 302384 292224
64166 292224 282318 273028 264587 256771 249296 242385 236548 231724 227040 221682 215875 210803 207593 206472
64152 206472 206762 207536 208257 208973 210086 211929 214471 217338 220149 222931 226124 230057 234488 238812 242646
64137 242646 245918 248467 249974 250440 250344 250094 249628 248766 247588 246113 244014 241183 238296 236223 235026 234194
64121 234194 233784 234530 236692 239549 242460 245807 250333 255926 261715 267280 273233 280556 289657 300127
64107 300127 311134 321970 332333 342100 350830 357717 362245 364841 366635 368571 370837 373124 375282
64094 375282 377720 381261 386532 393371 400794 407579 412884 416424 418301 418764 417869 415215 410185 402641 393170
64079 393170 382442 370627 357781 344561 332032 320820 311004 302814 296779 292851 290033 287443 285368
64066 285368 284628 285090 285554 285138 284112 283134 282304 281469 281000 281552 283121 284915 286284 287404 288865 290970
64050 290970 293632 296804 300653 305340 310780 316714 323002 329860 337701 346706 356620 367051 377778 388571
64036 388571 398965 408602 417730 426762 435242 441750 445163 445616 443932 440506 435249 428384 420724 413181
64022 413181 406334 400456 395649 391962 389565 388673 389037 389755 389934 389342 388012 385520 381287 375517 369143
64007 369143 362798 356508 350453 345289 341279 337734 333813 329562 325733 322862 320890 319417 317996 316355
63993 316355 314623 313222 312444 312412 313537 316397 320879 325930 330641 335133 339924 344947 349883 355012 360911
63978 360911 367568 374668 382586 392056 402749 413216 422627 431748 441715 452638 464010 475822 488415
63965 488415 501678 515259 529490 545306 563201 582868 603989 626823 651890 679632 710634
63954 710634 745773 785790 831070 882259 940891 1008979 1088021 1178782 1281967 1398684 1530080
63943 1530080 1676884 1839481 2018006 2211768 2418623 2635400 2859161 3087731 3318813
63934 3318813 3548842 3772951 3985826 4182228 4356990 4505262 4623338 4709213 4762157 4781712
63924 4781712 4767169 4717949 4634495 4518819 4374248 4204645 4013970 3806596 3587753 3363205
63914 3363205 3138234 2916905 2702160 2496260 2300970 2117572 1947018 1790161 1647749
63905 1647749 1520188 1407325 1308434 1222414 1147985 1083667 1027685 978269 934388 896120 863927
63894 863927 837486 815433 796280 779217 763949 750134 737371 725536 714713 704846 695653 686919
63882 686919 678647 670912 663787 657478 652441 649293 648568 650466 654767 661128 669639 680962 695774 714055
63868 714055 735067 757995 782486 808615 836478 865816 895838 925353 953237 978945 1002653
63857 1002653 1024827 1045533 1064047 1079154 1089997 1096655 1099787 1099691 1095894 1087740 1075102 1058417 1038247
63844 1038247 1015121 989610 962194 933068 902329 870368 837842 805231 772610 739890 707131
63833 707131 674615 642697 611591 581278 551828 523935 498826 477214 458531 441570 425773
63822 425773 411394 398482 386421 374700 363597 353712 345190 337742 331073 324890 318776 312523 306480
63809 306480 301159 296572 292306 288192 284510 281504 278999 276691 274608 273079 272167 271204 269129 265532 261374
63794 261374 258308 257129 257169 257247 256777 255727 254085 251934 249726 247837 246006 243763 241283 239166 237444
63779 237444 235502 233107 230865 229431 228778 228443 228009 227159 225851 224708 224595 225409 225872 225075 223691 223038
63763 223038 223401 224008 224310 224443 224561 224616 224782 225284 225679 225142 223727 222567 222443 222859 223033 223143 223831 224977
63745 224977 225840 226268 226938 228353 230256 232220 234250 236539 239060 241641 244131 246265 247755 248813 250311
63730 250311 253013 256722 260505 263659 266225 268611 271083 273734 276712 280247 284434 289097 293922 298779
63716 298779 303811 309084 314178 318361 321245 323009 323853 323629 322340 320638 319238 317906 315709 312450 309259
63701 309259 307385 306777 306391 305595 304745 304435 304749 305387 306116 306854 307595 308521 310042 312455 315588 318949 322244
63684 322244 325570 329040 332378 335061 336868 338075 339020 339630 339627 339134 338806 339221 340337 341644 342687 343396
63668 343396 344087 345205 346807 348143 348151 346690 344947 344183 344229 343739 341819 338872 335783 332837 329679 325891
63652 325891 321321 316131 310863 306231 302592 299691 297052 294492 292202 290588 290083 290827 292361 293925 295231
63637 295231 296677 298677 301206 304252 308182 313113 318268 322645 326308 330413 335865 342472 349507 356638
63623 356638 364028 371890 380309 389406 399392 410470 422721 436020 450068 464704 480205 497179
63611 497179 516149 537439 561325 587967 617086 648081 680579 714545 749632 784731 818510
63600 818510 850077 878631 902710 920544 931445 936410 937030 934262 928640 921205 913296 905228 895920
63587 895920 884237 870273 854810 837871 818506 795972 770574 743273 715038 686821 659705
63576 659705 634634 612113 592299 575160 560457 547949 537861 530760 526597 524272 522624 521639 522178
63563 522178 524660 528619 533537 539504 546799 555316 564757 575170 586941 600283 614920 630374 646558
63550 646558 664121 684148 707445 734244 764621 798926 837474 879861 924835 970701 1015578
63539 1015578 1057293 1093386 1121377 1139125 1145486 1141231 1129266 1113347 1096291 1079495 1063760 1049750
63527 1049750 1037400 1025521 1012463 997005 978397 955959 929110 897792 862692 825055 786197
63516 786197 747051 708234 670721 636135 605744 579204 554905 531717 509900 490258 473132
63505 473132 458463 446039 435226 425093 415449 407211 401105 396513 392263 388152 384827 382465 380466
63492 380466 378392 376403 374696 373243 372159 371693 371722 371833 372044 372811 374233 375849 377408 379264 381770 384861
63476 384861 388500 392892 397866 402602 406457 409612 412403 414399 414791 413465 411069 408083 404382 399774
63462 399774 394502 389089 383946 379251 374955 370846 366826 363202 360600 359467 359750 361058 363031 365492
63448 365492 368350 371451 374614 377914 381878 387266 394546 403658 414249 426022 438894 453074 469099
63435 469099 487607 509012 533531 561451 592869 626949 661864 695839 727958 757499 782839
63424 782839 801835 813569 819390 822108 824524 828736 836313 848524 866264 889877 919043 952827
63412 952827 989910 1028788 1067745 1104792 1137922 1165505 1186407 1199944 1206066 1205540 1199596 1189375
63400 1189375 1175998 1160987 1145843 1130891 1115049 1097132 1076970 1054766 1029870 1000958 967424
63389 967424 930047 890332 849838 810129 772655 738173 706647 677981 652516 630521 611579
63378 611579 594928 580268 567896 558174 551177 546707 544360 543639 544348 546867 551818 559459 569571 581855
63364 581855 596155 612368 630450 650491 672591 696703 722843 751349 782538 816189 851811
63353 851811 889434 929549 971991 1015272 1057271 1096181 1130483 1158529 1178916 1191290 1196355 1195156
63341 1195156 1188778 1178669 1166530 1153497 1139680 1124693 1108353 1090555 1070754 1048062 1021926
63330 1021926 992455 960069 925130 888150 850226 813007 778163 746919 720005 697774 680247
63319 680247 667113 657827 651652 647661 644865 642415 639352 633966 623927 607803 586586 563174 540132
63306 540132 518312 497704 478768 462324 448527 436727 426310 417138 409208 402389 396576 391700
63294 391700 387533 383862 380822 378680 377185 375591 373404 370724 367732 364318 360460 356583 353244 350682
63280 350682 348849 347591 346575 345431 344236 343552 343640 343914 343540 342374 341011 340195 340484 342057 344294 345821
63264 345821 345759 344837 344616 345566 346723 347344 348029 349714 352272 354905 357548 361016 365834 371636 377854 384343
63248 384343 391015 397373 402968 408225 414401 422549 432627 443742 455217 467333 480962 496583 513813
63235 513813 531985 550982 571262 593164 616462 640612 665167 689867 714588 739379 764387
63224 764387 789527 814369 838558 862290 886123 910313 934571 958518 982142 1005564 1028449
63213 1028449 1049799 1068344 1083057 1093307 1098640 1098568 1092612 1080587 1062863 1040300 1013946 984773
63201 984773 953665 921531 889332 858001 828408 801391 777684 757712 741428 728479 718573 711718
63189 711718 708085 707746 710642 716768 726173 738624 753410 769720 787285 806456 827485 849815 872305
63176 872305 894196 915676 937299 959022 980092 999944 1018775 1036906 1053778 1068094 1079039
63165 1079039 1086861 1091910 1093475 1090054 1080678 1065517 1045256 1020380 991297 958779 923922 887750
63153 887750 850979 814083 777506 741990 708676 678554 651676 627221 604611 584248 566788
63142 566788 551966 538682 526202 514765 504898 496630 489650 483880 479469 476298 473844 471604 469527
63129 469527 467995 467419 467842 468883 470090 471341 472882 474960 477562 480602 484178 488413 493063 497558 501578
63114 501578 505440 509711 514476 519194 523363 527086 530806 534618 538143 541044 543389 545413 547170 548628
63100 548628 549910 551210 552460 553256 553194 552368 551552 551797 553565 556193 558529 560179 561804 563986 566211 567440
63084 567440 567486 567291 567838 569222 570914 572570 574360 576717 579953 584101 589040 594806 601609 609452 617979
63069 617979 626997 636924 648278 660866 674073 687957 703393 720907 739979 759951 781179 804815
63057 804815 831762 862223 896023 932851 972339 1014406 1059477 1108033 1159917 1214407 1270842
63046 1270842 1328916 1388397 1448917 1510007 1571108 1631749 1692003 1752523 1813619 1874477 1933930
63035 1933930 1991973 2049699 2107495 2163951 2216943 2265157 2307925 2343960 2371092 2387308 2391524
63024 2391524 2383276 2362150 2327893 2281019 2223220 2157136 2085526 2010436 1933256 1855651 1780182
63013 1780182 1709615 1645683 1588817 1538935 1496105 1460575 1432771 1413370 1402766 1400236 1404158 1413517
63001 1413517 1428728 1450484 1478091 1509618 1543487 1579222 1616652 1655185 1694144 1733214 1772130
62990 1772130 1810332 1847379 1883375 1918491 1952177 1983223 2010418 2032680 2048669 2056851 2056155 2046264
62978 2046264 2027149 1998608 1960451 1912954 1857040 1794244 1726582 1656147 1584515 1512600 1441234
62967 1441234 1371756 1305849 1244794 1188997 1138125 1091610 1049090 1010521 975844 944544 915733
62956 915733 888842 864067 841846 821960 803385 785086 766707 748477 730734 713724 697603
62945 697603 682306 667474 652776 638341 624648 611911 599784 587749 575662 563849 552854
62934 552854 543246 535406 529190 523900 518895 514239 510452 507632 505154 502368 499292 496451 494280 492864
62920 492864 492017 491329 490302 488772 487113 485811 484845 483706 481933 479447 476488 473468 470816 468622 466434
62905 466434 463636 460116 456361 452934 450065 447752 446002 444820 444099 443603 443102 442628 442578 443311 444498 445206
62889 445206 444951 444360 444342 444866 445164 444941 444665 444605 444367 443701 443057 442923 443107 443203 443374 444140 445569 447140 448290
62870 448290 448785 448678 448179 447463 446411 444775 442724 440956 440014 439772 439818 439968 440078 439825 439138 438551 438535 438750
62852 438750 438524 437925 437711 438339 439571 441054 442664 444193 445253 445682 445612 445111 444170 443080 442275 441670 440716
62835 440716 439298 438042 437458 437254 436838 436130 435477 435154 435325 436222 437890 439919 441809 443451 444958 446210
62819 446210 447042 447796 449229 451770 455123 458678 462091 465442 469083 473398 478504 484079 489600 494842 500082
62804 500082 505833 512478 520163 528786 538002 547428 557096 567689 580118 594740 611064 628297 646142
62791 646142 664938 685217 707366 731778 759082 790026 825237 865148 909989 959744 1014435
62780 1014435 1074671 1141594 1215840 1296669 1382604 1472817 1567271 1665298 1764604 1862031 1954974
62769 1954974 2041695 2120526 2189256 2245321 2286398 2310883 2318079 2308008 2281110 2238320 2181469
62758 2181469 2113231 2036313 1952815 1864516 1773440 1681667 1590677 1501292 1414315 1330868 1252043
62747 1252043 1178442 1110189 1047183 989330 936703 889494 847613 810370 776802 746380 719130
62736 719130 695027 673612 654349 637065 621765 608205 596029 585231 576148 568880 562998 558010
62724 558010 554011 551584 551040 551929 553502 555555 558567 562962 568576 575141 582994 592831 604723 617915
62710 617915 631885 647242 665235 686622 711462 739881 772455 809671 851431 897375 947501
62699 947501 1002243 1062159 1127708 1199075 1275735 1356176 1438404 1520865 1602691 1682971 1760054
62688 1760054 1831764 1896083 1951343 1995867 2027795 2045460 2047861 2034757 2006531 1964179 1909336
62677 1909336 1844079 1770652 1691373 1608610 1524469 1440382 1357256 1276246 1199141 1127633 1062246
62666 1062246 1002317 946992 895906 848886 805617 765993 730382 699030 671385 646522 624116
62655 624116 604386 587091 571248 556157 542162 530019 519831 510949 502611 494280 485674 476961
62643 476961 468845 462032 456573 451991 447891 444149 440682 437539 435183 434158 434339 434931 435372 435875 436875
62628 436875 438288 439515 439950 439302 437742 436026 435231 435922 437547 438817 438672 436937 434382 432398 432351 434738
62612 434738 438862 443534 448100 452745 458073 464747 473363 484189 496870 510716 525366 540991 557885
62599 557885 576327 596954 620706 647968 678114 710413 745149 783289 825105 869710 915931
62588 915931 962950 1009780 1054755 1096052 1132421 1162934 1186361 1201458 1207801 1205772 1195697 1177583
62576 1177583 1151860 1119861 1083298 1043631 1002111 959903 917716 875601 833608 792521 753567
62565 753567 717551 684626 654799 628165 604549 583376 564133 546775 531548 518573 507740
62554 507740 498844 491601 485548 480101 474848 469769 465101 460942 457033 453094 449277 446147 444169 443379
62540 443379 443527 444330 445550 447075 448993 451335 453718 455637 457214 459202 462033 465348 468874 473217 479194
62525 479194 486700 495020 504089 514733 527679 543047 560900 581556 605064 631004 659189 690138
62513 690138 724488 762322 803361 847359 893809 941550 989107 1035390 1079778 1121612 1159835
62502 1159835 1193003 1219495 1237984 1248088 1250479 1246122 1235439 1218459 1195689 1168605 1139307 1109853
62490 1109853 1081883 1056547 1034577 1016402 1002315 992636 987815 988271 994096 1005043 1020966 1042104
62478 1042104 1068646 1100044 1135033 1172201 1210237 1247707 1283097 1315184 1342937 1364945 1379469
62467 1379469 1385362 1382627 1371786 1353053 1326353 1291820 1249967 1201709 1148620 1092899 1036572 980785
62455 980785 926077 873128 822880 776114 733367 695218 662239 634604 611871 593116 577153
62444 577153 562975 550401 540218 533302 529557 527948 527508 527937 529286 531409 533886 536209 537912 538644
62430 538644 538271 536856 534513 531277 527009 521468 514670 507147 499527 491691 482821 472634 462258 453341
62416 453341 446483 441049 436346 432258 428655 424903 420446 415540 411052 407663 405484 404183 403202 401993
62402 401993 400385 398750 397612 397066 396698 396151 395657 395939 397506 400079 402846 405316 407822 411010 414976
62387 414976 419142 422932 426248 429237 431962 434581 437597 441520 446292 451401 456679 462644 469761 477678
62373 477678 485621 493472 501922 511445 521742 532595 544765 559353 576499 595409 615653 637711
62361 637711 662179 689176 718925 752254 790012 832353 879050 930087 985438 1044535 1106403
62350 1106403 1169976 1233636 1294743 1350392 1398733 1439033 1470541 1492011 1502684 1503232 1495301 1480214
62338 1480214 1458328 1429574 1394385 1354039 1310094 1263645 1215304 1165828 1116308 1067684 1020608
62327 1020608 976137 935934 901080 870986 844186 820001 798649 779846 762289 744808 727245
62316 727245 709801 692194 673978 655221 636326 617499 598914 581102 564637 549517 535358
62305 535358 522139 510366 500445 492302 485660 480362 476240 472947 470133 467702 465723 464220 463210 462877
62291 462877 463361 464319 464974 464930 464831 465872 468588 472371 476205 479612 482780 486127 489989 494492 499414 504332
62275 504332 509140 514277 520245 527062 534464 542411 551071 560453 570476 581358 593599 607640 623819
62262 623819 642626 664668 690329 719703 752838 789853 830930 876460 927018 982858 1043382
62251 1043382 1107302 1173156 1239351 1303949 1364857 1420198 1468224 1507084 1535257 1552240 1558460
62240 1558460 1554594 1541320 1519492 1489895 1452776 1408169 1356738 1299870 1239027 1175569 1111185
62229 1111185 1047759 986682 928833 875297 827254 784903 747268 713531 683885 658548 636595
62218 636595 616539 597856 581246 567447 556288 546910 538500 530722 523587 517062 510974 505427 501104
62205 501104 498665 497934 498227 499511 502536 507603 513889 520451 527301 535015 543790 553518 564405 576734
62191 576734 590181 603964 617636 631258 644860 658218 671132 683502 695108 705648 715052 723477
62179 723477 730988 737494 742966 747534 751333 754430 756911 759040 761416 764959 770574 778838 790243 805679
62165 805679 826173 852087 883019 918606 958759 1002786 1048917 1095219 1140483 1183679 1223023
62154 1223023 1256379 1282374 1300512 1310436 1311850 1305134 1291418 1271952 1247737 1219638 1188217 1153501
62142 1153501 1115486 1075016 1033735 993160 954249 917815 884725 855463 829989 808267 790544
62131 790544 776855 766668 759362 754776 752922 753226 754465 755573 756462 757960 760994 765839 772109 779272
62117 779272 786989 795079 803412 811782 819525 825283 827709 826698 823552 819674 815472 810798 805818 800832
62103 800832 795552 789312 781902 773708 765173 756713 749068 743130 739337 737685 738270 741275 746387 752726
62089 752726 759525 766478 773502 780657 788390 797291 807351 817859 828313 839118 851182 865077 880737
62076 880737 897773 915896 935183 955942 978144 1001117 1024093 1047033 1070563 1095103 1120476
62065 1120476 1146380 1172859 1200186 1228686 1258797 1290912 1324895 1359858 1394430 1427052 1456185
62054 1456185 1480729 1500337 1514931 1523873 1526132 1521448 1510814 1495441 1475557 1450550 1420003 1384245
62042 1384245 1344089 1300419 1254047 1205719 1156178 1106204 1056582 1008071 961531 917954 878106
62031 878106 842115 809610 780220 753774 730060 708707 689348 671717 655657 641207 628462
62020 628462 617045 605990 594607 583259 572705 562874 553053 543176 534020 525925 518246 510539 503530
62007 503530 498301 495000 492899 491282 489831 488605 488208 489583 493010 497583 502185 506655 511388 516095
61993 516095 519730 521653 522219 522130 521626 520400 517899 513703 507934 501341 494681 488072 481213 474085 466989
61978 466989 460010 452988 446044 439617 433808 428173 422438 417050 412750 409855 408191 407479 407472 407891 408599 409810
61962 409810 411893 414891 418339 421580 424131 425862 426973 427889 429013 430421 431826 432970 434113 436045
61948 436045 439549 444816 451321 458240 465026 471823 479358 488302 498689 510157 522812 537406 554339
61935 554339 572730 590998 608278 624859 641270 657559 673572 689319 704636 718788 730862
61924 730862 740425 747631 752838 756304 758093 758057 756056 752270 747156 741041 734122 726986 720713 716214 713780
61909 713780 713519 715811 720889 728319 737408 747970 760137 773472 786749 798679 808536 816063 821109
61896 821109 823464 822808 818780 811249 800518 787154 771805 755360 738958 723339 708275 693095
61884 693095 677794 663190 649924 637810 626319 615271 604730 594511 584126 573177 561685
61873 561685 550123 539217 529522 521038 513412 506578 501012 497153 494793 493329 492520 492708 494270 497181
61859 497181 501302 506829 514120 523109 533332 544729 558135 574605 594394 616932 641685 668492
61847 668492 696979 726220 755377 784312 813134 841413 868264 892958 914911 933160 946488
61836 946488 954279 956885 955077 949553 941173 931251 921185 911907 903931 897832 894458 894621 898643 906207
61822 906207 916561 928896 942497 956525 969793 980991 989099 993423 993267 987892 976943 960788
61810 960788 940279 916302 889591 860891 831121 801319 772337 744570 718077 693079 670120
61799 670120 649565 631125 614229 598730 584811 572246 560296 548589 537680 528435 521122 515357
61787 515357 510588 506251 501653 496196 489832 483120 476854 471698 467890 465008 462187 458951 455749 453346
61773 453346 451786 450375 448640 446811 445232 443884 442784 442415 443244 445002 446880 448447 449987 451958 454454
61758 454454 457290 460316 463451 466597 469679 472696 475590 478136 480083 481363 482121 482577 482893 483087 483008 482398
61742 482398 481042 478898 476159 473230 470617 468662 467307 466162 464879 463440 462171 461486 461581 462258 463086
61727 463086 463875 464910 466547 468672 470767 472553 474269 476325 478889 481874 485023 487874 490051 491754
61713 491754 493678 496148 498619 500337 501203 501630 501756 501266 499853 497473 494265 490688 487603 485606 484207
61698 484207 482230 479178 475782 472963 470688 468179 464904 461063 457275 454085 451648 449590 447300 444526
61684 444526 441660 439324 437776 436774 435894 434883 433818 432967 432437 431996 431414 430838 430527 430249 429413 427873
61668 427873 426224 425140 424739 424802 425250 426101 427234 428396 429255 429377 428489 426990 425772 425307 425212 425032 425016 425708
61650 425708 427070 428506 429594 430414 431315 432695 434818 437424 439711 441084 441832 442703 444047 445832 448145
61635 448145 451010 453768 455378 455497 454670 453346 451348 448603 445756 443502 441682 439575 436960 434351 432196
61620 432196 430286 428125 425554 422777 419976 417273 415067 413935 413864 413813 412492 409631 406071 402557 398926
61605 398926 394723 390109 385610 381240 376477 371066 365453 360372 356345 353481 351446 349687 347987 346687
61591 346687 345977 345157 343143 339700 335600 331530 327507 323539 320190 317961 316479 314790 312316 309255 306262
61576 306262 303983 302658 301845 300713 298909 296942 295470 294447 293391 292224 291330 290828 290399 289964 290015 290903
61560 290903 292204 293192 293776 294530 295821 297309 298425 298996 299236 299341 299379 299476 299883 300810 302262 304004 305604
61543 305604 306692 307324 307988 309018 310088 310545 310196 309538 309270 309833 311361 313659 316132 318079 319207 319652
61527 319652 319545 318964 318313 318174 318539 318676 318082 317097 316170 315010 313042 310441 308138 306880 306656 306893 306856
61510 306856 306040 304652 303530 303203 303253 303007 302579 302619 303290 304093 304588 304606 303906 302369 300556 299325 298802 298445
61492 298445 298181 298609 299788 300666 300308 299072 298044 297767 298087 298822 299918 301148 302195 302983 303572 303905 304025
61475 304025 304338 305255 306646 308035 309299 310800 312791 314962 316660 317387 317111 316220 315259 314650 314631 315286 316435
61458 316435 317545 318018 317661 316693 315374 313961 313010 313211 314698 316874 319216 321868 325108 328526 331213
61443 331213 332678 333177 333186 332943 332576 332411 332910 334281 336211 338107 339738 341540 344045 347024 349521 350797
61427 350797 350952 350594 350294 350519 351548 353114 354487 355364 356414 358460 361336 364059 366097 367919 370180
61412 370180 372805 375146 376774 377752 378209 377963 376801 375041 373542 372926 372897 372575 371459 369794 368011 366174
61396 366174 364184 362232 360762 360060 360005 360165 360072 359594 359072 358966 359337 359899 360581 361632 363060 364374 365178
61379 365178 365681 366325 367145 367818 368169 368327 368526 369045 370219 372184 374603 376844 378387 379016 378848 378329 378043
61362 378043 378322 379141 380392 382033 383903 385752 387664 390076 393134 396419 399629 403189 407797 413641 420487
61347 420487 428170 436462 444666 451902 457794 462503 466267 469410 472608 476504 480992 485358 489197 492771
61333 492771 496409 500049 503461 506510 509042 510837 511802 511956 511254 509759 507992 506565 505384 503719 501343
61318 501343 499149 498292 499007 500581 502258 503866 505794 508714 513168 519126 525991 533304 541294 550508 560978
61303 560978 572123 583495 595229 607544 619996 631442 640699 647109 650608 651510 650331 647553 643370
61290 643370 637688 630519 622310 613731 605182 596703 588275 579978 571826 563745 555823 548340 541461 535203
61276 535203 529839 525998 524062 523686 524182 525230 526918 529296 532161 535160 537822 539692 540825 541981 543928
61261 543928 546639 549582 552718 556715 562110 568776 576335 584566 593067 600914 607159 611627 614953 617901
61247 617901 620820 623702 626476 629084 631305 632637 632540 630895 628161 624962 621597 618130 614790 611960 609761
61232 609761 607943 606337 605212 605055 606153 608441 611570 615022 618389 621731 625535 630151 635364 640663
61218 640663 645822 651074 656802 663207 670180 677288 683905 689585 694399 698728 702690 705898 707941 708964
61204 708964 709606 710404 711407 712405 713314 714310 715785 718323 722551 728751 736653 745778 756003 767621 780787
61189 780787 794982 809001 821460 831508 839206 845148 849631 852412 853371 853082 852327 851323 849868 848052
61175 848052 846175 844107 841385 838036 834569 830963 826338 820001 812230 803734 794946 786247 778198 770867
61161 770867 763361 754675 744698 733909 722527 710605 698556 686787 675114 663373 652377 643374
61149 643374 636559 631019 626196 622519 620344 619110 617942 616469 614567 611835 607812 602405 595783 588224
61135 588224 580406 573433 568073 564231 561567 560410 561469 564668 568764 572429 575524 579152 584592 592329
61121 592329 602068 613396 626189 640479 656217 673291 691607 711066 731664 753675 777419 802669
61109 802669 828536 854174 879321 903928 927619 949965 971085 991441 1011135 1029767 1046774
61098 1046774 1061450 1072773 1079758 1082125 1080265 1074624 1065445 1052995 1037628 1019675 999706 978764
61086 978764 957749 936604 914637 891708 868566 845975 824125 803084 783294 765237 748933
61075 748933 734010 720012 706562 693513 681090 669690 659534 650768 643737 638666 635081 632082
61063 632082 629345 627403 626884 627920 630386 634139 638813 643850 649020 654539 660544 666869 673555 681179
61049 681179 690359 701229 713555 727095 741725 757565 775073 794720 816464 839876 864806 891443
61037 891443 919774 949545 980870 1014303 1050073 1087829 1127362 1169104 1213519 1260440 1309301
61026 1309301 1359663 1411233 1463738 1517189 1572180 1629850 1691695 1759299 1833910 1916313 2007449
61015 2007449 2108947 2222779 2350965 2496472 2664134 2859961 3090135 3361831 3684547
61006 3684547 4069470 4528923 5079679 5747495 6565546 7565970 8771225 10187335 11794462
60997 11794462 13538394 15337665 17107815 18776876 20270226 21488024 22324768 22737195
60989 22737195 22797175 22664444 22494981 22368310 22286595 22211696 22076441 21766722 21131754 20053798
60979 20053798 18528738 16681838 14704533 12770826 10993729 9427946 8088245 6963524
60971 6963524 6028269 5253968 4615148 4088617 3652561 3288942 2984762 2729362 2512034
60962 2512034 2323422 2157548 2010853 1880182 1762862 1657680 1564283 1481849 1409059 1344773
60952 1344773 1287986 1237626 1193063 1154159 1120082 1088675 1057890 1027519 998805 972666 948945
60941 948945 927013 906387 886897 868807 852606 838268 824918 811590 798044 784515 771128
60930 771128 758073 745980 735414 726139 717337 708411 699207 689722 680123 670884 662437 654767 647685
60917 647685 641289 635799 631121 627046 623690 621273 619634 618451 617894 618555 620730 624145 628377 633211 638583
60902 638583 644567 651402 659212 667751 676794 686778 698546 712311 727213 742107 756582 771057 786133
60889 786133 802067 818667 835441 851864 867679 883054 898379 913899 929490 944718 959081
60878 959081 972192 983884 994211 1003380 1011482 1018221 1023028 1025610 1026233 1025244 1022451 1017367 1010010 1001019
60864 1001019 990866 979408 966506 952741 939111 926139 913528 900485 886207 870288 853080
60853 853080 835552 818485 801897 785435 769164 753505 738526 723740 708702 693395 677955
60842 677955 662443 647102 632464 618819 605757 592647 579469 566817 555075 543950 532976
60831 532976 522173 511913 502376 493497 485426 478589 473100 468396 463781 459193 455151 451953 449264 446561
60817 446561 443782 441315 439416 437823 436046 434054 432552 432416 433765 435689 437006 437220 436724 436293 436576
60802 436576 437880 440021 442272 443736 443997 443444 442936 443165 444227 445653 446779 447150 446626 445278 443414 441638
60786 441638 440480 439794 438815 437064 434885 432803 430709 428102 424886 421449 418137 415149 412674 410516 407806
60771 407806 403888 399567 396580 395587 395389 394487 392746 391046 389913 389123 388246 386963 385112 382916 380998
60756 380998 379751 378871 377862 376691 375527 374234 372792 371981 372844 375375 378428 381161 383983 387745 392383
60741 392383 396835 400107 402049 403096 403574 403454 402643 401284 399611 397627 395182 392365 389567 387010 384479
60726 384479 381717 378848 376131 373506 370713 367785 365015 362428 359664 356451 352925 349331 345677 341907
60712 341907 338259 335172 332802 330819 328779 326665 324936 323974 323578 323163 322443 321720 321452 321739 322367 323113
60696 323113 323820 324281 324339 324086 323786 323635 323760 324357 325592 327304 329041 330510 331875 333487 335428 337470
60680 337470 339485 341651 344177 346936 349658 352427 355684 359625 363898 368160 372637 377708 383084 387913
60666 387913 391657 394416 396395 397604 398277 398983 399940 400632 400517 399782 399067 398728 398780 399254 400109 401004 401617 402075
60648 402075 402671 403326 403821 404371 405405 406744 407545 407128 405407 402480 398406 393578 388767 384406 380161 375566
60632 375566 370817 366601 363324 360828 358788 357027 355436 353788 351825 349536 347373 346106 346291 347810
60618 347810 350032 352360 354475 356070 356736 356316 355191 354046 353465 353791 355073 356895 358428 359021 358778 358343
60602 358343 358127 357942 357425 356651 356227 356891 358996 362207 365600 368237 369848 370948 372171 373533 374526 374913
60586 374913 375161 375858 376885 377480 377160 376282 375579 375363 375450 375704 376379 377928 380662 384568 389236 394020 398576
60569 398576 403412 409662 418066 428213 438920 449260 459088 468696 478222 487435 495736 502184 505740
60556 505740 505916 503260 498930 493715 487706 481077 474790 470129 467631 466925 467592 469718 473447 478502 484570
60541 484570 491882 500956 511870 524167 537380 551223 565193 578390 589958 599476 606821 611903
60529 611903 614750 615630 614851 612503 608665 603775 598522 593341 588239 583228 578673 574974 571983 569078 565907
60514 565907 562877 560719 559693 559429 559571 560317 562234 565602 570076 575059 580516 587478 597647 612201
60500 612201 630932 652674 676678 703407 734009 769175 808596 851219 895700 940633 984536
60489 984536 1025733 1062316 1092418 1114631 1128017 1131642 1124403 1105708 1076348 1038496 994834 947739
60477 947739 899134 850628 803588 759155 718273 681587 649236 620826 595720 573422 553778
60466 553778 536916 522968 511646 502136 493493 485214 477333 470053 463464 457633 452679 448550 444873
60453 444873 441217 437462 433792 430386 427285 424503 422038 419713 417304 414993 413511 413478 414586 415707 415902
60438 415902 415071 413535 411381 408608 405756 403812 403319 403793 404137 403515 401821 399634 397818 396875 396476 395774
60422 395774 394367 392838 392164 392719 394066 395563 396952 398352 399907 401518 402925 404037 405070 406279 407589
60407 407589 408744 409764 410928 412211 413138 413442 413550 414064 415007 415921 416593 417329 418561 420445 422828 425325
60391 425325 427537 429378 431132 433042 435034 437109 439642 442853 446195 448858 450803 452720 454980 457328
60377 457328 459754 462837 466714 470339 472523 473474 474624 476937 479991 482856 485328 487931 490958 493907
60363 493907 495906 496516 496055 495279 494851 495085 496022 497622 499875 502870 506739 511432 516555 521644 526688 532264
60347 532264 539002 546989 555694 564285 571876 577684 581291 582832 582803 581608 579347 575977 571522 566102 559947
60332 559947 553469 547152 541226 535498 529689 523983 519072 515512 513018 510557 507253 503130 498896 495104
60318 495104 491777 488868 486773 486067 486818 488558 490951 494162 498395 503510 509525 517296 528065 542159
60304 542159 558605 576258 594968 615293 637315 660100 682023 701131 715332 723008 723783 718442
60292 718442 707872 692410 672443 649352 625410 602686 582201 564094 548426 535643 526174 519655
60280 519655 514828 510517 506605 503724 501994 500499 498134 494634 490498 486272 482264 478757 476039 474145
60266 474145 472739 471289 469269 466375 462723 458772 454894 451122 447416 444037 441405 439727 438950 438990 439775
60251 439775 441058 442414 443486 444178 444662 445230 446037 446931 447668 448345 449390 450968 452634 453748 454035 453528
60235 453528 452209 450154 447969 446660 446909 448566 450912 453301 455570 457925 460522 463213 465734 467999
60221 467999 469962 471329 471872 472104 473126 475501 478651 481709 484642 488130 492628 498026 504078 510697 517826
60206 517826 525330 532992 540462 547422 553966 560483 566905 572523 577025 581319 586626 592974 599221 604439
60192 604439 608575 611848 614277 615962 617185 618048 618442 618402 617945 616557 613575 609257 604776 600828 596867
60177 596867 592086 586557 580929 575498 570166 565050 560546 556856 553843 551307 549152 547416 546271 545761
60163 545761 545354 544053 541343 537858 534823 532873 531608 530209 528278 526183 524708 524291 524579 524899 525164
60148 525164 525976 527718 529928 531818 533103 534019 534824 535699 536987 539069 541992 545456 549204 553249 557775
60133 557775 562983 568949 575434 581846 587618 592643 597223 601518 605123 607345 607940 607589 607466 608263 609736
60118 609736 611288 612679 613914 614804 615321 616256 618752 622865 627182 630283 632187 633907 635939 637754 638619
60103 638619 638353 637201 635413 633124 630458 627579 624713 622098 619838 617807 615793 613732 611840 610537
60089 610537 610219 610998 612651 614901 617625 620669 623591 625953 627808 629595 631499 633213 634335 634640 633957
60074 633957 632211 629696 626787 623208 618081 611026 602788 594420 586254 578039 569690 561336 552851 543995
60060 543995 534966 526401 518760 512041 506044 500582 495499 490882 487281 485318 484920 485189 485204 484824 484636 485277
60044 485277 486960 489585 493112 497655 503116 508901 514216 518735 522795 526883 531132 535419 539707 544027
60030 544027 548163 551533 553455 553573 552046 549303 545575 540823 535171 529117 522964 516328 508822 501123
60016 501123 494660 490030 486322 482327 477857 473528 469707 466238 462954 459967 457493 455578 453874 451670
60002 451670 448523 445021 442427 441284 440851 440207 439387 438983 439192 439805 440682 441596 442102 442281 443209 445775 449301
59985 449301 452283 454445 456980 460603 464393 467067 468578 469825 471276 472534 473007 472461 471002 468967 466840
59970 466840 465007 463515 462139 460688 459187 457860 456961 456622 456845 457646 459026 460733 462316 463638 465101
59955 465101 467014 468973 470318 471100 472037 473439 474752 475367 475484 475865 477018 478831 480799 482391 483359 483901
59939 483901 484455 485259 486253 487380 488648 489780 490169 489503 488269 487286 486787 486256 485230 484007 483384 483817 485013
59922 485013 486355 487521 488615 489853 491384 493396 496038 499090 501959 504317 506697 510189 515418 521845
59908 521845 528094 532962 536220 538552 540706 542769 544261 544798 544383 543151 541244 539072 537311 536333 535860
59893 535860 535387 534741 534123 533864 534412 536221 539302 543076 547014 551297 556566 563084 570378 577542 583719
59878 583719 588572 592610 596854 601837 606984 611166 613639 614214 612886 609849 605767 601523 597563 593709
59864 593709 589535 584744 579398 574026 569365 565714 562765 560268 558538 557908 558071 558472 559140 560638 563456
59849 563456 567935 574456 582966 592386 601162 608443 614289 618877 622205 624493 626172 627322 627726 627510 627166
59834 627166 626885 626418 625595 624337 622050 617831 611582 604391 597503 591386 585948 581071 576581 572163 567690
59819 567690 563315 559036 554554 549759 544983 540637 536977 534294 532805 532195 531871 531806 532476 533719 534396 533657
59803 533657 531915 530017 528033 525490 522295 518700 514771 510666 507237 505481 505269 505273 504380 502771 501477
59788 501477 501205 501776 502482 502785 502683 502466 502241 501874 501342 500759 499970 498545 496484 494594 493747 493880 494089 493635
59770 493635 492549 491322 490337 489658 489171 488835 488819 489358 490431 491703 492882 494041 495578 497923 501192 504927
59754 504927 508268 510743 512895 515782 519822 524564 529617 535223 541581 548135 554026 558963 563258 567237
59740 567237 571030 574748 578417 581762 584449 586569 588665 591184 594017 596563 598243 599065 599669 600624 601725
59725 601725 602305 602214 602008 602035 601886 601100 599984 599307 599399 599924 600290 600027 599090 598093 597902 598594 599190 598925 598406
59706 598406 598863 600478 602163 602954 602933 602677 602512 602660 603606 605814 609214 613273 617561 622082 627063 632467
59690 632467 637789 642400 646132 649277 651829 653056 652230 649731 646942 644946 643623 642116 639887 637069
59676 637069 634044 630995 627816 624264 620150 615485 610437 605154 599699 594227 589075 584488 580274 576016
59662 576016 571737 568094 565608 563895 562121 560204 559003 559142 560147 561159 562016 563092 564446 565919 567864
59647 567864 570928 574929 578625 580846 581363 580471 578381 575296 571563 567372 562702 557837 553507 550196 547708
59632 547708 545662 543964 542534 541049 539361 537731 536271 534582 532367 529997 527945 526090 524109 522258
59618 522258 521077 520459 519529 517413 513887 509476 505180 501795 499178 496492 493478 490974 489795 489736 490248
59603 490248 491398 493261 494906 495162 494209 493332 493178 493355 493725 494794 496444 497499 497341 497109 498411 501338
59587 501338 504535 506828 508039 508388 507908 506592 504653 502447 500245 498079 495650 492591 489030 485747 483441
59572 483441 481894 480149 477523 474206 470825 467666 464580 461537 458987 457460 456935 456838 456781 457045 458115 459861
59556 459861 461452 462120 461852 461356 461478 462674 464904 467918 471549 475620 479693 483305 486592 490352 495210
59541 495210 500969 507157 514061 522788 534260 548326 563759 578995 593029 605815 617561 627423
59529 627423 633338 633735 629268 622370 615257 608904 603717 600236 598794 599112 600677 603183 606332 609527 612079
59514 612079 613490 613404 611596 608273 604049 599325 593886 587354 579814 571737 563490 555184 546911 538887 531445
59499 531445 524982 519801 515824 512656 510074 508256 507344 507045 506990 507309 508417 510275 512311 514171 516132
59484 516132 518576 521429 524521 528276 533468 540250 547887 555714 563985 573420 584082 595097 605380
59471 605380 614252 621432 626903 630972 634047 636147 636860 635991 633968 631444 628789 626256 624368 623776 624822
59456 624822 627507 631735 637429 644526 653108 663362 675217 688197 701816 715940 730512 745169
59444 745169 759322 772333 783280 790936 794453 793896 789680 781801 770305 756372 742089 728894 716758
59431 716758 705040 693574 682536 671781 660921 650006 639699 630783 623723 618822 616550 617449 621642
59418 621642 628636 637853 649320 663546 680787 700869 723770 749592 777461 805037 829970 851494
59406 851494 869592 882623 887018 880155 863297 841394 820275 804036 794102 789631 788715 789817 792341
59393 792341 795559 796990 792428 778323 754513 724572 693420 664545 639292 617988 600862 587715
59381 587715 577562 569316 562728 558220 555883 555064 554907 554946 555112 555468 556083 557047 558520 560725 563724 567158
59365 567158 570452 573369 576113 578820 581352 583868 587103 591687 597535 604311 612044 620761 630003 639415
59351 639415 649479 660785 672890 684894 697105 711050 727599 745988 764987 784058 802891
59340 802891 820719 836925 851827 866067 879464 890985 899590 904619 905708 903039 897535 890233 881345
59327 881345 870376 857156 842299 826585 810369 793899 777860 763180 750274 738751 727891
59316 727891 717267 706903 697090 688225 680633 674240 668493 662993 658217 655273 654851 656742 660512 666186
59302 666186 674057 684181 696330 709988 724088 737196 748420 757689 764621 767612 764805 755868 742329
59289 742329 726490 710584 696467 685039 675868 668085 661661 657192 654630 653149 652243 652041 652418 652828
59275 652828 653327 654901 658336 663446 669719 676967 684897 692858 700614 708815 718026 727691 736590 743976
59261 743976 749807 754138 756719 757026 754467 748880 740975 731826 721786 710505 698240 686319 675764
59248 675764 666163 656720 647901 641071 636704 633889 631690 630255 630243 631691 633847 635942 637814 639682 641518
59233 641518 642935 643876 645073 647294 650177 652412 653223 653080 652692 651887 650025 647054 643478 639437 634501
59218 634501 628486 622076 616418 612167 608959 605823 602203 598589 595998 594854 594710 595031 595779 596963 598029
59203 598029 598230 597518 596724 596725 597607 598738 599710 600974 603249 606264 608677 609641 610012 611371 614190 617721 621389
59186 621389 625277 629202 632445 634777 636912 639463 642150 644480 646475 648222 649363 649667 649669 650106 651041 652062
59170 652062 653032 654240 656083 658972 663207 668588 674420 680274 686429 693307 700829 708590 716163 722937
59156 722937 728099 731248 732688 732843 731776 729507 726308 722314 717366 711600 705645 699823 693735 687141
59142 687141 680609 674694 669000 662787 656168 650052 645114 641386 638576 636276 634031 631646 629221 626681
59128 626681 623725 620588 618224 617195 616897 616499 616182 616739 618404 620798 623720 627293 631556 636568 642654
59113 642654 649902 657621 664903 671577 678095 684723 691339 697788 703891 709394 714388 719478 725027 730521
59099 730521 735231 739128 742600 745645 747922 749250 749499 748419 746200 743742 741677 739603 737051 734621
59085 734621 733127 732081 730234 727441 724743 722521 719676 714993 708461 700894 692911 684670 676188 667602
59071 667602 659288 651629 644527 637424 630123 623137 616773 610511 604000 598075 593738 590568 587256 583514
59057 583514 580249 577886 575756 573358 571156 569718 568827 567783 566022 563430 560720 559397 560348 562366 563018
59042 563018 561208 558039 555059 552773 551224 550812 551678 553042 553989 554561 555440 556986 559104 561734 564915
59027 564915 568542 572531 577124 582752 589663 597871 607354 618154 630310 643612 657313 670304 681866
59014 681866 692138 701531 709885 716587 721333 724314 725758 725718 724204 721230 716994 712346 708631 706558
59000 706558 705712 705732 707353 711363 717055 722825 728013 732965 737524 740828 742660 743709 744264 743837 742410
58985 742410 740899 739881 738812 736914 734023 730193 725452 720404 716203 713501 712184 712436 715053 720220
58971 720220 727009 734659 743469 753723 764709 775691 787120 799859 813584 826842 838500 848532
58959 848532 857599 866240 874271 880597 883975 884115 881656 876976 869768 860015 848517 835977 822368 807802
58945 807802 793236 779605 766895 754755 743391 733077 723419 714013 705387 698380 692829 687804 682940
58932 682940 678792 675894 674077 672679 670945 668416 665404 662860 661287 660083 658452 656617 655397 654819
58918 654819 653992 652350 650308 648558 647360 646727 646764 647486 648564 649632 650753 652446 655255 659346 664572
58903 664572 670899 678589 687798 698213 709494 721918 735972 751206 766165 779781 792326 804617
58891 804617 816778 828270 838842 848977 859642 871964 886774 903990 922519 941118 959117
58880 959117 976021 990833 1002448 1010658 1016197 1019675 1020891 1019274 1014605 1007012 996481 982855 966544
58867 966544 949044 932327 917510 904325 891999 880350 869728 860303 851916 844358 837224 829623
58855 829623 820744 810678 800120 789352 778167 766733 755696 745298 735172 725273 716270 708663
58843 708663 702097 695830 689359 682425 675068 667899 661672 656330 651070 645510 640031 634809 629489 624157
58829 624157 619624 616167 612916 609216 605751 603512 602439 601948 602091 603174 604799 606385 608309 611436 615654
58814 615654 619880 623469 626722 629962 632965 635519 637852 640199 642386 644071 645136 645759 646266 646805 646942
58799 646942 645789 642877 638764 634415 630172 625744 621033 616448 612320 608406 604166 599365 594386 589997
58785 589997 586764 584632 583172 582259 582312 583874 587178 592025 597748 603290 607837 611454 614758 617872 620174
58770 620174 621079 620505 618459 614817 609819 604195 598440 592407 585907 579262 573013 567463 562700 558649 554978
58755 554978 551484 548658 547262 547295 548071 549405 551824 555406 559333 562971 566416 569588 571860 573257 575026
58740 575026 578222 582510 587167 592381 598616 605409 611889 618022 624429 631322 638354 645021 650532 653955
58726 653955 655444 656772 659621 663776 667951 671873 676309 681369 686177 690342 694587 699656 705501 711838
58712 711838 718767 726478 734826 743438 751874 759538 765706 769701 770971 769303 765196 759656 753180 745212
58698 745212 735000 722595 708537 692989 675873 657639 639300 621792 605711 591461 579176
58687 579176 568629 559598 552126 546146 541137 536477 531832 527019 521959 517081 513176 510490 508436 506540
58673 506540 504999 503976 503157 502606 503249 505789 509739 514286 519488 525870 533428 541763 550623 559585 567735
58658 567735 574463 579977 584313 586586 586105 583569 580233 576503 572327 568207 564591 560870 556302 551498
58644 551498 547692 544845 541803 538167 534640 531573 528496 525276 522516 520510 518789 517052 515757 515412
58630 515412 515881 516613 517170 517461 517847 518970 521120 523962 527142 530717 534630 538313 541440 544555 548300
58615 548300 552555 556982 561838 567436 573428 579432 585744 592542 598961 603989 607703 610693 612877 613991
58601 613991 614633 615528 616144 615336 613043 610215 607354 604336 601375 598953 596926 594846 592985 592114 592500 594059
58585 594059 597085 601786 607599 613986 621397 630229 639493 647888 655638 663783 672168 679785 686737 694072
58571 694072 701856 709220 716337 724625 734833 746443 759149 773411 789400 806822 825994 847623
58559 847623 871314 895642 919829 943977 967509 988825 1006780 1021211 1031872 1038281 1040864 1040927
58547 1040927 1039209 1035595 1030319 1024029 1016656 1007654 997492 987396 977401 966131 952734 937586 920895
58534 920895 902276 882109 861789 842157 823006 804458 787374 772052 758071 745777 736392 730120
58522 730120 725626 721905 719248 717835 716897 715876 715069 714456 713268 711304 709448 708337 707737 707572 708146 708904
58506 708904 708527 706856 705269 704586 704069 703087 702129 701376 699866 697081 694036 691842 690428 689484 689378 690202
58490 690202 691148 691805 692997 695420 698544 701668 705060 709265 714291 720255 727835 737313 748129 759971
58476 759971 773343 788418 804391 820523 836687 852305 865816 875963 882637 885954 885560 881412
58464 881412 874252 864883 854019 843082 833800 826546 820337 814884 811357 810777 813024 817760 824810 833281
58450 833281 841963 850966 861232 871957 880446 885162 886986 886734 883566 876947 868194 858806 849005 839153
58436 839153 830725 824440 819106 813815 809768 808451 809428 811481 814574 819112 824532 830220 836875 845506
58422 845506 855861 866986 878352 889377 898922 906427 912548 917645 920730 920950 918990 915949 911857
58409 911857 906245 899171 890902 881692 872490 864543 857707 850669 843438 837856 834907 833404 832244 831955
58395 831955 832999 834650 836797 840704 846541 852215 856249 859780 864082 868183 870861 873002 875827 878521
58381 878521 879800 880374 881714 883728 885669 887991 891307 894782 897532 900428 904672 909824 915057 921007
58367 921007 928471 936612 944419 952747 962888 974292 985635 997058 1009515 1022991 1037118 1052313
58355 1052313 1068487 1083802 1096487 1106849 1115958 1123704 1129778 1135020 1140020 1143892 1146217 1148619 1152549
58342 1152549 1157197 1161529 1166649 1173908 1182381 1190573 1199159 1209637 1221689 1234227 1247745 1263271 1280177
58329 1280177 1297163 1314204 1331553 1348281 1363799 1379193 1394969 1409235 1420389 1429770 1439256 1448132
58317 1448132 1454942 1460642 1467141 1474364 1481476 1489302 1498709 1508249 1516354 1524344 1534428 1546340 1558778
58304 1558778 1572453 1588617 1606177 1623380 1640898 1660151 1680164 1699271 1718366 1739293 1761452
58293 1761452 1783167 1804908 1827982 1851645 1874759 1898665 1925108 1952933 1980220 2007898 2037795
58282 2037795 2068943 2099453 2130257 2163229 2197412 2230962 2265076 2302038 2341181 2380772 2422107
58271 2422107 2467503 2516011 2565364 2616462 2671566 2729794 2788800 2849234 2913097 2979524 3046776
58260 3046776 3116536 3191537 3270753 3351575 3434596 3521314 3609435 3695837 3782030 3871218 3962203
58249 3962203 4052039 4142505 4237727 4337393 4438657 4542945 4654426 4773534 4898449 5031142
58239 5031142 5175145 5329150 5489682 5658426 5839996 6034368 6238670 6454380 6685309
58230 6685309 6930615 7187663 7459764 7753089 8068197 8402852 8760655 9148085 9565720
58221 9565720 10011807 10491840 11014836 11583070 12195984 12861246 13590916 14390060 15261443
58212 15261443 16218562 17281554 18463809 19776664 21244549 22901615 24777864 26905674
58204 26905674 29338226 32146777 35405656 39199735 43643452 48873877 55031882 62274930
58196 62274930 70808145 80890025 92832511 107036308 124005746 144246739 168076361
58189 168076361 195461959 225910748 258367597 291220349 322555529 350497603 373239340
58182 373239340 388770257 394910205 390077413 374288552 349424808 318494450 284587999
58175 284587999 250273918 217480779 187504951 161008053 138119804 118650185 102260117
58168 102260117 88534909 77040395 67391145 59273210 52416633 46584066 41590292 37301088
58160 37301088 33602683 30389893 27582043 25124050 22964578 21049705 19339281 17810433
58152 17810433 16440870 15203728 14080562 13063787 12143229 11303443 10535976 9840945 9214110
58143 9214110 8644100 8123782 7652605 7225981 6833566 6469850 6135973 5829306 5541271
58134 5541271 5267314 5009775 4769363 4542716 4329626 4133589 3953548 3783461 3621516
58125 3621516 3471607 3334314 3204500 3079425 2961517 2851380 2745526 2642874 2546559 2457532
58115 2457532 2372916 2292092 2217869 2150206 2085237 2022004 1963840 1911570 1861467 1811554 1763997
58104 1763997 1719634 1675888 1631768 1589441 1549379 1509297 1469310 1432771 1400575 1369878 1339726
58093 1339726 1312474 1288116 1262807 1234970 1207708 1183123 1159144 1134078 1109534 1086600 1063565
58082 1063565 1039643 1016856 996170 975730 954816 935605 919114 903236 886701 871180 857577
58071 857577 843892 828744 813563 799438 785168 770218 756308 744245 732399 720002 708822
58060 708822 699871 691516 682506 673835 666011 657519 647635 637811 628684 618656 607042 595740 586183
58047 586183 577452 568925 561905 556924 552248 546712 541342 536600 530913 523660 516889 512098 507856 502512
58033 502512 496824 491964 487174 481341 474836 468059 460172 450954 441940 434135 426571 418584 411404 405856
58019 405856 400569 394178 387413 381344 375410 368886 362591 357478 353100 348969 345850 344228 343013 341196
58005 341196 339387 338419 337904 337398 337491 338503 339511 339860 340276 341490 343223 345368 348493 352186 354645 355006
57989 355006 354496 354251 353709 352212 350355 348549 345951 342114 338123 334890 331919 328877 326704 325860 325018
57974 325018 322859 319798 316839 314177 312034 311235 311723 311974 311128 310230 310228 310338 309658 308848 308772 308908 308527 308190
57956 308190 308673 309594 310391 311486 313223 314685 314749 313387 311025 307825 304460 302324 301989 302665 303969 306768
57940 306768 311417 316752 321933 327725 334847 342635 350596 359642 370360 381399 391060 399329 407067 414405
57926 414405 421124 427349 432565 435192 434409 431310 427146 421750 414768 406932 398793 389659 379252 369063
57912 369063 360593 353480 346759 340632 335509 330629 325299 320333 316651 313571 310021 306298 303080 299927
57898 299927 296431 293649 292494 291742 289566 286261 283617 282340 281876 282034 282949 284021 284739 286022 289012
57883 289012 293004 296279 298605 301176 304379 307321 309400 310753 311276 310601 309027 307231 305153 302285 298792
57868 298792 295219 291425 287045 282692 279465 277445 275798 274179 272915 272029 271187 270538 270654 271656 273155
57853 273155 274899 276889 279175 282072 286052 290770 294877 297463 299025 300304 301039 300624 299118 296638 292782
57838 292782 287689 282753 279092 276104 272688 269062 266128 263943 262117 260941 260667 260450 259484 258560 259045
57823 259045 260889 263090 265545 268835 272634 275949 278716 281738 285201 288557 291597 294364 296258 296468
57809 296468 295025 292314 288063 282078 275506 269895 265292 260669 255950 252155 249748 248226 247309 247215 247765
57794 247765 248390 248956 249624 250131 250217 250350 250918 251219 250559 249788 250275 251757 252766 252927 253181 253885 254469 255065
57776 255065 256881 260555 265426 270660 275852 280383 283442 285005 285777 285937 284901 282342 278580 274038 269319
57761 269319 265517 263266 261581 258887 255187 252029 250433 250068 250399 251322 252608 253992 255879 258869 262550
57746 262550 265857 268530 270999 273002 273683 273017 271763 269981 267015 262992 258929 255227 251459 247760 244961
57731 244961 243103 241268 239122 237218 235555 233407 230990 229708 230103 230954 231022 230397 229514 228124 226031 223722
57715 223722 221524 219078 216236 213522 211175 208755 206182 204131 202817 201422 199318 196922 194778 192764
57701 192764 190732 188983 187594 186233 185133 185201 186602 188275 189458 190620 192192 193529 193972 193964 194118 194074
57685 194074 193310 192439 192654 194262 196615 199184 202081 205857 211303 219084 229220 241350 255806 273806
57671 273806 296345 323630 355912 393809 436970 482997 528388 570057 605390 631473 645167
57660 645167 644028 627180 596034 554557 508189 461735 418254 379579 346792 319700 296851 276916
57648 276916 259716 245647 234762 226843 221552 218000 214872 211575 208682 206771 205552 204606 204134 204325
57634 204325 204747 205128 206077 208126 210592 212262 212827 212833 212557 211728 210184 208075 205531 202700 200004 197868
57618 197868 196232 194670 192885 190840 188703 186870 185768 185339 184981 184189 182941 181443 179996 179233 179838
57603 179838 181685 183778 185286 186134 186452 186117 185191 184138 183215 182248 181296 180774 180489 179396 176934 174004
57587 174004 171913 170871 170110 169056 167741 166439 165412 164748 164114 163026 161656 160798 160708 160598 159702 158220
57571 158220 156726 155277 153671 152056 150649 149291 147762 146139 144462 142566 140623 139218 138484 137829 136995
57556 136995 136621 137230 138425 139725 141350 143426 145243 146277 147275 149274 152046 154502 156168 157269 157804
57541 157804 157684 157505 158100 159398 160684 161851 163459 165599 167597 168922 169616 169829 169646 169421 169621 170348
57525 170348 171510 173298 175822 178470 180409 181662 182964 184712 186827 189531 193233 197533 201200 203500
57511 203500 204845 205888 206664 206990 207088 207353 207872 208510 209224 209984 210577 210753 210434 209710 208728 207629 206415 204945
57493 204945 203207 201520 200232 199284 198308 197122 195925 195089 194931 195529 196545 197300 197226 196216 194599 193022
57477 193022 192326 193008 194585 195935 196507 196725 196991 196957 196298 195539 195428 195916 196405 196664 196806 196754 196536 196860 198499
57458 198499 201123 203502 204966 206001 207341 209139 211161 213207 215097 216644 217870 218991 220125 221290
57444 221290 222657 224477 226700 228905 230607 231511 231712 231895 233054 235604 238881 241782 243724 244781 245307
57429 245307 245872 247160 249330 251763 253911 256123 259013 262337 265281 267718 270344 273596 277116 280413
57415 280413 283378 286049 288434 290779 293472 296570 299809 303124 306681 310327 313553 316118 318332 320548
57401 320548 322808 325079 327498 330202 333188 336375 339577 342474 344905 347137 349517 352020 354534 357417
57387 357417 361270 366155 371506 376785 381773 386352 390595 395079 400431 406409 411960 416436 420269 424229
57373 424229 428478 432609 436282 439544 442703 446074 449683 453153 456045 458344 460421 462593 464976 467721
57359 467721 471005 474775 478803 482995 487412 492069 496983 502298 508005 513631 518726 523599 529132 535807
57345 535807 543318 551162 559164 567269 575324 583288 591381 599763 608238 616381 623877 630622 636677 642168
57331 642168 647296 652505 658525 665878 674166 682328 689863 697360 705409 713518 720825 727509 734706 743108
57317 743108 752414 762111 772035 782069 791982 801782 811700 821665 831273 840399 849437 858833 868855 879796
57303 879796 891798 904340 916469 927775 938694 949706 960788 971853 983164 994898 1006713
57292 1006713 1018129 1029161 1040287 1051880 1063891 1076052 1088328 1101180 1115194 1130319 1145710
57281 1145710 1160562 1174798 1188549 1201468 1213215 1224402 1236258 1249386 1263537 1278485 1294300
57270 1294300 1310695 1327021 1343178 1359775 1377112 1394696 1412087 1429577 1447652 1466344 1485375
57259 1485375 1504364 1522631 1539515 1555298 1571188 1587967 1605223 1622390 1639854 1658351 1677784
57248 1677784 1697415 1716928 1736591 1756474 1776187 1795425 1814311 1833157 1852251 1871898 1892383
57237 1892383 1913731 1935556 1957128 1977693 1997011 2015601 2034209 2053069 2071961 2090926 2110354
57226 2110354 2130286 2150167 2169449 2187933 2205421 2221772 2237553 2253907 2271291 2288990 2306393
57215 2306393 2324053 2342784 2362325 2381784 2400997 2420507 2440420 2460233 2479809 2499641 2519976
57204 2519976 2540383 2560368 2579764 2598313 2615515 2631315 2646437 2661571 2676557 2690784 2704128
57193 2704128 2717027 2729712 2741877 2753309 2764450 2776056 2788407 2801199 2814180 2827544 2841494
57182 2841494 2855702 2869527 2882638 2895135 2907171 2918876 2930586 2942720 2955311 2968106 2981207
57171 2981207 2995091 3009739 3024292 3038028 3051374 3065398 3080536 3096298 3112171 3128323 3145321
57160 3145321 3163490 3182646 3202187 3221435 3240133 3258674 3277660 3297181 3316657 3335416 3353239
57149 3353239 3370254 3386479 3401569 3414950 3426037 3434356 3439596 3441635 3440541 3436416 3429268 3419147
57137 3419147 3406488 3392143 3377007 3361817 3347441 3335061 3325647 3319278 3315352 3313400 3313411 3315370 3318893
57124 3318893 3323278 3327483 3330022 3329513 3325752 3320081 3314504 3310694 3309901 3313289 3321866 3336237 3356745 3383820
57110 3383820 3418083 3460419 3512335 3576238 3655301 3753282 3874672 4024739 4209144 4433898
57100 4433898 4706394 5036696 5437626 5923543 6509080 7208515 8035234 9000909 10115078
57091 10115078 11385422 12817559 14412949 16165389 18058305 20064570 22148993 24272593
57083 24272593 26396563 28482289 30484855 32343777 33980417 35307927 36247951 36742576
57075 36742576 36758068 36287192 35354656 34019205 32364149 30479499 28447739 26339781 24216721
57066 24216721 22130881 20125213 18233031 16478118 14874430 13426365 12130754 10979555
57058 10979555 9961757 9064631 8275032 7580321 6968440 6427860 5948018 5519740 5135170
57049 5135170 4787612 4471514 4182242 3915754 3668861 3439757 3227582 3031316 2849554
57040 2849554 2681320 2526293 2384050 2253834 2135276 2028538 1933475 1849606 1777329 1718247
57030 1718247 1673701 1643669 1627399 1623800 1630241 1641909 1653550 1661081 1660290 1644938 1608503 1548744
57018 1548744 1469868 1380016 1287269 1197680 1115213 1041900 977986 922558 874346 832076 794464
57007 794464 760299 728710 699379 672407 647781 624981 603336 582668 563150 544543 526224
56996 526224 508186 491358 476509 463465 451901 442310 435450 431246 428995 428367 429487 432257 436381
56983 436381 441954 449196 457418 464849 469669 470879 468259 462028 452796 441512 429232 416898 405272
56970 405272 394884 386097 379253 374580 371978 371236 372512 376151 381983 389474 398736 410549 424886 440150
56956 440150 454488 467164 477969 486052 490298 490362 486298 477666 464145 446920 428437 410731 394749
56943 394749 381031 370027 361709 355815 352567 352431 355295 360826 369543 382422 399209 418095 437338
56930 437338 456272 474372 490261 502167 508676 508629 501117 486327 466032 442723 418468 394682
56918 394682 372334 351878 333387 317150 303704 292971 283878 275360 267372 260426 254456 248803 243222
56905 243222 238288 234637 232121 229933 227490 225061 223489 223338 224440 226324 228840 232212 236704 242615
56891 242615 250487 260905 273957 289038 305214 321702 338133 354488 370540 385124 396247 402261
56879 402261 402843 398713 390888 380638 369672 359501 350642 343006 337070 334106 335275 340905 350654 363985
56865 363985 380608 400923 425962 456517 492249 531780 573151 613828 650801 681439 704007
56854 704007 716921 718250 707086 685219 656567 625051 593747 565432 542342 525131 513231 506586
56842 506586 506177 512867 526922 548902 579810 619782 667626 722082 782400 846929 911951 972653
56830 972653 1024668 1064115 1087031 1089972 1071394 1032566 977765 913796 848173 786569 731751 684680
56818 684680 645806 615140 592264 577211 570812 573588 584862 603572 629385 662255 701251 744306
56806 744306 788638 830850 867103 893943 908865 909857 895194 864632 820682 768165 712420 657873
56794 657873 607440 562432 523135 489914 463570 444533 432332 426283 426112 431470 441469 455348
56782 455348 472979 493874 516066 536800 554100 566930 574055 573691 564467 546344 520638 489560
56770 489560 455692 421447 388799 359328 333937 312329 293263 275830 260139 246571 234990
56759 234990 225086 216823 209936 203580 197205 191288 186441 182285 178050 173868 170500 168010 165697 163283
56745 163283 161226 159789 158616 157425 156433 155891 155689 155574 155331 154691 153478 151901 150340 148902 147596 146796
56729 146796 146966 147928 148914 149430 149656 149927 150262 150477 150460 150215 149887 149763 150089 150944 152382 154455 156840 158789
56711 158789 159851 160372 160915 161457 161683 161820 162604 164429 166999 169739 172129 173738 174452 174674 174908 175113 174831
56694 174831 173937 172933 172477 172856 173831 174805 175256 175169 174912 174541 173611 171912 170018 168698 168121 168020 168258 168823
56676 168823 169570 170463 171745 173395 174757 175263 175275 175646 176679 178043 179408 180580 181273 181428 181611 182503 184116
56659 184116 186053 188275 190969 193797 196043 197503 198707 200225 202204 204425 206419 207690 208278 208857 209754
56644 209754 210279 209651 208231 207120 206774 206778 206776 206823 206987 207349 208213 209494 210128 209036 206565 204091 202269 200666
56626 200666 199011 197661 196664 195471 193873 192322 191028 189664 188244 187347 187104 186829 186112 185441 185255 185194
56610 185194 184769 184079 183322 182345 181185 180418 180333 180349 179879 179206 178837 178475 177433 175817 174577 174451 175366 176791
56592 176791 178214 179349 180249 181205 182326 183323 183886 184106 184372 184994 186039 187333 188514 189327 189986 190956 192264
56575 192264 193356 193823 194010 194712 196482 199314 202751 206156 209156 212004 215406 219947 225826 233082 241739
56560 241739 251693 262695 274445 286505 298335 309628 320431 330471 338669 343902 346211 346763 346810
56547 346810 347166 348407 350645 352967 353913 352819 350299 347342 344503 341904 339333 336142 331710 326217 320481
56532 320481 314967 309430 303558 297334 290794 284131 278031 273142 269111 264916 260188 255391 250712 245911
56518 245911 241444 238466 237101 235794 233175 229691 226613 224171 221615 218600 215573 213054 211246 210142
56504 210142 209490 208853 208149 207834 208148 208508 208130 206982 205783 205270 205745 206977 208306 209124 209489 209917 210462
56487 210462 210515 209702 208463 207516 207298 208041 209705 211574 212646 212850 213196 214353 215748 216464 216325 215643 214636
56470 214636 213657 213333 213843 214605 215210 216077 217640 219514 221052 222185 223125 223761 223915 223683 223085 221987 220841
56453 220841 220665 221692 222835 223198 223277 223752 223945 222719 220390 218518 218005 218430 219142 220027 221138 222339 223392
56436 223392 223975 223809 223180 222937 223443 224003 223912 223570 223823 224744 225921 227477 229786 232413 234287 234873 234480
56419 234480 233540 232300 231042 229956 228920 227919 227339 227361 227558 227723 228434 229956 231223 231026 229777 228956
56403 228956 229136 229743 230443 231476 232626 233174 233087 233212 233983 234795 234859 233934 232154 229942 228171 227566 227807 227963
56385 227963 227836 228112 229201 230824 232831 235501 238837 242391 245976 249850 254004 258031 261875 265938 270233
56370 270233 274199 277598 280912 284488 287849 290192 291151 290898 289931 288861 287984 287053 285825 284727 284374 284590
56354 284590 284607 284220 283984 284258 284754 285133 285370 285499 285627 286268 287937 290323 292506 294117 295617 297355 299082
56337 299082 300511 301715 302832 303958 305401 307388 309464 310859 311542 312249 313399 314743 316187 318151 320853
56322 320853 323904 326896 329826 332741 335474 337843 339592 340142 339152 337401 336422 337083 339057 341635 344303
56307 344303 346498 347780 348593 350103 352999 357023 361829 367465 373774 380115 386126 392090 398096 403440
56293 403440 407315 409684 411177 412516 414267 416692 419604 422686 426006 429856 434132 438544 443336 449136
56279 449136 455924 462901 469559 476236 483454 491334 499865 509149 519162 529829 541456 554531 569022
56266 569022 584451 600704 618122 636849 656819 678464 702663 729861 760019 793467 831050
56255 831050 873348 920557 973194 1031981 1096943 1167700 1244905 1330308 1424940 1528094 1638505
56244 1638505 1755543 1878695 2006674 2137668 2269734 2400374 2526310 2644280 2751589
56235 2751589 2845521 2922887 2980766 3017469 3032572 3026430 2999906 2954116 2890350 2810683 2718494
56224 2718494 2617546 2510357 2398171 2282513 2165832 2050485 1938079 1830097 1728056
56215 1728056 1632498 1542685 1457917 1378546 1305235 1237847 1175579 1117803 1064432 1015810 972280
56204 972280 933436 897920 864594 833715 806196 781979 760193 740643 723796 709274 695860
56193 695860 683257 672450 663882 656607 649741 643537 638413 634053 630064 626518 623315 620003 616664 613958
56179 613958 611949 609985 608064 606977 606709 606143 605007 604658 606112 608605 611045 613673 617321 622049 627455
56164 627455 633413 639661 645584 651133 657060 663658 670331 676994 684717 694229 705022 716653 729753
56151 729753 744867 761484 779186 798671 820890 846250 875432 909776 950122 996480 1049538
56140 1049538 1110927 1181121 1258548 1341709 1430367 1523339 1616758 1706196 1789330 1865209 1932458
56129 1932458 1990088 2039059 2081312 2117949 2149549 2177074 2200745 2218849 2229172 2231027 2224799 2210572
56117 2210572 2188606 2160172 2126420 2087051 2041069 1987758 1925978 1854235 1773241 1687310 1601637
56106 1601637 1519249 1441908 1372202 1312375 1262026 1219132 1182736 1152903 1128856 1109156 1093162
56095 1093162 1080700 1070946 1063252 1058265 1056569 1057015 1058109 1060148 1064185 1069663 1074974 1079690 1084495 1089595
56081 1089595 1094944 1101336 1109434 1118361 1126944 1135662 1145662 1156658 1167576 1178513 1190283 1202692
56069 1202692 1215056 1227690 1241223 1255206 1269029 1283311 1298757 1314729 1330684 1347803 1367263
56058 1367263 1388128 1409025 1430627 1454238 1479075 1503304 1526688 1549871 1572258 1593164 1613976
56047 1613976 1636523 1660226 1683456 1706680 1731492 1757412 1782608 1807170 1832916 1860505 1889378
56036 1889378 1919975 1953377 1989277 2026704 2066022 2107880 2151222 2194927 2240334 2289420 2341591
56025 2341591 2394989 2449677 2506592 2564774 2622920 2682382 2745314 2811059 2877833 2946533 3019163
56014 3019163 3094774 3170950 3248187 3328848 3412905 3498818 3587527 3681312 3779697 3880797 3985688
56003 3985688 4097023 4214410 4335849 4462733 4598677 4744351 4898314 5061853 5237775
55994 5237775 5425338 5621626 5827152 6044873 6274954 6516180 6771432 7045772 7340096
55985 7340096 7652707 7986005 8345341 8732648 9147980 9595949 10083489 10612792 11184088
55976 11184088 11803836 12482162 13224233 14033285 14920665 15903490 16994489 18204974 19556664
55967 19556664 21080073 22804095 24760835 27000693 29591188 32604547 36122801 40254600
55959 40254600 45131638 50891315 57682984 65694273 75161899 86376098 99712553 115651333
55951 115651333 134694141 157184396 183131112 212082888 243031128 274412105 304330121
55944 304330121 330891474 352306785 366685046 371994948 366671610 350589828 325526355
55937 325526355 294621902 261276159 228271872 197470439 169883916 145861603 125310237
55930 125310237 107914912 93286706 81018782 70716100 62034310 54695020 48465653
55923 48465653 43144894 38571595 34625727 31208370 28229924 25618628 23323544 21301186
55915 21301186 19508661 17912167 16489609 15219909 14079102 13049492 12122208 11287099
55907 11287099 10529104 9837331 9208431 8637617 8114694 7632078 7188719 6782783 6407788
55898 6407788 6059148 5737588 5442888 5170476 4917041 4683486 4469525 4271062 4085543
55889 4085543 3914522 3758406 3613868 3478800 3354738 3241897 3136515 3035423 2938844 2846602
55879 2846602 2756018 2665700 2577220 2491126 2405469 2320176 2238726 2163440 2092922 2025834 1963189
55868 1963189 1904936 1848218 1791230 1735456 1682306 1630955 1581267 1535331 1494155 1456026 1419842
55857 1419842 1386865 1357469 1329392 1301035 1273473 1247432 1221261 1193679 1165608 1137558 1108037
55846 1108037 1076390 1044565 1014343 985363 957362 931641 908676 886913 865614 846343 830023
55835 830023 815144 800528 787272 776098 765292 753276 741015 729966 719773 709795 700820 693351
55823 693351 686068 677798 669267 661234 652625 642255 630708 618934 606583 593292 580122 568175
55811 568175 557249 547174 538930 533025 528234 523281 518505 514747 512055 510566 511112 513751 517108 520212
55797 520212 523574 527615 531670 535474 539798 544529 547998 549391 550068 551252 552201 551913 550863 549613 547413
55782 547413 543684 539377 535397 531078 525540 519105 512189 504473 496644 491361 490914 495187 503106 514366
55768 514366 528217 542200 553894 562507 567093 564797 553093 532957 508099 481951 456872 434953
55756 434953 417321 403089 390666 379780 370946 363682 356764 349744 342878 336008 328736 321335 314519
55743 314519 308769 304543 302290 301505 300688 299166 297907 297686 297655 296778 295405 294051 291794 287459 281606 275848
55727 275848 270829 266118 261421 256688 251640 246287 241367 237315 233544 229686 226643 225382 225578 226510 228438
55712 228438 231971 236954 243012 250281 258460 266090 271906 276037 278819 279584 277821 274408 270236 264654
55698 264654 256816 247608 238649 230206 221726 213654 206980 201554 196588 192358 189790 188688 187970 187385 187549
55683 187549 188498 189614 190807 192434 194264 195782 197346 199830 203228 206627 209397 211403 212398 212187 211145
55668 211145 209761 208104 206496 205910 206656 207428 206852 205309 204072 203446 203091 203369 204804 206807 208477 210134
55652 210134 212491 214881 216015 216092 216387 217091 217265 216779 216505 216640 216614 216644 217613 219162 219526 217657 214136 209822
55634 209822 204992 199990 195248 190314 184277 177477 171441 166784 162501 157791 153219 149491 146312 143178
55620 143178 140349 138340 137192 136715 136756 136848 136335 135187 133994 132963 131628 129755 127703 125651 123292 120636
55604 120636 118411 117262 117087 117366 117641 117570 117049 116410 116028 115799 115390 114804 114142 113197 111950 111068 111025 111149
55586 111149 110493 109286 108394 107756 106723 105761 106242 108361 110666 112010 112729 113538 114485 115504 116956 119022
55570 119022 121339 123636 126024 128393 130330 131883 133583 135509 137108 138079 138608 138668 138068 137287 137132 137334
55554 137334 136636 134569 132006 129661 127251 124647 122570 121378 120220 118220 115674 113380 111635 110626
55540 110626 110853 112253 113611 113838 113327 113203 113721 114248 114469 114695 115162 115745 116335 116944 117477 117767 117673 116896
55522 116896 114963 111765 107891 104136 100908 98298 96323 94771 93169 91285 89461 88221 87807 88254 89572
55507 89572 91515 93494 95070 96320 97470 98352 98423 97276 95023 92371 90296 89353 89184 88870 87764 85889
55491 85889 83726 81925 80975 80758 80601 80171 80027 80752 81853 82319 82058 81964 82535 83289 83608 83395 82772 81977
55473 81977 81689 82560 84047 84529 83065 80426 78037 76545 75846 75842 76466 77336 78032 78606 79443 80679 81950
55456 81950 82665 82511 81851 81549 82101 83031 83549 83617 83852 84442 84826 84517 83701 82858 82234 81791 81262 80311 79016
55437 79016 78092 78118 78687 78914 78612 78256 77928 77229 76271 75916 76744 78398 80074 81078 80938 79748 78517 78453
55419 78453 79791 81877 84235 86756 89019 90559 91862 93962 96773 98895 99346 98491 96983 94929 92606
55404 92606 90839 89897 88918 87178 85199 83893 83263 82666 81863 81204 81134 81923 83458 85011 85744 85635 85331
55387 85331 84968 84023 82536 81491 81493 81994 82361 82846 83822 84853 85238 84884 84069 82978 81984 81669 81950 81839
55369 81839 80682 79068 78008 77817 78233 78967 79643 79922 80125 80977 82274 82756 81796 80300 79303 78767 78450
55352 78450 78806 79969 80867 80544 79533 78795 78107 76876 75788 76148 77866 79488 80147 80315 80715 81552 82766
55335 82766 84043 84620 83935 82481 81307 80849 80954 81765 83573 85948 87880 88802 88817 88118 86942 85918 85600
55318 85600 85725 85597 85065 84428 83679 82644 81672 81325 81447 81328 80694 79847 78998 78226 77899 78279 78820 78698 77993
55299 77993 77576 77880 78595 79501 80708 82001 82811 83045 83308 84106 85302 86396 86906 86585 85757 85246 85442 85680
55281 85680 85204 84340 83924 83977 83935 83950 84693 85880 86226 85187 83686 82707 82130 81441 80764 80546 80778 81115 81427
55262 81427 81818 82341 82952 83557 83971 84084 84052 84057 83998 83795 83777 84233 84749 84606 83761 82823 82172 81771 81765 82419 83420
55241 83420 84004 83937 83691 83582 83422 83143 83037 83243 83701 84660 86405 88251 88739 87302 85054 83509 83136 83501
55223 83501 84145 84771 85120 85266 85713 86768 88073 89067 89580 89708 89488 89034 88672 88642 88920 89502 90518 91923
55205 91923 93422 94860 96263 97340 97468 96452 94889 93506 92557 92076 92151 92547 92572 91825 90713 89820 89089
55188 89089 88156 87173 86671 86711 86741 86362 85747 85193 84660 84000 83409 83317 83847 84621 85181 85511 85951 86678 87447 87884
55168 87884 87877 87668 87737 88548 90088 91596 92154 91738 91268 91451 92043 92556 93094 93915 94660 94769 94370 94032 93837
55149 93837 93380 92632 92074 91947 91961 91799 91520 91497 92291 94290 96998 99000 99320 98474 97551 96702 95474 94167
55131 94167 93581 93518 92964 91890 91523 92357 93187 92830 91746 91199 91696 92975 94748 96539 97449 97004 95884
55114 95884 95104 94852 94769 94880 95494 96462 97280 97709 97706 97082 95950 95283 96201 98639 101311 103092 103957 104478 104883
55095 104883 104842 103986 102463 101047 100617 101431 102932 104337 105231 105603 105617 105548 105680 106010 106261 106297 106301 106383 106285 105732
55075 105732 104784 103679 102602 101855 101911 102929 104321 105175 105093 104481 104060 104147 104345 103955 102817 101598 100975 100720
55057 100720 100094 99052 98391 98548 98926 98768 98153 97684 97607 97721 97857 97998 98089 98074 98014 97926 97665 97162 96634 96386
55037 96386 96536 96981 97406 97395 96948 96863 98020 100109 101715 101995 101708 102068 103090 103707 103216 101930 100532 99370
55019 99370 98536 98164 98413 99214 100170 100799 100984 101085 101436 101880 102123 102359 103019 103945 104491 104543 104731 105407 106121
55000 106121 106492 106905 107763 108650 108890 108575 108403 108745 109448 110336 111313 112060 112110 111305 109968 108726 108262 108862
54982 108862 109921 110267 109396 108125 107675 108424 109889 111527 112983 113836 113814 113262 112888 112985 113220 113256 113205 113359
54964 113359 113737 114100 114437 115278 117205 119891 121932 122105 120632 118698 116957 115311 113979 113682 114412 115039
54948 115039 114708 113781 112788 111393 109264 107234 106521 107167 108210 109099 110049 111172 112158 112775 113016 112808 112177
54931 112177 111568 111390 111461 111489 111860 113237 115479 117728 119459 120831 122122 123559 125645 128901 133163 137743
54915 137743 142283 146928 151709 156374 160814 165012 168555 170829 171769 171805 171078 169283 166337 162577 158226
54900 158226 153290 148065 143190 139018 135405 132166 129249 126518 123925 121893 120883 120562 120084 119262 118747
54885 118747 118870 119094 118914 118654 118946 119935 121345 122912 124470 125987 127765 130256 133509 137229 141456 146591
54869 146591 152545 158443 163431 167312 170092 171579 171806 171275 170237 168156 164462 159506 154244 149220 144364
54854 144364 139624 135277 131611 128640 126126 123701 121129 118613 116637 115247 113746 111445 108573 106086
54840 106086 104660 104167 104155 104438 105059 105823 106134 105533 104362 103665 104155 105374 106189 106067 105567 105569 106392 107723
54822 107723 109047 109994 110530 110957 111566 112249 112745 113139 113705 114205 113985 112953 111914 111515 111380 110797 109938 109733
54804 109733 110598 111813 112288 111658 110514 109779 109969 110952 112301 113752 115197 116354 116817 116562 116086 115864 115925
54787 115925 116127 116566 117361 118204 118517 118099 117398 117082 117480 118426 119513 120408 121021 121464 122013 123078 125011 127712
54769 127712 130569 133046 135316 138088 141867 146649 152207 158229 164086 169038 172921 176345 179953 183695
54755 183695 186960 189120 189767 188754 186259 182591 177771 171689 164894 158722 154143 150785 147601 144255
54741 144255 141228 138754 136470 134245 132653 132124 132045 131241 129259 126843 125163 124844 125656 126882 127880 128571
54725 128571 129527 131458 134473 137906 140988 143562 146044 148828 152006 155562 159450 163392 166967 170092
54711 170092 173094 176031 178196 178653 177066 173770 169269 164096 158917 154193 149762 145267 141013 137848
54697 137848 136055 134873 133405 131613 130127 129394 129261 129189 128657 127584 126472 125912 125826 125467 124351 122845
54681 122845 121645 120999 120636 120195 119454 118452 117611 117449 117911 118329 118299 118217 118510 118748 118155 116772 115483 114933
54663 114933 115098 115888 117446 119548 121330 122117 122147 122052 121900 121293 120318 119791 120320 121463 122203 122185 122107 122783 124061
54644 124061 124969 124818 123869 122836 122133 121791 121806 122147 122492 122379 121693 120769 119957 119353 119020 119167 119865 120782 121415
54625 121415 121498 121089 120417 119826 119615 119705 119593 118963 118162 117706 117472 116935 116201 116085 116899 117839 118150 118335 119384
54606 119384 121116 122270 122271 121975 122338 123151 123601 123478 123170 122906 122681 122728 123343 124254 124649 123977 122428 120663
54588 120663 119341 118804 118871 119007 118974 119178 120053 121281 122096 122321 122560 123326 124463 125569 126550 127514 128392 128929
54570 128929 128915 128377 127670 127363 127758 128538 129107 129282 129359 129565 129793 129969 130282 130934 131866 132864 133706 134206 134361
54551 134361 134499 134994 135842 136761 137647 138570 139331 139462 138775 137586 136334 135401 135266 136285 138145 140036 141652
54534 141652 143481 145830 148063 149257 149232 148448 147230 145722 144418 144055 144793 145847 146111 145033 142911 140586
54518 140586 138855 137959 137502 136928 136077 135279 134972 135299 136008 136630 136803 136457 135772 134998 134403 134200 134338 134462
54500 134462 134315 134090 134116 134288 134181 133713 133251 132954 132468 131501 130359 129580 129284 129165 129002 128936 129296 130260 131635
54481 131635 132948 133889 134598 135340 136039 136425 136578 136870 137374 137838 138303 139211 140646 141974 142577 142553 142391 142309
54463 142309 142258 142297 142540 142914 143283 143631 143986 144359 144926 145925 147204 148242 148855 149426 150171 150620 150315 149569 148919
54444 148919 148132 146458 143801 141068 139234 138510 138479 138673 138882 139107 139391 139665 139814 139942 140371 141223 142210 143021
54426 143021 143630 144049 144074 143665 143273 143344 143649 143524 142783 141953 141600 141710 141831 141573 140914 140187 139841 140089 140785
54407 140785 141610 142302 142682 142683 142484 142491 143091 144456 146513 148882 150947 152347 153388 154603 155922 156862 157495
54390 157495 158511 160122 161689 162785 163825 165108 166033 166036 165637 165608 165566 164420 162001 159346 157450 156615 156890
54373 156890 158189 159842 160867 160927 160463 159800 158814 157617 156823 156826 157369 158029 158697 159441 160408 161959 164331 167010
54355 167010 169018 170042 170772 171947 173634 175650 177992 180446 182383 183450 184091 184934 186044 187143 188113
54340 188113 188759 188531 187101 185051 183327 182082 180628 178481 175892 173275 170628 167860 165268 163276 161850
54325 161850 160517 158945 157259 155710 154339 153126 152233 151818 151738 151760 152042 152955 154340 155429 155769 155746 155780
54308 155780 155461 154179 152356 151152 150950 150893 150236 149402 149211 149620 149902 149786 149701 149863 149783 148964 147721 146919
54290 146919 147010 147630 148113 148131 147732 147093 146494 146371 146983 148008 148856 149408 150111 151159 152069 152321 152037 151703 151555
54271 151555 151635 152138 153178 154385 155193 155435 155284 154883 154479 154616 155526 156486 156536 155873 155788 157069 159100 160761
54253 160761 161598 161833 161817 161928 162564 163740 164893 165379 165016 164025 162741 161611 161082 161177 161393 161282 160895 160509
54235 160509 160188 159855 159503 159017 158080 156590 155003 153950 153621 153787 154264 155011 155797 156147 155700 154537 153101
54218 153101 151853 150984 150355 149776 149297 149200 149715 150871 152564 154560 156422 157705 158302 158445 158338 157989 157449
54201 157449 156879 156288 155443 154224 152866 151699 150826 150234 150054 150413 151104 151577 151314 150234 148775 147608 147171
54184 147171 147392 147886 148321 148563 148591 148526 148654 149176 149933 150566 150875 150818 150311 149435 148784 149106 150441 151954 152813
54165 152813 152937 152709 152365 151962 151687 151763 152075 152214 152007 151827 152201 153138 153976 154035 153364 152635 152306 152211 152144 152373
54145 152373 153097 153662 152980 150833 148281 146635 146382 147252 148861 150891 152876 154242 154725 154630 154507 154507 154196
54128 154196 153271 152321 152441 153920 155827 157146 157782 158017 157666 156532 155312 155079 156004 157376 158738 160135
54112 160135 161309 161685 161374 161220 161573 161871 161776 161852 162606 163675 164543 165414 166701 168168 169220 169659 169575 168885
54094 168885 167576 166094 164944 164138 163496 163211 163643 164772 166273 167941 169614 170954 171696 171949 171947 171753 171545
54077 171545 171847 172997 174607 175967 176829 177451 178063 178669 179228 179687 179935 179962 179941 180013 180275 181080 182895 185585
54059 185585 188274 190349 192241 194858 198650 203620 209769 216882 224186 230884 236998 243128 249391 254956
54045 254956 258603 259488 257594 253762 249263 245079 241682 239441 238752 239482 240821 242137 243663 245994 249296
54030 249296 253375 258073 263006 267354 270496 272683 274607 276570 278485 280323 282037 283406 284419 285437
54016 285437 286420 286533 285172 282878 280495 277924 274614 270806 267145 263328 258399 252458 246932 242882 239989
54001 239989 237422 234796 231960 228731 225352 222546 220694 219386 218056 216560 214973 213339 211754 210202
53987 210202 208275 205745 203385 202321 202416 202244 201038 199661 199141 199178 198891 198207 197605 197032 196102 195042 194543
53970 194543 194734 195067 195130 194911 194393 193624 193201 193913 195745 197814 199498 201073 202974 204985 206659 208197
53954 208197 210344 213429 216947 220205 223116 226198 229997 234756 240520 247221 254508 261704 268176 273714
53940 273714 278425 282384 285583 288128 290271 292184 293926 295611 297408 299277 300842 301666 301692 301406 301566
53925 301566 302649 304529 306806 309415 312690 316749 321158 325474 329850 334799 340542 346938 353852 361249
53911 361249 369021 377090 385577 394549 403673 412467 420816 429040 437586 446921 457374 468593 479354
53898 479354 488395 495168 499226 499232 493554 481942 465892 447322 427683 408349 390727 375346 361530
53885 361530 348559 336631 326248 317281 309279 302187 296015 290167 283861 277105 270692 265317 261128
53872 261128 257936 255314 252565 249188 245443 242059 239432 237430 235838 234436 232710 230089 226615 222905
53858 222905 219356 215926 212876 211046 210834 211362 211297 210345 209280 208619 208039 207296 206960 207667 209104 210349 210930
53841 210930 210982 210575 209690 208839 208861 209788 210641 210715 210507 210861 211751 212503 212767 212593 211923 210778 209755 209583 210202
53822 210202 210926 211453 212052 212788 213322 213585 213957 214538 214917 214928 215110 216089 217974 220603 223924 227788 231769
53805 231769 235479 238853 241970 244938 248094 251869 256251 260765 265144 269598 274245 278816 283130 287299
53791 287299 291128 293913 295375 296296 297617 299294 300666 301638 302671 303623 303429 301276 297624 293682 290147
53776 290147 286774 283019 278685 273813 268340 262336 256517 251946 248932 246595 243958 241115 238744 236791
53762 236791 234473 231571 228846 226874 225234 223311 221293 219843 219123 218641 217807 216348 214470 212875 212223
53747 212223 212303 212144 211279 210432 210469 211128 211444 211112 210740 210803 210994 210775 210102 209420 209202 209656 210771 212484 214763
53728 214763 217475 220260 222762 224937 226907 228546 229577 230092 230582 231335 232260 233395 235044 237229 239528
53713 239528 241748 244195 246960 249542 251639 253747 256361 259027 260890 261885 262723 263901 265365 266992 268777
53698 268777 270604 272359 274295 276820 279948 283346 286833 290411 293849 296677 298698 300185 301534 302873
53684 302873 303985 304438 303937 302682 301211 299859 298627 297585 296886 296234 294951 292946 291030 289878 289254
53669 289254 288695 288302 288228 288019 287249 286301 285708 285267 284644 284274 284534 284523 283010 280436 278608 278342 278675 278611 278376
53650 278376 278517 278921 279322 279793 280217 280100 279544 279540 280653 282182 283300 284291 285849 287737 289097 289788 290561
53633 290561 292027 294106 296445 298815 301126 303467 306070 308931 311611 313708 315341 316902 318635 320769
53619 320769 323667 327348 331090 334112 336537 339233 342779 347058 351779 356836 362069 367145 371872 376329
53605 376329 380547 384299 387444 390274 393335 396969 401115 405460 409632 413250 415986 417779 419017 420293
53591 420293 421845 423332 424272 424555 424314 423526 422061 420028 417609 414628 410748 406174 401649 397584 393678
53576 393678 389643 385813 382636 379982 377441 375017 373032 371520 370237 369191 368688 368732 368795 368281 367110 365765
53560 365765 364917 364970 365814 367009 368307 369864 371856 374132 376461 378959 381900 385183 388332 391052 393515
53545 393515 396090 399047 402578 406808 411614 416608 421426 425978 430402 434931 439869 445536 452102 459568
53531 459568 467945 477357 487861 499248 511107 523092 535143 547551 560839 575395 591055 607134
53519 607134 623087 639207 656501 675788 696965 719184 741656 764203 787210 811222 836571
53508 836571 863241 890972 919428 948176 976557 1003882 1029977 1055312 1080282 1104612 1127876
53497 1127876 1150382 1172838 1195075 1215969 1235061 1253590 1273254 1294334 1315719 1336460 1356485
53486 1356485 1375939 1394750 1413113 1431679 1450768 1469814 1487964 1504994 1521302 1537096 1551814
53475 1551814 1564314 1573596 1579502 1582641 1583468 1581559 1576159 1567364 1556306 1544041 1530730 1516075 1500149
53462 1500149 1483424 1466282 1448842 1431125 1413105 1394672 1375678 1355947 1335118 1312735 1288711
53451 1288711 1263648 1238557 1214298 1191296 1169586 1149053 1129708 1111813 1095586 1080894 1067494
53440 1067494 1055573 1045754 1038458 1033509 1030409 1028684 1027867 1027555 1027738 1028773 1030787 1033426 1036498 1040648
53426 1040648 1047005 1056189 1067853 1081131 1095393 1110648 1127364 1145813 1165628 1186199 1207529 1230345
53414 1230345 1255219 1281966 1310153 1339846 1371427 1404902 1439933 1476537 1515372 1557129 1601855
53403 1601855 1648949 1697710 1747819 1799376 1852617 1907660 1964533 2023197 2083318 2144111 2204747
53392 2204747 2264967 2325037 2385105 2444882 2503962 2562061 2618822 2673783 2726677 2777327 2825080
53381 2825080 2868862 2908154 2943517 2975697 3004486 3028929 3048372 3062747 3071971 3075590 3073038 3063859
53369 3063859 3047641 3024112 2993420 2956123 2912944 2864755 2812685 2757872 2701034 2642472 2582484
53358 2582484 2521596 2460426 2399545 2339519 2280902 2224181 2169740 2117759 2068009 2019905 1972912
53347 1972912 1926781 1881313 1836191 1791333 1747187 1704373 1663222 1624010 1587406 1554134 1524106
53336 1524106 1496278 1469560 1443775 1419760 1398661 1380978 1366000 1352154 1338091 1323497 1308824
53325 1308824 1294428 1280178 1265720 1250869 1235856 1221416 1208502 1197643 1188677 1181249 1175324 1170987
53313 1170987 1168031 1166177 1165520 1166362 1168732 1172483 1177733 1184778 1193622 1203909 1215267 1227435 1240335
53300 1240335 1254477 1271013 1290757 1313231 1337259 1362426 1389256 1417972 1447883 1478173 1508554
53289 1508554 1538827 1568406 1596724 1623627 1649073 1672839 1694805 1715020 1733139 1748275 1759770
53278 1759770 1767680 1772143 1772838 1769621 1763161 1754259 1742808 1728146 1710264 1690011 1668092 1644499 1618947
53265 1618947 1591414 1562189 1531832 1501169 1470854 1440793 1410312 1378984 1347038 1314979 1283184
53254 1283184 1251935 1221427 1191563 1162034 1132740 1103912 1075750 1048265 1021556 995842 970935
53243 970935 946035 920435 894396 869039 845421 823832 803824 784734 766264 748771 732936
53232 732936 719010 706519 694908 684245 674875 666402 657529 647230 635743 624110 612851 601451
53220 601451 589106 575554 561072 546027 530787 515933 502136 489690 478322 467581 457277
53209 457277 447421 437921 428608 419544 411070 403393 396262 389222 382086 375041 368313 361917 355707 349473
53195 349473 342995 336230 329538 323471 318180 313282 308495 304111 300473 297261 293848 290286 287303 285153
53181 285153 283170 280801 278544 277299 277159 277423 277578 277614 277420 276550 274718 272140 269332 266963 265780 266054
53165 266054 266979 267327 266933 266901 267940 269120 268902 267000 264528 262588 261428 260827 260493 259949 258681 256765
53149 256765 254914 253664 252816 251905 250843 249869 249155 248787 248904 249517 250335 251024 251530 251941 252201 252217 252159 252325
53131 252325 252759 253229 253602 253991 254492 254990 255276 255254 254997 254742 254804 255332 256118 256782 257164 257412 257726 258166 258711
53112 258711 259294 259810 260262 260865 261712 262358 262142 261042 259864 259307 259202 258948 258356 257594 256540 254833 252570
53095 252570 250444 249067 248523 248646 249217 249705 249373 248073 246657 246120 246526 247102 247224 246856 246170 245267 244420
53078 244420 244029 244135 244244 243919 243304 242818 242620 242719 243354 244731 246339 247064 246318 244803 243835 243992 244654 244795
53060 244795 243923 242268 240395 238785 237615 236775 236124 235751 235902 236619 237606 238443 238852 238798 238581 238757 239652 240855
53042 240855 241587 241697 241807 242205 242159 240904 238917 237459 237016 236988 236858 236859 237248 237688 237779 237625 237466 237209 236748
53023 236748 236346 236241 236283 236342 236638 237172 237279 236453 235323 235010 235643 236318 236516 236712 237372 238122 238385 238339 238690
53004 238690 239806 241447 243129 244380 244867 244658 244277 244219 244453 244668 244825 245169 245705 246087 246157 246330 247175 248658
52986 248658 250057 250730 250877 251385 252878 255000 256683 257133 256500 255724 255792 257034 258991 260984 262863 265074
52970 265074 267873 270685 272592 273392 273800 274555 275691 276835 277822 278724 279499 279987 280176 280165 279917 279314 278458
52953 278458 277626 276905 276066 274907 273526 272145 270758 269111 266904 264054 260858 258019 256295 255930 256409
52938 256409 256903 256921 256451 255720 255062 254987 255866 257340 258308 257855 256141 254127 252605 251716 251324 251407 251907 252523
52920 252523 252860 252709 252060 251071 250086 249547 249644 250186 250826 251318 251482 251209 250691 250402 250566 250759 250383 249422 248448
52901 248448 247866 247542 247245 247116 247441 248148 248800 249073 249026 248916 248925 249134 249564 250062 250207 249597 248296 246829 245620
52882 245620 244602 243544 242527 241886 241743 241982 242584 243636 244935 245985 246568 247008 247717 248765 250030 251484
52866 251484 253046 254422 255352 255835 255913 255489 254685 254081 254223 254986 255774 256216 256333 256188 255770 255153 254408 253331
52848 253331 251643 249441 247127 244857 242365 239387 235993 232474 229161 226410 224482 223324 222667 222396 222651
52833 222651 223526 224785 225931 226466 226171 225314 224514 224269 224693 225756 227423 229291 230465 230318 229206 227955
52817 227955 226809 225450 223951 222972 222871 223214 223422 223392 223278 223125 223062 223432 224420 225847 227559 229631 231902
52800 231902 233682 234274 233537 231689 228973 225886 223321 221861 221063 220007 218517 217392 217378 218346 219587 220581
52784 220581 221254 221674 221771 221414 220741 220309 220729 222049 223630 224764 225311 225573 225739 225751 225624 225577 225688 225685 225330
52765 225330 224944 225276 226746 228882 230693 231517 231412 230755 229826 228910 228412 228483 228699 228530 228058 227783 227708 227165
52747 227165 225777 224171 223415 223994 225555 227428 229117 230501 231872 233707 236174 238890 241273 243029 244181
52732 244181 244868 245350 246078 247483 249666 252381 255200 257633 259317 260250 260700 260677 259680 257285 253915 250709
52716 250709 248543 247351 246425 245200 243658 242138 240978 240354 240256 240424 240382 239836 239113 238931 239546 240365 240701
52699 240701 240656 240825 241299 241558 241371 241244 241691 242510 243123 243357 243591 244236 245259 246175 246507 246374 246522 247461 248641
52680 248641 248980 248221 247248 246920 247181 247579 248025 248578 248908 248579 247612 246431 245430 244930 245140 245821 246331 246463
52662 246463 246847 247979 249219 249448 248486 247231 246498 246437 246947 247951 249163 250313 251742 254133 257445 260663
52646 260663 262858 263983 264416 264272 263573 262610 261600 260234 258090 255376 252953 251596 251475 252220 253257 254137
52630 254137 254771 255412 256307 257467 258823 260456 262441 264579 266486 267981 269160 270053 270334 269491 267240 263805
52614 263805 259941 256708 254959 254750 255287 255755 256210 257362 259365 261279 262127 262105 262118 262294 261771 260149 258325
52597 258325 257399 257280 257027 256224 255368 255053 255389 256215 257340 258497 259501 260537 261945 263626 265049 265940
52581 265940 266649 267697 269203 270836 272053 272354 271641 270493 269755 269619 269397 268420 267012 266218 266577 267459 267772
52564 267772 267153 266196 265475 264712 263242 261152 259405 258693 258574 258109 257004 255766 254987 254945 255698 257035 258360
52547 258360 259115 259395 259736 260280 260578 260275 259542 258692 257844 257158 256948 257248 257600 257599 257394 257319 257295 257019 256631 256750
52527 256750 257769 259405 261028 262248 263047 263480 263418 262718 261595 260722 260724 261556 262524 262987 262931 262828 263139 264133
52509 264133 266007 268829 272285 275744 278743 281327 283774 286062 287757 288454 288130 287047 285387 283070 279817
52494 279817 275427 270225 265304 261968 260648 260577 260841 261403 262602 263973 264517 264206 264262 265491 267099 267858
52478 267858 267881 268384 269995 272133 274005 275473 276856 278504 280736 283630 286646 288841 289736 289725 289592 289905
52462 289905 290933 292725 295044 297503 299901 302154 303857 304285 303060 300590 297613 294550 291463 288411
52448 288411 285512 282703 279754 276604 273583 271159 269448 268028 266369 264438 262687 261392 260237 258734
52434 258734 256894 255298 254634 255270 257023 259099 260493 260796 260513 260343 260439 260675 261350 262975 265426 267815
52418 267815 269326 269875 270000 270436 271752 274028 276919 280328 284815 290815 297663 304076 309687 315465 322458
52403 322458 330686 339438 348040 355975 362620 367266 369248 368018 363490 356459 348330 340212 332587 325800
52389 325800 320352 316443 313717 311735 310386 309680 309507 309755 310251 310523 310184 309735 310335 312432 315185 317652
52373 317652 319964 322806 326300 330090 334151 338730 343654 348336 352500 356346 359991 363146 365355 366259
52359 366259 365727 364111 362321 361270 361226 361909 363009 364272 365265 365636 365610 365856 366750 368081 369520 371038 372880
52342 372880 375490 379457 385092 391863 398616 404701 410648 417456 425407 433977 442879 452689 464152 477198
52328 477198 491109 505605 521216 538430 556977 576408 596941 619077 642470 665937 688734
52317 688734 711185 733812 756363 778141 798871 818787 838072 856689 874619 891869 908280
52306 908280 923663 938155 952188 966032 979442 991755 1002305 1010846 1017663 1023266 1027949 1031684
52294 1031684 1034331 1035676 1035362 1033097 1028985 1023349 1016232 1007458 997332 986891 977232 968819 961506 954935
52280 954935 948824 943253 938859 936430 936228 938077 942157 949098 958995 970902 983787 997520 1012483
52267 1012483 1028552 1045039 1061407 1077529 1093337 1108636 1123248 1137092 1150218 1162901 1175471
52256 1175471 1187865 1199634 1210521 1220640 1229842 1237397 1242731 1246117 1248205 1249218 1248983 1247348 1244012
52243 1244012 1238331 1229917 1219220 1207014 1193621 1179140 1164133 1149339 1134955 1120870 1107457 1095348
52231 1095348 1084493 1074230 1064387 1055530 1047987 1041327 1035132 1029689 1025532 1022731 1020998 1020240 1020590 1021998
52217 1021998 1024017 1026038 1027837 1029937 1033264 1038174 1043994 1049811 1055478 1061461 1067900 1074480 1081110 1088101
52203 1088101 1095464 1102622 1109016 1114597 1119507 1123719 1127315 1130783 1134643 1138858 1142816 1145910 1148102 1149986
52189 1149986 1152274 1155104 1157952 1160272 1162006 1163304 1164040 1164025 1163398 1162329 1160390 1156797 1151268 1144180 1135874
52174 1135874 1126331 1115695 1104676 1094237 1085096 1077608 1071804 1067505 1064630 1063409 1064003 1065978 1068523
52161 1068523 1071182 1074079 1077428 1081220 1085307 1089345 1092710 1094930 1096262 1097381 1098437 1098893 1098345 1097060
52147 1097060 1095593 1094331 1093510 1093255 1093483 1094111 1095373 1097432 1099740 1101466 1102674 1104409 1107363 1111173 1115368
52132 1115368 1120311 1126675 1134563 1143814 1154811 1168347 1184864 1204317 1226585 1251476 1278440 1306839
52120 1306839 1336551 1367947 1401157 1435517 1469785 1502796 1533990 1563432 1591226 1616875 1639427
52109 1639427 1658332 1673844 1686378 1695823 1701808 1704406 1704231 1701940 1697999 1692862 1687064 1681020 1674899
52096 1674899 1668701 1662344 1655654 1648342 1640046 1630504 1619756 1608147 1595942 1583045 1569320 1555092
52084 1555092 1540997 1527342 1514045 1501341 1490163 1481486 1475586 1472227 1471436 1473727 1479503 1488369 1499153
52071 1499153 1510687 1522692 1535860 1550949 1567900 1585916 1604158 1621997 1638868 1654459 1669041
52060 1669041 1683062 1696223 1707466 1716047 1722206 1726611 1729546 1730858 1730287 1727622 1722916 1716711 1709599
52047 1709599 1701323 1690750 1677073 1660589 1642049 1621773 1599881 1576823 1553059 1528543 1503195
52036 1503195 1477719 1453271 1430337 1408475 1387255 1367067 1348862 1333343 1320451 1309430 1299433
52025 1299433 1290179 1281906 1274629 1267756 1260651 1253208 1245482 1237113 1227707 1217622 1207831 1198851 1190245 1181181
52011 1181181 1171187 1160274 1148683 1136589 1123807 1109752 1093922 1076496 1058229 1039703 1020880
52000 1020880 1001368 980980 960007 939132 919088 900167 882039 864151 846383 829198 813228
51989 813228 798852 786119 774914 765057 756285 748081 739657 730321 720021 709366 698992 689024 679225
51976 679225 669399 659374 648763 637143 624566 611801 599950 589826 581610 575090 570235 567343
51964 567343 566380 566443 566514 566845 568946 573819 580710 588050 595100 602001 608562 613901 617341 618963 619056 617553
51948 617553 614314 609634 604230 598924 594441 591220 589248 588320 588636 590938 595882 603373 612630 622784
51934 622784 633273 643819 654306 664710 674932 684428 692007 696237 696290 692398 685345 675611 663268
51921 663268 648596 632361 615351 598031 580878 564648 549941 536718 524633 513768 504674 497773
51909 497773 492959 489785 487850 487116 488117 491751 498610 508498 520748 534800 550260 566537 582788
51896 582788 598089 611348 621172 626225 625878 620353 610303 596534 580052 561998 543441 525387
51884 525387 508843 494470 482140 471251 461628 453825 448402 445335 444349 445438 448602 453285 458627
51871 458627 464320 470719 477851 484733 490159 493976 496991 499585 501001 500341 497754 494114 489875 484966
51857 484966 479685 474918 471233 468414 466165 464836 465077 467151 470838 475608 480516 484356 486464 487198 487204
51842 487204 486357 483845 479279 473399 467647 463154 459991 457230 453834 449568 444917 440280 435778 431866
51828 431866 429427 428817 429308 429928 430393 430796 430942 430586 429939 429225 428074 426042 423417 420785 418055 414787
51812 414787 411410 409239 409149 410871 413672 417027 420537 423824 426747 429259 430986 431436 430678 429258 427458
51797 427458 425270 423091 421679 421114 420480 418910 416492 413860 411378 408959 406270 402921 398904 395016 392277
51782 392277 390797 389806 388971 388891 389888 391071 391295 390531 389631 389142 389027 389293 390233 392101 395003 399000 403965
51765 403965 409563 415740 422968 431514 440792 449901 458575 466935 474495 480176 483373 484360 483508 480722 475880
51750 475880 469288 461396 452551 443423 435239 429009 424648 421305 418477 416414 415451 415473 416266 418037 421273
51735 421273 426229 432764 440513 448970 457520 465746 473608 481017 487314 491653 494010 495361 496614 497780
51721 497780 498448 498568 498221 496955 494048 489392 483646 477534 471508 466041 461624 458282 455509 452800 449865
51706 449865 446277 441635 436476 432498 431253 432710 435452 438195 440752 443611 447005 450575 453741 456186
51692 456186 457895 458829 458820 457940 456776 455991 455622 455045 453628 451119 447448 442596 436906 431189 426256 422389
51676 422389 419372 416916 414987 413963 414543 417269 421995 427942 434365 441074 448324 456394 465289 474630
51662 474630 483763 492094 499260 504793 507814 507467 503644 497056 488713 479804 471884 466436 463938 463774 465238
51647 465238 468174 472432 477203 481302 483771 483960 481407 476043 468402 459396 450034 441312 433909 427764
51633 427764 422353 417534 413678 410738 407800 404019 399608 395456 392175 389959 388949 388978 389181 388536 386841
51618 386841 384767 382999 381749 380969 380550 380267 379917 379573 379385 379173 378572 377592 376719 376416 376784 377667 378849
51601 378849 380173 381808 384418 388769 395079 402894 411569 420638 429721 438391 446324 453481 459971 465631
51587 465631 469727 471206 469491 465067 459142 452754 446461 440859 436856 435126 435678 438296 443153 450629
51573 450629 460806 473568 488968 506994 526994 547727 568076 587633 606754 626261 646888
51562 646888 668648 690818 712775 734747 757680 782642 810531 841806 875856 910818 944467
51551 944467 975158 1001470 1021406 1032798 1034599 1027165 1011249 987396 956496 920291 880868 839903
51539 839903 798602 758060 719425 683786 651945 624084 599694 578097 559023 542404 527816
51528 527816 514642 502743 492392 483531 475676 468653 462706 457610 452435 446676 441048 436522 432991
51515 432991 429564 425925 422619 420062 417980 415935 413877 411955 410286 409169 409109 410281 412179 414105 415893
51500 415893 417878 420297 422993 425723 428433 431139 433637 435461 436150 435586 434209 432816 431950 431452 430743
51485 430743 429563 428193 426860 425255 422887 419681 415866 411486 406484 401263 396607 392809 389240 385060
51471 385060 380159 375193 370875 367444 364611 361850 358835 355819 353421 351959 351109 350338 349487 348783 348467
51456 348467 348571 348922 349284 349716 350805 353172 356597 360038 362837 365532 369175 374210 380446 387804 396565
51441 396565 407000 419161 432865 447484 461911 475127 486593 495703 501357 502837 500973 497588
51429 497588 493777 489426 484391 479093 473618 467121 458889 449464 440093 431447 423508 416370 410379 405491
51415 405491 401176 397154 393830 391740 390863 390736 391118 392294 394632 397935 401414 404452 407319 410886 415575
51400 415575 420813 425665 429778 433428 436834 439847 442400 444895 447877 451530 455783 460796 466979 474476
51386 474476 483111 493101 505512 521543 541462 564670 590798 620279 653797 691673 733963 780626
51374 780626 831095 883847 936721 987536 1034260 1074895 1107482 1130172 1141285 1139905 1126771 1104119
51362 1104119 1074075 1037433 994365 945950 894379 841934 790406 741248 695450 653215 614415
51351 614415 579559 549689 525203 505260 488527 474057 461385 450285 440713 432586 425499 418961
51339 418961 412922 407645 403032 398644 394478 391144 388991 387585 386316 385078 384016 382934 381302 378681
51325 378681 375014 370762 366758 363554 360870 358139 355573 354029 353719 353775 353409 352788 352294 351693 350720 349956
51309 349956 350271 351654 353270 354516 355439 356258 357151 358434 360346 362587 364559 366147 367831 369939 372181
51294 372181 374055 375328 375995 376049 375530 374652 373669 372634 371382 369777 367971 366401 365498 365421 366078 367286 368812
51277 368812 370469 372407 375103 378631 382137 384573 385932 387091 388417 389282 389260 389000 389341 390198 390954 391546
51261 391546 392416 393724 395235 396727 397853 397887 396334 393750 391347 389752 388609 387261 385246 382326 378710
51246 378710 375300 373051 371928 371033 369811 368629 368031 367989 368089 368011 367669 367236 367167 367786 368750 369334 369312 369061
51228 369061 368704 367788 366124 364402 363504 363502 363705 363486 362758 361868 361345 361607 362597 363809 364800 365523 366072 366410
51210 366410 366556 366742 367207 368024 369344 371469 374410 377607 380457 382922 385363 388012 390910 394154 397742
51195 397742 401347 404577 407365 409705 411228 411579 411096 410447 409436 406985 402723 398024 394745 393207 392154
51180 392154 390627 389070 388308 388168 387739 386663 385493 384822 384637 384631 384649 384528 383914 382638 381106 380013 379751
51163 379751 380324 381660 383695 386324 389563 393644 398543 403449 407156 409099 409657 409348 408182 406031 403212
51148 403212 400294 397523 394881 392564 391049 390599 391005 391861 392887 393891 394667 395095 395273 395389 395532 395686
51132 395686 395901 396317 396984 397679 397947 397391 395970 394110 392533 391797 391797 391756 390948 389599 388844 389613 391669 393990
51114 393990 395985 397993 400653 404165 408212 412237 415594 417833 419128 420160 421312 422268 422771 423484 425515
51099 425515 429078 433147 436574 439158 441464 443942 446480 448604 449914 450487 450920 451744 452663 452727 451525 449769
51083 449769 448376 447295 445827 443908 442367 441768 441617 441039 439880 438793 438503 439268 440908 443067 445542
51068 445542 448491 452181 456434 460644 464611 469150 475552 484563 496044 509292 523267 536848 549558
51055 549558 562044 575149 588375 599860 608315 614575 620865 628969 639523 652579 667882 684358
51043 684358 699993 712786 721856 727455 730086 729858 726622 720506 712157 702506 692353 682109 671737
51030 671737 660705 648051 632815 614788 594968 575183 557160 541875 529607 520288 513634 509141
51018 509141 506334 505200 506167 509458 514485 520105 525584 531184 537772 545895 555270 565116 574945 584982
51004 584982 595700 606935 617759 627600 637216 648008 660283 672800 684325 695032 705884 717109
50992 717109 728036 738248 748085 757900 767417 776130 784021 791600 799429 807612 815658 822976 829789 837385
50978 837385 846973 858381 870375 882236 894359 907262 920811 934910 950499 969341 992952 1021988
50966 1021988 1056362 1095659 1139565 1188120 1241447 1299278 1360993 1426102 1494202 1564468 1635723
50955 1635723 1707139 1778146 1847440 1912845 1972736 2026969 2075857 2118827 2154855 2183770 2206295
50944 2206295 2223124 2234787 2242285 2246896 2249266 2249340 2247277 2243737 2239089 2232913 2224482 2213324 2199207
50931 2199207 2182163 2162719 2141611 2118950 2093901 2065348 2032584 1995255 1953138 1906305 1855329
50920 1855329 1801027 1744104 1685156 1624833 1563849 1502952 1443004 1385014 1329973 1278642 1231472
50909 1231472 1188644 1150201 1116149 1086346 1060299 1037323 1016892 998563 981637 965478 950400
50898 950400 937460 926816 916880 905946 894251 883498 874637 867202 860811 856043 853354 852055 851040
50885 851040 849997 849437 849983 851999 855380 859308 862771 865754 869439 874727 881166 887905 895145 903788 913994
50870 913994 925057 936656 949350 963639 979359 996324 1014934 1035630 1058212 1082333 1108480
50859 1108480 1137901 1171465 1209100 1250573 1296510 1348255 1406826 1472448 1545153 1625481 1714271
50848 1714271 1812065 1918990 2035075 2160236 2294003 2435628 2584455 2739732 2899881 3062309
50838 3062309 3224149 3382917 3536224 3681197 3814540 3933140 4034388 4116127 4176817 4216109
50828 4216109 4235237 4236700 4223476 4198537 4165019 4126536 4086906 4049341 4016079 3988786 3968829
50817 3968829 3956665 3951094 3949477 3948565 3944810 3934237 3912934 3878063 3828123 3762201 3679550 3580236
50805 3580236 3465810 3338945 3202526 3059272 2911931 2763432 2616781 2474783 2339739
50796 2339739 2213318 2096824 1991467 1898090 1816683 1746525 1686884 1637163 1596362 1562958 1535656
50785 1535656 1513906 1497410 1485348 1476380 1469217 1462926 1456847 1450471 1443452 1435707 1427490 1419094 1410236
50772 1410236 1400020 1387938 1374646 1361055 1346841 1330742 1312381 1292807 1272920 1252423 1230968
50761 1230968 1209386 1188826 1169272 1149927 1130756 1112710 1096571 1082404 1070147 1060051 1052444
50750 1052444 1047561 1045564 1046339 1049460 1054831 1063074 1074737 1089422 1106476 1126294 1150037 1178102 1209854
50737 1209854 1245108 1284932 1330519 1381992 1438790 1500645 1567564 1639266 1715240 1795112 1878410
50726 1878410 1964003 2050207 2135498 2218945 2300017 2378232 2452992 2523574 2589141 2648617 2700371
50715 2700371 2742094 2771301 2786340 2787010 2774398 2750339 2717085 2677297 2634079 2590838 2550797 2516324
50703 2516324 2488656 2468279 2455381 2449692 2449994 2454169 2459771 2464411 2465696 2461161 2448457 2425595 2391195
50690 2391195 2344883 2287488 2220679 2146421 2066932 1984936 1903453 1825118 1751858 1685074 1625850
50679 1625850 1574886 1532453 1498413 1472265 1453486 1442178 1439084 1444461 1457098 1475075 1497376 1524046
50667 1524046 1554668 1587457 1620189 1651451 1680656 1707436 1731573 1753184 1772522 1789799 1805503
50656 1805503 1820569 1835818 1851426 1867276 1883526 1900499 1918272 1936861 1956653 1978159 2001442
50645 2001442 2026303 2053104 2083002 2117202 2156163 2199574 2246838 2297458 2351074 2407152 2464590
50634 2464590 2521719 2576988 2629676 2679814 2727417 2772105 2813541 2851909 2887471 2919509 2945986
50623 2945986 2964525 2973541 2972048 2958442 2930408 2886964 2830703 2767576 2704314 2646191 2596681 2557910
50611 2557910 2530561 2513684 2505374 2503708 2506814 2512341 2517464 2519453 2516002 2505107 2485115 2455076 2414823
50598 2414823 2364631 2305029 2237069 2162604 2084091 2003961 1924046 1845509 1769303 1696694 1629153
50587 1629153 1567705 1512515 1463166 1419217 1380432 1346671 1317675 1292874 1271354 1252194 1234876
50576 1234876 1219195 1204935 1192034 1181051 1172784 1167158 1163150 1160301 1159641 1162395 1168197 1175537 1183785
50563 1183785 1193833 1206695 1222435 1240736 1261677 1285383 1311557 1339886 1370482 1403358 1437870
50552 1437870 1473250 1509514 1547196 1586235 1625557 1663795 1700127 1734501 1767465 1799856 1832408
50541 1832408 1865523 1899547 1935216 1973718 2016372 2064398 2118813 2180214 2248693 2324249 2407319
50530 2407319 2498680 2598773 2707305 2823509 2946599 3075954 3211076 3351416 3496021 3643203
50520 3643203 3790648 3935787 4075905 4207963 4328771 4435613 4526554 4599872 4653257 4683899
50510 4683899 4689612 4670063 4626982 4563094 4480752 4381650 4267958 4143566 4013888 3884431 3759708
50499 3759708 3643425 3539094 3450080 3379227 3328598 3299280 3290958 3301717 3328400 3367038 3412812
50488 3412812 3460080 3503103 3536828 3556733 3558184 3536806 3489966 3417795 3322778 3208708 3080041
50477 3080041 2941536 2797778 2652887 2510617 2374221 2245769 2125778 2013945 1910225
50468 1910225 1815018 1728613 1650991 1582134 1521993 1469920 1424493 1384187 1348143 1316224 1288560
50457 1288560 1265218 1246118 1231030 1219609 1211535 1206583 1204603 1205513 1209321 1215942 1224939 1235540 1247077
50444 1247077 1259311 1272255 1285771 1299414 1312620 1324935 1336144 1346233 1355253 1363113 1369576 1374502
50432 1374502 1378128 1381083 1384153 1387983 1392908 1399042 1406568 1415955 1427806 1442467 1459892 1479913 1502603
50419 1502603 1528302 1557353 1589931 1626159 1666373 1711189 1761134 1816169 1875690 1939184 2006698
50408 2006698 2078365 2153457 2230244 2306883 2382151 2455141 2524576 2588833 2646591 2697164 2740211
50397 2740211 2775203 2801078 2816186 2818705 2807439 2782299 2743910 2692956 2630267 2557535 2477476
50386 2477476 2393115 2307160 2222227 2141272 2067355 2002947 1949538 1907748 1877603 1858846 1851204
50375 1851204 1854174 1866307 1884876 1906657 1928945 1949477 1965534 1973866 1971913 1958775 1934666 1899887
50363 1899887 1854869 1801068 1741055 1677455 1612090 1546273 1481432 1418960 1359643 1303699 1251368
50352 1251368 1203093 1158923 1118125 1079765 1043658 1010524 981180 955767 933824 914856 898641
50341 898641 885150 874495 866921 862604 861353 862712 866456 872785 881834 893094 905623 918876 933192
50328 933192 949366 967749 987740 1008017 1027217 1044344 1058617 1069149 1075050 1075913 1072088 1064499
50316 1064499 1054432 1043474 1033154 1024236 1016536 1009642 1003594 998589 994452 991035 988934 989064 991338
50303 991338 994451 997221 999611 1002099 1004683 1007087 1009624 1013113 1017995 1024068 1031115 1039254 1048531 1058524
50289 1058524 1068638 1078569 1088326 1097997 1107753 1118013 1129368 1142197 1156344 1171192 1186036 1200263
50277 1200263 1213052 1222889 1227628 1225327 1215363 1199036 1179254 1159343 1141585 1126505 1113479 1101938
50265 1101938 1091841 1083219 1075825 1069403 1063879 1059062 1054565 1050340 1046868 1044423 1042518 1040643 1039258 1039346
50251 1039346 1041095 1043771 1047017 1051557 1058224 1066848 1076683 1087622 1100397 1115594 1132994 1152154 1173277
50238 1173277 1197058 1223613 1251890 1280420 1308502 1336327 1363971 1390669 1415193 1436589 1454443
50227 1454443 1468875 1480606 1490655 1499460 1506473 1510895 1512396 1510580 1504131 1491324 1471476 1445236
50215 1445236 1413516 1376909 1336358 1293677 1251063 1210553 1174145 1143663 1119743 1101248 1086208
50204 1086208 1073256 1061873 1051533 1041079 1028903 1013524 994255 971696 947478 923264 899991
50193 899991 878102 858070 840286 824611 810467 797331 784913 773002 761491 750565 740577 731681
50181 731681 723663 716022 708153 699716 691088 683282 677092 672367 668315 664412 660740 657589 655059 653072
50167 653072 651502 650273 649416 649023 649112 649706 651105 653771 657751 662495 667520 672986 679279 686387 694157
50152 694157 702907 713116 724597 736588 748705 761145 773765 785630 795735 803761 809809 813925
50140 813925 816335 817780 819066 820410 821645 822983 825203 829173 835523 844766 857313 873241 892239
50127 892239 913879 937837 963977 992535 1024265 1060147 1100757 1146034 1195586 1248911 1305173
50116 1305173 1363070 1421298 1479079 1536031 1591701 1645589 1697669 1748472 1798403 1847095 1893480
50105 1893480 1936130 1973257 2002637 2022031 2029763 2024776 2006400 1974696 1931139 1878431 1819310 1755783
50093 1755783 1689667 1623258 1558857 1497842 1440806 1388539 1342237 1302611 1269371 1241877 1219801
50082 1219801 1202664 1189107 1177298 1166110 1155485 1145562 1135995 1126393 1117027 1108471 1100533 1092092 1082271
50069 1082271 1071433 1060604 1050122 1039394 1028037 1016660 1006125 996377 986525 975934 964772 953501
50057 953501 942429 931977 922905 915826 910602 906527 903027 900038 897873 896989 897797 900424 904650 910227
50043 910227 917116 925239 934190 943525 953190 963228 973133 982065 989833 997113 1004401 1011260 1017037 1021902
50029 1021902 1026536 1031030 1034718 1037114 1038431 1039104 1039230 1038645 1037149 1034592 1031119 1027397 1024158 1021386 1018404
50014 1018404 1014904 1011323 1007930 1004184 999525 994425 990105 987504 987024 988966 993605 1001004 1011337 1025330
50000 1025330 1043731 1066480 1092987 1123174 1157463 1195552 1235892 1276702 1316987 1356269 1393892
49989 1393892 1429078 1461303 1490183 1515175 1535711 1551368 1561502 1564793 1559457 1543859 1516983 1478818
49977 1478818 1430761 1375491 1315974 1254508 1192826 1132832 1076717 1026183 981698 942556 907617
49966 907617 876083 847799 822941 801453 782877 766648 752430 740121 729728 721269 714657 709632
49954 709632 705983 703809 703337 704536 707274 711813 718606 727416 737099 746670 756219 766353 776907 786684
49940 786684 794467 800066 804335 808231 811736 813642 812639 808644 802665 795215 785385 771920 754902 735907
49926 735907 716749 698559 681872 666947 653811 642340 632500 624462 618500 614826 613330 613290 613607
49913 613607 613594 613388 613437 613907 614848 616521 619076 622192 625559 629549 634888 641818 650157 660014 671775 685294
49897 685294 699708 714209 728475 742240 754976 766237 775839 783445 788398 790334 789693 787306 783617
49884 783617 778496 771651 762970 752558 740657 727558 713558 699003 684275 669626 655168 641166
49872 641166 628144 616414 605709 595740 587037 580748 577463 576604 577023 577877 578847 579997 581692 584415
49858 584415 588376 593385 599180 605771 613417 622442 633022 644933 657556 670385 683431 696787 709888
49845 709888 721724 731750 740090 746745 751206 753115 752797 750796 747230 741950 734994 726562 716881 706447
49831 706447 696134 686642 677943 669619 661623 654462 648740 644767 642499 641653 641945 643389 646230 650493
49817 650493 655819 661972 669200 677783 687378 697237 707093 717462 728902 741047 752488 761708 768211
49804 768211 772769 776475 779675 782016 783360 784095 784356 783374 780000 773695 764825 754224 742781 731194
49790 731194 719680 707963 695758 683293 671178 659910 649734 640809 633203 626802 621449 617158
49778 617158 613863 611026 607838 604003 600205 597607 596889 597723 599192 600748 602793 606277 611707 618622 626052
49763 626052 633375 640682 648432 656773 665181 672833 679417 685362 691048 696021 699456 701224 701804 701159 698451
49748 698451 693160 685748 676800 666311 654546 642997 633489 626491 621097 616472 612487 609024 605654
49735 605654 602317 599665 598400 598695 600311 602695 604902 606239 607303 609598 613586 617744 620264 621264
49721 621264 622654 626112 631918 639551 648620 659013 670759 683894 698022 711880 723821 732961 739551
49708 739551 744026 746139 745359 741853 736604 730624 724361 717895 711360 705004 698949 693137 687524 682246
49694 682246 677387 672658 667496 661641 655437 649436 643937 639217 635924 634671 635220 636655 638563 641517
49680 641517 646218 652746 661081 671678 684848 699915 715816 732294 749724 767821 785387 801329
49668 801329 815016 825447 831211 831965 829351 825797 822881 821329 821834 824846 829755 835150 839964 843836
49654 843836 846364 846505 842611 832845 816060 793155 767522 743281 722717 705660 691054 678339
49642 678339 667336 657778 649590 643187 639030 637007 636435 636473 636510 636416 636418 636452 635791 633778 630752 627561 624205
49625 624205 619812 614176 608428 603629 599384 594514 588680 582718 577638 573906 571525 570274 569758 569535 569260
49610 569260 568801 568436 568894 570731 573520 576183 578285 580379 582791 584835 585829 586200 586787 587515 587757 587687 588249
49593 588249 589726 591303 592332 593268 594954 597571 600700 603978 607176 609874 611622 612506 613262 614665 616795
49578 616795 618978 620498 621373 622324 624019 626583 629943 634301 639925 646594 653680 660799 668179 676307 685399
49563 685399 695187 705041 714262 722344 728997 733961 736889 737511 735779 731903 726408 720074 713549 706978
49549 706978 700369 694265 689601 686793 685506 685449 686751 689236 692030 694473 696867 699731 702846 705769 708806
49534 708806 712601 717075 721712 726712 732896 740556 749356 759447 771637 786139 802020 818312 834936
49521 834936 852104 869482 886455 902618 917420 929800 938840 944615 947970 949730 950575 951387 953082
49508 953082 956132 960596 966576 974153 982680 990311 994476 993121 985807 973722 958455 940766 920770
49495 920770 899168 877685 858052 840964 826266 813639 802660 792642 783153 774647 768018 763444
49483 763444 760112 757174 754570 752705 751684 751204 751089 751487 752438 753489 754014 753960 754020 754957 756839 759131 761391
49466 761391 763627 765988 768501 771257 774571 778662 783237 787627 791313 794171 796204 797276 797246 796274 794732
49451 794732 792697 789689 785196 779420 773210 767160 761063 754456 747400 740399 733857 728051 723500 720763
49437 720763 719730 719521 719321 719122 719588 721464 725143 730474 736843 743750 751533 761309 774020 789646 807491
49422 807491 827111 848790 873054 899706 927330 953975 978473 1000683 1020027 1034125 1039848 1036090
49410 1036090 1025057 1010692 996396 984392 976276 973061 974721 980417 989346 1001061 1015075 1030541
49398 1030541 1046366 1061356 1074416 1085064 1093813 1101648 1109010 1115499 1120581 1124171 1126392 1127083 1125810
49385 1125810 1122239 1116333 1108290 1098414 1086941 1074010 1060000 1045957 1033303 1022829 1014201 1006751
49373 1006751 1000559 996264 993946 992844 992411 993052 995350 998962 1002871 1006500 1009937 1013105 1015437 1016518
49359 1016518 1016413 1015057 1011915 1006721 1000121 993130 986286 979764 973913 969052 965006 961481 958770 957429
49345 957429 957332 957710 958168 959028 960573 962588 964817 967199 969378 970566 970360 969233 967759 965677 962155 956768
49329 956768 949889 942398 935397 929943 926553 924934 924489 925034 926763 929609 933004 936343 939536 942990 947167
49314 947167 952151 957581 962969 968026 972662 976873 980919 985488 991184 997719 1004012 1009307 1013939 1018848
49300 1018848 1024721 1031882 1040530 1050624 1061723 1073463 1086128 1100303 1115881 1131704 1146293 1158780
49288 1158780 1169107 1177411 1183201 1185170 1182168 1174592 1164590 1154546 1145479 1137054 1128722 1120247 1111340
49275 1111340 1101588 1091094 1080719 1071427 1063653 1057508 1053172 1050669 1049515 1049043 1049100 1050062 1052133 1054882
49261 1054882 1057629 1060156 1062922 1066590 1071392 1076961 1082904 1089584 1098196 1109868 1124798 1142468 1162394
49248 1162394 1184090 1206250 1226749 1243941 1257435 1266917 1270692 1266462 1253757 1234761 1212450 1188616
49236 1188616 1164078 1139915 1117510 1097710 1080788 1067154 1057397 1051557 1048982 1049019 1051269 1055080 1059378
49223 1059378 1063367 1067103 1071112 1075680 1080733 1086113 1091673 1097157 1102332 1107386 1113151 1120707 1130525 1142003
49209 1142003 1154104 1166450 1179373 1192820 1205863 1217838 1229484 1242272 1256794 1272445 1288447
49198 1288447 1304472 1320320 1335732 1350617 1364876 1378008 1389536 1399845 1409886 1419950 1429452
49187 1429452 1437984 1445812 1453140 1459813 1466149 1473271 1482047 1492336 1503868 1517243 1533372 1552395 1573886
49174 1573886 1597899 1625283 1657137 1694387 1737515 1786041 1838199 1891412 1943009 1990423 2031161
49163 2031161 2062977 2083998 2092796 2089144 2075251 2055669 2035260 2017272 2003403 1994789 1991953 1994119
49151 1994119 1999500 2006384 2013617 2020398 2026349 2031743 2037102 2042598 2048264 2054567 2062181 2071306 2081743 2093562
49137 2093562 2107111 2122354 2138693 2155466 2172303 2189106 2206156 2224093 2243226 2262897 2282057
49126 2282057 2300461 2318761 2337482 2356549 2375955 2396156 2417401 2439115 2460516 2481676 2503595
49115 2503595 2527238 2552865 2580467 2610764 2645532 2686918 2736605 2795731 2865231 2945702 3036985
49104 3036985 3138563 3250576 3373690 3507109 3646345 3782995 3907173 4011661 4095470 4163172
49094 4163172 4218260 4255457 4260888 4222516 4141426 4032371 3913242 3794228 3675665 3553666
49084 3553666 3426740 3298586 3176358 3066640 2972515 2893854 2829507 2778295 2738345 2706968
49074 2706968 2681926 2662090 2646398 2633017 2620328 2608201 2597480 2588348 2579863 2571043 2561877 2553128
49062 2553128 2545473 2538929 2532924 2526837 2520502 2514253 2508556 2503684 2499647 2496251 2493242 2490581 2488552 2487349
49048 2487349 2486563 2485306 2482982 2479861 2476960 2475376 2475627 2477489 2480557 2484920 2491059 2499095 2508596 2519254
49034 2519254 2531136 2543922 2556535 2568058 2578447 2587612 2594392 2597457 2596971 2594421 2590900 2586487 2581248
49021 2581248 2575822 2570795 2566398 2562988 2561070 2560585 2560966 2562136 2564707 2568926 2574185 2579879 2586059 2592939
49007 2592939 2600447 2608624 2617701 2627334 2636351 2643736 2649352 2653477 2656290 2658214 2660000 2661866 2663108 2663046
48993 2663046 2661799 2659656 2656361 2651639 2645826 2639254 2631550 2622356 2612360 2602791 2594144 2586194 2579096 2573646
48979 2573646 2570375 2568979 2568712 2569011 2569754 2571295 2574138 2578277 2583047 2587852 2592683 2597531 2601796 2604909 2607268
48964 2607268 2609824 2612910 2616102 2619107 2622129 2625399 2629024 2633363 2638876 2645406 2652201 2658956 2666418 2675741
48950 2675741 2687553 2701871 2718629 2738020 2760446 2786229 2815182 2846367 2878506 2910860 2943650
48939 2943650 2977564 3012943 3049564 3087180 3126161 3167444 3211730 3258879 3308340 3360044 3414491
48928 3414491 3471873 3531572 3592742 3655025 3718390 3782639 3847410 3912404 3977299 4041767 4105955
48917 4105955 4170533 4235731 4300554 4363448 4423543 4480768 4535021 4585949 4633475 4677848 4719098
48906 4719098 4757094 4792279 4825683 4857911 4888527 4916756 4942380 4965671 4986759 5005456 5021519
48895 5021519 5034867 5045660 5054269 5061033 5065873 5068331 5068006 5064721 5058204 5047972 5033729 5015674 4994181
48882 4994181 4969385 4941259 4909928 4875687 4838834 4799639 4758365 4715135 4669899 4622621 4573327
48871 4573327 4521867 4467917 4411547 4353521 4294607 4234666 4172998 4109716 4046373 3984857 3925973
48860 3925973 3869522 3815569 3765086 3719115 3677686 3639864 3604801 3572514 3543695 3518942 3498159
48849 3498159 3480553 3465167 3451573 3440121 3431498 3426047 3423448 3423030 3424351 3427633 3433689 3443300 3456505
48836 3456505 3472560 3490688 3510639 3532327 3555173 3578227 3600947 3623531 3646413 3669725 3693241
48825 3693241 3716512 3738991 3760395 3781161 3802269 3824367 3847255 3870377 3893567 3917068 3940998
48814 3940998 3965135 3989159 4012881 4036281 4059507 4082827 4106433 4130265 4154128 4177951 4201933
48803 4201933 4226515 4252267 4279574 4308267 4337615 4366842 4395701 4424481 4453570 4483121 4513015
48792 4513015 4542875 4571996 4599412 4624236 4646096 4665189 4681803 4695731 4706269 4712849 4715572 4714970
48780 4714970 4711292 4704039 4692053 4673909 4648462 4615389 4575347 4529515 4479009 4424715 4367405 4307718
48768 4307718 4246112 4183065 4119245 4055311 3991677 3928667 3866670 3805876 3746130 3687531 3630969
48757 3630969 3577616 3527949 3481717 3438641 3398569 3361097 3325888 3293528 3265275 3241587 3221491
$$ [...]
##END NTUPLES=NMR SPECTRUM
##END=
