
##TITLE=AC1233_PERAH12114_6519287_kQ2xMY586G
##JCAMPDX= 6.0         $$ Bruker NMR JCAMP-DX V2.0
##DATA TYPE= NMR SPECTRUM
##DATA CLASS= NTUPLES
##ORIGIN= BRUKER
##OWNER= Administrator
$$ 1.72 TOPSPIN		Version 2.1
$$ 2012-07-14 10:49:20.796 -0500  Administrator@TOPSPIN
$$ Compression mode = diff/dup
##.OBSERVE FREQUENCY= 400.02188249412
##.OBSERVE NUCLEUS= ^1H
##.ACQUISITION MODE= SIMULTANEOUS (DQD)
##.ACQUISITION SCHEME= undefined
##.AVERAGES= 8
##.DIGITISER RES= 22
##SPECTROMETER/DATA SYSTEM= spect
##.PULSE SEQUENCE= zg30
##.SOLVENT NAME= COFFEE_meoh
##.SHIFT REFERENCE= INTERNAL, COFFEE_meoh, 1, 14.98509
##AUDIT TRAIL= $$ (NUMBER, WHEN, WHO, WHERE, PROCESS, VERSION, WHAT)
$$ ##TITLE= Audit trail, TOPSPIN		Version 2.1
$$ ##JCAMPDX= 5.01
$$ ##ORIGIN= Bruker BioSpin GmbH
$$ ##OWNER= Administrator
$$ $$ C:\Bruker\TOPSPIN/data/COFFEE/nmr/AC1233_PERAH12114_6519287_kQ2xMY586G/100/pdata/1/auditp.txt
$$ ##AUDIT TRAIL=  $$ (NUMBER, WHEN, WHO, WHERE, PROCESS, VERSION, WHAT)
(   1,<2012-07-14 10:49:11.687 -0500>,<Administrator>,<TOPSPIN>,<go>,<TOPSPIN 2.1>,
      <created by zg
	started at 2012-07-14 10:48:04.765 -0500,
	POWCHK enabled, PULCHK disabled,
       configuration hash MD5:
       6B 1B 68 BB D9 2E 58 E2 7F 35 AD 54 07 DF 0E 41
       data hash MD5: 64K
       E7 63 C8 70 08 90 A6 A9 C2 A5 40 4A F9 AA 7B A8>)
(   2,<2012-07-14 10:49:15.750 -0500>,<Administrator>,<TOPSPIN>,<proc1d>,<TOPSPIN 2.1>,
      <Start of raw data processing
       efp LB = 0 FT_mod = 6 PKNL = 1 PHC0 = 0 PHC1 = 0 SI = 32K 
       data hash MD5: 32K
       54 9B F5 1D 5B 78 D0 B1 B6 90 85 F8 9B C9 CB FE>)
(   3,<2012-07-14 10:49:16.218 -0500>,<Administrator>,<TOPSPIN>,<proc1d>,<TOPSPIN 2.1>,
      <pk PHC0 = 179.2804 PHC1 = 0 
       data hash MD5: 32K
       73 D0 C1 1F 2E 93 94 3F EC FF 10 B7 6E 24 54 1A>)
(   4,<2012-07-14 10:49:16.296 -0500>,<Administrator>,<TOPSPIN>,<proc1d>,<TOPSPIN 2.1>,
      <abs ABSG = 1 
       data hash MD5: 32K
       BE A9 D7 23 0C AF 67 ED A4 DA 15 9B 42 E4 A8 45>)
(   5,<2012-07-14 10:49:16.343 -0500>,<Administrator>,<TOPSPIN>,<proc1d>,<TOPSPIN 2.1>,
      <abs ABSG = 2 
       data hash MD5: 32K
       B8 94 7A C7 12 D8 B8 CD CE 46 C1 6C 51 E8 92 22>)
(   6,<2012-07-14 10:49:16.375 -0500>,<Administrator>,<TOPSPIN>,<proc1d>,<TOPSPIN 2.1>,
      <abs ABSG = 3 
       data hash MD5: 32K
       75 EF F8 7C 5A 16 D9 88 8B 75 C6 0A 3D 8C 1B FE>)
(   7,<2012-07-14 10:49:16.406 -0500>,<Administrator>,<TOPSPIN>,<proc1d>,<TOPSPIN 2.1>,
      <abs ABSG = 4 
       data hash MD5: 32K
       E9 2C 3B D8 9A C4 08 9D 6F C3 4F B9 C1 6B C6 2A>)
(   8,<2012-07-14 10:49:16.437 -0500>,<Administrator>,<TOPSPIN>,<proc1d>,<TOPSPIN 2.1>,
      <abs ABSG = 5 
       data hash MD5: 32K
       1A 11 96 E6 5C 0D B1 AD A7 4C D5 C9 23 79 23 BC>)
$$ ##END=
$$ 
$$ $$ hash MD5
$$ $$ A4 27 85 F3 7B 5D C9 82 64 7A 14 AA 81 41 7B C2
##$RELAX= 
##$RELAX= 
##$RELAX= 
##$RELAX= 
##$RELAX= 
##$RELAX= 
##$RELAX= 
##$RELAX= 
$$ Bruker specific parameters
$$ [...]
150 150 150 150 150 150 150 150
##$TP07= 0
##$TPNAME0= <>
##$TPNAME1= <>
##$TPNAME2= <>
##$TPNAME3= <>
##$TPNAME4= <>
##$TPNAME5= <>
##$TPNAME6= <>
##$TPNAME7= <>
##$TPOAL= (0..7)
0.5 0.5 0.5 0.5 0.5 0.5 0.5 0.5
##$TPOFFS= (0..7)
0 0 0 0 0 0 0 0
##$TUNHIN= 0
##$TUNHOUT= 0
##$TUNXOUT= 0
##$USERA1= <user>
##$USERA2= <user>
##$USERA3= <user>
##$USERA4= <user>
##$USERA5= <user>
##$V9= 5
##$VALIST= <valist>
##$VCLIST= <CCCCCCCCCCCCCCC>
##$VD= 0
##$VDLIST= <DDDDDDDDDDDDDDD>
##$VPLIST= <PPPPPPPPPPPPPPP>
##$VTLIST= <TTTTTTTTTTTTTTT>
##$WBST= 2048
##$WBSW= 25
##$XGAIN= (0..3)
0 0 0 0
##$XL= 0
##$YL= 0
##$YMAX_a= 507679
##$YMIN_a= -650995
##$ZGOPTNS= <>
##$ZL1= 120
##$ZL2= 120
##$ZL3= 120
##$ZL4= 120
##$ABSF1= 14.98509
##$ABSF2= -5.573092
##$ABSG= 5
##$ABSL= 3
##$ALPHA= 0
##$AQORDER= 0
##$ASSFAC= 0
##$ASSFACI= 0
##$ASSFACX= 0
##$ASSWID= 0
##$AUNMP= <proc_prof1d_extract_pilot.lims>
##$AXLEFT= 0
##$AXNAME= <>
##$AXNUC= <1H>
##$AXRIGHT= 0
##$AXTYPE= 0
##$AXUNIT= <>
##$AZFE= 0.1
##$AZFW= 0.1
##$BCFW= 0
##$BC_mod= 0
##$BYTORDP= 0
##$COROFFS= 0
##$CY= 15
##$DATMOD= 1
##$DC= 0
##$DFILT= <>
##$DTYPP= 0
##$F1P= 0
##$F2P= 0
##$FCOR= 0.5
##$FTSIZE= 32768
##$FT_mod= 6
##$GAMMA= 0
##$GB= 0
##$INTBC= 1
##$INTSCL= 1
##$ISEN= 128
##$LB= 0
##$LEV0= 0
##$LPBIN= 0
##$MAXI= 10000
##$MC2= 0
##$MEAN= 0
##$ME_mod= 0
##$MI= 0
##$NCOEF= 0
##$NC_proc= -8
##$NLEV= 6
##$NOISF1= 0
##$NOISF2= 0
##$NSP= 0
##$NTH_PI= 0
##$NZP= 0
##$OFFSET= 14.98509
##$PC= 1
##$PHC0= 179.2804
##$PHC1= 0
##$PH_mod= 1
##$PKNL= yes
##$PPARMOD= 0
##$PPDIAG= 0
##$PPIPTYP= 0
##$PPMPNUM= 2147483647
##$PPRESOL= 1
##$PSCAL= 4
##$PSIGN= 0
##$PYNMP= <proc.py>
##$REVERSE= no
##$SF= 400.02
##$SI= 32768
##$SIGF1= 0
##$SIGF2= 0
##$SINO= 400
##$SIOLD= 32768
##$SPECTYP= <>
##$SREGLST= <1H.CDCl3>
##$SSB= 0
##$STSI= 32768
##$STSR= 0
##$SW_p= 8223.68421052631
##$SYMM= 0
##$S_DEV= 0
##$TDeff= 65536
##$TDoff= 0
##$TI= <>
##$TILT= no
##$TM1= 0
##$TM2= 0
##$TOPLEV= 0
##$USERP1= <user>
##$USERP2= <user>
##$USERP3= <user>
##$USERP4= <user>
##$USERP5= <user>
##$WDW= 1
##$XDIM= 32768
##$YMAX_p= 478896682
##$YMIN_p= -740693
##$CURPLOT= <Network HP LaserJet P1505>
##$CURPRIN= <$Network HP LaserJet P1505>
##$DFORMAT= <normdp>
##$LAYOUT= <+/1D_H.xwp>
##$LFORMAT= <normlp>
##$PFORMAT= <normpl>
##$SURQMSG= 1
$$ End of Bruker specific parameters
$$ ---------------------------------
##NTUPLES= NMR SPECTRUM
##VAR_NAME=  FREQUENCY,     SPECTRUM/REAL,   SPECTRUM/IMAG
##SYMBOL=    X,             R,               I
##VAR_TYPE=  INDEPENDENT,   DEPENDENT,       DEPENDENT
##VAR_FORM=  AFFN,          ASDF,            ASDF
##VAR_DIM=   32768,         32768,           32768
##UNITS=     HZ,            ARBITRARY UNITS, ARBITRARY UNITS
##FACTOR=    0.250966925370066, 1,           1
##FIRST=     8223.43324360094, -204872,      -157120
##LAST=      0,             111657,          12594
##MIN=       0,             -740693,         0
##MAX=       8223.43324360094, 478896682,    0
$$ Real data points
##PAGE= N=1
##DATA TABLE= (X++(R..R)), XYDATA
$$ [...]
19521A23074J1514a9697j55663A66519E1320e17133b21406O2758C85412d15572
19510G3160c65394a00310k2161a88C0437a04927k9621e0177p5660j13021N6756
19499a82102j51572J43060r7977p2453g6086j63107d4466n8349n6881B40826i8013
19487G8302N5024a9979e761o3361j44799k10759D1103b82139c4165k1288o9237
19476a24690A94567g9433n3385r0334A25037b26224e3828I0613a62968k47730
19466d10698A62914A9858H653i5407A81936a97382B71775r3835B224R4819d10709
19454A58811m0902c9656C1115K45511A31959a81218A25984N0751A9495K220K16207
19443B37922J544E3578G402O272h0944N715k69196J32232P3491l3938b0425A6514
$$ y = [123074, 134588, -19697, -175360, 166519, 51320, -517133, -221406, -158648, 385412, -415572, 73160, -365394, -100310, -122471, -188, 30437, -104927, -134548, -50177, -125837, -238858, -182102, -333674, -190614, -288591, -361044, -76086, -239193, -44466, -102815, -159696, 240826, -98013, 78302, 133326, -19979, -5761, -69122, -213921, -424680, 41103, -282139, -34165, -55453, -124690, 194567, -79433, -132818, -223152, 125037, -226224, -53828, 90613, -162968, -410698, 162914, 19858, 8653, -95407, 181936, -197382, 271775, 177940, 2224, 97043, -410709, 158811, 117909, -39656, 31115, 276626, 131959, -181218, 125984, 176735, 19495, 21715, 237922, 239466, 53578, 7402, 13674, -80944, -75229, -344425, -212193, -138702, -172640, -20425, 16514]
19430C5457J39594g3029j06375P5715A09399a29781q3083b6650A12413a46883
19419b25383B22208e964k94759b0114B121d0595j46873N0369B8802b05936g0991
19407a29140r7258f8759k26382a22856I9320a24261o0699r2256J11636C13626
19396b3886p5781j44213A55167d96998a24845l1143m4245A89355a53984e7810
19385A03024M7537i1973A25907g2907B26034B6800M6325c17059l0123D2284J60369
19374B02653c10710A47803h6706A76009a4775j89321Q1181A38379a69746P137
19364a62609E7271K1001b05963F2874g3974k29976J47840A1580a78335B13657
19353A18684f9484m22805E4808J18490b49890J06735H4954f3726c1486k00267
$$ y = [35457, 175051, -73029, -179404, -103689, 109399, -129781, -212864, -26650, 112413, -146883, -225383, 222208, -5964, -300723, -20114, 2121, -40595, -187468, -137099, 28802, -205936, -70991, -129140, -226398, -68759, -295141, -122856, 99320, -124261, -184960, -277216, -165580, 313626, -23886, -99667, -243880, 155167, -496998, -124845, -155988, -200233, 189355, -153984, -57810, 103024, 150561, -91973, 125907, -72907, 226034, 26800, 73125, -317059, -347182, 42284, 202653, -310710, 147803, -86706, 176009, -14775, -204096, -122915, 138379, -169746, -162609, 57271, 78272, -205963, 62874, -73974, -303950, -156110, 11580, -178335, 213657, 118684, -69484, -492289, 54808, 173298, -249890, -143155, 84954, -63726, -31486, -231753]
19343b31753h4464r6107N9234q1004h517k82168B27735a18813A427a86319F7693
19331e3994j59072q761B44866a41053A99808a25381d2994B5442b61011A33890
19320a46638e8391j72871a5166k63132a00795j26638A42788b72339A14723N8996
19310A73719c31331G1836a15397b4709k74243J28063I0203M9883a26539j28048
19300b54587h3651G1900M4017L6294k5380h6627o2339A37202a64797a834A98688
19288b73307j50811a94503L0611a1812j57743A43556h5588k0391K2143B22648
19277a1664k11275J08620F7566J9184J8353A9640h9686m5072A75944i8272A21696
19265i8003k73201e1532k24315A0682b88852Q0288p6847a35562e0841C50233G8915
$$ y = [-231753, -84464, -180571, -121337, -202341, -8517, -290685, 227735, -118813, 1427, -186319, 67693, -53994, -213066, -221827, 244866, -141053, 199808, -125381, -42994, 25442, -261011, 133890, -146638, -58391, -231262, -15166, -278298, -100795, -227433, 142788, -272339, 114723, 173719, -331331, 71836, -115397, -24709, -298952, -170889, 90203, 140086, -126539, -254587, -83651, 71900, 115917, 152211, 126831, -86627, -148966, 137202, -164797, -1834, 198688, -273307, -424118, -194503, -163892, -11812, -169555, 143556, -85588, -105979, -83836, 222648, -11664, -222939, -114319, 67566, 86750, 105103, 19640, -89686, -134758, 175944, -98272, 121696, -98003, -371204, -51532, -275847, 10682, -288852, -208564, -285411, -135562, -50841, 350233, 78915]
19253a93052q1407J9321d8474j83129P9973C13112B6373b32085C96036b73082
19242A04021g0098k11142c6943k40093a029F4134M1678a87808a7117B6404J01895
19231A28299F252a31425A25064f7460b2026k45493a20396D1057i8512B265O661
19220H926J74095G3227K16935f8319A21713d2884l0814b1356j29602B9543K3301
19209E2844E0c09184N9662G9436a70899A54173L8738e8629a7877q2081o2823A25823
19196H1525C3913b31377H3562g898A6456c8828J3564l1802p0843n4702A33b35935
19183a00991j66261a8131l8442J050k09321J04417j17923A96110H3447a33463
19172a89587A36247b62797L9877J02403A21917a3317l03161B1925J13249K0685
$$ y = [-193052, -274459, -255138, -48474, -231603, -151630, 313112, 26373, -232085, 396036, -273082, 104021, -70098, -281240, -36943, -277036, -1029, 64134, 105812, -187808, -17117, 26404, 128299, 6252, -131425, 125064, -67460, -22026, -267519, -120396, 41057, -98512, 2265, 8926, 183021, 73227, 290162, -68319, 121713, -42884, -73698, -21356, -150958, 29543, 52844, 50, -309184, -249522, 79436, -170899, 154173, 192911, -58629, -17877, -99958, -162781, 125823, 81525, 33913, -231377, 83562, -7898, 16456, -38828, -25264, -57066, -127909, -182611, 133, -235935, -100991, -267252, -18131, -56573, -55523, -264844, -160427, -278350, 196110, 83447, -133463, -189587, 136247, -262797, -222920, -120517, 121917, -13317, -316478, 21925, 135174, 155859]
19162A55859a95417d5500l787l44674i9695A43540D613b5674j39911f192D8380
19150B7944H740a96563A5861b17989a04117j05728H7813i613A0686K3485f0217
19138A55068a05493r9703c5229k10733A82589e4766f203k4661A34859a98232H03
19126A32393j1951n9998b66854L2504F1237K22553a35903j27988A21166d8007
19115a02193F506c19401A28171K4295b4958n0864D8740e073G1956M6302h0533
19103a97673g7405k40953C6194K6928a43606J8168f1985C22298d49249a52368
19092a53216n7557E9234d7911l46B00995a32705A00936M4937g322k96806L3251
19081b70877k66405A07135f9495j30995j34474h7793C4255h340A03484J56463
$$ y = [155859, -195417, -45500, -49287, -393961, -99695, 143540, 4613, -25674, -165585, -6192, 48380, 27944, 8740, -196563, 15861, -217989, -104117, -209845, 87813, -9613, 10686, 34171, -60217, 155068, -105493, -205196, -35229, -245962, 182589, -54766, -6203, -30864, 134859, -198232, 803, 132393, 120442, 60444, -266854, -234350, 61237, 283790, -135903, -263891, 121166, -48007, -102193, 6506, -319401, 128171, 152466, -24958, -75822, 48740, -5073, 71956, 118258, -80533, -197673, -77405, -318358, 36194, 63122, -143606, -125438, -61985, 322298, -449249, -152368, -153216, -210773, 59234, -47911, -48257, 200995, -132705, 100936, 145873, -7322, -304128, -270877, -537282, 107135, -69495, -200490, -334964, -87793, 34255, -8340, 103484, 259947]
19071B59947G1648a33751o9506g2351D5653G006L9937c12443a10855J9241Q213
19060h3401j77809a01556g520n9883b9372A03409B5612P5341c52149a11051I1269
19048A7549h6900I6390L23931A19574a32365B00117d40160b00842M0401f1092
19037a38718F1143i6483j4458A9247a14495F546O8932N6731f1089A93224J54666
19026C47890a31842A71152J61141a51952A43158j3118J40830j6426b06049D58490
19015a23699C51023i8031B02431j3128b38621G1088J08128j0559g3751n6657m28765
19004e59173a98872M6236k67471J63011J01418j77001h0392c3319j45101M8731
18994a29689C02112b59955C18277C229e7137a1209B92276a78704j6446A17062
$$ y = [259947, 71648, -133751, -203257, -72351, 45653, 7006, 46943, -312443, -110855, -91614, -83401, -261210, -101556, -7520, -67403, -29372, 103409, 25612, 100953, -352149, -111051, 91269, 17549, -86900, 96390, 420321, 119574, -132365, 200117, -440160, -200842, -160441, -61092, -138718, 61143, -96483, -110941, 19247, -114495, 6546, 75478, 132209, -61089, 193224, 347890, -131842, 171152, 332293, -151952, 143158, 130040, 270870, 254444, -206049, 458490, -123699, 351023, -98031, 202431, 189303, -238621, 71088, 179216, 168657, -73751, -130408, -559173, -198872, -152636, -420107, -257096, -155678, -332679, -80392, -33319, -178420, -129689, 302112, -259955, 318277, 3229, -57137, -11209, 292276, -178704, -195150, 117062]
18983h3202m5839r2970B24901a39625A81836i2405p346j37403h0917j55219j6078
18972b52214A85912c97951B55417G3730k5142a4095A1580e5710k9261D0416N7498
18961I7914e01461C688J35350F0417b22592B75953a9337j0021A71406r615a18024
18949d43085i5943J9308A09376E1418a32486C10954k8602j34357a78803K9788
18939a49015b8083a1890j58610D2688P5385a48537a4569A20566a26279H4873J84617
18928B69490c9985E5008a53154O8765j35125c237A03807d00577a6317F2408d4008
18916a46477C80219a00417b964k95339g0252b888k65288B10473l5124f9959G470
18904B20792D6928b31829h5958r073j41319L8557g7176l44574A1129a20163B58490
$$ y = [-83202, -129041, -222011, 224901, -139625, 181836, -92405, -99751, -237154, -80917, -236136, -252214, 185912, -397951, 255417, 73730, 48588, -14095, 11580, -55710, -84971, 40416, 97914, -501461, 3688, 139038, 60417, -222592, 275953, -19337, -29358, 171406, 161791, -118024, -443085, -95943, -76635, 109376, 51418, -132486, 310954, 282352, 147995, -178803, -149015, -28083, -11890, -170500, 42688, 118073, -148537, -14569, 120566, -126279, 84873, 269490, -39985, 55008, -153154, -84389, -219514, -3237, 103807, -400577, -16317, 62408, -44008, -146477, 380219, -100417, -2964, -298303, -70252, -2888, -268176, 210473, 175349, -69959, 7470, 220792, 46928, -231829, -85958, -95031, -236350, -197793, -77176, -421750, 11129, -120163, 258490]
18892a4379I2034b5875r3892A55546e1566k38037a31918K9147k56223a34337B0338
18880a81682E9477a12263J5137r6024M339i2991b6774j61618j62190a8383j30442
18869a48825A37901P1305d22053a19518k91568a6438H5748b20398E9115e8928
18858c44692J19080R8989j28907R2684A4255K70710A19901M7633a37424d4486
18847i1648c6156j33244K515B14398a0148m7732B19856b45261J08115q9069j56016
18836c82231a2739m1597A52760b36826A5049N4519f228o3983b9336j47134A14381
18824a51579q0201L7483P5625B26906j06058a28905B08586a35438A55525J87793
18814C43318q3631J13804A02670b54404A14104J13608J78131A71417J18708j17683
$$ y = [-14379, 92034, -25875, -119767, 155546, -51566, -289603, -131918, -102771, -358994, -134337, 20338, -181682, 59477, -112263, -97126, -193150, -188811, -92991, -26774, -188392, -350582, -18383, -148825, 137901, 209206, -422053, -119518, -411086, -16438, 85748, -220398, 59115, -58928, -344692, -225612, -126623, -255530, -162846, 14255, 284965, 119901, 167534, -137424, -44486, -91648, -36156, -169400, -166885, 214398, -10148, -57880, 219856, -245261, -137146, -226215, -382231, -12739, -54336, 152760, -236826, 15049, 69568, -6228, -70211, -29336, -176470, 114381, -151579, -231780, -194297, -118672, 226906, 120848, -128905, 208586, -135438, 155525, 343318, 259687, 373491, 102670, -254404, 114104, 227712, 405843, 171417, 290125, 172442]
18804A72442n408K11156g7941k1942F1749K56351a41452D26367h3115L3240l0233
18793h0108J7851l46608A51204a03026B67552b97505i6305j14609g7800k426a0108
18781e2640j94083J0937A9577a24805p3135o7777I8904a76636Q263B23867b12626
18769e2004k77242J45032M5028e7649j98982k02974d6293j93371B8003a57780
18758c31259a9567l22814a03503A31141a23088C47538b9083B10540a91979f0558
18747A41083b28998M7541J6325f0652j37623R6566j33082g6391m8211d261n8377
18736f2638l6495F8038R3943O3098N5747a13421C03759B8134L26169c6152A4113
18724h3B18548h7142a4111r2741l39591L4801i5204M4433B69528a60291B28341
$$ y = [172442, 167034, 378190, -77941, -99883, 61749, 318100, -141452, 426367, -83115, -49875, -80108, -62257, -408865, 151204, -103026, 267552, -297505, -96305, -210914, -77800, -80226, -10108, -52640, -246723, -235786, 19577, -124805, -197940, -265717, 98904, -176636, -168373, 223867, -212626, -52004, -329246, -184214, -139186, -57649, -256631, -459605, -46293, -239664, 28003, -157780, -331259, -19567, -342381, -103503, 131141, -123088, 347538, -29083, 210540, -191979, -60558, 141083, -228998, -181457, -165132, -60652, -198275, -101709, -234791, -76391, -124602, -4261, -62638, -99133, 68038, 161981, 225079, 280826, -113421, 303759, 28134, 354303, -36152, 14113, -83, 218548, -87142, -14111, -106852, -446443, -411642, -95204, -50771, 269528, -160291, 228341]
18712A24718n7001a84613k17010E7077a0556k10297b6082A23925Q4382B8438b43659
18700c0583A44318E523J74544a2737n44856F7428K11974A00570d2241G726J53227
18689A60953a29861L8799A33996E343J20487a03726k8776A06800b5955j07218
18679a33173j44693E0037J62498a07033j6173j20831Q9040A00546a70184e2850
18668e4013q6706l149k70147i6453B7462b62675q9578R9070A319c595n14521A35422
18655a54246A43965C0179M2899a85339A40263b10982N4460k50461G6265C6360
18644a21357B02495a4954B0032K49291a79662A62018a9942j57864q8077J02702
18634a63181B5450J60781a85754j59428A02762a84143E8283b31932k60339i6655
$$ y = [124718, 67717, -184613, -401623, 57077, -10556, -220853, -26082, 123925, 208307, 28438, -243659, -30583, 144318, 5523, 180067, -12737, -557593, 67428, 279402, 100570, -42241, 7726, 160953, -129861, -91062, 133996, 5343, 125830, -103726, -132502, 106800, -25955, -133173, -277866, 50037, 212535, -107033, -123206, -244037, -154997, 100546, -170184, -52850, -54013, -140719, -143868, -414015, -96453, 27462, -262675, -352253, -253183, 1319, -3595, -518116, 135422, -154246, 143965, 30179, 73078, -185339, 140263, -210982, -156522, -406983, 76265, 36360, -121357, 202495, -14954, 20032, 269323, -179662, 162018, -19942, -177806, -265883, -163181, 25450, 186231, -185754, -345182, 102762, -184143, 58283, -231932, -492271, -96655]
18623b49008h3568B62137A5663b41915e7792A63185p2780c63625A66382e2128
18612B14033b13958M5259h0196J8518k54324f4986c951n0637l7306j72483j37833
18601d02210A07415c6447j98246k0651C005c11775A76097C1468b1387l16784a46544
18589G2412b45152j13043D1352c31734J1221k35235g6320b630A1558Q1129M6213
18578A38900k2386a57293g4457A03069l3129C3952b8418A78788a78787h9195p6174
18567a65369A69860c39072B77998d9617B11353a07213N1451r8159G4471C4629
18556a40625l0639g2588k04883c7295a0762n8999j19593j55744q81A11036i9448
18544F4491J97598a51729b4575n5080k45842A81274b77744c8051l0012l40867
$$ y = [-249008, -83568, 262137, 15663, -241915, -57792, 163185, 90405, -363625, 166382, -52128, 214033, -213958, -168699, -80196, -61678, -316002, -64986, -3951, -54588, -91894, -264377, -402210, 107415, -36447, -234693, -255344, 3005, -311775, 176097, 31468, -21387, -338171, -146544, 72412, -245152, -358195, 41352, -331734, -320513, -555748, -76320, -2630, 11558, 92687, 138900, 116514, -157293, -74457, 103069, 69940, 33952, -28418, 178788, -178787, -89195, -165369, 169860, -339072, 277998, -49617, 211353, -107213, -55762, -153921, 74471, 34629, -140625, -171264, -72588, -277471, -37295, -10762, -69761, -189354, -345098, -345979, 111036, -99448, 64491, 262089, -151729, -24575, -79655, -325497, 181274, -277744, -38051, -68063, -408930]
18534d08930b02249A22296n4764Q4454J6038J00805b21228a0040G1106d7506j4646
18523f2152A08243J24590E3392M12802b48340q128C1615a06628M8290j93359i2637
18511I37J06134a42430j3187A79924p7802h0070C6826O0612a36303K8843B39247
18499a1525m48588g1906j12608c580j28861C1511d06000d8628j32605r995A72330
18487e6722p2449j8714A16411b08473i1366A5015J92407J7735I3437c79248J69546
18476b09702g516A27281g7796K3594j71722B03210a14024A16034c48692g1785
18465a92368b88l22311C82322c91392G2597K2221c65262a1085j48886q28B31894
18453b38110A0082h3187j36631f6779C9344K2190a04942l9431j34717a06454A76925
$$ y = [-408930, -202249, 122296, 67532, 151986, 168024, 268829, -221228, -10040, 71106, -47506, -62152, 108243, 232833, 53392, 466194, -248340, -256468, 31615, -106628, -58338, -251697, -92637, 937, 107071, -142430, -155617, 179924, 102122, -80070, 36826, 97438, -136303, -107460, 239247, -11525, -460113, -71906, -184514, -3580, -132441, 31511, -406000, -48628, -181233, -191228, 172330, -56722, -129171, -147885, 116411, -208473, -91366, 15015, 207422, 225157, 93437, -379248, -209702, -7516, 127281, -77796, -54202, -225924, 203210, -114024, 116034, -348692, -71785, -192368, -288, -322599, 382322, -391392, 72597, 94818, -365262, -11085, -159971, -160799, 231894, -238110, 10082, -83187, -219818, -66779, 39344, 61534, -104942, -144373, -279090, -106454, 176925]
18441A8186h3242B51410e4237j65470G1479c0545B55089c82473A5385a40693f9209
18429A9917b03643m7734B09091f6491A32008a29310a5070G8121j7149e4873f254
18417c07084A13153g8610K7280j8704m7757D14138A50336i7268o4645d4824E6513
18405b94931A11442a27416D1319J04156e8017j0982B17913c16385a54659D9279
18394B10046C0838a32971b4955k33685d6052B77576a85565f4692C58832j05567
18384B53265c27667a11865e0883C16873a69141j31355k4753A42779b3114B51015
18373b5207o953q5420j51952B7474a91464C8190J37677G5394d0585o489B53229
18361A14694M3169b29400f6791m3055J9751E7354J26344i3652J8025A13792a76527
$$ y = [18186, -83242, 251410, -54237, -219707, 71479, -30545, 255089, -382473, 15385, -140693, -69209, 19917, -203643, -251377, 209091, -66491, 132008, -129310, -15070, 78121, 60972, -54873, -6254, -307084, 113153, -78610, -51330, -70034, -117791, 414138, 150336, -97268, -161913, -44824, 56513, -294931, 111442, -127416, 41319, 145475, -58017, -68999, 217913, -316385, -154659, 49279, 210046, 30838, -132971, -24955, -258640, -46052, 277576, -185565, -64692, 358832, 253265, -327667, -111865, -50883, 316873, -169141, -300496, -325249, 142779, -23114, 251015, -25207, -32160, -117580, -269532, 27474, -191464, 38190, 175867, 75394, -40585, -47074, 253229, 114694, 157863, -229400, -66791, -109846, -90095, 57354, 183698, -93652, -75627, 113792, -176527]
18349F0015b26582Q5701k52970a47194e8327A8225J56289p4898D40b12431D0125
18337b4705E5172J72636g4964k50708G041J6945J83724a94157B29815A7321f5213
18325I8834k0215l2232a37765A43296L4611a19532M3040B6090J14803E0433b93703
18313a83198M6154q9521j04257f4241l41207c3060C64863G7290b39814a14n6937
18302e7051A69810E881O6008e8908q5013D0076i3643A06393n24F042c80248I0693
18289f8616j64616A58001J35799a86060k5561E3138g1674g992B32277b41300A65750
18277a21194K4943j56144P4873M861B65507r0783d3967m42751a26902d1625l54554
18266c96179a28365k85524R7248J52065I4871D1648a79274j2179m155J8474A38642
$$ y = [60015, -226582, -140881, -393851, -147194, -58327, 18225, 174514, 99616, 440, -212431, 40125, -24705, 55172, 227808, -74964, -325672, 7041, 23986, 207710, -194157, 229815, 17321, -65213, 98834, 78619, 46387, -137765, 143296, 177907, -119532, -76492, 26090, 140893, 50433, -293703, -183198, -137044, -226565, -330822, -64241, -405448, -33060, 364863, 77290, -239814, -114, -57051, 169810, 5881, 71889, -58908, -143921, 40076, -93643, 106393, 105869, 6042, -380248, 90693, -68616, -233232, 158001, 293800, -186060, -211621, 53138, -71674, -7992, 232277, -241300, 165750, -121194, -96251, -252395, -177522, -172661, 265507, 174724, -43967, -486718, -126902, -41625, -396179, -128365, -413889, -316641, -164576, 94871, 41648, -179274, -191453, -195608, -177134, 138642]
18254A05373a39477B42682a56770f0336c0099l46956J47863G388c21643E1622
18243i0571k9398K0444B9370K17887J22458a29159a4900k60327H8566N0681E0145
18231A42800n6615a16184j9199j3200B398a06285K7527B3248J3353J27705D5869
18219a8098A02104a2500C78e5411H7851g0498a295l1227n749j3668j23394j54877
18207c30210O0311C25821a41732j21231A37163R6390b05692F0795a8721A80655
18196C36590A61100b08546B25370c5686F7832K5146C0435b9653m16847B5373C609
18184B8651d11502c1445j46412b8222j54112l20761C1689h8741k36265C7857h9446
18172F7867J71273a78184C30865b65143f2148j6931l1946K5050a1298A54981a52790
$$ y = [105373, -139477, 242682, -156770, -60336, -30099, -377055, -229192, 7388, -321643, 51622, -90571, -119969, -99525, 29370, 247257, 369715, -129159, -14900, -275227, 88566, 139247, 50145, 142800, 86185, -116184, -135383, -148583, 2398, -106285, -78758, 23248, 36601, 164306, 45869, -18098, 102104, -12500, 378, -55411, 87851, -70498, -1295, -32522, -38271, -51939, -175333, -330210, -269899, 325821, -141732, -262963, 137163, 233553, -205692, 60795, -18721, 180655, 336590, 161100, -208546, 225370, -35686, 67832, 92978, 30435, -29653, -446500, 25373, 3609, 28651, -411502, -31445, -177857, -28222, -182334, -503095, 31689, -88741, -325006, 37857, -89446, 67867, 239140, -178184, 330865, -265143, -62148, -79079, -111025, -85975, -11298, 154981, -152790]
18160G7874K48351j06305d26825O2452a5645j07775C69449a26118o328f1070C88628
18148E7695P1201b61107Q7194a04n6429l50298a62937p6508i41k28662B28437
18136B55346r8077J58069h4685C30528f2796l0708n4962j43311a41211E9191J27409
18125A86600a2677l04361p4536J90366C66c64118C2624a2290k50906i1375C25999
18113B7220b81748i9633j56798B02867I4624D3780N8979b12642P2809D1964c8761
18101g073p3566j64450A54788i2999B14950n0881m5059E3045b84009b7692A2402
18089a45358K3892C66168j70999b711A1124M0715c90652I4659i2230D9586b6450
18077D7991c7092A1113L55647b48942M5406P5115j33140A7624J62095E2959a65997
$$ y = [77874, 326225, 219920, -426825, -364373, -15645, -123420, 369449, -126118, -132446, -61070, 388628, 57695, 128896, -261107, -173913, -104, -56533, -406831, -162937, -239445, -941, -229603, 228437, 255346, 157269, 315338, -84685, 330528, -62796, -93504, -148466, -291777, -141211, 59191, 186600, -12677, -317038, -391574, -201208, 366, -364118, 32624, -12290, -263196, -91375, 325999, 27220, -281748, -99633, -256431, 202867, 94624, 43780, 102759, -212642, -139833, 41964, -38761, -7073, -80639, -245089, 154788, -92999, 214950, 164069, 119010, 53045, -284009, -27692, 12402, -145358, -121466, 366168, 195169, -2711, 11124, 51839, -390652, 94659, -92230, 49586, -26450, 47991, -37092, 11113, 366760, -248942, -203536, -128421, -261561, 17624, 179719, 52959, -165997]
18065b7996l3479A9307K04357b59l91579R0735A4429J80508H8989a73550D0380
18053B0287N7494f5375k79798D2386R0494a44597c738E3038A9026b3407j47334
18042a70741a4767j01265A9877b59406O657J167d3866A4092c14734b7751A38681
18030A18368J45849E9789J27296a94500A64509J63887f179m8846A97315i5946
18019A27158d51367M7687C740K48676D9734c97257a75599J9310O5881k9664E9865
18007B633b17028j20051A06603b26550J5575A96185a72371O6997G5464B6751b34222
17995E1021a27727J3966B3348K18948n8485b38229i1584B45286j19475e6263G3098
17983b19506c5254a5650k37288F9466B0043e319m1774F99b1477j64191i2350G1017
$$ y = [-27996, -61475, 19307, 223664, -259, -391838, -301103, 14429, 194937, 88989, -173550, 40380, 20287, 77781, -65375, -345173, 42386, 132880, -144597, -3738, 53038, 19026, -23407, -170741, -14767, -116032, 19877, -259406, -252749, -251582, -43866, 14092, -314734, -27751, 138681, 118368, 264217, 59789, 187085, -194500, 164509, 328396, -6179, -55025, 197315, -95946, 127158, -451367, -403680, 3740, 252416, 49734, -397257, -175599, -156289, -90408, -120072, 59865, 2633, -217028, -337079, 106603, -226550, -210975, 196185, -172371, -105374, 75464, 26751, -234222, 51021, -127727, -113761, 23348, 242296, 183811, -238229, -91584, 245286, 125811, -56263, 73098, -219506, -35254, -15650, -252938, 69466, 20043, -5319, -47093, 699, -21477, -185668, -92350, 71017]
17970a17930a6069B53463a4949F7923J31915d21168A86390K25E6577J07561b33789
17958f191j87590C786b4511l13245A41260J53960M8292A17086i6375C32270f9698
17946F0566c94459a75649i274A77920H1501a99351B0878J30247h004C25928a2246
17934A16271a89850B40858H5495d14866a32258F8922a04003D4597K05961a48608
17923A44299a58685r0973B59197n1530j6244c7756j71850c5051D31550c22234
17912b17752l8231e8060A06474a46634A8961R056J2118b59772A99564e0314D6780
17900b103n2537m1551B10087e8048A13307D1546j23a79345f7253l3872j14421
17889b15546A25968g6814j06951A11324J3306a82107A48016a2748F6739k4574
$$ y = [-117930, -16069, 253463, -14949, 67923, 199838, -421168, 186390, 186615, 56577, 164138, -233789, -6191, -193781, 3786, -24511, -337756, 141260, 295220, 343512, 117086, -96375, 332270, -69698, 60566, -394459, -175649, -9274, 177920, 81501, -199351, 20878, 151125, -8004, 325928, -12246, 116271, -189850, 240858, 85495, -414866, -132258, 68922, -104003, 44597, 250558, -148608, 144299, -158685, -249658, 259197, 207667, 191423, -37756, -209606, -35051, 431550, -322234, -217752, -255983, -58060, 106474, -146634, 18961, 28017, 40135, -259772, 199564, -50314, 46780, -2103, -54640, -96191, 210087, -58048, 113307, 41546, 41423, -179345, -67253, -101125, -215546, 125968, -76814, -183765, 111324, 124630, -182107, 148016, -12748, 66739, 42165]
17879D2165b10106D2118b70721A90233g0313L3112B56093a04028l6186d9165D8414
17867A12677e3227D2361b88633q346N9499c4332G8342e3333A80660h9584l2464
17856a22048L7552j75593B06323a80212k657R141B45363A12191J81001C7313O4428
17845A01741j894j2935c56777b5341r0639F5851e9770j870I7975J21289d8158
17833b05630D07841G7603b54987C2692a73351k16449A67570J13208A22074d5322
17822B40917i3974A18747b5937j47291N5402A17081i1101j84811j1686d4072B78213
17810A35141a36I4944k1266B9a25515C92382c6052k1084j83934e0937D0574b07870
17797A55137b49995i5097B9940e27055A47579b88120A32332i5272J828d2725B68858
$$ y = [42165, -210106, 42118, -270721, 190233, -70313, -37201, 256093, -104028, -140214, -49165, 48414, 112677, -53227, 42361, -288633, -296979, -237480, -34332, 78342, -53333, 180660, -89584, -122048, -84496, -260089, 206323, -180212, -182869, -173728, 245363, 112191, 293192, 37313, 101741, 99847, 86912, -356777, -25341, -115980, 65851, -59770, -61640, 97975, 219264, -48158, -205630, 407841, 77603, -254987, 32692, -173351, -389800, 167570, 280778, 122074, -45322, 240917, -93974, 118747, -25937, -173228, -117826, 117081, -91101, -275912, -287598, -44072, 278213, 135141, -136, 94944, 73678, 29, -125515, 392382, -36052, -57136, -241070, -50937, 40574, -207870, 155137, -249995, -95097, 29940, -527055, 147579, -288120, 132332, -95272, -93444, -42725, 268858]
17785a77868J7815a3626j06703A70049J09633j17744K22048j04178d2901K0348
17775b2553j63163F3484C1463g4253k2978l9063C63740D7615K72492a9026A69857
17763d0936B59422b25940E7892j365L29835h9255K2750n2664C73822F0656L4347
17752I5003b29455C6017e9488a1921B56243b80456a19041B80647g7068C79494
17741b9948G5107a80234B6026M3313a05973I0225M3949b34931p8666b0992k89258
17730c10250A14487b61357A61295d98658A3802K0196K32943e8821B05275a46392
17719C3602b74748D8616L7972b29096i5435k61071d3192C65020j04922D5131J74042
17708B19173b65822e269A15554a6644Q093H8270J3492r642K23996B9192J55171
$$ y = [-177868, -160053, -13626, -120329, 170049, 279682, 161938, 383986, 279808, -42901, -22553, -185716, 63484, 31463, -74253, -97231, -136294, 363740, 47615, 320107, -19026, 169857, -40936, 259422, -225940, 57892, 56527, 386362, -89255, -66505, -119169, 373822, 60656, 95003, -229455, 36017, -59488, -11921, 256243, -280456, -119041, 280647, -77068, 379494, -29948, 75107, -180234, 26026, 69339, -105973, 90225, 134174, -234931, -313597, -20992, -310250, 114487, -261357, 161295, -498658, 13802, 33998, 266941, -58821, 205275, -146392, 33602, -274748, 48616, 86588, -229096, -95435, -356506, -43192, 365020, 260098, 45131, 219173, -265822, -5269, 115554, -16644, -8551, 88270, 101762, 92120, 316116, 29192, 184363]
17697A84363l3036J14440J9999D2100J51591D1402J50292B7790J05769A8585M21340
17686D39925A09154b27284A03022b31104D9207Q1161b60382J29688e4376A11783
17675b19029a04745b3240C23371k3380b427n3859B91529F470M2400a19005d9254
17663B72671A14132i9421j10599A24786b9431a487l9375B1204P8010d29129G5974
17651H7470a3105B5642b17689E6824a75535O0153C608L16539d9907l9260H6125
17639B44150i2260A29601a29140B49050m1128o1161J10001j17794a18307l64281
17629d82588B16502g4269R739B11454C9242g2672l42227A66229b8219H7707a2325
17617B76598j37630o8812i948j56334N9545j94976f5774j43537D2695N7652a41035
$$ y = [184363, 151327, 265767, 285766, 42100, 193691, 41402, 191694, 27790, 133559, 18585, 439925, 109154, -227284, 103022, -231104, 49207, 130368, -260382, -130694, -54376, 111783, -219029, -104745, -23240, 323371, 299991, -2427, -56286, 291529, 6470, 48870, -119005, -49254, 272671, 114132, -99421, -210020, 124786, -29431, -1487, -40862, 21204, 99214, -429129, 75974, 87470, -13105, 25642, -217689, 56824, -175535, -115382, 3608, 320147, -49907, -89167, 86125, 244150, -92260, 129601, -129140, 249050, 207922, 146761, 256762, 138968, -118307, -482588, 216502, -74269, -64530, 211454, 39242, -72672, -414899, 166229, -28219, 87707, -12325, 276598, 138968, 70156, -9948, -166282, -106737, -301713, -65774, -209311, 42695, 100347, -141035]
17605D02042b11049B67565c44188J57185f068q0931l3510j33743e3614j37007
17595a90621j7745A14764j459c37228a58173c7127m5431F7683c9979C84565G6926
17583A78550a07269A41491g2635A33960b39991b2253j13248D5423m541a1619m0366
17572e1985B63320A30787a07535C97495E2332q745b07149B9335J97000M3364g137
17560i2705I6555c28582J54658B27881a16780A13509J41659b9696C51711j75227
17550A76484E0338B0236J4816b13697D2528J45146l956J38741j29700b7925A37864
17538B37594I6416L1464L80552A35634i6668l9365B17971p3363c3413j93205A08153
17526I381J01849J50490H3342R6858K38199c90072a28282C5953K99947A40554
$$ y = [402042, -211049, 267565, -344188, -187003, -6068, -86999, -120509, -254252, -53614, -190621, -208366, 114764, 113305, -337228, -158173, -37127, -82558, 67683, -39979, 384565, 76926, 178550, -107269, 141491, -72635, 133960, -239991, -22253, -135501, 45423, 40882, -11619, -51985, 263320, 130787, -107535, 397495, 52332, 43587, -207149, 29335, 226335, 269699, -7137, -92705, 96555, -328582, -173924, 227881, -116780, 113509, 255168, -29696, 351711, 176484, 50338, 20236, 35052, -213697, 42528, 187674, 183718, 322459, 192759, -27925, 137864, 237594, 96416, 127880, 508432, 135634, -96668, -136033, 217971, 144608, -33413, -226618, 108153, 9381, 111230, 261720, 83342, 180200, 418399, -390072, -128282, 35953, 335900, 140554]
17515B16108f7344B29603H6706Q6434m1305J74631a08205I6219J7677K66795i5482
17503D8592L13321j35123R4322F6379j6046J03475k241J19318m9211H920c22756
17491a15391D6977K74108N7177K1494j07622A32872n7016C1197L83680j62055
17481B52822N6973J89276A31273J0135J92770I5989L39733B08046q4115j9045
17471A04886K31011j32458a23611N934B80330m9453L9682C8196J00777L32378
17461D71351H7513P3634K39009a60975C11104j3952P1635G4957e0452A58192L6463
17450A94655J87274j75852J41529J03505j5130k00057J78687D7863M71387n8032
17440D61218K0565o4712A71195N08432k48566j81130n3755n4977L15973l6831
$$ y = [216108, -67344, 229603, 86706, 173140, 131835, 306466, -108205, 96219, 113896, 380691, -95482, 48592, 361913, 226790, 321112, 66379, 50333, 153808, 151567, 270885, 221674, 8920, -322756, -115391, 46977, 321085, 378262, 399756, 292134, 132872, 75856, 31197, 414877, 252822, 309795, 499071, 131273, 141408, 334178, 95989, 435722, 208046, 123931, 104886, 335897, 203439, -123611, -117677, 280330, 230877, 270559, 38196, 138973, 471351, 87513, 161147, 400156, -160975, 311104, 297152, 368787, 74957, -50452, 158192, 194655, 381929, 206077, 347606, 451111, 435981, 235924, 414611, 47863, 519250, 461218, 481783, 417071, 171195, 679627, 431061, 249931, 196176, 141199, 457172, 420341]
17430D20341J0244j63898j27024J86143b43234A76914J20027A16169N61716j30324
17420E47561k26112K06436j70495J30225r1445l9929J35663Q9248j00398j09556
17410C71198K67224k87178a06009F507J41512F3588K9085J62798I4790K14221
17400C09011B5535K8535L37486j10267A37532J1913M892L7551B2933a38149C69245
17388C74012c2568A85609J26591j37108j6357l6814c9966C36425n9155A33090
17377A63980J877P4547k1940M8475O1704K5232C520L50072j24437m9281j5269
17366A64605o6160Q7586J86392I7008i570A2022L50607I0478K85254k0138A59567
17354B14842G3507N5067a5622D43782B00139L19374j28836l9743r5617m998a2560
$$ y = [420341, 430585, 266687, 139663, 325806, -243234, 176914, 296941, 116169, 677885, 547561, 321449, 527885, 357390, 487615, 396170, 356241, 491904, 581152, 480754, 371198, 638422, 351244, -106009, 6507, 148019, 63588, 92673, 255471, 94790, 309011, 25535, 54070, 391556, 281289, 137532, 149445, 154337, 191888, 22933, -138149, 369245, 374012, -32568, 185609, 312200, 175092, 158735, 121921, -39966, 336425, 277270, 133090, 163980, 165857, 240404, 218464, 266939, 328643, 353875, 3520, 353592, 229155, 179874, 164605, 98445, 186031, 372423, 97008, -9570, 12022, 362629, 90478, 375732, 355594, 159567, 214842, 73507, 128574, -15622, 443782, 200139, 519513, 390677, 350934, 255317, 250319, -12560]
17342A13715Q6698l4778J24042K6612j9470P0115j11440A19130K97025A03364
17331C62195A70915L7313J37818F3449K82918I4115J35871A05910J47576G5540
17320a93300E0652K01734J03k1815j09387J52555A32187J9226C3276L38402b59523
17308B79728j22011K90910A77659l1782k2584f1285L0129C50433o4358R9745j60087
17297B25733I4270D3227J15519D4864J71747P5930c870A59660O7073E5918K18982
17286B74900K79732B26311B8691K62344H8050K43104C3420L16262A30831J40279
17276B71110Q4466A11934L00442i1327B51437j19500K72142n2962j28880J80733
17266D02970D4961k1345L2798J66938J36949A39524K60425m3190c1298E31172
$$ y = [113715, 200413, 165635, 289677, 316289, 296819, 366934, 255494, 119130, 416155, 103364, 362195, 170915, 208228, 346046, 63449, 346367, 94115, 229986, 105910, 253486, 75540, -193300, 50652, 252386, 252489, 230674, 121287, 273842, 132187, 151413, 33276, 371678, -259523, 279728, 157717, 448627, 177659, 145877, 123293, -61285, -31156, 350433, 286075, 385820, 225733, 94270, 43227, 158746, 44864, 216611, 292541, -3870, 159660, 226733, 55918, 274900, 554632, 226311, 28691, 291035, 88050, 331154, 33420, 349682, 130831, 271110, 355576, 111934, 412376, -91327, 251437, 131937, 404079, 351117, 222237, 402970, 44961, 23616, 56414, 223352, 360301, 139524, 399949, 356759, -31298, 531172]
17255a91337A76417D1273K67543C5960K47318n6210R1287j42246k3273L4427M0658
17244B27921J26446H8693Q8914d3440C56698o8274i3389D89010A89808G8694K33114
17233C11808K9041j36780J2961o8533J21634K8714e3958B60521j11196g4737B58699
17221A1280P6671K08898b99141B43131d4011D76420j06286J354p0234o873i8490
17209D39643k7778e7874E46205A44275J00938K65309B34389D1592K23186r3062
17199A71716J52834j26037J41279K71732I0560J15872l3248J13953K98780k24305
17189C61612m425j01682J89577P4762j33047e8827B92518p1077A09655K89900
17179C99555J12804r241B09959K59123j91969j33763M47618K9583A27224L34739
$$ y = [-191337, 176417, 41273, 308816, 35960, 283278, 227068, 318355, 176109, 152836, 187263, 227921, 354367, 88693, 177607, -43440, 356698, 288424, -93389, 489010, 189808, 78694, 311808, 340849, 204069, 217030, 148497, 270131, 298845, -53958, 260521, 149325, -74737, 258699, 11280, 87951, 296849, -299141, 243131, -44011, 476420, 370134, 371488, 301254, 294381, -98490, 439643, 411865, -57874, 546205, 144275, 245213, 510522, 234389, 41592, 264778, 171716, 324550, 198513, 339792, 611524, 90560, 206432, 173184, 287137, 585917, 361612, 357187, 255505, 445082, 519844, 386797, -58827, 292518, 221441, 109655, 399555, 512359, 503118, 209959, 469082, 277113, 143350, 590968, 620551, 127224, 461963]
17169D61963j26896K07057A07959O6531M41130J38337A03247J01529K53601A48682
17158F88548C42115b0166D69105L5055G5943J14165O8662Q9311p8496M5064K36032
17147E50681J42569j99909A89337K05226p6487q5729J81156j92307P9073L58327
17137F58596k85440K21687k16970K32634k26518A50355K28111A58519K31152r4239
17127B95432j03364K73601k05321l7693O31601m21994R4756j22157J6164k1591
17117C99434J56171j01648J29305j02565K10184H6509O70610n3967A74567J73154
17107C47721M2035k271j46147K79962j2876q4376K1303B18645J98351j077j08012
17096C07907M6522L9763p2826K29417K75832k95919R3000B63284L56780P7958
$$ y = [461963, 335067, 542124, 107959, 174490, 615620, 753957, 103247, 204776, 458377, 148682, 688548, 342115, -20166, 469105, 504160, 75943, 190108, 258770, 348081, 269585, 314649, 550681, 693250, 493341, 189337, 394563, 318076, 232347, 413503, 221196, 300269, 658596, 373156, 594843, 377873, 610507, 383989, 150355, 378466, 158519, 389671, 295432, 192068, 465669, 260348, 222655, 854256, 432262, 527018, 404861, 421025, 399434, 555605, 453957, 583262, 480697, 690881, 86509, 757119, 703152, 174567, 347721, 389756, 387485, 241338, 521300, 508424, 424048, 445351, 218645, 416996, 415919, 307907, 354429, 394192, 321366, 550783, 826615, 530696, 623696, 263284, 620064, 698022]
17086F98022j33973K4370j30141m7429J58323J07960N7750j89636J1605M1945
17076E98796K09533l03367l4618J86366K30035m07830J23490M8189k61253p7456
17066C11885K00832J90842q2049J55778k71216k17356N15368j57417j7544j77113
17056D52010K40455r5199j32329M34839k56480k41440o022P5044J64566J861j65641
17045D71664O04115E09409M26123j08845j79045j7946J34315l3571r2853J80628
17035H18215C06204L59541K96269D64512K27061k75073K58313j90310K52040L6612
17025G73155j77123j04990K59702L2378M0457j16684j31352J17292R0453k6369
17015G56919P1977n0334k2870K61416j67929k36524K49635k7108l25479J78479
$$ y = [698022, 564049, 588419, 458278, 410849, 569172, 677132, 734882, 545246, 556851, 598796, 808329, 504962, 470344, 656710, 886745, 478915, 602405, 650594, 389341, 311885, 512717, 703559, 621510, 777288, 506072, 288716, 804084, 646667, 629123, 452010, 692465, 597266, 464937, 899776, 643296, 401856, 395834, 470878, 635444, 637305, 471664, 1075779, 509409, 935532, 826687, 647642, 629696, 764011, 730440, 637587, 818215, 306204, 665745, 962014, 464512, 691573, 416500, 674813, 484503, 736543, 773155, 596032, 491042, 750744, 783122, 823579, 706895, 575543, 692835, 783288, 756919, 828896, 778562, 755692, 1017108, 849179, 612655, 862290, 835182, 509703, 688182]
17005F88182J92389L38014j77471j01531k9067l52680N49402k86659r2827L25393
16995A053145l87701R0192J93477O9189J86069n84920M78383M6885k85368j10212
16985G49139J96204J170L0502j36049L09909L02779l28922j36410L21149j44814
16975A164657j04247l8520j49323J19580m5224M7173L83167k21197J99965n17714
16965H38317K35676K28648M6952k87819K43780r8373j83485R2212J66274k56351
16955A025831K05664J70661n5856j20956M28323l64670K048M115M0291J12219
16945A447670l22850K49409J34400k1883k97241R63658p17589J78682l88944K50333
16935A475645n9257j06347L5075P0675J48958j58717L3547j7547O9084J09462
$$ y = [688182, 880571, 1218585, 1041114, 939583, 910516, 557836, 1107238, 820579, 727752, 1053145, 665444, 755636, 949113, 1018302, 1204371, 619451, 1097834, 1144719, 859351, 749139, 945343, 946513, 977015, 840966, 1150875, 1453654, 1124732, 988322, 1309471, 1164657, 1060410, 1021890, 872567, 992147, 946923, 994096, 1377263, 1156066, 1356031, 838317, 1073993, 1302641, 1349593, 1061774, 1305554, 1207181, 1023696, 1115908, 1282182, 1025831, 1231495, 1402156, 1346300, 1225344, 1653667, 1288997, 1291045, 1295160, 1335451, 1447670, 1124820, 1374229, 1508629, 1486746, 1189505, 2153163, 1435574, 1614256, 1225312, 1475645, 1416388, 1310041, 1345116, 1415791, 1564749, 1406032, 1439579, 1422032, 1491116, 1600578]
16925A600578K59795k29632J74715j18443p5320j54201K36039P7327j96373J59175
16915A733660J21773l39940J34101Q0105j04396N9386J97579m975l36744O48661
16905B189210j16425l15343K53716J97364l14065J2726P4488J25388j82273Q0836
16895B005622K14156J9430k35430K15700j34098J73628N3469n9599j60671K53202
16885B345409Q1344k49880K87378j05441l2753J56438l01079L07180K57811M3048
16875B789455j19638J76331J57328k34557J13710k7395j1459L48027m0463q4940
16865C066399K02847o5112l85223K00794L49416j65546l0078M17545m70463N24409
16855C644988n48116L7555N61101k16049J19491J55935k27727N75560k99566n42578
$$ y = [1600578, 1860373, 1630741, 1805456, 1687013, 1611693, 1457492, 1693531, 1770858, 1574485, 1733660, 1855433, 1515493, 1649594, 1729699, 1625303, 1684689, 1882268, 1877293, 1540549, 2189210, 2072785, 1757442, 2011158, 2208522, 1894457, 1907183, 1981671, 2107059, 1924786, 2005622, 2219778, 2239208, 2003778, 2219478, 2085380, 2259008, 2312477, 2252878, 2092207, 2345409, 2426753, 2176873, 2464251, 2358810, 2326057, 2482495, 2181416, 2488596, 2746407, 2789455, 2669817, 2846148, 3003476, 2768919, 2882629, 2855234, 2843775, 3191802, 3151339, 3066399, 3269246, 3204134, 2818911, 3019705, 3369121, 3203575, 3173497, 3591042, 3120579, 3644988, 3096872, 3134427, 3695528, 3479479, 3598970, 3754905, 3527178, 4102738, 3803172, 3260594]
16845C260594N40851K5673K08419J18865K48414K16486p8205J90445m06203R7172
16835D422511J95918J44082l43528L91414L64559j09363q5117L39797O8012J83190
16825E571475j93757M22005j51676J98798K52460m03403O24369j68625M26732
16816F578378j32551J12102N958l0601O41586l34275M16103m070K44608J03617
16806G600855K96281q5911R5152M29660K95034L31887j41838L41357O46977m51296
16796I358158K14679M60241M70027J36061K78567K19719J85955L18797L50386
16787A1992590M483Q30801j40632N13749N54651K19629M78480K72930N98637L92817
16777A5718135N69372J19887P38224K01435O38961L26372R24502O30962P63714
$$ y = [3260594, 3801445, 3827118, 4035537, 4154402, 4402816, 4619302, 4541097, 4731542, 4325339, 4422511, 4618429, 4762511, 4418983, 4810397, 5174956, 5065593, 4980476, 5320273, 5388285, 5571475, 5377718, 5799723, 5648047, 5846845, 6099305, 5695902, 6320271, 6151646, 6578378, 6445827, 6557929, 6563887, 6533286, 7174872, 6840597, 7256700, 7252630, 7497238, 7600855, 7897136, 7811225, 7906377, 8336037, 8631071, 8962958, 8821120, 9162477, 9809454, 9358158, 9572837, 10033078, 10503105, 10639166, 10917733, 11137452, 11323407, 11642204, 11992590, 11997073, 12827874, 12687242, 13200991, 13755642, 13975271, 14453751, 14726681, 15325318, 15718135, 16287507, 16407394, 17145618, 17347053, 17986014, 18312386, 19236888, 19867850, 20631564]
16768B0631564N22804P69971Q72447N82204J079303L61537R32002J210402J206016
16759B8168250J017604R09354J752412J227725J475485J414245Q80665K057255
16751C8902995J778451K191798J881470J937528K038007K607529K490051K614627
16743E6442456K996313K980486L163921L629545L972550L924921L886544M998044
16735H5994780M792315N285561N548331N760269N956138O302033O910970O800462
16727A33350859P054423O804427P042752O849992O527887O398798N850797M682260
16719A84562195L681291L522603J531210N74752q55779j411864l510396l558349
16711A84535663n160003n946655o274235o569109p439942p205574p570033o856291
$$ y = [20631564, 21154368, 21924339, 22796786, 23378990, 24458293, 24819830, 25751832, 26962234, 28168250, 29185854, 30095208, 31847620, 33075345, 34550830, 35965075, 36845740, 38902995, 40681446, 42873244, 44754714, 46692242, 48730249, 51337778, 53827829, 56442456, 59438769, 62419255, 65583176, 69212721, 73185271, 77110192, 80996736, 85994780, 90787095, 96072656, 101620987, 107381256, 113337394, 119639427, 126550397, 133350859, 140405282, 147209709, 154252461, 161102453, 167630340, 174029138, 179879935, 184562195, 188243486, 191766089, 193297299, 193872051, 193016272, 191604408, 188094012, 184535663, 179375660, 173429005, 167154770, 160585661, 153145719, 145940145, 138370112, 131513821]
16703A31513821p206678o623074o774602o254483n970493n839107n348513n068098
16695H2428773m703293m525750l679773l967367l494980l617459l305063k351542
16687E2783546l231660k522060k418352k278097j794525j939496j882199j592892
16679C5124265j609553j628175j321179j435029j071740j026776j405848r50759
16671B4675206r95880r07647r67458o29617r91808p22572o64003o31357p87661
16662A7377203o90565l19189j113108k03285p78422J04475p62221n02561l73926
16653A2738401j03433m23831l98833j013669J9446N7298k27307q02638M09781
16644A0255215q30826k18973j31361n2702k73364l62648m89249j68211P9064m42870
$$ y = [131513821, 124307143, 117684069, 110909467, 104654984, 98684491, 92845384, 87496871, 82428773, 77725480, 73199730, 69519957, 65552590, 62057610, 58440151, 55135088, 52783546, 49551886, 47029826, 44611474, 42333377, 40538852, 38599356, 36717157, 35124265, 33514712, 31886537, 30565358, 29130329, 28058589, 27031813, 25625965, 24675206, 23679326, 22771679, 21804221, 21174604, 20182796, 19460224, 18796221, 18164864, 17377203, 16686638, 16367449, 15254341, 15051056, 14272634, 14377109, 13614888, 13112327, 12738401, 12634968, 12211137, 11812304, 10798635, 10818081, 10875379, 10648072, 9845434, 10255215, 9424389, 9205416, 9074055, 9021353, 8747989, 8385341, 7896092, 7727881, 7806945, 7364075]
16634G364075K56252n60991n85045M64095k95965l6104l78486m16481j29086M24440
16624F106704p21349K92053k41520K5250m19697J49463n0238l01542J05234j25961
16614D818397o09737L47316j51573K33960n27505K85899j88463P3741k12225k82109
16604C787701r1263k95108K02249j46711J29896j77485m245k99278K5305M4673
16594C175734m26923L73633j77166j04815j07357K62160j56109K07993m70770
16585B576380r9714J35642P5752j68426j84754K70745l78501L33601j36481l53889
16575B070355M72298m07455q9602L8466m06397L28288N42451p46663J19401J12436
16565B033578j40003n3047k2686J59578o3536M31893m33406j98493J47852j35946
$$ y = [7364075, 7620327, 7059336, 6474291, 6938386, 6642421, 6606317, 6227831, 5811350, 5682264, 6106704, 5385355, 5677408, 5435888, 5461138, 5041441, 5190904, 5140666, 4839124, 4944358, 4818397, 4208660, 4555976, 4404403, 4638363, 4110858, 4396757, 4208294, 4282035, 4069810, 3787701, 3696438, 3401330, 3603579, 3456868, 3586764, 3409279, 3405034, 3105756, 3131061, 3175734, 2748811, 3122444, 2945278, 2840463, 2733106, 2995266, 2839157, 3047150, 2576380, 2476666, 2612308, 2688060, 2519634, 2334880, 2605625, 2227124, 2560725, 2424244, 2070355, 2542653, 2135198, 2045596, 2084062, 1677665, 2005953, 2548404, 1801741, 1921142, 2033578, 1893575, 1840528, 1817842, 1977420, 1913884, 2345777, 1912371, 1713878, 1861730, 1725784]
16555A725784m0954J83912l05621j92318k841J35847j35964L44118j45764j140
16545A565059j82787j43378L87814k81681o951j48506K73611l4960O675r1378
16535A343518M1195j89915K17585j21382k72644M5106k1945J21834j08793J10127
16525A164686J54329j67400j01662L17868l32024l811J67421j24581P9046n37867
16515F16005L19945J16945k97606L89837l43577O4897R5526l03767M1632L25052
16505A024889l02528Q984K37816k12977k729j31754L33313J24628m21072J00190
16495G58760J49704k33555M00592l22603k33756J7970K58584j0035m9381o5881
16485F70399j82014o8687J62854o6066K43834k13396B71971J90829J6189j5744
$$ y = [1725784, 1684830, 1868742, 1563121, 1370803, 1367962, 1503809, 1367845, 1711963, 1566199, 1565059, 1382272, 1238894, 1626708, 1345027, 1338076, 1189570, 1463181, 1428221, 1434896, 1343518, 1384713, 1194798, 1412383, 1291001, 1018357, 1063463, 1041518, 1163352, 1054559, 1164686, 1319015, 1151615, 1049953, 1367821, 1035797, 1031986, 1199407, 1074826, 1153872, 616005, 935950, 1052895, 755289, 1145126, 801549, 866446, 961972, 658205, 699837, 1024889, 722361, 731345, 969161, 756184, 753455, 621701, 955014, 1079642, 658570, 758760, 908464, 674909, 1075501, 752898, 519142, 537112, 795696, 785661, 736280, 670399, 488385, 419698, 582552, 516486, 760320, 546924, 271971, 462800, 478989, 463245]
16475D63245K16092r6558J17899l15802K30007L13890l76729K9769B58693M52651
16465G11344j79330B32602N25146k42091m7440K67866n1974l21570j72450K30629
16455D20718A09554M58137P187J48948K9720k68549p5544J16438r9723q2472K47572
16444E91268F6094M00911J18100M4269j12409j98554J60916j84052L9543K27862
16434E62680K2480L46518I4068J38761J26384m4870J82950J38863A87594M35395
16424F22989k79393k4298e3012A12297K18957r1516J46368L9584D4621L07549
16414C52170A09108J35593J24543K18238R8799A97698J23986H5506d1509E16688
16403B70821K19409j87433I2879J55441J69945A10002J87948J67075A70021A6992
$$ y = [463245, 679337, 582779, 700678, 384876, 614883, 928773, 552044, 581813, 258693, 711344, 532014, 232602, 757748, 515657, 468217, 736083, 684109, 362539, 190089, 420718, 109554, 567691, 574878, 723826, 753546, 484997, 409453, 525891, 426168, 343696, 591268, 66094, 467005, 585105, 629374, 516965, 318411, 479327, 295275, 334818, 562680, 585160, 931678, 94068, 232829, 359213, 314343, 497293, 636156, 187594, 622989, 343596, 319298, -53012, 112297, 331254, 239738, 386106, 425690, 44621, 352170, 109108, 244701, 369244, 587482, 686281, 197698, 321684, 85506, -41509, 516688, 270821, 490230, 302797, 92879, 248320, 418265, 110002, 297950, 465025, 170021, 16992]
16392F1792K39348m6940j18790o2080P4583N7658L33902B55882R2424C2790K83818
16381C16608O1473j83747J2935r8053E4451N14652A11157N588Q8419K45523m9284
16370D01403j17138a5280D13239F1196J56574J8335d4389B92267K413N2271J85
16359C47136G1434a58625A05586a06915A92842a20741B61416K85360j61270A70395
16348d1904B18700p8922P060k7875P3898a0640A04638N09382A62838m9007a85236
16336A07642J8086K36135A46847J51980A22809L55858A24935K26817M7103b39091
16325h5466F4650L07859A70712K5963J71267i4821C82516j56066L5826a97441
16314A00833a4415D2801K77310a60984C31025f0570B91490d831A10377L47034
$$ y = [61792, 301140, 254200, 135410, 73330, 147913, 205571, 539473, 255882, 348306, 32790, 316608, 378081, 194334, 207269, 109216, 54451, 569103, 111157, 116745, 205164, 450687, 401403, 284265, -15280, 413239, 61196, 217770, 236105, -44389, 292267, 294680, 346951, 347136, 71434, -158625, 105586, -106915, 192842, -120741, 261416, 546776, 385506, 170395, -41904, 218700, 139778, 146838, 118963, 192861, -10640, 104638, 614020, 162838, 113831, -185236, 107642, 125728, 361863, 146847, 298827, 122809, 478667, 124935, 351752, 398855, -239091, -85466, 64650, 372509, 170712, 196675, 367942, -94821, 382516, 226450, 262276, -197441, 100833, -14415, 42801, 320111, -160984, 331025, -60570, 291490, -4831, 110377, 457411]
16304D57411p9893J05938E9696i0005B00115N4019k3623a70387C77594a48326
16293D08388l7124a97505B64383J03322h5087c2790j23713D7959J67929B311L46504
16282C48815A10858l2208J72646I2289J44706a01499A07162M4355k6703j5548
16272A09266m7626b72284g4540l77011d5937E41966A69202a2112D3254B0272b79116
16260A32844c7249k35846B66603a15327m5431B98609D859J01806l3099a53759
16249C89926h869r5531j62551F4063M2644a28940m3542f4502B26094C3608e4844
16237A63496b21127B75140d7187F643a65267A03734b29252G7626M0939a46838
16226I7020J40813E0500J8909g4308k70286I9118H827J47510b02653A2209b71722
$$ y = [457411, 377518, 483456, 59696, -90005, 200115, 254134, 230511, -170387, 377594, -148326, 408388, 371264, -197505, 264383, 367705, -85087, -32790, -156503, 47959, 215888, 2311, 348815, 110858, 78650, 251296, 92289, 236995, -101499, 107162, 151517, 124814, 109266, 61640, -272284, -74540, -451551, -45937, 541966, 169202, -12112, 43254, 20272, -279116, 132844, -37249, -273095, 266603, -115327, -160758, 298609, 4859, 106665, 73566, -153759, 389926, -8869, -104400, -266951, 64063, 106707, -128940, -172482, -64502, 226094, 33608, -54844, 163496, -221127, 275140, -47187, 6643, -165267, 103734, -229252, 77626, 118565, -146838, 97020, 237833, 50500, 69409, -74308, -344594, 99118, 8827, 156337, -202653, 12209, -271722]
16214E7335i5860B25676K08186b91129I4618c39262J42677g9025j25417k27803
16204d32245J49383a05046b5326I6984O4961F9981P6810L7868c1991j1866A84942
16192A27501a86368D4880L21147b4578B06390h5981A5414g2271A90511b42649
16181A54290J29438b5857A54062b1550m7606A92292F7033b14572A70220p5568
16171I4652L49704a07647q1413c4415D5813Q9983m9011a41003A22674n4050B9652
16159B2973c22350h0786C2262O4564l1900B388M6284a73416A27261J1469a53584
16147B5491J04991b33448B1671g7675A53264a90327D04751j08801j7002f9083
16136c60435C23155a86528f4056j27374K9709C34797a40131B16948G4240e5080
$$ y = [57335, -95860, 225676, 433862, -291129, 94618, -339262, -196585, -79025, -204442, -432245, -282862, -105046, -25326, 96984, 161945, 69981, 146791, 184659, -31991, -43857, 184942, 127501, -186368, 44880, 366027, -24578, 206390, -85981, 15414, -72271, 190511, -242649, 154290, 283728, -25857, 154062, -21550, -69156, 192292, 67033, -214572, 170220, 94652, 444356, -107647, -189060, -34415, 45813, 135796, 86785, -141003, 122674, 68624, 29652, 22973, -322350, -80786, 32262, 96826, 64926, 2388, 48672, -173416, 127261, 138730, -153584, 25491, 130482, -233448, 21671, -77675, 153264, -190327, 404751, 295950, 278948, -69083, -360435, 323155, -186528, -64056, -191430, -161721, 334797, -140131, 216948, 74240, -55080]
16125c8552A01890J36945A2260f1043B2777a53590A40380k3910a94327b6925k38241
16114b65166c0617F9231j2388k0819b9984C9819m076J06031J23298a30044K5268
16103a04776B92908K8956J0422j52830a98176F1884a70143A43891J0725e1156
16092a8297k5181A95475N5348I2745b71597a23983o4204H201N2561k9585c7551
16080c5580j85311a05250L1171p7090A99127G3342a36926a5291C5510b01170A80251
16068A54813C9114J69585j02396p685R5322e0220k58852G8950a9642L183l34630
16057c51089F8292C1818f1716A48229i9377j18970b3175A26420E4172L3068c5621
16045A21719f9794j60793k4841g7196C9370b37200A80146b5282l0605r8524A38472
$$ y = [-38552, 101890, 238835, 12260, -61043, 22777, -153590, 140380, 116470, -194327, -26925, -265166, -30617, 69231, 56843, 36024, -29984, 39819, 35743, 141774, 265072, -130044, -104776, 292908, 321864, 332286, 179456, -198176, 61884, -170143, 143891, 154616, -51156, -18297, -43478, 195475, 250823, 92745, -271597, -123983, -188187, 8201, 60762, 31177, -37551, -35580, -220891, -105250, -74079, -151169, 199127, 73342, -136926, -15291, 35510, -201170, 180251, 154813, 39114, 208699, 106303, 98618, 193940, -50220, -309072, 78950, -19642, -16459, -351089, 68292, 31818, -61716, 148229, -99377, -218347, -23175, 126420, 54172, 87240, -35621, 121719, -69794, -230587, -255428, -77196, 39370, -237200, 180146, -25282, -55887, -154411, 138472]
16033F3712J16174a30714N9909j33070C84823b51095A33212C4827J51415b18374
16022b57887O1446M1143j72437A34613A145a7657A68808a79127A45035a48399
16011c4159k41481f3984A15057i2944d0179c671l96203J16123A4969a31037l0753
16000a61790A7547a09148D317J6563L1703a93207A10103f2209r1819A89147L08956
15989D98103B3862L421a13322A57486g159A65883J3031L49532j35111j09963l9682
15978B43690o7785N7228N9344b40394A53747N7616K0146h7582B06991c23202A82382
15966g6084I7679J40958I3404J51212e9612q6263B33281f1002j24260A45012K754
15955A47766J1768a78347g6607j81955d5694A13234h1262F0098e0801b4340l8145
$$ y = [63712, 179886, -130714, -70805, -203875, 384823, -251095, 133212, 34827, 186242, -218374, -257887, -196441, -155298, -327735, 134613, 1145, -17657, 168808, -179127, 145035, -148399, -34159, -275640, -63984, 115057, -92944, -40179, -3671, -399874, -283751, 14969, -131037, -161790, 17547, -109148, 4317, 20880, 52583, -193207, 110103, -62209, -154028, 189147, 498103, 23862, 27283, -113322, 157486, -7159, 165883, 178914, 528446, 393335, 283372, 243690, 175905, 233133, 292477, -240394, 153747, 211363, 231509, -87582, 206991, -323202, 182382, -76084, 97679, 238637, 93404, 244616, -59612, -145875, 233281, -61002, -185262, 145012, 147766, 159534, -178347, -76607, -258562, -45694, 113234, -81262, 60098, -50801, -24340, -62485]
15944f2485j47323G7651P9667b80836c8476j46741K4912K9428G3646G126N8405
15933F5531e2324j31358m5165L5964a0989B2976c92542J52763F8579d6073k38844
15922b84917h3325j5713A1643b94520B1322J67838d36229h3678A40706B9618b15430
15910A00963a19775A14915R9570a09202r1937P4536q1663B8386h4073K754A7846
15898A45573f408B31547F672a55274m7215A59515d5134C5991J47092b5159l58085
15887c83244J72330B19074K9708j09383d8650B0316J65759J14384a9190m5939
15877f5129A26791M6772a56104I1302K24814b20757j72156L0759J76906A58701
15866A4742R6236k0296J40349a70393g5821p3898l36261G3014g9970A44188B8842
$$ y = [-62485, -209808, 77651, 157318, -280836, -38476, -185217, -160305, -130877, 73646, 7126, 65531, -52324, -183682, -228847, -192883, -10989, 22976, -392542, -239779, 68579, -46073, -284917, -83325, -99038, 11643, -294520, 21322, 189160, -436229, -83678, 140706, 29618, -215430, 100963, -119775, 114915, 214485, -109202, -201139, -126603, -208266, 28386, -84073, -81319, 17846, 145573, -6408, 231547, 6672, -155274, -202489, 159515, -45134, 35991, 183083, -25159, -383244, -210914, 219074, 248782, 139399, -48650, 20316, 186075, 300459, -19190, -65129, 126791, 173563, -156104, 91302, 316116, -220757, -392913, -362154, -185248, 158701, 14742, 110978, 90682, 231031, -170393, -75821, -149719, -485980, 73014, -79970, 144188, 28842]
15854A25164b16289R9062A76456D3277a49682A81980n6105h1766m3295E8441f32674
15842a0377j45282p1616A45018a32745f73B4633a54166A26618b55224e3122k03846
15831b56968B74298A1667J24977a61728M7062r719k31964A1063a7715k00993a03551
15819A76739J52171b5180q3820k39553F1947d8368C33009A14698h9856A19374
15808b36885c8014m7264A40150Q5490m6576a98934A97809J80046E484K0521K90098
15797C16103a66615A89062a38462F1244c932A82354h7017A34820c7624n2077g845
15785H228K9373L6590b1692A59925A0000J05013a86018r2181A68054E0053f3999
15773e4167k301a0860o7372j54254h3448h707A70013a3878B355P9344R1699D2401
$$ y = [125164, -216289, -117227, 176456, 43277, -149682, 181980, 125875, -81766, -125061, 58441, -632674, -10377, -155659, -227275, 145018, -132745, -673, 24633, -154166, 126618, -255224, -53122, -256968, 274298, 11667, 136644, -161728, -114666, -124385, -356349, 11063, -17715, -218708, -103551, 176739, 328910, -25180, -109000, -348553, 61947, -48368, 333009, 114698, -89856, 119374, -236885, -38014, -85278, 140150, 225640, 179064, -198934, 197809, 377855, 5484, 26005, 316103, -166615, 189062, -138462, 61244, -3932, 182354, -87017, 134820, -37624, -89701, -7845, 8228, 37601, 74191, -21692, 159925, 10000, 115013, -186018, -278199, 168054, 50053, -63999, -54167, -56468, -10860, -78232, -232486, -83448, -8707, 170013, -13878, 2355, 81699, 173398, 42401]
15760F8919b49935c2077l3696B09982o4190j9551Q9889e148j1349A37546C4443
15748A67628M4638b28674o4706C32409B7613a10873B03133H1297b8609n2493B70950
15736a00075p6507G7122c04310A4293J76804h7163j42258h6327A48796D441g9561
15724A36080a7300k51879Q0896G4197J49296H210e32792b56164K8879A76487a04686
15712d6149k77109C40994a63843p9636B9306b11071k19118A32202f9529a5610
15701d5800A94250d8466F5402B855a43294j8987C91020G4331b16123J6935R7522
15690a01666E7622a6056A35675P2562K1197i535l76347J83035C1877c76010a35751
15678b30862j55668B49459h9233j78497c7916A41893M8003L0591m1696K25229
$$ y = [68919, -249935, -32077, -65773, 209982, 145792, 126241, 216130, -5148, -16497, 137546, 34443, 167628, 212266, -228674, -293380, 332409, 27613, -110873, 203133, 81297, -28609, -81102, 270950, -100075, -176582, 77122, -304310, 14293, 191097, -87163, -229421, -86327, 148796, 4441, -79561, 136080, -17300, -269179, -188283, 74197, 223493, 8210, -532792, -256164, -227285, 176487, -104686, -46149, -323258, 340994, -163843, -243479, 29306, -211071, -430189, 132202, -69529, -15610, -45800, 194250, -48466, 65402, 2855, -143294, -162281, 391020, 74331, -216123, -199188, -101666, 57622, -16056, 135675, 208237, 229434, -9535, -385882, -202847, 31877, -376010, -135751, -230862, -386530, 249459, -89233, -267730, -37916, 141893, 189896, 220487, 178791, 404020]
15668D04020B6761a71056C6056h7887G9768b44011j1858A32042k3961a55556j26018
15657b81574R9583B83339A41627a57069N7303j83475R3466K9438F1684P3714O7092
15646B02490b9970E4480b00910B70213P6444e024A1011K77620i0928m2118f071
15634g2312c5015G4273K2571b0604B3220N8194g0147G8479K7766F61K59769a35113
15621i895B993N81847B0559b52318B52858a22809B71698g156p2335L6414C5652
15609a05004B5113h1734k10586b4873j87439B05363h3458A4153K60782d43131
15598B14007a12400j38156E524c6001K469B0131Q3631c01994g9573A1421b2390
15586A33897b37191a6337j70353A07411i6922p4617j2924A14735b88608C4750
$$ y = [404020, 26761, -171056, 36056, -87887, 79768, -244011, -255869, 132042, 108081, -155556, -281574, -181991, 283339, 141627, -157069, -99766, -283241, -189775, -160337, 61684, 135398, 202490, -29970, 54480, -200910, 270213, 346657, -5024, 11011, 288631, -90928, -133046, -6071, -72312, -35015, 74273, 96844, -20604, 23220, 81414, -70147, 78479, 106245, 661, 260430, -135113, -9895, 2993, 584840, 20559, -252318, 252858, -122809, 271698, -7156, -79491, -43077, 35652, -105004, 25113, -81734, -292320, -24873, -212312, 205363, -83458, 14153, 274935, -443131, 214007, -112400, -250556, 5524, -36001, -33532, 20131, 103762, -301994, -79573, 11421, -22390, 133897, -237191, -16337, -186690, 107411, -96922, -171539, -184463, 114735, -288608, 34750]
15575b76016a03979A17702J18159J13247G3992K02103a12506j44912B2789a9054
15564a23016e3696G6678K76966A71329a7817o5687I148J50532c05957J04270j41524
15553c43211J27852F9563K71606q5617h1635a657A06351d5449m9296d6276a2815
15541I5120a57054M3936k32595A14070m6653N1408d326G1221I048M74027k08320
15530B74755E4242K66440a01630k2844A10179a01235e525C26282b66514m5342
15520c11856Q4706B43238G1801a83906B55221K0194g5981I2195C8780g8809o7869
15509a46678B39363E952f1611l0708j02679M0964B09796a34892A45834I135h6017
15497a2529j58265F74O8092d0926C27280a0125m9608F0004b29147E4859e3736
$$ y = [-276016, -103979, 117702, 235861, 349108, 73992, 276095, -112506, -257418, 22789, -19054, -123016, -53696, 76678, 353644, 171329, -17817, -83504, 9148, 159680, -305957, -201687, -343211, -215359, 69563, 341169, 255552, -81635, -1657, 106351, -45449, -94745, -46276, -12815, 95120, -157054, -113118, -345713, 114070, 67417, 118825, -4326, 71221, 9048, 483075, 274755, 54242, 320682, -101630, -124474, 110179, -101235, -5525, 326282, -266514, -311856, -227150, 243238, 71801, -183906, 255221, 275415, -75981, 92195, 38780, -78809, -146678, 239363, 5952, -61611, -92319, -194998, -154034, 209796, -134892, 145834, 9135, -86017, -12529, -170794, 674, 68766, -40926, 327280, -10125, -59733, 60004, -229147, 54859, -53736]
15485D54289A70490J41688A15806a22698B25111H6491J46430A327J36264J11130
15475B48721J5683e3766j21076C5320K70643f9212A59743b58789k9649a1292B46842
15463a47762G854b63200B12152b81831a26646O397K0760B1255a76662A57014R2519
15452B49533a41744B664R5527i6074j84039a33252B10081a05623J2919C89783
15441B82470b22883D04086A5006L4154c5620B28040C4321b23213j73294B11943
15430d0969r5988C0877d22329D7632K40618q5817b75806C83453d4309q822A79777
15418b0144H7673P114b08071j44454A01206A4746J6844f8274C08011b60092D7779
15406b52075J22741j73332c7841A83558a00718K9220p8872m5321k357A03304L03186
$$ y = [454289, 170490, 312178, 115806, -122698, 225111, 86491, 232921, 1327, 137591, 248721, 264404, -53766, -174842, 35320, 305963, -69212, 159743, -258789, -288438, -11292, 246842, -147762, 7854, -263200, 212152, -281831, -126646, -120249, -99489, 21255, -176662, 157014, 249533, -141744, 2664, 98191, -96074, -280113, -133252, 210081, -105623, -92704, 389783, 282470, -222883, 404086, 15006, 49160, -35620, 228040, 34321, -223213, -396507, 211943, -40969, -136957, 30877, -422329, 47632, 288250, 202433, -275806, 383453, -44309, -53131, 179777, -20144, 87673, 94787, -208071, -352525, 101206, 14746, 31590, -68274, 308011, -260092, 47779, -252075, -129334, -302666, -37841, 183558, -100718, -71498, -150370, -195691, -198048, 103304, 406490]
15395D06490A08695D5434b7076G3018A0251d6685j64066A88076g217C8868a62912
15383I6020B3927O8369E873a0399H5732b65699f627A32086a6464j46704B62112
15371B24695i8619n1729C75700E5060K86001c05419C6203a13979B33405C6602
15360a87284B08349g2915C81404j37829K12738a445j70590D9645J82269G5475
15349a68974O2793j48937A29546g9154H3977e2453m7519j04912d447B0068a43291
15337A8968e7000A77178p298i7859A21470g4746m3292A76422F6159J03390L51149
15326E20698i6806B13738C7627L56067a38078p5288C15097f7073B02440b65591
15315C02150q7992I6801b8317E4534Q0679l7145D5080e1925j54731O8205B43640
$$ y = [406490, 108695, 45434, -27076, 73018, 10251, -46685, -210751, 188076, -7217, 38868, -162912, 96020, 23927, 92296, 5873, -10399, 85732, -265699, -6627, 132086, -16464, -163168, 262112, 224695, -98619, -150348, 375700, 55060, 341061, -305419, 36203, -113979, 233405, 36602, -187284, 208349, -72915, 381404, 243575, 456313, -1445, -172035, 49645, 231914, 75475, -168974, -106181, -255118, 129546, -79154, 83977, -52453, -99972, -204884, -4447, 20068, -143291, 18968, -57000, 177178, 169880, -97859, 121470, -74746, -118038, 176422, 66159, 169549, 520698, -96806, 213738, 37627, 393694, -138078, -213366, 315097, -67073, 202440, -265591, 302150, 214158, 96801, -28317, 54534, 135213, 98068, 45080, -51925, -206656, -138451, 243640]
15303D8634f9379l8149A70391G4637k8741J20583g1410A72727k2919J59538q614
15292C00732j29925J5381b41977A90622k7846K0464l3761O7118H0920b78365B64325
15280A036b2991D07744a51150A28789J59007j29013r374G3314E872K62399d0113
15268G6814q286G701d3586A87960J27432H1053B2860g2141B0097c80604A9995
15256a64976K1859B41814I3240b18981C16588n409m5752J62860A76341n3378B7613
15244G43283K9022P24271J566500j020912Q4336J73429H33354l83250A39219K17162
15234C56381n1793p1024A06188P0087A5776c8077a2248j21190C81986A25684Q3455
15223B09139a57926C20040P4310F3619P8003L95470i648l234m542j58609d449
$$ y = [48634, -69379, -107528, 170391, 74637, 45896, 166479, -71410, 172727, 149808, 309346, 300732, 170807, 186188, -241977, 190622, 162776, 183240, 149479, 216597, 80920, -278365, 264325, 1036, -22991, 407744, -151150, 128789, 287796, 158783, 149409, 73314, 5872, 268271, -40113, 76814, 68528, 7701, -43586, 187960, 315392, 81053, 22860, -72141, 20097, -380604, 19995, -164976, -143117, 241814, 93240, -218981, 316588, 311179, 265427, 428287, 176341, 122963, 27613, 743283, 772305, 1496576, 3063076, 2042164, 2126500, 2299929, 833354, 450104, 139219, 356381, 304588, 233564, 106188, 176275, 15776, -38077, -12248, -133438, 381986, 125684, 209139, -157926, 320040, 394350, 63619, 141622, 537092, -9648, -12882, -17424, -176033, -4449]
15211H7392B870f6012B89980b25454C2178O6277J81557J3920j33086j4718c8391
15199C40668a12743I0237C3975c4006A71909C8309A6030P3611J62494c23031a33055
15187B0973J86267C6888J50187C1514Q9146n7417a28275A55503e7841G4264f9728
15175C97273k499r5994a47094A38757F9070K09493A20280b1238D7690J30305i3097
15163d5735j46538C19934j02949j02365a63417c1700A6179e7919D5952d5367m643
15152e0010H5178N1980b88918d8500k1251B40224A19595L0747a3684k96367D62658
15140B03015a06003A8185K65034J08770A87416C7901j6144J2666J38708a63899
15129B0682J56842d2668B05123D8630J07614b67318C84123D0277J79461L9274
$$ y = [87392, 2870, -66012, 289980, -225454, 32178, 98455, 280012, 293932, 160846, 146128, -38391, 340668, -112743, 90237, 33975, -34006, 171909, 38309, 16030, 89641, 252135, -323031, -133055, 20973, 207240, 36888, 187075, 31514, 120660, 63243, -128275, 155503, -57841, 74264, -69728, 397273, 394774, 298780, -147094, 138757, 69070, 278563, 120280, -21238, 47690, 177995, -93097, -45735, -192273, 319934, 216985, 114620, -163417, -31700, 16179, -57919, 45952, -45367, -50010, 85178, 137158, -288918, -48500, -69751, 240224, 119595, 150342, -13684, -310051, 462658, 203015, -106003, 18185, 283219, 391989, 187416, 37901, 21757, 34423, 173131, -163899, 20682, 177524, -42668, 205123, 48630, 156244, -267318, 384123, 40277, 219738, 259012]
15119B59012K08623G5053K32288c083n8349A95698g3034A16402a65660B92318
15108C02294j38147K8366d453B05045L8534n5452C9626J40108L22147A06046K62607
15097C68653D0336K69214E5716a48919A75508J04971H9882J40173J12363M6180
15087C88598A75984m9983a88752D10064b0562i646B53934M637E0369L4867K94458
15076C79694A35688J51186j34257n9343J30069a85425g8304B49130A01146c1330
15065A91315H9210h1009A15750l4703f0759A01150J61347A07014J69576l9896
15055B36694J54061c3811E1366K39281o1103P8066A06617m6523L53213j36660
15045B76647b21418A64148L63754i7345A45605M1334J67356q8490K61015A95326
$$ y = [259012, 467635, 75053, 307341, -3083, -61432, 195698, -73034, 116402, -165660, 292318, 302294, 164147, 192513, -4453, 205045, 243579, 188127, 39626, 179734, 501881, 106046, 368653, 40336, 309550, 55716, -148919, 175508, 280479, 89882, 230055, 342418, 388598, 175984, 126001, -188752, 410064, -20562, -9646, 253934, 258571, 50369, 85236, 379694, 135688, 286874, 152617, 93274, 223343, -185425, -78304, 249130, 101146, -31330, 191315, 89210, -81009, 115750, 81047, -60759, 101150, 262497, 107014, 276590, 236694, 390755, -33811, 51366, 290647, 229544, 307610, 106617, 60094, 413307, 276647, -221418, 164148, 527902, -97345, 145605, 186939, 354295, 265805, 526820, 195326]
15034A41407J52582a8138B62055J3984m1519M6131j28356K58584G9973J22231
15024B02204p4594Q30M31185B71507j19389i653D59824A74895m9297m6340J74349
15013B53607K80521B25648E2361J47623L29928o5935k12122i4851k23600A67859
15002E6343J00551J45068k0217H2031A789K19829p218J11463L7787o6593A19223
14990A53006O1367J09869j2883A39835D6184P197K28078J13937C2518L38039E133
14978G1207b1696B54656J96141A17742K32706K07701e6694D83334j61655J30866
14968D52545A94551K77302k22403K42354A69879R9874F2203M04977P4027j07027
14958D34180A5756L64432A46969J1389p6955O4076q404J1149R8270j07253l659
$$ y = [141407, 293989, -18138, 262055, 276039, 234520, 280651, 152295, 410879, 79973, 202204, 127610, 128440, 559625, 271507, 152118, -9653, 459824, 174895, 125598, 79258, 253607, 534128, 225648, 52361, 199984, 529912, 463977, 251855, -94851, -318451, 167859, 56343, 156894, 301962, 281745, 82031, 1789, 221618, 214400, 325863, 363650, 297057, 119223, 153006, 214373, 324242, 311359, 139835, 46184, 53381, 281459, 395396, 32518, 370557, 5133, 71207, -21696, 254656, 450797, 117742, 350448, 558149, -56694, 483334, 321679, 452545, 194551, 471853, 249450, 491804, 169879, 269753, 62203, 467180, 541207, 434180, 15756, 380188, 146969, 158358, 81403, 145479, 137075, 148224, 246494, 139241, 135582]
14947A35582J05001j5053B4229N05148B56483O6220r333p0177N0805K31536j95756
14936C29778C4022M15120M2587A48680K10755l2258M3981K40001B77037P4872
14926C51909j40664J86961m435j0569A26985J81082a68214E36534j28431K28824
14916F36927k59031B9567K25629M511E5537R1795N1246M10567e1608F39538j60916
14905D78622j42546q0517N2583J13434m1022d345A08017K9482L41038k38997L0262
14894B69802J26913r1035o832I7549J36011J70587J48148K30130j46349k89050
14884C47026j0817r7290O4682K80541k27844L35229B02291K11081O6533r5095
14874C84810M6719j15388j6770l2697K10646j685L38290C95060r1754J13016j6273
$$ y = [135582, 240583, 225530, 24229, 529377, 256483, 322703, 313370, 243193, 293998, 525534, 329778, 34022, 449142, 491729, 148680, 359435, 327177, 371158, 611159, 277037, 351909, 211245, 398206, 393771, 383202, 126985, 308067, -168214, 536534, 408103, 636927, 377896, 29567, 255196, 259707, 55537, 147332, 198578, 609145, -51608, 639538, 478622, 336076, 255559, 308142, 421576, 380554, -4345, 108017, 137499, 478537, 239540, 269802, 396715, 305680, 298848, 97549, 233560, 404147, 552295, 782425, 636076, 347026, 336209, 238919, 303601, 584142, 356298, 691527, 202291, 413372, 479905, 384810, 431529, 316141, 299371, 266674, 477320, 475635, 813925, 395060, 303306, 416322, 400049]
14863D00049N2801A79229L56587j72772J23956q2198L42215l41256j00780J05751
14853D10732o0230J89378K7100k18651m8412K65221A41335L63257J7704j42391
14843C79905J98583n3058J082k35148N69870l21883j9573J75909j29630k2375
14833E43682R8638B37722L66226j83906J43244K28224C16737K69013j21466p5554
14823C88730L91922a9633D97404M8975j20500K12412B48060M17094k15213J3144
14813D63085K41978m7866B80165M41125L41354E03635A49553M31608J5983N87
14803E97731m3547j67009J09070R5088O5232J97063l03180K99761J65148D96929
14792E36336k23468K25527m309N2965K10344j89020p4235N00918C36125N8764
$$ y = [400049, 452850, 179229, 535816, 363044, 487000, 404802, 747017, 405761, 304981, 410732, 350502, 539880, 566980, 348329, 299917, 565138, 141335, 504592, 522296, 379905, 578488, 525430, 526512, 291364, 861234, 539351, 519778, 695687, 566057, 543682, 642320, 237722, 603948, 420042, 563286, 791510, 316737, 585750, 464284, 388730, 780652, -19633, 497404, 546379, 425879, 638291, 248060, 665154, 449941, 463085, 705063, 657197, 280165, 721290, 1062644, 503635, 149553, 581161, 597144, 597731, 554184, 387175, 496245, 591333, 656565, 853628, 550448, 850209, 1015357, 496929, 536336, 312868, 538395, 534086, 587051, 797395, 608375, 534140, 1035058, 336125, 394889]
14782C94889J17715K48050L8456k56439K12651l64767L44480j88420J2484K90601
14772H49700l19744O3652k1299j2459M47641l80149K34393j51118k3699K13436
14762I00354J28172k08902l93605J04480L0086j48793J83952o1322J39065j72998
14752E00489Q6948m5139M09151j28452p203J2158j90799j18798M53856k59677
14742G12534J24713r5109j522K9250P10Q2676n4690j43397O5241O8395k55282
14731E33519K79552J17867m8507K316L871l01158K99026k04374N25173l56306
14721H50979M2087J36067k18765J83206J09160m16517L56926m4304J03058m50300
14711F51597K22241k12230J42754J10948J65881k32657n9501M7418J46612M3957
$$ y = [394889, 512604, 760654, 799110, 542671, 755322, 390555, 735035, 546615, 559099, 849700, 529956, 593608, 572309, 559850, 1007491, 627342, 861735, 710617, 686918, 900354, 1028526, 819624, 426019, 530499, 560585, 411792, 595744, 534422, 673487, 500489, 587437, 542298, 951449, 822997, 815794, 827952, 637153, 518355, 972211, 712534, 837247, 742138, 740616, 769866, 770576, 853252, 798562, 655165, 720406, 788801, 533519, 813071, 930938, 882431, 884747, 888618, 587460, 886486, 682112, 1207285, 850979, 893066, 1029133, 810368, 993574, 1102734, 686217, 1043143, 998839, 1101897, 651597, 873838, 661608, 804362, 915310, 1081191, 848534, 789033, 836451, 983063, 1027020]
14701A027020j12885l26205J73975L108L02579M8400N8158l45567K33730n9120
14691A003193j73973q074K94328j72007o1935k72186K99172J68465k80573J24542
14681I20952K24967j75432O1920r4892Q1896K69018l40153J72509r0704L7532
14671A067613k28611K25132j81633J2310J64804K63380k47205M6044J13167k4707
14661A210294J48737j19469k53200K55678j03117J65757j93230J26503N1300L5100
14651A324353k18507K34910o9348K13860m94987J16864J04279j07765J74154J9936
14641A297749K61894l70507M34690j85002K28704j57818k87041J28908L55667
14632A707244o05418O05245j38322k31334j14449K15474L12592k32057J2718m6099
$$ y = [1027020, 914135, 587930, 761905, 765013, 1067592, 1115992, 1174150, 828583, 1062313, 1003193, 829220, 821146, 1115474, 943467, 881532, 609346, 908518, 1076983, 796410, 920952, 1145919, 970487, 1032407, 937515, 1019411, 1288429, 948276, 1120785, 1030081, 1067613, 839002, 1064134, 882501, 894811, 1059615, 1322995, 1075790, 1121834, 1235001, 1210294, 1359031, 1239562, 986362, 1242040, 1138923, 1304680, 1111450, 1237953, 1289253, 1324353, 1105846, 1340756, 1271408, 1485268, 990281, 1107145, 1211424, 1103659, 1277813, 1297749, 1559643, 1189136, 1623826, 1438824, 1667528, 1509710, 1222669, 1351577, 1707244, 1101826, 1707071, 1568749, 1337415, 1222966, 1438440, 1751032, 1518975, 1531693, 1485594]
14622A485594j55506k72820M89699J97818l76685K10647k71898L54522r2254m04
14612A568713N23190n80186m2464K69916k42735M03435l84016N47924m89548L57524
14602A931753k26790J20659j60520j44872J36202L32239j05476l7301R2065k06006
14592A731953o5533M46998j69148k22759l278K62888J18317J63802l63305J30503
14582B030438L39585m02922o6481K84219q5082J39705m0431j19882K07793K34415
14572B521357k92828J48863J19749K08104p83082O36754R6344J27250m92037N01762
14562B792236R967o45310N46619L44211J27455j29532L01144k95185M33557M42168
14552C927330L30996J00862J124472K434091M955240J0363703J7834589R759365
$$ y = [1485594, 1330088, 1057268, 1546967, 1744785, 1368100, 1578747, 1306849, 1661371, 1569117, 1568713, 2091903, 1511717, 1469253, 1739169, 1496434, 1899869, 1515853, 2063777, 1574229, 1931753, 1704963, 1825622, 1665102, 1520230, 1656432, 1988671, 1883195, 1845894, 1937959, 1731953, 1666420, 2113418, 1944270, 1721511, 1718233, 1981121, 2099438, 2263240, 1899935, 2030438, 2370023, 1967101, 1900620, 2184839, 2099757, 2239462, 2199031, 2079149, 2286942, 2521357, 2228529, 2377392, 2497141, 2705245, 1922163, 2558917, 2655261, 2782511, 2290474, 2792236, 2802203, 2156893, 2703512, 3047723, 3175178, 3045646, 3346790, 3051605, 3485162, 3927330, 4258326, 4359188, 5483660, 7917751, 12872991, 23236694, 41071283, 50830648]
14544E0830648A5559241F246090k247509k33805j54191R28425J534742O69577
14536F743329C031403p10158j02917j38073M74185k86860K7493n1399K0078J46468
14526B410220q6941j38032N29023l82443J88681O9398k3770J66307J38753J33725
14516C004921k79940k98914J74997L53370k03367k44654R32117o71549M09613
14507C176594n30271M65517J16796N8859O0821K03352m50521Q4742L28269m0014
14497C474144m4195k46469J18385K12214r3884j6717J52473L00703j20472n9804
14487C676378j30209K95005J43376K5107l06991K09443J20963k58562K65625R2566
14477D132701O01466p02853L1487K1250N36844J63484k87334N2401J84178N5943
$$ y = [50830648, 15559241, 6246090, 3998581, 3764776, 3610585, 4539010, 6073752, 6743329, 3031403, 2321245, 2218328, 2080255, 2554440, 2267580, 2295073, 2243674, 2263752, 2410220, 2323279, 2185247, 2714270, 2331827, 2520508, 2589906, 2566136, 2732443, 2871196, 3004921, 2724981, 2426067, 2601064, 2954434, 2751067, 2506413, 3438530, 2766981, 3176594, 2646323, 3111840, 3228636, 3287495, 3348316, 3551668, 3101147, 3185889, 3514158, 3474144, 3429949, 3183480, 3301865, 3514079, 3420195, 3403478, 3555951, 3856654, 3736182, 3676378, 3546169, 3841174, 3984550, 4009657, 3702666, 3912109, 4033072, 3774510, 4040135, 4132701, 4734167, 4031314, 4062801, 4084051, 4620895, 4784379, 4497045, 4549446, 4733624, 4789567]
14467D789567k15559K33500J50953p6698k55611L68503j5568k16275K43090K96829
14457E302731L20969k99694N9923k79909Q05166l24775k11360M50041L1334J76163
14447F030589k25258N75205l01450N5617J28466k74K56038J03006k33011L40494
14437F729422Q2996o499J17775m3690J69385J22796J6287L67378m58420N27009
14427G624439J29674j93595k19000K90202P04574j77520n4383J07238K73307l00557
14417H184379M79376j4976M59813l9689J54703j51005L89025L0927K62586j28441
14407I626698K58800L95887J00661L73189K2723j74082L53949N08295L1744J13870
14397A1611734K42003K80116j95207L55595J98107j57451M59692L09011L01032
$$ y = [4789567, 4574008, 4807508, 4958461, 4881763, 4626152, 4994655, 4979087, 4762812, 5005902, 5302731, 5623700, 5324006, 5383929, 5104020, 5909186, 5584411, 5373051, 5823092, 5854426, 6030589, 5805331, 6380536, 6079086, 6134703, 6263169, 6262895, 6518933, 6621939, 6388928, 6729422, 6812418, 6805919, 6923694, 6880004, 7049389, 7172185, 7188472, 7555850, 7097430, 7624439, 7754113, 7560518, 7341518, 7631720, 8336294, 8158774, 8104391, 8211629, 8484936, 8184379, 8663755, 8648779, 9108592, 9068903, 9223606, 9072601, 9461626, 9492553, 9755139, 9626698, 9885498, 10281385, 10382046, 10755235, 10777958, 10603876, 10957825, 11466120, 11497864, 11611734, 11853737, 12133853, 11938646, 12294241, 12492348, 12334897, 12794589, 13103600, 13404632]
14388A3404632J28067k4029O56618J48054o8194R38897k32116L70042M19600L03583
14378A6045154j24258J044043j88819K39883M87896K03710L81117P59981j78464
14369A8670243P81792L94489O4465N35475M31578O85934Q5007N76003Q14374K89621
14359B3328981M41513M32594P32083M02171Q47590L41493J019221L45860P14379
14350B8605885K40033J214031N43106Q47467P98582P30389J043548P25415R95202
14341C5743658R27603J046089J310948Q24608J057933J025006J187822J478343
14333D4602010J249827J341073J718197J436186J399516J738201J259865K007480
14325E6752355K147355J670130K263660K153462K238989J965525K670494K598566
$$ y = [13404632, 13532699, 13508670, 14165288, 14313342, 14245148, 15184045, 14951929, 15321971, 15741571, 16045154, 15920896, 16964939, 16776120, 17016003, 17503899, 17707609, 18088726, 18848707, 18670243, 19452035, 19846524, 19910989, 20446464, 20878042, 21563976, 21648983, 22224986, 23039360, 23328981, 23770494, 24203088, 24935171, 25337342, 26184932, 26526425, 27545646, 27891506, 28605885, 28845918, 30059949, 30603055, 31450522, 32249104, 32979493, 34023041, 34748456, 35743658, 36671261, 37717350, 39028298, 39852906, 40910839, 41935845, 43123667, 44602010, 45851837, 47192910, 48911107, 50347293, 51746809, 53485010, 54744875, 56752355, 58899710, 60569840, 62833500, 64986962, 67225951, 69191476, 71861970, 74460536]
14317G4460536K751287K645524L096212L550637L038822L352572M006166L677706
14309A00579462M330395L949023M906688M703409N262039N596579N824059O031161
14301A41182815O530522O786539P364286P804625P921553Q947516Q981882R587930
14293B05107668J0659813J0627143J1333753J1696102J2965735J3260904J4038213
14286B89689331J4314249J4835924J5171346J5786142J5861027J6297570J5703712
14279C97659301J5431123J4929323J4125553J3123782J1105696Q705020L816884
14272D78896682n34945l531132J281485K663006n039160o917826j0837175j2487089
14264D43493846j1948968j3228459j2613895j3446290j5376274j5731987j5651924
$$ y = [74460536, 77211823, 79857347, 82953559, 86504196, 89543018, 92895590, 96901756, 100579462, 104909857, 108858880, 113765568, 118468977, 123731016, 129327595, 135151654, 141182815, 147713337, 154499876, 161864162, 169668787, 177590340, 186537856, 195519738, 205107668, 215767481, 226394624, 237728377, 249424479, 262390214, 275651118, 289689331, 304003580, 318839504, 334010850, 349796992, 365658019, 381955589, 397659301, 413090424, 428019747, 442145300, 455269082, 466374778, 475079798, 478896682, 478361737, 474830605, 476112090, 478775096, 473735936, 466818110, 455980935, 443493846, 431544878, 418316419, 405702524, 392256234, 376879960, 361147973, 345496049]
14257C45496049j5872059j5902392j5424458j4923281j4428417j3815766j3018454
14250B42111222j2384897j1550058q727624j0638840j0375401r053151q606838
14243A70774413q462565p690291p313895p295107o272091n745498n063618o024103
14235A16907245n256631m481199m507784m012931l573863l810376l926166l366238
14227H3972057l197546l025785l055692k763032k218887k735807k196176k308624
14219F2470508k171383j642701k301406k104949j457109j307861j238263j924867
14211D8321969j661938j547065q78965j692219k53164j233243j547675j046099
14203C8461601j410590r50508o23595m01926j427552j109191q49548l70624j221778
$$ y = [345496049, 329623990, 313721598, 298297140, 283373859, 268945442, 255129676, 242111222, 229726325, 218176267, 209448643, 198809803, 188434402, 179381251, 170774413, 162311848, 154621557, 147307662, 140012555, 133740464, 127994966, 122931348, 116907245, 111650614, 107169415, 102661631, 98648700, 95074837, 91264461, 87338295, 83972057, 80774511, 77748726, 74693034, 71930002, 69711115, 66975308, 64779132, 62470508, 60299125, 58656424, 56355018, 54250069, 52792960, 51485099, 50246836, 48321969, 46660031, 45112966, 44234001, 42541782, 42288618, 41055375, 39507700, 38461601, 37051011, 36100503, 35476908, 35074982, 33647430, 32538239, 31688691, 31318067, 30096289]
14194C0096289m38435j002378n01171j133616k18401p22405j109761k15453n57279
14185B4197390m24330n92561r7438q34626m63707l47374m98551m21964l72987
14176B0143852m97453n91990r3760j70195q26371j78951O2774j055051p3907k60929
14166A6458019k81189j15293r39367O3018k07986k55523j05255o83391j05674
14157A3827359j58374n49276K92272p72875J30265l18479j89676o5703n48160
14148A1647353K7690M6597l49534k77010m0884J12811k18401l27142m59791J55535
14138A0317224q0005j78393j48366K30567p50085k13386L45395l94653m63972
14129H664326K14705l13423l70923J4350K10482k53703P2997m15507J30767j90053
$$ y = [30096289, 29657854, 28655476, 28154305, 27020689, 26802288, 26079883, 24970122, 24754669, 24197390, 23773060, 23180499, 23083061, 22248435, 21784728, 21437354, 20938803, 20516839, 20143852, 19646399, 19054409, 18960649, 18790454, 17964083, 17785132, 17847906, 16792855, 16718948, 16458019, 16176830, 16061537, 15122170, 15185188, 14977202, 14721679, 14616424, 13933033, 13827359, 13668985, 13119709, 13411981, 12639106, 12769371, 12450892, 12261216, 12195513, 11647353, 11675043, 11721640, 11372106, 11095096, 11054212, 11167023, 10948622, 10621480, 10161689, 10317224, 10237219, 10058826, 9910460, 10141027, 9390942, 9177556, 9522951, 9128298, 8664326, 8879031, 8565608, 8194685, 8209035, 8419517, 8165814, 8238811, 7823304, 7954071, 7764018]
14119G764018L19565o84073Q9748P4466j49550r1218k22507k70602K14768J3150
14109G057765j86179k25143l1054Q3296r7692l279l87033l7274J1379K02464j81360
14098F205890l62631L86848n34576L8566k47870K53408k46292P9996l80118K90342
14088E483563j21072j19062l89043J45081l1099J6269l24425M00370j30128L9300
14078D969754q9691k3692l18163J89623j52796j68326m7785m5733Q451k50225
14068D071417L06323l30030N10547o51888L67811k42897P4906k53707N03747k54587
14058D101642L50301m32053l46659L32571j98244j17523P8130p4620j69611Q1678
14048C605612k89231j74079J69803J18175k57966J64932j29135q0975N3446j72297
$$ y = [7764018, 8083583, 7399510, 7489258, 7563724, 7414174, 7322956, 7100449, 6829847, 7044615, 7057765, 6871586, 6646443, 6615389, 6698685, 6600993, 6597714, 6210681, 6173407, 6184786, 6387250, 6205890, 5843259, 6230107, 5695531, 5734097, 5486227, 5739635, 5493343, 5573339, 5193221, 5483563, 5362491, 5243429, 4854386, 4999467, 4968368, 4984637, 4660212, 5060582, 4930454, 4969754, 4880063, 4856371, 4538208, 4727831, 4575035, 4406709, 4358924, 4313191, 4321642, 4071417, 4377740, 4047710, 4558257, 3906369, 4274180, 4031283, 4106189, 3852482, 4356229, 4101642, 4451943, 4019890, 3673231, 4005802, 3807558, 3690035, 3768165, 3693545, 3523934, 3605612, 3316381, 3142302, 3312105, 3430280, 3172314, 3337246, 3208111, 3127136, 3180582, 3008285]
14038C008285M27968l01844q6896l15544L49899J47248j92126L1753J76302j1911
14028C233134n41329M03740k34830J00297M9750k56227J18662n8179q5389K3521
14018B753150k51190p1041M7504Q7959m6275j41170k0570L9288k43816N05224
14008B659063m06796J85491j32094L6812K82346l7566j37877l72771j59963J9168
13998A935813K9971P5116j52823q0942K17078k10497J60773M50397J28464R84647
13988C537997L375774R267428J5898364K2837181B3701403A0976346l647461j544369
13980E784516m20729j291323l3130p82255p427k87385K50656l60960k5511n27469
13970B298983K36200l5268l48078K76799m27167J42639K57421j06370j6604k34640
$$ y = [3008285, 3436253, 3134409, 3047513, 2731969, 3081868, 3229116, 3036990, 3068743, 3245045, 3233134, 2691805, 3095545, 2860715, 2961012, 3010762, 2754535, 2873197, 2815018, 2729629, 2753150, 2501960, 2430919, 2478423, 2566382, 2520107, 2378937, 2358367, 2397655, 2153839, 2659063, 2252267, 2437758, 2305664, 2342476, 2624822, 2587256, 2449379, 2076608, 1916645, 1935813, 1965784, 2040900, 1888077, 1807135, 2024213, 1813716, 1974489, 2424886, 2553350, 3537997, 6913771, 16181199, 32079563, 54916744, 23701403, 10976346, 7328885, 5784516, 5363787, 4072464, 4039334, 3257079, 3249652, 2962267, 3212923, 2851963, 2826452, 2298983, 2535183, 2499915, 2151837, 2428636, 2001469, 2144108, 2401529, 2295159, 2278555, 2043915]
13960B043915k3685J27283j51036j1303K08281k37524o8102P7642J16199o59816
13950A421854M71627j61442K48088J02081k71242L28534l35887m1718J70572j70180
13940A762287K05308j69068j46413P4825n3394J03572j7882J04209k15908l3758
13930A613778N8836j30055j3774K35514j57276J87795k90583p9370O4422j10872
13920A378415N8324K08988k80800L01284l13m92760K45831n484J90396O034k19431
13909A390484r5827K67230l34150J08650J3326J80877l48643K43743j91798K32504
13899A466396n717l86250J40264J22715p9820Q2999j14567j85108L06558j47978
13889A199492L0615j39334j01840M35116l82302L07506k88323L02588m78614K50015
$$ y = [2043915, 2020230, 2147513, 1996477, 1985174, 2193455, 1955931, 1887829, 1965471, 2081670, 1421854, 1893481, 1732039, 1980127, 2082208, 1810966, 2139500, 1803613, 1761895, 1932467, 1762287, 1967595, 1798527, 1652114, 1726939, 1673545, 1777117, 1759235, 1863444, 1647536, 1613778, 1672614, 1542559, 1528785, 1764299, 1607023, 1794818, 1504235, 1424865, 1489287, 1378415, 1436739, 1645727, 1364927, 1666211, 1665898, 1173138, 1418969, 1413485, 1603881, 1609915, 1390484, 1294657, 1561887, 1227737, 1336387, 1349713, 1530590, 1181947, 1425690, 1233892, 1466396, 1460679, 1074429, 1214693, 1337408, 1257588, 1340587, 1226020, 1040912, 1347470, 1199492, 1230107, 1090773, 988933, 1424049, 1041747, 1349253, 1060930, 1363518, 884904, 1134919]
13879A134919p1846o3568p620R1622k27348K81977n3970m5637n7071K50776o7050
13868A165184k17331n6799R8137M21732k29009k2414M3187l05221N8561J92343
13858A148370m63813K63357Q5539j53480K48547o4925N3368M3609l32070K08452
13848A036954j69870j3709R1266P1489j17918L723j0536q1348J23083l3334m608
13837H95192M20925k20894m64738J05505r7570K51190j72111j50145L77909k363
13827I42900J45827m5186m43653n6661L59370J49718o3397l13516R7298K00521
13817I73221k25562J40225j42760Q3904j42238R9516Q3079j91959L8576N6404
13807G72406n7418J92104j44024K51470m35500j93684M51539O3205l82606K60776
$$ y = [1134919, 1063073, 999505, 991885, 1083507, 856159, 1138136, 1084166, 1038529, 981458, 1232234, 1165184, 947853, 891054, 989191, 1410923, 1181914, 1159500, 1202687, 897466, 956027, 1148370, 684557, 947914, 1033453, 879973, 1128520, 1063595, 1116963, 1160572, 828502, 1036954, 867084, 853375, 944641, 1016130, 898212, 901935, 891399, 810051, 933134, 899800, 895192, 1316117, 1095223, 630485, 735990, 638420, 889610, 717499, 567354, 945263, 942900, 1088727, 1043541, 599888, 543227, 902597, 1052315, 988918, 675402, 772700, 973221, 747659, 887884, 745124, 829028, 686790, 786306, 869385, 677426, 716002, 772406, 714988, 907092, 763068, 1014538, 579038, 385354, 836893, 900098, 517492, 778268]
13797G78268q8902P2300Q3054m3213J49223k33316n9459Q5615k56843J73436N2775
13786G12938N7365L8334P5170k59449q9095K79746j18108C33222O53761m16914
13776E70069K66924j83684k33793N18637k45322P4919j1683j48537Q2921n6956
13766F33495j45033M36411p7427o6597j80292n5626q4342M17702k96239J24496
13756G06548k32723N40288j61888l91818J61586J24532l16892J46850Q9585j33111
13746E32957K91671l25091j44960L07197m1735j26448j07877J98004M6652j98964
13736D31406K41183n6540n3479j05758L05045j66371B80113J51331K13390j14214
13726E30620L3413k8118K21519k57647j037p7150J14781m2075J31652o5998J06362
$$ y = [778268, 689366, 761666, 844720, 801507, 950730, 717414, 657955, 743570, 486727, 660163, 712938, 770303, 808637, 883807, 624358, 535263, 815009, 696901, 333222, 986983, 570069, 836993, 653309, 419516, 938153, 692831, 767750, 756067, 607530, 690451, 633495, 488462, 924873, 847446, 780849, 600557, 544931, 460589, 878291, 582052, 706548, 473825, 1014113, 852225, 460407, 621993, 746525, 429633, 576483, 666068, 532957, 824628, 499537, 354577, 661774, 620039, 493591, 385714, 583718, 630370, 431406, 672589, 616049, 562570, 456812, 761857, 595486, 280113, 431444, 644834, 530620, 564033, 535915, 757434, 499787, 498750, 421600, 536381, 494306, 625958, 559960, 666322]
13715F66322n0589j6442L5860j01242l2573k2068j5958K87104j73786E1829J75724
13704B27553L70086j92601J22870k17285N01195A76314K84863M1354Q1268j6523
13694E67276k34579J19816m4994J67674K4385B04772K86515J98292C40956L87600
13684G28556j47179j36314k10644K87956k24018P3571Q6023J1856L32111k19919
13674E81999A97911L1709N85586l08961r9733o5089k7750r3364k4292L82874B36364
13662B84418O1994j12999J80375j39086K48129k48831A32241N32613l30954J88734
13652E22634J1718H7338M3498L62401k01131R2562L1343Q1047A81058M54787j21355
13641E14490j21303L587o399m0893J53660k32522J54806L6546q7111K13603l3669
$$ y = [666322, 615733, 599291, 635151, 533909, 501336, 479268, 463310, 750414, 576628, 51829, 227553, 597639, 405038, 527908, 310623, 811818, 176314, 461177, 502531, 583799, 567276, 332697, 452513, 407519, 575193, 599578, 204772, 491287, 689579, 340956, 728556, 581377, 445063, 234419, 522375, 298357, 371928, 457951, 469807, 801918, 581999, 197911, 229620, 815206, 506245, 406512, 341423, 313673, 220309, 196017, 578891, 236364, 284418, 346412, 233413, 413788, 274702, 522831, 274000, 132241, 664854, 333900, 522634, 534352, 87338, 130836, 493237, 292106, 384668, 416011, 497058, 181058, 635845, 514490, 393187, 396774, 390375, 349482, 503142, 270620, 425426, 461972, 374861, 588464, 554795]
13630E54795B59146L1340K38893J4372B21608B800K93081K08336B35820P2502
13620C08322J6664l8733O6835b2543C23858K77865h7038C32107j16027M0369l4371
13609B22078K15687j69412P0958k1875L55516A2729L10817C8254J36948L29690
13599E04892j76245k3665o0984J00019l6005K61189B79333l2712L42081A83048
13588A47376J37146J93931m6731o8010A61208J73270k5124m3847K15678A48353
13577B55732J07898M5015A77189M2318H4451L04331n147r8053J42620j84593j7846
13566B25763O1593a59511D32630K4n5883A82398N2011F2306J63023p2329J11698
13555B64698j17326K76253K45663B24627o1050b33753e2616D52462Q291j10432
$$ y = [554795, 259146, 290486, 529379, 543751, 221608, 2800, 295881, 504217, 235820, 308322, 324986, 286253, 353088, -22543, 323858, 601723, -87038, 332107, 216080, 256449, 222078, 437765, 268353, 339311, 317436, 672952, 12729, 323546, 38254, 175202, 504892, 328647, 304982, 243998, 344017, 308012, 569201, 279333, 246621, 588702, 183048, 147376, 284522, 478453, 431722, 363712, 161208, 334478, 309354, 265507, 481185, 148353, 255732, 363630, 408645, 177189, 219507, 84451, 388782, 383635, 285582, 428202, 243609, 225763, 287356, -159511, 432630, 432654, 376771, 182398, 234409, 62306, 225329, 153000, 264698, 147372, 423625, 669288, 224627, 163577, -233753, -52616, 452462, 460753, 350321]
13545C50321l2169A36929L44485J31255B08183J47332l0371D5207M34813A30840
13534A71485l8887J09998q8142K5638J12763k2467D7382Q0504J66432n8052M41273
13523F77539k97692K06421B50109L08419k69414B6985J37927b3096A95317M0717
13513B36034N1146K52361B12679E7759K23754K30507B16888J54819a5509B27272
13502C65280n2295j29118J7901r4191l0066q293J29890O1401l6120J73187A48858
13490E26080B61855N5728j56711n4976H099O30546A3358J61116L5176G5572m980
13479G0592K97231o3537A45891L09576C6429K9435N29162k55604k2069p3887A8655
13467a69139A84956J0731m2085A7295J71660b3885A94040q5573N9771J07255j27465
$$ y = [350321, 318152, 136929, 481414, 612669, 208183, 355515, 325144, 45207, 480020, 130840, 171485, 132598, 242596, 154454, 180092, 292855, 270388, 47382, 127886, 294318, 236266, 677539, 379847, 586268, 250109, 558528, 289114, 26985, 164912, -23096, 195317, 236034, 287180, 539541, 212679, 57759, 281513, 512020, 216888, 371707, -15509, 227272, 365280, 312985, 183867, 201768, 107577, 77511, 69218, 199108, 260509, 224389, 397576, 148858, 526080, 261855, 317583, 160872, 105896, 8099, 638645, 13358, 174474, 209650, 75572, 70592, 367823, 304286, 145891, 455467, 36429, 65864, 595026, 339422, 317353, 243466, 18655, -169139, 184956, 195687, 153602, 17295, 188955, -23885, 194040, 108467, 168238, 275493, 148028]
13456A48028r149N859K2150O9259N2633j25627J1319a53D37705B09955n1627E6556
13443b7489A39668B6474J40997J46302A02061D5201J03247a30950B46530g077
13432A74338n1614J16278R6132E1168h7192a3147B67211o1636n5461J18686H9733
13420D87758j12119a9661D15780r7617j17435K7723e2980G511K03041E6216J08372
13409A64588h4549j4167C23718j24129H9552b09277D51590H7231K0945j4263a0570
13397C48489A37322P2598r8887c8550D3571l251f8333r877C36529G9548K70062
13386C49610j68854J87511M0574a46379A36506F7194A7202N6208k9419b06631
13375C03437A31031K25092e2600B01865l2322L6731F6935J12006n9236a10212
$$ y = [148028, 138879, 144738, 166888, 236147, 288780, 163153, 174472, -153, 437705, 209955, 158328, 56556, -27489, 139668, 26474, 167471, 313773, 102061, 45201, 148448, -130950, 246530, -7077, 174338, 122724, 239002, 335134, 51168, -87192, -13147, 267211, 205575, 150114, 268800, 89733, 487758, 375639, -19661, 415780, 318163, 200728, 228451, -52980, 7511, 210552, 56216, 164588, -84549, -98716, 323718, 199589, 89552, -209277, 451590, 87231, 108176, 93913, -10570, 348489, 137322, 209920, 111033, -38550, 43571, 40320, -68333, -78210, 336529, 79548, 349610, 180756, 368267, 408841, -146379, 136506, 67194, 17202, 73410, 43991, -206631, 303437, 131031, 356123, -52600, 201865, 169543, 206274, 66935, 178941, 119705, -110212]
13364B54573J9637p6869n3975L1031K38304A42923J27130A20937J41865j19503
13354A43299F7581K06065a25215G9189A0986Q1696J92253M42073l01068A42308
13343E90637A29529J89760j47603M71535B72702r6290N37572B86518J05342m9425
13333C42435n3202I5421K21385D6042O12249B35782l9063a39029A75977Q4483
13323B60460f406B3622M61163B08499j9311E1710L918R6624J86939C1648a9363
13311D26616A44085n9975N7220K79905h850A26873B268b48463C27526C031a8730
13299a6331G8217K97527j82088e6739C6323J12138Q8184a17157G8782k0958K65856
13288C23680n2445P0506A6552d79951D5422d8360a469E8446J14504J38298j12161
$$ y = [254573, 274210, 197341, 143366, 174397, 412701, 142923, 270053, 120937, 262802, 143299, 67581, 273646, -125215, 79189, 10986, 92682, 284935, 727008, 425940, 142308, 590637, 129529, 319289, 171686, 643221, 272702, 176412, 713984, 286518, 391860, 342435, 289233, 95421, 316806, 46042, 658291, 235782, 196719, -139029, 175977, 260460, -6406, 23622, 484785, 208499, 189188, 51710, 55628, 152252, 339191, 31648, -19363, 426616, 144085, 84110, 141330, 421235, -8850, 126873, 2268, -248463, 327526, 3031, -18730, -16331, 78217, 375744, 193656, -56739, 36323, 148461, 236645, -117157, 78782, 57824, 323680, 271235, 341741, 16552, -479951, 45422, -48360, -1469, 58446, 172950, 311248, 199087]
13277A99087Q7260B1479b8756o4791j77676A99231r6978m3351N7801J01791O2639
13266B81133j25680b27772B52298A6774H18L7595L16399j58002j1966E3807O6700
13255A20507e2836B32504R5319a35363k00176e613G5460Q3264K1033m6132d3703
13243a21152J2706k1693F120J37086L0171l8947L53748j79451e2619C27571q0264
13232B47307h7938c2119o0672B7415b7797B43511G5425K2508K47572i583B2737
13220A23933D7264J79858F1278J34093k3210q0018l2753J2902c2580B7078Q9441
13209A16519b29424J8186D09148A74941b30666B73875a4834j36145j12459J26501
13199a36937a5212B88428f9753B22866k7701E3985J24471l3003a31749e2253A7595
$$ y = [199087, 286347, 21479, -28756, -93547, -271223, 199231, 102253, 58902, 116703, 218494, 281133, 155453, -227772, 252298, 16774, 818, 38413, 354812, 196810, 184844, 53807, 120507, -52836, 232504, 327823, -135363, -335539, -5613, 75460, 158724, 179757, 133625, -43703, -121152, -108446, -130139, 6120, 143206, 173377, 134430, 488178, 308727, -52619, 327571, 247307, -87938, -32119, -92791, 27415, -27797, 243511, 75425, 97933, 345505, -9583, 22737, 123933, 47264, 227122, 61278, 195371, 172161, 92143, 59390, 72292, -32580, 27078, 116519, -229424, -211238, 409148, 174941, -230666, 273875, -14834, -150979, -263438, -136937, -15212, 288428, -69753, 222866, 195165, 53985, 178456, 145453, -131749, -52253, 17595]
13187D47056b13238O3060c0498j03268E8349P403P5972Q6112J28494g4991B19116
13175C26059j48911a34295I6730g2479B05640H7063J69072a10842L5937A19646
13164A8123P6856a55828D0318L76578A88905o9496E8346L45967h8537C40807A03658
13152a30468j6819I0865J13449A6745J0895d4421B27345D196i3930B12308A0493
13140H1655J38544L3858L6548A06973c1090A46741P4291a07510l5695J7575N436
13129a20194L4606j0379A01464a67010e0787H3448a6759k46041A28758g7423B97872
13117A29024i2114A81049R8138L2788h7725p7849A57419i2624C70442a1680m4402
13106e6082b4543o3978F608a15870c0808B63788b0057r3178I4057J69135E7307
$$ y = [447056, -213238, -150178, -30498, -133766, 58349, 65752, 141724, 227836, 356330, -74991, 219116, 326059, 177148, -134295, 96730, -72479, 205640, 87063, 256135, -110842, -74905, 119646, 18123, 94979, -155828, 40318, 416896, 188905, 119409, 58346, 404313, -88537, 340807, 103658, -130468, -147287, 90865, 204314, 16745, 27640, -44421, 227345, 4196, -93930, 212308, 10493, 81655, 220199, 254057, 290605, 106973, -31090, 146741, 221032, -107510, -143205, -125630, -120194, -85588, -95967, 101464, -167010, -50787, 83448, -16759, -262800, 128758, -77423, 297872, 129024, -92114, 181049, 279187, 311975, -87725, -165574, 157419, -92624, 370442, -11680, -56082, -24543, -88521, 6608, -115870, -30808, 263788, -20057, -113235, 94057, 263192, 57307]
13094a47807B85425A8309K66029A1227A725J05378a14420E59513A13271J06969
13084B20240a27065C80695a2301r1178k329A0195a99754N6291A65308J41083f9996
13072a65648c3D3141b30070c091A47184L1645B7991O0818K37283C828L06329e9653
13059A58987A4312L12331k0782a33841F4988A8316o435L13420b58165B64927I231
13047B46431c45I3323J09706p3868K7181b54024D45591k09093A5194g5060D6950
13035A09827a8541E046L22079A0393J25870F0535a5846A3136O2598K12562J881
13024B90177c19710a42414F623a10184A82560J36129E9510J06220J8738j2999
13014A71469J15036A15179l1926K23609g7555C41770r0803r1357k804p5213I067
$$ y = [-147807, 285425, 18309, 284338, 11227, 1725, 107103, -114420, 559513, 113271, 220240, -127065, 380695, -12301, -103479, -105808, 10195, -199754, -143463, 165308, 306391, -69996, -165648, -33, 43141, -230070, -3091, 147184, 178829, 27991, 88809, 326092, 3828, 310157, -59653, 158987, 14312, 326643, 305861, -133841, 64988, 18316, 11881, 325301, -258165, 264927, 9231, 246431, -345, 93323, 203029, 129161, 156342, -254024, 445591, 236498, 15194, -75060, 46950, 109827, -18541, 5046, 327125, 10393, 136263, 60535, -15846, 13136, 75734, 288296, 290177, -319710, -142414, 6623, -110184, 182560, 318689, 59510, 165730, 184468, 171469, 286505, 115179, 83253, 306862, -77555, 341770, 250967, 159610, 156806, 81593, 9067]
13002A16133K26353j53196J45376k4642A38664b82877O6681I8451L7335M6841
12992A82627A2864h7560m2302A18947a96554a747A21225h6608G4253K13797j36343
12981A51707k6116R6268J13654a19696J569c3839A51904b131D37776H1976l7819
12970D4157J816J56660o3398b3055k8069B73946h8626a3308B00267a07546G8139
12958e7795K417B17039e9955A67739J06909j31273e8780o0149o747L8492j35146
12947b22330H4728b8696A56700h8634B1637c7756C74226b3288n4050B04469P8595
12936B83064A21085B1973a72729O9709B48090a13327A7130N4861J55293a18302
12925A65772Q3679c34380A80229H0252K0319a04203b246B1595J63263J44716a86890
$$ y = [116133, 342486, 189290, 334666, 310024, 138664, -282877, -216196, 98451, 135786, 182627, 12864, -87560, -129862, 118947, -196554, -1747, 121225, -86608, 74253, 288050, 151707, 125591, 221859, 335513, -119696, -118127, -33839, 151904, -2131, 437776, 81976, 44157, 45973, 202633, 139235, -23055, -51124, 273946, -88626, -13308, 200267, -107546, 78139, -57795, -55378, 217039, -59955, 167739, 274648, 143375, -58780, -118929, -125676, -87184, -222330, 84728, -28696, 156700, -88634, 21637, -37756, 374226, -23288, -77338, 204469, 283064, 121085, 21973, -172729, -103020, 248090, -113327, 17130, 71991, 227284, -118302, 165772, 249451, -334380, 180229, 80252, 100571, -104203, -2246, 21595, 184858, 329574, -186890]
12913a59146k6417e0881I5043b1140r364A18557l6412o373J66577C4775a62436
12901b17350A72677a87577q75B1243h5777j7579o9283A43231b10858H1153M9596
12890A30749n9712d4137j66378E2072J63994M8050j26905c6907A66730A5521J65369
12879A80890K8815j00734M2040J42765A13473P1540a83745o7117j04163E3259
12868h1122A30957k0938K0877Q8785c35079A73965J6920n3044d9414A97515D4617
12856B08862a34763e8631H8557l5649K00175a39426p5301E2221J96966b65202
12845A5329b09512G5053k5654J01233a01365a267A23518E9636b04936e7881b2659
12833e6058K3001p2567B31308H1300b44436B63510a40219e6610j40223a0495A84960
$$ y = [-159146, -185563, -50881, 95043, -21140, -30504, 118557, 82145, 75772, 242349, 34775, -162436, -217350, 172677, -187577, -188452, 21243, -85777, -103356, -172639, 143231, -210858, 81153, 130749, 71037, -44137, -210515, 52072, 216066, 264116, 137211, -36907, 166730, 15521, 180890, 209705, 108971, 151011, 293776, 113473, 185013, -183745, -250862, -355025, 53259, -81122, 130957, 110019, 130896, 219681, -335079, 173965, 190885, 137841, -49414, 197515, 44617, 208862, -134763, -58631, 88557, 52908, 253083, -139426, -214727, 52221, 249187, -265202, 15329, -209512, 75053, 49399, 150632, -101365, -1267, 123518, 59636, -204936, -57881, -22659, -56058, -33057, -105624, 231308, 81300, -244436, 263510, -140219, -56610, -196833, -10495, 184960]
12821h2854c9143n9669j3644A03876J07131j03909a80941a0629I0824B8659h5425
12809b02568A4333J50296a86693A80076M0426c76924B69812k4477a40487a9540
12798B82401a06270B86498E168K07167F2400h3686B75102h3363A1201a53555A07135
12786b46937P1187j46028J29375d3846H4891h1949A37517b56084a21465A4123
12775A78322j7146C1457J41086b43253A60333A3501J16836J7583J45019A3285
12764f7490A63065K3830J46247E6282b90083B84060e51550f6087C70309b19623
12753C22071b134C62769a55383D1118i0642A10792o189B0527J5429a28417M6845
12742h1572r0271l7718n471G2292a08869C14463p5797c7673B70872G8749j7501
$$ y = [-82854, -39143, -98812, -112456, 103876, 211007, 107098, -180941, -10629, 90824, 28659, -85425, -202568, 14333, 164629, -186693, 180076, 220502, -376924, 269812, 245335, -140487, -19540, 282401, -106270, 286498, 5168, 212335, 62400, -83686, 275102, -83363, 11201, -153555, 107135, -246937, -175750, -321778, -192403, -43846, 84891, -81949, 137517, -256084, -121465, 14123, 178322, 161176, 31457, 172543, -243253, 160333, 13501, 130337, 147920, 292939, 13285, -67490, 163065, 186895, 333142, 56282, -290083, 284060, -551550, -66087, 370309, -219623, 322071, -2134, 362769, -155383, 41118, -90642, 110792, 104603, 20527, 35956, -128417, -81572, -171843, -209561, -215032, 72292, -108869, 314463, 238666, -37673, 270872, 78749, 61248]
12731F1248Q3818h8269K4740F7007A2600K18607a2059j26859F7258a30967C19082
12719A24612f0999A16383a20260G3377J82672j07550R0824I5849C9946A49L87119
12708C87268n9055H2484L13135n3700j47017K8850b1314A98704j210a07378C17016
12696i3583J8109E9203J15020E0557a17886B13091h5822r1731l4701d660j10603
12685a15263A46667O5223b39810F7835J05441L3341q3618J98915I8464J74752
12675B73216P4179b8426A42845l1906c7529A0208b38237B5684L72955a66512A10162
12663I1874Q9991O8198d1885C38927I6761A666J765R2851a26600C46791E938a82195
12650D9117J68085n2885m1875l7669J90302F5882b42124D8237j0096a02020j6104
$$ y = [61248, 145066, -88269, -63529, 67007, 12600, 231207, -12059, -138918, 67258, -130967, 319082, 124612, -60999, 116383, -120260, 73377, 256049, 148499, 239323, 95849, 39946, 149, 387268, 328213, 82484, 395619, 341919, 194902, 223752, -21314, 198704, 197494, -107378, 317016, -93583, -75474, 59203, 174223, 50557, -117886, 213091, -85822, -177553, -212254, -4660, -115263, 146667, 211890, -239810, 67835, 173276, 206617, 122999, 321914, 98464, 273216, 347395, -28426, 142845, 110939, -37529, 10208, -238237, 25684, 398639, -166512, 110162, 91874, 181865, 250063, -41885, 338927, 96761, 1666, 3431, 96282, -126600, 346791, 5938, -182195, 49117, 217202, 164317, 122442, 84773, 275075, 65882, -242124, 48237, 38141, -102020, -118124]
12639a18124B5514L91955j32222A21667b18394A03105L2206J62571f2H7652K57955
12628C45607K59898j77208H9021O0071J98746A38845n9262M0701L69941k39477
12618B50748J33311A17742J6431j7125a6485F6986a8889j24708A48758J041E6255
12606a21485o1993A67615b69541A07712i0963k04582A30580K09752E1293K18462
12596B69755j867a76025O5192A71850L0986g2194C68029l5821h7101l986c4210
12584b487C05424r5956r4214a23631m3960Q0463r999E1581J54489e48448a03365
12572C81733a47500b8262k7780A64958k7044R4611D8622f9253j16442K5640C48344
12560g9624j15737I3914f8923D9595N1707b4832A39976J25767F0429b6833C70243
$$ y = [-118124, 25514, 417469, 285247, 121667, -218394, 103105, 135311, 297882, -62, 87652, 345607, 605505, 428297, 89021, 149092, 347838, 138845, 79583, 120284, 490225, 250748, 384059, 117742, 134173, 117048, -16485, 66986, -18889, -143597, 148758, 149799, 56255, -121485, -183478, 167615, -269541, 107712, -90963, -295545, 130580, 340332, 51293, 269755, 267888, -176025, -110833, 171850, 202836, -72194, 368029, 332208, -87101, -91087, -34210, -2487, 305424, 209468, 115254, -123631, -167591, -87128, -97127, 51581, 206070, -548448, -103365, 381733, -147500, -28262, -56042, 164958, 137914, 232525, 48622, -69253, -185695, -160055, 348344, -79624, -195361, 93914, -68923, 49595, 101302, -24832, 139976, 265743, 60429, -26833, 370243]
12548d4585A01102b53922a23158A25436a98696h4102m11724a8884A64053d8783
12537A59380a7200A74517J6621b39785l2105B01340a05697B808a7109A23274J95419
12526C18693H9258R7484k11A553h8379B46501b40961R0510j31530H6956d2357
12514F700J06439g6996A55452d1134A40620c12826A59359G5021p568K5487l6649
12503E6291J36137n3950k6072J46117j03574K00228m1289b01636L7251A41424
12492A29174D748a79128B58263d3235p524A61919a89885P4023j22373D1030a59944
12480a26404B8113J76051b4330j41059B98833a8253B12895I5222K23168a13597
12469D54202d7137k4318B89770a66656I6561K16954A14241a9172B28507m8721
$$ y = [-44585, 101102, -253922, -123158, 125436, -198696, -84102, -495826, -18884, 164053, -48783, 159380, -17200, 174517, 191138, -239785, -271890, 201340, -105697, 2808, -17109, 123274, 318693, 89258, 186742, 186531, 1553, -88379, 246501, -240961, -150451, -281981, 86956, -42357, 6700, 113139, -76996, 155452, -41134, 140620, -312826, 159359, 75021, 67453, 92940, 56291, 192428, 138478, 112406, 258523, 154949, 355177, 313888, -201636, -164385, 141424, 129174, 4748, -179128, 258263, -43235, -50759, 161919, -189885, -115862, -238235, 41030, -159944, -126404, 28113, 204164, -24330, -165389, 298833, -18253, 212895, 95222, 318390, -113597, 454202, -47137, -71455, 289770, -166656, 96561, 313515, 114241, -19172, 228507, 179786]
12459A79786D1718b00669a0692m66451H103a70408f8260E3057K5126C4023j5392
12448A8631K28578h732F0978a86661A46903o9262i2219A97703N5724a93058l74254
12437e67312a5265j03625o9614P5970q5502B0335L3864b24297f0821j62349A25959
12425I458d9288a3431E474L376J0019J08348C098L9793i6619K4546b9799f815
12412a14130j50892J21390d2909B34883I0891a55273B0581J7684a3713A30244
12401A77547a36474I3469a90332C02205b20933A70063f0672E683d32819C43454
12390c42892a20286c375r6219b7413H4309j5728B0259a4575k14823G1350R952
12379H1302b31321I7096k3971J39364G5143e2058A98767A6903a05303j92607O5829
$$ y = [179786, 41718, -200669, -10692, -477143, 8103, -170408, -68260, 53057, 78183, 34023, 18631, 247209, -8732, 60978, -186661, 146903, 77641, -92219, 197703, 253427, -193058, -567312, -15265, -118890, -188504, -112534, -198036, 20335, 54199, -224297, -60821, -223170, 125959, 9458, -49288, -13431, 5474, 8850, 18869, 127217, 3098, 42891, -96619, -72073, -29799, -6815, -114130, -265022, -143632, -42909, 234883, 90891, -155273, 20581, 38265, -13713, 130244, 177547, -136474, 93469, -190332, 302205, -220933, 170063, -60672, 5683, -432819, 343454, -342892, -120286, -3375, -99594, -27413, 84309, 68581, 20259, -14575, -229398, 71350, 81302, -231321, 97096, 73125, 212489, 75143, -52058, 198767, 16903, -105303, -297910, -232081]
12368b32081O6516A23678R4453j1647C6658M3010J88631a3193E7950c0345M827
12357b5518j23791R358o2792q288B4523N6658b89161E6106a17808p7824A93075
12345G315P7647K63832a54373A08204i6796j2134C1823N05800a73772k8380l4594
12334b36746B339K19169b04018o0948B8421I228Q0858d17644G4266a23905A6273
12322B34420a81228B70783d82325a20727k31772B18251b6336G9017M8672d9058
12311A87032P6756r2596b26099a657C34890f9363k06819A23623g6600B0330A618
12299A5897K46604r7460a22664j77280b4248j2675c79C05683j36263L3447Q4609
12288B87476g9612j28235G6909J21074p4647Q7145q806D1702R7790n9169i3931
$$ y = [-232081, -165565, 123678, 218131, 206484, 36658, 79668, 268299, -13193, 57950, -30345, -25518, -149309, -139951, -202743, -211031, 24523, 81181, -289161, 56106, -117808, -195632, 193075, 7315, 84962, 348794, -154373, 108204, -96796, -108930, 31823, 537623, -173772, -202152, -236746, 2339, 221508, -204018, -264966, 28421, 9228, 90086, -417644, 74266, -123905, 16273, 234420, -181228, 270783, -482325, -120727, -352499, 218251, -26336, 79017, 127689, -49058, 187032, 263788, 171192, -226099, -1657, 334890, -69363, -276182, 123623, -76600, 20330, 1618, 15897, 262501, 165041, -122664, -299944, -24248, -36923, -379, 305683, 169420, 202867, 287476, -79612, -207847, 76909, 197983, 123336, 210481, 201675, 41702, 139492, 80323, -93931]
12276a9520l6157E10398n2905B09225A03455D5714J5673M32053A48118K3251d592
12264H5749J10097R7405Q4028A39886g3016A02762E1053A6611K07966D6674K34422
12253B81096A35036b94275a35377A76352J71421F8169J27448B4751K66679r3181
12243A98249E0428K92007b96541o0186a41519A18644K7052K6949g5919j14773
12233a90692B23161A691g9605C01839a10580C77416A58207K19020j43281K90707
12223E24653k15297A01228M42399N8314q8849j50299j71668K73886A51612e1238
12212C89487F5586h2387b0435p9646B0402O411a2178B80447J62849j92213M44338
12201F95421H9961b2189A52886J09903J34165J98665j15102j81008j32002J95007
$$ y = [-19520, -55677, 510398, 457493, 209225, 103455, 45714, 61387, 493440, 148118, 171369, -4592, 85749, 195846, 293251, 377279, 139886, -73016, 102762, 51053, 16611, 224577, 46674, 281096, 135036, -294275, -135377, 176352, 347773, 68169, 195617, 24751, 291430, 198249, 50428, 342435, -296541, -356727, -141519, 118644, 145696, 172645, -75919, -190692, 223161, 1691, -79605, 301839, -110580, 377416, 158207, 377227, 233946, 524653, 309356, 101228, 543627, 601941, 513092, 362793, 191125, 465011, 151612, -51238, 389487, 65586, -82387, -20435, -100081, 20402, 26813, -12178, 280447, 443296, 251083, 695421, 89961, -22189, 152886, 262789, 396954, 595619, 480517, 299509, 167507, 362514]
12191C62514A38884m5876J46141L1429D1779L55210A36771a37006A42403b64431
12180b68778A57355c35373E62461j76752o3571j29884j8871J01735C9581J27887
12170A67468L5379J4902E7939J61404a28588d5300E6654K37284K6064E8361Q5863
12159A44224K10793j72052j4303j9531M47803a65979B13600g5170k2845C81739
12148B28123o6477Q3444C8878b491k6957A32269B6058P7642K7477P7766M6189
12137B55132a16472B15767q4373R3136A6457c60313g6419B5251J37831b17558
12126a50068N0093B44028p5941g7646A34274J3432b45742C3215N5834J42991b40308
12114c5353B28824k8016l0039J85248a41178O0064o7566H8985c18024A9236K82911
$$ y = [362514, 138884, 93008, 239149, 270578, 41779, 396989, 136771, -137006, 142403, -264431, -268778, 157355, -335373, 562461, 385709, 322138, 192254, 173383, 275118, 39581, 167468, 202847, 217749, 57939, 219343, -128588, -45300, 56654, 293938, 320002, 58361, 144224, 355017, 182965, 168662, 149131, 596934, -165979, 213600, -75170, -98015, 381739, 228123, 161646, 245090, 38878, -2491, -29448, 132269, 26058, 103700, 131177, 208943, 255132, -116472, 215767, 131394, 224530, 16457, -360313, -76419, 25251, 163082, -217558, -150068, -99975, 244028, 168087, -77646, 134274, 147706, -245742, 33215, 89049, 232040, -240308, -35353, 228824, 200808, 170769, 356017, -141178, -81114, -148680, 88985, -318024, 19236, 302147]
12103C02147G0294b79E4074e1340j24375A20140J07315a81558c5238o8114j65050
12092b68402f9453A97930a70808j26822J17849B546L60756b48850B1738i1388
12081B43945A04850a79272A06972C4447J0491J74324l2422Q57756M82888K148046
12071C675530j533845E40116o7156A89229a67746A72494p6462b3379D82737c93748
12060a7507B19422H2041M19043e2423b726B89401f0729C11326b9423A0572J01570
12049A12142A5622e20849a64141Q0914B9910c16402A44710E0236K04388f8679
12038a49215f6140C23748a83608K9573O9186A25036a59307H6915d3574n9217h78
12026a47034l3174o643O1976n7903A21776d338m29459K07063f142A18688q669
$$ y = [302147, 70294, -279, 54074, -51340, -175715, 120140, 227455, -181558, -35238, -103352, -268402, -69453, 197930, -170808, -297630, -179781, 2546, 363302, -248850, 21738, -91388, 243945, 104850, -179272, 106972, 34447, 44938, 219262, 186840, 1044596, 1527484, 3675530, 2141685, 540116, 472960, 189229, -167746, 172494, 96032, -23379, 482737, -393748, -17507, 219422, 82041, 501084, -52423, -2726, 289401, -60729, 311326, -29423, 10572, 112142, 15622, -520849, -164141, -83227, 29910, -316402, 144710, 50236, 254624, -68679, -149215, -66140, 323748, -183608, -154035, -84849, 125036, -159307, 86915, -43574, -102791, -878, -147034, -180208, -186851, -124875, -182778, 121776, -4338, -433797, -226734, -6142, 118688, 110019]
12015A10019C3586a2077j70545H8800O0290a9191j04089l06156H2568l5332a40018
12003a95453C72573b97238F3270a13042d9917C184J21647b20042J3082B09348
11992E6298P4060J59785b9683j09190B6835L2135b183A36422a2378C04325b15415
11980h4727A10166J64139l0731a43672A81058L14106F9792c60556A53886O9762
11970B23648p903a00461j6223m6419K9909B78926j19004b50907q362h2317A11448
11958F3650Q830J88920b2869A85138h2410j02261A24679b9159l30248B71620a39678
11946b70529B68190F6513L98614c39015A7200h6889r1390k50510a41160h454j07638
11935a16092B22853c30508a39093d2933D41033N0929l6619A095d5294a64k57407
$$ y = [110019, 33586, -12077, -182622, 88800, 149090, -19191, -123280, -429436, 82568, 47236, -140018, -195453, 372573, -297238, 63270, -113042, -49917, 3184, 124831, -220042, -206960, 209348, 56298, 130358, 290143, -29683, -138873, 26835, 58970, -2183, 136422, -12378, 304325, -215415, -84727, 110166, 274305, 243574, -143672, 181058, 495164, 69792, -360556, 153886, 223648, 215745, -100461, -116684, -163103, -133194, 278926, 159922, -250907, -259269, -82317, 111448, 63650, 72480, 261400, -22869, 185138, -82410, -184671, 124679, -29159, -359407, 271620, -139678, -270529, 268190, 66513, 465127, -339015, 17200, -86889, -178279, -428789, -141160, -8454, -116092, 222853, -330508, -139093, -42933, 441033, 491962, 455343, 1095, -45294, -164, -257571]
11924b57571C38084c4914A64607o4825J45866b08941A20856i0359L8390m7587
11914i9556P456p455K159A8689Q935d4459A65143f7751C9490a6587A5320K20026
11902B35346a6212K36j45334B3899b41048j10774I1962f4903j89105B33965A06566
11890c7703n1098j8009H4610b13235f0919A22795k3471a1974q5307l05613J67712
11879b35182o9631a96j24745j11203B94847d99408f6379a5660l35760A01393e4025
11867i5311k22623J24006b2868k70344B74008a88802k25338a24814A03560F641
11856A57476G2787k0092b6877J0598j7197p2707A15834J57445C2657a45236G9829
11844f737A45900b3417l70576J90504f1446r1566H1473k3723e4124K0492p8751
$$ y = [-257571, 338084, -34914, 164607, 99782, 245648, -208941, 120856, -90359, -51969, -99556, -92100, -99555, -97396, 18689, 27624, -44459, 165143, -67751, 39490, -16587, 15320, 235346, -16212, -15976, -161310, 23899, -241048, -351822, 91962, -64903, -254008, 233965, 106566, -37703, -88801, -106810, 84610, -213235, -60919, 122795, 99324, -11974, -97281, -402894, -235182, -304813, -196, -124941, -236144, 294847, -499408, -66379, -15660, -351420, 101393, -54025, -95311, -317934, -193928, -22868, -293212, 274008, -188802, -414140, -124814, 103560, 6641, 157476, 72787, 52695, -26877, -16279, -33476, -106183, 115834, 273279, 32657, -145236, 79829, -6737, 145900, -23417, -393993, -203489, -61446, -153012, 81473, 57750, -54124, -33632, -112383]
11833a12383j21087o9839A03457b40770F0653i3162b0009k1849l1378F0986J34815
11822A95801a52887A7433J45440b67963A672J1059P0150K8600D8956a72611b8093
11810G7264a72997A35029c04314A15778J03142a98250A847J76537p7410K06241
11800C07215b63771E5260b21177B4488P8699a45559j0228j24807A70586p9821
11790I0765m1733K80604I7826d3666l5192B68275a38558e2818q0579e8202C6551
11778a78871P0221K2365G8668a78157B09339D9870J13959c71452K2244i3975B04543
11766c17431D93915A3110a0162k6164m238p3275A46281n5057L37301b24869B35712
11754H2985A5120e8638C59043f0938n4349c25D13474a09647A26118g06938b06393
$$ y = [-112383, -233470, -303309, 103457, -240770, 60653, -93162, -20009, -41858, -73236, 60986, 195801, -152887, 17433, 162873, -267963, 1672, 12731, 82881, 111481, 48956, -172611, -28093, 77264, -172997, 135029, -304314, 115778, 218920, -198250, 1847, 178384, 100974, 307215, -263771, 55260, -221177, 24488, 103187, -145559, -155787, -280594, 170586, 90765, 49032, 329636, 97826, -43666, -78858, 268275, -138558, -52818, -133397, -58202, 36551, -178871, -108650, -86285, 78668, -178157, 209339, 49870, 163829, -371452, -349208, -93975, 204543, -317431, 493915, 13110, -10162, -36326, -40564, -113839, 146281, 91224, 428525, -224869, 235712, 82985, 15120, -58638, 359043, -60938, -115287, -325, 413474, -109647, 126118, -706938, -206393]
11742B59988a83520c5145D82246A62801a99110A88894Q4447A8117N261e8043A20672
11730f5333A15080b20775G0820c02389K3096H8246a76541B8034b07709G3646b38062
11718E075J86334b6469o3908B6216L912K15344a03749G479a40945o8658J9268
11707a90335A03692J32643N863C1363a4658k301B21352K91626B31337J08197M626
11696C44160j10733j05257P3379p4070c8625C67721C475a5333q264P611G277J01623
11684A08900b33737A95839i4679B57420d6629A73931m5643a24901C38960A34168
11673A61781e7880C25134E4807i7643r144A63941a84651B05771b9833r2217J1149
11662a10901c7078A80190J3378b57270C32622b45768E0331C235Q3110M25309A66329
$$ y = [259988, -183520, -35145, 482246, 162801, -199110, 188894, 273341, 18117, 23378, -58043, 120672, -65333, 115080, -220775, 70820, -302389, -279293, 88246, -176541, 28034, -207709, 73646, -238062, 5075, 191409, -26469, -90377, 26216, 30128, 245472, -103749, 7479, -140945, -209603, -190335, 103692, 236335, 242198, 31363, -14658, -16959, 221352, 512978, 231337, 339534, 344160, 233427, 128170, 201549, 127479, -38625, 367721, 3475, -15333, -23597, -15986, 7277, 108900, -233737, 195839, -94679, 257420, -46629, 173931, 128288, -124901, 338960, 134168, 161781, -57880, 325134, 54807, -97643, -106787, 163941, -184651, 205771, -29833, -122050, -110901, -37078, 180190, 193568, -257270, 332622, -245768, 50331, 3235, 86345, 511654, 166329]
11650C1923K36195I1029K20876a47496A1203J10296J24430k9169b51435J0954
11640b40481B07755J73436A2972a48958G0608L4658b97568a10557M8937E8952
11629A59087E6446b66734B84371H5821J99039C0439a02624B9734L4312k8511d783
11617C19738B3917J72542a46958C46995C1130f2437j61417e7648A56033C097i7964
11605a48796a3420F7490c67710C3228L10892m3994A33159B6655J37983m7492J93339
11594C10485A16025M1145P485D5724i7077B82742a32981B9497J90292a26560D83366
11582i0812A81011Q0139h6163A49964a25478A85170l6980n81j2092b95002B29374
11570A05445J90076p6210J58891j07435F5228J07637F2811B224J59107M6641i422
$$ y = [31923, 268118, 91029, 311905, -147496, 11203, 121499, 245929, 216760, -251435, -240481, 207755, 381191, 12972, -148958, 70608, 105266, -297568, -110557, -61620, 58952, 159087, 56446, -266734, 284371, 85821, 284860, 30439, -102624, 29734, 64046, 35535, -4783, 319738, 23917, 196459, -146958, 346995, 31130, -62437, -223854, -57648, 156033, 3097, -97964, -148796, -13420, 67490, -367710, 33228, 344120, 300126, 133159, 26655, 164638, 117146, 310485, 116025, 157170, 164655, 45724, -97077, 282742, -132981, 29497, 219789, -126560, 483366, -90812, 181011, 261150, -86163, 149964, -125478, 185170, 148190, 147609, 135517, -295002, 229374, 105445, 295521, 219311, 378202, 270767, 65228, 172865, 62811, 2224, 161331, 207972, -9422]
11558E745a94004N1722B20492r6444k2186a70020k9131c301G8815b1910j39902
11547a61812C14956j8029j43877l9200J40634B9094J30941C7053K83651c28136
11536A42083a35229e4174A07442C4274o764a0999c083B07807J99192J23423d5725
11524A57727m7523L6785e9498C96442j81812r9803h5337j1455A98040o4910l0454
11513A02676O6027O8290P6260A35534e6180D75032b767A64758R2174k7814E7789
11501C03038p7411A5879J22513K9563M0297h992C2729j4173a61539A86621J53093
11490C39714h9576B08365J5634P2639f9926B09873D1260L36374A77858M082m3039
11479A38901M7239J42596L0326K27743B72934k3299A03356L4463k743L9259R2987
$$ y = [5745, -194004, -142282, 220492, 124048, 101862, -170020, -199151, -3301, 78815, -21910, -161812, 314956, 296927, 153050, 113850, 254484, 29094, 160035, 37053, 320704, -328136, 142083, -135229, -54174, 107442, 34274, 27510, -10999, -3083, 207807, 406999, 530422, -45725, 157727, 110204, 146989, -59498, 396442, 214630, 114827, -85337, -96792, 198040, 133130, 102676, 168703, 236993, 313253, 135534, -56180, 475032, -2767, 164758, 256932, 229118, 57789, 303038, 225627, 15879, 138392, 167955, 208252, -8992, 32729, 18556, -161539, 186621, 339714, -89576, 208365, 223999, 296638, -69926, 209873, 41260, 377634, 177858, 181940, 138901, 186140, 328736, 359062, 586805, 272934, 249635, 103356, 137819, 135076, 174335, 267322]
11468B67322o0592b25954F0748K62487j50935K83020A21317K6480a69231K1801
11458a47430f6673D18187k06954a13821B89161l0624c4396F8561J49450b85604
11447B75677P5994C7200J78272a82069A60926L6561r6940D6467L51117C2102b5813
11435B05717I0946J01317J25758D2380O7158l9246p396a7201n7493j01256P964
11424a67986A26406i484k63679A91002a72174A85232P9109J33671j16500j4197
11414B67315A8243h2226j11971A7837Q9289C074a71743B3778h6119A83531a13969
11402C01077C6088J92615C7641e8504j51646A96506C1094a5828r1498K0927A67257
11390C07731a43572A30818c113B78914b48389H9902a47735G6116a61328A48754
$$ y = [267322, 206730, -225954, 60748, 323235, 172300, 455320, 121317, 147797, -169231, -147430, -66673, 418187, 211233, -113821, 289161, 258537, -34396, 68561, 218011, -285604, 275677, 351671, 37200, 215472, -182069, 160926, 197487, 100547, 46467, 397584, 32102, -25813, 205717, 90946, 192263, 318021, 42380, 109538, 70292, 62896, -17201, -74694, -175950, -167986, 126406, -9484, -273163, 191002, -172174, 185232, 264341, 398012, 281512, 267315, 18243, -82226, -194197, 17837, 107126, 3074, -171743, 23778, -86119, 183531, -113969, 301077, 36088, 228703, 37641, -58504, -210150, 196506, 31094, -15828, -107326, -86399, 167257, 307731, -143572, 130818, -3113, 278914, -248389, 89902, -147735, 76116, -161328, 148754]
11379a8633O844l18350I0592i8197B67286I6328g3823A32941a01511B33777E0647
11367f062k7181A13264J5146J35106c3498H9667M48b23561A46934k9667D9604
11355E2085b77010C3679a79502n09n5413j84425b07929O4321A54054b5985n1650
11344g7635I6202K8850j5180a57448j05000B90009a40228A33494o5883j632c23716
11332c89460L4137C06156b21737h0539A43565b78524A24843b26558R2819C8210
11321A18944n3042c40759I6896E154J30915J07622A11253K52539a38075I5692
11310a13706B04737A3348O8272a5747A1950b61152N8087f3681A23253E3900b02328
11298G2874c16232R4981M3028l8553H1680H993h7418c6723k71045N9313r6667
$$ y = [-18633, -11789, -330139, 90592, -98197, 267286, 96328, -73823, 132941, -101511, 233777, 50647, -6062, -33243, 113264, 128410, 263516, -33498, 89667, 90115, -223561, 146934, 117267, 49604, 52085, -277010, 33679, -179502, -180011, -235424, -419849, -207929, -143608, 154054, -25985, -77635, 96202, 125052, 109872, -157448, -262448, 290009, -140228, 133494, 67611, 65979, -323716, -389460, -355323, 306156, -221737, -80539, 143565, -278524, 124843, -226558, -133739, 38210, 118944, 65902, -340759, 96896, 5154, 136069, 243691, 111253, 363792, -138075, 95692, -113706, 204737, 13348, 81620, -15747, 11950, -261152, -203065, -63681, 123253, 53900, -202328, 72874, -316232, -221251, -178223, -216776, 81680, 8993, -87418, -36723, -307768, -248455, -345122]
11287c45122A13829l6824r66k7868a99189B8759b16742M5953q093A12271a35927
11275F0373R4795a35339L3691j15124M1272A47496i284B69997a30744k66200k6080
11264d23024J03197C5673L4318b2710j20896C9626d08953f1408J1432A53941a1104
11252H9358C417K73951j38255J7446g4858l33118A79689E3682a3567j14248B395
11240G0558J05097a77810k60641f6725G6815O4865C1910I025c33763F2707a08654
11228f0237k266A77730B7660a02207j07638g8346B46081C071K99158j15981E5029
11216g8767A85671p2572a71798B08064C2507a81384j69795C49277p1184E0974
11205A6298d2739j73372A13592a28970B30492g4024j39027b1019A03443a08911
$$ y = [-345122, 113829, 77005, 76039, 48171, -199189, 28759, -216742, -170789, -178882, 112271, -135927, 60373, 155168, -135339, -101648, -216772, -175500, 147496, -9284, 269997, -130744, -396944, -423024, -319827, 35673, 69991, -22710, -143606, 39626, -408953, -61408, -49976, 153941, -11104, 89358, 3417, 277368, 139113, 156559, -74858, -407976, 179689, 53682, -13567, -127815, 2395, 70558, 175655, -177810, -438451, -66725, 76815, 141680, 31910, 9025, -333763, 62707, -108654, -60237, -62503, 177730, 27660, -102207, -209845, -78346, 246081, 3071, 302229, 186248, 55029, -78767, 185671, 113099, -171798, 208064, 32507, -181384, -351179, 349277, 278093, 50974, 16298, -42739, -216111, 113592, -128970, 230492, -74024, -213051, -21019, 103443, -108911]
11194C0944A0437a00275A80697c2552F0278f1123b8753I1976D5853i1517D2866
11182h6778e099C2030K6365j2883a39106j56974d2055A31761a34309b0699D25900
11170A9314b2804J185p2164C68724b74186O2344f2850B07403a27913E7058J04305
11159A61363b59140j19404A51240h143A82133b9355j60221B5893b29927E891P9475
11148H5366c9776b233k80540B03765a74753e755H5688j1721J20397r1608c0916
11136A96572o6861F1620J39671o5689E4764a71977B79881K9998a4926E9001a25190
11124a49847N8260A28011B8580R6603K3140a1490j79787k5749A58204K30650g2804
11112E3109e3675B19559J9058a07515A46328J81571Q7358a79568A54248M92263
$$ y = [30944, 10437, -100275, 180697, -32552, 60278, -61123, -28753, 91976, 45853, -91517, 42866, -86778, -5099, 32030, 58395, 45512, -139106, -296080, -42055, 131761, -134309, -20699, 425900, 19314, -22804, -21619, -93783, 368724, -274186, -211842, -62850, 207403, -127913, 57058, 161363, -259140, -378544, 151240, -8143, 182133, -29355, -189576, 25893, -229927, 5891, 85366, -39776, -2233, -282773, 203765, -174753, -5755, 85688, 73967, 194364, 102756, -30916, 196572, 129711, 61620, 201291, 135602, 54764, -171977, 279881, 309879, -14926, 59001, -125190, -149847, -91587, 128011, 28580, 125183, 148323, -11490, -191277, -217026, 158204, 388854, -72804, 53109, -53675, 219559, 238617, -107515, 146328, 327899, 415257, -179568, 154248, 646511]
11102F46511I8828K76160j79799L13736B33989L27634E6460L67621A65729J34246
11092B99975m4283K61343k14160L872J11898A00478K10101j04056K37499D7156
11081B22869M2550P5976J2704j24445R9076r0323L41191j26813j26083j54739
11071A71963K8830J24297K99255m3566k46796Q2516R190J96136C10302L33727
11061F44029j0130L53526m78427N3888M10136j73629j31987J83518j84803m9997
11051F16124K89119L15662n18638N73844k50171o3596J91696k23500n6941M80359
11041A353958k22125k05432k50992N16145k67200M84402m66506O48059k68228
11032A322081j54717q8066o7519o4154l85304M40479k07988O02126k25180J22473
$$ y = [646511, 98828, 374988, 195189, 508925, 233989, 561623, 56460, 424081, 165729, 299975, 255692, 517035, 302875, 306747, 418645, 100478, 310579, 206523, 444022, 47156, 222869, 265419, 341395, 354099, 229654, 328730, 238407, 579598, 452785, 326702, 171963, 200793, 325090, 624345, 580779, 333983, 416499, 425689, 621825, 310302, 644029, 633899, 987425, 508998, 562886, 973022, 799393, 667406, 850924, 666121, 616124, 905243, 1220905, 702267, 1276111, 1025940, 962344, 1154040, 930540, 873599, 1353958, 1131833, 926401, 675409, 1191554, 924354, 1408756, 942250, 1590309, 1322081, 1167364, 1079298, 1011779, 947625, 562321, 1002800, 794812, 1396938, 1171758, 1294231]
11022A294231k07315K06269m30588j25921L14371m04339M45443k47406J2850m19040
11012D38555M73866O6581k06324K12799k09942q2751J65046k34590K22596j03720
11002G42116K16351j22509O060K81846k22412j13959K91193K8151k95065J42412
10992I54184K00042k73453M10548k71846K86374k77884L20425k0069n0067l5472
10982A242782J30599L02355L2198M3732j17340L96236P2303k15447J020086n5385
10972B852119M80247L08917O6274L55961J50426j09639l6260m69107l45749l06996
10962B946193j90673l51055L77862j41013j17203K067K48704J37637J22614J09364
10952C144497n62304l00956o58276j15182k39284M01093G82013M4631j2927l10160
$$ y = [1294231, 1086916, 1293185, 862597, 736676, 1051047, 646708, 1092151, 844745, 857595, 438555, 912421, 979002, 772678, 985477, 775535, 692784, 857830, 623240, 845836, 742116, 958467, 835958, 842018, 1123864, 901452, 787493, 1078686, 1106837, 811772, 954184, 1154226, 880773, 1291321, 1019475, 1305849, 1027965, 1348390, 1328321, 1278254, 1242782, 1373381, 1675736, 1707934, 1751666, 1634326, 2030562, 2102865, 1887418, 2907504, 2852119, 3332366, 3641283, 3707557, 4063518, 4213944, 4104305, 4068045, 3598938, 3253189, 2946193, 2755520, 2404465, 2782327, 2641314, 2524111, 2526178, 2774882, 2912519, 3035133, 3144497, 2582193, 2281237, 1622961, 1507779, 1268495, 1669588, 782013, 826644, 813717, 503557]
10942E03557j17811K05818J10849k23678o1386J13189N7028P129b22040B17385
10931C32949j48755J94971j7827m2121R8999C337K88166A04301J4639R8201n0876
10920A66265a33458L3252I1692C6816L8771O1264j7211Q7595G471J03735l8589
10909G2617j8755b78798J03437B07408F2820J73140Q7911i4359j47072D9507J47963
10898A97470b51283B42357D8884a41243b5156I2168J8711R3139a44149a8188A46999
10886a75602A8565e8574A96261a26658f2105K7474J1348F7758a3301D9525J83867
10875B33392b36868B219R2600p340J9360e248j23705e5414o8269a5648A25205
10863e3164C3825J00074b7787k5124A27788d08204H7910e3269k2286A09544e4265
$$ y = [503557, 385746, 591564, 702413, 478735, 417349, 530538, 587566, 594695, -222040, 217385, 332949, 184194, 379165, 361338, 319217, 418216, 3337, 291503, 104301, 118940, 217141, 166265, -133458, -100206, 91692, 36816, 75587, 136851, 119640, 207235, 7471, 111206, 72617, 53862, -278798, -175361, 207408, 62820, 235960, 323871, -94359, -241431, 49507, 197470, -251283, 242357, 48884, -141243, -25156, 92168, 110879, 204018, -144149, -18188, 146999, -175602, 18565, -58574, 196261, -126658, -62105, -34631, -23283, 67758, -13301, 49525, 233392, -236868, 2219, 94819, 87479, 106839, -5248, -128953, -55414, -123683, -15648, 125205, -53164, 33825, 133899, -27787, -52911, 127788, -408204, 87910, -53269, -75555, 109544, -54265]
10851B19694i056C3434J2029g3266F9579K75870c00793d2182k23350b5410A556
10839c35696A11309L7927c61403J09862F1176g8991A62547J66009d9033B2239
10828a54017b3222k1723O244A64071J1454h1419C8219R9051K764c5436n5198j49334
10816b39968r6255I2820j9994O1554m6504c7352j40868A89374a60952L0645B08449
10804a42132E175g9956o4038G1014I295a9020H6361k0344M2962h7964r7583K2116
10792a63431A29023b36977C99612h9128A53064a97407B9270J0783b7048j22911
10782a49959A02485P8435a75516N6783j42556a08809G0722h3283j1259A57452
10771b4355h474A27264L34212b78858e8453m9733E7740f128E5668b88840F4284
$$ y = [219694, -9056, 33434, 45463, -73266, 69579, 345449, -300793, -42182, -265532, -25410, 1556, -335696, 111309, 149236, -361403, -251541, 61176, -78991, 162547, 328556, -49033, 22239, -154017, -23222, -44945, -38701, 164071, 175525, -81419, 38219, 137270, 140034, -35436, -90634, -239968, -336223, 92820, 72826, 134380, 87876, -37352, -178220, 189374, -160952, -130307, 208449, -142132, 5175, -79956, -143994, 71014, 9295, -19020, 86361, 66017, 108979, -87964, -185547, -163431, 129023, -236977, 399612, -89128, 153064, -197407, 29270, 40053, -27048, -149959, 102485, 180920, -175516, -118733, -261289, -108809, 70722, -83283, -94542, 157452, -24355, -8474, 127264, 461476, -278858, -58453, -108186, 57740, -6128, 55668, -288840, 64284]
10759A32482b4449B27709j8940b52820D92366b60871P6409J4127O4146p8431I8146
10747a78291G4066a54449F1J4673b51013H3812b46158l5947A32953a54095J7277
10736a36818A0618a68951B7420J5387I925L11884E2226K04660H9300a40461j17802
10725b58263B21338a02116A01712c920j67369j79587O6654A88769J21925A21159
10714a18558A7142K54926D9105a61832I2939b7847l6011H148a77954b1824j58880
10703a80704N4647j20546H797g3616m8795O774H878d2703j78187b8721r189j92085
10691b29995Q3424M2926e0131e780j97776K8571B0835M3305R4969b25099g7012
10679i154l08638A10972E680L689K2712J22856l7821h8248j05017a831o7889l35022
$$ y = [132482, -24449, 227709, 208769, -252820, 492366, -260871, -184462, -170335, -106189, -184620, 98146, -178291, 74066, -154449, 61, 14734, -251013, 83812, -246158, -282105, 132953, -154095, -136818, 10618, -168951, 27420, 42807, 9925, 321809, 52226, 256886, 89300, -140461, -258263, 221338, -102116, 101712, -3920, -171289, -350876, -284222, 188769, 310694, 121159, -118558, 17142, 272068, 49105, -161832, 92939, -27847, -63858, 8148, -177954, -21824, -180704, -126057, -246603, 8797, -73616, -122411, -115637, 8878, -42703, -220890, -28721, -37910, -229995, -146571, -103645, -50131, -5780, -203556, -174985, 20835, 64140, 159109, -225099, -77012, -9154, -317792, 110972, 5680, 9369, 32081, 154937, 117116, -88248, -193265, -1831, -69720, -404742]
10667d04742A6324b87248o5657F7005J76694b91298B29279b83894E0686K31255
10657B81941f8872B5253c86781g9390B5264l005N2624K06262f1068A44144a60686
10645a48229G0521d4993p2243a8834A64879c7542B80916c1394k19992A20255g6458
10633a82179L7734H9678b45843C96190b15860a03921r4958F8231d0473J1666G706
10621d35786a35709q9145K8562H2420J42296a40396A18656E4919f0503K5727A99395
10609A06385L5971F8913b2519j55930J0877j21802E8323a07034d6069k73154F3133
10597a25623F7773C1623h1271c9240m9791j72076j19534a78440A133a13827M3866
10586f9961l2152j01962J9070M5069G5743N3388a08039K9717m1444A68816C1130
$$ y = [-404742, 16324, -287248, -352905, 67005, 243699, -291298, 229279, -283894, 50686, 281941, -68872, 25253, -386781, -79390, 25264, 22259, 74883, 281145, -61068, 144144, -160686, -148229, 70521, -44993, -117236, -18834, 164879, -37542, 280916, -31394, -251386, 120255, -76458, -182179, -144445, 89678, -245843, 396190, -215860, -103921, -198879, 68231, -40473, -28807, 7706, -435786, -135709, -224854, -196292, 82420, 224716, -140396, 118656, 54919, -60503, -34776, 199395, 106385, 142356, 68913, -22519, -178449, -167572, -289374, 58323, -107034, -46069, -319223, 63133, -125623, 67773, 31623, -81271, -39240, -89031, -261107, -380641, -178440, 1133, -113827, -69961, -102113, -204075, -185005, -139936, 75743, 129131, -108039, -78322, -119766, 168816, 31130]
10574d9752n6423A09784a45017q6303n7524Q5299F9622O9552a93055B5840J26443
10563A52283q978B4563A0638J80080c7035A65120j5586a1812n6824k995k69370
10552c41001A15227f4295o4579F6725c52255L3762J38567n1811A7735q062h6642
10540A6641n811i9494j43801h1266I3676b81023h9779k44964K714B67271d8705
10528b05709A60445l561O3566p7684B3741b15756A07164f8536I7354a52298A52762
10516B13235J71973d4547A080c77457D8430b65757E0079J54786q1167B763a73608
10504A49497a73790r5152e8766l82723c1659A81426g5370A86136c06240E2129
10493A11829c384A83773K41203A79147O1106e6772A90731D72i1760q8555C5794
$$ y = [-49752, -106175, 109784, -145017, -231320, -288844, -203545, 69622, 139174, -193055, 25840, 152283, 143305, 24563, 10638, 190718, -37035, 165120, 149534, -11812, -68636, -71631, -341001, 115227, -64295, -128874, 66725, -352255, -318493, -179926, -231737, 17735, 9673, -86642, 16641, 10830, -99494, -243295, -81266, 93676, -281023, -89779, -334743, -332029, 267271, -48705, -205709, 160445, 156884, 220450, 142766, 23741, -215756, 107164, -68536, 97354, -152298, 152762, 213235, 385208, -44547, 1080, -377457, 48430, -265757, 50079, 204865, 123698, 2763, -173608, 149497, -173790, -268942, -58766, -441489, -31659, 181426, -75370, 186136, -306240, 52129, 111829, -3384, 183773, 424976, 179147, 240253, -56772, 190731, 472, -91760, -180315, 35794]
10481B89257h96B50256l7103L74905k73028J60549L7701J54261B21072L0202a70187
10469D60162j89299a28341l912A16161j5401a81152N0778A80830m6880f5509E986
10457F073K02854l3247a77233J8095C5735e5853k37518a01027A54093a24648A47646
10445A97269G0279N1347j7139J3969l1149C2323J90434P7671M6728g0613l875
10434g4488H5459l5597a57794J9223A52618N6747a7413k5997F5156J48006a78402
10422C3535K4391b282j7499j4896A21095L3036a04667C50848A35538i3485m8849
10411a42334g0549j58364b0729j28000O2712B14827b1093q527m9615q2011A26072
10399D3720j5986b792D7745J24218q4064J95902j03943J55142C7347K22528o6904
$$ y = [289257, -896, 250256, 213153, 588058, 315030, 475579, 513280, 667541, 221072, 251274, -170187, 460162, 270863, -128341, -132253, 116161, 100760, -181152, -130374, 180830, 133950, -65509, 5986, 6073, 208927, 175680, -177233, -159138, 35735, -55853, -293371, -101027, 154093, -124648, 147646, 197269, 70279, 121626, 104487, 118456, 87307, 32323, 222757, 300428, 347156, -70613, -74488, 85459, 49862, -157794, -138571, 152618, 209365, -17413, -43410, 65156, 213162, -178402, 33535, 57926, -2282, -19781, -34677, 121095, 154131, -104667, 350848, 135538, -93485, -142334, -70549, -228913, -20729, -148729, -86017, 214827, -21093, -29620, -79235, -161246, 126072, 43720, 27734, -2792, 47745, 171963, 87899, 283801, 179858, 335000, 37347, 259875, 192971]
10388A92971B2929J50581A320J82127K53638A95147m1824J5722J1038n3612L62067
10377D88538A15142J47340K91444c861G7084L68834k10624K99683B43887K57955
10367E01842r2705J227l5542J59016J7692B18679J71204J04379m9129J82290A97987
10355D7307J20474M23906q4765q8499P2246K42770P7238j10681k55348I5131K81499
10344C76630K2512J93290J55556B31312L4267j4065J42095A20557J07004r2437
10334A35124L9679p2234J07328k143j9463G6695a88597A35189a3527C64605a56559
10322B01975N8825P9645G5776J10037J22921j25350e927D3712J50892a1589B11900
10310B62020a75253F5025g3436l2321M2941D2905f0921K0970B19495H7716b29683
$$ y = [192971, 22929, 173510, 1320, 183447, 437085, 195147, 153323, 169045, 180083, 126471, 488538, 115142, 262482, 553926, -3861, 77084, 445918, 235294, 534977, 243887, 501842, 409137, 410364, 374822, 533838, 551530, 218679, 389883, 494262, 445133, 627423, 197987, 47307, 167781, 591687, 506922, 418423, 490669, 733439, 810677, 699996, 444648, 95131, 376630, 399142, 592432, 747988, 231312, 265579, 251514, 393609, 120557, 227561, 135124, 174803, 102569, 209897, 207754, 188291, 76695, -188597, 135189, -13527, 364605, -156559, 201975, 260800, 340445, 75776, 185813, 308734, 183384, -5927, 43712, 194604, -11589, 211900, 262020, -175253, 65025, -73436, -105757, -62816, 42905, -60921, -39951, 219495, 87716, -229683]
10298b07469h424A59262O2715G0960a47441A70026O919H4507o581Q3688a76213
10286a86559o7786F2819J12202l6426h1202j24950N9244A21990C4753R8944g2394
10274a69281b1292B65050D4970J98581k3438c66587a061k63815A87865a9120K802
10263a6318C6050K00117a25876B56020e1551B86592f7721D56621J775A10524M53349
10252E63873B20984L41295B30692D4416L2453a13327A46504a99038a3574G0548
10241A72107c0195j95855R6244C15515D6487g684A63744b79830e9023K7511D5961
10229E2289J05915k2486k6969a55172q9265b9767k30200b9806q7196N3447J9487
10218d4068k91690B17822G6139J55199b28870A42671K507J01875a04429L6920
$$ y = [-207469, -8424, 159262, 221977, 70960, -147441, 170026, 176945, 84507, 77926, 161614, -176213, -186559, -254345, 62819, 175021, 138595, -81202, -206152, -146908, 121990, 34753, 133697, -72394, -169281, -21292, 265050, 44970, 243551, 220113, -366587, -1061, -264876, 187865, -19120, -16318, 36050, 236167, -125876, 256020, -51551, 286592, -67721, 456621, 458396, 110524, 563873, 220984, 562279, 230692, 44416, 76869, -113327, 146504, -199038, -13574, 70548, 172107, -30195, -226050, -129806, 315515, 46487, -7684, 163744, -279830, -59023, -31512, 45961, 52289, 158204, 135718, 108749, -155172, -244437, -29767, -259967, -29806, -117002, -63555, -44068, -335758, 217822, 76139, 231338, -228870, 142671, 145178, 247053, -104429, -67509]
10208f7509A06894A6456j957b27476m2260A47841e22432a84986d4012k72930D2497
10196A07552B2342a86937k3488L3702A17642d6482G3186c8056H942K79859d42028
10184a66768B24323a99024g3384p2989q0656N0795N1755N6319n9450C29951b07558
10172b31002j49959G3670i835j21013r5687O5713B6223L5662a64083P4710A88292
10160A43548a86247p7496k0675a14186A27103l7638b70669c151A17631i3761k9577
10149a23338e1875j09123F8095B3543d55480a83242j2246A37073c93436a59791
10138b72302d8187j39641I903b75766M8052G8583J62178b48284g1843k97621A73033
10126B6699a59927A16387I948g505j59307j34136j64766K24250C7769c08819e6083
$$ y = [-67509, 106894, 16456, 14499, -227476, -269736, 147841, -522432, -184986, -44012, -316942, 42497, 107552, 22342, -186937, -210425, -176723, 117642, -46482, 73186, -38056, 8942, 288801, -442028, -166768, 224323, -199024, -73384, -146373, -227029, -176234, -124479, -68160, -127610, 329951, -207558, -231002, -380961, 73670, -9835, -130848, -226535, -160822, 26223, 61885, -164083, -89373, 188292, 143548, -186247, -263743, -284418, -114186, 127103, 89465, -270669, -3151, 117631, -93761, -123338, -51875, -160998, 68095, 23543, -455480, -183242, -195488, 137073, -393436, -159791, -272302, -48187, -187828, 9903, -275766, -227714, 78583, 240761, -248284, -71843, -369464, 173033, 26699, -159927, 116387, 9948, -7505, -166812, -300948, -465714, -241464, 37769, -308819, -56083]
10114b8981k9957k06831a31174q8619l6826A45086a2035H2240L10564f2040j34380
10103a96420P4336g558m843k06683b3711A41103a60775o3831i308o2946j62049
10092b34303A42683b00433C7677J30037J94668a51551a3801k78925G9380a57133
10081b3661j40211C6375j2051h4789A61697a43610A76132G8541K7118e6960C9442
10069a9119j61371A5576L3378h4595A88204K8744I42R3862p3a57973A05079J65637
10057B70716h7779C328K52038o5945r0070a51696f0651j46675e0106A10885B7127
10045a29627k28006a12604L4423A73870C1867b89971H2707L24102f1066A00006
10034d6874l1047j09373F5944h3330m559r092r7422o6143c41j05201N2052C3743
$$ y = [-28981, -58938, -265769, -131174, -219793, -256619, 145086, -12035, 82240, 392804, -62040, -196420, -122084, -7558, -12401, -219084, -23711, 141103, -160775, -224606, -9308, -72254, -234303, 142683, -200433, 37677, 167714, 362382, -151551, -13801, -292726, 79380, -157133, -23661, -163872, 36375, 24324, -84789, 161697, -143610, 176132, 78541, 105659, -56960, 39442, -19119, -180490, 15576, 48954, -84595, 188204, 216948, 942, 94804, 94731, -157973, 105079, 270716, -87779, 3328, 255366, 189421, 99351, -151696, -60651, -207326, -50106, 110885, 27127, -129627, -357633, -112604, -78181, 173870, 31867, -289971, 82707, 406809, -61066, 100006, -46874, -77921, -187294, 65944, -83330, -87889, -96981, -194403, -260546, -341, -105542, -53490, 33743]
10021b19571A9545a30258j77876d9171m33186K3926K18113i5771j04017i7143
10010b7935A2608K8228j3890K6785a54500A5584a91800p6428a14529a9080A84581
9998c99484R7144a6379j79184j20954C69016d3660D3955b8288k99512B30642b5158
9986i1026C1460N8815a51091F6410K02564c6173A86401a55856p5758g8125j64387
9975b42512b4118l09583i125n35670G387h9515A53517m283a32946p691J0055q3505
9963b14087C6361J0034b11034O8154j98226e9919o3294J0666b9706E8754N8883
9952A17637c7205R485A75805g6467j50701P409M1848A51878d0881j91686B09796
9940c47727a38111l07937J78773C0549c87997j45079A97196i0869B27327a16044
$$ y = [-219571, 19545, -130258, -308134, -49171, -482357, -458431, -240318, -95771, -199788, -97143, -27935, 12608, 40836, 26946, 53731, -154500, 15584, -191800, -268228, -114529, -19080, 184581, -399484, -302340, -16379, -195563, -316517, 369016, -43660, 43955, -28288, -327800, 230642, -25158, -91026, 31460, 90275, -151091, 66410, 268974, -36173, 186401, -155856, -231614, -78125, -242512, -24118, -333701, -9125, -544795, 7387, -89515, 153517, 149234, -132946, -140637, -130582, -214087, 36361, 46395, -211034, -142880, -341106, -59919, -123213, -112547, -29706, 58754, 117637, -37205, -27720, 175805, -76467, -227168, -219759, -177911, 151878, -40881, -232567, 209796, -347727, -138111, -446048, -267275, 30549, -387997, -533076, 197196, -90869, 227327, -116044]
9929A75660a07613A60611c61412C7535J268b23955N3335j78361D9113c77808c8506
9917A46805d62660A17052g8306k11910A38552b64491d7641n8178P759l57269P3382
9906c81947j41427a24703o7101l7399P0143p3880a5893m0691j68176E5803b86669
9894B37103c778p5247A32149c8047i732C0046e71423C63160b18794I1920a74363
9882b89731h4669c0067j1986j51429B17366a74234n2212j25797a64558J0884K4463
9871a29211L7958A95264a80916j67058i0139G3661D836e1830j49220c0618j62865
9860a93483N4483M0387A87495c0885j2117B70919A4193a87197f5641l03666a79160
9848d7263F3251b63467F946a80167M5518A03358a6018F5465a66243D3055b9705
$$ y = [175660, -107613, 160611, -361412, 37535, 38803, -223955, -170620, -348981, 49113, -377808, -38506, 146805, -462660, 117052, -78306, -290216, 138552, -264491, -47641, -105819, -98060, -455329, -381947, -523374, -124703, -191804, -229203, -159060, -232940, -15893, -56584, -224760, 55803, -286669, 237103, -3778, -79025, 132149, -38047, -9732, 30046, -571423, 363160, -218794, 91920, -174363, -289731, -84669, -30067, -42053, -193482, 217366, -174234, -226446, -352243, -164558, -153674, -129211, -91253, 195264, -180916, -347974, -90139, 73661, 4836, -51830, -201050, -30618, -193483, -139000, -98613, 187495, -30885, -43002, 270919, 14193, -187197, -65641, -369307, -179160, -47263, 63251, -263467, 6946, -180167, -134649, 103358, -16018, 65465, -166243, 43055, -29705]
9836A22726d31226h7630A79268b71598i8427m3664b7160k3409A10012c00342I3393
9824e0139A8577f3537l45822A11686b29324g0282A20330d77970a09606B1736i3823
9812d89007f9078k06982J6617M5414A5818J26632a48380j46190K2265A26793D5811
9800A53959A376b92258g7598k0498j2047q8938A5333i7742l4754A80309d61512
9788d30812a0870l5824j24985G0113L8998a75314j5028Q4249a9175l99420E7632
9776c2607l04954G0824g40693h1502j0641n212I989a18060A37570a16468D4919
9764b37366J7738N6674C3076e61382B1595p33L2297a4644m7828j02382J8622B44056
9751a54016A95419i2249I2322a33219C1514g1495l29262I0780K5544A813a26366
$$ y = [122726, -431226, -87630, 179268, -271598, -98427, -142091, -27160, -50569, 110012, -300342, 93393, -50139, 18577, -63537, -409359, 111686, -229324, -70282, 120330, -477970, -109606, 21736, -93823, -489007, -69078, -276060, -259443, -214029, 15818, 142450, -148380, -294570, -272305, 126793, 45811, 153959, 1376, -292258, -77598, -98096, -110143, -199081, 15333, -97742, -132496, 180309, -461512, -430812, -10870, -46694, -171679, 70113, 109111, -175314, -190342, -106093, -19175, -418595, 57632, -32607, -337561, 70824, -740693, -81502, -92143, -97355, 9989, -118060, 137570, -116468, 44919, -237366, -219628, -162954, 33076, -561382, 21595, 20862, 53159, -14644, -62472, -164854, -146232, 244056, -154016, 195419, -92249, 92322, -133219, 31514, -71495, -400757, 90780, 116324, 1813, -126366]
9739d2788a7300n626n7064b7738k28074j38291a85783B06581p046r0436l254P6109
9727A81954a00257Q968A40544a52726j0473g9948j01813O6966m1404c4294l1384
9716f5678j05942j47455A43254b38024R689P238B7158q439J72952a89889A8607
9704b09150M0065A29679N2563K1631a6665k31591A21754k1868j7299c17454P9158
9693b38296k4449a6713m3667a0625D6637M12298b8434B41303a72223A44201C4081
9681B45616b42505D3125a89764a5600k92003i0572j86326N5341g9480r861G8041
9669E1195R9698e9934l33237B8956K42789c66941p942a25738b2530j55337c683
9657a3281A3909J8181h4713j3219j21853l6009a19387o0054A80020b63709g777
$$ y = [-42788, -17300, -22926, -79990, -27738, -255812, -394103, -185783, 206581, 199535, 109099, 105845, 181954, -100257, -91289, 140544, -152726, -163199, -79948, -181761, -114795, -156199, -34294, -65678, -171620, -319075, 143254, -238024, -228335, -221097, 27158, 18719, 191671, -189889, 18607, -209150, -169085, 129679, 182242, 203873, -16665, -248256, 121754, 99886, 82587, -317454, -238296, -262745, -16713, -60380, -10625, 46637, 458935, -28434, 241303, -172223, 144201, 34081, 245616, -242505, 43125, -189764, -15600, -307603, -90572, -276898, -221557, -79480, -89341, 78041, 51195, 150893, -59934, -393171, 28956, 271745, -366941, -374883, -125738, -22530, -177867, -3683, -13281, 13909, 32090, -84713, -97932, -219785, -255794, -119387, -179441, 180020, -263709, -7777]
9645e2971k65598g9676j47327P3161A21691a82327j8444j63100a16059q8439g477
9633C0680a14927j6127E674c79297B4355b43763N4923j38688a28556B907d75677
9621c05297H0615l9235i7901m18463a86962q9741d722l09326a46699J5509B5928
9609B58441a27811A18010a27548C06093b16318B04256c11161c6640j79579b9698
9598B41765a01738J1098j89149a22089j14962A73577b14397l9553j16483e3408
9587A62523C8129b28759j4822a03A28738b19383N0643B44544h6456j04498M0818
9576a50136E0308b22264k38516d1115B55947H4391c46283P5342i9232A8796F768
9564a90900c3361l20569j8842a46117A55518b10089A0530d3922A40903a49296
$$ y = [-52971, -318569, -79676, -227003, -153842, 121691, -182327, -200771, -363871, -116059, -204498, -7477, 30680, -114927, -131054, 5674, -379297, 24355, -243763, -188840, -327528, -128556, 2907, -475677, -305297, 80615, 41380, -97901, -516364, -186962, -276703, -4722, -314048, -146699, -131190, 25928, 258441, -127811, 118010, -127548, 306093, -216318, 204256, -311161, -36640, -216219, -29698, 241765, -101738, -90640, -279789, -122089, -237051, 173577, -214397, -253950, -370433, -53408, 162523, 38129, -228759, -243581, -103, 128738, -219383, -168740, 244544, -86456, -190954, -150136, 50308, -222264, -460780, -41115, 255947, 84391, -346283, -270941, -99232, 18796, 6768, -190900, -33361, -353930, -372772, -146117, 155518, -210089, 10530, -43922, 140903, -149296]
9553d7773k42484J16825j50341J26918p6182N6091f7498k30772B198g7707l63610
9542d41317C8078D705J24691b299B50044b9518j84629A22864f1764K4635j9214
9531e6343J717A9284l127b38751h5088l9636p5500R2394l87421b09443B0124a64773
9518e50148h6954l706k59821J53121a8163j54668B17180a53577f3052A910K39167
9507B41077a06941D9636a43557A80043c37532a34750A92657d0662a0677I931J83271
9496A93202c999q12j48429e0464A93313A5036a78096l69144I0676B2826d88667
9484A19150e2678j96270I0852C9107O6160b12316C7913R9234b53145l3552i8677
9472d4930I8682a65969A97255f6089j08612f7308p9791a2900E1676A4330i0026
$$ y = [-47773, -290257, -173432, -323773, -196855, -273037, -216946, -67498, -298270, 2198, -77707, -441317, 38078, 4705, 129396, -2299, 250044, -29518, -214147, 122864, -61764, -37129, -56343, -54626, 19284, 16157, -238751, -85088, -124724, -200224, -107830, -495251, -209443, 20124, -164773, -550148, -86954, -90660, -350481, -197360, -18163, -172831, 217180, -153577, -63052, 1910, 241077, -106941, 49636, -143557, 180043, -337532, -134750, 192657, -40662, -10677, 9931, 193202, -3999, -4811, -153240, -50464, 193313, 15036, -178096, -547240, 90676, 22826, -488667, 119150, -52678, -248948, 90852, 39107, 105267, -212316, 37913, 137147, -253145, -286697, -98677, -44930, 98682, -165969, 197255, -66089, -174701, -67308, -147099, -12900, 51676, 14330, -90026]
9460C46888b38453o9598A70569a30639j31585a28146L3095a7569l276J0419j43085
9449a53511H6731P1939E028a32360B2241i0337j5377k23554J33638A41591j0143
9438A31448g9474a3177B16588p2357c27593q3933C5245d3889D2154L1648f6680
9426a95000R733J59k3937A89862b96221I1513a00917A29002b62847A1680N2697
9415F4377a30137k1816n6404f6205C30994a86838k1796A73692b44769B01221D5470
9403a53501p9580j53140a67948O2689G8524o849h7727F8966g3344A06439f3880
9391b96057K8360a22215l1751q5738A36953m0471c08362b0353A36825a45002B8887
9379h8899k70111A13707D5047a95408A4827d7739A12432c35258c9829B13254K5696
$$ y = [346888, -238453, -308051, 170569, -130639, -262224, -128146, -95051, -17569, -20845, -10426, -153511, 86731, 158670, 5028, -132360, 22241, -90337, -105714, -329268, -195630, 141591, 131448, -79474, -13177, 216588, 144231, -327593, -411526, 35245, -43889, 42154, 73802, -66680, -195000, -185267, -185108, -209045, 189862, -296221, 91513, -100917, 129002, -262847, 11680, 64377, -130137, -151953, -208357, -66205, 330994, -186838, -208634, 173692, -244769, 201221, 45470, -153501, -233081, -386221, -167948, -105259, 78524, 71675, -87727, 68966, -73344, 106439, -63880, -296057, -267697, -122215, -153966, -239704, 136953, 96482, -308362, -20353, 136825, -145002, 28887, -88899, -359010, 113707, 45047, -195408, 14827, -47739, 112432, -335258, -39829, 213254, 238950]
9368B38950a84368E456J5238b08672A99835a36821A43134b63176a27437A13875
9357c4162k02066B65236A05510B1757b12548Q4944p7244N5303A5614a07346p6997
9346a84343j0648B46521j8262a22468k51055A4662a58685O0177D513a27199C66638
9334A04478m3425b96321B3267c89241C3025c5068G9171b44714F1400c1732o5136
9323i6868J1449F5818J7053a04357H2442f5596l421j40031M1233H1879c07552
9311f9032A34451a35498b0958j23345M0799A42612b63157p0131e828j15495L8205
9300h3118B1961a77546I2492i0472D8326g9790B79289a54674q6027j77C798d7627
9287a68344j08405A39458b3624l15152A2176b61164k8907B40619H6326a25178
$$ y = [238950, -184368, 5456, 20694, -208672, 199835, -136821, 143134, -263176, -127437, 113875, -34162, -236228, 265236, 105510, 21757, -212548, -127604, -204848, -149545, 15614, -107346, -184343, -194991, 246521, 228259, -122468, -373523, 14662, -158685, -98508, 4513, -127199, 366638, 104478, 61053, -296321, 23267, -389241, 33025, -35068, 79171, -244714, 61400, -31732, -96868, -85419, 65818, 82871, -104357, 82442, -65596, -69017, -209048, -167815, 81879, -307552, -69032, 134451, -135498, -20958, -144303, -103504, 142612, -263157, -333288, -5828, -121323, -83118, 21961, -177546, 92492, -90472, 48326, -79790, 279289, -154674, -240701, -240878, 3798, -47627, -168344, -276749, 139458, -23624, -338776, 12176, -261164, -290071, 240619, 86326, -125178]
9276a50834c4330F9120g7476b9040R14D74271A13581n3066Q847O729N060A3057
9263a77651C78245b90272A45916b66340J7118a18361J9962j46834J17516c122
9252a45236A02217b99157f027j34100j94177A47540C4838M10084a9460p0990j7347
9241a07797j06613G9770A2933P5197i3071l38718C6623A8165a72582i054j13024
9230a22078I2059M29435d35749K03302A08750a65997j27548e864m2115r6402k1713
9219a66094e431n6085H2800e9490H1928a04689f998n61539C08390b65514b8436
9207A2566b59122p0131a06123E9352a30329A73346e7514h464H0598a28366l6947
9196a65313G4990c36651c45C96608d0023r2759B80071a3626l71210a57562f0844
$$ y = [-150834, -34330, 69120, -77476, -29040, -28126, 474271, 113581, 60515, 69362, 76091, 81151, 13057, -177651, 378245, -290272, 145916, -266340, -249222, -118361, -98399, -245233, -127717, -3122, -145236, 102217, -299157, -6027, -140127, -334304, 147540, 34838, 444922, -19460, -90450, -107797, -214410, 79770, 12933, 88130, -93071, -431789, 36623, 18165, -172582, -9054, -122078, 92059, 521494, -435749, -232447, 108750, -165997, -293545, -5864, -47979, -144381, -166094, -5431, -61516, 82800, -59490, 81928, -104689, -6998, -568537, 308390, -265514, -28436, 12566, -259122, -329253, -106123, 59352, -130329, 173346, -57514, -8464, 80598, -128366, -165313, 74990, -336651, -345, 396608, -40023, -132782, 280071, -13626, -384836, -157562, -60844]
9184b65741B9502a59078m3896H515J26990a09054m3730b3046j80128k25000g7186
9172c45939a9376A08129a73896o1158A83932A4957c8660r3783k4422f5694d201
9160c82957a68667C2179a37343A07836a33881A36332a5275F9593E214a17276K6291
9149i0985d2638p7190M9087G7687J8521a81199A64698A7014M34326b22622e3607
9137a3222c091j21898m436n9829l60283A64132b2064A75554H599J31828b76123
9125a35669L4963J4801G253b59534B8320K9752J57813G0618k4033a60447A12249
9113a15693k05372d2342I1077a59589j77858o4537a26692F7357b15833b1277k10243
9102b31520i7007m2783L1275n6603f7594G8510L152a54646B2709a17564l16295
$$ y = [-265741, 29502, -159078, -202974, 8515, 135505, -109054, -152784, -23046, -203174, -428174, -77186, -345939, -19376, 108129, -173896, -235054, 183932, 14957, -38660, -132443, -156865, -65694, -4201, -382957, -168667, 32179, -137343, 107836, -133881, 136332, -15275, 69593, 5214, -117276, -90985, -42638, -119828, -70741, 77687, 96208, -181199, 164698, 17014, 451340, -222622, -53607, -13222, -3091, -124989, -129425, -189254, -549537, 164132, -22064, 175554, 8599, 140427, -276123, -135669, -100706, -85905, 7253, -259534, 28320, 58072, 215885, 70618, 46585, -160447, 112249, -115693, -321065, -42342, 91077, -159589, -337447, -401984, -126692, 67357, -215833, -21277, -231520, -97007, -139790, -108515, -165118, -67594, 78510, 81662, -154646, 22709, -117564, -433859]
9091d33859l1495K32316D3403a9426E5655P5575a74245G3567Q8982k4312G257
9079h788l19184j30719b18287e3929k38083h4561k08276D40280E9987b2660k33102
9068b55762a10288A11463R5759c02508I5999d8761E7415L4688a93513A67878P2938
9057B40816b51518b9867k87352K8983j02388B03479I5813a0072j59263d3791l79176
9046d22967B39578B7035J302Q2757c24610J48110A16601I561b18858B6698d6870
9034a16776j83392Q9699E877g2465L2411j69012R0188c3737m3658k99074H8464
9022C1519c48461a71003M7004C4395a60850B69343b11179N4048K4725L1049A4469
9010b07697d9067m8330d2934B659J98983C1276R0128a19625I7050b00589O1086
$$ y = [-433859, -465354, -233038, 43403, -19426, 55655, 131230, -174245, 73567, 162549, 138237, 7257, -8788, -327972, -458691, -218287, -53929, -292012, -84561, -292837, 440280, 59987, -22660, -255762, -110288, 111463, 207222, -302508, 95999, -48761, 57415, 92103, -193513, 167878, 240816, -251518, -29867, -317219, -288236, -390624, 203479, 95813, -10072, -169335, -43791, -422967, 239578, 27035, 28337, 111094, -324610, -176500, 116601, 9561, -218858, 26698, -46870, -116776, -300168, -210469, 5877, -72465, -40054, -209066, -118878, -33737, -77395, -376469, 88464, 31519, -348461, -171003, -123999, 34395, -160850, 269343, -211179, -157131, -132406, -101357, 14469, -207697, -49067, -97397, -42934, 2659, 201642, 31276, 121404, -119625, 97050, -200589, -139503]
8999a39503N8725k5200B91510b12827a01319k22911B2299f3165l16158A70194
8988a30499A02956b61913B77423d15290A54061d09116a3692j29594c7802q4202
8978a22004a6997A80795e3585F4060d53396b8578F9246a76346I7766J51992b95467
8966b03338L7928G8076J43673Q6138F0662a24674D9642K9378a86056A39448h5167
8954D255c90026J86172f9453A15804E1336J19680a86756A48474b21793L5392F0191
8942e7070r9205i499j43210A59252a01639B56148l8862n3537B0564a69541a1254
8930h7614C65925a56737B86966J45395A70563J60903J06178J375952K796219Q653107
8920A3262922D998936I98211j44224A26584n9254b1535G0132L06520M3926A67162
$$ y = [-139503, -80778, -105978, 291510, -212827, -101319, -324230, 22299, -63165, -379323, 170194, -130499, 102956, -261913, 277423, -415290, 154061, -409116, -13692, -143286, -37802, -122004, -16997, 180795, -53585, 64060, -453396, -28578, 69246, -176346, 97766, 249758, -295467, -203338, -165410, 78076, 221749, 307887, 60662, -124674, 49642, 79020, -186056, 139448, -85167, 4255, -390026, -203854, -69453, 115804, 51336, 171016, -186756, 148474, -221793, -186401, 60191, -57070, -156275, -9499, -152709, 159252, -101639, 256148, 217286, 163749, 20564, -169541, -11254, -87614, 365925, -156737, 286966, 432361, 170563, 331466, 437644, 1813596, 4609815, 13262922, 4998936, 998211, 853987, 126584, 67330, -21535, 70132, 376652, 420578, 167162]
8909a94903B64478J4380a11185o4473A90031b40184b1983o7605l4497N9374C4491
8897A14163g5316A46944c91830C1707J5577q742P9900a6900j21277A18698h8749
8885c07752J01457l05544K02035P1247B49377c30809A16171l8301i9394d5669
8874c8055H2797c0337A02597a27210b8818A93804c85550A00743c36862a544A13823
8862c14750B49327c40997j00281J88927R6038k4917j33939J53888j94660h052
$$ y = [-194903, 264478, 278858, -111185, -175658, 190031, -240184, -21983, -89588, -124085, -64711, 34491, 114163, -75316, 146944, -391830, 31707, 47284, 38542, 118442, -16900, -138177, 118698, -88749, -307752, -206295, -511839, -309804, -238557, 249377, -330809, 116171, 77870, -99394, -45669, -38055, 82797, -30337, 102597, -127210, -28818, 193804, -385550, 100743, -336862, -1544, 113823, -314750, 249327, -340997, -441278, -252351, -156313, -181230, -315169, -161281, -355941, -8052]
$$ [...]
##END NTUPLES=NMR SPECTRUM
##END=
