
##TITLE=AC1233_PERAH12114_6519287_kQ2xMY586G
##JCAMPDX= 6.0         $$ Bruker NMR JCAMP-DX V2.0
##DATA TYPE= NMR SPECTRUM
##DATA CLASS= NTUPLES
##ORIGIN= BRUKER
##OWNER= Administrator
$$ 1.72 TOPSPIN		Version 2.1
$$ 2012-07-14 11:02:23.921 -0500  Administrator@TOPSPIN
$$ Compression mode = diff/dup
##.OBSERVE FREQUENCY= 400.02188249412
##.OBSERVE NUCLEUS= ^1H
##.ACQUISITION MODE= SIMULTANEOUS (DQD)
##.ACQUISITION SCHEME= undefined
##.AVERAGES= 64
##.DIGITISER RES= 22
##SPECTROMETER/DATA SYSTEM= spect
##.PULSE SEQUENCE= noesygpps1d.comp
##.SOLVENT NAME= COFFEE_meoh
##.SHIFT REFERENCE= INTERNAL, COFFEE_meoh, 1, 14.96145
##AUDIT TRAIL= $$ (NUMBER, WHEN, WHO, WHERE, PROCESS, VERSION, WHAT)
$$ ##TITLE= Audit trail, TOPSPIN		Version 2.1
$$ ##JCAMPDX= 5.01
$$ ##ORIGIN= Bruker BioSpin GmbH
$$ ##OWNER= Administrator
$$ $$ C:\Bruker\TOPSPIN/data/COFFEE/nmr/AC1233_PERAH12114_6519287_kQ2xMY586G/102/pdata/1/auditp.txt
$$ ##AUDIT TRAIL=  $$ (NUMBER, WHEN, WHO, WHERE, PROCESS, VERSION, WHAT)
(   1,<2012-07-14 11:02:19.140 -0500>,<Administrator>,<TOPSPIN>,<go>,<TOPSPIN 2.1>,
      <created by zg
	started at 2012-07-14 10:50:48.890 -0500,
	POWCHK enabled, PULCHK disabled,
       configuration hash MD5:
       6B 1B 68 BB D9 2E 58 E2 7F 35 AD 54 07 DF 0E 41
       data hash MD5: 64K
       67 C6 2B DA 16 03 E2 7E 4C 6A E0 40 1A 99 46 C3>)
(   2,<2012-07-14 11:02:21.984 -0500>,<Administrator>,<TOPSPIN>,<proc1d>,<TOPSPIN 2.1>,
      <Start of raw data processing
       efp LB = 0.3 FT_mod = 6 PKNL = 1 PHC0 = 0 PHC1 = 0 SI = 128K 
       data hash MD5: 128K
       59 40 BF B0 74 3B 66 6C 58 31 88 A2 E1 4B 55 82>)
(   3,<2012-07-14 11:02:23.250 -0500>,<Administrator>,<TOPSPIN>,<proc1d>,<TOPSPIN 2.1>,
      <pk PHC0 = 1.323853 PHC1 = 0 
       data hash MD5: 128K
       67 A1 85 BB EB 43 81 4F 2C 1C 63 6F B3 89 6A E5>)
(   4,<2012-07-14 11:02:23.593 -0500>,<Administrator>,<TOPSPIN>,<proc1d>,<TOPSPIN 2.1>,
      <abs ABSG = 1 
       data hash MD5: 128K
       26 D6 7B 44 C6 82 50 8D 7E 16 B1 DE 0F 1F F2 BF>)
(   5,<2012-07-14 11:02:23.671 -0500>,<Administrator>,<TOPSPIN>,<proc1d>,<TOPSPIN 2.1>,
      <abs ABSG = 2 
       data hash MD5: 128K
       9F 07 68 47 FE 74 E0 34 43 41 F3 61 62 7D C4 61>)
(   6,<2012-07-14 11:02:23.718 -0500>,<Administrator>,<TOPSPIN>,<proc1d>,<TOPSPIN 2.1>,
      <abs ABSG = 3 
       data hash MD5: 128K
       79 78 9B B8 13 DA 9A 79 47 13 08 12 2E B0 E7 CD>)
(   7,<2012-07-14 11:02:23.781 -0500>,<Administrator>,<TOPSPIN>,<proc1d>,<TOPSPIN 2.1>,
      <abs ABSG = 4 
       data hash MD5: 128K
       4F 81 4D 78 B9 69 D1 04 8E 5E 63 FD 7B 52 76 52>)
(   8,<2012-07-14 11:02:23.828 -0500>,<Administrator>,<TOPSPIN>,<proc1d>,<TOPSPIN 2.1>,
      <abs ABSG = 5 
       data hash MD5: 128K
       19 19 9B B4 8F 7C 12 59 99 66 3B D0 AC BB 17 D8>)
$$ ##END=
$$ 
$$ $$ hash MD5
$$ $$ F7 87 A7 B7 9D 27 5F 25 9F 72 CE A2 8A 0F 20 82
##$RELAX= 
##$RELAX= 
##$RELAX= 
##$RELAX= 
##$RELAX= 
##$RELAX= 
##$RELAX= 
##$RELAX= 
##$RELAX= 
$$ [...]
##$TP07= 0
##$TPNAME0= <>
##$TPNAME1= <>
##$TPNAME2= <>
##$TPNAME3= <>
##$TPNAME4= <>
##$TPNAME5= <>
##$TPNAME6= <>
##$TPNAME7= <>
##$TPOAL= (0..7)
0.5 0.5 0.5 0.5 0.5 0.5 0.5 0.5
##$TPOFFS= (0..7)
0 0 0 0 0 0 0 0
##$TUNHIN= 0
##$TUNHOUT= 0
##$TUNXOUT= 0
##$USERA1= <user>
##$USERA2= <user>
##$USERA3= <user>
##$USERA4= <user>
##$USERA5= <user>
##$V9= 5
##$VALIST= <valist>
##$VCLIST= <CCCCCCCCCCCCCCC>
##$VD= 0
##$VDLIST= <DDDDDDDDDDDDDDD>
##$VPLIST= <PPPPPPPPPPPPPPP>
##$VTLIST= <TTTTTTTTTTTTTTT>
##$WBST= 2048
##$WBSW= 25
##$XGAIN= (0..3)
0 0 0 0
##$XL= 0
##$YL= 0
##$YMAX_a= 17088391
##$YMIN_a= -12983848
##$ZGOPTNS= <>
##$ZL1= 120
##$ZL2= 120
##$ZL3= 120
##$ZL4= 120
##$ABSF1= 14.96145
##$ABSF2= -5.596732
##$ABSG= 5
##$ABSL= 3
##$ALPHA= 0
##$AQORDER= 0
##$ASSFAC= 0
##$ASSFACI= 0
##$ASSFACX= 0
##$ASSWID= 0
##$AUNMP= <proc_prof1d_extract.lims>
##$AXLEFT= 0
##$AXNAME= <>
##$AXNUC= <1H>
##$AXRIGHT= 0
##$AXTYPE= 0
##$AXUNIT= <>
##$AZFE= 0.1
##$AZFW= 0.1
##$BCFW= 0
##$BC_mod= 0
##$BYTORDP= 0
##$COROFFS= 0
##$CY= 15
##$DATMOD= 1
##$DC= 0
##$DFILT= <>
##$DTYPP= 0
##$F1P= 0
##$F2P= 0
##$FCOR= 0.5
##$FTSIZE= 131072
##$FT_mod= 6
##$GAMMA= 0
##$GB= 0
##$INTBC= 1
##$INTSCL= 1
##$ISEN= 128
##$LB= 0.3
##$LEV0= 0
##$LPBIN= 0
##$MAXI= 10000
##$MC2= 0
##$MEAN= 0
##$ME_mod= 0
##$MI= 0
##$NCOEF= 0
##$NC_proc= -2
##$NLEV= 6
##$NOISF1= 0
##$NOISF2= 0
##$NSP= 0
##$NTH_PI= 0
##$NZP= 0
##$OFFSET= 14.96145
##$PC= 1
##$PHC0= 1.323853
##$PHC1= 0
##$PH_mod= 1
##$PKNL= yes
##$PPARMOD= 0
##$PPDIAG= 0
##$PPIPTYP= 0
##$PPMPNUM= 2147483647
##$PPRESOL= 1
##$PSCAL= 4
##$PSIGN= 0
##$PYNMP= <proc.py>
##$REVERSE= no
##$SF= 400.020009457822
##$SI= 131072
##$SIGF1= 0
##$SIGF2= 0
##$SINO= 400
##$SIOLD= 131072
##$SPECTYP= <>
##$SREGLST= <1H.CDCl3>
##$SSB= 0
##$STSI= 131072
##$STSR= 0
##$SW_p= 8223.68421052631
##$SYMM= 0
##$S_DEV= 0
##$TDeff= 65536
##$TDoff= 0
##$TI= <>
##$TILT= no
##$TM1= 0
##$TM2= 0
##$TOPLEV= 0
##$USERP1= <user>
##$USERP2= <user>
##$USERP3= <user>
##$USERP4= <user>
##$USERP5= <user>
##$WDW= 1
##$XDIM= 131072
##$YMAX_p= 318569767
##$YMIN_p= -13047
##$CURPLOT= <Network HP LaserJet P1505>
##$CURPRIN= <$Network HP LaserJet P1505>
##$DFORMAT= <normdp>
##$LAYOUT= <+/1D_H.xwp>
##$LFORMAT= <normlp>
##$PFORMAT= <normpl>
##$SURQMSG= 1
$$ End of Bruker specific parameters
$$ ---------------------------------
##NTUPLES= NMR SPECTRUM
##VAR_NAME=  FREQUENCY,     SPECTRUM/REAL,   SPECTRUM/IMAG
##SYMBOL=    X,             R,               I
##VAR_TYPE=  INDEPENDENT,   DEPENDENT,       DEPENDENT
##VAR_FORM=  AFFN,          ASDF,            ASDF
##VAR_DIM=   131072,        131072,          131072
##UNITS=     HZ,            ARBITRARY UNITS, ARBITRARY UNITS
##FACTOR=    0.0627417313425164, 1,          1
##FIRST=     8223.62146879497, 1101,         -85333
##LAST=      0,             2416,            -85587
##MIN=       0,             -13047,          0
##MAX=       8223.62146879497, 318569767,    0
$$ Real data points
##PAGE= N=1
##DATA TABLE= (X++(R..R)), XYDATA
$$ [...]
61306A034985J1542J1688J1010R231P660P185O768M986K035q72l413o290r803
$$ 1034985 1046527 1058215 1069225 1078456 1086116 1093301 1100069 1105055 1107090 1106218 1102805 1096515 1086712
61293A086712j3357j6222j7944j8149j6823j4862j3495j2923j2123j0281p877
$$ 1086712 1073355 1057133 1039189 1021040 1004217 989355 975860 962937 950814 940533 932656
61282I32656n920m629l340j578L09J704K475L058L993N530P456R136R940R924
$$ 932656 926736 922107 918767 917189 917498 919202 921677 924735 928728 934258 941714 950850 960790 970714
61268I70714R911J0527J1367J1537J0932J0410J0614J1270J1845J2249J2560J2587
$$ 970714 980625 991152 1002519 1014056 1024988 1035398 1046012 1057282 1069127 1081376 1093936 1106523
61256A106523J2204J1683J1197J0343Q576N857K440j483n482q665j0440j1213
$$ 1106523 1118727 1130410 1141607 1151950 1160526 1166383 1168823 1167340 1161858 1153193 1142753 1131540
61244A131540j1664j1672j0637q641o528m851l444k029o06Q24K376L985N376O383
$$ 1131540 1119876 1108204 1097567 1088926 1082398 1077547 1074103 1072074 1071468 1072292 1074668 1078653 1084029 1090412
61230A090412P038P470Q010R065J0510J1569J1837J2012J2881J3966J4035J2795
$$ 1090412 1097450 1104920 1112930 1121995 1132505 1144074 1155911 1167923 1180804 1194770 1208805 1221600
61218A221600J1119R770Q740P914P405P098O759O724P643R300J0559J0758J0438
$$ 1221600 1232719 1242489 1251229 1259143 1266548 1273646 1280405 1287129 1294772 1304072 1314631 1325389 1335827
61205A335827J0363J0554J0719J0913J1340J1963J2766J3920J5342J6512J7061
$$ 1335827 1346190 1356744 1367463 1378376 1389716 1401679 1414445 1428365 1443707 1460219 1477280
61194A477280J7222J7428J7761J7981J7765J6808J4940J2202Q575L835j816p221
$$ 1477280 1494502 1511930 1529691 1547672 1565437 1582245 1597185 1609387 1617962 1621797 1619981 1612760
61182A612760j1101j3381j5016j6603j7934j8984k0247k1887k3368k4288k4889
$$ 1612760 1601659 1588278 1573262 1556659 1538725 1519741 1499494 1477607 1454239 1429951 1405062
61171A405062k5453k5865k6057k6185k6121k5472k4340k3340k2633k1686k0243
$$ 1405062 1379609 1353744 1327687 1301502 1275381 1249909 1225569 1202229 1179596 1157910 1137667
61160A137667j8672j7099j5122j2778j0763r271p586n370l279j681R7K345M013
$$ 1137667 1118995 1101896 1086774 1073996 1063233 1053962 1046376 1041006 1037727 1036046 1036143 1038488 1042501
61147A042501M315M340N653P933R403R223Q116O883N655M718M713N725P143Q618
$$ 1042501 1046816 1051156 1056809 1064742 1074145 1083368 1091484 1098367 1104022 1108740 1113453 1119178 1126321 1134939
61133A134939J0540J3303J6849K0932K5123K8562L0472L1158L1750L2849L4124
$$ 1134939 1145479 1158782 1175631 1196563 1221686 1250248 1280720 1311878 1343628 1376477 1410601
61122A410601L5304L6731L8468L9680L9462L7895L5787L3654L1407K8825K5903
$$ 1410601 1445905 1482636 1521104 1560784 1600246 1638141 1673928 1707582 1738989 1767814 1793717
61111A793717K2697J9101J4895J0009M779j47m302p785j1056j4438j7974k1566
$$ 1793717 1816414 1835515 1850410 1860419 1865198 1865051 1860749 1852964 1841908 1827470 1809496 1787930
61099A787930k5051k8256l1300l4597l8274m1707m4083m5309m5931m6165m5533
$$ 1787930 1762879 1734623 1703323 1668726 1630452 1588745 1544662 1499353 1453422 1407257 1361724
61088A361724m3612m0655l7300l3969l0829k7946k5222k2370j9396j6848j5205
$$ 1361724 1318112 1277457 1240157 1206188 1175359 1147413 1122191 1099821 1080425 1063577 1048372
61077A048372j4051j2328r573o542m310l034k011p71M11J227K033L433N515P806
$$ 1048372 1034321 1021993 1012420 1005878 1001568 998534 996523 995752 996163 997390 999423 1002856 1008371 1016177
61063A016177R773J1064J1587J1799J2659J4698J7251J9153K0148K1084K2732
$$ 1016177 1025950 1037014 1048601 1060400 1073059 1087757 1105008 1124161 1144309 1165393 1188125
61052A188125K4965K7147K8729K9411K9346K9315L0068L1311L1934L1478L0687
$$ 1188125 1213090 1240237 1268966 1298377 1327723 1357038 1387106 1418417 1450351 1481829 1512516
61041A512516L0293K9987K9088K7636K6108K4504K2450K0022J7810J6180J4955
$$ 1512516 1542809 1572796 1601884 1629520 1655628 1680132 1702582 1722604 1740414 1756594 1771549
61030A771549J3836J2693J1478J0191R000Q231Q128Q705R782J1127J2616J4303
$$ 1771549 1785385 1798078 1809556 1819747 1828747 1836978 1845106 1853811 1863593 1874720 1887336 1901639
61018A901639J6265J8535K1305K4980K9698L5011M0406M5951N1977N8408O5089
$$ 1901639 1917904 1936439 1957744 1982724 2012422 2047433 2087839 2133790 2185767 2244175 2309264
61007B309264P2554Q1639R2300J03715J15580J28469J42909J59250J78817K04118
$$ 2309264 2381818 2463457 2555757 2659472 2775052 2903521 3046430 3205680 3384497 3588615
60997C588615K37291K79119L29921L90212M59341N33969O08788O78901P41826
$$ 3588615 3825906 4105025 4434946 4825158 5284499 5818468 6427256 7106157 7847983
60988G847983P98380Q52165R07316R65878J027756J093013J162807J237869J318371
$$ 7847983 8646363 9498528 10405844 11371722 12399478 13492491 14655298 15893167 17211538
60979A7211538J406866J509010J627658J755756J877544J977867K048054K079149
$$ 17211538 18618404 20127414 21755072 23510828 25388372 27366239 29414293 31493442
60971C1493442K047398J908434J614031J148102N57951m8334n45045q45709r35501
$$ 31493442 33540840 35449274 37063305 38211407 38769358 38721024 38175979 37330270 36394769
60962C6394769q65165p24210o16326o39189q56990j267222j786098k276333k609736
$$ 36394769 35529604 34805394 34189068 33549879 32692889 31425667 29639569 27363236 24753500
60953B4753500k724310k637578k414840k125838j821402j532858j277836j062844
$$ 24753500 22029190 19391612 16976772 14850934 13029532 11496674 10218838 9155994
60945I155994q85857p41651o25615n33233m59137l98766l49957l11512k81252
$$ 9155994 8270137 7528486 6902871 6369638 5910501 5511735 5161778 4850266 4569014
60936D569014k56523k35659k17640k01124j85089j69860j56307j44313j32966
$$ 4569014 4312491 4076832 3859192 3658068 3472979 3303119 3146812 3002499 2869533
60927B869533j22042j12274j04228r7758r2516q8222q4326q0052p5056o9699o4525
$$ 2869533 2747491 2635217 2530989 2433231 2340715 2252493 2168167 2088115 2013059 1943360 1878835
60916A878835n9681n4983n0352m6042m2431l9571l7117l4790l2724l1084k9568
$$ 1878835 1819154 1764171 1713819 1667777 1625346 1585775 1548658 1513868 1481144 1450060 1420492
60905A420492k7745k5786k4419k4014k4188k4240k3625k2031j9672j7503j6562
$$ 1420492 1392747 1366961 1342542 1318528 1294340 1270100 1246475 1224444 1204772 1187269 1170707
60894A170707j6798j7104j6653j5671j4752j3964j3067j2069j1188j0554j0147
$$ 1170707 1153909 1136805 1120152 1104481 1089729 1075765 1062698 1050629 1039441 1028887 1018740
60883A018740r848r377q585p864p845q497r007q666p570o370n747o182p576r028
$$ 1018740 1008892 999515 990930 983066 975221 966724 957717 949051 941481 935111 929364 923182 915606 906578
60869I06578r555r249r059r315r242q263o954o154n787n199m216l216k496k145
$$ 906578 897023 887774 878715 869400 860158 851895 844941 838787 833000 827801 823585 820369 817873 815728
60855H15728k189k435k397j845j164p64n18j18K98M04K80K38M01P69J416K167
$$ 815728 813539 811104 808707 806862 805698 804934 804416 804298 804596 805000 805280 805518 805919 806688 808104 810271
60839H10271K384J634K74j014k016k805l191k999k698k929l521l633k979k247
$$ 810271 812655 814289 814563 813549 811533 808728 805537 802538 799840 796911 793390 789757 786778 784531
60825G84531k142k593l117l515l859m065l933l486l057l045l549m221m491m126
$$ 784531 782389 779796 776679 773164 769305 765240 761307 757821 754764 751719 748170 743949 739458 735332
60811G35332l558l456l994m725n165n262n179m952m545m178m216m656m976m703
$$ 735332 731774 728318 724324 719599 714434 709172 703993 699041 694496 690318 686102 681446 676470 671767
60797F71767m065l767m144m751m891m338l379k484k038k204k701k949k658k145
$$ 671767 667702 663935 659791 655040 650149 645811 642432 639948 637910 635706 633005 630056 627398 625253
60783F25253j824j706j680j878k248k150j058N06J482J641J628J781J777J618
$$ 625253 623429 621723 620043 618165 615917 613767 612709 613215 614697 616338 617966 619747 621524 623142
60769F23142J911K715L095K453J577J593K363K818K533K132K268K900L579L867
$$ 623142 625053 627768 630863 633316 634893 636486 638849 641667 644200 646332 648600 651500 655079 658946
60755F58946L452K356J140M64L77L32l5n18p76q54j118j787k717l538m016m301
$$ 658946 662398 664754 665894 666358 666735 667067 667032 666514 665738 664884 663766 661979 659262 655724 651708 647407
60739F47407m765n607o597p301p437o978o092n085m250l655l166k764k636k853
$$ 647407 642642 637035 630438 623137 615700 608722 602630 597545 593295 589640 586474 583710 581074 578221
60725E78221l082k827j952r16m23p82j597k115k001j540j042m07M73J197J285
$$ 578221 575139 572312 570360 569444 569021 568239 566642 564527 562526 560986 559944 559537 560010 561207 562492
60710E62492R39Q14J066J219R99P74R51J442J872K051K053K205K911M098M942
$$ 562492 563431 564245 565311 566530 567529 568303 569254 570696 572568 574619 576672 578877 581788 585886 590828
60695E90828M708L858L559M066M423M021L522L723M319M518M263M082M135M132
$$ 590828 595536 599394 602953 607019 611442 615463 618985 622708 627027 631545 635808 639890 644025 648157
60681F48157M002L843L401K310Q14k28k49M78J156J121K61q92j541j318n95l6
$$ 648157 652159 656002 659403 661713 662527 662299 662050 662528 663684 664805 665066 664174 662633 661315 660720 660684
60665F60684lm40j050j435j418j357j827k797l562l653l394l271l277l260l307
$$ 660684 660681 660241 659191 657756 656338 654981 653154 650357 646795 643142 639748 636477 633200 629940 626633
60650F26633l357k849j458J81J066Q76M5r14j616j725j322j095j518k072j954
$$ 626633 623276 620427 618969 619150 620216 621092 621137 620223 618607 616882 615560 614465 612947 610875 608921
60635F08921j342j125j456j495p47J34L33Kl4O03J463J865J567R12M93N85Q31
$$ 608921 607579 606454 604998 603503 602756 602890 603223 603225 603191 603794 605257 607122 608689 609601 610094 610679 611510
60618F11510N87k66j006p45N18J654J477J9j405j673j104q39j243j539j099l12
$$ 611510 612097 611831 610825 610080 610598 612252 613729 613748 612343 610670 609566 608727 607484 605945 604846 604534
60602F04534J47K71M53P08Q60J110J783K614K990K818K648K833L160L387L717
$$ 604534 604681 604952 605405 606113 606973 608083 609866 612480 615470 618288 620936 623769 626929 630316 634033
60587F34033M362N000N070M581M301M865N824N969M756L102K331K596K928K703
$$ 634033 638395 643395 648465 653046 657347 662212 668036 674005 678761 681863 684194 686790 689718 692421
60573F92421K329K372K739L147L703M558N453O093O618P249P805Q015Q000Q023
$$ 692421 694750 697122 699861 703008 706711 711269 716722 722815 729433 736682 744487 752502 760502 768525
60559G68525Q127Q375R059J0217J1256J1640J1630J1861J2433J2850J2575J1232
$$ 768525 776652 785027 794086 804303 815559 827199 838829 850690 863123 875973 888548 899780
60547H99780Q610N096J757n86k217l871n537o414n941m247j762J035L602N568
$$ 899780 908390 913486 915243 914657 912440 908569 903032 896618 890677 886430 884668 885703 889305 894873
60533H94873P037Q259R167R621R910J0517J1582J2954J4533J6037J6805J6456
$$ 894873 901910 910169 919336 928957 938867 949384 960966 973920 988453 1004490 1021295 1037751
60521A037751J5487J4591J3593J1694Q627M920J207k105m565n858o255o380o492
$$ 1037751 1053238 1067829 1081422 1093116 1101743 1106663 1107870 1105765 1101200 1095342 1089087 1082707 1076215
60508A076215o458o207n595m135j498J745M668P092R484J1876J3692J4818J5928
$$ 1076215 1069757 1063550 1057955 1053820 1052322 1054067 1058735 1065827 1075311 1087187 1100879 1115697 1131625
60495A131625J7599J9702K1857K3918K5857K7724K9852L2542L5511L8103M0063
$$ 1131625 1149224 1168926 1190783 1214701 1240558 1268282 1298134 1330676 1366187 1404290 1444353
60484A444353M1586M2707M3200M2966M1806L8965L3779K6779J9219J1415K591
$$ 1444353 1485939 1528646 1571846 1614812 1656618 1695583 1729362 1756141 1775360 1786775 1789366
60473A789366p394j7166k5272l1669l7247m2583m7669n2351n6296n8923n9833
$$ 1789366 1781972 1764806 1739534 1707865 1670618 1628035 1580366 1528015 1471719 1412796 1352963
60462A352963n9129n7046n3698m9450m5034m0979l7209l3535l0005k6522k2780
$$ 1352963 1293834 1236788 1183090 1133640 1088606 1047627 1010418 976883 946878 920356 897576
60451H97576j9003j6203j5058j4848j4137j2354j0222q740q130p789o983n588
$$ 897576 878573 862370 847312 832464 818327 805973 795751 787011 778881 771092 764109 758521
60439G58521m216l556l610l786l675l351k915k279j585j292j555j862j612p85
$$ 758521 754305 750749 747139 743353 739678 736327 733412 731133 729548 728256 726701 724839 723227 722442
60425G22442J82Q39Q92K94n52r40n48K67R67J394J660J821J855J711J320P58M47
$$ 722442 722624 723463 724355 724649 724097 723157 722609 722876 723843 725237 726897 728718 730573 732284 733604 734362 734809
60408G34809P68J468J918K032K345L018L447L206K786K861L327L620L628L657
$$ 734809 735577 737045 738963 740995 743340 746358 749805 753011 755797 758658 761985 765605 769233 772890
60394G72890L774L830L993M669N700O190N363L466J666J060J827L184M079L949
$$ 772890 776664 780494 784487 789156 794856 801046 806409 809875 811541 812601 814428 817612 821691 825640
60380H25640K966J790J185J592K721L683L842L449L179L207L107K640K145K087
$$ 825640 828606 830396 831581 833173 835894 839577 843419 846868 850047 853254 856361 859001 861146 863233
60366H63233K567L294L781L608K829K120K125K763L465M015M653N443O117O468
$$ 863233 865800 869094 872875 876483 879312 881432 883557 886320 889785 893800 898453 903896 910013 916481
60352I16481O454N998N197M650M865N453N588N247N188N689O163O171N967N817
$$ 916481 922935 928933 934130 938780 943645 949098 954686 959933 965121 970810 976973 983144 989111 994928
60338I94928N621N480N723O017N270K948j89l137n636p783r442j0618j1707j2692
$$ 994928 1000549 1006029 1011752 1017769 1023039 1025987 1025798 1022661 1017025 1009242 999800 989182 977475 964783
60324I64783j2782j1500r464p514n677l674j801m56O17J824K921L565M176N354
$$ 964783 952001 940501 931037 923523 917846 914172 912371 911915 912532 914356 917277 920842 925018 930372
60310I30372O789P679Q006Q515R564J0829J2043J3238J4269J4831J5031J5329
$$ 930372 937161 944840 952846 961361 970925 981754 993797 1007035 1021304 1036135 1051166 1066495
60298A066495J5917J6700J7860J9782K2237K4198K4600K3024J9567J4470Q078
$$ 1066495 1082412 1099112 1116972 1136754 1158991 1183189 1207789 1230813 1250380 1264850 1272928
60287A272928Q86o516j3680k0548k7313l3650l8209l9546l7737l4424l1014k7578
$$ 1272928 1273814 1267298 1253618 1233070 1205757 1172107 1133898 1094352 1056615 1022191 991177 963599
60275I63599k3841k0256j7338j4806j2306j0333r349q672p379n884n328n647n593
$$ 963599 939758 919502 902164 887358 875052 864719 855370 846698 839319 833435 828107 822460 816867
60262H16867m690l783l383k829j610l99r2n60j013j057q22m81j85j00k00k25j10
$$ 816867 812177 808394 805011 802182 800572 800173 800081 799521 798508 797451 796629 796148 795963 795863 795663 795438 795328
60245G95328j02k54k34J92Q40J468K036K479K676K824L430M597N822O644P152
$$ 795328 795226 794972 794738 794930 795770 797238 799274 801753 804429 807253 810683 815280 821102 827746 834898
60230H34898P549P727P632P646Q140Q908R455R706J0038J0728J1660J2512J3052
$$ 834898 842447 850174 857806 865452 873592 882500 891955 901661 911699 922427 934087 946599 959651
60217I59651J3253J3282J3325J3319J2979J2124J0861R414P970O720N816N157
$$ 959651 972904 986186 999511 1012830 1025809 1037933 1048794 1058208 1066178 1072898 1078714 1083871
60205A083871M428L495K588J959J515R50J89n25j043j702l130n431p769r093r283
$$ 1083871 1088299 1091794 1094382 1096341 1097856 1098806 1098995 1098470 1097427 1095725 1092595 1087164 1079395 1070302 1061019
60190A061019r176r353r502r285r103r235q863o954m089k204k335l465l974l418
$$ 1061019 1051843 1042490 1032988 1023703 1014600 1005365 996502 989548 985459 983255 980920 977455 973481 970063
60176I70063k395j419o22j46j3J11N26R87J072Q51P30P79P36N58M87N42M52J82
$$ 970063 967668 966249 965627 965481 965468 965579 966105 967092 968164 969015 969745 970524 971260 971818 972305 972847 973299 973481
60158I73481P3L71R27J544K231K889L121K724K235K537L875N542O678P144P405
$$ 973481 973554 973925 974852 976396 978627 981516 984637 987361 989596 992133 996008 1001550 1008228 1015372 1022777
60143A022777P742P915P647P154O961P308P954Q513Q803Q873Q919R175R660R937
$$ 1022777 1030519 1038434 1046081 1053235 1060196 1067504 1075458 1083971 1092774 1101647 1110566 1119741 1129401 1139338
60129A139338R387P897O138M913M340L887L147K215J286K78r33k138l043l710
$$ 1139338 1148725 1156622 1162760 1167673 1172013 1175900 1179047 1181262 1182548 1182826 1181893 1179755 1176712 1173002
60115A173002m465n394o206o633o642o278n702n419o005p372q601q798p884o334
$$ 1173002 1168537 1163143 1156937 1150304 1143662 1137384 1131682 1126263 1120258 1112886 1104285 1095487 1087603 1081269
60101A081269m598l038k029j564j128l81K91M89O41J333K049J617J9j287j228
$$ 1081269 1076671 1073633 1071604 1070040 1068912 1068531 1068822 1069311 1069952 1071285 1073334 1074951 1074970 1073683 1072455
60086A072455m83m18j370k535l112k907k171j505j690l083n147p002q303r280
$$ 1072455 1071972 1071554 1070184 1067649 1064537 1061630 1059459 1057954 1056264 1053181 1048034 1041032 1032729 1023449
60072A023449j0115j0676j0860j0813j0737j0650j0386r764q762p496o022m252
$$ 1023449 1013334 1002658 991798 980985 970248 959598 949212 939448 930686 923190 917168 912916
60060I12916k326p22L03J171K338L407L629L156K950L299L434K993K787L552M707
$$ 912916 910590 909868 910171 911342 913680 917087 920716 923872 926822 930121 933555 936548 939335 942887 947594
60045I47594N217M961M488L963L153K124J129N4j347k990m766o921r361j1093
$$ 947594 952811 957772 962260 966223 969376 971500 972629 972683 971336 968346 963580 956659 947298 936205
60031I36205j1213j0234r537r694j0111j0109r618q824q000p637q018q713q994
$$ 936205 924992 914758 905221 895527 885416 875307 865689 856865 848865 841228 833210 824497 815503
60018H15503q639p731o081l805k133k387m079n160m430k710j355p52o58r66j349
$$ 815503 806864 799133 793052 789247 787114 784727 780648 775488 771058 768348 766993 766241 765583 764617 763268
60003G63268j008L83K040L164M091N548P167P723O786N349M632M908N647O267
$$ 763268 762260 762643 764683 767847 771938 777486 784653 792376 799162 804511 809143 814051 819698 825965
59989H25965O415N843M489K696J053j12j005k047l315m503n375o027o583o861
$$ 825965 832380 838223 842712 845408 846461 846349 845344 843297 839982 835479 830104 824077 817494 810633
59975H10633o531n552m256l119k498k424k487k139j223j05Q78J739K539L133L510
$$ 810633 804102 798550 794294 791175 788677 786253 783766 781627 780404 780299 781177 782916 785455 788588 792098
59960G92098M000M731N179M718L459K176J543J736K522L392L804L645L260K816
$$ 792098 796098 800829 806008 810726 814185 816361 817904 819640 822162 825554 829358 833003 836263 839079
59946H39079K044R34R0p9l9l48p37p21o24j045j562j096N30K309L413L898M023
$$ 839079 841123 842057 842147 842068 842029 841681 840944 840223 839599 838554 836992 835896 836426 838735 842148 846046 850069
59929H50069L748L256L055L301L590L760M183N039N816N947N473M807M268M092
$$ 850069 853817 857073 860128 863429 867019 870779 874962 880001 885817 891764 897237 902044 906312 910404
59915I10404M439N107N472M957L461J456j48n31J94Q76N94k33o02l78j13L11J600
$$ 910404 914843 919950 925422 930379 933840 935296 935148 934617 934811 935687 936281 936048 935446 935068 934955 935266 936866
59898I36866L587N033N338N340N922O716O917O645O643P078P342O956O073N215
$$ 936866 940453 945486 950824 956164 962086 968802 975719 982364 989007 996085 1003427 1010383 1016456 1021671
59884A021671M764M675M545M122L719L770M069L983L385K775K301J351o03l222
$$ 1021671 1026435 1031110 1035655 1039777 1043496 1047266 1051335 1055318 1058703 1061478 1063779 1065130 1064527 1061305
59870A061305n627p174p763p857q266r434j0785j1268j0652r784r424r485r469
$$ 1061305 1055678 1048504 1040741 1032884 1024618 1015184 1004399 993131 982479 972695 963271 953786 944317
59857I44317r029p928o113m135k845k414k143j490n71M49J790L507N187O509P541
$$ 944317 935288 927360 921247 917112 914267 911853 909710 908220 907649 908098 909888 913395 918582 925091 932632
59842I32632Q194Q115P466P085P427P914P862P424P182P360P913Q870J0067J1047
$$ 932632 940826 948941 956407 963492 970919 978833 986695 994119 1001301 1008661 1016574 1025444 1035511 1046558
59828A046558J1639J2217J2927J3206J2536J1196R774Q317O429L797L62l621p264
$$ 1046558 1058197 1070414 1083341 1096547 1109083 1120279 1130053 1138370 1144799 1148596 1148958 1145337 1138073
59815A138073r399r698r020q316p721p167p200q493j0926j3742j6216j7699j7492
$$ 1138073 1128674 1118976 1109956 1101640 1093919 1086752 1079552 1071059 1060133 1046391 1030175 1012476 994984
59802I94984j5416j2323r490p593o533n985n727n709o101o953p665p311n821m280
$$ 994984 979568 967245 957755 950162 943629 937644 931917 926208 920107 913154 905489 898178 892357 888077
59788H88077l628l562l224k481j874j720j862k081k199j942j227l89J52L54M70
$$ 888077 884449 880887 877663 875182 873308 871588 869726 867645 865446 863504 862277 861888 862040 862394 862864
59773H62864P04J104J545J739J603J606K297L474M423N010N728O596O965O719
$$ 862864 863568 864672 866217 867956 869559 871165 873462 876936 881359 886369 892097 898693 905658 912377
59759I12377O677P318P986P937P368O793O232N651N475N866O189N843N058M247
$$ 912377 919054 926372 934358 942295 949663 956456 962688 968339 973814 979680 985869 991712 996770 1001017
59745A001017L335K335J783J826J687Q70Q2J02N41O90P94J342J853J624J130J295
$$ 1001017 1004352 1006687 1008470 1010296 1011983 1012853 1012935 1013037 1013578 1014268 1015062 1016404 1018257 1019881 1021011 1022306
59729A022306J813J645Q63N82J174J850K116K367K871L277L364L363L302K883
$$ 1022306 1024119 1025764 1026627 1027209 1028383 1030233 1032349 1034716 1037587 1040864 1044228 1047591 1050893 1053776
59715A053776K247K099K843M091N187N740N708N501N739O411O599N688M435L975
$$ 1053776 1056023 1058122 1060965 1065056 1070243 1075983 1081691 1087192 1092931 1099342 1105941 1111629 1116064 1120039
59701A120039M217M279M104M422N212N567N239N104N720O485O620O088N097L538
$$ 1120039 1124256 1128535 1132639 1137061 1142273 1147840 1153079 1158183 1163903 1170388 1177008 1183096 1188193 1191731
59687A191731J364j009l153m959o331p029p047o700o245n807n681o094o751p161
$$ 1191731 1193095 1192086 1188933 1183974 1177643 1170614 1163567 1156867 1150622 1144815 1139134 1133040 1126289 1119128
59673A119128p402p910q588q841q486p854p029n767m316l368l010k503j398j99
$$ 1119128 1111726 1103816 1095228 1086387 1077901 1070047 1063018 1057251 1052935 1049567 1046557 1044054 1042656 1042457
59659A042457L95L30M8j9L62J014J236M57r62k161k900l614m389m828m976n407
$$ 1042457 1042852 1043182 1043230 1043211 1043573 1044587 1045823 1046280 1045318 1043157 1040257 1036643 1032254 1027426 1022450 1017043
59643A017043o219o880p344q288r734j0448r482p563o133n596n329m936m653m591
$$ 1017043 1010824 1003944 996600 988312 978578 968130 958648 951085 944952 939356 934027 929091 924438 919847
59629I19847m471m099l654l381l402l771m432n065n298n042m486l758k818j639
$$ 919847 915376 911277 907623 904242 900840 897069 892637 887572 882274 877232 872746 868988 866170 864531
59615H64531l94O87J525K183K600K518J924J341J358J783J827J213N61M30N35
$$ 864531 864137 864824 866349 868532 871132 873650 875574 876915 878273 880056 881883 883096 883657 884087 884622
59600H84622L73J9k62o68j458k275k636k722k959l137k717j819j038n01K0K74
$$ 884622 884995 885014 884752 884084 882626 880351 877715 874993 872034 868897 866180 864361 863323 862822 862842 863116
59584H63116k68j351k031j951j687j733j968k258k765l423l822l861l784l514
$$ 863116 862848 861497 859466 857515 855828 854095 852127 849869 847104 843681 839859 835998 832214 828700
59570H28700k724j741j517k256k881k344r20K90O53L69m8j80J47P25J126J200
$$ 828700 825976 824235 822718 820462 817581 815237 814317 814607 815260 815629 815581 815401 815548 816273 817399 818599
59554H18599J282J777K759L986N139O009O652P290P928Q322Q538R117J0260J1289
$$ 818599 819881 821658 824417 828403 833542 839551 846203 853493 861421 869743 878281 887398 897658 908947
59540I08947J1506J1251J1400J2112J2813J3185J3465J3893J4576J5642J6807
$$ 908947 920453 931704 943104 955216 968029 981214 994679 1008572 1023148 1038790 1055597
59529A055597J7032J5394J2106Q046L658p13l985n211n096n326o448p641q589
$$ 1055597 1072629 1088023 1100129 1108175 1111833 1111120 1107135 1101924 1096828 1091502 1085054 1077413 1068824
59516A068824r959j1837j3246j3729j4033j4549j4426j3099j1497j0725j0373
$$ 1068824 1058865 1047028 1033782 1020053 1006020 991471 977045 963946 952449 941724 931351
59505I31351r229p089m886l363k461j770j007o8R95K041K963L614L810L821M443
$$ 931351 922122 915033 910147 906784 904323 902553 901546 901478 902473 904514 907477 911091 914901 918722 923165
59490I23165N929P120O660M945L804M216N441O478P185P685P944Q314R348J0662
$$ 923165 929094 936214 942874 947819 951623 955839 961280 967758 974943 982628 990572 998886 1008234 1018896
59476A018896J1154J0856J1271J3256J5654J6871J6725J5928J4684J2789J0436
$$ 1018896 1030050 1040906 1052177 1065433 1081087 1097958 1114683 1130611 1145295 1158084 1168520
59465A168520Q046N868M267L744M097M436M596N615Q118J1077J3004J3612J3533
$$ 1168520 1176566 1182434 1186701 1190445 1194542 1198978 1203574 1209189 1217307 1228384 1241388 1255000 1268533
59452A268533J3176J2628J1909J0628Q153M860K316J355R45j94j755k890m119
$$ 1268533 1281709 1294337 1306246 1316874 1325027 1329887 1332203 1333558 1334503 1334309 1332554 1329664 1325545
59439A325545o719j0598j4155j6136j6500j5606j3650j1003q227n645l348j477
$$ 1325545 1318826 1308228 1294073 1277937 1261437 1245831 1232181 1221178 1212951 1207306 1203958 1202481
59427A202481j07R52J812K391K990M387O791R228J0593J0792J0354R619Q972R032
$$ 1202481 1202374 1203326 1205138 1207529 1210519 1214906 1221697 1230925 1241518 1252310 1262664 1272283 1281255 1290287
59413A290287R797J0202R438Q045O970O174N087L708K094o14n287j1196j6346
$$ 1290287 1300084 1310286 1319724 1327769 1334739 1340913 1346000 1349708 1351802 1351188 1345901 1334705 1318359
59400A318359j9237j9463j7021j2298o621j598K119M653N579L810j048p845j4515
$$ 1318359 1299122 1279659 1262638 1250340 1243719 1242121 1244240 1248893 1254472 1258282 1257234 1249389 1234874
59387A234874j9168k0907k0194j8198j5459j1678p217l827k776l071k729j309
$$ 1234874 1215706 1194799 1174605 1156407 1140948 1129270 1122053 1118226 1115450 1112379 1109650 1108341
59375A108341R0R31J762K764L285L179L337M468O198P727Q677R099R350J0109
$$ 1108341 1108431 1109362 1111124 1113888 1117173 1120352 1123689 1128157 1134355 1142082 1150759 1159858 1169208 1179317
59361A179317J1838J4086J5904J7056J8124J9436K0528K0887K0620K0332K0551
$$ 1179317 1191155 1205241 1221145 1238201 1256325 1275761 1296289 1317176 1337796 1358128 1378679
59350A378679K1285K1816K1249J9609J7886J6525J4621J1361P537M397J568k384
$$ 1378679 1399964 1421780 1443029 1462638 1480524 1497049 1511670 1523031 1530568 1534965 1536533 1534149
59338A534149p603j2589j6265j9051k1614k3813k5382k6548k7468k7855k7598
$$ 1534149 1526546 1513957 1497692 1478641 1457027 1433214 1407832 1381284 1353816 1325961 1298363
59327A298363k7024k6194k4713k2610k0627j9177j7757j5889j3988j2762j2217
$$ 1298363 1271339 1245145 1220432 1197822 1177195 1158018 1140261 1124372 1110384 1097622 1085405
59316A085405j1771j1011j0010r109q679q797q991q626p672o737o218n837n185
$$ 1085405 1073634 1062623 1052613 1043504 1034825 1026028 1017037 1008411 1000739 994002 987784 981947 976762
59303I76762m398l942l957m004l411j891J56J973L205M188N419P039Q952J0993
$$ 976762 972364 968422 964465 960461 957050 955159 955315 957288 960493 964681 970100 977139 986091 997084
59289I97084J2762J3762J4152J4825J6228J7626J8183J8227J8695J9725K0682
$$ 997084 1009846 1023608 1037760 1052585 1068813 1086439 1104622 1122849 1141544 1161269 1181951
59278A181951K1338K2031K2879K3644K4413K5505K6661K7120K6540K5121K2733
$$ 1181951 1203289 1225320 1248199 1271843 1296256 1321761 1348422 1375542 1402082 1427203 1449936
59267A449936J8583J2051L384o426j6026k4010k9428l2143l2551l1119k8513k5607
$$ 1449936 1468519 1480570 1483954 1477528 1461502 1437492 1408064 1375921 1343370 1312251 1283738 1258131
59255A258131k2778j9583j5765j2063r258o952m286j508L52J154J853L003M196
$$ 1258131 1235353 1215770 1200005 1187942 1178684 1171732 1167446 1165938 1166290 1167444 1169297 1172300 1176496
59242A176496N061N845O748P574Q188Q573Q310O926M779K760J022j083l647n886
$$ 1176496 1181557 1187402 1194150 1201724 1209912 1218485 1226795 1233721 1238500 1241260 1242282 1241199 1237552 1231666
59228A231666p391q746j0442j2061j3024j3423j3598j3512j3024j2250j1354j0318
$$ 1231666 1224275 1215529 1205087 1193026 1180002 1166579 1152981 1139469 1126445 1114195 1102841 1092523
59216A092523r255q443p880p232o361n445m543l576k742k394k388k179j673j313
$$ 1092523 1083268 1074825 1066945 1059713 1053352 1047907 1043364 1039788 1037046 1034652 1032264 1030085 1028412 1027099
59202A027099j253j098o24o2M88J252K233L086L776M679N782O406O096N288M745
$$ 1027099 1025846 1024748 1024124 1024062 1024550 1025802 1028035 1031121 1034897 1039576 1045358 1051764 1057860 1063148 1067893
59187A067893M808N388O329P373Q145Q401Q202P747P271P050P188P380P203O586
$$ 1067893 1072701 1078089 1084418 1091791 1099936 1108337 1116539 1124286 1131557 1138607 1145795 1153175 1160378 1166964
59173A166964N880N540N841O599P052O548N488M860M512L010j64l419n214o360
$$ 1166964 1172844 1178384 1184225 1190824 1197876 1204424 1209912 1214772 1219284 1222294 1222130 1218711 1213497 1207137
59159A207137q685j2158j5131j6977j8560k0141k0748k0024j8944j8164j7175
$$ 1207137 1198452 1186294 1171163 1154186 1135626 1115485 1094737 1074713 1055769 1037605 1020430
59148A020430j5668j4355j3618j2671j0891r010q012p649o890n303l323j613o13
$$ 1020430 1004762 990407 976789 964118 953227 944217 936205 928556 921666 916363 913040 911427 910814
59135I10814l19r0Q80K629M365N482O062O461O914P625Q553R199R343R782J1376
$$ 910814 910495 910405 911285 913914 918279 923761 929823 936284 943198 950823 959376 968575 977918 987700 999076
59120I99076J3571J4914J5058J5024J5433J5711J5327J4616J3984J3375J2875
$$ 999076 1012647 1027561 1042619 1057643 1073076 1088787 1104114 1118730 1132714 1146089 1158964
59109A158964J2769J2681J1730R875Q109P029O318N820N780N729M490J956m90
$$ 1158964 1171733 1184414 1196144 1206019 1214128 1221157 1227475 1233295 1239075 1244804 1249294 1251250 1250760
59096A250760j946l140m861o543p305p235o768n783m359l500m121n878p843r698
$$ 1250760 1248814 1245674 1240813 1234270 1226965 1219730 1212962 1207179 1202820 1199320 1195199 1189321 1181478 1171780
59082A171780j1573j3361j4856j5943j6276j5469j4031j3144j3019j2472j0679
$$ 1171780 1160207 1146846 1131990 1116047 1099771 1084302 1070271 1057127 1044108 1031636 1020957
59071A020957q374o715n935n693n733n530m456k948k403l160l876l654l395l950
$$ 1020957 1012583 1005868 999933 994240 988507 982977 978521 975573 973170 970010 966134 962480 959085 955135
59057I55135m425l715k537k256k630k422j557j000q24q6J497L047L779L688L057
$$ 955135 950710 946995 944458 942202 939572 937150 935593 934593 933769 933683 935180 938227 942006 945694 948751
59042I48751K187J595J645K074K494L077M128N357O320P156Q222R378J0343J1300
$$ 948751 950938 952533 954178 956252 958746 961823 965951 971308 977628 984784 993006 1002384 1012727 1024027
59028A024027J2422J3281J3467J3313J3340J3415J3159J2700J2272J1608J0414
$$ 1024027 1036449 1049730 1063197 1076510 1089850 1103265 1116424 1129124 1141396 1153004 1163418
59017A163418Q923P336N356K975R74j33r01j800k062p71J535L517M747N743O754
$$ 1163418 1172341 1179677 1185033 1188008 1188982 1188849 1187948 1186148 1184086 1183315 1184850 1188367 1193114 1198857 1205611
59002A205611P637Q561R712J0633J0771J0355R868R059P464N460L727K178M29
$$ 1205611 1213248 1221809 1231521 1242154 1252925 1263280 1273148 1282207 1289671 1295131 1298858 1301036 1301465
58989A301465j104j760j900k398l136l210k467j566n81J163L720O146P743Q855
$$ 1301465 1300361 1298601 1296701 1294303 1291167 1287957 1285490 1283924 1283343 1284506 1288226 1294372 1302115 1310970
58975A310970J0144J1731J3232J4123J4052J3272J2639J2648J2759J2210J1110
$$ 1310970 1321114 1332845 1346077 1360200 1374252 1387524 1400163 1412811 1425570 1437780 1448890
58964A448890J0038Q977P468N486L250M25l538q368j3113j7274k0979k4157k6268
$$ 1448890 1458928 1467905 1475373 1480859 1484109 1484534 1480996 1472628 1459515 1442241 1421262 1397105 1370837
58951A370837k6974k6455k5104k3334k1497j9595j7329j4781j2615j1127r671
$$ 1370837 1343863 1317408 1292304 1268970 1247473 1227878 1210549 1195768 1183153 1172026 1162355
58940A162355p710n751m539l812k806j476m21J01K07j26r03j785k610l694m932
$$ 1162355 1154645 1148894 1144355 1140543 1137737 1136261 1135840 1135941 1136148 1136022 1135119 1133334 1130724 1127030 1122098
58925A122098n346m430l203k837k891k111m01J256K474L758N376P093Q875J0773
$$ 1122098 1116752 1112322 1109119 1106282 1103391 1101280 1100879 1102135 1104609 1108367 1113743 1120836 1129711 1140484
58911A140484J2342J3191J3829J4999J6580J8056J9568K1319K2621K2899K3092
$$ 1140484 1152826 1166017 1179846 1194845 1211425 1229481 1249049 1270368 1292989 1315888 1338980
58900A338980K4533K6822K8438K9139K9963L0959L0899K9544K8287K7945K7486
$$ 1338980 1363513 1390335 1418773 1447912 1477875 1508834 1539733 1569277 1597564 1625509 1652995
58889A652995K5753K3158K0774J8704J6204J2722Q247L212j617n671r245j3013
$$ 1652995 1678748 1701906 1722680 1741384 1757588 1770310 1778557 1781769 1780152 1774481 1765236 1752223
58877A752223j6902k0151k2544k4653k6778k8532k9574k9884k9229k7354k4876
$$ 1752223 1735321 1715170 1692626 1667973 1641195 1612663 1583089 1553205 1523976 1496622 1471746
58866A471746k3023k2170k1503k0393j9255j8667j8438j7991j7151j6145j5297
$$ 1471746 1448723 1426553 1405050 1384657 1365402 1346735 1328297 1310306 1293155 1277010 1261713
58855A261713j4862j4824j4772j4385j3949j3887j4010j3751j3030j2252j1729
$$ 1261713 1246851 1232027 1217255 1202870 1188921 1175034 1161024 1147273 1134243 1121991 1110262
58844A110262j1628j2064j2611j2218j0501q571p571o981n571l564k302k053j731
$$ 1110262 1098634 1086570 1073959 1061741 1051240 1042669 1035098 1028117 1022546 1018982 1016680 1014627 1012896
58831A012896q43l1M41J254K637L765M165M416M922N140M692M217M404M934M987
$$ 1012896 1012053 1012022 1012463 1013717 1016354 1020119 1024284 1028700 1033622 1038762 1043454 1047671 1052075 1057009 1061996
58816A061996M204K664O02j402k608k894k941l333m000m723n529o381p002p235
$$ 1061996 1066200 1068864 1069466 1068064 1065456 1062562 1059621 1056288 1052288 1047565 1042036 1035655 1028653 1021418
58802A021418p146o729n973n159m573m013l207k499k406k693k654k162j590q66
$$ 1021418 1014272 1007543 1001570 996411 991838 987825 984618 982119 979713 977020 974366 972204 970614 969748
58788I69748L82J861K813L204L695M373M460L545K240J358J072R73M22j071l192
$$ 969748 970130 971991 974804 978008 981703 986076 990536 994081 996321 997679 998751 999724 1000146 999075 995883
58773I95883m740m882m225l982m470n305o489q151r516r476q037o131m187k018
$$ 995883 991143 986261 982036 978054 973584 968279 961790 953639 944123 934647 926610 920479 916292 914274
58759I14274R7J504K239K802L071K644K059K346L472M598N607P016Q543R390R803
$$ 914274 914371 915875 918114 920916 923987 926631 928690 931036 934508 939106 944713 951729 960272 969662 979465
58744I79465J0671J1651J1500J0321R590R688R361Q153P413Q134R411R992R887
$$ 979465 990136 1001787 1013287 1023608 1033198 1042886 1052247 1060400 1067813 1075947 1085358 1095350 1105237
58731A105237R613R145Q493Q166Q332Q407Q065P561O797N229L175J784J303O27
$$ 1105237 1114850 1123995 1132488 1140654 1148986 1157393 1165458 1173019 1179816 1185045 1188220 1190004 1191307 1191934
58717A191934r19k770m547o812r649j2039j3455j4769j6608j8077j8172j7405
$$ 1191934 1191015 1188245 1183698 1176886 1167237 1155198 1141743 1126974 1110366 1092289 1074117 1056712
58705A056712j7014j7363j8010j8567j8788j8502j8057j8041j8156j7366j5489
$$ 1056712 1039698 1022335 1004325 985758 966970 948468 930411 912370 894214 876848 861359
58694H61359j3583j2314j1127r569q115p058n752l876k250j653j707j767j914
$$ 861359 847776 835462 824335 814766 806651 799593 793841 789965 787715 786062 784355 782588 780674
58681G80674k334k579k217j433l80J198L138M522M811M621M770N366O162P143
$$ 780674 778340 775761 773544 772111 771731 772929 776067 780589 785400 790021 794791 800157 806319 813462
58667H13462Q291R461J0652J1698J1804J0367Q087O035L847L71m002p437r245
$$ 813462 821753 831214 841866 853564 865368 875735 883822 889857 893704 894075 890073 882636 873391
58654H73391j0499j1742j2065j1108r997r459q715p179n598m517l280j533k32
$$ 873391 862892 851150 839085 827977 817980 808521 799806 792627 787029 782512 779232 777699 777467
58641G77467J9J68J170K524L377L784L953L545K684K337K754K843K001J227J415
$$ 777467 777486 777654 778824 781348 784725 788509 792462 796007 798691 801028 803782 806625 808626 809853 811268
58626H11268J962K081K234L073M194M990N611O243O558O625P131P965Q014P093
$$ 811268 813230 815311 817545 820618 824812 829802 835413 841656 848214 854839 861970 869935 877949 885042
58612H85042O434O545O267M911L491K766J861J47j347j728j743k065j846m83Q53
$$ 885042 891476 898021 904288 909199 912690 915456 917317 917464 916117 914389 912646 910581 908735 908252 909105
58597I09105J229J807L913O655Q343R106J0166J1603J2651J3368J4391J5722J7134
$$ 909105 910334 912141 916054 922709 931052 940158 950324 961927 974578 987946 1002337 1018059 1035193
58584A035193J8841K0623K1331K0503J9309J8765J8350J7549J7149J7558J7542
$$ 1035193 1054034 1074657 1095988 1116491 1135800 1154565 1172915 1190464 1207613 1225171 1242713
58573A242713J6336J5526J6837J9455K1490K2842K4615K6778K8373K9229K9579
$$ 1242713 1259049 1274575 1291412 1310867 1332357 1355199 1379814 1406592 1434965 1464194 1493773
58562A493773K8860K6609K3631K0640J6676J0556K987m381j1023j6986k1347k3131
$$ 1493773 1522633 1549242 1572873 1593513 1610189 1620745 1623732 1619351 1608328 1591342 1569995 1546864
58550A546864k2942k2062k0682j8466j5944j3973j2756j2598j4341j7742k0948
$$ 1546864 1523922 1501860 1481178 1462712 1446768 1432795 1420039 1407441 1393100 1375358 1354410
58539A354410k3004k5213k8322l0390k9564k7115k5281k3764k0986j7357j4499
$$ 1354410 1331406 1306193 1277871 1247481 1217917 1190802 1165521 1141757 1120771 1103414 1088915
58528A088915j2282r515o630m927l925k190k29J78q53j420q97n09j038k072l295
$$ 1088915 1076633 1067118 1060488 1055561 1051636 1049446 1049217 1049395 1048542 1047122 1046225 1045716 1044678 1042606 1039311
58513A039311m606n290m828m136m177m255l358k223j990j987j034J53L05K63J623
$$ 1039311 1034705 1029415 1024587 1020451 1016274 1012019 1008661 1006438 1004448 1002461 1001427 1001580 1001885 1002148 1003771
58498A003771L687M558M429M951O037O320O276P745J0539J2508J3019J3515J4562
$$ 1003771 1007458 1012016 1016445 1021396 1027433 1033753 1040029 1047774 1058313 1070821 1083840 1097355 1111917
58485A111917J5164J5194J5848J7257J8145J8205J8450J8954J8405J6249J3175
$$ 1111917 1127081 1142275 1158123 1175380 1193525 1211730 1230180 1249134 1267539 1283788 1296963
58474A296963R332M160j866p311j1633j5118j7200j7033j5444j4057j2630r632
$$ 1296963 1306295 1310455 1308589 1301278 1289645 1274527 1257327 1240294 1224850 1210793 1198163 1188531
58462A188531n342j873J1J749M342P127R476J1601J3204J3318J1807R473O519
$$ 1188531 1183189 1181316 1181327 1183076 1187418 1194545 1204021 1215622 1228826 1242144 1253951 1263424 1269943
58449A269943K587j837n660q663j1175j2722j2704j1837j1117r996p502m403k065
$$ 1269943 1272530 1270693 1265033 1256370 1245195 1232473 1219769 1207932 1196815 1186819 1179317 1174914 1172849
58436A172849r3K580N126N916N477N677O580O805O459O869P810P741O513N163
$$ 1172849 1172756 1175336 1180462 1186378 1191855 1197532 1204112 1210917 1217376 1224245 1232055 1239796 1246309 1251472
58422A251472L475M60l123n593p266r705j2544j4018j4196j4615j5080j4048j1929
$$ 1251472 1254947 1255407 1252284 1246691 1239425 1229720 1217176 1203158 1188962 1174347 1159267 1145219 1133290
58409A133290j0739j0579r713p979o892o374m832k468j189j137o25M12L93m28
$$ 1133290 1122551 1111972 1102259 1094280 1087388 1081014 1076182 1073714 1072525 1071388 1070763 1071175 1071568 1071140
58395A071140J9J749K436J410M76L45l00j574j693k82R11J197J760K852L358L635
$$ 1071140 1071159 1072908 1075344 1076754 1077230 1077575 1077275 1075701 1074008 1073726 1074637 1075834 1077594 1080446 1083804 1087439
58379A087439N372Q196R780R824J0544J2592J4005J3888J3697J4139J4131J3563
$$ 1087439 1092811 1101007 1110787 1120611 1131155 1143747 1157752 1171640 1185337 1199476 1213607 1227170
58367A227170J3793J4828J5250J5315J6623J8439J8097J5524J3470J2677J0887
$$ 1227170 1240963 1255791 1271041 1286356 1302979 1321418 1339515 1355039 1368509 1381186 1392073
58356A392073P393M454L097J640m86j311j25J123J474K416M553O414P639R700
$$ 1392073 1399466 1403920 1407017 1408657 1408171 1406860 1406735 1407858 1409332 1411748 1416301 1422715 1430354 1440054
58342A440054J2427J3588J2938J2907J4279J4991J4239J3784J4213J3857J2481
$$ 1440054 1452481 1466069 1479007 1491914 1506193 1521184 1535423 1549207 1563420 1577277 1589758
58331A589758J1933J2106J0461O699L625K321P69j570k439j266m67q14m7K494
$$ 1589758 1601691 1613797 1624258 1630957 1634582 1636903 1637672 1636102 1633663 1632397 1631930 1631116 1631069 1633563
58317A633563M463N110O647R563J1312J1132J1456J3092J3823J3264J4011J6418
$$ 1633563 1638026 1643136 1649783 1659346 1670658 1681790 1693246 1706338 1720161 1733425 1747436 1763854
58305A763854J7431J6218J5757J7140J7729J6702J6798J8665J9198J7548J7019
$$ 1763854 1781285 1797503 1813260 1830400 1848129 1864831 1881629 1900294 1919492 1937040 1954059
58294A954059J8851K0003J9361K0074K3248K5499K5401K6179K9282L1512L1399
$$ 1954059 1972910 1992913 2012274 2032348 2055596 2081095 2106496 2132675 2161957 2193469 2224868
58283B224868L2122L5131L7296L7404L8867M2798M5181M4291M4066M6563M8167
$$ 2224868 2256990 2292121 2329417 2366821 2405688 2448486 2493667 2537958 2582024 2628587 2676754
58272B676754M7071M7334N1299N5086N5892N6790N9932O2068O1362O1417O4005
$$ 2676754 2723825 2771159 2822458 2877544 2933436 2990226 3050158 3112226 3173588 3235005 3299010
58261C299010O5050O2454O0382O1214O1005N7799N6314N9351O2766O4269O8438
$$ 3299010 3364060 3426514 3486896 3548110 3609115 3666914 3723228 3782579 3845345 3909614 3978052
58250C978052P7348Q5213Q8508R2377J00583J08390J12278J17198J26793J35971
$$ 3978052 4055400 4140613 4229121 4321498 4422081 4530471 4642749 4759947 4886740 5022711
58240E022711J40929J46921J58047J69133J76178J84790J99454K14646K25901
$$ 5022711 5163640 5310561 5468608 5637741 5813919 5998709 6198163 6412809 6638710
58231F638710K39201K59637K81541L00109L21872L52740L86784M18319M53809
$$ 6638710 6877911 7137548 7419089 7719198 8041070 8393810 8780594 9198913 9652722
58222I652722M99907N51391O03524O64528P42878Q34753R37872J064948J229453
$$ 9652722 10152629 10704020 11307544 11972072 12714950 13549703 14487575 15552523 16781976
58213A6781976J432662J681019K001707K423261K954280L596400M356612N219346
$$ 16781976 18214638 19895657 21897364 24320625 27274905 30871305 35227917 40447263
58205D0447263O118133O960329P675514Q231258Q627428Q898141R092858R223831
$$ 40447263 46565396 53525725 61201239 69432497 78059925 86958066 96050924 105274755
58197A05274755R255379R179246R078411R084988R309847R853058J0818847J2210037
$$ 105274755 114530134 123709380 132787791 141872779 151182626 161035684 171854531 184064568
58189A84064568J3810284J5277270J6395260J7165035J7582853J7334614J5705877
$$ 184064568 197874852 213152122 229547382 246712417 264295270 281629884 297335761
58182B97335761J1810017N089166m089508j4170254k2914328k8508596l0428042
$$ 297335761 309145778 314234944 310145436 295975182 273060854 244552258 214124216
58175B14124216k9370131k6503010k2818868j8981058j5416996j2355481r835483
$$ 214124216 184754085 158251075 135432207 116451149 101034153 88678672 78843189
58168G8843189p794516o167197m896093l906040l122032k497273j996669j571004
$$ 78843189 71048673 64881476 59985383 56079343 52957311 50460038 48463369 46892365
58160D6892365j169039p60335l34158J03736N22472Q78643J152308J347251J435416
$$ 46892365 45723326 44962991 44628833 44732569 45255041 46133684 47285992 48633243 50068659
58151E0068659J316358Q55903k1446j252788k615137l791257m517055m716700
$$ 50068659 51385017 52240920 52219474 50966686 48351549 44560292 40043237 35326537
58143C5326537m505193m064061l529032k979294k471773k041894j689865j399354
$$ 35326537 30821344 26757283 23228251 20248957 17777184 15735290 14045425 12646071
58135A2646071j164838r85356q46334p29101o29839n52243m90480m35316l88438
$$ 12646071 11481233 10495877 9649543 8920442 8290603 7738360 7247880 6812564 6424126
58126F424126l55103l30054l04865k81790k66753k55687k40861k24023k10597
$$ 6424126 6069023 5738969 5434104 5152314 4885561 4629874 4389013 4164990 3954393
58117C954393j97442j78829j58520j43706j32460j18809j04918r6779r2803q7779
$$ 3954393 3756951 3578122 3419602 3275896 3143436 3024627 2919709 2822930 2730127 2642348
58107B642348q3451q4250q6933q5101q0073p7134p4964o8931o1178n7359n6343
$$ 2642348 2558897 2474647 2387714 2302613 2222540 2145406 2070442 2001511 1940333 1882974 1826631
58096A826631n2867m7556m5042m4674m2114l7851l5656l4723l1562k7457k6189
$$ 1826631 1773764 1726208 1681166 1636492 1594378 1556527 1520871 1486148 1454586 1427129 1400940
58085A400940k6501k4515k1460k1406k3393k3251k1365k1448k3276k3611k2589
$$ 1400940 1374439 1349924 1328464 1307058 1283665 1260414 1239049 1217601 1194325 1170714 1148125
58074A148125k2591k2662k0450j7751j7727j8655j6803j3407j2320j2856j1508
$$ 1148125 1125534 1102872 1082422 1064671 1046944 1028289 1011486 998079 985759 972903 961395
58063I61395q880q299r250q681p237p856r589r164p324p424r045r015p570p442
$$ 961395 952515 944216 934966 926285 919048 911192 901603 892439 885115 877691 868646 859631 852061 844619
58049H44619q075o779m526m621o520o845n623n773p196p180n975o289p823p811
$$ 844619 836544 829765 825239 820618 814098 807253 801630 795857 788661 781481 775506 769217 761394 753583
58035G53583o556o873q561q695p149o583p287p135o300o895q262p651n398m474
$$ 753583 747027 740154 731593 722898 715749 709166 701879 694744 688444 681549 673287 665636 660238 655764
58021F55764n112m707k924k030k218j396L74Q22q2o1J095J434R86J680L209L321
$$ 655764 650652 645945 643021 640991 638773 637377 637751 638573 638491 638430 639525 640959 641945 643625 646834 650155
58005F50155K116J807K389J920P82J249K917K996J215P6K34l7q09l67Q51N65r65
$$ 650155 652271 654078 656467 658387 659169 660418 663335 666331 667546 667622 667856 667819 667010 666643 667494 668059 667094
57988F67094j281n17j319l794n076m373l931m389l786j937j323k536l167k309
$$ 667094 665813 665296 663977 660183 655107 650734 646803 642414 638628 636691 635368 632832 629665 627356
57974F27356k042l254m027l464l281m160m227k636j260j286j357m91K11J10L61
$$ 627356 625314 622060 618033 614569 611288 607128 602901 600265 599005 597719 596362 595871 596082 596192 596553
57959E96553J439K040J581J218J525J713J724K477L482L096J643J382K844M155
$$ 596553 597992 600032 601613 602831 604356 606069 607793 610270 613752 616848 618491 619873 622717 626872
57945F26872M496N073O193O596O375P287R273J0039Q988Q420R616J0862J0583
$$ 626872 631368 636441 642634 649230 655605 662892 672165 682204 691192 699612 709228 720090 730673
57932G30673R575Q895Q223P491P467P710O470L525O48j446l818o423p564p114
$$ 730673 740248 749143 757366 764857 772324 780034 786504 790029 790677 789231 785413 778990 771426 764312
57918G64312p196q541r199q067o774o692o917o592o506o932o492m720l294l306
$$ 764312 757116 748575 739376 731309 724535 717843 710926 704334 697828 690896 684404 679684 676390 673084
57904F73084l603l185k902l454l943l744l630l916l604k434j543j280o20L86K84
$$ 673084 669481 666296 663394 659940 655997 652253 648623 644707 641103 638669 637126 635846 635226 635612 635896
57889F35896p64n04J668L382L098K363K696L059K351J721K271K771J897O31L33
$$ 635896 635132 634628 636296 639678 642776 645139 647835 650894 653245 654966 657237 660008 661905 662536 662869
57874F62869L57l45j027n78L84Q07J128K131L251L678L796M081L976L231K882
$$ 662869 663226 662881 661854 661276 661660 662467 663595 665726 668977 672655 676451 680532 684508 687739 690621
57859F90621L490L909L252K495K659K927K200J116Q90J334J534J372J033J06j575
$$ 690621 694111 698020 701272 703767 706426 709353 711553 712669 713559 714893 716427 717799 718832 718938 717363
57844G17363l169l993m350m489m063l364l548m691n206m193k750k001j591j181
$$ 717363 714194 710201 705851 701362 697299 693935 690387 685696 680490 676297 673547 671546 669955 668774
57830F68774j471k466k648j365k85q76j975j611J15J618K080J639M63r01j316
$$ 668774 667303 664837 662189 660824 660539 659663 657688 656077 656192 657810 659890 661529 661992 661091 659775
57815F59775n33J59j90q11p97o83j200j751j470p06k65j57j04j78q8R39K702L882
$$ 659775 659242 659401 659211 658400 657603 656920 655720 653969 652499 651793 651528 651371 651267 651089 651001 651940 654642 658524
57797F58524M096M560N846O783O608O405P100P814P536O759O011M600K341Q38
$$ 658524 662620 667180 673026 679809 686417 692822 699922 707736 715272 722031 728042 732642 734983 735821
57783G35821J251K376K642K532L223M256M510M228M214M031K858J192K8p15j556
$$ 735821 737072 739448 742090 744622 747845 752101 756611 760839 765053 769084 771942 773134 773162 772447 770891
57768G70891k296k892m293o784q763q813p824p451p511o747n114l598k573j982
$$ 770891 768595 765703 761410 754626 745863 737050 729226 721775 714264 707517 702403 698805 696232 694250
57754F94250k137k840k745j176M72Q06P29J873L826M964N123N382N891N880N362
$$ 694250 692113 689273 686528 685352 685824 686630 687359 689232 693058 698022 703145 708527 714418 720298 725660
57739G25660M957M495L443K307J959K081J773J162Q48L78j080k984l898l444k409
$$ 725660 730617 735112 738555 740862 742821 744902 746675 747837 748685 749063 747983 744999 741101 737657 735248
57724G35248j419p90j005j969k409j455j74j54j224k055k261k381k478k295k269
$$ 735248 733829 733039 732034 730065 727656 726201 726027 725873 724649 722594 720333 717952 715474 713179 710910
57709G10910k866l492l466l313l644l660k483j075r22j502j088L92J346J103N69
$$ 710910 708044 704552 701086 697773 694129 690469 687986 686911 685989 684487 683399 683791 685137 686240 686809
57694F86809M57O05J041K029L141L762M415O141Q729J1024J2708J4428J6345J8048
$$ 686809 687266 687871 688912 690941 694082 697844 702259 708400 717129 728153 740861 755289 771634 789682
57680G89682J9567K1103K2088K2018K1804K2721K4300K4990K4696K5044K7124
$$ 789682 809249 830352 852440 874458 896262 918983 943283 968273 992969 1018013 1045137
57669A045137L0454L4085L7319L9507M0501M1060M1326L9167L1604J7825l65k0409
$$ 1045137 1075591 1109676 1146995 1186502 1227003 1268063 1309389 1348556 1380160 1397985 1397620 1377211
57657A377211l9517n4059o0977o0449n5621m9357m2555l5468k8775k2862j7549
$$ 1377211 1337694 1283635 1222658 1162209 1106588 1057231 1014676 979208 950433 927571 910022
57646I10022j3018r871q067o864n868n125m301l085k089k016k168j341N8N02p1
$$ 910022 897004 887133 879066 872202 866334 861209 856908 853823 851734 849718 847550 846209 846267 846769 846698
57631H46698j05J003K075K282K293K670K802K250J795K217L092L584L569L322
$$ 846698 846593 847596 849671 851953 854246 856916 859718 861968 863763 865980 869072 872656 876225 879547
57617H79547K902K379K015J850J690J680K171K926L192K681J806J006N03N84J259
$$ 879547 882449 884828 886843 888693 890383 892063 894234 897160 900352 903033 904839 905845 906348 906932 908191
57602I08191J876J878J681J907K188J817J179J248J939K324K206K173K242J880
$$ 908191 910067 911945 913626 915533 917721 919538 920717 921965 923904 926228 928434 930607 932849 934729
57588I34729J297J251J560J285L98q1K08N19L95J86M7k59m42J64J316J965J750
$$ 934729 936026 937277 938837 940122 940520 940439 940647 941166 941561 941747 941794 941535 941093 941257 942573 944538 946288
57571I46288J273Q92N67P73K088L757M263L506K975L496M326M766N145N718O040
$$ 946288 947561 948453 949020 949793 951881 955638 959901 963407 966382 969878 974204 978970 984115 989833 995873
57556I95873N974O084O501O590O107N632N548N730O358P702R013R061Q058P561
$$ 995873 1001847 1007931 1014432 1021022 1027129 1032761 1038309 1044039 1050397 1058099 1067112 1076173 1084231 1091792
57542A091792Q148Q734Q574Q322Q533Q660Q255P717P190O152M821M508N706P083
$$ 1091792 1099940 1108674 1117248 1125570 1134103 1142763 1151018 1158735 1165925 1172077 1176898 1181406 1187112 1194195
57528A194195P268O514N773N317N154N598O535P086O838O488O582O649O323O097
$$ 1194195 1201463 1207977 1213750 1219067 1224221 1229819 1236354 1243440 1250278 1256766 1263348 1269997 1276320 1282417
57514A282417O195N860M791M118M781N881N920N025M633N355O336O641O352O172
$$ 1282417 1288612 1294472 1299263 1303381 1308162 1314043 1319963 1324988 1329621 1334976 1341312 1347953 1354305 1360477
57500A360477O523P239P907Q484R299J0353J0990J0892J0824J1524J2392J2497
$$ 1360477 1367000 1374239 1382146 1390630 1399929 1410282 1421272 1432164 1442988 1454512 1466904 1479401
57488A479401J2348J3074J4167J3954J2389J1289J1380J1251J0066R166R725J0627
$$ 1479401 1491749 1504823 1518990 1532944 1545333 1556622 1568002 1579253 1589319 1598485 1608210 1618837
57476A618837J0339R330Q971R194R053Q735R203J0320J1008J1055J1333J2214
$$ 1618837 1629176 1638506 1647477 1656671 1665724 1674459 1683662 1693982 1704990 1716045 1727378 1739592
57464A739592J3021J3207J3136J3428J4085J4506J4094J2902J1763J1495J2002
$$ 1739592 1752613 1765820 1778956 1792384 1806469 1820975 1835069 1847971 1859734 1871229 1883231
57453A883231J2597J3108J3868J4637J4625J3867J3469J4044J4888J5240J5258
$$ 1883231 1895828 1908936 1922804 1937441 1952066 1965933 1979402 1993446 2008334 2023574 2038832
57442B038832J5222J4838J4119J3920J4709J5663J5897J5764J6053J6648J6944
$$ 2038832 2054054 2068892 2083011 2096931 2111640 2127303 2143200 2158964 2175017 2191665 2208609
57431B208609J7045J7437J7917J7785J6849J5584J4525J4016J4245J5028J5857
$$ 2208609 2225654 2243091 2261008 2278793 2295642 2311226 2325751 2339767 2354012 2369040 2384897
57420B384897J6533J7346J8367J9090J9179J8983J9003J9251J9518J9677J9592
$$ 2384897 2401430 2418776 2437143 2456233 2475412 2494395 2513398 2532649 2552167 2571844 2591436
57409B591436J9178J8723J8594J8673J8758J9282K0646K2004K2039K0951K0334
$$ 2591436 2610614 2629337 2647931 2666604 2685362 2704644 2725290 2747294 2769333 2790284 2810618
57398B810618K0877K1693K2098K2486K2997K3036K2751K3300K4793K5624K4898
$$ 2810618 2831495 2853188 2875286 2897772 2920769 2943805 2966556 2989856 3014649 3040273 3065171
57387C065171K3895K3970K4511K4383K3993K4327K5069K5318K5274K5725K6485
$$ 3065171 3089066 3113036 3137547 3161930 3185923 3210250 3235319 3260637 3285911 3311636 3338121
57376C338121K6849K6944K7339K7840K7893K7685K7703K7706K7241K6704K6814
$$ 3338121 3364970 3391914 3419253 3447093 3474986 3502671 3530374 3558080 3585321 3612025 3638839
57365C638839K7510K8245K8820K9124K8720K7704K7170K7829K8877K9309K9576
$$ 3638839 3666349 3694594 3723414 3752538 3781258 3808962 3836132 3863961 3892838 3922147 3951723
57354C951723L0675L2263L3054L2745L2265L2334L2800L3333L3842L4368L5073
$$ 3951723 3982398 4014661 4047715 4080460 4112725 4145059 4177859 4211192 4245034 4279402 4314475
57343D314475L6117L7081L7135L6206L5234L4827L4593L4340L4674L5656L6138
$$ 4314475 4350592 4387673 4424808 4461014 4496248 4531075 4565668 4600008 4634682 4670338 4706476
57332D706476L5539L5087L5979L7411L7793L7060L6312L5991L5817L5922L6636
$$ 4706476 4742015 4777102 4813081 4850492 4888285 4925345 4961657 4997648 5033465 5069387 5106023
57321E106023L7639L8458L9184L9786L9644L8881L8942M0472M1772M1113L9461
$$ 5106023 5143662 5182120 5221304 5261090 5300734 5339615 5378557 5419029 5460801 5501914 5541375
57310E541375L8966L9688M0025L9756M0214M1647M2717M2788M2680M2843M2631
$$ 5541375 5580341 5620029 5660054 5699810 5740024 5781671 5824388 5867176 5909856 5952699 5995330
57299E995330M1832M1283M1440M1747M1803M1978M2436M2742M2739M2867M3333
$$ 5995330 6037162 6078445 6119885 6161632 6203435 6245413 6287849 6330591 6373330 6416197 6459530
57288F459530M3827M4216M4639M4911M4674M4111M3757M3728M3884M4389M5248
$$ 6459530 6503357 6547573 6592212 6637123 6681797 6725908 6769665 6813393 6857277 6901666 6946914
57277F946914M5701M5154M4214M3787M3582M2726M1420M0625M0479M0316M0007
$$ 6946914 6992615 7037769 7081983 7125770 7169352 7212078 7253498 7294123 7334602 7374918 7414925
57266G414925L9936L9997L9859M0015M1155M2785M3807M4170M4681M5465M6035
$$ 7414925 7454861 7494858 7534717 7574732 7615887 7658672 7702479 7746649 7791330 7836795 7882830
57255G882830M6542M7425M8211M8204M7956M8280M8246M6194M2659M0061L9278
$$ 7882830 7929372 7976797 8025008 8073212 8121168 8169448 8217694 8263888 8306547 8346608 8385886
57244H385886L8681L6983L4963L3542L2176L0248K8487K7790K7786K7658K7467
$$ 8385886 8424567 8461550 8496513 8530055 8562231 8592479 8620966 8648756 8676542 8704200 8731667
57233H731667K7744K8525K9549L0797L2305L3910L5511L7064L8265L8901L9407
$$ 8731667 8759411 8787936 8817485 8848282 8880587 8914497 8950008 8987072 9025337 9064238 9103645
57222I103645M0233M0874M0510L9457L8800L8635L7979L6454L4810L3543L2231
$$ 9103645 9143878 9184752 9225262 9264719 9303519 9342154 9380133 9416587 9451397 9484940 9517171
57211I517171L0515K8613K6596K4217K1671J9527J7799J5998J4092J2380J0639
$$ 9517171 9547686 9576299 9602895 9627112 9648783 9668310 9686109 9702107 9716199 9728579 9739218
57200I739218Q535O730O129O157N285L278J387J30j376l520n261n798n808o320
$$ 9739218 9747753 9754483 9760612 9766769 9772054 9775332 9776719 9776849 9775473 9771953 9766692 9760894 9755086 9748766
57186I748766p448q796j0165j1359j2125j2586j3059j3513j4020j5331j7855k0506
$$ 9748766 9741318 9732522 9722357 9710998 9698873 9686287 9673228 9659715 9645695 9630364 9612509 9592003
57174I592003k2072k3297k5786k9206l1677l3072l5477l9981m5206m9914n4862
$$ 9592003 9569931 9546634 9520848 9491642 9459965 9426893 9391416 9351435 9306229 9256315 9201453
57163I201453o0904o7093p2222p6829q2191q8228r3660r7608j00188j01946j03300
$$ 9201453 9140549 9073456 9001234 8924405 8842214 8753986 8660326 8562718 8462530 8360584 8257284
57152H257284j03970j02673r8161r0680q1658p1983o1579n0558l9568k8996j9163
$$ 8257284 8153314 8050641 7952480 7861800 7780142 7708159 7646580 7596022 7556454 7527458 7508295
57141G508295j1284o903o297q728j4186k3290l5478m8926o2320p5141q6079r2991
$$ 7508295 7497011 7490108 7483811 7475083 7460897 7437607 7402129 7353203 7290883 7215742 7129663 7036672
57129G036672r4638r1034q2159o8111n0540l2074j4299J957J4778K1995K3996
$$ 7036672 6942034 6851000 6768841 6700730 6650190 6618116 6603817 6605774 6620552 6642547 6666543
57118F666543K3691K3740K6118L4063N1480P9889J18134J65206K21073K85351
$$ 6666543 6690234 6713974 6740092 6774155 6825635 6905524 7023658 7188864 7409937 7695288
57108G695288L58716M46097N55101O89815Q47295J018864J191377J348430J475915
$$ 7695288 8054004 8500101 9055202 9745017 10592312 11611176 12802553 14150983 15626898
57099A5626898J569085J633167J679001J722287J785191J891405K056483K284451
$$ 15626898 17195983 18829150 20508151 22230438 24015629 25907034 27963517 30247968
57091C0247968K571422K908463L283941L685056M081910M392415M478322M222536
$$ 30247968 32819390 35727853 39011794 42696850 46778760 51171175 55649497 59872033
57083E9872033L638032K883893K151991J546111J077934P37412N04175K85854
$$ 59872033 63510065 66393958 68545949 70092060 71169994 71907406 72411581 72697435
57075G2697435r0387p66639j729645k810378l798554m548867n004660n170400
$$ 72697435 72607048 71840409 70110764 67300386 63501832 58952965 53948305 48777905
57067D8777905n086310m813508m417464l953593l463935k980316k525628k114104
$$ 48777905 43691595 38878087 34460623 30507030 27043095 24062779 21537151 19423047
57059A9423047j753438j446488j191033r80861q09240o71148n62807m80807m21972
$$ 19423047 17669609 16223121 15032088 14051227 13241987 12570839 12008032 11527225 11105253
57050A1105253l82726l58732l46271l43112l46547l51498l52584l47784l38375
$$ 11105253 10722527 10363795 10017524 9674412 9327865 8976367 8623783 8275999 7937624
57041G937624l25916l11238k95870k81987k70351k59720k48549k36261k22989
$$ 7937624 7611708 7300470 7004600 6722613 6452262 6192542 5943993 5707732 5484743
57032E484743k09511j97412j88033j80961j74471j67511j60403j53733j47490
$$ 5484743 5275232 5077820 4889787 4708826 4534355 4366844 4206441 4052708 3905218
57023C905218j41248j34362j26032j15918j04823r4167q4886p7113p0581o4718
$$ 3905218 3763970 3629608 3503576 3387658 3282835 3188668 3103782 3026669 2956088 2891370
57013B891370n8803n2590m6491m0712l4671k7867k0735j3916p147L67Q846J8067
$$ 2891370 2832567 2779977 2733486 2692774 2658103 2630236 2609501 2595585 2588438 2588805 2597651 2615718
57001B615718K8184L9406N0771O0034O4802O2917N1462K6529j4108o6884j21259
$$ 2615718 2643902 2683308 2734079 2794113 2858915 2921832 2973294 2999823 2985715 2918831 2797572
56990B797572j64203j87536j91501j81816j64243j42501j19565r8343q0515o6169
$$ 2797572 2633369 2445833 2254332 2072516 1908273 1765772 1646207 1547864 1467349 1401180
56980A401180n5091m7483m3154m1195m0816m1472m1971m0730l7497l3718l0610
$$ 1401180 1346089 1298606 1255452 1214257 1173441 1131969 1089998 1049268 1011771 978053 947443
56969I47443k7932k5110k2391k0145j8103j6058j4438j3357j2059r991p669n696
$$ 947443 919511 894401 872010 851865 833762 817704 803266 789909 777850 767859 760190 754494
56957G54494l768j406J059K858L377J787k787r786j6724k1232k3033k3141k1967
$$ 754494 750726 749320 750379 753237 756614 758401 755614 745828 729104 707872 684839 661698 639731
56944F39731j9358j5752j2056q581n139j954M92K372M428O994R729J2262J4512
$$ 639731 620373 604621 592565 583984 578845 576891 577383 579755 584183 591177 600906 613168 627680
56931F27680J6410J7715J8047J6845J3494P712l59j0299k1098l0609l6288l7078
$$ 627680 644090 661805 679852 696697 710191 717903 717544 707245 686147 655538 619250 582172
56919E82172l4193k9791k5423k1802j9103j6896j4452j1620q955o809n001l640
$$ 582172 547979 518188 492765 470963 451860 434964 420512 408892 399937 393128 388127 384487
56907C84487l237l558l319j779K09J431J891K419L418M717O051P049P252O761
$$ 384487 381250 377692 374373 372594 372803 374234 376125 378544 381962 386679 392730 399779 407031 413792
56893D13792O327O397O779P599R566J2555J5002J5662J5235J5200J5718J5610
$$ 413792 420119 426516 433295 440894 450460 463015 478017 493679 508914 524114 539832 555442
56881E55442J3877J0342N396L8m221o431o857o021l799k45L485O150P894R724
$$ 555442 569319 579661 585057 585095 580874 574443 567586 561565 557766 557521 561006 567156 575050 584774
56867E84774J1957J4185J6381J8970K2026K5314K8866L2683L6128L8413L9379
$$ 584774 596731 610916 627297 646267 668293 693607 722473 755156 791284 829697 869076
56856H69076L8812L5380K7405J4938M07j2787k1974k5974k5179k0984j4763p417
$$ 869076 907888 943268 970673 985611 986018 973231 951257 925283 900104 879120 864357 856940
56844H56940L1O242J0596J3812J6868J9938K3094K7220L3023L9683M5666N0580
$$ 856940 856971 863213 873809 887621 904489 924427 947521 974741 1007764 1047447 1093113 1143693
56832A143693N4917N8090N7817N1479L7439J5652j1486l8729n9962p1530p3558
$$ 1143693 1198610 1256700 1314517 1365996 1403435 1419087 1407601 1368872 1308910 1237380 1163822
56821A163822o8436n8973m7828l7177k7974j9954j2658o054j41N332J0448J4983
$$ 1163822 1095386 1036413 988585 951408 923434 903480 890822 884768 884627 889959 900407 915390
56809I15390J9002K3051K7478L1830L5068L6000L3274K5372J1306q156k9723m8439
$$ 915390 934392 957443 984921 1016751 1051819 1087819 1121093 1146465 1157771 1149615 1119892 1071453
56797A071453o0189o4021o1936n6430m8725l9447k9940k1863j5870j1436p853
$$ 1071453 1011264 947243 885307 828877 780152 740705 710765 688902 673032 661596 653743
56786F53743m709j627J724N203Q270J0554J2089J3087J3558J2900R754K812p762
$$ 653743 649034 647407 649131 654334 662604 673158 685247 698334 711892 724792 734546 737358 729596
56773G29596k0013l1455m0278m5336m5995m2774l7463l1822k6501k1645j7741
$$ 729596 709583 678128 637850 592514 546519 503745 466282 434460 407959 386314 368573
56762C68573j5117j3183j1168r195p841p024o146n058m066l277k666k473k790
$$ 368573 353456 340273 329105 319910 312069 305045 298899 293841 289775 286498 283832 281359 278569
56749B78569l094k907k604k780l166l022k367j902j938k079j911j279j83J060
$$ 278569 275475 272568 269964 267184 264018 260996 258629 256727 254789 252710 250799 249520 249337 250397
56735B50397J723J447P76L89J97j43l73r6L61M17K84N73J257J815K182K610K948
$$ 250397 252120 253567 254343 254732 254929 254786 254413 254317 254678 255095 255379 255952 257209 259024 261206 263816 266764
56718B66764K871K561K393K201J709J301J475J986K334K639L054K926J703J77
$$ 266764 269635 272196 274589 276790 278499 279800 281275 283261 285595 288234 291288 294214 295917 296094
56704B96094m48k92l03m06K62J420J670O34l85k94M47Q45O13L1n17n08M14J832
$$ 296094 295646 295354 295051 294645 294907 296327 297997 298631 298246 297952 298399 299244 299857 299888 299371 298863 299277 301109
56686C01109K916L492M012M523M583M182L801L540L130K766K962L535L760L542
$$ 301109 304025 307517 311529 316052 320635 324817 328618 332158 335288 338054 341016 344551 348311 351853
56672C51853L406L384K965K177J570J094J82r84j501j190q51q73q14o13r21j824
$$ 351853 355259 358643 361608 363785 365355 366449 366631 365647 364146 362956 362105 361232 360418 359805 358884 357060
56656C57060k445k285j868j684j587j544j829k091j469j78L63m58j470j569j294
$$ 357060 354615 352330 350462 348778 347191 345647 343818 341727 340258 340080 340443 339985 338515 336946 335652
56641C35652j654k383k517j955j445j459j924k692l610m385m906n304n463n014
$$ 335652 333998 331615 329098 327143 325698 324239 322315 319623 316013 311628 306722 301418 295955 290941
56627B90941m049l171k556j750p36k56n75p89j26Q03Q47j28j159j398p97J8K28
$$ 290941 286892 283721 281165 279415 278679 278423 277848 277059 276933 277736 278583 278455 277296 275898 275101 275119 275347
56610B75347m54j259j072J21J104J049M66J97K58K34J15M6k19q45j373j195l74
$$ 275347 274893 273634 272562 272683 273787 274836 275302 275499 275757 275991 276106 276152 275933 275088 273715 272520 272146
56593B72146N46J271J864K408K874L190L201K807K241J874J761J732J859K368
$$ 272146 272692 273963 275827 278235 281109 284299 287500 290307 292548 294422 296183 297915 299774 302142
56579C02142L118L727M137M519M698M409L959L845L971M059M623O302Q340R145
$$ 302142 305260 308987 313124 317643 322341 326750 330709 334554 338525 342584 347207 353509 361849 370994
56565C70994Q579Q253R211J0651J1586J2367J3664J5083J5788J5675J5060J3880
$$ 370994 379573 387826 397037 407688 419274 431641 445305 460388 476176 491851 506911 520791
56553E20791J2032R845P556M997K368N77N2p1q85k341l677m575n286n985o692
$$ 520791 532823 542668 550224 555221 557589 558166 558218 558147 557262 554921 551244 546669 541383 535398 528706
56538E28706p441q154q748r535j0870j2240j2557j1684j0757j0557j0571j0149
$$ 528706 521265 513111 504363 494828 483958 471718 459161 447477 436720 426163 415592 405443
56526D05443r559r143q501p344o316o063o120n693m880m283l967l610l233l002
$$ 405443 395884 386741 378240 370896 364580 358517 352397 346704 341824 337541 333574 329964 326731 323729
56512C23729k754k378k258k671l270l615l715l534k718j425o55j015j780j867
$$ 323729 320975 318597 316339 313668 310398 306783 303068 299534 296816 295391 294736 293721 291941 290074
56498B90074j185l64J77K66k17q70q10J09Q39O78L33N93Q31O6j135j270r7J078
$$ 290074 288889 288525 288702 288968 288751 287881 287071 287180 288019 288697 289030 289623 290454 290520 289385 288115 288018 289096
56480B89096J295R39P29P05N04P5k16KO53J095P14k38q45p16l81k92j70K80O93
$$ 289096 290391 291330 292059 292764 293268 293343 293127 293129 293782 294877 295591 295353 294508 293792 293411 293119 292949 293229 293922
56461B93922O24K46j4p0J0K03K89R3J26J103K505K823J689O19Q67J686J668P78
$$ 293922 294546 294792 294778 294708 294718 294921 295210 295303 295429 296532 299037 301860 303549 304168 305035 306721 308389 309167
56443C09167m4l82l80k5N36O26J7m32m6M56J36n55n63L0L00P0j22k40o80j188
$$ 309167 309123 308741 308361 308336 308872 309498 309515 309083 309037 309493 309629 309074 308511 308541 308841 308911 308789 308549 307869 306681
56423C06681j064l51K09L51M58O62O85N19M19L24m0m62m15J19N74N48J38l35n76
$$ 306681 305617 305266 305475 305826 306284 306946 307631 308150 308569 308893 308853 308391 307976 308095 308669 309217 309355 309020 308444
56404C08444m73k24j30q5K63Q00J022R27J112J756K405K937L653M210L728K459
$$ 308444 307971 307747 307617 307532 307795 308595 309617 310544 311656 313412 315817 318754 322407 326617 330345 332804
56388C32804J942K772L588L199K315K126K383K180J530Q58k9j195j765j185l84
$$ 332804 334746 337518 341106 344305 346620 348746 351129 353309 354839 355697 355668 354473 352708 351523 351139
56373C51139l88o85k91N06Q76J042J600K131J938J453J359J087j50j578j842j217
$$ 351139 350751 350066 349775 350281 351157 352199 353799 355930 357868 359321 360680 361767 361617 360039 358197 356980
56357C56980j066j464j142L71K178L484M222M385M013L722L972M119L281J836
$$ 356980 355914 354450 353308 353679 355857 359341 363563 367948 371961 375683 379655 383774 387055 388891
56343C88891Q63N78N32Q06J670K548K733K637K979L268K612J566J515K577L657
$$ 388891 389754 390332 390864 391670 393340 395888 398621 401258 404237 407505 410117 411683 413198 415775 419432
56328D19432M228M614M744M235L459L187L392L648M201N243N813N000L717L516
$$ 419432 423660 428274 433018 437253 440712 443899 447291 450939 455140 460383 466196 471196 474913 478429
56314D78429M186M355L975M196N022N227M643M535N476O616P333P992Q811R427
$$ 478429 482615 486970 490945 495141 500163 505390 510033 514568 520044 526660 533993 541985 550796 560223
56300E60223R843J0462J1114J1231J0946J0817J0680J0043R276R013Q845Q053
$$ 560223 570066 580528 591642 602873 613819 624636 635316 645359 654635 663648 672493 680546
56288F80546P225P399Q129Q187P860Q614J0679J2847J4601J6462J8327J9414J9935
$$ 680546 687771 695170 703299 711486 719346 727960 738639 751486 766087 782549 800876 820290 840225
56275H40225K1117K3386K6151K9233L2901L6637L9689M2700M7050N2760N8811
$$ 840225 861342 884728 910879 940112 973013 1009650 1049339 1092039 1139089 1191849 1250660
56264A250660O5173P2510Q0196Q6804R2468R8726J06063J13697J21535J30061
$$ 1250660 1315833 1388343 1468539 1555343 1647811 1746537 1852600 1966297 2087832 2217893
56254B217893J38449J45197J50660J56567J62949J68049J71342J74092J76503
$$ 2217893 2356342 2501539 2652199 2808766 2971715 3139764 3311106 3485198 3661701
56245C661701J76998J74724J70355J63842J53939J40546J25105J07831Q7035O1992
$$ 3661701 3838699 4013423 4183778 4347620 4501559 4642105 4767210 4875041 4962076 5024068
56235E024068L4270N436k4333n4476q3113j08873j31822j51811j67815j79506
$$ 5024068 5058338 5063774 5039441 4984965 4901852 4792979 4661157 4509346 4341531 4162025
56225D162025j87540j91901j91999j88836j84672j80037j73455j64632j55405
$$ 4162025 3974485 3782584 3590585 3401749 3217077 3037040 2863585 2698953 2543548
56216B543548j46738j37486j27134j17235j08884j01118r2968q4977p7623p0403
$$ 2543548 2396810 2259324 2132190 2014955 1906071 1804953 1711985 1627008 1549385 1478982
56206A478982o3515n8252n4706n1231m7088m3395m0594l7387l3287k9696k7327
$$ 1478982 1415467 1357215 1302509 1251278 1204190 1160795 1120201 1082814 1049527 1019831 992504
56195I92504k4998k2128j9909j8766j7224j4683j2741j2261j1699j0012q650q817
$$ 992504 967506 945378 925469 906703 889479 874796 862055 849794 838095 828083 819433 810616
56183H10616r098p834n725m124k804j285m97j088j849j536p02j11P93K360L527
$$ 810616 801518 793684 787959 783835 781031 779746 779249 778161 776312 774776 774074 773963 774756 777116 780643
56168G80643L767M417O425Q552R434R681J0430J1527J2630J4341J6824J9055K0752
$$ 780643 784410 788827 795252 803804 813238 822919 833349 844876 857506 871847 888671 907726 928478
56155I28478K3190K6915L0608L3468L6470M0117M3294M5768M9293N4620N9929
$$ 928478 951668 978583 1009191 1042659 1079129 1119246 1162540 1208308 1257601 1312221 1372150
56144A372150O3885O7741P2684P7618Q1602Q5935R1761R7899J03150J08347J14005
$$ 1372150 1436035 1503776 1576460 1654078 1735680 1821615 1913376 2011275 2114425 2222772 2336777
56133B336777J18360J19922J19671J18417J14288J05292R2284P7187O0544M3232
$$ 2336777 2455137 2575059 2694730 2813147 2927435 3032727 3125011 3202198 3262742 3305974
56123C305974K8207J7647R982K126o994j7102k8522m0967n2268o0729o7234p3210
$$ 3305974 3334181 3351828 3361810 3363936 3356942 3339840 3311318 3270351 3218083 3157354 3090120 3016910
56111C016910p8527q3287q9286r7503j06217j13566j19551j23595j23007j16530
$$ 3016910 2938383 2855096 2765810 2668307 2562090 2448524 2328973 2205378 2082371 1965841
56101A965841j06819r6785q5988p3310o0474m9921m1423l3745k7395k2935j8853
$$ 1965841 1859022 1762237 1676249 1602939 1542465 1492544 1451121 1417376 1389981 1367046 1348193
56090A348193j3979r836p839o507m159j948j339j041O62K880M268N719Q047R667
$$ 1348193 1334214 1324378 1316539 1310032 1305873 1303925 1302586 1301545 1302207 1305087 1309355 1315074 1323121 1332788
56076A332788R489R374J0784J1849J0898R879J0845J2117J1466J0181J0260J0573
$$ 1332788 1342277 1351651 1362435 1374284 1385182 1395061 1405906 1418023 1429489 1439670 1449930 1460503
56064A460503R574Q861J0031J0985R557P893Q975J1489J2540J2780J4433J6745
$$ 1460503 1470077 1478938 1488969 1499954 1509511 1517404 1526379 1537868 1550408 1563188 1577621 1594366
56052A594366J7814J8506K0351K1991K1863K1701K3366K5054K4863K4838K7144
$$ 1594366 1612180 1630686 1651037 1673028 1694891 1716592 1739958 1765012 1789875 1814713 1841857
56041A841857K9589K9681K9590L2083L5096L5668L5734L8323M1492M1949M1463
$$ 1841857 1871446 1901127 1930717 1962800 1997896 2033564 2069298 2107621 2149113 2191062 2232525
56030B232525M3507M6611M7310M6835M8651N2054N4339N6390O0115O3359O3597
$$ 2232525 2276032 2322643 2369953 2416788 2465439 2517493 2571832 2628222 2688337 2751696 2815293
56019B815293O3457O6291O9706P0057O9596P2253P6163P7753P9354Q4895R1823
$$ 2815293 2878750 2945041 3014747 3084804 3154400 3226653 3302816 3380569 3459923 3544818 3636641
56008C636641R5397R7496J02862J10194J15414J20121J28018J36734J42154J47061
$$ 3636641 3732038 3829534 3932396 4042590 4158004 4278125 4406143 4542877 4685031 4832092
55998D832092J56221J66939J74207J80934J92830K07454K19178K30743K48449
$$ 4832092 4988313 5155252 5329459 5510393 5703223 5910677 6129855 6360598 6609047
55989F609047K70232K90228L10876L38092L69081L97953M28882M70087N19540
$$ 6609047 6879279 7169507 7480383 7818475 8187556 8585509 9014391 9484478 10004018
55980A0004018N71064O29433P04106P93458Q92292J009889J162878J356188J591322
$$ 10004018 10575082 11204515 11908621 12702079 13594371 14604260 15767138 17123326 18714648
55971A8714648J888711K279871K780706L392910M123214M969295N883101O774240
$$ 18714648 20603359 22883230 25663936 29056846 33180060 38149355 44032456 50806696
55963E0806696P557561Q186101Q650771Q977259R213715R384368R458880R406458
$$ 50806696 58364257 66550358 75201129 84178388 93392103 102776471 112235351 121641809
55955A21641809R279364R206201R314761R713668J0525212J1822169J3477991
$$ 121641809 130921173 140127374 149442135 159155803 169681015 181503184 194981175
55948A94981175J5158163J6541104J7515116J8083865J8063555J6880285J3666863
$$ 194981175 210139338 226680442 244195558 262279423 280342978 297223263 310890126
55941C10890126P679641j082126j1420484k1165559k8179169l1437629l1309304
$$ 310890126 318569767 317487641 306067157 284901598 256722429 225284800 193975496
55934A93975496k8932184k5426625k1572070j7870239j4619510j1915747r715161
$$ 193975496 165043312 139616687 118044617 100174378 85554868 73639121 63923960
55927F3923960p950144o567740n494971m642675l952659l401245k959788k589534
$$ 63923960 55973816 49406076 43911105 39268430 35315771 31914526 28954738 26365204
55919B6365204k272238k010030j794728j606230j438877j301065j189316j087743
$$ 26365204 24092966 22082936 20288208 18681978 17243101 15942036 14752720 13664977
55911A3664977r92020r10318q41257p73024p03922o43184n91519n40036m88278
$$ 13664977 12672957 11762639 10921382 10148358 9444436 8801252 8209733 7669697 7181419
55902G181419m44956m10585l76611l41915l13866k92673k70504k46550k27950
$$ 7181419 6736463 6325878 5949267 5607352 5293486 5000813 4730309 4483759 4255809
55893D255809k15091k00487j83077j69786j61771j52332j39695j29338j22330
$$ 4255809 4040718 3840231 3657154 3487368 3325597 3173265 3033570 2904232 2781902
55884B781902j13370j01856r3420q9061q3523p5750p0398o7819o2898n5090m9630
$$ 2781902 2668532 2566676 2473256 2384195 2300672 2224922 2154524 2086705 2023807 1968717 1919087
55873A919087m7491m3862l7869l4274l4092l2757k9180k7599k8866k8583k5580
$$ 1919087 1871596 1827734 1789865 1755591 1721499 1688742 1659562 1631963 1603097 1574514 1548934
55862A548934k3829k4247k2767j8387j5239j4834j3864j1398j0891j3296j5467
$$ 1548934 1525105 1500858 1478091 1459704 1444465 1429631 1415767 1404369 1393478 1380182 1364715
55851A364715j7074k1847l0038l6611l8973l9939m1220m0583l7388l4531l2800
$$ 1364715 1347641 1325794 1295756 1259145 1220172 1180233 1139013 1098430 1061042 1026511 993711
55840I93711k9400k4066k0672k0733k0967j9199j7208j5981j3672j0101p937p662
$$ 993711 964311 940245 919573 898840 877873 858674 841466 825485 811813 801712 793775 786113
55828G86113o431l589k099k901l069j252J06l33n45M78R18K78O80K466L154K185
$$ 786113 779682 776093 773994 771093 768024 766772 766878 766545 766000 766478 767396 767674 768354 770820 773974 776159
55812G76159K103L558L876K136R23J324Q63j821m640o205q036j0862j2853j3232
$$ 776159 778262 781820 785696 787832 788755 790079 790942 789121 784481 778276 770240 759378 746525 733293
55798G33293j3706j4794j4684j3101j2278j2726j2146r859q087p567o215l542
$$ 733293 719587 704793 690109 677008 664730 652004 639858 629999 621912 614345 608130 604588
55786F04588j953k036j039K200N119O107O954Q729R454Q092O731O582N697K953
$$ 604588 602635 600599 599560 601760 606879 612986 619940 628669 638123 646215 652946 659528 665225 668178
55772F68178M72j99o18j891k232n08J364J941K723M602N124J918l985j0497j7160
$$ 668178 668650 668451 667833 665942 663710 663202 664566 666507 669230 673832 678956 680874 676889 666392 649232
55757F49232k3279k6516k5933k3862k2456k0913j8090j5141j3267j1498q907o663
$$ 649232 625953 599437 573504 549642 527186 506273 488183 473042 459775 448277 439370 432707
55745D32707n849n491m679m305m873m945l576j987j285p26K17O16K51M93J583
$$ 432707 426858 421367 416688 412383 407510 402565 398989 397002 395717 394991 395208 395824 396075 396568 398151
55730C98151J756M02p15q05j576l754n202m455l127k831k606j482p54j410j969
$$ 398151 399907 400309 399594 398789 397213 393459 388257 383802 380675 377844 375238 373756 373002 371592 369623
55715C69623j073J51M61O97J656K303K117K626M528N920N510M882N393N538L840
$$ 369623 368550 368701 369162 369859 371515 373818 375935 378561 383089 389009 394519 399401 404794 410332 414172
55700D14172J635M42r18l780o616p334o515n666m374j896L76Q96O87J436K502
$$ 414172 415807 416249 415331 411551 404935 397601 391086 385420 381046 379150 379526 380422 381109 382545 385047
55685C85047K371J508J294J568J610J973L095L705K872J986K431L042K226Q65
$$ 385047 387418 388926 390220 391788 393398 395371 398466 402171 405043 407029 409460 412502 414728 415593
55671D15593O30J003N77k22k60j67j092k250k169j373j443k442l367m069m783
$$ 415593 416223 417226 417803 417581 417321 417154 416062 413812 411643 410270 408827 406385 403018 398949 394166
55656C94166m946m418m483n742o598n784m662m801n125m059k724l141m616m944
$$ 394166 389220 384802 380319 374577 367979 362195 357533 352732 347607 343548 340824 337683 333067 328123
55642C28123m079l721m062l748k523j411p69k63k40j063j887k041k569m393o104
$$ 328123 324044 320323 316261 312513 309990 308579 307810 307547 307307 306244 304357 302316 299747 295354 289250
55627B89250n813m190l292l455l622l714m230m424l440k346k589l320k792j533
$$ 289250 283437 279247 275955 272500 268878 265164 260934 256510 253070 250724 248135 244815 242023 240490
55613B40490j427k347k500j575q43n25K34J069P73j88j87O50N52p93j748j535
$$ 240490 239063 236716 234216 232641 231798 231273 231507 232576 233349 233161 232974 233624 234176 233383 231635 230100
55597B30100j156j220j054l99k1j62r3M23P46N95L61J22k70l79K80J172J515J563
$$ 230100 228944 227724 226670 226271 226250 226088 225995 226418 227164 227759 228120 228242 227972 227593 227873 229045 230560 232123
55579B32123J856J884J060K06L20P05K77k40M02J414J143K08O90K515L410K578
$$ 232123 233979 235863 236923 237129 237449 238154 238431 238191 238593 240007 241150 241358 242048 244563 247973 250551
55563B50551J696J921K394K328K303K717K941K725K732L066K866J969J377J562
$$ 250551 252247 254168 256562 258890 261193 263910 266851 269576 272308 275374 278240 280209 281586 283148
55549B83148J755J407R86Q29M50n19j756k863l656l781l139k535k831l589l637
$$ 283148 284903 286310 287296 288125 288575 288056 286300 283437 279781 276000 272861 270326 267495 263906 260269
55534B60269k808j937j526j582k278l392l783k862k013k756m205m276k967k197
$$ 260269 257461 255524 253998 252416 250138 246746 242963 240101 238088 235332 231127 226851 223884 221687
55520B21687k649l053k629k066j767j186l05O5k11m07m71j021j728j474l66K35
$$ 221687 219038 215985 213356 211290 209523 208337 208032 208097 207886 207479 207008 205987 204259 202785 202419 202654
55504B02654o0k23K21N87O42R61J357Q81k21m83K97N69l56j099n41M57O85L51
$$ 202654 202594 202371 202592 203179 203821 204782 206139 207020 206799 206316 206613 207182 206826 205727 205186 205643 206328 206679
55486B06679J84J39m3j36j88p87j873k363j747r68r08j101p17P0N06L68j4l17
$$ 206679 206863 207002 206959 206823 206635 205848 203975 201612 199865 198897 197989 196888 196171 196241 196747 197115 197101 196784
55468A96784l56j55j7m5K60J155J798J280J88o3O72J271J249J153J116N71l65
$$ 196784 196428 196273 196256 196211 196471 197626 199424 200704 200892 200829 201501 202772 204021 205174 206290 206861 206496
55451B06496q62q80j201j747j531n40j7l65m53L73J170J054N34M27N65M25J6m37
$$ 206496 205634 204754 203553 201806 200275 199735 199718 199353 198900 199273 200443 201497 202031 202458 203023 203448 203464 203027
55433B03027q15p84q1O71N68r1j51N24R42Q54J060J590J336N7r43p93j40L56J054
$$ 203027 202212 201428 201347 202018 202586 202495 202344 202868 203810 204664 205724 207314 208650 208707 207764 206971 206831 207187 208241
55414B08241K090K547J877P92L4n90j173j099k51L92K19n6K86Q55J044R14N35
$$ 208241 210331 212878 214755 215547 215581 214991 213818 212719 212468 212860 213079 213023 213309 214164 215208 216122 216657
55397B16657m01j649k258k020j858k157k080j231n57p23r46m65J11j0m82o56p18
$$ 216657 216256 214607 212349 210329 208471 206314 204234 203003 202446 201723 200777 200312 200423 200413 199931 199275 198557
55380A98557r29q14r4N42N50M60P88R69L93m73q91r31q73m73K96P14M38K23O52
$$ 198557 197628 196814 196720 197262 197812 198272 199060 200029 200422 199949 199058 198127 197254 196781 197077 197791 198229 198452 199104
55361A99104J022N00n41j234j456j389p96L10J042O85k66r21j114j054o42J6K68
$$ 199104 200126 200626 200085 198851 197395 196006 195210 195520 196562 197247 196981 196060 194946 193892 193250 193266 193534
55344A93534j17m30j81J18M6L1L35L01m03q50k11Q84J352J150Q17M31Jp5J31k35
$$ 193534 193417 192987 192806 192924 192970 193001 193336 193637 193234 192384 192173 193057 194409 195559 196376 196807 196808 196733 196864 196629
55324A96629j266j555j79J640K253J886J738J761J026k98j039q45m21j81N2K21
$$ 196629 195363 193808 193629 195269 197522 199408 201146 202907 203933 203635 202596 201751 201330 201149 201201 201422
55308B01422O8j76j36n9k93m57j03L81N12P61J604K213J486np01l56j35m46l17
$$ 201422 201490 201314 201178 201119 200826 200369 200266 200647 201159 201920 203524 205737 207223 207218 206517 206161 206026 205580 205263
55289B05263P33J667J438M91O0N36J144R59n8r93r59j75K53k35r67j120p59l90
$$ 205263 205996 207663 209101 209592 209652 210188 211332 212291 212233 211240 210281 210106 210359 210124 209157 208037 207278 206888
55271B06888j16N6k76j263k219k398j955j429q09P2P84Q23M82L45K91q3m60j64
$$ 206888 206772 206828 206552 205289 203070 200672 198717 197288 196479 196551 197335 198158 198640 198985 199276 199193 198733 198569
55253A98569O99J339J362J060Q19Q32J146J477J283N23j58m58r08j743k154j510
$$ 198569 199268 200607 201969 203029 203848 204680 205826 207303 208586 209109 208951 208493 207585 205842 203688 202178
55237B02178n36k62m53k61J66J6o70j027o98o8O07J262J432P00l84p98l98J54
$$ 202178 201642 201380 200927 200666 200832 200848 200178 199151 198453 198385 198992 200254 201686 202386 202002 201204 200806 200960
55219B00960N48R56J228R83M33J51R8k47q18r43l83M09J009J286J050K22p28j176
$$ 200960 201508 202464 203692 204675 205108 205259 205357 205110 204292 203349 202966 203375 204384 205670 206720 206942 206214 205038
55201B05038j123r39n69J96R39R35J65o61j008q32l00K23J74n03j031q19l32k28
$$ 205038 203915 202976 202407 202603 203542 204477 204642 203981 202973 202141 201841 202064 202238 201735 200704 199885 199553 199325
55183A99325k10L13R55R09L27L0J25Q5m6K45P65P71K54l2J11J83J00L70R55J067
$$ 199325 199115 199428 200383 201292 201619 201649 201774 201859 201813 202058 202823 203594 203848 203816 203927 204110 204210 204580 205535 206602
55163B06602L61n54j008q85k80N78J076O94j07m02j26%j50R1Q20J142N12m28p66
$$ 206602 206963 206409 205401 204516 204236 204814 205890 206584 206477 206075 205949 205949 205799 205890 206710 207852 208364 207936 207170
55144B07170l91K80R31J290J065L24m04o40l56J27L56K5o00p37o7P20R01P03O78
$$ 207170 206779 207059 207990 209280 210345 210669 210265 209625 209269 209396 209752 209777 209177 208440 208373 209093 209994 210697 211375
55125B11375O08R5l12K03J207J509J007O68O74J36j078j704r19M17J092J099J113
$$ 211375 211983 212078 211766 211969 213176 214685 215692 216360 217034 217170 216092 214388 213469 213886 214978 216077 217190
55108B17190J292J404J569K001K392K180J269J10p13q15k78K87K71j79l38J01
$$ 217190 218482 219886 221455 223456 225848 228028 229297 229407 228694 227879 227601 227888 228159 227980 227642 227743
55092B27743O93R34Q03M80L7m36p00n89j33M81Q92Q02M33L91P35P35Op75r42q82
$$ 227743 228436 229370 230173 230653 230690 230254 229554 228965 228832 229313 230205 231007 231440 231831 232566 233301 233307 232532 231590 230708
55072B30708j113j068j35P84K63j300k014j220k49k62p88r27o35j40O83J636J825
$$ 230708 229595 228527 228392 229176 229439 228139 226125 224905 224656 224394 223606 222679 222044 221904 222587 224223 226048
55055B26048P87p34j676j743j214l84M04Q00Q72R27P88Kj147j747j578j368j419
$$ 226048 226835 226101 224425 222682 221468 221084 221488 222288 223160 224087 224875 224877 223730 221983 220405 219037 217618
55038B17618j079m0Q75Q55K25k26l20k94j98l9k7j84k58k29l45m13N3Q14R54L78
$$ 217618 216539 216499 217374 218229 218454 218228 217908 217614 217416 217377 217350 217166 216908 216679 216334 215921 215974 216788 217742 218120
55018B18120J84R92J866J715Q53K83J52j07n12m82J86J014J457J329P82K39J15
$$ 218120 218304 219296 221162 222877 223730 224013 224165 224058 223546 223064 223250 224264 225721 227050 227832 228071 228186
55001B28186L52M63K40n3k46m62n65p6R84J890K128J986J808J445P97K20q6m47
$$ 228186 228538 229001 229241 229188 228942 228480 227915 227839 228823 230713 232841 234827 236635 238080 238877 239097 239011 238564
54983B38564r63j139p63m40o34q35m18L22P04P38Q51J037J028R55J091J238J058
$$ 238564 237601 236462 235699 235259 234625 233790 233372 233694 234398 235136 235987 237024 238052 239007 240098 241336 242394
54966B42394P69P93R71P68K04j71j07Q6J18P8J03J37J08J07K85O17Q71Q35O91
$$ 242394 243163 243956 244927 245695 245899 245728 245621 245707 245825 245903 246006 246143 246251 246358 246643 247260 248131 248966 249657
54947B49657R31J650K182J939J376J441K204K825K867K749K782K703K414K335
$$ 249657 250588 252238 254420 256359 257735 259176 261380 264205 267072 269821 272603 275306 277720 280055
54933B80055K581K668K465K593L387M211M373M007L557L086K612K308J883N48
$$ 280055 282636 285304 287769 290362 293749 297960 302333 306340 309897 312983 315595 317903 319786 320334
54919C20334j701l662m500m921n910p092p378o651n707m947m123l090j944p27
$$ 320334 318633 314971 310471 305550 299640 292548 285170 278519 272812 267865 263742 260652 258708 257981
54905B57981K68L93l76q53n9J248J608J054R43J759K483K379K110K515L286L609
$$ 257981 258249 258642 258266 257413 257354 258602 260210 261264 262207 263966 266449 268828 270938 273453 276739 280348
54889B80348L476L565M107M542M353L851L863M662N403M921L065Q16r72k438m017
$$ 280348 283824 287389 291496 296038 300391 304242 308105 312767 318170 323091 326156 326972 326000 323562 319545
54874C19545n518o407o645o608o471o154n706n211m548l694l044k940l061k799
$$ 319545 314027 307620 300975 294367 287896 281742 276036 270825 266277 262583 259539 256599 253538 250739
54860B50739k051j281r42j135j601j780j224k65J85j31m09o7K83j30r26j191r22
$$ 250739 248688 247407 246465 245330 243729 241949 240725 240460 240645 240514 240105 240038 240321 240191 239265 238074 237152
54843B37152p52o68j71M55L05o61j402j269o86j37M46R94R48J95m66l99o2j87
$$ 237152 236400 235732 235561 236016 236321 235660 234258 232989 232303 232166 232612 233606 234554 234749 234283 233884 233822 233635
54825B33635o60q69p44p01p35l64N16J297J401R81O62Q10J173J230P08j67q97
$$ 233635 232975 232106 231362 230661 229926 229562 230078 231375 232776 233757 234419 235229 236402 237632 238340 238173 237276
54808B37276j095p46q4O56J364J951K230K085J753J703K042K258J853J083O97
$$ 237276 236181 235435 235351 236007 237371 239322 241552 243637 245390 247093 249135 251393 253246 254329 255026
54793B55026R54J386J572J666J959K321K411K198K012K231L006M070M751M494
$$ 255026 255980 257366 258938 260604 262563 264884 267295 269493 271505 273736 276742 280812 285563 290057
54779B90057L495K540K171K344K879L745M692N173M932M285L605K891K027J025
$$ 290057 293552 296092 298263 300607 303486 307231 311923 317096 322028 326313 329918 332809 334836 335861
54765C35861j70j657l151m085m364m450m545m305l659l179l195l244k904k493
$$ 335861 335691 334034 330883 326798 322434 317984 313439 309134 305475 302296 299101 295857 292953 290460
54751B90460k379k287j923j593j513j204l66L05J82j2Q16K302L036K625K122K307
$$ 290460 288081 285794 283871 282278 280765 279561 279195 279500 279682 279670 280486 282788 285824 288449 290571 292878
54735B92878K733K812K771L068L594L986M154M103L651K713J535L86p41j882k889
$$ 292878 295611 298423 301194 304262 307856 311842 315996 320099 323750 326463 327998 328384 327643 325761 322872
54720C22872l681m426n247n897o047n800n695n960n986m925k938j358j121j477
$$ 322872 319191 314765 309518 303621 297574 291774 286079 280119 274133 269208 266270 264912 263791 262314
54706B62314j069J6L85l79j021o34j12n73j437j390n30j59o81j153q90l63k14
$$ 262314 261245 261261 261646 261267 260246 259612 259500 258927 257490 256100 255570 255411 254730 253577 252687 252324 252110
54689B52110l82m91m05j97l1k08p76j196r04j72J98p2n92j008j254j202q06m94
$$ 252110 251728 251237 250832 250635 250604 250396 249620 248424 247520 247348 247546 247474 246882 245874 244620 243418 242612 242118
54671B42118o71r05m24N73R55K05q74j252q16j28L15K66l10j079j441j087k82
$$ 242118 241447 240542 240118 240691 241646 241851 240977 239725 238909 238781 239096 239362 239052 237973 236532 235445 235163
54654B35163M89R31J069J123J306J460J170M30j04L0M10L60k5j64L0J96L14O08
$$ 235163 235652 236583 237652 238775 240081 241541 242711 243141 243037 243067 243477 243837 243812 243648 243678 243874 244188 244796
54636B44796Q68O90L36M74J011J135O26K07L32M44j22j120j755j651j069n01k77
$$ 244796 245664 246354 246690 247164 248175 249310 249936 250143 250475 250919 250797 249677 247922 246271 245202 244701 244424
54619B44424l36k70K01P61R07O33L52K32J43J52M94J064J470J623J731J765J435
$$ 244424 244088 243818 244019 244780 245687 246320 246672 246904 247047 247199 247693 248757 250227 251850 253581 255346 256781
54602B56781P20r8q68j510j703j244n98m16n64l77K31O83P51Q05J020J056P21
$$ 256781 257501 257403 256535 255025 253322 252078 251480 251064 250500 250123 250354 251037 251788 252593 253613 254669 255390
54585B55390K38k46p62j119j044p61p27q14n57j25j52n67n62J44R27J310J397
$$ 255390 255628 255382 254620 253501 252457 251696 250969 250155 249598 249473 249321 248754 248192 248336 249263 250573 251970
54568B51970J132K32q66j106l49L02J73j2M42R80P92K09M3K74L55L10N53R54J025
$$ 251970 253102 253334 252468 251362 251013 251315 251488 251476 251918 252898 253690 253899 253942 254216 254571 254881 255434 256388 257413
54549B57413Q19Q30J134J310J088O13J41j41j33k1j07j79N03K118L651L939L030
$$ 257413 258232 259062 260196 261506 262594 263207 263348 263207 263074 263053 262946 262767 263270 265388 269039 272978 276008
54532B76008J862R79K30l99n12j4N17M29k37q96j125j144j467k185k681k354j432
$$ 276008 277870 278849 279079 278680 278168 278154 278671 279100 278863 277967 276842 275698 274231 272046 269365 267011 265579
54515B65579p08n15m50j49J58J50K0J91P20J205J207O21j61m75n7N19M54k30p19
$$ 265579 264871 264356 263906 263757 263915 264065 264085 264276 264996 266201 267408 268029 267868 267393 267336 267855 268309 268079 267360
54496B67360n22PL32L79K39j57p36j047p08J08Q58J128Q75M18K25M10N91M53K74
$$ 267360 266838 266845 267177 267556 267795 267638 266902 265855 265147 265255 266113 267241 268116 268534 268759 269169 269760 270213 270487
54477B70487L82M70J10k53J78J175J589J015K95J65L79N26P58J169J320R68N65
$$ 270487 270869 271339 271449 271196 271374 272549 274138 275153 275448 275613 275992 276518 277276 278445 279765 280733 281298
54460B81298N02N41M44M30M93R5q81j610j418o89j06L52Q85J061M30n56j044q97
$$ 281298 281800 282341 282785 283215 283708 283803 282922 281312 279894 279205 279099 279451 280336 281397 281827 281271 280227 279330
54442B79330n79l16q8o1l03m07p5K70J21k23j55J93K29j9O0O19J059R37N48M21
$$ 279330 278751 278435 278347 278286 277983 277576 277501 277771 277892 277669 277514 277707 277936 277917 277977 278596 279655 280592 281140 281561
54422B81561O27P61M03l68q95n64M43J316J599J567J556J480J228R06M84j54n72
$$ 281561 282188 282949 283352 282984 282089 281525 281968 283284 284883 286450 288006 289486 290714 291620 292104 291950 291378
54405B91378J0J395K166J415k0p09l61L68J053J589J635J013L39L76R27J221J069
$$ 291378 291388 292783 294949 296364 296344 295635 295274 295642 296695 298284 299919 300932 301271 301647 302574 303795 304864
54388C04864R21R73J042J097J220J204R03O94R09J058M81m86q22k19O27J057J055
$$ 304864 305785 306758 307800 308897 310117 311321 312224 312918 313827 314885 315366 314880 314058 313839 314466 315523 316578
54371C16578Q83Q01J099J769K174J762R59O87J059J296R64N44O12J120J701K182
$$ 316578 317461 318262 319361 321130 323304 325066 326025 326712 327771 329067 330031 330575 331187 332307 334008 336190
54355C36190K549K776K848K779K549K184J740J060j57j809l234l943m089m008
$$ 336190 338739 341515 344363 347142 349691 351875 353615 354675 354518 352709 349475 345532 341443 337435
54341C37435l732l340l203l369l243k551j911j855j889j445j083j609k477k408
$$ 337435 333703 330363 327160 323791 320548 317997 316086 314231 312342 310897 309814 308205 305728 303320
54327C03320j401p58j043j293o21M50P81J6j246k168k231j549p96n49o48n73k83
$$ 303320 301919 301161 300118 298825 298204 298654 299435 299451 298205 296037 293806 292257 291461 290912 290264 289691 289408
54310B89408j25j46l9K45M29L63Q4m29r99j080m51J39j16q32q86%J009J519J693
$$ 289408 289283 289137 289098 289343 289772 290135 290219 289790 288791 287711 287260 287399 287283 286451 285565 285565 286574 288093 289786
54291B89786J788J750J590J455J196N81m5p9L74N59J45n17j074j367j099k32M39
$$ 289786 291574 293324 294914 296369 297565 298146 298101 298022 298396 298955 299100 298583 297509 296142 295043 294811 295250
54274B95250J17o83p66j14J34l03l12O88J667J554P87M24O32Q69R55J018R84Q06
$$ 295250 295367 294684 293918 293804 293938 293635 293323 294011 295678 297232 298019 298443 299075 299944 300899 301917 302901 303707
54256C03707Q38J319J833J783J122K81k88k38M51J179J148L98k25l07l69p98j119
$$ 303707 304545 305864 307697 309480 310602 310883 310595 310357 310808 311987 313135 313533 313308 313001 312632 311834 310715
54239C10715q64m50m90q82j221j587k154k436j732k16J054J237M85l25l72L96
$$ 310715 309851 309401 308911 308029 306808 305221 303067 300631 298899 298683 299737 300974 301459 301134 300762 301158
54223C01158J196J218N71N2L2J55J53K13K52k42j235j743j127q3K88p8m37m37
$$ 301158 302354 303572 304143 304195 304227 304382 304535 304748 305000 304758 303523 301780 300653 300570 300858 300780 300343 299906
54205B99906l20j59K96J049J693J800J259L63k17RN93M74n73j383q77M48J271
$$ 299906 299586 299427 299723 300772 302465 304265 305524 305887 305670 305679 306272 306746 306173 304790 303913 304361 305632
54188C05632J203Q90O48N3r68j603j171j10M79N8q89j519j511j285j349j627j637
$$ 305632 306835 307725 308373 308426 307458 305855 304684 304574 305053 305111 304222 302703 301192 299907 298558 296931 295294
54171B95294j302j141j440j685j220j40Q85J473J737J686J019k78j450j462p5
$$ 295294 293992 292851 291411 289726 288506 288366 289251 290724 292461 294147 295166 294888 293438 291976 291901
54156B91901J697K401J576J92n59o38q99j625k069j608o56L7M38J028J861K415
$$ 291901 293598 295999 297575 297767 297208 296570 295671 294046 291977 290369 289713 289750 290188 291216 293077 295492
54140B95492K325J806J320J097J013Q19N22N12J115K023K522K349J946J795J847
$$ 295492 297817 299623 300943 302040 303053 303872 304394 304906 306021 308044 310566 312915 314861 316656 318503
54125C18503J860J813J763J614J280Q15K17n41j072o89O47J950K226J589R96J031
$$ 318503 320363 322176 323939 325553 326833 327648 327865 327324 326252 325563 326210 328160 330386 331975 332971 334002
54109C34002J400J434Q29j6k71M95J677K186J757J185J127J313J368J672K706
$$ 334002 335402 336836 337665 337649 337378 337873 339550 341736 343493 344678 345805 347118 348486 350158 352864
54094C52864L972M390L646K453J623J395J671K274K907L282L441L700M203M770
$$ 352864 356836 361226 364872 367325 368948 370343 372014 374288 377195 380477 383918 387618 391821 396591
54080C96591N136N211N070M825M360L205R66k028m814o740p942q691q762p833
$$ 396591 401727 406938 412008 416833 421193 424398 425364 423336 418522 411782 403840 395149 386387 378554
54066C78554o134m220k412r01j26m00j286j939k015j855j786j703j332n93M03
$$ 378554 372420 368200 365788 364887 364761 364361 363075 361136 359121 357266 355480 353777 352445 351852 352255
54051C52255J443K307K915L388L793M015L999L971M199M669N206N707O059O126
$$ 352255 353698 356005 358920 362308 366101 370116 374115 378086 382285 386954 392160 397867 403926 410052
54037D10052O041O219O797P320P318O978O858P238Q007Q970R834J0175R857R361
$$ 410052 416093 422312 429109 436429 443747 450725 457583 464821 472828 481798 491632 501807 511664 521025
54023E21025R219R287Q926P800O050L903J632k09j116j308j599k417l337l751
$$ 521025 530244 539531 548457 556257 562307 566210 567842 567633 566517 565209 563610 561193 557856 554105
54009E54105l719l861m560n473n908n642n180n157n571n947o167o626p413p872
$$ 554105 550386 546525 541965 536492 530584 524942 519762 514605 509034 503087 496920 490294 482881 475009
53995D75009p376o216n234m759m424l886l317l079l238l536l656l460l066k738
$$ 475009 467633 461417 456183 451424 447000 443114 439797 436718 433480 429944 426288 422828 419762 417024
53981D17024k672k922l368l636l239k137j047p46j089j291j090r61j061q40r5
$$ 417024 414352 411430 408062 404426 401187 399050 398003 397257 396168 394877 393787 392826 391765 390925 390830
53966C90830L98q4j093j594j251n45M4L66M64O49J402K677L692L951L997M552
$$ 390830 391228 391144 390051 388457 387206 386661 386705 387071 387535 388184 389586 392263 395955 399906 403903 408455
53950D08455N308N438M934M532M489M377M113M339N485P108Q393Q924Q853Q748
$$ 408455 413763 419201 424135 428667 433156 437533 441646 445985 451470 458578 466971 475895 484748 493496
53936D93496R266J0492J1625J1672J0515Q879P504O720O669P239P887Q126Q253
$$ 493496 502762 513254 524879 536551 547066 555945 563449 570169 576838 584077 591964 600090 608343
53923F08343R018J0668J2793J5053J7211J8536J7950J5110J0729N646K63m859
$$ 608343 617361 628029 640822 655875 673086 691622 709572 724682 735411 741057 741320 736461
53911G36461q568r898r014p004m912l157j592P0J807L092L441L084K752K738K590
$$ 736461 727893 717995 708981 701977 697065 693908 692316 692386 694193 697285 700726 703810 706562 709300 711890
53896G11890J891Q59j17j089k368l948n487o703p459p599p052o201n885o739q495
$$ 711890 713781 714640 714523 713434 711066 707118 701631 694928 687469 679870 672818 666617 660732 653993 645498
53881F45498j0091j0623j0204r723r804j0281j0639j0551r907q774p591p034p285
$$ 645498 635407 624784 614580 604857 595053 584772 574133 563582 553675 544901 537310 530276 522991
53868E22991p763p830p427o727n654m289l308l350m179n112n954o850p463p171
$$ 522991 515228 507398 499971 493244 487590 483301 479993 476643 472464 467352 461398 454548 447085 439914
53854D39914o096n065m451l829k938k317k515l176l415k877k060j682j860k011
$$ 439914 433818 428753 424302 420473 417535 415218 412703 409527 406112 403235 401175 399493 397633 395622
53840C95622j569p76m60r45j559j536r85n30l81k32J80R16J889K530J932J9j801
$$ 395622 394053 393277 392817 391872 390313 388777 387792 387262 386881 386649 386829 387745 389634 392164 394096 394115 392314
53823C92314k027q67K24N23N31O52O34M38N57J103J561J779K283L222L877L702
$$ 392314 390287 389420 389644 390167 390698 391350 391984 392422 392979 394082 395643 397422 399705 402927 406804 410506
53807D10506L080K592K220J887K005K909M208N252N846O139O275O501P085P776
$$ 410506 413586 416178 418398 420285 422290 425199 429407 434659 440505 446644 452919 459420 466505 474281
53793D74281P872P251O745P020P662P881P551P025O356N405M272L105J757K01
$$ 474281 482153 489404 496149 503169 510831 518712 526263 533288 539644 545049 549321 552426 554183 554384
53779E54384j081j661j813k103k604k983l177l464m057n008o169p020o908n942
$$ 554384 553303 551642 549829 547726 545122 542139 538962 535498 531441 526433 520264 513244 506336 500394
53765E00394n198n453o140o239n796n718o217o414n658m442l655l506l540l401
$$ 500394 495196 489743 483603 477364 471568 465850 459633 453219 447561 443119 439464 435958 432418 429017
53751D29017l192l197l496l830l812l340k727k322k165k125k119k008j457l38
$$ 429017 425825 422628 419132 415302 411490 408150 405423 403101 400936 398811 396692 394684 393227 392889
53737C92889Q06J134M54n22r96q95p06p61q79p14k20L00N21M09J93J34L35O76
$$ 392889 393695 394829 395283 394761 393765 392870 392164 391403 390524 389810 389590 389890 390411 390820 391013 391147 391482 392158
53719C92158R25R78J062J474K056K207J632Q41N43Q34J310J778K355K950L253
$$ 392158 393083 394061 395123 396597 398653 400860 402492 403333 403876 404710 406020 407798 410153 413103 416356
53704D16356L222L153L206L275L317L382L349L104K935L136L325K883K088K001
$$ 416356 419578 422731 425937 429212 432529 435911 439260 442364 445299 448435 451760 454643 456731 458732
53690D58732K991M115M319L528K249Q83j48l49J80N77L04j63k25r6j90k00L89
$$ 458732 461723 465838 470157 473685 475934 476817 476669 476320 476500 477077 477381 477218 476993 476897 476707 476507 476896
53673D76896J359K081K418K511K100J010m8k14J71m9j098j953j915j468j201q97
$$ 476896 478255 480336 482754 485265 487365 488375 488327 488113 488284 488235 487137 485184 483269 481801 480600 479703
53657D79703k99O6l95j217j361o34Q1L4n17q38o55k97n4J95P05J372J718J389
$$ 479703 479404 479470 479075 477858 476497 475863 475944 475978 475461 474623 473968 473671 473617 473812 474517 475889 477607 478996
53639D78996N87p5j60K23O56R11J106J377J576J496J284J389J993K746L170L150
$$ 478996 479583 479508 479348 479571 480227 481138 482244 483621 485197 486693 487977 489366 491359 494105 497275 500425
53623E00425K913K790L107L871M398L789K204J098J520K670L037K590K675L855
$$ 500425 503338 506128 509235 513106 517504 521293 523497 524595 526115 528785 531822 534412 537087 540942
53609E40942N137N537N257M846M315L740L752M648N657N903N506N067M697M243
$$ 540942 546079 551616 556873 561719 566034 569774 573526 578174 583831 589734 595240 600307 605004 609247
53595F09247L909L841L618K951K436K758L512L714L182K596K436K650L092L515
$$ 609247 613156 616997 620615 623566 626002 628760 632272 635986 639168 641764 644200 646850 649942 653457
53581F53457L294K030K78j030j753k420l188l788m246m744m946m431l720l767
$$ 653457 656751 658781 659059 658029 656276 653856 650668 646880 642634 637890 632944 628513 624793 621026
53567F21026m408m428l374k226j883k022j903j428q19n3Q22J438J662J836J985
$$ 621026 616618 612190 608816 606590 604707 602685 600782 599354 598535 598482 599304 600742 602404 604240 606225
53552F06225J516K68p70n61O11J590J830J784K002K493K880K738J982J256J582
$$ 606225 607741 608009 607239 606678 607289 608879 610709 612493 614495 616988 619868 622606 624588 625844 627426
53537F27426L121M627M819M059L869M877O112O523O386O733P887R181R889R966
$$ 627426 630547 635174 639993 644052 647921 652798 658910 665433 671819 678552 686439 695620 705509 715475
53523G15475R877J0132J1016J2504J4218J5626J6467J6965J7623J8780K0363K2006
$$ 715475 725352 735484 746500 759004 773222 788848 805315 822280 839903 858683 879046 901052
53511I01052K3296K3978K4049K3808K3756K4370K5817K7810K9700L0877L1226
$$ 901052 924348 948326 972375 996183 1019939 1044309 1070126 1097936 1127636 1158513 1189739
53500A189739L1138L0976L0657K9972K9182K8856K9045K9129K8698K8120K7833
$$ 1189739 1220877 1251853 1282510 1312482 1341664 1370520 1399565 1428694 1457392 1485512 1513345
53489A513345K7618K7075K6556K6817K7783K8435K8107K7253K6613K6193K5538
$$ 1513345 1540963 1568038 1594594 1621411 1649194 1677629 1705736 1732989 1759602 1785795 1811333
53478A811333K4551K3521K2501K1281J9912J8806J8186J7819J7407J6971J6599
$$ 1811333 1835884 1859405 1881906 1903187 1923099 1941905 1960091 1977910 1995317 2012288 2028887
53467B028887J5988J4542J1945Q531N003J847r58l731o605r308j1425j2847j3876
$$ 2028887 2044875 2059417 2071362 2079893 2084896 2086743 2085785 2082054 2075449 2066141 2054716 2041869 2027993
53454B027993j4886j5945j6900j7740j8640j9694k0720k1403k1566k1277k0903
$$ 2027993 2013107 1997162 1980262 1962522 1943882 1924188 1903468 1882065 1860499 1839222 1818319
53443A818319k1012k1852k2884k3171k2409k1218k0207j9285j8275j7532j7224
$$ 1818319 1797307 1775455 1752571 1729400 1706991 1685773 1665566 1646281 1628006 1610474 1593250
53432A593250j6484j4275j0984q112o311m786k821p98P85K289M157O009P369Q660
$$ 1593250 1576766 1562491 1551507 1543395 1537084 1532298 1529477 1528679 1529464 1531753 1535910 1541919 1549288 1557948
53418A557948J0574J2878J4802J6265J7836J9583K0985K1926K2992K4606K6560
$$ 1557948 1568522 1581400 1596202 1612467 1630303 1649886 1670871 1692797 1715789 1740395 1766955
53407A766955K8538L0533L2540L4369L6021L7832M0040M2456M4726M6691M8401
$$ 1766955 1795493 1826026 1858566 1892935 1928956 1966788 2006828 2049284 2094010 2140701 2189102
53396B189102N0014N1696N3480N5273N7121N9236O1601O3798O5526O6968O8334
$$ 2189102 2239116 2290812 2344292 2399565 2456686 2515922 2577523 2641321 2706847 2773815 2842149
53385B842149O9302O9458O8960O8306O7638O6794O5786O4563O2552N9190N4904
$$ 2842149 2911451 2980909 3049869 3118175 3185813 3252607 3318393 3382956 3445508 3504698 3559602
53374C559602N0835M7488M4276M0447L5917L1080K6346K1993J7928J3546Q301
$$ 3559602 3610437 3657925 3702201 3742648 3778565 3809645 3835991 3857984 3875912 3889458 3897759
53363C897759K530k928p906j3113j8990k5199l1418l7895m4651n0769n5208n8012
$$ 3897759 3900289 3897361 3889455 3876342 3857352 3832153 3800735 3762840 3718189 3667420 3612212 3554200
53351C554200o0104o2004o3298o3429o2594o1673o1387o1595o1462o0287n8145
$$ 3554200 3494096 3432092 3368794 3305365 3242771 3181098 3119711 3058116 2996654 2936367 2878222
53340B878222n5651n3309n1364n0055m9631m9963n0443n0356m9365m7667m5769
$$ 2878222 2822571 2769262 2717898 2667843 2618212 2568249 2517806 2467450 2418085 2370418 2324649
53329B324649m3938m1810l8915l5629l3009l1358k9656k7051k4235k2445k1679
$$ 2324649 2280711 2238901 2199986 2164357 2131348 2099990 2070334 2043283 2019048 1996603 1974924
53318A974924k0988k0210j9994k0223j9859j8644j7618j7434j7318j6380j4897
$$ 1974924 1953936 1933726 1913732 1893509 1873650 1855006 1837388 1819954 1802636 1786256 1771359
53307A771359j3479j1937r860p566n568l618j202J479L851N930Q114J0367J2369
$$ 1771359 1757880 1745943 1736083 1728517 1722949 1719331 1718129 1719608 1723459 1729389 1737503 1747870 1760239
53294A760239J4178J5976J7450J8205J8603J9436K0869K2450K3963K5474K6713
$$ 1760239 1774417 1790393 1807843 1826048 1844651 1864087 1884956 1907406 1931369 1956843 1983556
53283A983556K7215K7167K7220K7414K7085K5983K4625K3261K1365J8624J5758
$$ 1983556 2010771 2037938 2065158 2092572 2119657 2145640 2170265 2193526 2214891 2233515 2249273
53272B249273J3635J1997R735O313K378j026l475n405p632j0620j4056j7225j9767
$$ 2249273 2262908 2274905 2284640 2290953 2293331 2292305 2288830 2283425 2275793 2265173 2251117 2233892 2214125
53259B214125k1958k4117k6164k7968k9786l1931l4173l5956l7097l7759l7847
$$ 2214125 2192167 2168050 2141886 2113918 2084132 2052201 2018028 1982072 1944975 1907216 1869369
53248A869369l7080l5791l4972l5126l5542l5260l4281l3327l2680l2011l1196
$$ 1869369 1832289 1796498 1761526 1726400 1690858 1655598 1621317 1587990 1555310 1523299 1492103
53237A492103l0527l0062k9463k8728k8380k8671k9078k8950k8206k7113k5867
$$ 1492103 1461576 1431514 1402051 1373323 1344943 1316272 1287194 1258244 1230038 1202925 1177058
53226A177058k4704k3879k3180k1923j9949j8075j6999j6318j5346j4423j4483
$$ 1177058 1152354 1128475 1105295 1083372 1063423 1045348 1028349 1012031 996685 982262 967779
53215I67779j5525j6465j6481j5856j5429j5867j7371j9393k0660k0203j8510
$$ 967779 952254 935789 919308 903452 888023 872156 854785 835392 814732 794529 776019
53204G76019j6973j6198j5516j4318j2987j2218j1992j1737j1123j0347r800r597
$$ 776019 759046 742848 727332 713014 700027 687809 675817 664080 652957 642610 632810 623213
53192F23213r375q647p575p067p637q611q984q715q320p673o331m865m467n118
$$ 623213 613838 605191 597616 590549 582912 574301 565317 556602 548282 540609 534278 529413 524946 519828
53178E19828n438m747l948l829l799l160k462k522k976k971k597k534k705k459
$$ 519828 514390 509643 505695 501866 498067 494907 492445 489923 486947 483976 481379 478845 476140 473681
53164D73681j839j546j808k168k381k690l109l235k931k513k162j640q39j35L3
$$ 473681 471842 470296 468488 466320 463939 461249 458140 454905 451974 449461 447299 445659 444820 444685 444718
53149D44718l02p02q14o87o48q49r52n40J70M01j58q07o55K32R01O45k40q01l91
$$ 444718 444416 443714 442900 442213 441565 440716 439764 439224 439394 439795 439637 438830 438175 438407 439308 439953 439713 438912 438521
53130D38521P36J746K089J961J752J484J114R77J363J853J828J379R79N52j84
$$ 438521 439257 441003 443092 445053 446805 448289 449403 450380 451743 453596 455424 456803 457782 458334 458150
53115D58150o64q3J026J245N38M56J574K324J346n10j730k320l034l556l105k141
$$ 458150 457486 457403 458429 459674 460212 460668 462242 464566 465912 465402 463672 461352 458318 454762 451657 449516
53099D49516j791k084k169j958j998k060j339m1O98M56j12n64j057j390j030k96
$$ 449516 447725 445641 443472 441514 439516 437456 436117 436076 436774 437230 437118 436554 435497 434107 433077 432781
53083D32781k40j054j675j388o87k04K02P24R11L88l54n30j1O78J013Q63N31M88
$$ 432781 432541 431487 429812 428424 427737 427533 427735 428459 429370 429758 429404 428874 428863 429541 430554 431417 431948 432436
53065D32436P87Q30J40q43j309j210j063r00l64K86K98l15o73l93p5j46j88J61
$$ 432436 433223 434053 434193 433350 432041 430831 429768 428868 428504 428790 429088 428773 428100 427707 427632 427486 427298 427459
53047D27459N93Q19J105J595J820J415O47j05q02j275j103l31L17M47M96Q25R87
$$ 427459 428052 428871 429976 431571 433391 434806 435453 435348 434546 433271 432168 431837 432154 432601 433097 433922 434909
53030D34909N25j80m61k74P0N27J079J352J146R10J135J534J529J163Q96P49L25
$$ 434909 435434 435254 434793 434519 434589 435116 436195 437547 438693 439603 440738 442272 443801 444964 445860 446609 446934
53013D46934m64j211j507j182k48R60J784J819J410J142J082R35P27P79J064J143
$$ 446934 446470 445259 443752 442570 442322 443282 445066 446885 448295 449437 450519 451454 452181 452960 454024 455167
52997D55167R16Q86J468K309K625K132J392J103J216J022K21n03k83P18J504J541
$$ 455167 456083 456969 458437 460746 463371 465503 466895 467998 469214 470236 470457 469954 469671 470389 471893 473434
52981D73434J317J498K049K553K832K965K902K545K029J644J480J328Q64j8r73
$$ 473434 474751 476249 478298 480851 483683 486648 489550 492095 494124 495768 497248 498576 499440 499422 498449
52966D98449j363q76Q8R01J376J665J709J370R75J011J293J135M54n9p4j35p17
$$ 498449 497086 496210 496298 497199 498575 500240 501949 503319 504294 505305 506598 507733 508187 508128 508054 507919 507202
52949E07202j462j823j894k055k363k660k873k815k195j221o37p11q11n00m03
$$ 507202 505740 503917 502023 499968 497605 494945 492072 489257 487062 485841 485204 484493 483682 483182 482779
52934D82779j169k222k379j469l89K35N57P46N87N9m31n99o82r67j367j591j512
$$ 482779 481610 479388 477009 475540 475151 475386 475943 476689 477276 477335 476904 476305 475623 474656 473289 471698 470186
52917D70186j196q02n37n13o20o23m14p2J93J74j43l22J73J260K066J827P08m51
$$ 470186 468990 468188 467651 467138 466518 465895 465481 465409 465602 465776 465633 465311 465484 466744 468810 470637 471345 470894
52899D70894r71p26j3N99O02O6l20o8N08P73N82K03k34p64j231j393j323j264
$$ 470894 469923 469197 469184 469783 470385 470451 470131 470063 470571 471344 471926 472129 471895 471131 469900 468507 467184 465920
52881D65920j230j078q47o84n73m33k94o7N49J490K071J835J362J542K217K398
$$ 465920 464690 463612 462765 462081 461508 461075 460781 460714 461263 462753 464824 466659 468021 469563 471780 474178
52865D74178J781J194J367J967K193J710P21l71j047r39l71k47j034k198k960
$$ 474178 475959 477153 478520 480487 482680 484390 485111 484740 483693 482754 482383 482136 481102 478904 475944
52850D75944l152k975k431j627j272k072l642m705m547l669k834k136j418r67
$$ 475944 472792 469817 467386 465759 464487 462415 458773 454068 449521 445852 443018 440882 439464 438497
52836D38497j132j524j458j061j107j670j798r35J07L01j30j85L11O77O80Q33
$$ 438497 437365 435841 434383 433322 432215 430545 428747 427812 427919 428220 428090 427905 428216 428893 429573 430406
52820D30406J267J299N87j88l11l6L7o4P0L98N69N66N93N62L53L06Q15J546J675
$$ 430406 431673 432972 433559 433371 433060 433024 433061 432997 433067 433465 434034 434600 435193 435755 436108 436414 437229 438775 440450
52801D40450R78O3n03q24j249j820k322k619k783k915k973k693j902q95l23m13
$$ 440450 441428 441491 440988 440164 438915 437095 434773 432154 429371 426456 423483 420790 418888 417993 417670 417257
52785D17257o95o55m14l75n31n79m32j95K15Q60J423J609J693K120K627K462J522
$$ 417257 416562 415907 415493 415118 414587 414008 413576 413381 413596 414456 415879 417488 419181 421301 423928 426390 427912
52768D27912O12L56N00N11L14J35j5k56m61l27K57J002J343Q16l92j389j350m25
$$ 427912 428524 428880 429380 429891 430205 430340 430325 430069 429608 429281 429538 430540 431883 432699 432307 430918 429568 429143
52750D29143M89Q34Q52R24R84Q32O55Q22J387K031K354K119J386O21M01Q30J366
$$ 429143 429632 430466 431318 432242 433226 434058 434713 435535 436922 438953 441307 443426 444812 445433 445834 446664 448030
52733D48030J383P89L0l09J33J252K392K805K417J984K148K601K484J571O19M56
$$ 448030 449413 450202 450232 449923 450056 451308 453700 456505 458922 460906 463054 465655 468139 469710 470329 470785
52717D70785R61J166K61j595l400m133l489j997n55J99K45N9O3J34j61p92j086
$$ 470785 471746 472912 473173 471578 468178 464045 460556 458559 458004 458203 458448 458507 458570 458704 458543 457751 456665
52700D56665n79J82K03n96j182p55K63R27J034J100J349J417J157J038J451K035
$$ 456665 456086 456268 456471 455875 454693 453938 454201 455128 456162 457262 458611 460028 461185 462223 463674 465709
52684D65709K182J913J705J664J342N71j15j12M87J019R51J90r88j992k134j268
$$ 465709 467891 469804 471509 473173 474515 475086 474971 474859 475346 476365 477316 477506 476518 474526 472392 471124
52668D71124j70J60m55j282j584j227m12O26J500J743J359R53J005J242J055L56
$$ 471124 470954 471114 470659 469377 467793 466566 466154 466780 468280 470023 471382 472335 473340 474582 475637 475993
52652D75993l02m06N0P26J358J939K583L270L755L700K973J740M30m59o61m19
$$ 475993 475691 475285 475335 476061 477419 479358 481941 485211 488966 492666 495639 497379 497809 497350 496689 496270
52636D96270k76m23n37m18m07p55j008o18K04R43J703K701L109J755q98k805k909
$$ 496270 495994 495571 495034 494616 494209 493454 492446 491828 492032 492975 494678 497379 500488 502243 501345 498540 495631
52619D95631k340k472k980k898k530k883l797m059l196j927r34k29K22K80K10
$$ 495631 493291 490819 487839 484941 482411 479528 475731 471672 468476 466549 465615 465386 465608 465888 466098
52604D66098N82J329J655J097J42m12k48M53J238J545J146N19L59P35J121J219
$$ 466098 466680 468009 469664 470761 470903 470491 470243 470696 471934 473479 474625 475144 475503 476238 477359 478578
52588D78578J213J192Q99K32m57p29m10L88J292J799J767J639J840K028J577O11
$$ 478578 479791 480983 481882 482114 481657 480928 480518 480906 482198 483997 485764 487403 489243 491271 492848 493459
52572D93459k0J18N26M88p0n49l22N75J231P36n62j226o32Q1l43j392j716j311
$$ 493459 493439 493557 494083 494571 494501 493952 493630 494205 495436 496172 495610 494384 493752 493833 493490 492098 490382 489071
52554D89071j327j976k200j604j135j464k002k098j991j903j323k7J124J262O58
$$ 489071 487744 485768 483568 481964 480829 479365 477363 475265 473274 471371 470048 470021 471145 472407 473065
52539D73065Q3k70n30n20j57J11l2k06m3J80K20N14J383K217K347K137K365K985
$$ 473065 473148 472878 472348 471828 471671 471782 471750 471544 471501 471681 471901 472415 473798 476015 478362 480499 482864 485849
52521D85849L435L674L982M070L481K646K520L193L812L866L697L709L819L822
$$ 485849 489284 492958 496940 501010 504491 507137 509657 512850 516662 520528 524225 527934 531753 535575
52507E35575L557K687R21j416l596n230o261o425n476l968k907k547k219j548
$$ 535575 539132 541819 542740 541324 537728 532498 526237 519812 514336 510368 507461 504914 502695 501147
52493E01147r52p79p07n08n77j180j680j211K10J766K791L154K894K119J198O49
$$ 501147 500195 499416 498709 498201 497624 496444 494764 493553 493763 495529 498320 501474 504368 506487 507685 508334
52477E08334O65R94J252J257J063R12J171K038L245M150M275L727L048K588K141
$$ 508334 508999 509993 511245 512502 513565 514477 515648 517686 520931 525081 529356 533083 536131 538719 540860
52462E40860J312J33q77j357j586k151l289m671n759o184n899n166m373l740l240
$$ 540860 542172 542305 541428 540071 538485 536334 533045 528374 522615 516431 510532 505366 500993 497253 494013
52447D94013k870k779k973l109k847k229j511p68j4M83M54J23k9J1k47r08j294
$$ 494013 491143 488364 485391 482282 479435 477206 475695 474927 474913 475396 475850 475973 475944 475955 475708 474800 473506
52430D73506q05J26M79l6n47j20J010J610Q81n93j499j178j03Q68J331J328J105
$$ 473506 472701 472827 473306 473270 472723 472603 473613 475223 476104 475511 474012 472834 472731 473599 474930 476258 477363
52413D77363J074J750L151M515N003M712M504M882N467N736N792O079O653P117
$$ 477363 478437 480187 483338 487853 492856 497568 502072 506954 512421 518157 523949 530028 536681 543798
52399E43798P218P169P365P925Q649R278R732J0049J0105R523P954N410K203j413
$$ 543798 551016 558185 565550 573475 582124 591402 601134 611183 621288 630811 638765 644175 646378 644965
52385F44965n228q660j0725j0834r516p893o482m889k819q75J37L13M89J063J563
$$ 644965 639737 631077 620352 609518 600002 592109 585627 580738 577919 577044 577181 577494 577983 579046 580609
52370E80609J470Q67O2q54j709k086j864j596j693j742j209n20n53j172j253l07
$$ 580609 582079 582946 583008 582154 580445 578359 576495 574899 573206 571464 570255 569735 569182 568010 566757 566450
52354E66450Q52J373J514J914K468K622K406K397K793L249L565L892M199M124
$$ 566450 567302 568675 570189 572103 574571 577193 579599 581996 584789 588038 591603 595495 599694 603818
52340F03818L577L068L090L474L712L739L964M534N007N012M937N464O577P483
$$ 603818 607395 610463 613553 617027 620739 624478 628442 632976 637983 642995 647932 653396 659973 667456
52326F67456P682P557P732Q226Q648Q784Q545P762O614N905O262P238P911Q186
$$ 667456 675138 682695 690427 698653 707301 716085 724630 732392 739006 744911 751173 758411 766322 774508
52312G74508Q673R497J0168J0718J1863J3753J5521J6498J7082J7881J8799J9528
$$ 774508 783181 792678 802846 813564 825427 839180 854701 871199 888281 906162 924961 944489
52300I44489K0189K0848K1026K0406J9530J9051J8765J8122J7266J6822J6940
$$ 944489 964678 985526 1006552 1026958 1046488 1065539 1084304 1102426 1119692 1136514 1153454
52289A153454J7306J7855J8673J9442J9692J9576J9781K0558K1447K1935K1958
$$ 1153454 1170760 1188615 1207288 1226730 1246422 1265998 1285779 1306337 1327784 1349719 1371677
52278A371677K1725K1454K1232K0863J9950J8408J6754J5583J5017J4808J4713
$$ 1371677 1393402 1414856 1436088 1456951 1476901 1495309 1512063 1527646 1542663 1557471 1572184
52267A572184J4473J3801J2731J1584J0393Q886P338O582O676O359M690K475J104
$$ 1572184 1586657 1600458 1613189 1624773 1635166 1644052 1651390 1657972 1664648 1671007 1675697 1678172 1679276
52254A679276O43K20k69k56O6j57q49r49r9Q01J135J486K537M106N703P291Q933
$$ 1679276 1679919 1680139 1679870 1679614 1679680 1679523 1678674 1677725 1677626 1678427 1679562 1681048 1683585 1687691 1693394 1700685 1709618
52237A709618J0492J2056J3931J5833J6876J6827J6627J7130J7992J8348J8006
$$ 1709618 1720110 1732166 1746097 1761930 1778806 1795633 1812260 1829390 1847382 1865730 1883736
52226A883736J7365J6725J6216J5965J5830J5319J4227J2874J1463R733P654N880
$$ 1883736 1901101 1917826 1934042 1950007 1965837 1981156 1995383 2008257 2019720 2029453 2037107 2042987
52214B042987M912M342L391J831p6k117m005n236n679n958o672p544p896p682
$$ 2042987 2047899 2052241 2055632 2057463 2057387 2055270 2051265 2046029 2040350 2034392 2027720 2020176 2012280 2004598
52200B004598p407p310p203o927o417n591m652m259m697n226m936m128l915m579
$$ 2004598 1997191 1989881 1982678 1975751 1969334 1963743 1959091 1954832 1950135 1944909 1939973 1935845 1931930 1927351
52186A927351n267n475n769o607p331p145o433o177o304n662l756j627n38m63
$$ 1927351 1922084 1916609 1910840 1904233 1896902 1889757 1883324 1877147 1870843 1865181 1861425 1859798 1859260 1858797
52172A858797m72j87p6m12q31j068j403j985k338k070j637j735k255k569k577
$$ 1858797 1858325 1858138 1858062 1857650 1856819 1855751 1854348 1852363 1850025 1847955 1846318 1844583 1842328 1839759 1837182
52157A837182k797l447m187m790n303n532n016l775k413j291j91J035K126L005
$$ 1837182 1834385 1830938 1826751 1821961 1816658 1811126 1806110 1802335 1799922 1798631 1798440 1799475 1801601 1804606
52143A804606L993N107N752N607N199N211N627O037O264O228N764N094M954N675
$$ 1804606 1808599 1813706 1819458 1825065 1830264 1835475 1841102 1847139 1853403 1859631 1865395 1870489 1875443 1881118
52129A881118O574O894O920P454Q531R459R795R519Q497O617M444K850J944J025
$$ 1881118 1887692 1894586 1901506 1908960 1917491 1926950 1936745 1946264 1954761 1961378 1965822 1968672 1970616 1971641
52115A971641k56j444k141k632l329m115m576m510l860k457j76K814O146R472
$$ 1971641 1971385 1969941 1967800 1965168 1961839 1957724 1953148 1948638 1944778 1942321 1942145 1944959 1951105 1960577
52101A960577J2458J4847J6652J8142J9478K0468K0804K0469J9846J9462J9665
$$ 1960577 1973035 1987882 2004534 2022676 2042154 2062622 2083426 2103895 2123741 2143203 2162868
52090B162868K0445K1618K3121K4948K6771K7929K8072K7574K7003K6326K5075
$$ 2162868 2183313 2204931 2228052 2253000 2279771 2307700 2335772 2363346 2390349 2416675 2441750
52079B441750K3191K1261J9815J8671J7228J5189J2878J0822R081P098M351J176
$$ 2441750 2464941 2486202 2506017 2524688 2541916 2557105 2569983 2580805 2589886 2596984 2601335 2602511
52067B602511j411k812l523m404n592o466o586o243o081o451p145p639p612p319
$$ 2602511 2601100 2598288 2594765 2590361 2584769 2578303 2571717 2565474 2559393 2552942 2545797 2538158 2530546 2523227
52053B523227p289p631p902p827p722p959q360q498q214p497o210m411k613j140
$$ 2523227 2515938 2508307 2500405 2492578 2484856 2476897 2468537 2460039 2451825 2444328 2438118 2433707 2431094 2429954
52039B429954L98K389M416N878P011Q342R436R380Q480Q197R134J0191J0250R557
$$ 2429954 2430352 2432741 2437157 2443035 2450046 2458388 2467824 2477204 2485684 2493881 2503015 2513206 2523456 2533013
52025B533013Q847Q068O886N613M718L976L088K623L276M523N050M475L606K929
$$ 2533013 2541860 2549928 2556814 2562427 2567145 2571121 2574209 2576832 2580108 2584631 2589681 2594156 2597762 2600691
52011B600691J858k53l135o091q832j1515j4324j7350k0530k3548k6183k8748
$$ 2600691 2602549 2602296 2599161 2593070 2584238 2572723 2558399 2541049 2520519 2496971 2470788 2442040
51999B442040l1751l4923l7236l8190l8434l8847l9574m0527m2041m4247m6228
$$ 2442040 2410289 2375366 2338130 2299940 2261506 2222659 2183085 2142558 2100517 2056270 2010042
51988B010042m6898m6532m6387m6705m6275m4331m1822l9987l8575l6494l3727
$$ 2010042 1963144 1916612 1870225 1823520 1777245 1732914 1691092 1651105 1612530 1576036 1542309
51977A542309l1410l0107k9151k7904k6567k5261k3260j9946j6034j2924j1064
$$ 1542309 1510899 1480792 1451641 1423737 1397170 1371909 1348649 1328703 1312669 1299745 1288681
51966A288681r712q196o675n606n139n309o198p601q887r610r951j0286j0519
$$ 1288681 1278969 1270773 1264098 1258492 1253353 1248044 1241846 1234245 1225358 1215748 1205797 1195511 1184992
51953A184992j0145q822o636l960j298R15K649M361O437Q628J0302J1192J1543
$$ 1184992 1174847 1166025 1159389 1155429 1154131 1155046 1157695 1162056 1168493 1177121 1187423 1198615 1210158
51940A210158J1525J0916R523P650N772L935J725j158m454p552r955j1515j2329
$$ 1210158 1221683 1232599 1242122 1249772 1255544 1259479 1261204 1260046 1255592 1248040 1238085 1226570 1214241
51927A214241j2494j2042j1076r923r042q656q510q033o868n239l808l065k823
$$ 1214241 1201747 1189705 1178629 1168706 1159664 1151008 1142498 1134465 1127597 1122358 1118550 1115485 1112662
51914A112662k336j007J012L001M434N381O081O334N592L534K53m027r050j4208
$$ 1112662 1110326 1109319 1110331 1113332 1117766 1123147 1129228 1135562 1141154 1144688 1144941 1140914 1131864 1117656
51900A117656j8542k1492k3387k4872k5901k5821k4375k2193k0036j7973j5647
$$ 1117656 1099114 1077622 1054235 1029363 1003462 977641 953266 931073 911037 893064 877417
51889H77417j3057j0654q702o987n184l226j198Q78L017N194P431R718J1744J2902
$$ 877417 864360 853706 845004 838017 832833 829607 828409 829287 832304 837498 844929 854647 866391 879293
51875H79293J2878J2077J1206J0467R390P443M519R22k677n303o200n671m990
$$ 879293 892171 904248 915454 925921 935311 942754 947273 948195 945518 940215 934015 928344 923354
51862I23354n040n313m740l286k100k089k986m019m865n657o451p110p527p568
$$ 923354 918314 913001 908261 904975 902875 900786 897800 893781 888916 883259 876808 869698 862171 854603
51848H54603p068o156n447n563o514p751q681r011q814q422q025p249n525l150
$$ 854603 847535 841379 835932 830369 823855 816104 807423 798412 789598 781176 773151 765902 760377 757227
51834G57227j370r26r29M8K073L850M484M269L670K486N63j433k610k877k782
$$ 757227 755857 754931 754002 754050 756123 759973 764457 768726 772396 774882 775445 774012 771402 768525 765743
51819G65743k537j793l39J379K507K484J520M66N1J30j12j169k609l564l569k814
$$ 765743 763206 761413 761074 762453 764960 767444 768964 769430 769481 769611 769499 768330 765721 762157 758588 755774
51803G55774j845j097o01QR78J950K332K150K137K759L666M336M769N086M959
$$ 755774 753929 752832 752231 752239 753217 755167 757499 759649 761786 764545 768211 772547 777316 782402 787361
51788G87361M032K729J954K003K280K232K019K039K138J701N24o78q37M09K340
$$ 787361 791393 794122 796076 798079 800359 802591 804610 806649 808787 810488 811012 810334 809497 809906 812246
51773H12246L918M784N309N775N980N708N172M605L714J951p30l700o210p884
$$ 812246 816164 820948 826257 832032 838012 843720 848892 853497 857211 859162 858432 854732 848522 840638
51759H40638q656q566p763o545n197l804k394j217o89q22j027p61l97q26k038
$$ 840638 831982 823416 815653 809108 803911 800107 797713 796496 795807 794985 793958 793197 792800 791974 789936
51744G89936k674j553Q27K903L854M049L954L531K881K539K743L053L038K818
$$ 789936 787262 785709 786536 789439 793293 797342 801296 804827 807708 810247 812990 816043 819081 821899
51730H21899K642K486K388K657L378M213M958N715O257N963M870M109M603N881
$$ 821899 824541 827027 829415 832072 835450 839663 844621 850336 856593 862556 867426 871535 876138 882019
51716H82019O849P204P287P014N808L470L59l040o064p650p046m811k429q48K0
$$ 882019 888868 896072 903359 910373 916181 919651 920010 916970 910906 903256 896210 891399 888970 888122 888142
51701H88142M72M77J38J0M96J195J118m15l131n972p897q626q461p585n977m030
$$ 888142 888614 889091 889229 889239 889735 890930 892048 891633 888502 882530 874633 866007 857546 849961 843984 839954
51685H39954k603k165k464l295m934p255r134r480q416o795n087l426k208j703
$$ 839954 837351 835186 832722 829427 824493 817238 808104 798624 790208 783413 778326 774900 772692 770989
51671G70989j425p50J79R42J764L072M570N814P231R379J1614J2846J3436J4795
$$ 770989 769564 768814 768993 769935 771699 774771 779341 785155 792386 801765 813379 826225 839661 854456
51657H54456J7057J8624J8287J6349J3289Q855L185k501p190j1082j4500j6745
$$ 854456 871513 890137 908424 924773 938062 946917 950102 947601 940411 929329 914829 898084
51645H98084j6914j5215j2669j0117q038o634n459l705j484j23m58j604k228k353
$$ 898084 881170 865955 853286 843169 835131 828497 823038 819333 817849 817726 817268 815664 813436 811083
51631H11083l003m609o691q654j0018j0147q805o762n123m130l283k389j708j209
$$ 811083 808080 803471 796780 788126 778108 767961 759156 752394 747271 743141 739858 737469 735761 734552
51617G34552m72O04J573J968J640O88n99j787k701l561m374m508l423j538J40
$$ 734552 734080 734684 736257 738225 739865 740553 739954 738167 735466 731905 727531 723023 719600 718062 718202
51602G18202J067J330J124P46R49K411M735O611P216P002O995P745R149J0881
$$ 718202 719269 720599 721723 722469 723418 725829 730564 737175 744391 751393 758388 766133 775282 786163
51588G86163J2641J4213J5539J6739J8012J9423K0647K1020K0096J8328J6892
$$ 786163 798804 813017 828556 845295 863307 882730 903377 924397 944493 962821 979713
51577I79713J6628J7453J8921K1023K4022K7827L1954L5971L9663M2867M5385
$$ 979713 996341 1013794 1032715 1053738 1077760 1105587 1137541 1173512 1213175 1256042 1301427
51566A301427M6983M7394M6660M5518M4940M4879M3932M0749L5513K9605K4149
$$ 1301427 1348410 1395804 1442464 1487982 1532922 1577801 1621733 1662482 1697995 1727600 1751749
51555A751749J9310J4690R751L976k846j0492j8760k7845l7835m8056n7299o4579
$$ 1751749 1771059 1785749 1795500 1799476 1796630 1786138 1767378 1739533 1701698 1653642 1596343 1531764
51543A531764o9273p0899o9432o5696o0897n5606m9655m2992l6200l0152k5466
$$ 1531764 1462491 1391592 1322160 1256464 1195567 1139961 1090306 1047314 1011114 980962 955496
51532I55496k2216j9868j7552j4811j1988r654p833o145m477l093k153j603j452
$$ 955496 933280 913412 895860 881049 869061 859407 851574 845429 840952 837859 835706 834103 832651
51519H32651j728k209k517k520k376k216k076k033k166k501l117m012m801m974
$$ 832651 830923 828714 826197 823677 821301 819085 817009 814976 812810 810309 807192 803180 798379 793405
51505G93405m708m860n753o543o296n177l875k521r94J66K50l50m88J22O00K37
$$ 793405 788697 783837 778084 771541 765245 760068 756193 753672 752678 752844 753094 752744 752256 752378 752978 753215
51489G53215p08j773k920m109n026n578o036o446o384n682m795m231m003l899
$$ 753215 752507 750734 747814 743705 738679 733101 727065 720619 714235 708553 703758 699527 695524 691625
51475F91625l811l652l273k736k230j729j060l70m4j35k95l07j23M56J543K624
$$ 691625 687814 684162 680889 678153 675923 674194 673134 672764 672720 672585 672290 671983 671860 672316 673859 676483
51459F76483K979K770K888L691M570M971M988M763M202L618L812M901N924O167
$$ 676483 679462 682232 685120 688811 693381 698352 703340 708103 712305 715923 719735 724636 730560 736727
51445G36727O207O897Q022Q780R109R701J0887J2273J3365J3845J3315J1382Q121
$$ 736727 742934 749831 757853 766633 775742 785443 796330 808603 821968 835813 849128 860510 868631
51432H68631M134J67l138n202n608m346k001K22Q56q29m001o858q292q555q218
$$ 868631 872765 872932 869794 864592 858984 854638 852637 852859 853715 852886 848885 842027 833735 825180 816962
51417H16962p228n426l307j549k22R61J880K113J615P65o0n36k88P38K020L100
$$ 816962 809734 804308 801001 799452 799230 800191 802071 804184 805799 806564 806504 805968 805680 806418 808438 811538
51401H11538M262O060Q435J0871J3208J5716J8441K1109K3630K6130K8524L0645
$$ 811538 815800 821860 830295 841166 854374 870090 888531 909640 933270 959400 987924 1018569
51389A018569L2797L5577L9022M2435M5270M7711N0118N2401N4252N5798N7465
$$ 1018569 1051366 1086943 1125965 1168400 1213670 1261381 1311499 1363900 1418152 1473950 1531415
51378A531415N9240O0319N9699N7089N3009M7890M1363L2783K2404J1328J46j1788
$$ 1531415 1590655 1650974 1710673 1767762 1820771 1868661 1910024 1942807 1965211 1976539 1976685 1964897
51366A964897k5243l9734n3895o6764p7970q6777r1840r2238q8372q1635p3515
$$ 1964897 1939654 1899920 1846025 1779261 1701291 1614514 1522674 1430436 1342064 1260429 1186914
51355A186914o5060n6862m9258m2528l6839l2051k7820k4032k0894j8340j5891
$$ 1186914 1121854 1064992 1015734 973206 936367 904316 876496 852464 831570 813230 797339
51344G97339j3397j1479j0628j0272r506q449p986q264q367p634o447n437m675
$$ 797339 783942 772463 761835 751563 742057 733608 725622 717358 708991 701357 694910 689473 684798
51331F84798m000l516l279l042k691k444k284j689m14R46J672J814J838J785J427
$$ 684798 680798 677282 674003 670961 668270 665826 663542 661853 661439 662385 664057 665871 667709 669494 670921
51316F70921J039J236K063K838K995K721K575K801L167L295L066K827L063L737
$$ 670921 671960 673196 675259 678097 681092 683813 686388 689189 692356 695651 698717 701544 704607 708344
51302G08344M031L092R46j606l894n778p205p888p708p068o434n758m680l247
$$ 708344 712375 715467 716413 714807 710913 705135 697930 690042 682334 675266 668832 663074 658394 655147
51288F55147k081j653j612j075L89K235L494L827L823M220M992N541N604N623
$$ 655147 653066 651413 649801 648726 649115 651350 654844 658671 662494 666714 671706 677247 682851 688474
51274F88474O070O758P126O942O358N384L800J720j75j254j537j387r11oJ146
$$ 688474 694544 701302 708428 715370 721728 727112 730912 732632 732457 731203 729666 728279 727368 727362 728508
51259G28508K079K535K526J941N98j132k414k928l297m017m485l822k435j812
$$ 728508 730587 733122 735648 737589 738187 737055 734641 731713 728416 724399 719914 716092 713657 711845
51245G11845k602l690l614k345j129r22j569k401l071l625m084m196l620k310
$$ 711845 709243 705553 701939 699594 698465 697543 695974 693573 690502 686877 682793 678597 674977 672667
51231F72667p53L32O46N97Q20J459K062K116J540P36K71M79J265K245L111L702
$$ 672667 671914 672246 672892 673489 674309 675768 677830 679946 681486 682222 682493 682972 684237 686482 689593 693295
51215F93295L820L253K201J449J701K837M032M625M591M256L886L566L266K856
$$ 693295 697115 700368 702569 704018 705719 708556 712588 717213 721804 726060 729946 733512 736778 739634
51201G39634K274J621J043O15N22J078K163K901K538J536J038J185Q52n34j934
$$ 739634 741908 743529 744572 745187 745709 746787 748950 751851 754389 755925 756963 758148 759000 758466 756532
51186G56532k144j492j144j307j326j217j721k819l476l273l121l733m399m087
$$ 756532 754388 752896 751752 750445 749119 747902 746181 743362 739886 736613 733492 729759 725360 721273
51172G21273k950j886j196o09j58j13k40j5N15R20J228J756K248K082J484J512
$$ 721273 718323 716437 715241 714632 714474 714361 714121 714106 714621 715541 716769 718525 720773 722855 724339 725851
51156G25851K538L535L394K253J064L69J9k96p90j589k493k823k055m87R70J659
$$ 725851 728389 731924 735318 737571 738635 739004 739023 738727 737937 736348 733855 731032 728977 728490 729460 731119
51140G31119J599J144N08k97j215j916j980j406q10p46r09m94O37J699K056K027
$$ 731119 732718 733862 734370 734073 732858 730942 728962 727556 726746 726000 725091 724597 725234 726933 728989 731016
51124G31016K291K922L503L823L968L972L886M039M725N609N901N170L765K464
$$ 731016 733307 736229 739732 743555 747523 751495 755381 759420 764145 769754 775655 780825 784590 787054
51110G87054J879K082K543K509J729P33J99K35M87P18Q94R22P58O32P43Q04L62
$$ 787054 788933 791015 793558 796067 797796 798529 798728 798963 799450 800168 801062 801984 802742 803374 804117 804921 805283
51093H05283m50r83r57p24n59k39L84Q58O47o8n41l47J90N13N03N81J231K477
$$ 805283 804833 803850 802893 802169 801610 801371 801755 802613 803260 803192 802651 802304 802494 803007 803510 804091 805322 807799
51075H07799L763M403M202L688L693M567N866O849P336P913R119J0612J1543J1726
$$ 807799 811562 815965 820167 823855 827548 832115 837981 844830 852166 860079 869198 879810 891353 903079
51061I03079J1909J2750J4030J5236J6426J7967J9721K1256K2660K4376K6203
$$ 903079 914988 927738 941768 957004 973430 991397 1011118 1032374 1055034 1079410 1105613
51050A105613K7229K6949K5784K4135K1629J7970J4005J1222J0215J0262J0278
$$ 1105613 1132842 1159791 1185575 1209710 1231339 1249309 1263314 1274536 1284751 1295013 1305291
51039A305291R602P826M641L45l936p129r288j1388j3963j6392j7584j7017j4879
$$ 1305291 1314893 1322719 1327360 1327705 1323769 1316640 1307352 1295964 1282001 1265609 1248025 1231008 1216129
51026A216129j1658q125n512m906o221q211r713j0421j0311q922n948k053J619
$$ 1216129 1204471 1196346 1190834 1185928 1179707 1171496 1161783 1151362 1141051 1132129 1126181 1124128 1125747
51013A125747M661P409R850J1294J1410J0860J0511J0463J0297R946R831J0247
$$ 1125747 1130408 1137817 1147667 1158961 1170371 1181231 1191742 1202205 1212502 1222448 1232279 1242526
51001A242526J1018J1696J1912J1557J0742R591Q017N891L439J216l56j268j641
$$ 1242526 1253544 1265240 1277152 1288709 1299451 1309042 1317059 1322950 1326389 1327605 1327249 1325981 1324340
50988A324340j476q31K4R45K156M024O641R862J3482J7230K0743K3885K6958L0395
$$ 1324340 1322864 1322033 1322057 1323002 1325158 1329182 1335823 1345685 1359167 1376397 1397140 1421025 1447983 1478378
50974A478378L4308L8542M2963M7495N1956N6144O0060O3888O7768P1707P5540
$$ 1478378 1512686 1551228 1594191 1641686 1693642 1749786 1809846 1873734 1941502 2013209 2088749
50963B088749P8799Q0751Q0906P9493P7314P5188P3608P2722P2310P1850P0832
$$ 2088749 2167548 2248299 2329205 2408698 2486012 2561200 2634808 2707530 2779840 2851690 2922522
50952B922522O9032O6366O2670N7835N2072M5730L8920L1695K4429J7634J1456
$$ 2922522 2991554 3057920 3120590 3178425 3230497 3276227 3315147 3346842 3371271 3388905 3400361
50941C400361N790R35k419m072m788n506o422p257q290j0579j5061k1718k9708
$$ 3400361 3406151 3407086 3404667 3400595 3395807 3390301 3383879 3376622 3368332 3357753 3342692 3320974 3291266
50928C291266l8054m6001n2896n8172o1726o4237o6828p0180p3992p7354p9526
$$ 3291266 3253212 3207211 3154315 3096143 3034417 2970180 2903352 2833172 2759180 2681826 2602300
50917B602300q0376q0206p9443p8333p6719p4114p0258o5636o1128n7146n3318
$$ 2602300 2521924 2441718 2362275 2283942 2207223 2133109 2062851 1997215 1936087 1878941 1825623
50906A825623m9120m4507l9793l5264l1160k7765k5170k3033k0839j8372j5791
$$ 1825623 1776503 1731996 1692203 1656939 1625779 1598014 1572844 1549811 1528972 1510600 1494809
50895A494809j3362j1246r456p773n949m103k702j813p13J301L846N765O514O700
$$ 1494809 1481447 1470201 1460745 1452972 1447023 1442920 1440218 1438405 1437692 1438993 1442839 1448604 1455118 1461818
50881A461818P177Q174R498J1010J2564J3893J5032J6501J8687K1201K3323K4916
$$ 1461818 1468995 1477169 1486667 1497677 1510241 1524134 1539166 1555667 1574354 1595555 1618878 1643794
50869A643794K6538K8758L1676L4987L8249M1235M4329M8379N3785N9853O5568
$$ 1643794 1670332 1699090 1730766 1765753 1804002 1845237 1889566 1937945 1991730 2051583 2117151
50858B117151P0833P6461Q2970Q9970R6884J03706J10816J18443J26486J34493
$$ 2117151 2187984 2264445 2347415 2437385 2534269 2637975 2748791 2867234 2993720 3128213
50848C128213J41684J47513J52387J57389J62940J68171J71942J74073J75062
$$ 3128213 3269897 3417410 3569797 3727186 3890126 4058297 4230239 4404312 4579374
50839D579374J74980J73291J69627J64136J56980J47932J36533J22330J05113
$$ 4579374 4754354 4927645 5097272 5261408 5418388 5566320 5702853 5825183 5930296
50830E930296Q5302O4181M3261K3314M369j3346k8902m1371n0669n7265o1337
$$ 5930296 6015598 6079779 6123040 6146354 6150723 6137377 6108475 6067104 6016435 5959170 5897833
50819E897833o2649o1291n8189n4658n1672m9764m9602n2241n8523o8256q0289
$$ 5897833 5835184 5773893 5715704 5661046 5609374 5559610 5510008 5457767 5399244 5330988 5250699
50808E250699r3499j07360j21486j34949j46639j56133j63698j69297j72145j71561
$$ 5250699 5157200 5049840 4928354 4793405 4646766 4490633 4326935 4157638 3985493 3813932
50798C813932j67852j61884j53971j43807j31591j18591j06157r4457q2732p0736
$$ 3813932 3646080 3484196 3330225 3186418 3054827 2936236 2830079 2735622 2652890 2582154
50788B582154n9367m9632m1499l4140k7106k0707j5401j1305q423o835o390o572
$$ 2582154 2522787 2473155 2431656 2397516 2370410 2349703 2334302 2322997 2314574 2307739 2301349 2294777
50776B294777o968p673r011j1027j3452j5925j8033j9417k0102k0592k1342k2316
$$ 2294777 2287809 2280136 2271125 2260098 2246646 2230721 2212688 2193271 2173169 2152577 2131235 2108919
50764B108919k3260k4145k4944k5220k4479k2891k1162j9678j8201j6453j4482
$$ 2108919 2085659 2061514 2036570 2011350 1986871 1963980 1942818 1923140 1904939 1888486 1874004
50753A874004j2182q981m482P30N493R284J2847J7327K2992K8938L4118L8364
$$ 1874004 1861822 1852841 1848359 1849089 1854582 1863866 1876713 1894040 1917032 1945970 1980088 2018452
50741B018452M2362M6739N1519N6441O1492O6879P2574P8091Q2756Q6255Q9017
$$ 2018452 2060814 2107553 2159072 2215513 2277005 2343884 2416458 2494549 2577305 2663560 2752577
50730B752577R1886R5121R7851R8941R8398R7256R5998R3830Q9970Q4855P9374
$$ 2752577 2844463 2939584 3037435 3136376 3234774 3332030 3428028 3521858 3611828 3696683 3776057
50719C776057P3492O6541N8534N0103M1310L1460K0250Q186m284j7098k9695m0641
$$ 3776057 3849549 3916090 3974624 4024727 4066037 4097497 4117747 4125933 4121649 4104551 4074856 4034215
50707D034215m8696n3696n6025n5820n3237m8958m3851l8482l3367k9269k6696
$$ 4034215 3985519 3931823 3875798 3819978 3766741 3717783 3673932 3635450 3602083 3572814 3546118
50696C546118k5533k5750k7944l2510l8683m5343n2516o1052p0691p9522q5735
$$ 3546118 3520585 3494835 3466891 3434381 3395698 3350355 3297839 3236787 3166096 3086574 3000839
50685C000839q9049q9982q8444q4068p7397o9791o2029n3772m4634l5142k6254
$$ 3000839 2911790 2821808 2733364 2649296 2571899 2502108 2440079 2386307 2341673 2306531 2280277
50674B280277j8358j1221m600J535P244J2629J7627K2168K6437L0533L3917L5774
$$ 2280277 2261919 2250698 2246098 2247633 2254877 2267506 2285133 2307301 2333738 2364271 2398188 2433962
50662B433962L6033L5401L4254L2172K8888K5005K1262J7761J4535J2231J1268
$$ 2433962 2469995 2505396 2539650 2571822 2600710 2625715 2646977 2664738 2679273 2691504 2702772
50651B702772J0847R834Q436P894Q616R746J0655J1671J3062J4439J5752J7840
$$ 2702772 2713619 2723453 2731889 2739783 2748399 2758145 2768800 2780471 2793533 2807972 2823724 2841564
50639B841564K1279K5514K9824L4341L9269M3784M6789M8374M9500N0466N0606
$$ 2841564 2862843 2888357 2918181 2952522 2991791 3035575 3082364 3130738 3180238 3230704 3281310
50628C281310M9439M7321M4919M2754M1356M1132M1821M2508M2476M1778M0801
$$ 3281310 3330749 3378070 3422989 3465743 3507099 3548231 3590052 3632560 3675036 3716814 3757615
50617C757615L9445L6600L0323J8778J665j8957l9292n5425o4830o7160o4200
$$ 3757615 3797060 3833660 3863983 3882761 3884426 3865469 3826177 3770752 3705922 3638762 3574562
50606C574562n8768n3092m8057m3870m0821l9149l8727l9543m1966m5977n0561
$$ 3574562 3515794 3462702 3414645 3370775 3329954 3290805 3252078 3212535 3170569 3124592 3074031
50595C074031n4761n8933o4002o9648p4272p6879p7912p7980p6733p3607o8964
$$ 3074031 3019270 2960337 2896335 2826687 2752415 2675536 2597624 2519644 2442911 2369304 2300340
50584B300340o3828n8839n4044m9389m4929m0666l6549l2578k8772k5146k1787
$$ 2300340 2236512 2177673 2123629 2074240 2029311 1988645 1952096 1919518 1890746 1865600 1843813
50573A843813j8730j5676j2200q267m283m79L345P335J1262J4905J8323K1469
$$ 1843813 1825083 1809407 1797207 1788940 1784657 1784178 1787523 1794858 1806120 1821025 1839348 1860817
50561A860817K3964K5666K7198K9408L2321L5092L7049L8481M0184M2397M4412
$$ 1860817 1884781 1910447 1937645 1967053 1999374 2034466 2071515 2109996 2150180 2192577 2236989
50550B236989M5383M5415M5502M6294M7300M7607M7142M6572M6154M5438M4287
$$ 2236989 2282372 2327787 2373289 2419583 2466883 2514490 2561632 2608204 2654358 2699796 2744083
50539B744083M3412M3461M4182M4997M6074M8118N1298N5029N8715O2178O5273
$$ 2744083 2787495 2830956 2875138 2920135 2966209 3014327 3065625 3120654 3179369 3241547 3306820
50528C306820O7629O9157P0461P2350P4962P7621P9630Q1016Q2333Q3825Q5005
$$ 3306820 3374449 3443606 3514067 3586417 3661379 3739000 3818630 3899646 3981979 4065804 4150809
50517D150809Q5073Q3566Q0427P5729O9600O2394N4502M5996L6625K6235J4988
$$ 4150809 4235882 4319448 4399875 4475604 4545204 4607598 4662100 4708096 4744721 4770956 4785944
50506D785944L189q797k0447l1207m0775m9007n5614o0324o3353o5237o6025o5107
$$ 4785944 4789133 4780336 4759889 4728682 4687907 4638900 4583286 4522962 4459609 4394372 4328347 4263240
50494D263240o2088n7366n1565m4893l7545l0298k3982j8640j3927j0282q977
$$ 4263240 4201152 4143786 4092221 4047328 4009783 3979485 3955503 3936863 3922936 3912654 3903677
50483C903677j0832j5521k2489l1879m4036n8363p3302q7404r9944j10466j18259
$$ 3903677 3892845 3877324 3854835 3822956 3778920 3720557 3647255 3559851 3459907 3349441 3231182
50472C231182j22678j23741j22012j17887j11403j02865r3297q3924p5256o6995
$$ 3231182 3108504 2984763 2862751 2744864 2633461 2530596 2437299 2353375 2278119 2211124
50462B211124n8814n0897m3574l6768l0147k3697j7904j3210r529o371l431r20
$$ 2211124 2152310 2101413 2057839 2021071 1990924 1967227 1949323 1936113 1926584 1920213 1916782 1915862
50450A915862P43J551K158L402N542Q050J0188J1787J3333J5263J7364J9028K0115
$$ 1915862 1916605 1918156 1920314 1923716 1929258 1937308 1947496 1959283 1972616 1987879 2005243 2024271 2044386
50437B044386K1203K2777K4439K5341K5263K4750K4070K2656J9991J6548J3320
$$ 2044386 2065589 2088366 2112805 2138146 2163409 2188159 2212229 2234885 2254876 2271424 2284744
50426B284744J0715Q562P042O783P899R571J0970J2130J3505J4995J6041J6623
$$ 2284744 2295459 2304021 2311063 2317846 2325745 2335316 2346286 2358416 2371921 2386916 2402957 2419580
50414B419580J7663K0077K3538K6657K8572L0084L2680L6446L9727M1180M1444
$$ 2419580 2437243 2457320 2480858 2507515 2536087 2566171 2598851 2635297 2675024 2716204 2757648
50403B757648M1984M2783M2372M0028L6728L3552L0202K5791K0322J4532Q784
$$ 2757648 2799632 2842415 2884787 2924815 2961543 2995095 3025297 3051088 3071410 3085942 3094726
50392C094726K953k866q372j3732j9518k5937l2634l9238m5589n1359n5906n8703
$$ 3094726 3097679 3094813 3086441 3072709 3053191 3027254 2994620 2955382 2909793 2858434 2802528 2743825
50380B743825n9577n8537n5738n1709m7180m2502l7417l1665k5491j9433j3814
$$ 2743825 2684248 2625711 2569973 2518264 2471084 2428582 2391165 2359500 2334009 2314576 2300762
50369B300762q749m582k031j720l673p330j2067j7585k3744l0188l6355m1758
$$ 2300762 2292013 2287431 2285400 2283680 2280007 2272677 2260610 2243025 2219281 2189093 2152738 2110980
50357B110980m6064m8939n0130m9718m8074m5424m1806l7502l3183k9323k5849
$$ 2110980 2064916 2015977 1965847 1916129 1868055 1822631 1780825 1743323 1710140 1680817 1654968
50346A654968k2604j9836j7834j6337j4740j2727j0308p450m107o12K444M826
$$ 1654968 1632364 1612528 1594694 1578357 1563617 1550890 1540582 1533132 1529025 1528413 1530857 1535683
50334A535683O745Q303R094Q489O088J939l339q554j2402j4137j3802j1859q832
$$ 1535683 1542428 1550731 1559825 1568314 1574402 1576341 1573002 1564448 1552046 1537909 1524107 1512248 1503416
50321A503416n237j633J522L981N755P087Q298R486J0507J1350J2329J3584J4638
$$ 1503416 1498179 1496546 1498068 1502049 1507804 1514891 1523189 1532675 1543182 1554532 1566861 1580445 1595083
50308A595083J4802J3939J2429J0568Q486O602N527N328N385N236N134N533O357
$$ 1595083 1609885 1623824 1636253 1646821 1655307 1661909 1667436 1672764 1678149 1683385 1688519 1694052 1700409
50295A700409P092P291O760N502L717J597j089m896r801j4702j8219j9880k0183
$$ 1700409 1707501 1714792 1721552 1727054 1730771 1732368 1731279 1726383 1716582 1701880 1683661 1663781 1643598
50282A643598j9666j8470j6738j4872j3123j1210q712n687k728m09J230K662M384
$$ 1643598 1623932 1605462 1588724 1573852 1560729 1549519 1540807 1535120 1532392 1531983 1533213 1535875 1540259
50269A540259O413Q351R910J1261J2754J4454J6188J7940J9871K1849K3315K3937
$$ 1540259 1546672 1555023 1564933 1576194 1588948 1603402 1619590 1637530 1657401 1679250 1702565 1726502
50257A726502K4230K5155K7071K9345L1133L2337L3529L5082L6710L7897L8499
$$ 1726502 1750732 1775887 1802958 1832303 1863436 1895773 1929302 1964384 2001094 2038991 2077490
50246B077490L8789L9076L9498M0027M0438M0325L9402L7768L5671L3092K9853
$$ 2077490 2116279 2155355 2194853 2234880 2275318 2315643 2355045 2392813 2428484 2461576 2491429
50235B491429K6105K2370J8994J5876J2927J0365Q248N932K465k589r100j6878
$$ 2491429 2517534 2539904 2558898 2574774 2587701 2598066 2606314 2612246 2614711 2612122 2603022 2586144
50223B586144k5627l4397m1735m6766m9693n0863m9895m6325m0872l5265l0657
$$ 2586144 2560517 2526120 2484385 2437619 2387926 2337063 2287168 2240843 2199971 2164706 2134049
50212B134049k6863k3413k0833k0341k2511k6595l1035l4306l5509l4735l3009
$$ 2134049 2107186 2083773 2062940 2042599 2020088 1993493 1962458 1928152 1892643 1857908 1824899
50201A824899l1453l0306k8952k6962k4700k2813k1484k0546k0010j9984k0209
$$ 1824899 1793446 1763140 1734188 1707226 1682526 1659713 1638229 1617683 1597673 1577689 1557480
50190A557480k0190j9832j9437j8989j7975j6228j4492j3588j3240j2405j0775
$$ 1557480 1537290 1517458 1498021 1479032 1461057 1444829 1430337 1416749 1403509 1391104 1380329
50179A380329r186q323p627o145m050k500j969j572l23J578L155L970M384M806
$$ 1380329 1371143 1362820 1355193 1349048 1344998 1342498 1340529 1338957 1338634 1340212 1343367 1347337 1351721 1356527
50165A356527N300N945O947Q130Q841Q649P952P537P705Q112Q344Q396Q557R028
$$ 1356527 1361827 1367772 1374719 1382849 1391690 1400339 1408291 1415828 1423533 1431645 1439989 1448385 1456942 1465970
50151A465970R771J0644J1530J2412J3398J4713J6577J8901K1179K2838K3779
$$ 1465970 1475741 1486385 1497915 1510327 1523725 1538438 1555015 1573916 1595095 1617933 1641712
50140A641712K4416K5145K6029K7177K9042L1936L5473L8935M2195M5863N0506
$$ 1641712 1666128 1691273 1717302 1744479 1773521 1805457 1840930 1879865 1922060 1967923 2018429
50129B018429N6124O2334O8662P4494P9218Q2503Q4231Q4058Q1588P7083P1508
$$ 2018429 2074553 2136887 2205549 2280043 2359261 2441764 2525995 2610053 2691641 2768724 2840232
50118B840232O5563N9189N2292M5538L9845L5267L0722K4760J6381N432p511k1706
$$ 2840232 2905795 2964984 3017276 3062814 3102659 3137926 3168648 3193408 3209789 3215221 3207710 3186004
50106C186004l6816n2554o7755q0501q9681r5826r9821j01407r9796r5435q9984
$$ 3186004 3149188 3096634 3028879 2948378 2858697 2762871 2663050 2561643 2461847 2366412 2276428
50095B276428q4545p8853p2467o5827n9697n4243m9245m4752m0967l7746l4715
$$ 2276428 2191883 2113030 2040563 1974736 1915039 1860796 1811551 1766799 1725832 1688086 1653371
50084A653371l1742k8979k6539k4367k2399k0597j8904j7303j5765j4185j2464
$$ 1653371 1621629 1592650 1566111 1541744 1519345 1498748 1479844 1462541 1446776 1432591 1420127
50073A420127j0730r270q165p227o392n811n359m408k498j4K149L603M785O228
$$ 1420127 1409397 1400127 1391962 1384735 1378343 1372532 1367173 1362765 1360267 1360253 1362402 1366005 1370790 1377018
50059A377018P817R037R732J0378J1492J2948J4103J4564J4631J4908J5603J6405
$$ 1377018 1384835 1393872 1403604 1413982 1425474 1438422 1452525 1467089 1481720 1496628 1512231 1528636
50047A528636J6923J7064J6991J6859J6608J6079J5277J4525J4099J3847J3391
$$ 1528636 1545559 1562623 1579614 1596473 1613081 1629160 1644437 1658962 1673061 1686908 1700299
50036A700299J2757J2351J2233J1914J1175J0539J0509J0814J1013J1395J2469
$$ 1700299 1713056 1725407 1737640 1749554 1760729 1771268 1781777 1792591 1803604 1814999 1827468
50025A827468J3935J5094J6104J7853K0500K3161K5234K7088K9113L1089L2986
$$ 1827468 1841403 1856497 1872601 1890454 1910954 1934115 1959349 1986437 2015550 2046639 2079625
50014B079625L5443L8714M1845M3789M4746M5649M6735M7621M8463M9910N1949
$$ 2079625 2115068 2153782 2195627 2239416 2284162 2329811 2376546 2424167 2472630 2522540 2574489
50003B574489N3600N3922N2656M9733M4856L7914K9395K0196J1296L541k703p885
$$ 2574489 2628089 2682011 2734667 2784400 2829256 2867170 2896565 2916761 2928057 2931598 2928895 2921010
49991B921010j2971j8755k5727l4431m5286n7861p0807q2668r2493r9506j02830
$$ 2921010 2908039 2889284 2863557 2829126 2783840 2725979 2655172 2572504 2480011 2380505 2277675
$$ [...]
##END NTUPLES=NMR SPECTRUM
##END=
