
##TITLE=AC1233_PERAH12114_6519287_kQ2xMY586G
##JCAMPDX= 6.0         $$ Bruker NMR JCAMP-DX V2.0
##DATA TYPE= NMR SPECTRUM
##DATA CLASS= NTUPLES
##ORIGIN= BRUKER
##OWNER= Administrator
$$ 1.72 TOPSPIN		Version 2.1
$$ 2012-07-14 11:32:31.312 -0500  Administrator@TOPSPIN
$$ Compression mode = diff/dup
##.OBSERVE FREQUENCY= 400.02188249412
##.OBSERVE NUCLEUS= ^1H
##.ACQUISITION MODE= SIMULTANEOUS (DQD)
##.ACQUISITION SCHEME= undefined
##.AVERAGES= 8
##.DIGITISER RES= 22
##SPECTROMETER/DATA SYSTEM= spect
##.PULSE SEQUENCE= zg30
##.SOLVENT NAME= COFFEE_meoh
##.SHIFT REFERENCE= INTERNAL, COFFEE_meoh, 1, 14.98509
##AUDIT TRAIL= $$ (NUMBER, WHEN, WHO, WHERE, PROCESS, VERSION, WHAT)
$$ ##TITLE= Audit trail, TOPSPIN		Version 2.1
$$ ##JCAMPDX= 5.01
$$ ##ORIGIN= Bruker BioSpin GmbH
$$ ##OWNER= Administrator
$$ $$ C:\Bruker\TOPSPIN/data/COFFEE/nmr/AC1233_PERAH12114_6519287_kQ2xMY586G/60/pdata/1/auditp.txt
$$ ##AUDIT TRAIL=  $$ (NUMBER, WHEN, WHO, WHERE, PROCESS, VERSION, WHAT)
(   1,<2012-07-14 11:32:24.265 -0500>,<Administrator>,<TOPSPIN>,<go>,<TOPSPIN 2.1>,
      <created by zg
	started at 2012-07-14 11:31:17.656 -0500,
	POWCHK enabled, PULCHK disabled,
       configuration hash MD5:
       6B 1B 68 BB D9 2E 58 E2 7F 35 AD 54 07 DF 0E 41
       data hash MD5: 64K
       1D 59 F9 30 D7 E9 42 BE BB 92 80 6D 1E F0 89 70>)
(   2,<2012-07-14 11:32:27.125 -0500>,<Administrator>,<TOPSPIN>,<proc1d>,<TOPSPIN 2.1>,
      <Start of raw data processing
       efp LB = 0 FT_mod = 6 PKNL = 1 PHC0 = 0 PHC1 = 0 SI = 32K 
       data hash MD5: 32K
       F7 24 81 42 A3 75 8F F4 6F 9A B4 BF D1 3F E0 EC>)
(   3,<2012-07-14 11:32:27.453 -0500>,<Administrator>,<TOPSPIN>,<proc1d>,<TOPSPIN 2.1>,
      <pk PHC0 = 178.0774 PHC1 = 0 
       data hash MD5: 32K
       3C E2 3D 85 99 AE 25 90 A3 F7 44 57 4F F4 D7 FF>)
(   4,<2012-07-14 11:32:27.500 -0500>,<Administrator>,<TOPSPIN>,<proc1d>,<TOPSPIN 2.1>,
      <abs ABSG = 1 
       data hash MD5: 32K
       E8 0D 28 7A 25 5E 97 09 DA 52 34 1B 46 02 25 03>)
(   5,<2012-07-14 11:32:27.531 -0500>,<Administrator>,<TOPSPIN>,<proc1d>,<TOPSPIN 2.1>,
      <abs ABSG = 2 
       data hash MD5: 32K
       B3 6F F5 99 40 4D 94 A0 B0 F0 6A 3E 9A 41 B3 5D>)
(   6,<2012-07-14 11:32:27.562 -0500>,<Administrator>,<TOPSPIN>,<proc1d>,<TOPSPIN 2.1>,
      <abs ABSG = 3 
       data hash MD5: 32K
       B2 0F 54 A2 81 8C 6E 2C 3D 93 C6 49 65 B6 3F 8D>)
(   7,<2012-07-14 11:32:27.593 -0500>,<Administrator>,<TOPSPIN>,<proc1d>,<TOPSPIN 2.1>,
      <abs ABSG = 4 
       data hash MD5: 32K
       13 7F 59 D2 43 20 8A 08 D1 81 49 3D 1A B2 7C DB>)
(   8,<2012-07-14 11:32:27.625 -0500>,<Administrator>,<TOPSPIN>,<proc1d>,<TOPSPIN 2.1>,
      <abs ABSG = 5 
       data hash MD5: 32K
       01 FF C1 A5 68 60 C0 6C 70 2E 77 52 BF 31 7C 6C>)
$$ ##END=
$$ 
$$ $$ hash MD5
$$ $$ 20 55 37 11 D8 35 E3 E2 35 92 F2 32 18 FA 45 E7
##$RELAX= 
##$RELAX= 
##$RELAX= 
##$RELAX= 
##$RELAX= 
##$RELAX= 
##$RELAX= 
##$RELAX= 
$$ Bruker specific parameters
$$ [...]
150 150 150 150 150 150 150 150
##$TP07= 0
##$TPNAME0= <>
##$TPNAME1= <>
##$TPNAME2= <>
##$TPNAME3= <>
##$TPNAME4= <>
##$TPNAME5= <>
##$TPNAME6= <>
##$TPNAME7= <>
##$TPOAL= (0..7)
0.5 0.5 0.5 0.5 0.5 0.5 0.5 0.5
##$TPOFFS= (0..7)
0 0 0 0 0 0 0 0
##$TUNHIN= 0
##$TUNHOUT= 0
##$TUNXOUT= 0
##$USERA1= <user>
##$USERA2= <user>
##$USERA3= <user>
##$USERA4= <user>
##$USERA5= <user>
##$V9= 5
##$VALIST= <valist>
##$VCLIST= <CCCCCCCCCCCCCCC>
##$VD= 0
##$VDLIST= <DDDDDDDDDDDDDDD>
##$VPLIST= <PPPPPPPPPPPPPPP>
##$VTLIST= <TTTTTTTTTTTTTTT>
##$WBST= 2048
##$WBSW= 25
##$XGAIN= (0..3)
0 0 0 0
##$XL= 0
##$YL= 0
##$YMAX_a= 503608
##$YMIN_a= -646228
##$ZGOPTNS= <>
##$ZL1= 120
##$ZL2= 120
##$ZL3= 120
##$ZL4= 120
##$ABSF1= 14.98509
##$ABSF2= -5.573092
##$ABSG= 5
##$ABSL= 3
##$ALPHA= 0
##$AQORDER= 0
##$ASSFAC= 0
##$ASSFACI= 0
##$ASSFACX= 0
##$ASSWID= 0
##$AUNMP= <proc_prof1d_extract_pilot.lims>
##$AXLEFT= 0
##$AXNAME= <>
##$AXNUC= <1H>
##$AXRIGHT= 0
##$AXTYPE= 0
##$AXUNIT= <>
##$AZFE= 0.1
##$AZFW= 0.1
##$BCFW= 0
##$BC_mod= 0
##$BYTORDP= 0
##$COROFFS= 0
##$CY= 15
##$DATMOD= 1
##$DC= 0
##$DFILT= <>
##$DTYPP= 0
##$F1P= 0
##$F2P= 0
##$FCOR= 0.5
##$FTSIZE= 32768
##$FT_mod= 6
##$GAMMA= 0
##$GB= 0
##$INTBC= 1
##$INTSCL= 1
##$ISEN= 128
##$LB= 0
##$LEV0= 0
##$LPBIN= 0
##$MAXI= 10000
##$MC2= 0
##$MEAN= 0
##$ME_mod= 0
##$MI= 0
##$NCOEF= 0
##$NC_proc= -8
##$NLEV= 6
##$NOISF1= 0
##$NOISF2= 0
##$NSP= 0
##$NTH_PI= 0
##$NZP= 0
##$OFFSET= 14.98509
##$PC= 1
##$PHC0= 178.0774
##$PHC1= 0
##$PH_mod= 1
##$PKNL= yes
##$PPARMOD= 0
##$PPDIAG= 0
##$PPIPTYP= 0
##$PPMPNUM= 2147483647
##$PPRESOL= 1
##$PSCAL= 4
##$PSIGN= 0
##$PYNMP= <proc.py>
##$REVERSE= no
##$SF= 400.02
##$SI= 32768
##$SIGF1= 0
##$SIGF2= 0
##$SINO= 400
##$SIOLD= 32768
##$SPECTYP= <>
##$SREGLST= <1H.CDCl3>
##$SSB= 0
##$STSI= 32768
##$STSR= 0
##$SW_p= 8223.68421052631
##$SYMM= 0
##$S_DEV= 0
##$TDeff= 65536
##$TDoff= 0
##$TI= <>
##$TILT= no
##$TM1= 0
##$TM2= 0
##$TOPLEV= 0
##$USERP1= <user>
##$USERP2= <user>
##$USERP3= <user>
##$USERP4= <user>
##$USERP5= <user>
##$WDW= 1
##$XDIM= 32768
##$YMAX_p= 480062118
##$YMIN_p= -716793
##$CURPLOT= <Network HP LaserJet P1505>
##$CURPRIN= <$Network HP LaserJet P1505>
##$DFORMAT= <normdp>
##$LAYOUT= <+/1D_H.xwp>
##$LFORMAT= <normlp>
##$PFORMAT= <normpl>
##$SURQMSG= 1
$$ End of Bruker specific parameters
$$ ---------------------------------
##NTUPLES= NMR SPECTRUM
##VAR_NAME=  FREQUENCY,     SPECTRUM/REAL,   SPECTRUM/IMAG
##SYMBOL=    X,             R,               I
##VAR_TYPE=  INDEPENDENT,   DEPENDENT,       DEPENDENT
##VAR_FORM=  AFFN,          ASDF,            ASDF
##VAR_DIM=   32768,         32768,           32768
##UNITS=     HZ,            ARBITRARY UNITS, ARBITRARY UNITS
##FACTOR=    0.250966925370066, 1,           1
##FIRST=     8223.43324360094, -257905,      161561
##LAST=      0,             -117622,         -244812
##MIN=       0,             -716793,         0
##MAX=       8223.43324360094, 480062118,    0
$$ Real data points
##PAGE= N=1
##DATA TABLE= (X++(R..R)), XYDATA
$$ [...]
19513B37547f932m562D3167b24792Q9093A97526a9976r2750E3260B4448R8162
$$ 237547 -6932 -11494 43167 -224792 -135699 197526 -19976 -112726 53260 24448 122610
19502A22610a78380j20200h5852L0403j74227A89474b84231a1981j89915E5100
$$ 122610 -178380 -298580 -85852 -55449 -229676 189474 -284231 -11981 -201896 55100
19491a07394j01199P4261j32577g6225k28648e9551H3156b31188G3281b2415L189
$$ -107394 -208593 -134332 -266909 -76225 -304873 -59551 83156 -231188 73281 -22415 -19226
19480a9226k8510K2582C45461c51257J29371j16468e7086A9771a32739a5767m6607
$$ -19226 -47736 -25154 345461 -351257 -221886 -338354 -57086 19771 -132739 -15767 -62374
19469f2374k13333a15065a4722l5010j65303k48450a39969B07932b47734R4829
$$ -62374 -275707 -115065 -14722 -49732 -215035 -463485 -139969 207932 -247734 -152905
19459a52905M6607c0947j71119b8183p6775A8668a3428c47k46031g5001j36766
$$ -152905 -106298 -30947 -202066 -28183 -104958 18668 -13428 -347 -246378 -75001 -211767
19448b11767r424l0177N8198H0450j1727A7195f838A37596J17446b27214k4196
$$ -211767 -221191 -251368 -193170 80450 68723 17195 -6838 137596 255042 -227214 -251410
19437b51410p0472H2557a52520b6733A4818J33024C7670N8855b13758R2999I0905
$$ -251410 -321882 82557 -152520 -26733 14818 147842 37670 96525 -213758 -120759 90905
19425a07554A15330b31957e1377k2494E0361a15994B87970q8994b34947j03862
$$ -107554 115330 -231957 -51377 -73871 50361 -115994 287970 198976 -234947 -338809
19415c38809O1180I6365b36700L6979i0339B42870R868N5678C0319o291f4742
$$ -338809 -277629 96365 -236700 -199721 -90339 242870 252738 308416 30319 24028 -64742
19403G4653A9501a85123A66825c47578a33132H9132H161K82216A22372a12041
$$ 74653 19501 -185123 166825 -347578 -133132 89132 8161 290377 122372 -112041
19392A59875b23569g0777E0774a43288A20733a71988C6777a48578e6012K3874
$$ 159875 -223569 -70777 50774 -143288 120733 -171988 36777 -148578 -56012 -32138
19382c2138j81810P0993L0680j95207A46375a72029A70952h620n0245g808k62052
$$ -32138 -213948 -142955 -112275 -307482 146375 -172029 170952 -8620 -58865 -7808 -269860
19371b69860B4523b61574b2840H4646a18983M3446A98059b15976A66982b21883
$$ -269860 24523 -261574 -22840 84646 -118983 -75537 198059 -215976 166982 -221883
19360b8856o7070A57621o7169J27181b7575A67756g4657a9511B7412d11139d2261
$$ -28856 -95926 157621 90452 217633 -27575 167756 -74657 -19511 27412 -411139 -42261
19348d06188J71557b7843j60547e7033j46260A07158l6772a70686B39000D0055
$$ -406188 -234631 -27843 -188390 -57033 -203293 107158 70386 -170686 239000 40055
19337c78156J86839j0897A14075A3061a28630B03122a22822b1628c63A27130N8096
$$ -378156 -191317 -202214 114075 13061 -128630 203122 -122822 -21628 -363 127130 185226
19326A85226A4534K88223A1185c06721J12406I198b13058A44942n3582p79a37440
$$ 185226 14534 302757 11185 -306721 -194315 9198 -213058 144942 91360 90581 -137440
19314A6441f1683j56030B0310a42546B4778c0141B27339f9971k94442D33940a63299
$$ 16441 -61683 -217713 20310 -142546 24778 -30141 227339 -69971 -364413 433940 -163299
19302d7915j36224B81883a59501L9153B37500I792a080m97510A15007g8532r4239
$$ -47915 -184139 281883 -159501 -120348 237500 9792 -1080 -498590 115007 -78532 -172771
19291a72771c8799j37690A8416J6335j4793J72839F9468K097a05440k98993a0909
$$ -172771 -38799 -176489 18416 34751 19958 192797 69468 71565 -105440 -404433 -10909
19279a83198A13802a20583m1562P6943j5281c6167A74286a77636I570c92846A83009
$$ -183198 113802 -120583 -162145 -85202 -100483 -36167 174286 -177636 9570 -392846 183009
19267a48607A70979E3788d35684H6293c05761a48214j20377k01276C4336a29551
$$ -148607 170979 53788 -435684 86293 -305761 -148214 -268591 -469867 34336 -129551
19256b08743l05664a80853K3254f5934B1280b62256D4604K7842b1061A9627d01627
$$ -208743 -514407 -180853 -157599 -65934 21280 -262256 44604 72446 -21061 19627 -401627
19244G5518k2337d92180b39253c7613m8612k9830o9438k92441a22280l7196B10021
$$ 75518 53181 -492180 -239253 -37613 -86225 -116055 -185493 -477934 -122280 -159476 210021
19232H3564h175p8032J2457n3069M7809I3837J80233b87501c1989J0955m0038
$$ 83564 -8175 -86207 -73750 -126819 -79010 93837 274070 -287501 -31989 -21034 -61072
19221f1072b3560A42505J86695d01997a98566k42342H3330a94251j876j02109
$$ -61072 -23560 142505 329200 -401997 -198566 -440908 83330 -194251 -196127 -298236
19211b98236C13963d9619G2592b3523A51429i2516l08449q8769F9187K71438c65003
$$ -298236 313963 -49619 72592 -23523 151429 -92516 -400965 -489734 69187 340625 -365003
19199b24893O3216K0363n9741h2037j75727i8971A56512E0890d40887A08819D6736
$$ -224893 -161677 -141314 -201055 -82037 -257764 -98971 156512 50890 -440887 108819 46736
19187a6907k96064A11127a58926M5324G952a9801C3774h044j05551e1814q6759
$$ -16907 -312971 111127 -158926 -113602 7952 -19801 33774 -8044 -113595 -51814 -138573
19176a38573A1511M3452d5046l17324a19422e3640m6472J5517B4911b11013F6900
$$ -138573 11511 54963 -45046 -362370 -119422 -53640 -100112 -84595 24911 -211013 66900
19164f6428k6166I5163d5382A3361b00476h2779d0829G961J58223h8738L8920
$$ -66428 -92594 95163 -45382 13361 -200476 -82779 -40829 7961 166184 -88738 -49818
19153d9818a5373C13983g4150j90039a4028j86922g2392j97355a27445A58368
$$ -49818 -15373 313983 -74150 -264189 -14028 -200950 -72392 -269747 -127445 158368
19142a63054G0447B3087c10339g1253p4363N2270k43120a53711f2642k28639A87934
$$ -163054 70447 23087 -310339 -71253 -145616 -93346 -336466 -153711 -62642 -291281 187934
19130c85096a68991F5320c25904a55254M161C6577b7333C30653B5698J0612a09975
$$ -385096 -168991 65320 -325904 -155254 -151093 36577 -27333 330653 25698 36310 -109975
19118A54480a27914e8750I215c89550H7572G985N0888b45302L4888k2895R487
$$ 154480 -127914 -58750 9215 -389550 87572 7985 58873 -245302 -210414 -233309 -223822
19107b23822I075e7683l08327A80306b35202D17419A4409h0634A58799a22544
$$ -223822 9075 -57683 -366010 180306 -235202 417419 14409 -80634 158799 -122544
19096c92488a77773j26945J36299d2710j85723k4048A91597i5748L9331o7975
$$ -392488 -177773 -304718 -168419 -42710 -228433 -252481 191597 -95748 -56417 -124392
19086a24392k07239F7315a82747K3407M8644F0039L52442E6066J40275b62545
$$ -124392 -331631 67315 -182747 -159340 -110696 60039 412481 56066 196341 -262545
19075G9159g7505A50935C7636c57975l8709m6441f1438a1011j34276r4630a07363
$$ 79159 -77505 150935 37636 -357975 -396684 -443125 -61438 -11011 -145287 -239917 -107363
19063b21376B52418a00412C62747A69015A7021K73819j09951a5150q2992b8948
$$ -221376 252418 -100412 362747 169015 17021 290840 180889 -15150 -98142 -28948
19052b15321B09217c6870A3511a11789B5765i06m1096k17271D0300h4217E6610
$$ -215321 209217 -36870 13511 -111789 25765 -906 -42002 -259273 40300 -84217 56610
19040C25933b61154a6513k10142A40477b03596A6655K9433L29160C7979e34663
$$ 325933 -261154 -16513 -226655 140477 -203596 16655 46088 375248 37979 -534663
19029g4956A36117L62213A96516q2487J5655C4532J80933A9109a3186H1328c9863
$$ -74956 136117 498330 196516 114029 129684 34532 215465 19109 -13186 81328 -39863
19017b51273B87855d412n08394g0792p1978c1746k01722L4688j70028a31382K0194
$$ -251273 287855 -4412 -512806 -70792 -142770 -31746 -233468 -198780 -368808 -131382 -111188
19006a11188b5m1819A44061f2611m07710a370l42531n1035I4599a39888J5889
$$ -111188 -25 -41844 144061 -62611 -470321 -1370 -343901 -394936 94599 -139888 -123999
18995a23999j36714H722R6343c09561h9229j10210H4840a57907F1430K496c7032
$$ -123999 -260713 8722 105065 -309561 -89229 -199439 84840 -157907 61430 63926 -37032
18983c21445P5084A24452B1181a36397N2025q8224l71120a48667k14156h3113
$$ -321445 -246361 124452 21181 -136397 -84372 -172596 -543716 -148667 -362823 -83113
18972c34434B00736b61153F2966K814A7522h4214F9954K7677b67435F7623J65640
$$ -334434 200736 -261153 62966 65780 17522 -84214 69954 97631 -267435 67623 233263
18961B33263b93923O5320d9375j79032i047D2546b5674E3958b53906h6142j50355
$$ 233263 -293923 -228603 -49375 -228407 -9047 42546 -25674 53958 -253906 -86142 -236497
18950b36497A70181c37743f4477D4168c33321d4045r9523o0702A93566b61327
$$ -236497 170181 -337743 -64477 44168 -333321 -44045 -143568 -204270 193566 -261327
18939A74059b39675C03941e9490K5618B28899m2519b11477b433k88789I8723l1768
$$ 174059 -239675 303941 -59490 -33872 228899 186380 -211477 -2433 -291222 98723 66955
18928F6955a73404e0474o0226j98687A62424a28769d862C97907a15029A7621J84741
$$ 66955 -173404 -50474 -110700 -309387 162424 -128769 -4862 397907 -115029 17621 202362
18917B02362l8875d6421l9275j04177A1656a06199k28384A3725c05592A72374
$$ 202362 163487 -46421 -85696 -189873 11656 -106199 -334583 13725 -305592 172374
18906a40742C7301a38451k12143A55407b45414c2927j66729p2243R8006B91197
$$ -140742 37301 -138451 -350594 155407 -245414 -32927 -199656 -271899 -173893 291197
18895a76907E2873a93140A39688o1375l6378M4408c11267A96141c81398A29262
$$ -176907 52873 -193140 139688 78313 41935 86343 -311267 196141 -381398 129262
18884h7303A67003N4945h246j36392N1153K1680l5341B31478a75174C09094b31911
$$ -87303 167003 221948 -8246 -144638 -93485 -71805 -107146 231478 -175174 309094 -231911
18872b61099A49300a97629G7273B0187a94721m2587j11077h283o8899k04634A8804
$$ -261099 149300 -197629 77273 20187 -194721 -237308 -348385 -8283 -77182 -281816 18804
18860F8286J54845R6631A7505b02317A12273a23987A40517b43046h4875A80992
$$ 68286 223131 319762 17505 -202317 112273 -123987 140517 -243046 -84875 180992
18849b24901Q4945C01326i1240J6412F5707J24820C0506J60069A775N0374K47677
$$ -224901 -139956 301326 -91240 -74828 65707 190527 30506 190575 1775 52149 299826
18838B99826a03656J3992n6995f8530j47926J07841b5274A3470a6077j53433b1081
$$ 299826 -103656 -89664 -146659 -68530 -216456 -108615 -25274 13470 -16077 -169510 -21081
18826A63006b35480e5116j9685J023J2324B52244A06645i0059A25482l7693B0793
$$ 163006 -235480 -55116 -74801 -73778 -61454 252244 106645 -90059 125482 87789 20793
18814E24089k25548a00993G5169J3982J91492M5501a28404H3444M78822m5103
$$ 524089 298541 -100993 75169 89151 280643 326144 -128404 83444 562266 517163
18804E17163A52314G1393i592I641b02412C7259N2825f1336D06065I6442K995
$$ 517163 152314 71393 -9592 9641 -202412 37259 90084 -61336 406065 96442 99437
18793I9437f2794J9453n3227m89594F3139h3358B33891b31964D7452f1415k3910
$$ 99437 -62794 -43341 -96568 -586162 63139 -83358 233891 -231964 47452 -61415 -85325
18782h5325J871C1244a27512A79627A6099l546K5008h6056p7687N2520c7289j97578
$$ -85325 -83454 31244 -127512 179627 16099 12553 37561 -86056 -163743 -111223 -37289 -234867
18770b34867L1140A12449f36j15109e2090m4213I520c22161a20758J2136D0981
$$ -234867 -203727 112449 -636 -115745 -52090 -96303 9520 -322161 -120758 -108622 40981
18758d32411F4004n414f4051D9043B0309K58956r6422c6563j15483j56373J34111
$$ -432411 64004 58590 -64051 49043 20309 279265 182843 -36563 -152046 -308419 -174308
18747a74308K8164o9340E509d23586i1310k00482A85776m6080B6885c02114C27227
$$ -174308 -146144 -215484 5509 -423586 -91310 -291792 185776 139696 26885 -302114 327227
18735G0500a97819j95543Q0006J35571O5027e0013L253l0028j1325C992e04227
$$ 70500 -197819 -393362 -313356 -177785 -112758 -50013 -46760 -76788 -88113 3992 -504227
18723a80841A24044P0519c240k93136O489a41730M5435P73F8413R4711J64794
$$ -180841 124044 194563 -3240 -296376 -289887 -141730 -96295 -95522 68413 163124 327918
18712C27918D4056d49796a47782N2881o3702r8332a17888k34427f9210A17396
$$ 327918 44056 -449796 -147782 -94901 -158603 -256935 -117888 -352315 -69210 117396
18701a46365A83721c00926i9456c0354l03035K049d5377r3297k59443F5401b07429
$$ -146365 183721 -300926 -99456 -30354 -333389 -331340 -45377 -138674 -398117 65401 -207429
18689b12918R8563C77177d4012k21476D3722b12169a3919j32817j58671d0945
$$ -212918 -114355 377177 -44012 -265488 43722 -212169 -13919 -146736 -305407 -40945
18678A42940a28879G9754b27606A09304J23506b65310k76542b01894j67042A77716
$$ 142940 -128879 79754 -227606 109304 232810 -265310 -541852 -201894 -368936 177716
18667B70375i600A3494b37675n4695b8665A4964Q5084o490a89986Q4771k15156
$$ 270375 -9600 13494 -237675 -292370 -28665 14964 100048 93558 -189986 -105215 -320371
18656c20371c4549j27356O3791A39643b20450Q6946l43320f3234m69272K52891
$$ -320371 -34549 -161905 -98114 139643 -220450 -133504 -476824 -63234 -532506 -279615
18646b79615p3124C00957a13295C6184J32863J35890D8353c08634b0165k24360
$$ -279615 -352739 300957 -113295 36184 169047 304937 48353 -308634 -20165 -244525
18636b44525A40703M0515a88096a8763B115d10937A72097b53367a4032A22690
$$ -244525 140703 181218 -188096 -18763 2115 -410937 172097 -253367 -14032 122690
18625g3410j37948B6871N1495b25287l5409F0366e1816A43273a50524A46980f3553
$$ -73410 -211358 26871 78366 -225287 -260696 60366 -51816 143273 -150524 146980 -63553
18613a89986D1026F33J23014C5596P7729P1436b6933I5710a37944b1949k78900
$$ -189986 41026 633 123647 35596 113325 184761 -26933 95710 -137944 -21949 -300849
18602c00849A75823a78698M9993K9545p4335l7209e0882K1666o4397j2937k9778
$$ -300849 175823 -178698 -128705 -99160 -173495 -210704 -50882 -29216 -93613 -106550 -136328
18591a36328c4418A31069B5017g3367l37581A43067e7038A44591a07907m0062
$$ -136328 -34418 131069 25017 -73367 -410948 143067 -57038 144591 -107907 -147969
18581a47969a2997k76157A82267g9176B9605L58904m5915c09855A10324b68529
$$ -147969 -12997 -289154 182267 -79176 29605 388509 342594 -309855 110324 -268529
18570A7075c8425m3596A64656g5319C07184i4390q1566I38K70471c34131C54600
$$ 17075 -38425 -82021 164656 -75319 307184 -94390 -175956 938 271409 -334131 354600
18558b40136q8471a07379B4901a51619A19846E5375b13100M9124B9062J05894
$$ -240136 -328607 -107379 24901 -151619 119846 55375 -213100 -163976 29062 134956
18548A34956c00160A3575f6257j30168k347I2255q788i738j0593C2805h1993c0928
$$ 134956 -300160 13575 -66257 -196425 -198772 92255 83467 -9738 -20331 32805 -81993 -30928
18535H8093A254a7092k20820c5212G3503g2143r7181e7268j69518C2397L2426
$$ 88093 1254 -17092 -237912 -35212 73503 -72143 -169324 -57268 -226786 32397 64823
18524F4823k938i5138B15648N1178e5266A09083A4620M796K78633g4253m8497
$$ 64823 61885 -95138 215648 266826 -55266 109083 14620 19416 298049 -74253 -122750
18513a22750E989J95258n0643D8737a98929n2407g4817A65368d7340j74366L0071
$$ -122750 5989 201247 150604 48737 -198929 -251336 -74817 165368 -47340 -221706 -191635
18502a91635C50529B8637J54842A4061a00250q9864A67094b12694B89029c61557
$$ -191635 350529 28637 183479 14061 -100250 -190114 167094 -212694 289029 -361557
18491C91715j16451r1555F1435b69507E3205J77702a84164j28383a06372J1618
$$ 391715 275264 183709 61435 -269507 53205 230907 -184164 -312547 -106372 -94754
18481i4754j52204A58572a36781l6772A83196a96404M7928B18102c60031A71482
$$ -94754 -246958 158572 -136781 -173553 183196 -196404 -148476 218102 -360031 171482
18470G4629d8239j34620Q0543r4627d7859k6371A11849a2703A01475k4711N6370
$$ 74629 -48239 -182859 -102316 -196943 -47859 -74230 111849 -12703 101475 76764 133134
18459A33134b4532B9455i6756M0143r7630j02715d9051k67043A98710j8017a53681
$$ 133134 -24532 29455 -96756 -56613 -154243 -256958 -49051 -316094 198710 180693 -153681
18447b14650F0857h4666m7483d8068B48716a67225b8453j73063R9622n1226a3565
$$ -214650 60857 -84666 -132149 -48068 248716 -167225 -28453 -201516 -101894 -153120 -13565
18435a2772j94186c3705A54419h384j65825B93082F3089b69616l44594i8236p8594
$$ -12772 -206958 -33705 154419 -8384 -174209 293082 63089 -269616 -614210 -98236 -176830
18424a76830j11182j10412J98848b3644k48986A30482f2995m9900k98027A80243
$$ -176830 -288012 -398424 -199576 -23644 -272630 130482 -62995 -112895 -410922 180243
18413B4563a19338A02797C3390N833a60644c7363k30031a21297j66480f7726j80698
$$ 24563 -119338 102797 33390 39223 -160644 -37363 -267394 -121297 -287777 -67726 -248424
18402b48424d2872A33330N9749H5656p701c0748A99686b21691A19734a50651J3522
$$ -248424 -42872 133330 193079 85656 77955 -30748 199686 -221691 119734 -150651 -137129
18391a37129G914a07823m0042G8128b97308A4104P3149a59956j049b6246p2019
$$ -137129 7914 -107823 -147865 78128 -297308 14104 87253 -159956 -161005 -26246 -98265
18380i8265f891n9712E6504b64343A03657A8546g3568F6801c69846A09694a4667
$$ -98265 -6891 -66603 56504 -264343 103657 18546 -73568 66801 -369846 109694 -14667
18368A61019a71250q1808b7369j45494n0032A6886B375R6204A8588d822B0166
$$ 161019 -171250 -253058 -27369 -172863 -222895 16886 2375 98579 18588 -4822 20166
18356c29930E3517a0773j3140A97870b26881R9570C0042k224a60707e2418l1249
$$ -329930 53517 -10773 -23913 197870 -226881 -127311 30042 27818 -160707 -52418 -83667
18345h3667j05434g282j21853J4716A9309a43006a610m71346a94193N2454j34875
$$ -83667 -189101 -7282 -129135 -114419 19309 -143006 -1610 -472956 -194193 -141739 -276614
18334b76614J28719j02719h5664D7083c50995a05927j64296J05332C981b35428
$$ -276614 -147895 -250614 -85664 47083 -350995 -105927 -270223 -164891 3981 -235428
18323h7416D6767J19462P9589H7461e6712F7085b4185j1127A02631C9915K19829
$$ -87416 46767 166229 245818 87461 -56712 67085 -24185 -35312 102631 39915 259744
18312B59744b5849j76096i6702k89327c1137m7308j15502a2280j84928L7225j359
$$ 259744 -25849 -201945 -96702 -386029 -31137 -78445 -193947 -12280 -197208 -159983 -161342
18301a61342b0830k49045k86110A37867J00570F6088N7442b51660J20835j72246
$$ -161342 -20830 -269875 -555985 137867 238437 66088 123530 -251660 -130825 -303071
18291c03071f7857j6664E3014a86016j56958d857r5269A6156b69663d1383k994
$$ -303071 -67857 -84521 53014 -186016 -342974 -4857 -100126 16156 -269663 -41383 -44377
18280d4377A82038D9729a91386j82317a54782A93965b36849B20592D3971d2021
$$ -44377 182038 49729 -191386 -373703 -154782 193965 -236849 220592 43971 -42021
18269c6155k86785A84296f1077j37401D3509J9482h5521k32182J56590o47N676
$$ -36155 -322940 184296 -61077 -198478 43509 62991 -85521 -317703 -161113 -161760 -156084
18258a56084N6448B05893e2755A38261g7997D7371h7092D9569d13876A0453e5910
$$ -156084 -99636 205893 -52755 138261 -77997 47371 -87092 49569 -413876 10453 -55910
18246g4853A75025C5050J9250J1002a20286a139A27651N257a91138r0748B94937
$$ -74853 175025 35050 54300 65302 -120286 -1139 127651 132908 -191138 -281886 294937
18234H8803J29857l3734d93364a49657B57342b82143D0186c16297d8705B07253
$$ 88803 218660 184926 -493364 -149657 257342 -282143 40186 -316297 -48705 207253
18223A66565o6292N4914a86121A33235a88659P3244r6166a3108D752J85253a71047
$$ 166565 100273 155187 -186121 133235 -188659 -115415 -211581 -13108 4752 190005 -171047
18211A71906a71122A7105L2352a45108j93677a01671b4625A40600a17690K0254
$$ 171906 -171122 17105 49457 -145108 -338785 -101671 -24625 140600 -117690 -97436
18201i7436J9001m1610a7115o3826k67076A10809n394B2980a90357A30650a1438
$$ -97436 -78435 -120045 -17115 -80941 -348017 110809 105415 22980 -190357 130650 -11438
18189a30539B06898G1222K9523A3772b1695e453A52487d4829J9942m2637j37024
$$ -130539 206898 71222 100745 13772 -21695 -5453 152487 -44829 -24887 -67524 -204548
18178b04548j11330h8420m2883j55635L6598J12956K0311b8708A5065N830g9435
$$ -204548 -315878 -88420 -131303 -286938 -250340 -137384 -117073 -28708 15065 20895 -79435
18166A47129A2938J06405Q2895c34931A91375b93551A41688A5186b09228M9335
$$ 147129 12938 119343 202238 -334931 191375 -293551 141688 15186 -209228 -159893
18156a59893G762e20290F4351a23445C8991A6514O554b25431P3329A34411b1666
$$ -159893 7762 -520290 64351 -123445 38991 16514 23068 -225431 -152102 134411 -21666
18144a43336D0164K51815j42008a83702h5595j51934A2870J5400c25223O2285
$$ -143336 40164 291979 149971 -183702 -85595 -237529 12870 28270 -325223 -262938
18134b62938Q7465M5618j50941A22355c20546h9541i391k2924C23694H3014N291
$$ -262938 -175473 -129855 -280796 122355 -320546 -89541 -9391 -32315 323694 83014 88305
18123H8305c22997R1755G4438e282A55272J00431c02892Q7729B42486B8163c93987
$$ 88305 -322997 -231242 74438 -5282 155272 255703 -302892 -215163 242486 28163 -393987
18111b02485j63598P7903B07591a43035C5707J13292A8345b4603C4455b88772
$$ -202485 -366083 -288180 207591 -143035 35707 148999 18345 -24603 34455 -288772
18100A87598e6191A24638a6902C62182g4121k2232A72600b011B8399J89267c07599
$$ 187598 -56191 124638 -16902 362182 -74121 -96353 172600 -2011 28399 217666 -307599
18088b89580a21115A72379N882P802a25567l5719A61269c02730A23947b95550
$$ -289580 -121115 172379 178261 186063 -125567 -161286 161269 -302730 123947 -295550
18077H7362a89565M1970j10225i0473j15771B08664E4841N7692a79627A74402
$$ 87362 -189565 -147595 -257820 -90473 -206244 208664 54841 112533 -179627 174402
18066c66137k4395a09802B0127K60553a07574o4112B680M3818b1356H5421b82439
$$ -366137 -390532 -109802 20127 280680 -107574 -171686 2680 46498 -21356 85421 -282439
18054A15158a19195q0525j16657f1954J481k01859o8504h9699B14613b09847A68202
$$ 115158 -119195 -199720 -316377 -61954 -60473 -262332 -330836 -89699 214613 -209847 168202
18042G6134L3052J2875i5458k61096F7409c56622J13230L2399R4435b364B94422
$$ 76134 109186 122061 -95458 -356554 67409 -356622 -243392 -210993 -116558 -2364 294422
18030b6833n5492j86969A29401k990B0154M5251K71797j10029b08748A42090f8680
$$ -26833 -82325 -269294 129401 126411 20154 65405 337202 227173 -208748 142090 -68680
18018A66649a68750B08541G7074a2190j16400A5405b7325j84041q8961C7166b44513
$$ 166649 -168750 208541 77074 -12190 -128590 15405 -27325 -211366 -300327 37166 -244513
18006A60200H428j92L93529a77333d0543A37329b16857c8403p1246J2348k0445
$$ 160200 8428 8236 401765 -177333 -40543 137329 -216857 -38403 -109649 -97301 -117746
17995a17746A2476b68093L5543K6784f0451B14221b20818M46L0887m5854A26939
$$ -117746 12476 -268093 -232550 -205766 -60451 214221 -220818 -220372 -189485 -235339 126939
17983a35207C81088b43288l3482b504D6019c44506C2452c67645B32762H015J27149
$$ -135207 381088 -243288 -276770 -2504 46019 -344506 32452 -367645 232762 8015 135164
17972A35164P06f02000A05094a1952n7972q4006A21120a31428o0650m9968C07025
$$ 135164 135870 -602000 105094 -11952 -69924 -153930 121120 -131428 -192078 -242046 307025
17960A10912d0522B95914b5421o5629L7970B63384c22905J35838F2807f8991B8075
$$ 110912 -40522 295914 -25421 -91050 -53080 263384 -322905 -187067 62807 -68991 28075
17948a73731d6071j40921M0252E56908B6656Q8619a38241j29665A12454K1207
$$ -173731 -46071 -186992 -146740 556908 26656 115275 -138241 -267906 112454 133661
17938A33661c5552j47368p9106r088l9042A28801N0415o9735J37287B702L85635
$$ 133661 -35552 -182920 -262026 -271114 -310156 128801 179216 109481 246768 2702 388337
17927C88337F7001a92811f8837B20507C9398a43966o7905A60469a39328n7047
$$ 388337 67001 -192811 -68837 220507 39398 -143966 -211871 160469 -139328 -196375
17917a96375j33437A9474d84962a19650F7190B4529d0542B73887A04729a1585
$$ -196375 -329812 19474 -484962 -119650 67190 24529 -40542 273887 104729 -11585
17906G1582b46464G774J5826d0627r6244A44804b19573B01146c65034H8033j7743
$$ 71582 -246464 7774 23600 -40627 -136871 144804 -219573 201146 -365034 88033 70290
17895G0290C4959K4443P1847b8424f236A9723a89313C67815B2839a01241H3532
$$ 70290 34959 59402 131249 -28424 -6236 19723 -189313 367815 22839 -101241 83532
17883D4736b6877m4315C2793a63897b6016G7046a88455q2738H4474b31762j46539
$$ 44736 -26877 -71192 32793 -163897 -26016 77046 -188455 -271193 84474 -231762 -378301
17872c78301a60712L120C64610C2398a75899j51643I0364a90037P1045I1426P367
$$ -378301 -160712 -157592 364610 32398 -175899 -327542 90364 -190037 -118992 91426 98793
17861I8793N7208b83061C8365O1859Q7200E8493a68054A16457a84573e147B73796
$$ 98793 156001 -283061 38365 100224 187424 58493 -168054 116457 -184573 -5147 273796
17849b08972F3145b22308G1835h3009h529A43010f3263A90875J30115j24065a92200
$$ -208972 63145 -222308 71835 -83009 -8529 143010 -63263 190875 320990 196925 -192200
17837b577k86794c7586A21048C5188f2179l9830A74236b56982h665m5554j0165
$$ -2577 -289371 -37586 121048 35188 -62179 -102009 174236 -256982 -8665 -54219 -64384
17826f4384k66839j72337D4608j0687K13861j21398K1695g4444q9033f1896K1227
$$ -64384 -331223 -503560 44608 33921 247782 126384 148079 -74444 -163477 -61896 -40669
17815d0669A71969p8880A5658a03104C35103r0700a6079B18600h8919l3898b4596
$$ -40669 171969 93089 15658 -103104 335103 244403 -16079 218600 -88919 -122817 -24596
17803A7996c0559C22939A30151a91499j24994I2611K58731a51422O0005B03949
$$ 17996 -30559 322939 130151 -191499 -316493 92611 351342 -151422 -91417 203949
17792A45927a29644N6977j74037e8416k27719D5421g4148B27336F6765c41036
$$ 145927 -129644 -72667 -246704 -58416 -286135 45421 -74148 227336 66765 -341036
17781A89323b59057J16591O8080A81335c40861A2539J51197e3593C40874j68299
$$ 189323 -259057 -142466 -74386 181335 -340861 12539 163736 -53593 340874 172575
17771A72575L4271g9607o2267C696J77389p2309c0471B15563i5014A72403d4204
$$ 172575 206846 -79607 -141874 3696 181085 108776 -30471 215563 -95014 172403 -44204
17759i5949G909O9617O7656h6555A90470N4860A03026f1552a924k05404B50503
$$ -95949 7909 77526 145182 -86555 190470 245330 103026 -61552 -1924 -207328 250503
17747b67755B14666I415a13373j66665A13654R56K6766E7315d2500A33216b77503
$$ -267755 214666 9415 -113373 -280038 113654 114610 141376 57315 -42500 133216 -277503
17735b66816A55260f03E8624c8755j48546d4507E9858A4332c03668D58537c4087
$$ -266816 155260 -603 58624 -38755 -187301 -44507 59858 14332 -303668 458537 -34087
17723A11116j60a59195G369h4354p7602C48748i6644B97516a39453A4126M5274
$$ 111116 110956 -159195 7369 -84354 -161956 348748 -96644 297516 -139453 14126 59400
17712E9400c575E9956e3678j08703n2878j34960J39905l21443c4873j8499k7735
$$ 59400 -3575 59956 -53678 -162381 -215259 -350219 -210314 -531757 -34873 -53372 -81107
17701h1107A7346h8062c425k9476A54154L7694M2781E3096a7009A7259J17005
$$ -81107 17346 -88062 -3425 -32901 154154 191848 234629 53096 -17009 17259 134264
17690A34264d116n4476A02190a83391r831l3504A48098A2996K81800d948j65120
$$ 134264 -4116 -58592 102190 -183391 -193222 -226726 148098 12996 294796 -4948 -170068
17679a70068Q2554a3933G9488l3931c7260A19822n5601J24711d6449A69014c9580
$$ -170068 -87514 -13933 79488 45557 -37260 119822 64221 188932 -46449 169014 -39580
17667E1391a30744n6858e062C45148A3199E508b25844A97832M1610b13538h69
$$ 51391 -130744 -187602 -5062 345148 13199 5508 -225844 197832 239442 -213538 -869
17655A9604c09042g1249A24052a95038O1460k5925D0895h3092q3815O9934A41561
$$ 19604 -309042 -71249 124052 -195038 -133578 -159503 40895 -83092 -166907 -96973 141561
17643A14624c49444A90024n8705a57456p6014I0718b96221C59086g08B32118J7682
$$ 114624 -349444 190024 131319 -157456 -233470 90718 -296221 359086 -708 232118 249800
17632B49800d8024B18909a10951A0368K42448a19012A00036h7131C0492a35525
$$ 249800 -48024 218909 -110951 10368 252816 -119012 100036 -87131 30492 -135525
17621d55793A84243m8220n1069a26493H3235a77795a8538C03025A25202d5493
$$ -455793 184243 136023 84954 -126493 83235 -177795 -18538 303025 125202 -45493
17610a17592o939e6723k5907B27072B3314O1381M6484l7320K60814e0005j00338
$$ -117592 -124531 -56723 -82630 227072 23314 84695 131179 93859 354673 -50005 -150343
17599a50343A67254J99355f253A2300J16349K96237A36136h2546B2674J63356
$$ -150343 167254 366609 -6253 12300 128649 424886 136136 -82546 22674 186030
17589A86030o8397M5095c45824A35364r658l9919K68788A23113J38158K5326f5869
$$ 186030 117633 162728 -345824 135364 125706 85787 354575 123113 261271 286597 -65869
17577a80369P7539A3739h7247r7448B9495c19105B5088J6319b0024l8828H524
$$ -180369 -102830 13739 -87247 -184695 29495 -319105 25088 41407 -20024 -58852 8524
17565i2671C0164K32944i7247k9506M1807a0814I8213N1451p2327J7439J58892
$$ -92671 30164 263108 -97247 -126753 -84946 -10814 98213 149664 77337 94776 253668
17554B53668D1223a5589B6330b6467D37362A79140M2888a92662B58592a51672
$$ 253668 41223 -15589 26330 -26467 437362 179140 222028 -192662 258592 -151672
17543f9774A73003J27464a7205A12694K14119A24837L44249i991B7209b2769C16600
$$ -69774 173003 300467 -17205 112694 326813 124837 469086 -9991 27209 -22769 316600
17531i4265b7013n5522j24372E37225A48760a05563B52899m4248o4828J20269
$$ -94265 -27013 -82535 -206907 537225 148760 -105563 252899 208651 143823 264092
17521B64092j31705b6867B51434j09536D9020M24889A15930Q1993I4943K80807
$$ 264092 132387 -26867 251434 141898 49020 473909 115930 197923 94943 375750
17511C75750j71150G6310J25249b83473F5430h0735A18679J11836a148A7011J10795
$$ 375750 204600 76310 201559 -283473 65430 -80735 118679 230515 -1148 17011 127806
17500A27806E6754k5878O5756N1559a86872A17020J54840P7970a06957j264A96069
$$ 127806 56754 30876 96632 148191 -186872 117020 271860 349830 -106957 -108221 196069
17488a09040B42060a24812a3602B08125l6201n1384E3021r968L15664C2831K8461
$$ -109040 242060 -124812 -13602 208125 171924 120540 53021 43053 358717 32831 61292
17477F1292L6603J54181a2192A68109K45929b9237j42297C46613C1986L3795J57822
$$ 61292 97895 252076 -12192 168109 414038 -29237 -171534 346613 31986 65781 223603
17466B23603m5715J86782A13239J56441k3707J09772M2952C9884L03637F4441
$$ 223603 177888 364670 113239 269680 245973 355745 398697 39884 343521 64441
17455B33573E6135o554J28095K9391J07464A43925L76820A81965J26347J86932
$$ 233573 56135 49581 177676 207067 314531 143925 520745 181965 308312 495244
17445D95244J93073C06689r1224j2811M64714l17821O4337H0781a90187B92001
$$ 495244 688317 306689 215465 202654 667368 349547 413884 80781 -190187 292001
17434D21275J13963B54457j08932M14768I6696P9720p2708N1317k3841N483K43812
$$ 421275 535238 254457 145525 560293 96696 176416 103708 155025 131184 136667 380479
17423C80479j39450K10932H1646J52944K8736q0818M6190O5968A32695K60435
$$ 380479 241029 451961 81646 234590 263326 182508 228698 294666 132695 393130
17413C93130A23766M28589j1181B44186k2510m921b09123C18428j8777f5505I9725
$$ 393130 123766 552355 541174 244186 221676 216755 -209123 318428 299651 -65505 99725
17401A93343a6060F1664J32500J16131J37683A13176R5754b29609B42884q7691
$$ 193343 -16060 61664 194164 310295 447978 113176 208930 -229609 242884 155193
17391A55193p1706P0288J01420M5129o9662b32602A9690K50477L65a6219A63238
$$ 155193 83487 153775 255195 300324 230662 -232602 19690 270167 270532 -16219 163238
17379A2537J25454J57756G650g9403C3102a35895f1778A78067O0928L2575L8523
$$ 12537 137991 295747 7650 -79403 33102 -135895 -61778 178067 238995 271570 310093
17368C10093L1372H2532K24492a46067B68190F5047P4546J18760f676C33583I3117
$$ 310093 341465 82532 307024 -146067 268190 65047 139593 258353 -6676 333583 93117
17356F29819i820A46699J34169J46028m6069A02720J23326j06079Q5304l4417
$$ 629819 -9820 146699 280868 426896 380827 102720 226046 119967 205271 170854
17346A70854l6359J81950A47220Q2090C9937L03965b31739B40584b01102A77462
$$ 170854 134495 316445 147220 229310 39937 343902 -231739 240584 -201102 177462
17335A32490M9040i84B58049I7380J11677J17030a67381O5338A00589K14356q3274
$$ 132490 181530 -984 258049 97380 209057 326087 -167381 -102043 100589 314945 231671
17324B31671F3654a26668C22964j52899c9800A05138b5361D67921k30892a00160
$$ 231671 63654 -126668 322964 170065 -39800 105138 -25361 467921 237029 -100160
17313C27565g7465B40336c3864a5853i72B15679K56121q2334j82751n9849k7392
$$ 327565 -77465 240336 -33864 -15853 -972 215679 471800 389466 206715 146866 119474
17302A19474P7676m3207J22595F8930I682K16256J22990A72338m640b25339C63262
$$ 119474 197150 153943 276538 68930 9682 225938 348928 172338 167698 -225339 363262
17290G9421K28558b5455B6356J78748B0183K16046I0363N4725K59415A65697H0433
$$ 79421 307979 -25455 26356 205104 20183 236229 90363 145088 404503 165697 80433
17278B90881L7638H5817L22126j27843O781l3969K34664A75745o7909K36770j38766
$$ 290881 328519 85817 407943 280100 286881 252912 487576 175745 107836 344606 205840
17267B05840K24421o4944j12795K16354A06531b24136A66301k3602g9584L5438
$$ 205840 430261 365317 252522 468876 106531 -224136 166301 142699 -79584 -44146
17257d4146A09646J04456o0907K4647M3619A02711K06962A03522j1796k4624L95515
$$ -44146 109646 214102 153195 177842 221461 102711 309673 103522 91726 67102 462617
17246D62617A07538o786K4574c0314E6501a6381A17051b7603C88403G9699e6333
$$ 462617 107538 100752 125326 -30314 56501 -16381 117051 -27603 388403 79699 -56333
17234E22076A99426J34333L9591a66475D10402A06201m0801c7071D44121j18760
$$ 522076 199426 333759 373350 -166475 410402 106201 65400 -37071 444121 325361
17224C25361j1494L54744b6445C5046a9420B03172J20545L20543l09164A65918
$$ 325361 313867 668611 -26445 35046 -19420 203172 323717 644260 335096 165918
17213E64831j41660j06054c9682B42535P9104A9291L09843J16127B06252h9334
$$ 564831 423171 317117 -39682 242535 321639 19291 329134 445261 206252 -89334
17202C63709A00927M14086a70300E60862A58822k4466L06396j91009J73107j29268
$$ 363709 100927 515013 -170300 560862 158822 134356 440752 249743 422850 293582
17192B93582m1190J19029L7014M2371k04563H0934L29478k02792L715G9074J79130
$$ 293582 252392 371421 408435 450806 246243 80934 410412 207620 211335 79074 258204
17181B58204J77190L0400k04550P0163K36957n1674J00870k03699a94444C46593
$$ 258204 435394 465794 261244 331407 568364 516690 617560 413861 -194444 346593
17170C16881K6708j23805L42332B61835J86956A66983J63436N9131J0397A09626
$$ 316881 343589 219784 562116 261835 448791 166983 330419 389550 399947 109626
17159C42116j07587p357k611C0452N63229G0747L44921M6098j09125l7921K31640
$$ 342116 234529 227172 224561 30452 593681 70747 415668 461766 352641 314720 546360
17148E46360k46263K17830j4976A57839J36247Q8348J31418k16174Q4002p8142
$$ 546360 300097 517927 502951 157839 294086 382434 513852 297678 381680 303538
17138C03538M8728K34228k83128g4643B38491L6149K9863C7426K25146O7302L64107
$$ 303538 352266 586494 303366 -74643 238491 274640 304503 37426 262572 329874 693981
17127F93981k56876A52352J66921j4651L17228j87022k9479e5716D45638I0217
$$ 693981 437105 152352 319273 304622 621850 434828 405349 -55716 445638 90217
17116E86434n8000j17414O9532J22832j93520k5900k8079J13744k08251R4002
$$ 586434 528434 411020 480552 603384 409864 383964 355885 469629 261378 355380
17106C55380J52073n783m7019j60569P4487Q2565M470k05530N20079l42358J92379
$$ 355380 507453 501670 454651 294082 368569 451134 455604 250074 770153 427795 620174
17095F20174B81163O3703L850L6586L21536C13692L55422k31409N9640B03363
$$ 620174 281163 344866 348716 385302 706838 313692 669114 437705 497345 203363
17084B54842N03948k4618j14461j62601j28377J90360O0809M9371K21397C74333
$$ 254842 758790 734172 619711 457110 328733 519093 579902 629273 850670 374333
17073D72471j60797K27758K84012b7180D40970n5436J51798L44254k45138j37814
$$ 472471 311674 539432 823444 -27180 440970 385534 537332 881586 636448 498634
17063D98634L5769o0516L484M29344D33177Q4719q541j18802N57777l28857m6022
$$ 498634 534403 473887 477371 906715 433177 517896 509355 390553 948330 619473 573451
17052E73451r8784o5327L58539p1465Q7561k25561M7483K10988l76734K55649
$$ 573451 474667 409340 767879 696414 783975 558414 605897 816885 440151 695800
17042F95800j80056K28280B25326D5319P47041q3517J47603l37768k8007K65919
$$ 695800 515744 744024 225326 45319 792360 708843 856446 518678 490671 756590
17032G56590q0602K32218m14525K57119l73400L29836J4646m1923L669J01603
$$ 756590 675988 908206 493681 750800 377400 707236 721882 679959 683628 785231
17022G85231n8449j92185L32049k20031j14919K88913K42709l37579J23158k24268
$$ 785231 726782 534597 866646 646615 531696 820609 1063318 725739 848897 624629
17012F24629K22326k6596k37222M7157K19388P518j77804L0647J82096l7468J27393
$$ 624629 846955 820359 583137 630294 849682 857200 679396 710043 892139 854671 982064
17001I82064k70312m8944N07146m04573r5146L12447j5320l19203K03409J15011
$$ 982064 711752 662808 1169954 765381 670235 982682 967362 648159 851568 966579
16991I66579j45732K36646n3625k73609K26608j79174N80982l80975P2983k10904
$$ 966579 820847 1057493 1003868 730259 956867 777693 1358675 977700 1050683 839779
16981H39779j28068R8564J04415J87606m05318M74441m72954K10999K15756j57418
$$ 839779 711711 810275 914690 1102296 696978 1171419 698465 909464 1125220 967802
16971I67802J10866M9890l64037K05363M18863k35848k16905L4039j09094K52656
$$ 967802 1078668 1128558 764521 969884 1388747 1152899 935994 970033 860939 1113595
16961A113595r482j93608N75019k89911l25032M46715l5983J3394k36571J31510
$$ 1113595 1104113 910505 1485524 1195613 870581 1317296 1281313 1294707 1058136 1189646
16951A189646m6217L55270m27904K00229L18140k28168j71371P6522J21646q5798
$$ 1189646 1143429 1498699 1070795 1271024 1589164 1360996 1189625 1266147 1387793 1301995
16941A301995j10753K78823j23758j97089O6377k18844P09269l40451J01154k03358
$$ 1301995 1191242 1470065 1346307 1149218 1215595 996751 1706020 1365569 1466723 1263365
16931A263365k7448J92607J90285N8283p2332l96310K58517L2747j25087K63830
$$ 1263365 1235917 1428524 1618809 1677092 1604760 1208450 1466967 1499714 1374627 1638457
16921A638457q2561J4062q6458R2701K16299q2825o5572L12221N1528l57083j61496
$$ 1638457 1555896 1569958 1483500 1576201 1792500 1709675 1644103 1956324 2007852 1650769 1489273
16910A489273J95279J59297q1017j91624K32243j496j27510M28260J58487m30257
$$ 1489273 1684552 1843849 1762832 1571208 1803451 1801955 1674445 2102705 2261192 1830935
16900A830935J93486j56446N1359J76401m2883k30622q836K36028l26244M78444
$$ 1830935 2024421 1867975 1919334 2095735 2052852 1822230 1813394 2049422 1723178 2201622
16890B201622p2697k67227J73649m5044J18131K37396J4198M2145J53046k79360
$$ 2201622 2128925 1861698 2035347 1990303 2108434 2345830 2360028 2402173 2555219 2275859
16880B275859k42312L54651l81899P39273l04933K53059L26289n82024K12892
$$ 2275859 2033547 2388198 2006299 2745572 2440639 2693698 3019987 2437963 2650855
16871B650855k765J207n5112k03503L08006J1987N25970k31299J83560k00588
$$ 2650855 2648090 2649297 2594185 2390682 2698688 2710675 3236645 3005346 3188906 2988318
16861B988318M9605q871K16931q9380j1294J28380R0662m1115L36924k53598j3415
$$ 2988318 3037923 3029052 3245983 3156603 3145309 3273689 3364351 3323236 3660160 3406562 3393147
16850C393147K63267k45278L29439K1957j04422J72439P7440l22345N08746l77363
$$ 3393147 3656414 3411136 3740575 3762532 3658110 3830549 3907989 3585644 4094390 3717027
16840C717027M37966k16218L19832J0224K72629n1341k9194N568J67509n9945
$$ 3717027 4154993 3938775 4258607 4268831 4541460 4490119 4460925 4466493 4634002 4574057
16830D574057K10173K68382p7498N15639n10197J47300L97674k3173l33436Q80230
$$ 4574057 4784230 5052612 4975114 5490753 4980556 5127856 5525530 5502357 5168921 6049151
16820F049151l69056j02811L00852j19966M53860K79045J39586k44383M61596
$$ 6049151 5680095 5577284 5878136 5758170 6212030 6491075 6630661 6386278 6847874
16811F847874L24050l03578M64306k07300M13658j61559K25379M82529l05720
$$ 6847874 7171924 6868346 7332652 7125352 7539010 7377451 7602830 8085359 7779639
16802G779639O74918l81914O35768N7754N7806M07889k25165M77537K43482N4261
$$ 7779639 8454557 8072643 8708411 8766165 8823971 9231860 9006695 9484232 9727714 9781975
16792I781975L55817M35318N26380j92872O10145R2917L49692O47565l12826N69970
$$ 9781975 10137792 10573110 11099490 10906618 11516763 11609680 11959372 12606937 12294111 12864081
16782A2864081M10786K48338N81071P1092O36843K00432M64185M02381O96310
$$ 12864081 13274867 13523205 14104276 14175368 14812211 15012643 15476828 15879209 16575519
16773A6575519N90590J67325Q08768O84104L68635Q21223Q64155O76215O79756
$$ 16575519 17166109 17333434 18142202 18826306 19194941 20016164 20880319 21556534 22236290
16764B2236290Q29439J020629Q08593Q23320P49418J225424J257490J103825J264380
$$ 22236290 23065729 24086358 24894951 25718271 26467689 27693113 28950603 30054428 31318808
16755C1318808J045678J499622J387987J480980J443031K005823J301576K259935
$$ 31318808 32364486 33864108 35252095 36733075 38176106 40181929 41483505 43743440
16747D3743440K004381K715451K388142K275063K622068K738379K886048L547161
$$ 43743440 45747821 48463272 50851414 53126477 55748545 58486924 61372972 64920133
16739F4920133L701222L786106L614065M689181M196534M571713N227636N417508
$$ 64920133 68621355 72407461 76021526 80710707 84907241 89478954 94706590 100124098
16731A00124098N759895O116543N993017O784728O499740P001219P290734O516542
$$ 100124098 105883993 112000536 117993553 124778281 131278021 138279240 145569974 152086516
16723A52086516P232539O439927O315117N776042M994250L906325L099568K206826
$$ 152086516 159319055 165758982 172074099 177850141 182844391 186750716 189850284 192057110
16715A92057110R14732m76242j554137k582496l870049m676960n517424n801190
$$ 192057110 192971842 192495600 190941463 188358967 184488918 179811958 174294534 168493344
16707A68493344o818478o787015p227647o949956p448060p161246o944516o334830
$$ 168493344 161674866 154887851 147660204 140710248 133262188 126100942 119156426 112821596
16699A12821596o378111o054962n680853n708998m648517m925622m375949m240315
$$ 112821596 106443485 100388523 94707670 88998672 84350155 79424533 75048584 70808269
16691G0808269m035497l837789l098806l035602l161002k918052k358939k509804
$$ 70808269 66772772 62934983 59836177 56800575 53639573 50721521 48362582 45852778
16683D5852778k148809k162140j974966j892308j710944j880056j413137j523335
$$ 45852778 43703969 41541829 39566863 37674555 35963611 34083555 32670418 31147083
16675C1147083j155107j371569j246918p78717j056782j381433r06581o60622
$$ 31147083 29991976 28620407 27373489 26594772 25537990 24156557 23249976 22589354
16667B2589354j176832n23489o62915j151967n04444n87335o29932q41489j49952
$$ 22589354 21412522 20889033 20226118 19074151 18569707 17982372 17352440 16510951 16360999
16658A6360999j015783l74718o00323l07048k90303n91869j26095o58295m40470
$$ 16360999 15345216 14970498 14370175 14063127 13772824 13180955 13054860 12396565 11956095
16649A1956095l98683l8987m91319l24694k67025p2740n58371k47897k60712k09663
$$ 11956095 11557412 11518425 11027106 10702412 10435387 10362647 9804276 9556379 9295667 9086004
16639I086004l92441k67178l27928k6328J2617k85943j77065m81505J99427r776
$$ 9086004 8693563 8426385 8098457 8072129 8084746 7798803 7621738 7140233 7339660 7329884
16629G329884r35188L22830j43313M0770n02854k23400M5939k82938K11332l61634
$$ 7329884 6394696 6717526 6574213 6614983 6112129 5888729 5934668 5651730 5863062 5501428
16619E501428j20610j49412k8397J46785m76942K34642m30973k8855J15171p8575
$$ 5501428 5380818 5231406 5203009 5349794 4872852 5107494 4676521 4647666 4762837 4684262
16609D684262j6533l77810n257M8456j29897o8655l47141J29622r1279p3175k51072
$$ 4684262 4667729 4289919 4284662 4333118 4203221 4134566 3787425 3917047 3825768 3752593 3501521
16598C501521O0252j16643L06966n81617J38426L20398m31631k68065J89143J40799
$$ 3501521 3561773 3445130 3752096 3170479 3308905 3629303 3197672 2929607 3118750 3259549
16588C259549j57076q5516n3738j82477J4601k5540l41605K13092k46251p6669
$$ 3259549 3102473 3016957 2963219 2780742 2795343 2769803 2428198 2641290 2395039 2318370
16578B318370K33361k42929K23552j23823l0587L9110O3046k65042p3826M14402
$$ 2318370 2551731 2308802 2532354 2408531 2377944 2417054 2480100 2215058 2141232 2555634
16568B555634k26257q0253R4496k34013J05508p3021j02699j76868J74965J34230
$$ 2555634 2329377 2249124 2343620 2109607 2215115 2142094 2039395 1862527 2037492 2171722
16558B171722j27934o6613l59177n6364Q8199l8424l375N808J80554l86715K17463
$$ 2171722 2043788 1977175 1617998 1561634 1649833 1611409 1608034 1613842 1794396 1407681 1625144
16547A625144k01152J0300k09945M37824L4578k53597J00969j85531m43492J56787
$$ 1625144 1423992 1434292 1224347 1662171 1696749 1443152 1544121 1358590 915098 1071885
16537A071885J25273k00772K66505j13867M4280J56165J07824m32748J65037q8152
$$ 1071885 1197158 996386 1262891 1149024 1193304 1349469 1457293 1024545 1189582 1101430
16527A101430p5136o2249J50167R0772J1802J55249k93558K84399k32279J69077
$$ 1101430 1026294 964045 1114212 1204984 1216786 1372035 1078477 1362876 1130597 1299674
16517A299674l4274j93032l19750L80450Q75p4636k10914K13631k41976J23172
$$ 1299674 1265400 1072368 752618 1133068 1133943 1059307 848393 1062024 820048 943220
16507I43220j5956j32769Q6606o8528k08497L07861j77520l04834L96634k24402
$$ 943220 927264 794495 881101 812573 604076 911937 734417 429583 826217 601815
16497F01815P60897k92234J36868n66617K78159r8896k40268k0029N880K11389
$$ 601815 1362712 1070478 1207346 640729 918888 819992 579724 559695 565575 776964
16487G76964L2821p3891L32687l53677P407j3587J3169r7648Q2877J36749j12136
$$ 776964 809785 735894 1068581 714904 722311 708724 721893 624245 707122 843871 731735
16476G31735L3368k30123K67508j09152L3931K8974j29068j77852K24479j26646
$$ 731735 765103 534980 802488 693336 727267 756241 627173 449321 673800 547154
16466E47154n7987J82606M1663M522B09444O49127l21720L5341K32987R6975k67584
$$ 547154 489167 671773 713436 717958 209444 858571 536851 572192 805179 902154 634570
16455F34570m0112J78917l08901J48427r7282j24861P0011J07508r2202K63357
$$ 634570 594458 773375 464474 612901 515619 390758 460769 568277 476075 739432
16445G39432k18484K14725k87345K50408j66388k7817N3857k43048J40269J3743
$$ 739432 520948 735673 448328 698736 532348 504531 558388 315340 455609 469352
16435D69352L4689j21447J97630r7103J77806k51918L57025k53883B42246M11588
$$ 469352 504041 382594 580224 483121 660927 409009 766034 512151 242246 653834
16425F53834o8862D2479L26202j37539K53368E1954O03288B90601Q5602j40597
$$ 653834 584972 42479 368681 231142 484510 51954 655242 290601 376203 235606
16415B35606M6617j02872J65353L9091L36045k96186j48444M6544R3925M8872
$$ 235606 282223 179351 344704 383795 719840 423654 275210 321754 415679 464551
16405D64551M2796j48264A03201K22804J82392P590k29695M4616J30424j8143
$$ 464551 507347 359083 103201 326005 508397 515987 286292 330908 461332 443189
16395D43189B17572K6213R7707J22617j12446j67639J33859L94365B27786J22195
$$ 443189 217572 243785 341492 464109 351663 184024 317883 712248 227786 349981
16385C49981J01407A17979N0796M6141P2053j19680b1762D1928M2667J06415L64409
$$ 349981 451388 117979 168775 214916 286969 167289 -21762 41928 84595 191010 555419
16374E55419b7578B77521K5568a31266B44782R881p1573M7876J60191a01288B80258
$$ 555419 -27578 277521 303089 -131266 244782 254663 183090 230966 391157 -101288 280258
16362f0549E08022a23786B52615R752j24176M07855c2208E1712K21883H0350A5052
$$ -60549 508022 -123786 252615 262367 138191 546046 -32208 51712 273595 80350 15052
16350A94947L3836C6772K04197f0203B34585J8270k7627j02837J67436j22907
$$ 194947 228783 36772 240969 -60203 234585 252855 225228 122391 289827 166920
16340A66920P6177j16151J33068n7141L19236j97582b07504B97466J32294G6821
$$ 166920 243097 126946 260014 202873 522109 324527 -207504 297466 429760 76821
16329B19633h9455a9715j15922B93131D4091J1700j7445M9666K88602E3733J38653
$$ 219633 -89455 -19715 -135637 293131 44091 55791 38346 88012 376614 53733 192386
16318A92386M3084p5470J5478E8141O0980j5741R434M8272F3331h6341K0502C64670
$$ 192386 235470 160000 175478 58141 119121 103380 112814 161086 63331 -86341 -65839 364670
16305B00627a39816G8573J06159Q0438j12323a15784E5158a53406B40872C3547
$$ 200627 -139816 78573 184732 265170 152847 -115784 55158 -153406 240872 33547
16294B70565P2662G3941L4349R4033q57G1385J04349j5720o2876J65839a94702
$$ 270565 343227 73941 108290 202323 201466 71385 175734 160014 97138 262977 -194702
16282E892a60022A40308K4632a73159I6805O2854K0240m1481a60980G4822a04763
$$ 5892 -160022 140308 164940 -173159 96805 159659 179899 138418 -160980 74822 -104763
16270A55490a91331A21641C7053i9278f611G1194j1331K97265B5455K29900F5574
$$ 155490 -191331 121641 37053 -99278 -6611 71194 59863 357128 25455 255355 65574
16258A88753I0133f6977a1100B78900a40207B18432m9326m0697M9648p0400J14012
$$ 188753 90133 -66977 -11100 278900 -140207 218432 169106 128409 178057 107657 221669
16247B21669J30553b87453J19871C51503A00734j924K1845a16255D37861b47360
$$ 221669 352222 -287453 -167582 351503 100734 98810 120655 -116255 437861 -247360
16236c6200r7458A32265a4665q0803A51039K54168g430j27210B14566n3561a49394
$$ -36200 -133658 132265 -14665 -95468 151039 405207 -7430 -134640 214566 161005 -149394
16224e3585F8570L3354J9493L0896a846C25161D050J75878J25759e45j62915A57232
$$ -53585 68570 101924 121417 152313 -1846 325161 4050 179928 305687 -545 -163460 157232
16211c3239k1995C5310J2140J21972J72192A42627i9403C1579R0556a06876j66248
$$ -33239 -55234 35310 47450 169422 341614 142627 -99403 31579 122135 -106876 -273124
16200b73124G836K97632f1761B4219Q9090a2006B1562a01635Q873D4214J13715
$$ -273124 7836 305468 -61761 24219 113309 -12006 21562 -101635 -92762 44214 157929
16189A57929Q602a42491B06933a88525i3540k66047A27962J6504a7796H4752l2550
$$ 157929 166531 -142491 206933 -188525 -93540 -359587 127962 144466 -17796 84752 52202
16178E2202O8533l8995d2838B15992D2237P4616B6147b63919h3199A96436f8060
$$ 52202 120735 81740 -42838 215992 42237 116853 26147 -263919 -83199 196436 -68060
16166G4587a7222o7900D8388a9914A6546P3363a44244A26894D3440a42583e3259
$$ 74587 -17222 -85122 48388 -19914 16546 89909 -144244 126894 43440 -142583 -53259
16154b31352e2676k37214A9441e1390l34901B83320A35556L22203H5219J46501
$$ -231352 -52676 -289890 19441 -51390 -386291 283320 135556 457759 85219 231720
16144B31720k1369n7876D3431j1949M6422J60900F1603a20979D3861P6123B7941
$$ 231720 210351 152475 43431 31482 77904 238804 61603 -120979 43861 119984 27941
16132c50450e7663H3648a48198j20469h098j81346R2713J7723r5104b9272H5728
$$ -350450 -57663 83648 -148198 -268667 -8098 -189444 -96731 -79008 -174112 -29272 85728
16120B3798d3590m57030b08219g4805k22989q7188B33169a51722B9488J92533
$$ 23798 -43590 -500620 -208219 -74805 -297794 -384982 233169 -151722 29488 222021
16110B22021a95277A73879a08807B09267e7248B48674c9625B77952A00876K07569
$$ 222021 -195277 173879 -108807 209267 -57248 248674 -39625 277952 100876 308445
16100C08445r4984J90106A96730q2817f4566J5528B26040F0830B2871J13407a92043
$$ 308445 213461 403567 196730 113913 -64566 -49038 226040 60830 22871 136278 -192043
16088D7586a71225j67459m5729C9767L47324A47499i4837B48803i6662k67198
$$ 47586 -171225 -338684 -384413 39767 387091 147499 -94837 248803 -96662 -363860
16078c63860N0366c9767C2991c13218J54273O2289A63382J61342c85474g7538
$$ -363860 -313494 -39767 32991 -313218 -158945 -96656 163382 324724 -385474 -77538
16067b12254K6875L1235c2271C21466a26550j62978F0794b41575A16451c24624
$$ -212254 -185379 -154144 -32271 321466 -126550 -289528 60794 -241575 116451 -324624
16056i138j5743k5763k0759D7075i9968n9164A97331B4235b14176G4195J19073
$$ -9138 -24881 -50644 -71403 47075 -99968 -159132 197331 24235 -214176 74195 193268
16045A93268a39428A44481K5205F5337c29292a01060e252K63j07062A37098J86175
$$ 193268 -139428 144481 169686 65337 -329292 -101060 -5252 -4989 -112051 137098 323273
16034C23273A6321a64341E3144C095J95698I4422K1061b15380M6115D8367j8243
$$ 323273 16321 -164341 53144 3095 198793 94422 115483 -215380 -169265 48367 30124
16023C0124J27220J84773F0520e0204J253A12688C333a70049D399a21473B74328
$$ 30124 157344 342117 60520 -50204 -48951 112688 3333 -170049 4399 -121473 274328
16011g2640D7691b41377A8958m914L2171N3396a68475P3936j84335C00183a59629
$$ -72640 47691 -241377 18958 14044 46215 99611 -168475 -94539 -278874 300183 -159629
15999b95827A49807C0958a94506M78B64572a48109A81076e7558n7301H1723h6704
$$ -295827 149807 30958 -194506 -194028 264572 -148109 181076 -57558 -114859 81723 -86704
15987b03253A07191i153A62877N1724J88394j78471J81450A53357L75837A18967
$$ -203253 107191 -9153 162877 214601 402995 224524 405974 153357 529194 118967
15976A71736g7388c4228G0733a34325J4551d4178k46323B3769i8643b2429B28164
$$ 171736 -77388 -34228 70733 -134325 -119774 -44178 -290501 23769 -98643 -22429 228164
15964a67478B0875M896J80395A971J56954a81093B35214m8235n7839n0999a257
$$ -167478 20875 25771 206166 1971 158925 -181093 235214 186979 129140 78141 -1257
15952a68202O2430k45618L3073H8779B669a4420j59157j08379a06186A10841b41266
$$ -168202 -105772 -351390 -318317 88779 2669 -14420 -173577 -281956 -106186 110841 -241266
15940C111d717A8999J57202a18792B81553a00322k4958m1594N6004C31336R1579
$$ 3111 -4717 18999 176201 -118792 281553 -100322 -125280 -166874 -110870 331336 422915
15929D22915j82984A0104P231Q1768J7761l8143b05754M3655j30067A01330b59603
$$ 422915 239931 10104 17335 99103 116864 78721 -205754 -162099 -292166 101330 -259603
15917b60713i6250B114b83098a31552B53541b62480A24274i9169H2K76952c73796
$$ -260713 -96250 2114 -283098 -131552 253541 -262480 124274 -99169 82 277034 -373796
15905h8238n4144l5356j36648B6132a73833A20021K41597b76527B00666G6682
$$ -88238 -142382 -177738 -314386 26132 -173833 120021 361618 -276527 200666 76682
15894A2123a0498D0523b09764c7674k70961J15744i4882o1892m0312l3767l5322
$$ 12123 -10498 40523 -209764 -37674 -308635 -192891 -94882 -156774 -197086 -230853 -266175
15883b66175C09365p8394b72813B53780b44054P7387B9457a42368C32356a12963
$$ -266175 309365 230971 -272813 253780 -244054 -166667 29457 -142368 332356 -112963
15872g7521j65223L1015C4984a6748A65093b97924A07368b815l9158m4137E11212
$$ -77521 -242744 -211729 34984 -16748 165093 -297924 107368 -2815 -41973 -86110 511212
15860a95169A10333g0569C99466c26896g6047m578j65181A73258o9441a19160
$$ -195169 110333 -70569 399466 -326896 -76047 -80625 -245806 173258 103817 -119160
15849i2288F5444c05082A51398p5619c97561A62034a28641F4092A3069f1194k5721
$$ -92288 65444 -305082 151398 75779 -397561 162034 -128641 64092 13069 -61194 -86915
15838h6915b8181B45210J5615H8321A7995a08596A4108K24650b17533I230O5758
$$ -86915 -28181 245210 260825 88321 17995 -108596 14108 238758 -217533 9230 74988
15827G4988K2052a33396K1072b9068B88155C4935a11617C426K10292E7111M5420
$$ 74988 97040 -133396 -112324 -29068 288155 34935 -111617 3426 213718 57111 102531
15816A02531K59a9707k97114B01187a82696A01058J44965a6638n8916p1676O7957
$$ 102531 102790 -19707 -316821 201187 -182696 101058 246023 -16638 -75554 -147230 -79273
15805g9273B34759d46036I4147a1992j58293P3582B2111O7121K7138i045j27130
$$ -79273 234759 -446036 94147 -11992 -170285 -96703 22111 89232 116370 -9045 -136175
15794a36175j13296R4905B07135n8164i5032m6591B52499a18423B13243l8906
$$ -136175 -249471 -154566 207135 148971 -95032 -141623 252499 -118423 213243 174337
15784A74337a27416j80216c3512j54197Q6867A27303J35065b85590a20033C4871
$$ 174337 -127416 -307632 -33512 -187709 -100842 127303 262368 -285590 -120033 34871
15773b00319B59700c6165n4140B8640c03495n426J24289o000F2206a65380C4347
$$ -200319 259700 -36165 -90305 28640 -303495 -308921 -184632 -190632 62206 -165380 34347
15761b14747j01762R3108L7512A75929E1611J50594Q3439a229j36008D9509g6171
$$ -214747 -316509 -223401 -185889 175929 51611 202205 285644 -1229 -137237 49509 -76171
15749c95723B24313a8502A82245b053E64661E5611l057J13861K00705j24498a51362
$$ -395723 224313 -18502 182245 -2053 564661 55611 52554 166415 367120 242622 -151362
15737b34476H3736b5139m0050k44106a38268k02214e7328E379b0334j61755L5471
$$ -234476 83736 -25139 -65189 -309295 -138268 -340482 -57328 5379 -20334 -182089 -146618
15726a46618K1343k08417a57965A36040Q2790p9780f1958m03129B06302a8798
$$ -146618 -125275 -333692 -157965 136040 218830 139050 -61958 -465087 206302 -18798
15715A26023N8503a99392P7621C8089b20333B9332a87355A2407b81106a1192B1625
$$ 126023 184526 -199392 -121771 38089 -220333 29332 -187355 12407 -281106 -11192 21625
15703E7268a36486j62007P3880B710a951A54470j1806l0152a59785D6446J21442
$$ 57268 -136486 -298493 -224613 2710 -1951 154470 142664 112512 -159785 46446 167888
15692A67888a05885m8381B95441C3570J54444a9754B49703a8173B38087b91955
$$ 167888 -105885 -154266 295441 33570 188014 -19754 249703 -18173 238087 -291955
15681b7475k3263j59342B08603a56471M8017G6553d29205J68805i7554A00775
$$ -27475 -50738 -210080 208603 -156471 -108454 76553 -429205 -260400 -97554 100775
15670d2367p6922E0430j8230J15763J31514m3912a3293B779M1335c8840j22727
$$ -42367 -119289 50430 32200 147963 279477 235565 -13293 2779 44114 -38840 -161567
15659a61567J3441B80966h3844j89318K0728c6329A18178B7833a67258M4931j64849
$$ -161567 -148126 280966 -83844 -273162 -252434 -36329 118178 27833 -167258 -122327 -287176
15648b87176G0598b03070C19620G1884a74613J0843B53301A09855L3248a59382
$$ -287176 70598 -203070 319620 71884 -174613 -163770 253301 109855 143103 -159382
15637c91104A63050B3897J37908b79690e3244A42602b74637H9194K34841B5591
$$ -391104 163050 23897 161805 -279690 -53244 142602 -274637 89194 324035 25591
15626I6887J28439b14237A99108c07890B40510m227N415L6433G3185Q6609a17385
$$ 96887 225326 -214237 199108 -307890 240510 236283 241698 278131 73185 159794 -117385
15614b5515A03591a38665a8457B50546a41104j75462C5718a27435A33369n5570
$$ -25515 103591 -138665 -18457 250546 -141104 -316566 35718 -127435 133369 77799
15604G7799a40226k8155A23800a24501A85662f7681B01416F1593c32466D28862
$$ 77799 -140226 -168381 123800 -124501 185662 -67681 201416 61593 -332466 428862
15593b05938A85052D5338d33635G9501a26924A25921J00987N4439a73201O5906
$$ -205938 185052 45338 -433635 79501 -126924 125921 226908 281347 -173201 -107295
15583a07295M3398B50846a82353d9084A36976d7491d45A6757c47965f280A02677
$$ -107295 -63897 250846 -182353 -49084 136976 -47491 -445 16757 -347965 -6280 102677
15571b1275k27565j11412A14233b53263A9397J52556a7959j92962M8735A48896
$$ -21275 -248840 -360252 114233 -253263 19397 171953 -17959 -210921 -162186 148896
15560A46122L369J4440Q5189a46935G1077J45514H5000a25539A8334L98313b05585
$$ 146122 149491 163931 249120 -146935 71077 216591 85000 -125539 18334 416647 -205585
15548g0390G6398b28073B01141h7948F9464d1088J7945n9622F5230g0477B35783
$$ -70390 76398 -228073 201141 -87948 69464 -41088 -23143 -82765 65230 -70477 235783
15536b23872B99681F0435a73948j42327b4572o7629c4779j50638K1274B08033
$$ -223872 299681 60435 -173948 -316275 -24572 -92201 -34779 -185417 -164143 208033
15525e69B577O2414h6266P521p378A41949a1194A09896O3546f2890j89798P9910
$$ -569 2577 64991 -86266 -78745 -86123 141949 -11194 109896 173442 -62890 -252688 -172778
15513a72778h2563j50734B456c19916a2523k10096I6867C1971b98081A36747B19
$$ -172778 -82563 -233297 2456 -319916 -12523 -222619 96867 31971 -298081 136747 219
15501c06216C619a77611A69626b2061j49593d528j30884K5041B41860I5556N4243
$$ -306216 3619 -177611 169626 -22061 -171654 -4528 -135412 -110371 241860 95556 149799
15490A49799c29118J39345D9766a42562l33277J54648I6403L6854n2527c45749
$$ 149799 -329118 -189773 49766 -142562 -475839 -321191 96403 133257 80730 -345749
15479b4938F5624a5399k24879B2091b7568H8054A7744J0848e0759A82712a57617
$$ -24938 65624 -15399 -240278 22091 -27568 88054 17744 28592 -50759 182712 -157617
15467A28519k4814b75961B47674a85714l9272A85857o1019b66715A65150o8114
$$ 128519 103705 -275961 247674 -185714 -224986 185857 124838 -266715 165150 97036
15457I7036a32963d7872R984k5713c0203B56842a9269D7897K23371h1816B4037
$$ 97036 -132963 -47872 -37888 -63601 -30203 256842 -19269 47897 271268 -81816 24037
15445A0262K05710b42841A85075K22977c6569A08864K7304l3554C6832b75734
$$ 10262 215972 -242841 185075 408052 -36569 108864 136168 102614 36832 -275734
15434b3794D7778b66708l6569B77257C4994i2197A04699a43783N8090a0253j2536
$$ -23794 47778 -266708 -303277 277257 34994 -92197 104699 -143783 -85693 -10253 -22789
15423b2789o2338B9697J6863K05529a06420A14219d75019B65739j17904A494b05710
$$ -22789 -85127 29697 46560 252089 -106420 114219 -475019 265739 147835 1494 -205710
15411B6690f9403B06344c14192a09597A20617a82223R0800H2902a21878B1653
$$ 26690 -69403 206344 -314192 -109597 120617 -182223 -91423 82902 -121878 21653
15400D9783A7176i0741G3246K6259a65143J6363j13906d3640j12041A53094i6034
$$ 49783 17176 -90741 73246 99505 -165143 -148780 -262686 -43640 -155681 153094 -96034
15388B38147j14661j7135b0701D1626K00204b50596B54489a00182L7500a5665
$$ 238147 123486 106351 -20701 41626 241830 -250596 254489 -100182 -62682 -15665
15377a5715D0079K52968D7540c72673h4654B34874c51184M3428B05905J73951
$$ -15715 40079 293047 47540 -372673 -84654 234874 -351184 -307756 205905 379856
15367C79856A54524l1607a24474A0214i1345B73477c2372n2212b1534k95271J17229
$$ 379856 154524 122917 -124474 10214 -91345 273477 -32372 -84584 -21534 -316805 -199576
15356a99576B21083q9852a18263M3876A40195n8126a49045a4171A70829l6811
$$ -199576 221083 131231 -118263 -74387 140195 82069 -149045 -14171 170829 134018
15346A34018a19876B6310J67964A9796L05312j37146J12295b0861A25058a08092
$$ 134018 -119876 26310 194274 19796 325108 187962 300257 -20861 125058 -108092
15335i4117A81302H9347L0650A6638b36010G2474R2458J02220b80409i6778a8281
$$ -94117 181302 89347 119997 16638 -236010 72474 164932 267152 -280409 -96778 -18281
15323I3574c1525A26612b36311N8144B3523a08382C03452A12133n5516c88117
$$ 93574 -31525 126612 -236311 -178167 23523 -108382 303452 112133 56617 -388117
15312a76687h0497A75902l1835n0790R5876J11825m2774d0210j0323A46226a41278
$$ -176687 -80497 175902 144067 93277 189153 300978 258204 -40210 -50533 146226 -141278
15300a17899J8527C66426a65710B738J98004m1645J27417q4306J03171F3944a84380
$$ -117899 -99372 366426 -165710 2738 200742 159097 286514 202208 305379 63944 -184380
15288A26600k9768C1648J4043P1412C7280L95271a3687n3140j78069J09003p504
$$ 126600 96832 31648 45691 117103 37280 432551 -13687 -66827 -244896 -135893 -143397
15277a43397A00548a18234C37928g3000k76188C13005a32587M9693C10313A34727
$$ -143397 100548 -118234 337928 -73000 -349188 313005 -132587 -82894 310313 134727
15266a25368B84576g4126B0653a97503A93603o9691J5491M6934L92088B48335
$$ -125368 284576 -74126 20653 -197503 193603 123912 139403 186337 578425 248335
15255h7653I4343L0468l3241l4807h5857b8656C61775h3466A63346K58296O6566
$$ -87653 94343 124811 91570 56763 -85857 -28656 361775 -83466 163346 421642 488208
15244D88208M33687L18743J555724m50343k75450R25313A138131C97094J2799
$$ 488208 921895 1240638 2796362 2346019 2070569 2995882 1138131 397094 409893
15235D09893j41333K3558g686A08002B0422N4J07302J57940j39399L3563j1280
$$ 409893 268560 292118 -7686 108002 20422 20476 127778 285718 146319 179882 168602
15224A68602R0117a82063H4949K49470h917I2855a24061C4007J06136J61029c3033
$$ 168602 258719 -182063 84949 334419 -8917 92855 -124061 34007 140143 301172 -33033
15212g9010l1422L4973C78987E8958J13984a44787D12539G3793J43085c6684A61797
$$ -79010 -110432 -75459 378987 58958 172942 -144787 412539 73793 216878 -36684 161797
15200c6413o9007n4469A66614g6873A75813b8141D9133A5537K72113L7660g0275
$$ -36413 -105420 -159889 166614 -76873 175813 -28141 49133 15537 287650 325310 -70275
15188a18876c1063B12307b65598A37570M3875M6299a18567A19166P740R6975a77119
$$ -118876 -31063 212307 -265598 137570 181445 227744 -118567 119166 126906 223881 -177119
15176e1974A37766A9477M36665a18409d187l11641a56852n7134c8695F2105K70487
$$ -51974 137766 19477 456142 -118409 -4187 -315828 -156852 -213986 -38695 62105 332592
15165C32592a85849M2326G0262b59720C27446a93086Q7973A999K06697J70560
$$ 332592 -185849 -143523 70262 -259720 327446 -193086 -105113 1999 208696 379256
15155C79256b3948B04594a24299F8045i5377B24047F7632I210b9943D3727a30861
$$ 379256 -23948 204594 -124299 68045 -95377 224047 67632 9210 -29943 43727 -130861
15143F21110j72669c3872D20876I8158a47914A95573F9391J20650F5860a26560
$$ 621110 448441 -33872 420876 98158 -147914 195573 69391 190041 65860 -126560
15132C08770n7242Q0166q3170l8928O8691h6727o839A00822a05742A57261n3090
$$ 308770 251528 331694 248524 209596 278287 -86727 -93566 100822 -105742 157261 104171
15121A04171O0885F0530K91879n7805K16753A1987L55661I5010c0215m6116K6987
$$ 104171 165056 60530 352409 294604 511357 11987 367648 95010 -30215 -76331 -49344
15110d9344F12324e9102B16815G4293J28780P8508c3281I5167a9496q1313H2655
$$ -49344 612324 -59102 216815 74293 203073 281581 -33281 95167 -19496 -100809 82655
15098b9912B13800q5175b067B53045j03968G2140h5885B87251k5835P9379j13878
$$ -29912 213800 128625 -2067 253045 149077 72140 -85885 287251 261416 340795 226917
15087B26917d5023B21998K34062E9986N9149J53622G4456J0224K2917e3687B16193
$$ 226917 -45023 221998 456060 59986 119135 272757 74456 84680 107597 -53687 216193
15075a83910g6645D14339I0504a64813C59070A59353C9873J28413I761e1150F0412
$$ -183910 -76645 414339 90504 -164813 359070 159353 39873 168286 9761 -51150 60412
15063A27706K5382j2947J55314A58J8803M9615K08453j00105m7139D9732a06526
$$ 127706 153088 140141 295455 158 18961 68576 277029 176924 129785 49732 -106526
15051h358B00090b89700C27488r0978q5656c4228I5966K08038j31096F4189r344
$$ -8358 200090 -289700 327488 236510 150854 -34228 95966 304004 172908 64189 54845
15040E4845K75608j01425i831C64889m3006A42270K1261F4225L09414r9997H2688
$$ 54845 330453 229028 -9831 364889 321883 142270 163531 64225 373639 273642 82688
15028I7090J27110J68038j53748b46514A23867K49709m5077a26887B36002A12773
$$ 97090 224200 392238 238490 -246514 123867 373576 328499 -126887 236002 112773
15017C22830l5536o6502J70169b9868A74748H0560J25974j2512J8948F7319J37489
$$ 322830 287294 220792 390961 -29868 174748 80560 206534 194022 212970 67319 204808
15006B04808M7526F3662K38982j9979a8637A19074N0018n9841m9728J85393o2256
$$ 204808 252334 63662 302644 282665 -18637 119074 169092 109251 59523 244916 182660
14995A82660K98297A94451o7436N8740b297C33191H2374K78850n7287E0023K22358
$$ 182660 480957 194451 127015 185755 -2297 333191 82374 361224 303937 50023 272381
14984B72381L6576K37856E0256N33983I1343J31964q7626J36861J56748B08352
$$ 272381 308957 546813 50256 584239 91343 223307 135681 272542 429290 208352
14973E0260K5228J4349L49492F9106e532D67069j72107F2591K85912B5349K42013
$$ 50260 75488 89837 439329 69106 -5532 467069 294962 62591 348503 25349 267362
14962B67362A03580M55720a19970k3115D97597B22082L62178B53493J48809K017
$$ 267362 103580 559300 -119970 -143085 497597 222082 584260 253493 402302 404319
14952D04319A40254L13089B25916r8372A1560M5960Q9513K93101A10473B4895
$$ 404319 140254 453343 225916 127544 11560 57520 147033 440134 110473 24895
14941B18383K02356B8072J98221L583j8686J65040L14564C25388A02717R9211
$$ 218383 420739 28072 226293 229876 211190 376230 690794 325388 102717 201928
14931B01928o4382N97687C01611I4258L00730N1115F422N12223o3314A74306L09840
$$ 201928 137546 735233 301611 94258 394988 446103 6422 518645 455331 174306 484146
14920D84146d5544C92582o1208A8797M36491F3064L06062j82198J97320J23084
$$ 484146 -45544 392582 331374 18797 455288 63064 369126 186928 384248 507332
14910E07332L4065k35448J92731j20672j66374P7815j11568J02996j8232J51037
$$ 507332 541397 305949 498680 378008 211634 289449 177881 280877 262645 413682
14900D13682j41712K69508A93226H8388P4097J09345R061I9035L12790j92420
$$ 413682 271970 541478 193226 88388 162485 271830 280891 99035 411825 219405
14890B19405P6024K53526b823B09821k9708J44922Q2433m3297M7876m2080K15609
$$ 219405 295429 548955 -2823 209821 180113 325035 407468 364171 412047 369967 585576
14879E85576B29482J65447n6152j4049P0907K8035P7451A48121K87952l5593M03842
$$ 585576 229482 394929 338777 324728 395635 423670 501121 148121 436073 400480 804322
14868H04322C58868J13754B32926H4554J26131K02979a35327C19153L4590K38693
$$ 804322 358868 472622 232926 84554 210685 413664 -135327 319153 353743 592436
14858E92436A88216K58455J5656l6627A2437L87739A64910K29267L49119A60684
$$ 592436 188216 446671 462327 425700 12437 400176 164910 394177 743296 160684
14847D28608J09846A38557J14321J30706J55967j00335O0037m7539j19372J41544
$$ 428608 538454 138557 252878 383584 539551 439216 499253 451714 332342 473886
14837D73886J15903M0022A55381N63733A95139O01782C64389j52040L60555k6157
$$ 473886 589789 629811 155381 719114 195139 796921 364389 212349 572904 546747
14827E46747R8374j85018O6021B49323J91817q630j90081J30244L22375j46569
$$ 546747 645121 460103 526124 249323 441140 432510 242429 372673 695048 548479
14817E48479O1434O0272k66664K49374j85821j06081K23800j08769J95390O6499
$$ 548479 609913 670185 403521 652895 467074 360993 584793 476024 671414 737913
14807G37913l15877K00261j65716k8750J30582P8881l13479J94375M67946m76938
$$ 737913 422036 622297 456581 427831 558413 637294 323815 518190 986136 509198
14797E09198p4175j9274J57804B38708L92212K9182j3096k01208J86593j0802
$$ 509198 435023 415749 573553 238708 630920 660102 647006 445798 632391 621589
14787F21589B78244M77238j81623r5060O6080m9261j05228J04209p7675N6533
$$ 621589 278244 755482 573859 478799 544879 495618 390390 494599 416924 473457
14777D73457J03575J50195j78865N5175k04233K80317j47892m654K64554P4545
$$ 473457 577032 727227 548362 603537 399304 679621 531729 527075 791629 866174
14767H66174j77715l03466J13918A37428M32524q595j83648L26812M8034J18386
$$ 866174 688459 384993 498911 137428 569952 561357 377709 704521 752555 870941
14757H70941l85078K37145k1907P7574o9523J59019l53701J30464J01592l18702
$$ 870941 485863 723008 701101 778675 709152 868171 514470 644934 746526 427824
14747D27824L65571C20292L58133J793O9247J02183k47026j02576L61723j1292
$$ 427824 793395 320292 678425 680218 749465 851648 604622 502046 863769 852477
14737H52477R9192o8076O719j96790l09181P0148L17144k3507K2863l7096L5963
$$ 852477 951669 883593 890312 693522 384341 454489 771633 748126 770989 733893 769856
14726G69856j64104r0759j02923M28971j9281k3270L36385l16757M0019J32449
$$ 769856 605752 514993 412070 841041 821760 798490 1134875 818118 858137 990586
14716I90586m54105J07303L77066m58781K74559p6943J72660N6501J49234m17739
$$ 990586 536481 643784 1020850 562069 836628 759685 932345 988846 1138080 720341
14706G20341p4753M27819j74232j69038J13755J92643l35248L8480J77764q7007
$$ 720341 645588 1073407 899175 730137 843892 1036535 701287 739767 917531 830524
14696H30524l0674k34598j8347L67774o8381J1461K87736n63231K44927k42874
$$ 830524 799850 565252 546905 914679 846298 857759 1145495 582264 827191 584317
14686E84317K03984j7403J72783l8828j2868K75896k86862J21062J50168m15964
$$ 584317 788301 770898 943681 904853 891985 1167881 881019 1002081 1152249 736285
14676G36285L03062R2667k97064q567M88542k85503P599M44804l80862o6382K43824
$$ 736285 1039347 1132014 834950 826383 1314925 1029422 1037021 1481825 1100963 1034581 1278405
14665A278405j41104o3705o6249J43044p8912k63129N85786k6069k90396o7122
$$ 1278405 1137301 1073596 1007347 1150391 1071479 808350 1394136 1368067 1077671 1010549
14655A010549J49294j515k08488M29254m67547K90917q6719K03973k67249J81591
$$ 1010549 1159843 1158328 949840 1379094 911547 1202464 1115745 1319718 1052469 1234060
14645A234060j01734K37181j83803k50717L78770k33798K57764l3843J24898N8671
$$ 1234060 1132326 1369507 1185704 934987 1313757 1079959 1337723 1303880 1428778 1487449
14635A487449l45889J04075J50017r1265r062J63844r8191Q4182L38269m62006
$$ 1487449 1141560 1245635 1395652 1304387 1295325 1459169 1360978 1445160 1783429 1321423
14625A321423J13314m54845L77975m5925L53707l86345J80478l64341L25554n6489
$$ 1321423 1434737 979892 1357867 1311942 1665649 1279304 1459782 1095441 1420995 1364506
14615A364506N7746P5518P3940r5665j37276K11920o8307K20073P5655j89898
$$ 1364506 1422252 1497770 1571710 1476045 1338769 1550689 1482382 1702455 1778110 1588212
14605A588212q1027j08552L5982K72634K82742m91003J61845j03130k0953M88697
$$ 1588212 1507185 1398633 1434615 1707249 1989991 1498988 1660833 1557703 1536750 2025447
14595B025447k71203p5271k77383L24939J80106K6605l1901k52612M34873m79173
$$ 2025447 1754244 1678973 1401590 1726529 1906635 1933240 1901339 1648727 2083600 1604427
14585A604427J26994l8192L25070k94143M40507j88670m570j38748j07395M02096
$$ 1604427 1731421 1693229 2018299 1724156 2164663 1975993 1971423 1832675 1725280 2127376
14575B127376J03826m394j36069K37736k6660o6703J2913J99317L6518k60608
$$ 2127376 2231202 2226808 2090739 2328475 2301815 2235112 2248025 2447342 2483860 2223252
14565B223252L95279l20923J65270O2724M9819K55691j12051J82918J40146K64497
$$ 2223252 2618531 2297608 2462878 2525602 2575421 2831112 2719061 2901979 3042125 3306622
14555C306622l05308L68222J45562O90080K21646J154556J760007L248849P247815
$$ 3306622 3001314 3369536 3515098 4205178 4426824 5581380 7341387 10590236 17838051
14546A7838051J8619033J5994846B4782159H826277m302929j432181K49607j72525
$$ 17838051 36457084 52451930 24782159 8826277 4523348 3091167 3340774 3168249
14538C168249J324133K940539k828455k072599j11423k05329P6896K41157k59926
$$ 3168249 4492382 7432921 4604466 2531867 2420444 2215115 2292011 2533168 2273242
14529B273242J26949L754k22581k69636K16338O9464m5274n6055M20680K04101
$$ 2273242 2400191 2403945 2181364 1911728 2128066 2197530 2152256 2096201 2516881 2720982
14519B720982j54434Q572R523k08948J00214k217j54003N20635q2623p0782L54236
$$ 2720982 2566548 2575120 2584643 2375695 2475909 2473692 2319689 2840324 2757701 2686919 3041155
14508C041155k48170K96956N2707p5259Q0529J93088j53579j94067K27540m48195
$$ 3041155 2792985 3089941 3142648 3067389 3147918 3341006 3187427 2993360 3220900 2772705
14498B772705N87746j47680J02072N00857l80472J19163m1305J98173l73641P9977
$$ 2772705 3360451 3212771 3314843 3815700 3435228 3554391 3513086 3711259 3337618 3417595
14488C417595J87643k83098M43116K60917l49516K78697m93500L32549L223j19374
$$ 3417595 3605238 3322140 3765256 4026173 3676657 3955354 3461854 3794403 3797626 3678252
14478C678252O13916k86157j85317J34153L38111J12343k49288K02259L86064
$$ 3678252 4292168 4006011 3820694 3954847 4292958 4405301 4156013 4358272 4744336
14469D744336j43513j24283l0177j36461L05191j16565J61829j70380K10260K30691
$$ 4744336 4600823 4476540 4446363 4309902 4615093 4498528 4660357 4489977 4700237 4930928
14459D930928J12337L80990m15956J38532k61910O00112q8420m0341k30641M38750
$$ 4930928 5043265 5424255 5008299 5146831 4884921 5485033 5396613 5356272 5125631 5564381
14449E564381k93619K35535J8120k2385N07985j50947P443M76949j44384k34484
$$ 5564381 5270762 5506297 5524417 5502032 6010017 5859070 5866513 6343462 6199078 5964594
14439E964594M80793l09963J23648K26078l7807K83609P3351m3209J46444j6239
$$ 5964594 6445387 6135424 6259072 6485150 6447343 6730952 6804303 6761094 6907538 6891299
14429F891299K91692r4688J79949J507J78486J24245N9746j80185K52521N77484
$$ 6891299 7182991 7088303 7268252 7269759 7448245 7572490 7632236 7452051 7704572 8282056
14419H282056j58202J36852J75297r0684K87578j04913K17363j79893M36804K21765
$$ 8282056 8123854 8260706 8436003 8345319 8632897 8527984 8745347 8565454 9002258 9224023
14409I224023J29622j81281J53555K64409J65868L69278K74526k94684O01340
$$ 9224023 9353645 9172364 9325919 9590328 9756196 10125474 10400000 10105316 10706656
14400A0706656j42813O73507P5526j39618K45254m0092L92109Q2485M16774j30917
$$ 10706656 10563843 11237350 11312876 11173258 11418512 11378420 11770529 11853014 12269788 12138871
14390A2138871O13212k05682N33766K55394m1942L29883M31645J39851L72260
$$ 12138871 12752083 12546401 13080167 13335561 13293619 13623502 14055147 14194998 14567258
14381A4567258M3227O64622K18409K64101Q4296R2546O67405L10653K73983N77030
$$ 14567258 14610485 15275107 15493516 15757617 15841913 15934459 16601864 16912517 17186500 17763530
14371A7763530J929M46373L10413K43044J04115O63939K54534R63890K05034K90654
$$ 17763530 17765459 18211832 18522245 18765289 18869404 19533343 19787877 20751767 20956801 21247455
14361B1247455L34093J120119J30306Q27802K87965N08272P76723L89714J008555
$$ 21247455 21581548 22701667 22831973 23659775 23947740 24456012 25232735 25622449 26631004
14352B6631004L38632N09413O85998N67988R24655O15048Q10798Q24046Q04484
$$ 26631004 26969636 27479049 28165047 28733035 29657690 30272738 31083536 31907582 32712066
14343C2712066P40886J165997N28378J560424R51194R28471J002503J149033J286226
$$ 32712066 33452952 34618949 35147327 36707751 37658945 38587416 39589919 40738952 42025178
14334D2025178J262116J279669J303760J565864J158528J625629J633606J784973
$$ 42025178 43287294 44566963 45870723 47436587 48595115 50220744 51854350 53639323
14326E3639323J739417J607737K287527K031355J786362K419695K330126K740696
$$ 53639323 55378740 56986477 59274004 61305359 63091721 65511416 67841542 70582238
14318G0582238K446232K412959K680351L266129K902703L771148L528361L652264
$$ 70582238 73028470 75441429 78121780 81387909 84290612 88061760 91590121 95242385
14310I5242385L817351L972510M385877M889004M936792N279263N530070N783315
$$ 95242385 99059736 103032246 107418123 112307127 117243919 122523182 128053252 133836567
14302A33836567O185647O676222P336737P212659Q051853Q202142Q633592R477843
$$ 133836567 140022214 146698436 154035173 161247832 169299685 177501827 186135419 195613262
14294A95613262R959782J0552272J0947706J2018680J2220260J2832885J3412065
$$ 195613262 205573044 216125316 227073022 239091702 251311962 264144847 277556912
14287B77556912J4095150J4639178J5285801J5609292J5667660J6208903J6112283
$$ 277556912 291652062 306291240 321577041 337186333 352853993 369062896 385175179
14280C85175179J5941547J5285864J4836663J3888549J2675841J0844959P207754
$$ 385175179 401116726 416402590 431239253 445127802 457803643 468648602 475856356
14273D75856356J971974J704681N29107l02655k206504l795734o132567q261309
$$ 475856356 477828330 479533011 480062118 479759463 477552959 473757225 467624658 459363349
14265D59363349r712490j1661149j2945764j4271880j5356351j6159910j6447767
$$ 459363349 449650859 437989710 425043946 410772066 395415715 379255805 362808038
14258C62808038j6585462j6066779j6223441j5653780j5177398j4191740j3936701
$$ 362808038 346222576 330155797 313932356 298278576 283101178 268909438 254972737
14251B54972737j3099001j2664222j1782819q927311r572685j0458559r740228
$$ 254972737 241873736 229209514 217426695 208499384 198926699 188468140 178727912
14244A78727912q037785q314168p870492p425377o630295o884524n555430n117894
$$ 178727912 170690127 162375959 154505467 147080090 140449795 133565271 128009841 122891947
14236A22891947n812041n015756m688203m754113m163197l420904l675465l779067
$$ 122891947 117079906 112064150 107375947 102621834 98458637 95037733 91362268 87583201
14228H7583201l425529l598718k687941l091348k728051k800256k238956k536481
$$ 87583201 84157672 80558954 77871013 74779665 72051614 69251358 67012402 64475921
14220F4475921j895276j882118j874127k234601j759303j840621j581698j320893
$$ 64475921 62580645 60698527 58824400 56589799 54830496 52989875 51408177 50087284
14212E0087284j580637j416516j404768j400531j134959n68821j132540j453565
$$ 50087284 48506647 47090131 45685363 44284832 43149873 42581052 41448512 39994947
14204C9994947j263074j454358r16352q64305m40141r73269r72624j083974j038815
$$ 39994947 38731873 37277515 36361163 35496858 35056717 34083448 33110824 32026850 30988035
14195C0988035n15804o25678n54507q73915o57356n05642r36596o60928l82710
$$ 30988035 30472231 29846553 29292046 28418131 27760775 27255133 26318537 25657609 25274899
14186B5274899p72230n97683p91196J19480j153821q7966l67237l88758m18650
$$ 25274899 24502669 23904986 23113790 23233270 22079449 21991483 21624246 21235488 20816838
14177B0816838k53030n47019o56150J3391l60914o39210l87618k72905n55186
$$ 20816838 20563808 20016789 19360639 19374030 19013116 18373906 17986288 17713383 17158197
14168A7158197j68721q22256M26474o37537l33333m6082n5762m02161n39304m31832
$$ 17158197 16989476 16167220 16593694 15956157 15622824 15576742 15520980 15118819 14579515 14147683
14158A4147683k4412k43866l78475J73569m89157j80293k96714k54268p2252k93066
$$ 14147683 14123271 13879405 13500930 13674499 13185342 13005049 12708335 12454067 12381815 12088749
14148A2088749J55729m15902k78459n89944L51951M9895k98829m92531R0503j53374
$$ 12088749 12244478 11828576 11550117 10960173 11312124 11362019 11063190 10570659 10661162 10507788
14138A0507788m09807J21846j87216k22807J73145l92829j63008j19794N7346
$$ 10507788 10097981 10219827 10032611 9809804 9982949 9590120 9427112 9307318 9364664
14129I364664n45595l5993Q8031J02570m91549j9833o6555k72581j39307o5751
$$ 9364664 8819069 8783076 8871107 8973677 8482128 8462295 8395740 8123159 7983852 7918101
14119G918101k2924J04712k58493l08360j51650K6041L82615o32648q6589R0573
$$ 7918101 7895177 7999889 7741396 7433036 7281386 7307427 7690042 7057394 6970805 7061378
14109G061378l67313L28661o45907K27718j10146j32534K44045l00283L04763
$$ 7061378 6694065 7022726 6376819 6604537 6494391 6361857 6605902 6305619 6610382
14100F610382q0963n46826Q4278k41273r5733L24661n76194L41997r0513J0031
$$ 6610382 6529419 5982593 6066871 5825598 5729865 6054526 5478332 5820329 5729816 5739847
14090E739847j39448k49001l31009L61944j71425k94476m199j29983m5916J95790
$$ 5739847 5600399 5351398 5020389 5382333 5210908 4916432 4912233 4782250 4736334 4932124
14080D932124R4814k35501O6161j80379N7386K51963l39649O4218K60683k80621
$$ 4932124 5026938 4791437 4857598 4677219 4734605 4986568 4646919 4711137 4971820 4691199
14070D691199n17986L24399k11480j43083j08252K76034j5433k34447q0952j6140
$$ 4691199 4173213 4497612 4286132 4143049 4034797 4310831 4295398 4060951 3979999 3963859
14060C963859J82384L25574k53032K91241k48660k74386J8321l92638J33586q7689
$$ 3963859 4146243 4471817 4218785 4510026 4261366 3986980 4005301 3612663 3746249 3658560
14050C658560R2761Q0255r0991J2246n5274k71434k77475L53536k74458J51393
$$ 3658560 3751321 3831576 3740585 3752831 3697557 3426123 3148648 3502184 3227726 3379119
14040C379119j33239l8261k11404L89117J49315n48711O8283M7957j19967J89107
$$ 3379119 3245880 3207619 2996215 3385332 3534647 2985936 3054219 3102176 2982209 3171316
14030C171316J4452L1990j47885J59067j01467o5821j94077m8708r1190J1830
$$ 3171316 3185768 3217758 3069873 3228940 3127473 3061652 2867575 2818867 2727677 2739507
14020B739507j84214r8160J63900J92295k40134K29308j88012p5897K25989k86916
$$ 2739507 2555293 2457133 2621033 2813328 2573194 2802502 2614490 2538593 2764582 2477666
14010B477666l18976N35120k53008L2320j55873P6403P8669k02295j9380j16444
$$ 2477666 2158690 2693810 2440802 2473122 2317249 2393652 2472321 2270026 2250646 2134202
14000B134202P1130M0766l10723R563K54468q544p6065k24684J96449K51249K11131
$$ 2134202 2205332 2246098 1935375 1944938 2199406 2190862 2114797 1890113 2086562 2337811 2548942
13989B548942R70137K141432N051037J6168316K6411463k0817312A5046479o487421
$$ 2548942 3519079 5660511 10711548 26879864 53291327 32474015 15046479 8559058
13981H559058k628519j376025m26371l82804j80916l40281k85060K6359M4027
$$ 8559058 5930539 4554514 4128143 3745339 3564423 3224142 2939082 2965441 3009468
13972C009468n31824J27999j80474L34421J52621k84417j49759l71363M23771
$$ 3009468 2477644 2605643 2425169 2759590 2912211 2627794 2478035 2106672 2530443
13963B530443o2727l10480l1902N5297L03256k91677j89076j1556Q5265J00428
$$ 2530443 2467716 2157236 2125334 2180631 2483887 2192210 2003134 1991578 2076843 2177271
13953B177271J003k06311J59122k72886l1933M0380m6719r7189K71351j72020
$$ 2177271 2178274 1971963 2131085 1858199 1826266 1866646 1819927 1722738 1994089 1822069
13943A822069K43123k81026j36812O26795p9783m87216K43379j21594n41398N38921
$$ 1822069 2065192 1784166 1647354 2274149 2194366 1707150 1950529 1828935 1287537 1826458
13933A826458l75181O34842k11375l59957J37797J75660k11523L8043l26502N66973
$$ 1826458 1451277 2086119 1874744 1514787 1652584 1828244 1616721 1654764 1328262 1895235
13923A895235j67918R9326n92908L84820k45191K98115l39903J28583j12262J23072
$$ 1895235 1727317 1826643 1233735 1618555 1373364 1671479 1331576 1460159 1347897 1470969
13913A470969J37793q0303L5343j2643j59095K56818j50390L4883l33067O00699
$$ 1470969 1608762 1528459 1563802 1551159 1392064 1648882 1498492 1533375 1200308 1801007
13903A801007j31111j8292l95355N5231L99062o21186L97053k2767m55773L54702
$$ 1801007 1669896 1651604 1256249 1311480 1710542 1089356 1486409 1463642 1007869 1362571
13893A362571J80864j98219J38337N504m09775J75268j07754R8755J39734k57939
$$ 1362571 1543435 1345216 1483553 1489057 1079282 1254550 1146796 1245551 1385285 1127346
13883A127346k85904L89897L4907l9556j0782j67006K57938R6599J28004n9833
$$ 1127346 841442 1231339 1266246 1226690 1215908 1048902 1306840 1403439 1531443 1471610
13873A471610m40751r692J8523J83486O6784k45558m4001J85361j46601N8819
$$ 1471610 1030859 1021167 1039690 1223176 1289960 1044402 1000401 1185762 1039161 1097980
13863A097980L7676K24565k82454m9916j26216J63139J72140l05139M94792m79071
$$ 1097980 1135656 1360221 1077767 1027851 901635 1064774 1236914 931775 1426567 947496
13853I47496O388J26684M2777m7482j21411K55921j76457q2006L13140j14560
$$ 947496 953884 1080568 1123345 1075863 954452 1210373 1033916 951910 1265050 1150490
13843A150490k17437N3438M9297N6029k97546K16204K08686K02638E50515N69341
$$ 1150490 933053 986491 1035788 1091817 794271 1010475 1219161 1421799 550515 1119856
13833A119856k44825K35543m37587N50170j40739l0188j51977O3702N52k2347
$$ 1119856 875031 1110574 672987 1223157 1082418 1052230 900253 963955 964507 942160
13823I42160j14898j26066L25943J24316j56344k50736K07170k354K50325k34140
$$ 942160 827262 701196 1027139 1151455 995111 744375 951545 949191 1199516 965376
13813I65376j99115J61298j5233k05466O5027M40539m64504K03184K07698n20182
$$ 965376 766261 927559 912326 706860 771887 1212426 747922 951106 1158804 638622
13803F38622K56701j08235P564k56940K71120j7738M67794j75383k68632K0269
$$ 638622 895323 787088 794652 537712 808832 791094 1258888 1083505 814873 835142
13793H35142M7921k99024L34654r2497K19710l96274J10234K5418k20411J73888
$$ 835142 883063 584039 918693 826196 1045906 649632 759866 785284 564873 738761
13783G38761m270J53021r8660k64021L77142l52919O9859L18237k60994j09492
$$ 738761 734491 887512 788852 524831 901973 549054 618913 937150 676156 566664
13773E66664K04382J20421k10042K95797k61456K03051D33606L75087k77426n2772
$$ 566664 771046 891467 681425 977222 715766 918817 433606 808693 531267 478495
13763D78495L48359j35090o1219o1145K27384k44840J32775C27758L92573J00646
$$ 478495 826854 691764 630545 569400 796784 551944 684719 327758 720331 820977
13753H20977j36739q3242k77367N08716p3605j19019j44956P3102K12977A12321
$$ 820977 684238 600996 323629 832345 758740 639721 494765 567867 780844 112321
13742D75832K60751j27630j20569o9107K56809J48792k50128n1663P6652o1909
$$ 475832 736583 608953 488384 419277 676086 824878 574750 523087 599739 537830
13732E37830J93733C38002L94919B28730N62877j08846N5980C55085K72355m4988
$$ 537830 731563 338002 732921 228730 791607 682761 738741 355085 627440 582452
13722E82452K7845l6468j24229O5522p3655P8987k36183K01291R9777k0674m9961
$$ 582452 610297 573829 449600 515122 441467 520454 284271 485562 585339 564665 514704
13711E14704Q8630j02009j4654K835J26667B82795Q160L62294j38698J35199j6660
$$ 514704 603334 501325 486671 489506 616173 282795 290955 653249 514551 649750 633090
13700F33090j26577O9310p7388K06199k97486J33317B33033o9561K61839M15106
$$ 633090 506513 575823 498435 704634 407148 540465 233033 163472 425311 840417
13690H40417k51083j59583L4255A94938M66933B99920K08500N0653k08986M29530
$$ 840417 589334 429751 464006 194938 661871 299920 508420 559073 350087 779617
13680G79617j96773k26895c3058A43633J99742J50456Q6365K3626j22719k20323
$$ 779617 582844 355949 -33058 143633 343375 493831 580196 603822 481103 260780
13670B60780Q6607K43504j2378J97009l18814j84444K35586K34840J76409B61062
$$ 260780 347387 590891 578513 775522 456708 272264 507850 742690 919099 261062
13659G09655m0667k14018r785q8090J71018J71558k7945B94757K30606N3701J81370
$$ 709655 668988 454970 445185 357095 528113 699671 671726 294757 525363 579064 760434
13648G60434j89418A97402N15448k36142j78047k4432J40072q3366N08609k12621
$$ 760434 571016 197402 712850 476708 298661 274229 414301 330935 839544 626923
13638F26923A9200J67332D6714K39564J24535m1913l0664L35157p3894K32239
$$ 626923 19200 186532 46714 286278 410813 368900 338236 673393 599499 831738
13628H31738D09869M35147l10772k8404l2347M5969J25145k18947O2540A85964
$$ 831738 409869 845016 534244 505840 473493 519462 644607 425660 488200 185964
13617A81155J76814K65561B02232L17323k8323A21560L50601L4803q2022m3925
$$ 181155 357969 623530 202232 519555 491232 121560 472161 506964 424942 381017
13607C81017p0720p8435j07797m5129K65577j32396K31959j45503M6624a8830
$$ 381017 310297 231862 124065 78936 344513 212117 444076 298573 345197 -18830
13596D15524k5996J09743j99320K49010q4050I9708L55444J79092A31120O0042
$$ 415524 389528 499271 299951 548961 464911 99708 455152 634244 131120 191162
13586A91162L43615j89163O5051H0173J55684J33887K21468n2186A83867K92644
$$ 191162 534777 345614 410665 80173 235857 369744 591212 539026 183867 476511
13576D76511J09251k14196n8682j50774L25438i1400C87422J923J48608F2872
$$ 476511 585762 371566 312884 162110 487548 -91400 387422 389345 537953 62872
13565F4427L60006A84505L20433B42308J17019j48315F4414L22112A16755M55067
$$ 64427 424433 184505 504938 242308 359327 211012 64414 386526 116755 571822
13555E71822A46747J68540J39415j24773j17889j3616Q2953K71949j63420A81681
$$ 571822 146747 315287 454702 329929 212040 198424 281377 553326 389906 181681
13544C87426l7137A58697J46816K71416B87913l2504J21156J82552B49543A06006
$$ 387426 350289 158697 305513 576929 287913 255409 376565 559117 249543 106006
13533B63545J48702F9366L44995l6368J48988l5629k31168j6698O1129o6542d1880
$$ 263545 412247 69366 414361 377993 526981 491352 260184 243486 304615 238073 -41880
13521I0916M2383K3092m4069n4702N5311m2540K90105Q9095j25495j05216n4880
$$ 90916 133299 156391 112322 57620 112931 70391 360496 449591 324096 218880 164000
13510A64000P7683K2276A21404R4494J77304J50353j97957p5794H0873Q4090J81810
$$ 164000 241683 263959 121404 215898 393202 543555 345598 269804 80873 164963 346773
13499C46773j8585J65581A91514J01608Q7391A35435L67374j30450H3101a87943
$$ 346773 328188 493769 191514 293122 380513 135435 502809 372359 83101 -187943
13488A52842L86973j83899A66347J13183l6586G1089K23608j6352K32750N0984
$$ 152842 539815 355916 166347 279530 242944 71089 294697 278345 511095 562079
13478E62079B15889L4393Q745A16426J11879o2600E7094a39061B00238O9767I0646
$$ 562079 215889 250282 259027 116426 228305 165705 57094 -139061 200238 270005 90646
13466B60962N7254A08566L03685r9642p685G3303L36307k01660J03545G1343L73592
$$ 260962 318216 108566 412251 312609 304924 73303 409610 207950 311495 71343 444935
13455D44935j75359O983l6159J18058Q2513a66335B14258L1563D4745a23885D15363
$$ 444935 269576 276559 240400 358458 440971 -166335 214258 245821 44745 -123885 415363
13443C36536e1219D02156E2811J33640O6042J17169O3997A85088J83702h74C2976
$$ 336536 -51219 402156 52811 186451 252493 369662 433659 185088 368790 -874 32976
13431B38117G9232J12848P8908G1940J77184j0484b2619B60492n9186e2374D02826
$$ 238117 79232 192080 270988 71940 249124 238640 -22619 260492 201306 -52374 402826
13419A51303J52228R3375j73588k95K77330A23578A1807O35152k28355j25644
$$ 151303 303531 396906 223318 223023 500353 123578 11807 646959 418604 292960
13409B92960J0525j15169N49976C26195A33753J72903O515J20547D4635J90419
$$ 292960 303485 188316 738292 326195 133753 306656 313171 433718 44635 235054
13399B35054j00079J17163r8039k9923J21101A15699M0868B204R2098B3853J96415
$$ 235054 134975 252138 154099 124176 245277 115699 156567 2204 94302 23853 220268
13388B20268J22850A24749P0166K21012A19237A7578J90795m8513l4311d280E40059
$$ 220268 343118 124749 194915 415927 119237 17578 208373 159860 125549 -4280 540059
13376D4207M0244K30706J48166j56264p8133J34315I0880J01495M8436J22592
$$ 44207 84451 315157 463323 307059 228926 363241 90880 192375 240811 363403
13366C63403A76574J33465l5663j6616m8188p2450K13837j9477l132a04802A66971
$$ 363403 176574 310039 274376 257760 209572 137122 350959 331482 328350 -104802 166971
13354e4196C94975C1874J03113K77519j02786F6325b2129A76292M71803k21854
$$ -54196 394975 31874 134987 412506 309720 66325 -22129 176292 648095 426241
13344D26241j65358Q2298j55794l0276L81477r0712A99889a20858A51718L87313
$$ 426241 260883 343181 187387 157111 538588 447876 199889 -120858 151718 539031
13334E39031B37936n1575N15971C34990j42786q6944J50327R0375j02967K60463
$$ 539031 237936 186361 702332 334990 192204 105260 255587 345962 242995 503458
13324E03458A04520J24320N0747M8911n7120j6536M6197n6631n8777M809L42294
$$ 503458 104520 228840 279587 328498 271378 254842 301039 244408 185631 190440 532734
13313E32734A49109e464C69298A58518P1900K57208A53487k0770J71463J12526
$$ 532734 149109 -5464 369298 158518 230418 487626 153487 132717 304180 416706
13303D16706j77936o9609a1845E93430B92164j14740G9698N4761A5506K23493
$$ 416706 238770 169161 -11845 593430 292164 177424 79698 134459 15506 238999
13293B38999J56599F237L52061A31792b290j10873j2985i281B86668A06566P9610
$$ 238999 395598 6237 358298 131792 -2290 -113163 -126148 -9281 286668 106566 186176
13282A86176n282J06548J54641k12262P7915K6763b73158C18889a93286e7255
$$ 186176 180894 287442 442083 229821 307736 334499 -273158 318889 -193286 -57255
13271A97725i6935N796A85536p6006c698A73R4502J4704e3316C69182D5180O4501
$$ 197725 -96935 -91139 185536 109530 -3698 173 94675 109379 -53316 369182 45180 109681
13259A09681F851J52859K0523R3983G6875h5710c6656j60484C18017E7956K24837
$$ 109681 6851 159710 180233 274216 76875 -85710 -36656 -197140 318017 57956 282793
13248B82793d3769A20381K22802A53040B2399J27890d7606a4642b44B54329q6964
$$ 282793 -43769 120381 343183 153040 22399 150289 -47606 -14642 -244 254329 167365
13237A67365e9507j94037A23008R2353o5691a55979A46112m4600i6417B48272
$$ 167365 -59507 -253544 123008 215361 149670 -155979 146112 101512 -96417 248272
13226B02461K73080C5317K2521b10652B71806M1114K0668a7392B0229O503e9780
$$ 202461 475541 35317 57838 -210652 271806 312920 333588 -17392 20229 26732 -59780
13214B10812J9412L71917j30843C286O5142c40396F6391K00280K2144b12348F6383
$$ 210812 230224 602141 471298 3286 68428 -340396 66391 266671 288815 -212348 66383
13202A34366N12152H7132a63024n412e8313C15067A01594J41216k5497H1618j2061
$$ 134366 646518 87132 -163024 -168436 -58313 315067 101594 242810 217313 81618 69557
13191F9557K19090a13717D0419a30832o2165C25790G7832e3439k17858b6119m5664
$$ 69557 288647 -113717 40419 -130832 -192997 325790 77832 -53439 -271297 -26119 -71783
13180g1783A32154n3439C0620L27562E2343a70049a8684C93864A36101R5294f2795
$$ -71783 132154 78715 30620 358182 52343 -170049 -18684 393864 136101 231395 -62795
13168B23967b56187F355c3698q8035A19369A1215a78935Q1168A1707J3341M06873
$$ 223967 -256187 6355 -33698 -121733 119369 11215 -178935 -97767 11707 25048 431921
13157D31921k7229A12892d4029j45200D0774J64726E0353b1117D9725h7620j28312
$$ 431921 404692 112892 -44029 -189229 40774 205500 50353 -21117 49725 -87620 -215932
13146b15932a0832m4942k9919a6830l04649C63658e716D3585e6654C8143M85916
$$ -215932 -10832 -55774 -85693 -16830 -321479 363658 -5716 43585 -56654 38143 524059
13135E24059a15156C5658J44298b25355E34772B11919a81569A68097b86097D4794
$$ 524059 -115156 35658 179956 -225355 534772 211919 -181569 168097 -286097 44794
13124C47678l4726L13093b5316K936m1590A58806c52452A87379J83504j38800
$$ 347678 312952 626045 -25316 -22380 -63970 158806 -352452 187379 370883 232083
13114B32083n322O0594A8162J03419R2526l673e0126j2184j91578Q725E9823L9158
$$ 232083 226761 287355 18162 121581 214107 210434 -50126 -62310 -253888 -245163 59823 98981
13102I8981k4333N9325L6199m0770E5105L7642N0522i508k3841G411a38096C03276
$$ 98981 74648 133973 170172 129402 55105 92747 143269 -9508 -33349 7411 -138096 303276
13089F5016c48995A39172A0162R2473g9619j6380C62018A53335K27988l4657A23008
$$ 65016 -348995 139172 10162 102635 -79619 -95999 362018 153335 381323 346666 123008
13077b29592D1935a29066N8643B51434b73597R0788A71044B6425M70382m2127
$$ -229592 41935 -129066 -70423 251434 -273597 -182809 171044 26425 496807 454680
13067D54680a00232O205q325e0324a733C47638A27217a29735A31457J24098L8550
$$ 454680 -100232 -94027 -102352 -50324 -1733 347638 127217 -129735 131457 255555 294105
13056B94105A13815J45846a20805k0752j59426A21083n3953K26257c1530I9280
$$ 294105 113815 259661 -120805 -141557 -300983 121083 67130 293387 -31530 99280
13045A02442L0840B0718f5175l1049C92722j49213i7065B46179F4103J16307J80625
$$ 102442 133282 20718 -65175 -96224 392722 243509 -97065 246179 64103 180410 361035
13034C61035q7037j2401p4789J10565k1078A37783J44496Q945n5224H6968O7900
$$ 361035 273998 261597 186808 297373 276295 137783 282279 291224 236000 86968 154868
13023A54868k7544C4478J2923P6241R1215m5297g7258F2991a35769A87246I2032
$$ 154868 127324 34478 47401 123642 214857 169560 -77258 62991 -135769 187246 92032
13011a11805G930J78113H2405M99890E2554J82511j01068N6706p1519J81170K0577
$$ -111805 7930 186043 82405 582295 52554 235065 133997 190703 119184 300354 320931
13000C20931G6371J10400H7874a1671a483C67420f3939B15981B7219i3214o1557
$$ 320931 76371 186771 87874 -11671 -1483 367420 -63939 215981 27219 -93214 -154771
12989a54771B24045b54880B01165H3742G820L3049a3780H4153A9642K06581a12522
$$ -154771 224045 -254880 201165 83742 7820 40869 -13780 84153 19642 226223 -112522
12977C1978a18695D13987G1492k0363J6830f0400b9523A97195a34852C85199Q604
$$ 31978 -118695 413987 71492 51129 67959 -60400 -29523 197195 -134852 385199 393803
12966C93803j30427I8772a66044A326b9007m3629o1493D9283K44763b60654C21294
$$ 393803 263376 98772 -166044 1326 -29007 -72636 -134129 49283 294046 -260654 321294
12954C37722c8884C088O5126F578a02024E0378Q8328a2912j51543a6606A65958
$$ 337722 -38884 3088 68214 6578 -102024 50378 138706 -12912 -164455 -16606 165958
12942A72116O9098J0416a99640C03030I5993J8465a31263k64331h5820L1103l36890
$$ 172116 241214 251630 -199640 303030 95993 114458 -131263 -395594 -85820 -54717 -391607
12931c91607B35084h4027B18442A04246Q1941G8700b8371A42160F5198b00985
$$ -391607 235084 -84027 218442 104246 186187 78700 -28371 142160 65198 -200985
12920a30581B59159a47281H5098m2413k366K70887K5720d2442B7212J65386c1422
$$ -130581 259159 -147281 85098 42685 40319 311206 336926 -42442 27212 192598 -31422
12908d6829A48868M327a8729j89619L0596B35141P5946A12112j067a13517B08786
$$ -46829 148868 153195 -18729 -208348 -177752 235141 311087 112112 111045 -113517 208786
12896c38690A68979l1e5397m5407g215G2718J844b89794B31104m8488m4554o4288
$$ -338690 168979 168948 -55397 -100804 -7215 72718 74562 -289794 231104 182616 138062 73774
12884G3774J36404o2393i4373C47532b67331A37124e5520B88016a97421e632D62664
$$ 73774 210178 147785 -94373 347532 -267331 137124 -55520 288016 -197421 -5632 462664
12872D1303a35955C0905K4759e1090B22329a50913I1686b0890k54442f7504f197
$$ 41303 -135955 30905 55664 -51090 222329 -150913 91686 -20890 -275332 -67504 -6197
12860A1647N7912a85554d3165A90620H3287b6374G1677k7389N443a13022L8556
$$ 11647 69559 -185554 -43165 190620 83287 -26374 71677 44288 49731 -113022 -74466
12849g4466A58983m8605P0515l9375F6076J39848q3197a2421j12840D8549j2949
$$ -74466 158983 110378 180893 141518 66076 205924 122727 -12421 -125261 48549 35600
12838C5600i6176B42649h4813B12796L9613n0895L228a31171L7732c9001o7980
$$ 35600 -96176 242649 -84813 212796 252409 201514 204742 -131171 -93439 -39001 -106981
12827a06981c0948j61157H6964c2506A46318i5769A94988G8395O6401b21988C67125
$$ -106981 -30948 -192105 86964 -32506 146318 -95769 194988 78395 144796 -221988 367125
12815d6049j44755g6354C68975k4634i4874F3030k1807P9593J69505A7340a72946
$$ -46049 -190804 -76354 368975 344341 -94874 63030 41223 120816 290321 17340 -172946
12803D7795g44k26558B23845c21264d9941o6931d2387j77274B08626J53937A67658
$$ 47795 -744 -227302 223845 -321264 -49941 -116872 -42387 -219661 208626 362563 167658
12791A71504D2763a92716D1247K56440A21645K06056A38925J54852d51801B42639
$$ 171504 42763 -192716 41247 297687 121645 327701 138925 293777 -451801 242639
12780A75272a07864H3626J2580a66998P4913B19840C7093d15114B77775E9161
$$ 175272 -107864 83626 96206 -166998 -92085 219840 37093 -415114 277775 59161
12769B75576n8397a73071j08438p593C4940J16662e6727j06921E3453A0912a837
$$ 275576 217179 -173071 -281509 -289102 34940 151602 -56727 -163648 53453 10912 -1837
12757a59293o8737B31703A11329b25788f7256j28790j10994D5669J94414M9395
$$ -159293 -228030 231703 111329 -225788 -67256 -196046 -307040 45669 240083 289478
12747B89478e5563B06334R3150c25078h7679A2925f1927A71073Q4692P4940I3557
$$ 289478 -55563 206334 299484 -325078 -87679 12925 -61927 171073 255765 330705 93557
12735B98808A27803A0176Q8590Q2494J31929h899C35919a18419o7282A17238a53180
$$ 298808 127803 10176 98766 181260 313189 -8899 335919 -118419 -185701 117238 -153180
12723a13027K4198Q986l55324i4270C03235c0248A29863K40612a82037K9909F8907
$$ -113027 -88829 -79843 -435167 -94270 303235 -30248 129863 370475 -182037 -152128 68907
12711C5710K75952i964A79125d670D00010o0256o8267j5563m7254K68315L8791
$$ 35710 311662 -9964 179125 -4670 400010 339754 271487 255924 208670 476985 515776
12700E15776j81926D2253K7185c04399J24533C6111K22102a41829M9749C06491
$$ 515776 333850 42253 69438 -304399 -179866 36111 258213 -141829 -92080 306491
12689A04042K20875a73276n0452b1291n8410q7412J7691D56347j14535A02491
$$ 104042 324917 -173276 -223728 -21291 -79701 -167113 -149422 456347 341812 102491
12678E54961k65937J8525b82681E1149K12245a18347B70550H7438a82454B3436
$$ 554961 289024 307549 -282681 51149 263394 -118347 270550 87438 -182454 23436
12667E2054a10827A81461o0978L3492b669B22854A5177e5969B62859k5971J11748
$$ 52054 -110827 181461 120483 153975 -2669 222854 15177 -55969 262859 236888 348636
12656C48636A24424R0867H1948k5176L91405F7009b2916C15164b38266A90925
$$ 348636 124424 215291 81948 56772 448177 67009 -22916 315164 -238266 190925
12645b9756j53831R035c0972G3436B1939J16055E8003K64353r1899r787a47635
$$ -29756 -183587 -174552 -30972 73436 21939 137994 58003 322356 230457 220670 -147635
12633B99144G170K67795R5887j80666b78717E43626a95966E6577A550a8379C32638
$$ 299144 7170 274965 370852 190186 -278717 543626 -195966 56577 1550 -18379 332638
12621C20996a28177D19259A76372J6980e3295A66976A7209B155J11569O5782l8092
$$ 320996 -128177 419259 176372 193352 -53295 166976 17209 2155 113724 179506 141414
12610A41414C1806K45902C6515b13054f9277A28980J5635j3038g5975C22890J2206
$$ 141414 31806 277708 36515 -213054 -69277 128980 144615 131577 -75975 322890 335096
12599C35096o5507L6321K7263K5983A72516A3099K10893c3938A10544M1523K091
$$ 335096 269589 305910 333173 359156 172516 13099 223992 -33938 110544 152067 154158
12588A54158n2461A5266K74785I8221L0072D8149I513a4490A1823b08818B21062
$$ 154158 101697 15266 290051 98221 128293 48149 9513 -14490 11823 -208818 221062
12576B11241L7800A10862J25670b9698F9193K48643d7472G3540A9791N3097A8854
$$ 211241 249041 110862 236532 -29698 69193 317836 -47472 73540 19791 72888 18854
12564a95910C28770a1316j07083B15786C4566C154J43776k856P832d1439B15204
$$ -195910 328770 -11316 -118399 215786 34566 3154 146930 144074 151906 -41439 215204
12552a80194k72406h5808A7530a73593A67059b7728o6762n7624i882H8456o260
$$ -180194 -452600 -85808 17530 -173593 167059 -27728 -94490 -152114 -9882 88456 82196
12541H2196a15513A11455D6946b0414D31610F083b62718Q6486D2233a4074n4201
$$ 82196 -115513 111455 46946 -20414 431610 6083 -262718 -176232 42233 -14074 -68275
12530f8275b3789C24345e6488B02801p977K6301A146a61C98434A33953B2395a12795
$$ -68275 -23789 324345 -56488 202801 194824 221125 1146 -161 398434 133953 22395 -112795
12517a0493m5461q5513A92967E713M5665K86031f3165N145K8190r0480C38393
$$ -10493 -55954 -141467 192967 5713 51378 337409 -63165 -58020 -29830 -120310 338393
12505A75127A9833b74326C5544J1201M63824k14195P6013A32286c53158A22664
$$ 175127 19833 -274326 35544 46745 510569 296374 372387 132286 -353158 122664
12494H267K75453H7421k6939j7261K37387G485d5464D7799a41186A96206a13545
$$ 8267 283720 87421 60482 43221 280608 7485 -45464 47799 -141186 196206 -113545
12482B66640a3882j38999c9976k08313B21690F137J25098c471k84416F2850a7556
$$ 266640 -13882 -152881 -39976 -248289 221690 6137 131235 -3471 -287887 62850 -17556
12470D3401N6894L01324a3951n5842D9092J12212l8227f9805A19826R297h6683
$$ 43401 100295 401619 -13951 -69793 49092 161304 123077 -69805 119826 129123 -86683
12458c22823J54412G506J63031b6452j62423B78300a50315A03874a27696H3226
$$ -322823 -168411 7506 170537 -26452 -188875 278300 -150315 103874 -127696 83226
12447B47426C9039J64099a14843A61138p8238b54723A66381m9677b5484A0051
$$ 247426 39039 203138 -114843 161138 82900 -254723 166381 116704 -25484 10051
12436A16915b64639a28795a6037k70566a14006L876A80935b32343I5829a78969
$$ 116915 -264639 -128795 -16037 -286603 -114006 -110130 180935 -232343 95829 -178969
12425F7787K52664F8263j137L16072b38306B35531E2970J8679B1256a7555A22245
$$ 67787 320451 68263 67126 383198 -238306 235531 52970 71649 21256 -17555 122245
12413e4751I4806c20040f8261j5045C76344q7003r8442r1830a07632A25392R7402
$$ -54751 94806 -320040 -68261 -83306 376344 289341 190899 99069 -107632 125392 222794
12402B22794c58417C7840B248a01993p8543a916I5607O5759M5805J15606D0825
$$ 222794 -358417 37840 2248 -101993 -180536 -1916 95607 161366 207171 322777 40825
12390b53476C9057i4234C6904A6117K08134j09268i6365I9618f5687B76262C8133
$$ -253476 39057 -94234 36904 16117 224251 114983 -96365 99618 -65687 276262 38133
12378E9566a08280A00290j4044J03760j2526a7813D6628J4409h7606B34771h5207
$$ 59566 -108280 100290 86246 190006 177480 -17813 46628 61037 -87606 234771 -85207
12366A51281a05076l3971A37421l6283a79833M5792B80199M1283q2755b46242
$$ 151281 -105076 -139047 137421 101138 -179833 -134041 280199 321482 238727 -246242
12355A17087d12425d2209C29716j43322a05121G7107k3444N3816c09117B3723
$$ 117087 -412425 -42209 329716 186394 -105121 77107 53663 107479 -309117 23723
12344A11782d4173J6863j5324j417l1556B59822b99697A49796i2681H3967Q4249
$$ 111782 -44173 -27310 -42634 -44051 -75607 259822 -299697 149796 -92681 83967 168216
12333A68216c32587a10575g493n70m25128A85072a0828p698j05132J5158D8788
$$ 168216 -332587 -110575 -7493 -8063 -433191 185072 -10828 -18526 -123658 -108500 48788
12321a77536Q1787l4094A76892b13415N4261F1951P4055j3853D6152C854a33244
$$ -177536 -95749 -129843 176892 -213415 -159154 61951 136006 122153 46152 3854 -133244
12309D2518f3217C59680A73224a54899B64682a27003j35195a11446C2238K5075
$$ 42518 -63217 359680 173224 -154899 264682 -127003 -262198 -111446 32238 57313
12299E7313p806O9555a75277o8807j10681B0842L3427K4030O5867c8105j93289
$$ 57313 49507 119062 -175277 -244084 -354765 20842 54269 78299 144166 -38105 -231394
12288b31394E4892d9206B42637J64102a25854B6104J4593j0595O2517B4804j907
$$ -231394 54892 -49206 242637 406739 -125854 26104 40697 30102 92619 24804 22897
12277B2897L35594g8750C38023r6045m4919N7761K21584j53447j48967F4353K29356
$$ 22897 358491 -78750 338023 241978 197059 254820 476404 322957 173990 64353 293709
12266B93709A02600N7571o8986K35835j12118b3249B06108j02368d1878F0681
$$ 293709 102600 160171 91185 327020 214902 -23249 206108 103740 -41878 60681
12255A25788B4190J68550E2283J22781E3573J93282f5043d219C63369C511K57549
$$ 125788 24190 192740 52283 175064 53573 246855 -65043 -4219 363369 3511 261060
12244B61060I1326B9878L38764j66650D9125j4231L44535k8886A28818e3880H7007
$$ 261060 91326 29878 368642 201992 49125 34894 379429 350543 128818 -53880 87007
12232B22142K7124B9030K00338J71145I1938J51865d5606B84446j25893K03441
$$ 222142 249266 29030 229368 400513 91938 243803 -45606 284446 158553 361994
12222C61994k7530j1429J30020b7315D32416k0702j64027L03058A72359K63195
$$ 361994 334464 323035 453055 -27315 432416 411714 247687 550745 172359 435554
12212D35554n728j70516K64984B31324M5547A06892J02346I1121L59953H952a63499
$$ 435554 429826 259310 524294 231324 276871 106892 209238 91121 451074 8952 -163499
12200B42134H0208f2030a9295I7182K28038A9775M7513J58599L384E4851K94991
$$ 242134 80208 -62030 -19295 97182 325220 19775 67288 225887 229271 54851 349842
12189C49842A63364b44823E34387c0618D62125J4913j16682c12526d2826D36746
$$ 349842 163364 -244823 534387 -30618 462125 477038 360356 -312526 -42826 436746
12178B2734L30708j43949e1410E307J10943J79216l9540d3714C39055D8600J69307
$$ 22734 353442 209493 -51410 5307 116250 295466 255926 -43714 339055 48600 217907
12167B17907N6995r4319m9327B6655K83922p1009H4425a1636p5642j05099h7617
$$ 217907 274902 180583 131256 26655 310577 239568 84425 -11636 -87278 -192377 -87617
12155A31046C5051K11122M8932r6797E9437Q0053E9794J9422m067L24860m2976
$$ 131046 35051 246173 295105 198308 59437 139490 59794 79216 75149 400009 357033
12144C57033h2318B47872e0146a8059l91723H8334J17132k89A00872l8629a53290
$$ 357033 -82318 247872 -50146 -18059 -409782 88334 205466 205177 100872 62243 -153290
12132a94190A13752J54272b57134e908j37127F13994A39010m2669R8794J58987
$$ -194190 113752 268024 -257134 -5908 -143035 613994 139010 96341 195135 354122
12122C54122A55838M9093I9336d22399A20144a37038c4174C30358d52278A52634
$$ 354122 155838 204931 99336 -422399 120144 -137038 -34174 330358 -452278 152634
12111A9284a64780P7912A9709a53634B34974K44647g0785L0652D8132a89984a8887
$$ 19284 -164780 -86868 19709 -153634 234974 479621 -70785 -40133 48132 -189984 -18887
12099D2860P371a79697Q4217A09039o011J82776M56209A13476m7820K9920f9863
$$ 42860 50231 -179697 -95480 109039 103028 285804 742013 113476 65656 95576 -69863
12087a34820o3324A0344J34571c51108g7749A91127F785K76781a91225B85269
$$ -134820 -198144 10344 144915 -351108 -77749 191127 6785 283566 -191225 285269
12076E7878J06850J27166K42805P11454J937094k94826A330724F64256e3115A22168
$$ 57878 164728 291894 534699 1246153 3183247 2888421 1330724 664256 -53115 122168
12065C048L20310K9851A05417B9069R0696K24908D0975f0877H9268b18159g3836
$$ 3048 323358 353209 105417 29069 119765 344673 40975 -60877 89268 -218159 -73836
12053F6596J46100f3792e130k9529E4508q660j8148f558B61382a65429D01005
$$ 66596 212696 -63792 -5130 -34659 54508 45848 27700 -6558 261382 -165429 401005
12041b95697b3925j57877k8450B60844j4656r8817b74999C6878b38380J17529
$$ -295697 -23925 -181802 -210252 260844 246188 147371 -274999 36878 -238380 -120851
12031a20851A31240b52499J8631B76202b0111C6208J4219b81258d0430j96806
$$ -120851 131240 -252499 -233868 276202 -20111 36208 50427 -281258 -40430 -237236
12021b37236a17876L0043j68806B52643a28475k345A33850f259I6236J69705j23599
$$ -237236 -117876 -87833 -256639 252643 -128475 -130820 133850 -6259 96236 265941 142342
12010A42342O0535A452R4789c4940I6756a18559B09566p1346c03867C9512j6196
$$ 142342 202877 1452 96241 -34940 96756 -118559 209566 138220 -303867 39512 23316
11999B3316h0761C42755l9492j09623a45623n5115l705B07453a77372H136J32396
$$ 23316 -80761 342755 303263 193640 -145623 -200738 -204443 207453 -177372 8136 140532
11988A40532a84455g276m7045j61058l8817k06542B20032a55388D8422c88611
$$ 140532 -184455 -7276 -54321 -215379 -254196 -460738 220032 -155388 48422 -388611
11977a44634D4017L6980g6430F9252K72110j70454J7520m9484n7366j3218A049
$$ -144634 44017 80997 -76430 69252 341362 170908 188428 138944 81578 68360 1049
11965C40565b5255n7746B47127b462j86002B35564J055a58657D79626g2028m9016
$$ 340565 -25255 -83001 247127 -2462 -188464 235564 236619 -158657 479626 -72028 -121044
11954a21044A77757c72522i6298E6942a48340B1705J49696E8725M7961a08398
$$ -121044 177757 -372522 -96298 56942 -148340 21705 171401 58725 106686 -108398
11943A32616o0236e5385m4329m7261G097O649f5317C2618G29P5172a02591B48571
$$ 132616 72380 -55385 -99714 -146975 7097 13746 -65317 32618 729 75901 -102591 248571
11930D1118K45495c86011B11316i8001c2730j81933A4175Q0102O4730M3181r3890
$$ 41118 286613 -386011 211316 -98001 -32730 -214663 14175 94277 159007 202188 108298
11919A08298a61091L8139j38178C48575A12831B8363K43478p7401l5052g4908
$$ 108298 -161091 -122952 -261130 348575 112831 28363 271841 194440 159388 -74908
11908f4929l17233D314L08800A47708O1102e1052D9109h9674c5101C33822h499
$$ -64929 -382162 4314 313114 147708 208810 -51052 49109 -89674 -35101 333822 -8499
11896B22422a63749P5502m4847J1025B2601R5698p750e16096C0169b32381D4913
$$ 222422 -163749 -88247 -133094 -122069 22601 118299 110549 -516096 30169 -232381 44913
11884A1210a28650l1122j61063F6004b58064f7403a926j90106N8210M7902A06765
$$ 11210 -128650 -159772 -320835 66004 -258064 -67403 -1926 -192032 -133822 -85920 106765
11872a61574p291A66945f6328F8933b63131b2764k07086g0709D9059a77620B29710
$$ -161574 -168865 166945 -66328 68933 -263131 -22764 -229850 -70709 49059 -177620 229710
11860a64463f6281n8162G9204M1246E9658b44382A28793b79345A80525M4259L7201
$$ -164463 -66281 -124443 79204 120450 59658 -244382 128793 -279345 180525 224784 261985
11849B61985a76530A32272a79549j12727o5450J30816A61748a82790a4697B873
$$ 261985 -176530 132272 -179549 -292276 -357726 -226910 161748 -182790 -14697 2873
11838A2514M5692a4231A1208a09979B84158c0310P549l15578J63572j55895B44849
$$ 12514 58206 -14231 11208 -109979 284158 -30310 -22761 -338339 -174767 -330662 244849
11826a00755l26676G7171c9011n8538q6052g7964n6294j17205J10225B18145q248
$$ -100755 -427431 77171 -39011 -97549 -183601 -77964 -134258 -251463 -141238 218145 209897
11815B09897E8974M9914B8874d6695A36584a09510d2960l36394J39990L8422G403
$$ 209897 58974 108888 28874 -46695 136584 -109510 -42960 -379354 -239364 -200942 7403
11803g2645D6892a75733c0738j96198a07871K5619E5684J11572a09982F515a35855
$$ -72645 46892 -175733 -30738 -226936 -107871 -82252 55684 167256 -109982 6515 -135855
11791b7831p8842k13906a17329B16264a04847B3425a56756k3889l4154f5478A49735
$$ -27831 -106673 -320579 -117329 216264 -104847 23425 -156756 -180645 -214799 -65478 149735
11779a51874A47454D1406J79865A03942j8791N2782a44589A40694i41l0116G7205
$$ -151874 147454 41406 221271 103942 85151 137933 -144589 140694 -941 -31057 77205
11767a60109G1901h3285j58164f4071k03952a29213A29893K74582a05743F0101
$$ -160109 71901 -83285 -241449 -64071 -268023 -129213 129893 404475 -105743 60101
11756a13032E16158A41466a66583B61780e8752A5726K19576b72907h1857E5184
$$ -113032 516158 141466 -166583 261780 -58752 15726 235302 -272907 -81857 55184
11745a8780r6668b1295j03699C75465d5043k15671A20195d5665j22708j094a3380
$$ -18780 -115448 -21295 -124994 375465 -45043 -260714 120195 -45665 -168373 -169467 -13380
11733E9449j6990a67492M9170d3322I5930M9816J70622d78330a43911o12F2856
$$ 59449 42459 -167492 -118322 -43322 95930 145746 316368 -478330 -143911 -144523 62856
11721A36884J0543c9863j8594B59779B6124R1365Q2504A9183K61515c1627B34339
$$ 136884 147427 -39863 -58457 259779 26124 117489 199993 19183 280698 -31627 234339
11709B09962J29997c66414B14922l6730P2091q022k7405d1127Q855G2621g6671
$$ 209962 339959 -366414 214922 178192 250283 242261 214856 -41127 -32272 72621 -76671
11697C39696P6084b65615A45938n1867Q9093J15152a53738G2193i4143C28118
$$ 339696 415780 -265615 145938 94071 183164 298316 -153738 72193 -94143 328118
11686A13917P3109a08626J0297D9420L03647d6887D8952a7674r4666B26145b4068
$$ 113917 187026 -108626 -98329 49420 353067 -46887 48952 -17674 -112340 226145 -24068
11674A05935J33574l4424J76768j41871a12257J2498A00226K08395E9237a9609
$$ 105935 239509 205085 381853 239982 -112257 -99759 100226 308621 59237 -19609
11663A80778B1596d978C1219b54182a18949B61251F0480J01497A8721a30999J1635
$$ 180778 21596 -4978 31219 -254182 -118949 261251 60480 161977 18721 -130999 -119364
11652a19364B44467k5532m7517o1571e5490B9404J8597b51078C54886j53747a34806
$$ -119364 244467 218935 171418 109847 -55490 29404 48001 -251078 354886 201139 -134806
11640A62701D1983K70958j51190a9521k509C57337a47681B24465a94878C16641
$$ 162701 41983 312941 161751 -19521 -22030 357337 -147681 224465 -194878 316641
11629A37954l3761b05119L8999A70041O4205C4630a96589F75609B77071a21526
$$ 137954 104193 -205119 -166120 170041 234246 34630 -196589 675609 277071 -121526
11618A26002j3464d26724A13542O690e2250A0867K8518b3435A76634n2264n9057
$$ 126002 112538 -426724 113542 120232 -52250 10867 39385 -23435 176634 124370 65313
11607F5313b31819A94760q2922b27618B57969A06555J2317J38427a15084A29948
$$ 65313 -231819 194760 111838 -227618 257969 106555 118872 257299 -115084 129948
11596B48165f5966B12984A02054C4316L71608b075C36186A00040A5359K06999
$$ 248165 -65966 212984 102054 34316 405924 -2075 336186 100040 15359 222358
11586B22358L14224D8769j3326L81945c0362C25302E9693d0587k38708b4826C28205
$$ 222358 536582 48769 35443 417388 -30362 325302 59693 -40587 -279295 -24826 328205
11574b1557k23662B8867N50423A27791J84050j19328K61591n1854j97336J03259
$$ -21557 -245219 28867 579290 127791 311841 192513 454104 402250 204914 308173
11564C08173a25830D2629K71748A42639A2153a0941A88704a02643A5930P7778
$$ 308173 -125830 42629 314377 142639 12153 -10941 188704 -102643 15930 93708
11554I3708a26333j2948D20376G6441L37297q9611A9165J83771B6441J63044A5787
$$ 93708 -126333 -139281 420376 76441 413738 324127 19165 202936 26441 189485 15787
11542b389A86016M54562a10672A53998L3248M09495B27739r8462J56650J27646
$$ -2389 186016 640578 -110672 153998 187246 596741 227739 129277 285927 413573
11532D13573A43951b07040C9949J99628R5534A8687g2086G3825K87973j6743E1679
$$ 413573 143951 -207040 39949 239577 335111 18687 -72086 73825 361798 345055 51679
11520F2783J17490K44160j29633N23906c26563g5333C63780j45750B8542J43230
$$ 62783 180273 424433 294800 818706 -326563 -75333 363780 218030 28542 171772
11510A71772h577j6206I9484a53659D32413E1230L99930A5174M29601C291K49599
$$ 171772 -8577 -24783 99484 -153659 432413 51230 451160 15174 444775 3291 252890
11499B52890n4572a36761I9200J81392f9148G1762j8433K40321a4261B78495Q3695
$$ 252890 198318 -136761 99200 280592 -69148 71762 53329 293650 -14261 278495 362190
11488C62190m6147K93224A71878P5659A18000b80061B29546J80586j68065J39889
$$ 362190 316043 609267 171878 247537 118000 -280061 229546 410132 242067 381956
11478C81956j30557b8041B85115L2649h013C19177j49052J0251R7590r2793E4777
$$ 381956 251399 -28041 285115 317764 -8013 319177 170125 180376 277966 185173 54777
11466e4872E9901J00722K05995j51891A05322O9216J53119A51667a09050c5178
$$ -54872 59901 160623 366618 214727 105322 174538 327657 151667 -109050 -35178
11455C19414c9330l8287F20395a4801j28768B3218Q2556K20892a20131j49972
$$ 319414 -39330 -77617 620395 -14801 -143569 23218 105774 326666 -120131 -270103
11445b70103B90184j44841e0558A57255P3710e2332C1839a7565H9491D2344L18633
$$ -270103 290184 145343 -50558 157255 230965 -52332 31839 -17565 89491 42344 360977
11434C60977B6404J94647k2345E7595J6881K17217a95491A70247O4841a06143
$$ 360977 26404 221051 198706 57595 74476 291693 -195491 170247 235088 -106143
11423A14927B1965e9506H3404a1057C07339m1055A28805J57446A25349g6703j249
$$ 114927 21965 -59506 83404 -11057 307339 266284 128805 286251 125349 -76703 -77952
11412g7952C35094e8672m9968C74698a21491c241C67831A83457K14932A16043
$$ -77952 335094 -58672 -108640 374698 -121491 -3241 367831 183457 398389 116043
11401E1641J90384J34633j56720B8625J47897H7398J08690J10519f2810j13814
$$ 51641 242025 376658 219938 28625 176522 87398 196088 306607 -62810 -176624
11391a76624B42595a88367D6894J37745c14703D4028a47245j03033A03541M8838
$$ -176624 242595 -188367 46894 184639 -314703 44028 -147245 -250278 103541 152379
11381A52379Q644i569C22971a76118I1583J20502J16331h6416m7319e4477j87692
$$ 152379 161023 -9569 322971 -176118 91583 212085 328416 -86416 -133735 -54477 -242169
11370b42169A77168q3600J51988b87644i9351d5762G7560g3429k87332A65466
$$ -242169 177168 93568 245556 -287644 -99351 -45762 77560 -73429 -360761 165466
11359B50572A06201J11280c98427J57428a8583A39183O893b66714L6448A77688
$$ 250572 106201 217481 -398427 -240999 -18583 139183 146076 -266714 -230266 177688
11348f4162A48291O7425A9607J96877A07584D9021a88379g9702B075R1856j3383
$$ -64162 148291 215716 19607 216484 107584 49021 -188379 -79702 2075 93931 80548
11337H0548b66228A40064Q5752P4657d2950k10862b6939j21681e1187C00880a69043
$$ 80548 -266228 140064 225816 300473 -42950 -253812 -26939 -148620 -51187 300880 -169043
11325B25358g1625j33490R939A62805N7650a11251A91685c0544j4612B03393a1586
$$ 225358 -71625 -205115 -195176 162805 220455 -111251 191685 -30544 -45156 203393 -11586
11313B09318f5094j0425k5155A28280K67747h829C70722a52185K7229C2993K2298
$$ 209318 -65094 -75519 -100674 128280 396027 -8829 370722 -152185 -124956 32993 55291
11302E5291a37809G2901J76896A17245e9841E6935f7946j36304A0141a3913j8206
$$ 55291 -137809 72901 249797 117245 -59841 56935 -67946 -204250 10141 -13913 -32119
11291c2119r7457A18913a04796I890a21945M1768L9163a43j47222m6653A71224
$$ -32119 -129576 118913 -104796 9890 -121945 -80177 -41014 -143 -147365 -194018 171224
11279A79425f0654A81519a69279l927k70390a98582A02752L7430d3042A2642L17258
$$ 179425 -60654 181519 -169279 -173206 -443596 -198582 102752 140182 -43042 12642 329900
11268C29900j20108a24872b9604k76374a17887A4567M6414e9574j32439d4511
$$ 329900 209792 -124872 -29604 -305978 -117887 14567 60981 -59574 -192013 -44511
11257e8025H0100i6433B02573a10503E0193K7846a1177j129j44709A2567K26551
$$ -58025 80100 -96433 202573 -110503 50193 78039 -11177 -12306 -157015 12567 239118
11246B39118q0012e079C06842q2663i2381j58379J16305c4829C47643D546J19244
$$ 239118 159106 -5079 306842 224179 -92381 -250760 -134455 -34829 347643 4546 123790
11235A23790L2621C1849i5881B13410D2827K77322b64791j773A2906c54955c9468
$$ 123790 156411 31849 -95881 213410 42827 320149 -264791 -266564 12906 -354955 -39468
11223A27297g8909m9328J4903L2782k38893F1430A8698K16060b76282A26181b10192
$$ 127297 -78909 -128237 -113334 -80552 -319445 61430 18698 234758 -276282 126181 -210192
11211B25751q884b73883a0583j09363G6331h9991A20082a08744A36071a44865
$$ 225751 216867 -273883 -10583 -119946 76331 -89991 120082 -108744 136071 -144865
11200E0143O4602Q9390d7049A02572B4209a74867K9252O032d0993l5406A38790
$$ 50143 114745 204135 -47049 102572 24209 -174867 -145615 -139583 -40993 -76399 138790
11188a42974O8107c6075I5479a87516I8118d21598f9790m8271A79676O2724j9576
$$ -142974 -74867 -36075 95479 -187516 98118 -421598 -69790 -118061 179676 242400 222824
11177B22824j00486a68012d3903o0879M484d0426F9604c31667C9202J8886a89171
$$ 222824 122338 -168012 -43903 -104782 -100298 -40426 69604 -331667 39202 58088 -189171
11165G5756b57938a02748A01970j5804d8079E6418h0317B9276a7329A7295a09796
$$ 75756 -257938 -102748 101970 86166 -48079 56418 -80317 29276 -17329 17295 -109796
11153b46572q2143A87074J2561n6784a62726D76529I7803d6735B1557L7158P6798
$$ -246572 -328715 187074 199635 142851 -162726 476529 97803 -46735 21557 58715 135513
11142A35513a23763K8708b3286B89532g7410r2478J6432j17519B3845K70070l8091
$$ 135513 -123763 -95055 -23286 289532 -77410 -169888 -153456 -270975 23845 293915 255824
11131B55824I0229h531j45022D3400a36822K710A39491d4937A65961n4257J79847
$$ 255824 90229 -8531 -153553 43400 -136822 -134112 139491 -44937 165961 111704 291551
11120B91551F6206k4696M2431K73414a75183B5767K93298b11658I7743B1768c75294
$$ 291551 66206 41510 83941 357355 -175183 25767 319065 -211658 97743 21768 -375294
11108A59812F0398B167K25829a19598f272n9292A17873N0678q146K38986J70594
$$ 159812 60398 2167 227996 -119598 -6272 -65564 117873 168551 160405 399391 569985
11097E69985A31482K16226A9570P4051J12908J16326O8302A16761J36870r5444
$$ 569985 131482 347708 19570 93621 206529 322855 391157 116761 253631 158187
11087A58187K44146H2279M1375R5472J00590J36122K28725k82352J59023q1095
$$ 158187 402333 82279 123654 219126 319716 455838 684563 402211 561234 480139
11077D80139I9125J10167N5123M58492j31456A99964e1826E81389o9675k29072
$$ 480139 99125 209292 264415 722907 591451 199964 -51826 581389 511714 282642
11067B82642O1538L05139C23982K20500j81685j32598N68202j25176J11244R6362
$$ 282642 344180 649319 323982 544482 362797 230199 798401 673225 784469 880831
11057H80831j91425J19029L4771m1301J50482K08055j6694l71713K37642L9066
$$ 880831 689406 808435 843206 801905 952387 1160442 1143748 772035 1009677 1048743
11047A048743J88040l12342k9046K4359J66678m523k44822j65599O55687n19085
$$ 1048743 1236783 924441 895395 919754 1086432 1081909 837087 671488 1327175 808090
11037H08090L79791l3125j97022j44068K49266j11390R2984q382j66060J47635
$$ 808090 1187881 1154756 957734 813666 1062932 951542 1044526 1036144 870084 1017719
11027A017719L60751j53070l52878N36321q7845m37967J99088j64842M3560k60947
$$ 1017719 1378470 1225400 872522 1408843 1320998 883031 1082119 917277 960837 699890
11017F99890M20661k03705j98689M34814k20345J6494k91881L05476l00155J68360
$$ 699890 1120551 916846 718157 1152971 932626 949120 657239 962715 662560 830920
11007H30920m745P0063J64280k57598L46743k06330J75338j01890m9778J26182
$$ 830920 826175 896238 1060518 802920 1149663 943333 1118671 1016781 967003 1093185
10997A093185L3705m15697L91125j89145o1441j08765M3978K75399j47389J83664
$$ 1093185 1126890 711193 1102318 913173 851732 742967 786945 1062344 914955 1098619
10987A098619K12766Q1771m37726K60225q9115M88773j36480N29175o08102J23814
$$ 1098619 1311385 1393156 955430 1215655 1126540 1615313 1478833 2008008 1399906 1523720
10977A523720M16588p7998L66551N27810J54800K43809M14181K52943L02957j00103
$$ 1523720 1940308 1862310 2228861 2756671 2911471 3155280 3569461 3822404 4125361 4025258
10967D025258J18537q817m80738j29389m82757k52313n0767j63639L08039l88567
$$ 4025258 4143795 4134978 3654240 3524851 3042094 2789781 2739014 2575375 2883414 2494847
10957B494847K56255j15463K80311j35331j78395J98454l88246l18714l56445
$$ 2494847 2751102 2635639 2915950 2780619 2602224 2800678 2412432 2093718 1737273
10948A737273j39569m11281m47630J39792k12647o2190K15939j99137k61518J08784
$$ 1737273 1597704 1186423 738793 878585 665938 603748 819687 620550 359032 467816
10938D67816e0701D01329J48514B01285o0628h0364B90308G1935P825M9673K88410
$$ 467816 -50701 401329 549843 201285 140657 -80364 290308 71935 79760 129433 417843
10927D17843c6091a972C4348e8544G3654e0352A08872B0236K38634D4812L73560
$$ 417843 -36091 -1972 34348 -58544 73654 -50352 108872 20236 258870 44812 418372
10916D18372L147J697j58775e0631k82734E0587P7587J29141a85772g2121j23828
$$ 418372 421519 423216 264441 -50631 -333365 50587 128174 257315 -185772 -72121 -195949
10905a95949j17384J45594C64777c02968A13658b99997C66762j33500o5742J08982
$$ -195949 -313333 -167739 364777 -302968 113658 -299997 366762 233262 167520 276502
10895B76502J13236h1083j00773F6558B1197e0169H3606M44986A48352a1209B282
$$ 276502 389738 -81083 -181856 66558 21197 -50169 83606 528592 148352 -11209 2282
10883b59674J7406A04474A4196K63478I3563O7172C4525K49735b21781f2591k01843
$$ -259674 -242268 104474 14196 277674 93563 160735 34525 284260 -221781 -62591 -264434
10872b64434P9671I7866N4222b00178G1765J34028M5448b00556i3255I8937R1160
$$ -264434 -184763 97866 152088 -200178 71765 205793 251241 -200556 -93255 98937 190097
10861A90097i3588B47010b24560A34409A28a5833j89056A71217G2708i1872j5972
$$ 190097 -93588 247010 -224560 134409 128 -15833 -204889 171217 72708 -91872 -107844
10850a07844j16003h1077r2938C40775A28428M1396k441J3947H7205b21108f4633
$$ -107844 -223847 -81077 -174015 340775 128428 169824 167383 181330 87205 -221108 -64633
10838E23364C8392K50432p8814j02276a59674L3945C5938R2259g3179H1443a19435
$$ 523364 38392 288824 210010 107734 -159674 -125729 35938 128197 -73179 81443 -119435
10826B17750g7786A6449Q6712c5130A24778a39254C4914a07413k9651A09367A8644
$$ 217750 -77786 16449 103161 -35130 124778 -139254 34914 -107413 -137064 109367 18644
10814C11495c59271i7041A28871e7466K7261B14760a6913j40535b8932k28986
$$ 311495 -359271 -97041 128871 -57466 -30205 214760 -16913 -157448 -28932 -257918
10804b57918A16673a16601I3951C3850i1505n3411B34240I2000a0952j9036C9661
$$ -257918 116673 -116601 93951 33850 -91505 -144916 234240 92000 -10952 -29988 39661
10792C64629a58354C01286j32335a89005L562O6248A734R4458b272B71626f5702
$$ 364629 -158354 301286 168951 -189005 -185443 -119195 1734 96192 -2272 271626 -65702
10780A6818J26791c85601f8859k63532J13665D5673c04828f9976k41486d8219
$$ 16818 143609 -385601 -68859 -332391 -218726 45673 -304828 -69976 -311462 -48219
10769A02999l8285a0349j91161g2146J9298E4692R3622c62627A09825c07675p3155
$$ 102999 64714 -10349 -201510 -72146 -52848 54692 148314 -362627 109825 -307675 -380830
10758c80830J63984j56452B9278J98464A10724b9636j96768A73506G7098J11014
$$ -380830 -216846 -373298 29278 227742 110724 -29636 -226404 173506 77098 188112
10748A88112e9144A88943b22768E5980J99786c04102A0202N7293b59597A72663
$$ 188112 -59144 188943 -222768 55980 255766 -304102 10202 67495 -259597 172663
10737e9310l8456j07334p8027f606C23229a16474r3536B19090D6527b39125A9776
$$ -59310 -97766 -205100 -283127 -6606 323229 -116474 -210010 219090 46527 -239125 19776
10725a28532A06236a60640A00988a42608m2574Q0704M1320j43225C061L2668a94656
$$ -128532 106236 -160640 100988 -142608 -185182 -104478 -63158 -206383 3061 35729 -194656
10713C00616a26466b003A88757a53500A33452c9584m6680A01986l6748e5552j04424
$$ 300616 -126466 -2003 188757 -153500 133452 -39584 -86264 101986 65238 -55552 -159976
10702a59976C5970a01785j05937b8403q9336H6718e3198j20153h0384q8300D05677
$$ -159976 35970 -101785 -207722 -28403 -117739 86718 -53198 -173351 -80384 -168684 405677
10690A08642K1846b4924A93056b93890A71087B2198a62042p3247A21406e3071
$$ 108642 130488 -24924 193056 -293890 171087 22198 -162042 -235289 121406 -53071
10679A51854a21604j49302A60686b09080G0489a55588r4448n1336A2393c64001
$$ 151854 -121604 -270906 160686 -209080 70489 -155588 -250036 -301372 12393 -364001
10668a48168k30368a50885p33B43417f5822I3795a24605p2440k9542B10965J01199
$$ -148168 -378536 -150885 -151618 243417 -65822 93795 -124605 -197045 -226587 210965 312164
10657C12164a70319n685E6163b2429j3072r2577j58374j51129a06978K1887j76132
$$ 312164 -170319 -176004 56163 -22429 -35501 -128078 -286452 -437581 -106978 -85091 -261223
10646b61223j24396a02585j15429C62380c34219g2162j89154b1158A1204a06213
$$ -261223 -385619 -102585 -218014 362380 -334219 -72162 -261316 -21158 11204 -106213
10635c55128J08412a10956j34642r9005J3472A93883a40734k48971C213b21540
$$ -355128 -246716 -110956 -245598 -344603 -331131 193883 -140734 -389705 3213 -221540
10624A7008a26208q8480Q7969A35869A0656a40922A46461l177l2810a84285a54
$$ 17008 -126208 -214688 -126719 135869 10656 -140922 146461 143284 110474 -184285 -154
10612a35480L0610F9021J7769i0718E7930i7813g059l3474j97706b5331G1597
$$ -135480 -104870 69021 86790 -90718 57930 -97813 -7059 -40533 -238239 -25331 71597
10600a76420G5923h5023j8436M5112A19424a52715D6762B2177b32276Q4545D2614
$$ -176420 75923 -85023 -103459 -58347 119424 -152715 46762 22177 -232276 -147731 42614
10588C15143G396J12398a0922n9433r3422A17901e9994I5385a82033C0329A0582
$$ 315143 7396 119794 -10922 -70355 -163777 117901 -59994 95385 -182033 30329 10582
10576g9599J5013A19642n8441J12302a21631q2599A09742b31462f818B02739a53571
$$ -79599 -64586 119642 61201 173503 -121631 -204230 109742 -231462 -6818 202739 -153571
10564c9667A08391K2053d9187A11522E2333j5600a84366a6525B47458a06560n655
$$ -39667 108391 130444 -49187 111522 52333 36733 -184366 -16525 247458 -106560 -112215
10553a12215k36313B10997C0054d8838A55951m7251b9526l6331B28502h8703c1699
$$ -112215 -348528 210997 30054 -48838 155951 108700 -29526 -65857 228502 -88703 -31699
10541H0568a9736A98665b34938B7971h8869A34092b9965B14084D8375A0973b8755
$$ 80568 -19736 198665 -234938 27971 -88869 134092 -29965 214084 48375 10973 -28755
10529I1463a18962G9353a86073D35947E2486b25077A43701a17k67496B5139f0870
$$ 91463 -118962 79353 -186073 435947 52486 -225077 143701 -117 -267613 25139 -60870
10517e425B2559b98331B65367l3800c0166n9459D6446N6964A6286J73457D7608
$$ -5425 22559 -298331 265367 231567 -30166 -89625 46446 103410 16286 189743 47608
10505g5605H2761L72996A73238f2625G4162a71579L0691B88437c2397G5534a21305
$$ -75605 82761 455757 173238 -62625 74162 -171579 -140888 288437 -32397 75534 -121305
10493I0655J24678E3101c3493B166b27262h3841A58162a71920M6065d7044C19763
$$ 90655 215333 53101 -33493 2166 -227262 -83841 158162 -171920 -125855 -47044 319763
10481A19420L50089A95794M1872j12622J51705P9011M25506q5334p7384j99824
$$ 119420 469509 195794 237666 125044 276749 355760 781266 695932 618548 418724
10471D18724L45807A20322j17a35259a4064j32383c3696A48481A4421J48531A8587
$$ 418724 764531 120322 120205 -135259 -14064 -146447 -33696 148481 14421 162952 18587
10459B07626q0466K9279L14301E6460B2591b12918R3785A87105o5138a07718I6000
$$ 207626 127160 156439 470740 56460 22591 -212918 -119133 187105 121967 -107718 96000
10447f1859j37721F2842b42594g7816n9043q0558f1256m9090l25985a10535m0588
$$ -61859 -199580 62842 -242594 -77816 -136859 -217417 -61256 -110346 -436331 -110535 -151123
10436a51123k01656a29936K6666m3082A47257a44438G1383L89849a5282l9203
$$ -151123 -352779 -129936 -103270 -146352 147257 -144438 71383 461232 -15282 -54485
10426e4485a588k8554l08362H3536a62407B5432J93505l9126n0771J9884J68450
$$ -54485 -1588 -30142 -338504 83536 -162407 25432 218937 179811 129040 148924 317374
10415C17374A54249c7217j17050d2215A47240c6658A33769B7408f3529l71447
$$ 317374 154249 -37217 -154267 -42215 147240 -36658 133769 27408 -63529 -434976
10405d34976B66648L1990o5461m46a39882p598D4316l956b09634D5473f166G9337
$$ -434976 266648 298638 233177 232731 -139882 -147480 44316 40360 -209634 45473 -6166 79337
10392d912I0186R0531L61162c0800E37146d5965B78375J23749i9019B68505j31439
$$ -4912 90186 180717 541879 -30800 537146 -45965 278375 402124 -99019 268505 137066
10381A37066n8302b9283H8750N77884h7666B92860A37146J48274n8599l5700M39480
$$ 137066 78764 -29283 88750 666634 -87666 292860 137146 285420 226821 191121 630601
10370F30601N159k29337q8788R7105R6483R1441k12676L00809C29405o5843K44815
$$ 630601 635760 406423 317635 414740 511223 602664 389988 690797 329405 263562 508377
10359E08377j64607K70544k43520O1457j78178A24284L48302D889M27914l5156
$$ 508377 343770 614314 370794 432251 254073 124284 472586 4889 432803 397647
10349C97647M52216j84511j76165j94418J66377B30013J63251K68767j3144k76772
$$ 397647 849863 665352 489187 294769 461146 230013 393264 662031 648887 372115
10339C72115J28831o3882A54673j5793d0284A86978J24701F8884M4547n3857L19838
$$ 372115 500946 437064 154673 138880 -40284 186978 311679 68884 113431 59574 379412
10328C79412F5133P4717J17169f3925A37222l3287K31382r9678N5878A03377L33964
$$ 379412 65133 139850 257019 -63925 137222 103935 335317 235639 291517 103377 437341
10317D37341a40353A63900f1030j4893A83405o2120a72477L9123A61465a39002
$$ 437341 -140353 163900 -61030 -75923 183405 121285 -172477 -133354 161465 -139002
10306B34392i9567D7210K03462b8856A72842P7967G7594J20069b1626B90483m7042
$$ 234392 -99567 47210 250672 -28856 172842 250809 77594 197663 -21626 290483 243441
10295B43441g4980A36675a64169F7881k1916K95940r5968q4189b57467e9417A57180
$$ 243441 -74980 136675 -164169 67881 45965 341905 245937 161748 -257467 -59417 157180
10283a9310h137A63695e8525j26121B80717G1791B0767b63646c5734j96844c9374
$$ -19310 -8137 163695 -58525 -184646 280717 71791 20767 -263646 -35734 -232578 -39374
10271C8617a35922C31666b37594e7906J5421m79105a27903B29490e5550A6401
$$ 38617 -135922 331666 -237594 -57906 -42485 -521590 -127903 229490 -55550 16401
10260C1657f0917D16308A58408J1365L75902j76367J39316j86771J9717J05905
$$ 31657 -60917 416308 158408 169773 545675 369308 508624 321853 341570 447475
10250D47475p4423j66904Q2071f7640b9455q9168j1846a7785D38336G1846J8311
$$ 447475 373052 206148 288219 -67640 -29455 -118623 -130469 -17785 438336 71846 90157
10239I0157M6942g1575A42216j877b35848G3102B5653d8624B67576e1551m27243
$$ 90157 137099 -71575 142216 140339 -235848 73102 25653 -48624 267576 -51551 -478794
10228d78794A29776a19336O749j16424b3891j9901F6716a20491D468K19854a06819
$$ -478794 129776 -119336 -112587 -229011 -23891 -43792 66716 -120491 4468 224322 -106819
10216C9311e6252l5130A35978i9381A52714F3450a78811a4776k00832a2561j05548
$$ 39311 -56252 -91382 135978 -99381 152714 63450 -178811 -14776 -215608 -12561 -118109
10205a18109A87965c0304j2729m6168k57688a34295A49445a72727l0035c1750
$$ -118109 187965 -30304 -43033 -89201 -346889 -134295 149445 -172727 -202762 -31750
10194i6620j04761j4502e8379l22658A13373M9065a17901J8595A91457a99411
$$ -96620 -201381 -215883 -58379 -381037 113373 162438 -117901 -99306 191457 -199411
10183d3470G4429b87521K5313B90094O1042c51209R4082r925h6587A16505C9274
$$ -43470 74429 -287521 -262208 290094 351136 -351209 -257127 -267052 -86587 116505 39274
10171b57487G9360a78172f2869M660j36603h1814k5488j13003c2804l7122o8553
$$ -257487 79360 -178172 -62869 -58209 -194812 -81814 -107302 -220305 -32804 -69926 -138479
10160a38479o5165h2817l31575a16591d5621k98839a2866C7812C036a89187m2052
$$ -138479 -203644 -82817 -414392 -116591 -45621 -344460 -12866 37812 3036 -189187 -231239
10149b31239a05728B5968a00922j58029K5419B74983a57954L6533A29115b73733
$$ -231239 -105728 25968 -100922 -258951 -233532 274983 -157954 -121421 129115 -273733
10138I7228K6157d38j18241N5899j69014A84837a26045F6288d6160A12953M5060
$$ 97228 123385 -438 -118679 -62780 -231794 184837 -126045 66288 -46160 112953 158013
10127A58013O518J29096a92927j28655A26171M3008i1889k17900J33228P7110
$$ 158013 164531 293627 -192927 -321582 126171 169179 -91889 -309789 -176561 -99451
10117i9451B33057B8200b27931B64636J12773i5418A8200K02195A07175a9427
$$ -99451 233057 28200 -227931 264636 377409 -95418 18200 220395 107175 -19427
10106a65351O400R322L7562L9971a9204j22425A73687a56727l3841O6803m2538
$$ -165351 -158951 -149629 -112067 -72096 -19204 -141629 173687 -156727 -190568 -123765 -166303
10095a66303p3912J1010A00687A1289L288J10674a85397e7785A0622L3082c56649
$$ -166303 -240215 -229205 100687 11289 14577 125251 -185397 -57785 10622 43704 -356649
10083b33106H1962J34987c56154J48896O6297l11247b21659d954k08098P2921
$$ -233106 81962 216949 -356154 -207258 -140961 -452208 -221659 -4954 -213052 -140131
10073a40131c5620G4269a55491g6749n6300A65135b10103q3600a8605A46812b27863
$$ -140131 -35620 74269 -155491 -76749 -133049 165135 -210103 -293703 -18605 146812 -227863
10061d1367j18234a1594n0148A33008o4937c2347C0500a78411A43854c25895J04777
$$ -41367 -159601 -11594 -61742 133008 68071 -32347 30500 -178411 143854 -325895 -221118
10050b21118A50511A1052d30018e7228J6316b357j34922N5080M500H9299a65279
$$ -221118 150511 11052 -430018 -57228 -40912 -2357 -137279 -82199 -77699 89299 -165279
10038a38382L7035C5178h2922a5582o6483A30603c2128p5342A45613b05612J237
$$ -138382 -101347 35178 -82922 -15582 -82065 130603 -32128 -107470 145613 -205612 -204375
10027b04375A21992b14708H5512b01115l3483b1926m4701j41924E5783B890N2808
$$ -204375 121992 -214708 85512 -201115 -234598 -21926 -66627 -208551 55783 2890 55698
10016E5698d0252C8066i8644B56484h8195d4009A20025b5481m0277B09430b17986
$$ 55698 -40252 38066 -98644 256484 -88195 -44009 120025 -25481 -65758 209430 -217986
10004A08715O8777c10048B15865G6505B1157Q6834c33315B18156H8050a74890
$$ 108715 177492 -310048 215865 76505 21157 107991 -333315 218156 88050 -174890
9993a28359d0577r157l48183O6883a409B9604O7988a64075f7927j21379F0574
$$ -128359 -40577 -49734 -397917 -331034 -1409 29604 97592 -164075 -67927 -189306 60574
9981h6783B4784i1078p6510B589c56932F1779a99894f5512b4918l02938m4381
$$ -86783 24784 -91078 -167588 2589 -356932 61779 -199894 -65512 -24918 -327856 -372237
9970c72237J16638A0917b53507J11409k76642I6478a15442K0455p2103C4823i0505
$$ -372237 -255599 10917 -253507 -142098 -418740 96478 -115442 -94987 -167090 34823 -90505
9958b83385C66223b67768Q0295j4966D3469J13745e7251k25972B86621b82899
$$ -283385 366223 -267768 -187473 -202439 43469 157214 -57251 -283223 286621 -282899
9947b25591I6628K6381b48444g5350e595j44676j83528E9885c8065A03326b39667
$$ -225591 96628 123009 -248444 -75350 -5595 -150271 -333799 59885 -38065 103326 -239667
9935c2010A7816b05895R9071D1213a65536j87512a73667K0606A05708b4743B69838
$$ -32010 17816 -205895 -106824 41213 -165536 -353048 -173667 -153061 105708 -24743 269838
9923a62103p2012l2472J9480G8246A1880J27043a91852e6670p0196A03015b32209
$$ -162103 -234115 -266587 -247107 78246 11880 138923 -191852 -56670 -126866 103015 -232209
9911b57002a013C1891a20763K0890A34885n6667a8459k12619n7127F0733a80659
$$ -257002 -1013 31891 -120763 -99873 134885 78218 -18459 -231078 -288205 60733 -180659
9899B17507g1140j13422e0306B2063O0481E819M9829b38469i6148C9836h3576
$$ 217507 -71140 -184562 -50306 22063 82544 5819 55648 -238469 -96148 39836 -83576
9887D881i5241F653Q2446g5133m14660H5833a07085F5892C0564c60219J3035A7541
$$ 4881 -95241 6653 89099 -75133 -489793 85833 -107085 65892 30564 -360219 -347184 17541
9874a66574M7740A95277d1351j89544E7642b15498F7044g6452A0625h2471C04763
$$ -166574 -118834 195277 -41351 -230895 57642 -215498 67044 -76452 10625 -82471 304763
9862b8951E1667O9536J83074C5572a29039A23825b40085B84631b46023m7422J06381
$$ -28951 51667 121203 304277 35572 -129039 123825 -240085 284631 -246023 -293445 -187064
9851a87064p9638a23469j69946A16869a92935p1128F9723M0330l6674a17896b3348
$$ -187064 -266702 -123469 -293415 116869 -192935 -264063 69723 110053 73379 -117896 -23348
9839A52173L6540b6705A77046a73889h513k8469A51788c16243n4510E1379P5631
$$ 152173 188713 -26705 177046 -173889 -8513 -36982 151788 -316243 -370753 51379 127010
9828A27010b17125Q7174k79125A82425b21338K034N3149E8782b47577b1464j3759
$$ 127010 -217125 -129951 -409076 182425 -221338 -219304 -166155 58782 -247577 -21464 -35223
9817c5223j09256n3339A67743a20227K7110M6305c028m84603c0417k4844C12593
$$ -35223 -144479 -197818 167743 -120227 -93117 -46812 -3028 -487631 -30417 -55261 312593
9805b36932g8038A27885b93459J08663A51663b87976c8300I0201b34163J13789
$$ -236932 -78038 127885 -293459 -184796 151663 -287976 -38300 90201 -234163 -120374
9795a20374a5529H0741b74179E0008B2928i8155I0170e5097o4266p4450k99589
$$ -120374 -15529 80741 -274179 50008 22928 -98155 90170 -55097 -119363 -193813 -493402
9784d93402a41140k4384O8004M0110m7448J2448q637o721A05781i1198j68137
$$ -493402 -141140 -165524 -97520 -57410 -104858 -92410 -101047 -107768 105781 -91198 -259335
9773b59335K4983h8384k15948J03430p719G5705a63876A4861d41745f8110o7501
$$ -259335 -234352 -88384 -304332 -200902 -208621 75705 -163876 14861 -441745 -68110 -135611
9762a35611A52973n1127a47483O2690A9117c78392i8837q126b0675q7655A50075
$$ -135611 152973 101846 -147483 -84793 19117 -378392 -98837 -106963 -20675 -108330 150075
9750g3561b8648A20463n7429K8487a37400A08488d2060C5467M3749a60281j95739
$$ -73561 -28648 120463 63034 91521 -137400 108488 -42060 35467 79216 -160281 -356020
9739c56020J70037j88517q9022J48838b8730k97490b9376r9179k6472j1838F7275
$$ -356020 -185983 -374500 -463522 -314684 -28730 -326220 -29376 -128555 -155027 -166865 67275
9727A36367b41613f6658F5445b56988g5964k82607a00967M2934F5576a55733C45569
$$ 136367 -241613 -66658 65445 -256988 -75964 -358571 -100967 -58033 65576 -155733 345569
9715a56527a4027j68961B19114p7046b16382C48816j51055a68642j07302d0206
$$ -156527 -14027 -182988 219114 142068 -216382 348816 197761 -168642 -275944 -40206
9704d5713k64927a21983e1977n569j19255c7258j40072o3514a01599L1891G577
$$ -45713 -310640 -121983 -51977 -57546 -176801 -37258 -177330 -240844 -101599 -69708 7577
9692i1190o6938A20342b43302b1128R061j73371k28221H0198J14408M9467h7657
$$ -91190 -158128 120342 -243302 -21128 -12067 -185438 -413659 80198 194606 244073 -87657
9680A84568d74309A14364J73651a13829r387p9531A39400b336A76344M5284c36975
$$ 184568 -474309 114364 288015 -113829 -123216 -202747 139400 -2336 176344 221628 -336975
9668c51035h3456A19974a27459g588A75258a40636L5989A66021a1055D299d9188
$$ -351035 -83456 119974 -127459 -7588 175258 -140636 -104647 166021 -11055 4299 -49188
9656b95594B41599a34325l2706O2199D9774A0921J89401n4003c35735F2238c57176
$$ -295594 241599 -134325 -167031 -104832 49774 10921 200322 146319 -335735 62238 -357176
9644b6343l32482e8683Q764l1911A7976p338M4679A2557d76273a53150j31348
$$ -26343 -358825 -58683 -49919 -81830 17976 10638 55317 12557 -476273 -153150 -284498
9633b84498d8772j56180R6834k8093B31014B0951M4502f3973H2314k9830b40799
$$ -284498 -48772 -204952 -108118 -136211 231014 20951 65453 -63973 82314 52484 -240799
9621g9031B7430J81649d74258a91391q1193j12919a48521A21223B4832h2582l30171
$$ -79031 27430 209079 -474258 -191391 -272584 -385503 -148521 121223 24832 -82582 -412753
9610d12753A61713l932d23496A29224k8255J57491a96348A93565c31028q5266
$$ -412753 161713 157781 -423496 129224 100969 258460 -196348 193565 -331028 -416294
9600d16294J53536k2867P4603K8247D5068f2420I8069a75569P8591F3970K27089
$$ -416294 -262758 -285625 -211022 -182775 45068 -62420 98069 -175569 -96978 63970 291059
9589B91059J2727e72371C6914d2472A79892f4306B82193c22122i6978g887D4412
$$ 291059 303786 -572371 36914 -42472 179892 -64306 282193 -322122 -96978 -7887 44412
9577B10696k3112d700A64234K87878a03175l9498B2983a83362G0884b01348e5831
$$ 210696 187584 -4700 164234 452112 -103175 -142673 22983 -183362 70884 -201348 -55831
9565A5324h6185n7988N5369j6185A15088f6784C24127O8280c53801J70934m4136
$$ 15324 -86185 -144173 -88804 -104989 115088 -66784 324127 392407 -353801 -182867 -227003
9554b27003E5095b47789A48736c1533p2639o5501a5112A31588a53802l3400M5079
$$ -227003 55095 -247789 148736 -31533 -104172 -169673 -15112 131588 -153802 -187202 -142123
9543a42123D9704M567J21499h6205J0973k64788J2618d0131B79005a95335g9454
$$ -142123 49704 54271 175770 -86205 -75232 -340020 -327402 -40131 279005 -195335 -79454
9531c10155f5617b1900j97303d1877j08673l9054j9077E275d5249j81897j15299
$$ -310155 -65617 -21900 -219203 -41877 -150550 -189604 -208681 5275 -45249 -227146 -342445
9520c42445C7703J8327N4022k3675R9159G282d8266j33676A78868q8279a06679
$$ -342445 37703 56030 110052 86377 185536 7282 -48266 -181942 178868 90589 -106679
9508A3705Q379a55065E3081c14951K5187C515J54638a49741M5150j32256M8636
$$ 13705 22084 -155065 53081 -314951 -289764 3515 158153 -149741 -104591 -236847 -188211
9497a88211I6065J96283c8137m835A07453a13977d0610A70264d0045C08387A3098
$$ -188211 96065 292348 -38137 -42972 107453 -113977 -40610 170264 -40045 308387 13098
9485a29309o7500R5602J1377C4788O9843i2740j02830m077M4241B739K18803a92642
$$ -129309 -196809 -101207 -89830 34788 104631 -92740 -195570 -199647 -155406 2739 221542 -192642
9472b75523P9237i5700J6039G7076c61398d8369A22109d84267a85026j49592J50812
$$ -275523 -196286 -95700 -79661 77076 -361398 -48369 122109 -484267 -185026 -334618 -183806
9461a83806A40441g4434L6571l645J381n0627c9952k30106M8984A97880a11295
$$ -183806 140441 -74434 -37863 -41508 -40127 -90754 -39952 -270058 -221074 197880 -111295
9449c16638D2353i5856j18128A11185b3737q534B16953H1852g5970A14265a23038
$$ -316638 42353 -95856 -213984 111185 -23737 -32271 216953 81852 -75970 114265 -123038
9437a8266G3240b68742F0484J11719e6230J8157k05799L732h126j96664C42647
$$ -18266 73240 -268742 60484 172203 -56230 -38073 -243872 -240140 -8126 -204790 342647
9425a21763A8433G519M882a84697B52282C0511b9357k21598R0911I3907J58645
$$ -121763 18433 7519 12401 -184697 252282 30511 -29357 -250955 -160044 93907 252552
9414B52552Q5956a42719A3936K03239g4632A99852E3100A7289a76538F3049a14110
$$ 252552 338508 -142719 13936 217175 -74632 199852 53100 17289 -176538 63049 -114110
9402a49069P1916D803a44012O8000A9247a09644d6274k12389a1935j01128n6729
$$ -149069 -77153 4803 -144012 -76012 19247 -109644 -46274 -258663 -11935 -113063 -169792
9391a69792o9180A54456g7757A53442b63329C993a90836A55515h9561j32853Q9067
$$ -169792 -238972 154456 -77757 153442 -263329 3993 -190836 155515 -89561 -222414 -133347
9380a33347l5570C88339B4218b05219K094j66955a40829B2808c61678J38273A30058
$$ -133347 -168917 388339 24218 -205219 -203125 -370080 -140829 22808 -361678 -223405 130058
9368B8029N6985B9830b51854h1432j50157A22944f228A18069e9775j0921m10970
$$ 28029 85014 29830 -251854 -81432 -231589 122944 -6228 118069 -59775 -70696 -481666
9357d81666g7135j8300j5596r3020B62558a62170g1113K4927l76657J64756P1084
$$ -481666 -77135 -95435 -111031 -204051 262558 -162170 -71113 -46186 -422843 -258087 -187003
9346a87003A4528O5206k2648a80536b8534C8561b44138j34124f9668p3839l8546
$$ -187003 14528 79734 57086 -180536 -28534 38561 -244138 -378262 -69668 -143507 -182053
9335a82053E4767g6569c1747m232B05550d63112C39705f4062j19832H0934a13686
$$ -182053 54767 -76569 -31747 -35979 205550 -463112 339705 -64062 -183894 80934 -113686
9323a84475A17360B8378P302K19172A5359b5720L533q3638M6670B8322i9916K5358
$$ -184475 117360 28378 35680 254852 15359 -25720 -22187 -105825 -59155 28322 -99916 -74558
9311g4558c2165l0196D1370J45657e871j62146P9761o8566O8251b1382j58474
$$ -74558 -32165 -62361 41370 187027 -5871 -168017 -88256 -156822 -88571 -21382 -179856
9300a79856F4515B977N7429c1207r597n4339p634p8308q2562B31090b93797j35673
$$ -179856 64515 2977 60406 -31207 -40804 -95143 -102777 -181085 -263647 231090 -293797 -429470
9288d29470O8920a00615A14605a10064E3005G079a08655p7477l9020j9633B71322
$$ -429470 -360550 -100615 114605 -110064 53005 7079 -108655 -186132 -225152 -244785 271322
9276h2740D7294b7627j27213e64A50342h502j22643j61930j1173a11302F3742
$$ -82740 47294 -27627 -154840 -564 150342 -8502 -131145 -293075 -304248 -111302 63742
9264C7817a45073a058j22662E1612b20358J09356K3493a0695C0937Q350a72942
$$ 37817 -145073 -1058 -123720 51612 -220358 -111002 -87509 -10695 30937 39287 -172942
9252a06524A74466d21394E0972d5081l05647E9290J65301a06130j84010B862g7073
$$ -106524 174466 -421394 50972 -45081 -350728 59290 224591 -106130 -290140 2862 -77073
9240a95529q5807J34537j80280R10F5721h4717C9326e6168l2402A09945c03958
$$ -195529 -281336 -146799 -327079 -326169 65721 -84717 39326 -56168 -88570 109945 -303958
9228B12482b1148A85916e4756B14711a16372M5337A44368P148A2378m994b01503
$$ 212482 -21148 185916 -54756 214711 -116372 -71035 144368 151516 12378 7384 -201503
9216B07270c70857J57950G0374a93992D859L02389a97755e941j83973k4161k9091
$$ 207270 -370857 -212907 70374 -193992 4859 307248 -197755 -5941 -189914 -214075 -243166
9205b43166A05982b69979o4152a210j47516k620H6184d92553K33948M0413a36
$$ -243166 105982 -269979 -334131 -1210 -148726 -151346 86184 -492553 -258605 -218192 -136
9193C5198a3786k0898m2555K6120o7474l1264A88553a80035A15923d76286h7549
$$ 35198 -13786 -34684 -77239 -51119 -118593 -149857 188553 -180035 115923 -476286 -87549
9181I2525b14866B6982a06411j71242b907k92486B14622G5616d1063A03702K98150
$$ 92525 -214866 26982 -106411 -277653 -2907 -295393 214622 75616 -41063 103702 401852
9170D01852F1837c1903C01309k93J10208A14360i1598r8564a536l2319A62310
$$ 401852 61837 -31903 301309 301016 411224 114360 -91598 -190162 -1536 -33855 162310
9158d4852D256a67158p1401F6658a58251O6988q8069k37695A61050c5187k9545
$$ -44852 4256 -167158 -238559 66658 -158251 -91263 -179332 -417027 161050 -35187 -64732
9147f4732k42567d6271H8173b77018G3470b07462f1556A1706a89827A0987b95451
$$ -64732 -307299 -46271 88173 -277018 73470 -207462 -61556 11706 -189827 10987 -295451
9135a69485O2815C48788B6093c49486f4205A57830K0187a75271E4067d12818a63640
$$ -169485 -106670 348788 26093 -349486 -64205 157830 178017 -175271 54067 -412818 -163640
9123e4369j18835A73195b82516N0467P482F8704c80637P6388a24206b7788l8141
$$ -54369 -173204 173195 -282516 -232049 -224567 68704 -380637 -304249 -124206 -27788 -65929
9112f5929B41603a20533d4504A14544a67061O7327c4886j69579R8283p0163E0201
$$ -65929 241603 -120533 -44504 114544 -167061 -99734 -34886 -204465 -106182 -176345 50201
9100C7957P4066a93388B5485O6901h5392F0058a71229b5647k00369A41211c33114
$$ 37957 112023 -193388 25485 92386 -85392 60058 -171229 -25647 -226016 141211 -333114
9088d737j36159C1456h1486n8170k98306h138k30416A48137E8061a29586o8861
$$ -4737 -140896 31456 -81486 -139656 -437962 -8138 -238554 148137 58061 -129586 -198447
9077a98447A9472J07890a11697N4347K4420I6006M789O1274b9127H0589G2b36644
$$ -198447 19472 127362 -111697 -57350 -32930 96006 100795 162069 -29127 80589 72 -236644
9064c6488A28481R6730c62019D878a24877m4360A3589L7474a71108B10584e40878
$$ -36488 128481 225211 -362019 4878 -124877 -169237 13589 51063 -171108 210584 -540878
9052A39937E5009Q0963d8139I2972f6631j33472h553k03062j12885A22188b46736
$$ 139937 55009 135972 -48139 92972 -66631 -200103 -8553 -211615 -324500 122188 -246736
9040C21999g9939m0308A40101d1558k13120P8278j50883H1761K17378c55790a56146
$$ 321999 -79939 -120247 140101 -41558 -254678 -176400 -327283 81761 299139 -355790 -156146
9028A78391b93269l241P4472K636h2557k35971C2216b07157A99031k3546a11242
$$ 178391 -293269 -296510 -222038 -219402 -82557 -318528 32216 -207157 199031 175485 -111242
9016c27933P4200c5016G6481j5916d6156J8619F9474c39106c9555J839A39831
$$ -327933 -253733 -35016 76481 60565 -46156 -27537 69474 -339106 -39555 -37716 139831
9004A70371l6294a19914P493k78307A0351a99662a7235o8510q3919j5663A98313
$$ 170371 134077 -119914 -112421 -390728 10351 -199662 -17235 -85745 -169664 -185327 198313
8992c2142k89108A96016f8306l52704a11113k09925L8677A4600K4578g3963C08125
$$ -32142 -321250 196016 -68306 -421010 -111113 -321038 -282361 14600 39178 -73963 308125
8980d201B4454O1527k9374A6961q447J34576b85351N0771A80147a36698L0347
$$ -4201 24454 85981 56607 16961 8514 143090 -285351 -234580 180147 -136698 -106351
8969a06351e2721B80059M885b15764c3706F5860f4622l43077J05160d5320j60223
$$ -106351 -52721 280059 284944 -215764 -33706 65860 -64622 -407699 -302539 -45320 -205543
8958b05543j00961A02375j155a59502P5090E0420a29053e6632A09280g6356l6824
$$ -205543 -306504 102375 101220 -159502 -84412 50420 -129053 -56632 109280 -76356 -113180
8947a13180a5488L45l2931A86325J65253d9967B12817c65048a22310j43763A54922
$$ -113180 -15488 -15143 -48074 186325 351578 -49967 212817 -365048 -122310 -266073 154922
8935C45079f4059A47627l2793L16026e4518A53797J68001A26871d3661B56657
$$ 345079 -64059 147627 114834 430860 -54518 153797 321798 126871 -43661 256657
8924A44872L38952Q38160J957172P376292k335036B179850G75918k01845j39739
$$ 144872 483824 1321984 3279156 10655448 8320412 2179850 775918 574073 434334
8915D34334A37261o8428a69227B56760i04m955C7487J17706J58129A22694C790
$$ 434334 137261 68833 -169227 256760 -904 -5859 37487 155193 313322 122694 3790
8903a92491j04750Q6884L4462N9343i124A93142b39402O9100n2036C3563O4977
$$ -192491 -297241 -210357 -175895 -116552 -9124 193142 -239402 -170302 -222338 33563 98540
8892I8540b99872o6634F796Q7634a62496j13623C03840e6752m7461k16632Q1771
$$ 98540 -299872 -366506 6796 94430 -162496 -276119 303840 -56752 -104213 -320845 -239074
$$ [...]
##END NTUPLES=NMR SPECTRUM
##END=
