
##TITLE=AC1233_PERAH12114_6519287_kQ2xMY586G
##JCAMPDX= 6.0         $$ Bruker NMR JCAMP-DX V2.0
##DATA TYPE= NMR SPECTRUM
##DATA CLASS= NTUPLES
##ORIGIN= BRUKER
##OWNER= Administrator
$$ 1.72 TOPSPIN		Version 2.1
$$ 2012-07-14 11:45:33.093 -0500  Administrator@TOPSPIN
$$ Compression mode = diff/dup
##.OBSERVE FREQUENCY= 400.02188249412
##.OBSERVE NUCLEUS= ^1H
##.ACQUISITION MODE= SIMULTANEOUS (DQD)
##.ACQUISITION SCHEME= undefined
##.AVERAGES= 64
##.DIGITISER RES= 22
##SPECTROMETER/DATA SYSTEM= spect
##.PULSE SEQUENCE= noesygpps1d.comp
##.SOLVENT NAME= COFFEE_meoh
##.SHIFT REFERENCE= INTERNAL, COFFEE_meoh, 1, 14.96155
##AUDIT TRAIL= $$ (NUMBER, WHEN, WHO, WHERE, PROCESS, VERSION, WHAT)
$$ ##TITLE= Audit trail, TOPSPIN		Version 2.1
$$ ##JCAMPDX= 5.01
$$ ##ORIGIN= Bruker BioSpin GmbH
$$ ##OWNER= Administrator
$$ $$ C:\Bruker\TOPSPIN/data/COFFEE/nmr/AC1233_PERAH12114_6519287_kQ2xMY586G/62/pdata/1/auditp.txt
$$ ##AUDIT TRAIL=  $$ (NUMBER, WHEN, WHO, WHERE, PROCESS, VERSION, WHAT)
(   1,<2012-07-14 11:45:28.687 -0500>,<Administrator>,<TOPSPIN>,<go>,<TOPSPIN 2.1>,
      <created by zg
	started at 2012-07-14 11:33:58.593 -0500,
	POWCHK enabled, PULCHK disabled,
       configuration hash MD5:
       6B 1B 68 BB D9 2E 58 E2 7F 35 AD 54 07 DF 0E 41
       data hash MD5: 64K
       B5 C1 5B C9 69 F7 86 E4 B5 B9 79 EB 43 26 04 CD>)
(   2,<2012-07-14 11:45:31.359 -0500>,<Administrator>,<TOPSPIN>,<proc1d>,<TOPSPIN 2.1>,
      <Start of raw data processing
       efp LB = 0.3 FT_mod = 6 PKNL = 1 PHC0 = 0 PHC1 = 0 SI = 128K 
       data hash MD5: 128K
       0B 5C 67 B7 A9 A6 65 DF A3 37 E0 A5 65 8C 38 A1>)
(   3,<2012-07-14 11:45:32.421 -0500>,<Administrator>,<TOPSPIN>,<proc1d>,<TOPSPIN 2.1>,
      <pk PHC0 = 0.0769043 PHC1 = 0 
       data hash MD5: 128K
       20 BF DF 82 02 92 7F 1F AB 27 91 3D 3F 78 0D AA>)
(   4,<2012-07-14 11:45:32.718 -0500>,<Administrator>,<TOPSPIN>,<proc1d>,<TOPSPIN 2.1>,
      <abs ABSG = 1 
       data hash MD5: 128K
       94 7A 87 63 C3 AD CB D3 CA A9 8B C3 C2 A4 54 D7>)
(   5,<2012-07-14 11:45:32.796 -0500>,<Administrator>,<TOPSPIN>,<proc1d>,<TOPSPIN 2.1>,
      <abs ABSG = 2 
       data hash MD5: 128K
       A4 29 CF DB D6 97 7B 5B 32 AA BF ED 69 23 78 50>)
(   6,<2012-07-14 11:45:32.859 -0500>,<Administrator>,<TOPSPIN>,<proc1d>,<TOPSPIN 2.1>,
      <abs ABSG = 3 
       data hash MD5: 128K
       93 FF C2 61 6E E2 1F F8 5A 0C 49 2B 5B 69 19 F1>)
(   7,<2012-07-14 11:45:32.921 -0500>,<Administrator>,<TOPSPIN>,<proc1d>,<TOPSPIN 2.1>,
      <abs ABSG = 4 
       data hash MD5: 128K
       37 FB C3 1C A5 E4 BB 74 B9 AE 68 CF 45 F2 F8 B5>)
(   8,<2012-07-14 11:45:32.968 -0500>,<Administrator>,<TOPSPIN>,<proc1d>,<TOPSPIN 2.1>,
      <abs ABSG = 5 
       data hash MD5: 128K
       3D 0C FC C8 F8 16 2E 48 8A 0B 2D 6A 58 4E F0 7D>)
$$ ##END=
$$ 
$$ $$ hash MD5
$$ $$ 9C A7 76 C8 6B A0 5F 7A D5 FB C7 D4 EC D0 14 C6
##$RELAX= 
##$RELAX= 
##$RELAX= 
##$RELAX= 
##$RELAX= 
##$RELAX= 
##$RELAX= 
##$RELAX= 
##$RELAX= 
$$ [...]
##$TP07= 0
##$TPNAME0= <>
##$TPNAME1= <>
##$TPNAME2= <>
##$TPNAME3= <>
##$TPNAME4= <>
##$TPNAME5= <>
##$TPNAME6= <>
##$TPNAME7= <>
##$TPOAL= (0..7)
0.5 0.5 0.5 0.5 0.5 0.5 0.5 0.5
##$TPOFFS= (0..7)
0 0 0 0 0 0 0 0
##$TUNHIN= 0
##$TUNHOUT= 0
##$TUNXOUT= 0
##$USERA1= <user>
##$USERA2= <user>
##$USERA3= <user>
##$USERA4= <user>
##$USERA5= <user>
##$V9= 5
##$VALIST= <valist>
##$VCLIST= <CCCCCCCCCCCCCCC>
##$VD= 0
##$VDLIST= <DDDDDDDDDDDDDDD>
##$VPLIST= <PPPPPPPPPPPPPPP>
##$VTLIST= <TTTTTTTTTTTTTTT>
##$WBST= 2048
##$WBSW= 25
##$XGAIN= (0..3)
0 0 0 0
##$XL= 0
##$YL= 0
##$YMAX_a= 16815081
##$YMIN_a= -13024988
##$ZGOPTNS= <>
##$ZL1= 120
##$ZL2= 120
##$ZL3= 120
##$ZL4= 120
##$ABSF1= 14.96155
##$ABSF2= -5.596632
##$ABSG= 5
##$ABSL= 3
##$ALPHA= 0
##$AQORDER= 0
##$ASSFAC= 0
##$ASSFACI= 0
##$ASSFACX= 0
##$ASSWID= 0
##$AUNMP= <proc_prof1d_extract.lims>
##$AXLEFT= 0
##$AXNAME= <>
##$AXNUC= <1H>
##$AXRIGHT= 0
##$AXTYPE= 0
##$AXUNIT= <>
##$AZFE= 0.1
##$AZFW= 0.1
##$BCFW= 0
##$BC_mod= 0
##$BYTORDP= 0
##$COROFFS= 0
##$CY= 15
##$DATMOD= 1
##$DC= 0
##$DFILT= <>
##$DTYPP= 0
##$F1P= 0
##$F2P= 0
##$FCOR= 0.5
##$FTSIZE= 131072
##$FT_mod= 6
##$GAMMA= 0
##$GB= 0
##$INTBC= 1
##$INTSCL= 1
##$ISEN= 128
##$LB= 0.3
##$LEV0= 0
##$LPBIN= 0
##$MAXI= 10000
##$MC2= 0
##$MEAN= 0
##$ME_mod= 0
##$MI= 0
##$NCOEF= 0
##$NC_proc= -2
##$NLEV= 6
##$NOISF1= 0
##$NOISF2= 0
##$NSP= 0
##$NTH_PI= 0
##$NZP= 0
##$OFFSET= 14.96155
##$PC= 1
##$PHC0= 0.0769043
##$PHC1= 0
##$PH_mod= 1
##$PKNL= yes
##$PPARMOD= 0
##$PPDIAG= 0
##$PPIPTYP= 0
##$PPMPNUM= 2147483647
##$PPRESOL= 1
##$PSCAL= 4
##$PSIGN= 0
##$PYNMP= <proc.py>
##$REVERSE= no
##$SF= 400.020009416158
##$SI= 131072
##$SIGF1= 0
##$SIGF2= 0
##$SINO= 400
##$SIOLD= 131072
##$SPECTYP= <>
##$SREGLST= <1H.CDCl3>
##$SSB= 0
##$STSI= 131072
##$STSR= 0
##$SW_p= 8223.68421052631
##$SYMM= 0
##$S_DEV= 0
##$TDeff= 65536
##$TDoff= 0
##$TI= <>
##$TILT= no
##$TM1= 0
##$TM2= 0
##$TOPLEV= 0
##$USERP1= <user>
##$USERP2= <user>
##$USERP3= <user>
##$USERP4= <user>
##$USERP5= <user>
##$WDW= 1
##$XDIM= 131072
##$YMAX_p= 412797330
##$YMIN_p= -13145
##$CURPLOT= <Network HP LaserJet P1505>
##$CURPRIN= <$Network HP LaserJet P1505>
##$DFORMAT= <normdp>
##$LAYOUT= <+/1D_H.xwp>
##$LFORMAT= <normlp>
##$PFORMAT= <normpl>
##$SURQMSG= 1
$$ End of Bruker specific parameters
$$ ---------------------------------
##NTUPLES= NMR SPECTRUM
##VAR_NAME=  FREQUENCY,     SPECTRUM/REAL,   SPECTRUM/IMAG
##SYMBOL=    X,             R,               I
##VAR_TYPE=  INDEPENDENT,   DEPENDENT,       DEPENDENT
##VAR_FORM=  AFFN,          ASDF,            ASDF
##VAR_DIM=   131072,        131072,          131072
##UNITS=     HZ,            ARBITRARY UNITS, ARBITRARY UNITS
##FACTOR=    0.0627417313425164, 1,          1
##FIRST=     8223.62146879497, -2987,        -86667
##LAST=      0,             -522,            -87430
##MIN=       0,             -13145,          0
##MAX=       8223.62146879497, 412797330,    0
$$ Real data points
##PAGE= N=1
##DATA TABLE= (X++(R..R)), XYDATA
$$ [...]
61303A034579J6406J6738J7481J7503J5713J2107P628L075j492o249j0949j4996
61291A107544j7951j9727k0505k0632k0338j9424j7559j5085j3015j1826j0786
61280I20696q993o693m751l244j484O36K296L013L401M279N697P223Q678J0043
61266I40797J1144J1904J2658J3711J4823J5531J5786J5921J6177J6639J7456
61255A102547J8634J9519J8938J6042J1066N230r6m321p835j1234j4326j6192
61243A137972j6302j5266j4151j3282j2088j0063p481n032l022j179Q70L111N192
61230A049279O808P940Q734R380J0111J1111J2230J3054J3385J3496J3631J3574
61218A182733J3048J2309J1735J1034R545P446N863N521N845N911N683N771O384
$$ y = [1034579, 1050985, 1067723, 1085204, 1102707, 1118420, 1130527, 1138155, 1141230, 1139738, 1133489, 1122540, 1107544, 1089593, 1069866, 1049361, 1028729, 1008391, 988967, 971408, 956323, 943308, 931482, 920696, 911703, 905010, 900259, 897015, 895531, 896167, 898463, 901476, 904877, 909156, 914853, 922076, 930754, 940797, 951941, 963845, 976503, 990214, 1005037, 1020568, 1036354, 1052275, 1068452, 1085091, 1102547, 1121181, 1140700, 1159638, 1175680, 1186746, 1191976, 1191880, 1187559, 1179724, 1168490, 1154164, 1137972, 1121670, 1106404, 1092253, 1078971, 1066883, 1056820, 1049339, 1044307, 1041285, 1040106, 1040976, 1044087, 1049279, 1056087, 1064027, 1072761, 1082141, 1092252, 1103363, 1115593, 1128647, 1142032, 1155528, 1169159, 1182733, 1195781, 1208090, 1219825, 1230859, 1240404, 1247850, 1253713, 1259234, 1265079, 1270990, 1276673, 1282444, 1288828]
61205A288828P185P959Q787R657J0447J1362J2886J5105J7452J9302K0627K1886
61193A451483K3412K4977K5960K5936K5053K3741K1988J9136J4632Q740K381l539
61181A663900q344j1637j3589j5122j7151j9592k1574k2717k3641k4990k6527
61170A459016k7582k8064k8506k9267l0148l0745l0861l0526k9865k8961k7620
61159A136871k5390k2154j8624j5769j3692j1515q633n574l235j659p5J967M172
61146A016690O160P907R310R815Q939O906M445K112P6j462k059j347N80L146N773
61131A076991Q424J1615J5684K0114K3975K6990K9771L2815L5780L8094L9830
61120A360083M1458M3044M4270M5052M5526M5459M4291M1928L8971L5942L2711
$$ y = [1288828, 1296013, 1303972, 1312759, 1322416, 1332863, 1344225, 1357111, 1372216, 1389668, 1408970, 1429597, 1451483, 1474895, 1499872, 1525832, 1551768, 1576821, 1600562, 1622550, 1641686, 1656318, 1665058, 1667439, 1663900, 1655556, 1643919, 1630330, 1615208, 1598057, 1578465, 1556891, 1534174, 1510533, 1485543, 1459016, 1431434, 1403370, 1374864, 1345597, 1315449, 1284704, 1253843, 1223317, 1193452, 1164491, 1136871, 1111481, 1089327, 1070703, 1054934, 1041242, 1029727, 1021094, 1015520, 1012285, 1010626, 1010551, 1012518, 1016690, 1022850, 1030757, 1040067, 1049882, 1058821, 1065727, 1070172, 1072284, 1072360, 1070898, 1068839, 1067492, 1068072, 1071218, 1076991, 1085415, 1097030, 1112714, 1132828, 1156803, 1183793, 1213564, 1246379, 1282159, 1320253, 1360083, 1401541, 1444585, 1488855, 1533907, 1579433, 1624892, 1669183, 1711111, 1750082, 1786024, 1818735]
61109A818735K8866K4369J9514J4498R320M083q43n089q787j2668j7433k2952
61097A851613k8452l3519l8554m3782m8425n1427n2774n3304n3336n2332m9992
61086A345716m6915m3805m0669l7184l3390k9572k5892k2550j9928j8108j6475
61075A011228j4285j1566r021p141n730m322k775j332k20O75J670K838L918M790
61061I68727N787P190Q615R485J0078J1458J4096J7112J9328K0713K2285K4735
61049A139609K7629L0002L1427L2321L3297L4397L5105L5078L4580L4016L3344
61038A500805L2199L0496K8519K6580K4866K3360K1582J8761J4834J1000Q551
61027A741553P353O190M423K418N72j002j767j007R34K799M161N946Q720J1758
$$ y = [1818735, 1847601, 1871970, 1891484, 1905982, 1915302, 1919385, 1918542, 1913453, 1904666, 1891998, 1874565, 1851613, 1823161, 1789642, 1751088, 1707306, 1658881, 1607454, 1554680, 1501376, 1448040, 1395708, 1345716, 1298801, 1254996, 1214327, 1177143, 1143753, 1114181, 1088289, 1065739, 1045811, 1027703, 1011228, 996943, 985377, 976356, 969215, 963485, 959163, 956388, 955056, 954836, 955511, 957181, 960019, 963937, 968727, 974514, 981704, 990319, 999804, 1009882, 1021340, 1035436, 1052548, 1071876, 1092589, 1114874, 1139609, 1167238, 1197240, 1228667, 1260988, 1294285, 1328682, 1363787, 1398865, 1433445, 1467461, 1500805, 1533004, 1563500, 1592019, 1618599, 1643465, 1666825, 1688407, 1707168, 1722002, 1733002, 1741553, 1748906, 1755096, 1759519, 1761937, 1762509, 1761507, 1759740, 1758733, 1759667, 1762466, 1766627, 1772573, 1781293, 1793051]
61013A793051J4562J8088K3305K9505L5311M0689M6682N3581O0636O7398P4199
61002B257007Q1329Q8600R5758J02678J09327J16294J25046J36950J52306J71037
60992C436332J93891K21958K55228K92568L33068L76875M25296M81048N48042
60983F564306O30326P32121Q59665J020734J218894J447669J692045J935644K165752
60974A8267156K375459K567148K750772K922857L034073K984887K678334K099517
60966C9680203J349885N99749J237l65846m93068m26398k66856j67492k85583
60957C9625831o99171j353099k085645k715394l120728l266559l185476k944613
60949B0255146k617460k264626j925137j618839j353938j131807r48454p96989
$$ y = [1793051, 1807613, 1825701, 1849006, 1878511, 1913822, 1954511, 2001193, 2054774, 2115410, 2182808, 2257007, 2338336, 2426936, 2522694, 2625372, 2734699, 2850993, 2976039, 3112989, 3265295, 3436332, 3630223, 3852181, 4107409, 4399977, 4733045, 5109920, 5535216, 6016264, 6564306, 7194632, 7926753, 8786418, 9807152, 11026046, 12473715, 14165760, 16101404, 18267156, 20642615, 23209763, 25960535, 28883392, 31917465, 34902352, 37580686, 39680203, 41030088, 41629837, 41631074, 41265228, 40772160, 40345762, 40078906, 39911414, 39625831, 38926660, 37573561, 35487916, 32772522, 29651794, 26385235, 23199759, 20255146, 17637686, 15373060, 13447923, 11829084, 10475146, 9343339, 8394885, 7597896]
60941G597896o71499n68537m85515m19408l67251l26392k93767k66089k41313
60932C958125k19118j99599j82200j66175j51163j36904j23218j10763j01039
60923B567946r4855r1207q8167q4550q0320p5786p1083o6252o1364n6487n1825
60912A746050m7657m3956m0287l6434l2922l0522k9335k8694k7918k6845k5646
60901A375834k4470k3424k2620k2072k1582k0862j9785j8520j7444j6790j6381
60890A151884j5848j5136j4636j4551j4402j3505j1864j0262r380r137r101r115
60878A004947r245r353r154q684q269q026p718p303p234p944r176j0114j0153
60865H92574r406q504p986p785p216n677l518j969j873k668l061k583j990k026
$$ y = [7597896, 6926397, 6357860, 5872345, 5452937, 5085686, 4759294, 4465527, 4199438, 3958125, 3739007, 3539408, 3357208, 3191033, 3039870, 2902966, 2779748, 2668985, 2567946, 2473091, 2381884, 2293717, 2209167, 2128847, 2053061, 1981978, 1915726, 1854362, 1797875, 1746050, 1698393, 1654437, 1614150, 1577716, 1544794, 1514272, 1484937, 1456243, 1428325, 1401480, 1375834, 1351364, 1327940, 1305320, 1283248, 1261666, 1240804, 1221019, 1202499, 1185055, 1168265, 1151884, 1136036, 1120900, 1106264, 1091713, 1077311, 1063806, 1051942, 1041680, 1032300, 1023163, 1014062, 1004947, 995702, 986349, 977195, 968511, 960242, 952216, 944498, 937195, 929961, 922017, 912841, 902727, 892574, 883168, 874664, 866678, 858893, 851677, 846000, 842482, 840513, 838640, 835972, 832911, 830328, 828338, 826312]
60851H26312k428k491k149j906j877j510m19R76J900K077J928J989K424L010L360
60836H31196L046J825r6k011l159l304k816k220j823j702j895k426l247m154m799
60821H02415m828m242l584l541m254n217n912o178n947n047l670k634k708l735
60807G40918m791n182m910m346l916m020m723n447n455m782m260m407m828m962
60793F74889m911n081n308m966l885k678k076k210k646k859k638k188j956k194
60779F29293k617k585j754m97L86M30j05n81o38l67J8M43Q26R83R51J234K325
60762F27745M021N473N973N520M643M003M052M709N244M883L742K812K760L044
60748F88624K605J188m61j613k238k655k974l293m063n664p606q717q451p645
$$ y = [826312, 823884, 821393, 819244, 817338, 815461, 813951, 813532, 814508, 816408, 818485, 820413, 822402, 824826, 827836, 831196, 834242, 836067, 835971, 833960, 830801, 827497, 824681, 822461, 820638, 818936, 817041, 814615, 811368, 807214, 802415, 797587, 793345, 789761, 786220, 781966, 776749, 770837, 764659, 758712, 753665, 749995, 747361, 744653, 740918, 736127, 730945, 726035, 721689, 717773, 713753, 709030, 703583, 698128, 693346, 689086, 684679, 679851, 674889, 669978, 664897, 659589, 654623, 650738, 648060, 645984, 643774, 641128, 638269, 635631, 633443, 631487, 629293, 626676, 624091, 622337, 621840, 622226, 622656, 622551, 621970, 621332, 620965, 620983, 621426, 622252, 623235, 624186, 625420, 627745, 631766, 637239, 643212, 648732, 653375, 657378, 661430, 666139, 671383, 676266, 680008, 682820, 685580, 688624, 691229, 692417, 691956, 690343, 688105, 685450, 682476, 679183, 675120, 669456, 661850, 653133, 644682, 637037]
60734F37037p512q032p976o607m661l355k944k841k721k749k839k587k024j755
60720E78434j976j992j201r6K75k96r33p97o7M26K24l03m84j04M82Q77J077J279
60702E74825J491J541J440J398J540J851K363L120L952M619N120N629O041O006
60688F20936N487M937M724M726M628M361L989L448K664J767J065Q15J067J571
60674F66185J805J428O87J21j71n36j012j111n07M24J090J303J145N95l12j323
60658F69811k250l164l969m224l808l368l555m069m026l149k030j292r20n36J13
60643F29564R16J375Q88o22k434l678m143m166l926l339k439j412k95R03J843
60628F09035K161K029J886J689J053J83j29L94J068J207R29O60M59K57K19K90
$$ y = [637037, 629525, 621493, 613517, 606910, 602249, 598894, 595950, 593109, 590388, 587639, 584800, 582213, 580189, 578434, 576458, 574466, 573265, 573169, 573444, 573148, 572215, 571418, 571351, 571777, 572001, 571698, 571214, 571110, 571592, 572469, 573546, 574825, 576316, 577857, 579297, 580695, 582235, 584086, 586449, 589569, 593521, 598140, 603260, 608889, 614930, 620936, 626423, 631360, 636084, 640810, 645438, 649799, 653788, 657236, 659900, 661667, 662732, 663547, 664614, 666185, 667990, 669418, 670105, 670226, 670055, 669519, 668507, 667396, 666889, 667313, 668403, 669706, 670851, 671446, 671134, 669811, 667561, 664397, 660428, 656204, 652396, 649028, 645473, 641404, 637378, 634229, 632199, 630907, 629987, 629451, 629564, 630480, 631855, 632743, 632121, 629687, 626009, 621866, 617700, 613774, 610435, 607996, 606584, 606289, 607192, 609035, 611196, 613225, 615111, 616800, 617853, 618036, 617907, 618301, 619369, 620576, 621505, 622165, 622624, 622881, 623100, 623390]
60612F23390q8j154k105j941q56%N5j83j85j97o41j352j816j796j396p90k67j79
60594F08499m58m18N28K099L428L999M032M027M322M988N792O244O054N529N257
60579F63922N315N172M412L213K046J184O28J69m91j357j752q43J212L096L692
60564F89618L314L210M195O138Q497J0775J2636J4010J5146J6270J7348J8341
60552H19498J9358K0148J9881J7979J4987J1949R096N729J421l285p395j0209
60540I19157j1467j1323j0292q895p256n322l285j321Q41L536O502R203J1635
60527H91713J4039J6097J7294J8040J9296K1068K2283K2378K1806K0635J7917
60516A102566J3210P666K746j273m739p493r271j0470j1433j1589j0385q527p190
$$ y = [623390, 623302, 622148, 620043, 618102, 617246, 617246, 617301, 617118, 616933, 616736, 616095, 614743, 612927, 611131, 609735, 608945, 608678, 608499, 608041, 607623, 608151, 610250, 613678, 617677, 621709, 625736, 630058, 635046, 640838, 647082, 653136, 658665, 663922, 669237, 674409, 678821, 682034, 684080, 685264, 685892, 686061, 685570, 684213, 682461, 681618, 682830, 685926, 689618, 692932, 696142, 700337, 706475, 714972, 725747, 738383, 752393, 767539, 783809, 801157, 819498, 838856, 859004, 878885, 896864, 911851, 923800, 932896, 938625, 940046, 936761, 929366, 919157, 907690, 896367, 886075, 877180, 869924, 864602, 861317, 859996, 860837, 864373, 870875, 880078, 891713, 905752, 921849, 939143, 957183, 976479, 997547, 1019830, 1042208, 1064014, 1084649, 1102566, 1115776, 1123442, 1126188, 1124915, 1120176, 1112683, 1103412, 1092942, 1081509, 1069920, 1059535, 1051008, 1043818]
60503A043818o360n139l371j797p15L85J832L527N670Q689J2201J5109J7107J9312
60489A110268K2998K8266L4268M0149M5440N0102N4489N8917O2976O5579O5702
60478A639154O2867N6968M8329L7844K6608J5233L961o703j6217k4836l3407m2182
60466A767619n0454n7565o3389o7569o9198o7913o4747o1161n7614n3659m9140
60455A105210m4535m0220l6028l1715k7484k3801k0860j8424j6227j4329j2903
60444H18684j1700j0205q433p176o990p287o994n892m656l783l192k860k972l249
60430G33295k944j841p43m90j000j552j600j029j00O07N82R4M0Q24J781K106J854
60413G29884J642J714J807J698J446J190J015R46R31R95J425K405L455L771L342
$$ y = [1043818, 1037458, 1032319, 1028948, 1027151, 1026436, 1026821, 1028653, 1032180, 1037850, 1046539, 1058740, 1073849, 1090956, 1110268, 1133266, 1161532, 1195800, 1235949, 1281389, 1331491, 1385980, 1444897, 1507873, 1573452, 1639154, 1702021, 1758989, 1807318, 1845162, 1871770, 1887003, 1890964, 1884261, 1868044, 1843208, 1809801, 1767619, 1717165, 1659600, 1596211, 1528642, 1459444, 1391531, 1326784, 1265623, 1208009, 1154350, 1105210, 1060675, 1020455, 984427, 952712, 925228, 901427, 880567, 862143, 845916, 831587, 818684, 806984, 796779, 788346, 781170, 774180, 766893, 759899, 754007, 749351, 745568, 742376, 739516, 736544, 733295, 730351, 728510, 727767, 727277, 726277, 724725, 723125, 722096, 721996, 722603, 723185, 723279, 723319, 724143, 725924, 728030, 729884, 731526, 733240, 735047, 736745, 738191, 739381, 740396, 741342, 742273, 743268, 744693, 747098, 750553, 754324, 757666]
60398G57666L131L796M764N142M926M692M505M016L380L230L659L932L498K666
60384H13003K065J816J633J456J600K295L322M170M533M533M427M193L601K737
60370H55384K188K452L254L668L029J690P82J131K366L294L273K940L302M345
60356H93098N099M944M269L755L604L709M000M344M512M576M986N897O829P282
60342I60904P393P656Q391R711J1556J3308J3847J2592J0170P559M849J452k663
60329A066725o724j0086j2696j4565j5396j5040j3886j2456j0897r123p298n856
60317I32702n057m653m075k976j554k58P53J596K136J974J237R52K188M936Q237
60302I38138J1274J3920J6345J8655K1036K3885K7452L1442L5105L7718L8985
$$ y = [757666, 760797, 764593, 769357, 774499, 779425, 784117, 788622, 792638, 796018, 799248, 802907, 806839, 810337, 813003, 815068, 816884, 818517, 819973, 821573, 823868, 827190, 831360, 835893, 840426, 844853, 849046, 852647, 855384, 857572, 860024, 863278, 866946, 869975, 871665, 872447, 873578, 875944, 879238, 882511, 885451, 888753, 893098, 898197, 903141, 907410, 911165, 914769, 918478, 922478, 926822, 931334, 935910, 940896, 946793, 953622, 960904, 968297, 975953, 984344, 994055, 1005611, 1018919, 1032766, 1045358, 1055528, 1063087, 1067936, 1069388, 1066725, 1060001, 1049915, 1037219, 1022654, 1007258, 992218, 978332, 965876, 954979, 945856, 938558, 932702, 927645, 922992, 918917, 915941, 914387, 914129, 914882, 916478, 918614, 920588, 921825, 922777, 924965, 929901, 938138, 949412, 963332, 979677, 998332, 1019368, 1043253, 1070705, 1102147, 1137252, 1174970, 1213955]
60291A213955L8892L7195L3175K6178J6422M976p037j8826k9483l7844m3266m6037
60279A188300m6645m5067m1372l6546l1866k7624k3305j8960j5532j3570j2409
60268H75404j1057r313p648o404n612n247n126m737l640k111j007q55j284j503
60254H09860j231q86q56q68m08L72O97J73o85j163j173r61n15J95P28O67L81N74
60236H04901J187J570J716K344L566M498M599M569N151N948O289O613P859R793
60222H70603J1171J1572J1881J2697J3338J3080J2486J2662J3663J4504J4524
60211A012181J3917J3014J1854J0576R586R000Q411P503O527N827N296M601L711
60198A122004K755J687L88j110k864n199q050j0456j1431j1269j1184j1545j1355
$$ y = [1213955, 1252847, 1290042, 1323217, 1349395, 1365817, 1370793, 1363756, 1344930, 1315447, 1277603, 1234337, 1188300, 1141655, 1096588, 1055216, 1018670, 986804, 959180, 935875, 916915, 901383, 887813, 875404, 864347, 855034, 847386, 840982, 835370, 830123, 824997, 820260, 816620, 814509, 813502, 812647, 811363, 809860, 808629, 807743, 806887, 806019, 805611, 805983, 806680, 806853, 806168, 805005, 803832, 802871, 802356, 802551, 803279, 803946, 804327, 804901, 806088, 807658, 809374, 811718, 815284, 819782, 824381, 828950, 834101, 840049, 846338, 852951, 860810, 870603, 881774, 893346, 905227, 917924, 931262, 944342, 956828, 969490, 983153, 997657, 1012181, 1026098, 1039112, 1050966, 1061542, 1071128, 1080128, 1088539, 1096042, 1102569, 1108396, 1113692, 1118293, 1122004, 1124759, 1126446, 1126834, 1125724, 1122860, 1117661, 1109611, 1099155, 1087724, 1076455, 1065271, 1053726, 1042371]
60185A042371r851p786o526o403o661o586n983m862l479k522k490k869k622j586
60171I72145o95o52j026j003m48J83N75P24O65M49L24N20R39J205J023M04k77
60154I75055l91M35J792K742K911K921L446M204M418L962L479L475L932M804O110
60139A023295P412P932P602P376Q052R218J0011J0387J0959J1790J2221J1928
60127A138183J1380J1002J0499R394P790O152M680L257J819M33r23k351l834n232
60113A192249o439p436q300r195j0141j0820j0919j0643j0549j0653j0224q722
60101A078208o518m358k576j179k49K88R05J867K712K904K703K715K872K603J857
60086A084754J159P31L45qr4p0l33p19p81q86k029m304o614q240r720j1586j3299
$$ y = [1042371, 1032520, 1024734, 1018208, 1011805, 1005144, 998558, 992575, 987713, 984234, 981712, 979222, 976353, 973731, 972145, 971450, 970798, 969772, 968769, 968321, 968504, 969079, 969803, 970468, 970917, 971241, 971761, 972700, 973905, 974928, 975332, 975055, 974664, 975099, 976891, 979633, 982544, 985465, 988911, 993115, 997533, 1001495, 1004974, 1008449, 1012381, 1017185, 1023295, 1030707, 1038639, 1046241, 1053617, 1061669, 1070887, 1080898, 1091285, 1102244, 1114034, 1126255, 1138183, 1149563, 1160565, 1171064, 1180458, 1188248, 1194400, 1199080, 1202337, 1204156, 1204589, 1203666, 1201315, 1197481, 1192249, 1185810, 1178374, 1170074, 1160879, 1150738, 1139918, 1128999, 1118356, 1107807, 1097154, 1086930, 1078208, 1071690, 1067332, 1064756, 1063577, 1063328, 1063616, 1064521, 1066388, 1069100, 1072004, 1074707, 1077422, 1080294, 1082897, 1084754, 1085913, 1086644, 1086989, 1086981, 1086887, 1086817, 1086484, 1085765, 1084984, 1084098, 1082069, 1077765, 1071151, 1062911, 1053191, 1041605, 1028306]
60069A028306j4168j4434j4570j4188j2680j0449q586p514o728n718m443l098
60057I11730k015j591j686j393M6K215M006M891N243N652O511P894R275R675Q790
60042I69243P635P223P008N535K532p57l280n166o805p998q565q944r607j0318
60028I37736j0564j0329j0048r984j0083j0181j0102r660q811p786p039o968p567
60015H18614q138p701o097m423l861m252m432l867l188l031l155k949k214j049
60001G60257M20J861K778L169L743N050O696P837Q215Q305Q572Q927Q927Q293
59987H43050P266O391N850N066L287O32j911l600m715n935p378q547r009q737
59973H21710p992p099o270n439m439l391k650k247j685o57M27R92J207J804L034
$$ y = [1028306, 1014138, 999704, 985134, 970946, 958266, 947817, 939231, 931717, 924989, 919271, 914828, 911730, 909715, 908124, 906438, 905045, 905091, 907306, 911312, 916203, 921446, 927098, 933609, 941503, 950778, 960453, 969243, 976878, 984101, 991109, 996644, 999176, 998419, 995139, 989973, 983168, 975170, 966605, 957661, 948054, 937736, 927172, 916843, 906795, 896811, 886728, 876547, 866445, 856785, 847974, 840188, 833149, 826181, 818614, 810476, 802775, 796678, 792255, 788394, 784142, 779710, 775843, 772655, 769624, 766469, 763520, 761306, 760257, 760677, 762538, 765316, 768485, 772228, 777278, 783974, 791811, 800026, 808331, 816903, 825830, 834757, 843050, 850316, 856707, 862557, 867623, 870910, 871542, 869631, 866031, 861316, 855381, 848003, 839456, 830447, 821710, 813718, 806619, 800349, 794910, 790471, 787080, 784430, 782183, 780498, 779841, 780268, 781260, 782467, 784271, 787305]
59958G87305M301M968N173N523O220O817O775O022M849L538K294J432J272J699
59944H48188J998J431k5j637k621k812k637k531k500k243j587o72L38J437K541
59929H36668L292L400L074K820K936L463M406N544O250O197O105O949Q377Q887
59915I08368P826O283N468N197M658L737K685J289n60k022k233j675j505j781
59901I35735j598p46m4N1R7O93J816L259M863O191O835P101P583Q053P809P059
59885I94757O832P337P672P465P552Q472R469R673R272Q745P887O436M802L314
59871A099685J400j491m744p273q927j0376j1874j3045j3609j3686j3465j3123
59859I89472j2863j2619j1975j0774r411q188o890n450m351l792k977j101J413
$$ y = [787305, 791606, 796574, 801747, 807270, 813490, 820307, 827082, 833104, 837953, 841491, 843785, 845217, 846489, 848188, 850186, 851617, 851592, 849955, 847334, 844522, 841885, 839354, 836854, 834611, 833024, 832352, 832690, 834127, 836668, 839960, 843360, 846434, 849254, 852190, 855653, 860059, 865603, 871853, 878050, 884155, 891104, 899481, 908368, 916194, 922477, 927945, 933142, 937800, 941537, 944222, 945511, 944951, 942929, 940696, 939021, 937516, 935735, 934137, 933391, 933347, 933398, 933495, 934188, 936004, 939263, 944126, 950317, 957152, 964253, 971836, 979889, 987698, 994757, 1001589, 1008926, 1016598, 1024063, 1031615, 1040087, 1049556, 1059229, 1068501, 1077246, 1085133, 1091569, 1096371, 1099685, 1101085, 1099594, 1094850, 1087577, 1078650, 1068274, 1056400, 1043355, 1029746, 1016060, 1002595, 989472, 976609, 963990, 952015, 941241, 931830, 923642, 916752, 911302, 906951, 903159, 900182, 899081, 900494]
59846I00494L411M432M892N151N199N042M718M062L143K647L174M353N416O437
59832I62571Q144J0599J2946J4537J5580J6466J7194J7622J7713J7290J6097J4261
59820A141020J2247J0092P152L002j737n691p848q188p484o581n937n771o450
59807A117826q405j1508j4871j7453j8686j8462j6934j4624j2339j0570r267q355
59795I56352q112q601r238r381r022q443p571o247m708l289j951p23j52n94j449
59780H76871j871j925k187k494k103j043k69l55q70j183j037k53J281K984L796
59765H69342L377K556K351L050M410N965P016P078O723P212Q901J0685J1417J1131
59751I61214J0382R176P401N740N169N648O060N452L854J970M65m02p98r98r18
$$ y = [900494, 903905, 908337, 913229, 918380, 923579, 928621, 933339, 937401, 940544, 943191, 946365, 950718, 956134, 962571, 970715, 981314, 994260, 1008797, 1024377, 1040843, 1058037, 1075659, 1093372, 1110662, 1126759, 1141020, 1153267, 1163359, 1170511, 1173513, 1171776, 1166085, 1158237, 1150049, 1142565, 1135984, 1130047, 1124276, 1117826, 1109421, 1097913, 1083042, 1065589, 1046903, 1028441, 1011507, 996883, 984544, 973974, 964707, 956352, 948240, 939639, 930401, 921020, 911998, 903555, 895984, 889737, 885029, 881740, 879789, 879066, 878914, 878320, 876871, 875000, 873075, 870888, 868394, 866291, 865248, 864979, 864624, 863754, 862571, 861534, 861281, 862562, 865546, 869342, 872719, 875275, 877626, 880676, 885086, 891051, 898067, 905145, 911868, 919080, 927981, 938666, 950083, 961214, 971596, 980772, 988173, 993913, 999082, 1004730, 1010790, 1016242, 1020096, 1022066, 1022531, 1022129, 1021331, 1020333, 1019415]
59736A019415k16J010J949J932J266Q18R24J149J012N60J67J29M34Q19J121J578
59720A034067K539L740M328L922L192K886K802K399K066K773M416N539N145L977
59706A083791L475L973M598M671M477M656N308N988O284O314O561P249P983Q316
59692A163644Q543R403J0778J1320R863O748L212p4l046n213n873n427n348o296
59678A192234p253p155o535o701p917r410j0725j2018j3083j3161j1901r841p756
59665A068778o077m984m418l949l155k121j146l3J552L136L785L449L082L170
59651A061069L081K225R61k11j489l132m676n572o084o846p900q891r765j0578
59637A002192j0940j0354q965p378n934m692l801l403l303l332l703m567n507
$$ y = [1019415, 1019199, 1020209, 1022158, 1024090, 1025356, 1026174, 1027098, 1028247, 1029259, 1029819, 1029986, 1030115, 1030549, 1031368, 1032489, 1034067, 1036606, 1040346, 1044674, 1048596, 1051788, 1054674, 1057476, 1059875, 1061941, 1064714, 1069130, 1074669, 1079814, 1083791, 1087266, 1091239, 1095837, 1100508, 1104985, 1109641, 1114949, 1120937, 1127221, 1133535, 1140096, 1147345, 1155328, 1163644, 1172187, 1181590, 1192368, 1203688, 1213551, 1220299, 1223511, 1223437, 1220391, 1215178, 1209305, 1203878, 1198530, 1192234, 1184981, 1177826, 1171291, 1164590, 1156673, 1147263, 1136538, 1124520, 1111437, 1098276, 1086375, 1076534, 1068778, 1062701, 1057717, 1053299, 1049350, 1046195, 1044074, 1042928, 1042895, 1044447, 1047583, 1051368, 1054817, 1057899, 1061069, 1064150, 1066375, 1067336, 1067125, 1065636, 1062504, 1057828, 1052256, 1046172, 1039326, 1031426, 1022535, 1012770, 1002192, 991252, 980898, 971933, 964555, 958621, 953929, 950128, 946725, 943422, 940090, 936387, 931820, 926313]
59624I26313o070o477p095p535p086n867m719l961l053j613n3J025J502J631J680
59609H78622J868K220K472K350K087K224K865L461L418K599J323Q1p38j159j619
59594I02074k391l153l380k989k314j686j383j684k509l178l100k491k001j864
59580H67951j868j934k107k208k109k148k640l164l093k665k737l470m127m209
59566H29472m036l937l650k806j484l0J222J854J542N27m65q92p43j82N96J215
59550H18203J405J495K117L343M588N421N927O276O593P273Q765J0854J2785J4237
59536I09282J5580J6974J8066J8841K0091K2377K4895K5851K3876J9056J2901
59525A127790P383L565J054r81k542l178l306m132o132q566j0807j3163j5854
$$ y = [926313, 920243, 913766, 906671, 899136, 892050, 886183, 881464, 877503, 874450, 872837, 872784, 873809, 875311, 876942, 878622, 880490, 882710, 885182, 887532, 889619, 891843, 894708, 898169, 901587, 904186, 905509, 905590, 904852, 903693, 902074, 899683, 896530, 893150, 890161, 887847, 886161, 884778, 883094, 880585, 877407, 874307, 871816, 869815, 867951, 866083, 864149, 862042, 859834, 857725, 855577, 852937, 849773, 846680, 844015, 841278, 837808, 833681, 829472, 825436, 821499, 817849, 815043, 813559, 813529, 814751, 816605, 818147, 818674, 818209, 817317, 816574, 816392, 816988, 818203, 819608, 821103, 823220, 826563, 831151, 836572, 842499, 848775, 855368, 862641, 871406, 882260, 895045, 909282, 924862, 941836, 959902, 978743, 998834, 1021211, 1046106, 1071957, 1095833, 1114889, 1127790, 1135173, 1138738, 1139792, 1138811, 1136269, 1133091, 1129785, 1125653, 1119521, 1110955, 1100148, 1086985, 1071131]
59512A071131j8036j8655j7788j6453j5376j4540j3627j2456j1083r713q399o761
59500I08244m437j826J56J213J906K596K860K371J633J337J522J874K337K913
59486I24699L335L474L678M247N006N741O660P920R303J0805J3006J6092J8982
59473A032948K0287J9932J9155J8951J9037J8294J5795J1533O563K354l14j663
59461A182872k032j162J264M825Q636J2135J5044J7015J7958J8453J9127J9651
59449A313786J9015J6762J3480J0068P062M646K781J127q76l664p336j1660j6077
59436A349114j9856k2457k3610k3016k0390j6125j1517p872n560m177l304k672
59424A188558j882n88J181L298N910R054J2138J4362J5596J6363J6970J7201J6770
$$ y = [1071131, 1053095, 1034440, 1016652, 1000199, 984823, 970283, 956656, 944200, 933117, 923404, 915005, 908244, 903807, 901981, 902137, 903350, 905256, 907852, 910712, 913083, 914716, 916053, 917575, 919449, 921786, 924699, 928034, 931508, 935186, 939433, 944439, 950180, 956840, 964760, 974063, 984868, 997874, 1013966, 1032948, 1053235, 1073167, 1092322, 1111273, 1130310, 1148604, 1164399, 1175932, 1182495, 1184849, 1184535, 1182872, 1180840, 1179678, 1180942, 1185767, 1194403, 1206538, 1221582, 1238597, 1256555, 1275008, 1294135, 1313786, 1332801, 1349563, 1363043, 1373111, 1380173, 1384819, 1387600, 1388727, 1387851, 1384187, 1376851, 1365191, 1349114, 1329258, 1306801, 1283191, 1260175, 1239785, 1223660, 1212143, 1204271, 1198711, 1194534, 1191230, 1188558, 1186676, 1186088, 1187269, 1190567, 1196477, 1205531, 1217669, 1232031, 1247627, 1263990, 1280960, 1298161, 1314931]
59411A314931J5629J3865J1822J0268R761R617P993L395l954j2217j9051k2668
59399A339391k2407j8841j3314p066p25N322J0096J1815Q825J122r075j8431k4496
59386A262216k6786k6205k3867k0539j6788j3134r975p372n091k936j176m33q56
59373A107058j614j682r67j67M08J163K218K972L070L157M127O035Q255J0367
59359A144400J2305J4020J5525J7129J9076K1144K2978K4634K6360K8035K9262
59348A374868K9843K9809K9128K7766K5943K3839K1210J7590J2836P224J133n033
59336A596156j0777j5713j9851k3455k6739k9716l2137l3502l3458l2353l0971
59325A307484k9598k7824k5484k3135k1198j9320j7159j5264j4345j4065j3407
$$ y = [1314931, 1330560, 1344425, 1356247, 1366515, 1376276, 1385893, 1393886, 1397281, 1393327, 1381110, 1362059, 1339391, 1316984, 1298143, 1284829, 1277763, 1277038, 1282360, 1292456, 1304271, 1313096, 1314218, 1305143, 1286712, 1262216, 1235430, 1209225, 1185358, 1164819, 1148031, 1134897, 1124922, 1117550, 1112459, 1109523, 1108347, 1107914, 1107058, 1105444, 1103762, 1102795, 1102628, 1103036, 1104199, 1106417, 1109389, 1112459, 1115616, 1119743, 1125778, 1134033, 1144400, 1156705, 1170725, 1186250, 1203379, 1222455, 1243599, 1266577, 1291211, 1317571, 1345606, 1374868, 1404711, 1434520, 1463648, 1491414, 1517357, 1541196, 1562406, 1579996, 1592832, 1600056, 1601189, 1596156, 1585379, 1569666, 1549815, 1526360, 1499621, 1469905, 1437768, 1404266, 1370808, 1338455, 1307484, 1277886, 1250062, 1224578, 1201443, 1180245, 1160925, 1143766, 1128502, 1114157, 1100092, 1086685]
59314A086685j2053j0640r765r427r447r683r753r159p900o569n717n447n617
59301I75508o020o344o303n847n073l956k411n45J369L033M140M559M774N712
59287I62596P674R806J1113J1720J2538J4035J5956J8137K0739K3706K6666K9471
59275A164157L2339L5250L7763L9526M0604M1141M1071M0075L7400L1754K2096
59264A563176Q916n547j8660k8903l6025m0273m1837m0949l8178l4356l0195k6014
59252A231155k1856j7834j4138j0747p439m181j248J146L096M819O472Q256J0264
59239A187765J2122J3203J3343J2940J2155J0668Q371N725L039O3l198o010p908
59226A262278r589j1955j4667j6473j6767j6066j5085j4085j3121j2247j1406
$$ y = [1086685, 1074632, 1063992, 1054227, 1044800, 1035353, 1025670, 1015917, 1006758, 998858, 992289, 986572, 981125, 975508, 969488, 963144, 956841, 950994, 945921, 941965, 939554, 939009, 940378, 943411, 947551, 952110, 956884, 962596, 970270, 980076, 991189, 1002909, 1015447, 1029482, 1045438, 1063575, 1084314, 1108020, 1134686, 1164157, 1196496, 1231746, 1269509, 1309035, 1349639, 1390780, 1431851, 1471926, 1509326, 1541080, 1563176, 1572092, 1566545, 1547885, 1518982, 1482957, 1442684, 1400847, 1359898, 1321720, 1287364, 1257169, 1231155, 1209299, 1191465, 1177327, 1166580, 1159141, 1154960, 1153712, 1154858, 1157954, 1162773, 1169245, 1177501, 1187765, 1199887, 1213090, 1226433, 1239373, 1251528, 1262196, 1270567, 1276292, 1279331, 1279394, 1276196, 1270186, 1262278, 1252689, 1240734, 1226067, 1209594, 1192827, 1176761, 1161676, 1147591, 1134470, 1122223, 1110817]
59215A110817j0493r548q632p714o923o538o427n960m897l887l566l660l536l108
59201A025928k550j652k62J119J981K593L365L945L913L848M513N381N257M198
59187A061577L498L771M329M630N070N957O744O832O361N832N580N931P092Q642
59173A141846R672R832R687R882J0424J0946J1147J0858J0161R311Q154N862J982
59160A259764k582o473r574j2785j6294j9288k1386k3044k4255k4126k2356k0051
59148A057550j8439j7559j6737j5587j4045j2132j0268r120q736q341p415o261
59136I12910n234m170k964j919j071J8J346K191K334K745M326O639Q606R848J0639
59121I46244J1156J1607J2622J4583J6804J8138J8260J7762J7234J6835J6601
$$ y = [1110817, 1100324, 1090776, 1082144, 1074430, 1067507, 1060969, 1054542, 1048582, 1043685, 1039798, 1036232, 1032572, 1029036, 1025928, 1023378, 1021726, 1021464, 1022583, 1024564, 1027157, 1030522, 1034467, 1038380, 1042228, 1046741, 1052122, 1057379, 1061577, 1065075, 1068846, 1073175, 1077805, 1082875, 1088832, 1095576, 1102408, 1108769, 1114601, 1120181, 1126112, 1133204, 1141846, 1151518, 1161350, 1171037, 1180919, 1191343, 1202289, 1213436, 1224294, 1234455, 1243766, 1251920, 1257782, 1259764, 1257182, 1250709, 1241135, 1228350, 1212056, 1192768, 1171382, 1148338, 1124083, 1099957, 1077601, 1057550, 1039111, 1021552, 1004815, 989228, 975183, 963051, 952783, 943663, 934927, 926586, 919171, 912910, 907676, 903506, 900542, 898623, 897552, 897570, 898916, 901107, 903441, 906186, 910512, 917151, 925757, 935605, 946244, 957400, 969007, 981629, 996212, 1013016, 1031154, 1049414, 1067176, 1084410, 1101245, 1117846]
59110A117846J6550J6472J6081J5312J4241J2830J1093R317P850O801O039N322
59098A255754M227K387J4k124l421l910l901l571l111k817k825l087l681m792
59084A225142o242p676r261j1542j4363j6676j7763j7967j7808j7152j5822j4314
59072A058556j3127j1898j0035p862o315n699n432m992m467m120l978l886l726
59059I73019l492l367l624m210m613m374l630k912k521k277j740n78J084K539
59045I39304K985K297J112J12n16q77j038j042r24m65P01K563M586O299P775R383
59029I72255J1295J3352J5161J6329J6850J7177J7604J7654J6685J4850J2927
59018A142139J1138Q977O247L490J203o47k060k741k710k429j951o89J514L865
$$ y = [1117846, 1134396, 1150868, 1166949, 1182261, 1196502, 1209332, 1220425, 1229742, 1237592, 1244393, 1250432, 1255754, 1259981, 1262368, 1262382, 1260258, 1256837, 1252927, 1249026, 1245455, 1242344, 1239527, 1236702, 1233615, 1229934, 1225142, 1218900, 1211224, 1201963, 1190421, 1176058, 1159382, 1141619, 1123652, 1105844, 1088692, 1072870, 1058556, 1045429, 1033531, 1023496, 1015634, 1009319, 1003620, 998188, 993196, 988729, 984609, 980631, 976745, 973019, 969527, 966160, 962536, 958326, 953713, 949339, 945709, 942797, 940276, 937999, 936259, 935681, 936765, 939304, 942289, 944586, 945698, 945810, 945294, 944417, 943379, 942337, 941413, 940948, 941649, 944212, 948798, 955097, 962872, 972255, 983550, 996902, 1012063, 1028392, 1045242, 1062419, 1080023, 1097677, 1114362, 1129212, 1142139, 1153277, 1162254, 1168501, 1171991, 1173194, 1172547, 1170487, 1167746, 1165036, 1162607, 1160656, 1159967, 1161481, 1165346]
59004A165346N692P336R281J1170J2422J3278J4262J5017J4662J3200J1609J0387
58992A303662Q835O106K456j003l513n271o860q362r237q982p636n607l269r34
58978A260385J101K770M403O292Q301J0242J2312J4718J7134J9046K0390K1314
58966A398408K1651K1292K0712K0282J9316J6737J2559P774K882k391p989j3306
58954A517927j8190k3014k7522l0687l2013l2011l1115k9245k6696k4271k2064
58943A221099j9203j5349j1440q385n976l707j693j75J013J856J845R15j62q80
58929A159758j720l207n022o586p687q161p723o623n571m683l459k096j483j462
58915A094275o15J511L493M276M827O322Q171R274J0068J1643J3800J5643J7331
$$ y = [1165346, 1171038, 1178374, 1187655, 1198825, 1211247, 1224525, 1238787, 1253804, 1268466, 1281666, 1293275, 1303662, 1312497, 1318603, 1321059, 1320056, 1316543, 1311272, 1304412, 1296050, 1286813, 1277831, 1270195, 1264588, 1261319, 1260385, 1261486, 1264256, 1268659, 1274951, 1283252, 1293494, 1305806, 1320524, 1337658, 1356704, 1377094, 1398408, 1420059, 1441351, 1462063, 1482345, 1501661, 1518398, 1530957, 1538731, 1541613, 1539222, 1531233, 1517927, 1499737, 1476723, 1449201, 1418514, 1386501, 1354490, 1323375, 1294130, 1267434, 1243163, 1221099, 1201896, 1186547, 1175107, 1166722, 1160746, 1157039, 1155346, 1155171, 1156184, 1158040, 1159885, 1160800, 1160638, 1159758, 1158038, 1154831, 1149809, 1143223, 1135536, 1127375, 1119652, 1113029, 1107458, 1102775, 1099316, 1097220, 1095737, 1094275, 1093660, 1095171, 1098664, 1102940, 1107767, 1114089, 1122260, 1131534, 1141602, 1153245, 1167045, 1182688, 1200019]
58902A200019J9597K2088K3816K4956K6651K9264L2079L4595L6859L8648L9435
58891A528007L9182L8311L7017L5372L3676L2003K9776K6520K2460J7695J1638
58880A851657M289k832q286j2607j7231k2198k6293k9049l1033l2440l2854l2356
58868A608767l1531l0414k8548k6076k3692k1635j9774j8451j8072j8096j7560
58857A354918j6526j5825j5523j4924j4060j3900j4836j6048j6671j6683j6444
58846A183478j6143j5872j5605j5092j4288j3681j3586j3413j2457j0922r383
58835A033036p719n644l806l100l149k695j331L06J937L865N814O894P011P136
58821A038555P808Q312P810O517N345M824M644M003K447N10p95j325k027l384
$$ y = [1200019, 1219616, 1241704, 1265520, 1290476, 1317127, 1346391, 1378470, 1413065, 1449924, 1488572, 1528007, 1567189, 1605500, 1642517, 1677889, 1711565, 1743568, 1773344, 1799864, 1822324, 1840019, 1851657, 1855946, 1853114, 1844828, 1832221, 1814990, 1792792, 1766499, 1737450, 1706417, 1673977, 1641123, 1608767, 1577236, 1546822, 1518274, 1492198, 1468506, 1446871, 1427097, 1408646, 1390574, 1372478, 1354918, 1338392, 1322567, 1307044, 1292120, 1278060, 1264160, 1249324, 1233276, 1216605, 1199922, 1183478, 1167335, 1151463, 1135858, 1120766, 1106478, 1092797, 1079211, 1065798, 1053341, 1042419, 1033036, 1025317, 1019673, 1015867, 1012767, 1009618, 1006923, 1005592, 1005898, 1007835, 1011700, 1017514, 1024408, 1031419, 1038555, 1046363, 1054675, 1062485, 1069002, 1074347, 1079171, 1083815, 1087818, 1090265, 1090775, 1089980, 1088655, 1086628, 1083244]
58807A083244m620n093n512o679p955q310q053q071q024p013n610n390o457p125
58793I89332o288m658l445l018l028k801j554Q11L199M532N175O020O729O310
58779I97316N062M266M009L084J124p22j609j970k495l395m909p162r320j0205
58765I73074r900r499r238q372o978o179o199n756m018j775j31P65J213J368J653
58750I10028K653M178N457O442P778R372J0310J0432J0551J0851J0591R803R660
58737A018106J0500J1048J0418R556R739J0751J1512J1554J1107J0482J0084J0331
58725A145188J1026J1444J1339J1094J0727R729Q078O338M556K172p34l348n532
58712A222077q037j0946j3243j4454j5379j6647j7759j8264j8697j9605k0667
$$ y = [1083244, 1078624, 1073531, 1068019, 1061340, 1053385, 1045075, 1037022, 1028951, 1020927, 1013914, 1008304, 1002914, 996457, 989332, 983044, 978386, 974941, 971923, 968895, 966094, 964540, 965351, 968550, 973082, 978257, 984277, 991006, 997316, 1002378, 1006644, 1010653, 1013737, 1014861, 1014139, 1012530, 1010560, 1008065, 1004670, 999761, 992599, 983279, 973074, 963174, 953675, 944437, 936065, 929087, 922908, 916709, 910953, 906935, 905160, 905029, 905794, 907007, 908375, 910028, 912681, 916859, 922316, 928758, 936536, 945908, 956218, 966650, 977201, 988052, 998643, 1008446, 1018106, 1028606, 1039654, 1050072, 1059628, 1069367, 1080118, 1091630, 1103184, 1114291, 1124773, 1134857, 1145188, 1156214, 1167658, 1178997, 1190091, 1200818, 1210547, 1218625, 1224963, 1229519, 1231691, 1230957, 1227609, 1222077, 1214040, 1203094, 1189851, 1175397, 1160018, 1143371, 1125612, 1107348, 1088651, 1069046, 1048379]
58701A048379k1398k1829k2007k1765k1295k0972k0335j8471j5676j3420j2239
58690H38972j1077r159p156n839n025m556m884n891o435n968n368n299n008l701
58676G53606j936n45P69K735N140P236Q812J0127J1368J2785J4590J6354J7212
58663H58253J7062J6477J5179J1919O430K42n124r594j3458j6187j7232j6962
58651H47005j5966j4320j2242j0400q899p020m618k631j576o68P51K101K673K765
58637G76955K894K920K733K778L155L214K641J932J284K80q31r68j5P35P23J152
58621H01582K969N364P319R054J0767J1564J1020J0393J0710J0970R705P239M791
58608I13447K450l62l228n199o200o616o241m953l683l320l251k346p52O45J927
$$ y = [1048379, 1026981, 1005152, 983145, 961380, 940085, 919113, 898778, 880307, 864631, 851211, 838972, 827895, 818736, 811580, 805741, 800716, 796160, 791276, 785385, 778950, 772982, 767614, 762315, 757307, 753606, 751670, 751125, 751894, 754629, 759769, 767005, 775817, 785944, 797312, 810097, 824687, 841041, 858253, 875315, 891792, 906971, 918890, 925320, 925562, 920438, 910844, 897386, 881199, 863967, 847005, 831039, 816719, 804477, 794077, 785178, 778158, 773540, 770909, 769333, 768665, 769416, 771517, 774190, 776955, 779849, 782769, 785502, 788280, 791435, 794649, 797290, 799222, 800506, 800786, 799955, 798987, 798972, 799707, 800430, 801582, 804551, 809915, 817234, 826288, 837055, 848619, 859639, 870032, 880742, 891712, 901417, 908656, 913447, 915897, 915535, 912307, 907108, 900908, 894292, 888051, 883098, 879415, 876095, 872844, 870498, 869746, 870391, 872318]
58593H72318L955O890J0168J3563J7085K0140K1862K2151K1643K0849J9959J9047
58581A069630J8029J6818J5724J5042J4143J2105R464Q052Q674J0418J2680J6161
58569A226940K0969K5579K8890L1733L4966L7611L8421L7938L7238L5709L1892
58558A587886K5810J8841J1832M742k283q691j4029j7811j9449j9046j7617j5868
58546A534317j3703j1434j0331j1173j3478j6833k1580k7350l2394l5526l7286
58535A303229l8267l7748l5229l1727k8206k4156j9080j4045j0305p687n556m010
58523A047213k901j258R90K300J913J224J349J160m79k466l386l919n139o191
58509A030410n909n279n785o617o069m583l828l700k786j148k51m85r65j268j503
$$ y = [872318, 876273, 883163, 893331, 906894, 923979, 944119, 965981, 988132, 1009775, 1030624, 1050583, 1069630, 1087659, 1104477, 1120201, 1135243, 1149386, 1161491, 1170955, 1179007, 1187681, 1198099, 1210779, 1226940, 1247909, 1273488, 1302378, 1334111, 1369077, 1406688, 1445109, 1483047, 1520285, 1555994, 1587886, 1613696, 1632537, 1644369, 1649111, 1646828, 1638137, 1624108, 1606297, 1586848, 1567802, 1550185, 1534317, 1520614, 1509180, 1498849, 1487676, 1474198, 1457365, 1435785, 1408435, 1376041, 1340515, 1303229, 1264962, 1227214, 1191985, 1160258, 1132052, 1107896, 1088816, 1074771, 1064466, 1056779, 1051223, 1047213, 1044312, 1043054, 1044044, 1046344, 1048257, 1049481, 1050830, 1051990, 1051511, 1049045, 1045659, 1041740, 1036601, 1030410, 1024501, 1019222, 1013437, 1006820, 1000751, 996168, 992340, 988640, 985854, 984706, 984455, 983970, 983005, 981737, 980234]
58494I80234j164K45K086L706N867R228J2516J4111J4652J6049J8704K1595K4237
58481A122066K6662K8260K8579K8345K7981K6122K1444J4814P788K89q041j5629
58469A308680k0580k3323k5196k5618k3310j9200j5366j1823p195j818K655O171
58457A144077J0031J4030J6547J7283J7459J7435J6353J3823R912M017l929j1723
58445A265315j6724j8988k0394k1283k0373j7486j3903j0303o586l253q11J602
58433A116813M824P707Q841R292J1089J3756J5087J4693J4043J3486J1935R166
58421A250732N857J822l310q220j1253j3031j5204j7326j7711j6711j6203j6379
58409A123063j5822j4412j3273j2315j0544q388p028n944l866j463l25P0J425
$$ y = [980234, 979070, 979315, 981401, 985107, 990974, 1000202, 1012718, 1026829, 1041481, 1057530, 1076234, 1097829, 1122066, 1148728, 1176988, 1205567, 1233912, 1261893, 1288015, 1309459, 1324273, 1332061, 1332350, 1324309, 1308680, 1288100, 1264777, 1239581, 1213963, 1190653, 1171453, 1156087, 1144264, 1137069, 1135251, 1137906, 1144077, 1154108, 1168138, 1184685, 1201968, 1219427, 1236862, 1253215, 1267038, 1276950, 1280967, 1277038, 1265315, 1248591, 1229603, 1209209, 1187926, 1167553, 1150067, 1136164, 1125861, 1119275, 1116022, 1115211, 1116813, 1121637, 1129344, 1138185, 1147477, 1158566, 1172322, 1187409, 1202102, 1216145, 1229631, 1241566, 1250732, 1256589, 1258411, 1255101, 1246881, 1235628, 1222597, 1207393, 1190067, 1172356, 1155645, 1139442, 1123063, 1107241, 1092829, 1079556, 1067241, 1056697, 1048309, 1041281, 1035337, 1031471, 1030008, 1029683, 1029753, 1031178]
58396A031178L319L832K869J859Q77q77k453k285j312j695k978k869j220J19Q42
58381A029206K082L296K892J640J897L736N212O062P622R568J0366J0656J2405
58368A106640J5098J6401J6382J7270J9365K0856K1360K1876K1609J8759J4135
58357A309751J0201O958K714j821m382n482p361r265q426n377l370k743p72K982
58343A283607O139Q322J1501J5357J7357J7596J8568J9995J9100J6197J4644J4919
58331A463302J4173J1973J0823J0479P668K379j449k554l884o367p055m966k985
58318A491537k346p93K137L590K871L013N170O754O784P705J0262J1900J1819
58305A560403J2290J3671J3571J2191J2705J5047J5354J2972J1833J3380J4379
$$ y = [1031178, 1034497, 1038329, 1041198, 1043057, 1043934, 1043057, 1040604, 1038319, 1037007, 1035312, 1032334, 1029465, 1028245, 1028364, 1029206, 1031288, 1034584, 1037476, 1039116, 1041013, 1044749, 1049961, 1056023, 1063645, 1073213, 1083579, 1094235, 1106640, 1121738, 1138139, 1154521, 1171791, 1191156, 1212012, 1233372, 1255248, 1276857, 1295616, 1309751, 1319952, 1326910, 1329624, 1327803, 1323421, 1317939, 1310578, 1301313, 1292887, 1287510, 1284140, 1281397, 1280625, 1283607, 1289746, 1298068, 1309569, 1324926, 1342283, 1359879, 1378447, 1398442, 1417542, 1433739, 1448383, 1463302, 1477475, 1489448, 1500271, 1510750, 1518418, 1520797, 1519348, 1516794, 1512910, 1506543, 1499488, 1494522, 1491537, 1489191, 1488398, 1490535, 1494125, 1496996, 1500009, 1505179, 1511933, 1518717, 1526422, 1536684, 1548584, 1560403, 1572693, 1586364, 1599935, 1612126, 1624831, 1639878, 1655232, 1668204, 1680037, 1693417, 1707796]
58294A707796J3483J3507J5449J6604J6459J7925K1024K2022K0607K1008K4130
58283A910014K5782K4746K5081K8108K9683K8186K7633L0073L2285L2833L4901
58272B229325L9315M2322M3069M5514N0268N2677N1752N2500N6429N8544N6870
58261B778585N5861N6980N5436M9935M6141M6375M5678M2146M1191M5075M8566
58250C311969M9556N3406O1739O7902O9015P1495P8970Q5920Q9139R4026J03207
58239D136344J10757J14157J19946J30876J39909J43922J50411J63242J75273
58230E384837J82790J93328K10923K28039K40844K57473K81963L05680L24459
58221G610336L47880L81181M15058M44480M79858N27812N79470O30322O92023
$$ y = [1707796, 1721279, 1734786, 1750235, 1766839, 1783298, 1801223, 1822247, 1844269, 1864876, 1885884, 1910014, 1935796, 1960542, 1985623, 2013731, 2043414, 2071600, 2099233, 2129306, 2161591, 2194424, 2229325, 2268640, 2310962, 2354031, 2399545, 2449813, 2502490, 2554242, 2606742, 2663171, 2721715, 2778585, 2834446, 2891426, 2946862, 2996797, 3042938, 3089313, 3134991, 3177137, 3218328, 3263403, 3311969, 3361525, 3414931, 3476670, 3544572, 3613587, 3685082, 3764052, 3849972, 3939111, 4033137, 4136344, 4247101, 4361258, 4481204, 4612080, 4751989, 4895911, 5046322, 5209564, 5384837, 5567627, 5760955, 5971878, 6199917, 6440761, 6698234, 6980197, 7285877, 7610336, 7958216, 8339397, 8754455, 9198935, 9678793, 10206605, 10786075, 11416397, 12108420]
58212A2108420P71540Q59617R53935J071410J222845J400055J604639J862942
58204B1855403K193677K587490L035950L548563M122334M735275N399352O183091
58196E3661135P158062Q374026R916075J1909192J4390440J7216229K0148909
58189A42774068K2978275K5521230K7640870K9383225L0882305L1749611L0536880
58182C41466464K5275403J5040632J108998j3513586k5746500l3788601l7356735
58175B72486075l7187057l4464511l0401382k5941584k1650196j7803206j4518736
58168I0519403j1805826r588006p767605o272842n040606l996220l075517k240691
58160D0732090j460992p07207K2939P02577J309484J840270K296083K685424L020462
$$ y = [12108420, 12879960, 13739577, 14693512, 15764922, 16987767, 18387822, 19992461, 21855403, 24049080, 26636570, 29672520, 33221083, 37343417, 42078692, 47478044, 53661135, 60819197, 69193223, 79109298, 91018490, 105408930, 122625159, 142774068, 165752343, 191273573, 218914443, 248297668, 279179973, 310929584, 341466464, 366741867, 381782499, 382891497, 369377911, 343631411, 309842810, 272486075, 235299018, 200834507, 170433125, 144491541, 122841345, 105038139, 90519403, 78713577, 69125571, 61357966, 55085124, 50044518, 46048298, 42972781, 40732090, 39271098, 38563891, 38586830, 39289407, 40598891, 42439161, 44735244, 47420668, 50441130]
58151E0441130L240372L130818K411111R82484r16131k827271m339586n249024
58143D6873903n551121n368377m882210m265065l630342l035090k511635k076874
58135A5553189j724366j435570j200583j015266q66822p39925o32008n47318m81369
58126F909962m25179l78550l45242l20592k96970k75729k61298k49063k31373
58117D125966k10156j91837j75164j55455j35543j20989j09344r5376q2362p7268
58107B772472p8831q0628q1989q5765q9291q7627q2550p9105p6495p1045o4581
58096A894565o1172n8976n3814m7493m4378m2969l9027l3877l1627l1203k8896
58085A421133k5831k5349k5879k3876k0943k0822k2091k1103j9271k0247k2623
$$ y = [50441130, 53681502, 56812320, 59223431, 60205915, 59289784, 56462513, 52122927, 46873903, 41322782, 35954405, 31072195, 26807130, 23176788, 20141698, 17630063, 15553189, 13828823, 12393253, 11192670, 10177404, 9310582, 8570657, 7938649, 7391331, 6909962, 6484783, 6106233, 5760991, 5440399, 5143429, 4867700, 4606402, 4357339, 4125966, 3915810, 3723973, 3548809, 3393354, 3257811, 3136822, 3027478, 2932102, 2849740, 2772472, 2693641, 2613013, 2531024, 2445259, 2355968, 2268341, 2185791, 2106686, 2030191, 1959146, 1894565, 1833393, 1774417, 1720603, 1673110, 1628732, 1585763, 1546736, 1512859, 1481232, 1450029, 1421133, 1395302, 1369953, 1344074, 1320198, 1299255, 1278433, 1256342, 1235239, 1215968, 1195721, 1173098]
58074A173098k2580k1174k1853k3190k1290j7286j5518j6056j5556j3832j3222
58063I71541j3147j1370r049q849r784r297q405r459j1031j0434q950r212r890
58050H42664q435o536p164q720p865n635n052n131l296j263k351n097n698m808
58036G65613n723p742p671o259o745q434p982n959n900p794q503p823q225r368
58022F61485q707o933o990q220p184m005k287k883l107k050j510j649p35P95Q34
58007F06854l3O54K372K374R46R89K600L087K284K785M666M948K884J093P98L42
57991F39643q94j386r31j267k560k990k286k167k926l161k934l631m684m174k690
57976F00962k708m157m537l542l486m817n218l832k542k377k184j608j846k801
$$ y = [1173098, 1150518, 1129344, 1107491, 1084301, 1063011, 1045725, 1030207, 1014151, 998595, 984763, 971541, 958394, 947024, 937975, 929126, 919342, 910045, 901640, 892181, 881150, 870716, 861766, 852554, 842664, 834229, 827693, 820529, 811809, 803944, 798309, 793257, 788126, 784830, 783567, 781216, 776119, 770421, 765613, 759890, 752148, 744477, 738218, 731473, 723039, 715057, 709098, 703198, 695404, 686901, 679078, 670853, 661485, 652778, 645845, 638855, 630635, 623451, 619446, 617159, 614276, 611169, 609119, 607609, 605960, 605225, 606020, 606854, 606821, 607475, 609847, 612221, 613167, 614156, 616756, 619843, 622127, 624912, 629578, 634526, 637410, 638503, 639301, 639643, 638749, 637363, 636432, 635165, 632605, 629615, 627329, 625162, 622236, 619075, 616141, 612510, 607826, 603652, 600962, 598254, 594097, 589560, 586018, 582532, 577715, 572497, 568665, 566123, 563746, 561562, 559954, 558108, 555307]
57962E55307k745j527r27j289r28N19J313P16L3lj58o40p13n47q80r55N09K600
57944E49685L355L250M387O568P624P451Q176J0212J1664J1920J2397J3482J4065
57931F64236J4278J5297J6179J4493J0523P259N661L548m7l098m323n219o971
57918G31816q397q449q064q135p991p159o518o575o620o273o030n821m970l894
57904F36920l731m213m176m033n235p242p835o659n656n704n597m755m125l874
57890E64085k895j174m5M19J620L550M434L831L411L947M113L052J677P17k19
57875E90523r69o40L46L57p49j322p35j48o1M14J422J933J868K302L174L254K677
57858F03646K974M253M946M601M361M416L771K799L005L945L433J291k83o13j442
$$ y = [555307, 552562, 551035, 550108, 548819, 547891, 548410, 549723, 550439, 550472, 550469, 550311, 549671, 548958, 548411, 547531, 546576, 547085, 549685, 553040, 556290, 560677, 567245, 574869, 582320, 590496, 600708, 612372, 624292, 636689, 650171, 664236, 678514, 693811, 709990, 724483, 735006, 742265, 747926, 751474, 751427, 748329, 744006, 738787, 731816, 723419, 714970, 706906, 698771, 690780, 683621, 677103, 670528, 663908, 657635, 651605, 645784, 640814, 636920, 633189, 628976, 624800, 620767, 615532, 608290, 600455, 593796, 588140, 582436, 576839, 572084, 567959, 564085, 561190, 560016, 559971, 560390, 562010, 565560, 569994, 573825, 577236, 581183, 585296, 588348, 590025, 590742, 590523, 589554, 588914, 589260, 589617, 588868, 587546, 586811, 586663, 586602, 587016, 588438, 590371, 592239, 594541, 597715, 600969, 603646, 606620, 610873, 615819, 620420, 624781, 629197, 632968, 635767, 638772, 642717, 646150, 647441, 647158, 646545, 645103]
57843F45103l214l987l186k975m475n802n551n115n776o305n440m158l594k985
57829E82540j570l88m08p15k82L08L70N34J229J496O67m12r98j582k491l098l333
57812E71867m067n198n338m225l347l351l075k010j384j748j883j207q02r64k35
57797E33033J796L300L313L466M998O453O199N067M528M272L424K340J486L14
57783E83989j107j239M91K330K945L593N720Q300R538R538R327Q742P264N548
57769F54979M246K561k28l084m753n783p294q939r777j0096j0719j1376j1280
57756E78457j0520r661q750p695o682n441l248l87J769K807L811N162N704N063
57742E50389M735N608O339N716M685M526M716M231L413K900K254J136K99jr12
$$ y = [645103, 641889, 637902, 634716, 631741, 627266, 621464, 615913, 610798, 605022, 598717, 593277, 589119, 585525, 582540, 580970, 580582, 580174, 579459, 579177, 579485, 579855, 580389, 581618, 583114, 583781, 583369, 582371, 580789, 578298, 575200, 571867, 567800, 562602, 557264, 553039, 549692, 546341, 543266, 541256, 539872, 538124, 536241, 535034, 534232, 533268, 533033, 534829, 538129, 541442, 544908, 549906, 556359, 562558, 567625, 572153, 576425, 579849, 582189, 583675, 583989, 582882, 581643, 582134, 584464, 587409, 591002, 596722, 605022, 614560, 624098, 633425, 642167, 649431, 654979, 659225, 661786, 661558, 658474, 653721, 647938, 640644, 631705, 621928, 611832, 601113, 589737, 578457, 567937, 558276, 549526, 541831, 535149, 529708, 526460, 526073, 527842, 530649, 534460, 539622, 545326, 550389, 555124, 560732, 567071, 572787, 577472, 581998, 586714, 590945, 594358, 597258, 599512, 600648, 600947, 600946, 600034]
57727F00034k784l863k890j252p53r22n29j71j048k487k966k616k606k957k947
57712E69243k898l652m853n497n629n969o414o391o005n577m799l465k339k042
57698E03713k029j715j609k172k685k478k136k289k284j408k87K71O60J491K304
57683D87347K603L014M173N558O699Q269J0709J3138J5018J7550K1842K7070L2019
57670F55009L7174M3502N0333N6171O0701O4343O6667O6582O3051N4341L8088
57659A255962J4153j3450l8949n8535p0767p5238p2868o6405n8575n0227m1566
57648G23535l3869k8296k4162k0226j6696j4265j2255r688p212o038n757n065
57636E40006l930l218k859k152j268p78l06P62J874K128J783J532J144K33n36
$$ y = [600034, 597250, 593387, 590497, 589245, 588492, 587570, 587041, 586870, 585822, 583335, 580369, 577753, 575147, 572190, 569243, 566345, 562693, 557840, 552343, 546714, 540745, 534331, 527940, 521935, 516358, 511559, 508094, 505755, 503713, 501684, 499969, 498360, 496188, 493503, 491025, 488889, 486600, 484316, 482908, 482621, 482892, 483552, 485043, 487347, 489950, 492964, 497137, 502695, 509394, 517663, 528372, 541510, 556528, 574078, 595920, 622990, 655009, 692183, 735685, 786018, 842189, 902890, 967233, 1033900, 1100482, 1163533, 1217874, 1255962, 1270115, 1256665, 1217716, 1159181, 1088414, 1013176, 940308, 873903, 815328, 765101, 723535, 689666, 661370, 637208, 616982, 600286, 586021, 573766, 564078, 556866, 550828, 545071, 540006, 536076, 532858, 529999, 527847, 526579, 525801, 525495, 526257, 528131, 530259, 532042, 533574, 534718, 534951, 534415]
57621E34415m56q3p1J43J023J520P18l47l14K35K8n17k46M25L26j94nO66Q39Q20
57601E38925J481K281K064J241J037J238P86l7k12j97j263l016l832l496l289
57586E33711l661l790l318k727k110j293q23j208j671j366j095j955l057k728
57572E02909j412j065k002k674k336j791j504j083o61q33j235r28j71k0m26m34
57556D84334PK12L82J179K055J985J527K036L227L582K994K743L102L131K799
57541E15295L129M112M616M447M545N080N365N516O162O586N390L009J363J015
57527E75630Q57O39J263K477K770K040J973L106L887L352K487K220K129K024K739
57512F09593M407N795O186O290O552O335N564N307N924O224N417M275L625L171
$$ y = [534415, 533959, 533876, 533805, 533948, 534971, 536491, 537209, 536862, 536548, 536783, 536811, 536294, 536048, 536473, 536799, 536605, 536600, 537266, 538105, 538925, 540406, 542687, 544751, 545992, 547029, 548267, 549053, 549016, 548804, 548607, 547344, 544328, 540496, 537000, 533711, 530050, 526260, 522942, 520215, 518105, 516812, 515989, 514781, 513110, 511744, 510649, 508694, 505637, 502909, 501497, 500432, 498430, 495756, 493420, 491629, 490125, 489042, 488381, 487548, 486313, 485385, 485214, 485194, 484768, 484334, 484341, 484553, 484935, 486114, 488169, 490154, 491681, 493717, 496944, 500526, 503520, 506263, 509365, 512496, 515295, 518424, 522536, 527152, 531599, 536144, 541224, 546589, 552105, 558267, 564853, 570243, 573252, 574615, 575630, 576487, 577126, 578389, 580866, 583636, 585676, 587649, 590755, 594642, 597994, 600481, 602701, 604830, 606854, 609593, 614000, 619795, 625981, 632271, 638823, 645158, 650722, 656029, 661953, 668177, 673594, 677869, 681494, 684665]
57498F84665K649K559K871K518J061m55j122j362j800k231k393k568k714k224
57484F79454j114k54J58R75K427L412L145K226J493R50N41O91J415J910J691J215
57468G00335R05O53N76J198K342L024K892K689K954L353L626M106M893N568N988
57453G45102O358O396N593M404L925M260M487M375M661N464N968N949O124O685
57439H19751O921O644O510O598O226N500N435O076O146N123M101L980M282M422
57425H97715M655N103N258N134N525O488O934O443N982O164O256N730N363N826
57411I78576O464O460O182O336O841P355Q004Q782R089Q640P994P608P210O626
57397A082167O333O618P045P189P163P083O880O846P446Q342Q702Q526Q590Q943
$$ y = [684665, 687314, 689873, 692744, 695262, 696323, 695868, 694746, 693384, 691584, 689353, 686960, 684392, 681678, 679454, 678340, 678086, 678244, 679219, 681646, 685058, 688203, 690429, 691922, 692872, 693413, 694104, 695519, 697429, 699120, 700335, 701240, 701893, 702469, 703667, 706009, 709033, 711925, 714614, 717568, 720921, 724547, 728653, 733546, 739114, 745102, 751460, 757856, 763449, 767853, 771778, 776038, 780525, 784900, 789561, 795025, 800993, 806942, 813066, 819751, 826672, 833316, 839826, 846424, 852650, 858150, 863585, 869661, 875807, 880930, 885031, 889011, 893293, 897715, 902370, 907473, 912731, 917865, 923390, 929878, 936812, 943255, 949237, 955401, 961657, 967387, 972750, 978576, 985040, 991500, 997682, 1004018, 1010859, 1018214, 1026218, 1035000, 1044089, 1052729, 1060723, 1068331, 1075541, 1082167, 1088500, 1095118, 1102163, 1109352, 1116515, 1123598, 1130478, 1137324, 1144770, 1153112, 1161814, 1170340, 1178930, 1187873]
57383A187873Q851Q412Q659R720J0361J0002R694J0356J1325J1507J0926J0365
57371A308051J0252J0558J0962J0847R882Q738Q390Q746R062R500J0797J2528
57359A428313J3326J3057J2986J3541J3721J3178J3006J3786J4526J4420J4061
57348A577921J4118J4223J4045J4049J4399J4413J3907J3756J4379J4880J4495
57337A734585J3727J3334J3376J3787J4683J5565J5513J4718J4472J5122J5564
57326A894446J5257J5153J5864J6512J6290J5763J5689J5910J6232J6983J7890
57315B071989J7854J6799J6289J7212J8349J8345J7812J8106J9143J9824J9791
57304B271513J9602J9688K0145K0932K1594K1438K0568K0019K0354K0952K1174
$$ y = [1187873, 1196724, 1205136, 1213795, 1223515, 1233876, 1243878, 1253572, 1263928, 1275253, 1286760, 1297686, 1308051, 1318303, 1328861, 1339823, 1350670, 1360552, 1369290, 1377680, 1386426, 1395488, 1404988, 1415785, 1428313, 1441639, 1454696, 1467682, 1481223, 1494944, 1508122, 1521128, 1534914, 1549440, 1563860, 1577921, 1592039, 1606262, 1620307, 1634356, 1648755, 1663168, 1677075, 1690831, 1705210, 1720090, 1734585, 1748312, 1761646, 1775022, 1788809, 1803492, 1819057, 1834570, 1849288, 1863760, 1878882, 1894446, 1909703, 1924856, 1940720, 1957232, 1973522, 1989285, 2004974, 2020884, 2037116, 2054099, 2071989, 2089843, 2106642, 2122931, 2140143, 2158492, 2176837, 2194649, 2212755, 2231898, 2251722, 2271513, 2291115, 2310803, 2330948, 2351880, 2373474, 2394912, 2415480, 2435499, 2455853, 2476805, 2497979]
57293B497979K1298K1820K2660K3510K4166K4278K3683K3093K3380K4128K4131
57282B754126K3407K3187K3785K4153K3847K3799K4550K5313K5379K5029K4586
57271C021161K3947K3577K4379K6062K7081K6725K5871K5392K5268K5590K6650
57260C301703K7774K7794K7018K6850K7250K6730K5276K4871K6332K7953K8283
57249C597834K8040K8174K8169K7572K7280K7957K8840K9290K9826L0732L1311
57238C915025L1508L2375L4045L5116L5036L5036L5717L5915L5152L4879L5848
57227D295652L6489L5539L4214L3970L4002L2906L1154K9980K9259K8313K7596
57216D649074K7850K8664K9313K9967L0828L1321L1271L1626L2914L4295L5127
$$ y = [2497979, 2519277, 2541097, 2563757, 2587267, 2611433, 2635711, 2659394, 2682487, 2705867, 2729995, 2754126, 2777533, 2800720, 2824505, 2848658, 2872505, 2896304, 2920854, 2946167, 2971546, 2996575, 3021161, 3045108, 3068685, 3093064, 3119126, 3146207, 3172932, 3198803, 3224195, 3249463, 3275053, 3301703, 3329477, 3357271, 3384289, 3411139, 3438389, 3465119, 3490395, 3515266, 3541598, 3569551, 3597834, 3625874, 3654048, 3682217, 3709789, 3737069, 3765026, 3793866, 3823156, 3852982, 3883714, 3915025, 3946533, 3978908, 4012953, 4048069, 4083105, 4118141, 4153858, 4189773, 4224925, 4259804, 4295652, 4332141, 4367680, 4401894, 4435864, 4469866, 4502772, 4533926, 4563906, 4593165, 4621478, 4649074, 4676924, 4705588, 4734901, 4764868, 4795696, 4827017, 4858288, 4889914, 4922828, 4957123, 4992250]
57205D992250L6041L7479L8726L9426M0450M2186M3572M3848M3775M4102M4459
57194E446314M4636M5216M6095M6165M5342M4959M5364M5149M3675M2162M1303
57183E936380M0110L8202L6902L6818L6640L5589L4806L5070L5535L5894L7303
57172F339249L9699M0754L9069L6236L4286L3246L2428L1756L0575K7680K3705
57161F708683K0980J9896J8203J4939J2029J0768R951Q856Q636R207Q251N052
57149F855451J885k01l316q551j3721j7417k1507k7151l2107l4645l6432l8835
57137F623453l9978l8314l5638l3632l0777k5439j8737j1815l738N406J3032J8147
57125F421970K3179K9380L4512L7372M0130M3731M5834M5948M7567N2553N8700
$$ y = [4992250, 5028291, 5065770, 5104496, 5143922, 5184372, 5226558, 5270130, 5313978, 5357753, 5401855, 5446314, 5490950, 5536166, 5582261, 5628426, 5673768, 5718727, 5764091, 5809240, 5852915, 5895077, 5936380, 5976490, 6014692, 6051594, 6088412, 6125052, 6160641, 6195447, 6230517, 6266052, 6301946, 6339249, 6378948, 6419702, 6458771, 6495007, 6529293, 6562539, 6594967, 6626723, 6657298, 6684978, 6708683, 6729663, 6749559, 6767762, 6782701, 6794730, 6805498, 6815449, 6824305, 6832941, 6842148, 6850399, 6855451, 6857336, 6857135, 6853819, 6845268, 6831547, 6814130, 6792623, 6765472, 6733365, 6698720, 6662288, 6623453, 6583475, 6545161, 6509523, 6475891, 6445114, 6419675, 6400938, 6389123, 6385385, 6390791, 6403823, 6421970, 6445149, 6474529, 6509041, 6546413, 6586543, 6630274, 6676108, 6722056, 6769623, 6822176, 6880876]
57114F880876O5740P7832R6926J19610J43897J72811K07897K46320K88261L40008
57104H640178M05696M83929N76782O93343Q39079J010491J205077J426367J673953
57095A6954895J940959K229097K554184K929059L354211L832371M373612M973411
57087D3141799N604505O246057O901447P571305Q234690Q873848R464797R877790
57079A05916238R816633Q964460P249259M935798K428728J2319k213542m221939
57071A32887954n967161p390164q446587r109410r377462r296189q948812q416616
57063F5935553p759122p028402o277170n544043m847169m199360l616701l107656
57055B3555930k667094k287424j966023j698093j472725j280997j119843r84868
$$ y = [6880876, 6946616, 7024448, 7121374, 7240984, 7384881, 7557692, 7765589, 8011909, 8300170, 8640178, 9045874, 9529803, 10106585, 10799928, 11639007, 12649498, 13854575, 15280942, 16954895, 18895854, 21124951, 23679135, 26608194, 29962405, 33794776, 38168388, 43141799, 48746304, 54992361, 61893808, 69465113, 77699803, 86573651, 96038448, 105916238, 115732871, 124697331, 131946590, 136882388, 139311116, 139323435, 137109893, 132887954, 126920793, 119530629, 111084042, 101974632, 92597170, 83300981, 74352169, 65935553, 58176431, 51148029, 44870859, 39326816, 34479647, 30280287, 26663586, 23555930, 20888836, 18601412, 16635389, 14937296, 13464571, 12183574, 11063731, 10078863]
57047A0078863q67771p64078o75532o01914n37921m80697m32869l95103l62520
57038D960458l31480l03579k80078k58453k37296k19158k05533j93813j81645
57029B749423j69897j59311j48477j36955j26382j17038j07163r6769q8056q1155
57019A518220p3549o4584n6537n0301m4060l7033l0513k4517j7318q992j490N414
57007A114740J4485K6783M0941N6968P6705R9846J23183J44535J64327J83479
56997B045992K02660K21550K33441K21998J71442Q3088k2272j19564j93325k37960
56987B607050k53116k43584k18989j88467j56652j25944r9243p8465o3371n3746
56977A125473n0081n0796n2049n1758n0900m9744m6364m0445l4912l1638k8688
$$ y = [10078863, 9211092, 8447014, 7771482, 7169568, 6631647, 6150950, 5718081, 5322978, 4960458, 4628978, 4325399, 4045321, 3786868, 3549572, 3330414, 3124881, 2931068, 2749423, 2579526, 2420215, 2271738, 2134783, 2008401, 1891363, 1784200, 1687431, 1599375, 1518220, 1444671, 1380087, 1323550, 1273249, 1229189, 1192156, 1161643, 1137126, 1119808, 1110816, 1109326, 1114740, 1129225, 1156008, 1196949, 1253917, 1330622, 1430468, 1553651, 1698186, 1862513, 2045992, 2248652, 2470202, 2703643, 2925641, 3097083, 3180171, 3157899, 3038335, 2845010, 2607050, 2353934, 2110350, 1891361, 1702894, 1546242, 1420298, 1321055, 1242590, 1179219, 1125473, 1075392, 1024596, 972547, 920789, 869889, 820145, 773781, 733336, 698424, 666786, 638098]
56966F38098k3915j8360j3837r856n239m66L683P835J2462J6539J9354K1667K3477
56953F71442K2491J6609O400n947j8462k9088l5629l7490l6150l3037k8485k3193
56941D69461j8556j4629r813l534K752Q106J3507J9633K5234K9073L1805L4750
56929E87789L8003M0390L9860L3605J9856N08j9508l6035m7545n3582n3957n0113
56917D99271m4907l9922l4701k9089k4314k0985j8118j5013j2296j0394q700o913
56905B33919n482m289k637r34m16q38m74J177K708L384M239O128Q560J1049J3680
56890B69774J6122J7986K0259K4179K8671L1441L2597L4143L5440L2521K3172
56879E66305R890l303j4395k2532k6580k6461k3840j9923j4333p205k43N545J1203
$$ y = [638098, 614183, 595823, 581986, 572130, 566891, 566425, 570108, 577943, 590405, 606944, 626298, 647965, 671442, 693933, 710542, 716942, 710995, 692533, 663445, 627816, 590326, 554176, 521139, 492654, 469461, 450905, 436276, 426463, 422929, 425681, 433787, 447294, 466927, 492161, 521234, 553039, 587789, 625792, 666182, 706042, 739647, 759503, 760011, 740503, 704468, 656923, 603341, 549384, 499271, 454364, 414442, 379741, 350652, 326338, 305353, 287235, 272222, 259926, 249532, 240832, 233919, 228437, 224148, 221511, 220577, 220161, 219323, 218849, 220026, 222734, 226118, 230357, 236485, 245045, 256094, 269774, 285896, 303882, 324141, 348320, 376991, 408432, 441029, 475172, 510612, 543133, 566305, 576195, 572892, 558497, 535965, 509385, 482924, 459084, 439161, 424828, 417623, 417380, 422925, 434128]
56866D34128J7735K4621L1498L9145M7562N5077O0798O6038P1808P6343P6152
56855A000905O8131N0333K3219q510l7291n7546o8216p0500o5595n5500m3389
56844G36041l1366j9361p117M727J6355K9305M4113N9322P3692Q7187R9072J07731
56832A199701J13350J17532J18410J09052Q3410M2341p377n7282r8929j25152
56822A495056j33760j29145j17739j02790q5089o6411m9186l3844j9176m727R218
56811G62407K3146L7586N1385O2602P0831P7060Q1521Q2612P7293O1907L4343
56800A422693k782m1806p4280r5431j04568j03330r4986q3631p1850n9672m6776
56789F43581l4475k4176j5277o302K869J1340J8799K5363L0669L4441L7047L8282
$$ y = [434128, 451863, 476484, 507982, 547127, 594689, 649766, 710564, 776602, 848410, 924753, 1000905, 1069036, 1119369, 1142588, 1134078, 1096787, 1039241, 971025, 900525, 834930, 779430, 736041, 704675, 685314, 678197, 682924, 699279, 728584, 772697, 832019, 905711, 992898, 1091970, 1199701, 1313051, 1430583, 1548993, 1658045, 1741455, 1783796, 1776419, 1719137, 1620208, 1495056, 1361296, 1232151, 1114412, 1011622, 926533, 860122, 810936, 777092, 757916, 753189, 762407, 785553, 823139, 874524, 937126, 1007957, 1085017, 1166538, 1249150, 1326443, 1388350, 1422693, 1419911, 1378105, 1303825, 1208394, 1103826, 1000496, 905510, 821879, 750029, 690357, 643581, 609106, 584930, 569653, 563351, 566220, 577560, 596359, 621722, 652391, 686832, 723879, 762161]
56777G62161L6307K8981J5757k190k2426m1270n4964o2079o3880o1849n6430m8737
56765D29381m1169l4995k9181k2994j7889j5198j3794j1886r623q094p224o438
56753B10896o080o330o059m551l126l215m022l941l129k752k733k228j469j319
56739A59942j670j934k321l083l400k541j299p07l35O34J549J294L01q8L80R88
56723A47710J480J969K181K049K238K941L132K310J701K382L413L433K856K791
56709A82586K969K584K120K419K808K068N61m16o95r30r70l14L82P2r65j611j670
56692A90998j678j610j158o57l77K38J357J778P15n30l27Q42J510J772K701L981
56676A99555M259L428K675K529K606K929L834M822N025M599M317M245M112M390
$$ y = [762161, 798468, 827449, 843206, 841016, 818590, 777320, 722356, 660277, 596397, 534548, 478118, 429381, 388212, 353217, 324036, 301042, 283153, 267955, 254161, 242275, 232652, 224558, 217334, 210896, 204816, 198486, 192427, 187876, 184750, 181535, 177513, 173572, 170443, 167691, 164958, 162730, 161261, 159942, 158272, 156338, 154017, 150934, 147534, 144993, 143694, 142987, 142652, 143286, 144835, 146129, 146430, 146342, 146722, 147710, 149190, 151159, 153340, 155389, 157627, 160568, 163700, 166010, 167711, 170093, 173506, 176939, 179795, 182586, 185555, 188139, 190259, 192678, 195486, 197554, 198115, 197699, 197004, 196074, 195104, 194790, 195172, 195244, 194279, 192668, 190998, 189320, 187710, 186552, 185895, 185518, 185756, 187113, 188891, 189606, 189076, 188749, 189591, 191101, 192873, 195574, 199555, 203814, 207242, 209917, 212446, 215052, 217981, 221815, 226637, 231662, 236261, 240578, 244823, 248935, 253325]
56662B53325N645P233Q018P809P011N603L787K716L082L755L270J917Q80K65m86
56647C13830j091j101j244k400l918m582m570m801n114m814m245m163m238l900
56633B63649l790m636n496n032l739k983k661j824r44j298k613l352l057k462
56619B19762j765p19k8n63j503j226J72J162J222J098R25J79p46q35k74j56n18
56602B16187m48Q5K89L01R07J722J528M57QQ12K009K870L446L629L192K686K861
56585B42541L297L004K142J687J664J329P85Q65J543K007K080K160K157J839J754
56570B70854K439L278L608M167N812P723Q677R278J0809J2784J3870J4522J6306
56557C84127J9055K1115K1917K1977K0749J7191J2354Q760P087N824M291L442
$$ y = [253325, 258970, 266203, 274221, 282030, 289041, 294644, 298431, 301147, 304229, 307984, 311254, 313171, 314051, 314316, 313830, 312739, 311638, 310394, 307994, 304076, 299494, 294924, 290123, 285009, 280195, 275950, 271787, 267549, 263649, 259859, 255223, 249727, 244695, 240956, 237973, 235312, 233488, 232544, 231246, 228633, 225281, 222224, 219762, 217997, 217278, 217250, 216687, 215184, 213958, 214130, 215292, 216514, 217612, 218537, 218716, 217970, 217135, 216861, 216705, 216187, 215739, 215824, 216113, 216414, 217321, 219043, 220571, 221028, 221036, 221848, 223857, 226727, 230173, 233802, 236994, 239680, 242541, 245838, 248842, 250984, 252671, 254335, 255664, 256449, 257314, 258857, 260864, 262944, 265104, 267261, 269100, 270854, 273293, 276571, 280179, 284346, 290158, 297881, 306558, 315836, 326645, 339429, 353299, 367821, 384127, 403182, 424297, 446214, 468191, 488940, 506131, 518485, 527245, 534332, 540156, 544447, 547889]
56545E47889L417K808R85j025k488l882n425o591p446q718j0263j1225j1709j2540
56531D73787j3397j3203j2333j2276j3046j3094j2003j1037j0719j0043q533p024
56519C37079n968m866l776l452l712l626l487m557o497p275o095m432l644l510
56505B72182l524l712l632k540r87m69j096j502j269j429k197k371j512o30k02
56490B45110N26J626J966J217N28N67P20P65J368K351K407J259K85L06N67M31
56474B61999L41M98L99J69O20J509J529M54m97p59r98j294q67J2l4j093j643j075
56456B59270m92m68j90N71Q89O73J006J868J827P37L63J442K423K118J376J093
56440B74506Q10L30N27J399J464K83n63j37K77m51j417j540j325j425j269m90
$$ y = [547889, 551306, 554114, 555099, 554074, 551586, 547704, 542279, 535688, 528242, 519524, 509261, 498036, 486327, 473787, 460390, 447187, 434854, 422578, 409532, 396438, 384435, 373398, 362679, 352636, 344103, 337079, 331111, 326245, 322469, 319017, 315305, 311679, 308192, 303635, 297138, 289863, 283768, 279336, 275692, 272182, 268658, 264946, 261314, 258774, 257787, 257318, 256222, 254720, 253451, 252022, 249825, 247454, 245942, 245312, 245110, 245636, 247262, 249228, 250445, 250973, 251540, 252260, 253025, 254393, 256744, 259151, 260410, 260695, 261001, 261568, 261999, 262340, 262838, 263237, 263406, 264026, 265535, 267064, 267518, 267021, 266262, 265264, 263970, 263103, 263115, 263081, 261988, 260345, 259270, 258778, 258310, 258120, 258691, 259580, 260253, 261259, 263127, 264954, 265691, 266054, 267496, 269919, 272037, 273413, 274506, 275316, 275646, 276173, 277572, 279036, 279319, 278756, 278619, 278896, 278445, 277028, 275488, 274163, 272738, 271469, 270979]
56424B70979O8K9M06J585K206J327k6q03j600k985l814k846p81Q14J480J666J661
56407B69366J667J908K004J368N15N83J304J341P60J040K185K422J458J364L018
56392B92303M391L782K455K252K779K729K270K229K460K540K785L226L019J938
56378C31158J018P07Q2j238k156k098k008k418k444j794j637k391k756k082j595
56363C08348j978k104j342r13j450j571m18O96Q43J358L360N657P031Q393J0603
56348C36513J2178J1400R020O854N252L837L033L032K802J833J254J724K027J302
56334D02061P17J232J775J427J292K272L014K219J040J072J763J940K103L115
56320D27042M314M907N502O355O083M083K277K289K889K350J322J152J450J630
$$ y = [270979, 271047, 271076, 271482, 273067, 275273, 276600, 276574, 275771, 274171, 271186, 267372, 264526, 263745, 264559, 266039, 267705, 269366, 271033, 272941, 274945, 276313, 276828, 277411, 278715, 280056, 280816, 281856, 284041, 286463, 287921, 289285, 292303, 296694, 300476, 302931, 305183, 307962, 310691, 312961, 315190, 317650, 320190, 322975, 326201, 329220, 331158, 332176, 332883, 332965, 331727, 329571, 327473, 325465, 323047, 320603, 318809, 317172, 314781, 312025, 309943, 308348, 306370, 304266, 302924, 302011, 300561, 298990, 298572, 299268, 300111, 301469, 304829, 310486, 317517, 325910, 336513, 348691, 360091, 369111, 375965, 381217, 385054, 388087, 391119, 393921, 395754, 397008, 398732, 400759, 402061, 402778, 404010, 405785, 407212, 408504, 410776, 413790, 416009, 417049, 418121, 419884, 421824, 423927, 427042, 431356, 436263, 441765, 448120, 454203, 458286, 460563, 462852, 465741, 468091, 469413, 470565, 472015, 473645]
56306D73645K737N231P098O830O185P347R344J0264J0838J2581J4181J3316J0690
56293E90287Q870Q159O957N231M449M593M354L825M285N727P046Q096R396J0530
56279F81805J1048J1949J4029J5858J5829J5082J5909J8266K0394K1980K4110
56268H66259K6980L0001L3425L7623M1767M5316M9591N5663O2127O7457P3063
56257A389272Q1202R1255J01008J10456J21354J33966J47248J61289J76614J91879
56247B705543K05202K16905K28160K37766K43341K44837K43837K39952K30996
56238D796539K16200J96326J71095J39521J02560O2717K1393k0774o1631r8499
56228E525447j31092j60608j86274k05630k18081k25460k29131k29067k25645
$$ y = [473645, 476382, 481613, 488711, 495541, 501726, 509073, 518417, 528681, 539519, 552100, 566281, 579597, 590287, 599157, 607316, 614273, 619504, 623953, 628546, 632900, 636725, 641010, 646737, 653783, 661879, 671275, 681805, 692853, 704802, 718831, 734689, 750518, 765600, 781509, 799775, 820169, 842149, 866259, 893239, 923240, 956665, 994288, 1036055, 1081371, 1130962, 1186625, 1248752, 1316209, 1389272, 1470474, 1561729, 1662737, 1773193, 1894547, 2028513, 2175761, 2337050, 2513664, 2705543, 2910745, 3127650, 3355810, 3593576, 3836917, 4081754, 4325591, 4565543, 4796539, 5012739, 5209065, 5380160, 5519681, 5622241, 5684958, 5706351, 5685577, 5623946, 5525447, 5394355, 5233747, 5047473, 4841843, 4623762, 4398302, 4169171, 3940104, 3714459]
56219C714459k19876k11923k01567j89963j78789j67986j56404j44171j32455
56210B111325j21471j10850j01208r3271q6227p8976p2120o6621o1688n6166n0819
56199A211908m6852m3434l9160l4679l1326k8537k5216k2206k0639j9340j6844
56188H83675j4434j3952j4130j2501r682q190q149p719o770o548o519n176l284
56175G66621k828l405l002j648r46p29L78J886K248K063L032M641N254N523P129
56160G86217R183R625R316J0822J3834J5811J6457J7704J9763K1199K2367K4985
56148I77283K8599L1285L3365L6769M1385M5698N0380N7310O5872P4105Q2594
56137A524645R3140J04507J13895J21873J31299J41907J50444J55552J57914J56152
$$ y = [3714459, 3494583, 3282660, 3081093, 2891130, 2712341, 2544355, 2387951, 2243780, 2111325, 1989854, 1879004, 1777796, 1684525, 1598298, 1519322, 1447202, 1380581, 1318893, 1262727, 1211908, 1165056, 1121622, 1082462, 1047783, 1016457, 987920, 962704, 940498, 919859, 900519, 883675, 869241, 855289, 841159, 828658, 818976, 810786, 802637, 794918, 788148, 781600, 775081, 769905, 766621, 763793, 760388, 757386, 755738, 754792, 754063, 754441, 756327, 758575, 760638, 763670, 768311, 773565, 779088, 786217, 795400, 805025, 814341, 825163, 838997, 854808, 871265, 888969, 908732, 929931, 952298, 977283, 1005882, 1037167, 1070532, 1107301, 1148686, 1194384, 1244764, 1302074, 1367946, 1442051, 1524645, 1617785, 1722292, 1836187, 1958060, 2089359, 2231266, 2381710, 2537262, 2695176, 2851328]
56127B851328J47468J32355J14353R5547P6584O0221M9672M3442L6469K6280J3789
56116C647508r94j8840l7277n1992o2376p1190p9529q7056r6304j10701j28391
56105B902858j43523j53586j60044j62310j57369j45607j31071j15573r8251q0873
56095A554651o7320n7426m7522l7448l0667k7030k2231j5380j0405q717p047l959
56083A219499k022j893n48K777M962M994N702Q016R327Q971R460J1036J0990R325
56069A300596R066R973Q538N120M206O425P408N869N436P052P188N378N840R448
56055A397543J1768J1341J2206J5730J7766J6681J6503J9101K0849K0064K0183
56044A579735K2559K3616K2149K1961K4239K5054K3259K3090K5860K7261K5840
$$ y = [2851328, 2998796, 3131151, 3245504, 3341051, 3417635, 3477856, 3527528, 3570970, 3607439, 3633719, 3647508, 3646514, 3627674, 3590397, 3538405, 3476029, 3404839, 3325310, 3238254, 3141950, 3031249, 2902858, 2759335, 2605749, 2445705, 2283395, 2126026, 1980419, 1849348, 1733775, 1635524, 1554651, 1487331, 1429905, 1382383, 1344935, 1314268, 1287238, 1265007, 1249627, 1239222, 1230505, 1223458, 1219499, 1217477, 1215584, 1215036, 1217813, 1222775, 1227769, 1233471, 1241487, 1250814, 1259785, 1269245, 1280281, 1291271, 1300596, 1309662, 1319635, 1328173, 1333293, 1337499, 1343924, 1351332, 1357201, 1362637, 1369689, 1376877, 1382255, 1388095, 1397543, 1409311, 1420652, 1432858, 1448588, 1466354, 1483035, 1499538, 1518639, 1539488, 1559552, 1579735, 1602294, 1625910, 1648059, 1670020, 1694259, 1719313, 1742572, 1765662, 1791522, 1818783, 1844623]
56033A844623K5959K9168L1162L0611L2252L7670M1811M2361M3717M7901N0605
56022B257840N0142N1118N5241N7791N7131N8101O2072O3752O1925O2726O7894
56011B905733P0899O9426P0235P6434Q1686Q2717Q5481R2839R8442R9370J02482
56000C835744J11344J19406J23236J29415J40948J50282J53888J59972J73337
55991E097572J86581J95021K05827K23123K39099K49756K64082K87377L11277
55982G259715L30921L55298L89461M23972M53929M90162N39090N90964O41402
55973A1474914P03872P86444Q78239R74737J093231J246425J426210J632741J892629
55964B2109442K226989K628607L090828L625921M231740M880700N575513O379808
$$ y = [1844623, 1870582, 1899750, 1930912, 1961523, 1993775, 2031445, 2073256, 2115617, 2159334, 2207235, 2257840, 2307982, 2359100, 2414341, 2472132, 2529263, 2587364, 2649436, 2713188, 2775113, 2837839, 2905733, 2976632, 3046058, 3116293, 3192727, 3274413, 3357130, 3442611, 3535450, 3633892, 3733262, 3835744, 3947088, 4066494, 4189730, 4319145, 4460093, 4610375, 4764263, 4924235, 5097572, 5284153, 5479174, 5685001, 5908124, 6147223, 6396979, 6661061, 6948438, 7259715, 7590636, 7945934, 8335395, 8759367, 9213296, 9703458, 10242548, 10833512, 11474914, 12178786, 12965230, 13843469, 14818206, 15911437, 17157862, 18584072, 20216813, 22109442, 24336431, 26965038, 30055866, 33681787, 37913527, 42794227, 48369740, 54749548]
55956E4749548P365131Q579481J0108000J2094358J4617478J7573668K0732006
55949A45819670K3853146K6711947K9139046L1177967L3017557L4378398L3881547
55942C57979278K9435345J9745323N637384j0111785k4238041l4427926l9841776
55935C04177802m0877062l8676916l4614203k9847071k5112661k0798134j7088836
55928I7162919j4027883j1543681r528551p904838o610589n569760m715574m017261
55920C3244782l455142k992842k597561k263242j989442j757526j548555j364606
55912A5275866j211930j080669r59693q54318p71214p01210o33739n73508n27054
55903G962531m86927m44483m05132l76048l51206l22815k95802k77069k61417
$$ y = [54749548, 62114679, 70694160, 80802160, 92896518, 107513996, 125087664, 145819670, 169672816, 196384763, 225523809, 256701776, 289719333, 324097731, 357979278, 387414623, 407159946, 412797330, 402685545, 378447504, 344019578, 304177802, 263300740, 224623824, 190009621, 160162550, 135049889, 114251755, 97162919, 83135036, 71591355, 62062804, 54157966, 47547377, 41977617, 37262043, 33244782, 29789640, 26796798, 24199237, 21935995, 19946553, 18189027, 16640472, 15275866, 14063936, 12983267, 12023574, 11169256, 10398042, 9696832, 9063093, 8489585, 7962531, 7475604, 7031121, 6625989, 6249941, 5898735, 5575920, 5280118, 5003049, 4741632]
55894D741632k41463k21326k07581j96281j81235j66139j56712j49290j38337
55885C083268j27074j20093j13573j03145r3427q9623q7362q0814p3364p0367
55875B124426o8546o2487n4941n0931m8015m1789l5117l2756l2379k9708k7073
55864A640684k8330l0597k9317k6424k5423k3646j7487j0453p830p873o093l891
55852A423320n304r405j3369j9024k8935l9749m6464m9676n2013n1625m6089l8850
55840A022817l4706l2397k8303k3798k2083k1343j8095j4085j3103j3797j2389
55829G88718r593q463q055n670k781k382l005j507O86K68j459r45J016J177K57
55814G48262J433M182N481N462O362P471O565M604L840K995m37m946p393q699
$$ y = [4741632, 4500169, 4278843, 4071262, 3874981, 3693746, 3527607, 3370895, 3221605, 3083268, 2956194, 2836101, 2722528, 2619383, 2525956, 2436333, 2348971, 2268157, 2194793, 2124426, 2055880, 1993393, 1938452, 1887521, 1839506, 1797717, 1762600, 1729844, 1697465, 1667757, 1640684, 1612354, 1581757, 1552440, 1526016, 1500593, 1476947, 1459460, 1449007, 1441177, 1433304, 1427211, 1423320, 1418016, 1408611, 1395242, 1376218, 1347283, 1307534, 1261070, 1211394, 1159381, 1107756, 1061667, 1022817, 988111, 955714, 927411, 903613, 881530, 860187, 842092, 828007, 814904, 801107, 788718, 779125, 770662, 762607, 756937, 754156, 751774, 748769, 747262, 747948, 748216, 746757, 745812, 746828, 748005, 748262, 749695, 753877, 759358, 764820, 771182, 778653, 785218, 789822, 793662, 796657, 796220, 791274, 783881, 775182]
55800G75182j1746j5374j6143j4544j3988j4781j4621j3827j4646j6240j5703
55789F13569j3312j1724j0695p707l236l78M67J804M267O149P379R453J1549J1144
55775F18729Q469O377N765N006L759L615M945O605Q598J1724J4932J6144J5190
55762G29858J2828P876j272j2965k3530l1383l6826l8996l6836l2229k8342k5469
55750D82714k1919j8098j5848j4577j2085q793p226p586p565o384n278m196j728
55737C51431J590L493L615L747M463M663M272M228L946J985r16k649l378n044
55723C75446p489q422p332o092n492m426k726j690j443o87O58J292J256K048L888
55708C38789N500O693Q411J0252J0694R822R090Q320N826J593k424n377q075j0342
$$ y = [775182, 763436, 748062, 731919, 717375, 703387, 688606, 673985, 660158, 645512, 629272, 613569, 600257, 588533, 577838, 570131, 566895, 566517, 566984, 568788, 573055, 579204, 586583, 596036, 607585, 618729, 627198, 633575, 639340, 644346, 648105, 651720, 656665, 663270, 671868, 683592, 698524, 714668, 729858, 742686, 750562, 749290, 736325, 712795, 681412, 644586, 605590, 568754, 536525, 508183, 482714, 460795, 442697, 426849, 412272, 400187, 391394, 384168, 376582, 369017, 362633, 357355, 353159, 351431, 353021, 356514, 360129, 363876, 368339, 373002, 377274, 381502, 385448, 387433, 386517, 383868, 380490, 375446, 367957, 359535, 352203, 346111, 340619, 336193, 333467, 331777, 330334, 329647, 330305, 331597, 332853, 334901, 338789, 344289, 350982, 359393, 369645, 380339, 390161, 399251, 407571, 413397, 414990, 412566, 407189, 399114, 388772]
55694C88772j0646q863o756n221l450j173O33J628K493L185K948K160J987K308
55680C70005K054J458J705K626L038L078L707M254L147Q50o37j026j710k663k343
55665C87543q05N9l12n01M6J87m99j126j650l059n014n931n705n859o639o579
55649C44156n424m746n151n400m922m698n033m887m015l414l165k177o17q1p94
55634B89632j166p36r71k388l484l492l731n060o271o164n290m545l871l225l134
55619B36104l457l325k796k861l359k905j360l06m91q51o54n34p19l83N26Q02
55603B13431M7p04r53j400k025j728n14J19l29o12j83j67j085j765j482j098j106
55586A98446o87L70Q97M56J95O22O17k47n67N02J707J848J615J923K251J933J533
$$ y = [388772, 378126, 369263, 362507, 357286, 353836, 352663, 353296, 354924, 357417, 360602, 363550, 365710, 367697, 370005, 372059, 373517, 375222, 377848, 380886, 383964, 387671, 391925, 395072, 395922, 395285, 394259, 392549, 389886, 387543, 386738, 386797, 386485, 385984, 386030, 386217, 385718, 384592, 382942, 379883, 374869, 368938, 363233, 357374, 350735, 344156, 338732, 333986, 328835, 323435, 318513, 313815, 308782, 303895, 299880, 296466, 293301, 291124, 290507, 290426, 289632, 288466, 287730, 286759, 284371, 280887, 277395, 273664, 268604, 262333, 256169, 250879, 246334, 242463, 239238, 236104, 232647, 229322, 226526, 223665, 220306, 217401, 216041, 215735, 215244, 214393, 213739, 213205, 212486, 212103, 212629, 213431, 213478, 212774, 211821, 210421, 208396, 206668, 206154, 206273, 205944, 205332, 205149, 204982, 203897, 202132, 200650, 199552, 198446, 197759, 198129, 199026, 199482, 199677, 200299, 200916, 200669, 200102, 200604, 202311, 204159, 205774, 207697, 209948, 211881, 213414]
55569B13414J617J676J326J187J552J714J484J743K680L213L019L231M139M261
55555B46256K821J183N33M0j220k365k312j636j290r76l18j57j098k074j897j005
55539B34485k81N65J971L065K796J597N47k10j050j870k582l621m954n618n218
55524B19622m763n032n350m978m431m374m409m072l783l785l407k397j723j919
55510A65199k003j143n5M22P64J489J855J201L81M18R00R94J011J518K056J977
55494A76984J597J334Q26J0j06Q74J644J167M52Q41J675J444K98l16J14Q31J179
55477A90848J039M65q2R8P01L68j182k214j448k0L42j60l50k91p57j436j508j176
55459A83237j027o40M75J427J173M14M44Q94M51p34j361j246j334j703j416l70
$$ y = [213414, 215031, 216707, 218033, 219220, 220772, 222486, 223970, 225713, 228393, 231606, 234625, 237856, 241995, 246256, 249077, 250260, 250793, 250833, 249613, 247248, 244936, 243300, 242010, 241034, 240716, 240559, 239461, 237387, 235490, 234485, 234204, 234769, 236740, 239805, 242601, 244198, 244745, 244535, 243485, 241615, 239033, 235412, 230458, 224840, 219622, 214859, 209827, 204477, 199499, 195068, 190694, 186285, 182213, 178430, 174645, 171238, 168841, 167118, 165199, 163196, 162053, 161998, 162420, 163184, 164673, 166528, 167729, 168110, 168528, 169428, 170422, 171433, 172951, 175007, 176984, 178581, 179915, 180741, 180751, 180645, 181519, 183163, 184330, 184782, 185623, 187298, 188742, 189040, 188724, 188838, 189669, 190848, 191887, 192352, 192270, 192368, 193069, 193437, 192255, 190041, 188593, 188573, 188915, 188755, 188405, 188114, 187357, 185921, 184413, 183237, 182210, 181570, 182045, 183472, 184645, 185059, 185503, 186397, 186848, 186114, 184753, 183507, 182173, 180470, 179054, 178684]
55443A78684M63O39O54P45O01K52pm14j261j891j416k49L79K28J15M23Q20J253
55425A80018J940K453K097J074K58q8k83k35L74J107J134N34J25K28N65J141K095
55408A94537K896K821K135J752J843J763J226N65l5o50j135j397j907l007m011
55393A97396l926k833j647q94n25n84j044j399j270j054j108r76k99K58J57J72
55377A80424J070J888J237l41j108q16p22j124r22J72Q95M56l14m32p6J50J62
55360A80599J4l75p39n61K4K49j36n55o30o02n74k82J82L16R2Q7N21R59J009O56
55340A80254r5j048j395n07Q45J161K29n35o8J081J733J440M64o77j324j021j42
55323A80395L72J57k75m68n63p63q78p03l13J37M95N10J63j16j2R0k44n84k53
$$ y = [178684, 179147, 179786, 180440, 181185, 181786, 182038, 182031, 181617, 180356, 178465, 177049, 176800, 177179, 177407, 177522, 177945, 178765, 180018, 181958, 184411, 186508, 187582, 187840, 187752, 187469, 187234, 187608, 188715, 189849, 190383, 190508, 190736, 191301, 192442, 194537, 197433, 200254, 202389, 204141, 205984, 207747, 208973, 209538, 209503, 208853, 207718, 206321, 204414, 201407, 197396, 193470, 190637, 188990, 188096, 187571, 186987, 185943, 184544, 183274, 182220, 181112, 180136, 179837, 180095, 180252, 180424, 181494, 183382, 184619, 184278, 183170, 182354, 181632, 180508, 179586, 179758, 180653, 181109, 180795, 180363, 180287, 180437, 180599, 180613, 180238, 179499, 178938, 178962, 179211, 179075, 178520, 177890, 177288, 176714, 176432, 176614, 176930, 177022, 177109, 177630, 178589, 179598, 180254, 180159, 179111, 177716, 177209, 178054, 179215, 179444, 178909, 178841, 179922, 181655, 183095, 183559, 182882, 181558, 180537, 180395, 180767, 180924, 180649, 180181, 179618, 178855, 177977, 177274, 176961, 177098, 177593, 178103, 178266, 178150, 178138, 178228, 177984, 177400, 177147]
55304A77147M10M25l14q93p90m17j89pJ24q0n24o99n57n66o89j85J156K421K671
55285A78444K084J525J400J371R68K45k06M9N95N01l98j165j095p23p98r66m79
55268A81352L43N75J88r6k37p66j397j135k2O71K81l94n44m65n98n88NP61R80
55249A78914O26J57j13p3L27Q04Q50M20R9K92O14M87j09p24r54p08j90K33L67
55230A81319M35P02R32O12l11j285j750j556r41l22l9L6L39R13J250J147J090
55213A82571J364J453J017O59Q74R94K53p04o78J90P34O35N75O67K65n77r56o66
55195A88670n61j024j391j260j123j208q76J55J032R55L50J25L96N97L68j63o88
55178A84354q65n20J47P01R38Q82N37L0k12PK48J35K0K51K96l67j009n97L95N72
$$ y = [177147, 177557, 177982, 177668, 176775, 175985, 175568, 175379, 175372, 175496, 175416, 174892, 174193, 173636, 173070, 172381, 172196, 173352, 175773, 178444, 180528, 182053, 183453, 184824, 185792, 186037, 185831, 185880, 186475, 186976, 186578, 185413, 184318, 183595, 182797, 181831, 181352, 181695, 182270, 182458, 182362, 182125, 181359, 179962, 178827, 178805, 179476, 179757, 179363, 178819, 178354, 177756, 177168, 177173, 177934, 178914, 179540, 179697, 179584, 179511, 179838, 180642, 181492, 181912, 182011, 182303, 182917, 183404, 183295, 182571, 181617, 180909, 180719, 180952, 181319, 181754, 182456, 183388, 184000, 183689, 182404, 180654, 179098, 178157, 177835, 177796, 177832, 178171, 179084, 180334, 181481, 182571, 183935, 185388, 186405, 187064, 187938, 188932, 189185, 188481, 187803, 187993, 188727, 189362, 189937, 190604, 190869, 190292, 189336, 188670, 188109, 187085, 185694, 184434, 183311, 182103, 181227, 181382, 182414, 183369, 183719, 183844, 184240, 184837, 185205, 185042, 184354, 183489, 182969, 183116, 183817, 184755, 185637, 186174, 186204, 185992, 185999, 186247, 186382, 186402, 186653, 186949, 186582, 185573, 184976, 185371, 185943]
55158A85943j47m05L60J156J164Q28P25P13O35P58R96Q28M28O42J473J786J011
55141A98894l8o00r66j416j403o02L38P96J020J265J053J32q26j251j493j869
55125A93034j849j002M2N24O20Q08Q45L14m15o41k70L24Q98J205R33L66M05J337
55107A97478K228K267J886J858J987J595P39M7k36k69q9K92N44M09J29P3K50N09
55089B11697P10M62n71j782j860m67J115J622J300J156J439J647J477J053O22
55074B19620M51N71M30n28j700j833r27m65j145j845j606j214j559j764o23J144
55058B07007J780J047K16j38n84j236j329o64j00k63p18q16n24j63O6J28J75N07
55040B04391J048J133L44p18j102p13k49j44l05o20r84r88l43N03P70L42k20n34
$$ y = [185943, 185796, 185391, 185751, 186907, 188071, 188899, 189624, 190337, 190972, 191730, 192726, 193554, 193982, 194624, 196097, 197883, 198894, 198856, 198256, 197290, 195874, 194471, 193869, 194207, 195003, 196023, 197288, 198341, 198473, 197647, 196396, 194903, 193034, 191185, 190183, 190225, 190749, 191369, 192177, 193022, 193336, 192921, 192280, 192010, 192334, 193232, 194437, 195370, 195736, 196141, 197478, 199706, 201973, 203859, 205717, 207704, 209299, 210038, 210085, 209849, 209580, 209491, 209783, 210327, 210736, 210865, 210938, 211188, 211697, 212407, 212869, 212298, 210516, 208656, 208189, 209304, 210926, 212226, 213382, 214821, 216468, 217945, 218998, 219620, 220071, 220642, 221072, 220544, 218844, 217011, 216084, 215619, 214474, 212629, 211023, 209809, 208250, 206486, 205863, 207007, 208787, 209834, 210050, 209912, 209328, 208092, 206763, 206099, 205999, 205736, 205018, 204202, 203678, 203515, 203581, 203709, 203884, 204391, 205439, 206572, 206916, 206198, 205096, 204383, 204134, 203990, 203685, 203065, 202081, 201093, 200750, 201253, 202023, 202365, 202145, 201611]
55022B01611o83p50o12k10L48Q30R10M71K7L56J339J881J369N48L36N47M87J68
55004B08973K3J9l7K10J162K325K805K418J606O52k49n21J91J256J713J446J003
54987B24995N46j19q41j231j244j013m59K57M40k05q62p05j13J54K82Q07J303
54970B21992J023L95M34J046J241Q42N44M91K65J14O73J465J357N52M47J188J289
54953B35358J75o92j95N97K24q06r59p2O59O13M04O93J395K112K598K743K525
54936B47372K127J853J986K747M119N609O519O736O832P286P842P850O912N110
54922C20900K885Q38o87j883l154m561n894p055p947q214p700o966o624o325n292
54907B52321l770k951l263l722l348k346j401o19J92P63O86K12K19J317L243M991
$$ y = [201611, 200928, 200178, 199566, 199356, 199704, 200534, 201444, 201915, 201942, 202298, 203637, 205518, 206887, 207435, 207771, 208318, 208805, 208973, 208996, 209015, 208978, 209188, 210350, 212675, 215480, 217898, 219504, 220156, 219907, 219386, 219577, 220833, 222546, 223992, 224995, 225541, 225422, 224581, 223350, 222106, 221093, 220634, 220891, 221331, 221126, 220264, 219559, 219446, 219600, 219882, 220689, 221992, 223015, 223410, 223844, 224890, 226131, 226973, 227517, 228008, 228273, 228387, 229060, 230525, 231882, 232434, 232881, 234069, 235358, 235533, 234841, 234646, 235243, 235467, 234661, 233702, 233630, 234289, 234902, 235306, 235999, 237394, 239506, 242104, 244847, 247372, 249499, 251352, 253338, 256085, 260204, 265813, 272332, 279068, 285900, 293186, 301028, 308878, 315790, 320900, 323785, 324623, 323936, 322053, 318899, 314338, 308444, 301389, 293442, 285228, 277528, 270562, 263938, 257613, 252321, 248551, 245600, 242337, 238615, 235267, 232921, 231520, 230901, 231093, 231856, 232542, 232754, 232973, 234290, 237533, 242524]
54891B42524N594N021M317M517N522O448O911P257P678P888P774P477O638M490
54877C30056J140k035l857m656n569p022q398q869q174o795n656n363n539n253
54863B54010m225l135k649k668k743k657k319j660r05m91m08k10R9j37j150k134
54847B26618k263j731j218q43l26K05L22j1m62r08j408j755j579q85j36K57K56
54830B14133J02J46O17J281J489Q87p2o25n31k10l4J17N73J305J765J422M34m01
54812B22398n67m35o07q97n72M76J477J891K023K267K388K079J653J591J756J734
54796B38655J601J720J916J584O95M2K70J105J776J841J325M77k38j19J142K854
54780B56646L826L805L851M936O530P321P049O716O948P175O772O062N513M722
$$ y = [242524, 248118, 253139, 257456, 261973, 267495, 273943, 280854, 288111, 295789, 303677, 311451, 318928, 325566, 330056, 331196, 329161, 325304, 320648, 315079, 308057, 299659, 290790, 282616, 275821, 270165, 264802, 259263, 254010, 249785, 246650, 244001, 241333, 238590, 235933, 233614, 231954, 231049, 230558, 230150, 229940, 230039, 229902, 228752, 226618, 224355, 222624, 221406, 220563, 220237, 220442, 220764, 220753, 220291, 219383, 217975, 216220, 214641, 213756, 213620, 213877, 214133, 214235, 214381, 214998, 216279, 217768, 218655, 218583, 217958, 217427, 217217, 217183, 217300, 217873, 219178, 220943, 222365, 222799, 222398, 221831, 221396, 220789, 219892, 219320, 219796, 221273, 223164, 225187, 227454, 229842, 231921, 233574, 235165, 236921, 238655, 240256, 241976, 243892, 245476, 246171, 246213, 246483, 247588, 249364, 251205, 252530, 253007, 252769, 252650, 253792, 256646, 260472, 264277, 268128, 273064, 279594, 286915, 293964, 300680, 307628, 314803, 321575, 327637, 333150, 337872]
54766C37872L089Q65j307l379n427o684o282m835m038m573n449n539m758l502
54752B86053k043q46n25j003j474j578j825k432k619j679p1J146J451J014K85
54737B73854o1N93K041L284L786M148N071O272O971O936O390N458M293L240K294
54722C34570Q42j453l897n593o541p290p960q274q209p885p175o087n163m751
54708B55134m268l018j432n36m39l52l5q7o91j111q14k13J03J86K16j7o01r46
54690B41079n29J99L09l31r06q42m85m77r04j341j463j222o81m7K09k27r04q98
54672B30539M8J042J117M02k44m66o31r45j166j272j606k059j811m30J275K099
54656B25892J826J185P10K74k86o61m84R2M44J34n95j017o75J36P65R75J023J074
$$ y = [337872, 340961, 341826, 340519, 337140, 331713, 325029, 318747, 313912, 309874, 305301, 299852, 294313, 289555, 286053, 284010, 283164, 282639, 281636, 280162, 278584, 276759, 274327, 271708, 270029, 269958, 271104, 272555, 273569, 273854, 273793, 274386, 276427, 279711, 283497, 287645, 292716, 298988, 305959, 312895, 319285, 324743, 329036, 332276, 334570, 335412, 333959, 330062, 324469, 317928, 310638, 302678, 294404, 286195, 278310, 271135, 265048, 259885, 255134, 250866, 247848, 246416, 245880, 245441, 245089, 245054, 244967, 244276, 243165, 242351, 242138, 242241, 242427, 242643, 242626, 242025, 241079, 240550, 240749, 241058, 240727, 239821, 238979, 238494, 238017, 237113, 235772, 234309, 233087, 232406, 232359, 232568, 232341, 231437, 230539, 230587, 231629, 232746, 233148, 232904, 232438, 231807, 230862, 229696, 228424, 226818, 224759, 222948, 222518, 223793, 225892, 227718, 228903, 229613, 229887, 229601, 228940, 228456, 228548, 228992, 229126, 228531, 227514, 226839, 226975, 227740, 228715, 229738, 230812]
54638B30812R57N80J39k28o28j065j238r25k95L34P58Q27N15J64K43O19O22N1
54620B32242m31k55K11K71j03m58o32p26n60J06R20J145O51J55L19R97J545J582
54602B36979J227Q12N82N62N87L79k14r34j158n08N33R91N52j6L0L91L53Qk9K17
54582B41344J61j78j86J13m1p45j031m06L49M78L30L86L27p2l7R78K023J848Q37
54563B46478L66O62O65r4q41r80r01r96q82j45Q01J144O37j82n40j47N00O86M74
54544B46705P25J804K802K749K020J691J938K021J646J230R53N64J94K54M90J65
54528B67951o57j047p11m79q83j281r61k48J52J22j43o96j423j686j151m86m65
54511B55908q08o83p4K15k19r35j398j483j137k36R36J571J156J11o62q02p33
$$ y = [230812, 231769, 232349, 232488, 232260, 231632, 230567, 229329, 228404, 228109, 228443, 229201, 230028, 230543, 230707, 230950, 231569, 232191, 232242, 231811, 231556, 231767, 232038, 231935, 231477, 230845, 230119, 229559, 229665, 230585, 231730, 232381, 232536, 232855, 233852, 235397, 236979, 238206, 239018, 239600, 240162, 240749, 241128, 240914, 239980, 238822, 238314, 238847, 239838, 240390, 240374, 240404, 240795, 241148, 241156, 241127, 241344, 241505, 241327, 241141, 241254, 241213, 240468, 239437, 239031, 239380, 239858, 240188, 240574, 240901, 240829, 240792, 241770, 243793, 245641, 246478, 246844, 247506, 248171, 248077, 247236, 246256, 245355, 244359, 243477, 243332, 244133, 245277, 245914, 245732, 245192, 245045, 245545, 246231, 246705, 247430, 249234, 252036, 254785, 256805, 258496, 260434, 262455, 264101, 265331, 266284, 266848, 267042, 267296, 267786, 267951, 267294, 266247, 265536, 265057, 264174, 262893, 261932, 261684, 261836, 261958, 261815, 261119, 259696, 258010, 256859, 256373, 255908, 255100, 254417, 254343, 254558, 254339, 253404, 252006, 250523, 249386, 249150, 250086, 251657, 252813, 252924, 252262, 251460, 250727]
54494B50727r34j286j347r91m57J52R39J709J881J299O30M64M45l5o24l76O43
54477B52839J272R52N65R95J751J837J318J056J260J269P82L63M91Q59R28P01
54461B69238N32N85P72J013J230J261J074Q49O79L74j00l35m0L19J2q47j337j037
54443B74242o28q40j367j399q57l72k93l87m61o10p96p78n72l80j48L21P54O63
54425B66092K36J87N83P40N06O26J339J705J092L33M54J006Q59M7m07j81J09J49
54407B75475K38L74J77k28k83k3J4p5M04J363J779J314R54J459K197K238J732
54390B89109J368J207R23P05R64J456J507R96M49K31K29K71L57M63N20N90P06
54373C02051O51K27l20n22l30j95m21p22n58K46J366K335K978L409L776M088M348
$$ y = [250727, 249793, 248507, 247160, 246169, 245712, 245864, 246803, 248512, 250393, 251692, 252322, 252786, 253231, 253196, 252572, 252196, 252839, 254111, 255063, 255628, 256623, 258374, 260211, 261529, 262585, 263845, 265114, 265896, 266259, 266750, 267609, 268537, 269238, 269770, 270355, 271127, 272140, 273370, 274631, 275705, 276554, 277233, 277607, 277507, 277172, 277132, 277451, 277463, 276616, 275279, 274242, 273614, 272774, 271407, 270008, 269151, 268779, 268486, 268099, 267638, 267028, 266232, 265454, 264882, 264502, 264354, 264675, 265429, 266092, 266328, 266515, 267098, 267838, 268344, 268970, 270309, 272014, 273106, 273439, 273893, 274899, 275758, 275805, 275398, 275217, 275326, 275475, 275713, 276087, 276264, 276036, 275753, 275730, 275744, 275669, 276073, 277436, 279215, 280529, 281483, 282942, 285139, 287377, 289109, 290477, 291684, 292607, 293312, 294276, 295732, 297239, 298235, 298684, 298915, 299144, 299415, 299772, 300235, 300755, 301345, 302051, 302702, 302929, 302609, 302087, 301757, 301562, 301141, 300419, 299861, 300107, 301473, 303808, 306786, 310195, 313971, 318059, 322407]
54356C22407M608M801M671M151L628L539L790L796L086J633k67k117l389l918
54342C50419m132m496m888m845m339l801l498l377l446l687l603k620j052k9j32
54327C02474p29r22o21k83j48j95m42q12r78p64m94n36p96r30q64p75p45p68r10
54308B89762j200j462j525j480j499j576j556j352r80n39j77L2K09M48N19J41
54292B77765n06q49n83R3Q43J407J546J261J052J327J584R68k74q25j64N64K41
54275B85450n61n22M21J046O57r8l09P5M31K99k11o04m51J54O81P87P08Q17J087
54256B89857J274J403J653J945J981J645J068M89K11M84J092J364R00J02m33p57
54240C04278j331k088k369j804q42j97j46m48p13p37n66l76k19N0N49J140J525
$$ y = [322407, 327015, 331816, 336487, 340638, 344266, 347805, 351595, 355391, 358477, 360110, 359843, 357726, 354337, 350419, 346287, 341791, 336903, 332058, 327719, 323918, 320420, 317043, 313597, 309910, 306307, 303687, 302635, 302606, 302474, 301745, 300823, 300202, 299919, 299771, 299576, 299134, 298322, 297344, 296580, 296086, 295550, 294754, 293824, 292960, 292185, 291440, 290672, 289762, 288562, 287100, 285575, 284095, 282596, 281020, 279464, 278112, 277132, 276593, 276416, 276448, 276657, 277105, 277624, 277765, 277259, 276410, 275827, 275920, 276763, 278170, 279716, 280977, 282029, 283356, 284940, 285908, 285634, 284809, 284645, 285209, 285450, 284889, 284367, 284788, 285834, 286491, 286393, 286084, 286159, 286590, 286889, 286678, 286074, 285623, 285777, 286458, 287245, 287953, 288770, 289857, 291131, 292534, 294187, 296132, 298113, 299758, 300826, 301315, 301526, 302010, 303102, 304466, 305366, 305468, 305035, 304278, 302947, 300859, 298490, 296686, 295844, 295647, 295501, 295053, 294340, 293603, 293037, 292661, 292442, 292492, 293041, 294181, 295706]
54223B95706J484J043N67N87J215J733J237j95j434j637j196r96j226j397j160
54208B94331o01P8O80R47Q10O08O60Q55R17Q65Q30O17l2q58j245r05j49N38Q34
54189B99780O93L21O5J01L46O92J072J163N69m94j228j325j383j853k128j549
54173B94842o25l39n91m37K19L06p95k269k897k439j542q07l30J06O25R74O93
54156B84694j75q47p13k01j20m21m08l4M6k39p1R18J950K204J835J381Q82K29
54138B90910k13m3N54J218J964K820L299K985K268J845J697J353R42J136J957
54123C14692K447J870P21P2K30M64N6p64j125o63J9J67j08o1N40J091J162J163
54105C21973J617K251K379J881J206O35J16k60k68j7J68L93J163K536L830M410
$$ y = [295706, 297190, 298233, 298800, 299387, 300602, 302335, 303572, 303377, 301943, 300306, 299110, 298114, 296888, 295491, 294331, 293730, 293808, 294488, 295435, 296245, 296853, 297513, 298368, 299285, 300150, 300980, 301597, 301565, 300707, 299462, 298557, 298408, 298946, 299780, 300473, 300794, 300859, 300960, 301306, 301998, 303070, 304233, 304802, 304308, 303080, 301755, 300372, 298519, 296391, 294842, 294217, 293878, 293287, 292850, 293069, 293375, 292580, 290311, 287414, 284975, 283433, 282626, 282296, 282402, 283027, 284001, 284694, 284519, 283672, 282959, 282758, 282638, 282217, 281809, 281775, 281821, 281582, 281511, 282429, 284379, 286583, 288418, 289799, 290681, 290910, 290697, 290654, 291208, 292426, 294390, 297210, 300509, 303494, 305762, 307607, 309304, 310657, 311599, 312735, 314692, 317139, 319009, 319730, 319802, 320032, 320496, 320552, 319788, 318663, 318000, 318019, 318186, 318078, 318017, 318557, 319648, 320810, 321973, 323590, 325841, 328220, 330101, 331307, 331942, 332058, 331798, 331530, 331513, 331681, 332074, 333237, 335773, 339603, 344013]
54089C44013M404M381M664N194N748O053O046O168P044Q495R316Q498O488M587
54075D31099L249J500j627n647q922j0285j0054r390q933q250o683m506k839k365
54061C56347k498k209j302n06l87p20r36p48k08M39Q12O49J95PK28M85O50J168
54043C51466K293L447L878L651L486L833M570N463O417P380Q413R710J1135J2011
54029D37153J1876J1281J1169J1630J1938J1667J1015R967Q144N734L692K588
54017E47854J909J009Q8k87j08J84K67m3r12k079k783k711k584l171m092m423
54001E28118m204m451n665p138p954q009p831p776p737p401o606n590m864m672
53987D38220m613m057k914j758j283j710k646l310l167k513k189k450k636k255
$$ y = [344013, 348417, 352798, 357462, 362656, 368404, 374457, 380503, 386671, 393715, 402210, 411526, 420024, 426512, 431099, 434348, 435848, 434221, 428574, 419652, 409367, 399313, 389923, 380990, 372740, 366057, 361551, 358712, 356347, 353849, 351640, 350338, 349832, 349445, 348725, 347789, 347041, 346833, 347272, 348084, 348733, 348928, 348935, 349163, 349648, 350298, 351466, 353759, 357206, 361084, 364735, 368221, 372054, 376624, 382087, 388504, 395884, 404297, 414007, 425142, 437153, 449029, 460310, 471479, 483109, 495047, 506714, 517729, 527696, 535840, 541574, 545266, 547854, 549763, 550772, 550860, 550573, 550465, 550649, 550916, 550873, 549961, 547882, 545099, 542388, 539804, 536633, 532541, 528118, 523914, 519463, 513798, 506660, 498706, 490697, 482866, 475090, 467353, 459952, 453346, 447756, 442892, 438220, 433607, 429550, 426636, 424878, 423595, 421885, 419239, 415929, 412762, 410249, 408060, 405610, 402974, 400719]
53973D00719j875k213k857k751j774q81o60p31p26r25j502j962j854j448j109
53958C77451o04L84J442J887J795J885K471L128L506L830M351M745M535L908L667
53943D18381M275N284N920O089O414P291Q329Q892Q919Q807Q759Q606Q231P784
53929E21981P458P391P799Q948J0857J3226J5621J7536J8562J8911J9551K1098
53917F88939K2459K1237J5933P476j573q918j3458j5073j4297j2056r195o121
53905F75353l002j16K315M332N937O785O699O354O711P669P869O155K931l19k502
53890G33171l559l969m201m612n375o312p092p753q671r901j0930j1384j1609
53877F37803j2127j2759j2797j2017j0998j0397j0276j0238r892r058p878o809
$$ y = [400719, 398844, 396631, 393774, 391023, 389249, 388368, 387708, 386977, 386251, 385326, 383824, 381862, 380008, 378560, 377451, 376847, 377231, 378673, 380560, 382355, 384240, 386711, 389839, 393345, 397175, 401526, 406271, 410806, 414714, 418381, 422656, 427940, 433860, 439949, 446363, 453654, 461983, 470875, 479794, 488601, 497360, 505966, 514197, 521981, 529439, 536830, 544629, 553577, 564434, 577660, 593281, 610817, 629379, 648290, 667841, 688939, 711398, 732635, 748568, 756044, 754471, 745553, 732095, 717022, 702725, 690669, 681474, 675353, 672351, 672235, 674550, 678882, 684819, 691604, 698303, 704657, 711368, 719037, 726906, 733061, 735992, 735673, 733171, 729612, 725643, 721442, 716830, 711455, 705143, 698051, 690298, 681627, 671726, 660796, 649412, 637803, 625676, 612917, 600120, 588103, 577105, 566708, 556432, 546194, 536302, 527244, 519366, 512557]
53865E12557o262o121n937n576n341n415n636n883o185o322n925n186m817n025
53851D32926n196m987m955n481n808n069l727k949k871k643k008j654j872j972
53837C81734j416o53k99k93l67o64j274j695j429q02n41p06o90j05P69J514K018
53820C75101K267K045J180np47m76O02J653J990J592R01L05l5k7M18J279K413
53803C90456L546M247M146L434K962L520N057O788P970Q398Q403Q581R330J0320
53789D77158J0702J0159R390R162R204Q649P260N557L920K292P77k69q33j282
53775E51846j750k025k207k708l509m083m298m686n546o382o679o610o522o250
53761D88591n561m895n019o021p108p452o970o270n986o150o158n439m087k721
$$ y = [512557, 506295, 500174, 494237, 488661, 483320, 477905, 472269, 466386, 460201, 453879, 447954, 442768, 437951, 432926, 427730, 422743, 417788, 412307, 406499, 401430, 397703, 394754, 391883, 389240, 387232, 385578, 383706, 381734, 380318, 379665, 379366, 379073, 378706, 378042, 376768, 375073, 373644, 372842, 372301, 371595, 370905, 370800, 371569, 373083, 375101, 377368, 379413, 380593, 380588, 379841, 379365, 379967, 381620, 383610, 385202, 386103, 386408, 386373, 386346, 386764, 388043, 390456, 394002, 398249, 402395, 405829, 408791, 412311, 417368, 424156, 432126, 440524, 448927, 457508, 466838, 477158, 487860, 498019, 507409, 516571, 525775, 534424, 541684, 547241, 551161, 553453, 554230, 553961, 553128, 551846, 550096, 548071, 545864, 543156, 539647, 535564, 531266, 526580, 521034, 514652, 507973, 501363, 494841, 488591, 483030, 478135, 473116, 467095, 459987, 452535, 445565, 439295, 433309, 427159, 421001, 415562, 411475, 408754]
53747D08754j846j614k032k916l724l881l461l063k953k758k144j318p03m70n91
53732C75280r64j350j450j208p81k42L94R26J134J099R72O71K43K61J053J883
53716C77921J729Q60M74Q44J010N92N97J743L137L500K834K049J620J494J792
53701D02196K625L594M184M431M617M705M644M747N146N318M837M125L751L459
53687D62379K666J517O63K46n9k33NM39M88O1l13k36K24Q44J370J455R72L14m2
53668D72760n4J60P05J427J517M08j253k278k383k147j776r01L10R01L24p92j395
53651D65533j079k54L10M7q49j390q29L46R62P08L86O04R71Q97N33M40P07Q26
53633D68869L48n58j126n73J025K541K855K110J508J839K669L163L175L201L517
$$ y = [408754, 406908, 405294, 403262, 400346, 396622, 392741, 389280, 386217, 383264, 380506, 378362, 377044, 376341, 375871, 375280, 374316, 372966, 371516, 370308, 369527, 369285, 369679, 370605, 371739, 372838, 373810, 374481, 374724, 374985, 376038, 377921, 379650, 380510, 380984, 381828, 382838, 383430, 384027, 385770, 388907, 392407, 395241, 397290, 398910, 400404, 402196, 404821, 408415, 412599, 417030, 421647, 426352, 430996, 435743, 440889, 446207, 451044, 455169, 458920, 462379, 465045, 466562, 467225, 467471, 467412, 467179, 467184, 467623, 468111, 468172, 467859, 467623, 467847, 468691, 470061, 471516, 472488, 472802, 472760, 472706, 472866, 473571, 474998, 476515, 476923, 475670, 473392, 471009, 468862, 467086, 466185, 466495, 467396, 467720, 466928, 465533, 464454, 464200, 464510, 464557, 463708, 462318, 461489, 461835, 462797, 463505, 463891, 464495, 465466, 466363, 466896, 467336, 468043, 468869, 469217, 468659, 467533, 466960, 467985, 470526, 473381, 475491, 476999, 478838, 481507, 484670, 487845, 491046, 494563]
53618D94563L751L318K137Q98N23J295K565L416L534L314L325L781M392M608M260
53603E39680L987M602N866O513N859M766M430M776M882M544M476N040N702N915
53589F11038N744N473N191M982N012N198N187M740L934K907J745N94n08j746l225
53574F56266m660n709o390o812o768o166n444n019m592l713k762k520k958l239
53560E89514k905k250j559p78m5K63J16j21k54k49J67J085J773J382L93J95J137
53543E87864K039J957J432J430K008K571K760K520J944J500J802K783L660M102
53529F20372M616N490O145O192O276P182Q666R871J0454J0715J1046J1793J3231
53516G32049J5174J6954J8134J8867J9231J9019J8567J8977K0792K3112K4741
$$ y = [494563, 498314, 501632, 503769, 504667, 505190, 506485, 509050, 512466, 516000, 519314, 522639, 526420, 530812, 535420, 539680, 543667, 548269, 554135, 560648, 566507, 571273, 575703, 580479, 585361, 589905, 594381, 599421, 605123, 611038, 616782, 622255, 627446, 632428, 637440, 642638, 647825, 652565, 656499, 659406, 661151, 661745, 661237, 659491, 656266, 651606, 645897, 639507, 632695, 625927, 619761, 614317, 609298, 604706, 600993, 598231, 595711, 592753, 589514, 586609, 584359, 582800, 582022, 581977, 582240, 582356, 582235, 581981, 581732, 581899, 582984, 584757, 586139, 586532, 586727, 587864, 589903, 591860, 593292, 594722, 596730, 599301, 602061, 604581, 606525, 608025, 609827, 612610, 616270, 620372, 624988, 630478, 636623, 642815, 649091, 656273, 664939, 674810, 685264, 695979, 707025, 718818, 732049, 747223, 764177, 782311, 801178, 820409, 839428, 857995, 876972, 897764, 920876, 945617]
53505I45617K5654K6550K7572K8365K8919K9432K9633K9159K8373K8006K8170
53494A255450K8490K8928K9646L0231L0059K9341K8991K9349K9863L0086L0202
53483A580636L0364L0275K9697K8802K7762K6542K5298K4478K4241K4200K4040
53472A876335K3961K4192K4491K4364K3594K2267K0482J8346J6033J3667J1145
53461B098877Q263M999J625j489m236o915r926j3131j5789j7243j7530j7188j6744
53448A993573j6715j7724j9951k2517k4062k4233k4113k4884k6372k7346k7020
53437A738636k5839k4748k4096k3523k2620k1347j9733j7629j4998j2243r897
53426A521963q037o339m667l197j938n50J184K998M490N650O830Q381J0439J2863
$$ y = [945617, 971271, 997821, 1025393, 1053758, 1082677, 1112109, 1141742, 1170901, 1199274, 1227280, 1255450, 1283940, 1312868, 1342514, 1372745, 1402804, 1432145, 1461136, 1490485, 1520348, 1550434, 1580636, 1611000, 1641275, 1670972, 1699774, 1727536, 1754078, 1779376, 1803854, 1828095, 1852295, 1876335, 1900296, 1924488, 1948979, 1973343, 1996937, 2019204, 2039686, 2058032, 2074065, 2087732, 2098877, 2107140, 2112139, 2113764, 2112275, 2108039, 2101124, 2091198, 2078067, 2062278, 2045035, 2027505, 2010317, 1993573, 1976858, 1959134, 1939183, 1916666, 1892604, 1868371, 1844258, 1819374, 1793002, 1765656, 1738636, 1712797, 1688049, 1663953, 1640430, 1617810, 1596463, 1576730, 1559101, 1544103, 1531860, 1521963, 1513926, 1507587, 1502920, 1499723, 1497785, 1497235, 1498419, 1501417, 1505907, 1511557, 1518387, 1526768, 1537207, 1550070]
53412A550070J5231J7124J8565J9997K1750K3730K5637K7188K8163K8677K9499
53401A805631L1493L4524L7379L9193M0415M2015M4206M6618M9234N2378N5878
53390B278964N9072O1726O4335O7256P0042P1914P2688P2902P3176P3646P4000
53379C039721P3963P3566P2888P1746O9911O7543O5016O2329N9133N5411N1694
53368C762921M8258M4660M0308L5168K9555K3635J7504J1364N180j559r276j7707
53356C990011k6245l4558m2496m9647n5553o0140o3541o5693o6636o6896o7031
53345C391575o6954o6267o5032o3689o2326o0735n9093n7956n7575n7713n8097
53334B716138n8430n8062n6412n3872n1540m9820m7940m5162m1847l8767l5934
$$ y = [1550070, 1565301, 1582425, 1600990, 1620987, 1642737, 1666467, 1692104, 1719292, 1747455, 1776132, 1805631, 1837124, 1871648, 1909027, 1948220, 1988635, 2030650, 2074856, 2121474, 2170708, 2223086, 2278964, 2338036, 2399762, 2464097, 2531353, 2601395, 2673309, 2745997, 2818899, 2892075, 2965721, 3039721, 3113684, 3187250, 3260138, 3331884, 3401795, 3469338, 3534354, 3596683, 3655816, 3711227, 3762921, 3811179, 3855839, 3896147, 3931315, 3960870, 3984505, 4002009, 4013373, 4018553, 4016994, 4007718, 3990011, 3963766, 3929208, 3886712, 3837065, 3781512, 3721372, 3657831, 3592138, 3525502, 3458606, 3391575, 3324621, 3258354, 3193322, 3129633, 3067307, 3006572, 2947479, 2889523, 2831948, 2774235, 2716138, 2657708, 2599646, 2543234, 2489362, 2437822, 2388002, 2340062, 2294900, 2253053, 2214286, 2178352]
53323B178352l2782k9279k6194k4151k2965k2132k1592k1672k2419k3440k4421
53312A907305k5342k5959k5533k3642k0956j8569j6680j4710j2656j1275j0609
53301A701374r384o619k974K96K923N216O844P362P526Q719J1106J3633J5812
53288A761834J8202K0911K3084K4427K5999K8660L1674L3680L4363L4238L3469
53277B070541L1902K9938K8349K7225K5895K3947K1750J9826J8133J6164J3428
53266B327098R799N591J368k476n932r168j2218j5058j7873k1023k4663k8507
53254B206938l1936l4411l5889l6810l7609l8309l8729l8915l8981l8730l7807
53243A798812l6363l5065l4316l3847l3260l2650l2406l2678l3215l3579l3397
$$ y = [2178352, 2145570, 2116291, 2090097, 2065946, 2042981, 2020849, 1999257, 1977585, 1955166, 1931726, 1907305, 1881963, 1856004, 1830471, 1806829, 1785873, 1767304, 1750624, 1735914, 1723258, 1711983, 1701374, 1691990, 1685371, 1682397, 1682693, 1685616, 1690832, 1697676, 1705038, 1712564, 1721283, 1732389, 1746022, 1761834, 1780036, 1800947, 1824031, 1848458, 1874457, 1903117, 1934791, 1968471, 2002834, 2037072, 2070541, 2102443, 2132381, 2160730, 2187955, 2213850, 2237797, 2259547, 2279373, 2297506, 2313670, 2327098, 2336897, 2342488, 2343856, 2341380, 2335448, 2326280, 2314062, 2299004, 2281131, 2260108, 2235445, 2206938, 2175002, 2140591, 2104702, 2067892, 2030283, 1991974, 1953245, 1914330, 1875349, 1836619, 1798812, 1762449, 1727384, 1693068, 1659221, 1625961, 1593311, 1560905, 1528227, 1495012, 1461433, 1428036]
53232A428036l2623l1717l1251l1212l0925k9766k7778k5544k3701k2610k2070
53221A118839k1320j9663j7335j5336j4242j3648j3002j2547j2982j4482j6502
53210I47780j8376j9776k0659k1118k1271k1134k0588j9595j8288j6838j5391
53199G34746j4150j3257j2536j1702j0861j0442j0504j0560j0345j0177j0298
53188F09914j0330r849r099q570q211p615o775o105n800n662n488n151m478l512
53174E13269k791k845l454l923l983l868l578k783j646j015j415k390l151l483
53160D72944l591l503l144k732k570k567k400k084j953k136k376k450k420k409
53146D36609k348k034j282j20R93J296M69q09j490j365j160j320j316m86Q97J939
$$ y = [1428036, 1395413, 1363696, 1332445, 1301233, 1270308, 1240542, 1212764, 1187220, 1163519, 1140909, 1118839, 1097519, 1077856, 1060521, 1045185, 1030943, 1017295, 1004293, 991746, 978764, 964282, 947780, 929404, 909628, 888969, 867851, 846580, 825446, 804858, 785263, 766975, 750137, 734746, 720596, 707339, 694803, 683101, 672240, 661798, 651294, 640734, 630389, 620212, 609914, 599584, 589735, 580636, 572066, 563855, 556240, 549465, 543360, 537560, 531898, 526410, 521259, 516781, 513269, 510478, 507633, 504179, 500256, 496273, 492405, 488827, 486044, 484398, 483383, 481968, 479578, 476427, 472944, 469353, 465850, 462706, 459974, 457404, 454837, 452437, 450353, 448400, 446264, 443888, 441438, 439018, 436609, 434261, 432227, 430945, 430825, 431818, 433114, 433583, 432774, 431284, 429919, 428759, 427439, 426123, 425637, 426534, 428473]
53130D28473K170J829J327R81J070J583J982J772J269J193J604J851J673J561
53116D50338J847K164K145J993J899J661J295J310J744J616K39j488k143j766
53102D62854j650k362l150l380l371l424l122k171j233j083j487j531r31l50n02
53087D33107j248j721j256j98M11J18l11J8P75R05K80j66JJ24j63j09Q39J809
53069D33215J614M78l56m25l69o55j011j143j176j210j145j099j341j662j451
53054D22264o57k0p8m45m79j89n8k06k22K46J083J807J939J379N89K13L31L42
53036D27839j96q73r39l78M0j70o19o72k72K62Q88J747K529K589J858J122J080
53019D35835J424J346O67jj23K47Q21J447J947J989J427N42k67q82j399j765j712
$$ y = [428473, 430643, 432472, 433799, 434780, 435850, 437433, 439415, 441187, 442456, 443649, 445253, 447104, 448777, 450338, 452185, 454349, 456494, 458487, 460386, 462047, 463342, 464652, 466396, 468012, 468251, 466763, 464620, 462854, 461204, 458842, 455692, 452312, 448941, 445517, 442395, 440224, 438991, 437908, 436421, 434890, 433959, 433609, 433107, 431859, 430138, 428882, 428684, 429095, 429213, 428902, 428920, 429695, 430600, 430880, 430714, 430715, 430839, 430676, 430567, 431406, 433215, 434829, 435307, 434951, 434526, 434157, 433502, 432491, 431348, 430172, 428962, 427817, 426718, 425377, 423715, 422264, 421607, 421587, 421509, 421064, 420585, 420396, 420338, 420132, 419910, 420156, 421239, 423046, 424985, 426364, 426953, 427166, 427497, 427839, 427643, 426770, 425831, 425453, 425493, 425323, 424704, 424032, 423760, 424022, 424910, 426657, 429186, 431775, 433633, 434755, 435835, 437259, 438605, 439272, 439271, 439148, 439395, 440216, 441663, 443610, 445599, 447026, 447568, 447301, 446419, 445020, 443255, 441543]
53002D41543j034J71J499K469K780K406J467K16q22r87o8J303K242K507K498K469
52986D60659K227J689J223J247J773K551L284L595L169K186J346J131J282J228
52972D88590Q07L28J20K26M29M46J98J1L12J049J716J998K052K065J926J568J247
52955E05088J163J070N83l28j334k054k282k137k073k382k665k303j532j329j964
52940D85521k444j908q65l51m72o38p18r93j273j086o60o84j069r66k17K12l70
52923D71019j341j688j312q00m37r1K33L37K19M2j84m79n73j46O30J192J255J028
52905D68904P27K64m00q52o17J65Q03Q17M04Kk53m50n44m27k14r6l7O6j8n51j236
52884D66457j454j182j044j283j388j051p58q90r14j77R53J552J403J020P27N50
$$ y = [441543, 440509, 440680, 442179, 444648, 447428, 449834, 451301, 451517, 450695, 449708, 449640, 450943, 453185, 455692, 458190, 460659, 462886, 464575, 465798, 467045, 468818, 471369, 474653, 478248, 481417, 483603, 484949, 486080, 487362, 488590, 489397, 489725, 489845, 490071, 490500, 490946, 491144, 491155, 491467, 492516, 494232, 496230, 498282, 500347, 502273, 503841, 505088, 506251, 507321, 507904, 507576, 506242, 504188, 501906, 499769, 497696, 495314, 492649, 490346, 488814, 487485, 485521, 483077, 481169, 480304, 479953, 479481, 478843, 478125, 477132, 475859, 474773, 474113, 473429, 472360, 471394, 471177, 471389, 471019, 469678, 467990, 466678, 465878, 465441, 465350, 465583, 465920, 466139, 466181, 465997, 465518, 464945, 464799, 465429, 466621, 467876, 468904, 469631, 469895, 469495, 468643, 468026, 468191, 468994, 469811, 470215, 470217, 469964, 469514, 468970, 468543, 468329, 468233, 468196, 468262, 468244, 467693, 466457, 465003, 463821, 462777, 461494, 460106, 459055, 458297, 457407, 456493, 456316, 457269, 458821, 460224, 461244, 461971, 462521]
52868D62521P78J679K715K989K526K210K310K082J153K85K32O11O85N25O10P46
52852D84657L21o12j330j555j818k545l410l895m027m273m826n316n214m369l150
52837D38638k048j216m84J95N32K56m91j319j973k345k278j672p88j45L0L9K74
52820D25205P16R96Q70M75J48P4J54J09j79m18j00R15K066K589K334J836J544
52803D39334J390J238J286J547J268l19k753m579m959m443l861l190k028o09K60
52788D19582J52o64j624k172j976j246o37m01NR49J717J349J49n92l08K90N52
52771D15125P41J202J575J450J150J152J204P83J58J88J044J808J441q9j802k534
52755D24596j841l24Q47J003N60M31R20J466J405P49N6j93L0M21O14M14j5k21
$$ y = [462521, 463299, 464978, 467693, 470682, 473208, 475418, 477728, 479810, 480963, 481248, 481480, 482091, 482776, 483301, 483911, 484657, 484978, 484366, 483036, 481481, 479663, 477118, 473708, 469813, 465786, 461513, 456687, 451371, 446157, 441788, 438638, 436590, 435374, 434890, 435085, 435617, 435873, 435382, 434063, 432090, 429745, 427467, 425795, 425007, 424862, 424892, 424931, 425205, 425921, 426917, 427787, 428262, 428410, 428484, 428638, 428747, 428568, 428150, 428050, 428965, 431031, 433620, 435954, 437790, 439334, 440724, 441962, 443248, 444795, 446063, 445744, 442991, 438412, 433453, 429010, 425149, 421959, 419931, 419322, 419582, 419734, 419070, 417446, 415274, 413298, 412052, 411415, 411014, 411019, 411968, 413685, 415034, 415183, 414591, 414283, 414573, 415125, 415866, 417068, 418643, 420093, 421243, 422395, 423599, 424382, 424540, 424728, 425772, 427580, 429021, 428932, 427130, 424596, 422755, 422431, 423278, 424281, 424841, 425272, 426192, 427658, 429063, 429812, 429868, 429675, 429705, 430126, 430740, 431154, 431139, 430918]
52737D30918J77J042J763J899J659J603J840J823J085l3o37j94J030K344L252
52722D49571L685L849L930L910L596K811J546Kj425k303k464k191j864j492r09
52707D60252l52m00j088j687j642j265j125j166j001o34l40n1M28Q57Q28N23N25
52690D52662R23J265J372J544J908K182K197K075J795J184M23pm2j14l85n38m66
52673D67978m85o53n16Q3N54L38l68r70j161r56n38l71q69j656j741q25K01M86
52655D58531L15L65N68N08M83J182K505L537L709L392L295L738M499M898M220
52640D95745K465N81n62j203k129l285l677k717r77O22J732K480K969L255L497
52625D98796L724L606K758J248l81j565k223k746l512m384m833m645m235m054
$$ y = [430918, 431095, 432137, 433900, 435799, 437458, 439061, 440901, 442724, 443809, 443776, 443139, 442945, 443975, 446319, 449571, 453256, 457105, 461035, 464945, 468541, 471352, 472898, 472900, 471475, 469172, 466708, 464517, 462653, 461161, 460252, 459900, 459500, 458412, 456725, 455083, 453818, 452693, 451527, 450526, 449892, 449552, 449501, 449929, 450786, 451614, 452137, 452662, 453585, 454850, 456222, 457766, 459674, 461856, 464053, 466128, 467923, 469107, 469530, 469523, 469481, 469367, 468982, 468444, 467978, 467493, 466840, 466324, 466407, 466961, 467299, 466931, 465961, 464800, 463844, 463306, 462935, 462066, 460410, 458669, 457844, 458045, 458531, 458846, 459211, 459779, 460287, 460770, 461952, 464457, 467994, 471703, 475095, 478390, 482128, 486627, 491525, 495745, 498210, 498791, 498229, 497026, 494897, 491612, 487935, 485218, 484241, 484863, 486595, 489075, 492044, 495299, 498796, 502520, 506126, 508884, 510132, 509751, 508186, 505963, 503217, 499705, 495321, 490488, 485843, 481608, 477554]
52611D77554l929l319k117q63j69j98o75j131j156o53J33Q96J506J847J689J043
52595D70458M17L13N35M46q1m23m9P42J151Q58L99N75J531K507K604J769Q27M85
52577D85064O40Q27Q64Q20O47L40K30N53R12O68j40q13j025j217j806k489k632
52560D81443k043j080k21J83M1l72n62l50j16k72o60p53m21j60l70p53o97j77
52542D72660J62r4n50o53o13j033j744j722n17R09J256N03k24o2P60J511J772
52525D72321J653J521J672K027K203K121K302L236M511N183M948M501M572N078
52511E17849N489N587N503N291M709L471J528p74k783l999m534m975n637o100
52497E20625n654m187k531j828k447l514l707k603j093k98l79o88p91q11q73p96
$$ y = [477554, 473625, 470306, 468189, 467326, 467157, 466959, 466284, 465153, 463997, 463344, 463477, 464373, 465879, 467726, 469415, 470458, 470875, 471188, 471723, 472169, 472088, 471665, 471616, 472358, 473509, 474367, 474766, 475341, 476872, 479379, 481983, 483752, 484579, 485064, 485704, 486531, 487395, 488215, 488862, 489202, 489432, 489985, 490897, 491565, 491425, 490612, 489587, 488370, 486564, 484075, 481443, 479400, 478320, 478099, 478282, 478323, 477951, 477389, 477039, 476923, 476651, 475991, 475238, 474817, 474657, 474287, 473534, 472837, 472660, 472822, 472728, 472178, 471525, 470912, 469879, 468135, 466413, 465896, 466805, 468061, 468564, 468340, 468278, 469038, 470549, 472321, 473974, 475495, 477167, 479194, 481397, 483518, 485820, 489056, 493567, 498750, 503698, 508199, 512771, 517849, 523338, 528925, 534428, 539719, 544428, 547899, 549427, 548653, 545870, 541871, 537337, 532362, 526725, 520625, 514971, 510784, 508253, 506425, 503978, 500464, 496757, 494154, 493061, 492763, 492384, 491696, 490905, 490094, 489221, 488425]
52481D88425m36N9N07Q96J215J363J355J359J492J790K398L414M565N360N641
52466E19403N587N236M465L536L044L057K726J248j107l233m240m043l239k795
52452E29645l442m944o133o107n251m640m686m829m507l765k893j965j006k69
52438D75208Pj16m13p43j008j036p66m66n06r62j536j883j854j460p71N7P50J081
52420D63583J085R91R56R24P87N78M38M53O55J055J536J764J519J158J426K637
52404D81545M207N310N846O360P118P757Q134Q888J0639J2871J4342J4646J4683
52391F02346J5243J5699J4695J1615O908J295m523r520j2703j3978j4032j3212
52379E99833j1237q269n324l148j490j8Q52R40J199K434L657L137Q76j342k420
$$ y = [488425, 487989, 488048, 488555, 489451, 490666, 492029, 493384, 494743, 496235, 498025, 500423, 503837, 508402, 513762, 519403, 524990, 530226, 534691, 538227, 541271, 544328, 547054, 548302, 547195, 543962, 539722, 535679, 532440, 529645, 526203, 521259, 515126, 509019, 503768, 499128, 494442, 489613, 485106, 481341, 478448, 476483, 475477, 475208, 475215, 475099, 474686, 473943, 472935, 471899, 471133, 470667, 470161, 469199, 467663, 465780, 463926, 462466, 461695, 461752, 462502, 463583, 464668, 465659, 466615, 467539, 468326, 468904, 469342, 469795, 470450, 471505, 473041, 474805, 476324, 477482, 478908, 481545, 485752, 491062, 496908, 503268, 510386, 518143, 526277, 535165, 545804, 558675, 573017, 587663, 602346, 617589, 633288, 647983, 659598, 666506, 667801, 663278, 653758, 641055, 627077, 613045, 599833, 588596, 580327, 575003, 571855, 570365, 570347, 571199, 572139, 573338, 575772, 579429, 582566, 583442, 582100, 579680]
52364E79680k995l768m209l746k958k655k552j908q67j08K65N72P13M69L41R85
52348E57259K048K540K363K382K909L199K756K107J887K028K298K879L748M278
52334E94681M119L961M592N697O404O631P021P720Q130P952P650P669P832P703
52320F87762P096O023M694L627L255L298L109K777L194M753O698Q259R719J1673
52306G65937J3812J5379J6438J7747J9383K0518K0681K0472K0601K0932K0826
52295I72726K0006J8658J7071J5552J4462J3973J3963J4358J5323J6828J8345
52284A151265J9269J9639K0051K0939K2111K3006K3314K3253K3211K3161K2646
52273A391865K1550K0502K0178K0364K0273J9647J8906J8193J7164J5832J4825
$$ y = [579680, 576685, 572917, 568708, 564962, 562004, 559349, 556797, 554889, 554022, 553914, 554179, 554751, 555464, 555933, 556274, 557259, 559307, 561847, 564210, 566592, 569501, 572700, 575456, 577563, 579450, 581478, 583776, 586655, 590403, 594681, 598800, 602761, 607353, 613050, 619454, 626085, 633106, 640826, 648956, 656908, 664558, 672227, 680059, 687762, 694858, 700881, 705575, 709202, 712457, 715755, 718864, 721641, 724835, 729588, 736286, 744545, 754264, 765937, 779749, 795128, 811566, 829313, 848696, 869214, 889895, 910367, 930968, 951900, 972726, 992732, 1011390, 1028461, 1044013, 1058475, 1072448, 1086411, 1100769, 1116092, 1132920, 1151265, 1170534, 1190173, 1210224, 1231163, 1253274, 1276280, 1299594, 1322847, 1346058, 1369219, 1391865, 1413415, 1433917, 1454095, 1474459, 1494732, 1514379, 1533285, 1551478, 1568642, 1584474, 1599299]
52262A599299J4299J3459J1764R907Q802Q166P002N132L293J816K45j572k939
52249A678673l293l150l534m746n982o152m930l040j461l58J026L313O201Q952
52235A661519J1255J3251J4987J6353J7310J7782J7726J7681J8713K1010K3035
52224A850622K3039K1244J9464J8729J8345J7490J6374J5469J4552J3183J1464
52213B039975R653P649N374L204J463n7j669l293m755o083p149p523p220o993
52199B022576p343p723p332o363n683n564n455m994m575m775n645o738p596q093
52185A934697q387q631q703q457q092p893p580o467m530k731j893j766j672j538
52171A856357j687j978j907j355o24J88J128J830J644N14q11j597j797j863k301
$$ y = [1599299, 1613598, 1627057, 1638821, 1648728, 1657530, 1665696, 1672698, 1677830, 1681123, 1682939, 1683184, 1681612, 1678673, 1675380, 1672230, 1668696, 1663950, 1657968, 1651816, 1646886, 1643846, 1642385, 1642027, 1643053, 1646366, 1652567, 1661519, 1672774, 1686025, 1701012, 1717365, 1734675, 1752457, 1770183, 1787864, 1806577, 1827587, 1850622, 1873661, 1894905, 1914369, 1933098, 1951443, 1968933, 1985307, 2000776, 2015328, 2028511, 2039975, 2049628, 2057277, 2062651, 2065855, 2067318, 2067261, 2065592, 2062299, 2057544, 2051461, 2044312, 2036789, 2029569, 2022576, 2015233, 2007510, 2000178, 1993815, 1988132, 1982568, 1977113, 1972119, 1967544, 1962769, 1957124, 1950386, 1942790, 1934697, 1926310, 1917679, 1908976, 1900519, 1892427, 1884534, 1876954, 1870487, 1865957, 1863226, 1861333, 1859567, 1857895, 1856357, 1854670, 1852692, 1850785, 1849430, 1848806, 1848994, 1850122, 1851952, 1853596, 1854110, 1853299, 1851702, 1849905, 1848042, 1845741]
52156A845741l498n563q029r982j0640r838q013n857l961k463j012P49K667M182
52142A784483M933N081N106N379N866O167N870N031M147L637L561L962N138P208
52128A855569R619J1485J2381J2596J2630J2633J2348J1445R935Q230O685N156
52116A980712L315J313l80j872l939o836r587j0993j0938j0163r078p477n191
52103A908886k397O91L965P251J0267J2727J4280J4655J4250J4098J4818J5992
52091B029483J7094J8510K0825K3531K5521K6744K8289L0666L2967L4099L3983
52080B321712L3139L1798L0003K8026K6167K4379K2506K0596J8681J6577J4166
52069B587750J1616R100O588M179K265J102L62o15k191m159n850o616o455o256
$$ y = [1845741, 1842243, 1836680, 1828651, 1818669, 1808029, 1798191, 1790178, 1784321, 1780360, 1777897, 1776885, 1777634, 1780301, 1784483, 1789416, 1794497, 1799603, 1804982, 1810848, 1817015, 1822885, 1827916, 1832063, 1835700, 1839261, 1843223, 1848361, 1855569, 1865188, 1876673, 1889054, 1901650, 1914280, 1926913, 1939261, 1950706, 1960641, 1968871, 1975556, 1980712, 1984027, 1985340, 1984960, 1983088, 1979149, 1972313, 1962726, 1951733, 1940795, 1930632, 1921554, 1914077, 1908886, 1906489, 1907180, 1911145, 1918396, 1928663, 1941390, 1955670, 1970325, 1984575, 1998673, 2013491, 2029483, 2046577, 2065087, 2085912, 2109443, 2134964, 2161708, 2189997, 2220663, 2253630, 2287729, 2321712, 2354851, 2386649, 2416652, 2444678, 2470845, 2495224, 2517730, 2538326, 2557007, 2573584, 2587750, 2599366, 2608466, 2615054, 2619233, 2621498, 2622600, 2622962, 2622347, 2620156, 2615997, 2610147, 2603531, 2597076, 2590820]
52055B590820p070r031j1271j2886j3603j3616j3245j2955j3116j3500j3372j2348
52043B444807j0765r038p019m394j386J251K818L257L291M003N804P860Q947Q925
52029B458361Q720Q889Q976Q569Q135Q232Q533Q373P785P306P136P189P707R030
52015B572941J0847J2318J2949J2869J2183J0645Q116N020K071l17k473n279r273
52002B642617j3827j7661k0380k3010k6497l0372l3533l5894l8242m0679m2362
51991B320160m3004m3598m5221m7788n0485n2722n4122n4135n2511m9972m7727
51980A778875m6188m4688m2594m0319l8791l8121l7213l4897l1154k6901k2734
51969A375275j8483j4125j0423q064o716n634m997n700p888j0498j2584j4262
$$ y = [2590820, 2583750, 2574719, 2563448, 2550562, 2536959, 2523343, 2510098, 2497143, 2484027, 2470527, 2457155, 2444807, 2434042, 2425004, 2417985, 2413591, 2412205, 2413456, 2416274, 2419531, 2422822, 2426825, 2432629, 2440489, 2449436, 2458361, 2467081, 2475970, 2484946, 2493515, 2501650, 2509882, 2518415, 2526788, 2534573, 2541879, 2549015, 2556204, 2563911, 2572941, 2583788, 2596106, 2609055, 2621924, 2634107, 2644752, 2652868, 2657888, 2659959, 2659642, 2657169, 2651890, 2642617, 2628790, 2611129, 2590749, 2567739, 2541242, 2510870, 2477337, 2441443, 2403201, 2362522, 2320160, 2277156, 2233558, 2188337, 2140549, 2090064, 2037342, 1983220, 1929085, 1876574, 1826602, 1778875, 1732687, 1687999, 1645405, 1605086, 1566295, 1528174, 1490961, 1456064, 1424910, 1398009, 1375275, 1356792, 1342667, 1332244, 1324180, 1317464, 1311830, 1306833, 1301133, 1293245, 1282747, 1270163, 1255901]
51957A255901j6006j7647j8594j8523j7374j5103j1984q805o051l205M93M808
51945A127910Q700J1653J4087J6428J8409J9548J9725J9017J7358J4708J1254
51934A298797P218K796j639n591q991j2253j5516j8139j9380j9215j8176j6633
51922A173278j4711j2653j0727q795o584m341k612j324L85L086O322R235J1563
51909A142122J3519J5003J5438J4348J1653P391J593n395j2679j9210k4384k8139
51897A131260l0564l1599l1257l0036k8778k7919k7038k5412k2904j9995j7014
51886H38744j3757j0036o192k808j32K028M131O788J0390J4424J7546J8791J8491
51873H98408J7548J6092J3538R792N625J749j692m466n879n612m428l429k893
$$ y = [1255901, 1239895, 1222248, 1203654, 1185131, 1167757, 1152654, 1140670, 1131865, 1125814, 1122609, 1123102, 1127910, 1136610, 1148263, 1162350, 1178778, 1197187, 1216735, 1236460, 1255477, 1272835, 1287543, 1298797, 1306015, 1308811, 1307172, 1301581, 1292590, 1280337, 1264821, 1246682, 1227302, 1208087, 1189911, 1173278, 1158567, 1145914, 1135187, 1126392, 1119808, 1115467, 1112855, 1111531, 1111916, 1115002, 1121324, 1130559, 1142122, 1155641, 1170644, 1186082, 1200430, 1212083, 1219474, 1221067, 1215672, 1202993, 1183783, 1159399, 1131260, 1100696, 1069097, 1037840, 1007804, 979026, 951107, 924069, 898657, 875753, 855758, 838744, 824987, 814951, 808759, 805951, 805819, 807847, 811978, 818766, 829156, 843580, 861126, 879917, 898408, 915956, 932048, 945586, 955378, 961003, 962752, 961060, 956594, 950715, 945103, 940675, 937246, 934353]
51860I34353k305j428p07o36j155j856k546l416m747o484q092q894q694q005p565
51845H67823p713q323r189j0230j1271j1893j1653j0525q996p629o414m767k313
51832G56907M53K570L607L920L951L703L062K150J124j5j104j648j371o49ON98
51816G77264J345K005K118J727J255O90m01k014l503m406m858m971m465l269j920
51801G56597q76Q1J229K220K607K671K990L423L317K632K131K313K905L430L689
51786G91359L538K898K170J881J726P53j081k400k126q85J62J126K867N161O774
51771H13923P334P758Q615R288R176Q582P661N596J816k597n856p438q232q954
51757H46672r429r355q846q031o766n053l273j838r68q57j554k542k979k547j709
$$ y = [934353, 932048, 930620, 929913, 929277, 928122, 926266, 923720, 920304, 915557, 909073, 900981, 892087, 883393, 875388, 867823, 860110, 851787, 842598, 832368, 821097, 809204, 797551, 787026, 778030, 770401, 763987, 759220, 756907, 757360, 759930, 763537, 767457, 771408, 775111, 778173, 780323, 781447, 781432, 780328, 778680, 777309, 776660, 776666, 777264, 778609, 780614, 782732, 784459, 785714, 786404, 786003, 783989, 780486, 776080, 771222, 766251, 761786, 758517, 756597, 755721, 755802, 757031, 759251, 761858, 764529, 767519, 770942, 774259, 776891, 779022, 781335, 784240, 787670, 791359, 794897, 797795, 799965, 801846, 803572, 804325, 803244, 800844, 798718, 797833, 797995, 799121, 801988, 807149, 813923, 821257, 829015, 837630, 846918, 856094, 864676, 872337, 877933, 879749, 877152, 871296, 863858, 855626, 846672, 837243, 827888, 819042, 811011, 804245, 799192, 795919, 794081, 793113, 792256, 790702, 788160, 785181, 782634, 780925]
51742G80925r20m7J192K544L369L328K697K074J904K211K679K949K893K583K191
51727H12572K085K796M493O560P976Q232P620O733O046N947O678Q049R441J0177
51713I05405R740P756M231r5l980o481p340o690m824k381k80Q18Q38J52n88n66
51697H95715N95K178K787J680o61l303n610p013o904n298l177j580p46n49j250
51682H66864l133n754q296j0402j2073j2922j2474j1164j0211j0248j0626j0302
51670G49259q883o673m144j630P74L303O238R425J2339J4751J6960J9265K1558
51657H32542K3563K5098K5795K4860K1568J5969Q962J723m867j0451j4989j8277
51645I31496j9730j8927j6396j3483j1196r446p618n490l309j248O82K222K837
$$ y = [780925, 780005, 779958, 781150, 783694, 787063, 790391, 793088, 795162, 797066, 799277, 801956, 804905, 807798, 810381, 812572, 814657, 817453, 821946, 828506, 836482, 844714, 852334, 859067, 865113, 871060, 877738, 885787, 895228, 905405, 915145, 922901, 927132, 927037, 923057, 916576, 909236, 902546, 897722, 895341, 895061, 895879, 896717, 896869, 896281, 895715, 896310, 898488, 901275, 902955, 902294, 898991, 893381, 886368, 879464, 874166, 870989, 869409, 868663, 868114, 866864, 863731, 857977, 849681, 839279, 827206, 814284, 801810, 790646, 780435, 770187, 759561, 749259, 740376, 733703, 729559, 727929, 728703, 732006, 738244, 747669, 760008, 774759, 791719, 810984, 832542, 856105, 881203, 906998, 931858, 953426, 969395, 978357, 980080, 975213, 964762, 949773, 931496, 911766, 892839, 876443, 862960, 851764, 842318, 834700, 829210, 825901, 824653, 825335, 827557, 830394]
51632H30394K089j13l519p382j0479j1834j1590j0747r875q575o430l951k070
51619G45918j019l26K98P19R49J267J579J237j24k031l783n196o297o757o245
51604G20189n132m231l772l248k288j208m30J73J082K458L974N243O170O997Q010
51589G33987R240J0483J1668J3079J4988J7198J9114K0104J9579J7108J3047Q874
51577I08469O251N697O624Q654J2129J7180K3132K9231L5289M1097M5851M8965
51565A188569N1116N3708N7311O1086O3680O4165O2338N8746N4560N0918M7972
51554A814169M4725L9913L2973K4207J4081K476j1217k7044m3604n8646p0628
51543A761405p9305q4753q6615q4783q0218p4288o7603o0145n2377m5308l9392
$$ y = [830394, 832483, 832370, 828851, 821469, 810990, 799156, 787566, 776819, 766944, 758369, 751939, 747988, 745918, 744899, 744573, 744871, 745590, 746539, 747806, 749385, 750622, 750498, 748467, 744684, 739488, 733191, 726434, 720189, 715057, 710826, 707054, 703806, 701518, 700310, 699880, 700053, 701135, 703593, 707567, 712810, 718980, 725977, 733987, 743227, 753710, 765378, 778457, 793445, 810643, 829757, 849861, 869440, 886548, 899595, 908469, 914720, 920417, 927041, 935695, 947824, 965004, 988136, 1017367, 1052656, 1093753, 1139604, 1188569, 1239685, 1293393, 1350704, 1411790, 1475470, 1539635, 1601973, 1660719, 1715279, 1766197, 1814169, 1858894, 1898807, 1931780, 1955987, 1970068, 1972544, 1961327, 1934283, 1890679, 1832033, 1761405, 1682100, 1597347, 1510732, 1425949, 1345731, 1271443, 1203840, 1143695, 1091318, 1046010, 1006618]
51532A006618l4065k8673k3342j8648j4830j1668q983o916n640m930m176l007
51520H41740j762j038q01n37k95q17k118k872k064p38r26l047n505o840p159p192
51504G98029p060o590n954n374m659l644k633j937j414q25k25L93J271K188K176
51489G63742O71j480k944l524m094n073n922o218o369o849p425p550p117o378
51475F93470n464m403l430k823k508k131j527r21o46q36j312j661j517r64n06
51460F62821m16k90M34J594K444K664K737L138L634L807L801M049M540M908N111
51445G04976N530O404P716R442J1442J3140J4049J4581J5635J7216J8167J7407
51433H55705J4799J0642N376J87l100l638k481j294q13j220l031o329r652j1086
$$ y = [1006618, 972553, 943880, 920538, 901890, 887060, 875392, 866409, 859493, 853853, 848923, 844747, 841740, 839978, 838940, 838139, 837602, 837307, 836490, 834372, 831500, 829436, 828698, 827772, 824725, 819220, 812380, 805221, 798029, 790969, 784379, 778425, 773051, 768392, 764748, 762115, 760178, 758764, 757939, 757714, 758107, 759378, 761566, 763742, 764413, 762933, 759989, 756465, 752371, 747298, 741376, 735158, 728789, 721940, 714515, 706965, 699848, 693470, 688006, 683603, 680173, 677350, 674842, 672711, 671184, 670263, 669617, 668781, 667469, 665808, 664291, 663327, 662821, 662405, 662115, 662549, 664143, 666587, 669251, 671988, 675126, 678760, 682567, 686368, 690417, 694957, 699865, 704976, 710506, 716910, 724626, 734068, 745510, 758650, 772699, 787280, 802915, 820131, 838298, 855705, 870504, 881146, 886522, 886709, 883609, 879971, 877490, 876196, 875383, 874163, 871132, 864803, 855151, 844065]
51419H44065j0400q935p579o003l953j934k75J288K615K802J443n45k024k872
51405H07693l545m084m190l852l212k062j15K391M740O315P065P601Q918J1496
51391H35159J4644J7275J9470K2523K7161L2600L7788M2804M8258N4029N9558
51380A211269O4967P0966P7705Q4417R0065R3710R4412R1558Q5277P6060O4120
51369B104526M9670L3580J6858o11j9924m1332o3053q2277r6963j06383j10489
51358A683602j09529j04362r6619q7976p9291p0529o1590n2890m5000l8000l1647
51347I06169k6143k2135j9778j8316j6879j5362j4178j3422j2727j1700j0275
51336G25254q759p747p563p606o768m895l364l467m664n215m332k836j691r16
$$ y = [844065, 833665, 824730, 817151, 811148, 807195, 805261, 804986, 806274, 808889, 811691, 813134, 812589, 810565, 807693, 804148, 800064, 795874, 792022, 788810, 786748, 786633, 789024, 793764, 800079, 807144, 814745, 823663, 835159, 849803, 867078, 886548, 909071, 936232, 968832, 1006620, 1049424, 1097682, 1151711, 1211269, 1276236, 1347202, 1424907, 1509324, 1599389, 1693099, 1787511, 1879069, 1964346, 2040406, 2104526, 2154196, 2187776, 2204634, 2204023, 2184099, 2142767, 2079714, 1997437, 1900474, 1794091, 1683602, 1574073, 1469711, 1373092, 1285116, 1205825, 1135296, 1073706, 1020816, 975816, 937816, 906169, 880026, 857891, 838113, 819797, 802918, 787556, 773378, 759956, 747229, 735529, 725254, 716495, 708748, 701185, 693579, 686811, 681916, 678552, 675085, 670421, 665206, 660874, 658038, 656347, 655431]
51322F55431k11K09O7j88K50J522K965L951M480M798M879M578M154M210M963N824
51306G01882O073N750N477N425M973L643J748k09k348n021p873r918j0582j0194
51292F88826r426q651p905p147o341n495m646l759k662j239L65J887L205M365
51278F41377N437O473P409P992Q013P749P732P953P729O695N331M146K879J198
51264G28113l29q13l27L28R80K160L765M656M022K321M55j305k978m056l872k643
51248G30477j514j465k380l332l586l319l287l877m679n142n260n259m914l876
51234F78587k487j534j179q26k14K15K58M61J122J559J027n9n84j09P83J368J376
51217F79764R26M23M43J234K367L268L950M762N548N707N129M460M262M375M408
$$ y = [655431, 655220, 655429, 655496, 655308, 655558, 657080, 660045, 663996, 668476, 673274, 678153, 682731, 686885, 691095, 696058, 701882, 707955, 713705, 719182, 724607, 729580, 733223, 734971, 734762, 732414, 727393, 719520, 709602, 699020, 688826, 679400, 670749, 662844, 655697, 649356, 643861, 639215, 635456, 632794, 631555, 631920, 633807, 637012, 641377, 646814, 653287, 660696, 668688, 676701, 684450, 692182, 700135, 707864, 714559, 719890, 724036, 726915, 728113, 727784, 726971, 726644, 726972, 727952, 730112, 733877, 738533, 742555, 744876, 745331, 744026, 741048, 736992, 733120, 730477, 728963, 727498, 725118, 721786, 718200, 714881, 711594, 707717, 703038, 697896, 692636, 687377, 682463, 678587, 676100, 674566, 673387, 672561, 672347, 672562, 672820, 673281, 674403, 675962, 676989, 676930, 676346, 676237, 677020, 678388, 679764, 680690, 681113, 681556, 682790, 685157, 688425, 692375, 697137, 702685, 708392, 713521, 717981, 722243, 726618, 731026]
51202G31026M401M593M774M300K843R07n31q34j97O42J138J299J366J356J114
51187G58197O89L37J20k48r46j713k145k293k624l355m058m181l803l544l701
51172G26732l840l472k764k229j918j407o01M5K33K71N24Q52J000J197J825K680
51156G19128L092K816K338K209K463K775K813K346J338K11l13K5O50P70K33n12
51140G42382j093j517j922k378k932l526l813l422k495j600j014m35M04J229J642
51125G19510J728J866K177K606L263M212N036N229M940M785M886M735M092L403
51111G72468L082K997K918K897K908K716K511K934L882M097K769R55L29Q77J010
51096H09350j61j785k651k525j804p84K00O51M08j78q68j753k553k456j212K61
$$ y = [731026, 735427, 740020, 744794, 749094, 751937, 752844, 752313, 751479, 751282, 751924, 753062, 754361, 755727, 757083, 758197, 758886, 759223, 759343, 759095, 758149, 756436, 754291, 751998, 749374, 746019, 741961, 737780, 733977, 730433, 726732, 722892, 719420, 716656, 714427, 712509, 711102, 710501, 710546, 710779, 711050, 711574, 712426, 713426, 714623, 716448, 719128, 722220, 725036, 727374, 729583, 732046, 734821, 737634, 739980, 741318, 741529, 741216, 741241, 741891, 742661, 742894, 742382, 741289, 739772, 737850, 735472, 732540, 729014, 725201, 721779, 719284, 717684, 716670, 716235, 716639, 717868, 719510, 721238, 723104, 725281, 727887, 731150, 735362, 740398, 745627, 750567, 755352, 760238, 764973, 769065, 772468, 775550, 778547, 781465, 784362, 787270, 789986, 792497, 795431, 799313, 803410, 806179, 807134, 807463, 808340, 809350, 809189, 807404, 804753, 802228, 800424, 799640, 799840, 800491, 800899, 800721, 799853, 798100, 795547, 793091, 791879, 792140]
51080G92140R36Q39O66P10Q26J009J405J914K350K774L282L721M049M516N064
51065H26201N072M343L886M774O664Q341R527J1055J3357J5891J8322K1085K4290
51052I72808K7086K8821L0068L1709L3464L4038L2452K8725K3725J8962J6162
51041A278020J5980J7116J7242J5015J0894O136J595k547o504j0559j4685j8254
51029A309449k0376k0522j8649j4968j0284o526n956r148j4082j7818j8901j7795
51017A134424j5384j1916p502k857J075L980O315Q515J0400J1464J1628J1530
51005A161672J1989J3186J4525J5336J5562J5643J5864J6005J5582J4276J2044
50994A321684R108N867K708j02k389l994m953n636o468p350p649o862n145l018
$$ y = [792140, 793076, 793915, 794581, 795291, 796117, 797126, 798531, 800445, 802795, 805569, 808851, 812572, 816621, 821137, 826201, 831273, 835616, 839502, 844276, 850940, 859281, 868808, 879863, 893220, 909111, 927433, 948518, 972808, 999894, 1028715, 1058783, 1090492, 1123956, 1157994, 1190446, 1219171, 1242896, 1261858, 1278020, 1294000, 1311116, 1328358, 1343373, 1354267, 1360403, 1361998, 1359451, 1352947, 1342388, 1327703, 1309449, 1289073, 1268551, 1249902, 1234934, 1224650, 1218124, 1212168, 1203020, 1188938, 1171120, 1152219, 1134424, 1119040, 1107124, 1099622, 1096765, 1097840, 1101820, 1108135, 1116650, 1127050, 1138514, 1150142, 1161672, 1173661, 1186847, 1201372, 1216708, 1232270, 1247913, 1263777, 1279782, 1295364, 1309640, 1321684, 1330792, 1336659, 1339367, 1339265, 1336876, 1332882, 1327929, 1322293, 1315825, 1308475, 1300826, 1293964, 1288819, 1285801]
50980A285801o99K123N809J0172J4482J8162K1487K5377L0269L5486M0071M4140
50968A532680M8828N4833O1546O7842P3190P7622Q1091Q3388Q4530Q4785Q4434
50957B334769Q3956Q4107Q5267Q6686Q6913Q5108Q1610P7142P1907O5646N8322
50946C201433N0418M2579L5129K8007K1228J5346J1128Q680P288O364O225P463
50934C441288R690J1341J0685O697p19j0691k1573l1791m0769m8712n5592o0999
50922C208855o5074o8884p3409p8535q3319q6956q9257r0468r0877r0408q8531
50911B303137q4922q0203p5532p1266o6673o1184n5335m9945m5008m0075l5262
50900A637732l1091k7562k4173k0903j8402j6960j5922j4439j2412j0342q503
$$ y = [1285801, 1285102, 1287225, 1293034, 1303206, 1317688, 1335850, 1357337, 1382714, 1412983, 1448469, 1488540, 1532680, 1581508, 1636341, 1697887, 1765729, 1838919, 1916541, 1997632, 2081020, 2165550, 2250335, 2334769, 2418725, 2502832, 2588099, 2674785, 2761698, 2846806, 2928416, 3005558, 3077465, 3143111, 3201433, 3251851, 3294430, 3329559, 3357566, 3378794, 3394140, 3405268, 3413948, 3421236, 3427600, 3433825, 3441288, 3450978, 3462319, 3473004, 3479701, 3478982, 3468291, 3446718, 3414927, 3374158, 3325446, 3269854, 3208855, 3143781, 3074897, 3001488, 2922953, 2839634, 2752678, 2663421, 2572953, 2482076, 2391668, 2303137, 2218215, 2138012, 2062480, 1991214, 1924541, 1863357, 1808022, 1758077, 1713069, 1672994, 1637732, 1606641, 1579079, 1554906, 1534003, 1515601, 1498641, 1482719, 1468280, 1455868, 1445526, 1437023]
50889A437023o661m581k493q85Q3Q25J805K988L988M750N687P005Q304R211J0064
50874A477113J1547J3739J5967J7576J8521J9194K0043K1350K3168K5264K7363
50863A690845K9465L1758L4266L6842L9563M2877M7217N2606N8766O5543P3031
50852B202779Q1329R0367R9977J10115J20791J31859J43025J54258J65883J77968
50842C478351J89680J99706K07333K12795K16420K17885K16458K11567K02808
50833E353003J89780J72406J51219J27029J00581P2873M5514K0192k118k0947
50823F209532l5618m5429n0542n1998n0627m6530l9942l2091k4706j9090j6113
50812E796846j6778k2064l2206m6497o3961q3748j04772j25465j44359j60917
$$ y = [1437023, 1430362, 1425781, 1423288, 1422403, 1422486, 1423311, 1425116, 1428104, 1432092, 1436842, 1442529, 1449534, 1457838, 1467049, 1477113, 1488660, 1502399, 1518366, 1535942, 1554463, 1573657, 1593700, 1615050, 1638218, 1663482, 1690845, 1720310, 1752068, 1786334, 1823176, 1862739, 1905616, 1952833, 2005439, 2064205, 2129748, 2202779, 2284108, 2374475, 2474452, 2584567, 2705358, 2837217, 2980242, 3134500, 3300383, 3478351, 3668031, 3867737, 4075070, 4287865, 4504285, 4722170, 4938628, 5150195, 5353003, 5542783, 5715189, 5866408, 5993437, 6094018, 6166891, 6212405, 6232597, 6230479, 6209532, 6173914, 6128485, 6077943, 6025945, 5975318, 5928788, 5888846, 5856755, 5832049, 5812959, 5796846, 5780068, 5758004, 5725798, 5679301, 5615340, 5531592, 5426820, 5301355, 5156996, 4996079]
50802D996079j75300j87359j96152k00715k01009j97773j91567j82378j70239
50793C293587j55864j40412j24795j09429r4550q0498o7623n6029m5468l5631
50783B383288k6597j8943j3105q762n147k095k58j50j323k902m520o373q499j0612
50769B274002j2529j4338j6156j8074k0283k2848k5300k6938k7687k8247k9249
50758B032353l0537l1405l1262k9825k7121k3615k0102j7071j4180j0708o515
50747A790012k224J611N257R494J4619K0079K5041K9265L3235L7622M2797M8807
50735B055615N5595O3032P0904P8927Q6795R4186J00897J06948J12408J17021
50725B942328J20255J21839J21962J20776J18022J13491J07587J00845R2968Q2930
$$ y = [4996079, 4820779, 4633420, 4437268, 4236553, 4035544, 3837771, 3646204, 3463826, 3293587, 3137723, 2997311, 2872516, 2763087, 2668537, 2588039, 2520416, 2464387, 2418919, 2383288, 2356691, 2337748, 2324643, 2315881, 2310734, 2308639, 2308381, 2308231, 2306908, 2304006, 2299486, 2293113, 2284614, 2274002, 2261473, 2247135, 2230979, 2212905, 2192622, 2169774, 2144474, 2117536, 2089849, 2061602, 2032353, 2001816, 1970411, 1939149, 1909324, 1882203, 1858588, 1838486, 1821415, 1807235, 1796527, 1790012, 1787788, 1789399, 1794656, 1804150, 1818769, 1838848, 1863889, 1893154, 1926389, 1964011, 2006808, 2055615, 2111210, 2174242, 2245146, 2324073, 2410868, 2505054, 2605951, 2712899, 2825307, 2942328, 3062583, 3184422, 3306384, 3427160, 3545182, 3658673, 3766260, 3867105, 3960073, 4043003]
50715D043003P0175N5293L9222K2324M725j2784k8793m2287n3041o0839o4855
50704C972143o4308n9498n1814m2742l3301k4392j7025j1832q735p535q612j2689
50692C629660k0085l0485m3206n7192p0960q3230r3617j02183j08340j10943j09614
50681B799805j05217r8706r0225p9917o8925n8685m9467m0364l0734k0950j1704
50670B144911l110N197J3400K1206K8138L3946L8671M2302M4547M5123M4225M2317
50658B500873L9453L5300K9981K4357J9266J4931J1394Q868P198N562L420J325
50646B701928J43j35o7L60J632L667N938Q573J2364J7413K2683K7338L1725L6607
50632B870169M1914M6830N0745N3615N5606N6883N7716N8511N9660O1291O3161
$$ y = [4043003, 4113178, 4168471, 4207693, 4230017, 4234742, 4221958, 4193165, 4150878, 4097837, 4036998, 3972143, 3907835, 3848337, 3796523, 3753781, 3720480, 3696088, 3679063, 3667231, 3658496, 3650961, 3642349, 3629660, 3609575, 3579090, 3535884, 3478692, 3407732, 3324502, 3230885, 3128702, 3020362, 2909419, 2799805, 2694588, 2595882, 2505657, 2425740, 2356815, 2298130, 2248663, 2208299, 2177565, 2156615, 2144911, 2141801, 2146998, 2160398, 2181604, 2209742, 2243688, 2282359, 2324661, 2369208, 2414331, 2458556, 2500873, 2540326, 2575626, 2605607, 2629964, 2649230, 2664161, 2675555, 2684423, 2691621, 2697183, 2700603, 2701928, 2702071, 2701936, 2701869, 2702229, 2703861, 2707528, 2713466, 2722039, 2734403, 2751816, 2774499, 2801837, 2833562, 2870169, 2912083, 2958913, 3009658, 3063273, 3118879, 3175762, 3233478, 3291989, 3351649, 3412940, 3476101]
50621C476101O4768O5793O6423O7019O7331O5886N9995M6751K5076k392k9813
50610C972938n1418o4513o9521o8024o1801n3106m4369l7150l1923k8896k8160
50599C434057k9218l1432l5082m0963m8659n6438o3272o9872p6934q3456q7741
50588B810990q9385q9182q7630q4574q0090p4750o9048o3275n7888n3250m9121
50577B012797m5029m1079l7792l5131l2328k8802k4733k0580j6432j2079p463
50566A711349k801J647N865J0085J4415J8455K1612K3904K6130K8949L2105L4872
50554A926587L7032L8988M1107M3297M5218M6599M7375M7743M7973M8072M7788
50543B417779M7039M6014M4762M2994M0636L8186L6238L4936L4284L4636L6473
$$ y = [3476101, 3540869, 3606662, 3673085, 3740104, 3807435, 3873321, 3933316, 3980067, 4005143, 4002751, 3972938, 3921520, 3857007, 3787486, 3719462, 3657661, 3604555, 3560186, 3523036, 3491113, 3462217, 3434057, 3404839, 3373407, 3338325, 3297362, 3248703, 3192265, 3128993, 3059121, 2982187, 2898731, 2810990, 2721605, 2632423, 2544793, 2460219, 2380129, 2305379, 2236331, 2173056, 2115168, 2061918, 2012797, 1967768, 1926689, 1888897, 1853766, 1821438, 1792636, 1767903, 1747323, 1730891, 1718812, 1711349, 1708548, 1710195, 1716060, 1726145, 1740560, 1759015, 1780627, 1804531, 1830661, 1859610, 1891715, 1926587, 1963619, 2002607, 2043714, 2087011, 2132229, 2178828, 2226203, 2273946, 2321919, 2369991, 2417779, 2464818, 2510832, 2555594, 2598588, 2639224, 2677410, 2713648, 2748584, 2782868, 2817504, 2853977]
50532B853977L9784M4030M8435N2151N4605N6210N8410O2338O7632P3111P8402
50521C489085Q4133R0600R7084J02622J06843J09697J10941J10250J07518J02674
50511D511447R5462Q5719P3775O0303M5777L0224J3581l779k0932l6931n1339
50500D803307o4090p4757q2425q6473q7125q4966q0168p2667o2812n1344l8806
50489D017674k5564j2371l46R707J7517K2696K4396K1834J4824L522j1946l1097
50477D050846n2561p4429r5114j13525j28480j38687j43677j44428j42366j37918
50467B879661j30594j20641j09766r9703r0519q1026p0606n9914m9926m1123l3716
50456A992127k7870k3306j9335j5676j2707j0628q859o783m538k533m92K323O128
$$ y = [2853977, 2893761, 2937791, 2986226, 3038377, 3092982, 3149192, 3207602, 3269940, 3337572, 3410683, 3489085, 3573218, 3663818, 3760902, 3863524, 3970367, 4080064, 4191005, 4301255, 4408773, 4511447, 4606909, 4692628, 4766403, 4826706, 4872483, 4902707, 4916288, 4912509, 4891577, 4854646, 4803307, 4739217, 4664460, 4582035, 4495562, 4408437, 4323471, 4243303, 4170636, 4107824, 4056480, 4017674, 3992110, 3979739, 3979393, 3989100, 4006617, 4029313, 4053709, 4075543, 4090367, 4093889, 4081943, 4050846, 3998285, 3923856, 3828742, 3715217, 3586737, 3448050, 3304373, 3159945, 3017579, 2879661, 2749067, 2628426, 2518660, 2418957, 2328438, 2247412, 2176806, 2116892, 2066966, 2025843, 1992127, 1964257, 1940951, 1921616, 1905940, 1893233, 1882605, 1873746, 1866963, 1862425, 1859892, 1859400, 1861723, 1867851]
50443A867851J0278J3916J6682J8908K1291K4145K6880K8615K9391L0204L1556
50432B119717L2592L2136K9942K6423K1866J6678J1908Q550O530N111M031L516
50420B319000L482L489L456L690M326N395P169R757J2613J5225J8069K2022K6950
50407B454643L1818L6129M0286M4560M8599N2054N4799N6427N6416N4937N2647
50396B983315M9612M5316L9864L4067K8121K1189J2736L310o491j6781k7626l8381
50384C128251m8406n7644o5883p2276p6163p7657p6755p2865o5954n7317m8234
50373B409097l8658k8231j7867q982j709M706R892J2266J1163P723L212k528j0297
50360B349787j9919l0101l9512m7410n3427n7310n8974n8639n6797n3949n0358
$$ y = [1867851, 1878129, 1892045, 1908727, 1927635, 1948926, 1973071, 1999951, 2028566, 2057957, 2088161, 2119717, 2152309, 2184445, 2214387, 2240810, 2262676, 2279354, 2291262, 2299812, 2306342, 2311453, 2315484, 2319000, 2322482, 2325971, 2329427, 2333117, 2337443, 2342838, 2350007, 2359764, 2372377, 2387602, 2405671, 2427693, 2454643, 2486461, 2522590, 2562876, 2607436, 2656035, 2708089, 2762888, 2819315, 2875731, 2930668, 2983315, 3032927, 3078243, 3118107, 3152174, 3180295, 3201484, 3214220, 3217530, 3211039, 3194258, 3166632, 3128251, 3079845, 3022201, 2956318, 2884042, 2807879, 2730222, 2653467, 2580602, 2514648, 2457331, 2409097, 2370439, 2342208, 2324341, 2315359, 2313650, 2318356, 2328248, 2340514, 2351677, 2359400, 2362612, 2360084, 2349787, 2329868, 2299767, 2260255, 2212845, 2159418, 2102108, 2043134, 1984495, 1927698, 1873749, 1823391]
50349A823391m6082m1316l6512l2058k8035k4458k1426j8747j5747j1862p277
50338A539871k593J907O204R910J2306J3034J2267J0063O036l7p436j4508j9457
50325A567567k1251k0134j7346j4171j1088p776l904K03L677N856P004Q155J0076
50312A506868J2427J4189J4872J4832J4431J3458J1775R961Q812Q485Q513Q488
50300A647111Q372Q383Q882J0127J1793J3039J3353J3028J2348J0658O889Q72
50288A764855o293j3026j8094k0952k1903k1822k1395k0651j9502j8233j6983
50277A566001j5249j2675r981q169o998n171k184R90L238M551N655P034Q711J0464
50263A546217J1977J3094J4087J5290J6564J7587J8565J9955K1598K2991K4412
$$ y = [1823391, 1777309, 1735993, 1699481, 1667423, 1639388, 1614930, 1593504, 1574757, 1559010, 1547148, 1539871, 1537278, 1539185, 1545389, 1555299, 1567605, 1580639, 1592906, 1602969, 1609005, 1608968, 1601532, 1587024, 1567567, 1546316, 1526182, 1508836, 1494665, 1483577, 1475801, 1471897, 1472100, 1475777, 1481633, 1488637, 1496792, 1506868, 1519295, 1533484, 1548356, 1563188, 1577619, 1591077, 1602852, 1612813, 1621625, 1630110, 1638623, 1647111, 1655483, 1663866, 1672748, 1682875, 1694668, 1707707, 1721060, 1734088, 1746436, 1757094, 1763983, 1764855, 1758562, 1745536, 1727442, 1706490, 1684587, 1662765, 1641370, 1620719, 1601217, 1582984, 1566001, 1550752, 1538077, 1528096, 1519927, 1512929, 1507758, 1505574, 1506564, 1509802, 1514353, 1520008, 1527042, 1535753, 1546217, 1558194, 1571288, 1585375, 1600665, 1617229, 1634816, 1653381, 1673336, 1694934, 1717925, 1742337]
50252A742337K6769L0047L3028L4998L6733L9154M1893M4008M5375M6408M7137
50241B167887M7471M7931M8973M9852M9203M6703M3305L9840L6331L2731K9396
50230B639623K6478K3425J9441J4027O970j692j1483k1690l1839m1564m9968n5649
50218B516079n7694n6327n2469m6956m0393l3406k6880k2092k0470k2641k7537
50207B109214l2890l6876l9049l9664l8778l6420l3180k9973k7317k5225k3666
50196A746176k2703k2222k1866k1449k1162k1290k1756k2047k1680k0683j9541
50185A509777j8705j8218j7918j7642j7053j5693j3677j2025j1494j1272r742
50174A346338o690l765k305j707o76Q02J809K232K869M003N046N773O723Q068
$$ y = [1742337, 1769106, 1799153, 1832181, 1867179, 1903912, 1943066, 1984959, 2028967, 2074342, 2120750, 2167887, 2215358, 2263289, 2312262, 2362114, 2411317, 2458020, 2501325, 2541165, 2577496, 2610227, 2639623, 2666101, 2689526, 2708967, 2722994, 2729964, 2728272, 2716789, 2695099, 2663260, 2621696, 2571728, 2516079, 2458385, 2402058, 2349589, 2302633, 2262240, 2228834, 2201954, 2179862, 2159392, 2136751, 2109214, 2076324, 2039448, 2000399, 1960735, 1921957, 1885537, 1852357, 1822384, 1795067, 1769842, 1746176, 1723473, 1701251, 1679385, 1657936, 1636774, 1615484, 1593728, 1571681, 1550001, 1529318, 1509777, 1491072, 1472854, 1454936, 1437294, 1420241, 1404548, 1390871, 1378846, 1367352, 1356080, 1346338, 1339648, 1335883, 1333578, 1331871, 1331195, 1331997, 1333806, 1336038, 1338907, 1342910, 1347956, 1353729, 1360452, 1368520]
50160A368520R034R009Q495Q323Q525Q610Q530Q675R158R642R847R855R982J0659
50146A496864J2159J4144J5707J6252J6026J5500J4643J3428J2608J3088J4597
50135A655016J5997J7096J9262K3777L0312L7724M5650N4442O3857P2883Q0946
50124B116962Q8328R5025R9979J02072J01448R9191R5999R1909Q7199Q2658P8635
50113C139405P4435O8992O1643N1829L8612K1366Q80k0863m2087o1923p9757r4604
50101C157928j05558j12475j15801j16045j13633j09138j03225r6485q9369q2193
50091B114006p5044o7910o1025n4899m9846m5739m2308l9339l6443l3096k9231
50080A579126k5494k2535k0340j8561j7138j6119j5211j4068j2858j1982j1364
$$ y = [1368520, 1377554, 1386563, 1395058, 1403381, 1411906, 1420516, 1429046, 1437721, 1446879, 1456521, 1466368, 1476223, 1486205, 1496864, 1509023, 1523167, 1538874, 1555126, 1571152, 1586652, 1601295, 1614723, 1627331, 1640419, 1655016, 1671013, 1688109, 1707371, 1731148, 1761460, 1799184, 1844834, 1899276, 1963133, 2036016, 2116962, 2205290, 2300315, 2400294, 2502366, 2603814, 2703005, 2799004, 2890913, 2978112, 3060770, 3139405, 3213840, 3282832, 3344475, 3396304, 3434916, 3456282, 3457162, 3436299, 3394212, 3332289, 3252532, 3157928, 3052370, 2939895, 2824094, 2708049, 2594416, 2485278, 2382053, 2285568, 2196199, 2114006, 2038962, 1971052, 1910027, 1855128, 1805282, 1759543, 1717235, 1677896, 1641453, 1608357, 1579126, 1553632, 1531097, 1510757, 1492196, 1475058, 1458939, 1443728, 1429660, 1416802, 1404820, 1393456]
50069A393456j0554r467q460p675o837n724m423l061j708m86O64K217M555P239
50055A349736R379J0720J1756J2819J3771J4707J6100J7912J9352J9948K0176
50044A516376K0543K0738K0306J9538J8958J8335J7132J5599J4591J4297J3988
50033A710401J3100J1909J0879R975Q914P748O908O826P660R203J0945J2423J3578
50020A840469J4685J5945J7332J8815K0560K2885K6069L0076L4301L7771M0009
50009B118917M1725M4296M8485N3898N9638O5137P0176P4392P7089P7484P5021
$$ y = [1393456, 1382902, 1373435, 1364975, 1357300, 1350463, 1344739, 1340316, 1337255, 1335547, 1335061, 1335725, 1337942, 1342497, 1349736, 1359115, 1369835, 1381591, 1394410, 1408181, 1422888, 1438988, 1456900, 1476252, 1496200, 1516376, 1536919, 1557657, 1577963, 1597501, 1616459, 1634794, 1651926, 1667525, 1682116, 1696413, 1710401, 1723501, 1735410, 1746289, 1756264, 1765178, 1772926, 1779834, 1786660, 1794320, 1803523, 1814468, 1826891, 1840469, 1855154, 1871099, 1888431, 1907246, 1927806, 1950691, 1976760, 2006836, 2041137, 2078908, 2118917, 2160642, 2204938, 2253423, 2307321, 2366959, 2432096, 2502272, 2576664, 2653753, 2731237, 2806258]
$$ [...]
##END NTUPLES=NMR SPECTRUM
##END=
