
##TITLE=AC1233_PERAH12114_6519287_kQ2xMY586G
##JCAMPDX= 6.0         $$ Bruker NMR JCAMP-DX V2.0
##DATA TYPE= NMR SPECTRUM
##DATA CLASS= NTUPLES
##ORIGIN= BRUKER
##OWNER= Administrator
$$ 1.72 TOPSPIN		Version 2.1
$$ 2012-07-14 15:45:12.703 -0500  Administrator@TOPSPIN
$$ Compression mode = diff/dup
##.OBSERVE FREQUENCY= 400.02188249412
##.OBSERVE NUCLEUS= ^1H
##.ACQUISITION MODE= SIMULTANEOUS (DQD)
##.ACQUISITION SCHEME= undefined
##.AVERAGES= 8
##.DIGITISER RES= 22
##SPECTROMETER/DATA SYSTEM= spect
##.PULSE SEQUENCE= zg30
##.SOLVENT NAME= COFFEE_meoh
##.SHIFT REFERENCE= INTERNAL, COFFEE_meoh, 1, 14.98509
##AUDIT TRAIL= $$ (NUMBER, WHEN, WHO, WHERE, PROCESS, VERSION, WHAT)
$$ ##TITLE= Audit trail, TOPSPIN		Version 2.1
$$ ##JCAMPDX= 5.01
$$ ##ORIGIN= Bruker BioSpin GmbH
$$ ##OWNER= Administrator
$$ $$ C:\Bruker\TOPSPIN/data/COFFEE/nmr/AC1233_PERAH12114_6519287_kQ2xMY586G/110/pdata/1/auditp.txt
$$ ##AUDIT TRAIL=  $$ (NUMBER, WHEN, WHO, WHERE, PROCESS, VERSION, WHAT)
(   1,<2012-07-14 15:44:52.296 -0500>,<Administrator>,<TOPSPIN>,<go>,<TOPSPIN 2.1>,
      <created by zg
	started at 2012-07-14 15:43:34.421 -0500,
	POWCHK enabled, PULCHK disabled,
       configuration hash MD5:
       6B 1B 68 BB D9 2E 58 E2 7F 35 AD 54 07 DF 0E 41
       data hash MD5: 64K
       66 48 F3 E5 BE DB 17 3C 66 40 BB 5B 69 EE F5 0C>)
(   2,<2012-07-14 15:45:00.953 -0500>,<Administrator>,<TOPSPIN>,<proc1d>,<TOPSPIN 2.1>,
      <Start of raw data processing
       efp LB = 0 FT_mod = 6 PKNL = 1 PHC0 = 0 PHC1 = 0 SI = 32K 
       data hash MD5: 32K
       3B DD 9E B4 76 07 12 45 E6 BC 05 03 0D 89 E1 B2>)
(   3,<2012-07-14 15:45:01.718 -0500>,<Administrator>,<TOPSPIN>,<proc1d>,<TOPSPIN 2.1>,
      <pk PHC0 = 174.6881 PHC1 = 0 
       data hash MD5: 32K
       1B F8 01 FA E6 40 D3 C2 37 73 69 23 CC A5 3C 47>)
(   4,<2012-07-14 15:45:02.140 -0500>,<Administrator>,<TOPSPIN>,<proc1d>,<TOPSPIN 2.1>,
      <abs ABSG = 1 
       data hash MD5: 32K
       60 20 24 7F 75 60 A2 CD AE 5B 3C 36 51 19 A9 E3>)
(   5,<2012-07-14 15:45:02.421 -0500>,<Administrator>,<TOPSPIN>,<proc1d>,<TOPSPIN 2.1>,
      <abs ABSG = 2 
       data hash MD5: 32K
       D8 70 E1 BC 3D F5 FC C0 27 67 11 16 81 F4 ED EF>)
(   6,<2012-07-14 15:45:02.703 -0500>,<Administrator>,<TOPSPIN>,<proc1d>,<TOPSPIN 2.1>,
      <abs ABSG = 3 
       data hash MD5: 32K
       AB EB E5 B6 40 ED E3 F4 A1 C4 C3 BA F4 3A 80 BE>)
(   7,<2012-07-14 15:45:02.984 -0500>,<Administrator>,<TOPSPIN>,<proc1d>,<TOPSPIN 2.1>,
      <abs ABSG = 4 
       data hash MD5: 32K
       A5 F1 05 D1 95 F5 06 1F C5 E4 01 D7 9D AF 78 DC>)
(   8,<2012-07-14 15:45:03.296 -0500>,<Administrator>,<TOPSPIN>,<proc1d>,<TOPSPIN 2.1>,
      <abs ABSG = 5 
       data hash MD5: 32K
       D3 E8 A6 4D 39 D0 F8 9E 81 A2 BF C5 FD 04 1C A2>)
$$ ##END=
$$ 
$$ $$ hash MD5
$$ $$ 28 2D F9 2C E9 4B 69 2B F3 7B 13 51 AF EF 64 52
##$RELAX= 
##$RELAX= 
##$RELAX= 
##$RELAX= 
##$RELAX= 
##$RELAX= 
##$RELAX= 
##$RELAX= 
$$ Bruker specific parameters
$$ [...]
150 150 150 150 150 150 150 150
##$TP07= 0
##$TPNAME0= <>
##$TPNAME1= <>
##$TPNAME2= <>
##$TPNAME3= <>
##$TPNAME4= <>
##$TPNAME5= <>
##$TPNAME6= <>
##$TPNAME7= <>
##$TPOAL= (0..7)
0.5 0.5 0.5 0.5 0.5 0.5 0.5 0.5
##$TPOFFS= (0..7)
0 0 0 0 0 0 0 0
##$TUNHIN= 0
##$TUNHOUT= 0
##$TUNXOUT= 0
##$USERA1= <user>
##$USERA2= <user>
##$USERA3= <user>
##$USERA4= <user>
##$USERA5= <user>
##$V9= 5
##$VALIST= <valist>
##$VCLIST= <CCCCCCCCCCCCCCC>
##$VD= 0
##$VDLIST= <DDDDDDDDDDDDDDD>
##$VPLIST= <PPPPPPPPPPPPPPP>
##$VTLIST= <TTTTTTTTTTTTTTT>
##$WBST= 2048
##$WBSW= 25
##$XGAIN= (0..3)
0 0 0 0
##$XL= 0
##$YL= 0
##$YMAX_a= 474935
##$YMIN_a= -588575
##$ZGOPTNS= <>
##$ZL1= 120
##$ZL2= 120
##$ZL3= 120
##$ZL4= 120
##$ABSF1= 14.98509
##$ABSF2= -5.573092
##$ABSG= 5
##$ABSL= 3
##$ALPHA= 0
##$AQORDER= 0
##$ASSFAC= 0
##$ASSFACI= 0
##$ASSFACX= 0
##$ASSWID= 0
##$AUNMP= <proc_prof1d_extract_pilot.lims>
##$AXLEFT= 0
##$AXNAME= <>
##$AXNUC= <1H>
##$AXRIGHT= 0
##$AXTYPE= 0
##$AXUNIT= <>
##$AZFE= 0.1
##$AZFW= 0.1
##$BCFW= 0
##$BC_mod= 0
##$BYTORDP= 0
##$COROFFS= 0
##$CY= 15
##$DATMOD= 1
##$DC= 0
##$DFILT= <>
##$DTYPP= 0
##$F1P= 0
##$F2P= 0
##$FCOR= 0.5
##$FTSIZE= 32768
##$FT_mod= 6
##$GAMMA= 0
##$GB= 0
##$INTBC= 1
##$INTSCL= 1
##$ISEN= 128
##$LB= 0
##$LEV0= 0
##$LPBIN= 0
##$MAXI= 10000
##$MC2= 0
##$MEAN= 0
##$ME_mod= 0
##$MI= 0
##$NCOEF= 0
##$NC_proc= -8
##$NLEV= 6
##$NOISF1= 0
##$NOISF2= 0
##$NSP= 0
##$NTH_PI= 0
##$NZP= 0
##$OFFSET= 14.98509
##$PC= 1
##$PHC0= 174.6881
##$PHC1= 0
##$PH_mod= 1
##$PKNL= yes
##$PPARMOD= 0
##$PPDIAG= 0
##$PPIPTYP= 0
##$PPMPNUM= 2147483647
##$PPRESOL= 1
##$PSCAL= 4
##$PSIGN= 0
##$PYNMP= <proc.py>
##$REVERSE= no
##$SF= 400.02
##$SI= 32768
##$SIGF1= 0
##$SIGF2= 0
##$SINO= 400
##$SIOLD= 32768
##$SPECTYP= <>
##$SREGLST= <1H.CDCl3>
##$SSB= 0
##$STSI= 32768
##$STSR= 0
##$SW_p= 8223.68421052631
##$SYMM= 0
##$S_DEV= 0
##$TDeff= 65536
##$TDoff= 0
##$TI= <>
##$TILT= no
##$TM1= 0
##$TM2= 0
##$TOPLEV= 0
##$USERP1= <user>
##$USERP2= <user>
##$USERP3= <user>
##$USERP4= <user>
##$USERP5= <user>
##$WDW= 1
##$XDIM= 32768
##$YMAX_p= 473787369
##$YMIN_p= -718640
##$CURPLOT= <Network HP LaserJet P1505>
##$CURPRIN= <$Network HP LaserJet P1505>
##$DFORMAT= <normdp>
##$LAYOUT= <+/1D_H.xwp>
##$LFORMAT= <normlp>
##$PFORMAT= <normpl>
##$SURQMSG= 1
$$ End of Bruker specific parameters
$$ ---------------------------------
##NTUPLES= NMR SPECTRUM
##VAR_NAME=  FREQUENCY,     SPECTRUM/REAL,   SPECTRUM/IMAG
##SYMBOL=    X,             R,               I
##VAR_TYPE=  INDEPENDENT,   DEPENDENT,       DEPENDENT
##VAR_FORM=  AFFN,          ASDF,            ASDF
##VAR_DIM=   32768,         32768,           32768
##UNITS=     HZ,            ARBITRARY UNITS, ARBITRARY UNITS
##FACTOR=    0.250966925370066, 1,           1
##FIRST=     8223.43324360094, -101429,      160967
##LAST=      0,             90025,           -106772
##MIN=       0,             -718640,         0
##MAX=       8223.43324360094, 473787369,    0
$$ Real data points
##PAGE= N=1
##DATA TABLE= (X++(R..R)), XYDATA
$$ [...]
$$ plain form
19558 -176998 161902 -137988 -372521 -460748 118611 -103396 29642 -143034 -102643 57178
19547 -109673 -288143 100315 -80751 -179751 152317 -66636 -320255 -27664 270772 134469
19536 -128824 -128909 290476 -211375 -109790 -64691 188331 255646 -92688 -509364 -278958 -11849
19524 272708 -89956 182331 -16200 -228628 -55414 -19897 42988 -136953 -70192 11532 75814
19513 75814 248112 85319 -30000 427160 -56481 22548 -61355 -243410 -81549 -27645 56246
19501 115854 49015 222525 -212134 141537 92174 -387701 88662 -215665 -149382 15784
19490 -138121 -104158 -329644 265522 -47900 -64860 -328426 64511 79161 28913 -158531 86296
19478 -314608 148198 -216722 -30689 -72597 31836 -32210 56441 -140680 -9716 -20336 27788
$$ packed form
19558a76998A61902a37988k34533q8227A18611a03396B9642a43034M0391E7178
19547a09673j78470A00315h0751r9000A52317f6636k53619b7664B70772A34469
19536a28824q5B90476b11375J01585M5099A88331O7315i2688m16676K30406a1849
19524B72708h9956A82331a6200k12428e5414a9897D2988a36953O6761A1532O4282
19513G5814J72298H5319c0000D27160e6481B2548f1355j82055h1549b7645E6246
19501A15854D9015J73510b12134A41537m9363c87701H8662b15665O6283A5784
19490a38121L3963k25486B65522d7900j6960k63566F4511J4650B8913a58531H6296
19478c14608A48198b16722c0689m1908C1836c2210E6441a40680i716j0620B7788
$$ plain form
19466 3950 222659 -302742 133180 185611 -152826 99924 -102119 -54555 400364 -400926
19455 166685 36319 57284 -120143 10879 -79700 -19714 -88126 -187943 -10839 -84038 67113
19443 -37816 109757 85112 -91113 327618 -7668 -388997 62430 -218126 -335866 43903 -16870
19431 -117248 -47155 23748 80440 139250 -14628 9526 191481 133209 70866 -65638 -334353
19420 -334353 -79358 -9186 -69389 -307435 48554 82294 11092 -80553 -134198 -273772 -207440
19409 -207440 -45105 198993 -177782 -143579 -356618 -153 -93099 -43651 -44331 -10688 -20524 -116366
19397 -116366 -342502 -356264 -342110 -250213 -217202 -337149 159258 57153 -105865 -171317 69066
19385 -332581 101536 -260904 272355 -197538 -163238 66400 -193997 -232100 -248065 -93723
$$ packed form
19466C950K18709c02742A33180N2431a52826I9924a02119M7564D00364d00926
19455A66685C6319K0965a20143A0879g9700a9714o8412r9817a0839p3199F7113
19443c7816A09757k4645i1113C27618g668l81329F2430b18126j17740D3903a6870
19431a17248d7155B3748N6692N8810a4628I526J81955n8272o2343f5638k68715
19420c34353g9358i186o0203k38046D8554L3740A1092h0553n3645j39574O6332
19409b07440d5105A98993a77782L4203k13039a53r2946d3651o80a0688r836r5842
19397a16366k26136j3762J4154R1897L3011j19947A59258E7153a05865o5452F9066
19385c32581A01536b60904B72355a97538L4300F6400a93997l8103j5965i3723
$$ plain form
19374 -46154 -82027 131092 30028 -4495 12297 -110813 -173678 118033 -137248 -224886 -130493
19363 -130493 100023 -150449 36091 -34632 -100822 -23220 -208814 11377 108188 -149502 -70274
19351 42149 -91295 -63669 -46809 -115932 -115914 -102433 -81714 179371 -46536 -74829 -139866 -295621
19339 -295621 -300484 -252785 -319394 112187 -134119 355266 -291800 -416139 -136365 9258 -142219
19327 1688 -117035 75302 165171 -89317 29593 83718 -228487 39908 105640 -230751 -520779
19316 -520779 -65103 -10351 64800 -185422 -121771 293698 77865 -8136 21128 171299 -95449
19304 -12722 45679 58039 271393 164888 113073 54887 -206054 -28780 1354 53122 -112347
19292 -52678 44952 101778 222472 -355810 -4352 -191069 -179299 -65464 -282816 -190419 33550
$$ packed form
19374d6154l5873A31092C0028d495A2297a10813o2865A18033a37248q7638R4393
19363a30493A00023a50449C6091c4632o6190b3220j85594A1377R6811a49502g0274
19351D2149i1295K7626J6860o9123J8J3481K0719A79371d6536k8293o5037j55755
19339b95621m863M7699o6609A12187a34119C55266b91800j24339a36365I258a42219
19327A688a17035G5302Q9869h9317B9593N4125b28487C9908O5732b30751k90028
19316e20779f5103a0351F4800a85422O3651B93698G7865h136B1128J50171i5449
19304a2722D5679J2360K13354j06505n1815E4887b06054b8780A354N1768a12347
19292e2678D4952N6826J20694c55810d352j86717J1770f5464k17352R2397C3550
$$ plain form
19280 -124398 104182 -305955 -291008 -211618 -198876 11173 171749 -445977 278478 159420
19270 159420 56430 124064 203405 -188214 -238475 -52349 60379 -30653 -53616 -339296 -417100
19259 -417100 -403405 240695 -134007 -226352 131873 95141 -46598 -257227 359404 53135
19248 -75398 -41339 -226157 -293550 264145 4418 -59860 -12520 -74606 -104062 -158043 -59919
19236 -66958 -371731 -31637 125020 -29411 -68042 87928 176578 43110 -100828 4856 -94073
19224 9459 82228 46837 -119856 -207226 177475 -248052 -89664 -67109 -60817 -113775 -65977
19213 -65977 -270251 -156380 49068 -70284 -187292 167545 58952 142924 -7066 -130208 129980
19201 -19430 229383 90323 -185187 150795 -130686 -52069 -114951 156497 -206242 -15049
$$ packed form
19280a24398A04182c05955J4947P9390J2742A1173J60576d45977B78478j19058
19270A59420E6430O7634P9341a88214n0261e2349F0379c0653k2963k85680p7804
19259d17100J3695B40695a34007r2345A31873l6732d6598k10629C59404E3135
19248g5398L4059j84818o7393B64145D418e9860a2520o2086k9456n3981e9919
19236f6958l04773c1637A25020b9411l8631H7928Q8650D3110a00828D856i4073
19224I459P2769l5391a19856q7370A77475b48052h9664K2555O292n2958M7798
19213f5977k04274J13871D9068g0284j17008A67545E8952Q3972g066j23142A29980
19201a9430B29383I0323a85187A50795a30686e2069o2882A56497b06242a5049
$$ plain form
19190 177630 -143602 -149898 121215 -77866 -515388 -71083 -300375 117752 43577 -225585
19179 -288410 150147 -300949 -79425 -164351 -294505 -40106 36651 -410261 37774 -37917 122673
19167 -179894 -48688 -24256 -49090 46016 253543 -145806 258594 -61841 -294683 -168215
19157 -168215 -5293 -203976 300425 84323 -317334 -108565 -160393 -162817 132682 263296 14482
19145 52790 -87438 -139339 -141601 33640 -20699 -4 -279005 -164536 -51363 124265 39754 151452
19133 151452 -153153 -291681 -184550 43925 118751 -9698 164411 -37241 -41101 -108375 -230204
19122 -230204 255413 22765 -203509 -302865 -220331 -90328 -10665 -52143 -238005 119494 -91417
19110 -168765 7823 -144880 226201 -49982 -82388 -331944 61148 -137112 -150252 -294728 223723
$$ packed form
19190A77630a43602o296A21215g7866m37522g1083k29292A17752D3577b25585
19179b88410A50147c00949g9425q4926j30154d0106C6651d10261C7774c7917A22673
19167a79894d8688b4256k4834D6016K07527a45806B58594f1841k32842J26468
19157a68215e293j98683C00425H4323c17334a08565n1828k424A32682J30614A4482
19145E2790h7438n1901k262C3640b0699dk79001J14469e1363A24265C9754J11698
19133A51452a53153j38528J07131D3925P4826i698A64411c7241l860o7274j21829
19122b30204B55413B2765b03509r9356Q2534i0328a0665m1478j85862A19494i1417
19110a68765G823a44880B26201d9982l2406k49556F1148a37112j3140j44476B23723
$$ plain form
19098 79678 175957 -88834 202166 189981 -35865 -232613 32558 -234979 -346736 -65923 -50345
19087 -50345 119202 129661 -129086 51659 -50746 -102030 145476 -88863 -90414 -85420 -194109
19076 -194109 -182141 -192225 -231725 12661 -202588 15812 -287084 -18678 -109587 173994 -318428
19064 259881 -29675 -12129 28342 -50066 -156398 -238497 134874 -97757 75330 81516 208368
19053 208368 -78583 175076 97752 -397751 54268 226988 132862 5627 -103634 -226426 -60810
19041 163774 -15751 -229119 304245 -57774 27983 -263948 153038 -102267 242657 -124575
19030 -18637 349188 158601 51233 126669 109159 -157338 -102869 -23541 116960 207140 316726
19019 316726 -85535 224566 -230472 166637 12174 -67169 -189685 -122377 -196189 -456223
$$ packed form
19098G9678R6279h8834B02166j2185c5865j96748C2558b34979j11757f5923J5578
19087e0345A19202J0459a29086E1659e0746n1284A45476h8863j551M994j08689
19076a94109J1968j0084l9500A2661b02588A5812b87084a8678r0909A73994c18428
19064B59881b9675a2129B8342e0066j06332q2099A34874i7757G5330O186J26852
19053B08368g8583A75076p7324c97751E4268J72720r4126E627a03634j22792f0810
19041A63774a5751k13368C04245e7774B7983b63948A53038a02267B42657a24575
19030a8637C49188A58601E1233P5436j7510a57338N4469b3541A16960R0180J09586
19019C16726h5535B24566b30472A66637A2174f7169j22516O7308p3812k60034
$$ plain form
19009 -456223 250704 124602 81444 95431 -196118 65210 -51581 24658 123504 215364 -440727
18997 15024 14328 -230452 -97418 -188763 131678 7851 175326 87383 -54423 -372186 232175
18985 15271 -125667 -63464 -390906 69252 -122387 -131658 -75085 -42880 83548 -2087 -8423 -99456
18973 -99456 -97497 -200053 -79953 -84437 -167748 75085 -326239 -140997 -213554 235264 -219009
18961 -146557 -156260 -86170 130167 -269155 -12803 -132931 26321 -112978 -183778 -194384 130728
18949 -187240 -225565 249556 -136879 -346541 -127703 20045 205092 9711 177744 246671
18939 246671 -9559 -369758 -174866 12239 -29241 -45409 -124076 140180 -218104 -179958 9364
18927 14185 160536 20592 -49182 -87860 97753 -166953 57008 100343 -272991 41837 -337738
$$ packed form
19009d56223B50704A24602m3158J3987a96118F5210e1581B4658R8846R1860d40727
18997A5024o96b30452i7418r1345A31678G851J67475H7383e4423l17763B32175
18985A5271a25667O2203l27442F9252a22387r271N6573L2205H3548b087o336r1033
18973i9456J959j02556g9953m484q3311G5085c26239a40997p2557B35264b19009
18961a46557r703P0090A30167b69155a2803j20128B6321a12978p0800j0606A30728
18949a87240l8325B49556a36879k09662a27703B0045J85047I711J68033O8927
18939B46671i559l60199a74866A2239b9241j6168p8667A40180b18104L8146I364
18927A4185J46351B0592d9182l8678I7753a66953E7008M3335b72991D1837c37738
$$ plain form
18915 26437 -183002 -56524 -165221 175238 -198880 -74923 315658 -209490 15330 99337
18905 99337 -222265 -97425 -394750 -132204 -59110 2142 136466 42088 151263 -177586 -183188
18894 -183188 74105 39411 -20858 379925 -28286 4279 -88649 -126596 123787 52833 234611
18883 234611 42910 -139433 -233375 91503 -234048 124301 135664 164005 -46464 -175144 -38824
18871 219683 167489 -70888 71867 -193761 -27093 -43883 55837 -43720 -154885 -2145 -373792
18860 -373792 139506 -228132 64874 -222170 -100874 -347234 -158107 -39547 -149080 29055
18849 119213 30067 76620 -297791 -188229 -298249 -55031 162222 -10001 -59488 149573
18838 27348 -438888 -30559 -104196 -89324 -68882 -72677 6553 105347 -8816 -59032 -121462 -1451
$$ packed form
18915B6437a83002e6524j08697A75238a98880g4923C15658b09490A5330Q4007
18905I9337b22265i7425k97325a32204e9110B142J34324D2088J09175a77586n602
18894a83188G4105l4694b0858C79925b8286D279h8649l7947A23787E2833J81778
18883B34611D2910a39433r3942I1503b34048A24301J1363K8341d6464j28680c8824
18871B19683n2194g0888G1867a93761b7093j6790E5837d3720j11165b145l71647
18860c73792A39506b28132F4874b22170a00874k46360a58107c9547j09533B9055
18849A19213C0067M6553b97791J09562j10020e5031A62222a0001m9487A49573
18838B7348d38888c0559p3637J4872K0442l795F553R8794h816n0216o2430a451
$$ plain form
18825 -81947 189219 -87829 265414 36743 -396394 -103445 -152970 229003 149661 -77507 47983
18813 -202970 8931 98327 380584 303666 -229779 -187823 62366 -21412 1891 10889 49845 -37261
18800 -155258 -334 -494806 171959 -78524 -134846 -226246 -19026 -90167 -224148 -8053 -66986
18789 -66986 -270616 53230 241436 -133297 -25635 -214942 62724 -312636 61953 117469 -207766
18777 83127 141788 -134110 -48330 -131479 29445 -99079 219471 180704 -242721 -3935 -306519
18766 -306519 -1674 43922 428835 -235394 -89931 118665 -261546 -115151 24097 1880 -62582
18754 -224646 -248320 40377 -72234 -19551 2884 219903 12032 -132590 -361318 114413 197936
18743 197936 -29566 17810 16372 327497 -252248 -200732 -185938 -283012 208228 80355 41405
$$ packed form
18825h1947A89219h7829B65414C6743c96394a03445m9525B29003p9342g7507D7983
18813b02970H931Q9396K82257p6918b29779M1956F2366b1412A891Q998L8956c7261
18800a55258c34m94472A71959g8524n6322r1400a9026p1141j33981h053n8933
18789f6986k03630E3230J88206a33297b5635j89307F2724c12636F1953N5516b07766
18777H3127N8661a34110d8330q3149B9445i9079B19471l8767b42721c935l02584
18766c06519a674D3922L84913b35394h9931A18665b61546a15151B4097A880f2582
18754b24646k3674D0377g2234a9551B884K17019A2032a32590k28728A14413Q3523
18743A97936b9566A7810j438L11125b52248N1516J4794r7074B08228H0355l8950
$$ plain form
18732 41405 86611 21678 122970 -46129 -122776 -170694 -24298 -79655 69717 -100761 -145877
18721 -145877 -82358 140487 28463 362759 -30503 -457290 173205 -58212 -38618 132584
18710 -309377 -50526 -199716 -86282 153536 113763 -314596 -62960 -35479 319876 4332 64818
18699 64818 83900 104799 58879 172100 128175 -259921 -144532 -84923 59553 -32231 1356
18687 -2606 -70065 -168802 233050 126851 -57058 96846 -44994 173938 -39589 592 -167388
18675 -90280 -329041 -64088 313485 -288499 -219291 -7613 -406797 -182842 -121955 35356 -26730
18663 -97250 -40088 -83624 111390 -20273 -213036 387464 61420 -92955 -249013 -116901 -47946
18651 -367986 -191688 66327 32053 -193156 103155 -12885 -37846 -146213 -47986 -167430
$$ packed form
18732D1405M5206B1678J01292d6129p6647m7918b4298n5357F9717a00761m5116
18721a45877O3519A40487B8463L34296c0503m26787A73205e8212J9594A32584
18710c09377e0526j49190h6282A53536l9773c14596f2960K7481C19876D332O0486
18699F4818J9082K0899m5920J13221m3925b59921J15389N9609E9553c2231A356
18687b606o7459r8737B33050j06199e7058I6846d4994A73938c9589E92a67388
18675i0280k38761f4088C13485b88499O9208g613l99184a82842O0887C5356b6730
18663i7250d0088m3536A11390b0273j92763C87464F1420i2955j56058a16901d7946
18651c67986J76298F6327C2053a93156A03155a2885k4961j08367d7986j19444
$$ plain form
18641 -167430 103506 7588 -23068 48624 -116753 -28552 -69650 -36562 189524 336470 42666
18629 71007 -133918 -75220 -355565 -203945 79633 -208957 131612 -311152 -247729 148715
18618 -145090 -224071 -288332 -279990 -187894 -16230 77569 227438 148772 -111252 46668 96353
18607 96353 -33972 -112272 -159531 -85451 -118902 -235694 -145557 -94479 -63642 -64654 -83639 -241351
18595 -241351 -11760 -273184 63976 -78950 58365 86491 -23273 -61573 -316656 -152189 -39863
18583 -24859 -111206 -66975 71380 74009 -233154 214526 -32281 43364 -70454 -395918 -249672
18572 -249672 126682 -33587 -166465 -56403 -122898 -49382 -95780 -201374 118250 -48571 -68883
18561 -68883 164532 24667 -6493 87741 -30528 -189918 -26254 -72583 -320997 -279209 39615
$$ packed form
18641a67430A03506G588b3068D8624a16753b8552m1098L3088A89524J46946D2666
18629G1007a33918N8698k80345J51620G9633b08957A31612c11152O3423A48715
18618a45090p8981o4261Q342R2096a6230G7569J49869p8666a11252D6668M9685
18607I6353c3972p8300m7259P4080l3451j16792R0137N1078L0837j012j8985j57712
18595b41351a1760k61424F3976g8950E8365K8126b3273l8300k55083a52189c9863
18583b4859q6347M4231G1380K629b33154B14526c2281D3364g0454l25464J46246
18572b49672A26682c3587j32878e6403o6495d9382m6398j05594A18250d8571k0312
18561f8883A64532B4667f493H7741c0528j59390b6254m6329k48414M1788C9615
$$ plain form
18549 -100595 -303634 143842 -325453 246005 -353040 -545503 49730 -203484 -47533 -84635
18539 -84635 -90606 212636 -357927 -66235 -93461 63505 -124405 -27590 -16671 225436 57821
18527 24283 -121649 79095 -71 -84403 -56848 -110984 114123 10905 -2636 -194931 -279878 -21801
18514 37566 -298353 274400 41985 -249704 -217916 -86432 -84958 126354 -208955 -328030 -268384
18503 -268384 121109 -356321 188509 -174233 -179855 175986 43529 -74430 -393642 -266322
18493 -266322 -352001 -120195 181298 -14720 -93954 -335906 -105944 -233239 178425 249794
18483 249794 131186 -213170 76998 -87790 154013 -211853 -17036 22410 -319068 41916
18472 76069 62258 -94293 -4587 -308203 15288 272388 -162979 260236 -89130 -218416 -132785
$$ packed form
18549a00595k03039A43842c25453B46005c53040j92463D9730b03484d7533l7102
18539h4635n971B12636c57927f6235k7226F3505a24405b7590J0919B25436E7821
18527B4283a21649G9095g1q4332K7555n4136A14123A0905b636j92295q4947b1801
18514C7566b98353B74400D1985b49704L1788h6432J474A26354b08955j19075N9646
18503b68384A21109c56321A88509a74233n622A75986D3529g4430l19212J27320
18493b66322q5679a20195A81298a4720p9234k41952a05944j27295A78425P1369
18483B49794j18608b13170G6998h7790A54013b11853a7036B2410c19068D1916
18472G6069j3811i4293d587l03616A5288K57100a62979B60236h9130j29286Q5631
$$ plain form
18461 -132785 -64678 -15323 235466 -87452 -92727 -68601 142081 279109 -342296 28831 292969
18450 292969 164623 -1096 -9240 263293 -226640 154155 6921 -142336 -290906 -151718 -95220
18439 -95220 -91209 -119959 -126163 284853 -220904 12561 196606 377763 -115367 -110740 -268099
18428 -268099 282739 -90467 100107 -264186 84618 -111746 -121719 48659 -330348 -99221 -241340
18417 -241340 -265513 339556 -67314 -5455 184536 255383 -163556 85036 -146241 99268 42963
18405 -264198 172149 -26871 -353428 42721 67920 -36899 -87126 -470679 71428 115253 -87982
18393 267266 -77339 -262487 236655 -56903 -247369 -7113 -180320 -277316 118010 -118286
18382 -249265 -25677 -181472 58324 4784 -125606 -5383 91579 254563 -180689 -365688 -16797
$$ packed form
18461a32785f4678a5323B35466h7452n275K4126A42081J37028c42296B8831K64138
18450B92969j28346a096q144B63293b26640A54155F921a42336j48570J39188N6498
18439i5220M011k8750o204B84853b20904A2561J84045J81157a15367M627j57359
18428b68099B82739i0467A00107b64186H4618a11746r973D8659c30348i9221j42119
18417b41340k4173C39556f7314e455A84536P0847a63556H5036a46241I9268D2963
18405b64198A72149b6871l26557D2721K5199c6899n0227l83553G1428M3825h7982
18393B67266g7339j85148B36655e6903j90466g113j73207r6996A18010a18286
18382b49265b5677j55795E8324D784a25606e383I1579J62984a80689j84999a6797
$$ plain form
18370 -259597 -108914 216643 -198971 -173538 -65921 -176185 263941 -371490 3656 41688
18360 41688 14021 233436 56101 -108298 120097 -90834 72945 -222256 3074 -65805 126224
18348 135413 298583 -144577 18223 -25205 -429004 45573 -92359 -334497 25267 212011
18338 212011 -115290 -27325 218418 -83439 187235 -82150 140903 115864 13750 -67073 -168028
18327 -168028 63533 189955 -213484 -9545 -129376 -21473 -276140 -175012 -179617 -23640 -397897
18316 -397897 82853 -171236 -443879 102469 273161 60057 403776 79932 -61910 -291938
18306 -291938 -152116 -4664 95374 -380627 -135628 -429036 -3405 -221309 -207758 -211228 -107125
18295 -107125 120888 -7663 -22391 367041 -69625 -130575 450073 267376 129439 -87050 -70710
$$ packed form
18370b59597a08914B16643a98971K5433f5921j10264B63941c71490C656L8032
18360D1688A4021K19415E6101a08298A20097i0834G2945b22256C074f5805A26224
18348A35413J63170a44577A8223b5205m03799D5573i2359k42138B5267J86744
18338B12011a15290b7325B18418h3439A87235h2150A40903k5039A3750f7073j00955
18327a68028F3533J26422b13484i545j19831b1473k54667J01128m605b3640l74257
18316c97897H2853a71236k72643A02469J70692F0057L43719G9932f1910k30028
18306b91938J39822d664I5374c80627a35628k93408c405k17904J3551l470J04103
18295a07125A20888g663j4728C67041f9625o0950D50073j82697A29439h7050J6340
$$ plain form
18284 -70710 -170242 -178291 -56709 35138 -53257 -237946 346108 246941 -79001 146652 -59902
18272 4899 -16693 -5493 310433 131394 -48343 69910 187514 -203278 203383 -110912 20601
18260 -292929 -14067 -27812 36354 72492 -99947 -54031 53676 36189 78030 155974 -131598
18248 -390210 -290569 325550 300795 97036 -219694 -100351 -128466 171136 7648 51314 63655
18237 63655 169495 95833 249521 32816 -128605 103572 85400 234960 242247 185628 -7945
18225 340781 171238 -274836 463260 -205968 -112716 -14346 -103851 84721 73651 -495715
18214 -137054 -94700 31832 -57981 -400756 -47814 -5507 81555 -442086 -73925 -297393 -193571
18203 -193571 -230908 -163751 -338343 -23084 -115931 -21480 -169364 342755 17837 -228134 -44913
$$ packed form
18284g0710r9532q049e6709C5138e3257j84689C46108r9167g9001A46652e9902
18272D899a6693e493C10433A31394d8343F9910J17604b03278B03383a10912B0601
18260b92929a4067j3745C6354L6138i9947M5916E3676j7487M1841P7944a31598
18248c90210R9641C25550k4755I7036b19694a00351k8115A71136G648M3666J2341
18237F3655J05840p3662J53688C2816a28605A03572j8172J49560P287n6619g945
18225C40781j69543b74836D63260b05968R3252a4346q9505H4721j1070d95715
18214a37054M2354C1832e7981l42775d7814e507H1555d42086g3925k23468J03822
18203a93571l7337O7157j74592b3084r2847b1480j47884C42755A7837b28134d4913
$$ plain form
18191 9844 -173581 -485263 -116816 199952 -185102 -161936 366195 -122750 -225782 -3138
18180 -140153 -228678 93521 -44111 -157742 -226571 -34665 163287 -119547 -282588 62766 -35154
18168 -272608 -24472 53192 -258069 -31168 66238 118349 -116229 20825 248956 198890 -40434
18156 421216 -23465 120957 -119246 -32047 175469 -152078 351488 -398373 115678 -199455
18145 -35939 -36684 -238167 -135299 -114813 -177412 -217327 -38499 -274053 173672 -451307 -151968
18133 5074 -305569 109867 -75239 6315 -172764 -66991 -93791 16269 16638 145103 -234282
18121 -5187 47687 -3604 -8965 -108320 -14402 -222635 188004 -113866 137743 -54881 -365812
18110 -365812 -193256 -214149 -423967 144006 255782 71722 -112311 -130785 -126520 -73288 -75158
$$ packed form
18191I844a73581l11682a16816A99952a85102K3166C66195a22750j03032c138
18180a40153q8525I3521d4111j13631o8829c4665A63287a19547j63041F2766c5154
18168b72608b4472E3192b58069c1168F6238N2111a16229B0825K28131n0066d0434
18156D21216b3465A20957a19246c2047A75469a52078C51488c98373A15678a99455
18145c5939p45k01483J02868K0486o2599l9915c8499k35554A73672d51307a51968
18133E074c05569A09867g5239F315a72764f6991k6800A6269L69J28465b34282
18121e187D7687c604n361r9355a4402k08233A88004a13866A37743e4881l10931
18110c65812J72556k0893k09818A44006J11776G1722a12311j8474M265N3232j870
$$ plain form
18099 -75158 -146192 16227 -220663 319740 -12883 -257024 -157947 229088 131922 257502 9630
18087 57005 -185572 -259883 -94727 264123 -272609 -33707 46757 -28660 166503 -124972 -38969
18075 32971 154977 -8666 200498 -126004 194752 134509 5437 -200299 3308 -246512 -118246
18063 86313 47308 40746 34958 -187443 236347 229513 2855 199246 -207666 -33399 -137221
18052 -137221 -270735 -32174 -145561 -330247 42972 -248319 -125982 -85414 -247003 -296725
18042 -296725 -114663 281892 108136 54001 177796 117680 -23108 -374147 -89014 -80075 -248946
18031 -248946 147027 230678 66501 150577 -273646 -54518 -34868 -97692 151060 -92853 -224949
18020 -224949 -127817 -383416 -429073 -136729 32858 -246071 234081 -138787 -67801 17510
$$ packed form
18099g5158p1034A6227b20663C19740a2883k44141R9077B29088r7166J25580I630
18087E7005a85572p4311i4727B64123b72609c3707D6757b8660A66503a24972c8969
18075C2971J22006h666B00498a26004A94752o0243E437b00299C308b46512a18246
18063H6313l9005o562n788a87443B36347o834B855J96391b07666c3399j03822
18052a37221j33514c2174j13387j84686D2972b48319J22337M0568j61589m9722
18042b96725a14663B81892A08136E4001J23795o0116b3108l51039h9014Q939j68871
18031b48946A47027Q3651F6501Q4076b73646e4518J9650o2824A51060i2853j32096
18020b24949R7132k55599m5657a36729C2858b46071B34081a38787f7801A7510
$$ plain form
18009 -20248 216064 -20636 48580 64187 -239584 -97449 -241553 -366387 -324648 -185842 -528223
17998 -528223 -245049 5761 -483440 52712 48925 -68950 12838 22092 -169720 -200117 23231
17986 77057 -170897 -193345 23896 -151430 98814 -121384 32046 -42562 -163981 -39081 -27690
17975 -27690 41523 110080 21599 204098 -11272 1021 31209 178214 99575 -192436 316006
17963 -84755 -11525 215380 89795 28409 22366 -204558 326177 -41038 -313672 160732 96150
17952 96150 -99522 24075 -25395 213147 -96236 -193137 192610 -43390 138049 134054 -11627
17940 45539 144833 -218106 -196804 100370 -138019 -70712 53439 -75063 -25624 -130267 102298
17928 -112163 131516 -202577 109517 89314 107506 127196 -163897 -72921 47897 -387567
$$ packed form
18009b0248B16064b0636D8580J5607b39584i7449j44104j24834M1739J38806l42381
17998e28223b45049E761d83440E2712l787f8950A2838R254a69720l0397B3231
17986G7057a70897k2448B3896a51430I8814a21384C2046d2562j21419c9081J1391
17975b7690D1523O8557B1599J82499a1272A021L0188J47005p8639a92436C16006
17963h4755a1525B15380H9795B8409o043b04558C26177d1038k72634A60732o4582
17952I6150i9522B4075b5395B13147i6236r6901A92610d3390A38049l995a1627
17940D5539R9294b18106K1302A00370a38019O7307E3439g5063b5624j04643A02298
17928a12163A31516b02577A09517k0203J8192J9690a63897g2921D7897c87567
$$ plain form
17917 17179 49879 -140910 65640 253411 -126054 -204378 -52365 49339 -189173 112575 79871
17906 79871 181532 -132133 -152086 -198403 74434 -314423 -65362 92055 185935 22608 -199897
17894 202836 99922 -43338 -219259 169416 44851 -159977 -38360 -553068 48487 -201495
17883 176232 76457 -22642 163050 -48202 341686 -231337 -312960 130670 12988 -60066 23168
17871 154719 173676 153261 86985 354880 212017 300890 -270099 -20873 -205564 -39346 230631
17859 94049 3712 252841 -139597 -69440 -32959 3193 -84429 -216305 -106725 -22344 -94835
17848 -94835 -55218 247164 -74800 222530 88629 -337175 155927 -19163 -205796 -253282 -138639
17837 -138639 42420 377301 -244247 376230 -132480 85948 -78289 39597 -84265 79283 -57370
$$ packed form
17917A7179L2700a40910F5640J87771a26054p8324e2365D9339a89173A12575l2704
17906G9871J01661a32133j9953m6317G4434c14423f5362I2055R3880B2608a99897
17894B02836I9922d3338j75921A69416D4851a59977c8360n14708D8487b01495
17883A76232G6457b2642A63050d8202C41686b31337q1623A30670A2988f0066B3168
17871A54719J8957k0415o6276K67895j42863Q8873b70099b0873j84691c9346B30631
17859I4049C712K49129a39597f9440c2959C193h4429j31876a06725b2344p2491
17848i4835L9617B47164g4800B22530H8629c37175A55927a9163j86633m7486J14643
17837a38639D2420L34881b44247C76230a32480H5948g8289C9597h4265G9283e7370
$$ plain form
17825 -231454 367764 -71098 -280967 -105567 -112092 48440 -200891 19146 269366 125181
17814 48821 101977 -288580 -123988 -171342 -155240 -138761 23243 48328 -320474 -170798 -37258
17802 29456 -98690 -103517 -320420 -69987 33020 -177480 -11670 2715 214005 207353 200456 83080
17789 -18754 -85295 -121477 37296 254036 159506 20193 15834 -72461 -38732 -18460 40342 -70126
17776 -160486 -148371 35655 86959 -29662 285765 74454 12802 1345 134210 327047 61217
17764 181002 278979 58625 -60327 20511 -230238 -34406 -407873 5910 56216 -238022 -58053
17752 -91016 124096 227498 -29201 34554 268447 89161 57233 -152376 351388 -331927
17741 98563 -41104 176417 -65915 -261837 11867 -175578 -229352 305 195545 -99343 132376
$$ packed form
17825b31454C67764g1098k09869a05567o525D8440b00891A9146K50220A25181
17814D8821N3156b88580a23988m7354J6102J6479B3243K5085c20474J49676c7258
17802B9456i8690m827k16903f9987C3020a77480a1670B715K11290o652o897H3080
17789a8754o6541l6182C7296K16740r4530B0193m359g2461L3729a8460D0342g0126
17776a60486J2115C5655N1304b9662B85765G4454A2802A345J32865J92837F1217
17764A81002R7977E8625f0327B0511b30238c4406l73467E910N0306b38022e8053
17752i1016A24096J03402b9201C4554K33893H9161l1928a52376C51388c31927
17741I8563d1104A76417f5915j95922A1867a75578n3774C05J95240i9343A32376
$$ plain form
17729 -98376 -246133 264266 -181714 -29587 -20025 376671 -98269 108070 -280795 -164030
17719 -164030 48859 145821 -317336 25976 196829 -297108 4084 266813 -73662 116582 -68341
17707 -187019 -126143 -12881 -287828 -75347 50032 81833 76058 -124861 -340821 106299 -50770
17695 -200423 81973 94306 256059 -12218 177577 -82463 -130282 -125944 53928 -171026 306762
17683 191314 167052 49109 231819 124120 -145050 -133806 -104328 -48935 53201 -143447 -218023
17672 -218023 -146586 -80771 -118249 -20340 -331978 201318 -42185 -254411 146436 -151920
17661 91100 374559 226720 394967 -109922 181946 359175 99858 -55555 -44068 66907
17650 -88666 123648 -185885 -13580 -210856 -12680 -51486 136582 -28498 -320648 -139245
$$ packed form
17729i8376j47757B64266a81714b9587R562C76671i8269A08070b80795J16765
17719a64030D8859R6962c17336B5976J70853b97108D084K62729g3662A16582f8341
17707a87019O0876a2881k74947g5347E0032L1801n775a24861k15960A06299e0770
17695b00423H1973J2333J61753a2218A77577h2463m7819M338E3928a71026C06762
17683A91314k4262D9109J82710j07699a45050J1244K9478d8935E3201a43447p4576
17672b18023P1437O5815l7478b0340l11638B01318d2185k12226A46436a51920
17661I1100K83459j47839J68247a09922A81946J77229I9858e5555J1487F6907
17650h8666A23648a85885a3580j97276a2680l8806A36582b8498k92150a39245
$$ plain form
17639 -205995 -85984 -72483 -66987 -253443 -197932 -139044 -135533 -197705 196485 132436 206695
17628 206695 8492 -13827 150992 86152 351616 -17756 -389247 -15920 103544 -93934 -370519
17617 -370519 215057 5009 80130 175133 -4920 190895 -91716 4520 -7214 -168601 -161505 -29715
17604 8706 202052 24252 -34423 176647 31253 -124091 203898 24828 -32324 217526 -123119
17592 -9873 26842 130910 -4999 -32109 -58206 249289 -39847 58837 113320 -11219 -301204
17581 -301204 -113029 -203851 -69036 -265702 -1500 -2865 3466 458119 -3754 -87848 244433
17569 41065 169247 166774 -309082 160966 -45610 -21087 9871 191333 28583 -64705 -240950
17558 -240950 120322 -139224 125168 -409629 -24773 -106426 129908 337531 -314902 -172721
$$ packed form
17639b05995h5984J3501N496j86456N5511N8888L511o2172A96485o4049P4259
17628B06695H492a3827A50992o4840K65464a7756l71491a5920A03544i3934k76585
17617c70519B15057E009P5121R5003d920A90895i1716D520g214j61387P096b9715
17604H706J93346B4252c4423A76647C1253a24091B03898B4828c2324B17526a23119
17592i873B6842J04068d999k7110k6097B49289c9847E8837N4483a1219k89985
17581c01204a13029r0822f9036j96666a500j365C466M54653c754q4094B44433
17569D1065J28182k473c09082A60966d5610b1087I871J81462B8583f4705j76245
17558b40950A20322a39224A25168d09629b4773q1653A29908K07623c14902J42181
$$ plain form
17548 -172721 29304 -103331 -32772 177530 -117311 161349 -13128 -55921 -133491 128429
17537 274398 -106536 15465 -128535 172440 241155 -126607 58527 87179 152204 20017 378621
17526 378621 -44153 25502 -77163 166743 181348 19355 118513 -19948 302884 111533 254126
17515 254126 -268212 -23590 -56348 79628 -215174 -248452 150026 195383 198610 358739 160965
17503 -57192 -190493 109561 212363 -389630 311552 210227 592630 206389 310510 382244
17493 382244 222870 98819 115332 225574 -15459 193378 -157432 -129739 231308 124474
17483 124474 -106873 365369 293905 123016 92769 13459 -76762 263165 130546 292158
17473 292158 -52476 150035 131826 79794 113650 1302 -136772 31126 -97306 362975 98371
$$ packed form
17548a72721B9304a03331c2772A77530a17311A61349a3128m2793p7570A28429
17537B74398a06536A5465a28535A72440O8715a26607E8527K8652O5025B0017L58604
17526C78621d4153B5502g7163A66743J4605A9355R9158a9948C02884A11533J42593
17515B54126b68212b3590l2758G9628b15174l3278A50026M5357L227J60129A60965
17503e7192j33301A09561J02802c89630C11552j01325L82403B06389J04121P1734
17493C82244j59374I8819J6513J10242a5459A93378a57432K7693B31308j06834
17483A24474a06873C65369p1464A23016l0247A3459g6762B63165A30546J61612
17473B92158e2476A50035j8209n2032L3856A302a36772C1126i7306C62975I8371
$$ plain form
17461 -9103 -56501 319976 334547 334963 -81274 1816 423707 183776 325641 136165 360607
17450 360607 252295 525056 617694 68553 354925 133973 209267 87290 438516 324024
17440 324024 210621 400672 52317 420707 376251 41855 295098 408353 280108 146080
17430 146080 190182 216096 71825 86617 148853 297600 250787 448961 70532 413704 466400
17419 466400 238860 303751 143383 247682 133412 36081 286987 130519 304948 20981
17408 304801 589561 110858 90145 239047 18065 227483 224107 -28207 -355745 -53965 52068
17396 -84668 193424 -37488 344942 103219 -342511 71105 111240 217144 38829 -155276
17385 -98417 76053 53079 79846 -41596 192590 28803 -893 128627 200652 250959 68020 157592
$$ packed form
17461i103m7398C19976J4571M16h1274A816M21891A83776J41865A36165K24442
17450C60607j08312K72761R2638F8553K86372A33973P5294H7290L51226j14492
17440C24024j13403J90051E2317L68390m4456D1855K53243J13255j28245j34028
17430A46080M4102K5914G1825J4792O2236J48747m6813J98174G0532L43172N2696
17419D66400k27540O4891A43383J04299j14270C6081K50906A30519J74429B0981
17408C04801K84760A10858k0713J48902A8065K09418l376b8207l27538e3965E2068
17396h4668A93424c7488C44942A03219c42511G1105M0135J05904C8829a55276
17385i8417G6053k2974K6767d1596A92590B8803h93A28627P2025N0307F8020Q9572
$$ plain form
17373 157592 90257 467348 340985 384793 48609 143704 -281747 174496 200706 -105199
17362 321381 130717 -65660 -91464 179095 -66783 -64882 -261403 -101714 139777 21377 -206935
17350 48316 138913 122698 207841 -361594 417533 -99947 310737 185650 -99586 213303 106064
17338 163347 -4538 53117 -231774 -11705 81979 359793 126324 238539 66344 -158593 377760
17326 158716 243228 53965 109798 -142164 213673 -20355 333452 198531 28509 165901
17316 165901 200095 -126980 172976 -16292 202602 124800 -19685 -83891 -125459 -157960 320169
17304 70040 -213911 16606 -235396 211614 -196541 174685 251019 52963 291906 109742
17293 131837 777500 401231 -64845 98690 -119538 162800 372460 112650 136686 -301619
$$ packed form
17373A57592o7335L77091j26363M3808D8609R5095b81747A74496K6210a05199
17362C21381A30717f5660k5804A79095f6783J901j96521a01714A39777B1377b06935
17350D8316R0597j6215Q5143c61594D17533i9947C10737j25087i9586B13303A06064
17338A63347d538E3117b31774a1705H1979K77814A26324J12215F6344a58593C77760
17326A58716Q4512E3965N5833a42164B13673b0355C33452j34921B8509J37392
17316A65901L4194a26980A72976a6292B02602p7802a9685o4206m1568l2501C20169
17304G0040b13911A6606b35396B11614a96541A74685P6334E2963K38943A09742
17293A31837O45663l76269f4845I8690a19538A62800K09660A12650K4036c01619
$$ plain form
17282 84702 461409 -105043 -54913 275731 168786 169554 -60199 78173 62082 67302 188589
17271 188589 -148021 212215 276334 132492 226247 124967 30298 285272 123079 188110
17261 188110 117729 260114 -178261 310186 136857 33792 11721 146977 174925 312171
17251 312171 355617 453843 183569 101788 30647 106867 282731 93938 419958 -48190 236434
17239 55837 297018 222123 383296 240772 -13968 262223 210028 -90170 475972 -129992
17228 160594 333812 126678 273303 328867 -49688 230323 470757 412439 153789 178604
17218 178604 -30301 105456 -163900 -168830 -31863 350121 -60601 120071 -70549 195423 82783
17206 15519 -24629 162260 -170808 224964 249519 270007 185054 269381 192987 302275 205693
$$ packed form
17282H4702L76707a05043N0130B75731j06945P68f0199G8173j6091N220J21287
17271A88589a48021B12215O4119A32492R3755j01280C0298K54974A23079O5031
17261A88110p0381J42385a78261C10186A36857C3792A1721J35256K7948J37246
17251C12171M3446R8226A83569q1781C0647P6220J75864I3938L26020d8190B36434
17239E5837K41181p4895J61173j42524a3968B62223n2195i0170D75972a29992
17228A60594J73218A26678J46625N5564d9688B30323K40434n8318A53789K4815
17218A78604c0301A05456a63900m930c1863C50121f0601A20071g0549A95423H2783
17206A5519b4629A62260a70808B24964K4555K0488q4953Q4327p6394J09288r6582
$$ plain form
17195 205693 309625 599891 229501 93474 197194 281318 330375 502810 116833 189708
17185 189708 178330 146346 365954 352688 469262 115428 172612 358229 292374 6849 219773
17174 219773 401092 223119 263870 212438 306759 -65703 115599 -57122 84718 67895 432269
17163 432269 220422 231569 210023 291457 122976 -102787 133499 197753 113108 292617
17153 292617 -78742 197105 474473 244439 273730 125612 382199 135862 89171 469150
17143 469150 266980 515669 -6713 113483 146992 178039 390355 566870 51854 106511 -193668
17131 134091 378794 188773 262610 246529 294351 273342 48900 381636 717474 489548
17121 489548 -33493 99321 -147349 25001 315800 282415 210294 396644 565969 283005
$$ packed form
17195B05693J03932K90266B29501I3474J03720Q4124M9057J72435A16833P2875
17185A89708j1378l1984K19608j3266J16574A15428N7184J85617o5855F849K12924
17174B19773J81319j77973M0751n1432R4321f5703A15599e7122H4718j6823L64374
17163D32269k11847J1147k1546Q1434A22976a02787A33499O4254q4645J79509
17153B92617g8742A97105K77368k30034K9291A25612K56587A35862m6691L79979
17143D69150k02170K48689f713A13483L3509L1047K12316J76515E1854N4657a93668
17131A34091K44703A88773P3837j6081M7822k1009D8900L32736L35838k27926
17121D89548c3493I9321a47349B5001K90799l3385p2121J86350J69325k82964
$$ plain form
17111 283005 331187 151200 462641 381368 419957 266889 -41260 37885 221684 452835
17101 452835 572541 489422 373775 -164214 542247 83381 510337 536217 182302 470978
17091 470978 204068 328435 404950 571074 586558 430344 242262 459224 520641 416481
17081 416481 312430 423325 238823 565259 348152 151903 285453 552570 188522 480032
17071 480032 266460 439174 393205 573299 416290 486766 323084 456324 480653 191021
17060 577878 458224 448296 416760 348816 224042 225892 314019 483236 268171 301472 529603
17049 529603 108011 335213 415049 385598 426036 539714 265842 411301 356498 630428
17039 630428 599349 441056 565009 465190 187533 250886 371202 687258 159257 750529
$$ packed form
17111B83005M8182A51200L11441q1273L8589j53068d1260C7885J83799K31151
17101D52835J19706q3119j15647a64214E42247H3381M26956K5880A82302K88676
17091D70978B04068J24367P6515J66124J5484j56214j88082K16962O1417j04160
17081D16481j04051J10895j84502L26436k17107A51903J33550K67117A88522K91510
17071D80032k13572J72714m5969J80094j57009P0476j63682J33240K4329A91021
17060E77878j19654r928l1536o7944j24774J850Q8127J69217k15065L3301K28131
17049E29603A08011K27202P9836k9451M0438J13678B65842J45459n4803K73930
17039F30428l1079j58293J23953r9819A87533O3353J20316L16056A59257N91272
$$ plain form
17029 750529 859806 360925 401615 257679 365674 394616 655643 325334 860804 391377
17018 635283 727684 451956 617158 420462 519845 561498 508042 229790 712245 326026
17007 709014 674326 932292 248139 580346 603708 566622 929898 686735 513689 562941
16997 562941 500449 864473 516389 535401 1132036 688313 473814 773719 430486 620553
16987 620553 770576 505401 696860 800482 862614 679100 539667 616245 627307 322662
16977 322662 472072 464930 931686 740947 711471 504611 548411 594083 661555 595903 649783
16966 649783 967404 581527 868375 425315 728171 758015 865478 1034975 806253 830036
16956 830036 697065 792287 1141237 910496 1062599 1013990 518129 1053082 1023961 758134
$$ packed form
17029G50529J09277C60925M0690j43936J07995K8942K61027C25334N35470C91377
17018F35283R2401k75728J65202j96696R9383M1653n3456B29790M82455C26026
17007G09014l4688K57966B48139L32207K3362l7086L63276k43163j73046M9252
16997E62941o2492L64024l48084J9012N96635m43723k14499K99905l43233J90067
16987F20553J50023k65175J91459J03622O2132j83514j39433P6578J1062l04645
16977C22662J49410p142M66756j90739k9476k06860M3800M5672O7472o5652N3880
16966F49783L17621l85877K86848D25315L02856K9844J07463J69497k28722K3783
16956H30036j32971R5222L48950k30741J52103m8609m95861N34953k9121k65827
$$ plain form
16946 758134 979369 1146833 1002485 992977 877242 1339983 1105342 726823 1283227 800786
16936 800786 1152904 808430 819910 939693 1327026 964138 1095930 762825 997577 1294490
16926 1294490 1147789 1126771 1374607 1040651 1127767 1316347 1133363 1293697 1262726 1319172
16916 1319172 941755 1578334 1160430 1344509 1590931 1303954 1209467 1270371 1456972 1018339
16906 1018339 1146529 1271940 1635276 1376825 1391141 1448889 1658907 1359532 1672866 1387546
16896 1387546 1577746 1518726 1631872 1553066 1861651 1460695 1666215 1561506 1667268 1903406
16886 1903406 1756789 1662300 1774635 1752701 1837551 1657718 1442865 1779878 1920907 1982657
16876 1982657 1481962 2027387 1832140 2082771 1890508 1681546 1906718 2075509 2156970 2199411
$$ packed form
16946G58134K21235J67464j44348r508j15735M62741k34641l78519N56404m82441
16936H00786L52118l44474J1480J19783L87333l62888J31792l33105K34752K96913
16926A294490j46701k1018K47836l33956Q7116J88580j82984J60334l0971N6446
16916A319172l77417O36579m17904J84079K46422k86977r4487O0904J86601m38633
16906A018339J28190J25411L63336k58451J4316N7748K10018k99375L13334k85320
16896A387546J90200n9020J13146p8806L08585m00956K05520j04709J05762K36138
16886A903406j46617r4489J12335k1934Q4850j79833k14853L37013J41029O1750
16876A982657n00695N45425j95247K50631j92263k08962K25172J68791Q1461M2441
$$ plain form
16866 2199411 2046695 2389892 2262362 2015610 2361260 2272557 2301379 2175176 2195940 2403113
16856 2403113 2325998 2731427 2427112 2651195 2425608 2777137 2614180 2668665 2622678 2841785
16846 2841785 2786226 2898740 2782337 2898066 2876629 2571639 3268081 3137318 3374676 3471224
16836 3471224 3148425 3508342 3137501 3542150 3350157 3179210 3732056 3924021 3683297
16827 3683297 3995767 3847678 4105378 4192312 4096684 4321872 4208167 4202982 4453490 4698519
16817 4698519 4761318 4620302 4602400 5190029 4718531 5303472 5336925 4976613 5240189 5441311
16807 5441311 5749366 5656242 5774779 5925301 6286677 5923461 6590362 6728396 6728604 6895901
16797 6895901 6949172 7118513 7083824 7530618 7707584 8020091 8061261 8383869 8384577 8641955
$$ packed form
16866B199411j52716L43197j27530k46752L45650q8703K8822j26203K0764K07173
16856B403113p7115M05429l04315K24083k25587L51529j62957N4485m5987K19107
16846B841785n5559J12514j16403J15729k1437l04990O96442j30763K37358R6548
16836C471224l22799L59917l70841M04649j91993j70947N52846J91965k40724
16827C683297L12470j48089K57700Q6934r5628K25188j13705n185K50508K45029
16817D698519O2799j41016j7902N87629m71498N84941L3453l60312K63576K01122
16807E441311L08055r3124J18537J50522L61376l63216O66901J38034K08J67297
16797F895901N3271J69341l4689M46794J76966L12507M1170L22608P08K57378
$$ plain form
16787 8641955 9117831 8982990 9162728 9783769 10001570 10305211 10769129 10804160 11170147 11594931
16777 11594931 12106290 12116093 12504686 13026278 13380891 13776953 14160359 14733591 15338844 15629363
16767 15629363 16320447 17326635 17480923 18177068 18908136 19592209 20192081 21264365 22256774
16758 22256774 22981220 23915935 24737564 26101384 27170666 28304578 29718932 31260441
16750 31260441 32572117 33843359 35856670 37297374 39889980 41539979 43993377 46508971
16742 46508971 48815695 52004964 54889850 58074631 61466218 65257945 69323883 73548040
16734 73548040 79001822 83549232 89311725 94984190 101565166 107937213 115510671 122868159
16726 122868159 130812119 138724106 147331653 156144600 164293701 172229808 179892344 186755697
$$ packed form
16787H641955M75876j34841J79738O21041K17801L03641M63918L5031L65987M24784
16777A1594931N11359R803L88593N21592L54613L96062L83406N73232O05253K90519
16767A5629363O91084J006188J54288O96145P31068O84073N99872J072284R92409
16758B2256774P24446R34715Q21629J363820J069282J133912J414354J541509
16750C1260441J311676J271242K013311J440704K592606J649999K453398K515594
16742D6508971K306724L189269K884886L184781L391587L791727M065938M224157
16734G3548040N453782M547410N762493N672465O580976O372047P573458P357488
16726A22868159P943960P911987Q607547Q812947Q149101P936107P662536O863353
$$ plain form
16718 186755697 192540330 197170961 200631235 202288005 202646666 200818431 198136447 193521187
16710 193521187 187992243 181206067 173918681 165645013 156963022 148972871 140189809 131964884
16702 131964884 124080455 116184534 108687040 101804955 95327578 89367113 83672530 78426342
16694 78426342 73667859 68730075 64787894 60894268 57213280 54173331 50625381 48004442
16686 48004442 45462123 42836118 40578388 38649985 36706111 34714081 33033294 31230858
16678 31230858 30215472 28614781 27152392 26107328 24884580 23845251 22948833 21838208
16670 21838208 21326416 20134905 19181546 18668506 17989986 17250317 16448675 16031461 15323637
16661 15323637 14697083 14679388 13947903 13604689 13119844 12852265 12082973 11757298 11276883
$$ packed form
16718A86755697N784633M630631L460274J656770L58661j828235k681984m615260
16710A93521187n528944o786176p287386q273668q681991p990151q783062q224925
16702A31964884p884429p895921p497494o882085o477377n960465n694583n246188
16694G8426342m758483m937784l942181l893626l680988l039949l547950k620939
16686D8004442k542319k626005k257730j928403j943874j992030j680787j802436
16678C1230858j015386j600691j462389j045064j222748j039329q96418j110625
16670B1838208n11792j191511r53359n13040o78520p39669q01642m17214p07824
16661A5323637o26554j7695p31485l43214m84845k67579p69292l25675m80415
$$ plain form
16652 11276883 11093223 10686596 10503699 10337189 9748098 9395566 9462079 8925362 8964891 8536156
16642 8536156 8060793 8154133 7624940 7695667 7524364 6814060 7057440 7009170 6616814 6332483
16632 6332483 5998803 5914029 5954027 5964902 5794055 5622129 5945393 5190014 5611648 5130928
16622 5130928 5133159 4989822 4868289 4607661 4602199 4801216 4437701 4265079 4263511 4096345
16612 4096345 3935305 3739647 3704551 3668058 3626987 3780899 4041318 3437852 3287560 3610007
16602 3610007 3470922 3058417 3190976 3317133 3173567 3045034 2850698 3130440 3012326
16593 3012326 2857234 2782140 2927821 2758335 2613715 2367893 2726093 2622003 2789390 2702298
16583 2702298 2519830 2463957 2075455 2342149 2147569 2236389 2213012 2344099 2224951 1802839
$$ packed form
16652A1276883j83660m06627j82897j66510n89091l52532O6513n36717L9529m28735
16642H536156m75363R3340n29193P0727j71303p10304K43380m8270l92356k84331
16632F332483l33680q4774L9998J0875j70847j71926L23264p55379M21634m80720
16622E130928K231j43337j21533k60628n462J99017l63515j72622j568j67166
16612D096345j61040j95658l5096l6493m1071J53912K60419o03466j50292L22447
16602C610007j39085m12505J32559J26157j43566j28533j94336K79742j18114
16593C012326j55092p5094J45681j69486j44620k45822L58200j04090J67387q7092
16583B702298j82468n5873l88502K66694j94580Q8820k3377J31087j19148m22112
$$ plain form
16573 1802839 2018818 1921462 1891299 1752878 1870822 1918663 1591448 1803031 1904562 1733866
16563 1733866 1847234 1630453 1597557 1783417 1615370 1582426 2322559 1740783 1568846 1560169
16553 1560169 1558772 1827927 1662341 1674495 1636381 1281473 1300132 1231118 1539276 1398840
16543 1398840 1058209 1193633 925852 1370077 1498375 1421924 1415391 1483594 983452 1540438
16533 1540438 1250439 1173288 1265488 1164959 1045883 1154542 1307714 1361847 1120351 1165755
16523 1165755 1348071 921541 1060815 1292815 1072254 1043909 1040178 895660 1148926 996240
16513 996240 829501 882797 687355 657483 842848 589072 955797 1012543 638101 831286
16503 831286 763507 1001670 898956 544067 873222 950425 809721 562138 469993 643959
$$ packed form
16573A802839K15979r7356l0163j38421J17944M7841l27215K11583J01531j70696
16563A733866J13368k16781l2896J85860j68047l2944P40133n81776j71937q677
16553A560169j397K69155j65586J2154l8114l54908J8659o9014L08158j40436
16543A398840l40631J35424k67781M44225J28298p6451o533O8203n00142N56986
16533A540438k89999p7151R2200j00529j19076J08659J53172N4133k41496M5404
16523A165755J82316m26530J39274K32000k20561k8345l731j44518K53266j52686
16513I96240j66739N3296j95442k9872J85365k53776L66725N6746l74442J93185
16503H31286o7779K38163j02714l54889L29155P7203j40704k47583r2145J73966
$$ plain form
16493 643959 492875 728922 786137 446190 631634 628419 745144 394619 376563 840102
16483 840102 872604 753005 784149 490750 851008 464679 542483 648444 602369 670839
16473 670839 663518 431087 468191 457870 325955 846180 705243 669369 598966 691030 711562
16462 711562 624145 350774 812242 700335 565953 603627 456217 763541 643893 429512
16452 429512 567543 500139 810654 671439 462351 268732 516522 499012 744379 305708
16441 297357 167832 496932 523080 706304 311281 510211 288006 402079 441853 701102
16431 701102 851551 452855 472742 517805 133023 489228 198600 108455 555554 207766
16420 859408 209051 597594 750147 375877 376651 457240 328924 346198 113621 163474 453469
$$ packed form
16493F43959j51084K36047N7215l39947J85444l215J16725l50525j8056M63539
16483H40102L2502j19599L1144k93399L60258l86329P7804J05961m6075O8470
16473F70839p321k32431L7104j0321j31915N20225j40937l5874p0403R2064K0532
16462G11562q7417k73371M61468j11907j34382L7674j47410L07324j19648k14381
16452D29512J38031o7404L10515j39215k09088j93619K47790j7510K45367C05708
16441B97357j29525L29100K6148J83224C11281J98930k22205J14073L9774K59249
16431G01102J50449l98696J9887M5063A33023L56205A98600r0145M47099B07766
16420H59408B09051L88543J52553l74270P74Q0589j28316J7274A13621M9853K89995
$$ plain form
16409 453469 371187 361808 346438 354676 -68552 489665 535380 231353 512496 320164 105187
16397 350398 293788 276896 701703 158428 168884 254188 595416 120428 702986 218860
16386 248435 301005 495242 458130 473904 207146 49728 273901 287124 317953 298740 138505
16374 365460 175845 614654 438150 321788 384068 221289 420394 133497 348495 326080
16364 326080 178677 183474 560680 227182 287437 172158 455778 611642 119457 390919
16354 390919 355054 179420 195604 339665 209141 178586 20091 604921 102267 260380
16344 260380 185912 220963 3607 -137334 118842 138725 234404 45080 233130 346720 35600
16332 82832 203043 364869 244576 121349 68795 191450 195256 251709 229619 -51116 521668
$$ packed form
16409D53469q2282r379j5370Q238f8552D89665M5715B31353K81143j92332A05187
16397C50398n6610j6892M24807A58428J0456Q5304L41228A20428N82558B18860
16386B48435N2570J94237l7112J5774B07146D9728K24173J3223L0829j9213A38505
16374C65460A75845M38809j76504j16362O2280j62779J99105A33497K14998k2415
16364C26080j47403M797L77206B27182O0255j15279K83620J55864A19457K71462
16354C90919l5865j75634J6184J44061j30524l0555B0091N84830A02267J58113
16344B60380p4468L5051C607a37334A18842J9883R5679D5080J88050J13590C5600
16332H2832J20211J61826j20293A21349n2554J22655L806N6453k2090e1116E21668
$$ plain form
16320 61786 138691 114560 255144 110701 -36637 -74143 169778 -108942 235290 85534 360003
16309 360003 59870 114841 185261 106948 192453 174500 550050 306324 -5699 446351 63549
16297 -12906 -296222 554699 232434 486087 158409 162443 126827 244864 102662 21462
16286 275189 -330009 347362 227009 328506 69128 68694 460883 -50319 -205100 76844 -100297
16274 -125766 310308 207583 85370 -62920 -9996 -107807 158503 177316 179746 292734 267731
16263 267731 -283929 -129837 183971 -221974 192439 46130 277149 61963 -191676 -89004
16252 216285 113036 192934 -139054 44975 -97859 172354 101077 115588 258400 -29049 37599
16240 256234 24939 91169 -214626 242285 185904 192028 77029 -15343 12357 -78296 -78493 -13678
$$ packed form
16320F1786P6905k4131J40584A10701c6637l7506A69778a08942B35290H5534K74469
16309C60003E9870N4971P0420p8313Q5505j7953L75550k43726e699D46351F3549
16297a2906k83316E54699B32434K53653A58409M034l5616J18037A02662B1462
16286B75189c30009C47362j20353J01497F9128m34L92189e0319j54781G6844a00297
16274a25766C10308j02725H5370f2920i996r7811A58503J8813K430J12988k5003
16263B67731b83929a29837A83971b21974A92439D6130K31019F1963a91676h9004
16252B16285j03249P9898a39054D4975i7859A72354p1277J4511J42812b9049C7599
16240B56234B4939O6230b14626B42285n6381O124G7029a5343A2357g8296j97a3678
$$ plain form
16227 57200 74006 91410 378222 -122248 188652 202453 37916 143904 -37085 -102671 -186535
16216 -186535 -92434 -3187 -99107 51280 48498 101225 267025 464980 -118123 7780 -18307
16204 -25970 -135177 202169 -173240 -23490 171401 126928 -164244 -124720 -208915 214836
16193 -340623 -68552 168854 -174096 70765 16392 309099 43989 -65268 -48777 93914 -99444
16181 -72956 220718 8032 149343 224434 -47194 6218 159287 147644 268220 93405 -64143
16169 298317 -421359 -33679 306327 494233 11985 -297589 219357 334371 29151 -180449
16158 -150410 -15415 596 -144066 276926 138368 29493 158528 75331 171883 210831 262147
16147 262147 -78938 -185302 -65138 -124926 322790 -37655 60271 148387 48125 92750 -78129
$$ packed form
16227E7200J6806J7404K86812a22248A88652J3801C7916J05988c7085o5586q3864
16216a86535i2434c187r5920E1280k782N2727J65800J97955a18123G780a8307
16204b5970j09207B02169a73240b3490A71401m4473a64244L9524q4195B14836
16193c40623f8552A68854a74096G0765A6392K92707D3989f5268J6491I3914i9444
16181g2956B20718H032J41311P5091d7194F218J53069j1643J20576I3405f4143
16169B98317d21359c3679C06327J87906A1985b97589B19357J15014B9151a80449
16158a50410a5415E96a44066B76926A38368B9493J29035G5331R6552L8948N1316
16147B62147g8938j06364f5138n9788C22790c7655F0271Q8116D8125M4625g8129
$$ plain form
16135 248866 -171299 -83268 239851 155502 12707 -269291 44863 247023 76755 44086 -146041
16123 -69530 233150 24443 140677 53243 -170699 51925 40009 -248140 310764 179840
16113 179840 -401549 -79806 -244141 -26109 293250 -99430 -261406 217538 -44623 -201301
16103 -201301 78668 311778 26020 396404 259791 119554 41294 -73139 -112975 119508
16092 -38017 199904 -93218 238269 204120 -8444 -66654 -306150 -158594 -167515 -117619 145269
16080 -188227 293938 353279 -5446 -517671 -424593 -392171 115849 181871 70252 -121570 -166386
16069 -166386 167255 -66076 33763 142499 -89017 -161198 -28952 60735 -301749 236645 278253
16058 278253 213174 -37294 50447 -263806 -78216 -100732 -214213 43668 139877 -161775 -346145
$$ packed form
16135B48866a71299h3268B39851q4349A2707b69291D4863K02160G6755l2669a46041
16123f9530B33150B4443J16234E3243a70699E1925j1916b48140C10764j30924
16113A79840d01549g9806j64335b6109B93250i9430j61976B17538d4623j56678
16103b01301G8668K33110B6020L70384j36613A19554D1294g3139l9836A19508
16092c8017A99904i3218B38269l4149h444n8210k39496J47556q921M9896A45269
16080a88227B93938N9341e446n12225R3078L2422A15849O6022G0252a21570m4816
16069a66386A67255f6076C3763J08736h9017p2181b8952F0735c01749B36645M1608
16058B78253o5079c7294E0447b63806g8216k2516j13481D3668R6209a61775j84370
$$ plain form
16047 -346145 121200 17255 -230843 -38362 -435486 -239992 122423 -298642 -54318 220589
16036 39299 -18602 9707 25330 45090 74200 -81464 -69763 158023 265683 -119509 -198263
16025 -198263 -4914 170246 -309219 -305592 45342 166933 16726 101118 122963 -220769 -265263
16014 -265263 -307315 -408265 -49685 -49440 125879 96094 -395154 -126730 -25947 -324775 -132712
16002 -299547 24986 -294661 -170933 -166516 45648 -73670 101929 -84513 -121276 24262 -240168
15990 138743 -119648 285957 167248 260624 -84437 -320624 -30562 200648 342119 102678
15979 309399 340379 246062 -62809 81292 -82329 -71728 -437392 -124687 165285 217211 120580
15968 120580 -159341 -232785 -12585 -281630 368159 42565 78661 -83435 94931 71076 -114518
$$ packed form
16047c46145A21200A7255b30843c8362l97124J95494A22423b98642e4318B20589
16036C9299a8602I707J5623J9760K9110h1464J1701A58023J07660a19509p8754
16025a98263d914A70246c09219L627D5342J21591A6726Q4392K1845b20769m4494
16014b65263m2052j00950d9685K45A25879k9785c95154a26730b5947k98828a32712
16002b99547B4986b94661J23728M417D5648g3670A01929h4513l6763B4262b40168
15990A38743a19648B85957j18709R3376h4437k36187c0562B00648J41471A02678
15979C09399L0980r4317f2809H1292h2329J0601l65664a24687A65285N1926r6631
15968A20580a59341p3444a2585k69045C68159D2565L6096h3435I4931k3855a14518
$$ plain form
15956 188300 -51042 237513 33709 -106776 21533 -169917 -83633 -3516 128223 -224618 -257052
15945 -257052 170330 64229 87276 234388 81499 -145110 -88650 -294430 -116831 -17729
15934 -96518 132097 21221 190064 -213289 -94817 -66321 -80227 -244238 -217927 72044 -184664
15922 -64100 70691 -160448 123731 -273585 -282588 -362484 -432779 -110410 41135 14702 -187507
15910 142587 -326482 44710 -168271 170082 -7368 43340 26266 -59211 403391 131988 97853
15899 97853 52249 253026 -190806 -176169 -63171 113657 -81919 2711 -410269 -91077 50041
15887 -100373 -5150 9877 -13388 -49585 74457 258359 -238159 -48300 88013 -44087 -194509
15876 -194509 -8589 282656 -167164 77502 -145908 -125870 89700 67055 -125471 -104952 4963
$$ packed form
15956A88300e1042B37513C3709a06776B1533a69917h3633c516A28223b24618l2434
15945b57052A70330F4229K3047J47112H1499a45110N6460k05780a16831a7729
15934i6518A32097B1221J68843b13289i4817K8496j3906j64011K6311G2044a84664
15922f4100G0691a60448A23731b73585r003p9896p0295a10410D1135A4702a87507
15910A42587c26482D4710a68271A70082g368D3340j7074e9211D03391A31988l4135
15899I7853m5604K00777a90806J4637f3171A13657h1919B711d10269i1077E0041
15887a00373e150I877a3388l6197G4457J83902b38159d8300H8013d4087j50422
15876a94509h589B82656a67164G7502a45908K0038H9700k2645a25471K0519D963
$$ plain form
15864 95 -5552 -149843 131951 36324 76753 -28980 -127178 6268 229 223301 -169554 176222
15851 -59173 193808 61532 213998 195126 -162741 -191270 -26021 59693 304287 -137318 94580
15839 164849 339987 12888 -252184 76743 111660 7991 65340 -40658 61854 -88818 102333
15827 -119478 -17356 98148 132836 -90960 -185781 -404291 -120832 -182799 -1393 205809 184199
15816 184199 -74108 21059 157897 250201 -195443 197017 -170471 -233846 141289 84587
15806 84587 -336494 14251 60149 -335136 221963 -266952 -143023 -239716 -238787 -22467 200198
15794 102565 -205118 -334673 -123876 -36450 -135695 174625 -201201 68007 -75016 -162569
15784 -162569 -369688 226715 -215343 6787 149438 -9292 237137 26485 -259644 -222479 68821
$$ packed form
15864I5e552j44291A31951C6324M0429b8980r8198F268B29K23072a69554A76222
15851e9173A93808F1532J52466j8872a62741k8529b6021E9693K44594a37318I4580
15839A64849J75138A2888b52184G6743L4917G991N7349d0658F1854h8818A02333
15827a19478a7356I8148L4688i0960r4821k18510a20832o1967a393B05809k1610
15816A84199g4108B1059J36838R2304a95443A97017a70471o3375A41289n6702
15806H4587c36494A4251M5898c35136B21963b66952J23929r6693R29b2467B00198
15794A02565b05118j29555a23876c6450r9245A74625b01201F8007g5016q7553
15784a62569k07119B26715b15343F787J42651i292B37137B6485b59644L7165F8821
$$ plain form
15772 28954 -224192 -283052 24377 123715 64253 201591 108428 -85416 3371 102859 72427
15761 72427 56197 204703 75109 -109870 178343 81100 -29069 752 117609 -150873 -29917
15749 -253384 -245825 -72955 216837 178864 78109 51662 9300 82098 119441 278 -233259 -60011
15736 -348943 8525 -92474 160099 -321076 -170857 54612 113005 108370 -50404 -91195 -89275
15725 -89275 192393 -169334 308441 -123711 22636 -127069 -84647 -165746 -15297 54794 -152856
15713 71060 38921 185350 55114 30377 -133044 -79936 -44339 -196335 35898 -23249 -146580
15702 -146580 -200790 67692 208791 -188522 220395 122936 -76935 448788 -157212 -41959
15691 189071 84319 18518 236237 -16929 407190 4149 -281942 -135042 -177796 83872 -375666
$$ packed form
15772B8954b24192n8860B4377R9338n9462J37338r3163h5416C371R9488l0432
15761G2427j6230J48506G5109a09870A78343H1100b9069G52J16857a50873b9917
15749b53384P559g2955B16837l7973G8109k6447I300P2798L7343B78b33259f0011
15736c48943H525i2474A60099c21076J50219E4612N8393m635e0404m0791J920
15725h9275A92393a69334C08441a23711B2636a27069M2422q1099a5297E4794a52856
15713G1060l2139J46429E5114k4737a33044N3108L5597j51996C5898b3249j23331
15702a46580n4210F7692J41099a88522B20395r7459g6935D48788a57212d1959
15691A89071H4319A8518K17719a6929D07190D149b81942a35042m2754H3872c75666
$$ plain form
15679 -85610 -198150 -82597 -20323 247717 2155 282 99459 53193 131024 -200378 -484603
15668 -484603 41351 -150950 -74720 -7973 -82290 -106652 -230701 8887 43795 -168274 101213
15656 85273 63816 -257294 -109555 -138809 185874 220368 250343 109628 10956 -270883 -149114
15645 -149114 -52202 108744 110026 103204 -35713 149538 30148 -194255 -32293 124730 -75000
15633 -361738 -14828 30937 22247 -166791 92997 -194112 -60221 -104067 -109331 -242831 64561
15621 -28731 152596 -152024 -46680 259695 245839 132922 95947 -47172 140526 -92411 196650
15609 140530 -143642 -132614 44573 -80970 -41908 -64074 127457 109769 -220892 68656 -175195
15597 77172 -128375 -250996 90438 -110074 -145609 115223 185955 -29911 -32242 -273802 -197689
$$ packed form
15679h5610j12540h2597b0323B47717B155B82R9177m6266P7831b00378k84225
15668d84603D1351a50950g4720g973p4317k4362j24049H887L4908a68274A01213
15656H5273k1457b57294a09555k9254A85874L4494K9975A09628A0956b70883J21769
15645a49114e2202A08744J282o822c5713A49538C0148a94255c2293A24730g5000
15633c61738a4828C0937q690a66791I2997a94112f0221m3846n264j33500F4561
15621b8731A52596a52024d6680B59695j3856j12917l6975d7172A40526i2411A96650
15609A40530a43642J1028D4573h0970L9062k2166A27457j7688b20892F8656a75195
15597G7172a28375j22621I0438a10074l5535A15223P0732b9911k331k41560P6113
$$ plain form
15586 -197689 -118719 75580 137626 207267 -27686 79458 -77222 188140 -158688 -260722 -21423
15574 28600 -89488 -381199 -451230 -117905 210978 -132235 102100 -99025 38265 182506
15564 182506 -226790 91620 -129624 55909 562888 54225 -122216 10878 51006 -213749
15553 -264706 174600 -23910 57495 131979 -52524 -146362 -122176 184984 1683 63403 -38020
15541 42649 198373 118553 139857 -28289 190304 -196709 -10562 -98903 -42545 -256121 3911
15529 207056 -8470 346953 119468 73887 67094 -214291 13235 392478 -99989 -112637 273197
15517 175811 149507 315481 277309 -115145 61269 -96422 211633 216525 -126726 12239 81468
15506 81468 -106799 -75960 -419190 24889 -246293 -44762 -77015 46068 -14749 -226549 -340250
$$ packed form
15586a97689P8970G5580O2046O9641b7686G9458g7222A88140a58688j02034b1423
15574B8600h9488k91711p0031a17905B10978a32235A02100i9025C8265J44241
15564A82506b26790I1620a29624E5909N06979E4225a22216A0878M0128b13749
15553b64706A74600b3910E7495P4484e2524r3838K4186A84984A683O1720c8020
15541D2649J55724p9820K1304b8289A90304a96709a0562q8341d2545k13576C911
15529B07056h470C46953A19468m5581o793b14291A3235L79243i9989j2648B73197
15517A75811k6304J65974l8172a15145F1269i6422B11633M892a26726A2239O9229
15506H1468a06799L0839l43230B4889b46293d4762l2253D6068a4749k11800j13701
$$ plain form
15495 -340250 -144382 -74312 25423 -118625 -182731 -125062 27307 -249162 -206985 -55930 67119
15483 37202 308947 -98317 442088 -27666 -35778 -4050 159527 29690 -298285 -54616 -186977
15472 -186977 -254849 173487 158786 -257449 96299 29405 -179037 -69966 502030 117176
15461 296726 100720 -7720 5753 108510 56498 9489 -220168 46783 -43167 200271 31069
15449 39198 55321 -449062 -55744 -1984 96594 -2799 -322256 223360 -157750 224537 374454
15438 374454 -36805 116766 83775 34790 279101 78504 1929 104174 -74499 -177730 -443791
15427 -443791 -9641 -56601 -55119 38099 33784 289502 -5225 139261 -269705 -72378 32013 -112205
15414 -15638 64871 -392940 318297 331233 -22607 -61852 -90091 161238 293482 -429005 -158064
$$ packed form
15495c40250a44382P0070B5423a18625o4106N7669B7307b49162M2177e5930F7119
15483C7202K71745i8317D42088b7666q112d050A59527B9690b98285e4616j32361
15472a86977o7872A73487j4701b57449I6299B9405a79037f9966E02030A17176
15461B96726A00720g720E753J02757n2012I489b20168D6783d3167B00271C1069
15449C9198J6123d49062e5744a984I6594b799l19457B23360a57750B24537J49917
15438C74454c6805A16766l2991C4790K44311G8504A929J02245g4499j03231k66061
15427d43791i641m6960J482C8099m315K55718e225A39261b69705g2378C2013a12205
15414a5638F4871c92940C18297J2936b2607l9245k8239A61238J32244d29005a58064
$$ plain form
15402 -375983 -111349 -202880 -162334 -187718 103378 -128089 -58423 -363747 -4377 -195008 -49608
15390 -341355 -331326 109995 -27779 52868 82484 -159385 70667 151730 -194824 49535 282754
15379 282754 -113374 -90513 214225 -370396 -85634 -425911 318989 -37786 -5385 -42225 6747
15367 -82120 102035 -190118 74887 -4118 -126712 -13749 -84138 -260759 170994 16517 -121087
15355 -32517 211465 22437 -274409 191538 112804 -49318 -81607 -115370 -39581 88541 265731
15344 265731 222617 123118 -76800 171492 439889 26077 44063 106997 -351135 283748 157593
15333 157593 44442 251876 67319 88237 153633 -541555 223593 141085 -269677 13382 260511
15322 260511 76453 -216871 14646 -290774 -254836 77820 -120403 441132 10330 -71561 -123835
$$ packed form
15402c75983a11349r1531M0546k5384A03378a28089e8423l05324d377j90631d9608
15390c41355J0029A09995b7779E2868K9616a59385G0667Q1063a94824D9535K33219
15379B82754a13374K2861B14225c70396h5634l40277C18989c7786e385l6840F747
15367h2120A02035a90118G4887d118j22594a3749p0389j76621A70994A6517a21087
15355c2517B11465B2437b74409A91538p8734d9318l2289l3763c9581H8541J77190
15344B65731m3114r9499g6800A71492K68397B6077J7986O2934c51135B83748j26155
15333A57593D4442K07434F7319K0918O5396e41555B23593q2508b69677A3382K47129
15322B60511G6453b16871A4646b90774L5938G7820a20403D41132A0330g1561n2274
$$ plain form
15311 -123835 -185866 -175058 157309 77940 82901 5710 -357600 40016 132662 -195946 -209391
15300 -209391 20851 19858 226371 -329445 361302 -18412 194532 209572 63637 185156 83969
15288 -116782 215690 -53862 -145530 -20248 -104131 169236 -293708 -295148 -14360 -30928 482362
15276 473132 -358412 -318177 -175013 275707 -67040 -302715 -138407 26542 162222 -102876
15265 -3404 -18787 279318 97987 -161345 211912 98701 428491 167922 151558 234858 71019
15253 24033 424713 166195 142521 297382 654327 1718893 947532 1101866 1179709 709852
15243 709852 165876 185082 -196750 199401 -160586 146035 -91300 16218 -23692 -127897
15233 -127897 44340 -90091 119781 -6516 615049 -142419 98792 -11703 106427 139268 142861
$$ packed form
15311a23835o2031J0808A57309G7940M961E710c57600D0016R2646a95946j3445
15300b09391B0851r93K06513c29445C61302a8412A94532J5040F3637J21519H3969
15288a16782B15690e3862r1668b0248q3883A69236b93708j440a4360j6568D82362
15276D73132c58412M0235J43164B75707f7040k35675a38407B6542J35680a02876
15265c404j5383B79318I7987a61345B11912I8701L29790A67922j6364Q3300G1019
15253B4033M00680A66195k3674J54861L56945J064566p71361J54334P7843m69857
15243G09852A65876J9206a96750A99401a60586A46035i1300A6218b3692j04205
15233a27897D4340i0091A19781f516F15049a42419I8792a1703A06427L2841L593
$$ plain form
15222 142861 -35502 132090 449928 -525989 -13727 -65116 -36740 389526 74635 -219997
15211 113026 -53134 -89392 -212784 124586 83234 -112679 139879 -167051 -126481 12128
15200 10309 -144791 47832 520266 298069 93871 -368641 171549 78690 -304083 226790
15189 -159910 216033 97553 38991 -87151 -18643 186752 -174272 302973 319493 337091 56809
15177 70188 170881 -207959 -167083 -56015 112704 15968 -241371 221171 -258670 -116237
15166 310717 65436 32894 88831 -60279 72131 -275046 -2623 -83888 74041 220782 99715
15154 75723 222900 106453 -146980 186788 80131 -100722 -84557 -104725 120204 115607 49970
15142 190421 -15411 140412 166885 287880 90851 231887 -49547 388922 -7938 344517 173208
$$ packed form
15222A42861c5502A32090L17838e25989a3727n1389K8376C89526G4635b19997
15211A13026e3134l6258j23392A24586m1352a12679A39879a67051M0570A2128
15200A0309a44791D7832M72434k22197I3871c68641A71549G8690c04083B26790
15189a59910B16033I7553C8991h7151a8643A86752a74272C02973J6520J7598E6809
15177G0188J00693b07959M0876e6015A12704A5968b41371B21171b58670a16237
15166C10717F5436l2542N5937f0279G2131b75046b623q1265G4041J46741I9715
15154G5723J47177A06453a46980A86788H0131a00722J6165k0168A20204m597D9970
15142A90421a5411A40412K6473J20995I0851J41036d9547C88922g938C44517j71309
$$ plain form
15131 173208 167471 218664 24633 145156 905 267083 -41682 57918 254801 -170573 200560
15119 170637 -121502 -37604 -13359 250785 99153 272781 -110374 172460 283641 301799
15109 301799 120628 -86736 -269760 199291 141812 -109578 8182 24583 399495 295349
15099 295349 226051 32712 204125 -145182 -184302 226370 104573 248743 50629 47608 -95792
15087 -40036 202636 219720 212036 -173888 554309 172872 107002 -50875 217977 111792 246925
15076 246925 263137 568006 2297 174787 14001 405573 137769 -168041 -271007 36787
15065 131616 -232220 -42757 129813 277082 -161314 295327 105817 165823 105263 -120346
15054 1883 238891 11680 95171 34727 300216 151971 165099 339364 31260 276244 -35692
$$ packed form
15131A73208n737N1193B4633J20523I05K66178d1682E7918J96883a70573B00560
15119A70637a21502c7604a3359B50785I9153J73628a10374A72460J11181J8158
15109C01799A20628h6736j83024A99291n7479a09578H182J6401L74912j04146
15099B95349o9298C2712J71413a45182l9120B26370A04573J44170E0629l021i5792
15087d0036B02636J7084p684a73888E54309A72872o5870e0875B17977j06185J35133
15076B46925J6212L04869B297J72490A4001L91572A37769a68041j02966C6787
15065A31616b32220d2757A29813J47269a61314B95327A05817O0006o0560a20346
15054A883K37008A1680Q3491C4727K65489j48245J3128J74265C1260K44984c5692
$$ plain form
15042 89919 -176522 186455 33126 224119 419058 146334 146580 -276581 64569 85549 195301
15031 195301 241533 209269 270544 339989 51681 97896 -82626 228199 179066 -160782 193916
15019 -46190 202515 202162 138830 10081 228721 341609 -219414 -96588 130495 350862 66017
15007 110352 171285 79126 201206 340666 1159 -281422 -366033 244746 -49641 -213858 251176
14995 -49433 167994 398960 14859 189510 235631 -49718 -252430 518918 210350 333480
14985 333480 -60901 448061 -13989 226524 116701 -69573 239127 322174 214167 -145850
14974 7137 243083 362148 164648 228458 253075 373447 208829 519400 179796 4651 391478
14963 391478 408962 425826 220973 -57033 106510 316298 294860 72850 297248 -2745 389584
$$ packed form
15042H9919a76522A86455C3126J90993J94939A46334K46b76581F4569K0980J09752
15031A95301M6232l2264O1275O9445E1681M6215h2626B28199m9133a60782A93916
15019d6190B02515l53o3332A0081K18640J12888b19414i6588A30495K20367F6017
15007A10352O0933G9126J22080J39460A159b81422q4611B44746d9641j64217B51176
14995d9433A67994K30966A4859J74651M6121d9718k02712E18918B10350J23130
14985C33480f0901D48061a3989B26524j09823f9573B39127Q3047j08007a45850
14974G137K35946J19065A64648O3810K4617J20372j64618L10571A79796D651L86827
14963C91478J7484J6864k04853e7033A06510K09788k1438G2850K24398b745C89584
$$ plain form
14951 240912 43347 196222 336650 263552 24238 300880 637612 212986 -63840 138795
14940 -111034 611774 317037 210551 310329 -290992 353334 274629 21149 -94371 40951
14929 357238 109034 117359 428276 66238 122019 137355 151969 34986 232211 435605 204460
14917 67555 551928 28044 473346 360724 7948 463766 440919 -106556 150651 541210
14907 541210 622620 395240 352422 398861 259363 622142 -203956 187406 447156 414601
14897 414601 211986 416583 156514 238183 384133 312666 476761 476733 470985 392391 355500
14886 355500 306808 52604 477867 310243 310950 209390 385175 456929 282045 518573 497642
14875 497642 378637 703412 134032 234556 567031 319812 335477 -293078 272490 211881
$$ packed form
14951B40912D3347J52875J40428p3098B4238K76642L36732B12986f3840A38795
14940a11034F11774k94737j06486R9778b90992C53334p8705B1149i4371D0951
14929C57238A09034Q325L10917F6238N5781J5336J4614C4986J97225K03394B04460
14917F7555M84373B8044M45302j12622G948M55818k2847a06556A50651L90559
14907E41210Q1410k27380m2818M6439j39498L62779b03956A87406K59750l2555
14897D14601k02615K04597A56514Q1669J45950p1467J64095k8n748p8594l6891
14886C55500m8692E2604M25263j67624P07j01560J75785P1754j74884K36528k0931
14875D97642j19005L24775A34032J00524L32475k47219J5665b93078B72490o0609
$$ plain form
14865 211881 513447 165647 551898 811193 398910 641262 216544 538720 -88789 466546
14854 50247 198440 502863 68015 437655 528334 309272 350006 158592 561406 526022
14844 526022 521295 311723 312710 210816 209452 524520 208459 -42954 508350 798997 97038
14832 241697 377495 717663 365795 553482 289529 420836 694511 558089 1077271 570551
14822 570551 440444 751864 524583 82085 239696 148910 434440 224840 745720 327416
14811 196207 523876 480296 282005 575508 254972 419757 530086 230240 357594 579415
14801 579415 378355 681498 156619 236606 546948 597987 559033 491599 477687 633066
14791 633066 500664 501798 35073 579160 510610 671871 365720 574765 382087 195090
$$ packed form
14865B11881L01566A65647L86251K59295C98910K42352B16544L22176h8789D66546
14854E0247J48193L04423F8015L69640R0679k19062M0734A58592M02814l5384
14844E26022m727k09572R87j01894j364L15068B08459d2954E08350K90647I7038
14832B41697J35798L40168l51868J87687k63953J31307K73675j36422N19182n06720
14822E70551j30107L11420k27281H2085J57611r0786K85530k09600N20880C27416
14811A96207L27669m3580j98291K93503B54972J64785J10329B30240J27354K21821
14801E79415k01060L03143A56619P9987L10342N1039l8954o7434j3912J55379
14791F33066j32402J134C5073N44087o8550J61261l06151K09045j92678j86997
$$ plain form
14781 195090 865506 279280 379923 392821 479106 433300 332472 676972 147091 369044
14771 369044 416084 471572 478310 712345 400171 659675 447759 567388 556142 513146 678185
14760 678185 579983 699077 717774 616846 700677 455371 635285 505689 284007 545867
14750 545867 106273 468885 446035 498316 748029 543838 547335 366073 511846 511325 324084
14739 324084 633017 693687 598628 464255 554775 732669 409197 645239 569711 744553
14729 744553 654004 382209 789039 307571 625209 906805 663300 671044 1024003 908409
14719 908409 779237 574340 667203 722464 886720 573953 769936 725590 532504 890758
14709 890758 743544 623886 824545 926830 751086 1081607 418889 823905 868729 749456
$$ packed form
14781A95090O70416B79280J00643J2898Q6285m5806j00828L44500A47091K21953
14771C69044M7040N5488O738K34035l12174K59504k11916J19629j1246m2996J65039
14760F78185r8202J19094J8697j00928Q3831k45306J79914j29596k21682K61860
14750E45867A06273L62612k2850N2281K49713k04191L497j81262J45773n21j87241
14739C24084L08933O0670r5059j34373R0520J77894l23472K36042p5528J74842
14729G44553r0549k71795M06830C07571L17638K81596k43505P744L52959j15594
14719I08409j29172k04897R2863N5261J64256l12767J95983m4346j93086L58254
14709H90758j47214j19658K00659J02285j75744L30521D18889M05016M4824j19273
$$ plain form
14699 749456 620112 842335 888262 725822 738875 844476 870700 721947 971252 1020898
14689 1020898 883173 805911 885791 685390 887268 721149 820544 469702 1050646 642805
14679 642805 586508 750121 733002 924732 551249 894842 922072 962185 870415 666041
14669 666041 1199638 876407 790368 1038280 631187 973706 711561 685075 714919 790147
14659 790147 843447 737275 1082729 956439 1016923 847852 1317028 741652 949662 1011630
14649 1011630 1029160 1343547 574207 916994 1021784 1119148 1002681 1173972 1228343 1326524
14639 1326524 921271 1218672 1168999 1193155 1068303 1438118 1091202 1131857 1137781 1090495
14629 1090495 1044788 1267951 1313770 1207472 1194012 1085583 1176756 1012043 1368735 1192474
$$ packed form
14699G49456j29344K22223M5927j62440J3053J05601K6224j48753K49305M9646
14689A020898j37725p7262P9880k00401K01878j66119R9395l50842N80944m07841
14679F42805n6297J63613j7119J91730l73483L43593K7230M0113r1770k04374
14669F66041N33597l23231q6039K47912m07093L42519k62145k6486K9844P5228
14659G90147N3300j06172L45454j26290O0484j69071M69176n75376K08010O1968
14649A011630J7530L14387E74207L42787J04790R7364j16467J71291N4371R8181
14639A326524m05253K97401m9673K4156j24852L69815l46916M0655N924m7286
14629A090495m5707K23163M5819j06298j3460j08429R1173j64713L56692j76261
$$ plain form
14619 1192474 1246261 1383254 1176901 1234823 1466074 1581703 1379978 1195800 1365642 1308679
14609 1308679 1514092 1616555 1415310 1409645 1710421 1456657 1396801 1501661 1141318 1372847
14599 1372847 1535652 1250404 1463761 1338711 1423777 1748203 1860533 1498181 1692942 1894609
14589 1894609 1679537 1708888 1914019 1742891 1670136 1506900 1633147 1608800 1969990 1709851
14579 1709851 1472229 2024358 1838811 1723545 1743738 1937845 1856880 1996970 2165878 1916450
14569 1916450 1952225 2017417 1989154 1906005 2088850 2103041 2454745 2255949 2405065 2234504
14559 2234504 2598215 2390872 2698698 2914683 3007618 3064537 3238011 3900117 4360306 5226071
14549 5226071 6953876 11065385 20297661 37894152 41908163 23004243 9851992 4360073
$$ packed form
14619A192474N3787J36993k06353N7922K31251J15629k01725j84178J69842n6963
14609A308679K05413J02463k01245n665L00776k53764n9856J04860l60343K31529
14599A372847J62805k85248K13357j25050Q5066L24426J12330l62352J94761K01667
14589A894609k15072K9351K05131j71128p2755j63236J26247k4347L61190k60139
14579A709851k37622N52129j85547j15266K0193J94107q0965J40090J68908k49428
14569A916450L5775O5192k8263q3149J82845J4191L51704j98796J49116j70561
14559B234504L63711k07343L07826K15985R2935N6919J73474O62106M60189Q65765
14549E226071J727805M111509R232276J7596491M014011j8903920I851992D360073
$$ plain form
14540 3174502 2376488 1818101 1884930 1422569 1596492 2265015 1898449 1866164 1901302 1849528
14530 1849528 2291517 2084267 2173666 2020897 2426489 2232635 2211063 2118565 2183956 2360927
14520 2360927 2110252 2205463 2246789 2400652 2495902 2464636 2414960 2429810 2581530 2398406
14510 2398406 2436998 2435158 2557509 2787861 2645799 2838084 2595439 3130173 2499984 2672655
14500 2672655 2619651 2806552 2955083 2795172 2992366 2940220 3159932 2988255 3365245 2870984
14490 2870984 2812325 3118312 3232498 3245696 3350921 3499229 3149744 3396453 3497534 3384758
14480 3384758 3400576 3445800 3530113 3744631 3540919 3461149 3451258 3917436 3623278 3827538
14470 3827538 3961717 3466314 3902631 3868324 3918975 4179727 4188000 4261778 4032301 4354953
$$ packed form
14540C174502p98014n58387O6829m62361J73923O68523l66566l2285L5138n1774
14530A849528M41989k07250Q9399j52769M05592j93854k1572r2498O5391J76971
14520B360927k50675R5211M1326J53863R5250l1266m9676J4850J51720j83124
14510B398406L8592j840J22351K30352j42062J92285k42645N34734o30189J72671
14500B672655n3004J86901J48531j59911J97194n2146K19712j71677L76990m94261
14490B870984n8659L05987J14186J3198J05225J48308l49485K46709J01081j12776
14480C384758J5818M5224Q4313K14518k03712p9770r891M66178k94158K04260
14470C827538J34179m95403M36317l4307N0651K60752Q273P3778k29477L22652
$$ plain form
14460 4354953 4357877 4636405 4297429 4740846 4649371 4792257 4686041 4687412 4767386 4684120 5152360
14449 5152360 5028806 5379840 5362407 5389645 5265002 5588536 5111029 5542374 5628703 5220355
14439 5220355 5645376 5834832 5684623 5732440 5817016 6053849 5990526 6245512 6178659 6112518
14429 6112518 6191369 6386290 6481313 6659991 7041216 6755718 6886509 7013047 6738485 7255894
14419 7255894 7277547 7423857 7553685 7195165 8021677 7845817 8001875 8053331 8297937 8223594
14409 8223594 8226012 8498252 8727981 8735918 8881081 8971730 9367267 9252020 9405653 9623277
14399 9623277 10058719 9901465 10223167 10112530 10262917 10571319 11035083 10581063 11134282
14390 11134282 11189279 11311408 11577465 11896713 12020568 12294567 12535140 12641879 13224069
$$ packed form
14460D354953K924K78528l38976M43417r1475J42886j06216J371P9974q3266M68240
14449E152360j23554L51034j7433K7238j24643L23534m77507M31345Q6329m08348
14439E220355M25021J89456j50209M7817Q4576K36833o3323K54986o6853o6141
14429F112518P8851J94921R5023J78678L81225k85498J30791J26538k74562N17409
14419G255894K1653J46310J29828l58520Q26512j75860J56058N1456K44606p4343
14409H223594K418K72240K29729P937J45163R0649L95537j15247J53633K17624
14399I623277M35442j57254L21702j10637J50387L08402M63764m54020N53219
14390A1134282N4997J22129K66057L19248J23855K73999K40573J06739N82190
$$ plain form
14381 13224069 13437813 13632492 13881020 14203863 14383656 14582957 14781223 14916343 15334479
14372 15334479 15863507 15707158 16400290 17030854 16837317 17218900 17888052 18165817 18569719
14363 18569719 19004054 19116813 19432728 20236935 20540212 20929859 21618807 22243501 22564758
14354 22564758 22731583 23547964 24206770 25045196 25684037 26097404 26405928 27468301 28088107
14345 28088107 28745809 29613349 30176222 31493067 31948360 32761947 33476668 34703914 35672691
14336 35672691 36925516 37863788 39162944 40339458 41309707 42543126 44176126 45606108
14328 45606108 47043014 48396330 50134245 52055001 53605175 55474125 57278174 59711914
14320 59711914 61580037 64223961 66483597 68891485 71646522 74308504 77455764 80273235
$$ packed form
14381A3224069K13744J94679K48528L22843J79793J99301J98266J35120M18136
14372A5334479N29028j56349O93132O30564j93537L81583O69152K77765M03902
14363A8569719M34335J12759L15915Q04207L03277L89647O88948O24694L21257
14354B2564758J66825Q16381O58806Q38426O38841M13367L08524J062373O19806
14345B8088107O57702Q67540N62873J316845M55293Q13587P14721J227246R68777
14336C5672691J252825R38272J299156J176514R70249J233419J633000J429982
14328D5606108J436906J353316J737915J920756J550174J868950J804049K433740
14320E9711914J868123K643924K259636K407888K755037K661982L147260K817471
$$ plain form
14312 80273235 83668830 87255492 90940275 95124131 99318692 103958782 108378806 113376151
14304 113376151 118709336 124291701 130292317 136693320 143355968 150698100 158412459 166921337
14296 166921337 175550128 184765330 194554294 205201752 216517572 228349820 241044569
14289 241044569 254187381 268097553 282496800 297844890 313437294 329361341 345686654
14282 345686654 362182416 378760707 395183606 410823438 425596787 439042487 451678047
14275 451678047 461924731 469920368 473787369 473148856 470881847 468855480 464082688 457313788
14267 457313788 453578838 445561068 433700867 419891954 405260424 390006613 373733852
14260 373733852 356985794 340024332 323216602 306814159 290953124 276572495 262403964
$$ packed form
14312H0273235L395595L586662L684783M183856M194561M640090M420024M997345
14304A13376151N333185N582365O000616O401003O662648P342132P714359Q508878
14296A66921337Q628791R215202R788964J0647458J1315820J1832248J2694749
14289B41044569J3142812J3910172J4399247J5348090J5592404J5924047J6325313
14282C45686654J6495762J6578291J6422899J5639832J4773349J3445700J2635560
14275D51678047J0246684P995637L867001o38513k267009k026367m772792o768900
14267D57313788l734950q017770j1860201j3808913j4631530j5253811j6272761
14260C73733852j6748058j6961462j6807730j6402443j5861035j4380629j4168531
$$ plain form
14253 262403964 248731985 235491270 223115110 211102135 200480936 189876447 180412324
14246 180412324 170964805 162463642 154779246 147187741 140051624 133095718 127287213 121371634
14238 121371634 116060549 111346869 106137137 101528107 96864439 92628550 89447944 85838682
14230 85838682 82422256 79061367 75710174 72957727 70427518 67599416 65131846 62849294
14222 62849294 60695841 58216900 56496534 54591356 52530456 50981785 49437883 47722982
14214 47722982 46458050 45237224 43661012 42300551 40991219 39588748 38860802 38347560
14206 38347560 36862887 36036269 34671673 33677346 32937819 32171871 31452830 30615888 29583348
14197 29583348 28503734 27906701 27475882 26634860 26254628 25802550 25087111 23801498 23620270
$$ packed form
14253B62403964j3671979j3240715j2376160j2012975j0621199j0604489r464123
14246A80412324r447519q501163p684396p591505p136117o955906n808505n915579
14238A21371634n311085m713680n209732m609030m663668m235889l180606l609262
14230H5838682l416426l360889l351193k752447k530209k828102k467570k282552
14222F2849294k153453k478941j720366j905178k060900j548671j543902j714901
14214D7722982j264932j220826j576212j360461j309332j402471p27946n13242
14206C8347560j484673q26618j364596r94327p39527p65948p19041q36942j032540
14197B9583348j079614n97033m30819q41022l80232m52078p15439j285613j81228
$$ plain form
14188 23620270 23203266 22568636 21982489 21497653 21175594 20504530 20281368 19496752 19413348
14179 19413348 18930165 18207531 17867412 17595180 17132504 17111278 16593558 16516409 16592854 15643793
14169 15643793 15506323 15174675 15035216 14630142 14085423 14388970 13798486 13678093 13316394
14160 13316394 13237151 13121151 12659826 12294344 12302380 12182175 11841029 12035040 11901592 11127041
14150 11127041 11437226 10913895 10766266 10412912 10616007 10298010 10084406 9776455 9828209
14141 9828209 9497408 9405121 9261556 9173155 8989523 9061839 8906539 8724520 8598119 8756824
14131 8756824 8184098 8772056 8131383 7878732 7850126 7944523 7468694 7587625 7295683 7288087
14121 7288087 7057551 7447519 6953760 7023466 6968568 6646617 6973674 6740435 6265106 6390739
$$ packed form
14188B3620270m17004o34630n86147m84836l22059o71064k23162p84616q3404
14179A9413348m83183p22634l40119k72232m62676k1226n17720p7149P6445r49061
14169A5643793j37470l31648j39459m05074n44719L03547n90484j20393l61699
14160A3316394p9243j16000m61325l65482Q036j20205l41146J94011j33448p74551
14150A1127041L10185n23331j47629l53354K03095l17997k13604l07951N1754
14141I828209l30801r2287j43565q8401j83632P2316j55300j82019j26401J58705
14131H756824n72726N87958o40673k52651k8606R4397m75829J18931k91942p596
14121G288087k30536L89968m93759O9706n4898l21951L27057k33239m75329J25633
$$ plain form
14111 6390739 6285284 6309866 6192500 5830270 6086637 5781208 5940389 5715839 5710766 5645914
14101 5645914 5695022 5448731 5746818 5043727 5376150 5326112 5384178 5013472 5164645 5126789
14091 5126789 5127299 4540940 5046540 5044916 4632938 4819463 4529621 4701173 4658536 4371758
14081 4371758 4527587 4423267 4541010 4371156 4061278 4290513 4359797 4098606 3985350 3868739
14071 3868739 4235743 3987536 3990745 4107814 3688201 4036891 3801383 3742840 3623992 3360358
14061 3360358 3658720 3813233 3361037 3371699 3897589 3468507 3860930 3389553 3355578 3243134
14051 3243134 3238698 3251272 3188310 3239725 3250311 3151725 3044755 2981749 2992790 2847622 2882381
14040 2882381 2858448 3067585 2817599 2914127 2920542 2986088 2672755 2999244 3136114 2624959
$$ packed form
14111F390739j05455K4582j17366l62230K56367l05429J59181k24550n073o4852
14101E645914M9108k46291K98087p03091L32423n0038N8066l70706J51173l7856
14091E126789N10n86359N05600j624m11978J86525k89842J71552m2637k86778
14081D371758J55829j04320J17743j69854l09878K29235O9284k61191j13256j16611
14071C868739L67004k48207L209J17069m19613L48690k35508n8543j18848k63634
14061C360358K98362J54513m52196J0662N25890m29082L92423m71377l3975j12444
14051C243134m436J2574o2962N1415J0586r8586j06970o3006J1041j45168L4759
14040B882381k3933K09137k49986R6528O415O5546l13333L26489J36870n11155
$$ plain form
14030 2624959 2580921 2768671 2802341 2417425 2891166 2657757 2291109 2419609 2382990 2599950
14020 2599950 2572474 2596647 2673303 2305041 2380539 2172552 2541128 2027260 2430375 2215790
14010 2215790 2328459 2302420 1902446 2136270 2149849 2025158 1980834 2102608 1332854 1992012
14000 1992012 2292081 1938134 1867865 2239232 1696789 1755868 2004878 1860335 1839814 2037000
13990 2037000 2340655 3122138 6572480 13739280 31303456 42000334 26246248 13249485
13982 13249485 7817911 5618756 4413579 3789704 3476423 3093683 2822109 2373298 2742994
13973 2742994 2683056 2535974 2671736 2476618 2417783 2214499 2111931 2157065 2395055 1951197
13963 1951197 2143441 2012643 2074614 1906889 1912526 1800078 1847607 1903475 1752540 1900231
$$ packed form
14030B624959m4038J87750L3670l84916M73741k33409l66648J28500l6619K16960
14020B599950k7476K4173P6656l68262P5498k07987L68576n13868M03115k14585
14010B215790J12669k6039l99974K33824J3579j24691m4324J21774p69754O59158
14000A992012L00069l53947p0269L71367n42443N9079K49010j44543k0521J97186
13990B037000L03655P81483L450342P166800J7564176J0696878j5754086j2996763
13982A3249485n431574k199155j205177o23875l13281l82740k71574m48811L69696
13973B742994n9938j47082J35762j95118n8835k03284j02568M5134K37990m43858
13963A951197J92244j30798O1971j67725N637j12448M7529N5868j50935J47691
$$ plain form
13953 1900231 1698869 1581482 1604592 1804528 1817284 1860281 1984570 1510253 1798819 1934692
13943 1934692 1824578 1954728 1535694 1744042 1538405 1439843 1583544 1627427 1583228 1735694
13933 1735694 1274513 1575064 1248536 1594120 1568816 1476197 1412795 1559153 1323857 1168120
13923 1168120 1419296 1443053 1529026 1214298 1216231 1301707 1353645 1450547 1302168 1229903 1312548
13912 1312548 1553820 1260139 1359782 1473961 1116160 1520310 1186560 1263102 1280730 1205864
13902 1205864 1160337 1054055 1091411 1212495 998772 1238082 897969 1094128 1199426 1335401
13892 1335401 1073479 1159417 1030963 1207814 689210 1058681 1208926 1107010 1315750 1361431
13882 1361431 1331331 1382034 1154282 1231544 964117 1203522 880288 818491 1052463 1299065
$$ packed form
13953A900231k01362j17387K3110J99936J2756M2997J24289m74317K88566J35873
13943A934692j10114J30150m19034K08348k05637r8562J43701M3883m4199J52466
13933A735694m61181L00551l26528L45584k5304r2619o3402J46358k35296j55737
13923A168120K51176K3757Q5973l14728J933Q5476N1938R6902j48379p2265Q2645
13912A312548K41272k93681R9643J14179l57801M04150l33750P6542J7628p4866
13902A205864m5527j06282L7356J21084k13723K39310l40113J96159J05298J35975
13892A335401k61922Q5938j28454J76851n18604L69471J50245j01916K08740M5681
13882A361431l0100N0703k27752P7262k67427K39405l23234o1797K33972K46602
$$ plain form
13872 1299065 947155 860955 1181187 1113903 973347 1029840 1340451 884479 820954 1090884
13862 1090884 1091895 1007153 879681 1058209 1163854 852762 969506 989570 944717 680075
13852 680075 1073215 860991 1165294 996587 938627 1228790 908574 1218221 1273482 816011
13842 816011 868690 721595 951798 1274368 975028 934634 628782 742307 718921 1048439
13832 1048439 887076 1019797 880300 844440 1065265 831266 849655 902463 740741 785968
13822 785968 933212 584629 565454 744168 1121227 543626 565318 797148 787465 970368
13812 970368 770539 1033100 546639 836047 1030170 744839 831144 891295 977008 814041
13802 814041 801865 585185 574660 861201 629973 876603 429084 549209 916071 356509
$$ packed form
13872A299065l51910q6200L20232o7284j40556N6493L10611m55972o3525K69930
13862A090884J011q4742j27472J78528J05645l11092J16744K0064m4853k64642
13852F80075L93140k12224L04303j68707n7960K90163l20216L09647N5261m57471
13842H16011N2679j47095K30203L22570k99340m0394l05852J13525k3386L29518
13832A048439j61363J32721j39497l5860K20825k33999J8389N2808j61722M5227
13822G85968J47244l48583j9175J78714L77059E43626K1692K31830r683J82903
13812I70368j99829K62561m86461K89408J94123k85331Q6305O0151Q5713j62967
13802H14041j2176k16680j0525K86541k31228K46630D29084J20125L66862C56509
$$ plain form
13791 1044142 795208 896035 780431 985975 961037 573512 806425 630728 513299 447102
13781 447102 683172 735639 796164 850302 607286 460522 781062 649677 844421 499634
13771 499634 618591 579345 743459 582163 1034738 841014 774550 622117 538709 449278
13761 449278 332435 620629 634027 588030 461086 741265 589783 681795 779184 627399
13751 627399 445318 350892 750433 633919 652660 466594 660578 474133 894810 587081
13741 587081 400855 906616 611043 705999 907988 756600 324538 706323 466137 583465
13731 583465 363371 72814 480277 775021 596880 440322 463391 504871 612698 682528
13721 682528 534834 260570 693799 569678 490560 570104 314440 297950 220218 694051
$$ packed form
13791A044142k48934J00827j15604K05544k4938l87525K32913j75697j17429o6197
13781D47102K36070N2467O0525N4138k43016j46764L20540j31385J94744l44787
13771D99634J18957l9246J64114j61296M52575j93724o6464j52433q3408q9431
13761D49278j16843K88194J3398m5997j26944K80179j51482R2012R7389j51785
13751F27399j82081r4426L99541j16514J8741j86066J93984j86445M20677l07729
13741E87081j86226N05761k95573R4956K01989j51388C24538L81785k40186J17328
13731E83465k20094G2814M07463K94744j78141j56558K3069M1480J07827O9830
13721F82528j47694B60570M33229j24121p9118P9544k55664j6490p7732M73833
$$ plain form
13711 694051 606303 381947 235839 734306 584841 571652 413934 590380 485859 326511
13701 326511 101042 615662 310699 355810 505302 322660 252371 518060 265824 481668
13691 481668 719106 1015730 469463 508954 391967 471072 405071 528703 417850 384783
13681 384783 351357 517535 165264 600279 337244 449939 203838 440054 453544 281957
13671 281957 499934 -12328 641662 437892 236526 427993 477903 625375 664809 52486
13660 229326 372199 525033 236994 500748 636014 339310 273813 573295 524587 234840
13649 192897 464007 537278 300707 66297 366823 237296 321614 484137 -37814 205136
13638 469886 442115 420681 81255 484632 205885 296198 421747 210525 272567 440740
$$ packed form
13711F94051q7748k24356j46108M98467j49465j3189j57718J76446j04521j59348
13701C26511A01042N14620l04963M5111J49492j82642p0289K65689k52236K15844
13691D81668K37438K96624D69463L9491j16987P9105o6001J23632j10853l3067
13681C84783l3426J66178A65264M35015k63035J12695B03838K36216J3490j71587
13671B81957K17977a2328F41662k03770k01366J91467M9910J47472L9434E2486
13660B29326J42873J52834B36994K63754J35266k96704o5497K99482m8708B34840
13649A92897K71110P3271k36571F6297L00526j29527Q4318J62523c7814B05136
13638D69886k7771k1434H1255M03377B05885R0313J25549B10525O2042J68173
$$ plain form
13628 440740 327871 166540 540638 525547 571470 338906 234884 239008 149055 346284
13618 346284 541012 285394 151563 228203 543827 321693 457653 59965 176735 550340
13608 550340 768437 172992 184930 178071 201578 118 2733 627557 477837 410320 577813
13597 577813 472127 240213 268259 586863 399740 548443 176644 66462 346836 576243
13587 576243 384171 484478 610171 135712 336642 350849 327285 324466 256089 421216
13577 421216 345152 493840 410772 419173 363146 375608 216167 249156 484126 -23975 176361
13565 315027 353871 133328 366054 132328 127216 364717 163921 335116 167327 93835
13555 93835 26714 278105 332143 122149 245915 155895 356815 204341 114081 204840 564335
$$ packed form
13628D40740j12869j61331L74098j5091M5923k32564j04022M124q9953J97229
13618C46284J94728k55618j33831P6640L15624k22134J35960E9965J16770L73605
13608E50340K18097A72992J1938o859K3507A18K615O24824j49720o7517J67493
13597E77813j05686k31914K8046L18604j87123J48703A76644F6462K80374K29407
13587E76243j92072J00307J25693A35712K00930J4207k3564k819o8377J65127
13577D21216p6064J48688q3068Q401n6027J2462j59441L2989K34970b3975A76361
13565C15027L8844A33328K32726A32328n112K37501A63921J71195A67327p3492
13555I3835B6714K51391N4038A22149J23766r0020K00920j52474r0260R0759L59495
$$ plain form
13544 564335 58161 459233 397010 429807 575555 161083 159780 273480 459052 210332
13533 536579 352435 115091 407726 471723 123889 403669 145874 183818 3637 309236
13523 309236 222974 301002 361420 -94675 278433 494387 175769 336801 241219 1284 267222
13512 267222 419659 -146658 364780 263758 426169 69118 116561 157081 263460 15002
13501 297285 234692 108559 173846 236666 -33979 457416 49717 53622 281398 196714 360650
13490 360650 211178 200937 342883 114936 304865 133222 362015 468003 278950 213846
13480 213846 359291 87202 396327 73347 157876 36410 324668 331181 430501 52119 157912
13469 157912 557645 312132 234690 328435 35483 188858 272662 287379 327350 -162769 491172
$$ packed form
13544E64335E8161M01072o2223L2797J45748A61083j303J13700J85572B10332
13533E36579j84144A15091K92635O3997A23889K79780A45874L7944C637L05599
13523C09236q6262P8028O0418i4675B78433K15954A75769J61032r5582A284K65938
13512B67222J52437a46658C64780j01022J62411F9118M7443M0520J06379A5002
13501B97285o2593A08559O5287O2820c3979D57416D9717L905K27776q4684J63936
13490C60650j49472j0241J41946A14936J89929A33222K28793J05988j89053o5104
13480B13846J45445H7202L09125G3347Q4529C6410K88258O513R9320E2119J05793
13469A57912L99733k45513p7442R3745C5483J53375Q3804J4717L9971a62769D91172
$$ plain form
13457 310907 217225 -52718 125230 2987 212394 -24349 231155 310880 384164 264745 337381
13446 337381 323490 185221 274092 229899 388681 131478 -212659 71234 -88155 122003
13435 274927 102399 205452 252789 301553 -140045 132953 -71468 435898 359935 236761
13425 236761 112444 135665 104119 344606 -80868 209600 10234 228298 -130072 75366
13414 83096 -68787 406823 337829 -46844 34194 68179 352250 56341 147955 264479 196255
13403 196255 120028 210621 333395 -38846 326049 291297 452267 64074 116614 219368 242435
13392 242435 230508 211049 357967 307622 437481 -120242 -75687 26528 -16922 147214 -60148
13380 109174 173306 119297 283847 250827 10571 -10149 127486 200783 306005 378220 289464
$$ packed form
13457C10907r3682e2718A25230B987K09407b4349B31155P9725P3284j19419P2636
13446C37381j3891j38269Q8871m4193J58782A31478b12659G1234h8155A22003
13435B74927A02399J03053M7337M8764a40045A32953g1468D35898p5963j23174
13425B36761A12444K3221l1546K40487h0868B09600A0234K18064a30072G5366
13414H3096f8787D06823o8994d6844C4194L3985K84071E6341R1614J16524o8224
13403A96255p6227R0593J22774c8846C26049l4752J60970F4074N2540J02754K3067
13392B42435j1927j9459J46918n0345J29859a20242M4555B6528a6922A47214f0148
13380A09174O4132n4009J64550l3020A0571a0149A27486P3297J05222P2215q8756
$$ plain form
13369 289464 185855 188060 258675 411571 14911 -16648 218413 332307 475294 200541
13358 426067 217859 3313 137304 104411 133228 -96238 239552 170502 190039 86623 73241
13347 73241 294467 463199 295739 -267588 675442 144570 267714 274600 -215 413697 -66637
13335 588176 124982 235567 327293 81728 235608 398638 389088 279464 149038 457655
13325 457655 -132014 -43800 138936 285180 311047 86323 379738 165412 -82469 81886
13314 218313 400842 87872 -103134 312503 -162132 180899 229983 254345 406536 158230
13303 37624 -72961 12845 94322 32818 166468 207643 -88716 5241 -1681 -115630 -82223 84095
13290 3416 -73387 238346 349181 -41994 149578 372224 373945 535069 -63780 328028 100821
$$ packed form
13369B89464j03609K205P0615J52896A4911a6648B18413J13894J42987B00541
13358D26067k08208C313J33991l2893K8817i6238B39552o9050J9537H6623j3382
13347G3241K21226J68732j67460b67588F75442A44570J23144O886b15D13697f6637
13335E88176A24982J10585R1726H1728J53880J63030r550j09624j30426L08617
13325D57655a32014d3800A38936J46244K5867H6323K93415A65412h2469H1886
13314B18313J82529H7872a03134C12503a62132A80899M9084K4362J52191A58230
13303C7624g2961A2845Q1477C2818J33650M1175h8716E241a681j13949L3407H4095
13290C416g3387B38346J10835d1994A49578K22646J721J61124f3780C28028A00821
$$ plain form
13278 -128250 339664 1743 -3550 225359 46635 -49571 181232 251951 107154 167517 -76158
13266 74351 197528 24578 119435 188951 598125 -203235 -138757 5336 -87541 296870 81607
13254 -76992 222980 189532 123439 -32620 205819 -111804 -1637 484206 100784 501978 -22992
13242 -43526 191033 -129370 -80467 -64962 195386 -140686 -123414 -211589 60227 124756 193019
13231 193019 4400 14402 356681 52578 -323083 217473 22391 85989 146494 10822 -360103
13219 74264 -3769 104869 226323 23824 327064 -98140 -187711 55044 144673 125601 -24814
13207 347645 326369 250075 -68808 289953 106062 354723 401786 -32955 201728 401951
13197 401951 158855 84065 61197 -1897 77235 154140 162795 139015 220532 100161 307934
$$ packed form
13278a28250C39664A743c550B25359D6635d9571A81232P0719A07154O0363g6158
13266G4351J23177B4578R4857O9516M09174b03235O4478E336h7541B96870H1607
13254g6992B22980l3448o6093c2620B05819a11804a637D84206A00784M01194b2992
13242d3526A91033a29370M8903J5505A95386a40686J7272q8175F0227O4529O8263
13231A93019D400J0002L42279E2578c23083B17473B2391O3598O0505A0822c60103
13219G4264c769A04869J21454B3824L03240i8140q9571E5044Q9629j9072b4814
13207C47645k1276p6294f8808B89953A06062K48661M7063c2955B01728K00223
13197D01951A58855p4790k2868a897G7235P6905Q655k3780Q1517A00161K07773
$$ plain form
13186 307934 135453 -257299 372597 234625 349526 5061 -100387 29999 134663 -65369
13175 126485 29492 301616 -615 189470 200436 488819 121779 26672 -116140 -97147 275039
13163 -152623 -127327 38006 29321 45176 -253189 57046 -289680 -117394 113225 -12528 434553
13151 -240745 -140067 93442 -53969 -42346 -33143 -156148 -144906 285555 -16062 233353 287935
13140 287935 177740 -42677 -171092 -25928 36081 -251788 36530 107159 226591 82713 86777
13129 86777 222297 -19154 -37558 289655 175488 -55640 280535 129971 23840 -67695 334964
13117 271188 -298806 155602 -66370 -76700 403951 -13497 427158 -86669 136974 -43461
13106 102846 211636 348598 1927 109144 143235 77121 -167341 266408 64956 147139 84674
$$ packed form
13186C07934A35453b57299C72597j37972J14901E061a00387B9999J04664f5369
13175A26485B9492K72124f15A89470J0966K88383A21779B6672a16140J8993B75039
13163a52623K5296C8006q685J5855b53189E7046b89680a17394A13225a2528D34553
13151b40745J00678I3442e3969J1623R203j23005J1242B85555a6062B33353N4582
13140B87935j10195d2677j28415b5928C6081b51788C6530P0629J19432H2713M064
13129H6777J35520a9154j8404B89655j14167e5640B80535A29971B3840f7695C34964
13117B71188b98806A55602f6370j0330D03951a3497D27158h6669A36974d3461
13106A02846J08790J36962A927J07217L4091o6114a67341B66408F4956Q2183o2465
$$ plain form
13095 84674 164913 66673 -45091 -201529 164709 -155218 -133433 195064 236159 11689 72156
13084 72156 -132147 -229767 -171142 31354 -17019 -198597 -86886 -192468 -29869 150544 333866
13073 333866 269237 68059 -42166 185584 162832 -202565 17995 -40741 347236 181627 56215
13061 91136 86750 -111064 -115532 -84008 178847 178546 207009 38750 152426 43882 96882 77496
13049 77496 -149925 235350 111185 188979 332252 222161 -31535 126547 113950 -258735
13038 -101890 -62330 190559 196233 131613 -172832 292224 -18274 -78149 150745 -241377 126211
13026 411305 -15567 -35800 -35850 148168 124861 14254 187633 -47274 -117760 357371 248851
13015 248851 34023 207778 397634 63731 -210336 251495 33389 338021 303000 -72714
$$ packed form
13095H4674Q0239F6673d5091j56438A64709a55218K1785A95064M1095A1689O0467
13084G2156a32147r7620N8625C1354a7019j81578h6886j05582b9869A50544J83322
13073C33866o4629F8059d2166A85584k2752b02565A7995d0741C47236j65609E6215
13061I1136m386a11064m468L1524A78847l01K8463C8750J13676D3882N3000j9386
13049G7496a49925B35350A11185P7794J43273j10091c1535A26547j2597b58735
13038a01890L9560A90559N674o4620a72832B92224a8274n9875A50745b41377A26211
13026D11305a5567k0233n0A48168k3307A4254J73379d7274p0486C57371j08520
13015B48851C4023J73755J89856F3731b10336B51495C3389L04632l5021g2714
$$ plain form
13004 -67347 88035 271789 -74367 54668 21852 307932 319873 71878 -143487 355229 -2259
12992 -37391 146822 77790 44106 280468 49524 165111 -129195 134913 162328 11140 2318
12980 -106428 -121190 242385 231920 -38059 -236913 -334862 -131089 245560 -145844 142285
12969 18503 174824 372704 11985 179959 -36142 63537 36248 251371 -241540 58124 -141921
12957 -87493 113375 250211 94809 -175558 133010 16994 -104165 103564 204677 80144
12946 -327114 108199 85251 -75957 28360 -177801 -295559 -222814 95610 310389 303047 315665
12935 315665 -54886 148769 -308985 103705 42372 -131574 246125 -192431 195340 -20588
12924 -129168 76942 122700 -82671 95119 21587 -313906 -67490 -12452 93129 222139 19666
$$ packed form
13004f7347H8035J83754g4367E4668B1852K86080J1941G1878a43487C55229b259
12992c7391A46822o9032l3684K36362D9524J15587a29195A34913K7415A1140B318
12980a06428j4762B42385j0465c8059j98854r7949a31089B45560a45844A42285
12969A8503J56321J97880A1985J67974c6142F3537k7289K15123b41540E8124a41921
12957h7493A13375J36836I4809a75558A33010A6994a04165A03564J01113H0144
12946c27114A08199k2948g5957B8360a77801j17758P2745I5610K14779p342J2618
12935C15665e4886A48769c08985A03705D2372a31574B46125a92431A95340b0588
12924a29168G6942M5758h2671I5119B1587c13906f7490a2452I3129J29010A9666
$$ plain form
12912 203316 90960 -198782 -47414 191563 -158460 228428 -347218 -95451 229735 226138
12902 226138 -369825 254652 214302 -80747 -254155 15128 17411 48797 63365 387165 -32698
12890 324 193153 347749 -163606 70131 -22261 93 209747 -129159 -60326 222744 163797
12879 163797 200694 -106173 262456 53654 73244 80215 282839 263147 -30882 234675 209269
12868 209269 149712 -154805 345806 -346067 58425 165080 -173306 20356 121671 -1828
12857 -215572 181235 -104089 95778 -84000 43337 130657 -78095 342382 145762 -31218 87678
12845 103452 -68843 124013 -98170 -79405 174767 156122 101119 141646 -5253 -87572 115264
12833 404984 -287097 -79104 -351010 166200 253814 -84753 77429 -245209 -29106 124670
$$ packed form
12912B03316I0960a98782d7414A91563a58460B28428c47218i5451B29735l597
12902B26138c69825B54652m0350h0747j73408A5128K283L1386J4568L23800c2698
12890C24J92829J54596a63606G0131b2261I3K09654a29159f0326B22744n8947
12879A63797L6897a06173B62456E3654J9590O971K02624j9692c0882B34675k5406
12868B09269n9557a54805C45806c46067E8425J06655a73306B0356J01315a828
12857b15572A81235a04089I5778h4000D3337Q7320g8095C42382A45762c1218H7678
12845A03452f8843A24013i8170J8765A74767j8645n5003M0527e253q2319A15264
12833D04984b87097g9104k71906A66200Q7614h4753G7429b45209b9106A24670
$$ plain form
12822 29762 -32658 83528 -282448 -238646 89486 181095 270938 -120261 -36671 -135285 161444
12810 46207 7183 211060 -16704 369454 262765 230089 116720 -92605 -180804 147059 -87529
12798 -270756 199264 171135 202536 -72448 -28580 -2544 -245066 307446 206594 130859 16210
12786 119967 208092 -72983 -66363 67066 10668 52391 -104953 163428 29789 183579 322639
12775 322639 -58131 171368 257708 -256051 -291236 -355131 -316972 -70009 -204293 122343 97374
12764 97374 2623 31543 -106671 -189871 -226198 83166 -192893 -57743 188410 -19388 134301
12752 246115 160741 170207 182122 161877 142561 -102974 -209569 532 -46469 -104757 13275 112331
12740 112331 22466 65530 282291 248255 59654 98191 238553 103141 -75480 -109259 27582
$$ packed form
12822B9762c2658H3528b82448M3802H9486R1609Q9843a20261c6671r8614A61444
12810D6207G183K03877a6704C69454j06689l2676j13369i2605q8199A47059h7529
12798b70756A99264k8129L1401g2448b8580b544k42522C07446j00852p5735A6210
12786A19967Q8125g2983O620F7066A0668M1723a04953A63428B9789J53790J39060
12775C22639e8131A71368Q6340b56051l5185o3895L8159g0009j34284A22343k4969
12764I7374B623K8920a06671q3200l6327H3166a92893e7743A88410a9388A34301
12752B46115q5374R466J1915k0245j9316a02974j06595E32d6469n8288A3275R9056
12740A12331B2466M3064K16761l4036E9654L8537J40362A03141g5480l3779B7582
$$ plain form
12728 141638 -22910 106649 6122 182342 -59612 -113750 -18691 -169786 -137877 271201 71515
12716 -20094 -582 -43838 -183057 -174177 233173 439045 68884 13375 134255 440810 449103
12705 449103 -29402 128923 306764 39076 511213 221671 300239 73733 261066 -56664
12694 366500 34172 219433 280619 186967 -80711 14191 14971 -157921 -117189 -238109 226986
12682 46467 256269 124852 436911 -153496 -253009 122637 197219 185035 -132686 -5885 550972
12670 118972 149682 200946 -83214 -324895 90894 -293382 100827 202946 51173 -47834 57966
12658 517211 170276 -171771 323747 127335 -200959 2536 236798 101598 64612 359594
12648 359594 -10845 187218 -205751 79339 -63682 83347 -15344 153783 -39341 -122148 281547
$$ packed form
12728A41638b2910A06649F122J76220e9612n4138a8691j51095L1909B71201G1515
12716b0094e82m3256j39219Q880B33173K05872F8884A3375J20880L06555Q293
12705D49103b9402A28923J77841C9076M72137B21671P8568G3733J87333e6664
12694C66500C4172J85261O1186r3652h0711A4191P80a57921M0732j20920B26986
12682D6467K09802A24852L12059a53496r9513A22637P4582j2184a32686e885E50972
12670A18972L0710N1264h3214k41681I0894b93382A00827J02119E1173d7834E7966
12658E17211A70276a71771C23747A27335b00959B536K34262A01598l6986K94982
12648C59594a0845A87218b05751G9339f3682H3347a5344A53783c9341q2807B81547
$$ plain form
12636 -48338 -27638 -16442 -25493 253570 130461 -91917 77473 477287 329062 61643 213774
12625 213774 348822 212804 285627 459235 15967 -181580 50820 159945 -225616 73057
12614 58164 -79865 -45391 -335397 -67972 304566 -57226 143239 317100 170692 418742
12604 418742 165222 161853 194104 -84559 215300 28212 143730 76121 329886 111529 273493
12593 273493 116564 107351 223123 94564 8509 17444 32451 122364 -19213 133741 358567
12582 358567 193767 -407021 -53328 -272670 103664 47014 158288 -2232 -96435 298980
12571 -1852 228282 272106 54329 109106 264391 331226 200969 -37880 266454 -113309 -49293
12559 -90925 -251812 239398 341614 -149401 295099 17829 120230 -111851 -120109 176151
$$ packed form
12636d8338K0700J1196r051B53570j23109i1917G7473L99814j48225F1643J52131
12625B13774J35048j36018P2823J73608A5967a81580E0820J09125b25616G3057
12614E8164g9865L4474k90006f7972C04566e7226A43239J73861j46408K48050
12604D18742A65222l369L2251h4559B15300B8212J15518o7609K53765A11529J61964
12593B73493A16564r213J15772I4564H509Q935J5007Q9913a9213A33741K24826
12582C58567j64800d07021e3328k19342A03664D7014J11274b232r4203B98980
12571a852B28282M3824E4329N4777J55285O6835j30257c7880B66454a13309d9293
12559i0925j60887B39398J02216a49401B95099A7829J02401a11851q258A76151
$$ plain form
12548 22407 -179749 -115386 -82418 171332 -25201 -88066 -58739 67431 -65482 207129 262262
12537 262262 -122581 -20050 -112590 96462 93678 -240532 85422 -119759 161482 173357 25086
12525 157435 -33332 -173548 52016 -109329 -72672 17743 -136780 80621 -241028 -236816 -56097
12513 213072 23370 50647 -51299 30400 298301 13496 8579 63840 -159293 96836 145818
12502 145818 211285 495021 -199715 -322163 181797 118094 60380 151683 30699 -270510
12491 128788 272070 -266910 -41700 -34991 261128 249142 -68369 174062 27404 156088 259236
12480 259236 300869 12929 -168460 93072 166167 -35224 166701 89343 -21278 308629 -283460
12468 133890 -96855 -361446 150400 -125611 -19906 147737 245922 -86997 341584 -106173
$$ packed form
12548B2407a79749O4363L2968A71332b5201o2865K9327F7431f5482B07129N5133
12537B62262a22581b0050r2540I6462k784b40532H5422a19759A61482J1875B5086
12525A57435c3332j40216E2016a09329L6657A7743a36780H0621b41028M212e6097
12513B13072B3370K7277e1299C0400K67901A3496m917N5261a59293I6836M8982
12502A45818O5467K83736a99715j22448A81797o3703n7714R1303C0699b70510
12491A28788J43282b66910d1700O709B61128j1986f8369A74062B7404J28684J03148
12480B59236M1633A2929a68460I3072P3095c5224A66701p7358b1278C08629b83460
12468A33890i6855k64591A50400a25611a9906A47737R8185h6997C41584a06173
$$ plain form
12457 -18124 270249 206586 -12996 149706 -29975 136716 -44346 59802 321447 -41005 118201
12445 -27408 20477 52754 123252 99123 -92182 36366 167087 76321 63798 -322749 35974
12433 88257 -111718 68881 -148349 35483 190461 -61844 -196661 256037 -306089 -227024
12423 -227024 -81550 110818 44191 112532 -123690 267091 146819 -68333 -151403 89620 179044
12412 179044 116997 -37263 7409 -339914 -102735 242263 132921 189348 -37758 -288994 90333
12400 187815 -24064 -6180 81471 185194 187134 197698 -74143 -28053 -136154 -439512 140831
12388 4123 -60007 32533 8776 147489 -89945 -77594 -537816 94006 151446 216021 164958 -41044
12375 -102999 155020 -282982 7686 -226596 -153004 -305618 -28842 -179653 -83359 36308 4714
$$ packed form
12457a8124B70249o3663a2996A49706b9975A36716d4346E9802K61645d1005A18201
12445b7408B0477L2277P0498k4129i2182C6366J30721G6321j2523c22749C5974
12433H8257a11718F8881a48349C5483J54978f1844j34817B56037c06089P9065
12423b27024h1550A10818D4191O8341a23690B67091j20272f8333q3070H9620Q9424
12412A79044o2047c7263G409c39914a02735B42263j09342N6427c7758k51236I0333
12400A87815b4064f180H1471J03723J940J0564g4143b8053j08101l03358A40831
12388D123f0007C2533H776J38713h9945J2351m60222I4006N7440O4575n1063d1044
12375a02999A55020b82982G686b26596P3592j52614b8842j50811h3359C6308D714
$$ plain form
12363 5775 39860 9783 121609 -77490 -134445 -4028 37203 -440243 -4670 -69602 116040 130231
12351 130231 57881 -141798 -299053 -270659 -105386 199340 -216742 -266877 -46406 271490
12340 -32128 -270440 -190945 292677 -76052 -64748 164221 155864 -121757 140873 11859 115631
12329 115631 -110754 -123135 79266 -31436 -91455 49192 -5555 165026 -205744 97966 31414
12317 93539 155819 8978 297290 27894 -281621 112749 -77154 373474 135423 -25517 -31170
12306 -31170 -65661 -72197 65612 169802 -73581 -338529 116532 -132642 247107 205457 44710
12294 39173 9396 -45277 -177141 -285064 82758 -262684 346672 57530 159074 -2095 360062
12282 93719 -45736 9551 -40915 133865 196446 -142983 14967 159161 59182 311228 296672
$$ packed form
12363E775L4085I783J11826g7490n6955d028C7203d40243d670o4932A16040J4191
12351A30231E7881a41798j57255K8394a05386A99340b16742n0135d6406B71490
12340c2128k38312P9495B92677g6052J1304A64221q357a21757A40873A1859J03772
12329A15631a10754j2381G9266c1436o0019D9192e555A65026b05744I7966C1414
12317I3539O2280H978K88312B7894b81621A12749g7154C73474A35423b5517n653
12306c1170l4491o536F5612J04190g3581k64948A16532a32642B47107m1650D4710
12294C9173I396d5277j31864j07923H2758b62684C46672E7530J01544b095C60062
12282I3719d5736I551d0915A33865O2581a42983A4967J44194E9182K52046j4556
$$ plain form
12271 296672 132084 -137642 22422 151863 217998 -244353 153732 187319 155431 -113335
12260 -76923 334885 21401 266938 151894 -19622 191785 70053 239299 -98837 -30516 32919
12248 62124 27067 57669 -145028 175366 197448 464334 149807 -175680 330568 347314
12238 347314 320049 64115 -7639 231846 275368 182221 232262 -72702 128252 353300 208710
12227 208710 -274716 307979 99914 525140 276154 -36857 651781 656858 166851 380668
12217 380668 -66019 121150 -95490 422437 45470 216648 105262 -120697 -135673 319032
12206 -20699 502334 433173 77365 176878 195738 168781 354846 -93945 184725 183314 269468
12195 269468 -33832 236137 442074 419455 250779 -72640 -234611 345024 208920 122652
$$ packed form
12271B96672A32084a37642B2422J29441O6135b44353A53732L3587l1888a13335
12260g6923C34885B1401K45537j15044a9622A91785G0053J69246i8837c0516C2919
12248F2124B7067L0602a45028A75366K2082K66886A49807a75680C30568J6746
12238C47314k7265F4115g639B31846M3522r3147N0041g2702A28252K25048j44590
12227B08710b74716C07979I9914M25226k48986c6857F51781N077A66851K13817
12217C80668f6019A21150i5490D22437D5470J71178A05262a20697j4976C19032
12206b0699E02334o9161G7365R9513J8860k6957J86065i3945A84725j411Q6154
12195B69468c3832B36137K05937k2619j68676g2640j61971C45024j36104q6268
$$ plain form
12185 122652 -66759 -206574 -227776 -1150 237629 -40300 -45509 -73149 -16989 -11464 84887 -145952
12172 96903 143153 112470 -141316 106659 -122400 -115841 287184 200125 -92315 44200 85132
12161 85132 124213 -168458 169674 -40443 351837 168162 -175153 248941 -193019 59305
12150 291309 -80250 -69301 6340 -98112 135324 198877 211364 124495 -153467 -48995 -66817
12139 -66817 -141600 -13364 230463 282991 170027 -167707 -129836 27786 230457 -167548 312851
12127 238980 31348 -129174 -36006 3111 -19902 167825 -88226 -102513 -144751 87491 -37177
12115 39838 90869 36218 54950 30408 9245 124921 90313 -267387 190881 -206391 156253
12103 446282 -73402 -103891 -40050 80837 357207 -43152 167183 27415 315590 -319376 108457
$$ packed form
12185A22652f6759j39815k1202a150B37629d0300n209k7640a6989N525H4887a45952
12172I6903M6250l0683a41316A06659a22400O559B87184q7059i2315D4200M0932
12161H5132L9081a68458A69674d0443C51837A68162a75153B48941a93019E9305
12150B91309h0250J0949F340i8112A35324O3553J2487q6869a53467d8995j7822
12139f6817p4783a3364B30463N2528j12964a67707L7871B7786K02671a67548C12851
12127B38980C1348a29174c6006C111a9902A67825h8226j4287m2238H7491c7177
12115C9838N1031C6218J8732k4542I245J15676l4608b67387A90881b06391A56253
12103D46282g3402l0489d0050H0837K76370d3152A67183B7415K88175c19376A08457
$$ plain form
12091 -36184 116130 82476 -2905 -102611 -101716 -154283 -218856 -104045 -250825 -16897 -82675 24573
12078 -171970 -45615 -138244 172802 138540 -128746 -124258 -127628 14362 366579 1191966 1557440
12067 1557440 593481 113437 131606 276555 161614 -70474 93136 -3969 349307 152790
12056 152542 282166 -24614 -7632 59825 -91768 -42294 -509660 -94545 -50584 -85748 -274636
12045 -274636 123434 -6258 -194835 -2041 115236 -108417 11036 34282 73214 320135 -57164
12033 146350 331593 -162286 -27232 430380 -286974 161942 51989 157992 -240495 -73021
12022 12918 -385663 94450 -129613 -191886 -172714 89289 135704 304087 -36506 32267 130618
12011 130618 172299 -239187 -72390 293889 20334 130345 222786 91096 188331 138240 -118280
$$ packed form
12091c6184A16130l3654b905r9706Q95n2567o4573a04045j46780a6897o5778B4573
12078a71970d5615r2629A72802l4262a28746M488l370A4362L52217Q25387L65474
12067A557440E93481A13437J8169J44949j14941g0474I3136c969C49307A52790
12056A52542J29624b4614g632E9825i1768d2294m67366i4545M3961l5164j88888
12045b74636A23434f258j88577b041A15236a08417A1036K3246L8932K46921e7164
12033A46350J85243a62286b7232D30380b86974A61942E1989J06003b40495g3021
12022A2918c85663I4450a29613o2273J9172H9289M6415J68383c6506C2267R8351
12011A30618M1681b39187g2390B93889B0334J10011R2441I1096R7235n0091a18280
$$ plain form
11999 138709 -62074 -62563 -97528 -171417 -65975 302259 69656 -207145 -157371 227115 -2999
11987 -68609 -151265 -108118 132963 75672 6944 103833 -3157 52656 83398 158610 -8288 -83191
11975 -83191 -234366 -276630 -298528 53618 63122 -165976 104089 -82021 -47820 -154392 276569
11963 -161096 -23464 -348373 152927 -250928 -11901 -169312 -70331 -287330 232591 -63979
11952 -88717 110488 -404820 -142594 -42436 -51086 -47780 -140868 112852 70537 302934 -351
11940 54578 17201 -485316 -38979 -163931 69328 35175 29212 250561 -5400 319768 5657
11928 103899 13135 163971 -278969 -21898 -295638 -9657 -198861 -134583 198081 445487
11918 445487 -23671 -105105 -70512 178603 -387645 -207457 20597 311199 -11787 -89050 57054
$$ packed form
11999A38709f2074m89l4965p3889f5975C02259F9656b07145M9774B27115b999
11987f8609q2656M3147A32963n7291F944R6889c157E2656L0742P5212h288p4903
11975h3191j51175m2264k1898E3618R504a65976A04089h2021L4201j06572B76569
11963a61096b3464l24909A52927b50928a1901j57411g0331k16999B32591f3979
11952h8717A10488d04820a42594d2436q650L306r3088A12852m2315K32397c51
11940E4578A7201d85316c8979j24952F9328l4153n963K21349e400C19768E657
11928A03899A3135J50836b78969b1898k73740i657j89204O4278A98081K47406
11918D45487b3671q1434L4593A78603c87645J80188B0597K90602a1787p7263E7054
$$ plain form
11906 17183 -98130 79836 -147215 41401 31411 -76387 258327 -65826 39347 -82177 13184
11894 132001 52431 46356 -313300 -50054 54163 73219 265592 47444 -84457 107564 -214669
11882 -4925 -98493 -69699 149060 101364 -314693 6247 18984 -277894 -300271 -100504 -75639
11871 -75639 -27788 -260731 157360 138881 -126152 -31150 -124195 -152270 -285620 91581 81310
11860 81310 -27686 -26874 -226404 -223289 84082 -67137 386050 -64613 -191359 22069 -46798 185144
11847 -94207 220661 -99541 75118 -365021 -208928 89268 -109326 40893 -213996 -317367
11837 -317367 88530 -102268 -205253 -345102 23152 84608 24673 -382546 -314375 -117729
11826 194755 123044 -109484 -289949 381648 -367624 -460952 124005 -172444 -479007 -5603
$$ packed form
11906A7183i8130G9836a47215D1401r990g6387B58327f5826C9347h2177A3184
11894A32001E2431o075c13300e0054E4163J9056J92373D7444h4457A07564b14669
11882d925r3568K8794A49060m7696c14693F247J2737b77894k2377a00504K4865
11871g5639b7788k32943A57360j8479a26152c1150r3045k8075j33350I1581j0271
11860H1310b7686Q12j99530L115H4082f7137C86050f4613j26746B2069d6798A85144
11847i4207B20661i9541G5118c65021J56093H9268a09326D0893b13996j03371
11837c17367H8530a02268j02985j39849B3152O1456B4673c82546O8171a17729
11826A94755p1711a09484j80465C81648c67624r3328A24005a72444l06563e603
$$ plain form
11815 133695 29319 168019 -74125 -34660 -266064 15405 -240791 179310 50090 6852 256852
11804 256852 8500 -27626 -83841 -159697 -336449 1251 -161103 58421 5374 -234992 -338272
11793 -338272 -7536 167416 34355 116815 54701 -156879 93863 162517 222224 41117 11523
11781 -55064 -186185 94995 -144070 210177 169117 -13439 -125296 84460 224149 -207904
11770 17916 -41977 18090 111416 337560 133214 -96314 45201 47217 145763 266219 -160104
11758 98598 211956 -206061 113574 218395 -441489 -117456 160420 -102642 -367200 -122129
11747 376700 -66910 206997 151727 67049 -304907 -55415 -251242 276250 -50346 -184805
11737 -184805 263260 300705 -12070 -63585 -103031 -410688 -138973 -430120 110248 16468
$$ packed form
11815A33695B9319J38700g4125c4660k31404A5405b40791A79310E0090F852K50000
11804B56852H500b7626n6215p5856j76752A251a61103E8421E374b34992j03280
11793c38272g536A67416C4355Q2460E4701a56879I3863O8654N9707D1117A1523
11781e5064j31121I4995a44070B10177m1060a3439j11857H4460J39689b07904
11770A7916d1977A8090R3326K26144A33214i6314D5201K016R8546J20456a60104
11758I8598J13358b06061A13574J04821d41489a17456A60420a02642k64558a22129
11747C76700f6910B06997n5270F7049c04907e5415j95827B76250e0346j34459
11737a84805B63260L7445a2070n1515l9446l07657a38973k91147A10248A6468
$$ plain form
11726 -58646 -226886 -95655 104956 193988 -430664 -70314 162655 -401054 11568 85617 -127132
11714 -74387 225876 9950 172082 22496 63740 213049 -211550 10010 49327 -166568 13426
11702 -14609 -45406 -100888 -135065 -123496 89987 102492 170439 27032 239790 123138 240465
11691 240465 35573 -15357 -45254 -216179 2300 -81883 -56742 399048 97431 276523 -33374
11679 6171 171861 117674 96008 98196 73529 115147 80045 255859 -180976 161965 117049
11668 117049 -269854 81815 -265195 -402486 11474 -434363 162393 -137182 -94531 -29073
11657 192231 89659 370599 -203446 538114 -150204 84419 108018 289518 -9458 -162552
11647 -162552 169562 64309 395655 -252958 102426 -534926 -238946 -188209 91514 -98243
$$ packed form
11726e8646j68240i5655A04956Q9032d30664g0314A62655d01054A1568P4049a27132
11714g4387B25876I950J62132B2496M1244J49309b11550A0010L9317a66568A3426
11702a4609l0797n5482l4177J1569H9987J2505O7947B7032K12758j16652J17327
11691B40465C5573a5357k9897j70925B300h1883K5141C99048I7431J79092c3374
11679F171J65690n4187k1666K188k4667M1618l5102J75814a80976A61965m4916
11668A17049b69854H1815b65195j37291A1474d34363A62393a37182M2651b9073
11657A92231H9659K80940b03446E38114a50204H4419K3599J81500i458j53094
11647a62552A69562F4309L31346b52958A02426e34926b38946N0737I1514i8243
$$ plain form
11636 -57082 -398709 -206324 29656 72716 1901 47245 -178089 -68701 339268 187724 -60031
11624 19707 -72576 148185 3068 152637 -116616 -23180 147218 178285 -29282 -220959 136910
11612 -469371 -107140 108759 138818 -200627 255825 78319 197480 162772 -47411 -161922
11602 -161922 149863 204427 -126585 223921 144613 239643 160420 91730 -17928 13628 -106752
11590 5247 13481 253002 192866 62433 249100 111949 100197 66846 -234054 153942 167319
11579 167319 -80886 78680 -17885 -217579 26982 63498 -27529 63080 47591 27045 -45474
11567 -13101 189773 180143 67949 -45858 105072 192176 -3447 234908 67721 32362 -199538
11555 -152208 -25052 60138 -305947 -20911 256619 356037 58683 7133 74827 145461 119225
$$ packed form
11636e7082l41627J92385B9656M3060A901M5344a78089f8701C39268j51544f0031
11624A9707g2576A48185C068J49569a16616b3180A47218L1067b9282j91677A36910
11612d69371a07140A08759L0059b00627B55825G8319J19161l4708d7411j14511
11602a61922A49863N4564a26585B23921p9308R5030p9223o8690a7928A3628a06752
11590E247Q234K39521o0136F2433J86667A11949j1752l3351b34054A53942J3377
11579A67319h0886G8680a7885j99694B6982L6516b7529F3080j5489k0546d5474
11567a3101A89773r630F7949d5858A05072Q7104c447B34908F7721C2362a99538
11555a52208b5052F0138c05947b0911B56619R9418E8683G133O7694P0634k6236
$$ plain form
11544 119225 239331 131624 -105668 73048 97103 -15825 110308 237799 -167272 181034
11533 -165921 362041 -68252 -2871 -5663 3330 -322801 -187227 64853 -1465 -141324 40092
11521 319765 192890 163081 -8984 183779 88207 131710 324857 424379 -37316 261777 124711
11509 171812 52773 170266 11570 41238 54228 -182047 13293 -61875 139157 11457 104211
11498 104211 151567 -102453 168995 172656 16922 -82610 197980 453570 96282 328015 223891
11487 223891 148396 323356 106073 91956 245816 330325 315882 -37086 216145 86164 81624
11476 81624 249053 417755 9998 227751 103861 9503 192162 84235 368004 173619 85976
11464 149985 75962 107066 -3 199039 -236812 -115407 230035 -304668 242005 -91880 404003
$$ packed form
11544A19225J20106j07707a05668G3048K4055a5825A10308J27491a67272A81034
11533a65921C62041f8252b871k792C330c22801J35574F4853a465j39859D0092
11521C19765j26875k9809h984A83779H8207M3503J93147R9522c7316B61777A24711
11509A71812E2773J17493A1570K9668J2990a82047A3293f1875A39157A1457R2754
11498A04211M7356a02453A68995L661A6922h2610A97980K55590I6282K31733j04124
11487B23891p5495J74960A06073j4117J53860Q4509j4443c7086B16145H6164m540
11476H1624J67429J68702I998K17753A03861I503J82659H4235K83769A73619H5976
11464A49985p4023L1104cA99039b36812a15407B30035c04668B42005i1880D04003
$$ plain form
11452 182945 189196 982 279316 204172 32084 104595 321197 -103626 -233042 -66251 108947
11440 -60606 215427 -107662 -193651 208254 336247 391127 -234628 -38444 247776 47487
11429 -68136 31808 -216057 191362 -44429 166176 54713 416567 -91163 -237229 211883
11418 94312 -25158 -93350 102215 158526 153292 72054 -95731 -44316 21818 -188738 -69981
11406 -44972 -98405 311725 52195 402470 247751 -123241 -97878 47123 153252 -41064 -3369
11394 33740 -23791 227097 -179670 29636 59678 -252895 54118 262577 -1526 183896 -255300
11382 -533636 63599 32652 116321 100172 109938 -60664 242573 -183866 -114891 -450709 73282
11370 -59646 -210417 -52616 -10540 63989 261406 294319 70851 98196 4606 201909 -370361
$$ packed form
11452A82945O251I82K78334p5144C2084P2511K16602a03626j29416f6251A08947
11440f0606B15427a07662q5989B08254J27993N4880b34628c8444B47776D7487
11429f8136C1808b16057A91362d4429A66176E4713L61854i1163j46066B11883
11418I4312b5158o8192A02215N6311n234G2054i5731d4316B1818a88738f9981
11406d4972n3433C11725E2195L50275j54719a23241K5363D7123J06129d1064c369
11394C3740b3791B27097a79670B9636L0042b52895E4118K08459a526A83896b55300
11382e33636F3599l0947Q3669j6149R766f0664B42573a83866O8975l35818G3282
11370e9646j50771e2616a0540F3989J97417L2913G0851K7345D606J97303c70361
$$ plain form
11358 -113946 278344 85890 -160132 -194790 329502 249074 -105297 -7407 -19635 83318 -102879
11346 -116372 274683 172239 90705 21442 -72192 -343138 106760 234419 -67743 -261655
11336 -261655 -122183 -123340 351397 -132499 -1727 -240251 65086 76716 15321 -111690 29329
11324 -83663 -285191 -152002 -58702 -169402 -357702 130436 132199 161109 175819 101910 44372
11312 136550 133978 132516 -112638 -61655 -146773 291027 176124 -272575 20644 -25151 -154575
11301 -154575 70860 126129 -167076 -146594 -382979 -4898 148679 -63657 -151611 334060 -75199
11289 112429 62740 -264341 -234561 195102 -52368 -13130 -303867 65613 -91390 179830 -217727
11277 52414 385462 -173452 -9145 4978 -48320 -38792 177215 -66792 178579 -58354 78588
$$ packed form
11358a13946B78344H5890a60132l4658C29502q0428a05297g407j2228H3318a02879
11346a16372B74683j02444q1534B1442g2192k70946A06760J27659f7743j93912
11336b61655a22183j157C51397a32499a727k38524F5086J1630A5321a11690B9329
11324h3663k01528J33189e8702j10700j88300A30436J763K8910J4710p3909D4372
11312A36550k572j462a12638N0983q5118B91027j14903b72575B0644b5151j29424
11301a54575G0860N5269a67076K0482k36385d898A48679f3657q7954C34060g5199
11289A12429m9689b64341K9780A95102e2368a3130k90737F5613i1390A79830b17727
11277E2414L33048a73452i145D978d8320R528A77215f6792A78579e8354G8588
$$ plain form
11265 -58167 109641 -46411 -159617 -182196 -92119 79301 411 -105029 -71677 42172 209887
11254 209887 -314104 -198688 258993 -81618 -94720 27577 -15593 -124591 151567 -158386
11243 -169430 -8793 4515 179567 -146558 -37080 238764 -205921 -232450 -296905 -7236 24538
11231 438679 -150386 -29466 120552 101747 -100653 16049 98700 147401 -180528 -69810 -109002
11220 -109002 17656 296504 -76829 -59502 -175297 -313070 -105160 19659 -206685 -142211
11210 -142211 31943 -101147 -49131 -79520 47354 207958 -190354 127893 41266 2729 -49396
11198 -93574 12713 172533 184022 -49178 -62640 44644 -6214 82594 158651 -105254 -78491
11187 -78491 -165577 20104 -80854 80837 -235921 184700 -312504 -288626 -31968 -53728 198374
$$ packed form
11265e8167A09641d6411j13206k2579R0077G9301D11a05029L3352D2172J67715
11254B09887c14104J15416B58993h1618j3102B7577a5593j08998A51567a58386
11243a69430h793D515J75052a46558c7080B38764b05921k6529o4455g236B4538
11231D38679a50386b9466A20552j8805a00653A6049Q2651M8701a80528f9810l9192
11220a09002A7656K78848g6829J7327j15795j37773a05160A9659b06685O4474
11210a42211C1943a01147d9131l0389D7354J60604a90354A27893D1266B729d9396
11198i3574A2713J59820J1489d9178j3462D4644f214H2594P6057a05254K6763
11187g8491q7086B0104h0854H0837b35921A84700c12504K3878c1968k1760A98374
$$ plain form
11175 -189512 -180545 -230302 223506 -86864 -209917 -620963 58953 -26363 124845 67909 -21854
11163 114001 15245 281253 -47239 -245303 -131458 185361 -434544 -336815 -143343 -162095
11153 -162095 296145 133495 -165898 25501 -176154 -394232 -195263 -47559 70388 -156396
11142 89502 41586 -190256 -33415 -57005 94546 -263508 -316806 172859 -163532 25520 162909
11131 162909 -38370 31954 -152618 -34521 -113143 -16170 41862 -119300 418774 -127965 222749
11119 39694 249330 157573 185080 130057 90447 305287 76623 42349 57161 135057 237194
11108 237194 51312 -208139 4902 53338 -183213 116798 163743 -74855 46762 270281 140714
11097 140714 61941 -82235 280004 -177876 526267 283664 362028 174516 482882 207168
$$ packed form
11175a89512Q967m9757B23506h6864j23053m11046E8953b6363A24845n6936b1854
11163A14001A5245K66008d7239j98064J13845A85361d34544R7729a43343j8752
11153a62095B96145A33495a65898B5501a76154k18078a95263d7559G0388a56396
11142H9502D1586a90256c3415k3590I4546b63508n3298A72859a63532B5520J37389
11131A62909c8370C1954a52618c4521p8622a6170D1862a19300D18774a27965B22749
11119C9694K09636r1757K7507n5023l9610K14840G6623l4274J4812P7896J02137
11108B37194E1312b08139D902M8436a83213A16798M6945g4855D6762K23519j29567
11097A40714F1941h2235B80004a77876E26267k42603P8364A74516L08366B07168
$$ plain form
11086 105299 104151 56432 654 468368 282548 224362 6581 503685 245420 654977 302837
11074 168925 513081 440593 446083 374902 447534 338780 367893 226735 328897 296952 497303
11063 497303 116639 358993 272478 479686 891087 409276 799496 682861 427478 786558
11053 786558 435014 583970 860064 538960 692534 637085 614304 815681 659631 840250
11043 840250 699115 705755 771984 536242 718003 487662 777978 715924 792160 911356
11033 911356 638493 742436 747076 577864 635208 776423 748140 793587 658711 880980
11023 880980 475191 578949 705906 632329 612832 679886 650246 814254 670695 652077
11013 652077 670595 887006 787760 769683 525072 744468 711043 644081 730125 849947 458248
$$ packed form
11086A05299j148m7719F54M67714j85820n8186F581M97104B45420M09557C02837
11074A68925L44156p2488N490p1181P2632j08754K9113j41158J02162l1945K00351
11063D97303A16639K42354q6515K07208M11401D09276L90220j16635k55383L59080
11053G86558l51544J48956K76094l21104J53574n5449k2781K01377j56050J80619
11043H40250j41135O640O6229k35742J81761k30341K90316o2054P6236J19196
11033I11356k72863J03943M640j69212N7344J41215k8283M5447j34876K22269
11023H80980m05789J03758J26957p3577j9497O7054k9640J64008j43559j8618
11013F52077J8518K16411r9246j8077k44611K19396l3425o6962Q6044J19822l91699
$$ plain form
11002 458248 559357 552723 734681 1014596 931772 500289 616716 383394 562966 714254
10992 714254 687353 949086 641359 639915 790138 713251 677413 928514 849324 1131612 817552
10981 817552 1175740 1197897 1331051 1585708 2029852 1805277 2308709 2723347 2847875 3025586
10971 3025586 2716362 2881266 2443246 2498697 2073390 2177611 1791943 1751227 1600756 1820246
10961 1820246 1651801 1745239 1879389 1605526 1662380 1670378 1910408 1118238 1262061 911936
10951 911936 534825 769640 439207 415519 526009 398013 138419 581255 541626 335420
10941 335420 309782 194585 417206 288509 307877 179255 -175787 -19038 340399 49991
10930 10703 11035 -350600 -332435 -326342 34463 205106 77706 56784 39046 177328 145602 -50046
$$ packed form
11002D58248J01109o634J81958K79915q2824m31483J16427k33322J79572J51288
10992G14254k6901K61733l07727j444J50223p6887l5838K51101p9190K82288l14060
10981H17552L58188K2157J33154K54657M44144k24575N03432M14638J24528J77711
10971C025586l09224J64904m38020N5451m25307J04221l85668m0716j50471K19490
10961A820246j68445R3438J34150k73863N6854P998K40030p92170J43823l50125
10951I11936l77111K34815l30433k3688J10490j27996A38419M42836l9629k06206
10941C35420k5638j15197K22621j28697J9368j28622a75787a9038C40399D9991
10930A0703L32c50600J8165O093C4463J70643G7706k0922j7738J38282l1726e0046
$$ plain form
10917 233960 75348 -4435 -268082 -15874 -107376 303821 47177 -181168 110873 249213 13563
10905 -27674 -166344 36389 -91636 280531 24965 -136791 -93388 167961 -246089 -136970
10895 -136970 195245 -12669 -147085 53798 -145819 149282 -210992 42426 -517395 1440
10884 151784 95929 1004 -20422 -253969 154068 10010 -86617 -62813 465729 -326683 326990
10872 19988 21625 -30670 -108962 -182078 -146141 -173572 -272037 8717 -153156 -101271 -61316 -50376
10860 -50376 23318 -48417 -21398 -35139 254875 -331731 51993 -38484 -294879 294349 92351
10848 296952 15216 -313713 123137 -314042 185070 -35700 -102673 39259 71594 70468 -55052
10836 311593 -177461 73375 2369 -142183 -125929 -117249 220326 236084 -337595 -144341 329971
$$ packed form
10917B33960G5348d435k63647a5874r1502C03821D7177a81168A10873J38340A3563
10905b7674j38670C6389i1636B80531B4965a36791M3403A67961b46089J09119
10895a36970A95245a2669j34416E3798a45819A49282b10992D2426e17395A440
10884A51784n5855A004b0422k33547A54068A0010h6617K3804D65729c26683C26990
10872A9988J637c0670p8292p3116L5937k7431r8465H717a53156N1885L9955J0940
10860e0376B3318d8417b1398j3741B54875c31731E1993c8484k56395B94349I2351
10848B96952A5216c13713A23137c14042A85070c5700o6973C9259L2335j126e5052
10836C11593a77461G3375B369a42183J6254Q680B20326J5758c37595a44341C29971
$$ plain form
10824 -239006 34105 -30098 53900 2246 -111671 -45666 -46527 -521645 -203433 -108137 -208376
10813 -208376 -146519 84976 -257536 -101128 -316264 114043 55960 90199 -294587 -238525
10803 -238525 174037 -118267 160845 -78770 -49599 159358 73401 -59408 -170832 15202
10792 -130853 -130657 -76649 25903 -195389 157216 -31004 60587 -239401 56768 -265425 30434
10780 -416228 -126893 46096 -256854 143875 -174732 89194 -16285 -56186 19175 10935 88982
10769 88982 352587 -120728 -2293 -51285 9201 -167291 -124370 -321442 -168882 65636 205833
10758 205833 22861 70260 104298 155252 285933 108650 101534 -152639 184639 -179389 162070
10746 -21994 116760 -61136 33512 -203393 91532 -94938 81706 100472 239213 -151506 -66797
$$ packed form
10824b39006C4105c0098E3900B246a11671d5666q61m75118b03433R5296j00239
10813b08376O1857H4976b57536a01128k15136A14043E5960L4239b94587N6062
10803b38525A74037a18267A60845g8770K9171A59358G3401e9408j11424A5202
10792a30853J96N4008B5903a95389A57216c1004F0587b39401E6768b65425C0434
10780d16228a26893D6096b56854A43875a74732H9194a6285l9901A9175q240P8047
10769H8982K63605a20728b293m8992I201a67291M2921j97072J52560F5636J40197
10758B05833B2861M7399L4038N0954J30681A08650p116a52639A84639a79389A62070
10746b1994A16760f1136C3512b03393I1532i4938H1706J8766J38741a51506f6797
$$ plain form
10734 393404 -2390 -205948 -19101 -384964 427989 -99045 -137710 -176350 142195 -97994 -65437
10723 -65437 -116359 -16438 -41198 -9605 35056 123493 -336555 72978 137107 108511 -56191 -221890
10711 -221890 -71785 -86649 -329943 58953 202597 31856 -67139 -131565 36256 -43723 286286
10699 116276 -58663 125224 -106140 -235921 80167 -127156 -121016 315659 -152437 130228
10688 -136117 -298713 -236542 -93155 122584 3580 -223131 -401560 -75998 -294170 70046 78231
10677 78231 34035 83965 -380170 -221151 -151826 -497015 207662 23779 32962 -63143 -59824
10666 -59824 147606 -32047 121304 -304481 71647 78545 -91952 -63975 -380763 -92880 75448
10654 -143152 -129317 -50872 -100594 339301 -64956 65789 30592 -528801 117483 14554 28443
$$ packed form
10734C93404b390k03558a9101l65863D27989i9045l8665l8640A42195i7994L2557
10723f5437n0922a6438k4760i605C5056Q8437c36555G2978O4129k8596e6191j65699
10711b21890g1785j4864k43294E8953J43644C1856f7139o4426C6256d3723B86286
10699A16276e8663A25224a06140j29781H0167a27156O140C15659a52437A30228
10688a36117j62596O2171i3155A22584C580b23131j78429g5998k18172G0046Q185
10677G8231C4035M9930c80170J59019O9325l45189B07662B3779R183f3143L319
10666e9824A47606c2047A21304c04481G1647O898i1952K7977l16788i2880G5448
10654a43152J3835e0872m9722C39301f4956F5789C0592e28801A17483A4554J3889
$$ plain form
10643 28443 -212681 -25720 -14246 100824 14133 -108285 97205 -230982 -163003 5585 -238990
10631 174131 3388 16046 219832 -75959 -245010 228410 40820 246608 96047 -175610 27987
10619 65806 161660 59132 -274344 -266177 31416 -100715 233889 -121716 172978 86168 204499
10608 204499 290702 -38882 21723 -57242 -274472 2434 -131428 -93457 -354870 -115694 109714
10596 70813 -230481 8847 87490 -238748 -15614 -113243 -305153 -204731 72016 -142002 -32553
10584 -178666 -267847 3946 -71000 -133861 -248158 44528 -38961 -229338 27148 48927 -74256
10572 -93427 6312 14792 374336 115770 -17143 208663 52786 -144392 -213655 -279842 208901
10560 -6121 300386 84462 233975 -203696 -220631 -261398 -154336 151456 54867 114077 -22653
$$ packed form
10643B8443b12681b5720J1474A00824A4133a08285I7205b30982O7979E585b38990
10631A74131C388J2658K03786g5959j69051B28410D0820K05788I6047a75610B7987
10619F5806R5854E9132b74344Q167C1416a00715B33889a21716A72978H6168J18331
10608B04499Q6203c8882B1723e7242k17230B434a31428L7971k61413a15694A09714
10596G0813b30481H847P8643b38748a5614r7629j91910J00422G2016a42002c2553
10584a78666q9181C946g1000o2861j14297D4528c8961j90377B7148K1779g4256
10572i3427F312Q480L59544A15770a7143B08663E2786a44392o9263o6187B08901
10560f121C00386H4462J49513b03696j6935m0767J07062A51456E4867N9210b2653
$$ plain form
10548 99706 261022 -249359 62042 244521 95336 240410 -26307 -125737 48986 270102 -8360
10536 -109550 55667 -118778 222022 194816 169337 -315410 -142736 42674 -231610 -239829 -338723
10525 -338723 -47242 484403 125320 -365843 -137396 22459 33274 -314908 -42259 -174910
10515 -174910 -88514 105523 -171003 -32126 -16938 -60930 -87776 -689 92131 254850 -31051
10503 13693 -30463 -60969 138348 -129052 -82501 3568 -50161 36409 -75666 -164818 -246006
10492 -246006 196795 -200928 170807 -43459 31738 4146 281194 -197038 115720 445596
10482 445596 333948 457986 214135 417318 54256 36502 -80581 128756 -5787 -137083
10472 -137083 -79575 272266 -51129 9465 -172589 151730 -223314 -41603 -167906 4948 147027
$$ packed form
10548I9706J61316b49359F2042J82479I5336J45074b6307r9430D8986K21116h360
10536a09550E5667a18778B22022k7206k5479c15410a42736D2674b31610q219r8894
10525c38723d7242D84403A25320c65843a37396B2459J0815c14908d2259j32651
10515a74910Q6396A05523a71003c2126J5188m3992k6846f89I2131J62719c1051
10503A3693c0463l0506A38348a29052M6551C568e0161C6409g5666q9152q1188
10492b46006A96795b00928A70807d3459C1738D146K77048a97038A15720L29876
10482D45596j11648J24038B14135K03183E4256j7754h0581A28756e787j31296
10472a37083N7508B72266e1129I465a72589A51730b23314d1603j26303D948J42079
$$ plain form
10461 147027 90738 -139074 -336588 78330 -5714 -68816 -32311 -81787 -8926 -69045 -197365
10450 -197365 -67282 53522 -88174 15126 -38717 -201822 -58094 -239515 69634 -133377 -99587
10439 -99587 -18402 -31636 21731 216005 -156600 -78830 -323258 -338076 281864 -74806 32389
10427 184146 255378 -103506 -203002 -17401 17690 -224067 -276631 157620 92997 -293624 145348
10415 266706 126830 223686 85378 176980 -27421 104829 -110374 -1102 -205939 -180579 136326
10403 -61698 -161579 -101258 99005 -176188 112838 59531 -29161 -353676 139007 335506 -91417
10391 49119 86618 95288 -202309 -3107 113272 -179465 181417 74790 -116835 389016 476612
10380 476612 48562 87233 -152313 155846 147555 205834 318453 -52939 497809 112614 264381
$$ packed form
10461A47027n6289a39074j97514G8330e714o3102c2311m9476h926o0119j28320
10450a97365f7282E3522h8174A5126c8717j63105e8094j81421F9634a33377L3790
10439i9587a8402j3234B1731J94274a56600P7770k44428j4818B81864g4806C2389
10427A84146P1232a03506r9496a7401A7690b24067n2564A57620o4623b93624A45348
10415B66706A26830R6856H5378R1602b7421A04829a10374a102k04837K5360A36326
10403f1698r9881O0321I9005a76188A12838n3307b9161l24515A39007J96499i1417
10391D9119L7499Q670b02309c107A13272a79465A81417G4790a16835C89016Q7596
10380D76612D8562L8671a52313A55846q291N8279J12619e2939D97809A12614J51767
$$ plain form
10369 264381 38694 177322 371930 342048 331330 -40321 367663 383921 637951 421234
10359 421234 253999 125397 13201 420370 196767 330361 272116 515358 375361 675656
10349 675656 357365 194272 166771 293950 354855 546757 471047 544696 385855 430873
10339 430873 148006 198996 179029 150212 -24710 199261 80315 -120748 -53940 140731 -40125
10327 -72921 67712 88938 32489 390599 266158 65688 199613 258852 174029 -79650 -14360
10315 222059 339748 -93266 -189635 81831 -33030 79367 -348959 109806 1888 312007 -18395
10303 -122867 396106 118225 68075 -14361 36879 120214 -178742 -80168 -116972 -265683 173515
10291 -83494 179195 73174 228258 52642 -102032 -217300 -124586 181720 133069 -227805
$$ packed form
10369B64381C8694J38628J94608k9882j0718d0321C67663J6258K54030k16717
10359D21234j67235A25397A3201M07169A96767J33594n8245K43242j39997L00295
10349F75656l18291j63093k7501J27179O0905J91902p5710P3649j58841M5018
10339D30873A48006N0990j9967k8817b4710A99261H0315a20748e3940A40731d0125
10327g2921F7712K1226C2489L58110j24441F5688J33925N9239q4823g9650a4360
10315B22059J17689i3266r6369H1831c3030G9367c48959A09806A888L10119a8395
10303a22867C96106A18225n0150a4361C6879Q3335a78742h0168l6804j48711A73515
10291h3494A79195G3174J55084E2642a02032j15268R2714A81720m8651b27805
$$ plain form
10280 -238289 -31564 18247 -93454 14158 -253329 -283905 -222595 -135775 123960 -253461 -108626
10268 -128009 12013 11324 -354214 -15616 -9456 -274190 141130 177629 388168 159677 283716
10257 283716 372835 354826 271437 429814 -290786 157666 -241636 10653 -67941 -196604
10247 -196604 140124 -89872 99701 175939 -1966 205052 1673 -199810 -298721 -129751 287164
10235 -62862 -7572 302062 -125624 -272190 -118103 276608 15268 106289 86567 -69617 -312052
10224 -312052 -461218 -376795 -26392 -629610 288427 -81590 201709 250625 97414 -141940
10213 -17094 -7772 -287016 -170893 -623523 -290287 166861 -146324 52414 -104287 38563
10202 52238 -415688 59998 -215190 -192358 151224 22828 252990 -119274 226171 -312366
$$ packed form
10280b38289c1564A8247i3454A4158b53329l0576O1310Q6820A23960b53461a08626
10268a28009A2013o89c54214a5616O160k64734A41130L6499K10539A59677J24039
10257B83716Q9119j8009q3389J58377b90786A57666b41636A0653f7941j28663
10247a96604A40124h9872I9701P6238a966B05052A673a99810r8911a29751B87164
10235f2862g572C02062a25624j46566a18103B76608A5268R1021j9722f9617k42435
10224c12052j49166Q4423b6392o03218B88427h1590B01709M8916I7414a41940
10213a7094g772k79244J16123m52630b90287A66861a46324E2414a04287C8563
10202E2238d15688E9998b15190K2832A51224B2828K30162a19274B26171c12366
$$ plain form
10191 56851 -53888 92073 -211283 -123974 149867 -4691 121462 -102875 -238259 -144131 61955
10179 -94597 -69231 -74062 -448403 -125502 282600 -210184 -249389 -223995 -307881 7555 -40009
10167 228285 -235003 -63738 -190470 -39724 244981 235717 -205828 25832 -34895 327459 282440
10156 282440 -648475 24283 50452 -151495 -141685 -12471 -243523 238225 -96442 -192689 38788
10144 -52321 -100703 -67997 179059 -26969 -285011 -118949 -99900 -108166 -145767 -74390 71797
10132 -50027 6168 118476 53137 -225248 65001 -90029 -121423 -36141 -87058 -355935 -91074
10120 -74987 -65024 140631 -264298 -150932 -135887 218408 27155 -112238 -73204 -166893 -61734
10108 -144712 -48169 -34220 -293730 78610 -97491 50143 30381 -275259 -79048 -92063 120816
$$ packed form
10191E6851e3888I2073b11283Q7309A49867d691A21462a02875j35384R4128F1955
10179i4597K5366m831l74341a25502B82600b10184l9205K5394q3886G555d0009
10167B28285b35003f3738j26732c9724B44981r264b05828B5832c4895C27459m5019
10156B82440f48475B4283K6169a51495R810a2471k31052B38225i6442r6247C8788
10144e2321m8382L2706A79059b6969k58042a18949J9049q266l7601P1377G1797
10132e0027F168J12308E3137b25248F5001i0029l1394c6141n0917k68877i1074
10120g4987R963A40631b64298J13366J5045B18408B7155a12238L9034r3689f1734
10108a44712d8169J3949k59510G8610i7491E0143j9762b75259g9048j3015A20816
$$ plain form
10096 -100450 37523 -34860 -147394 -140041 149303 -47906 -360371 40293 -128048 -118489 -31302
10084 -274552 -163342 47549 -144967 -220588 -42103 -88446 57141 300614 -97267 -55741 -71166
10073 -71166 -226226 -85797 -61068 370661 42984 160611 -168027 -264604 116813 -26828 129923
10061 48864 15254 91439 65734 -479268 60825 -259443 334605 -185304 152271 -272317
10050 -168208 -173769 81514 -167495 138872 -165191 -183615 -2621 171442 -43025 59186 -293596
10038 231453 -213501 -35891 259531 -318031 60053 -39884 -92016 -190326 -50627 122554 20156
10026 -23497 -94773 -177451 -37672 -244860 -30901 -98560 -160157 -171177 -86340 -3574 35101 105297
10014 105297 -230115 -16820 -204759 -425391 109869 -426942 -257466 131982 243192 -98749
$$ packed form
10096a00450C7523c4860j12534P353A49303d7906l12465D0293a28048R559c1302
10084b74552J11210D7549a44967p5621d2103m6343E7141K43473i7267M1526j5425
10073g1166j55060h5797K4729C70661D2984J17627a68027r6577A16813b6828A29923
10061D8864A5254P6185k5705d79268F0825b59443C34605a85304A52271b72317
10050a68208n561H1514a67495A38872a65191j8424b621A71442d3025E9186b93596
10038B31453b13501c5891B59531c18031F0053c9884n2132r8310e0627A22554B0156
10026b3497p1276q2678c7672k07188c0901o7659o1597j1020Q4837c574C5101P0196
10014A05297b30115a6820j87939k20632A09869d26942J69476A31982J11210i8749
$$ plain form
10003 -81800 182640 110795 -296224 -347654 -159667 170075 -95371 78314 59503 -34223 57154
9991 209706 -173229 -46093 -215046 -174558 -491960 -230457 -289665 -94503 -128968 70438 47962
9980 47962 54971 -118123 68864 63608 -176664 137979 173943 -497215 167450 -117253 56860
9968 35513 -235798 -96999 -33018 -229772 214797 -20012 -9539 -222178 -369256 -57235 -145375
9957 -145375 -253299 -184826 210253 176905 112330 -192012 132043 54496 -89355 -272957 113488
9945 -167995 -55970 6655 -130130 -177666 -16800 293986 39868 -284244 40676 106746 -109755
9933 282631 43196 -457107 -291416 -29768 -271828 -245765 -304370 -185287 -33643 -49233 26428
9921 -230824 -117345 -401386 82701 -400815 -59699 49050 -344720 115294 57062 -301055
$$ packed form
10003h1800A82640p1845b96224n1430a59667A70075i5371G8314j8811c4223E7154
9991B09706a73229d6093j68953M0488l17402b30457n9208i4503l4465G0438k2476
9980D7962P009a18123F8864n256a76664A37979L5964d97215A67450a17253E6860
9968C5513b35798i6999c3018j96754B14797b0012i539k12639j47078e7235q8140
9957a45375j07924O8473B10253l3348o4575a92012A32043E4496h9355j83602A13488
9945a67995e5970F655a30130m7536a6800B93986C9868b84244D0676O6070a09755
9933B82631D3196d57107J65691b9768k42060K6063n8605J19083c3643j5590B6428
9921b30824J13479k84041H2701d00815e9699D9050c44720A15294E7062c01055
$$ plain form
9910 -237193 -50712 -39745 33174 -183805 -91463 -254340 41907 21170 -213254 -211261 148632
9898 -36165 -137429 -145720 -180333 -200524 -84157 -74455 -275986 103045 -332047 -133514 -549933
9887 -549933 -172303 -235238 129403 -384932 60561 -165208 -4282 128151 -56393 -16714 -172805
9876 -172805 -66358 -89070 28281 -220009 -13097 -287994 -164512 -215675 -86109 -6777 175055
9864 -122418 -39712 -20427 -101882 -105107 32069 -88252 -177384 158709 -246551 -372739 -13249
9852 -56722 119231 162559 44138 -418429 159581 -194503 -339609 -118475 -14721 88686 -45456
9840 152312 -144520 1742 -145092 -9386 -105995 -243415 -338446 -149399 -73707 -89065 227991
9828 -397011 4870 120023 -381832 -170939 -209218 18278 -117131 -201265 -173569 -136612 -263089
$$ packed form
9910b37193e0712J0967C3174a83805i1463j62877D1907k0737b13254J993A48632
9898c6165j01264q291l4613k0191h4157R702k01531A03045c32047a33514m16419
9887e49933a72303o2935A29403c84932F0561a65208d282A28151e6393a6714j56091
9876a72805f6358k2712B8281b20009a3097k74897J23482n1163h6109f777A75055
9864a22418c9712J9285q1455l225C2069h8252q9132A58709b46551j26188a3249
9852e6722A19231M3328D4138d18429A59581a94503j45106a18475a4721H8686d5456
9840A52312a44520A742a45092i386r6609j37420r5031a49399g3707j5358B27991
9828c97011D870J15153c81832a70939l8279A8278a17131q4134K7696L6957j26477
$$ plain form
9817 -263089 121439 415396 81709 80969 -20522 -336676 -353899 -55285 -168672 -302820 90438
9805 102613 -129832 -86487 85611 11114 157210 19798 277788 -24385 9738 -400740 -184055
9793 -133731 -283557 -316295 -101542 -23800 -185863 109935 173349 -375372 -83316 -15609 -48115
9782 -48115 -48329 -328332 -158976 112504 231971 -47956 -230937 -219433 199706 -33970 -179263
9771 -179263 105012 133374 119470 194595 -89783 -97339 248015 67553 -290954 160449 156402
9760 156402 -17509 -358797 74679 17404 6635 -328336 213485 -513819 58294 -101239 -4004
9748 -230228 85679 -8001 71025 320808 41301 -130736 -157143 -59710 -398968 -223728 -143250
9737 -143250 -225636 8000 64749 -279242 138863 189316 -116296 -6078 44738 39316 135446 -172889
$$ packed form
9817b63089A21439K93957H1709p40b0522l16154j7223e5285j13387j34148I0438
9805A02613a29832M3345H5611A1114J46096A9798K57990b4385I738d00740a84055
9793a33731j49826l2738a01542b3800j62063A09935O3414c75372h3316a5609l2506
9782d8115k14k80003a58976A12504J19467d7956j82981J1504A99706c3970j45293
9771a79263A05012K8362j3904P5125h9783p556B48015F7553b90954A60449m047
9760A56402a7509l41288G4679A7404F635c28336B13485e13819E8294a01239d004
9748b30228H5679h001G1025K49783D1301a30736k6407e9710l39258J75240Q0478
9737a43250q2386H000N6749b79242A38863N0453a16296f078D4738n422R6130a72889
$$ plain form
9724 63615 -186710 72916 52639 257046 291270 -215274 -32228 -191770 -78327 -43733 -58453
9713 -58453 -192445 -66625 64492 -153149 31805 -305778 101490 -95986 196762 184970 7481
9701 -116498 64904 -358204 -313319 -115940 -81138 97247 114824 -17309 25888 47581 -278687
9689 -194843 -304613 -105535 12771 96613 -92780 -155725 -166577 79369 -151857 -81371 -122304
9678 -122304 131041 -27638 -181032 -83577 -291176 20784 -310743 -91830 -86800 54531 -334936
9666 24801 183591 -309983 -438883 26906 -78878 253987 -25558 -200454 156405 -164110
9655 99765 -267199 -131888 -279675 -20047 172021 -445651 -307294 -100277 30193 -287268
9644 -86257 -134009 112487 43900 -385018 -109926 135988 -209387 74622 -170218 -110919 -209441
$$ packed form
9724F3615a86710G2916k0277K04407L4224b15274c2228j59542g8327L4594j4720
9713e8453j33992f6625F4492a53149C1805c05778A01490i5986A96762j1792G481
9701a16498F4904c58204M4885a15940L4802I7247J7577a7309B5888K1693b78687
9689a94843j09770a05535A2771Q3842i2780o2945j0852G9369a51857P0486m0933
9678a22304A31041b7638j53394h3577k07599B0784c10743i1830N030E4531c34936
9666B4801J58790c09983j28900B6906g8878B53987b5558j74896A56405a64110
9655I9765b67199a31888j47787b0047A72021d45651J38357a00277C0193b87268
9644h6257m7752A12487D3900c85018a09926A35988b09387G4622a70218N9299r8522
$$ plain form
9633 -209441 -176248 -13539 118234 -14706 44072 22911 -240175 -169410 -202800 163971 229098
9622 229098 -292801 -116643 260997 -103669 -14936 53116 219891 -197611 347529 38339
9611 -238559 -106929 -167317 -297578 -243498 -219446 -2847 18126 -165495 -15944 -46870 58148
9599 -291757 -168409 -72167 -42900 -154609 -17429 156150 -35673 -106248 -277463 -86063 347225
9587 -137028 71845 5862 -18031 -283567 -180345 224860 -122787 116190 -108731 -103930 -108683
9576 -108683 153533 260192 -84281 -108801 -170904 -24159 -89432 97368 -86668 -56117 -34952
9565 -34952 259525 -134485 -133761 -199014 143161 -168009 -319411 -280127 -139918 -92226 -41678
9553 -29543 -43524 469264 -306282 26987 -235741 228001 158282 186345 -343402 -169685 -120209
$$ packed form
9633b09441L3193a3539A18234a4706D4072k1161b40175P0765l3390A63971O5127
9622B29098b92801a16643B60997a03669a4936E3116J66775a97611C47529C8339
9611b38559a06929o0388j30261N4080K4052b847A8126a65495a5944l0926E8148
9599b91757J23348g2167K9267j11709a7429A56150c5673p0575j71215h6063C47225
9587a37028G1845E862a8031k65536J03222B24860a22787A16190a08731M801m753
9576a08683A53533J06659h4281k4520o2103b4159o5273I7368h6668L0551K1165
9565c4952B59525a34485P24o5253A43161a68009j51402L9284a39918M7692d1678
9553b9543j3981D69264c06282B6987b35741B28001o9719K8063c43402a69685M9476
$$ plain form
9542 -120209 148487 73659 -125807 224680 253421 -293471 -318959 -299247 251963 -110682
9531 357339 -32149 96723 -160015 -400723 114757 -265986 -239573 -202482 -139400 -131027 31322
9519 90199 -145443 41946 -57365 -288601 134687 -47070 90840 44912 479399 -149331 -102033
9508 -102033 -305153 -80409 -319355 -395668 -206799 83267 -349697 -179379 153699 -460939
9497 9402 -16674 -205459 -351831 214100 12817 101555 2906 -291725 -21252 -254874 -53697
9485 -79597 -299086 -151535 57814 -174830 -6300 -110072 -6077 123099 -31929 141627 -397766
9473 -291836 -207590 160492 14582 -239091 -170374 135551 106014 -76911 -4157 -147335 -53556
9461 -274794 -305446 56377 267978 52885 149288 54734 -437 102927 62820 282578 23417
$$ packed form
9542a20209A48487G3659a25807B24680K8741b93471k5488J9712B51963a10682
9531C57339c2149I6723a60015k40708A14757b65986K6413L7091O3082Q373C1322
9519I0199a45443D1946e7365k31236A34687d7070I0840D4912M34487a49331M7298
9508a02033k03120h0409k38946p6313J88869H3267c49697J70318A53699d60939
9497I402a6674j88785j46372B14100A2817Q8738B906b91725b1252k33622e3697
9485g9597k19489J47551E7814a74830f300j03772f077A23099c1929A41627c97766
9473b91836Q4246A60492A4582b39091O8717A35551k9537g6911d157j43178e3556
9461b74794l0652E6377K11601E2885R6403E4734d37A02927m0107K19758B3417
$$ plain form
9449 95437 -225387 -39243 88745 -151322 236382 25315 -317336 -9230 -86495 -430538 -197988
9437 69027 73982 49613 -94239 -539861 -346069 -103026 -66952 54565 -218259 -222443 -529093
9426 -529093 132825 68079 19715 310104 244260 -45536 -109208 -36708 44173 -382733 -277456
9415 -277456 -253724 204303 488820 134257 194257 -168078 -71619 -148513 -178695 -120633 149593
9403 91823 -201694 204242 -141830 -171163 -93308 44377 -26733 -20157 -29996 -268318 74810
9391 -94031 -49124 -32395 107602 121341 96847 9037 -133811 212014 163007 265914 -177835
9379 -111961 304751 -325892 77189 -39200 -56353 -340382 -25024 -230694 -203843 -380633 67359
9367 -146509 241284 -215789 -153023 32346 12396 -36038 32813 78104 195711 -127537 -36839
$$ packed form
9449I5437b25387c9243H8745a51322B36382B5315c17336i230p7265l44043a97988
9437F9027M955k4369i4239m45622J93792a03026L6074E4565b18259m184l06650
9426e29093A32825o4746A9715K90389o5844d5536o3672c6708D4173c82733J05277
9415b77456K3732B04303K84517A34257O0000a68078g1619p6894l0182N8062A49593
9403I1823b01694B04242a41830k9333P7855D4377b6733O576r839k38322G4810
9391i4031M4907J6729A07602J3739k4494I037a33811B12014m9007J02907a77835
9379a11961C04751c25892G7189c9200j7153k84029b5024k05670K6851j76790F7359
9367a46509B41284b15789O2766C2346A2396c6038C2813M5291J17607a27537c6839
$$ plain form
9355 -35335 8780 -526 71627 18763 107287 -62180 22929 136949 43318 121498 116289 -268854
9342 -163762 49283 -39480 -202232 -151904 -245405 198206 83449 -382700 -152358 85308 -133596
9330 180767 -70933 -61900 29520 401315 206176 64544 115102 115427 106591 -67934 25631 -217705
9317 -253929 61845 40612 164402 32593 167762 -202830 -421988 -4603 36629 133394 -164899
9305 -39824 -313435 -158209 -161836 -21637 65004 140466 -113758 229242 -251465 -269594 266306
9293 233790 -149467 84178 -36984 -32929 -67088 -164227 -142703 -317147 -147376 -120432 -88764
9282 -88764 -414506 -89308 -71851 273259 -473903 -67233 -236968 -62147 11496 -148373 -72233
9270 -168218 -218384 145434 37215 -27030 204679 -112454 159174 161282 -122697 -224963 -29957
$$ packed form
9355c5335H780e26G1627A8763Q8524f2180B2929J14020D3318P8180n209b68854
9342a63762D9283c9480j62752N0328r3501A98206H3449c82700a52358H5308a33596
9330A80767g0933R033B9520L71795j95139F4544N0558L25q836f7934B5631b17705
9317b53929F1845k1233J23790C2593J35169b02830k19158d603C6629R6765a64899
9305c9824k73611J55226l627b1637F5004P5462a13758B29242b51465j8129B66306
9293B33790a49467H4178c6984M055l4159r7139K1524j74444a47376K6944L1668
9282h8764l25742h9308J7457B73259d73903f7233j69735f2147A1496a48373g2233
9270a68218n0166A45434C7215b7030B04679a12454A59174K108a22697j02266b9957
$$ plain form
9258 194686 -220955 -88363 23104 27123 -95038 -231401 -99594 -98714 -49791 -337158 -40044 67069
9245 201900 -170072 82435 53392 127119 -60979 52959 29356 -37925 145072 -31687 -82070
9234 -82070 171530 -30290 273748 -27377 -259796 -378119 -296961 -391141 -171483 37795 -61226
9222 204618 21800 183900 85300 52933 52174 96086 -101889 -167417 -67798 -193816 270772
9210 10509 209777 -265895 -31023 -26644 -453180 243659 259189 43055 -187737 -99829 -272675
9199 -272675 -57493 168888 2515 106037 -59777 -103303 132957 -274711 -304434 -33594 27396
9187 72278 -202280 -136544 -235410 -173334 -167905 -129126 -173467 -266335 -274207 -58839 166771 -201814
9174 -172652 -64521 -145697 304567 -13977 29196 22769 -302080 -125663 -236923 86265 193078
$$ packed form
9258A94686b20955h8363B3104M019i5038j36363i9594Q80M8923k87367d0044F7069
9245B01900a70072H2435k9043P3727f0979E2959k3603c7925A45072c1687n0383
9234h2070A71530c0290B73748b7377k32419j18323Q1158r4180a71483C7795f1226
9222B04618B1800J62100H5300l2367p59M3912a01889o5528f7798j26018B70772
9210A0509J99268b65895c1023M379m26536B43659J5530D3055a87737Q7908j72846
9199b72675e7493A68888B515J03522e9777m3526A32957b74711k9723c3594B7396
9187G2278b02280O5736r8866O2076N429L8779m4341r2868p872e8839A66771b01814
9174a72652f4521q1176C04567a3977B9196o427c02080a25663j11260H6265J06813
$$ plain form
9163 193078 8769 121832 -36525 88766 149740 166614 -131157 -139072 127543 -184564 -240596
9152 -240596 -45988 -55478 -130814 -161192 64186 -123773 -129437 -154297 19645 5695 -244421 -14945
9139 -165773 97279 -142501 -72579 -84733 -29421 -54265 -104088 14578 -385318 114325 220340
9128 220340 198004 356048 167351 -232174 -299710 219558 -16018 -47215 -65605 143105 112734
9117 112734 -274136 -111462 132415 -42701 -45216 -21816 -215748 -420842 -283573 337407
9106 -30488 206530 -296529 -436618 -169385 -59722 -376386 81191 242262 -443618 -33357
9095 114482 -46840 -47736 -265384 -198712 9709 149028 -9626 -197434 79584 -84590 202634 -59683
9082 -18374 -323905 94012 -116155 195346 38989 50340 30720 -284059 43644 -179184 -53676
$$ packed form
9163A93078H769J13063c6525H8766O0974J6874a31157p915A27543a84564n6032
9152b40596d5988r490p5336l0378F4186a23773n664k4860A9645E695b44421a4945
9139a65773I7279a42501O9922j2154b9421k4844m9823A4578c85318A14325J06015
9128B20340k2336J58044A67351b32174o7536B19558a6018l1197j8390A43105l0371
9117A12734b74136a11462A32415d2701k515b1816j93932k05094J37269C37407
9106c0488B06530b96529j40089a69385e9722l16664H1191J61071d43618c3357
9095A14482d6840q96k17648O6672I709J39319i626j87808G9584h4590B02634e9683
9082a8374l05531I4012a16155A95346C8989J1351j9620b84059D3644a79184e3676
$$ plain form
9070 -45378 -426278 -244619 7890 62215 -154060 -461790 112020 -316950 -101977 56131 -102942
9058 28051 13067 -315321 53270 -324690 170047 -315913 -89618 -205335 -254337 165203 -451757
9046 -85961 -350389 -76531 -299005 -118716 266779 -47250 -13141 23098 -124778 -78086 -43836
9035 -43836 -515782 51164 117128 95710 -212534 67765 -300554 -206510 -43861 103592 -198722
9023 97236 8935 -123009 39318 119779 -159001 221443 -239230 -3005 -506442 113332 70220
9012 70220 -56879 -145886 -34426 -168736 -170467 -123028 152885 282991 69259 -184223 -58773
9000 12859 -16684 43171 109385 -16006 33968 283297 -194733 35262 -90420 47479 -62785
8988 -280610 -111565 293915 -85726 -270373 63021 263369 -167577 -114976 331505 98408
$$ packed form
9070d5378l80900J81659G890N4325a54060l07730A12020c16950a01977E6131a02942
9058B8051A3067c15321E3270c24690A70047c15913h9618j15717m9002A65203d51757
9046h5961k64428g6531k22474a18716B66779d7250a3141B3098a24778M6692L4250
9035d3836m71946E1164O5964k1418b12534F7765c00554R4044d3861A03592a98722
9023I7236H935a23009C9318Q0461a59001B21443b39230c005n03437A13332m3112
9012G0220e6879q9007c4426j34310j731M7439A52885J30106F9259a84223e8773
9000A2859a6684D3171O6214a6006C3968K49329a94733C5262i0420D7479f2785
8988b80610a11565B93915h5726j84647F3021K00348a67577N2601C31505I8408
$$ plain form
8977 -56863 26414 -54754 82840 -53194 -55612 -120233 20999 -47002 102222 -32921 -84993 182484
8964 -177465 -46933 -169269 -57967 -340504 -161207 88594 -53783 -66643 -82286 166427 1718
8952 243197 33538 -68871 -102139 -141398 92848 208430 -41914 -277035 119291 -148458 -264733
8941 -264733 -106488 55674 -104682 -6115 -274276 -32896 -195600 158314 -2276 -251373 -57058
8929 -107564 -16069 -146722 371631 374089 342130 1081174 4007364 12460270 6468696 1741183
8918 459379 262430 88814 207866 135024 63269 -136674 -297720 -129450 -28328 23825 469486
8907 469486 62746 -61144 9671 12424 -195064 -202 -33060 -175487 -7954 -91192 68409 -8773
8894 -68597 -371881 121036 297597 -148743 -38949 241225 114521 -397836 -412415 243524
$$ packed form
8977e6863B6414e4754H2840e3194k418o4621B0999d7002A02222c2921n2072A82484
8964a77465d6933j22336e7967k82537a61207H8594e3783j2860j5643A66427A718
8952B43197C3538f8871l3268l9259I2848J15582d1914k35121A19291a48458j16275
8941b64733a06488E5674a04682f115k68161c2896j62704A58314b276k49097e7058
8929a07564a6069j30653C71631K458l1959P39044K926190Q452906n991574A741183
8918D59379j96949H8814J19052p2842F3269a36674j61046a29450b8328B3825M45661
8907D69486F2746f1144I671K753a95064b02l2858j42427g954q3238F8409h773
8894f8597l03284A21036J76561a48743c8949B41225A14521c97836j4579B43524
$$ plain form
8883 -66862 -184380 5143 -314451 -189599 -178164 178731 119669 226093 -199275 -153380 -50272
8871 -211974 -170875 55962 119017 -296682 -40865 -185896 180453 -186890 -190404 66982 115675
8860 115675 -126665 -174662 -318854 -310683 -8406 -63548 -448187 202004 -97520 37947 -253799
8848 9767 -345516 -394104 -67028 102070 176012 -130089 -37953 113487 -120979 -77145 -225491
8837 -225491 -42400 257600 -9930 -225486 -170219 18273 -92683 -260349 148476 -144203 -194292
$$ packed form
8883f6862j17518E143c14451J24852J1435A78731n9062J06424a99275M5895e0272
8871b11974M1099E5962O3055b96682d0865j45031A80453a86890l514F6982M8693
8860A15675a26665m7997j44192Q171h406n5142l84639B02004i7520C7947b53799
8848I767c45516m8588f7028A02070P3942a30089c7953A13487a20979M3834j48346
8837b25491d2400B57600i930k15556N5267A8273i2683j67666A48476a44203n0089
$$ [...]
##END NTUPLES=NMR SPECTRUM
##END=
