
##TITLE=AC1233_PERAH12114_6519287_kQ2xMY586G
##JCAMPDX= 6.0         $$ Bruker NMR JCAMP-DX V2.0
##DATA TYPE= NMR SPECTRUM
##DATA CLASS= NTUPLES
##ORIGIN= BRUKER
##OWNER= Administrator
$$ 1.72 TOPSPIN		Version 2.1
$$ 2012-07-14 15:58:50.312 -0500  Administrator@TOPSPIN
$$ Compression mode = diff/dup
##.OBSERVE FREQUENCY= 400.02188249412
##.OBSERVE NUCLEUS= ^1H
##.ACQUISITION MODE= SIMULTANEOUS (DQD)
##.ACQUISITION SCHEME= undefined
##.AVERAGES= 64
##.DIGITISER RES= 22
##SPECTROMETER/DATA SYSTEM= spect
##.PULSE SEQUENCE= noesygpps1d.comp
##.SOLVENT NAME= COFFEE_meoh
##.SHIFT REFERENCE= INTERNAL, COFFEE_meoh, 1, 14.96059
##AUDIT TRAIL= $$ (NUMBER, WHEN, WHO, WHERE, PROCESS, VERSION, WHAT)
$$ ##TITLE= Audit trail, TOPSPIN		Version 2.1
$$ ##JCAMPDX= 5.01
$$ ##ORIGIN= Bruker BioSpin GmbH
$$ ##OWNER= Administrator
$$ $$ C:\Bruker\TOPSPIN/data/COFFEE/nmr/AC1233_PERAH12114_6519287_kQ2xMY586G/112/pdata/1/auditp.txt
$$ ##AUDIT TRAIL=  $$ (NUMBER, WHEN, WHO, WHERE, PROCESS, VERSION, WHAT)
(   1,<2012-07-14 15:58:45.250 -0500>,<Administrator>,<TOPSPIN>,<go>,<TOPSPIN 2.1>,
      <created by zg
	started at 2012-07-14 15:47:14.906 -0500,
	POWCHK enabled, PULCHK disabled,
       configuration hash MD5:
       6B 1B 68 BB D9 2E 58 E2 7F 35 AD 54 07 DF 0E 41
       data hash MD5: 64K
       4D 27 59 DE C6 D8 46 8C 34 C8 1A 08 D8 25 16 F7>)
(   2,<2012-07-14 15:58:48.281 -0500>,<Administrator>,<TOPSPIN>,<proc1d>,<TOPSPIN 2.1>,
      <Start of raw data processing
       efp LB = 0.3 FT_mod = 6 PKNL = 1 PHC0 = 0 PHC1 = 0 SI = 128K 
       data hash MD5: 128K
       CD 43 DC 00 07 B4 E4 ED AC 70 29 A3 C7 3D E8 53>)
(   3,<2012-07-14 15:58:49.421 -0500>,<Administrator>,<TOPSPIN>,<proc1d>,<TOPSPIN 2.1>,
      <pk PHC0 = -1.851196 PHC1 = 0 
       data hash MD5: 128K
       BF E8 0C 47 90 EB 7C F8 32 AD F7 4E 07 A2 15 30>)
(   4,<2012-07-14 15:58:49.937 -0500>,<Administrator>,<TOPSPIN>,<proc1d>,<TOPSPIN 2.1>,
      <abs ABSG = 1 
       data hash MD5: 128K
       E5 1A C6 12 88 E3 DA 97 D7 AC 08 26 F7 04 DD C9>)
(   5,<2012-07-14 15:58:50.015 -0500>,<Administrator>,<TOPSPIN>,<proc1d>,<TOPSPIN 2.1>,
      <abs ABSG = 2 
       data hash MD5: 128K
       E9 09 8A 90 29 D7 AF EF 07 D3 F6 E4 B2 9E 03 73>)
(   6,<2012-07-14 15:58:50.078 -0500>,<Administrator>,<TOPSPIN>,<proc1d>,<TOPSPIN 2.1>,
      <abs ABSG = 3 
       data hash MD5: 128K
       10 30 BE 74 81 5B FB C5 58 BF 43 08 8D 27 21 DE>)
(   7,<2012-07-14 15:58:50.140 -0500>,<Administrator>,<TOPSPIN>,<proc1d>,<TOPSPIN 2.1>,
      <abs ABSG = 4 
       data hash MD5: 128K
       1C 9F 52 BD 75 89 07 C6 C0 60 54 52 44 05 F0 F4>)
(   8,<2012-07-14 15:58:50.187 -0500>,<Administrator>,<TOPSPIN>,<proc1d>,<TOPSPIN 2.1>,
      <abs ABSG = 5 
       data hash MD5: 128K
       E5 2B E9 8C A5 33 E2 1A B3 CE B7 0B 58 9E 15 14>)
$$ ##END=
$$ 
$$ $$ hash MD5
$$ $$ 98 77 04 9F E6 E3 0A A9 34 B6 4C 21 99 4E 48 79
##$RELAX= 
##$RELAX= 
##$RELAX= 
##$RELAX= 
##$RELAX= 
##$RELAX= 
##$RELAX= 
##$RELAX= 
##$RELAX= 
$$ [...]
##$TP07= 0
##$TPNAME0= <>
##$TPNAME1= <>
##$TPNAME2= <>
##$TPNAME3= <>
##$TPNAME4= <>
##$TPNAME5= <>
##$TPNAME6= <>
##$TPNAME7= <>
##$TPOAL= (0..7)
0.5 0.5 0.5 0.5 0.5 0.5 0.5 0.5
##$TPOFFS= (0..7)
0 0 0 0 0 0 0 0
##$TUNHIN= 0
##$TUNHOUT= 0
##$TUNXOUT= 0
##$USERA1= <user>
##$USERA2= <user>
##$USERA3= <user>
##$USERA4= <user>
##$USERA5= <user>
##$V9= 5
##$VALIST= <valist>
##$VCLIST= <CCCCCCCCCCCCCCC>
##$VD= 0
##$VDLIST= <DDDDDDDDDDDDDDD>
##$VPLIST= <PPPPPPPPPPPPPPP>
##$VTLIST= <TTTTTTTTTTTTTTT>
##$WBST= 2048
##$WBSW= 25
##$XGAIN= (0..3)
0 0 0 0
##$XL= 0
##$YL= 0
##$YMAX_a= 10830755
##$YMIN_a= -8815554
##$ZGOPTNS= <>
##$ZL1= 120
##$ZL2= 120
##$ZL3= 120
##$ZL4= 120
##$ABSF1= 14.96059
##$ABSF2= -5.597591
##$ABSG= 5
##$ABSL= 3
##$ALPHA= 0
##$AQORDER= 0
##$ASSFAC= 0
##$ASSFACI= 0
##$ASSFACX= 0
##$ASSWID= 0
##$AUNMP= <proc_prof1d_extract.lims>
##$AXLEFT= 0
##$AXNAME= <>
##$AXNUC= <1H>
##$AXRIGHT= 0
##$AXTYPE= 0
##$AXUNIT= <>
##$AZFE= 0.1
##$AZFW= 0.1
##$BCFW= 0
##$BC_mod= 0
##$BYTORDP= 0
##$COROFFS= 0
##$CY= 15
##$DATMOD= 1
##$DC= 0
##$DFILT= <>
##$DTYPP= 0
##$F1P= 0
##$F2P= 0
##$FCOR= 0.5
##$FTSIZE= 131072
##$FT_mod= 6
##$GAMMA= 0
##$GB= 0
##$INTBC= 1
##$INTSCL= 1
##$ISEN= 128
##$LB= 0.3
##$LEV0= 0
##$LPBIN= 0
##$MAXI= 10000
##$MC2= 0
##$MEAN= 0
##$ME_mod= 0
##$MI= 0
##$NCOEF= 0
##$NC_proc= -2
##$NLEV= 6
##$NOISF1= 0
##$NOISF2= 0
##$NSP= 0
##$NTH_PI= 0
##$NZP= 0
##$OFFSET= 14.96059
##$PC= 1
##$PHC0= -1.851196
##$PHC1= 0
##$PH_mod= 1
##$PKNL= yes
##$PPARMOD= 0
##$PPDIAG= 0
##$PPIPTYP= 0
##$PPMPNUM= 2147483647
##$PPRESOL= 1
##$PSCAL= 4
##$PSIGN= 0
##$PYNMP= <proc.py>
##$REVERSE= no
##$SF= 400.020009800941
##$SI= 131072
##$SIGF1= 0
##$SIGF2= 0
##$SINO= 400
##$SIOLD= 131072
##$SPECTYP= <>
##$SREGLST= <1H.CDCl3>
##$SSB= 0
##$STSI= 131072
##$STSR= 0
##$SW_p= 8223.68421052631
##$SYMM= 0
##$S_DEV= 0
##$TDeff= 65536
##$TDoff= 0
##$TI= <>
##$TILT= no
##$TM1= 0
##$TM2= 0
##$TOPLEV= 0
##$USERP1= <user>
##$USERP2= <user>
##$USERP3= <user>
##$USERP4= <user>
##$USERP5= <user>
##$WDW= 1
##$XDIM= 131072
##$YMAX_p= 384206923
##$YMIN_p= -11653
##$CURPLOT= <Network HP LaserJet P1505>
##$CURPRIN= <$Network HP LaserJet P1505>
##$DFORMAT= <normdp>
##$LAYOUT= <+/1D_H.xwp>
##$LFORMAT= <normlp>
##$PFORMAT= <normpl>
##$SURQMSG= 1
$$ End of Bruker specific parameters
$$ ---------------------------------
##NTUPLES= NMR SPECTRUM
##VAR_NAME=  FREQUENCY,     SPECTRUM/REAL,   SPECTRUM/IMAG
##SYMBOL=    X,             R,               I
##VAR_TYPE=  INDEPENDENT,   DEPENDENT,       DEPENDENT
##VAR_FORM=  AFFN,          ASDF,            ASDF
##VAR_DIM=   131072,        131072,          131072
##UNITS=     HZ,            ARBITRARY UNITS, ARBITRARY UNITS
##FACTOR=    0.0627417313425164, 1,          1
##FIRST=     8223.62146879497, -2745,        -57134
##LAST=      0,             -1567,           -57931
##MIN=       0,             -11653,          0
##MAX=       8223.62146879497, 384206923,    0
$$ Real data points
##PAGE= N=1
##DATA TABLE= (X++(R..R)), XYDATA
$$ [...]
61743D31351j179j158j476k216k571k015j113p11q39j024j108j146q89q8R38J630
61727D16386J918K115K335K453K443K345K095J816J926K506K926K656K118K067
61713D48105K411K366J658Q07K06l73j195k032k499k560k484k482k486k225j560
61698D35657r28j012j774k226j698r42j219k485l400l130k289j789j615j239o84
61683D09227n06r81j815k536k788k362j361l17J49o5m45m64j88j45o13j182j247
61666C92361q70q02j435k111j856p26J47p6r37j287o40M32J092J082P78O50Q07
61649C86609J049J149J063Q63O72O72J049J717K249K280K020K039K464K682K106
61634D10683J038L44K57K3j057k570l466l307k602j956j507j272j411j775j763
$$ plain form
61743 431351 430172 429014 427538 425322 422751 420736 419623 418912 418073 417049 415941 414795 413906 413818 414756 416386
61727 416386 418304 420419 422754 425207 427650 429995 432090 433906 435832 438338 441264 443920 446038 448105
61713 448105 450516 452882 454540 455347 455553 455180 453985 451953 449454 446894 444410 441928 439442 437217 435657
61698 435657 434729 433717 431943 429717 428019 427077 425858 423373 419973 416843 414554 412765 411150 409911 409227
61683 409227 408721 407740 405925 403389 400601 398239 396878 396561 396710 396645 396200 395736 395548 395403 394790 393608 392361
61666 392361 391491 390689 389254 387143 385287 384561 384708 384632 383695 382408 381768 382200 383292 384374 385152 385802 386609
61649 386609 387658 388807 389870 390733 391405 392077 393126 394843 397092 399372 401392 403431 405895 408577 410683
61634 410683 411721 412065 412322 412345 411288 408718 405252 401945 399343 397387 395880 394608 393197 391422 389659
61619C89659j110m07k89m58k34K47J63p04j622k043k240k556k777k808l251m629
61603C64941o326p072o378m977l841l246k893k526k254k364k926l576l764l280
61589C09518k479j911j827k111k460k559k263j824j703k000k251j995j423j177
61575B81535j544k138k354j993j419j130j223j260p85P4O30L69m52j033q13%O66
61558B67130O93L58L54Q98J432J342O92K4l25l28M5P20J257J192O86K96J78J4
61540B76658k25j15M96J147J454J588J804J916J623R84K77k86n17k88J37K19j60
61523B86712n14m80l08k94k56K3K35m0o64j139j278j269j236j149j035r25p13
61506B75670l60q3j00l12m62m77m03k27N4K68J93k16p77j119q23O7P87N43m50
$$ plain form
61619 389659 388549 388142 387853 387395 387161 387408 387571 386867 385245 383202 380962 378406 375629 372821 369570 364941
61603 364941 358615 351543 345165 340188 336347 333101 330208 327682 325428 323064 320138 316562 312798 309518
61589 309518 307039 305128 303301 301190 298730 296171 293908 292084 290381 288381 286130 284135 282712 281535
61575 281535 279991 277853 275499 273506 272087 270957 269734 268474 267689 267763 268393 268762 268310 267277 266464 266464 267130
61558 267130 267823 268181 268535 269433 270865 272207 272899 272923 272598 272270 272315 273035 274292 275484 276170 276466 276644 276658
61540 276658 276433 276318 276814 277961 279415 281003 282807 284723 286346 287330 287607 287321 286804 286516 286653 286872 286712
61523 286712 286198 285718 285410 285116 284860 284883 285118 285078 284414 283275 281997 280728 279492 278343 277308 276383 275670
61506 275670 275310 275227 275127 274815 274353 273876 273473 273246 273300 273568 273761 273545 272768 271649 270826 270893 271680 272223 271773
61487B71773j180j107o39k10K91Q29P99Mo10j5J478K567K511J697Q85M94N72R31
61469B81070J229J298J186Q25j2j136j799j537p26O9P78J373J411P08l7j24O8
61452B84644k54q70p82K60J397J875J827J724J750J868J949J752J197O50M84O07
61436C00078Q74J541K649L345K873J915J829K557K602J303j47n10j19M3m9J79
61420C20963O93J013J224J773K445K439J584P09N86R81J110O57M4k10j02l9k43
61403C35627m88n36o55j313k333k819k170r30k06l89q49r03o12m52n76p61q51
61386C18784p62k01R96K187K264J105m7j77J07k87r72n43J083K221J783P57N60
61369C28858J044J185R15J008J590J909J528Q00K25L0L01R04J334J337J398K045
$$ plain form
61487 271773 270593 269486 268847 268637 268928 269757 270556 270560 269950 269935 271413 273980 276491 278188 279073 279567 280139 281070
61469 281070 282299 283597 284783 285608 285596 284460 282661 281124 280398 280467 281245 282618 284029 284737 284700 284576 284644
61452 284644 284390 283520 282738 282998 284395 286270 288097 289821 291571 293439 295388 297140 298337 298987 299471 300078
61436 300078 300952 302493 305142 308487 311360 313275 315104 317661 320263 321566 321419 320909 320790 320833 320784 320963
61420 320963 321656 322669 323893 325666 328111 330550 332134 332843 333429 334410 335520 336177 336221 336011 335909 335870 335627
61403 335627 335139 334603 333948 332635 330302 327483 325313 324383 324177 323788 322939 322036 321424 320972 320396 319635 318784
61386 318784 318022 317821 318817 321004 323268 324373 324326 324149 324256 323969 322997 322454 323537 325758 327541 328298 328858
61369 328858 329902 331087 332002 333010 334600 336509 338037 338837 339062 339092 339393 340297 341631 342968 344366 346411
61353C46411K938L417L657M367N557O528P000P307P458P010N969M986M458M228
61339D21291M261M742N324N235M418L709L533L299K521J644J228J015M81k64q01
61324D61636j100j337j396j202j117j381j518r05K27J012J099J012J364K167L027
61309D61588L668M125M650N533O890Q564J0224J1544J2319J2481J2104J1308J0085
61296E75083Q251N560K044j661m397n329m924m695n690p470q850r214q716p722
61282E22270o727o444p103p763p220n574m101l465k949j688P6J446J971J910J784
61267D76423K002K555K855K273J023J45M61J882L809N693P098P779P928P921P712
61252E37559P009O052N495N296M544K852J179O65J096J258M42r62k185k812k851
$$ plain form
61353 346411 349349 352766 356423 360790 366347 372875 379875 387182 394640 401650 407619 412605 417063 421291
61339 421291 425552 430294 435618 440853 445271 448980 452513 455812 458333 459977 461205 462220 462701 462437 461636
61324 461636 460536 459199 457803 456601 455484 454103 452585 451680 451907 452919 454018 455030 456394 458561 461588
61309 461588 465256 469381 474031 479564 486454 495018 505242 516786 529105 541586 553690 564998 575083
61296 575083 583334 588894 590938 589277 584880 579551 574627 569932 564242 556772 547922 538708 529992 522270
61282 522270 515543 509099 501996 494233 487013 481439 477338 473873 470924 469236 469312 470758 472729 474639 476423
61267 476423 478425 480980 483835 486108 487131 487276 487737 489619 493428 499121 506219 513998 521926 529847 537559
61252 537559 544568 550620 556115 561411 565955 568807 569986 570651 571747 573005 573447 572485 570300 567488 564637
61237E64637k567k233j904j490j140j245j871k485k496j865r50J5J074K358L886
61222E51724N396O349O427O070O076O559O802O336N645N409N477N204M462L742
61208F31678L317K813J786L78p81j252j162q97n63J10J269K723M283O014P898
61193F57614R589J0905J2220J3786J4955J4708J2931J0507Q206O162M432L312
61181G79327K759K153R96m93j716k308k362k352k850l964n037n369n156n206n792
61166G42630o388o593o668o997p632q503r568j0646j1493j2120j2522j2303j1208
61153F19989r862r171q992q321o808n131l731k279p69o9p18k089l298m319n458
61138E48974o432o652o082n288m816m815m963m565l213j416o1P79J825L365M836
$$ plain form
61237 564637 562070 559837 557933 556443 555303 554058 552187 549702 547206 545341 544391 544406 545480 547838 551724
61222 551724 557120 563469 569896 575966 582042 588601 595403 601739 607384 612793 618270 623474 627936 631678
61208 631678 634995 637808 639594 639972 639191 637939 636777 635880 635317 635427 636696 639419 643702 649716 657614
61193 657614 667203 678108 690328 704114 719069 733777 746708 757215 765421 771583 776015 779327
61181 779327 782086 784239 785235 784742 783026 780718 778356 776004 773154 769190 764153 758784 753628 748422 742630
61166 742630 736242 729649 722981 715984 708352 699849 690281 679635 668142 656022 643500 631197 619989
61153 619989 610127 600956 591964 583643 576835 571704 567973 565694 564925 564856 564138 562049 558751 554432 548974
61138 548974 542542 535890 529808 524520 519704 514889 509926 505361 502148 500732 500671 501450 503275 506640 511476
61123E11476N894O958Q421J0089J1744J3478J5163J6397J7327J8689K0688K2579
61111F78903K3694K4048K3757K2844K1882K1712K2116K1879K0599J9198J8137
61100I18769J6546J3887J1093Q984O805L501n20m219p541j0969j4174j6440j7829
61087I07893j8858j9568j9971k0702k2030k2848k1983k0014j8577j8202j8086
61076F87054j7689j7247j6717j5451j3228j0796r171q702q809q373o765m665l351
61063E46090k959k297p45Q12J511J871K708L748M348M688N211N720O077O919Q581
61048E92283J0188J0923J1338J2340J3758J5075J6595J8622K0458K1504K2446
61037G65530K4073K5890K7231K8591L0405L1883L2567L3795L6705M0091M2168
$$ plain form
61123 511476 517370 524328 532749 542838 554582 568060 583223 599620 616947 635636 656324 678903
61111 678903 702597 726645 750402 773246 795128 816840 838956 860835 881434 900632 918769
61100 918769 935315 949202 960295 969279 976084 979585 979065 974846 967305 956336 942162 925722 907893
61087 907893 889035 869467 849496 828794 806764 783916 761933 741919 723342 705140 687054
61076 687054 669365 652118 635401 619950 606722 595926 586755 578053 569244 560871 554106 549441 546090
61063 546090 543131 540834 540089 540901 542412 544283 546991 550739 555087 559775 564986 570706 576783 583702 592283
61048 592283 602471 613394 624732 637072 650830 665905 682500 701122 721580 743084 765530
61037 765530 789603 815493 842724 871315 901720 933603 966170 999965 1036670 1076761 1118929
61026A118929M3139M3908M3816M2257M1209M3195M7678N2457N7578O4631P2976
61015A671773Q0277Q6437R3657J03102J15196J32719J59473J95922K40361K94061
61005C172978L60524M40327N33242O45724P89005R69291J188959J455402J764179
60996A1319631K052890K187748K038465J592851R90237M27459L3809j61451j70705
60987B0310934r549K62570M98143N14978K23984k99557q77883j356757j673224
60978A7593639j832030j856999j775797j626015j448047j267764j093666r29167
60970E764154p79595o48212n34061m36388l56535k93971k44783k05550j75393
60961B089666j53012j35082j19104j05203r3727q3510p3673o4822n7134m9430
$$ plain form
61026 1118929 1162068 1205976 1249792 1292049 1333258 1376453 1424131 1476588 1534166 1598797 1671773
61015 1671773 1752050 1838487 1932144 2035246 2150442 2283161 2442634 2638556 2878917 3172978
61005 3172978 3533502 3973829 4507071 5152795 5941800 6911091 8100050 9555452 11319631
60996 11319631 13372521 15560269 17598734 19191585 20181822 20609281 20643090 20481639 20310934
60987 20310934 20301385 20563955 21062098 21577076 21801060 21501503 20623620 19266863 17593639
60978 17593639 15761609 13904610 12128813 10502798 9054751 7786987 6693321 5764154
60970 5764154 4984559 4336347 3802286 3365898 3009363 2715392 2470609 2265059 2089666
60961 2089666 1936654 1801572 1682468 1577265 1483538 1400028 1326355 1261533 1204399 1154969
60951A154969m1478l5212l2118l1025k9902k8425k7282k6242k4518k2177j9866
60940H36724j7794j5967j4749j4236j3733j2730j1811j1697j2052j2077j1718
60929F88160j1412j1069j0206q932p954p654p729p676p292o676o053n541n044
60916E84922m496m043l748l289k411j516j190j244r23l8R11J774K990M619O022
60901E78340O883P768R146J0543J1243J1315J1410J1910J2755J3735J4546J4835
60889G14429J4630J4488J4906J5713J6252J5999J4903J3405J2204J1668J1426
60878H70023J0805R709Q637P809O868N551M146L011K054R51n55k705n618q881
60864I11805j1590j3067j3353j2868j2095j1593j1860j2838j3939j4736j5245
$$ plain form
60951 1154969 1113491 1078279 1046161 1015136 985234 956809 929527 903285 878767 856590 836724
60940 836724 818930 802963 788214 773978 760245 747515 735704 724007 711955 699878 688160
60929 688160 676748 665679 655473 646541 638587 630933 623204 615528 608236 601560 595507 589966 584922
60916 584922 580426 576383 572635 569346 566935 565419 564229 562985 562062 562024 562935 564709 567699 572318 578340
60901 578340 585223 592991 602137 612680 623923 635238 646648 658558 671313 685048 699594 714429
60889 714429 729059 743547 758453 774166 790418 806417 821320 834725 846929 858597 870023
60878 870023 880828 890537 899174 906983 913851 919402 923548 926559 928613 929564 929009 926304 920686 911805
60864 911805 900215 887148 873795 860927 848832 837239 825379 812541 798602 783866 768621
60853G68621j5437j5036j4091j3225j2869j2740j2456j2252j2533j3098j3324
60842F21560j3021j2609j2455j2467j2362j2072j1790j1761j1967j2014j1485
60831D87557j0433r329q469p718p012o623o655o563n689m163k847k301k201j929
60817D05625j448j289j717k271k293j720r98l77K72Q10O36m18j438j279N4J497
60801C93646K266K454K285J623N21l55m35M9M41M71K73r3o70j255j504j347j044
60784C97326q02o78p43j083j582k000k296k686l286l857m032l723l267l148l508
60769C60635l908l662k577j248n00n24p98p70m12K0M10P18O74j5j128j939j977
60752C42999j488r56l98N15J758K793L155K876K296J703J341J440J987K501K332
$$ plain form
60853 768621 753184 738148 724057 710832 697963 685223 672767 660515 647982 634884 621560
60842 621560 608539 595930 583475 571008 558646 546574 534784 523023 511056 499042 487557
60831 487557 477124 467795 459326 451608 444596 437973 431318 424755 419066 414903 412056 409755 407554 405625
60817 405625 404177 402888 401171 398900 396607 394887 393889 393512 393784 394594 395230 394812 393374 392095 392149 393646
60801 393646 395912 398366 400651 402274 402795 402440 402005 402054 402495 402966 403239 403146 402476 401221 399717 398370 397326
60784 397326 396524 395846 395103 394020 392438 390438 388142 385456 382170 378313 374281 370558 367291 364143 360635
60769 360635 356727 353065 350488 349240 348740 348216 347418 346648 346236 346256 346666 347384 348058 348043 346915 344976 342999
60752 342999 341511 340555 340157 340672 342430 345223 348378 351254 353550 355253 356594 358034 360021 362522 364854
60737C64854J258k32j376j854k061k467k870k609j676j078j652k911l644l491
60723C38191l217l476l986m135l723k974k217j836j959k126j719r26o50j250k027
60708C01970k239k028j875j760j377p35q6M00N13K9p89j236j024o51n26m56l20
60691B87810m44p65m90O48J624J554J119J490K480L005K875K759K760K444K106
60676C10975K548L557L979L542L244L638L986L623K976K615K369K009J839J955
60662C52855J723Q11PJ91J058J590J336O53K9j55L54J297J850J552R57Q61J229
60645C68198J448J318J090P14j80j517k643l150l382l808m302m369l969l705m023
60630C37720m485m198k937j432m78k04l93r22j406j037M34J887J965Q27j26k39
$$ plain form
60737 364854 366112 365880 364504 362650 360589 358122 355252 352643 350967 349889 348237 345326 341682 338191
60723 338191 334974 331498 327512 323377 319654 316680 314463 312627 310668 308542 306823 305897 305247 303997 301970
60708 301970 299731 297703 295828 294068 292691 291956 291870 292270 292783 292812 292023 290787 289763 289112 288586 288130 287810
60691 287810 287366 286601 286111 286759 288383 289937 291056 292546 295026 298031 300906 303665 306425 308869 310975
60676 310975 313523 317080 321059 324601 327845 331483 335469 339092 342068 344683 347052 349061 350900 352855
60662 352855 354578 355389 355396 355587 356645 358235 359571 360224 360253 360098 360452 361749 363599 365151 366108 366969 368198
60645 368198 369646 370964 372054 372768 372588 371071 368428 365278 361896 358088 353786 349417 345448 341743 337720
60630 337720 333235 329037 326100 324668 324190 323986 323593 322671 321265 320228 320662 322549 324514 325341 325215 324976
60614C24976k21o88j148r40k70K79N52O09L56o1n9N64J137R94M22J72M13P74J097
60595C28958J521K028K418K615K649K472K063J523Q15j88j297j959k018j953k096
60580C37551k048j339j70R57J869K523K685K410K419L306M738O028P077Q159R137
60565C85302R764J0350J1193J1608J0531Q115N666L841J877r57m004n982o493
60552D40811o201n770n199m168k609q61O46J837L063M614O281P644Q725R953J1512
60537D70278J3079J4219J4702J4329J2911J0585P866N124K258q74l927o212p304
60524E47034p324o783o208n867n642n244m613l956l384k705j768p87r0L52Q90
60509D93905J695K587L405M222N082N843O607Q074J0906J4785J8606K1823K5061
$$ plain form
60614 324976 324755 324067 322919 321979 321709 321988 322540 323149 323505 323444 323385 323949 325086 326080 326502 326674 327087 327861 328958
60595 328958 330479 332507 334925 337540 340189 342661 344724 346247 347062 346874 345577 343618 341600 339647 337551
60580 337551 335503 334164 333994 334951 336820 339343 342028 344438 346857 350163 354901 360929 368006 376165 385302
60565 385302 395066 405416 416609 428217 438748 446863 452529 456370 458247 457290 453286 447304 440811
60552 440811 434610 428840 423641 419473 416864 416003 416649 418486 421549 426163 432444 440088 448813 458766 470278
60537 470278 483357 497576 512278 526607 539518 550103 557969 563093 565351 564477 560550 554338 547034
60524 547034 539710 532927 526719 520852 515210 509966 505353 501397 498013 495308 493540 492753 492663 493015 493905
60509 493905 495600 498187 501592 505814 510896 516739 523346 531420 542326 557111 575717 597540 622601
60496F22601K9014L3196L6464L8517M0097M1679M2591M1633L8039L1629K2637
60485A018097J1843N14j0240j9994k8632l5806m1068m4324m5695m5194m2914l9430
60473F77157l5639l2108k8880k5800k2779j9796j6922j4346j2159j0166q224o639
60461D43699n848n705n523m988m581m824n382n376m534l579l280l494l502l058
60447C80025k621k484k290j692j030r00j305j716j861j884j870j752j657j790
60433C55173j873j377m17J97P0k26j05J86J29j54j89J2O7j3J83P23J162J195J033
60414C55776J022J196J315J158P56M64P37J644K668L156K843J874N83n24q17o5
60398C73786J160J930J821J235R07J268K098K640K261J238O37J164K305K951K689
$$ plain form
60496 622601 651615 684811 721275 759792 799889 841568 884159 925792 963831 995460 1018097
60485 1018097 1029940 1030454 1020214 1000220 971588 935782 894714 850390 804695 759501 716587 677157
60473 677157 641518 609410 580530 554730 531951 512155 495233 480887 468728 458562 450338 443699
60461 443699 437851 432146 426623 421635 417054 412230 406848 401472 396938 393359 390079 386585 383083 380025
60447 380025 377404 374920 372630 370938 369908 369008 367703 365987 364126 362242 360372 358620 356963 355173
60433 355173 353300 351923 351506 351703 351773 351547 351442 351628 351757 351603 351414 351426 351493 351480 351663 352386 353548 354743 355776
60414 355776 356798 357994 359309 360467 361223 361687 362424 364068 366736 369892 372735 374609 375192 374668 373851 373786
60398 373786 374946 376876 378697 379932 380839 382107 384205 386845 389106 390344 390981 392145 394450 397401 400090
60383D00090K122K034K580L242L275K343R40J00M23J520K591L271L639L773L763
60368D35706L851M030L742K577J115M04O15R49Q74P30Q83J017O79O9j52M29J791
60351D59309L682N706P438Q710R641J0182R952Q779P131N641M287K472n0k606
60337E40274m152m365l982m029m776n587n825n595n426n516n647n652n556n295
60323D68871m799m357m405m851n001m409l379k401j525o37J08N80J160K382M176
60308D41513N984P597R347J1455J3771J6284J9274K2424K4291K3390J9813J5074
60296F30217J0286N080j267q245j4289j8288k0242k0522j9333j7122j4794j2951
60284D98530j1318r393p323n699m682l982l466l222l047k488j575r46j088j797
$$ plain form
60383 400090 402212 404246 406826 410068 413343 415686 416626 416726 417149 418669 421260 424531 428170 431943 435706
60368 435706 439557 443587 447329 449906 451021 451425 452040 452989 453863 454593 455476 456493 457172 457241 457089 457518 459309
60351 459309 462991 468697 476135 484845 494486 504668 514620 523399 530530 536171 540458 542930 542880 540274
60337 540274 536122 531757 527775 523746 518970 513383 507558 501963 496537 491021 485374 479722 474166 468871
60323 468871 464072 459715 455310 450459 445458 441049 437670 435269 433744 433107 433215 433795 434955 437337 441513
60308 441513 447497 455094 464441 475896 489667 505951 525225 547649 571940 595330 615143 630217
60296 630217 640503 645583 644316 636071 621782 603494 583252 562730 543397 526275 511481 498530
60284 498530 487212 477819 470496 464797 460115 456133 452667 449445 446398 443910 442335 441389 440301 438504
60270D38504k583l156l336l009k429k229k691l313l445l053k536k068j604j278
60256D01774j212j064m20L67L56p01j824j913j025j09K03J71L32Q46J417J695
60240C98893J596J347J197J068O75M7l33j31L91Q55J368K162K843K703J785R29
60224D17395O63O47N32O02J111J571J360P53O32J377K537L574M338M909N397N893
60208D53291O283O262N886N825O482P142O746N420M427M534N244N807O142O336
60194E35827O060N096L911L089K543J877J191R09J000Q84R3j337l062m611n538
60179E47932n689n375n059m904m799m672m573m532m433l995k928j415l91q15k424
60164D91928l747l713k784k103j969j836j490j386j771k126j791p84K68Q67J097
$$ plain form
60270 438504 435921 432765 429429 426420 423991 421762 419071 415758 412313 409260 406724 404656 403052 401774
60256 401774 400562 399498 399078 399445 399801 399100 397276 395363 394338 394229 394432 394603 394935 395781 397198 398893
60240 398893 400489 401836 403033 404101 404776 404823 404490 404359 404750 405605 406973 409135 411978 414681 416466 417395
60224 417395 418058 418705 419237 419839 420950 422521 423881 424634 425266 426643 429180 432754 437092 442001 447398 453291
60208 453291 459574 465836 471722 477547 484029 491171 497917 503337 507764 512298 517542 523349 529491 535827
60194 535827 541887 546983 550894 553983 556526 558403 559594 560503 561503 562387 562480 561143 558081 553470 547932
60179 547932 542243 536868 531809 526905 522106 517434 512861 508329 503896 499901 496973 495558 495167 494352 491928
60164 491928 488181 484468 481684 479581 477612 475776 474286 472900 471129 469003 467212 466428 466696 467563 468660
60149D68660J349J669J588Q22o5j47O85J578J904J984K266K539K543K880M313
60134D94568O408P719P425O099M780L878L145K227J042n8m62lN89M60j34o8J081
60117E38696K368K722K272J955K261K916L474L627L076J751K39n35k73L65N69
60102E65483J92m15j096j928k728l028k640j914j222n45J84P30Q70Q14R22J146
60086E54825J283J510K149K926L151K655J990J582J290Q91L72l90j580k790l228
60071E66636k957l128m465o156p046p264p818q949r821r755q922p858o900o152
60057D69445n573n027m584m502m651m300l062j606q01m84J23J090J771J945K070
60042D41854K412K844L494M692O016O394N543M527M341M657M485L601K625K040
$$ plain form
60149 468660 470009 471678 473266 474088 474023 473876 474561 476139 478043 480027 482293 484832 487375 490255 494568
60134 494568 500976 508695 516120 522219 526999 530877 534022 536249 537291 537233 536771 536768 537357 537817 537683 537615 538696
60117 538696 541064 543786 546058 548013 550274 553190 556664 560291 563367 565118 565357 564822 564549 564914 565483
60102 565483 565675 565260 564164 562236 559508 556480 553840 551926 550704 550159 550343 551073 551943 552757 553679 554825
60086 554825 556108 557618 559767 562693 565844 568499 570489 572071 573361 574252 574624 574234 572654 569864 566636
60071 566636 563679 560551 556086 549930 542884 535620 527802 518853 509032 499277 490355 482497 475597 469445
60057 469445 463872 458845 454261 449759 445108 440808 437746 436140 435339 434855 434978 436068 437839 439784 441854
60042 441854 444266 447110 450604 455296 461312 467706 473249 477776 482117 486774 491259 494860 497485 499525
60028D99525J711J267N24n18j782l192m699o192p386p973p879p258o362n555n225
60013D39006n344n225m247k750j769j847k543l099l144k707k023j480j331j347
59999D00150j086n71k65k89j95L05Q61J010P74N11M53O88J254K013K620K856K877
59982D13966K959L188L434L471L100K301J339N24j48r11j826k732l542m241m627
59967D16255m395l594k613j687o90M67J534K184K341K120J609Q79J10l81l22K48
59951D14065Q96J193J216J380J678J618J078O88R32J380J433J332J726K486K833
59936D35934K471J809J098J61r49j713j811j466j007n18n8K16K37L8l08n09p7
59919D33548R88J852J794J231J133J727K567L457M448N163N158M789M657M365
$$ plain form
60028 499525 501236 502503 503027 502509 500727 497535 492836 486644 479258 471285 463406 456148 449786 444231 439006
60013 439006 433662 428437 424190 421440 419671 417824 415281 412182 409038 406331 404308 402828 401497 400150
59999 400150 399064 398493 398228 397939 397744 398049 398910 399920 400694 401205 401658 402346 403600 405613 408233 411089 413966
59982 413966 416925 420113 423547 427018 430118 432419 433758 434282 434134 433223 431397 428665 425123 420882 416255
59967 416255 411860 408266 405653 403966 403276 403743 405277 407461 409802 411922 413531 414410 414520 414139 413817 414065
59951 414065 414961 416154 417370 418750 420428 422046 423124 423812 424744 426124 427557 428889 430615 433101 435934
59936 435934 438405 440214 441312 441473 440524 438811 437000 435534 434527 434009 433951 434167 434404 434442 434134 433625 433548
59919 433548 434536 436388 438182 439413 440546 442273 444840 448297 452745 457908 463066 467855 472512 476877
59905D76877L019R11n80r10r12j251j585j578j435j097k21O77M86n48o66R02K785
59888D74874L683M179N093N661M984M045M375N494N720M956M675N271N397M288
59874E42695K907K179J577L27j095j701j570j781k963m593n712n933n683n541
59860E13113n474m865l404j619l08K52L10J53P5N43J887L950O353Q825J0890J1614
59844E42295J0307P333L842Q58j004j415n71O26J326J533J615J293j27k548m898
59829E60465o239o545o359o162o132o066n512m421l523l592m452n267n635n705
59815D84855n375m273k719j774j889k172j579l20N11L73k41o35o68n65n17o54
59799D62358j183k112k981l185k659j933j359p10J53O08mj182j583p18M35P77
$$ plain form
59905 476877 479896 480807 480227 479317 478405 477154 475569 473991 472556 471459 471238 471915 472401 471853 471187 472089 474874
59888 474874 478557 482736 487829 493490 498474 502519 506894 512388 518108 523064 527739 533010 538407 542695
59874 542695 545602 547781 549358 549685 548590 546889 545319 543538 540575 535982 530270 524337 518654 513113
59860 513113 507639 502774 499370 497751 497443 497695 498005 498158 498233 498776 500663 504613 510966 519791 530681 542295
59844 542295 552602 559935 563777 564635 563631 562216 561645 562271 563597 565130 566745 568038 567911 565363 560465
59829 560465 554226 547681 541322 535160 529028 522962 517450 513029 509506 505914 501462 496195 490560 484855
59815 484855 479480 475207 472488 470714 468825 466653 465074 464754 465265 465638 465397 464762 464094 463529 463012 462358
59799 462358 461175 459063 456082 452897 450238 448305 446946 446236 446389 446997 446993 445811 444228 443510 443945 444722
59783D44722K90m35j112j622j637j190j014j563k062j484j49O31M01J5J38K74
59767D34203k43j108j425q28K65J215J630J456R96P56J043J646K062K028J791
59752D45487J874K493L282L733L881M244N043N836O073N723N082M402L910L820
59738E04883L924L541K362J093O74J119J609J613J343J157J075R52P20M23K18
59723E26706L17O57P42J97p05j335j381r69l30K19K72k27p24o65k41ql2P9M40
59704E23012Q08J144J618K031J891J210O76Q26J489K134K412K249J783J353J160
59689E45796R25K68n41p43j83L56K09k51k24K99M96j07r28j066m85j43r25k704
59671E40049m584n813o172n658m444l199k905l856n126n472m637l389k430j623
$$ plain form
59783 444722 445012 444577 443465 441843 440206 439016 438002 436439 434377 432893 432744 433375 433776 433791 433929 434203
59767 434203 433960 432852 431427 430599 430864 432079 433709 435165 436161 436917 437960 439606 441668 443696 445487
59752 445487 447361 449854 453136 456869 460750 464994 470037 475873 481946 487669 492751 497153 501063 504883
59738 504883 508807 512348 514710 515803 516477 517596 519205 520818 522161 523318 524393 525345 526065 526488 526706
59723 526706 527023 527680 528422 528619 527914 526579 525198 524229 523899 524118 524390 524163 523439 522774 522533 522525 522493 522572 523012
59704 523012 523820 524964 526582 528613 530504 531714 532390 533216 534705 536839 539251 541500 543283 544636 545796
59689 545796 546721 546989 546448 545705 545522 545878 546087 545836 545612 545911 546407 546300 545372 544306 543821 543678 542753 540049
59671 540049 535465 529652 523480 517822 513378 510179 507274 503418 498292 492820 488183 484794 482364 480741
59657D80741m47J089K183K078J128O91J561K876L194K510K239L047L770L125J556
59642E11341M55J20m05j735l296m211m226l717l218l042l056k803k100j287o97
59627D78123k54L9k45j313k515l061l093l341l935m232l801l007k552k785l406
59612D40622l622k880j697j271j898k328j283Q71K655L187K639J514L56j94LK05
59596D36879j89o19k85M26N58K76N13J143J012o3p82l79K25r0j080j797j975j976
59578D31797k024k140k394k669k590k081j588j436j358j050o62m59m21m84p43
59563D09698j159j455j538j576j521j059k58K82K63J58M68R97J198J000Q33J050
59547D07381J578K117K463K733L254M134N086N858O702Q147J0546J4002J8201
$$ plain form
59657 480741 480294 481383 483566 485644 486772 487463 489024 491900 495094 497604 499843 502890 506660 509785 511341
59642 511341 511796 511916 511511 509776 506480 502269 498043 494326 491108 488066 485010 482207 480107 478820 478123
59627 478123 477869 477908 477663 476350 473835 470774 467681 464340 460405 456173 452372 449365 446813 444028 440622
59612 440622 437000 434120 432423 431152 429254 426926 425643 426514 429169 432356 434995 436509 436865 436671 436674 436879
59596 436879 436690 436071 435786 436212 436770 437046 437559 438702 439714 439651 438869 438490 438715 438625 437545 435748 433773 431797
59578 431797 429773 427633 425239 422570 419980 417899 416311 414875 413517 412467 411805 411346 410925 410441 409698
59563 409698 408539 407084 405546 403970 402449 401390 401132 401414 401677 401835 402303 403300 404498 405498 406331 407381
59547 407381 408959 411076 413539 416272 419526 423660 428746 434604 441306 449453 459999 474001 492202
59534D92202K1720K2154J8003J0476K613l373p230r423r957q771o375l587j052
59521E17400P57J632J922K255K753K972K599J704L42j448l250m530n331o107o917
59506E06753p461p809q283q629q217p094o019n336m724m089l721l461k771j812
59492D27327j440j804k046j705j355j359j147l03O33J128J504K101K494K295K004
59477D28327K245K780L029L028L153L389L491L478L390L058K478J963J526P86
59463D66121k05o61j39Q53J725K573L530M185M312M417M884N299N341N616O747
59448E14598Q209Q954Q726P975O869N216L051O45j809m039n634o665p775r078
59434E29243r616q638o844n577n213n081m584l651k414j139j69O10J824L683N589
$$ plain form
59534 492202 513922 536076 554079 564555 567168 563795 556565 547142 537185 528414 522039 518452 517400
59521 517400 518157 519789 521711 523966 526719 529691 532290 533994 534336 532888 529638 525108 519777 513670 506753
59506 506753 499292 491483 483200 474571 466354 459260 453241 447905 443181 439092 435371 431910 429139 427327
59492 427327 425887 424083 422037 420332 418977 417618 416471 416168 416801 417929 419433 421534 424028 426323 428327
59477 428327 430572 433352 436381 439409 442562 445951 449442 452920 456310 459368 461846 463809 465335 466121
59463 466121 465916 465255 465116 465969 467694 470267 473797 477982 482294 486711 491595 496894 502235 507851 514598
59448 514598 522807 531761 540487 548462 555331 560547 563598 564243 562434 558395 552761 546096 538321 529243
59434 529243 519627 510989 504145 498568 493355 488274 483690 480039 477625 476486 476317 476927 478751 482434 488023
59419D88023P119Q744J0921J3225J5101J6706J8300J9757K1477K4472K8057K8607
59407G00509K2802J1800L50q044j3259j6146j6500j4236j0464o091r06M531P403
59394F61749M961k059r873j5446j8587k0307k0693j9303j6784j4740j3955j3465
59382E01498j1832q885n789l656k573k004j530r65j50Q84J800K254K371K604L152
59367D77179L684L685L083K504K715L692M517M496M089M216M896N340N291N441
59353E34828O313P530Q550R444J0564J2052J3895J5902J7355J7452J6473J5717
59341F86075J5927J6410J6262J5526J4521J2928J0348P252M365J670j213m028
59329G96043o182p757r407j1414j3470j5203j6281j6295j5165j3538j2238j1470
$$ plain form
59419 488023 495142 503886 514807 528032 543133 559839 578139 597896 619373 643845 671902 700509
59407 700509 723311 735111 735461 727417 714158 698012 681512 667276 656812 650721 649815 654346 661749
59394 661749 666710 664651 654778 639332 620745 600438 579745 560442 543658 528918 514963 501498
59382 501498 489666 480781 474992 471336 468763 466759 465229 464264 464114 464998 466798 469052 471423 474027 477179
59367 477179 480863 484548 487631 490135 492850 496542 501059 505555 509644 513860 518756 524096 529387 534828
59353 534828 541141 548671 557221 566665 577229 589281 603176 619078 636433 653885 670358 686075
59341 686075 702002 718412 734674 750200 764721 777649 787997 795249 799614 801284 800071 796043
59329 796043 789861 782104 772697 761283 747813 732610 716329 700034 684869 671331 659093 647623
59317F47623j0916j0346r676q837p968p344o710n316l077j053j05L09J222K708
59303E80514M180N637P583J0139J2991J5826J7804J7183J2768N706j255o370r857
59290F72849j2420j3937j3954j2598j0556q637p432o927o377n045l109j437n47
59277E69873k55j61j7L96J249K494L993N616P034P805P994Q266Q863R055Q155
59262F40360O627N428M705L807K225j64l372o994r926j1268j1297j0943j0556
59249E98632r892q931p940o988o101n502n081m110k255l76N65Q63J398K201K703
59234E49186K981L496L961L687K854K213J824J231O56O72Q94L52r76k316l622
59219E67093n373o905o747m972l554l729m530m607m099l743l364k457j341o71
$$ plain form
59317 647623 636707 626361 616685 607848 599880 592536 585826 580510 577433 576380 576275 576584 577806 580514
59303 580514 584694 590331 597914 608053 621044 636870 654674 671857 684625 690331 689076 682706 672849
59290 672849 660429 646492 632538 619940 609384 600747 593315 586388 580011 574966 571857 570420 569873
59277 569873 569618 569457 569440 569836 571085 573579 577572 583188 590222 598027 606021 614287 623150 632205 640360
59262 640360 646987 652415 657120 660927 663152 662988 659616 652622 642696 631428 620131 609188 598632
59249 598632 588740 579809 571869 564881 558780 553278 548197 544087 541832 541456 542021 542884 544282 546483 549186
59234 549186 552167 555663 559624 563311 566165 568378 570202 571433 572089 572761 573655 574007 573031 570715 567093
59219 567093 561720 554815 548068 543096 539542 535813 531283 526676 522577 518834 515470 513013 511672 511001
59205E11001l38J75P48P86J71n68q44m24N20J501K084K351K706L186L400L185
59189E29640K811K496K295K469L237M155M473M220M105M241L857K602J230N78
59175E72409N92Q08J106J499J763J767J728J804J892K113K853M061N091N615O071
59160F11172O812P399P274O606N893N104L796J889k02k095l729n151o336p138
59146F31294p431p232o777o289n772n140m444l792l245k905k960l278l424l311
59132E65294l478m204m805m471l437k593k216j895j497j248r38N8J742L240L818
59117E43370L577L100K906L331M433N810O901P430P425O994O463O258O317O067
59103F20382N464N346O101O752O295N185M389L667K170J91j154j717k237k670
$$ plain form
59205 511001 510663 510838 511586 512372 512543 511975 511131 510707 511227 512728 514812 517163 519869 523055 526455 529640
59189 529640 532451 534947 537242 539711 542948 547103 551576 555796 559901 564142 567999 570601 571831 572409
59175 572409 573001 573809 574915 576414 578177 579944 581672 583476 585368 587481 590334 594395 599486 605101 611172
59160 611172 617984 625383 632657 639263 645156 650260 654056 655945 655743 653648 649919 644768 638432 631294
59146 631294 623863 616631 609854 603565 597793 592653 588209 584417 581172 578267 575307 572029 568605 565294
59132 565294 561816 557612 552807 548336 544899 542306 540090 538195 536698 535450 534512 534570 536312 539552 543370
59117 543370 546947 550047 552953 556284 560717 566527 573428 580858 588283 595277 601740 607998 614315 620382
59103 620382 625846 631192 637293 644045 650340 655525 659914 663581 665751 665942 664788 663071 660834 658164
59089F58164k197q93J18L30K22j34j243k814l719l760m017m978n858o226o809
59074F16186p943q687q372p763p690p619o682n208m217l996m116m321m597m754
59060E30221m585m176l648l051k704l017l714l898l198k254j776j788j980k132
59046D88300j979j387p84o89q26n58j22l21r73r96k14L02J09K00J269K465K720
59029D86516K301K183K764L880N334O682P283P175P250Q052R138R977J0661J1264
59015E80460J1402J0858R916Q640O732M339K069Mk230m153m543l270j722q03R3
59000F17792J481K613K887L052L899M764M602L633K909K839L037L061K515J131
58986F60215o20j765k231l027m566n831n939n380m874m095k530o06J001K379L811
$$ plain form
59089 658164 655967 655074 655192 655522 655744 655610 654367 651553 647834 644074 640057 635079 629221 622995 616186
59074 616186 608243 599556 591184 583421 575731 568112 561430 556222 552005 548009 543893 539572 534975 530221
59060 530221 525636 521460 517812 514761 512057 509040 505326 501428 498230 495976 494200 492412 490432 488300
59046 488300 486321 484934 484150 483461 482635 482077 481955 481634 480661 479665 479451 479753 479862 480062 481331 483796 486516
59029 486516 488817 491000 493764 497644 502978 509660 516943 524118 531368 539420 548558 558535 569196 580460
59015 580460 591862 602720 612636 621276 628008 632347 634416 634420 632190 628037 623494 620224 618502 617699 617792
59000 617792 619273 621886 624773 627825 631724 636488 641090 644723 647632 650471 653508 656569 659084 660215
58986 660215 659595 657830 655599 652572 648006 642175 636236 630856 625982 621887 619357 618751 619752 622131 625942
58971F25942N088O151P513R158R975R314Q217Q136R157J0337J0979J0793R691
58958G40451Q246P466P319O447M093J190j286l742o673r259j0605j1323j2468
58945G19856j3742j4118j3520j2602j1606j0550r798r313q185o074m222l818m194
58932E98114l981l174k693k653k530k379k527k531j831q79n07o58q44j142j614
58917E68171j614q74l98r63j660j351n79m24l86P07K422L310L338L727M731N508
58901E83665O068P369R420J0996J1503J1578J1666J1388J0582R717R085Q711R037
58888G10785J0595J2966J5108J6641J7843J8633J8726J8451J8244J7510J5369
58877H90871J2233R319O755L620k41l937p092j0151j2993j4635j4803j4469j4378
$$ plain form
58971 625942 631030 637181 644694 653852 663827 673141 681358 689494 698651 708988 719967 730760 740451
58958 740451 748697 756163 763482 769929 774022 775212 773926 770184 763511 754252 743647 732324 719856
58945 719856 706114 691996 678476 665874 654268 643718 633920 624607 616422 610348 606126 602308 598114
58932 598114 594133 590959 588266 585613 583083 580704 578177 575646 573815 572936 572429 571771 570927 569785 568171
58917 568171 566557 565683 565285 564322 562662 561311 560732 560308 559922 560629 563051 566361 569699 573426 578157 583665
58901 583665 589733 597102 606522 617518 629021 640599 652265 663653 674235 683952 693037 701748 710785
58888 710785 721380 734346 749454 766095 783938 802571 821297 839748 857992 875502 890871
58877 890871 903104 912423 919178 922798 922557 918620 911528 901377 888384 873749 858946 844477 830099
58864H30099j4131j3186j1828j0608r534q326p124o562p245r011j0655j0902r958
58851G01029r403j0089j1048j1060j0322r627q897p832p013p015p077o170m807
58838E90669m282m677n067n251n694o108n723m764m126l792l049k075j788k186
58824E32087k301j770j104m88L73J318J894K336L084L637L237K413K416L266L873
58809E54271L898L973M194L966L285K665J878K69j677k675k534k250k187j826
58795E65250j316j615k874m205n209o201o834o175m449l103k741k471j628o50
58781E15779J46J123K239K821K929L573N001O028N588L864J498j138l471m695
58767E41285m776m572m613m694m731n007n327n010l979k903k154j544j084r46
$$ plain form
58864 830099 815968 802782 790954 780346 770812 762486 755362 748800 741555 732544 721889 710987 701029
58851 701029 691626 681537 670489 659429 649107 639480 630583 622751 615738 608723 601646 595476 590669
58838 590669 586387 581710 576643 571392 565698 559590 553867 549103 544977 541185 538136 536061 534273 532087
58824 532087 529786 528016 526912 526424 526797 528115 530009 532345 535429 539066 542303 544716 547132 550398 554271
58809 554271 558169 562142 566336 570302 573587 576252 578130 578399 576722 574047 571513 569263 567076 565250
58795 565250 563934 562319 559445 555240 550031 543830 536996 530821 526372 523269 520528 518057 516429 515779
58781 515779 515925 517048 519287 522108 525037 528610 533611 539639 545227 549091 550589 549451 545980 541285
58767 541285 536509 531937 527324 522630 517899 512892 507565 502555 498576 495673 493519 491975 490891 489945
58753D89945p55m5P32Q48P13J271K227K385J739J522K109K510K250K115K654L380
58737E15600L892M418M920M948M685M864N399N435M933M780N097M945M089L551
58723E81556L913M407M195L456K705K192K180K850L726M322N207P148R287R804
58709F46948Q451O790N770M720L098J517M46o16k174m136o576r747j3064j5321
58695F26106j6274j6738j7037j6719j5815j4902j3782j1733r168p420o685n866
58683D73967m653m018m358m840m936m973m871m070k947k555k652j815J24J630
58669D29033J843J623J799K236L027M724O891Q242Q665R260J0014R487P272M642
58655E08758K349j52k692l966l845l907m808n310m738m184m239l813k417j442
$$ plain form
58753 489945 489190 489145 489877 490725 491438 492709 494936 497321 499060 500582 502691 505201 507451 509566 512220 515600
58737 515600 519492 523910 528830 533778 538463 543327 548726 554161 559094 563874 568971 573916 578005 581556
58723 581556 585469 589876 594071 597527 600232 602424 604604 607454 611180 615502 620709 627857 637144 646948
58709 646948 655399 662189 667959 672679 675777 677294 677740 677124 674950 670814 664238 654491 641427 626106
58695 626106 609832 593094 576057 559338 543523 528621 514839 503106 493938 486518 479833 473967
58683 473967 469314 465296 460938 456098 451162 446189 441318 437248 434301 431746 429094 427279 427403 429033
58669 429033 430876 432499 434298 436534 439561 444285 451176 459418 468083 477343 487357 496844 504116 508758
58655 508758 511107 510955 508263 504297 500452 496545 491737 486427 481689 477505 473266 469453 467036 465594
58641D65594j879k735k945k932l056k487r67J97J98R8Q35J693J922K063K337J692
58625D59628j87j640j262J44J163J622J669Q25o27j069J62J562J965K381L867
58610D70203N334N358M588M477M802M329K944J516M30l38n39k06q5o18j355j990
58594D98850k775l439l159k173j698j694p09J436K954L082L421N111O976P921
58580E14104Q883J0715J2255J2348J1890J1922J1608R998Q142P443P399O873O323
58567F39903O872Q310R711J1011J2560J4251J6168J8875K1995K4080K4779K5359
58555H33874K6064K5053K1267J6219J1600P162K499j320l630n527p631q570p524
58542I09536o248o562p827q769r810j1701j3764j5435j7553k0255k1724k0959
$$ plain form
58641 465594 463715 460980 458035 455103 452047 449560 448593 448790 448988 449086 449921 451614 453536 455599 457936 459628
58625 459628 459441 457801 456539 456683 457846 459468 461137 461962 461335 460266 460428 461990 463955 466336 470203
58610 470203 475537 480895 485483 489960 494762 499091 502035 503551 503981 503643 503104 502898 502813 502195 500840 498850
58594 498850 496075 492636 489477 487304 485606 483912 483203 484639 487593 490675 494096 499207 506183 514104
58580 514104 522987 533702 545957 558305 570195 582117 593725 603723 611865 619308 626707 633580 639903
58567 639903 646775 655085 664796 675807 688367 702618 718786 737661 759656 783736 808515 833874
58555 833874 859938 884991 906258 922477 934077 941239 943738 942418 938788 933261 925630 917060 909536
58542 909536 903288 896726 888899 880130 870320 858619 844855 829420 811867 791612 769888 748929
58530G48929j9562j8836j7465j4301j1083r714r090p264m752l018j683P5J193
58517F33429N37o98r91j137k203k921j927o93j226k510k369j313j418k668l421
58502F08471l349l222k948k361k469l506l481j284P10L9j852k119j068p48q23
58487E79990M02K280K922K791L716N390O289O995Q999J1303J1879J1579J2843
58474F67378J5308J6338J5342J3973J2501R668N738K263r30n205r816j2355j2332
58461G17871j1357j0076p857n103k916q20K331N707P606Q468R841J1145J0661
58448G35501Q992Q263Q272O760L236n60l706o635q981r787r544r418q942p077
58434G06374m778l732l444k373r29l62J67K180M643N545N657P267R945J1215J0675
$$ plain form
58530 748929 729367 710531 693066 678765 667682 657968 648878 641614 636862 633844 632161 632236 633429
58517 633429 633966 633268 632277 631140 628937 626016 624089 623396 622170 619660 617291 615978 614560 611892 608471
58502 608471 605122 601900 598952 596591 594122 590616 587135 585851 586561 586600 584748 582629 581561 580813 579990
58487 579990 580392 582672 585594 588385 592101 597491 603780 610775 619774 631077 642956 654535 667378
58474 667378 682686 699024 714366 728339 740840 750508 756246 758509 757579 752374 742558 730203 717871
58461 717871 706514 696438 688581 683478 680562 679742 682073 687780 695386 703854 713695 724840 735501
58448 735501 744493 752756 761028 767788 771024 770464 766758 760123 751142 741355 731811 722393 713451 706374
58434 706374 701596 697864 694420 692047 691118 690756 690923 693103 697746 703291 708948 716215 726160 737375 748050
58419G48050R988R430P911N776M221K576m83l807n186n071n551o627o905o895
58405G47427p920q926q099o518o355o665n010k117o75n74L31J808K068J947L576
58390G04298N728N261K601J075J360J298O20R97J869J126m16o3J632J679K04J38
58374G29407J762K636K700M099O144N877L807L654O094Q030Q327R042J0549J0807
58360H12935J0010J0719J2852J3577J2603J2522J3484J2822J0341Q675Q053N985
58348I44578K588P92Q53J42j243l83K520L935L375M119O884Q608Q404Q888J0664
58333A004724J1275J0581J1390J3830J4843J4019J4121J5216J4324J1630J0708
58322A146661J1820J1310Q474O581O288M725K052J927M404N246L574L210N231
$$ plain form
58419 748050 758038 767468 775379 781155 785376 787952 787469 783662 778476 773405 767854 761227 754322 747427
58405 747427 739507 730581 722482 715964 709609 702944 697934 695817 695142 694568 694899 696707 698775 700722 704298
58390 704298 710026 715287 717888 718963 720323 721621 722241 723238 725107 726233 725817 725754 727386 729065 729269 729407
58374 729407 731169 733805 736505 740604 746748 752625 756432 760086 766180 774210 782537 791579 802128 812935
58360 812935 822945 833664 846516 860093 872696 885218 898702 911524 921865 930540 938593 944578
58348 944578 947166 947958 948811 948953 947710 947327 949847 953782 957157 961276 968160 976768 985172 994060 1004724
58333 1004724 1015999 1026580 1037970 1051800 1066643 1080662 1094783 1109999 1124323 1135953 1146661
58322 1146661 1158481 1169791 1178265 1184846 1191134 1195859 1197911 1199838 1204242 1209488 1213062 1216272 1221503
58309A221503O338N924P404J1051J2853J2084J2622J5215J5949J4055J3506J5163
58297A363667J5135J2757J2232J4462J5322J3929J4311J7002J7588J5666J6337
58286A528408K0458K2593K1170K1342K4884K6835K5404K5572K9259L1437K9810
58275A807172K9024L1426L3052L2423L3821L8029L9682L7569L7582M1595M3785
58264B205160M2016M2090M6397M9323M8551M9682N4869N8239N7637N9170O4944
58253B778078O8241O6424O6316P1111P4478P3618P5139Q1683Q6150Q5848Q8629
58242C615715R7914J05700J07877J12066J22431J31593J35766J42679J55844J66689
58232D894274J71292J78771J93737K07283K15244K27666K49643K70966K86035
$$ plain form
58309 1221503 1227841 1233765 1241169 1252220 1265073 1277157 1289779 1304994 1320943 1334998 1348504 1363667
58297 1363667 1378802 1391559 1403791 1418253 1433575 1447504 1461815 1478817 1496405 1512071 1528408
58286 1528408 1548866 1571459 1592629 1613971 1638855 1665690 1691094 1716666 1745925 1777362 1807172
58275 1807172 1836196 1867622 1900674 1933097 1966918 2004947 2044629 2082198 2119780 2161375 2205160
58264 2205160 2247176 2289266 2335663 2384986 2433537 2483219 2538088 2596327 2653964 2713134 2778078
58253 2778078 2846319 2912743 2979059 3050170 3124648 3198266 3273405 3355088 3441238 3527086 3615715
58242 3615715 3713629 3819329 3927206 4039272 4161703 4293296 4429062 4571741 4727585 4894274
58232 4894274 5065566 5244337 5438074 5645357 5860601 6088267 6337910 6608876 6894911
58223F894911L05138L34207L63086L86362M15374M56380M98347N36145N83073
58214A0773023O45726P10813P72836Q48967R49423J060765J177404J320128J502996
58205A9762081J713707J949579K239283K605004L041125L558376M208632N035239
58197D4113026O042845P249023Q715121J0491614J2597138J5096046J8119768
58190A22424581K1749214K5936982L0523545L5045230L8288322L8294510L3420047
58183C45682431K3734293J1250559j378995j2341564k0959525k7059852l0567822
58176B88359525l1672367l0949481k9084374k6565417k3694792k0726563j7866027
58169A07800504j5214598j2816974j0726478q972167p514591o293155n284196
$$ plain form
58223 6894911 7200049 7534256 7897342 8283704 8699078 9155458 9653805 10189950 10773023
58214 10773023 11418749 12129562 12902398 13751365 14700788 15761553 16938957 18259085 19762081
58205 19762081 21475788 23425367 25664650 28269654 31310779 34869155 39077787 44113026
58197 44113026 50155871 57404894 66120015 76611629 89208767 104304813 122424581
58190 122424581 144173795 170110777 200634322 235679552 273967874 312262384 345682431
58183 345682431 369416724 380667283 379288288 366946724 345987199 318927347 288359525
58176 288359525 256687158 225737677 196653303 170087886 146393094 125666531 107800504
58169 107800504 92585906 79768932 69042454 60070287 52555696 46262541 40978345
58162D0978345m473942l816108l261260k797789k426558k123055j858496j632584
58154A8588553j453209j305842j171384j053349r60595q81989q02779p28308o68573
58145I562525o15805n58658n02950m58193m18452l75612l37257l12817k95418
58136E687363k74706k54805k42811k32262k14660j95693j84134j75593j62407
58127C750292j48898j41997j36871j26341j14912j09580j05954r7089q7220q3413
58117B598017q2019p6280o9408o7545o7342o2773n7102n6308n7503n5146n2046
58106A894545n3132n4911n1978m7603m7298m8025m4251l8664l6663l6007l2057
58095A403956k7748k8240l0845k9960k7074k6515k6284k2432j7793j7163j8356
$$ plain form
58162 40978345 36504403 32688295 29427035 26629246 24202688 22079633 20221137 18588553
58154 18588553 17135344 15829502 14658118 13604769 12644174 11762185 10959406 10231098 9562525
58145 9562525 8946720 8388062 7885112 7426919 7008467 6632855 6295598 5982781 5687363
58136 5687363 5412657 5157852 4915041 4682779 4468119 4272426 4088292 3912699 3750292
58127 3750292 3601394 3459397 3322526 3196185 3081273 2971693 2865739 2768650 2681430 2598017
58117 2598017 2515998 2439718 2370310 2302765 2235423 2172650 2115548 2059240 2001737 1946591 1894545
58106 1894545 1841413 1786502 1734524 1686921 1639623 1591598 1547347 1508683 1472020 1436013 1403956
58095 1403956 1376208 1347968 1317123 1287163 1260089 1233574 1207290 1184858 1167065 1149902 1131546
58084A131546j6842j4693j6126j8748j8006j6052j7424k0062j9278j6767j7126
58073I40422j9051j8351j6292j6739j8261j7030j4429j4099j4589j2443r404r124
58061G60610r882p979n213n610p795p954p337r356j2165j1596q928q401r484q787
58047F40123p216p943r569q451n760n296o220m963k526k830n362o205n119n109
58033E57554o240o063n106n888p650p722o825p466q630p634n692n950p524p162
58019D62002n346n098o080n501l604k867l059k343j736l189m876l829j567j648
58005D11259l242k887j026r56k492k570j115o50r99K8J646J296j46J49J304J90
57989C99789k412k924j391j135k471k630j499j752l388l696k616k778m228m395
$$ plain form
58084 1131546 1114704 1100011 1083885 1065137 1047131 1031079 1013655 993593 974315 957548 940422
58073 940422 921371 903020 886728 869989 851728 834698 820269 806170 791581 779138 769734 760610
58061 760610 750728 742749 737536 731926 724131 716177 708840 699484 687319 675723 666795 658394 648910 640123
58047 640123 632907 624964 615395 606944 601184 595888 589668 584705 582179 579349 573987 567782 562663 557554
58033 557554 551314 545251 540145 534257 526607 518885 512060 504594 495964 488330 482638 476688 469164 462002
58019 462002 456656 451558 445478 439977 436373 433506 430447 428104 426368 423179 418303 414474 412907 411259
58005 411259 408017 405130 404104 403148 400656 398086 396971 396321 395322 395350 396996 398292 398146 398295 399599 399789
57989 399789 397377 394453 393062 391927 389456 386826 385327 383575 380187 376491 373875 371097 366869 362474
57975C62474l292l477m742m221j872p26j316j021O89J361M13L7O86M46o03j29
57959C44707J808K412J066J97O34N37n66j042r35k137m233m529k828j802k124
57944C31165j626J17R01M07J064L418M968M824N218P133Q545Q443Q616R939J0548
57929D03680R322P707O727N389L379K133J931J001j267l224m061n041o671p614
57915D13391p420p422q085q249p719p690q023p091m937l536l341k727j487j505
57901C34159l145m287l963l746m492m793l861k929k656j981o02J66K7M77J939
57886C00313K835K447K068K458K813L009M055N542N445L396J430O53n8j337k159
57871C32910k236k722l595l307j969j848l639n163m987m359m266l549j528K03
$$ plain form
57975 362474 359182 355705 350963 346742 344870 344144 342828 341807 342496 343857 344270 344307 344993 345439 344836 344707
57959 344707 346515 348927 349993 350190 350824 351361 350795 349753 348818 346681 342448 337919 335091 333289 331165
57944 331165 329539 329656 330557 330964 332028 335446 340414 345238 350456 357589 366134 374577 383193 393132 403680
57929 403680 413002 420709 427436 432825 436204 438337 440268 441269 440002 436778 432717 427676 421005 413391
57915 413391 405971 398549 390464 382215 374496 366806 358783 351692 346755 343219 339878 337151 335664 334159
57901 334159 331014 326727 322764 319018 314526 309733 305872 302943 300287 298306 297704 297870 297897 298374 300313
57886 300313 303148 305595 307663 310121 312934 315943 319998 325540 330985 334381 335811 336464 336406 335069 332910
57871 332910 330674 327952 324357 321050 319081 317233 313594 308431 303444 299085 294819 291270 289742 289945
57857B89945M00J86Q12J593J599J403J705K062K116K367K752K318J055J51j52
57842C10312q95k072k364j715j735k823l455l040k864l390l290k210j826k892
57828B75741l722k940j410k51Q46K090K652K421K550L251L161J982J485K724M276
57813B94856M417L160J233r93k825l466l552m482n865n976m995m952o071o232
57799B54257m790l688l741l127r51Q82J086J148K301L185K532J525J484J660J294
57784B55057J421K613L313K423J378J592K022J411P53J349K312K273J858K352
57770B82127L409M027M300M456L696J693k59j233k116l636m702m366l578l309
57756B80509k763j245L5q8o63m08R8j12l40L66J247J205P62P98P45j50j067r46
$$ plain form
57857 289945 290345 290531 291343 292936 294535 295938 297643 299705 301821 304188 306940 309258 310313 310464 310312
57842 310312 309417 307345 304981 303266 301531 298708 295253 292213 289349 285959 282669 280459 278633 275741
57828 275741 272019 269079 267669 267418 268264 270354 273006 275427 277977 281228 284389 286371 287856 290580 294856
57813 294856 299273 302433 303666 302673 299848 296382 292830 288348 282483 276507 271512 266560 260489 254257
57799 254257 249467 245779 242038 238911 237960 238842 239928 241076 243377 246562 249094 250619 252103 253763 255057
57784 255057 256478 259091 262404 264827 266205 267797 269819 271230 271983 273332 275644 277917 279775 282127
57770 282127 285536 289563 293863 298319 302015 303708 303449 302216 300100 296464 291762 287396 283818 280509
57756 280509 277746 276501 276536 276448 275785 275377 275475 275363 275023 275389 276636 277841 278603 279401 280146 279996 278929 277983
57738B77983l79m73j042j441j937k689k796j851j056j316j664j079k96k67m33
57723B59264r0Q1m85q92n67o45j804k540j624n14j089k556k885k006j254q95m89
57706B39010n69j725k909k855k293k650l396k868j019O60J418J609J331M54m24
57691B23774o70p37j314j992k054j717j452j019l61k80r35r63N32K493L806N190
57675B22301P602J0306J2388J4779J8844K4181K9727L5771M2750M8983N1503M8335
57663E67470L8676K2664K971j5009k7191l4082l8234m0089l8830l5695l3041l0790
57651C38820k6898k1155j5736j2009r389p423o649o957p137o453n207l686j957
57638B08164o00k05l84m13m14o41m21O84J564J031k00p15p55j440k460k594j936
$$ plain form
57738 277983 277604 277131 276089 274648 272711 270022 267226 265375 264319 263003 261339 260260 259964 259697 259264
57723 259264 259174 259255 258770 257878 257311 256666 254862 252322 250698 250184 249095 246539 243654 241648 240394 239499 239010
57706 239010 238441 236716 233807 230952 228659 226009 222613 219745 218726 219386 220804 222413 223744 224198 223774
57691 223774 223104 222367 221053 219061 217007 215290 213838 212819 212458 212178 211243 210280 210812 213305 217111 222301
57675 222301 229903 240209 252597 267376 286220 310401 340128 375899 418649 467632 519135 567470
57663 567470 606146 628810 631781 616772 589581 555499 517265 477176 438346 402651 369610 338820
57651 338820 311922 290767 275031 263022 253633 246210 239561 232604 225467 219014 213807 210121 208164
57638 208164 207564 207359 206975 206562 206148 205507 205086 205770 207334 208365 208165 207450 206695 205255 202795 200201 198265
57621A98265j579j592j229p36r62j618j747j511j678j931j518r84j327j910j349
57606A76594lN36Q6r1L79O67O10Q34J197R30K18j71n21j614k889l115k509k309
57588A68829k511k148j423j453k073k065j481j532k202k138j076k59l01n28n98
57573A47041q91j162o92J45K51k97n25n80j360k333k015o47k3m26k20J106J914
57556A39286J214K27J74N61O56Q50J428J586P74k72p15p31p31o27m50o30j077
57539A41523j077m63R9K56L37M35K93J08L20N92K73k84k73k0m54j178r43N4L16
57520A39914m00o90mO02O02Q82J756K077J225L06M15J148J672J912J957J552Q81
57503A55807O24P80N96M8l4M09M43q9k94o5m32j463j722o26M47L21l49o30q42
$$ plain form
57621 198265 196686 195094 193865 193129 192167 190549 188802 187291 185613 183682 182164 181180 179853 177943 176594
57606 176594 176591 177127 177213 177122 177501 178168 178778 179612 180809 181739 181957 181786 181265 179651 176762 173647 171138 168829
57588 168829 166318 164170 162747 161294 159221 157156 155675 154143 151941 149803 148727 148468 148167 147639 147041
57573 147041 146150 144988 144296 144441 144692 144395 143870 143290 141930 139597 137582 136935 136912 136486 136266 137372 139286
57556 139286 140500 140727 140901 141462 142118 142968 144396 145982 146756 146484 145769 145038 144307 143680 143230 142600 141523
57539 141523 140446 139983 140082 140338 140675 141110 141403 141511 141831 142423 142696 142412 142139 142119 141665 140487 139544 139598 139914
57520 139914 139514 138824 138820 139422 140024 140906 142662 144739 145964 146270 146685 147833 149505 151417 153374 154926 155807
57503 155807 156431 157211 157807 157855 157821 158230 158673 158584 158290 158225 157793 156330 154608 153982 154429 154750 154401 153771 152929
57484A52929j335j345l65N69L68l75m00L71J111J381J120J65j210k002j660r28
57468A48394p27q96q24n86n69o38m31q6M5PL9J53K23J37k45p96q78j03P97P81
57448A43797J03n7N26R08P56Q47J404J429L48r79j573j581j475j105l55K42K99
57431A43534K96P64J378J458Q09k68j292j675j150k81J20O5J96N06L54k87o77
57414A43850n09k98l90n69o66o23n8J136J999J566N28L21Q39P05k34o63k33k00
57396A46501j138j887j525o93j04N89J578K032J452P00Q07J746K982M083M367
57381A61490L208J284K16M92J014J066J205J693J691P87j67n43q78j607k193k223
57365A66535k046j774r58J44M72j59p23q08j063j442q78N70J243L96o56p78m72
$$ plain form
57484 152929 151594 150249 149884 150453 150821 150446 150046 150417 151528 152909 154029 154194 152984 150982 149322 148394
57468 148394 147667 146771 145947 145361 144792 144154 143723 143637 143682 143689 143728 143881 144104 144241 143996 143200 142322 142219 143016 143797
57448 143797 143900 143843 144369 145277 146033 146880 148284 149713 150061 149082 147509 145928 144453 143348 142993 143235 143534
57431 143534 143830 144594 145972 147430 148239 147971 146679 145004 143854 143573 143693 143758 143954 144460 144814 144527 143850
57414 143850 143341 143043 142653 142084 141418 140795 140737 141873 143872 145438 145966 146287 147126 147831 147597 146934 146701 146501
57396 146501 145363 143476 141951 141258 141154 141743 143321 145353 146805 147505 148312 150058 153040 157123 161490
57381 161490 164698 165982 166198 166690 167704 168770 169975 171668 173359 174146 173979 173436 172558 170951 168758 166535
57365 166535 164489 162715 161757 161901 162373 162214 161491 160683 159620 158178 157300 157870 159113 159509 158853 158075 157603
57348A57603j66Q05K383L019K084J067R83P38m11r21N34K535L051K415K030J657
57332A79406L76r95q63N15J517J598J313P22l31j059o79M2r6p13o38j1J56j27
57314A80133j06O8l24j066j313r69l98N77J934K618J950J144J643K798K946K127
57298A93762J675J695J064k75j055p57j44L24R46J589J651J340J592K507L144
57283B09058K992K478K031J701J702K196K620K236J214L20k19n58m26M12J331
57268B29088J586J514J833K247J983J341J315J977K483K527K497K473K257K167
57254B57288K624L162L051K606K674L100K972K203J598J398J004J40p24j086p59
57239B81251L25J807K812K888K687K912L288L345L422L810L890L229K669L012
$$ plain form
57348 157603 157437 158242 160625 163644 165728 166795 167778 168516 168105 167184 167718 170253 173304 175719 177749 179406
57332 179406 179782 178787 177924 178439 179956 181554 182867 183589 183258 182199 181520 181562 181466 180753 180115 180104 180260 180133
57314 180133 180027 180095 179771 178705 177392 176423 176025 176602 178536 181154 183104 184248 185891 188689 191635 193762
57298 193762 195437 197132 198196 197921 196866 196109 195965 196289 197235 198824 200475 201815 203407 205914 209058
57283 209058 212050 214528 216559 218260 219962 222158 224778 227014 228228 228548 228329 227771 227345 227757 229088
57268 229088 230674 232188 234021 236268 238251 239592 240907 242884 245367 247894 250391 252864 255121 257288
57254 257288 259912 263074 266125 268731 271405 274505 277477 279680 281278 282676 283680 283820 283096 282010 281251
57239 281251 281576 283383 286195 289083 291770 294682 297970 301315 304737 308547 312437 315666 318335 321347
57225C21347L584L545L560M455N259M615L288L044L639L376K287K225L673M896
57211C72793M767M218M293M673M910N407O338O986O899O565O428O332O290O690
57197D53589P451Q009Q291Q570Q430P235N685N341O360P241P077O685P000P809
57183E54773Q524Q979R034Q573Q276R093J0725J1804J1979J2322J3360J4178J4186
57170F95806J4265J5293J6670J7278J7040J6709J6756J7178J7736J8014J7743
57159H80488J7380J7644J8457J9093J9462K0144K1048K1207K0361J9628K0075
57148A094987K1551K3341K5156K6881K8195K8935K9347K9624K9720K9756K9960
57137A397453L0199L0201L0242L0789L1653L2310L2966L4259L6074L7722L9267
$$ plain form
57225 321347 324931 328476 332036 336491 341750 346365 349653 352697 356336 359712 361999 364224 367897 372793
57211 372793 377560 381778 386071 390744 395654 401061 407399 414385 421284 427849 434277 440609 446899 453589
57197 453589 461040 469049 477340 485910 494340 501575 507260 512601 518961 526202 533279 539964 546964 554773
57183 554773 563297 572276 581310 589883 598159 607252 617977 629781 641760 654082 667442 681620 695806
57170 695806 710071 725364 742034 759312 776352 793061 809817 826995 844731 862745 880488
57159 880488 897868 915512 933969 953062 972524 992668 1013716 1034923 1055284 1074912 1094987
57148 1094987 1116538 1139879 1165035 1191916 1220111 1249046 1278393 1308017 1337737 1367493 1397453
57137 1397453 1427652 1457853 1488095 1518884 1550537 1582847 1615813 1650072 1686146 1723868 1763135
57126A763135M1425M4164M6695M8961N1916N6032O0810O5948P1733P8014Q4101
57115B412934R0057R6919J05231J14525J24642J36227J49503J63813J79061J96493
57105C769405K17469K42528K72374L08752L53766M09252M77510N61781O65484
57096G278321P91774R44100J125874J338601J580925J849772K141036K448165
57088A9498568K761127L068056L357408L617042L830635L974867M019900L934062
57080D8061665L692869L290181K745234K098964J399404O84669k4980p21065j393753
57071E9833188k024154k587724l062763l435049l696948l845305l880885l808919
57063C3491441l640516l394511l096709k774473k450297k139780j853464j597798
$$ plain form
57126 1763135 1804560 1848724 1895419 1944380 1996296 2052328 2113138 2179086 2250819 2328833 2412934
57115 2412934 2502991 2599910 2705141 2819666 2944308 3080535 3230038 3393851 3572912 3769405
57105 3769405 3986874 4229402 4501776 4810528 5164294 5573546 6051056 6612837 7278321
57096 7278321 8070095 9014195 10140069 11478670 13059595 14909367 17050403 19498568
57088 19498568 22259695 25327751 28685159 32302201 36132836 40107703 44127603 48061665
57080 48061665 51754534 55044715 57789949 59888913 61288317 61972986 61948006 61226941 59833188
57071 59833188 57809034 55221310 52158547 48723498 45026550 41181245 37300360 33491441
57063 33491441 29850925 26456414 23359705 20585232 18134935 15995155 14141691 12543893
57055A2543893j374439j181289j015530q74969p56945o57969n75080n06267m49332
57046E152073m01747l61847l28776l01117k76881k54871k34631k15119j95089
57037B581995j74719j55218j36771j18692j01327q5710p1325n6357l9989k2136
57027A619751j578K1601M0927M5311K8965k412l7086o6631q8215j01252j06010
57016A353371j04672j00341r4545q7293p9068p0973o3267n5437m7513m0187l3967
57005E76108k9123k5853k3630k1260j8429j6268j5487j5106j4109j2974j2351
56994C71518j1512r646p509o168n051k975k87J792L384N761R256J2675J4590J4062
56980C89890J0615M775j691p094j1077j3934j5535j5788j5225j4088j1791q427
$$ plain form
57055 12543893 11169454 9988165 8972635 8097666 7340721 6682752 6107672 5601405 5152073
57046 5152073 4750326 4388479 4059703 3758586 3481705 3226834 2992203 2777084 2581995
57037 2581995 2407276 2252058 2115287 1996595 1895268 1809558 1738233 1681876 1641887 1619751
57027 1619751 1618173 1639774 1680701 1726012 1754977 1752565 1715479 1648848 1560633 1459381 1353371
57016 1353371 1248699 1148358 1053813 966520 887452 816479 753212 697775 650262 610075 576108
57005 576108 546985 521132 497502 476242 457813 441545 426058 410952 396843 383869 371518
56994 371518 360006 350360 342851 336683 331632 328657 328370 330162 333546 339307 348563 361238 375828 389890
56980 389890 400505 405280 403589 396495 385418 371484 355949 340161 324936 310848 299057 290630
56968B90630n624m498l772j564J814M573O285Q231J1253J4976J8818K2187K3791
56955C87100K2254J7620J1130L775l924j0995j6230j9271k0576k0457j9055j6932
56943C14439j4772j2652j0329p862n275k251J223M641Q134J2763J8706K4220K7547
56930C58532K8724K8158K4732J7226O788l858j3119k0706k5921k7976k7684k6777
56918C18119k5573k3125j9610j6605j4832j3366j1424r368p606n952m475l651
56906A62532l340k746j659o52R7J023K066K564K429K347K650L085L800N374P678
56891A87248R846J1656J3866J6831J9788K1867K2862K2677K0783J6717J0698L610
56879C78449l221q433j1511j3141j4101j4130j2565r688o412k946J160N778J0159
$$ plain form
56968 290630 285006 280508 276736 275172 276986 281559 287844 296075 307328 322304 341122 363309 387100
56955 387100 409354 426974 438104 441879 437955 426960 410730 391459 370883 350426 331371 314439
56943 314439 299667 287015 276686 268824 263549 261298 262521 267162 275296 288059 306765 330985 358532
56930 358532 387256 415414 440146 457372 464160 460302 447183 426477 400556 372580 344896 318119
56918 318119 292546 269421 249811 233206 218374 205008 193584 184216 176610 170658 166183 162532
56906 162532 159192 156446 154787 154135 154232 155255 157321 159885 162314 164661 167311 170396 174196 179570 187248
56891 187248 197094 208750 222616 239447 259235 281102 303964 326641 347424 364141 374839 378449
56879 378449 375228 366795 355284 342143 328042 313912 301347 291659 285247 282301 283461 289239 299398
56866B99398J4169J8566K3911L0063L6796M4060N1368N7334N9784N6251M5246
56855G36946K8064Q824q232k1390l0914l6982l9425l8839l6282l1977k5621j7825
56843D86347r930k468N120J3358K2365L2439M3811N6012O8431Q0869R1977R7515
56831I85846R2219P4143M6364J4547j6013m1413n9493p0282p5293p5813p2373
56820H02439o5689n7002m7302l7075k6878j7250q036J392J1206K1157L1299M1846
56808F50107N2388O1776O8081O8091N8245L7991J1838j3600l4387m9973o0355
56797H50202o5034o4672o1363n6593n0522m3472l6380k9422k1970j4261p468j717
56785C97328M258J1018J7594K3323K8694L3401L5057L1104K1242P450p390k0475
$$ plain form
56866 299398 313567 332133 356044 386107 422903 466963 518331 575665 635449 691700 736946
56855 736946 765010 773834 765602 744212 713298 676316 636891 598052 561770 529793 504172 486347
56843 486347 476417 473949 479069 492427 514792 547231 591042 647054 715485 796354 888331 985846
56831 985846 1078065 1152208 1198572 1213119 1197106 1155693 1096200 1025918 950625 874812 802439
56820 802439 736750 679748 632446 595371 568493 551243 543207 544599 555805 576962 608261 650107
56808 650107 702495 764271 832352 900443 958688 996679 1008517 994917 960530 910557 850202
56797 850202 785168 720496 659133 602540 552018 508546 472166 442744 420774 406513 399045 397328
56785 397328 401586 412604 430198 453521 482215 515616 550673 581777 603019 610469 603079 582604
56773E82604k9902l5425l7954l8221l6720l4498l2564l0484k7124k2867j9442
56762B37403j7350j5319j2702j0484r272q149o468n061m583m226l236k322k329
56749A35902k782k900k893l069k771j534l24l17j123j448r40l37j96m99j078j616
56733A12075j541o52M82J195J432J429J240R51Q04P50N43M10R38J971K510K024
56717A26561J103M45J01RL59J044J520J604J659J761J557J123R95J155J020N64
56701A42580M20O90Q28Q42J300J949J764P16mO3ko54r74m11J65K1k44p1j01r08
56681A47969j712j603r78p51r76j231j488j761j709j377j392j772j556l39R01
56666A30225J312J367J728K066J998K086K866L788M180M332M695M847M309L508
$$ plain form
56773 582604 552702 517277 479323 441102 404382 369884 337320 306836 279712 256845 237403
56762 237403 220053 204734 192032 181548 172276 164127 157659 152598 148015 143789 140553 138231 135902
56749 135902 133120 130220 127327 124258 121487 119953 119629 119312 118189 116741 115801 115464 115268 114769 113691 112075
56733 112075 110534 109882 110364 111559 112991 114420 115660 116611 117415 118165 118708 119118 120056 122027 124537 126561
56717 126561 127664 128109 128210 128219 128578 129622 131142 132746 134405 136166 137723 138846 139841 140996 142016 142580
56701 142580 143000 143690 144518 145360 146660 148609 150373 151089 151085 151148 151146 150492 149518 149107 149272 149293 149049 148978 148877 147969
56681 147969 146257 144654 143676 142925 141949 140718 139230 137469 135760 134383 132991 131219 129663 129324 130225
56666 130225 131537 132904 134632 136698 138696 140782 143648 147436 151616 155948 160643 165490 169799 173307
56652A73307L125L093L089L122L011K230R72K80M55N10m9k74M54J173R88O48J091
56635A97225J634J121j16j009j543k300k972k859k273j971j754j033k88n28j572
56620A79762k180j770r59m76n54j153j973k412k111j359n67J67O35L80n32j349
56604A63549j723k066k405j966n26R19J554J697J749J383N97K36N18M21m72q81
56588A62584J45J473J553P10K62L59K46j47l12k45j65J09N32M47j29l4J175K111
56570A70674J706J097J763L083L565L434M045N493O852Q151J0216J2905J5133
56557B48117J6327J6458J5137J2229Q805O101M025K035O13L41L43o07k017k543
56543C25364k270k309k652k352j539j371k123k943l457m056m772n263n749o578
$$ plain form
56652 173307 176432 179525 182614 185736 188747 190977 191949 192229 192684 193194 193145 192871 193325 194498 195486 196134 197225
56635 197225 198859 199980 199864 198855 197312 195012 192040 189181 186908 184937 183183 182150 181862 181334 179762
56620 179762 177582 175812 174853 174377 173823 172670 170697 168285 166174 164815 164248 164415 165050 165430 164898 163549
56604 163549 161826 159760 157355 155389 154863 155782 157336 159033 160782 162165 162762 162998 163516 163937 163465 162584
56588 162584 162729 164202 165755 166465 166727 167086 167332 167185 166873 166628 166463 166572 167104 167551 167422 167388 168563 170674
56570 170674 172380 173477 175240 178323 181888 185322 189367 194860 201712 209863 220079 232984 248117
56557 248117 264444 280902 296039 308268 317073 323174 327199 329234 329847 330188 330531 329924 327907 325364
56543 325364 323094 320785 318133 315781 314242 312871 310748 307805 304348 300292 295520 290257 284508 277930
56529B77930p154o662n516m784m600m437m386m723m800l975l024l049l545l229
56515B14046k274j886k167k140j625j291j141o50j39l22q01p28n08j106k051k022
56499A93195j086m74l47J84J008J017J97k04K44O44M55N4l55q56r48k04M17l15
56481A92626j753k166j456j052j262r03K71R78O16J78M64J083J640K303K820K530
56465A96917J655J237J519J687J317P42J29m87m87N01J412R68k56p16l14j06o3
56448B05655O50J565J368L43K2M99L98m73q66n64o38j094p44K88N17j21k5R88
56430B07768J071m42j763j590q92p42o37j35m9p17r50J07J598K413K468J963R84
56413B10455L27R59K163K183R87K77M51J05r24q12R71K346J932J079J149J215
$$ plain form
56529 277930 270776 264114 258598 253814 249214 244777 240391 235668 230868 226893 223869 220820 217275 214046
56515 214046 211772 209886 207719 205579 203954 202663 201522 200872 200733 200411 199610 198882 198374 197268 195217 193195
56499 193195 192109 191635 191288 191472 192480 193497 193694 193490 193734 194378 194833 194887 194532 193676 192728 192524 192941 192626
56481 192626 190873 188707 187251 186199 184937 184034 184305 185283 185899 186077 186541 187624 189264 191567 194387 196917
56465 196917 198572 199809 201328 203015 204332 205074 205203 204716 204229 204730 206142 207110 206854 206138 205824 205718 205655
56448 205655 206305 207870 209238 209581 209603 210102 210500 210027 209161 208597 207959 206865 206121 206409 206926 206805 206780 207768
56430 207768 208839 208397 206634 205044 204152 203410 202773 202638 202589 201872 200922 201029 202627 205040 207508 209471 210455
56413 210455 210782 211741 213904 216087 217074 217351 217802 217907 216983 216171 217142 219488 221420 222499 223648 224863
56397B24863K20q33p91n21j205k110j954j068m72k7Q27J574J502J025R17J000
56381B22947P48L05k8l96q14r33q44r67r67j95O65L53m67K36K366L337K101Q28
56363B28275J291K150J614L89P1M31L83O5J37L06J79K95R62J365J165J440K798
56346B43316M040M027L367L020K814K573L001M105M553L882L515M295M948M536
56332B95992M249M981N208L477J182N96J537K278K403K601K715K108J184O85L19
56317C31515l93q73o54n86j385k055j434j66M16K93K12K40K31O05J341J529J093
56300C29929J489L326M922M761L735L327L256K732K329K761L213K855K636L613
56286C74884M967N506N727O434O783N824M650M880O136O956P070O920O285N314
$$ plain form
56397 224863 225083 224250 223459 222938 221733 219623 217669 216601 216129 216102 216929 218503 220005 221030 221947 222947
56381 222947 223695 224000 223972 223576 222762 221829 220985 220018 219051 218856 219521 219874 219407 219643 222009 225346 227447 228275
56363 228275 229566 231716 233330 233719 233790 234221 234604 234669 234806 235112 235291 235586 236548 237913 239078 240518 243316
56346 243316 247356 251383 254750 257770 260584 263157 266158 270263 274816 278698 282213 286508 291456 295992
56332 295992 300241 305222 310430 313907 315089 315685 317222 319500 321903 324504 327219 329327 330511 331196 331515
56317 331515 331122 330249 329595 329009 327624 325569 324135 323969 324385 324678 324890 325130 325361 325966 327307 328836 329929
56300 329929 331418 334744 339666 344427 348162 351489 354745 357477 359806 362567 365780 368635 371271 374884
56286 374884 379851 385357 391084 397518 404301 410125 414775 419655 425791 432747 439817 446737 453022 458336
56272D58336N538P769J0307J1278J1435J2521J4228J5081J5186J5746J6850J7961
56260F12236J9664K2749K6404K9389L2096L5621L9800M4110M9297N6094O3473
56249A030933P0285P7448Q6339R6158J05075J12954J20676J27733J32745J35436
56239B095782J36030J33564J26896J16551J03703Q8299O9986M9644K8229N494
56229B954178j8084l9823n7562p2447q6598r9323j08266j13000j15017j15194
56219B128864j13706j11338j08471j03923r7028q9587q3493p7985p1699o5697
56209A205937o1571n8163n3291m7433m2604l8840l4897l1318k9404k8131k5372
56198G54913k1526j8715j7120j5231j3071j2005j1790j0853r145p899p072n711
$$ plain form
56272 458336 463874 471643 481950 493228 504663 517184 531412 546493 561679 577425 594275 612236
56260 612236 631900 654649 681053 710442 742538 778159 817959 862069 911366 967460 1030933
56249 1030933 1101218 1178666 1265005 1361163 1466238 1579192 1699868 1827601 1960346 2095782
56239 2095782 2231812 2365376 2492272 2608823 2712526 2800825 2870811 2920455 2948684 2954178
56229 2954178 2936094 2896271 2838709 2766262 2679664 2580341 2472075 2359075 2244058 2128864
56219 2128864 2015158 1903820 1795349 1691426 1594398 1504811 1421318 1343333 1271634 1205937
56209 1205937 1144366 1086203 1032912 985479 942875 904035 869138 837820 808416 780285 754913
56198 754913 733387 714672 697552 682321 669250 657245 645455 634602 625457 617558 610486 604775
56186F04775m302m034m352l864k983l007l441k884j735j248r76J97J489J578J321
56171E76534K219L422L259K516K945L840L475K609L119M380M602M522N965P912
56157F31319Q034P091P732R809J0961J1136J2301J4335J5455J6172J8692K2732
56145G85769K6115K9030L3664L9992M6211N2838O2004P2882Q2153Q8746R3827
56134A413231R6402R3628Q5692P6065O6796N7733N0209M6732M6505M5492M1404
56123B119889L4904K6222J5014L563m456q861j2781j7802k3577l1537m3882n8738
56111A997958p1206p9543q5650q9581q8817q3373p6474o9469o0987n1585m4144
56100A197129l8928l3181k6348k0904j7434j3826r879p701o960m917j653j45o02
$$ plain form
56186 604775 600473 596439 592087 588223 585240 582233 578792 575908 574173 572925 571949 572146 573635 575213 576534
56171 576534 578753 582175 585434 587950 590895 594735 598210 600819 603938 608318 612920 617442 623407 631319
56157 631319 639353 646444 654176 663985 674946 686082 698383 712718 728173 744345 763037 785769
56145 785769 811884 840914 874578 914570 960781 1013619 1075623 1148505 1230658 1319404 1413231
56134 1413231 1509633 1603261 1688953 1765018 1831814 1889547 1939756 1986488 2032993 2078485 2119889
56123 2119889 2154793 2181015 2196029 2199592 2195136 2186275 2173494 2155692 2132115 2100578 2056696 1997958
56111 1997958 1926752 1847209 1761559 1671978 1583161 1499788 1423314 1353845 1292858 1241273 1197129
56100 1197129 1158201 1125020 1098672 1077768 1060334 1046508 1036629 1028928 1021968 1017051 1015398 1015253 1014651
56087A014651L5K352L594L174L554N069N358M538N320P386P508N842O048Q489
56073A082918R583Q755R416J2017J2888J1355J1258J3784J5439J4944J5364J7568
56061A235289J8270J6640J6173J7929J8569J7148J7102J9365K0345J8942J8642
56050A434414K0417K0582J8056J6711J8158J9201J8779K0006K3118K4084K2607
56039A656133K3544K7761K9879K8018K7299L0374L3063L2983L3900L7565L9727
56028B000246L8435L7965M0359M1492L9604L9222M2340M4434M3494M4185M8667
56017B460443N2349N3117N5560O1495O5911O6988P0225P7789Q3890Q5702Q8479
56006C221948R4653R8820R8918J01196J08332J14216J16330J21218J31534J40247
$$ plain form
56087 1014651 1014686 1017038 1020632 1023806 1027360 1032429 1037787 1042325 1047645 1055031 1062539 1068381 1074429 1082918
56073 1082918 1092501 1101256 1110672 1122689 1135577 1146932 1158190 1171974 1187413 1202357 1217721 1235289
56061 1235289 1253559 1270199 1286372 1304301 1322870 1340018 1357120 1376485 1396830 1415772 1434414
56050 1434414 1454831 1475413 1493469 1510180 1528338 1547539 1566318 1586324 1609442 1633526 1656133
56039 1656133 1679677 1707438 1737317 1765335 1792634 1823008 1856071 1889054 1922954 1960519 2000246
56028 2000246 2038681 2076646 2117005 2158497 2198101 2237323 2279663 2324097 2367591 2411776 2460443
56017 2460443 2512792 2565909 2621469 2682964 2748875 2815863 2886088 2963877 3047767 3133469 3221948
56006 3221948 3316601 3415421 3514339 3615535 3723867 3838083 3954413 4075631 4207165 4347412
55996D347412J44251J50622J62510J72540J77543J85661K00810K14934K24068
55987E980351K36698K57184K77002K92094L12016L41480L70385L93462M21537
55978H882209M61253N02835N40845N86829O47416P11268P73093Q48069R46032
55969A4899849J055241J169824J308119J484377J689777J923359K212821K581239
55961B8324606L025483L554596M215121N048936O063939P278561Q751468J0532386
55953G6795096J2639365J5130681J8133233K1736967K5914450L0535586L5193794
55946B36079172L8741508L9173984L4566132K4580525J1065602k976757j5054043
55939C66176123k3996428k9656089l2346920l2624891l1217921k8828257k5948521
$$ plain form
55996 4347412 4491663 4642285 4804795 4977335 5154878 5340539 5541349 5756283 5980351
55987 5980351 6217049 6474233 6751235 7043329 7355345 7696825 8067210 8460672 8882209
55978 8882209 9343462 9846297 10387142 10973971 11621387 12332655 13105748 13953817 14899849
55969 14899849 15955090 17124914 18433033 19917410 21607187 23530546 25743367 28324606
55961 28324606 31350089 34904685 39119806 44168742 50232681 57511242 66262710 76795096
55953 76795096 89434461 104565142 122698375 144435342 170349792 200885378 236079172
55946 236079172 274820680 313994664 348560796 373141321 384206923 381230166 366176123
55939 366176123 342179695 312523606 280176686 247551795 216333874 187505617 161557096
55932A61557096k2881463j9845088j6990729j4386633j2064587j0064636q402845
55925E6921115p036981n906611m980486m236702l631118l120658k693408k346687
55917B2968464k058136j804359j586072j409209j260263j123144j002016r05266
55909A1819999q23525p44263o72379o16424n68814n18680m70856m34100m02864
55900F568094l68135l34616l10566k91218k68084k44703k28143k14351j96308
55891D111970j77823j65557j55845j42477j29189j21760j15722j04390r1679q4998
55881B822530q2493p8715p5784p7663q0169p7641p3229p2189p1543o6718o1851
55870B004535o2913o6649o6607o4410o4834o5437o1435n5693n3691n3140m8519
$$ plain form
55932 161557096 138675633 118830545 101839816 87453183 75388596 65323960 56921115
55925 56921115 49884134 43977523 38997037 34760335 31129217 28008559 25315151 22968464
55917 22968464 20910328 19105969 17519897 16110688 14850425 13727281 12725265 11819999
55909 11819999 10996474 10252211 9579832 8963408 8394594 7875914 7405058 6970958 6568094
55900 6568094 6199959 5865343 5554777 5263559 4995475 4750772 4522629 4308278 4111970
55891 4111970 3934147 3768590 3612745 3470268 3341079 3219319 3103597 2999207 2907528 2822530
55881 2822530 2740037 2661322 2585538 2507875 2427706 2350065 2276836 2204647 2133104 2066386 2004535
55870 2004535 1941622 1874973 1808366 1743956 1679122 1613685 1552250 1496557 1442866 1389726 1341207
55859A341207m1526l7485l5415l1070k6038k4622k5162k3279k0474k0950k3091
55848A032095k2425k0074k0214k1945k1408j9354j9199k0154j9328j7880j8427
55837H11687j9230j7582j5719j6819j8475j6917j4204j4233j5110j2792r041q250
55825F33315r260q023n735o622r750j0627r202r109j0386j0021q425q584r952
55812E17619r548p968q104r152q056n582m919n532m375j955j149j229Q37M193
55798D55080N261M176M187N400M981L043K489L416L123J449Q71J598J596J093
55784D97763K073L634K698r87m982q717j3324j7693j9406j8996j8846j8614j6314
55771C68289j2890j0995j0084p643m450l565m712m724l189k563l052k365m51L68
$$ plain form
55859 1341207 1299681 1262196 1226781 1195711 1169673 1145051 1119889 1096610 1076136 1055186 1032095
55848 1032095 1009670 989596 969382 947437 926029 906675 887476 867322 847994 830114 811687
55837 811687 792457 774875 759156 742337 723862 706945 692741 678508 663398 650606 641565 633315
55825 633315 624055 616032 610297 603675 593925 583298 574096 564987 554601 544580 536155 527571 517619
55812 517619 508071 500103 491999 482847 474791 469209 464290 458758 454383 452428 451279 450050 450887 455080
55798 455080 460341 464517 468704 474104 479085 482128 484617 488033 491156 492605 493476 495074 496670 497763
55784 497763 499836 503470 506168 505181 500199 491482 478158 460465 441059 422063 403217 384603 368289
55771 368289 355399 344404 334320 326677 322227 318662 313950 309226 306037 303474 300422 298057 297606 297974
55757B97974n1L17J250N55j324j759r84j879m580o119n782o089p874q909q212
55742B46534p428p180o150m483m077m845m506k761j829k256j979l08R23Q31O22
55727B01108N61o13k678l670l285l265l966l867k851k580l214l044j806j023p52
55712A65055N52K650L402K504J948K380K366J712J951L014K869J102m09r60j890
55697A88246l430m075l699l999n209n563m675m142m172l051o25J032J219J631
55683A49488K924L564L007K813L599L951L378L245L814L400J507j17n81j075k081
55668A80836k315j504j286k257k862k289j694j642j102Q5N18m4o5P91R87K98N87
55651A67042K338L460K807J930J983J822O67j55K49O33j6q07j058j691l164m342
$$ plain form
55757 297974 297923 298240 299490 300045 298721 296962 295978 294099 289519 283400 277618 271529 263655 254746 246534
55742 246534 239106 231926 225776 221293 217216 212371 207865 205104 203275 201019 199040 198732 199655 200486 201108
55727 201108 201669 201056 198378 194708 191423 188158 184192 180325 177474 174894 171680 168636 166830 165807 165055
55712 165055 165607 168257 171659 174163 176111 178491 180857 182569 184520 187534 190403 191505 191096 190136 188246
55697 188246 184816 180741 177042 173043 167834 162271 157596 153454 149282 146231 145606 146638 147857 149488
55683 149488 152412 155976 158983 161796 165395 169346 172724 175969 179783 183183 184690 184573 183992 182917 180836
55668 180836 178521 177017 175731 173474 170612 168323 166629 164987 163885 163970 164488 164444 164379 165170 166157 166455 167042
55651 167042 169380 172840 175647 177577 179560 181382 182049 181894 182143 182776 182760 181953 180895 179204 176040 171698
55635A71698m707n339o532o856n796m859m800m277k626j388j623k119j748j248
55621A17780j247r13jJ31r40j568q83l69j088j795j492j375k406l271k683j651
55605I6229j447j443q14m76j283k141j820j028q49q96o45q87j957k330q73J069
55589G8409J679J271J113J145P31L08M05L13n61j138k41J410K303K241J923J580
55573I2891J386K069L722N102N358N361O016O511N533L189N69j617l023l597m259
55558A25211o220q752r335p077m149k675k071r34L25N41j3k97j99k7M40J080R67
55541H6815P2n0J297K395J637O8l45L72R11J033J307J505J117O49P16O77k30j165
55523I8781q47L04P40M4p84r70o56l27m57j303k394k804k421k074k087j873j343
$$ plain form
55635 171698 166991 161652 155120 148264 142468 137609 132809 128532 125906 124518 122895 120776 119028 117780
55621 117780 116533 115620 115619 115750 114810 113242 112359 111990 110902 109107 107615 106240 103834 100563 97880 96229
55605 96229 94782 93339 92525 92049 90766 88625 86805 85777 84928 84032 83387 82500 80543 78213 77340 78409
55589 78409 80088 81359 82472 83617 84348 84656 85061 85374 84813 83675 83434 84844 87147 89388 91311 92891
55573 92891 94277 96346 100068 105170 110528 115889 121905 128416 133949 137138 137707 136090 133067 129470 125211
55558 125211 118991 110239 100904 93827 89678 87003 84932 83998 84323 84864 84851 84554 84355 84328 84768 85848 86815
55541 86815 86887 86837 88134 90529 92166 92234 91889 92261 93172 94205 95512 97017 98134 98783 99499 100176 99946 98781
55523 98781 97934 98238 98978 99022 98238 97268 96612 96285 95828 94525 92131 89327 86906 84832 82745 80872 79529
55506G9529j254j590j303l61k23j361k214j708r24r11q44Q9P65k2j355j631r71
55489F3711m82l92m18q12j444j217K03J358J185O62Q42R06kp55j17R38R13M07
55471F5486P61J412R77j08m21j23l29p70m59L1o46j990k206j058m9Q1KJ39J71
55452F0901J28L12L99lk78K54R01O83J23K49N38k32j587j854p70L03N69M97M51
55433F1584L02K43N39O68J13l94Q9R45Q19k30r95j111j067p29L87J613J732Q50
55415F5358J14k07o74j065n94M14P83L59J3j10o58j447j454n70J51J45r1j90l42
55396E9935n26m64l13l42k21L15N69o3p48l94M38M31j92j29N95P18R1m8O84J177
55376F1513P68J80Q3J48k2k70m76p40p62j38P53J106Q60N23J67l28m74J00O18
$$ plain form
55506 79529 78275 76685 75382 75021 74798 73437 71223 69515 68591 67680 66836 66925 67690 67668 66313 64682 63711
55489 63711 63229 62837 62419 61607 60163 58946 59149 60507 61692 62354 63196 64102 64100 63345 63228 64166 65079 65486
55471 65486 66247 67659 68636 68528 68107 67984 67655 66885 66426 66457 65811 63821 61615 60557 60508 60589 60591 60730 60901
55452 60901 61029 61341 61740 61737 61459 61713 62614 63297 63420 63669 64207 63975 62388 60534 59764 60067 60636 61133 61584
55433 61584 61886 62129 62668 63336 63449 63055 63144 64089 64908 64678 63683 62572 61505 60776 61163 62776 64508 65358
55415 65358 65472 65265 64591 63526 62932 63346 64129 64488 64501 64391 63733 62286 60832 60262 60413 60558 60467 60277 59935
55396 59935 59409 58945 58632 58290 58069 58384 58953 58890 58142 57748 58186 58617 58425 58296 58891 59609 59700 59652 60336 61513
55376 61513 62281 62461 62544 62692 62670 62400 61924 61184 60422 60284 61037 62143 63003 63526 63693 63365 62891 62991 63609
55357F3609K33l83p9O87N94j39j21O82Q63J32j87M66R91O71L14N98Q80M01n95
55338F9617j491j982j704m31J032J379N75k7L34R41R60N31O6l84o77m92k8O9k70
55319F8018m90l80k73l13m53r93k041k724k170j004n51q41q28l72k85m89N8J391
55301E5260K178J748R78P36Q43R59J163J325J121Q92J228J685J254J63l43m6Q2
55284G1226r9L78J448J549M3j595j863j043j47M78P11J58r16j413r64n54r02j335
55266F5160j052l35K91R81J823K163J548N33j40l89l20J84Q84J039M92RJ55N61
55248G3587P19N73P4r04j876j998j363r52j073j005m68j26k25q3M79N81j66q71
55230F4903q98q18j108j101k75O09P06M82Q26J603K036J889J376N66l24o41o3
$$ plain form
55357 63609 63842 63459 63380 64067 64661 64522 64401 65083 65946 66078 65891 66357 67348 68019 68333 68931 69811 70212 69617
55338 69617 68126 66144 64440 64009 65041 66420 66995 66968 67302 68243 69203 69734 69800 69416 68739 68247 68219 68288 68018
55319 68018 67528 67148 66875 66562 66109 65116 63075 60351 58181 57177 56626 55785 54957 54585 54300 53811 53869 55260
55301 55260 57438 59186 60164 60900 61743 62702 63865 65190 66311 67203 68431 70116 71370 71533 71190 71144 71226
55284 71226 71127 71505 72953 74502 74545 72950 71087 70044 69897 70375 71086 71244 70328 68915 67951 67397 66495 65160
55266 65160 64108 63773 64064 65045 66868 69031 70579 71112 70972 70583 70263 70447 71331 72370 72862 72871 73026 73587
55248 73587 74306 74879 74953 74049 72173 70175 68812 67860 66787 65782 65314 65188 64963 64880 65359 65940 65774 64903
55230 64903 64005 63187 62079 60978 60703 61312 62018 62500 63326 64929 66965 68854 70230 70796 70472 69831 69768
55213F9768Q40J321J238P41j17j027j420j225r43p12j69N11N10k22o20q5O03O13
55195F9605K35P1O1O7L99J047J224N92lK24P61O29j81r05j051o22J53P53O00j28
55175G3531n53k70J76K69J54k4m54r08o85K27R07Q78P31Q71Q02K42j26J94O50
55156G6612P06P67J233J517R65m7o63n92OQ49J222L40j354k186j340M5N71L41
55138G8992J95K30J16J6J49J07m21r15q19l91n9L45R08J049M16l30n28m70n49
55119G8041l57M05R71N95j63l08K5L9k72l05m5k8l02m01j80Q2K55L88M15L45M23
55098G9623P17R19Q45O44L12k54o13j46O98P20r1l19N22R63l2j193p77Q15J833
55079H5186J679J110O31K01L1L11M16l14j390j794j461j082q26l64J85L77L14
$$ plain form
55213 69768 70608 71929 73167 73908 73791 72764 71344 70119 69176 68464 68295 68806 69316 69094 68474 68389 68992 69605
55195 69605 69840 69911 69972 70039 70438 71485 72709 73301 73298 73522 74283 74912 74731 73826 72775 72153 72306 73059 73659 73531
55175 73531 72978 72708 72884 73153 73307 73283 72829 71921 71236 71463 72370 73248 73979 74850 75652 75894 75768 75962 76612
55156 76612 77318 78085 79318 80835 81800 81753 81090 80498 80504 81353 82575 82915 81561 79375 78035 78080 78651 78992
55138 78992 79187 79417 79533 79549 79698 79805 79384 78469 77650 77259 77200 77545 78453 79502 79918 79588 79060 78590 78041
55119 78041 77684 78089 79060 79655 79492 79184 79209 79248 78976 78671 78626 78598 78296 77895 77715 77797 78052 78440 78855 79200 79623
55098 79623 80340 81259 82104 82748 83060 82806 82193 82047 82745 83465 83374 83055 83577 84540 84508 83315 82538 83353 85186
55079 85186 86865 87975 88606 88807 88838 89149 89565 89251 87861 86067 84606 83524 82698 82334 82519 82896 83210
55062H3210M16O08M98J21k26m43l53M40J664K128J211j11o09m25l51l87k09k58
55044H6924r98j681j316l74j05n25n59M2M05J46j24n2r3n34r16p27l3P31J100
55025H1311Q42L13K52Q13J257J041N84L30p9q58j190l76Q37J257R56P47O27M0
55007H8704p24q59m57k86l74j44K88K48j73k01K62N02K70J09L30O59Q99J081J052
54988I1186P01M23N33N88J18l55r3N07M94q9m02k35m8J76P66J296R78O8l89j34
54968I6089K10M08P73J121Q87K74J3N2k60p56o23j3Jp71j300j047o52n66l83N2
54948I3509J98q7j86P3M2m56o15KO49N83Q0l21o60r96q88j59N19N30K60M83J238
54927I3798J919K077J717J034L06j25p2M35J272K253L164M029N137O415P144O752
$$ plain form
55062 83210 83626 84234 84732 84853 84627 84184 83831 84271 85935 88063 89274 89163 88554 88129 87778 87391 87182 86924
55044 86924 85926 84245 82929 82555 82450 81925 81366 81408 81813 81959 81835 81783 81690 81156 80240 79513 79480 80211 81311
55025 81311 82153 82466 82718 83531 84788 85829 86413 86743 86664 85806 84616 84240 85077 86334 87290 88037 88664 88704
55007 88704 87980 87121 86664 86378 86004 85860 86148 86396 86223 86022 86284 86786 87056 87165 87495 88154 89053 90134 91186
54988 91186 91887 92310 92843 93431 93549 93194 93101 93608 94102 94013 93611 93376 93328 93504 94270 95566 96544 96612 96223 96089
54968 96089 96299 96707 97480 98601 99488 99762 99775 99827 99567 98811 98188 98175 98176 97405 96105 95058 94406 93840 93457 93509
54948 93509 93707 93620 93434 93507 93549 93093 92478 92480 93129 93712 93792 93471 92811 91815 90927 90768 91287 91817 92077 92560 93798
54927 93798 95717 97794 99511 100545 100851 100726 100654 101089 102361 104614 107778 111807 116944 123359 130503 137255
54911A37255N636M558L625K446R65o18k392m278n456n231m207l627l755l868l657
54896A17396l514l535l341k838k242j422k25P61P91J17m12o98j154j467r44Q9
54880I7362O55Q04J435K523L127L257L937N200N781N319N056N611N773M519K681
54865A53040J439M48j168k969l790l526l107l044l013k717k380k364k770l329
54851A20750l505l024k360k210k529k632k252j765j441j226j249j613j729r34
54837I2281K21N06p6k54L94P62J19o98p83m83m00k20M42J065J088R58J245J478
54819I7645Q46l61j069p89j6N34M96J0l19oN95O45N4l62j91J5k07m91m21j67M7
54798I6488L63O79N37N9N0O97J135Q44M77N94P10L35p6n9j26p66j346j022j00
$$ plain form
54911 137255 142891 147449 151074 153520 154485 153867 151475 147197 141741 136510 132303 128676 124921 121053 117396
54896 117396 113882 110347 107006 104168 101926 100504 100279 101040 101831 101948 101536 100838 99684 98217 97273 97362
54880 97362 98017 98821 100256 102779 105906 109163 113100 118300 124081 129400 134456 140067 145840 150359 153040
54865 153040 154479 154927 153759 150790 147000 143474 140367 137323 134310 131593 129213 126849 124079 120750
54851 120750 117245 114221 111861 109651 107122 104490 102238 100473 99032 97806 96557 94944 93215 92281
54837 92281 92502 93008 92932 92678 93072 93834 93953 93255 92472 91989 91589 91369 91811 92876 93964 94922 96167 97645
54819 97645 98491 98130 97061 96272 96256 96790 97286 97296 96977 96971 97566 98211 98265 97903 97712 97727 97520 97029 96608 96441 96488
54798 96488 96851 97530 98067 98126 98176 98873 100008 100852 101329 101923 102633 102968 102892 102833 102707 101941 100595 99573 99473
54779I9473N01N87N50N21M81P00J189J344R07O45J234K141K528K625L113L798
54763A22337M041M024M405N015N081M554M092L844L278K248J218L29r29k852m940
54748A55745o368o642n779m320l118k689k751k665k149j338m83J15J90j25l57
54733A17266l79o46j326j840j680j154p29j99Q13J979K666K857L013L239L283
54718A27163L205L369L894M533M988M993M342L177J990R72k13j746l198m188m901
54703A48380n429n302m308l260l052l397l311k558j791j434j292j234j450j910
54689A08652k146j754q37J19O15M92J54J53M35L48l64j015q74j55L60L36Jl62
54671A04158n80m11K47J028J373J013O5j081j850j809j189o62n09m15j59P5K07
$$ plain form
54779 99473 99974 100561 101111 101632 102113 102813 104002 105346 106253 106898 108132 110273 112801 115426 118539 122337
54763 122337 126378 130402 134807 139822 144903 149457 153549 157393 160671 162919 164137 164466 163537 160685 155745
54748 155745 149377 142735 136956 132636 129518 126829 124078 121413 119264 117926 117443 117558 117748 117623 117266
54733 117266 116887 116241 114915 113075 111395 110241 109512 109313 110126 112105 114771 117628 120641 123880 127163
54718 127163 130368 133737 137631 142164 147152 152145 156487 159664 161654 162626 162413 160667 157469 153281 148380
54703 148380 142951 137649 133341 130081 127029 123632 120321 117763 115972 114538 113246 112012 110562 108652
54689 108652 106506 104752 103915 104034 104649 105141 105295 105448 105883 106231 105867 104852 103978 103823 104183 104519 104520 104158
54671 104158 103578 103167 103414 104442 105815 106828 106893 105812 103962 102153 100964 100302 99793 99378 99219 99294 99501
54654I9501M19N37P6p82j077l68N64Q24M96J33n3L4O29J484J736J056K42L5J30
54635A05616jj48o8k46r04j114r0J279J482N04l37l82j84j64l9L60O52N42K12
54616A06970n1p4K42O56N56k46j070j271j162j242j057R7J719K473J959J106P06
54599A10311N30O6o74j343j679j503q00R6P41R85R32O79M10M40P42Q38N04K12
54581A11487L58N90M16N1l0J03J40K10N02O35J39o67j011o18J60Q62J059N25k58
54562A14653l80J63K57o10j345r39p0J11j56PL31K2m92k16M54K90m60k69J052
54543A12403J901J379N17L68N45M43N40J451K650L142K706J785P23k72r02j062
54527A28317r78q64p72q62j189j319q02l3J08m57r50r27o66l06M02J255J532J087
$$ plain form
54654 99501 99920 100457 100533 99751 98674 98306 98870 99694 100190 100323 100270 100304 100933 102417 104153 105209 105451 105486 105616
54635 105616 105615 105467 105399 105153 104249 103135 103045 104324 105806 106310 105973 105591 105407 105243 105204 105564 106216 106758 106970
54616 106970 106919 106845 107087 107743 108299 108053 106983 105712 104550 103308 102251 102348 104067 106540 108499 109605 110311
54599 110311 110841 110907 110233 108890 107211 105708 104908 105004 105745 106730 107662 108341 108751 109191 109933 110771 111275 111487
54581 111487 111845 112435 112851 112902 112872 112975 113115 113325 113827 114462 114601 113934 112923 112305 112465 113327 114386 114911 114653
54562 114653 114273 114436 114693 114083 112738 111799 111729 111840 111684 111691 112022 112044 111552 111336 111790 112080 111620 111351 112403
54543 112403 114304 115683 116200 116568 117113 117556 118096 119547 122197 125339 128045 129830 130553 130281 129379 128317
54527 128317 127339 126475 125703 124841 123652 122333 121531 121498 121606 121149 120199 119272 118606 118300 118702 119957 121489 122576
54509A22576O53O78P30L79j04l20l64m37m58l69k96k35n9Q0m1j52J02K84l35j398
54489A20914j647p12L99R34J297J856J993J154o4p39q66r29q16r4R78J590J419
54472A26667R28O22M91K95M4J0L48Q02J023J104J455J946J791P18l76o21m07n23
54454A36317o42M1J020R25k63j011o15k40r09j841j850j192q56p99k33P20R21
54437A29493j59j618k147j420k10O09Q96J107J403J329N92k32l51J22L79J43k4
54420A29912K63O74P57M81O9k46k09J77M58K80j4L9J49j55m55l1O98N52n05j176
54400A31718p33J01N50P94J183J568J857K228K319J435m6p28k44N0p25j447p88
54383A39092O50J293R10N67P88J088J051P68L05l82j016j201r76o53l50n4J39
$$ plain form
54509 122576 123229 123907 124637 125016 124912 124592 124228 123791 123333 122964 122668 122433 122374 122454 122413 122261 122363 122647 122312 120914
54489 120914 119267 118555 118954 119888 121185 123041 125034 126188 126124 125385 124519 123590 122774 122680 123658 125248 126667
54472 126667 127595 128217 128708 129003 129047 129057 129405 130207 131230 132334 133789 135735 137526 138244 137868 137247 136840 136317
54454 136317 135675 135716 136736 137661 137398 136387 135772 135532 134623 132782 130932 129740 128884 128085 127852 128572 129493
54437 129493 129334 127716 125569 124149 123939 124548 125444 126551 127954 129283 129875 129643 129292 129414 129793 129936 129912
54420 129912 130175 130849 131606 132087 132156 131910 131701 131878 132336 132616 132602 132641 132790 132635 132180 132149 132847 133399 132894 131718
54400 131718 130985 131086 131636 132430 133613 135181 137038 139266 141585 143020 142974 142246 142002 142052 141327 139880 139092
54383 139092 139742 141035 141945 142512 143300 144388 145439 146207 146512 146130 145114 143913 142937 142284 141934 141880 142019
54366A42019K91O51J052Q02k81j244j000L60J804K476K170J202L14K17P24Q91
54350A52448L77R8R21K399L482L838L742L216K141Q48j23o60r13q69o70q32j578
54333A67865k391k782l032l533l952l768l146k509j736n76N31R12O69M30L77K22
54317A43581r2m16q28j352j538j017j93L09M89O53O16J23m07m09j95m51r68r40
54299A36965l89j75n60q07m62l1o4l53m59l66k51j77k88p98j467j585q57J49P42
54280A28767R81J413K178K758K615J755O77j82p99j335j678j466o88J00L61J90
54264A35647R2L60Q63J325J522J357R67O19M05K03N5K24P13J102J082Q11N09O9
54246A47925n78j075j098p92m78j68K19M77L72rm36q76j244j260q94o26q03j012
$$ plain form
54366 142019 142310 142961 144013 144815 144534 143290 142290 142650 144454 146930 149100 150302 150616 150833 151557 152448
54350 152448 152825 152923 153844 156243 159725 163563 167305 170521 172662 173510 173387 172727 171814 170945 170275 169443 167865
54333 167865 165474 162692 159660 156127 152175 148407 145261 142752 141016 140440 140971 141883 142552 142982 143359 143581
54317 143581 143489 143073 142245 140893 139355 138338 138145 138454 138943 139596 140212 140335 139928 139519 139324 138873 137905 136965
54299 136965 136576 136401 135841 135034 134572 134541 134477 134124 133665 133299 133048 132871 132583 131785 130318 128733 127876 128025 128767
54280 128767 129748 131161 133339 136097 138712 140467 141144 140962 140163 138828 137150 135684 134996 135096 135457 135647
54264 135647 135739 136099 136962 138287 139809 141166 142133 142752 143157 143360 143415 143639 144352 145454 146536 147347 147856 147925
54246 147925 147347 146272 145174 144382 143904 143736 143955 144432 144804 144795 144359 143483 142239 140979 140085 139459 138656 137644
54228A37644o45K00Q44R48P51N38K94k4k60k15J02L63J72m59r06o21R2M44K43
54209A39505O9K52N06O90J070J494J176o7j192j197m30P7m6m86r57j224r19j96
54191A38125P9n14j071n78N45J055N97k04j002j871k399j855m26P46R93P52N91
54174A33563M35J00j68j23pj89o04q35o64l29l23q50j454j409n57M93J138J322
54156A29539J183O87l4m83m03j46o0JK10L79M75Q50J471J614R44K13J02J68k60
54137A36450q98j177j275j364p10J118K760K488P28m12k0Q22J031O61q1j231k082
54120A36808j409O61K352K442J645J098P93L00r4k1J10j46l53K9N62N09Q6Q6N62
54101A46020Q18N48J68kj17l55n61n12k20Q4J06k59n97j85J150K538K820J812
$$ plain form
54228 137644 136999 137199 138043 138991 139742 140280 140574 140550 140290 140075 140177 140540 140712 140253 139347 138726 138818 139262 139505
54209 139505 139574 139826 140332 141022 142092 143586 144762 144695 143503 142306 141876 141953 141907 141421 140464 139240 138321 138125
54191 138125 138204 137690 136619 136041 136586 137641 138238 138034 137032 135161 132762 130907 130481 131227 132220 132972 133563
54174 133563 133998 134098 133930 133807 133800 133611 133007 132172 131508 131179 130856 130006 128552 127143 126586 127079 128217 129539
54156 129539 130722 131409 131375 130892 130489 130343 130283 130284 130494 130873 131348 132198 133669 135283 136227 136440 136542 136710 136450
54137 136450 135552 134375 133100 131736 131026 132144 134904 137392 138120 137708 137688 138510 139541 140202 140121 138890 136808
54120 136808 135399 136060 138412 140854 142499 143597 144390 144690 144596 144575 144685 144539 144186 144215 144777 145286 145372 145458 146020
54101 146020 146838 147386 147554 147552 147435 147080 146519 146007 145787 145871 145977 145718 145121 144936 146086 148624 151444 153256
54083A53256M30m29p35r18r73m89M55J009N88j36K5J116J898J567P56M14M73L97
54065A58704L69Q82J571J588J028Q76J479K072K138K207K945M170N349O406P431
54050A99215Q015P527N914L783J771J61r87j646j868j856j799j608r95L1R22J300
54034B17880J700K895M467M925L770K426K426L379L792L249K586K228J726R11
54020B58360L23K39K49L5k63o48j371k201k417j860j317j532k443l625m845n847
54004B30837o201n743m817l834k985k466k477k840l035k813k375j925j456j016
53990A86854p43n65k70J06L05J88k94j176k113k317j514o04o03j210j292n47L18
53973A74523Q11J056J018M69k00k41K67M40k7n08n93n59m99p2O24J004J154J877
$$ plain form
54083 153256 153686 153257 152522 151604 150631 150142 150597 151606 152194 152058 152083 153199 155097 156664 157420 157834 158307 158704
54065 158704 159073 159955 161526 163114 164142 165018 166497 168569 170707 172914 175859 180029 185378 191784 199215
54050 199215 207230 214757 220671 224454 226225 226386 225399 223753 221885 220029 218230 216622 215627 215658 216580 217880
54034 217880 219580 222475 226942 231867 235637 238063 240489 243868 247660 250909 253495 255723 257449 258360
54020 258360 258683 258922 259171 259206 258943 258295 256924 254723 252306 250446 249129 247597 245154 241529 236684 230837
54004 230837 224636 218893 214076 210242 207257 204791 202314 199474 196439 193626 191251 189326 187870 186854
53990 186854 186111 185546 185276 185382 185687 185875 185581 184405 182292 179975 178461 177857 177254 176044 174752 174205 174523
53973 174523 175334 176390 177408 177877 177677 177436 177703 178143 178116 177608 177015 176456 175957 175885 176509 177513 178667 180544
53955A80544L248M206M119L677L671L936M109M466N246N907N809N026L940K778
53941B40682J946K004K728L024K414J754J813K077J706R02L86K05jl5O09J809
53925B64023K924L588L837L749L515L555L981M342M311M239M693N769P207Q661
53911C28394R577R508Q867Q662R105R301Q787Q421R111J0548J1898J2762J2560
53898D57501J0016M627j963p382j0992j3817j6432j8169j8433j7543j6103j4386
53886C36924j2599j1086r979r160q536q006p243n998m564l516l125l280l740m087
53872B42005l810k920k198k362l219m025m310m000l168k188j662j675j593j098
53858B03777q30j369k162k288j814j496j536j500j246j050r50p41m60l05k41k92
$$ plain form
53955 180544 183792 187998 192117 195794 199465 203401 207510 211976 217222 223129 228938 233964 237904 240682
53941 240682 242628 244632 247360 250384 252798 254552 256365 258442 260148 261050 261436 261641 261640 261605 262214 264023
53925 264023 266947 270535 274372 278121 281636 285191 289172 293514 297825 302064 306757 312526 319733 328394
53911 328394 337971 347479 356346 365008 374113 383414 392201 400622 409733 420281 432179 444941 457501
53898 457501 467517 472144 470181 462799 451807 437990 421558 403389 384956 367413 351310 336924
53886 336924 324325 313239 303260 294100 285564 277558 270315 264317 259753 256237 253112 249832 246092 242005
53872 242005 238195 235275 233077 230715 227496 223471 219161 215161 211993 209805 208143 206468 204875 203777
53858 203777 202947 201578 199416 197128 195314 193818 192282 190782 189536 188486 187536 186795 186335 186030 185789 185497
53842A85497p68j566j734o27Q78J375Q41N06R95J688J875J585J140P55O40P44
53826A93824N40j49m11N49J739J316o81k088j535j78K34k40l82J42O57R04J337
53809A95578K158K975L502L845M058M003L755L664L864M084M002L621L185K989
53795B45283L298M156N184N691N167L731K070R30N69O34O20L68P3j87o84j669
53779B75234k931l909m246m098l862l783l845l894l760l361k892k735k955l068
53765B25895k720k475l187m505m862l475j596r90j706k318k029j358q64l74K41
53750A93677N45K70k04m41m60l11R5N74O80M25K54J68k61q13n59O51J660J570
53732A97520Q92M69K64k0j4N74J069P37qk80m5K17N85J313J857J463N18J36N74
$$ plain form
53842 185497 184729 183163 181429 180802 181680 183055 183896 184402 185397 187085 188960 190545 191685 192440 193080 193824
53826 193824 194364 194215 193804 194353 196092 197408 196727 194639 193104 192926 193160 192920 192538 192680 193337 194241 195578
53809 195578 197736 200711 204213 208058 212116 216119 219874 223538 227402 231486 235488 239109 242294 245283
53795 245283 248581 252737 257921 263612 268779 272510 274580 275510 276079 276713 277333 277701 277774 277587 276903 275234
53779 275234 272303 268394 264148 260050 256188 252405 248560 244666 240906 237545 234653 231918 228963 225895
53765 225895 223175 220700 217513 213008 208146 204671 203075 202085 200379 198061 196032 194674 193810 193436 193677
53750 193677 194222 194492 194288 193847 193387 193076 193171 193745 194425 194850 195104 195272 195011 194198 193639 194290 195950 197520
53732 197520 198412 198881 199145 199125 199111 199685 200754 201491 201483 201203 201158 201375 201960 203273 205130 206593 207111 207247 207821
53713B07821J128J520K169L118L683L463K802K120J518J242J680K634L264L100
53699B41262K564K246K184K072J831J674J827K318K919L288L296L084K755K228
53685B75548J564R91M78k65j147j596j440j263j449j579j282r31q68p22k57j49
53669B65633q65j537j131k39l13j423k164j753r06n13n71p46r96j220j057l54
53653B49845O14J457J815J359K35o76o70j15K10L74R65J820K154J882J723J948
53637B64940K041J715J329J089P40K39j1J82N95J164K000K803K993K542K044J931
53621B88336K179K709L373L775L785L951M594M902M002K583K149K838L430L471
53607C36077L816M775N288M536L180K278K058K279K841L470L622L206K722K375
$$ plain form
53713 207821 208949 210469 212638 215756 219439 222902 225704 227824 229342 230584 232264 234898 238162 241262
53699 241262 243826 246072 248256 250328 252159 253833 255660 257978 260897 264185 267481 270565 273320 275548
53685 275548 277112 278103 278581 278316 277169 275573 274133 272870 271421 269842 268560 267629 266761 266039 265782 265633
53669 265633 264768 263231 262100 261861 261548 260125 257961 256208 255302 254789 254218 253472 252476 251256 250199 249845
53653 249845 250459 251916 253731 255090 255325 254649 253979 253864 254074 254448 255413 257233 259387 261269 262992 264940
53637 264940 266981 268696 270025 271114 271854 272093 272082 272264 272859 274023 276023 278826 281819 284361 286405 288336
53621 288336 290515 293224 296597 300372 304157 308108 312702 317604 321606 324189 326338 329176 332606 336077
53607 336077 339893 344668 349956 354492 357672 359950 362008 364287 367128 370598 374220 377426 380148 382523
53593C82523J941J653K079K819K541Q11j208k438l137l842m272m096l789l857
53579C67728l990l773l464l327l059k563k469l041l414k831j808j238j013n83
53565C31155j13o9j49K40Q40R56O96P67J193J232O08n9j89J08M49P76J292K061
53547C41794K769K949K599K459L208M393M847M311L870M350N162N369N150N449
53533C98679O585Q019R225J0046J0472J0608J0778J1198J1706J2171J2811J3745
53521E26043J4585J4909J4880J4992J5536J6539J7967J9591K1041K2199K3193
53510G21475K3891K3900K3367K3072K3508K4330K5050K5558K5688K5064K3824
53499I88727K2775K2354K2086K1537K0981K0652K0180J9373J8776J8735J8697
$$ plain form
53593 382523 384464 386117 388196 391015 393556 394367 393159 390721 387584 383742 379470 375374 371585 367728
53579 367728 363738 359965 356501 353174 350115 347552 345083 342042 338628 335797 333989 332751 331738 331155
53565 331155 331042 330973 330824 331064 331904 332860 333556 334323 335516 336748 337356 337297 337108 337216 337665 338441 339733 341794
53547 341794 344563 347512 350111 352570 355778 360171 365018 369329 373199 377549 382711 388080 393230 398679
53533 398679 405264 413283 422508 432554 443026 453634 464412 475610 487316 499487 512298 526043
53521 526043 540628 555537 570417 585409 600945 617484 635451 655042 676083 698282 721475
53510 721475 745366 769266 792633 815705 839213 863543 888593 914151 939839 964903 988727
53499 988727 1011502 1033856 1055942 1077479 1098460 1119112 1139292 1158665 1177441 1196176 1214873
53488A214873J8193J7694J7736J7933J7781J7643J7966J8209J7658J6693J6047
53477A408426J5375J3710J1031Q201N609L021M44j885m258p097r985j2101j3446
53464A417045j4642j5714j6229j6503j7375j8670j9204j8557j7787j7962j8975
53453A225427k0163k1230k2053k2350k2031k1404k0681j9806j8924j8398j8047
53442A000340j7009j4721j1616q588o113m242k907j953j066k9J081K001K560K882
53428I40620L482M924P108R126J0263J0913J1975J3572J5048J6095J7217J8886
53416A079229K0872K2602K3812K4712K5795K7514K9804L2054L3772L5155L6696
53405A392017L8492M0441M2699M5361M7877M9598N0767N2261N4321N6285N7566
$$ plain form
53488 1214873 1233066 1250760 1268496 1286429 1304210 1321853 1339819 1358028 1375686 1392379 1408426
53477 1408426 1423801 1437511 1448542 1456743 1462352 1465373 1465817 1463932 1459674 1452577 1442592 1430491 1417045
53464 1417045 1402403 1386689 1370460 1353957 1336582 1317912 1298708 1280151 1262364 1244402 1225427
53453 1225427 1205264 1184034 1161981 1139631 1117600 1096196 1075515 1055709 1036785 1018387 1000340
53442 1000340 983331 968610 956994 948406 942293 938051 935144 933191 932125 932096 933177 935178 937738 940620
53428 940620 944102 949026 956134 965260 975523 986436 998411 1011983 1027031 1043126 1060343 1079229
53416 1079229 1100101 1122703 1146515 1171227 1197022 1224536 1254340 1286394 1320166 1355321 1392017
53405 1392017 1430509 1470950 1513649 1559010 1606887 1656485 1707252 1759513 1813834 1870119 1927685
53394A927685N8208N8449N8393N8199N7960N7342N5897N3877N2012N0485M8795
53383B537302M6710M4543M2297L9371L5434L0961K6499K2037J7422J2783Q114
53372B863473K996k794q904j5084k1724k9105l6503m2707m7270n0699n3550n5819
53360B502310n7289n8009n8224n8049n7305n5715n3226n0255m7537m5708m4974
53349A916019m5041m5272m5043m4224m3184m2201m1021l9384l7622l6262l5075
53338A461690l3204l0362k7259k4606k2222j9604j6928j4914j3839j3240j2611
53327A232901j2101j2217j3050j3982j4220j3537j2415j1454j0845j0373r747
53316A098960q738p266n526l901k493r34J053L081M493N237N984P326R155J0967
$$ plain form
53394 1927685 1985893 2044342 2102735 2160934 2218894 2276236 2332133 2386010 2438022 2488507 2537302
53383 2537302 2584012 2628555 2670852 2710223 2745657 2776618 2803117 2825154 2842576 2855359 2863473
53372 2863473 2866469 2863675 2854771 2839687 2817963 2788858 2752355 2709648 2662378 2611679 2558129 2502310
53360 2502310 2445021 2387012 2328788 2270739 2213434 2157719 2104493 2054238 2006701 1960993 1916019
53349 1916019 1870978 1825706 1780663 1736439 1693255 1651054 1610033 1570649 1533027 1496765 1461690
53338 1461690 1428486 1398124 1370865 1346259 1324037 1304433 1287505 1272591 1258752 1245512 1232901
53327 1232901 1220800 1208583 1195533 1181551 1167331 1153794 1141379 1129925 1119080 1108707 1098960
53316 1098960 1090222 1082956 1077430 1073529 1071036 1070102 1071155 1074236 1078729 1083966 1089950 1097276 1106431 1117398
53302A117398J2459J3745J5137J6808J8652K0410K1995K3575K5288K7062K8716
53291A341245L0026L0594L0102K8822K7496K6416K5014K2774K0100J7709J5517
53280A615815J2836R503O088K968o1l121n857q037j0063j2538j5541j8574k1101
53267A552317k2945k4282k5358k6182k6617k6761k7061k7827k8875k9869l0754
53256A255786l1501l1736l1074k9768k8533k7701k6981k6077k5188k4849k5352
53245I47026k6397k7134k6774k5309k3482k1884k0457j9065j8051j7651j7299
53234G03523j6181j4287j2337j0770r447q229p255o656o459o747p521q518r601
53221E79515j1033j2882j4430j4889j4447j3943j3609j2987j1958j1007j0373
$$ plain form
53302 1117398 1129857 1143602 1158739 1175547 1194199 1214609 1236604 1260179 1285467 1312529 1341245
53291 1341245 1371271 1401865 1431967 1460789 1488285 1514701 1539715 1562489 1582589 1600298 1615815
53280 1615815 1628651 1638154 1644242 1647210 1647149 1644028 1638171 1630134 1620071 1607533 1591992 1573418 1552317
53267 1552317 1529372 1505090 1479732 1453550 1426933 1400172 1373111 1345284 1316409 1286540 1255786
53256 1255786 1224285 1192549 1161475 1131707 1103174 1075473 1048492 1022415 997227 972378 947026
53245 947026 920629 893495 866721 841412 817930 796046 775589 756524 738473 720822 703523
53234 703523 687342 673055 660718 649948 640501 632272 625017 618361 611902 605155 597634 589116 579515
53221 579515 568482 555600 541170 526281 511834 497891 484282 471295 459337 448330 437957
53210D37957r785r190q960r139r185q760q139p606p069o517o279o512o899p096
53196C26821p085o847o288n571n054m676l976k954k312k455k897k965k637k300
53182B68804k115k051k144k281k060j279l76k4l72r38j189j049r15j179j684j792
53166B47356j226n62n20r78j251j166j161j337j244o80k0M85R74J330J004p5j099
53149B39830j375j218j344j826k160k055j647j171q06o42n24j71L74O91N83M25
53133B26964O50J230J813K080J789Q93j89p32m83R9M46M29K26M3J36O36J215J365
53115B38610J147J081J214R95L48JL11M99k40j489k176j939j228m04M10Q84O11
53098B38635k52j085j513j599j468j261j253j595j949j892j602j669k144k351
$$ plain form
53210 437957 428172 418982 410022 400883 391698 382938 374799 367193 360124 353607 347328 340816 333917 326821
53196 326821 319736 312889 306601 301030 295976 291300 287324 284370 282058 279603 276706 273741 271104 268804
53182 268804 266689 264638 262494 260213 258153 256874 256498 256474 256102 255164 253975 252926 252011 250832 249148 247356
53166 247356 246130 245568 245048 244070 242819 241653 240492 239155 237911 237231 237211 237696 238670 240000 241004 240929 239830
53149 239830 238455 237237 235893 234067 231907 229852 228205 227034 226228 225586 225062 224891 225265 225956 226539 226964
53133 226964 227614 228844 230657 232737 234526 235419 235230 234498 234015 234114 234560 234989 235215 235258 235394 236030 237245 238610
53115 238610 239757 240838 242052 243047 243395 243396 243707 244206 243966 242477 240301 238362 237134 236730 237140 238024 238635
53098 238635 238383 237298 235785 234186 232718 231457 230204 228609 226660 224768 223166 221497 219353 217002
53084B17002j763p00R4L86O61J403K316K531J669M92Q9N51R39O31O8n0K42M20
53066B26981L34K27K04J86K33M51N49M0j055k004k082j312m26o1j56k07m7m5m10
53047B21400o95m82j67l74p48l15R13J629R48m13j245j325j189r93n46l4J12q3
53029B16393k30k40k67j80K94R29J131P21J05l44n38m03J75R67J439J316Q09K18
53011B22295k73m48q8O34J089Q14K4o14o60k22K74M72K73k22p74j011o19K87J067
52992B22298J176P88N17N78O26M55L32M74O92P92R41J272J526J415J049O73L32
52975B35936J22L85J217K045K224J878J670J898K237K324K070J527Q75N11P16
52960B57635J064P31m95j741j956j033J45P21N75O0o62j622k533k798k319j863
$$ plain form
53084 217002 215239 214539 214633 215019 215680 217083 219399 221930 223599 224091 224180 224731 225670 226301 226369 226319 226561 226981
53066 226981 227315 227542 227746 227932 228165 228616 229165 229205 228150 226146 224064 222752 222326 222265 222109 221902 221855 221810 221400
53047 221400 220705 220223 220056 219682 218934 218619 219532 221161 222109 221696 220451 219126 217937 216944 216398 216364 216476 216393
53029 216393 216163 215923 215656 215476 215770 216699 217830 218551 218656 218312 217774 217371 217546 218513 219952 221268 222077 222295
53011 222295 222022 221574 221486 222120 223209 224023 224047 223433 222773 222551 222825 223297 223570 223348 222574 221563 220944 221231 222298
52992 222298 223474 224262 224779 225357 225983 226438 226770 227244 227936 228728 229669 230941 232467 233882 234931 235604 235936
52975 235936 236058 236443 237660 239705 241929 243807 245477 247375 249612 251936 254006 255533 256408 256919 257635
52960 257635 258699 259430 258935 257194 255238 254205 254350 255071 255646 255706 255044 253422 250889 248091 245772 243909
52944B43909k136k697k496j416n11n33r55r67p22r07j381j179O8J381J504L48
52928B31310j010j577j419j251j419j564j243m90L60J091J547J524J030M66J02
52913B27457k86q89j208o57M32J096R55M31j39p53j126q06j00L6o01j093p65q3
52895B21901L45P12J282J515Q15l85j102r75l61L89J014J142O47ql52n34q30r30
52877B24285m43K41L69p2l76j92J49L81P39J428K122K240J590O42J51M29R86J135
52859B35804Q38O01O05N52L55K37Q5m72j141j047k16J05q29k169k835l034l436
52842B24003l736l233k201j503j306j261j462k065k384j650l89K06J00K84J017
52827B04420J554J614J759K061J761O31n14j156j712k329k168p22J052J828J455
$$ plain form
52944 243909 241773 239076 236580 235164 234653 234120 233165 232198 231476 230569 229188 228009 228077 229458 230962 231310
52928 231310 230300 228723 227304 226053 224634 223070 221827 221337 221697 222788 224335 225859 226889 227355 227457
52913 227457 227171 226282 225074 224417 224849 225945 226900 227331 227192 226439 225313 224507 224407 224443 223842 222749 221984 221901
52895 221901 222246 222958 224240 225755 226570 226185 225083 224108 223747 224136 225150 226292 226939 226931 226579 226045 225215 224285
52877 224285 223842 224083 224452 224380 224004 223812 223961 224342 225081 226509 228631 230871 232461 233103 233254 233683 234669 235804
52859 235804 236642 237243 237848 238400 238755 238992 239077 238605 237464 236417 236201 236306 235477 233308 230473 227439 224003
52842 224003 220267 217034 214833 213330 212024 210763 209301 207236 204852 203202 202813 203019 203119 203403 204420
52827 204420 205974 207588 209347 211408 213169 213800 213286 212130 210418 208089 205921 205199 206251 208079 209534
52812B09534P37J19m63q60o77P4Q76J314J390J246Q95L55j76m17k68m4k57j079
52794B12299k108k803k978k676j891p57K11M66Jp77j493j849j502m32Q13J663
52778A96187K160K524K503J779Q13M77Q53J199J041N99R8m95r35p39j5L99K9n91
52760B07886o97k84P5M6j76k38k5K28K08O1L48J239J962J672O37n0J25O13P84
52741B14414O63N95P80J286K024K544K402J854J628J904K056J618R48O26P11R28
52725B36981J168J438J529J096K9j415k700l330l188k647k138j722j254p50l72
52710B22725k65n79j345k072j994j080k99l37o16l18K57L13P5M64J473K095J865
52693B20362J298P39p9j042j323n23P04J537J783J567J017N14M58N46L5j026j675
$$ plain form
52812 209534 210271 210390 209927 209067 208390 208464 209340 210654 212044 213290 214185 214540 214364 213947 213679 213635 213378 212299
52794 212299 210191 207388 204410 201734 199843 199086 199297 199763 199764 198987 197494 195645 194143 193711 194524 196187
52778 196187 198347 200871 203374 205153 205966 206443 207296 208495 209536 210135 210233 209738 208803 208064 208049 208448 208477 207886
52760 207886 207189 206905 206980 207026 206850 206612 206587 206815 207023 207084 207432 208671 210633 212305 212942 212892 213017 213630 214414
52741 214414 215077 215672 216452 217738 219762 222306 224708 226562 228190 230094 232150 233768 234716 235342 236053 236981
52725 236981 238149 239587 241116 242212 242241 240826 238126 234796 231608 228961 226823 225101 223847 223097 222725
52710 222725 222460 221881 220536 218464 216470 215390 215091 214754 214138 213820 214077 214390 214465 214929 216402 218497 220362
52693 220362 221660 222399 222320 221278 219955 219432 220136 221673 223456 225023 226040 226554 227012 227558 227593 226567 224892
52676B24892j438r13o86n46k19K5J6R4L67L73l3k61J3K07j13m33k22J06Lj23M15
52655B21524J325J794J855K253L084L513K974J880R53L14l77j186j610j165k35
52640B36896L5r14k114k165j125m35q35j426j171l24L39Q45J656K599L118L206
52624B38185L166K764J560p0j127j276j148j279j470j384j174j094r36l25N44
52609B34936Q63O0j443k463k184r41J97N03J04l69l49L42J317J845J603J115J042
52592B36178J219R25R0n17m02K4J95J50K41N16P43P34M60J22R9N04Q38O44K83
52573B43046M03P56M55n14j090o64J24M75L64m9r19k041k488j728m64K57K47p4
52555B36096m50o91m45K65P28M21l18r00j248j368r02J94J095J054M42J38L04
$$ plain form
52676 224892 223454 222541 221855 221309 221090 221115 221131 221225 221592 221965 221932 221671 221684 221891 221778 221345 221123 221229 221232 221109 221524
52655 221524 222849 224643 226498 228751 231835 235348 238322 240202 241155 241469 241092 239906 238296 237131 236896
52640 236896 236931 236017 233903 231738 230613 230178 229343 227917 226746 226422 226761 227606 229262 231861 234979 238185
52624 238185 241351 244115 245675 245605 244478 243202 242054 240775 239305 237921 236747 235653 234717 234392 234936
52609 234936 235799 235859 234416 231953 229769 228828 229025 229528 229632 229263 228914 229256 230573 232418 234021 235136 236178
52592 236178 237397 238322 238412 237895 237493 237517 237712 237862 238103 238619 239362 240096 240556 240678 240777 241281 242119 242763 243046
52573 243046 243449 244205 244660 244146 243056 242392 242516 242991 243355 243306 242387 240346 237858 236130 235666 235923 236170 236096
52555 236096 235646 234955 234510 234775 235503 235924 235606 234706 233458 232090 231188 231382 232477 233531 233973 234111 234415
52538B34415M20J79l33r95j517j374n45P8k55j063j264n98L31J113J853K562K905
52521B35912K610J724N66l05l92J05M09K28J89Q14J664K128K406K999L691L889
52505B58637L527K920K083R84Q3k10l09r12j946k775l202l454l424k778j722q81
52489B46621m84l14l83r18j749k342k388j908r02N13J757K190J853J375J290J703
52473B45914K359K697K212J182N00M99N43K74M07J464K553K547J814J645K274
52458B68884K765K590K071J358J92j227k223k648k942l130k734j871j468k023
52444B57594k956l431l197k440j448o46l61m21m26m20p47j316j584j295o40K20
52428B36486J169J772J621R95N57L90L3n82r45o65K03J475K784L419K932J881
$$ plain form
52538 234415 234835 235014 234681 233686 232169 230795 230250 230328 230073 229010 227746 227148 227479 228592 230445 233007 235912
52521 235912 238522 240246 240812 240507 240115 240220 240629 240857 241046 241860 243524 245652 248058 251057 254748 258637
52505 258637 262164 265084 267167 268151 268234 268024 267715 266803 264857 262082 258880 255426 252002 249224 247502 246621
52489 246621 246137 245823 245440 244522 242773 240431 238043 236135 235233 235746 237503 239693 241546 242921 244211 245914
52473 245914 248273 250970 253182 254364 254864 255363 255906 256180 256587 258051 260604 263151 264965 266610 268884
52458 268884 271649 274239 276310 277668 277860 276633 274410 271762 268820 265690 262956 261085 259617 257594
52444 257594 254638 251207 248010 245570 244122 243476 243115 242694 242268 241848 241101 239785 238201 236906 236266 236486
52428 236486 237655 239427 241048 242043 242600 242990 243023 242441 241496 240831 241034 242509 245293 248712 251644 253525
52412B53525J328J653K482L525M744N918O897Q069R718J1138J1304J0210Q503
52399C39014O120K573j470m450n915o984q347r214q751p395n939m395k611j204
52385B81032q75j276j417q96j57K78L57L73O54J297K159L154M351N438N578M438
52369C04488L021K662L333L891L812L570L374K713J477L76j21l38n49n14j62J58
52353C31191M36J060J772J669O53j56j7M90P10J013J864K796L212L412L867M284
52337C58256M355M783O372Q540R887J0014R854J0239J1104J2083J3182J4590J6312
52324D89571J8132J9713K0722K1097K1100K1023K1006K1106K1256K1082K0230
52313G16038J8971J7988J7492J7100J6681J6593J6812J6581J5413J3767J2311
$$ plain form
52412 253525 254853 256506 258988 262513 267257 273175 280072 288141 297859 308997 320301 330511 339014
52399 339014 345134 347707 346237 341787 335872 328888 320541 311327 302576 295181 289242 284847 282236 281032
52385 281032 280157 278881 277464 276568 276411 276689 277046 277419 278073 279370 281529 284683 289034 294472 300050 304488
52369 304488 307509 310171 313504 317395 321207 324777 328151 330864 332341 332717 332596 332258 331709 331195 331033 331191
52353 331191 331627 332687 334459 336128 336781 336625 336608 337098 337808 338821 340685 343481 346693 350105 353972 358256
52337 358256 362611 367394 373766 382306 392193 402207 412061 422300 433404 445487 458669 473259 489571
52324 489571 507703 527416 548138 569235 590335 611358 632364 653470 674726 695808 716038
52313 716038 735009 752997 770489 787589 804270 820863 837675 854256 869669 883436 895747
52302H95747J1065R806Q688P934P286O326N070L765K453J042m89k179m038n787
52288I46689p067p991q909r579r426q676q260q228p423n263k760j016L77K422
52274H64890N033P301Q843R949J0830J1660J2847J4366J5342J5153J4526J4541
52262A005281J5009J4922J4126J3349J2783J1873J0539R445Q914Q511P966P550
52250A140268P245O418M716K582N12j652m206o926r299j1077j2217j2619j2355
52237A091390j1958j2017j2500j2734j2244j1365j0860j0959j1043j0345q784
52226I66581o890n170l857l067k677k184j235k53J20J39P14J947K830K791K615
52211I52404L262M531N612O304O928P517P827P846P605O807N365L936L274L255
$$ plain form
52302 895747 906812 916618 925306 933240 940526 946852 951922 955687 958140 959182 958693 956514 952476 946689
52288 946689 939622 931631 922722 913143 903717 895041 886781 878553 871130 865867 863107 862091 862468 864890
52274 864890 869923 877224 886067 896016 906846 918506 931353 945719 961061 976214 990740 1005281
52262 1005281 1020290 1035212 1049338 1062687 1075470 1087343 1097882 1107327 1116241 1124752 1132718 1140268
52250 1140268 1147513 1153931 1158647 1161229 1161741 1160089 1155883 1148957 1139658 1128581 1116364 1103745 1091390
52237 1091390 1079432 1067415 1054915 1042181 1029937 1018572 1007712 996753 985710 975365 966581
52226 966581 959691 954521 950664 947597 944920 942736 941501 941248 941368 941507 942221 944168 946998 949789 952404
52211 952404 955666 960197 965809 972113 979041 986558 994385 1002231 1009836 1016643 1022008 1025944 1029218 1032473
52197A032473L151K667K135J906K051K481K929L050K913K986L246K934J746O09
52183A067277M56P35J17j600l313m222m647n289o436q005r560j0305r688q124
52169I97396o550n331m161k888j735p26L47J353J882K012K339L113L841L986L560
52154I98438K878K173J565J062N43j7l28k08k2k86q80j157p81j2P60J268J281
52137A006277Q09M13P78J966L406M606N521O393P668R874J3007J6234J8757K0775
52123A116484K2956K5211K6867K7957K9349L1322L2817L2583L0629K8186K6513
52112A430874K5871K5365K3697K0416J6465J3108J0473P705M395J142j391l215
52100A574905m568n457n988o538p198p528p295p035p425q378r248r745j0260j1300
$$ plain form
52197 1032473 1035624 1038291 1040426 1042332 1044383 1046864 1049793 1052843 1055756 1058742 1061988 1064922 1066668 1067277
52183 1067277 1067733 1068468 1068585 1066985 1063672 1059450 1054803 1049514 1043078 1035073 1025513 1015208 1005520 997396
52169 997396 990846 985515 981354 978466 976731 976005 976352 977705 979587 981599 983938 987051 990892 994878 998438
52154 998438 1001316 1003489 1005054 1006116 1006659 1006642 1006314 1006106 1006084 1005798 1004918 1003761 1002980 1002968 1003728 1004996 1006277
52137 1006277 1007086 1007499 1008277 1010243 1013649 1018255 1023776 1030169 1037837 1047711 1060718 1076952 1095709 1116484
52123 1116484 1139440 1164651 1191518 1219475 1248824 1280146 1312963 1345546 1376175 1404361 1430874
52112 1430874 1456745 1482110 1505807 1526223 1542688 1555796 1566269 1573974 1578369 1579511 1578120 1574905
52100 1574905 1570337 1564880 1558892 1552354 1545156 1537628 1530333 1523298 1515873 1507495 1498247 1488502 1478242 1466942
52086A466942j2922j4679j5899j6022j4895j2848j0488q292o270m040j347J492
52074A350732L868N646P288R158J1028J2554J3858J5288J6870J8329J9304J9339
52062A503262J8071J5833J3651J2111J0678Q616O176M141K676J361J11q69j838
52049A593980l295n146o935q864j1556j4773j7384j8899k0071k1612k3169k4035
52037A418241k4205k4095k3697k2637k0792j8507j6342j4743j3678j2524j0689
52026A216332q439o722o110o374p081q029q912r223q867q417q426q735q782q317
52012A103898p666p508q399j0282j2397j3999j5126j6260j7390j7996j7983j7951
52000I40941j8325j8828j9027j8964j8973j9217j9530j9393j8096j5409j2113
$$ plain form
52086 1466942 1454020 1439341 1423442 1407420 1392525 1379677 1369189 1360897 1354627 1350587 1349240 1350732
52074 1350732 1354600 1360246 1367534 1376692 1387720 1400274 1414132 1429420 1446290 1464619 1483923 1503262
52062 1503262 1521333 1537166 1550817 1562928 1573606 1582222 1588398 1592539 1595215 1596576 1596687 1595818 1593980
52049 1593980 1590685 1585539 1578604 1569740 1558184 1543411 1526027 1507128 1487057 1465445 1442276 1418241
52037 1418241 1394036 1369941 1346244 1323607 1302815 1284308 1267966 1253223 1239545 1227021 1216332
52026 1216332 1207893 1201171 1195061 1188687 1181606 1173577 1164665 1155442 1146575 1138158 1129732 1120997 1112215 1103898
52012 1103898 1096232 1088724 1080325 1070043 1057646 1043647 1028521 1012261 994871 976875 958892 940941
52000 940941 922616 903788 884761 865797 846824 827607 808077 788684 770588 755179 743066
51989G43066r436p925p316p363p965q595q503p761p306p712q605r498j0374j1119
51975F23588j1286j0932j0889j1548j2123j1691j0348q715o933m956l235k202
51963E18730j423j06J763L522M897O182P487Q455Q708Q047O291L575P44j221k346
51948E73305l654n764p940q833p851n573k947m21K106M715P094Q827R900J0700
51934E73664J1572J2562J3442J3726J2705R974O013J859j851n163q133j0521j2356
51921F17493j4202j6330j8082j8605j7937j6838j5697j4170j1924r326p159n812
51909D51411m951l962k648j216L99K731N945R193J1484J2986J4605J6317J6877
51896E29171J5423J2457Q782M426o71n713r694j2539j4728j6194j6504j5857j4999
$$ plain form
51989 743066 733630 725705 718389 711026 703061 694466 685963 678202 670896 663184 654579 645081 634707 623588
51975 623588 612302 601370 590481 578933 566810 555119 544771 536056 529123 524167 520932 518730
51963 518730 517307 517201 518964 522486 527383 533565 541052 549507 558215 566262 572553 576128 576872 575651 573305
51948 573305 569651 563887 555947 547114 539263 533690 530743 530322 532428 537143 544237 553064 562964 573664
51934 573664 585236 597798 611240 624966 637671 647645 653658 655517 653666 648503 640370 629849 617493
51921 617493 603291 586961 568879 550274 532337 515499 499802 485632 473708 464382 457223 451411
51909 451411 446460 442498 439850 438634 439033 441764 447709 456902 468386 481372 495977 512294 529171
51896 529171 544594 557051 565833 570259 569588 563875 554181 541642 526914 510720 494216 478359 463360
51883D63360j4076j2482r992p325n213l438j229J650M528O458P093O923O650O459
51869D49366O045N313M634M209L639K488Q92p61k439m262n923o853o891o299n231
51854D37927l627j678J41J518K507L254L806M175M210L503J836l04k089l228m060
51839D47891m750n020m873m956n714o543o401n154l708k780k024p64Q59J942K022
51824D00027J686J781K269K242J030j018k842l682l686l603l887m156l643k190
51810C80328m72Q21J665K335K792K884K822K830K515J317n14k029k683k682k240
51795C89689j335l48q7p28j488j819k200l124l982l786k612j492j082j121j116
51780C63369q92m68k1M4m89j161j227n71K21P04J042J539K160K791L632M962O670
$$ plain form
51883 463360 449284 436802 426810 419485 414272 410834 409605 411255 415783 422241 429334 436257 442907 449366
51869 449366 455411 460724 465358 469567 473206 475694 476586 475825 473386 469124 463201 456348 449457 443158 437927
51854 437927 434300 432622 432763 434281 436788 440042 443848 448023 452233 455736 457572 457268 455179 451951 447891
51839 447891 443141 438121 433248 428292 422578 416035 409634 404480 400772 397992 395968 395204 396063 398005 400027
51824 400027 401713 403494 405763 408005 409035 408017 405175 401493 397807 394204 390317 386161 382518 380328
51810 380328 379856 380677 382342 384677 387469 390353 393175 396005 398520 399837 399323 397294 394611 391929 389689
51795 389689 388354 388006 387919 387191 385703 383884 381684 378560 374578 370792 368180 366688 365606 364485 363369
51780 363369 362477 362009 361988 362032 361543 360382 359155 358584 358805 359509 360551 362090 364250 367041 370673 375635 382305
51763C82305Q243R274R836J0232J0449J0066Q780O752M219J050k742o268q251
51750D43945q459p985p805p701p017n843m768l890k845j659q50o18m86J65J563
51735C85747L540N729P721R235J0141J0216R151P039M621K763J869J952K839L833
51721D66396L681J594j704m535n873n985n645n255m822m257l526k819k653l421
51707D21176m779n787n678m352k275j93J283K185L175M528N363M535K257J21o68
51692D20891m14m8J61N48J103J265N49r36k646l988m682m909n092n352n330m668
51676C86452l506k241r69N13K205L723M789N563O289O835O950O896P395Q709J0079
51661D49682J0310Q746N547J332k986o381q273q923q854p981n883k819K32K667
$$ plain form
51763 382305 390548 399822 409658 419890 430339 440405 449185 455937 460156 461206 458464 452196 443945
51750 443945 435486 427501 419696 411995 404978 399135 394367 390477 387632 385973 385123 384505 384019 384184 385747
51735 385747 389287 395016 402737 411972 422113 432329 441480 448519 453140 455903 457772 459724 462563 466396
51721 466396 470077 471671 469967 465432 459559 453574 447929 442674 437852 433595 430069 427250 424597 421176
51707 421176 416397 410610 404932 400580 398305 398112 399395 401580 404755 409283 414646 419181 421438 421559 420891
51692 420891 420477 420429 420590 421138 422241 423506 424055 423119 420473 416485 411803 406894 401802 396450 391120 386452
51676 386452 382946 380705 379736 380249 382454 386177 390966 396529 402818 409653 416603 423499 430894 439603 449682
51661 449682 459992 468738 474285 475617 472631 466250 457977 449054 440200 432219 426336 423517 423749 426416
51647D26416M636O033N981L987R69j577l148m271n394o432p269p889p997p261
51633C96784n999n034m692m466l880l179k820k694k280j419n28p6j03l08m32l84
51617C58490j39K42M44R7p00j278j161p05n55p27p93p71j064j424q98Q34K843
51600C52735M144M778N210N383N199N268O236P706Q637Q620P934O585M279J281
51586D33995j506l479m724n418n519n068m227k977j265N54K145L957O812J0540
51572D23820J3718J5129J4975J4477J4695J5939J7769J9296J9828J9407J8566
51561F07619J7710J7180J7786K0366K4635K9142L2723L5398L7423L8049L5832
51550I13863K9983K1115J0833Q69p764j5155k2012k8546l4067l7741l9436l9589
$$ plain form
51647 426416 431052 437085 443066 447053 448022 446445 443297 439026 433632 427200 419931 412042 404045 396784
51633 396784 390785 385751 381059 376593 372713 369534 366714 364020 361740 360321 359793 359717 359614 359306 358874 358490
51617 358490 358351 358593 359037 359134 358434 357156 355995 355290 354735 354008 353215 352444 351380 349956 349058 349892 352735
51600 352735 356879 361657 366867 372250 377449 382717 388953 396659 405296 413916 421850 428435 432714 433995
51586 433995 432489 429010 424286 418868 413349 408281 404054 401077 399812 400366 402511 406468 413280 423820
51572 423820 437538 452667 467642 482119 496814 512753 530522 549818 569646 589053 607619
51561 607619 625329 642509 660295 680661 705296 734438 767161 802559 839982 878031 913863
51550 913863 943846 964961 975794 976663 968899 953744 931732 903186 869119 831378 791942 752353
51538G52353l8577l6596l3945l0967k7766k4308k0798j7732j5453j3867j2602
51527D79742j1398j0222r040p737o348n273m873m914m773m327m147m553m932m474
51513C92731l280k174j631j410j117o01J39Q99J199P80J20KN63J324J909K255
51497C91708K195J574Q08N48O96N04k16p48o23k97k94l77j56O6k88j209k199l035
51479C88657l848m636n135n132m634l856l244l245l799m304m331m074l878l654
51465C30887l131k400j785j333q36k96rk05q01j469j802j482n08P58J899K738
51449C20225L315L802M435N343O253O706O810P491R639J3012J6200J7666J6720
51436D37617J3653R303M670P57j602k099j245j49J59q03l087o393r777j1746j1399
$$ plain form
51538 752353 713776 677180 643235 612268 584502 560194 539396 521664 506211 492344 479742
51527 479742 468344 458122 449082 441345 434997 429724 424851 419937 415164 410837 406690 402137 397205 392731
51513 392731 389451 387277 385646 384236 383119 382518 382657 383556 384755 385535 385655 385657 386220 387544 389453 391708
51497 391708 393903 395477 396285 396833 397529 398033 397817 397069 396446 396149 395855 395478 395322 395388 395100 393891 391692 388657
51479 388657 384809 380173 375038 369906 365272 361416 358172 354927 351128 346824 342493 338419 334541 330887
51465 330887 327756 325356 323571 322238 321402 321106 321097 320892 320091 318622 316820 315338 314830 315588 317487 320225
51449 320225 323540 327342 331777 337120 343373 350079 356889 364380 374019 387031 403231 420897 437617
51436 437617 451270 460573 465243 466000 464398 462299 461054 460905 461064 460261 457174 450781 441004 429258 417859
51421D17859r463p705p150p295p062o044m616l310k410j878j392o30L69J222J723
51406C62218K089K680L549M356M594M053L207K932L446L861L318K263J885K408
51392D06859K890K858L090M317N949O875P026P396Q821J1345J4673J8586K2874
51379E23559K7297L1719L6181M0820M5747N0728N4840N6645N4991M9686M1423
51368A013636L1331K0564R915m17j0556k0393k9448l7203m3242m7164m8858m8858
51356G89307m7990m6581m4476m1678l8410l4566k9906k4843k0264j6447j3020
51345D31126j0095q399p860p248n937m869m945n448n235m572m393m396l460j722
51331C52547o39q95j590j864k005k493k981k944k490j982j397o91k41l60p70j059
$$ plain form
51421 417859 408396 400691 393541 386246 379184 373140 368524 365214 362804 360926 359534 358904 359273 360495 362218
51406 362218 364307 366987 370536 374892 379486 383539 386746 389678 393124 396985 400303 402566 404451 406859
51392 406859 409749 412607 415697 420014 425963 432838 439864 447260 456081 467426 482099 500685 523559
51379 523559 550856 582575 618756 659576 705323 756051 810891 867536 922527 972213 1013636
51368 1013636 1044967 1065531 1075446 1075029 1064473 1044080 1014632 977429 934187 887023 838165 789307
51356 789307 741317 694736 650260 608582 570172 535606 505700 480857 460593 444146 431126
51345 431126 421031 412632 404772 397524 391587 386718 381773 376325 371090 366518 362125 357729 354269 352547
51331 352547 351908 351013 349423 347559 345554 343061 340080 337136 334646 332664 331267 330576 330335 329975 329205 328146
51315C28146j331j834k257j973r06K97R96J142J108J162J185Q31J6p68p79K10
51299C25245J611K593K829K595K241J838J285O20L8l65p25j199j682j893j748
51284C33283j469j205p96KJ156K466L793M972N621N315M032K244N88m96q83p51
51268C57872m29j54J05N18J193K007K591K476J504J39q57j204j315j674k210k455
51252C58107k103j270m77m34j480l026l894l528k480j514p06J10N56J75o00p72
51236C36664j38M77M60J97K45L69j1p87j169p06J42N40J57n97j093j081p95n78
51218C32296n31n04l24M9N22R34J148J171J063Q27N32M68Q66J425J584J439J830
51201C44795L072M126L751K252J193J337J793J494O94K79K15l02j364j993j562
$$ plain form
51315 328146 326815 324981 322724 320751 319845 320142 321138 322280 323388 324550 325735 326566 326582 325814 325035 325245
51299 325245 326856 329449 332278 334873 337114 338952 340237 340857 340895 340530 339805 338606 336924 335031 333283
51284 333283 331814 330609 329813 329815 330971 333437 337230 342202 347823 353138 357170 359414 360002 359506 358623 357872
51268 357872 357443 357289 357394 357912 359105 361112 363703 366179 367683 367822 366965 365761 364446 362772 360562 358107
51252 358107 356004 354734 354257 353823 352343 349317 345423 341895 339415 337901 337195 337305 337861 338036 337436 336664
51236 336664 336526 337003 337463 337660 337905 338274 338263 337476 336307 335601 335743 336283 336440 335843 334750 333669 332874 332296
51218 332296 331765 331261 330937 330986 331508 332442 333590 334761 335824 336651 337183 337651 338517 339942 341526 342965 344795
51201 344795 347867 351993 355744 357996 359189 360526 362319 363813 364507 364786 365001 364699 363335 361342 359780
51186C59780p40n34r04j010n27k0K6j84k80k87l64m28m31o16j061j332j067n92
51168C49429m37m42n1O42R15N52L10R57K403L954M971N036M084K651J558J008
51152C77540L95p15j866k320j999j411r68q22j065j634k109j983j197j90M85N95
51136C60736L60K39L85L96r2p59r93q10p28p83m90J41M28J68N9M92Q90P68O20
51117C61027R32J233J045R71J720K634K560J764J630K482L116K706J980J992K670
51102C90462L210L174K733K227J971K071K205J807Q02j34k87L60J171J454R78
51087D14204R6o24j013j355j705j563o86J81O8r58j900k109j794j324p69j43N21
51070C99127J395K562L519L659L282L370M218N063N424O049Q061J1558J5384J7882
$$ plain form
51186 359780 359040 358506 357602 356592 356065 356045 356071 355887 355607 355320 354956 354528 354097 353481 352420 351088 350021 349429
51168 349429 348992 348550 348499 349141 350056 350608 350918 351875 354278 358232 363203 368239 372323 374974 376532 377540
51152 377540 377935 377220 375354 373034 371035 369624 368656 367834 366769 365135 363026 361043 359846 359656 360141 360736
51136 360736 361096 361335 361720 362116 362024 361265 360272 359462 358734 357951 357461 357602 358030 358198 358257 358749 359639 360407 361027
51117 361027 361959 363192 364237 365208 366928 369562 372122 373886 375516 377998 381114 383820 385800 387792 390462
51102 390462 393672 396846 399579 401806 403777 405848 408053 409860 410662 410528 410241 410601 411772 413226 414204
51087 414204 414300 413676 412663 411308 409603 408040 407354 407535 407603 406645 404745 402636 400842 399518 398749 398606 399127
51070 399127 400522 403084 406603 410262 413544 416914 421132 426195 431619 437668 445729 457287 472671 490553
51056D90553J7758J4864J0572O986N390N684P297R928J3034J5408J6038J5171
51044F28683J3898J2790J1339Q697M590l30m731p291p593o502n519n732p345r956
51030F24998j3009j5992j8404j9737j9673j8350j6325j4083j1667q914n971l276
51018D59597j152L50J292J856K437L407M711N955O886P572Q167Q737R272R622
51004E28709R595R308R220R541R899R988J0158J0767J1348J1180J0486J0120J0254
50991F60573J0269J0006J0061J0497J0352Q972P062N744N238N118N342O264P869
50978G63367R629J0998J1623J1323J0317R350R294J0702J3753J8236K3357K8083
50966I30032L2081L5972M0329M4893M9198N3453N8141O2993O7011O9450P0245
$$ plain form
51056 490553 508311 523175 533747 540733 546123 551807 559104 569032 582066 597474 613512 628683
51044 628683 642581 655371 666710 675407 679997 679667 674936 667645 660052 653550 648031 642299 634954 624998
51030 624998 611989 595997 577593 557856 538183 519833 503508 489425 477758 468844 462873 459597
51018 459597 458445 458795 460087 461943 464380 467787 472498 478453 485339 492911 501078 509815 519087 528709
51004 528709 538304 547612 556832 566373 576272 586260 596418 607185 618533 629713 640199 650319 660573
50991 660573 670842 680848 690909 701406 711758 720730 727792 733536 738774 743892 749234 755498 763367
50978 763367 772996 783994 795617 806940 817257 826607 835901 846603 860356 878592 901949 930032
50966 930032 962113 998085 1038414 1083307 1132505 1185958 1244099 1307092 1374103 1443553 1513798
50955A513798O9579O7579O4499O0667N6139N0723M4469L7884L1484K5321J9128
50944B041270J2912P379L632K259K617L183K675P70k102n280q150j0397j2313
50931B038455j4498j7146j9862k2407k5145k8396l1798l4938l8189m2290m7101
50920A716685n1495n4595n6585n8057n9068n9129n7839n5137n1151m6270m1255
50909A126104l6947l3661l1003k8410k5658k2794j9894j7189j5197j4296j4107
50898H66948j3717j2607j1081r674q574p749p209o748n910m560l178k156j194
50885G72591J05J417K133K362K702L203L363L194L468M697O437P825Q368Q092
50871H29957P434P174P889R374J0967J2463J4233J6415J8626K0579K2391K4235
$$ plain form
50955 1513798 1583377 1650956 1715455 1776122 1832261 1882984 1927453 1965337 1996821 2022142 2041270
50944 2041270 2054182 2061561 2065193 2067452 2070069 2073252 2075927 2076697 2074595 2069315 2061165 2050768 2038455
50931 2038455 2023957 2006811 1986949 1964542 1939397 1911001 1879203 1844265 1806076 1763786 1716685
50920 1716685 1665190 1610595 1554010 1495953 1436885 1377756 1319917 1264780 1213629 1167359 1126104
50909 1126104 1089157 1055496 1024493 996083 970425 947631 927737 910548 895351 881055 866948
50898 866948 853231 840624 829543 819869 811295 803546 796337 789589 783679 779119 775941 773785 772591
50885 772591 772696 774113 776246 778608 781310 784513 787876 791070 794538 799235 805672 813497 821865 829957
50871 829957 837391 844565 852454 861828 872795 885258 899491 915906 934532 955111 977502 1001737
50859A001737K6286K9047L2956L7559M1957M6207N1431N8215O5863P3667Q1925
50848A546850R1047J00566J09811J18809J27629J35529J41760J46784J51604J55985
50838B826374J58198J56544J50506J40538J27399J11738R3840P3834N2431L1225
50828C922627J1814n065j9213l0215l7549m1152m1266l8024l1807k3696j4988
50817C651466o526P78N264N302P00p503j8509l2097m7556o3444p8778r3631j08006
50804C207460j20881j30927j37703j41541j42578j40534j35391j27831j18799
50795B011275j08770r7668q5585p3464o2676n3729m5797l7901l0186k3516j8094
50784A373889j3340r031n680l596k334j485j395k459m154n429n886o138o947q458
$$ plain form
50859 1001737 1028023 1057070 1090026 1127585 1169542 1215749 1267180 1325395 1391258 1464925 1546850
50848 1546850 1637897 1738463 1848274 1967083 2094712 2230241 2372001 2518785 2670389 2826374
50838 2826374 2984572 3141116 3291622 3432160 3559559 3671297 3765137 3838971 3891402 3922627
50828 3922627 3934441 3929376 3910163 3879948 3842399 3801247 3759981 3721957 3690150 3666454 3651466
50817 3651466 3644940 3645718 3650982 3656284 3656984 3649481 3630972 3598875 3551319 3487875 3409097 3315466 3207460
50804 3207460 3086579 2955652 2817949 2676408 2533830 2393296 2257905 2130074 2011275
50795 2011275 1902505 1804837 1719252 1645788 1583112 1529383 1483586 1445685 1415499 1391983 1373889
50784 1373889 1360549 1351518 1345838 1342242 1339908 1338423 1337028 1334569 1330415 1324986 1319100 1312962 1306015 1297557
50770A297557j0235j1777j2945j4036j5518j7479j9416k0690k1223k1479k1725
50759A111034k1610k0684j9153j7695j6545j5144j2946j0198p586n317l048o04
50747I60504J812M119O510Q955J1137J3191J5928J9867K4495K8937L3080L7460
50735A165995M2345M7478N2612N7758O2921O8017P2908P7160P9963Q0882Q0643
50724A888682Q0449Q0468P9621P7112P3457O9487O4862N8187M8586L6501K2973
50713B580385Q697n795j9444l0725l8545m2771m3800m1972l7636l1452k4172j6294
50701B256476q345j319L733O582P702P119L934k683j2431k4039l6102m7508n7504
50688B095615o5809p2388p6856p8496p7124p3482o8444o2296n5214m7808m0539
$$ plain form
50770 1297557 1287322 1275545 1262600 1248564 1233046 1215567 1196151 1175461 1154238 1132759 1111034
50759 1111034 1089424 1068740 1049587 1031892 1015347 1000203 987257 977059 969473 964156 961108 960504
50747 960504 962316 966435 972945 981900 993037 1006228 1022156 1042023 1066518 1095455 1128535 1165995
50735 1165995 1208340 1255818 1308430 1366188 1429109 1497126 1570034 1647194 1727157 1808039 1888682
50724 1888682 1969131 2049599 2129220 2206332 2279789 2349276 2414138 2472325 2520911 2557412 2580385
50713 2580385 2589082 2583287 2563843 2533118 2494573 2451802 2408002 2366030 2328394 2296942 2272770 2256476
50701 2256476 2248131 2246812 2250545 2257127 2264829 2271948 2275882 2273199 2260768 2236729 2200627 2153119 2095615
50688 2095615 2029806 1957418 1880562 1802066 1724942 1651460 1583016 1520720 1465506 1417698 1377159
50677A377159l3020k4726j6152q388j683M738J1322J7494K2552K6530K9787L2169
50665A437782L3063L2147K9818K6989K4483K2547K0832J8997J7190J5836J5140
50654A694824J4998J5252J5675J5910J5822J5818J6491J7966J9957K2319K5181
50643A890213K8624L2579L6964M1490M5501M8519N0885N3214N5272N6048N5058
50632B394367N2883N0177M6829M2679L8581L6040L5638L6016L4292K7486J4096
50621B809084m796k5672m4077n6679o2478o2565n8831n2663m4633l5149k5088
50610B336453j5466o812O72O339R100Q530N426P74n555j4340k5424l7278m8403
50597B214016n8444o7407p4448p8373p9189p8193p6361p3445o9032o3596n7862
$$ plain form
50677 1377159 1344139 1319413 1303261 1294873 1293190 1297928 1309250 1326744 1349296 1375826 1405613 1437782
50665 1437782 1470845 1502992 1532810 1559799 1584282 1606829 1627661 1646658 1663848 1679684 1694824
50654 1694824 1709822 1725074 1740749 1756659 1772481 1788299 1804790 1822756 1842713 1865032 1890213
50643 1890213 1918837 1951416 1988380 2029870 2075371 2123890 2174775 2227989 2283261 2339309 2394367
50632 2394367 2447250 2497427 2544256 2586935 2625516 2661556 2697194 2733210 2767502 2794988 2809084
50621 2809084 2804288 2778616 2734539 2677860 2615382 2552817 2493986 2441323 2396690 2361541 2336453
50610 2336453 2320987 2314175 2314847 2321186 2330286 2338816 2344242 2345016 2339461 2325121 2299697 2262419 2214016
50597 2214016 2155572 2088165 2013717 1935344 1856155 1777962 1701601 1628156 1559124 1495528 1437666
50586A437666n1865m5523l9535l4712l0805k7119k3948k2084k0992j8996j5674
50575A106413j2544j0756r429p277m674k830j770m70J447L434N114O615P963R187
50561A090423J0889J3753J7452K0877K3414K5337K7167K9360L2328L5834L8580
50550A365414L9345L8384L6871L5153L2805L0206K8629K8432K8588K8607K9647
50539A722081L2814L7346M1570M5161M9418N5498O3192P1401P9221Q6448R3444
50528B377594J00694J08357J16226J23947J31080J37049J41367J43917J44657
50519C524888J43066J38385J30430J19682J06480R0698P2319N1760K9469N742
50509D412919j8706m2503o4412q3986j01133j15346j25681j31206j31284j25771
$$ plain form
50586 1437666 1385801 1340278 1300743 1266031 1235226 1208107 1184159 1162075 1141083 1122087 1106413
50575 1106413 1093869 1083113 1073684 1066407 1061733 1058903 1057133 1056663 1058110 1061544 1066658 1073273 1081236 1090423
50561 1090423 1101312 1115065 1132517 1153394 1176808 1202145 1229312 1258672 1291000 1326834 1365414
50550 1365414 1404759 1443143 1480014 1515167 1547972 1578178 1606807 1635239 1663827 1692434 1722081
50539 1722081 1754895 1792241 1833811 1878972 1928390 1983888 2047080 2118481 2197702 2284150 2377594
50528 2377594 2478288 2586645 2702871 2826818 2957898 3094947 3236314 3380231 3524888
50519 3524888 3667954 3806339 3936769 4056451 4162931 4253629 4325948 4377708 4407177 4412919
50509 4412919 4394213 4351710 4287298 4203312 4102179 3986833 3861152 3729946 3598662 3472891
50499C472891j15348j01332q4787o6080m5541k4280l838J4779L1199M4773N4008
50488C176444N7196N3407M2723K5769L518k2240m8726p3167r4126j11472j25073
50477B884253j34190j38467j38798j36499j32059j25395j17008j07950r8701q9008
50467A666178p9007o9743o2144n5991n0292m4421l8639l3596k9564k6043k2257
50456A154481j8027j3973j0576p503m171o71K452N054P360R290J0433J0746J0656
50443A155551J0589J0783J1394J2206J2427J1454R621P633N570L291J389P39J245
50430A253892K049K991M651P006R215J0968J2776J4730J6154J7031J8572K1683
50418A391718K5770K9793L3645L7829M2497M7531N2929N8492O3606O7817P1150
$$ plain form
50499 3472891 3357543 3256211 3171424 3105344 3059803 3035523 3031685 3046464 3077663 3122436 3176444
50488 3176444 3233640 3287047 3329770 3355539 3359057 3336817 3288091 3214924 3120798 3009326 2884253
50477 2884253 2750063 2611596 2472798 2336299 2204240 2078845 1961837 1853887 1755186 1666178
50467 1666178 1587171 1517428 1455284 1399293 1349001 1304580 1265941 1232345 1202781 1176738 1154481
50456 1154481 1136454 1122481 1111905 1104402 1100231 1099560 1102012 1107066 1114426 1123716 1134149 1144895 1155551
50443 1155551 1166140 1176923 1188317 1200523 1212950 1224404 1234025 1241658 1247228 1250519 1251908 1252647 1253892
50430 1253892 1255941 1258932 1263583 1270589 1279804 1290772 1303548 1318278 1334432 1351463 1370035 1391718
50418 1391718 1417488 1447281 1480926 1518755 1561252 1608783 1661712 1720204 1783810 1851627 1922777
50407A922777P3512P4514P4201P3151P1453O8458O4031N8949N3453M6439L7081
50396B618019K6250J5245L841r187k4051l9523n4075o6464p5633q1212q3927q4582
50384B144701q2807p7784o9948o0815n1199m0669k8891j6492m452O545J5742K2197
50372A756128K5423K5646K3040J7287Q368k642j4033k4692l4589m4043n2642n9084
50360A624167o2207o2238o0712n9036n7338n4960n1719m8297m5415m3068m0628
50349A038549l7561l4001l0632k7899k5412k2398j8701j4987j1896r355o894m198
50337G94615j229J772M303O072P539R417J1536J2963J3573J4633J7099J9998K1249
50324I33540J9734J5941J0989N781R47l119o254q250q817q126p082o540o481o320
$$ plain form
50407 1922777 1996289 2070803 2145004 2218155 2289608 2358066 2422097 2481046 2534499 2580938 2618019
50396 2618019 2644269 2659514 2663355 2654168 2630117 2590594 2536519 2470055 2394422 2313210 2229283 2144701
50384 2144701 2061894 1984110 1914162 1853347 1802148 1761479 1732588 1716096 1711644 1718189 1733931 1756128
50372 1756128 1781551 1807197 1830237 1847524 1855892 1853250 1839217 1814525 1779936 1735893 1683251 1624167
50360 1624167 1561960 1499722 1439010 1379974 1322636 1267676 1215957 1167660 1122245 1079177 1038549
50349 1038549 1000988 966987 936355 908456 883044 860646 841945 826958 815062 805707 798813 794615
50337 794615 793386 795158 799461 805533 813072 822489 834025 846988 860561 875194 892293 912291 933540
50324 933540 953274 969215 980204 985985 986932 983813 977559 969309 960492 952366 945284 938744 932263 925943
50310I25943n684m507k774p42P75J099N76K91Q57J850K468K475K437L077M460
50295I32601N938P082Q287J0057J1913J2849J2765J2571J2891J3650J4976J7442
50283A073022K1169K5957L2245M0129M6594M5960L5052J6993j641j6551k7201
50272A291728l4042l6916l6238l3510k9946k5854k1653j8209j5776j3731j1648
50261A014205r786q322p022n905n258m860m025k666j441p21j87M36J116K063L674
50246I71301N747P593R121J0965J3354J5781J7976K0360K3121K5671K7395K8298
50234A176683K8643K8504K7888K6673K4348K0619J6344J3081J1462J0763J0154
50223A395162R380P937M772n37p086j3839k0759k8112l5138m0306m2662m2445
$$ plain form
50310 925943 920259 915752 912978 912236 913011 914110 914686 914977 915834 917684 920152 922627 925064 928141 932601
50295 932601 938539 945621 953908 963965 975878 988727 1001492 1014063 1026954 1040604 1055580 1073022
50283 1073022 1094191 1120148 1152393 1192522 1239116 1285076 1320128 1337121 1335480 1318929 1291728
50272 1291728 1257686 1220770 1184532 1151022 1121076 1095222 1073569 1055360 1039584 1025853 1014205
50261 1014205 1004419 996097 989075 983170 977912 973052 969027 966361 964920 964199 964012 964448 965564 967627 971301
50246 971301 977048 984641 993762 1004727 1018081 1033862 1051838 1072198 1095319 1120990 1148385 1176683
50234 1176683 1205326 1233830 1261718 1288391 1312739 1333358 1349702 1362783 1374245 1385008 1395162
50223 1395162 1404542 1412479 1417251 1416714 1409628 1395789 1375030 1346918 1311780 1271474 1228812 1186367
50211A186367m0485l7404l3288k7987k1807j5877j1494r143q641r945j3053j7046
50199I40197k0256k1754k1976k1564k0421j8439j6337j4941j4137j3277j2322
50188G44773j1844j1997j2076j1344r906q636q242q525q647q142p336o675o049
50175F25354n257m670m734n127n117m606l925k918j231M96J023L61K3R64K319
50160E92955K830K602K634L410M644N932O949P503P976R182J1201J2903J3243
50147F83964J2491J1510J0393Q645O364M329L029K249J572P75j51q96q04N92L121
50132G47183O224R421J2272J4363J5796J7392J9840K2970K6338L0139L4834M0106
50120I96878M4941M8794N1986N4781N6583N6497N4497N1790M9866M9227M9160
$$ plain form
50211 1186367 1145882 1108478 1075190 1047203 1025396 1009519 998025 988882 980241 970296 957243 940197
50199 940197 919941 898187 876211 854647 834226 815787 799450 784509 770372 757095 744773
50188 744773 732929 720932 708856 697512 687606 678970 670728 662203 653556 645414 638078 631403 625354
50175 625354 620097 615427 610693 605566 600449 595843 591918 589000 587769 588265 589288 589649 589672 590636 592955
50160 592955 595785 598387 601021 604431 609075 615007 621956 629459 637435 646617 657818 670721 683964
50147 683964 696455 707965 718358 727003 733367 737696 740725 742974 744546 745321 745170 744274 743470 744062 747183
50132 747183 753407 762828 775100 789463 805259 822651 842491 865461 891799 921938 956772 996878
50120 996878 1041819 1090613 1142599 1197380 1253963 1310460 1364957 1416747 1466613 1515840 1565000
50109A565000M8820M8315M8217M8037M5895M0001L0170J7650L999r526k2047l3229
50097A831302m3241n2041n8933o3094o4463o3643o1229n7585n3075m8016m2423
50086A223559l6296l0079k4504j9983j6446j3751j1915j0852j0182r449q484p552
50074A024066p139p472q149q416p968p327p300q084r079r590r571r613j0181j0965
50060I03212j1253j0861j0361j0140r770q720p232n876m618l118j632o74J01J588
50046H20646L684N170N505N661O638Q127R335J0262J1198J1657J0859R010P202
50033I24954O166N773N614N470N208M746M070L116J816M91k83n22j102k610m391
50018I58516n352n306m864m304l446k532k382l380m805n476m849l334j702j79
$$ plain form
50109 1565000 1613820 1662135 1710352 1758389 1804284 1844285 1874455 1892105 1896104 1886578 1864531 1831302
50097 1831302 1788061 1736020 1677087 1613993 1549530 1485887 1424658 1367073 1313998 1265982 1223559
50086 1223559 1187263 1157184 1132680 1112697 1096251 1082500 1070585 1059733 1049551 1040102 1031618 1024066
50074 1024066 1016927 1009455 1001306 992890 984922 977595 970295 962211 953132 943542 933971 924358 914177 903212
50060 903212 891959 881098 870737 860597 850827 842107 834875 828999 824381 821263 819631 818957 819058 820646
50046 820646 824330 829500 835005 840666 847304 855431 864766 875028 886226 897883 908742 917752 924954
50033 924954 931120 936893 942507 947977 953185 957931 962001 965117 966933 967424 967141 966619 965517 962907 958516
50018 958516 953164 947858 942994 938690 935244 932712 930330 926950 922145 916669 911820 908486 906784 906605
50004I06605J841N089R431J4005J8325K2738K7477L1905L5238L7491L9052L9695
49992A188892L8800L6458L3677L1451L0039K9012K7552K4687J9693J2422L064
49981A475747q055k0239l2191m2580n0670n6212n9010n9104n7121n3935n0010
49970I86620m5436m0447l5486l0887k6815k3390k0620j8388j6735j5786j5151
49959F97479j3919j1688r168p252n910m569l016j295Q95L765O688Q774J0002J1038
49945F81824J2000J2289J1549J0072Q202O161M413L420K978K456J683P78q28m130
49931G52867r019j3891j7184j8668j8953j8494j7443j5863j3699j1039q595p231
49919E82788o723n843m022k097r04o6J045J960J800Q47K78O18J397K277L461M893
$$ plain form
50004 906605 908446 913535 922966 936971 955296 978034 1005511 1037416 1072654 1110145 1149197 1188892
49992 1188892 1227692 1264150 1297827 1329278 1359317 1388329 1415881 1440568 1460261 1472683 1475747
49981 1475747 1467692 1447453 1415262 1372682 1322012 1265800 1206790 1147686 1090565 1036630 986620
49970 986620 941184 900737 865251 834364 807549 784159 763539 745151 728416 712630 697479
49959 697479 683560 671872 662704 655452 649542 644973 641957 640662 641557 645322 652010 660784 670786 681824
49945 681824 693824 706113 717662 727734 735936 742097 746510 749930 752908 755364 757047 757825 756997 752867
49931 752867 743848 729957 712773 694105 675152 656658 639215 623352 609653 598614 590019 582788
49919 582788 576065 570222 566200 564103 563199 563133 564178 566138 567938 568785 569063 569681 571078 573355 576816 581709
49903E81709N985O528P143Q413J0213J2201J4322J6265J7048J5877J3231J0344
49891G19279P737M968J936n04j653k101l032m765o632q152r546j1053j2427j3413
49877F60642j4120j4568j4393j3508j2523j1915j1172r480p119n286m524m060
49865E37974k952j251L29J342J829J983K149K863M389O298P904R015R908J0734
49851E92514J1421J2140J3193J4268J4377J2945J0575Q232O123L930J913P89M26
49838G02846m34k652n556p882r305j0270j0824j0568r619q670p946o997n684m581
49824F01858l975l268j881j70J200K297L704N508P215Q537R676J0799J1690J2036
$$ plain form
49903 581709 587694 594222 601365 609778 619991 632192 646514 662779 679827 695704 708935 719279
49891 719279 727016 731984 733920 733416 731763 729662 726630 721865 715233 707081 697535 686482 674055 660642
49877 660642 646522 631954 617561 604053 591530 579615 568443 558963 551844 546558 542034 537974
49865 537974 535022 533771 534100 535442 537271 539254 541403 544266 548655 554953 562857 571872 581780 592514
49851 592514 603935 616075 629268 643536 657913 670858 681433 689665 695788 699718 701631 702420 702846
49838 702846 702412 699760 694204 686322 677017 666747 655923 645355 635736 627066 619120 612123 606439 601858
49824 601858 597883 594615 592734 592564 593764 596061 599765 605273 612488 621025 630701 641500 653190 665226
$$ [...]
##END NTUPLES=NMR SPECTRUM
##END=
