
##TITLE=AC1233_PERAH12114_6519287_kQ2xMY586G
##JCAMPDX= 6.0         $$ Bruker NMR JCAMP-DX V2.0
##DATA TYPE= NMR SPECTRUM
##DATA CLASS= NTUPLES
##ORIGIN= BRUKER
##OWNER= Administrator
$$ 1.72 TOPSPIN		Version 2.1
$$ 2012-07-14 16:21:18.734 -0500  Administrator@TOPSPIN
$$ Compression mode = diff/dup
##.OBSERVE FREQUENCY= 400.02188249412
##.OBSERVE NUCLEUS= ^1H
##.ACQUISITION MODE= SIMULTANEOUS (DQD)
##.ACQUISITION SCHEME= undefined
##.AVERAGES= 8
##.DIGITISER RES= 22
##SPECTROMETER/DATA SYSTEM= spect
##.PULSE SEQUENCE= zg30
##.SOLVENT NAME= COFFEE_meoh
##.SHIFT REFERENCE= INTERNAL, COFFEE_meoh, 1, 14.98509
##AUDIT TRAIL= $$ (NUMBER, WHEN, WHO, WHERE, PROCESS, VERSION, WHAT)
$$ ##TITLE= Audit trail, TOPSPIN		Version 2.1
$$ ##JCAMPDX= 5.01
$$ ##ORIGIN= Bruker BioSpin GmbH
$$ ##OWNER= Administrator
$$ $$ C:\Bruker\TOPSPIN/data/COFFEE/nmr/AC1233_PERAH12114_6519287_kQ2xMY586G/120/pdata/1/auditp.txt
$$ ##AUDIT TRAIL=  $$ (NUMBER, WHEN, WHO, WHERE, PROCESS, VERSION, WHAT)
(   1,<2012-07-14 16:21:11.390 -0500>,<Administrator>,<TOPSPIN>,<go>,<TOPSPIN 2.1>,
      <created by zg
	started at 2012-07-14 16:20:04.625 -0500,
	POWCHK enabled, PULCHK disabled,
       configuration hash MD5:
       6B 1B 68 BB D9 2E 58 E2 7F 35 AD 54 07 DF 0E 41
       data hash MD5: 64K
       D4 04 4B F9 4C 50 5B B6 93 B4 04 2E 39 6C 62 FC>)
(   2,<2012-07-14 16:21:14.203 -0500>,<Administrator>,<TOPSPIN>,<proc1d>,<TOPSPIN 2.1>,
      <Start of raw data processing
       efp LB = 0 FT_mod = 6 PKNL = 1 PHC0 = 0 PHC1 = 0 SI = 32K 
       data hash MD5: 32K
       B7 27 27 F9 11 00 78 93 BF BD C0 FB DF C0 92 54>)
(   3,<2012-07-14 16:21:14.546 -0500>,<Administrator>,<TOPSPIN>,<proc1d>,<TOPSPIN 2.1>,
      <pk PHC0 = 177.3907 PHC1 = 0 
       data hash MD5: 32K
       54 EE 70 E5 04 D2 65 41 A6 14 59 EE D7 AE 8A 5E>)
(   4,<2012-07-14 16:21:14.609 -0500>,<Administrator>,<TOPSPIN>,<proc1d>,<TOPSPIN 2.1>,
      <abs ABSG = 1 
       data hash MD5: 32K
       58 C5 B1 6F 8A 9F 22 90 D1 F0 03 AD 52 87 C7 E3>)
(   5,<2012-07-14 16:21:14.640 -0500>,<Administrator>,<TOPSPIN>,<proc1d>,<TOPSPIN 2.1>,
      <abs ABSG = 2 
       data hash MD5: 32K
       73 EC 1E 4B 2C 4E 2D 86 47 69 F4 C4 2A 9E 2B 73>)
(   6,<2012-07-14 16:21:14.671 -0500>,<Administrator>,<TOPSPIN>,<proc1d>,<TOPSPIN 2.1>,
      <abs ABSG = 3 
       data hash MD5: 32K
       10 2A F1 DB A5 9E 87 3A 78 A9 D7 C3 6D F5 85 B6>)
(   7,<2012-07-14 16:21:14.703 -0500>,<Administrator>,<TOPSPIN>,<proc1d>,<TOPSPIN 2.1>,
      <abs ABSG = 4 
       data hash MD5: 32K
       71 02 CF 42 53 8B CA A1 36 2D 8E 25 55 0D FA E1>)
(   8,<2012-07-14 16:21:14.750 -0500>,<Administrator>,<TOPSPIN>,<proc1d>,<TOPSPIN 2.1>,
      <abs ABSG = 5 
       data hash MD5: 32K
       0C DD 4F CF E8 F1 98 5A 68 3E E1 5F 01 F6 D2 49>)
$$ ##END=
$$ 
$$ $$ hash MD5
$$ $$ 49 5F 82 CE C1 0F 86 FD 56 B4 ED 7F A8 C0 92 F7
##$RELAX= 
##$RELAX= 
##$RELAX= 
##$RELAX= 
##$RELAX= 
##$RELAX= 
##$RELAX= 
$$ Bruker specific parameters
$$ --------------------------
$$ [...]
150 150 150 150 150 150 150 150
##$TP07= 0
##$TPNAME0= <>
##$TPNAME1= <>
##$TPNAME2= <>
##$TPNAME3= <>
##$TPNAME4= <>
##$TPNAME5= <>
##$TPNAME6= <>
##$TPNAME7= <>
##$TPOAL= (0..7)
0.5 0.5 0.5 0.5 0.5 0.5 0.5 0.5
##$TPOFFS= (0..7)
0 0 0 0 0 0 0 0
##$TUNHIN= 0
##$TUNHOUT= 0
##$TUNXOUT= 0
##$USERA1= <user>
##$USERA2= <user>
##$USERA3= <user>
##$USERA4= <user>
##$USERA5= <user>
##$V9= 5
##$VALIST= <valist>
##$VCLIST= <CCCCCCCCCCCCCCC>
##$VD= 0
##$VDLIST= <DDDDDDDDDDDDDDD>
##$VPLIST= <PPPPPPPPPPPPPPP>
##$VTLIST= <TTTTTTTTTTTTTTT>
##$WBST= 2048
##$WBSW= 25
##$XGAIN= (0..3)
0 0 0 0
##$XL= 0
##$YL= 0
##$YMAX_a= 470606
##$YMIN_a= -596262
##$ZGOPTNS= <>
##$ZL1= 120
##$ZL2= 120
##$ZL3= 120
##$ZL4= 120
##$ABSF1= 14.98509
##$ABSF2= -5.573092
##$ABSG= 5
##$ABSL= 3
##$ALPHA= 0
##$AQORDER= 0
##$ASSFAC= 0
##$ASSFACI= 0
##$ASSFACX= 0
##$ASSWID= 0
##$AUNMP= <proc_prof1d_extract_pilot.lims>
##$AXLEFT= 0
##$AXNAME= <>
##$AXNUC= <1H>
##$AXRIGHT= 0
##$AXTYPE= 0
##$AXUNIT= <>
##$AZFE= 0.1
##$AZFW= 0.1
##$BCFW= 0
##$BC_mod= 0
##$BYTORDP= 0
##$COROFFS= 0
##$CY= 15
##$DATMOD= 1
##$DC= 0
##$DFILT= <>
##$DTYPP= 0
##$F1P= 0
##$F2P= 0
##$FCOR= 0.5
##$FTSIZE= 32768
##$FT_mod= 6
##$GAMMA= 0
##$GB= 0
##$INTBC= 1
##$INTSCL= 1
##$ISEN= 128
##$LB= 0
##$LEV0= 0
##$LPBIN= 0
##$MAXI= 10000
##$MC2= 0
##$MEAN= 0
##$ME_mod= 0
##$MI= 0
##$NCOEF= 0
##$NC_proc= -8
##$NLEV= 6
##$NOISF1= 0
##$NOISF2= 0
##$NSP= 0
##$NTH_PI= 0
##$NZP= 0
##$OFFSET= 14.98509
##$PC= 1
##$PHC0= 177.3907
##$PHC1= 0
##$PH_mod= 1
##$PKNL= yes
##$PPARMOD= 0
##$PPDIAG= 0
##$PPIPTYP= 0
##$PPMPNUM= 2147483647
##$PPRESOL= 1
##$PSCAL= 4
##$PSIGN= 0
##$PYNMP= <proc.py>
##$REVERSE= no
##$SF= 400.02
##$SI= 32768
##$SIGF1= 0
##$SIGF2= 0
##$SINO= 400
##$SIOLD= 32768
##$SPECTYP= <>
##$SREGLST= <1H.CDCl3>
##$SSB= 0
##$STSI= 32768
##$STSR= 0
##$SW_p= 8223.68421052631
##$SYMM= 0
##$S_DEV= 0
##$TDeff= 65536
##$TDoff= 0
##$TI= <>
##$TILT= no
##$TM1= 0
##$TM2= 0
##$TOPLEV= 0
##$USERP1= <user>
##$USERP2= <user>
##$USERP3= <user>
##$USERP4= <user>
##$USERP5= <user>
##$WDW= 1
##$XDIM= 32768
##$YMAX_p= 472422669
##$YMIN_p= -666286
##$CURPLOT= <Network HP LaserJet P1505>
##$CURPRIN= <$Network HP LaserJet P1505>
##$DFORMAT= <normdp>
##$LAYOUT= <+/1D_H.xwp>
##$LFORMAT= <normlp>
##$PFORMAT= <normpl>
##$SURQMSG= 1
$$ End of Bruker specific parameters
$$ ---------------------------------
##NTUPLES= NMR SPECTRUM
##VAR_NAME=  FREQUENCY,     SPECTRUM/REAL,   SPECTRUM/IMAG
##SYMBOL=    X,             R,               I
##VAR_TYPE=  INDEPENDENT,   DEPENDENT,       DEPENDENT
##VAR_FORM=  AFFN,          ASDF,            ASDF
##VAR_DIM=   32768,         32768,           32768
##UNITS=     HZ,            ARBITRARY UNITS, ARBITRARY UNITS
##FACTOR=    0.250966925370066, 1,           1
##FIRST=     8223.43324360094, 31937,        -134902
##LAST=      0,             -18365,          -198005
##MIN=       0,             -666286,         0
##MAX=       8223.43324360094, 472422669,    0
$$ Real data points
##PAGE= N=1
##DATA TABLE= (X++(R..R)), XYDATA
$$ [...]
23888 -95470 295543 37254 35350 73235 26789 85307 101627 -116592 6557 12499 -107802 -267364
23876 -267364 219786 244803 -204444 21584 -111186 210740 -63256 89795 -341674 -104677
23865 -501104 361748 -171634 -145082 -255056 293560 -147334 -252880 -408061 32068 -70120
23854 56133 36494 -17819 -37687 46255 -102829 -83 26323 133654 -503860 -32316 -183099
23843 -183099 -29751 143025 -72458 188931 -183079 3208 124362 -122020 -129442 -190527 -48788
23831 172202 -90704 18569 67024 -234707 -44657 -105580 34441 -28857 225845 99692 -78986
23819 82300 156679 -142727 -52246 281532 103064 -872 -4114 -193694 82774 195580 -246940
23807 -37904 -17325 65464 -148188 -167085 62747 -389586 -67145 -346002 -47140 137 -201637
23795 -7152 557606 -15613 64892 -225351 -169164 -12856 -56362 180430 -242763 118462 -22645
23783 -6194 241462 -113374 187254 -44293 -2714 -29185 -97074 -43065 -254614 31348 195175
23772 195175 -197535 201253 102402 208068 -107253 358515 -327150 160862 197336 71915
23761 130885 -192745 8123 204786 125248 -215141 14085 -1472 -22743 79735 -246402 -30499
23749 -153101 -336682 75172 12290 100451 -266533 143711 -117199 -215955 -5933 157395 -23627
23737 -57683 86088 109031 -174982 -44574 56795 209799 84238 349491 35005 -129837 298729
23725 152770 167862 -345714 -52305 -351228 -182166 165633 -80501 -5467 95061 -103661 -82884
23714 -82884 101820 -220554 -47895 6439 -85845 37280 -32667 -203169 -320693 -201036 -5389
23702 287423 -455064 -58666 -201189 -122150 -117207 461695 63085 -399905 63373 260709 -207706
23690 -101784 -143829 336337 160179 -207072 -12860 -12545 30877 -15304 -341613 -98151 146707
23678 -137357 44231 117376 -280016 -17144 263302 -189468 -499553 48839 316134 -226672
23667 -270972 -469 -228175 146708 -14970 194975 79049 222266 -169045 13467 -92675 49038
23655 50819 288616 28006 -189813 -68080 86154 154199 545355 -234043 91271 -75982 -33183
23643 39971 92766 -86845 -93674 -215513 -58501 -18086 -242285 -161970 -66418 -172354 -276514
23632 -276514 54927 877 90897 -95086 232614 61071 -86062 39431 -114105 62292 272393
23621 272393 31781 98798 22565 225643 -146574 113037 -234076 362558 61142 -110671
23610 23573 -59922 64675 -63952 -257785 -44161 -138369 417 95411 74292 52061 -211646 123255
23597 82527 -79071 -201806 -1041 -40677 310582 -164915 -115605 -40755 -97368 36879 -240973
23585 141937 -187906 123471 51186 -1745 -36586 273984 -332839 -59671 -98756 21139 -3263
23573 -253902 -83770 -26582 -98520 -177246 -49465 54661 -13985 78446 -68883 40898 -285760
23561 -230392 -21992 55905 101870 -80544 385 -111736 92393 15937 13040 -284192 83961 -165692
23548 96339 60889 10007 87332 147024 -307965 -115813 -350177 -333645 -149150 103219 33364
23536 -228549 131630 -108424 69032 -71529 -336245 -175166 199451 182145 55937 39686
23526 39686 -107624 58392 213740 100524 3941 -141128 -72381 188188 505 -306587 -172178
23515 -172178 -49204 -140589 -173431 -33555 204628 -36785 -76980 -150440 317169 136123 37413
23503 263997 314247 163584 53027 -79518 -164899 -412361 -438402 -17995 107307 162919 -50178
23491 -47240 -41698 -309815 193368 188095 213289 40549 136850 150591 -58428 268666 -249185
23479 242470 179486 318566 281570 -109071 242044 325135 -287787 -56197 -109329 -192181 71944
23467 70379 303298 317369 -228657 -31067 -50811 -218540 -56829 -66771 -48690 -128821 224986
23455 4087 -356813 322805 40328 -105788 -63749 88390 175858 70631 -50671 -284838 370450
23443 28554 -107175 -111668 25291 18176 -187731 79537 -156856 85975 -285608 92997 -48538
23431 58886 -99668 -3907 -142948 -448649 -299216 -207967 -204639 258229 -175534 -932 30494
23419 143837 214476 -56908 -319015 -227991 416159 -66463 133925 -137477 -93851 -122774 -452572
23408 -452572 155597 -121934 -187217 -175970 -416119 105130 280373 -99248 287574 -19510
23397 -22028 -62747 -112671 71759 -74364 -2670 134818 103900 -74018 -101993 -96629 76241 9315
23384 -100980 -9603 -428540 237639 205514 -29088 -241504 -184159 40196 -186125 -50650 -169877
23373 -169877 55189 16828 203051 59787 56178 -124900 31374 -403420 8614 332731 -92146
23361 219597 -44078 68322 -7428 48080 74646 -318218 18042 -188967 -90068 -97262 -31850
23349 61264 -194871 -158 -33446 -33629 -23143 -84884 -169476 207473 -24107 350061 81266 75850
23337 75850 306375 178104 -11242 215919 128667 162074 -47280 -124594 -133132 11380 -176609
23325 -90457 236692 312344 7846 -52529 -48459 82191 -143794 -152997 162427 -24395 66101 -352811
23312 414374 124036 -141246 54803 -94440 36634 -215616 -219993 367006 -147677 107714
23301 -314800 -180733 -172434 -239799 -70268 190502 -240944 64804 -102136 267584 -123649
23290 27396 212094 -285153 -278128 -340703 -55051 -92836 160030 -172226 -82990 -104253 10087
23278 97487 205486 -180579 -18895 162916 -395326 219969 16232 -62366 -19080 -11587 3953
23266 -118937 -112811 -225340 130097 237505 135059 -9386 189539 -1473 -145611 -159785 -326509
23255 -326509 -245797 -349893 144198 50002 -8703 -102436 -300841 -275936 117993 137059 84339
23244 84339 -319806 -209211 6555 -65428 -324315 246999 148602 -257451 102636 214477
23234 214477 -257611 24036 -33017 195492 205029 7996 167647 -20958 93143 -151751 447809
23222 41429 106299 -4066 -120900 67399 -222405 184662 113381 250476 24059 73290 -999
23210 -17654 -99471 172744 38218 -222236 -97439 107246 -36277 -139317 6531 -6430 -147429
23199 -147429 52934 -99234 -122650 -65632 -262763 -223581 -216638 254069 -390404 -133991 176704
23187 80399 203077 -44324 157663 -41474 240632 -343785 10426 73128 258187 -231289
23176 -76595 -65320 176853 47936 30040 4923 -43173 -180899 -83945 157631 24318 485625
23165 485625 -96194 101769 -266841 -31414 1861 234327 -60602 -15908 -19320 -91675 399208
23153 -239490 -141371 -41161 122711 -141021 -25421 -185029 79419 114531 36887 -237528 9251
23141 7937 -208754 -24683 -141231 57412 -164205 1942 -198756 -119666 162433 -13013 -170004
23130 -170004 204054 -82957 144022 -189590 108407 62412 195579 28310 260910 120787
23119 -80598 -92952 -102729 -310468 -88722 6795 59728 -78403 13379 99482 106422 179067 -32394
23106 -43170 16994 -32878 -209874 95200 54219 -246706 -71669 217933 -45549 159859 -152946
23094 23655 23399 -44112 14316 23527 399 33114 -298847 39762 -28780 30364 -218073 -4210
23081 -36997 72679 -46319 69097 -388552 -2271 -136598 -123734 211084 106986 -444361 -164280
23069 97356 10605 -52586 198505 -205766 -112385 205180 110056 228742 170429 34346 268143
23058 268143 147495 -192961 182909 260646 -338066 1904 -56268 63030 -84376 114758 -42505
23046 -40981 256321 -344463 162313 -27788 -157291 -186967 -87525 251187 214504 -435464
23035 249952 28343 -231231 -190908 78220 -30440 33401 -280942 -83472 -285322 -26316 89593
23023 36722 242983 -156552 81330 104943 -31800 145119 -89313 -31121 9119 85336 1945
23011 63506 284495 17405 -364510 19582 -66463 -231624 104293 -90795 -220532 -51059 -130004
23000 -130004 -191681 -44933 9772 -134029 215750 -304658 -117567 104449 429881 -635566
22989 -236241 -209819 203475 -624860 3452 -244051 124949 -73265 285633 116493 -216242
22978 257288 -144037 -333472 42998 -55280 -155022 -98712 106941 -234370 200200 -77678
22967 59334 -96696 -332664 68120 7386 -175733 -45308 143153 122109 88023 -395375 73236
22955 -236280 -56720 115140 31706 -405755 66820 -94921 -159894 -174174 -289930 -223470 -254483
22944 -254483 140297 112552 -13446 -247143 -284215 272476 -10215 39466 -73608 32721 -406017
22932 102461 96417 59964 -314811 -17111 -244776 -144522 226527 34021 86891 -3715 97107
22920 -69404 -374763 51040 -368183 12143 -77570 -99848 -195715 -151266 -102347 158405 -176029
22908 -46121 8117 45449 -363120 -89079 14923 -19799 -74227 -136491 -60315 122586 -61369
22896 -103981 223062 150148 118882 101282 70802 151495 357107 335957 -97143 -115487 -267701
22885 -267701 -31611 -91708 -148572 -78016 -26679 22533 -47179 -266706 -130829 -29676 -71394
22874 -71394 -259383 49954 -52495 -187031 -152995 -300986 -336834 -36893 25833 106969 79768
22863 79768 347883 164645 -280484 33605 -107972 113554 83808 -86672 25960 73336 -263935
22851 68061 23601 -69538 -205876 -215959 -162547 -154530 -217082 -40922 118238 102068 -419575
22839 123745 -76119 -52881 -1379 -242596 -41559 -134586 258372 -125953 -195255 -285454 74045
22827 -290236 -234967 247938 -331997 220099 22127 112426 -309516 97900 215604 -11371
22816 -148575 -166849 -204382 145016 251809 298545 18 303661 92015 -279545 347954 66051
22804 70491 30788 -130741 138672 41858 -42710 184106 104060 -45308 -45834 74610 131699
22793 131699 -91202 5590 -133872 -135868 -277808 -343963 -307918 189774 95605 -75427 -68508
22782 -68508 -96868 -6144 88817 -203383 189765 -93394 -49546 -15316 108705 -82569 -328562
22771 -328562 -403455 -216839 -3565 87387 13352 94346 229551 -227942 26363 -162416 -200324
22760 -200324 21934 -62123 -116129 88281 178325 174056 27836 177561 91084 -32928 -108546
22749 -108546 -197179 -139937 -40833 143493 -118280 -440508 273420 254270 227596 -296478
22738 9658 -332976 -288215 51876 249612 -36058 -187662 -129526 -149424 -202558 423016 80160
22726 -303159 8806 -32628 196718 -98857 -102643 14030 -245631 196318 97023 -161924 -3356
22714 17826 156534 128057 -172327 116991 -84676 -22717 -159419 -5177 268265 83406 -12241
22702 96546 146896 13511 -166594 143870 -16423 -65144 -108910 -99967 -207542 138441 185135
22691 185135 -217950 -135897 -50650 -209794 -61163 59644 218133 128503 49515 141011 -154465
22679 -14467 -133303 -80609 77113 -30344 -163391 104003 -39130 -256324 -207140 50769 -166081
22667 -279504 -91280 182058 -200640 59036 -142856 -321119 210697 -98454 -201285 -42048
22656 -135459 -130485 285643 -86210 86580 -42280 4860 16508 193802 113306 117306 20231 -297799
22643 -49008 -274044 46092 57893 -22723 62925 140966 -167733 -114925 -5983 -220735 -242683
22632 -242683 5799 -283852 -157281 -152028 25427 75743 11883 318371 -251146 -106431 -322619
22621 -322619 -390967 -143766 -213952 -102405 -26449 -19507 115439 162131 102021 32247 -71198
22609 -8416 356479 -72594 118969 -124059 28605 -29470 257455 -557641 29318 449027 -109070
22597 -14194 18579 -4770 -232197 -244227 338476 -41944 232336 -82175 -262391 683 98411
22586 98411 116694 147207 349585 -208845 77450 46233 168863 147057 -121320 93716 15787
22574 -213393 -507537 39112 305203 -21924 11310 96969 -132195 273488 133297 -118554
22563 -64091 -160192 -100230 3379 -62922 183032 284443 23824 -300031 -141796 -237472 -85657
22551 -31309 247779 52005 -18689 159985 -110477 36974 -338738 -240620 -248809 -175684 244314
22539 -279664 -307264 12131 130679 32549 -203255 38373 39939 -105453 170077 -169001 4490
22527 5945 -60557 290930 -143630 -85413 -180823 180329 156819 27600 -357494 100246 -229942
22515 -214225 64437 230818 -52370 -86564 -17465 -66863 -384794 59490 -73379 -138543 274909
22503 58925 -55585 271087 105283 -185818 -38702 -21955 -57102 -133142 217649 81458 -258719
22491 87147 -189326 240723 204107 25275 -57037 -73217 27219 92706 47560 -118896 178701
22479 -70777 -124860 -135786 107064 -194111 87858 68452 -407034 83 -104246 -231024 -304629
22468 -304629 -81663 -55334 -163285 -214664 239188 116080 28171 81456 178295 -246734 155805
22456 185001 -73526 189438 35519 20257 -86536 246718 20527 -106084 38205 -54656 -6444
22444 52860 -350256 391283 -105791 28693 60258 47791 -81737 31539 -16590 -64178 -57983
22433 -57983 220840 -213873 -59206 212934 -339603 -85850 -30117 -176484 -25496 -90431 -271939
22422 -271939 34206 -229578 -15274 -47384 158044 -326702 -62196 -39667 -274419 -146485
22412 -146485 -124799 -32372 -69202 -53649 -264479 127841 149889 -428379 -37516 -101827 4916
22400 154988 43783 217893 -182214 -26347 -127467 82023 -337464 -48393 -83871 -468877
22390 -468877 157395 53330 -307393 -55213 74402 -89507 42749 136297 -174135 264657 -213356
22378 -17911 -13950 27690 30136 -307604 3190 86268 157329 -500535 225792 -82649 -111654 208837
22365 -180624 -285469 106374 142233 297865 -94761 -31061 35487 260834 13774 167762
22355 167762 -15680 134690 302684 -256164 -228587 -119684 -105829 44175 47739 165969 -588249
22343 -168918 -177785 -50324 77986 100916 -120406 -229447 -103333 22637 -36274 -224077 -3191
22331 -262691 -157634 -6017 42840 163692 59343 -46271 70741 426540 118195 111920 63359
22320 63359 -294482 121725 -128416 102826 -55273 -115092 -33201 -2765 -58137 127553 -116813
22308 -165971 -8964 6342 -49038 -164096 1206 -220173 31179 26458 10930 49638 -186542 98608
22295 -209788 -390383 54120 127628 245738 160937 260140 393260 -275528 117005 -304269
22284 -56961 -47803 -414696 -123824 72410 170616 19487 -45894 -257296 4925 95907 -312947
22272 178784 -268373 231224 -103409 -46926 -212270 -119717 191147 94414 48048 -79877
22261 200916 97387 -256063 90445 -41936 -364757 -374218 61022 -129474 -57167 169258 -12383
22249 -15623 -316640 -237666 99439 149551 43584 30781 -351413 -226732 54411 90822 52751
22238 52751 -159166 298709 109403 -32139 -71308 -246130 301774 -124645 -146932 48333
22227 -25034 -208589 114529 -95254 -154685 -14769 -99180 -36993 157534 237491 -218015 -161538
22216 -161538 -90489 25114 -274122 77104 139105 -4185 -114676 -277548 -296940 53862 92928
22205 92928 5069 71432 -74176 157260 49558 -140998 -299521 -147831 174693 -163309 -23479
22193 -65530 221172 -190977 -118299 -252309 388138 223327 -37802 18269 -447393 -257733
22183 -257733 -12803 107213 -255203 81505 -260222 -72323 -423167 25416 -83706 -168580 -106883
22172 -106883 -191778 -115712 -92708 100153 15556 -48580 21449 91455 -28677 -140781 108907
22160 76403 -27761 -218177 102593 59830 -68464 22795 151404 -127210 365055 166542
22149 199335 233563 2864 -18988 173520 259757 47264 24629 -84330 -278247 -152401 -137327
22138 -137327 -375633 74227 -66615 -61918 -181652 25340 -59562 -157090 68914 242636 -144338
22126 51698 154432 37595 46399 -186646 -79693 32793 -368129 -225289 -54757 -51108 -9016
22114 -16538 -41754 268365 -184805 -225630 87292 -55005 184606 108828 -393633 -457295 -195341
22102 40645 178036 193622 -227980 -358180 -49133 -99032 -3932 -102176 -324884 91309 -121056
22090 289723 25161 98565 40505 -130369 -84882 -268476 -80205 25790 195390 180524 -19062
22078 -79839 -242178 -244238 172826 216520 109344 211723 -40536 -188578 -248025 -508290 24898
22066 -198630 -16217 -157776 -129654 90563 -78563 115531 125036 4016 -392256 140896 -146012
22054 -36563 88938 202932 242161 83614 -65868 -185153 135223 10073 -151030 -87303 -75791
22043 -75791 -21742 -307189 -146966 -27352 -102027 -283206 290143 -67763 -267878 272817
22032 57807 -54664 261896 166293 93745 -28254 7018 148438 -61844 -181676 169023 -187323
22020 163164 -311659 -248426 -48796 -207077 216029 69873 144102 -28909 -75542 75632 -202928
22008 -137124 125219 -38235 -105844 -56167 -16193 140297 176743 -4561 142790 301609 -201350
21996 433480 55110 -68919 -184827 -15881 -26653 84680 10300 31318 -149982 -222238 -246690
21985 -246690 755 -120423 221446 300807 90628 1789 -157140 -150356 170694 34726 -24353
21973 -241000 -49451 -89363 39867 -24318 -95009 31595 60530 174587 -248607 -130674 -308253
21962 -308253 58674 183154 -61057 -202828 48169 97764 -35844 -333330 235094 126341
21952 126341 -131209 -241812 -163649 9028 -65338 -218980 -252538 -29922 -149315 129610 145470
21941 145470 -4095 114467 -223710 109146 -294189 254319 -80522 -241360 -200636 -155058
21931 -155058 179174 -176208 252485 -69967 5404 -156245 -305261 122247 -111753 193 -453463
21919 98393 -50501 26433 20584 95716 -104206 -208165 122249 48095 -62103 -116164 -141272
21908 -141272 69270 20331 82571 -20277 -126904 -57613 -151016 -147351 -116535 135507 -244016
21896 68213 -330770 40956 -180288 64829 261202 53386 60697 -71973 -40089 357037 -135121
21884 6665 -36930 8520 117331 -377393 -245894 -35782 -92526 317383 -99215 1266 112137
21873 112137 129479 289575 -85974 230474 63443 -281959 -65982 -83695 -154284 -97459 -183804
21862 -183804 235981 -18134 -40359 125693 118860 -32561 -295318 239183 138254 -53875 -147390
21851 -147390 -100431 -196018 -123060 -4052 2024 -68112 -25948 -302570 -115761 -176064 94027
21839 13344 18124 -306987 -327307 39715 149593 -442997 -219871 32538 -26341 162868 -73506
21827 197748 -54086 159675 46998 160857 -45962 -68240 180241 -26105 -19505 -17044 68186
21815 295948 50301 -389684 104519 -466073 -165420 -353592 -123881 -44274 305383 47852
21804 338760 27524 291831 105258 21952 -63875 -129978 -311942 66637 -232015 -30053 -105269
21793 -105269 -1627 20683 -206287 84800 -14126 -3672 -38211 -42627 -194858 -29269 132339
21781 109428 -131522 -37338 306938 -141101 -336054 367887 277696 -319831 10870 -13221
21770 -159501 -9065 8247 -180178 -128061 -250667 138306 -22988 78807 -129381 128006 -201410
21758 20331 24579 85444 -178607 372936 -117842 58457 65715 -47542 236507 -422599 174549
21746 -19471 16334 77404 -249078 -192820 94958 26164 -174206 -271658 -135389 -83361 188140
21734 130212 168822 230986 -131262 -167971 23770 64620 -120425 -58479 -441154 5607 187653
21723 187653 283397 158317 -51039 147875 -35218 -208871 -95401 263347 79530 -45018 -415542
21712 -415542 199444 -5145 230490 66137 -117112 204404 57061 -219701 -8666 -51494 88532
21700 -21896 -53587 -61160 61633 5439 -155726 12574 111793 16731 169118 153087 2006 -166436
21687 -373017 -65736 81990 655 -217395 57629 -484667 86122 -95260 41632 58099 -297 -242099
21675 -242099 -135117 -131291 92977 122213 115820 17092 -337271 -50811 -503043 153497 -4347
21663 135253 -54454 -152736 -15892 -89857 -252313 -47696 241407 -326032 109346 -121452
21652 164855 52637 -192634 -84302 -360593 -168186 232254 129396 -114867 34492 -68045
21641 -248715 -266134 -77849 174741 -57182 -78144 -55570 141786 -13455 17520 -11723 41705
21629 -222660 -54053 -381183 -118960 -200707 -189774 -145612 -17126 -142824 -40160 -85937 125149
21617 -174870 -52249 3908 -374768 -97601 291197 -208190 -65424 228895 -170613 154617
21606 -56966 -418345 -41524 -180397 60007 -230506 106832 -199294 -107220 -260934 -273876
21596 -273876 -200395 -176081 -15148 -78547 -309506 132064 -252729 121100 149639 124214 -219206
21584 38011 -182840 420488 -192715 -176278 -214038 8550 -33596 -269398 -142486 -314655 22968
21572 109307 -80971 105395 186573 -124007 -171023 -277221 -336450 -182587 76591 37457 243750
21561 243750 264878 -304715 -51509 -79619 108620 -22922 15423 -348943 -25596 18747 213905
21550 213905 86438 -99134 -44302 164307 43155 117465 229628 121350 88354 -54426 47533
21538 -232169 57118 -313123 217775 -326994 -209081 -342184 -159954 235325 -213176 405630
21527 -115993 12387 -67893 64163 -169401 28453 -319538 41022 344938 43473 -273665 -170115
21516 -170115 -38993 138791 72727 -203008 71525 126953 -325505 -166758 -186971 9295 -43385
21504 9078 -337572 -145912 -226273 193997 -74218 -181755 42084 90251 -20064 129678 -128953
21492 -51261 -18707 -67714 -101185 165559 41522 -86991 -59252 -131441 -193584 -118746 -149044
21481 -149044 406209 -71794 -53652 37397 -186272 84078 357519 -91632 198627 230888 38112
21469 -162549 -50695 -196364 -203913 -60033 49772 -227695 -119852 129167 -61655 11379 127125
21458 127125 24781 -272084 -161998 -20429 -109119 361652 -277346 338916 174943 -93565
21447 59368 117648 -236664 263696 -147940 -25411 162399 -120767 79798 -60187 212102
21436 193907 238453 369345 331534 211022 292348 -3559 290859 73859 139791 110122 285037
21425 285037 110663 26312 -465955 -272536 -23850 159658 -58444 132792 22553 -348502
21414 -55573 -67854 -87000 -34317 -64656 -125831 -81281 -264786 -275966 -205860 37672 167421
21403 167421 116567 -72636 -100582 35502 -269731 -295404 13174 57603 -37048 452473 493797
21392 493797 51972 -101901 21238 -136649 -20739 -20716 240838 4941 209741 150939 -17355
21380 48917 2712 87298 -68760 70223 -49494 -59995 -34705 -168710 -13844 -132955 -376805
21369 -376805 -301140 -100314 -40627 -95034 -234798 -180155 69812 104307 -163662 -124801 124395
21357 -352303 -86061 -333528 -82010 69224 -275533 -119533 98357 237234 44861 -25223 -53465
21346 -53465 -74518 -207737 -30663 -310054 -40521 141467 19931 -4495 -189133 107941 -50488
21334 -235494 30106 157423 -27240 -183463 161558 170877 67077 -185235 -234548 -253518 -3163
21322 -81634 -66464 78774 -103632 133571 -53219 -87631 -257685 -217882 -190833 338633 368530
21311 368530 -360859 -233426 159321 33534 31249 -100064 -170156 -161775 209760 158286 -149052
21299 -192217 -135875 -119590 39812 148180 -7388 50108 -74905 -247350 -118217 157139 6055
21287 109144 -343088 160774 224741 -13893 -36770 -27496 182549 -179081 48372 74412 148617
21276 148617 -102944 -28219 106230 -149218 -189579 -285469 -125942 -387676 42773 -98188
21265 137711 -94644 -16701 30499 53369 -146777 -72140 211954 -225592 99809 -10109 -348114
21254 -348114 -240042 -77144 -140909 -294581 33436 250709 -111970 103463 192691 -173600
21243 56711 259477 159993 -135169 -130888 -139941 -157313 -103373 274946 -246868 -110591 17302
21231 14179 -135724 16333 56030 -192070 -222992 160230 -143107 -63561 41718 94116 -164425
21219 56728 128794 -108167 146754 -422889 -5022 -84256 -212722 55138 -136711 -211658 -293759
21208 -293759 5665 -92736 87117 231530 73492 -152311 -197154 -193965 11808 -55974 -368678
21197 -368678 199008 -42908 -63605 -108613 -165719 -142393 424048 -2905 -228332 -340296 101617
21185 35676 -90249 268192 -266289 214268 -93430 43912 -103737 359641 -277763 -222701
21175 -222701 -108624 -452326 -106808 -278026 -73684 -283091 -33703 -101303 148064 62344
21164 171545 -493256 -96323 -197499 -67881 -335686 -185293 331823 218965 9351 58537
21154 58537 23534 39063 20000 224542 121681 -57680 101219 -246433 -251498 12981 178253
21143 178253 121454 112529 -18581 -59479 18851 -11773 60675 220016 -175815 2168 309081
21132 309081 -107335 80633 -11318 -67828 152146 -269798 -201986 -45585 -301776 104531
21121 165405 -216850 36086 -120371 70903 -394999 296214 -41980 -100911 159297 27641
21110 -353340 340913 -252014 -53658 -122639 -6372 -15584 161970 -58258 210911 -49727 -26825
21099 -26825 -84501 123216 59523 -50370 -52595 -113888 102807 160024 -119311 -101746 -64339
21088 -64339 -172404 -224326 171654 161942 -94426 -72654 -191795 242239 -246560 -353087 -129936
21076 -169667 126240 -3400 -436606 -59512 -179958 12156 266377 -150839 -17115 -322440
21066 -322440 -195204 39059 -63409 -158863 -202659 -1589 86327 11057 -440822 -86869 93055
21054 -361657 -319618 -57842 -144646 250328 -207754 -230188 -402501 25501 174475 -238728
21043 48853 -238615 -183445 -296446 202796 -245667 21218 102064 -370689 335299 -53687
21032 -18149 -89704 -84424 52179 -274649 -204603 -299704 -143501 63861 401905 -129116 55410
21020 15089 -102076 68007 47309 -58199 -39552 52583 133165 123773 -192136 79491 133522
21009 133522 29186 154290 -119043 -105991 -173424 -68511 -220924 81138 -46105 274867 -57902
20997 169533 -18242 -328432 281429 110020 9181 106757 -3632 14255 215354 168035 13407
20985 -203127 129305 -165772 -93158 61850 -59948 60582 -1693 -440407 -20695 -105453 -116103
20974 -116103 34332 208161 -168659 23746 -445130 119076 -86202 112068 26607 -411949
20963 -188007 -125475 -253666 -148945 27246 -54705 -128407 18752 -121734 -55581 -27102 -99475
20952 -99475 -44096 -424521 103520 -81734 657 -313718 193450 337069 -96841 202341 74045
20940 110814 -75186 -60103 288553 27551 -57600 51591 121724 36045 -466415 -298717 -271112
20929 -271112 -157874 124477 -209421 -144231 -82577 -140160 -105225 -94738 -70183 -197480 105509
20917 -71752 115069 57727 112322 224798 210970 -144944 152905 -183900 -24296 82120 67719
20906 67719 9836 -103774 -11946 -183734 130417 -109497 26297 -123309 -121310 -226262 -195788
20895 -195788 -314088 20818 -105683 -100410 -23039 22906 96252 46765 -164488 -16869 249555
20883 -28171 -69790 -258917 -187328 -18748 13977 265164 157291 -74287 136706 146622 -48842
20871 149627 49201 -7603 276002 36388 88129 147866 -164515 -73803 152143 114685 217476
20860 217476 9696 -178245 63326 -297862 -360051 -173215 95712 -299341 -107722 46492 48139
20849 48139 -227791 -487567 -158019 -49697 -117090 156493 146372 71847 -72202 -85660 -79259
20838 -79259 -23617 6863 -70721 -81343 -23956 -48829 262101 24652 -276612 73278 97392
20827 97392 -339998 -248575 -167842 -186181 132869 -169356 -146214 -124624 -160509 67288 4511
20815 15037 -105624 24958 -52107 337313 -272527 -273143 88490 -172254 34933 4725 -56119
20803 230417 -92910 -72456 78687 -76129 193156 201792 -37659 -113071 -44937 196377 -27572
20791 -44865 -344509 123360 109117 279064 -165289 -349738 -235314 82167 -84436 -116414
20781 -116414 55145 80153 -177908 22711 -179606 288391 -96993 253671 -191958 236571
20770 94311 91053 -129105 -34496 134651 -165644 -107373 -16095 -61505 -67762 137504 -185580
20758 -117473 -242634 -342000 -108514 87106 -140431 -459569 -101599 210616 -43132 -110648
20748 -110648 367610 232914 -21448 -120125 112336 -52418 158074 268192 -466320 -214579
20737 -33045 54540 -174410 -117368 -66340 5937 11015 193572 123219 24260 106640 -145918
20725 57947 247017 141997 207903 -110078 4699 -56963 -337961 327643 -73032 87722 -158354
20713 -218343 121433 92828 28481 202105 -132574 91490 150241 -62306 -262660 -433370
20703 -433370 -29248 -140692 -226413 -364093 -421291 110450 74124 -63711 263800 -80526 -288298
20692 -288298 -194247 195510 2952 -130045 -132869 70509 -178331 -187938 -235232 40278 33625 -169072
20679 104902 75865 -95718 467241 -175777 -165456 142985 71229 -213455 16090 -254405
20668 46720 -144815 -142765 -211406 -105426 42506 -204464 -11813 -53252 -41001 -128721 -46376
20656 -370932 269728 64531 -985 -155093 103121 79610 -142197 -146735 6565 -109740 -183077
20645 -183077 -364214 177095 -42740 153421 65759 190827 137677 -117681 351144 148146
20634 13505 -71859 -246523 -316735 148901 149152 -31310 52005 269244 -14570 53680 -173530
20622 -60123 -51963 175435 -197305 -9662 -317705 20584 -149679 -172087 -182179 -169722 -61384
20610 -304427 -264576 -140643 -330021 -119487 21890 -122127 314572 70979 64400 263243
20600 263243 -260287 -239093 -418962 186879 316910 147745 -334992 15532 -423119 -161513
20589 -302078 60443 -422138 172683 124671 295455 -113952 253246 -17566 139686 45074
20578 -94831 -59953 52865 159050 127765 113591 4392 -139797 -232739 -96421 263022 -118907
20566 48592 -98201 311219 -47425 16916 324081 -99843 171870 -354020 185460 -324421
20555 -138199 -126520 255362 57823 154021 56081 157612 -202959 12760 -10971 76990 -35931
20543 -8179 25888 -30034 -55265 -38430 329076 75504 8692 136559 74334 -6077 -79377 29991
20530 -398080 -385229 -313933 -400754 -25226 174526 -106254 -186089 -214996 150526 95443 -461547
20518 131605 172751 24709 -114595 -141250 -92208 -76992 55803 -232015 8329 -137651 62784
20506 -166416 -257330 44143 -51985 -185541 37120 75210 -19693 -252728 72275 147536 -203949
20494 -42138 -129111 -144085 -108414 -32113 -78115 -253026 104945 -256461 136716 10540 -162508
20482 -158373 -153847 187580 -308817 5924 152412 273030 32961 -13398 103812 -125910 -40871
20470 -58886 -182344 66910 -85685 -50698 -22084 -207803 -176932 -26084 -345466 -20276 -183489
20459 -183489 53621 -35308 25627 -318539 -25972 -57915 119693 334646 292047 -264842 213835
20447 -162382 -47275 22512 -80528 -35632 -76694 -142445 -92737 -19908 -15205 -46982 -94449 -11354
20434 224093 168549 -293723 96276 -387923 -253376 66230 -47155 -201424 -81495 -227506
20424 -227506 -46767 -191668 -63961 232480 37648 87560 55640 53419 -213647 -81509 48537
20412 -50576 -150924 290006 30355 -147312 -118796 61408 27561 -357508 14938 -29300 -247384
20401 -247384 85804 50281 75656 -247740 40623 -126005 13638 -153883 -246827 -89981 121775
20389 43670 -52791 20251 -315692 -85407 168472 -302789 -38247 -109954 -152041 -176641 137112
20377 -64131 -111695 -26554 -305247 -456321 -483817 -63029 -79998 -254859 -73946 -246090 -149805
20366 -149805 -21940 -411954 -480227 -162228 7393 -122640 110060 -226428 -265002 -357139 -67486
20354 -322763 -395804 60627 -415419 259024 35287 277969 63540 52961 -85186 -10221 -309744
20343 -309744 -207742 -541913 154759 -22096 -59974 168092 -34629 -199433 -221788 12823
20332 -37528 -169762 108510 -125307 165215 -40295 -393093 -77961 42622 -27239 18440 -104252
20320 28902 -39258 -127918 -326486 322615 -25415 -48660 -43935 214476 -94766 48369 -161109
20308 -31853 -261319 -88829 16094 169743 144652 -2177 -210718 -131044 180269 -16922 -258442
20297 -258442 -287259 -586819 82419 60558 -379293 -15604 -183648 -290603 113122 -135675
20286 -213955 -212041 225779 -6035 -60512 -120742 -462128 12483 90385 -93211 -88897 135712
20274 318383 -69227 -212952 242425 -229444 -370776 -208145 -284844 -47785 71055 412 -363933
20262 -6107 46797 27838 48286 -170065 -289051 128894 -176576 -183198 -153177 -87596 -135729
20251 -135729 -91733 28647 -304890 269459 -239488 -54475 -248870 269797 -171267 14538
20240 -38103 -329723 -101319 -133624 54556 -200918 80372 -322375 -97008 28235 -52169 85672
20228 -169341 151940 -346119 328040 97421 78222 116418 175149 -326723 -251912 24657 114125
20217 114125 -8327 258017 -111999 72232 94116 71673 -112166 -79581 -62196 -69998 -37640
20206 -37640 -75299 -3008 -65194 -183722 1211 -89413 -11193 -179862 -146936 29235 -24830 248020
20193 -224175 -126750 -72657 -80683 -235293 44893 47299 142035 162102 -157465 34543 287653
20182 287653 122350 -368179 79412 -8528 35266 207704 -298994 69465 7454 -435864 -378781
20171 -378781 135819 14613 206666 -123140 142117 -79774 -247573 -47168 166103 -424216
20160 -118366 -127873 -72046 107335 140155 -196657 -352158 148584 179197 -222762 63675 -46531
20148 -61945 -208719 88697 240404 -94560 -117124 297909 -97116 -155236 72603 -162763 160756
20136 87397 -902 -1129 172726 -131628 -25565 96952 261333 -78309 13330 19979 -300233 -332481
20124 -332481 413820 62477 116050 -163800 -126800 -51873 32686 -269005 81458 -146791 -122646
20113 -122646 20047 174136 -184464 -112677 5000 187691 -4059 150590 -202864 -149864 -22022
20101 144866 -156487 -242175 -290073 -63017 -155751 -259210 22572 -62647 -37944 -34294 -207800
20090 -207800 2457 -258368 200526 -51706 426812 -37657 166014 -16478 -227293 -164131 -46800
20078 -71452 -310560 -327231 -200662 -242255 -1092 295637 10119 200536 56629 -262665 -110920
20066 -26692 -68977 -23306 59478 -218267 -289571 -162983 133621 84840 -293813 -5128 73289
20054 63119 252260 -169409 -33794 -52517 87165 -13548 105135 228591 207956 212824 -15544
20042 -347570 -174501 -300361 46550 -65325 -357904 -372900 -205493 -60974 17915 -47264 -171867
20031 -171867 -114831 -143956 10052 25692 -236334 112976 -162972 -48971 23053 -204860 -144558
20020 -144558 82390 -18107 82618 -98388 -142120 201241 17939 252421 -436459 -315640 9831
20008 136657 -64084 -179241 56983 -160750 -277408 -25141 -30052 154733 -5804 -80062 -13963
19996 -25050 -438393 -3742 -243766 143175 -308809 -16170 -84381 25046 295372 -93680 -388574
19985 -388574 236281 -8002 -102826 87989 -135572 -62506 84775 -5761 160723 65532 108106
19974 108106 -59852 16471 108425 -396597 -89855 103881 -180286 -236655 16909 191599 82993
19962 -315361 102998 -131996 -285539 49991 -8337 138609 -282003 232991 77726 -94901
19951 -215982 -433 -267664 267336 -146888 -116036 -251713 -102359 9893 138843 226095 -18523
19939 -120360 -178589 -66539 -45931 -13120 -77248 -336612 -143130 -174234 -92657 -61619 -114331
19928 -114331 172162 -157248 -226725 117509 -263757 113565 76666 124274 -118192 60981
19917 117590 -91536 20946 -142339 -129586 -292241 128959 18324 -133436 220361 -333872
19906 229016 -128304 46367 116502 -224746 119183 -360568 -99841 -16952 -188879 -133419
19896 -133419 -245432 24334 -429584 -14027 -264772 112526 39625 -304330 -376441 105216
19885 231136 -66139 -213307 -316995 43037 -68907 5567 266216 -313515 -50823 -13114 118360
19873 -96621 -339822 -390456 -252557 -192203 -21833 24274 -67379 -20776 116835 52961 -223581
19861 -14413 -144919 -220478 -76038 -111736 -340983 -40488 -291993 -38652 -173086 47761 -95162
19849 -290112 -219379 -300394 -208204 -68671 -6017 60578 -324612 -174908 -48839 215597 34395
19837 -193180 -37420 123115 -54099 -230767 183671 114991 11297 70672 113808 12924 -49430
19825 -408108 -96326 -42859 81825 52376 91084 -103270 -190889 165162 -476666 -176566 -278612
19814 -278612 180065 250238 -120746 -298030 -78957 -13389 -183260 232894 154139 -221413
19803 -330309 -360881 -33686 104919 393274 -104843 -166040 272231 -171335 89304 99059 114466
19792 114466 -343229 -47021 -296973 288428 -52394 -233279 268912 -9192 -162402 -329986
19782 -329986 48373 73291 -343646 -213979 -215992 -277388 -316245 17624 -183857 34609 68143
19771 68143 -128376 -250469 59199 87667 315167 -213170 -114965 -79463 -73826 217470 341640
19760 341640 -60007 29416 -173825 -265518 70478 -348900 -3351 -154489 125544 155742 -177718
19748 -34187 225076 -303273 -159072 -52379 -325976 54646 3161 -219662 -491015 -201960
19737 13692 -333365 183807 -64544 328236 -355436 180109 -71526 183678 -193739 33238
19726 -18684 128866 -105255 -206489 -87117 242339 245865 -89358 482743 326564 -125300
19715 113991 -173902 -6340 -110131 -69669 -65333 -37051 -116435 151882 -197105 -186673 46721
19703 -156081 -210497 195542 -195420 78663 72619 -47477 -364428 -53099 -39446 1590 152135
19692 152135 83997 -79036 -18652 161580 334233 -213911 -4622 -108539 -73031 218545 127817
19681 127817 -244805 -131189 -60664 -266944 214522 239852 -87642 -396114 171156 99997
19671 99997 91273 -146556 -176116 97026 142814 -145910 130831 113324 -87031 304719 24015
19659 26276 -59654 -477443 -324022 -51427 332126 -15738 -91240 31692 3505 -220104 47402
19647 200848 -150897 -164156 -71474 13140 -313921 -292682 -223794 -234570 -332029 -220016 -23949
19635 39518 -549458 -10724 -169380 51958 129168 -375129 -136534 61026 -58362 -24135 90577
19623 -16033 196 -220228 115393 -382434 139799 -310577 -449631 245150 -14209 -262169
19613 -262169 106970 88161 -31379 26680 -262001 155279 -38859 -47593 -23687 50539 -14142
19601 -8403 -34115 -213022 239151 -68794 -246666 241562 -193507 -250864 -136428 62816 -69322
19589 -36618 56676 -116075 16452 -314873 -116410 -14525 -106504 290885 -265566 -63011 -65582
19578 -65582 -14672 -80555 -93282 65493 -243718 -94407 -427567 -14039 -381298 364050 -285589
19566 1203 -387191 152059 -199552 -271355 -166835 66317 -146418 -83818 80717 -203577 -138373
19555 -138373 -219473 103502 -128568 -74002 166387 -319773 -119697 -322021 -257181 126856
19544 209535 -120977 -288959 -182498 -277638 -233569 -70662 65565 125583 -21665 36738 -171842
19532 75206 53603 -147045 -26157 231757 -226385 -126401 -67388 50845 -17030 -122138 5698
19520 252987 28760 155052 -331725 -23657 -61868 47139 -334149 153321 -10841 32852 37367
19509 37367 -6114 -157461 89579 -123346 -314414 14522 146183 -41177 348958 173910 -3820
19497 -180620 -11691 -11678 -220218 22690 -44837 -45611 194820 193334 255596 19910 -379744 69782
19484 -87079 -251504 -90614 -221575 109695 -23722 -121012 293439 -201064 -271947 -22703 73892
19472 -409164 23705 -608782 -112392 -227855 -9146 67693 130475 101932 103244 159536 -67675
19460 121011 -111668 -151141 -120311 -304219 140354 42909 -135834 -360712 142000 142084 -283020
19448 11310 -214072 128309 -156152 203284 8856 172941 -32941 225903 20417 -244772
19437 -483760 -198020 -89066 -222928 83085 -54375 -171898 209590 -314104 -132782 209618
19426 -155711 9653 193895 16634 51915 183217 -177158 63344 -174455 -147998 -81848 -356827
19415 -356827 -50084 -357956 -223275 -1949 -193400 66916 -51969 147085 -55727 -297223 -7097
19403 -165922 165718 -390117 98883 -46616 -44199 147904 41358 45510 390929 -163198 24755
19391 -214728 561918 -336816 -263588 94378 -354268 -69188 -343913 -98873 77115 126399 -65977
19379 -79276 253650 -236091 -53985 -14193 8369 281270 55285 5083 57830 -35701 -431333
19368 -431333 -63866 -409286 -216305 -89566 -115554 -342911 -126679 -81250 -27088 136487
19357 -196957 -137297 -270362 -255288 113347 -122155 166929 169287 -301276 121744 139579
19347 139579 76285 -253926 8599 -78087 -186572 -17139 -111065 -114708 52313 -92263 -97947 -75778
19335 -75778 110907 119815 -226715 133343 -212350 -183584 -101355 -345592 227108 -41061 -125135
19324 -125135 -96293 -98251 -56030 -11961 -567 75728 -406560 -248520 -37105 197128 -264555
19312 -182380 235630 -57259 118514 44366 -418285 171029 189719 -299237 -174907 -140274
19302 -140274 -18296 -27849 -58931 260657 140777 -142095 -55227 -48369 -457654 55392 -182131
19290 -106337 -355608 230260 -57396 -157254 -44447 -47948 -91522 -38200 -369824 -229700 239917
19278 -75062 218529 22994 150009 -274997 411148 -5284 -91729 -342787 30778 -27885 -237127
19267 -237127 21065 131024 -184887 60034 34368 -119911 148951 154183 -71547 -245229 109272
19255 -44017 243195 -565228 68864 -26116 158866 -263352 -237039 12113 -298610 -104229
19244 -424636 -253065 -160068 59197 -68531 -54547 -44509 -71054 -157279 -185037 -447590 58818
19232 10802 -130257 -497623 -468902 217491 47257 -109626 -26158 140693 -36593 30220 -175987
19220 -366784 -117275 -192713 21239 132235 -157482 -83114 129332 -44480 -19880 -212022
19210 -212022 -183958 -13388 -169676 -203134 -183993 181064 228203 -82964 233195 -10075 -51405
19199 -51405 -176926 -283145 -229455 130500 -71999 -43340 -208195 367253 -100198 65897
19188 -477751 -34479 160075 -80775 -305726 115670 -187889 -87303 -234904 202235 -81408
19177 212149 -197194 -149814 -15246 -236402 -63739 -185723 409250 -105089 38175 -75647
19166 -236407 120863 17662 -157300 27910 85678 38586 -131615 -248276 179754 -108892
19155 51508 127474 -219511 -11185 97488 354601 38317 -205292 -240957 176164 -81804 -99578
19144 -99578 -281304 -224207 -120772 -134001 -251513 -375281 -190713 -76255 104352 -227533
19133 -21130 -37331 42155 237295 -133215 -30933 47834 10331 -293195 185844 -168453 13170
19121 -105061 -217453 26485 -204389 17921 -181406 -241067 -407640 225349 -28463 -438623
19111 -438623 -56285 133797 -26193 134336 -1962 -383681 -174171 -78766 206349 -217979
19100 -190983 -55001 226744 -44433 -194417 160200 1454 -127778 -79687 219953 -479429
19089 -260497 -111010 -380926 -24625 343539 32131 -339330 -271043 111257 24337 -225143
19078 -309272 -39727 -194510 -191008 78784 -61421 -22680 -20380 -355148 -332154 -30089 -137553
19067 -137553 86748 -181718 -67598 321526 -40762 86815 -241777 -41421 -454371 223649
19056 21402 -285766 -65696 32852 342708 189102 14224 -10033 -54025 -53704 -84155 -306880
19045 -306880 -33636 60535 -132693 88867 -79367 9034 -96478 -9398 -11856 -139364 -141866 189838
19032 -213708 -3853 -262612 97206 150679 61830 16322 46275 -134702 -59956 -131832 291726
19020 4371 283501 94131 -208681 -257273 -242550 83336 -27017 -83384 -306717 -86983 288251
19008 281266 10569 -355516 152085 -103714 -174207 57774 16431 131387 91055 38421 -213262
18996 -13775 -172898 34056 49783 160185 -109055 -370781 -200090 127227 -16825 -229435
18986 -229435 211184 279419 -99258 147919 174902 -43989 37743 -170320 -79198 -188971 -137647
18975 -137647 -133879 42270 207672 -391415 235857 -67312 -62867 -19620 -193133 47030 -92968
18963 55912 -279398 -99775 -123987 133857 -241835 -87864 17420 -221630 -235520 -233472 -206620
18952 -206620 -32419 -172713 -27335 91048 53224 173872 157954 49504 -67082 -20850 -20406
18941 -20406 -171016 -29159 -222736 122064 9091 -100386 94890 102067 29756 -205487 680
18929 -80393 -251672 -163017 -41439 84398 192516 211713 -202003 58547 -146594 145915 -57305
18917 -46475 -147442 133630 -195350 106599 -55980 470657 -257403 176057 102842 -264509
18906 -151065 439796 -74867 -367268 -348563 16718 -60488 -135749 -198914 11538 -15976 86163
18894 -51280 449 -188328 -104560 -154480 221565 106706 -129265 -87293 -276429 -93334 155416
18882 129368 137154 -70011 93591 -74462 -66023 62620 -285710 -96158 91085 -16387 170966
18870 -298809 -34814 -46690 354116 -131888 -103720 -119986 -340152 -189852 133560 -145458
18859 52669 320534 -246212 -260324 -112613 -127424 -147537 -156900 26013 -489221 24504 146317
18848 146317 -10456 -134576 39367 -25048 -202276 187838 -422167 114470 -90528 222188
18837 40459 -127668 66439 -385768 -8265 19909 -229999 -310602 -165974 -113252 98198 101620
18826 101620 -32662 26622 -171391 -307799 52582 437924 -192505 -258093 118560 -443171
18815 -17550 38867 54520 -112799 -60801 -258499 252136 248574 -85881 -249732 272300 261110
18804 261110 -6117 -167234 186944 20786 -218388 -101744 -268724 65735 -87349 58587 113668
18793 113668 -343737 111231 -210994 -112669 -198682 -205171 -125743 11808 260784 -49103 182571
18781 -124967 -12606 -27811 -355099 -24462 276426 -36767 -28683 69400 -367183 88716 138915
18770 138915 -297046 -79447 -106589 -458385 -196013 -95729 12126 -177465 -111654 -339664
18760 -339664 -268464 -61491 120996 21613 178367 -32041 216332 -399270 -277799 48239
18749 -83903 140423 -272905 27013 344855 127059 -129741 -591206 -136829 42155 -386859
18738 64841 -236022 1096 16134 -80022 -34857 56166 171402 45742 -17187 279907 -242825
18726 309301 -103643 -419503 254596 -280002 -19970 -205248 -138998 280978 78729 -235481
18715 -225206 130354 -167404 -169372 57279 -201548 -162936 95798 9757 14746 103308 -24525
18703 96101 243752 -147181 -114117 129037 7480 81985 245435 177804 41510 -179838 80366
18691 -320997 -265869 293414 127822 -238801 47598 -253717 -49929 -162696 240489 -142766
18680 312044 11016 -221370 -222348 243163 18581 -28689 -110127 -144980 -236168 -606123 234442
18668 -20031 -288480 -271743 -108557 4082 13555 -139709 -1086 -143863 -14825 -266394 -135549
18657 -135549 41434 -79812 286035 25049 240771 83938 -53414 -499346 -102963 -194157 -283140
18646 -283140 -27232 -44691 -162724 -119871 -84701 -11975 -36942 132887 -252998 -356925 -231324
18635 -231324 -191252 42807 -279308 -147415 115583 -163798 -63528 -83333 -103245 -177379 -287448
18624 -287448 81200 -70778 -53291 16321 -121983 68271 128278 330002 282291 -145019 -37267
18612 -181870 121901 -140705 -78326 -268775 25328 -142003 121283 -4897 168544 -98460
18601 -55685 32881 -143329 73547 -158467 -67561 20711 -87864 57124 -58437 25811 1670
18589 339436 -149728 -293581 34634 33304 -142018 101046 156152 -168648 -201060 -173561 -159704
18578 -159704 -24693 -109467 -31083 -96158 -129981 121615 8491 87398 -258998 -73272 106529
18566 202313 -305229 62418 5266 -59487 -169967 -204967 -78249 26653 233654 -37120 -205992
18555 -205992 -9909 -127373 170486 -253927 202498 170187 -53622 -153687 191057 -153625
18544 394675 59953 -115596 -80415 225879 365178 -92368 -9275 66115 -74109 -21465 -210593
18533 -210593 60909 -147096 -134760 -140773 193936 -344436 85951 -61785 665 100001 -60870
18521 128296 150180 -111811 -421403 -181086 -96615 263793 -148376 -76094 -420978 -117553
18510 -86175 -28097 180082 -217133 -113711 -502663 75857 -169848 -199458 -78453 -98270 16527
18498 -156284 -80021 -72085 -188231 -37928 365041 -195023 -26109 -115399 -102450 -94263 -14070
18486 40505 -25633 -93698 62300 -22511 350708 -260626 73549 202676 64182 -374944 -50187
18474 -207311 165071 -224510 -238263 -211744 3782 133478 -70454 -19402 -32396 138656 -53639
18462 -192387 -77298 -414668 69410 -10703 96770 -29038 -321126 -220159 -198500 -40577 83602
18450 -50759 121107 154516 -381697 50802 -374547 -225488 35919 -69514 -242545 -45249 71626
18438 -259169 84378 27459 -5619 -19232 -283501 -233958 -84490 -161962 -341211 -544002 -63084
18426 -221063 307755 -340833 -301770 -110795 -85968 -61106 70915 133668 14467 163255 -31950
18414 -53368 77445 252505 -74583 -34687 -69430 -202012 -183964 -71123 134467 433638 -27440
18402 219640 5183 328551 -168287 -107715 29738 161095 14709 -301269 265472 -109018
18391 -156568 -120804 116584 -30140 -106847 290194 -220486 5787 -160719 83173 -6845 -92719
18380 -92719 -101277 -121561 93133 85754 -19054 -231182 -151282 50835 -279424 -352879 84581 -96804
18367 -32110 32260 -261667 98139 -108524 266819 54320 -219700 -170512 -28959 -41344 137893
18355 148134 37826 -64430 174446 277684 -50535 -70703 -96904 279495 174062 -43104 -195889
18344 -195889 323140 161884 139810 -158647 -110019 -79223 101636 110924 83152 -193590 -277424
18333 -277424 29103 -37603 -57214 414697 -89730 -220764 -34013 191488 -5181 -198397 33902
18321 300068 -37131 363869 -229986 -378090 -151728 -423158 -303761 -62466 -137951 99225
18310 -27587 -36890 -391191 245798 -57678 34957 198406 10125 190944 99023 -169770 196691
18298 -5375 28817 -138898 126001 185772 46220 298626 -427419 78955 -59351 19703 161344
18287 161344 -68928 299362 163116 27812 -444754 -123580 -85098 -219454 259275 87089
18276 -35173 -11437 34354 -3306 30424 84444 31853 53869 60847 242884 87284 -4632 17786
18263 80443 -182734 168960 -22784 104831 -158433 -95365 -84537 -51876 -194484 -254851 320257
18251 136034 148546 159998 155025 -122853 147438 -225674 281065 -52194 90791 187358 -235009
18239 234939 -119888 -386932 -62551 -93314 -277846 -149940 -122337 101221 75347 -75110
18228 -90280 13219 -415155 199791 -348589 -135565 5627 -318107 -292305 12154 -186837 -119744
18217 -119744 -5277 -47209 -293604 12782 311940 23836 -119563 20592 -13317 -114141 14434
18205 -121746 -339893 -127303 -161476 16950 167734 1716 165574 17302 87259 -241062 436590
18193 4385 378092 58451 234526 -189883 244944 -20642 77586 228909 48977 -2624 -285665
18182 -285665 64297 15943 -14796 -221837 -63419 -327628 -66051 32205 -97315 183251 -10342
18170 -113487 232662 -429063 -492197 -99765 109592 -283145 33270 -96178 -113019 -127302 -386233
18159 -386233 170197 154496 242146 71269 -27681 271907 -365358 -13181 98854 -50666 70553
18147 -149057 -223434 361122 -32274 -259633 -19000 -375922 -134253 -26398 -346005 -8152 -377495
18136 -377495 -37987 17879 -66600 16120 -272240 -232573 -9508 -287395 130933 24012 98995
18125 98995 34118 72039 -109920 -68247 39281 -306923 318637 198341 3437 165470 273916
18114 273916 -245200 245669 174553 -295227 -71012 -133279 18791 -125187 -372084 55696
18103 -34230 -382065 299149 15704 67878 44400 -207979 43462 -55334 -171408 178536 60797
18091 174121 126008 -162900 -261364 -194594 -74130 -34315 171211 -329066 66518 -240257 198945
18079 -151469 -174599 -68203 17137 -204234 105904 -39017 5219 -38678 -121844 -277224 106565
18067 -321847 22848 -89162 -147528 98132 145270 -50497 174650 99867 36294 99903 -298441
18055 231611 -49108 273884 -66597 -146498 120650 252326 -155153 -355321 -217861 -353870
18045 -353870 248255 -84260 277810 -112260 -23756 240297 160686 161540 263570 230879 -23136
18033 286270 -108979 240004 -20788 -4732 -144685 112181 162385 -113336 -285378 133392
18022 -103178 188179 45037 -102854 44485 293605 118310 -168826 153860 -88095 98396
18011 -35830 29532 -148622 23896 242450 -175332 192379 164036 25734 -27953 -11610 274111
17999 -28518 78827 57362 114569 -241309 70885 -46915 158979 -76889 -89124 12579 -97739
17987 86376 22843 -257860 47374 -127406 -127496 -208272 316313 188849 -53410 248662 58514
17975 148221 90879 -92770 -138859 17398 -137517 160390 -121769 197029 -209768 -33401
17964 3183 -13253 -172953 -61284 123300 72705 108737 -48358 -226305 109097 -36663 206701
17952 99346 150082 314053 -245325 -149025 -358175 -201834 -17152 -144394 -299698 -50638
17941 -312062 39768 -369211 181593 78978 -127343 96531 -360286 200024 -92460 39942
17930 107811 -198194 -135849 142139 -81817 -194839 -24867 -140310 -141247 -92581 -237363 248795
17918 -105885 132052 90451 -162026 -169253 -47607 -308052 131079 -163580 -63600 -92855 -152612
17907 -152612 -181109 -103551 146009 -204133 63255 -57063 94463 -51541 32592 187249 -40153
17895 -69884 122916 -186857 -116155 -212781 -154575 -15552 -114115 -161219 -124934 -221560 239957
17883 8307 133300 -209042 -7702 249227 -209810 15619 165103 -178724 112637 99290 -220605
17871 -251780 207573 -123785 53700 112604 -18291 -83299 10091 -396378 -21553 62283 -88709
17859 -194609 32072 -75072 12175 115955 -192233 -81487 -103908 -214975 -192404 -236300 313860
17847 -96194 -76754 201223 -159853 134412 348097 -259103 -113358 4710 350715 10481
17836 53441 -344368 -121219 -146599 169045 50866 -71776 5121 27019 6122 -106055 139010
17824 -329889 -54871 125814 -196606 236194 6111 -161847 -465124 233986 23948 14047 124502
17813 124502 246608 292041 258791 -36340 -349650 -49368 -22329 256672 143928 264975
17803 264975 56118 19491 186465 -159845 18118 77043 163445 92808 -341493 2659 133142
17792 133142 -286384 -3907 244545 160869 -310375 -70730 -265279 108840 209707 67486
17781 -190319 244884 -37931 193798 -87028 81022 123899 406 -50308 -146171 -114991 240677
17769 -22632 -16624 117742 -314249 -190427 62358 -325686 -128975 87913 -12470 156537 35969
17757 50595 -174659 5008 45409 13699 152538 84569 -198953 -433245 293347 81172 87932
17746 87932 30385 -74885 -205415 -67857 169 470586 -64292 -92677 -169570 126121 -279909
17734 -241896 -150175 -57054 -191526 -128165 -107399 341827 226074 -61308 38129 -34165 132110
17722 39417 -70023 -58153 -216741 -185335 -8631 335588 170580 286057 15560 40543 -6952
17710 -203012 -154924 -42051 1242 -60009 -375837 -142592 -159173 22837 -211390 245978 -215895
17698 -61830 450215 -222167 -139009 -92551 -247036 -178797 -7261 59845 461909 81703 149159
17687 149159 274756 151802 -226054 176702 -263511 -4866 189872 -229385 -75443 3851
17676 -105378 -72159 28252 -172291 132092 59622 52635 97105 -223888 185724 76477 47642
17665 47642 -70411 -127231 -90680 -67241 20563 321234 90563 -244416 21167 -135362 -141083
17654 -141083 27958 438185 133574 275295 -331541 -356529 -330733 29044 281801 235132
17644 235132 302634 -118512 60962 -1748 199323 45426 161459 47488 57710 -160570 -101674
17633 -101674 -185080 162886 7249 52076 76791 -59091 -27571 59881 214157 -77595 13298
17621 89684 -64826 290509 561748 -36631 -183347 -235974 369357 -36753 -100966 359267 180845
17610 180845 292078 -206064 -111145 -32257 -109486 -171872 193324 58666 -129183 220054
17599 -62461 83349 58442 21152 220556 -43249 57264 33326 8267 25144 77981 254086
17588 254086 127536 137830 -41747 -126910 368866 -482 53965 25843 -172830 -306576 89978
17576 -277735 -68024 112451 -117333 -117383 185414 32401 252392 -25280 33856 28373 -84644
17564 36471 196442 -10402 -115857 65711 63629 263528 -105096 199619 248884 40452 83934
17553 83934 169710 -185736 -156008 -266827 81146 -203857 37118 -33295 267082 88081 54648
17542 54648 107635 106338 1414 324348 238763 -139987 -266310 132740 78341 26915 -184737
17530 -436435 -263629 -169490 22906 63575 21660 -23469 16352 -283682 66699 -52219 232621
17518 125861 36647 -52097 68029 -87747 139090 129979 205812 281134 31521 65584 100315
17507 100315 -11812 -20477 139799 19957 327921 69673 -101486 63660 169549 102156 54832
17496 54832 -55922 57409 371384 -19807 114845 93378 -157039 173012 147000 44542 -560245
17484 61901 -104071 247455 177368 328098 28255 100964 297379 364346 115640 -247155
17473 417840 200438 159070 -131726 308370 31020 27861 284890 149634 359033 70932
17462 279639 -161729 -45608 -63752 142396 -39740 401813 329880 154926 -48075 187083
17451 576899 373796 178795 434019 188093 193150 226347 284316 108281 255098 120470
17440 171977 342779 282780 352160 324647 204734 339715 -134789 -41190 426813 101110
17429 -22149 623195 262417 94035 -23729 153046 146018 149643 103128 485320 12723 446227
17418 446227 67158 -58932 321261 371736 185655 674506 407707 83329 82444 284851 274294
17407 274294 128496 457862 127579 -137904 184252 -46558 -32584 424567 382489 380104
17397 380104 -87364 242135 48999 29467 -19397 468025 326509 34999 296045 243259 63371
17385 128426 81491 308547 165829 63339 307466 51129 223455 123440 84266 -169014
17374 81695 -197748 219742 105450 157489 334744 -11074 519595 217910 36997 163678
17364 163678 -41613 20948 203331 -87182 -8626 139738 122027 8522 290081 -162126 -79816
17352 57285 125076 49183 442121 -56204 195942 -319307 -5870 -61739 117960 -47320 -130257
17341 -130257 80190 138975 263344 171903 203429 345385 -318888 -257528 41567 138952 385208
17330 385208 280190 393213 294760 586189 155914 334150 85449 243582 210160 145211
17320 145211 -97652 256767 -100749 250006 90220 54548 208112 156074 46403 179934
17310 179934 135758 124934 92375 157881 -63472 235123 -204566 9827 177415 276100 264991
17299 264991 -14482 146441 -30782 -72500 62092 219738 -156070 445269 292292 89884
17288 100698 -1735 97701 6177 133081 154630 122103 -191303 277587 178301 38420 358556
17277 358556 139581 279926 118849 469772 176622 138835 227109 179177 -93123 -209584
17267 -209584 -9977 168991 -306430 34451 157316 681353 163336 275625 67455 80005
17257 80005 33973 283587 -60605 405155 486221 94905 164999 135980 91705 156995 103992
17246 103992 111399 -123636 213561 211672 363812 169659 183431 -104641 35311 381003 300360
17235 300360 315198 -42883 -276914 90098 -244789 218546 142517 -58331 52503 305161 -28286
17223 -129560 -103802 339062 76101 100770 -11323 117898 198148 160777 363646 203936 209491
17212 209491 371312 198151 82103 177667 210849 277905 140559 655 233443 317095 122001
17200 284976 -18604 273058 53663 232505 179072 216048 224429 -176141 240921 -131094 -103352
17189 -103352 -50213 349355 -109276 223656 122868 266716 232365 -26984 180439 -106389
17178 283565 476715 251229 292242 406352 -149082 58343 252753 438985 451176 49616
17167 -174438 401615 479862 263802 21215 393999 191352 229654 129667 382991 289693
17157 289693 123141 156248 305763 223282 -5786 498036 77900 256731 385453 344433 686468
17146 686468 475926 131187 136470 415919 79569 112667 295902 140190 106498 565083
17136 565083 466801 287602 342328 254562 498175 231813 287358 383283 513658 255623
17125 291216 215587 206558 287191 502146 382431 517023 202247 -21237 71314 135974 514344
17114 514344 11047 426039 247427 292130 330198 342060 483908 226042 471426 473395 351266
17103 351266 439490 223085 356319 323864 304857 210635 646309 97517 -51825 94915 387902
17092 387902 36524 212323 341996 298602 390658 447795 766272 297395 254914 141046
17082 141046 229359 -53340 265454 163975 252203 20314 457235 234726 588920 473397
17072 473397 276367 234925 430143 -13736 421813 396471 487892 586760 246985 761103
17062 761103 363157 480893 421995 491336 318296 810238 367091 216315 443231 333226
17052 333226 259802 368392 315988 515794 452733 331971 515480 635851 489799 456679
17042 456679 177453 380457 529918 676415 367868 632773 292444 566487 551079 286466
17032 286466 539209 470689 830372 564146 642530 598299 555007 763858 471615 399965
17022 399965 602958 458853 324447 240190 745616 680489 516551 626072 396102 404989
17012 404989 829869 929697 773870 555037 759835 823925 566772 358473 704384 562903
17002 562903 279869 611794 811986 823692 593572 596342 329164 745913 732213 715955
16992 715955 635602 447755 316253 617991 804418 548966 1119866 653548 746424 604289
16982 604289 727584 817846 589089 564089 513892 897053 739730 364185 713952 548107
16972 548107 783191 837700 714855 737111 721348 810142 986556 571135 869281 662656
16962 662656 803113 825993 876181 1044101 704338 834167 816710 662211 721432 852728
16952 852728 881417 1207581 1010355 832687 1133358 1040230 971801 918276 1080886 811884
16942 811884 1028129 846698 940155 1021491 933838 841653 1435047 659611 968345 1223326
16932 1223326 1089358 1036366 1170260 1292651 1239038 607790 1425116 1196810 1306074 1072017
16922 1072017 1029224 1128959 1273032 1141930 1295225 1081749 1155133 1187345 951413 1451679
16912 1451679 1240261 1205037 1424362 1248744 1248704 1126792 1068943 1613952 1360428 1428312 1379324
16901 1379324 1637210 1465448 1587009 1598204 1298503 1574981 1708690 1385226 1429022 1641928
16891 1641928 1586594 1825915 1467515 1623286 1841062 1528519 1521528 1671536 1855011 1640412
16881 1640412 1622532 1698835 1852306 1781296 1653570 2353799 1877165 1919904 2100579 2061474
16871 2061474 2165295 2422810 1954954 2008926 1858179 2251401 2234757 2231489 2183988 1998852
16861 1998852 2315681 2351943 2162629 2636055 2602852 2500451 2523292 2644658 2311758 2533687
16851 2533687 2984646 2791181 2812531 2710598 2756189 2861662 2798655 2817950 3042870 3239560
16841 3239560 3098000 2983827 3245800 3456408 3395312 3508563 3482078 3407923 3490067 3559745
16831 3559745 3928000 3917320 3825919 3808840 4035766 3955414 3892085 4504052 4327721 4519771
16821 4519771 4397341 4409368 4324770 4603328 4585030 4810293 4993315 4948094 5188333 5164172
16811 5164172 5051349 5377938 5096670 5665879 5765203 5912147 5752230 6271192 6224578 6059298
16801 6059298 6290489 6518794 6793950 7011284 6685479 7062409 7730546 7738497 7723280 8075087
16791 8075087 8086585 8587879 9035216 8710832 8816451 9145660 9611673 9731910 10424532 10366703
16781 10366703 10537344 11077054 11340146 11574794 11952932 12515887 12736974 13171300 13670796
16772 13670796 14303835 14513010 14873695 15751641 15904662 16600072 16837096 17693555 18633814
16763 18633814 19140501 19877768 20774677 21243234 22055741 23209774 24122499 24975653 26241014
16754 26241014 27416800 28507294 29813941 31401062 32863011 34237875 35609354 38066954
16746 38066954 39912202 41767990 44236684 46699279 49160113 51614700 54909095 58295948
16738 58295948 61562050 65177721 69735198 73406806 78539165 83595964 89018190 94420999
16730 94420999 100788616 107933002 114755205 122326531 130383729 138112294 146484502 154710281
16722 154710281 163310965 171008473 178629240 185399170 191520145 196384114 199461719 201360921
16714 201360921 201439536 200118565 197526594 192792888 186878493 180181543 173080326 165245934
16706 165245934 156356302 148286306 139662377 131261283 123185862 115343808 108208762 100923293
16698 100923293 94841581 88928800 83175643 77923451 72858093 68478779 64437440 60727605
16690 60727605 56946959 53576763 50619707 47696084 45216361 43022288 40459468 38180919
16682 38180919 36491110 34723621 32772203 31317773 29922732 28163878 27276704 26175993
16674 26175993 24976036 23894617 22912841 21750813 20942860 20025393 19450087 18427671 18005913
16665 18005913 16798633 16431676 16105643 15286072 14991828 14241737 13922937 13503579 12823375
16656 12823375 12877909 12247048 11781507 11345098 10958380 10411716 10218886 9809671 9729079 9453705
16646 9453705 9140082 8710501 8838997 8691561 8101026 7876730 7609073 7301917 7442565
16637 7442565 7040663 7246513 6708260 6565769 6418276 6506342 6058842 6110722 5884200 5932706
16627 5932706 5364163 5459236 5540284 5439902 5087844 4999369 4975894 4696345 4826449 4283474
16617 4283474 4278219 4110414 4402018 4349854 3812747 4064666 3865228 3635472 3649598 3676453
16607 3676453 3499793 3660539 3404087 3358330 3603052 2997131 3355148 2953888 3325216 2987592
16597 2987592 2965950 2836281 3125038 2821782 2580987 2631956 2606438 2445984 2782145 2531725
16587 2531725 2290994 2410331 2599823 2139596 2585215 2257648 2317795 2192122 2020495 2066131
16577 2066131 1879751 1840279 1875342 2283972 2008511 1994680 1659192 1817044 1719198 1765029
16567 1765029 1495107 1721011 1948813 1822461 1883972 1572810 1947519 1201016 1836513 1235129
16557 1235129 1351632 1675433 1589933 1775834 1755767 1794026 1296699 1260181 1433820 1167209
16547 1167209 1386007 1346193 1407762 1095890 1137772 1162724 1075704 1228838 930805 1112444
16537 1112444 1084727 813989 1415145 1138548 1024074 1375290 999134 1013394 1038446 728337
16527 728337 1153991 957599 731039 1062530 1002915 1359594 997011 778368 663628 978141
16517 978141 745233 1009955 1150293 962200 686205 840980 720816 800298 1224401 1033750
16507 1033750 784196 873889 898362 1009555 927978 1084692 1010886 685355 1234303 729809
16497 729809 927758 1004076 509668 864147 583840 796061 472571 407364 530490 547719
16487 547719 684959 731150 805313 722981 513193 832670 882402 882245 569687 580208 776029
16476 776029 664290 653291 955679 554556 614541 984473 796313 540730 377554 611816
16466 611816 853290 496619 784988 575520 548661 545645 725612 431627 558450 360955
16456 360955 800743 434107 514060 577939 729901 758199 583959 460557 513402 620631
16446 620631 306617 775200 386557 619774 460196 193618 508596 285310 187737 348736
16436 348736 586074 277858 425354 362749 492764 593585 515769 314541 410494 464893
16426 464893 124407 850144 205821 133378 627669 345232 669119 104255 347836 180608
16416 180608 507878 261971 634422 433646 218190 452115 573361 -201076 219264 401237
16406 401237 124966 506081 385738 171444 408000 93262 407402 399704 185891 297829
16396 297829 487972 323291 365914 198910 284980 91152 228964 196222 371372 523131
16386 523131 533064 285135 257246 189232 634788 414913 339971 75541 407298 249376 272367
16375 272367 209536 220035 412421 462289 296629 347180 142748 85130 572018 145316
16364 56831 161561 188371 186710 -45299 168572 -13215 -128623 65217 287569 159960 356703
16353 356703 179601 109589 575344 280791 60610 113099 215017 131303 171435 440343
16343 440343 -30955 120466 305002 714569 179202 193077 145437 297033 244323 331366
16333 331366 355023 301571 55553 230799 35039 138868 -40994 92108 109779 82917 114131
16322 114131 -135993 413837 129360 183898 373679 158053 173646 -18773 -65195 402625
16311 161365 -89942 271745 308042 333852 75051 394739 212431 165336 97038 385988 -105667
16299 -213243 163608 132927 110196 130015 -3385 330905 178317 9645 67813 168634 48278
16287 461495 10244 -85587 169040 210112 133170 173780 257957 404714 260923 170974 384581
16276 384581 27674 459658 197378 16012 -4998 471399 -41581 9457 130697 105511 -80533
16264 -150844 247706 12224 125283 58516 -50954 93812 150766 130963 161189 17305 -115207
16252 157882 7614 -26646 168103 -190221 -17845 -240106 179090 211978 204749 281077 105138
16240 -67226 -76551 46051 -54117 2276 368415 377056 329376 253434 188529 499604 51278 244694
16228 244694 -112186 -141605 201706 -189857 105177 271152 343547 62420 402690 -239478
16217 360 290783 14508 44765 -299487 -93256 305968 46551 44353 -149282 149858 425465
16206 425465 -154291 -317851 -58835 -163393 389571 -31634 177731 28423 334349 218756
16196 218756 -46941 -206089 141494 -72840 -20927 -116269 95530 179330 75788 28176 59984
16185 59984 8310 -85425 -97861 166922 -84942 171705 -78008 -122455 167076 -66794 218332
16173 82209 3211 -120840 11179 -159545 -44323 -190605 -65235 -148458 22827 322973 -53655
16161 419618 -75449 190296 85685 281135 -89385 78841 3400 -189980 -20382 -28910 53937
16149 154800 -218618 -206504 -129176 -14444 66497 -128881 163916 -221302 -10970 26690 21317
16138 21317 2119 233246 133520 228690 167832 -44209 50422 -28101 143634 -264927 102087
16126 257056 -79845 -105951 218183 -242937 -8474 106034 261848 2094 7934 -8719 413954
16114 86342 90961 -20692 170120 -176696 -6683 281180 -96578 13464 23857 100549 37837
16102 121097 71056 -100731 6010 -266971 86870 72884 -252676 -28865 394193 -106823 44189
16090 -73324 347311 -43232 -117280 250450 -90965 -70804 160366 255828 -353651 -266492 -145168
16079 -145168 -33470 -115205 109330 196991 -11535 50998 -238214 -36998 30422 294 68232
16068 68232 -94713 98710 70195 -60184 -245338 -8705 -121002 -134609 -178092 6643 -180655
16056 -112330 10215 110892 -89993 3422 46015 -29721 50900 246768 -9683 59887 -59749
16044 -76339 -312600 -181799 52805 -207492 -76846 -188979 -323212 30547 -13017 -243219
16034 -243219 165513 -73465 -188342 49577 -242550 95949 -161972 -202608 -146857 -7062 -141059
16023 -141059 -31345 111283 252395 140962 48981 -391862 47412 -80729 -59400 -203214
16013 -203214 -199729 12664 431882 -158726 -649 44299 163363 153512 231703 -252027 -179388
16002 -179388 41922 249123 -396447 -231672 -182962 -145395 -91147 -66972 -195417 -146428 95603
15990 127980 -39947 125867 75504 19 -32177 267510 380214 -238571 266931 1491 390401
15979 390401 21602 102603 258370 -310952 -261134 29746 7082 232158 -72834 -147840 225256
15967 31610 -229278 -163230 37464 20300 -57764 213566 -249206 -215017 -20836 225109 -123973
15955 -66940 302863 62016 -164937 -66444 -169558 47046 67241 93157 -114525 -312308 -67208
15943 -239861 -29493 -62526 192442 58247 -186738 -79123 26174 -40000 75125 286317 -200984
15931 37208 355186 -9592 54296 -457803 -66949 -230705 -38701 79087 -480194 33746 16003
15919 -3430 -402542 87489 41422 41395 84407 -277651 37869 150533 136782 62244 220574 -87325
15906 83327 -12732 -14646 -12956 178468 -248589 137676 97357 -173102 -289210 -298864 159339
15894 36700 27063 212928 -283183 -122468 11077 154178 -87893 -222152 -198993 41884 -174631
15882 75341 -52793 -154333 413893 298133 -64847 200369 -111753 98793 -97903 97106 -67592
15870 -443549 -263047 37026 -136305 23148 81374 -40557 -48729 -140572 -28445 -68990 -110125
15859 -110125 339893 87580 -337232 2380 36070 -117472 -19387 227577 48950 154118 260100
15848 260100 -137681 371378 193393 59587 -111327 -16791 189381 -56946 -132121 -238820
15838 -238820 117304 180592 45579 -40052 106418 186891 101635 144819 226059 -362484 -206370
15827 -206370 238879 239146 -141903 -133556 158317 -207405 -186147 -265539 -61896 68210 -300064
15815 2195 217317 -116651 -67069 -291464 -136798 -255908 125409 -538580 368022 -86062
15804 -186743 256257 33077 -39139 -221467 -52267 37061 12614 -9921 -100806 -160163 -216195
15793 -216195 -444565 106313 262978 226952 93943 168762 -25839 -342167 13827 270384
15783 270384 18314 29561 7655 -168990 -24716 -34946 -94630 -39241 111235 -131787 165236
15771 97239 104465 104082 -97725 -110195 619 149133 -149406 -225473 -211465 44091 -5744 128249
15758 56685 -225624 39921 -2292 162234 -260079 -138490 -20519 -35902 -74771 -118129 -90437
15747 -90437 137279 -54954 315630 139227 290148 -40460 -60730 -19510 -278151 -19878 -26436
15736 -26436 61779 -201107 -310310 203208 -12526 7931 -76341 -28802 -13985 -57410 -505314
15725 -505314 -112346 -71716 30074 -15027 119227 18942 -141126 -51441 -77569 111336 -1227
15713 -66840 4119 -102959 -254656 -48090 -364153 -337714 -53235 -94668 -342766 108290 398682
15702 398682 -17938 -19904 -150346 -95022 -11071 49622 -271176 82504 375766 32502 155879
15691 155879 164127 -185276 -103150 63000 85173 216440 184360 192047 49488 -184880 181650
15679 -1488 -190272 61976 -234273 -269873 6525 94849 -266862 79310 -114292 178623 -54550
15667 -57106 128320 3824 238758 289491 -30744 -110076 -215184 107572 -354729 -49539 -24399
15655 -211753 -67988 -53707 -218498 69058 -11820 197277 155946 175743 -74005 -165378 -97042
15644 -97042 75768 -486058 199516 -121244 -209206 208779 -103940 -70733 247627 -287268
15633 -255009 38125 3023 168375 137353 -99622 -188964 -248273 178953 -32238 191703 -105358
15621 -243642 -106468 -89735 201755 -138577 -48874 109032 129863 72557 87372 -64396 -115644
15610 -115644 -39738 -126025 52310 1677 -201342 32263 128648 102062 -216750 -54935 160651
15598 228605 -332911 -55464 -329468 -317962 -21169 157502 -95511 -63163 186847 -48880 216117
15586 109133 95442 88554 21956 48271 20109 -29557 200162 -73710 493 49196 -32473 -177847
15574 -177847 -138689 -188861 114326 -173114 93216 275152 -48452 11648 -220479 57458 -28218
15562 -43774 237606 74829 132920 4395 24874 -79917 187731 -97003 -35345 -28455 -141473
15551 -141473 -198777 -52136 279569 88898 -83813 -144978 -266444 33153 166737 -59035 -320110
15540 -320110 -148563 -176475 71119 57388 -153184 104024 134891 -63443 -220529 -35696 317952
15528 -97237 -27069 -110556 -53788 -197944 -64862 7012 347037 -96900 -81801 305052 -143844
15516 100972 213230 200324 38755 57059 130017 309 77855 83707 -176519 -31361 -3052 -58540
15504 -58540 -135115 -302513 -186899 227429 271472 94554 -157958 -153518 164882 256163 -159128
15492 -41899 15948 -155006 -123557 -121372 -296125 -4847 -23421 -93429 -164678 -268545 -120798
15480 44381 -163253 89700 93439 163092 145578 -281623 -111588 15124 68425 -173637 94916
15468 164877 121669 -55969 -77332 262436 -101249 -133622 52984 115331 140453 12415 97479
15457 97479 -51625 -102265 -265527 137130 36783 225615 432349 504916 -11814 -86476 -268424
15446 -268424 -165731 19612 244115 115029 254244 -81400 180348 338783 416352 -181977
15435 152026 -242249 105547 -266508 -461019 -293290 142125 -431912 -193596 4700 68582
15425 68582 73210 208046 -100655 48557 -90645 -110683 -97441 375982 -18634 134994 -164425
15413 -46302 166464 -149111 -243261 171494 -33277 201911 33602 -36110 -216307 -54877 176042
15401 112118 379483 -64142 135258 127576 -25408 87079 152750 30037 48193 4637 11334 396442
15389 396442 -91764 19791 -351008 -138430 -300129 -51829 -300331 218045 -232555 227437
15378 -66132 178641 -146724 -113721 96897 -39161 -6881 16952 -55963 -99411 -194912 8786 -217575
15365 -131274 28558 109191 287767 -197208 20876 -20950 205799 82292 -283799 155353
15354 548252 16396 70270 178313 -80531 101519 -439152 -24427 123725 49585 17410 -86589
15342 -45155 81569 303120 -153363 240355 -248816 -147224 77583 -85863 -25007 254011
15331 -104386 219060 61227 -169834 307061 47047 307625 39692 -116687 131137 -73323
15320 -98103 -194993 -57778 416309 5587 105574 -212792 -256338 133317 34623 104199 -38212
15308 55736 400767 177950 19181 156263 -168273 -165756 -12086 87826 296492 265736 65906
15296 -29028 152807 88193 -214624 -138923 248717 262538 149283 14174 -17568 320205 -138619
15284 -215680 104461 -228020 140436 148537 185094 236295 -228863 250710 87419 26937 267
15272 -77976 -163829 -268034 -2098 -190171 -147780 27868 291995 30941 -72649 -11090 132043
15260 111095 -25380 3051 70062 -155240 -228402 129218 267829 -154690 -217115 318043 -64685
15248 545815 1270383 1097411 1008961 1554732 538944 290680 309755 81179 33213 -35339
15237 -59790 83255 -166056 117900 -23838 -240052 -16801 44943 222150 -49214 -75309 11049
15225 94366 292842 150280 81640 -260393 253534 -67436 209594 131826 78194 197007
15215 197007 222181 176959 -203889 145335 140646 125206 170919 -45676 90499 211006 -126125
15203 168240 11247 139563 139678 20931 138418 -139095 77381 109225 -58449 224550 147898
15192 147898 179752 93601 -3489 -119275 88245 -109501 13423 209226 161872 148417 121083
15181 121083 333793 -22279 -64741 -83157 18118 152487 -270748 70337 -234760 -253235 88655
15169 -109728 114353 69818 197029 -6392 -74485 -11233 -244470 206578 187833 151584 -133533
15157 229851 49065 -9075 74938 102701 232304 -48172 452455 300527 -80705 62250 -97160
15145 187807 -304438 224812 367856 163354 244171 -115766 67501 173196 -325819 55769
15134 322782 278361 -258280 66578 43296 47344 329035 190801 -82845 300069 -85625 167428
15122 96904 379985 534666 353481 159076 -104489 -239380 279000 201247 41527 262040
15112 262040 -54289 192157 126583 196597 208488 337646 121357 33559 94695 164222 -209058
15100 -119275 -71809 -11776 87103 412512 -75951 250991 315547 137032 156744 -212858 9878
15088 42393 64587 123584 313974 387209 126984 155471 367715 168301 94407 395851 130446
15076 429108 177654 166709 303106 11359 94929 219541 -39853 -335007 247653 212686
15066 212686 116638 153154 75194 97200 64361 517834 73242 -107747 172290 43162 83402
15055 83402 184605 -169917 275876 440067 236644 8977 162976 144507 17697 35653 251395
15044 251395 102525 52414 279256 217542 70019 270494 151580 10509 337064 225750
15034 225750 -76193 182255 166438 81028 -115135 360144 157640 -21633 41 206475 -78176
15022 376454 415065 557873 351580 234489 222235 22642 265058 146394 -126221 51923
15011 277086 149940 372074 311897 166309 -33857 -31449 118542 -245551 407938 466178
15001 466178 -129736 431117 315524 611767 344808 486315 116903 196160 -113207 -35433
14990 140398 187638 -22481 297653 212559 433478 -119852 239566 474928 379206 454543
14980 454543 122478 94377 142570 169523 257826 244312 187297 185864 -6839 -78414 329347
14968 30333 232053 262673 11394 21565 185851 41673 560150 601727 252831 111239 342660
14957 342660 190541 122206 391353 564008 269885 280104 188822 356485 244904 399600
14947 399600 129154 295647 -29949 113399 561588 155361 -7871 494202 262710 362075
14937 362075 547120 292218 163835 463545 127471 -342039 102681 190476 37791 195506
14927 195506 302248 141384 407445 256342 43447 452964 470945 197045 507817 139631
14916 201514 355043 619651 173844 198614 258034 146071 320387 172813 392412 63604
14905 442892 355505 487404 499303 391696 20361 116618 400358 485309 555132 279612 477929
14894 477929 52132 356987 335891 449783 487985 252786 283503 350228 392321 384471 346055
14883 346055 336617 433295 -77657 122508 389154 192733 346808 283121 -16654 -46412 502144
14871 317994 489320 379271 258534 410161 601378 414217 197777 464683 -21453 224948
14860 335748 129541 572584 355507 565821 532099 559470 584024 425624 409989 279653
14850 279653 70706 431535 550402 465398 542618 354744 316188 249359 474175 467641 510951
14839 510951 629561 287722 535708 565586 166122 337614 300713 234141 402248 329506
14829 329506 729499 368923 526135 449924 421717 295087 520678 159928 332457 96717
14818 439362 651165 431395 263165 428143 356499 324910 200853 690352 162403 590018
14808 590018 485084 615752 660034 1003673 575707 511903 439374 654839 518654 369401
14798 369401 590066 396649 347299 826149 433026 666206 268402 423822 390246 506713
14788 506713 376403 285676 705747 702471 193740 822886 456640 579157 633065 492676
14778 492676 202533 500597 470991 471036 72122 1022314 508452 159273 512142 637174 339168
14767 339168 466243 713576 843536 290995 700383 669837 676052 375718 642442 506607
14757 506607 561754 921504 657483 254868 313244 376540 534048 527801 624568 477029 515543
14746 515543 663146 506588 400799 686332 824619 640176 632878 798656 440462 814432
14736 814432 395719 519850 647500 718560 723158 823662 335180 657798 1000038 573766
14726 573766 842769 794525 596311 668078 744102 596214 599989 543931 776531 497562 845668
14715 845668 947324 681819 669634 692905 926911 479692 650312 745499 791043 483491
14705 483491 756807 840789 283024 703054 847396 871797 991702 905993 1113898 993014
14695 993014 691937 789448 918848 1060697 534013 1013632 763079 951246 832382 529770
14685 529770 738583 1027250 762620 640263 1187961 890066 534465 1221500 883322 1019611
14675 1019611 1082578 1114118 853387 1093422 1235062 812748 1212561 1022999 677208 1107747
14665 1107747 1078213 917290 1142222 754814 900639 1165302 760907 1056320 1094668 1339895
14655 1339895 1008850 948670 1113141 821898 1227031 1111533 1013129 967953 930427 1131803
14645 1131803 1278944 1274670 1094311 855570 923244 1352989 1170802 958718 1170490 1157510
14635 1157510 1393463 1618935 1301576 1182523 1525154 1429812 1163777 1402592 1346271 920338
14625 920338 1265035 1609508 1440678 1062412 1289102 1376403 1531431 1469739 1127333 1166639
14615 1166639 1179449 1555291 1210757 1629292 1604751 1399823 1050333 1378249 1246440 1582416
14605 1582416 1341987 1421804 1335613 1523885 1847875 1773374 1200428 1628722 1682222 1416282
14595 1416282 1596907 1536677 1538036 1462798 1798336 1481428 1811156 1521841 1661138 1553930
14585 1553930 1722477 1336229 1819469 1998868 1924406 1435800 2070708 1602547 2047276 2088476
14575 2088476 1766488 1964105 2306472 2292795 1862891 2136684 2285470 1881863 2084683 2482350
14565 2482350 2031253 1961941 2359045 2432955 2301607 2492055 2592478 2525628 2896575 2964719
14555 2964719 3048045 3261987 3355783 3814210 4478670 4927402 6593768 9548240 17492043
14546 17492043 35793617 47465111 24056057 9214486 4458923 2693066 2500233 2069734
14538 2069734 1690000 1571594 1881761 2018750 1961174 2114713 1985626 2072564 2153823 2001618
14528 2001618 1836152 2208397 2087573 2347960 2275388 1827330 2339345 1986944 2086376 2430634
14518 2430634 2307865 2203612 2545501 2295899 2142639 2599336 2278102 2442877 2626487
14509 2626487 2549899 2522560 2355352 2560070 2245372 2495415 3003990 2652794 2700858 2612306
14499 2612306 2848122 3107883 2948464 3194800 3120033 3154929 3236576 2961131 2492247 2848063
14489 2848063 3158071 2894719 3320362 3434937 3565347 3241398 3542357 3353891 3712313
14480 3712313 3247233 3787801 3600823 3330146 3564432 3790765 3736970 3955708 3548587 3934390
14470 3934390 3801482 3856822 3759108 4152194 4159441 4089916 4354308 4261104 4371138 4338387 4122510
14459 4122510 4458068 4656598 4522946 4595180 4962491 4863659 4803077 4837036 4691196 4786587
14449 4786587 4746067 5018511 4924564 5180022 5020268 5379161 5255067 5524679 5495990 5817331
14439 5817331 5967028 5653597 5955017 6104317 6136135 6179987 6035335 6029626 6138747 6153439
14429 6153439 6659627 6635366 6677212 6331864 6531478 6734454 6903180 7004068 6963376 7429296
14419 7429296 7347845 7386486 7921495 7666188 8277985 7811743 7944622 8226875 8262740 8380484
14409 8380484 8530227 8620548 8600621 9068830 8934161 9273366 9423439 9561034 9857872 9571373
14399 9571373 9787833 10335111 10277985 10399065 10374307 10728720 10532070 10615407 11186288 11596119
14389 11596119 11711885 11809164 12206790 12157697 12553621 12991222 13007133 13109684 13351883 13658419
14379 13658419 14106546 14197884 14352678 14778290 14731472 15049272 15570057 15937725 16116658 16471393
14369 16471393 16839021 17065623 17516428 17754749 17980739 18467821 19246170 19208406 20001624
14360 20001624 20210526 20843465 21114895 21360797 22167456 22518799 22852516 23823806 24010532
14351 24010532 25229113 25407900 26215422 26644015 27312734 27875667 28822670 29456398 30312419
14342 30312419 31129709 32109584 32527914 33621540 34597005 35490422 36499154 37817633 38865814
14333 38865814 39985596 40982349 42589099 43749547 45166383 46469320 48407744 49893218
14325 49893218 51583425 53086528 55163424 57233684 58988392 61231501 63441209 65733704
14317 65733704 68410435 70728498 73824825 76572045 79757272 83073663 86398817 90137286
14309 90137286 93544966 98105767 102109020 106944879 111680250 116842240 122326346 128080802
14301 128080802 134363834 140949337 148058117 155394411 163166370 171735705 180534311 190208345
14293 190208345 200534581 211282850 222757285 234764189 247266415 260922068 274545832
14286 274545832 289600512 304543497 320300780 336527366 352798961 368951084 385117442
14279 385117442 400859613 416000335 430427109 443350879 454679300 463949623 470687691
14272 470687691 472422669 471295553 469337146 466862768 461709630 456036537 447657211 436887307
14264 436887307 424057950 409999880 394414374 378140374 361697638 344664655 327844122
14257 327844122 311781027 295351849 280935923 266545705 252876995 239205924 226489053
14250 226489053 214759650 203402984 192797200 183032636 173851121 164885961 157165121
14243 157165121 149198639 142077220 135356960 128724305 123005347 117617244 112452399 107445636
14235 107445636 102664669 98074367 93518958 89922421 86897925 83542044 79798957 76598516
14227 76598516 73761789 70942486 68135184 65335010 63538929 60771173 58620050 57177570
14219 57177570 55095384 53250810 51051619 49528301 47854429 47073202 45442265 43970900
14211 43970900 42038023 41320151 40108945 38888534 38360224 37032815 35840006 34756761
14203 34756761 33861193 32623589 32175207 31568154 30626841 29247574 28787287 28144310 27334531
14194 27334531 27150592 26029511 25545796 24677777 23998131 23669171 23099955 22572394 21863365
14185 21863365 21509762 20950103 20544785 20015331 19543269 18956428 18738196 18373012 18206900
14176 18206900 17771129 17517741 16953235 16700826 16228237 15960877 15759680 15035510 15310327
14167 15310327 14622623 14355140 14346546 13821036 13885127 13143468 13040122 12802373 12388650 12583741
14157 12583741 12430385 12160907 12087274 11634146 11690649 11142388 10933528 10983250 10641252 10513390
14147 10513390 10094275 10309770 9830169 9926638 9823255 9515213 9340086 9234889 9394521
14138 9394521 8871113 9033704 9128442 8759759 8250274 8333987 8412840 8385832 8053000 8080240
14128 8080240 7980379 7783205 7394738 7416128 7590439 7310436 7004343 6976100 6976905 6899299 6964505
14117 6964505 6795706 6494625 6728747 6285379 6726440 6076404 6025520 6128773 6316027 6274044
14107 6274044 5984696 5701749 5831719 5581117 5353432 5790598 5355740 5435136 5322755 5225742
14097 5225742 5292411 4957412 5112214 5135389 4849720 5149632 5282053 4633416 5077629 5025124
14087 5025124 4350814 4479869 4456289 4738241 4453637 4570852 4680641 4673180 4105367 4502499
14077 4502499 4163396 4325830 4333480 3926083 3854725 3657975 3894270 3859911 4072249 3844662
14067 3844662 3736041 3753756 4022248 3731484 3732207 3498393 3751438 3645748 3648945 3517317
14057 3517317 3458067 3513005 3577248 3361052 3407193 3288384 3654450 3191601 3417748 2937327
14047 2937327 3318848 3207350 2920801 2787490 2651882 2972201 3249209 3328112 3140506 2940934
14037 2940934 2709101 2929995 2868085 2520405 2846772 3031405 2629571 2673632 2535288 2803534
14027 2803534 2513053 2568671 2763157 2593842 2405917 2510169 2455388 2552549 2387947 2079622
14017 2079622 2458421 2519371 2292821 2394349 2374644 2206491 2325526 2358343 2307245 2211729
14007 2211729 2131472 2375574 2084766 2125288 1969429 2057371 2497699 2133438 1942358 1987602
13997 1987602 2108992 1616198 1777467 1803797 1902166 2203084 2070718 2170739 2836232 5026645
13987 5026645 11478320 28675564 46845638 27435947 13513934 7634265 5502096 4353483
13979 4353483 3967521 3230342 3078437 2987415 2857911 2809752 2391790 2324412 2501317 2240869
13969 2240869 2233459 2364279 1985115 1856961 2354977 2568991 1949448 2092575 1743032 1708466
13959 1708466 1800476 1811870 1702787 1874993 1932870 1911100 1848755 1765974 1786774 2189555 1572496
13948 1572496 1716261 1644518 1959862 1611729 1694061 1488194 1651597 1665337 1431360 1868595
13938 1868595 1478855 1515760 1801678 1394622 1651845 1487430 1585956 1487261 1560407 1479532
13928 1479532 1222828 1633282 1415989 1426796 1764136 1270209 1333046 1134692 1128432 1405324
13918 1405324 1330261 1220969 1566847 1481021 1035760 1258521 1485610 1497343 1295685 1378422
13908 1378422 1154267 1222863 1159382 1111094 1303108 1323218 1157149 1007040 1291663 1119794
13898 1119794 1427812 795914 1258302 1261610 1155053 1033319 1165470 1093414 1005792 934624
13888 934624 909742 1177002 831027 1008608 1165499 989447 1159994 1083649 739295 978261
13878 978261 1344236 1051759 1033279 869433 982716 1036693 933404 1139977 985766 1069482
13868 1069482 1139318 773056 775941 1155562 1079393 646828 899590 1130610 867426 825217
13858 825217 928692 1033800 736448 986838 1030266 591854 802708 943437 858660 887932
13848 887932 729344 1261020 714807 943584 808348 539401 851002 703008 800945 908454
13838 908454 1044403 1113216 563928 1085836 996495 646539 756989 819354 1152321 951367
13828 951367 855737 705802 1024124 738045 643047 738839 910609 737708 779113 538625
13818 538625 549233 545972 545886 846172 635603 1259711 575948 911444 973992 656181 863369
13807 863369 509585 768213 772976 944345 870851 421798 661996 554726 450694 870108
13797 870108 692374 889893 746757 696861 843014 793195 1163401 606027 685865 1008885
13787 1008885 795638 437736 596219 507696 537702 667110 739582 827476 487941 603236
13777 603236 565684 763852 843100 825036 822570 548401 535406 756714 333724 750649 432842
13766 432842 833409 238054 686818 637489 637157 850382 296159 610737 504613 634710
13756 634710 797076 442511 140142 426932 722187 326000 706080 683814 756106 584110
13746 584110 733986 542490 868706 503347 641345 405085 476903 211742 602713 758570
13736 758570 426084 338347 449365 472746 195636 753905 444001 692970 794789 411802
13726 411802 743936 674994 452380 447678 726918 395236 637567 439880 336308 583656
13716 583656 438497 395649 776284 577101 174612 795043 310034 349364 424860 322377
13706 322377 904663 278530 385463 318959 451187 182691 732820 474674 394062 408794
13696 408794 348549 140799 506496 377779 360494 562826 568628 299845 354287 268814 344856
13685 344856 390869 476043 179173 348537 535192 416357 374494 376469 406485 643037 347098
13674 347098 399475 237190 540364 761748 455283 237513 268123 352131 403769 521080
13664 521080 591753 260094 653544 327728 607658 559379 447310 304335 250662 619585
13654 619585 364711 549692 277578 433256 483753 34306 753784 360827 700893 107298
13643 -133974 587388 687632 275797 250172 864382 442323 491496 320222 195298 486813
13633 486813 340761 218321 85138 762154 137489 351999 177792 479680 502356 526735
13623 526735 216991 242613 499170 323236 103724 145219 298262 631665 602841 554536
13613 554536 29122 307060 355751 544627 257179 402157 537586 257641 511695 252644
13602 204883 482422 236023 418300 41456 217154 -47408 -61433 326868 245127 50759
13591 -19834 396020 224353 275987 190464 599114 265685 196384 341217 -86919 733779
13580 342327 412998 549719 189541 302092 352420 41616 250846 307099 184706 -68549
13569 285469 376801 -3147 635485 342555 394979 493029 468834 316117 199281 58648 80126
13558 80126 119669 273880 23930 172722 504235 307059 68708 380768 86287 386854
13548 386854 520913 169998 367047 199506 188348 381938 258003 668395 274100 11703
13537 372337 87114 204806 302873 -164591 666748 431766 379531 112022 13689 199649
13527 199649 -148931 240193 208620 324914 54215 324672 228721 156907 398950 54096
13516 130377 221455 303205 389263 159612 248444 311391 11945 324266 407276 48372 400639
13505 400639 125010 182246 378248 367395 -98316 390228 618735 -143865 245266 419546
13495 419546 194306 176382 363946 123704 137141 224057 366092 181798 135350 147115
13485 147115 -132985 267707 47666 129586 330744 260934 307597 28700 259254 93470 156744
13474 156744 124129 259948 422461 311011 167224 191704 234137 129839 190789 355483
13464 355483 -81608 159609 151891 234756 406146 7731 -159268 403756 259072 56185 442828
13453 442828 357916 374017 133159 -35909 -157730 86060 98163 -131424 267700 69546 162545
13442 162545 547861 221328 434313 -97278 -47902 -34877 194089 391625 470996 33680
13431 485912 311834 344350 -18394 -127434 41520 116730 107174 379155 34084 146294 455199
13420 455199 190808 210827 38866 38181 368574 -97245 40879 42955 267460 -49323 443078
13408 93859 252749 -130531 324612 619130 202484 154357 115585 209241 346589 -249459
13397 -122215 135780 -129657 9032 111297 -87056 279533 194684 381292 -47392 110791
13386 329258 620177 -67804 411966 352014 422596 151787 170673 381930 23152 266588
13376 266588 233979 148713 276722 272535 164080 202821 -100140 261852 -16728 124498 547258
13365 547258 400178 111820 -142810 220073 35931 388083 279372 125921 148506 46389
13354 -152399 347321 40973 445016 156448 296462 206460 246226 76127 -163521 424583
13343 79900 237796 -23194 619964 -38508 288822 252921 188034 303485 222729 456363 -156516
13331 -37 119518 20500 372626 -174274 40641 214491 37065 122199 645314 517126 400020
13320 400020 356147 608813 45974 -162973 343832 176246 206920 156123 67589 -85787 348846
13308 234022 -184067 234544 369825 256527 97141 291833 166224 316805 -144925 643112
13297 107946 355977 288911 -2447 326125 -195616 317072 10301 -18172 307081 135101
13286 80868 -17018 85881 279853 262827 284506 178076 314814 20100 -55256 199746 306794
13275 306794 211353 192184 145658 142702 33590 112315 -189113 275449 145592 -91506 300942
13263 51537 26896 387305 157283 157014 -175481 205751 -181003 -113722 120067 175760 75811
13251 70923 -221425 222928 350628 -215652 212615 -182122 166309 -52036 49830 -113019
13240 13842 46135 -214175 261941 183115 101110 145168 432160 114842 -79418 -155831 -267824
13229 -267824 177568 290177 118648 66377 179584 177380 281465 191501 158017 -22614 309792
13217 -48441 58402 54775 111454 -7927 222183 30165 136265 95052 354307 58749 -33031
13205 -37713 157447 51856 259990 25893 -55397 51497 -151897 -5556 -110827 384578 308356
13194 308356 40383 53893 75782 -11335 23385 -45191 196723 194883 197781 154693 -182097
13182 -123999 108118 52992 143258 48796 44373 212815 51259 -131134 165772 8973 15584
13171 15584 121020 150820 -91309 181944 -184421 192753 -249919 -93960 -4290 -109360 37769
13159 118096 169168 106940 28251 27581 171098 -11625 -283914 -114292 -45863 -99130 175528
13147 131805 157584 -3457 152919 -306992 -92003 258931 -7857 100310 181625 178628 142417
13136 142417 85210 43129 342380 29948 17034 22287 594806 199939 -8140 110910 229476
13125 229476 -209820 -57195 443745 194295 -88814 -14517 -139396 150510 -10947 81025
13114 6933 6065 223744 -102161 275412 66877 -6687 -4860 43778 86858 -237700 182125 -154906
13101 -123190 349674 78333 385146 80309 108354 -74282 -68652 -209067 -210184 -137614 69546
13089 -227222 -102710 -66171 26727 9887 162925 284100 -24060 190130 365528 -17355 -15994
13078 -15994 -166296 99513 -1535 -42258 165035 -74085 259200 111780 233992 320373 440744
13067 440744 -56160 352007 187529 213830 -30708 288989 203926 186774 192407 43709 -82661
13055 1128 330651 235744 253811 222099 272429 -120071 104286 237914 -11253 -76808 430400
13043 21682 -68600 407110 126140 257851 154931 106509 -179428 118709 226789 259342
13033 259342 58990 406882 -327581 -31301 77211 126540 194270 99457 -170273 505882 -3327
13021 64886 -5490 43088 33991 164053 -111981 46528 198958 54382 110787 93286 421164
13010 421164 201814 187855 60207 -237922 91502 -186245 -100143 -79615 535960 71362 -107960
12998 -130813 89551 119451 251508 128072 101181 -13182 164735 199922 383684 -357116
12987 98666 327739 -113711 149815 246613 126862 303334 124123 15948 67723 100954
12977 100954 -306174 385855 13888 -49883 -214889 131993 -40775 -98638 441481 188964
12966 128487 -128244 86462 433655 35749 7840 140414 -33224 -184159 -534356 228138
12955 -187382 301882 69699 78154 67901 40450 425652 189837 -176040 -75032 28913 -61477
12943 186735 -231712 188369 247663 -168694 19892 250800 147395 149442 252934 35835
12932 163684 28437 8854 208541 15689 191540 23695 -88034 -36278 -22818 61248 22896
12920 223688 16098 149361 265062 -106875 -71827 231106 370969 119182 15157 -4926
12909 -197366 -104798 -233535 298884 55464 -170373 -112106 369927 -56129 315932 -208515
12898 -336708 141654 156397 -326785 -41386 -16876 131203 255257 39494 5974 287075 87780
12886 -363658 154400 283963 -41865 -373213 -75460 226178 -72782 -28799 37385 126666 -172987
12874 113038 70759 21638 19407 250621 -32027 242586 -26531 64400 399231 4326 26624
12863 26624 78492 297005 60834 -111629 130155 98693 82869 -305769 61347 -39124 -22610
12852 -22610 8663 156860 -42607 58001 -67220 -127240 4452 -150374 69997 315501 315306 23361
12839 -22416 -366575 44855 -115766 -77951 304711 83597 -94784 -110011 -104503 -105515 -99826 284345
12826 289328 -93599 -96721 245553 116623 -4787 -161877 -81339 379243 139116 19404 337264
12815 337264 37507 -60306 -291290 -251983 -136766 -104241 121962 -87703 63304 -356567 65434
12803 308954 -47745 -86687 -535 58477 -38292 -308901 108306 -90284 477962 282168 -14649
12791 28252 -153077 172693 106116 -95466 178850 4167 -40018 111609 18597 65191 -271359
12779 -82801 -56846 196460 64170 -49834 -16243 -12040 -240076 4899 -48790 -77486 -363852
12768 -363852 -8513 219561 -158997 -6015 -2136 -287216 81548 -53799 -80461 304370 -132657
12756 -37761 194153 183633 -8604 65437 -68864 97599 243103 119134 240342 -334279 16854
12744 -138762 -97299 -76850 126445 -60580 -169193 367139 76319 260283 175028 284515
12734 284515 -34669 -34967 132723 499765 -189509 192585 133658 330811 306609 107689 -117020
12722 -242583 -50271 -420190 -101298 33333 123165 -37712 19363 -175834 -33083 31223 -64890
12710 -18987 35823 53891 -12294 151808 149973 312776 169293 228794 -103613 -36032 139506
12698 113538 67641 162638 187935 518659 -7200 219003 97973 107021 27689 -515598 -289279
12687 -289279 122069 59428 365489 35673 -90723 -63731 333966 -33998 525670 49841 103489
12676 103489 296176 -226133 19330 195971 -119644 152890 101053 260751 -140519 309432
12665 -58872 80544 165969 158239 -248821 -96607 120553 207227 97619 161232 129285 234895
12654 234895 98266 94996 -158701 -17838 47876 296102 -55835 -5069 -243222 -87894 -222461
12643 -222461 -72852 -107351 -162169 61091 120933 203648 172419 351282 318426 -203200 68505
12631 161700 527824 -71840 173057 16218 248755 340664 124230 212060 388514 265459
12621 265459 176522 210491 426 89001 137471 26748 -88674 -179397 111890 -107083 163179
12609 110389 124463 -83686 -20218 178039 -15793 24437 210863 -139424 -270039 223597
12598 103579 62311 184602 320364 130507 -275776 -313078 -155575 153328 127165 13733
12587 -29060 -94612 45119 66686 162613 10080 -91181 138673 70172 67493 -26522 -272810
12576 -272810 44469 209717 228248 112120 90557 288397 -340118 -49684 -69496 64608 10844
12564 -171962 105619 9360 -17098 24744 -32827 334793 -288067 -106695 -109789 102142 148221
12553 148221 -198775 258674 49 120208 -274127 13043 138215 71786 97554 265586 -182402
12541 -108686 -375890 201783 -159205 152706 231341 -154972 -134911 -231618 278503 -174911
12530 -187614 60439 168583 -55321 198607 324934 -113519 43388 262722 -241796 47471
12519 153590 346728 -335777 185317 -44889 -123536 279462 56398 -34658 -41957 402862 -123729
12507 328249 25416 -50053 -72655 -208015 -60215 -244132 -186219 3729 24604 29218 354301
12496 354301 269206 -269892 372995 -120591 352512 -1834 -70230 166733 -17259 200640
12485 -201034 -75876 260454 112308 2107 -88323 -81026 -68135 302087 -75711 180535 105871
12474 105871 28631 6050 22942 -33831 301302 26255 209512 -29097 -112039 -27025 -67430
12463 -67430 222206 -241539 -41053 94326 -313705 -47892 -324709 -87627 -115207 -79285 -222917
12452 -222917 -198872 110842 50813 -33560 -9847 -109738 -220810 2471 104132 -91760 289341
12440 278107 -12727 100115 -99958 -18862 19842 -298009 -12825 105583 284556 40346 66217
12429 66217 30009 -356975 19662 77954 -105061 -116118 -143469 -327353 67444 264147 96679
12417 -48222 36066 216692 -66877 -57985 -171999 -185108 180751 28391 -23060 -137157 210610
12405 -24431 -245987 -70776 75059 -174363 -222241 -139680 -170456 63371 -7392 151696 -233234
12393 352055 72148 -182871 -92641 127351 -79674 -10712 -167799 -58411 -27505 -129230 134466
12381 -177654 -160604 -142641 -58027 223446 -126402 -22988 86079 98378 -48143 -31445 -129760
12370 -129760 -347353 -124974 -210709 -94807 -157288 -26365 -344962 113651 65069 1445 141273
12359 141273 90970 -997 -101235 364254 -129603 261888 89942 95992 -59288 -230858 56538
12347 -120533 120732 148509 434114 188161 -169057 40914 544 60854 173666 -294503 119418
12335 -177155 -345531 21801 -214247 44253 218428 137058 -49501 560463 -136803 13159
12324 -124543 48529 -90686 65385 -97689 399062 -164526 -69592 -93102 -251888 72240 -54224
12312 -127544 -336862 -52193 52000 -183404 -35634 -75012 243141 -155562 130405 9732 96784
12301 96784 -13699 -209072 99094 -177310 344481 -126429 -61465 -123025 -403739 123718
12290 346625 -77943 -237654 330360 -64466 178741 99812 43473 -171066 -137396 45351 -56928
12278 209904 157082 279895 7162 -130690 37973 152866 163015 166883 -122366 -40242 132935
12266 -14079 -32515 54799 -225075 -129948 157769 121344 223530 -47812 10664 93657 53379
12255 53379 128535 304266 -207544 395340 117720 -224290 -254837 38794 64913 129848 69998
12244 69998 171194 222395 265234 177156 -124126 -41318 7370 -217376 239684 76301 -12380
12232 99305 -32002 258577 199642 403930 226388 11032 195732 -73735 253733 49598 485127
12221 485127 113429 -51380 265092 -31714 -34313 280963 123608 151293 410378 -46786 230245
12209 -172672 180291 13230 415226 31118 247614 138900 93623 142365 174068 -223666
12198 447615 429093 827575 315335 -23558 393291 187138 85912 257444 283285 36215
12187 482283 132338 7306 -218189 43701 214910 94182 349346 134503 142317 116148 223340
12176 223340 72588 101608 160730 368792 112129 339790 -10637 -60374 234928 47793 143729
12165 143729 -49236 94713 133380 -36768 19814 -154443 175304 159815 27524 -199999 -89763
12153 -69401 107969 21207 -175107 -127561 130475 115735 -155178 -120376 115816 294215
12143 294215 -112979 85925 -160118 -208661 84198 -47158 3771 324154 -232065 -151919 247587
12131 -122243 131459 58869 131068 -90788 109760 -120504 263279 81345 114175 184689 333245
12120 333245 23356 -385729 -207856 -187367 201247 -441784 -157458 25241 -24067 122671
12109 86763 64610 -86997 269495 4181 -61969 -352821 80520 100426 -17159 80427 3470 -237019
12096 28149 -112185 -1626 141957 43250 568380 -148444 175951 89717 38239 -280333 -187322
12085 -187322 14333 34785 51481 -13805 -15931 303220 7161 227570 -6455 -53477 -110542 182306
12072 -99200 320130 211886 452632 1306147 1452470 843448 104892 86951 -103454 -32053
12061 21807 3990 67686 183857 -283882 357031 155420 94289 83717 90361 299603 -138957
12049 12535 -60999 -213833 82113 179307 -194264 240532 -41291 110795 162478 -102597 275655
12037 78053 -465376 -146540 51684 -67665 67949 -196706 -6252 -92080 74045 -126186 22606
12025 -37289 -110129 -30100 -201362 -47558 -302547 -39594 -91011 250722 -21718 57500 -154301
12013 -60203 234083 -49202 372587 -305726 -122159 -34066 109533 -293823 79596 18366
12002 176270 157139 107666 -198224 -84950 -198603 -113831 -68966 34986 -3264 -130032 -28682
11990 -101588 -254695 -283962 -147651 -163757 -167586 -254779 -494773 111252 74229 -182592 221393
11978 105541 -464481 166454 164848 -109511 17364 151885 5363 99962 158375 -110521 230586
11966 543935 49811 246426 248463 -35662 -149842 181003 -79317 -1458 93214 227044 -172523
11954 -188622 120026 8195 -52110 183179 -143782 87089 -24735 157618 -45198 185259 274203
11943 274203 -220507 -121713 -154726 61347 44368 -240241 114089 -84851 107238 68745 177968
11932 177968 84461 117402 -22617 -87779 -184740 -191829 138910 -452231 -247081 196310 -54359
11920 -203292 -87721 -173186 -241355 39682 19968 -45363 -161712 -151008 12398 56497 -119961
11908 -15436 64287 -258322 -196242 -144634 7207 354990 249457 -101229 -72188 39041 154280
11897 154280 -53460 209741 33195 -7998 -229548 110300 185836 -189186 194931 -398673
11886 -40895 -107939 55533 127779 -188623 -16325 -19747 31069 10740 385432 249859 226521
11875 226521 -130155 191991 -98731 -142826 -203609 -7529 78266 -25204 -29169 114464 58603
11864 58603 -201976 100231 173112 5436 128178 -137546 -47444 -65780 -299571 50981 66970
11853 66970 -196060 20368 143120 -311454 -209477 -67386 -95607 -164975 57991 -132893 -339664
11842 -339664 85944 -33998 -239035 181628 8304 248245 239671 192838 66975 131922 71420
11831 71420 30128 -14351 44047 48777 67455 20972 17012 -169906 -280483 -108837 -65041
11820 -65041 -67891 15359 162889 -56063 123579 102332 -64597 93845 -42711 -163094 118509
11808 197653 -64774 -9445 8378 -45156 -139516 -150731 7136 6034 -273266 235564 -274241 48898
11795 202215 59999 53762 8221 -43705 -269633 -254526 -28569 -5127 -121392 -219290 -166808 31027
11782 -437134 -105760 35838 -91734 224627 259783 -92418 -253578 -135620 -9926 10314 -302047
11770 128281 -399069 114491 -110690 17498 314360 253167 -63282 -97528 -113367 -267013
11760 -267013 -3611 17217 -103307 17118 -165409 43225 -198248 -145855 -71013 -168503 -43069
11748 55032 -293653 -119848 59685 -89242 -236648 58121 -37181 232644 456981 87717 63628
11737 63628 -105987 -97881 6995 -5293 44601 -177166 239756 116274 250058 23889 -26527
11725 109393 65196 113007 -73396 84292 111249 38678 46262 96077 87923 18438 -133118 58446
11712 -128987 112995 -111588 167298 -49418 -245516 -478868 -164450 149722 -20577 -70337
11702 -70337 -34387 -247991 185008 54398 -148510 -123939 -41252 -63969 31044 119381 58397
11690 398465 -246805 97603 340507 -29303 350767 74213 65010 394426 219135 208208 507592
11679 507592 -111239 176973 244569 207646 -143042 -38834 -44537 -55530 -102757 -167207 -432378
11668 -432378 24067 -68859 -35006 51422 9306 278538 351720 66869 15497 208026 105047
11657 105047 223397 245969 -127426 -70024 155776 -173524 -52588 -25653 136734 -383798
11646 103391 87794 221277 195739 300782 -98933 6880 53075 8334 -168710 -139985 -315796
11635 -315796 6049 174840 105999 3396 167225 102260 -335904 289547 -124816 278904 274687
11624 274687 -78812 -48902 -7126 -404667 -13659 259507 105943 -109152 -141705 -157421 -6925
11612 115929 -87400 155532 89963 -222179 136125 219477 -149463 -36696 -97340 127319
11601 190220 314188 -140518 195437 163521 -6395 439665 -70416 119959 -392323 88640
11590 -32615 -4798 47347 242473 -78780 387380 -141264 347666 153768 -229364 -114929
11580 -114929 -215099 -37 72635 154184 114054 97077 204158 -135505 275539 152676 329568
11569 329568 -1337 -8750 354946 221721 64074 16373 96636 198662 -180657 78993 255059
11558 255059 43266 382115 -74282 17599 -209901 -127009 -318587 244695 -223520 -293063
11548 -293063 89944 150460 -139689 -15795 -261012 298772 273994 291772 169836 -84229 32269
11536 178671 122961 -52720 94423 145498 198623 -69996 205034 55319 -87424 89478 196314
11525 196314 -89491 301318 -17802 383235 43522 -12440 -55822 -51216 45958 135699 282347
11514 282347 151751 176320 495035 373277 465214 257867 227682 232757 175465 56055 -47780
11502 119300 272148 -75963 -157260 378145 309724 141023 -117952 85668 363328 -80264
11491 82837 7789 12029 203878 233223 -42567 -19558 319505 295125 226722 341973 -88665
11479 259862 30443 255493 -380027 48012 311468 396166 284250 110653 103453 -58171 -89913
11468 -89913 185146 51941 64830 153649 -141821 92000 -101269 -72197 211314 -99772 76990
11456 181406 330580 158319 29330 82144 240954 57862 41460 -34541 93947 -115537 -105800
11445 -105800 -50371 44566 358238 218064 -98144 181375 135306 -393269 -51996 204581
11434 -187660 148567 -59428 -130191 66181 -178496 -76839 121027 -130760 -280682 25675
11423 -141606 -101142 75835 238110 57689 -42640 299244 30320 -314971 -437450 -103180
11412 1723 -126032 173086 -13714 -38755 -274609 -150569 -60226 60977 61513 130596 262098
11401 262098 284685 -105003 221070 24842 96163 82987 -121585 -130487 108011 -70127 -11451
11389 56187 -113281 63830 83688 -105501 213644 24948 -204673 129541 -289073 163990
11378 71284 -43305 -123824 145991 -36030 65061 80324 141467 157161 266420 407863 -379894
11366 -15056 -412505 -39764 116034 -121833 -104676 -189556 -298485 263146 113597 -109714
11355 141267 307645 237841 149532 143165 33524 -390126 -100874 26319 -248185 226970 274396
11344 274396 -24803 221501 118681 260045 -147073 -130790 -194618 -110762 -101871 -47994 -75192
11333 -75192 48285 -180814 -171672 93288 239248 -43383 85193 155535 211674 17435 215897
11322 215897 -29959 -18638 245554 54711 87757 76978 205417 -3572 48237 136514 181165
11311 181165 -109360 -126583 211914 126678 -29939 -202649 10084 -52813 -94931 97728 -188413
11299 -45494 -140549 -180884 247943 56566 32465 28962 14238 -89783 -252243 413978 172101
11287 -86448 17752 13516 -50184 166565 61250 -221349 -120485 -155398 53775 240478 284454
11276 284454 100132 114681 277798 -165401 -287127 128431 171503 367199 -305842 67953
11265 -142148 -67775 43407 82053 -42198 -173751 7897 60335 59955 -119761 60031 -174088
11253 17296 69882 -70960 198082 42386 4956 -287601 -202239 -417570 93871 -399686 -317706
11242 -317706 -76714 -157183 -252353 -28297 -141991 160161 194472 -82483 -32067 -156769 64661
11230 -4557 28763 148625 -294411 -387312 -615794 254470 12785 -65334 24407 -246660 -137676
11219 -137676 32069 -134004 203025 115265 -81260 -244756 -560995 -29982 16676 83847 -130698
11207 22407 -248713 427027 8082 -55798 77623 47825 3758 11837 348276 -274221 -206672
11196 -206672 147955 -249086 12854 38923 -169288 -72418 -50934 133364 -44275 -64226 -233363
11185 -233363 235196 100988 97273 62822 120936 390612 -116867 57 -67891 -116116 -185408
11174 -185408 44844 -198773 132109 244208 70392 85282 -248199 -327828 -91198 204775
11163 159289 -107977 64419 -183353 -142238 -44702 53943 -34505 22227 279076 151826 -171338
11151 -21237 69975 82363 182388 100182 67624 -70060 -38952 84343 -245702 31632 -79766
11139 5172 38475 -25505 177705 23080 89711 109695 113556 313998 -99340 153 28296 212076
11127 212076 -182882 -9406 87415 72976 144663 -131070 248577 -145749 115756 -341225
11116 -76202 -130456 198341 119081 255086 -195303 -25792 156341 75997 49282 263631 244406
11105 244406 19205 130536 29750 123935 -82310 225270 259037 239048 -204059 -59062 -42956
11094 -42956 6089 -94037 431498 62926 414016 425935 354149 361516 27317 381221 388030 45355
11081 232170 17397 105942 330134 392947 197258 229641 54738 -95878 149882 329916 241642
11070 241642 488635 93167 476072 637266 657505 389131 478305 159873 421782 606043
11060 606043 522397 418001 262738 573270 709987 399716 613230 613840 305390 804852
11050 804852 889577 568522 363977 711813 525539 581464 574396 491812 645237 663809 701438
11039 701438 768064 850563 885125 531257 506592 575014 194055 503235 620162 651466 534742
11028 534742 312224 567161 752556 1008545 699776 624137 852908 893241 310114 672820
11018 672820 463553 250442 982761 483207 707622 607056 834073 745069 695436 666739
11008 666739 621059 596442 321953 254651 885880 944090 546084 613950 772995 414667
10998 414667 929453 584337 501961 406283 489353 831492 445017 677413 694808 905885
10988 905885 856877 969627 839267 1267851 926866 1027782 875955 1224024 1283576 1412616
10978 1412616 1404149 2028983 2057349 1951272 2525876 2371935 2584437 2732349 2687706 2775502
10968 2775502 2470194 1933567 1926841 1900445 1598790 1630946 1522150 1862572 1633220 2048181
10958 2048181 1919762 1567179 1401502 1673940 1657424 1436674 1081119 763475 854474 647728
10948 647728 365242 309198 367024 470404 209010 78198 266401 -66821 320234 317981 259197
10937 259197 323781 359421 29185 154325 325568 -25935 112619 250164 -232740 -28751
10926 -299457 -92541 108769 270097 201783 -77025 -80384 -266628 81800 128787 -184067 -182100
10915 -182100 -286840 433817 -133886 7129 346874 65222 -119033 23868 21075 -64579 38052
10903 4307 -887 129794 361216 84620 -104219 -29134 77970 -228312 304300 -298602 -21430
10891 -238025 -103928 -28253 -199594 117524 101542 -29814 75883 22393 -191468 56664 -127777
10879 32191 -10066 -59120 170030 6249 338339 -186113 155002 -70135 23178 43786 133449
10868 133449 405325 -211956 231083 52468 -40440 -72291 -174683 39794 -16154 155165
10857 -323740 -225322 -323822 77491 -177529 -75486 116794 215510 -114559 140891 -238228
10846 -66613 21684 36703 -122491 141002 169637 -186658 122005 103781 129647 92282 -149979
10834 48593 -95305 -132259 -130578 -111443 233200 -108553 57722 -2077 31390 -251460 -94302
10822 -200739 11109 -287587 216229 -333270 -200251 73551 -8846 67154 -75724 165451 -158225
10810 -296385 104513 -180883 94778 158484 63869 71669 18813 -188920 -102395 57006 18277
10798 29990 155752 173438 -310709 103352 79656 15408 136350 18163 78659 -204563 -114742
10787 -114742 329077 162566 93724 -9785 48137 128363 253215 22801 46716 119022 -340044
10775 -273911 -50449 -196390 -183002 -195969 -14333 239292 -140792 -51321 244377 63548 -474717
10763 -116242 -14364 -13544 127677 -134140 -115586 -157657 93092 22023 297341 -62173 82911
10751 -206068 -181817 -1238 -148464 32181 -331556 -141407 -33309 -179359 30975 36585 -85565
10739 -322337 -191778 -152643 -13595 -144526 -163670 171764 222427 -271626 -7809 73000 -5288
10727 278652 -70873 -431195 35708 97027 -315476 56047 -251311 -27265 -361314 -281396 209431
10715 -413455 -187574 -199751 -188028 -357252 69038 5188 -81912 156152 -250810 -21454 54633
10703 -184749 36123 120478 31833 333488 -120592 125231 -594036 -218610 3745 277179
10693 277179 -6387 -223689 -439331 -281116 19066 84396 -28123 -95125 -240015 -31717 155499
10681 381218 102380 -346605 163539 -82563 -177224 -288167 -212577 82336 -322285 77044
10670 41736 -216968 17 35044 55570 89877 118344 117729 -306935 314183 81725 43646 130849
10658 130849 -230816 -46021 104445 34757 7777 101511 135289 18211 -120384 -449241 30433
10646 -491780 -244581 -260421 315874 -122754 -98687 -210316 -134863 -99355 -204516 107341
10635 -174679 278444 -7008 45552 22832 -319954 -74599 -65668 -20327 -244723 357461 -243170
10623 -78838 1364 172698 -80975 135855 -40543 -312659 227972 -6017 39780 16845 98145
10612 98145 179705 -128468 -1566 62416 -379358 79325 -65981 -327322 4980 7689 -45319 261972
10599 -196524 -158811 -47304 -165600 16546 -246878 41084 13789 41496 85567 -127362 292452
10587 -137560 -100984 28592 -150203 -99729 -66523 -32639 117237 -47286 -305679 -135250 -264457
10576 -264457 168938 -232297 -89889 -94885 -40793 -163162 -181074 -120269 447485 214008 -197690
10564 -330008 64260 -50375 -125818 365277 -9644 -202333 -323021 68366 -87909 -47599 -94373
10553 -94373 -98066 162162 99752 -57422 166341 -202163 -272997 -73842 -120587 -226631 -39209
10541 -27751 -270552 133325 75823 57009 -85835 -99711 -61957 -28482 189419 -235283 -240177
10530 -240177 -103839 -165822 -88649 89618 -137636 93380 -208429 159665 -82990 -121940 -120805
10519 -120805 116586 -59201 12869 39647 60916 -22614 -15350 241044 -73927 83576 62754
10508 62754 180292 29054 147997 -22918 -107866 -16883 353832 68674 126643 40614 60035
10497 60035 -366593 -224001 21922 -355385 -427633 122132 -240254 -380129 229772 161618
10487 161618 1193 109896 213784 -129583 288011 81753 623158 755897 356341 258913
10477 258913 85505 190376 189456 458467 14513 -224861 -132525 146329 -214493 -350557 -58146
10465 259070 -245038 2912 -29494 -34395 -153994 33286 -143719 120250 -143532 108950 24318
10453 55764 82707 87640 -147536 275723 92980 212910 141141 -339586 -34501 260928 134175
10442 134175 -302480 -177008 -110712 -164039 191925 -172362 -172038 -345425 -220689 157244
10431 -207565 155925 7762 346122 -80607 64196 -27951 23308 -100578 95131 -16864 73008
10419 85346 202762 -226796 58877 -234711 114357 -139194 -213044 2747 -203561 7344 138228
10408 138228 -138432 223383 -162951 -149505 -159935 -43867 -9843 -104978 -68320 -31706 282848
10396 -252541 -203920 182199 296946 -100454 255662 24570 445724 -3876 52742 135655 -49889
10384 -244576 110966 -25292 -20581 406363 136133 -26629 379079 149672 63490 615103
10374 615103 294765 206455 183587 158518 233177 298720 367921 474277 620958 166763 357669
10363 357669 385406 576840 154347 -54766 -89992 198147 258327 291976 316705 175332 41461
10351 356241 465579 967649 710209 429770 386450 237962 171417 389660 459029 335619
10341 335619 13571 177953 468737 245776 348099 349898 126360 176792 -147369 -48450
10330 43217 -229710 -43189 20838 -178606 299518 8295 130354 352086 203033 141613 187043
10319 187043 -167573 60794 49503 28568 603148 238320 -74545 -60248 -163923 -297031
10309 -297031 185471 141293 -89384 -145394 -59738 -66334 -3466 5033 146381 868 209445 -135214
10296 50528 147234 191597 64366 -315657 93788 -48628 -215641 70184 80843 264745 -100981
10284 5495 -113724 217771 -218057 -49342 -4429 -143901 -247517 -276493 -96054 -59367 -329904
10273 -329904 -213443 -34783 149663 289152 423510 278504 135762 255667 181082 49089
10262 44013 103547 262438 133452 413094 594036 121795 311744 154725 15759 -351849
10251 112048 22920 165754 93381 -35841 66067 344336 -225344 282468 -153158 150210
10240 -124162 -176133 -114459 -65972 -90641 150272 -227275 207329 32406 126572 77527 -565989
10228 16279 -160757 -22593 307880 -62474 -168016 3771 263136 -10388 403781 110771 -162124
10216 -28932 -57130 253391 -159645 -61517 114954 39840 19366 -190716 -180329 78064 -38925
10204 -44643 -174982 -135096 9027 -153635 -222677 -227959 37895 -153724 40514 12799 14819 -81537
10191 -221997 -65405 -221387 141692 -77235 -57482 -155673 19700 229213 -26445 -182400 243253
10179 -247217 -50085 -20503 -59548 15018 -58372 -49548 48241 -214671 -77769 -257831 -58900
10167 -118453 -39427 -145449 -28427 -190398 18463 149353 128607 -233446 -211308 29294 -374217
10155 -207301 -165291 -50854 -79545 -153776 -100762 -20467 133990 -83192 57332 -29010 136004
10143 -94116 -136472 81274 110582 -93342 31951 -171733 -138827 -194956 -162212 3047 114379
10132 114379 -184191 -96389 -188 -276134 -223769 6700 10505 -495 -246912 -59819 106597 -62377
10119 2026 -404170 -24229 165949 -37931 212951 -135305 -231650 -349341 208516 -109033
10108 82856 197849 386420 -20505 -295986 24898 13490 -312070 -375111 195433 58663 -116848
10096 117723 -2167 -295247 -140197 12373 -314763 108746 -256990 -334956 -14049 171112
10085 -194892 116832 37389 -99861 221795 56405 321916 -79014 -37126 -86842 20596 -14657
10073 -306491 -236602 -420017 -128996 -19007 -20687 -598 -74169 -314712 -242481 -165441 255848
10061 22966 65954 58382 -125554 -268988 -401610 20448 198600 -213564 21602 -570343 231884
10049 124297 -265046 -87001 9373 38132 28129 -11842 -267661 -184363 -248939 -244605 161454
10037 -61567 -84976 362176 48573 -30669 337847 -163462 235337 -203068 -87664 96386 -229739
10025 -334675 -72736 62644 -166066 -161223 -238634 -251002 31667 -85126 268440 57578 -22771
10013 49219 -354052 -6167 -64398 -147049 264453 -77739 -123221 -219138 902 -262294 -344930 -14993
10000 -192051 -58341 -396510 270459 283350 231505 -157875 56745 263371 224837 -395310
9989 -103683 -165081 -167703 -356106 -24165 92116 -251370 -122066 62538 -14882 -328540 -175533
9978 -175533 -57168 -159451 -76014 -154108 12112 191394 83587 -174333 86065 134938 131063
9967 131063 -115607 -32924 -254900 -198803 -195603 -128193 -246021 -28418 -119087 -61620 -142022
9956 -142022 1019 -302076 142773 73378 272565 -44382 148072 -146377 -33937 -353189 -216038
9945 -216038 -298966 -52264 33647 -170092 -60172 -89002 45533 -230599 -143356 247139 -158145
9933 -36940 -75488 -437153 -40370 -199670 75936 -261442 -211959 84974 -402550 297266 -71418
9921 -345395 -15151 -146156 -113587 -174340 269378 107900 67386 -269613 -100142 -191344 -75310
9909 -10862 -210671 -58816 -86433 192039 119976 -390467 -1831 50630 136065 -326884 13686
9897 -228366 281742 54505 -136964 214983 33227 -90843 -93102 -49053 -165569 210471 -138822
9885 86589 -142558 86779 95185 268832 73828 -222383 -197579 131473 -52073 103582 70186
9874 70186 198615 -176342 37341 -139300 -130498 76185 126880 -109029 -208820 -90456 256976
9862 -111138 -324396 -134526 -243823 -10017 -158955 -164087 81485 -373064 -188787 -21083 53867
9850 -253504 26505 895 -232751 116682 97956 -184014 -34116 89482 -24451 59277 -155939
9838 -64173 -28973 -450169 -176300 158504 -383891 -398675 -236933 -314428 99943 6191 -234014
9826 192531 -483338 -363910 -124761 -72410 8774 -52908 5968 146549 -12697 -14288 62363
9814 -439900 380602 18423 241612 91802 166142 108645 361624 -109893 -82230 136280 -90739
9802 10346 -86228 -23286 -241064 -223078 -29313 136233 -105171 102286 -147890 -13115 -240306
9791 -240306 15898 -348423 -233563 -73290 -201805 -163067 21517 -146710 -24234 130345 144926
9780 144926 -122787 -168714 -247819 72478 -409713 -13927 -42202 257443 -293271 311513 -58592
9768 -306919 -159845 -12283 -158944 4954 136909 -15100 -604157 136130 -136876 -295810
9758 -295810 -202056 -178238 -126287 -51067 -128147 76519 -312628 -191582 171297 173727 -20456
9746 29631 -105312 137346 79592 182240 -13348 -280811 -39968 -206855 -46698 -303725 -70979
9734 25068 -57452 150694 -8566 -189261 -104028 -170114 19005 47047 184574 -190146 143728
9722 132173 127029 110362 -181979 -71648 -163543 100011 -214539 -79091 -151807 -188541 159241
9710 -22813 -297568 -111130 -92724 -130863 -130625 -74094 -81833 -52707 -77327 2270 52644 15894
9697 -8381 -334372 -100793 -292759 137266 117652 -116734 -314994 -202836 13298 -144993
9686 -28868 75771 133803 76755 15804 175519 -8011 -110450 145107 14876 -246884 -274856
9675 -274856 -125853 -117984 23263 -307971 -195917 -88622 -84486 -123100 -80975 -198726 -223335
9664 -223335 33874 -318799 72838 83475 112037 -130210 -15561 -61715 -47867 -17439 -12601
9653 -12601 172728 179139 -122387 -226384 -150820 -390291 -112410 -22064 -141195 -127205 -147947
9642 -147947 48383 -132987 -48358 -63126 -335710 -175282 -28313 49803 107634 -47287 27295
9630 -192105 -90158 -175110 -191552 -176338 -48958 -33666 -80044 63465 -209089 101111 330676
9619 330676 -156321 -63714 -207359 -162540 118457 -394093 -67841 10651 214380 -110843
9608 -11515 -127821 -129943 113369 -300870 -265326 33145 122368 -39898 -181563 202907 -187320
9596 181048 -22449 -21525 66829 31976 -355846 -130573 188951 -103197 202934 72834 -199393
9584 -233906 26406 -68446 117359 -165867 129894 147559 -171580 -84855 -4401 -335372 -96093
9572 -243703 145639 -70136 -68224 -9786 176276 -209484 82126 -198586 -254177 293992 -164478
9560 -41997 -298647 -133076 351814 -49859 -118036 176074 -48928 -47695 -75661 -28672 61298
9548 -223368 -79221 -95818 -275773 146121 242830 -73468 -63266 -29549 -102106 -70947 140659
9536 -144863 -103964 -159071 -89727 -216186 70636 -64404 381010 5225 -81427 -103075 -181409
9525 -181409 -279142 -16770 -137807 -102691 -228971 76235 -323873 -437545 -186114 -33410 -46158
9514 -46158 -135266 54700 -112640 132528 -123435 414924 -289392 228499 34357 -55558 -260136
9503 -260136 -84115 -149243 -172564 -453545 34003 -228431 -357653 345559 -179197 -215156 -52200
9491 -390675 48521 103351 161816 -136900 -221529 -136368 243515 -288357 25686 -84524 183486
9479 21701 -319 -199851 -159295 -25890 -142736 42222 -8348 -124576 -132425 -146043 23276 210864
9467 210864 78787 -124262 -222828 -351263 -228483 129723 -36710 -15502 -210290 -3975 -240654
9456 -240654 -106094 -212292 248892 -204571 -394445 -126097 -288185 -268741 160623 -262857
9445 -151040 57732 -263158 140992 183233 63015 -16066 -62439 -371825 -117110 111769 85075
9434 85075 -214889 -202522 -63750 -132574 -86001 -52262 -298170 76582 42304 -7291 79973 -134709
9421 -174545 266182 38553 -96560 -386589 72134 89985 104620 -71529 -146705 -63518 -44633
9410 -44633 1067 -246493 -31119 -28535 -299619 -182548 20591 -137312 345961 53440 -8947
9398 44148 -36675 57554 196658 -130566 -16547 136433 38165 -38963 -5808 -140288 57811
9386 -257812 -92951 -78918 4444 -294924 112990 -267429 -283774 233688 143232 -134920 -158824
9375 -158824 3216 -101066 -81836 -203881 47323 -270966 148808 -189529 -17540 -22761 -145330
9364 -145330 111497 -80142 -169143 -294735 -63839 -196072 -146346 148120 -112984 -159724 249895
9352 -123153 -18731 -252107 -175686 -350470 -45330 21451 -352379 -170636 -34718 -395879 -128834
9340 50513 -70007 -386514 134199 -82987 -10529 12486 35123 -267476 165350 49482 83491
9329 83491 286557 -81322 -24404 -193700 -41362 -422098 76699 -280466 34626 49082 -89539
9317 -82618 -20951 227407 93772 130639 -139054 -238000 -46167 150563 -172831 -2612 -84441
9306 -84441 144083 -453591 86635 23517 -110003 -272043 7553 -60580 -133519 136011 -43078
9294 56201 -7089 -240194 10716 -50673 -185766 -316808 317446 78593 -1377 192137 -295527
9282 101755 392447 141322 -2324 -51415 -125883 70331 114369 -312601 -305878 31965 -9159 187447
9269 -31784 139110 -115446 -124770 294241 -30271 -207306 -244596 103057 -42218 -351466 296506
9257 120954 23498 113574 -254771 -317493 -19072 -9078 135043 -334796 -162999 -184583 8839
9245 130030 -74172 53056 89583 82131 79257 -229756 227743 -15173 -54082 -38171 4893 -261667
9232 -131608 -20387 -70917 64248 -175523 -110590 96008 -280965 -337761 -114783 389933 -256464
9220 50096 -400054 -51958 -170657 17964 -53699 44071 3300 -112066 132375 51264 214485
9209 214485 124246 183336 -230395 -22278 -186393 -292137 97154 -287070 137181 28968 110963
9198 110963 -299803 -32099 264408 101242 -8942 -143114 -136341 -226145 158423 79741 451802
9187 451802 -288198 73118 -61437 -116508 -3739 -218106 113819 -2875 15482 71480 21605
9175 -91442 112150 173072 -70258 64244 -72688 77452 -36350 -433056 -83534 -49259 179643
9163 -248642 -170824 88858 -107607 202652 -108347 296331 -56112 -52706 -175437 -104097 -101632
9152 -101632 -111213 -228268 250930 -82394 -32710 252277 -293851 -272768 7298 350768 -28613
9140 -26384 27303 -55860 14072 -165046 20553 -55166 -20842 129653 -29952 -9028 33302 -170027
9127 -241404 -173145 -22371 -159966 -84461 -243699 -233333 -216830 -87726 36039 -278877 -129681
9115 -58547 -429998 -166064 70760 -8235 294379 -169914 155880 -86559 -17882 272595 -83878
9103 -289603 63083 -68859 17348 -174293 26493 -300884 291543 -230327 121788 -41999 -150869
9092 -150869 -2740 124115 67657 35378 -5887 -76725 -350803 15762 87114 69472 139644 -77448
9079 34355 -64806 -46353 203255 173180 223943 -178573 -154878 -181501 -216975 -147781 21150
9067 -111174 -163152 -90117 171024 -109230 -297814 -310864 -337360 59018 -91895 -6179 -161857
9056 -161857 -169087 -146838 -158781 277924 40738 316328 86637 -247476 -37336 -157267 -123549
9045 -123549 29191 -80944 303641 -19220 -56483 -320959 -3993 102953 -388343 157052 130731
9034 130731 -193056 -82480 -47372 -310174 -152177 130054 -311131 51623 -532409 223220
9023 -322661 -295064 6594 96972 124134 -350887 135474 -116574 115581 -95301 -135008 314819
9011 -122700 -361673 -102780 236254 -163389 41582 80012 -6249 -35980 108458 -236662 -272365
9000 -272365 -163153 97967 230913 70557 -59230 -312480 -317353 -80969 -75115 12808 -370299
8988 64299 -312126 -113528 193900 117927 231504 43171 -114076 -288678 -5541 -107114 -25754
8976 -169902 73717 -86524 150177 -147102 -121255 302287 -388968 48499 -14776 -172285 19849
8964 274937 45480 -200505 -105626 157245 -45750 11103 -169357 15601 -153242 -113890 -71077
8953 -71077 53388 8086 217390 33134 249887 -166640 -345363 173851 -383170 -91545 -252023
8942 -252023 136449 -74772 -240031 142184 -463174 -119292 132873 505424 -386471 30389
8931 -44785 50962 -8301 31372 -42106 485343 137322 317340 1009246 3365323 12366385
8921 12366385 6767647 1589144 421822 320659 -68245 108253 -67709 -304881 -67736 -140246
8911 -140246 217479 11176 227034 21013 210793 -352141 -85888 -60028 -42052 71869 151954
8900 151954 -159261 138728 -103243 63507 -266024 24980 -291584 -228558 -186096 292238
8889 114323 -324657 -48601 -283217 73193 89095 -106339 302311 -168633 -174044 42850 13017
8877 212836 185024 154009 212145 -7540 32842 -140343 -83348 -118399 -85805 46775 -70000 -440364
8865 -440364 -254127 -147954 -230446 -119678 18707 12150 -275702 -107150 -186583 -184789 18278
8853 -116444 -55305 142634 -394592 -313895 272447 -26385 57866 180162 -53589 -149662 165627
8841 290436 129408 485265 -151087 -209668 -165427 -177635 -246773 247041 -146992 73438 82142
8830 82142 -62732 391603 -183937 -355330 -223798 -167431 158043 159858 -100080 -20540 -162828
8819 -162828 107583 228252 103496 218371 -138186 329765 -234605 -63760 -257096 -25927
8808 356232 22980 -242162 11376 -21847 -155272 -60548 -418998 -98037 -240938 -140652 -69049
8796 -427276 -11933 -153901 119829 -278550 -31028 -122376 76049 110334 57951 17494 -68031
8784 177409 -199523 -60651 -150245 268765 -187132 281414 -195060 -47819 -49831 -80449 30997
8772 -95408 318681 115238 235479 229946 112325 18596 -65130 -214830 -127681 -19800 -301547
8761 -301547 -381076 -5378 -333883 -171609 -73886 -220039 -64066 -197266 -137712 -120073 27506
8749 -40637 57245 -191154 -215467 314449 -236605 -49273 -12879 60962 4741 82101 74273 -27742
8736 293851 -189900 99238 -187878 -188040 -217357 -241789 49798 88807 -133332 -415427 -20760
8724 153365 -275128 -403969 -135149 -207339 4680 95251 -8799 -97486 -138135 -138320 -35792 6629
8711 -666286 -52657 -103285 457879 -40359 -139736 -99323 54148 -160058 -171775 20795 -53726
8699 -195362 -224532 -226738 505402 -137426 26718 284383 -136383 -207872 300820 -45145 -241672
8688 -241672 78627 224356 -52768 -77700 103106 245855 -187729 -99517 -247641 63094 -159211
8676 49436 -116830 -71257 -121015 145132 179477 -177859 -80039 226530 -229565 -232337 -280563
8665 -280563 30374 -121571 -255936 -449891 -252873 139777 -281428 1285 76656 -7055 -107761
8654 -107761 -171576 -56427 375691 292345 40017 112027 -197736 247068 -251243 47323 108664
8643 108664 83906 334268 -28506 -88553 97344 78932 -28527 -51608 -284023 64261 -200658
8631 -173923 87515 -362484 21505 258286 -175037 218851 -288904 118020 -143954 -315401
8621 -315401 173263 232768 -20766 172440 -298717 -35757 225442 89470 234252 190325 -261406
8609 -23382 -200839 266137 31244 -5631 198848 -263101 -4216 -96204 -19600 -81602 69031
8597 -363418 -189183 -176112 -171450 282160 -115915 -416093 -25213 -291357 -310169 -97074 -56280
8586 -56280 38032 -63497 23044 89958 76515 110217 -181810 -143321 174015 -191252 36732
8574 120556 -47979 286087 84956 -19248 -138782 173194 -118316 -352975 285563 -102944
8563 -133242 -154789 8788 -12740 -163647 -11785 -51448 72345 57106 -176575 -133013 -315349
8552 -315349 -254301 -229799 236004 203338 -70137 -100727 24075 77602 136901 -57356 -73712
8541 -73712 63259 -237528 -49026 85932 -270570 20850 -132664 -81905 210634 144081 341899
8530 341899 226969 -318860 57617 184883 -393954 86596 -408606 -102705 -49003 160741
8519 99605 -218695 -501383 -142594 -235829 -52934 225893 44758 -215394 -110964 142430
8508 186949 63141 -495649 -4392 -136266 76831 89939 -147584 -72695 -46142 -166849 -8262
8496 -357751 20879 -322922 18697 -126524 -285073 -296698 22931 17827 -128185 -16577 -342115
8485 -342115 190411 -13586 -267467 -40288 65886 173287 64747 -145941 -144031 263743 94681
8473 -105300 -274841 187219 -102733 -209554 -135885 23839 283725 -65229 -40455 -6669 -338784
8462 -338784 -71218 89444 -260907 82398 -50372 197747 8157 8216 -32524 198150 -118130 -136663
8450 -136663 -203978 182947 168563 -14192 -71915 -31333 99281 -142992 86562 -278089 128270
8438 120766 39151 -297129 180152 -97226 32414 139053 -19623 -201228 245984 -474425
8427 -92107 100350 30815 -15067 -200530 -145955 -67808 42646 -138321 -125799 139708 -10177
8415 -425450 -10225 200398 113906 89503 -138242 211163 41922 -79568 -70549 -106653 4512
8403 -240487 -168158 183325 32455 -83654 94161 -166769 -95672 34153 278421 25628 254013
8392 254013 19621 -303818 -246113 192380 -180088 125862 183082 135557 79961 -227614 183526
8380 -14346 -160024 2574 3655 -145193 5928 -35181 130940 -114778 -214883 126484 -277743
8368 156322 -4371 -53839 72917 89442 27332 150640 76361 -87666 -172819 -40396 63497 141336
8356 141336 138040 8386 68610 -275900 73155 78290 130782 52678 81103 58293 109854 -90161
8343 76005 33840 125960 -366491 -79736 -197896 -30901 -19883 -69974 156209 -213873 -91203
8331 220590 -281275 43393 31736 128507 103538 -361003 45257 6490 -101577 198658 158493
8320 158493 -153645 -46805 275201 -112100 -166079 -192736 -82584 121689 -58373 114051 -146352
8308 -204692 -353544 106421 -72657 288275 145591 -22032 -196278 34915 -19564 214243
8297 1704 -280487 101223 -101024 122437 118855 -252405 -179748 -141355 -254609 -84109 62483
8285 73125 -26773 66421 -200175 134753 -141301 58773 -261916 -82183 65292 -114397 -163523
8274 -163523 183058 -115842 1466 -152421 -8284 209970 -123973 -41345 18100 110015 -196995
8262 -210005 -475569 6654 -137945 50452 -323798 -178620 139817 28371 86716 -250202 -81095
8250 -199062 125660 -113667 -38899 -237832 214474 -148824 -36856 68332 147426 -330487
8239 -332830 -21056 -178936 -85748 10644 -48062 -457197 22964 17520 211956 115542 -176884
8227 -9207 -19100 -71160 -298363 -23926 195191 -87085 33287 -18354 127564 73745 -54274 -26552
8214 -95523 146572 176472 -82790 100189 226686 -146378 -87764 -125483 -119877 -8205 112 45311
8202 45311 -339884 -101998 -29614 -248121 -293224 -173894 -75904 115136 119133 -7079 -144892
8191 -144892 -31056 162907 19605 111299 86658 -295758 -363937 -135120 -124351 32163 203046
8180 203046 -174280 57965 -381355 80068 2238 -107542 -46012 85578 -295920 -99681 171340
8168 -34999 -308454 68507 -22081 -239472 -293319 -115468 265637 156322 170858 -78920 70216
8156 355309 -200209 -59066 128170 -323836 186268 -84098 -164206 -114437 -13345 70432 80669
8145 80669 -279203 -349529 -161411 -198375 -218101 -113483 16815 193960 -267410 -111540 -50358
8133 169619 102114 282996 -210520 -287949 213592 102876 -47529 131543 123050 127917 -134180
8121 -138506 -2033 114211 -411310 62 -67755 -259402 -73790 -388590 66788 -253018 -111121
8109 6592 -46153 -204815 -79790 -40823 80877 -238344 -164381 -73655 -105844 -111482 -137927 -14707
8096 77213 18414 -153300 122531 29870 272023 180703 -58189 -9736 -129458 56955 59625
8085 59625 -197325 298630 -81211 -133296 290 -37777 42852 -149109 261850 171620 95041
8074 95041 -318818 -21082 -50990 121598 -32765 154699 53170 -57223 311433 169989 83678
8062 -50336 96736 69084 145172 121799 175130 -208244 -188155 230527 8382 144664 130188
8051 130188 -85404 -207968 -136935 -183689 -130698 -239275 15353 -159365 6736 -109376 189885
8039 -67019 -115532 163155 80137 -380786 353782 -187885 -113020 -133188 415098 -71246 14799
8027 132678 -370338 -217096 -180341 -87637 158745 -134931 53659 -7984 -57083 8521 -146483
8015 -18216 144791 -97598 43665 -85680 49833 -213038 -211400 -176940 -65712 121710 220109
8004 220109 -147895 -43991 34814 -43595 -186182 92744 -129037 -236854 -249807 -173639 -80715
7992 -149118 -27237 12864 -126678 -245284 15504 165587 -46015 25578 -63046 -113956 24485
7980 -103665 141901 -152635 -119648 63710 -281832 -227819 -200985 138542 205674 7291 172899
7969 172899 98492 262271 -339791 -178144 -55683 -153055 -135986 74991 46683 -304127 144819
7957 285518 -115136 12557 414019 -13989 132376 -107729 132163 -321419 -16903 -97418
7947 -97418 -60532 -134683 25242 -401364 -82664 27326 304820 -32394 -197678 -152040 -55865
7935 75979 51354 -142207 125431 -79733 -243118 31186 -111722 -6645 -17361 -155924 219114
7923 -13845 -96574 -102976 589948 154551 109703 -24927 13565 186163 -154322 -42638 326851
7911 113592 -440867 -109527 -168576 33173 -137261 -162123 172174 30007 -328719 -176725
7901 -176725 -41765 -162398 -30135 172203 -27488 -201602 -161894 -68327 57811 47186 -260888
7889 95625 132873 115591 -112314 -60861 83134 -354013 -277929 -74291 40339 -52850 -173036
7878 -173036 -276753 -213254 -94070 336129 -137192 111841 309516 -114743 -436165 -161456
7867 172337 102286 -104733 44143 -2095 -16065 -118199 -119025 349614 24261 33747 -303043 -175502
7855 -175502 -98417 -3050 156865 -103131 130727 107237 110571 -17082 -247713 180658 -146502
7843 8252 83192 51238 -20175 -141912 -173612 -434118 -146837 232959 -7683 -37884 -76036
7832 -76036 -186956 -222196 -198091 -36666 -94424 -133565 469392 -166902 353138 86574 -62845
7820 -75423 182291 66874 321358 -205722 -266788 -140668 -178295 -59453 263716 256715 17224
7808 -54493 -180894 89178 -348204 -126821 45555 -237384 288419 21661 -315891 -352855 -169650
7796 -228669 -78012 131289 -338406 -284896 -74294 -243147 131648 -148213 156002 61925
7785 22138 -210840 76080 -109782 -162472 -25732 -88028 -236669 1620 86773 -189671 43975
7773 36652 33639 -189732 -126034 -93696 -10206 -1924 -68035 308944 -60191 292217 5201 33471
7761 33471 -120056 -46314 62248 -14664 -38939 -40954 -56060 19596 15028 -407858 298431 453685
7749 453685 21266 284905 -48530 -156021 -65135 207843 197114 8511 -280211 -75045 -264632
7738 -264632 -99084 -28363 50342 -178438 -121236 -119625 34764 172328 -251424 147180 -475306
7726 -79126 -82647 -206980 -58172 283673 11676 318646 -151227 370346 100884 -276282 -71721
7714 -85800 164300 135282 125322 304726 71281 120681 -72983 182045 94637 -141846 187065
7702 281970 -121792 415267 -312688 -41760 -303919 -149666 169751 -24226 72767 206001
7692 206001 -33405 324466 -368666 53275 281413 91400 -220760 -195605 84709 37278 -338040
7680 30439 -366982 57759 13493 112460 -103585 134589 219372 110603 -220507 -269056 -106033
7668 30313 -241291 -16962 48248 -20839 -106017 -132322 -218077 34895 259894 20716 -34180
7656 -213806 53512 -26378 -185931 -276286 -120397 -142645 -359237 -150681 157232 -109163
7645 -29703 10920 49579 1284 -138956 114553 229408 -331491 136888 -19044 -397172 -9784
7633 99370 200379 -239769 -9347 146937 109381 82125 -135089 -242012 -104661 -48429 -72051
7622 -72051 -346772 59873 38744 171124 84452 -140103 -181971 -64148 -92055 16960 -95163
7610 231415 74522 -192454 -393912 177346 -336907 74975 165256 72797 203325 77019 76991
7599 76991 -7212 123514 257200 142453 -263601 43672 -156022 -137807 -281052 -262578 -80085
7587 61101 -54788 504877 -361450 188696 169573 24302 -313389 397822 142522 -193227
7576 37824 -135264 165164 -193315 -90266 -29099 39594 -113165 -173816 186711 11018 101681
7565 101681 206180 19782 164200 108188 80063 -122610 -284234 -366165 17245 -83383 25432
7553 70030 91591 -100448 10776 -16626 -159153 -65808 117282 -174899 -47085 -61177 36239
7541 -76001 156548 -352726 95333 -126188 -299227 -56102 -45068 -193881 -227110 -171802 -135740
7530 -135740 -70014 -173464 -240295 -313013 -104431 -199302 194850 13105 -119482 -214105 438
7518 78161 -72472 62163 161109 80389 -64908 54355 238716 81677 -147774 103448 -240255
7506 53621 2767 -480478 -131415 -234802 -55620 80472 105211 -28561 -164332 61939 -38206
7494 -167780 -171353 211746 34059 40577 -370685 -171778 -222279 -73348 24877 26260 277506
7483 277506 38549 31997 9263 -120762 2833 -57163 -345522 128776 -211706 -184469 61873
7471 -332724 -162009 -6032 -32753 -44721 80188 7122 -147977 -117452 345492 13042 -31459
7459 202335 170106 -306413 -15848 82563 -232313 110443 -194113 324608 64620 -177926
7448 108305 -86904 -200483 -98295 29653 -120107 -264306 -232567 -80818 -153459 243078 -98377
7436 140896 -316371 313596 -13761 -245619 -83506 126244 188549 -227096 28689 -242086
7425 34628 -26467 -113098 -253334 -59617 -64096 -263598 21080 302355 84895 -122528 317116
7413 180175 -92885 -306992 399681 643 122768 224292 25423 -117314 72331 -363452 7104
7401 -35130 -208861 42724 168141 -127046 -356716 -7082 408394 -94916 129107 -129228 81547
7389 -126062 -2729 -84364 114863 -366055 416758 -122432 -23503 91632 -116846 -104702 -213185
7378 -213185 -30063 -174017 -80201 200027 -15684 181132 84187 126961 63059 55323 49161
7367 49161 -346211 184655 -119967 -281544 140578 365439 -345580 -26783 162641 52560
7356 124944 191226 -307755 -33179 316546 79234 349658 -211580 -311118 -160515 -65171 64046
7344 105088 100948 -66407 217797 22916 -56674 52271 44313 -36617 -244375 89998 35042 -44368
7331 -321069 141726 48510 119657 -7013 -35890 -59052 -93819 -70397 145525 -32503 -115365
7320 -115365 71861 -145585 -129402 -175437 124966 172714 149437 154996 -109596 211971 -102690
7308 -19440 -180387 -367599 -15857 25573 -87126 -55850 -307700 21063 -95413 -16292 33923
7296 -127601 197791 13510 64415 -40929 112080 339112 24615 4467 -139052 -295372 -2879
7284 -105263 184381 -235902 121629 209234 165528 -431154 -127454 -398821 -112398 -318839
7274 -318839 35108 -85860 323869 -106351 386336 75931 111393 -62788 166657 30250 226613
7263 226613 39160 28065 188531 -143479 -254811 225894 -190620 -126329 -203620 100656
7252 -10352 35525 1663 -131815 -357323 57397 356280 -366145 -82348 -107295 -195172 31134
7240 13516 -214307 57967 -213767 332408 -55081 240317 -70041 -50050 9890 -30481 -94208
7229 -94208 -257796 101048 -187661 104691 145381 146415 -90469 -73455 -7014 88564 -93783
7217 -227059 -68459 146577 133563 283299 -253571 -65327 271757 -274138 140402 129638
7207 129638 -70982 -258781 222565 -67258 -289666 -165114 -121094 58574 164039 -35468 90421
7195 -616396 254279 151026 15286 -481074 -49156 40112 234672 -438269 -324032 147964
7184 154774 105491 -429606 -45186 -192581 -75405 218919 -161755 -17442 -95878 193353 31530
7172 181194 176696 -85958 -178197 114033 174038 76577 238541 188969 -233588 -32088 -106802
7161 -106802 -228197 267787 -8917 -76399 -8932 -40491 11663 112743 -162299 -6738 -239836
7150 -239836 297358 -160545 -109610 46778 -86265 112241 82555 -94373 -310870 -156058 163281
7138 -266361 -99034 -189460 -93487 259904 -161642 -52208 159177 11021 156655 -207675 -28667
7126 -45477 -76816 -409944 -215927 79065 370926 266000 47754 -157733 77613 -344755 131946
7114 64742 -182361 -123620 193250 12059 179617 -13318 -264032 -109709 -74025 -105077 182610
7102 -16576 -181387 289831 -146582 -211196 24271 43397 132064 -235566 102526 -83675 739
7090 18844 229933 112470 -79564 -228977 159961 -143270 -351213 14896 -97817 -327870
7080 -327870 106281 -35905 -159231 -249717 -462523 -14687 -67346 170383 88998 368583 -188213
7068 149162 -141827 103694 -137499 258784 -33108 50476 -224904 22695 129281 -13034
7057 -33578 240676 -128433 -386325 103122 -132493 -166290 8073 59451 -214989 -218961 125140
7045 230293 509020 -325077 -18855 -410008 -87736 -406991 -92490 -122501 179427 398422
7035 398422 31304 -85273 -12723 199876 72617 44791 238026 20632 185464 89813 231199
7024 231199 -46941 -7722 -365193 33089 -170907 330130 109002 143320 -69737 144903 -165857
7012 -219118 290298 -2444 79208 190105 -107474 -32180 54242 219766 145425 253500 188657
7001 188657 487287 103749 193998 -63339 -442740 -103189 -72625 -8539 115930 -10871 -4831
6989 178057 -300396 -475167 155429 -239930 -122766 175023 -299977 -23113 328342 -207512
6978 -372208 -82474 32384 23600 36511 515820 130215 -193956 -36054 -83885 -140476 -14132
6966 -68097 -53161 41696 -67989 183294 -155856 -247811 439595 70442 -26049 -128990 -231461
6955 -231461 38537 -159007 -147932 196707 -92565 57535 71804 -41348 -46906 85265 -94793
6943 -437891 -279449 -74818 -79831 -67483 39273 -131877 -217164 7068 128768 143266 -91338
6931 90849 -250507 -293017 2348 122517 90228 -326242 131988 53528 319510 97193 -9153
6919 78136 -48168 -173085 351987 -263815 -243581 -72003 -228031 175286 82565 -112693 -170311
6908 -170311 223052 -109067 -66894 -112957 92254 -58459 370179 47610 215574 72008 327097
6897 327097 -105158 -122334 119799 -5699 126361 -80759 -236383 32193 41553 -344721 182230
6885 252293 -13049 -255147 131169 -226635 -9233 -45620 121249 -172605 230585 -158479
6874 -147555 -266606 150956 81629 53217 112783 21751 -107653 -79766 -108821 -106445 67909
6862 10367 -16877 -178239 -28929 -152185 185809 -99136 -25056 -111429 -241361 263150 -424142
6850 -163215 100379 1620 -218041 -194586 -72580 174163 429413 122124 80109 -149144 -247261
6839 -247261 -116898 341439 191095 -11376 100459 -107832 -283509 132523 187425 -148695
6828 -330468 157329 164651 -126609 111208 184154 113510 -127414 387053 -355667 -126324
6817 130984 67109 139414 -82283 -349918 169646 -58258 -146384 -153437 72378 229434 -120330
6805 64029 94699 -76925 23617 148604 32562 -32533 -167584 103281 -87114 -165608 -320783
6794 -320783 246632 -251404 -48048 -22790 51648 -332073 -190745 -102320 -157315 -6679 -339678
6783 -339678 -482914 81132 15716 3563 -187135 -106303 120959 -34614 36027 46673 69642
6772 69642 -219809 -36068 -123175 171056 -291293 -67296 230033 -272625 56562 45901 192251
6761 192251 -362008 155711 57939 -216676 -31823 87699 -265919 -106843 42302 -125326
6750 -32808 -174860 -107850 -254768 -145352 -27138 114233 19360 -88543 -50053 -50618 -74951
6739 -74951 137656 69389 -25821 -227290 54707 -224174 236911 -217947 -302603 345522 177550
6728 177550 -57010 146565 -53426 -77996 200638 -66326 265112 -51559 -166039 -60234 173156
6716 -270216 -83010 -32794 13214 175061 98406 13012 143153 49894 -187712 -130135 6485
6704 -258733 393222 334319 -129951 61961 -20017 37289 70790 -61472 -272152 -139084 -28006
6692 -81122 255216 -334443 -136840 205651 222491 -167438 -29440 94232 -187769 -74450 -271895
6681 -271895 381451 -264512 -27819 34163 -198651 -159798 -380573 147002 -96962 -269385
6671 -269385 133360 -68349 -92569 98821 -267774 61426 -122742 52677 -30542 147867 203403
6660 203403 33637 -261945 59991 10857 -143656 67957 -354856 -6689 211319 120516 33943
6648 345674 136486 179161 368224 -1504 -150649 225757 112453 99516 326601 304596 23945
6636 30781 57983 108452 -76941 -340202 907 -124831 45082 217161 224536 -118945 -101097 -243532
6624 -243532 -113808 325447 -186555 -71182 -108100 -407545 211795 -117879 260220 -138552
6613 339909 -149663 -2964 -185475 -171526 237081 361833 295330 58342 25971 -186456 -47242
6601 -58690 -14170 -41035 -119796 -401261 172926 -60259 300448 -160401 77221 21049 258496
6590 258496 103048 40536 249337 123264 -274916 12665 -85804 -166727 59621 134712 219434
6579 219434 -48259 -23037 -73584 45346 378505 -211855 114820 -86711 -28343 142295 16525
6567 -139706 -135270 70131 -14233 6441 23531 83250 -108405 -269743 101911 -367111 29652
6555 -211932 230270 -82965 -138461 -25038 -64269 -234623 -158506 15634 -112727 -50705 -131877
6544 -131877 113560 171962 -4834 -289863 280566 -15887 -14756 133330 38828 -126564 105742
6532 -147991 -172097 -53350 -111663 47652 -65857 103182 15405 91676 -203731 145744 -42776
6520 -202264 -230264 -59158 -255943 -163721 104411 -164664 140319 -196122 -44779 142109
6509 -232935 -220467 97339 -29908 -225598 -185609 40086 172220 -285588 -3217 344283 -104221
6497 394447 183816 153277 29052 -221891 52549 233917 236863 232364 44634 -182262 26990
6485 99872 -266680 328389 -32498 163993 130374 266922 -120776 -277634 -286022 -264213 -97166
6473 -175579 99599 -97070 44153 -8892 -359998 -82671 215637 12678 85331 -231658 -123958
6462 -123958 43784 48420 -114352 155307 -166272 -64917 -70925 45231 386128 255033 -345384
6450 73113 -155943 217076 116916 10539 -58628 8027 182897 -1249 -13389 197165 -165555
6438 -40656 125655 -113684 -131432 349361 106481 41682 -75721 82274 -134597 -40221 2978
6426 -104463 112299 -83649 -556978 -287039 -287202 96249 -195458 142285 -274613 50437 8566
6414 -312763 -131377 208543 103881 419044 -59610 123060 -36487 -51814 -199846 47799
6403 25328 -58678 -141726 98328 331598 222378 113950 -80199 -62837 111412 -27407 89522
6391 -25228 -44786 -232214 -85474 305530 -166753 -285748 99406 338046 75609 -226992 -237073
6380 -237073 100984 -118930 -345232 -2877 -14473 -101985 -71272 -150071 -103348 -18601 -270940
6369 -270940 -9417 -139688 -348243 -157262 134016 -65028 18280 -36912 3704 8917 25499
6358 25499 161803 -291974 81866 -12422 -206526 289111 -76113 167135 120883 67736 170893
6347 170893 -144920 -15809 41068 -53136 206131 254069 -70174 -126579 -223855 -115418 175939
6335 2115 81466 -179394 -64679 -91159 163583 150538 86598 -5820 -204388 -59478 179092
6323 66597 -106977 -9884 55934 151519 -266122 -55539 -229150 107286 -171736 46893 14470
6311 -10247 -169899 -204475 28636 -84278 -14227 -141542 43512 185525 177256 -64330 -364389
6300 -364389 -364655 -200394 166516 108223 -272176 197695 107330 -52387 -28435 -151442 198426
6288 -93432 244251 -15162 88608 159135 -13462 -76424 -179627 87484 265300 -45394 -259833
6277 -259833 119752 -205039 -147312 145359 199094 -18456 -224872 272461 -89737 -271509
6267 -271509 -117595 143020 14500 -233443 67421 21483 -130768 -174318 -91947 127660 -27874
6255 -15884 179077 -232238 -86784 -171200 66670 147613 13220 -23466 -167129 47824 -166082
6243 295888 88571 -61159 84984 74945 -301495 11896 146203 211906 -196090 106242 119459
6232 119459 -6725 -97415 -336861 -30077 -82259 136647 -287954 400729 -25418 -151561 -236864
6221 -236864 -114713 -98865 165122 102082 20080 36475 165781 88150 -68166 39605 -98531
6209 -321112 -64086 42402 -287962 -32640 -299024 -122542 -371789 40244 -105972 31921 268834
6198 268834 101763 10110 -333296 26116 100851 382278 -41153 -210332 -42180 20476 125265
6187 125265 48210 51537 -207614 -46755 27541 -57976 -96676 -86084 140197 9255 333852
6176 333852 -190818 -227831 76337 168258 462134 222104 -7702 4865 -297705 97127 94704
6165 94704 -126056 -324040 -40094 274715 -515284 148385 231105 -43079 -39537 -97649 -32515
6153 1890 -226532 12042 99827 -200253 -204179 -252561 67328 174164 106756 151384 321178
6142 321178 -240851 121397 -287867 -167686 71696 -199670 296897 261721 187581 -91984
6131 -47193 199959 340580 -165794 224646 104066 8462 -46640 -260014 -264568 -24571 -7257
6119 101345 -334914 -132461 15657 61990 293977 159921 173501 -181056 15768 -165354
6108 -11508 344876 -57313 33472 382261 -75676 -69521 56772 -215699 213572 8592 -262969
6096 -151284 266929 26813 39464 103682 -7611 300393 -4625 -64005 87602 -62908 274007
6084 -140434 37708 -87536 8901 196266 -233120 -33755 -65269 -159178 -23983 389590 1606
6072 26170 -87680 -64031 -152608 2975 304646 -267242 216247 -40696 -287727 -143217 -11813
6060 272243 -84059 273914 55366 48935 186609 -53298 295619 68518 -113684 -61810 -39634
6049 -39634 -198777 -315034 98063 403939 -30886 -22889 -259228 -117438 -129864 78104 -73595
6037 -18223 -169118 37825 -100043 104334 -11664 -16614 -113930 124925 71137 28729 33200
6026 33200 233137 -105490 -155763 -18435 211515 98234 -161929 -159168 2751 204585 -78459
6014 24308 169479 44467 15271 -52847 -105483 -66281 -326446 -63086 -36197 339048 273856
6003 273856 -12052 73120 -277650 -91953 74008 28549 50802 -132628 2187 201233 232232
5992 232232 14521 -86468 -132455 86567 -40075 312218 -161647 -209267 -5554 -31340 158986
5980 -61516 -183873 106269 -225005 9808 213335 103040 145263 -277984 101745 28861 59646
5969 59646 -266153 123375 -61072 -81605 34911 26415 -6336 -194968 -466910 166486 -18282
5957 -495485 38325 260486 194063 6382 123191 -18429 -50363 -209791 -105065 72420 -91761
5945 -17064 -48775 -55689 -45650 -63966 -22157 -38944 -550064 -171054 143439 -99043 447394
5933 -14293 -179926 -102161 -204132 -44128 -313573 -129090 -409082 -131287 -251871 88917
5922 49976 -162087 -12026 -103024 -351949 134634 -133594 -122200 -29009 -40640 322416 60345
5910 -12936 -185017 98733 222324 107625 141821 -87275 -129612 108769 -216829 102881 -76367
5898 -89819 -389687 -94012 177024 169377 424328 -142329 -9876 -160532 -186243 98779 -52869
5886 -256950 -162827 62782 -143026 5734 44945 53164 154036 80747 -120969 -127387 110591
5874 -112805 69865 -48633 68911 -213846 21124 -335299 103083 16960 -133936 12810 310847
5863 310847 -97428 73348 445835 -42604 338748 109774 119696 -31184 89560 -140469 264471
5851 246893 -126777 -213544 195373 -106791 1941 184275 -22027 45405 -129939 239985 191700
5840 191700 92742 43678 -40303 268615 93061 -55912 -135320 -156720 24699 283001 32776
5828 -182250 11743 -181242 -20789 209233 -187291 -138482 -30426 -257824 -2357 229487 176327
5817 176327 133592 153982 237298 248760 106387 -132536 -145620 84671 17438 -119326 -141866
5806 -141866 219788 -70782 54683 343822 -137441 -225633 15458 -38517 -134956 -426816 241771
5794 -40655 -170920 -92078 155989 288257 75064 54896 -296706 -23028 -20659 -93332 58827
5782 -195230 22685 6683 86561 184781 42598 78047 322121 -291311 14545 10132 -258065
5770 39502 -346616 298048 -361740 140607 176611 143286 98227 -166205 -191017 44554 -23136
5758 -173991 72341 14951 128355 -54437 -96165 72956 11262 -39789 -166234 -69381 42085
5746 34850 194811 -23117 213828 -30586 -91819 -214813 -15193 163317 -111831 -155086 -2509
5734 306303 -243041 289094 -392742 -83131 -98967 389204 79967 19385 201671 126751 -68233
5722 -250253 75468 179528 -221968 156547 -130654 157634 -108308 82221 -127736 51323
5711 192235 -148985 6802 55013 -185356 -104421 155034 67447 -125200 -150816 439418 337129
5700 337129 -158563 -65824 -33008 -141531 -137549 -80035 417105 -63060 -386677 78103 -147020
5688 -67393 -247931 -263650 -242685 85055 -95748 -48009 -46091 143214 -163828 -6758 161843
5676 -260136 -119599 -230974 42118 51832 282559 -60157 195866 -1297 164321 -126899 11901
5664 243044 88498 70397 -352886 -174453 222095 -165390 -260890 363571 -93660 -46757 -95026
5653 -95026 -198407 -234882 -151586 -170187 -70723 -55686 105431 -114846 -43428 -150658 -218965
5642 -218965 -67662 -84183 -279502 -113161 -42052 -129506 -154957 -68858 -98976 132240 -31539
5630 -119780 -198480 -164081 129613 -58520 49846 -92279 362545 58920 272574 88328 -13986
5618 -2463 141130 -87652 -118674 88194 -177039 285848 -251596 -34924 7344 -129011 264492
5606 -376006 50190 100802 -347210 -298855 296696 -160849 10733 123470 95787 32060 419490
5595 419490 176473 53256 -170979 139858 -191399 272112 51235 173521 273923 -166921
5584 -47371 7806 218990 -13613 103551 33261 36385 -137747 -33547 -3677 -333470 124749
5572 1891 548551 -192678 43856 -24451 304688 -191929 -12301 -32610 157393 -400599 -89124
5560 -153894 -104386 -3865 -89384 -213359 30333 -55411 199217 2276 57893 204192 104671
5549 104671 -108646 192442 -214344 -97883 29414 -6900 -15072 -247274 265286 171187 -108326
5537 134471 291712 298271 353661 94891 6499 263522 -266207 -23194 30084 74273 152386
5526 152386 -166478 90332 37491 -231539 -276679 281466 -123273 164919 200795 386740
5516 386740 372373 -88672 -223084 124921 -86960 497049 285572 7671 -95652 125019 -219880
5504 -180230 -5426 260606 78284 123370 89524 402743 51535 -69164 -109789 13565 -327906
5492 -43317 177370 -167981 21903 -22604 37503 -94340 -19352 -79263 218214 56286 226602
5481 226602 -9053 206653 -106992 -87814 205329 -57127 -73598 -1334 -63437 -311417 97188
5469 -172284 -229016 -160188 -254426 -235089 312161 -47372 -125295 -214056 134663 -278870 166549
5457 -325928 85538 -91427 300298 5574 54594 169248 -11477 30984 173518 3597 -280893
5445 173831 15040 10475 -140690 84166 -139223 -218396 210833 -72677 149042 146305 -13599
5433 156157 -49903 360398 -13995 -13938 191635 -61903 -6423 -123817 407827 55135 -56174 -167195
5421 -167195 -182824 -189483 -102733 192295 -178920 -390532 86182 23980 -210693 98929 113264
5410 113264 14616 25768 -41087 -250950 149063 62511 57446 -73470 -310877 186157 -45567
5398 -226125 -19410 365079 111886 67398 -427760 -69830 95603 14318 58212 59896 96225
5387 96225 74435 -229434 52112 -181295 -193452 -152009 -537048 -71273 -218126 -64310 -52437
5376 -52437 -157688 160588 -258701 -269231 -35506 91845 -100024 -98414 344083 -108019 -47758
5364 41799 -50947 -4433 124603 -189890 -182258 384854 -277322 -73896 397080 182613 178960
5353 178960 -143852 -47591 -77647 254915 -227122 -14424 -16968 20806 154910 115244 -132097
5341 -69611 163152 -231377 -57429 -104786 -32630 -107714 -295175 14352 -229380 218029 -191784
5329 80451 202930 -119848 -67213 -114463 153004 -69682 -177716 -58165 36667 318047 -11354
5317 155232 -41039 5094 -4157 -26223 -198524 17969 -241648 -62544 126732 345639 -194757
5305 -23349 -204265 -87177 173179 56358 238686 166791 202662 130509 -95213 -49445 -120082
5294 -120082 -151068 -139939 13747 -255863 -138632 129618 -167764 20269 -315664 239529
5283 -287929 126084 251647 -9244 66629 -108024 -1352 97652 349641 -332009 -186677 -180407
5272 -180407 66696 357251 125655 -149206 227954 -82338 -91816 -279769 -76378 -66473 66751
5260 -95686 -102490 -41622 73551 -72611 -19016 60413 164137 155267 13925 -43283 -80216 432735
5247 142674 351722 337916 -200082 118420 -36625 161859 -125917 -63710 -182258 -51621
5236 -144512 -95124 76433 -149841 -139032 -311599 -54687 -44700 82146 161097 373291 121160
5224 41832 -83717 153162 -61005 44024 168908 62198 -51269 229450 -370235 -1926 -337914
5213 -337914 -158510 -70719 -28080 71749 303039 -39782 22830 48084 146328 -172645 46900
5201 86542 88039 -175059 85592 -95914 104745 -200749 306602 18052 -52882 -39490 -84830
5190 -84830 -45305 217584 57296 -188690 178786 128252 265323 122657 -139286 22829 109153
5179 109153 -118062 232500 -203708 111609 190281 -252527 -95907 -119875 73267 -353200
5168 253004 -266332 277499 228031 -23348 -82715 271293 98713 -200801 -220984 -233039 -90797
5156 -128570 162718 -277100 182210 -133528 100559 123185 -90981 177306 -136723 158639
5145 237680 -330002 79507 -14560 87775 -66688 83023 70211 196345 81215 263836 -68948
5133 45827 2946 284712 184709 -77630 34554 5377 542593 -65400 -23234 167145 -194478
5121 -162788 -67188 -38598 134891 183772 13166 -49642 158655 13169 -187692 -88702 7228
5109 -312542 82937 -63358 -71 98613 -10940 1005 81813 -136756 19712 -185068 -112928 -364386
5097 -364386 -39479 115022 -214015 -2543 -134792 209186 150836 48241 310737 108303 -498948
5085 167248 86004 -361928 -371022 131524 244382 -133693 -141376 -2351 -158929 -91561 259648
5073 305407 202872 281274 -402066 27937 -266989 124835 39251 -145047 -126705 -275855
5063 -275855 253525 178973 -40917 200105 -89560 -240728 133940 396184 290576 -139080
5052 148410 97609 -48654 -205934 -37890 205591 149876 -143982 279825 -131104 70965 77137
5041 77137 -84897 -314674 75204 -174022 13924 200501 51035 -76715 -212722 -196793 -326876
5030 -326876 -135133 41780 -21644 284126 -96050 120670 436647 -105196 -105018 29890 76675
5019 76675 -78110 -220621 -27070 4536 137248 170830 330873 -199631 24674 -168268 -66785
5007 -149131 8868 27351 323925 -5919 -77187 45333 -103832 320379 270317 340611 130194
4995 -261603 -231643 -143938 -240606 13086 165372 -156214 -99515 -89544 -106858 -23775 2277 -328728
4982 87634 -77583 289541 -266402 -54303 -164383 -350749 -265775 -22435 87137 -94739 -239834
4971 -239834 -150713 -121473 104165 436796 -188350 57046 -140822 -265622 157428 -35499
4960 -209974 -200240 27402 191775 -4879 -29585 -123160 17068 134590 -185671 345994 123354
4948 -27651 55593 62995 378457 411947 -107032 -6947 182804 -1533 295297 -22349 -156155
4937 -156155 -152238 169466 -72599 -149802 282368 419479 -328031 -49648 -30737 -95594 -137809
4926 -137809 -15826 -282065 288231 -123520 -14 263387 217164 128781 69768 140787 180627
4915 180627 -249684 175416 54765 73642 898 -163244 -175170 -253826 6523 -229760 -21060
4903 111068 383067 13411 178918 59332 467634 -120010 -173331 266862 193304 34858 -8893
4891 53669 -210470 306569 -82296 176983 330360 -15982 -104189 -298770 -96445 370846 -60760
4879 -231733 -66112 441922 -86463 -213125 94866 -171060 97389 195321 262636 -30267 -124010
4868 -124010 -229633 183689 -231357 -164190 -39027 -79423 -138044 -216972 57986 -100030 -280149
4857 -280149 50447 -210490 -145146 -277638 132497 -12026 -125942 -246429 -169893 25730 -38648
4845 87820 -55622 -151201 260251 -118346 46002 -426082 158773 -107688 -36828 116616 638267
4834 638267 11461 51671 -180333 30632 -218115 223038 13926 24446 -73262 -175980 -190334
4823 -190334 159359 141326 -78008 83927 87321 -134392 312675 184813 13164 -115493 12702
4811 16644 -15723 -48143 -13977 55865 78510 -63250 145153 42948 368177 -66381 326626
4799 227408 -47269 -23689 -1658 -207071 156470 213888 138173 166727 136196 -39448 -17315
4787 -346029 48791 -349106 -3985 257023 -131024 -275318 337623 80307 -413685 -35195 238779
4775 254230 229397 -272574 156803 -39618 -283145 -110998 300819 -157045 -31475 -102767
4765 -102767 -272009 1436 149762 176041 -216561 166305 -221252 -139670 168903 -117514
4754 -10083 392706 114094 -45863 62095 10744 183952 151154 96505 -78182 39200 -185413
4742 182107 -14970 27309 144079 -208981 -101272 -85660 -123221 24806 -338414 225671 139600
4731 139600 -97471 -190564 73516 -81618 131389 176712 81343 -154150 30630 -64101 90427
4719 -183384 301906 -213282 93714 36767 15891 -180180 88900 59103 26258 -14494 265973
4707 -25863 59306 120639 31371 121846 283586 32067 -115013 -343830 10645 -172163 149995
4695 -207132 -28487 129280 248883 12979 375452 279200 -66308 -248387 133255 53790 -96372
4683 82001 -64937 -55849 33902 -19423 108368 -265285 5705 45665 37482 -173628 50522 280817
4671 280817 69743 117838 -8037 39594 129222 -380619 12965 141182 119919 13604 -56174
4659 460769 47374 -149106 -51232 141566 -76890 370569 -3627 29835 110443 -385547 49371
4647 -152344 -187354 368059 -112651 103247 80590 123585 79378 -295101 -97681 -107484 209931
4635 197279 226693 -171515 175387 -111551 -396044 -265024 -90150 169951 157378 215508
4625 215508 55468 112264 -31346 52546 233237 -91837 224669 -75803 13031 -158194 -139828
4614 -139828 -76288 -32640 -74447 138860 -158499 251316 5056 27328 186210 -239592 -11711
4602 -326897 158657 -32429 -132250 206428 53942 108857 -94071 -149048 -34957 153788 130357
4591 130357 64123 17483 360652 420579 205082 -183734 268284 -546876 -57566 152086
4580 66656 -11740 218501 66315 190501 -299651 -237779 -133070 -155003 -51932 -103589 124359
4568 -16182 253733 -26747 184225 -449934 595416 199065 -4668 465069 18011 7474 261321
4557 261321 -50461 -60690 47968 27619 -135161 -104637 18651 100164 -357895 165884 -203745
4545 -72132 198893 198540 34551 -10726 72864 -234966 58591 -84388 -408750 54515 -107683
4533 202205 -159128 26071 -111268 41169 95040 33310 75974 71319 273502 -42272 -214957
4522 -214957 139971 -328768 34233 178738 -83460 -86743 48589 391562 -89770 108229 -7075
4510 18790 -131845 132870 96388 -63409 -125398 84836 -358145 23792 -59084 -142395 -1585
4498 7290 -11923 -347356 -244238 -44812 161192 118334 77427 303717 -1313 -215861 -126334
$$ [...]
##END NTUPLES=NMR SPECTRUM
##END=
