
##TITLE=AC1234_TANRS11078_6524953_RxOd57RpQz
##JCAMPDX= 6.0         $$ Bruker NMR JCAMP-DX V2.0
##DATA TYPE= NMR SPECTRUM
##DATA CLASS= NTUPLES
##ORIGIN= BRUKER
##OWNER= Administrator
$$ 1.72 TOPSPIN		Version 2.1
$$ 2012-07-15 01:16:56.015 -0500  Administrator@TOPSPIN
$$ Compression mode = diff/dup
##.OBSERVE FREQUENCY= 400.02188249412
##.OBSERVE NUCLEUS= ^1H
##.ACQUISITION MODE= SIMULTANEOUS (DQD)
##.ACQUISITION SCHEME= undefined
##.AVERAGES= 8
##.DIGITISER RES= 22
##SPECTROMETER/DATA SYSTEM= spect
##.PULSE SEQUENCE= zg30
##.SOLVENT NAME= COFFEE_meoh
##.SHIFT REFERENCE= INTERNAL, COFFEE_meoh, 1, 14.98509
##AUDIT TRAIL= $$ (NUMBER, WHEN, WHO, WHERE, PROCESS, VERSION, WHAT)
$$ ##TITLE= Audit trail, TOPSPIN		Version 2.1
$$ ##JCAMPDX= 5.01
$$ ##ORIGIN= Bruker BioSpin GmbH
$$ ##OWNER= Administrator
$$ $$ C:\Bruker\TOPSPIN/data/COFFEE/nmr/AC1234_TANRS11078_6524953_RxOd57RpQz/10/pdata/1/auditp.txt
$$ ##AUDIT TRAIL=  $$ (NUMBER, WHEN, WHO, WHERE, PROCESS, VERSION, WHAT)
(   1,<2012-07-15 01:16:49.375 -0500>,<Administrator>,<TOPSPIN>,<go>,<TOPSPIN 2.1>,
      <created by zg
	started at 2012-07-15 01:15:42.906 -0500,
	POWCHK enabled, PULCHK disabled,
       configuration hash MD5:
       6B 1B 68 BB D9 2E 58 E2 7F 35 AD 54 07 DF 0E 41
       data hash MD5: 64K
       40 A5 C5 EC 7F BD 07 29 59 47 14 62 A3 62 27 05>)
(   2,<2012-07-15 01:16:51.968 -0500>,<Administrator>,<TOPSPIN>,<proc1d>,<TOPSPIN 2.1>,
      <Start of raw data processing
       efp LB = 0 FT_mod = 6 PKNL = 1 PHC0 = 0 PHC1 = 0 SI = 32K 
       data hash MD5: 32K
       F5 5B 46 6D EE 7C D2 F8 D2 D7 4B C7 24 AC 55 2F>)
(   3,<2012-07-15 01:16:52.375 -0500>,<Administrator>,<TOPSPIN>,<proc1d>,<TOPSPIN 2.1>,
      <pk PHC0 = 174.4519 PHC1 = 0 
       data hash MD5: 32K
       B2 20 05 F4 4B 3C 34 48 F0 3C DE 3E AB F6 6B B7>)
(   4,<2012-07-15 01:16:52.453 -0500>,<Administrator>,<TOPSPIN>,<proc1d>,<TOPSPIN 2.1>,
      <abs ABSG = 1 
       data hash MD5: 32K
       26 4F C4 84 A1 57 CF 83 64 1A F8 76 F2 9C 6E CE>)
(   5,<2012-07-15 01:16:52.484 -0500>,<Administrator>,<TOPSPIN>,<proc1d>,<TOPSPIN 2.1>,
      <abs ABSG = 2 
       data hash MD5: 32K
       EA 1E C8 D3 43 1C BF 61 5C 65 FE 42 2E 7C 8A C1>)
(   6,<2012-07-15 01:16:52.515 -0500>,<Administrator>,<TOPSPIN>,<proc1d>,<TOPSPIN 2.1>,
      <abs ABSG = 3 
       data hash MD5: 32K
       20 CB FF 7B 57 A5 D4 D5 50 2C 66 CE F1 B8 B6 69>)
(   7,<2012-07-15 01:16:52.546 -0500>,<Administrator>,<TOPSPIN>,<proc1d>,<TOPSPIN 2.1>,
      <abs ABSG = 4 
       data hash MD5: 32K
       54 59 30 33 5E FC 66 8C B6 15 92 0D C6 DA 17 DB>)
(   8,<2012-07-15 01:16:52.578 -0500>,<Administrator>,<TOPSPIN>,<proc1d>,<TOPSPIN 2.1>,
      <abs ABSG = 5 
       data hash MD5: 32K
       68 02 7D 56 E8 5F 5C 76 44 1B 15 50 7E 66 9D C6>)
$$ ##END=
$$ 
$$ $$ hash MD5
$$ $$ 8F 4A BB 1C 02 2E 39 5A 9D 3A E3 FD A9 38 37 3B
##$RELAX= 
##$RELAX= 
##$RELAX= 
##$RELAX= 
##$RELAX= 
##$RELAX= 
##$RELAX= 
$$ Bruker specific parameters
$$ --------------------------
$$ [...]
##$TP= (0..7)
150 150 150 150 150 150 150 150
##$TP07= 0
##$TPNAME0= <>
##$TPNAME1= <>
##$TPNAME2= <>
##$TPNAME3= <>
##$TPNAME4= <>
##$TPNAME5= <>
##$TPNAME6= <>
##$TPNAME7= <>
##$TPOAL= (0..7)
0.5 0.5 0.5 0.5 0.5 0.5 0.5 0.5
##$TPOFFS= (0..7)
0 0 0 0 0 0 0 0
##$TUNHIN= 0
##$TUNHOUT= 0
##$TUNXOUT= 0
##$USERA1= <user>
##$USERA2= <user>
##$USERA3= <user>
##$USERA4= <user>
##$USERA5= <user>
##$V9= 5
##$VALIST= <valist>
##$VCLIST= <CCCCCCCCCCCCCCC>
##$VD= 0
##$VDLIST= <DDDDDDDDDDDDDDD>
##$VPLIST= <PPPPPPPPPPPPPPP>
##$VTLIST= <TTTTTTTTTTTTTTT>
##$WBST= 2048
##$WBSW= 25
##$XGAIN= (0..3)
0 0 0 0
##$XL= 0
##$YL= 0
##$YMAX_a= 507033
##$YMIN_a= -638118
##$ZGOPTNS= <>
##$ZL1= 120
##$ZL2= 120
##$ZL3= 120
##$ZL4= 120
##$ABSF1= 14.98509
##$ABSF2= -5.573092
##$ABSG= 5
##$ABSL= 3
##$ALPHA= 0
##$AQORDER= 0
##$ASSFAC= 0
##$ASSFACI= 0
##$ASSFACX= 0
##$ASSWID= 0
##$AUNMP= <proc_prof1d_extract_pilot.lims>
##$AXLEFT= 0
##$AXNAME= <>
##$AXNUC= <1H>
##$AXRIGHT= 0
##$AXTYPE= 0
##$AXUNIT= <>
##$AZFE= 0.1
##$AZFW= 0.1
##$BCFW= 0
##$BC_mod= 0
##$BYTORDP= 0
##$COROFFS= 0
##$CY= 15
##$DATMOD= 1
##$DC= 0
##$DFILT= <>
##$DTYPP= 0
##$F1P= 0
##$F2P= 0
##$FCOR= 0.5
##$FTSIZE= 32768
##$FT_mod= 6
##$GAMMA= 0
##$GB= 0
##$INTBC= 1
##$INTSCL= 1
##$ISEN= 128
##$LB= 0
##$LEV0= 0
##$LPBIN= 0
##$MAXI= 10000
##$MC2= 0
##$MEAN= 0
##$ME_mod= 0
##$MI= 0
##$NCOEF= 0
##$NC_proc= -8
##$NLEV= 6
##$NOISF1= 0
##$NOISF2= 0
##$NSP= 0
##$NTH_PI= 0
##$NZP= 0
##$OFFSET= 14.98509
##$PC= 1
##$PHC0= 174.4519
##$PHC1= 0
##$PH_mod= 1
##$PKNL= yes
##$PPARMOD= 0
##$PPDIAG= 0
##$PPIPTYP= 0
##$PPMPNUM= 2147483647
##$PPRESOL= 1
##$PSCAL= 4
##$PSIGN= 0
##$PYNMP= <proc.py>
##$REVERSE= no
##$SF= 400.02
##$SI= 32768
##$SIGF1= 0
##$SIGF2= 0
##$SINO= 400
##$SIOLD= 32768
##$SPECTYP= <>
##$SREGLST= <1H.CDCl3>
##$SSB= 0
##$STSI= 32768
##$STSR= 0
##$SW_p= 8223.68421052631
##$SYMM= 0
##$S_DEV= 0
##$TDeff= 65536
##$TDoff= 0
##$TI= <>
##$TILT= no
##$TM1= 0
##$TM2= 0
##$TOPLEV= 0
##$USERP1= <user>
##$USERP2= <user>
##$USERP3= <user>
##$USERP4= <user>
##$USERP5= <user>
##$WDW= 1
##$XDIM= 32768
##$YMAX_p= 477285466
##$YMIN_p= -660365
##$CURPLOT= <Network HP LaserJet P1505>
##$CURPRIN= <$Network HP LaserJet P1505>
##$DFORMAT= <normdp>
##$LAYOUT= <+/1D_H.xwp>
##$LFORMAT= <normlp>
##$PFORMAT= <normpl>
##$SURQMSG= 1
$$ End of Bruker specific parameters
$$ ---------------------------------
##NTUPLES= NMR SPECTRUM
##VAR_NAME=  FREQUENCY,     SPECTRUM/REAL,   SPECTRUM/IMAG
##SYMBOL=    X,             R,               I
##VAR_TYPE=  INDEPENDENT,   DEPENDENT,       DEPENDENT
##VAR_FORM=  AFFN,          ASDF,            ASDF
##VAR_DIM=   32768,         32768,           32768
##UNITS=     HZ,            ARBITRARY UNITS, ARBITRARY UNITS
##FACTOR=    0.250966925370066, 1,           1
##FIRST=     8223.43324360094, 81080,        31249
##LAST=      0,             -19439,          21115
##MIN=       0,             -660365,         0
##MAX=       8223.43324360094, 477285466,    0
$$ Real data points
##PAGE= N=1
##DATA TABLE= (X++(R..R)), XYDATA
$$ [...]
19523a43733f8329l60690f8294j04961C0224N3842b84759a06606L5932m6154J9327
19512i7501A60598J578A3643c22359R9529A10102a40727c3940l439k30265i8320
19500A35826h8727j16627g5025j10977C9431a23276K5178k48141B27900a87261
19489h4012d0936k49744b0296C10930I0355a30491M3822C05253c086A29453c3615
19477e8091j83576p7123e327k87441a30193B9664P5781A9503c58259P3052G3346
19465b45887P3176f3310q437n4850a4533H26d2520q212q9235k56454J58731A69291
19452G4537M1909c2167j37770H5352K33328B0587b6687C94123a97213L092q1818
19441b75939h1488B22231b52677A30577b3452G5365b30333n6084O8784J8756k0164
$$ plain form
19523 -143733 -68329 -429019 -68294 -173255 30224 84066 -284759 -106606 -70674 -116828 -97501
19512 -97501 160598 162176 13643 -322359 -222830 110102 -140727 -33940 -37379 -267644 -98320
19500 135826 -88727 -205354 -75025 -186002 39431 -123276 -98098 -346239 227900 -187261
19489 -84012 -40936 -290680 -20296 310930 90355 -130491 -86669 305253 -3086 129453 -33615
19477 -58091 -241667 -318790 -5327 -292768 -130193 29664 105445 19503 -358259 -285207 73346
19465 -245887 -172711 -63310 -71747 -126597 -14533 826 -42520 -50732 -139967 -396421 -237690 169291
19452 74537 116446 -32167 -169937 85352 318680 20587 -26687 394123 -197213 -194121 -275939
19441 -275939 -81488 222231 -252677 130577 -23452 75365 -230333 -286417 -217633 -198877 -219041
19430b19041C4201a94266k4641h9610r2512e4951j51090A27723e7485j9535j67200
19419b44220P3282b9714G5784K70626d9886A4702c9551a7898k97975O3191C6735
19407b40435g1054j06505C6532a94023P2598n9974P3745b4432D4681R8304n531
19396A37454e8707j81367C9688J5795a39698m6223D11034c89966a15015j99755
19386c14770E4291a29731c0609j64725G6802b38087i3503b9055k2863k11439b3512
19374A13050J67816b4434m1989l0143B8261e8684A97771a4515A84648M0783k5431
19363B00000f0794j61622Q6251b910D9615e451l46822B12905a00810l62925B5189
19351i2793j95443a12194C8220a35809A95299c34149F1151J65467K19909a16001
$$ plain form
19430 -219041 34201 -194266 -218907 -89610 -182122 -54951 -206041 127723 -57485 -77020 -244220
19419 -244220 -170938 -29714 75784 346410 -49886 14702 -39551 -17898 -315873 -252682 36735
19407 -240435 -71054 -177559 36532 -194023 -121425 -181399 -107654 -24432 44681 142985 137454
19396 137454 -58707 -240074 39688 55483 -139698 -185921 411034 -389966 -115015 -314770
19386 -314770 54291 -129731 -30609 -195334 76802 -238087 -93503 -29055 -51918 -263357 -23512
19374 113050 280866 -24434 -66423 -96566 28261 -58684 197771 -14515 184648 225431 200000
19363 200000 -60794 -222416 -136165 -2910 49615 -5451 -352273 212905 -100810 -463735 25189
19351 -92793 -288236 -112194 38220 -135809 195299 -334149 61151 226618 446527 -116001
19340A4897J46908b66739g2709j39128k30037a44802B96173H2498b0632j88910
19330b09542P2494B05951r3218i3379c6763B66752b15931k2457B17010b9035C50267
19318a77100P6747j60736Q4450E025b44277A02673b15956q7776b8720K156q0844
19307a07408I5294m0528M5060A9152a47037O6935K9828n3745I659a88958F8222
19295A31309b0089j26772E9256d60229J93304C59384e2885E2623i7713j80403
19285b78116a4713j90251d6862r5571O9389J109k26982h9885A73145p0409j435
19274A01301a05653A25237i8492j97372g7150B57453H0926d35361a41649D3224
19263F8326J02864a40613m97166a88992C9818A4892c14781L4198R1460O7305q0258
$$ plain form
19340 14897 161805 -266739 -72709 -211837 -441874 -144802 296173 82498 -20632 -209542
19330 -209542 -137048 205951 112733 -93379 -36763 266752 -215931 -238388 217010 -29035 350267
19318 -177100 -100353 -261089 -176639 5025 -244277 102673 -215956 -303732 -28720 -26564 -107408
19307 -107408 95294 54766 99826 19152 -147037 -80102 -50274 -104019 9659 -188958 68222
19295 131309 -20089 -146861 59256 -460229 -266925 359384 -52885 52623 -97713 -278116
19285 -278116 -14713 -204964 -46862 -142433 -73044 -71935 -298917 -89885 173145 102736 101301
19274 101301 -105653 125237 -98492 -295864 -77150 257453 80926 -435361 -141649 43224
19263 68326 171190 -140613 -637779 -188992 39818 14892 -314781 -280583 -189123 -121818 -202076
19252b02076K594m2691l1717q7920a55763f7103B96229b8057j41128d1056k02630
19241b43686d4691F8835b18086A87231a56051c9531k34212A87070b01298D2763
19230i1109G4830d1910H8469a30601F6701a98306m44j25796D340a32759k6359
19219a59118a4381l3454b408r3603J4377J8906K945j43488E1572a19319A30445
19207b94535a18599j61475a23185B5827m803J53772D4029b18508A60228C2000
19196d0413B04857a00627L7643k15277A80803a24684A36910a65907k0689a4082
19185G1545a84073L5894l52893E2168J39984G5851g3114j62923i3504C12744D9019
19173A65790D7527a21808j07496J00157M1535D8069b89243A76427F7910c65544
$$ plain form
19252 -202076 -199482 -242173 -273890 -361810 -155763 -67103 296229 -28057 -169185 -41056 -243686
19241 -243686 -44691 68835 -218086 187231 -156051 -39531 -273743 187070 -201298 42763
19230 -91109 74830 -41910 88469 -130601 66701 -198306 -198750 -324546 4340 -132759 -159118
19219 -159118 -14381 -47835 -2408 -96011 -81634 -62728 -59783 -203271 51572 -119319 130445
19207 -294535 -118599 -280074 -123185 25827 21024 174796 44029 -218508 160228 32000
19196 -40413 204857 -100627 -62984 -278261 180803 -124684 136910 -165907 -186596 -14082
19185 71545 -184073 -148179 -501072 52168 192152 75851 -73114 -236037 -93504 312744 49019
19173 165790 47527 -121808 -229304 -129147 -87612 48069 -289243 176427 67910 -365544
19162B4896e0109C12697a4205r4918m2759J7218n6362A3325J35735j009p3189
19151G4862n441O5606J17276b30655i7950A10673b4535l93760I9587B9234f3768
19139A44286b70677B21198d3618k82981a62891B02835m9909K2073a39170f551
19128b09033A06269b43967a1430q6093j80645O8434A79111C1035J53223n8863
19118A25395J40212b25024R5820C85346c8319k85247H255c1058p9437j46120p1445
19107c28060D6421g8084r1702A48032B4001J01659a03374m3248c8882j86326A33920
19095c09521i738j06537A74248c04190B05956a7170k6428B542h5594k71354a31191
19083E3481b52913J10420A8755K9432a03016d0126A13786l0711k8389b51343A52241
$$ plain form
19162 24896 -50109 312697 -14205 -109123 -151882 -134664 -191026 13325 149060 148051 74862
19151 74862 69421 135027 252303 -230655 -97950 110673 -24535 -418295 99587 29234 -63768
19139 144286 -270677 221198 -43618 -326599 -162891 202835 152926 174999 -139170 -6551
19128 -209033 106269 -243967 -11430 -97523 -278168 -209734 179111 31035 184258 125395
19118 125395 265607 -225024 -129204 385346 -38319 -323566 8255 -31058 -110495 -256615 -328060
19107 -328060 46421 -78084 -169786 148032 24001 125660 -103374 -146622 -38882 -225208 133920
19095 -309521 -9738 -116275 174248 -304190 205956 -17170 -43598 2542 -85594 -356948 -131191
19083 53481 -252913 -142493 18755 48187 -103016 -40126 113786 83075 54686 -251343 152241
19071d3848f438C06201a61021F689a44703q8462G2241f160I7287P842a96016O9877
19059a26139e1750D1514H904a37483D311K30709a11939A2131a53898I4747j8257
19048G6490b25588B68158j12548c43121B71721c51197d8121A33984J79882g6412
19037A91342d10285K01248r4801D9526Q4915C9243J15294c9434j45215B09742
19026f1044l81847B15113D6692b34434c7099d217B31929j15684a15800k59158
19016c74958A12972a29571e3114q005E3024K9081b3436r9163r0966K4025a5363
19004a59400e9952B60082j3950E9602J39451h4377j78065D3448b24837J3358B37170
18992c47250B44436f4708A80935a30869j3987o384j32513a12725m2557M2995A83838
$$ plain form
19071 -43848 -6438 306201 -161021 6689 -144703 -233165 72241 -6160 97287 105129 -196016 -126139
19059 -126139 -51750 41514 8904 -137483 4311 235020 -111939 12131 -153898 94747 76490
19048 76490 -225588 268158 155610 -343121 271721 -351197 -48121 133984 313866 -76412
19037 191342 -410285 -209037 -303838 49526 134441 39243 154537 -39434 -184649 209742
19026 -61044 -442891 215113 46692 -234434 -37099 -4217 231929 116245 -115800 -374958
19016 -374958 112972 -129571 -53114 -61119 53024 82105 -23436 -122599 -213565 -189540 -15363
19004 -159400 -59952 260082 246132 59602 199053 -84377 -262442 43448 -224837 -211479 237170
18992 -347250 244436 -64708 180935 -130869 -144856 -151240 -283753 -112725 -155282 -112287 183838
18980i8396D725b48343A40352K4044c52924j73553b14865A37126o3161l5723b50939
18968a3325p4469G1057a99247C28027g8641C8148f4762A33992J9758m747i7723
18956a71049D17133d32962A55289h778A97315a33591r3935J02051c3690j82615
18946b16305C7202d8872a4214B43521b9370A93084d030H5791b11349B2023a32967
18934e9959J7009A11843N5504o8758k8774M20307I686N2343c36483f4821A62961
18922A14367d49945E8422Q251c9475b131l08351g603k08951k22559e319j36547
18911a41866B6349b62467J09942j15347i0717j37407J11049m9773E1421a51711
18900B8299c6698r3124B57450i3540q4780N7053C58776b43397C19153a01760B17005
$$ plain form
18980 -98396 4725 -248343 140352 164396 -352924 -526477 -214865 137126 73965 38242 -250939
18968 -13325 -87794 71057 -199247 328027 -78641 38148 -64762 133992 153750 149003 -97723
18956 -171049 417133 -432962 155289 -8778 197315 -133591 -227526 -125475 -33690 -216305
18946 -216305 37202 -48872 -14214 243521 -29370 193084 -4030 85791 -211349 22023 -132967
18934 -59959 -42950 111843 167347 98589 69815 490122 9686 62029 -336483 -64821 162961
18922 114367 -449945 58422 66673 -39475 -2131 -310482 -7603 -216554 -439113 -5319 -141866
18911 -141866 26349 -262467 -152525 -267872 -90717 -228124 -117075 -166848 51421 -151711
18900 28299 -36698 -129822 257450 -93540 -178320 -121267 358776 -243397 319153 -101760 217005
18888a91927B02262I3587d05373G2981a59081A8344a97809q2216J2080L592C1924
18876a37029j60811A83091G3031A6545K4694J39743K80438A40384c29255p9189
18866d08444B525R2776b36293N176l7076J14405I4481a76108N8184j20463b408
18854c19786i1578o8044A32124a52264b4989n5614A88849B8810b38292J12348
18844a25944I5254f64m0381j0014j45387B317J006L3827K3558e3400j45923M9437
18832a49886G1963A1070K01276a49103A77772e5227k74199A087i758B7561a126
18820b24504C9795M3257l8711K47051d9793n7276d2667B59339A23314c004B07740
18808b12424A78478P8145d5241B34427a42042n637J088N4859k22203j7252a59567
$$ plain form
18888 -191927 202262 93587 -405373 72981 -159081 18344 -197809 -280025 -267945 -264353 31924
18876 -137029 -297840 183091 73031 16545 41239 180982 461420 140384 -329255 -408444
18866 -408444 2525 95301 -236293 -231117 -268193 -153788 94481 -176108 -117924 -238387 -2408
18854 -319786 -91578 -159622 132124 -152264 -24989 -80603 188849 28810 -238292 -125944
18844 -125944 95254 -664 -41045 -51059 -196446 2317 3323 37150 60708 -53400 -199323 -149886
18832 -149886 71963 11070 212346 -149103 177772 -55227 -329426 1087 -9758 27561 -1126
18820 -224504 39795 83052 44341 291392 -49793 -107069 -42667 259339 123314 -3004 207740
18808 -212424 178478 256623 -45241 234427 -142042 -147679 -146591 -91732 -313935 -331187 -159567
18796A47208P6602q1787F7890c84681H2901a82776M174C5306d69069b10791i8694
18784a61754Q0726j60702j24973A78595o7321E2924a48795B12712c10032q0484
18774c90516i3056A12382J07614i0565I0879L9016n7188J69820b60200Q9547L8316
18763a32337d2825j15225E5558P6058b78480C1015b07751g1778j15864I3205a5581
18751A57084a39040B21591C5028a1428k45251J17083A30277g0605l3125B202b75143
18739B051M0505M3204d7801A17848a69885A69146e1287C1543a37171r2481a07653
18727B35072a38540L0189G4055a19707d3640k08517f1800l3813H8941B6568b49017
18715c76957A54375k0311J11769B2928a9039A83749g7510L1923k16941A35742
$$ plain form
18796 147208 223810 142023 67890 -384681 82901 -182776 -178602 35306 -469069 -210791 -98694
18784 -161754 -81028 -241730 -366703 178595 111274 52924 -148795 212712 -310032 -390516
18774 -390516 -93056 112382 219996 -90565 90879 129895 72707 242527 -260200 -170653 -132337
18763 -132337 -42825 -158050 55558 131616 -278480 31015 -207751 -71778 -187642 93205 -15581
18751 157084 -139040 221591 35028 -11428 -256679 -139596 130277 -70605 -103730 2202 -275143
18739 2051 42556 85760 -47801 117848 -169885 169146 -51287 31543 -137171 -229652 -107653
18727 235072 -138540 -108351 74055 -119707 -43640 -252157 -61800 -95613 88941 26568 -249017
18715 -376957 154375 134064 245833 22928 -19039 183749 -77510 -45587 -262528 135742
18704B53955k2110e964j94415G2229h1095j3488j23306B26497a82679b9691H0501
18692A58644a76398K56m9858A09571D7076J73116R36a05256j0443A78276b28816
18680a02701j3587B1902J00596P01a80578C4846J74745i1435F6830a50946k34702
18669c85648a23938B16104B3666h9110l89639h517m9010j10562j10999J08382
18659a70706g84l62233A61674b47818D2751a4333l66086J49297A40026E4348a79550
18647b39372a09495k94678J89793g578A35330c90851J16917A68126c43273A9112
18636B21312B9891c03831J28001I7383a04208B1805i2723A39829D4786L00834
18626C45620j22028h6284I3351a73251k386B5572Q492a22749j9881j26146c78
$$ plain form
18704 253955 231845 -5964 -200379 72229 -81095 -94583 -217889 226497 -182679 -29691 80501
18692 158644 -176398 -176142 -226000 109571 47076 220192 221128 -105256 -115699 178276 -228816
18680 -102701 -116288 21902 122498 123199 -180578 34846 209591 -91435 66830 -150946 -385648
18669 -385648 -123938 216104 23666 -89110 -478749 -8517 -57527 -168089 -279088 -170706
18659 -170706 -784 -363017 161674 -247818 42751 -14333 -380419 -231122 140026 54348 -179550
18647 -239372 -109495 -404173 -214380 -7578 135330 -390851 -273934 168126 -343273 19112
18636 221312 29891 -303831 -175830 97383 -104208 21805 -92723 139829 44786 345620
18626 345620 223592 -86284 93351 -173251 -175637 25572 34064 -122749 -142630 -268776 -378
18614a87451j8563j29821J28363K9921a9677A7552b81479A20957k2043f3886j13575
18603a77461B61171b41945D7058c79210f3222B2009h5638k21004A7890f2007m075
18592f6082H0679d6228j31387q5192F8348a95180M188e9903j2738B88726a56005
18580f0836B61324c1744I2854c76391A3333a85507D7619J09276a84843O3021B1628
18568B0951a43351c7721m1807l05658a44306j2827f9456p42H1016A7132c14771
18556F6512Q5605c35306f8515k2437H6187a16727D22383a5207B13194A1707a52873
18544b56451A15884a38101B8256a35557d8640A14498E2125e1009F4669a88058
18533i3092k39743C05117a36017G6475l1711J83977a1513k0928q2102q220A91892
$$ plain form
18614 -187451 -206014 -335835 -207472 -177551 -19677 17552 -281479 120957 98914 -63886 -177461
18603 -177461 261171 -241945 47058 -379210 -63222 22009 -85638 -306642 17890 -62007 -66082
18592 -66082 80679 -46228 -177615 -262807 68348 -195180 -190992 -59903 -72641 288726 -156005
18580 -60836 261324 -31744 92854 -376391 13333 -185507 47619 156895 -184843 -121822 21628
18568 20951 -143351 -37721 -79528 -385186 -144306 -157133 -69456 -70198 81016 17132 -314771
18556 66512 152117 -335306 -68515 -90952 86187 -116727 422383 -15207 213194 11707 -152873
18544 -256451 115884 -138101 28256 -135557 -48640 114498 52125 -51009 64669 -188058
18533 -93092 -332835 305117 -136017 76475 44764 228741 -11513 -32441 -114543 -122763 191892
18521b06856i634k53434J06584I4886l0175b78764N3054b5887p7935B67066m7039
18510B20027a78716C0014a91664j80473A78852b93529D1672b013D843K84779E2407
18498b66038J21961B2137J11593C3263K4382C325a31217i90l42075J55180o0874
18487b48759O7551q6706B19133c1341k16788L01O8712b1647k05006F2194B9660
18475C9946b02814e4746k43831a11327B445f7260E2776L5089J95657j02732j1590
18464A69200b40277A985J62610P2497j04948o3084M5187j2797B9966c3895k43762
18453b77657q884j10142g3070G0507g0966B23711g9208H0395L8207a80948C1121
18441g4045a330k53560A7417a26407J2859j6805A80455e1647j79148C04937G308
$$ plain form
18521 -206856 -9634 -263068 -156484 94886 64711 -278764 -225710 -25887 -103822 267066 220027
18510 220027 -178716 30014 -191664 -372137 178852 -293529 41672 -2013 4843 289622 52407
18498 -266038 -144077 22137 133730 33263 57645 3325 -131217 -990 -343065 -187885 -248759
18487 -248759 -181208 -267914 219133 -31341 -248129 -247828 -179116 -21647 -226653 62194 29660
18475 39946 -202814 -54746 -298577 -111327 2445 -67260 52776 87865 283522 180790 169200
18464 169200 -240277 1985 164595 237092 132144 69060 114247 101450 29966 -33895 -277657
18453 -277657 -286541 -396683 -73070 70507 -70966 223711 -79208 80395 118602 -180948 31121
18441 -74045 -1330 -254890 17417 -126407 -113548 -130353 180455 -51647 -230795 304937 7308
18429E1408J009j5704A5861b09197K6949P1043k0558A08767c57812a48676L044
18418a45632D0880K93241C7101a10724A11163b52388g379C21857G0281g1763B8785
18406b8179B13704F9287g7963D2958b59412a3461o7310B4469J65870i998k80304
18395b90302d0146m40243g7032m04299b0673A09094b39137j2525R462d2240l04616
18384c46856B65268c08471a53125H0412G913d91099b09436j07207G214a26933
18373A69322O6149a3957j02480j35498I1045a48418m5524G8985a8456j7140j94401
18362b29997F9682K2982b63021g5270r2862k20988a10821L6289A09535a59915
18351A42385E730P4607a62442A34218Q4504I6735a32670B1307c18042J01865N519
$$ plain form
18429 51408 52417 36713 15861 -209197 -182248 -111205 -131763 108767 -357812 -148676 -145632
18418 -145632 40880 334121 37101 -110724 111163 -252388 -7379 321857 70281 -71763 28785
18406 -28179 213704 69287 -77963 42958 -259412 -13461 -80771 24469 190339 -9998 -290302
18395 -290302 -40146 -480389 -77032 -481331 -20673 109094 -239137 -251662 -242200 -42240 -346856
18384 -346856 265268 -308471 -153125 80412 7913 -491099 -209436 -316643 7214 -126933
18373 169322 235471 -13957 -116437 -251935 91045 -148418 -193942 78985 -18456 -35596 -229997
18362 -229997 69682 92664 -263021 -75270 -168132 -389120 -110821 -74532 109535 -159915
18351 142385 5730 80337 -162442 134218 218722 96735 -132670 21307 -318042 -216177 -210658
18340b10658j00394g6711a4941n15917C08936G7754Q0916a83426i701k00681O0859
18329a49523c1000j05980B07774j2069c92677I4174c5220A02650L7657a81089
18318b16628B25505i6535k58420A47371b68772J02600A66349c59803F0232i603
18307b31881I7965c0961J2402A51669F9230e6877l17151A45106f4274r4909A634
18295a42754M3397o7776C29685j32120b36236E9630a52739c3191I3166d1369A00444
18283B8313J04897a84172F76a51405a2751B17007G151i9996D12100j98132C0048
18271A58224R6082M6224j24523P7409A16897b74573A34105M9424M5531G4001j4058
18260E9943b60935j18877C006a02252l9102M8602l1172A1111N3297a70950a1816
$$ plain form
18340 -210658 -311052 -76711 -14941 -530858 308936 77754 158670 -183426 -9701 -210382 -149523
18329 -149523 -31000 -136980 207774 195705 -392677 94174 -35220 102650 140307 -181089
18318 -216628 225505 -96535 -354955 147371 -268772 -166172 166349 -359803 60232 -9603
18307 -231881 97965 -30961 -18559 151669 69230 -56877 -374028 145106 -64274 -159183 1634
18295 -142754 -99357 -167133 329685 197565 -236236 59630 -152739 -33191 93166 -41369 100444
18283 28313 133210 -184172 676 -151405 -12751 217007 7151 -99996 412100 213968 30048
18271 158224 254306 300530 176007 253416 116897 -274573 134105 183529 229060 74001 59943
18260 59943 -260935 -379812 3006 -102252 -141354 -92752 -123924 11111 64408 -170950 -11816
18248a14075r0453I5704d3973e835k7845q4602A15217M0852m3687a10546M5774
18237f4772m3389E4370a7735j25682A2071a29759j36290A19268J81326m366A24985
18225e5608j15993F9640i8357E1240c33701F9251M16773h5306A42411K45407i9200
18213e0771H5913b05535k59085a376F4884e8708A1233P7100d0871k24557h3651
18201a08560A53638a76356N4175B80M5104g9912K6693C8275K02393a07017C23720
18189B08380a04357A34659R5892j03391C1357K48904F3525b21472a09302L0639
18179g8663k55929R6744k01155C91225E0831J06954a04482p2063A63323J89684
18169C53007a03892B99440d27718a70919a5379E4806Q003J5352d3984j12568k5263
$$ plain form
18248 -114075 -204528 95704 -43973 -5835 -33680 -118282 115217 156069 112382 -110546 -64772
18237 -64772 -108161 54370 -17735 -143417 12071 -129759 -266049 119268 300594 296228 124985
18225 -55608 -171601 69640 -98357 51240 -333701 69251 486024 -85306 142411 387818 -99200
18213 -50771 85913 -205535 -464620 -1376 64884 -58708 11233 88333 -40871 -265428 -83651
18201 -108560 153638 -176356 -122181 280 45384 -79912 -53219 38275 240668 -107017 323720
18189 208380 -104357 134659 230551 127160 31357 280261 63525 -221472 -109302 -78663
18179 -78663 -334592 -237848 -439003 391225 50831 157785 -104482 -176545 163323 353007
18169 353007 -103892 299440 -427718 -170919 -15379 54806 62809 78161 -43984 -156552 -181815
18158a81815p1367i6620H3815K8770b23846B5473A1650J44703C781P0270J12257
18147A86308a71695j56370b4534l5241p6361A77279a57831R13E7570a10864m4107
18136a54971h880q0751l18829a03878j3524m5737E2202J50266d746j77001O7034
18125a14713G5602d5750a9752B39863a91496h7560k54857A17555j2862J44204
18115B48897h2025I3811C1700O1747J03010b02948P9051j72096B65150p0710O4175
18104B58615R5082c80806E0282b14719C2150K31450e5503A95573c69066A77982
18093A2398a17011A90218a16567c5954r6804C52548d7607B14422g8417B12661
18082a09795b6181p5908q6402g9549k1288k8132C425b01355j63061D214L6171
$$ plain form
18158 -181815 -253182 -96620 83815 112585 -223846 25473 11650 156353 3781 74051 186308
18147 186308 -171695 -328065 -24534 -59775 -136136 177279 -157831 -156918 57570 -110864 -154971
18136 -154971 -8880 -89631 -408460 -103878 -117402 -163139 52202 202468 -4746 -181747 -114713
18125 -114713 75602 -45750 -19752 239863 -191496 -87560 -342417 117555 104693 248897
18115 248897 -82025 93811 31700 93447 196457 -202948 -123897 -295993 265150 194440 258615
18104 258615 353697 -380806 50282 -214719 32150 263600 -55503 195573 -369066 177982
18093 12398 -117011 190218 -116567 -35954 -132758 352548 -47607 214422 -78417 212661
18082 -109795 -26181 -102089 -188491 -79549 -100837 -128969 3425 -201355 -364416 4214 40385
18071D0385b24859h4591G2185f1258A15468B8074a35590B34618A14506a20770
18060A25745J28747a3365C16838c7587a2433C6506g4519o8078e643j03948k5882
18049a35473f1978j16864d8408P697j9934D7160L43844b31926F3621R1925a36687
18037a80051A67919a73899P9830I9080C4778c0349h122k18337d0386o5765k91101
18026c97252H879N5113K20980a8874k61431J25271d9108k57121i5396E3529a29640
18014h3627j10467m0137A85434c46994B01039d35546J07247i5761b6721A28459
18003a564B30774I4085c69382a60759A96372E4664Q2865a56158A4502e8320B44267
17991a70484M3958A90900c85482b7388G6548d6197k84122a5218F6803a9465B33173
$$ plain form
18071 40385 -224859 -84591 72185 -61258 115468 28074 -135590 234618 114506 -120770
18060 125745 254492 -13365 316838 -37587 -12433 36506 -74519 -142597 -5643 -109591 -135473
18049 -135473 -61978 -178842 -48408 -40711 -60645 47160 391004 -231926 63621 155546 -136687
18037 -180051 167919 -173899 -94069 99080 34778 -30349 -8122 -226459 -40386 -106151 -397252
18026 -397252 8879 63992 284972 -18874 -280305 -155034 -49108 -306229 -95396 53529 -129640
18014 -83627 -194094 -234231 185434 -346994 201039 -435546 -328299 -95761 -26721 128459
18003 -1564 230774 94085 -369382 -160759 196372 54664 137529 -156158 14502 -58320 244267
17991 -170484 -126526 190900 -385482 -27388 76548 -46197 -330319 -15218 66803 -19465 233173
17979E6523O0914e63205a17758F1551n515M22128A59697c09363H0003b74342a8114
17967A92768a09461A2991a59058B3285K03903a44482I6870c750C03689p053D9763
17955B62917a86027b9353j15637c5819r8366d7996j0957A5136c00022o4389A73402
17943A35048a83922A80684c6628o8069j93011J20898D4456K69053h5253B46867
17932b02443A03530J89390C5042J52740J56286g9108b9177j86691A91904F5043
17921C80746A14690C5409O6806M0845D3453b02526l8322A4373K89551j02835b36238
17909C17277g7667j0655l1687M6866E5056b79013B21455a16664j46396I4943B1634
17897i0608J9136m0199k9225j91381H1727c4165A04062C548P7403b04663a9546
$$ plain form
17979 56523 117437 -563205 -117758 61551 56036 478164 159697 -309363 80003 -274342 -18114
17967 192768 -109461 12991 -159058 23285 227188 -144482 96870 -3750 303689 296636 49763
17955 262917 -186027 -29353 -144990 -35819 -134185 -47996 -58953 15136 -300022 -364411 173402
17943 135048 -183922 180684 -36628 -104697 -297708 -176810 44456 313509 -85253 246867
17932 -202443 103530 292920 35042 187782 344068 -79108 -29177 -215868 191904 65043
17921 380746 114690 35409 102215 143060 43453 -202526 -240848 14373 303924 201089 -236238
17909 317277 -77667 -88322 -120009 -73143 55056 -279013 221455 -116664 -263060 94943 21634
17897 -90608 -71472 -111671 -140896 -332277 81727 -34165 104062 3548 80951 -204663 -19546
17885G1573j0664i4126A79730a59659p841P6955a9926C072d3694c052k29745e8547
17872i812I9971J30100a67075e9858a7074A46171J51460b27776B23424f0392A77693
17860d3721C44512j33504b4519B9772A1118i4487A3657J26559N8224C2299N8204
17849I0503K5454a42376A64445a61074A68762b33186D1771D485K37273F5657J4798
17838H0455a64095d2706A0035M9465a06040B20845a64398C77738a73132i680F1667
17826c51112a67486l605k46667A85535F1203i6085A34005b66645a13678k46641
17816c60319a31916H7192b06457H376h1903I4856P6746i3472o5712Q509G3906
17804b72303P907C0303B072a20506q9583c5066C8814J16053D023h1444r4164b9913
$$ plain form
17885 71573 60909 -94126 179730 -159659 -167500 -90545 -19926 3072 -43694 -3052 -232797 -58547
17872 -9812 99971 230071 -167075 -59858 -17074 146171 297631 -227776 223424 -60392 177693
17860 -43721 344512 211008 -24519 29772 11118 -94487 13657 140216 198440 32299 90503
17849 90503 115957 -142376 164445 -161074 168762 -233186 41771 4485 241758 65657 80455
17838 80455 -164095 -42706 10035 59500 -106040 220845 -164398 377738 -173132 -9680 61667
17826 -351112 -167486 -171091 -417758 185535 61203 -96085 134005 -266645 -113678 -360319
17816 -360319 -131916 87192 -206457 8376 -81903 94856 171602 -93472 -159184 -150675 73906
17804 -272303 -264396 30303 2072 -120506 -210089 -35066 38814 154867 4023 -81444 -175608 -29913
17791a36591f007E2261d20352A39610O6017l1961o8394K07646o4b79667D2431
17779A67790j7165a42983d7606l5501F1263b3714B07433b6464n5432G6713P0797
17768A47510K22709g224C3302b38414i2138H4962f4638F1769R0424a39185o592
17757a45777E0966J11378J2393l5661j5794j4913a50918D5589a27374H4275k3505
17746F0770H424i8674E2182J7580J65422a37680q6287I7782b7604B57671H3192
17734C3399M8740b31106C0488K2570a64650m514A2613R9572J9746J68150A31287
17722a95056B00261J9744A7127d63043B65299A29545N978a61095B69146r6170
17712A72976N5981e4926g140H1727b08103b7217A6062b3841A14601P1358a93262
$$ plain form
17791 -136591 -6007 52261 -420352 139610 205627 173666 105272 312918 312854 -279667 42431
17779 167790 150625 -142983 -47606 -83107 61263 -23714 207433 -26464 -81896 76713 147510
17768 147510 370219 -7224 33302 -238414 -92138 84962 -64638 61769 152193 -139185 -145777
17757 -145777 50966 162344 174737 139076 123282 108369 -150918 45589 -127374 84275 60770
17746 60770 8424 -98674 52182 69762 235184 -137680 -223967 97782 -27604 257671 83192
17734 33399 82139 -231106 30488 53058 -164650 -169164 12613 112185 131931 300081 131287
17722 -195056 200261 220005 17127 -463043 265299 129545 135523 -161095 269146 172976
17712 172976 228957 -54926 -7140 81727 -208103 -27217 16062 -23841 114601 185959 -193262
17700C47316a15976e0262G3606C103a50046L9341B291R0999b96391i7748k15210
17689c12958a45633A29235K1348a24451d4529k30238f0928D0647A2160j494d4890
17677A03682J85042j06793c43578a45270H6419L11960b52642O0341A03300J11283
17667B14583A03010M2075O0341a52886B71020b14235K3984C19981J742C7180R0438
17656A27618M3615a49815m8450R1655R151B7115c4691D23568g8322L0899m7411
17645i4834c4542o3446B1805i6109j32999B83798c21429d1793o5139A19126K8326
17634A47452d9340J8147H5051k9932A2394a34123E9148J09532D9840c6100C44888
17622a14211b4233j6484A9701B903J36348n4068d9202l580J18b3883C1623K3562
$$ plain form
17700 347316 -115976 -50262 73606 3103 -150046 -110705 2291 93290 -296391 -97748 -312958
17689 -312958 -145633 129235 150583 -124451 -44529 -274767 -60928 40647 12160 10666 -44890
17677 103682 288724 181931 -343578 -145270 86419 398379 -252642 -192301 103300 214583
17667 214583 103010 145085 205426 -152886 271020 -214235 -190251 319981 321723 37180 127618
17656 127618 171233 -149815 -198265 -106610 -97459 27115 -34691 423568 -78322 -47423 -94834
17645 -94834 -34542 -97988 21805 -96109 -229108 283798 -321429 -41793 -106932 119126 147452
17634 147452 -49340 -31193 85051 55119 12394 -134123 59148 168680 49840 -36100 344888
17622 -114211 -24233 -40717 19701 2903 139251 85183 -49202 -52782 -52664 -23883 31623 55185
17610E5185L81022G5219j6887M1598l5893i7029R149H6331O3499c0500A40782
17598a39390N7717j13001f4226q3076O5379C2811L35096a49625D12010a09680
17587I785d45193b432C78735G9436h3523C16018A48906c83185f3250B74297G0763
17575b36345G7766a81606A01462m2718J38230N5505F3134b7532p021A02250a66599
17563a69710a0835A38696n1518p981J93102m1574B5984a98898A36906O743a2121
17551G0346a29410l2765e6500l210B87077a71049g4969G7137a5943C26754b00155
17539h2138j34671J02344H2573A6313J9290M01173a8985A0698f2069K2103A98712
17527B90174a92389A54825J90208b04639G2107J98545P7503a4538H306M58076
$$ plain form
17610 55185 436207 75219 58332 99930 64037 -97029 -87880 86331 149830 -30500 140782
17598 -139390 -81673 -194674 -64226 -147302 -81923 32811 367907 -149625 412010 -109680
17587 9785 -445193 -2432 378735 79436 -83523 316018 148906 -383185 -63250 274297 70763
17575 -236345 77766 -181606 101462 58744 196974 252479 63134 -27532 -34553 102250 -166599
17563 -169710 -10835 138696 87178 79197 272299 230725 25984 -198898 136906 143649 -12121
17551 70346 -129410 -162175 -56500 -59710 287077 -171049 -74969 77137 -15943 326754 -200155
17539 -82138 -216809 -114465 82573 16313 35603 436776 -18985 10698 -62069 -39966 198712
17527 290174 -192389 154825 345033 -204639 72107 270652 348155 -14538 8306 466382
17517D66382H9431J21904k5028d1787A5748a36932A08472C7219i4439B83859j34162
17506A49697J7483J67062F8835j0138L11639g6143j27320g0504B0841J0237J615
17495C2693K13761j5415p6635K84245a51139B50013j19526n7483N9051M4284a99675
17483B31043p5276b27572D21524a86032C05638j46010b30336B45518i6270D16460
17472C14038D1669M14694j61959j44055l8363L3422B3454J15504d1897k5414E1925
17460A88623m7932J54401o0386m0593J2034l858o1213l1408l4777J92826g028
17448C91503K3347q9275P1010j67763J7587J24513P0631B00564p2954L176a16689
17436f113G3740b6795D01515A61967J92947J30893J3035B28317O8200j31871o8799
$$ plain form
17517 466382 89431 211335 186307 -41787 15748 -136932 108472 37219 -94439 283859 149697
17506 149697 167180 334242 68835 58697 370336 -76143 -203463 -70504 20841 31078 32693
17495 32693 246454 231039 154404 438649 -151139 250013 130487 73004 132055 176339 -199675
17483 231043 155767 -227572 421524 -186032 305638 159628 -230336 245518 -96270 416460
17472 314038 41669 456363 294404 150349 111986 145408 23454 138958 -41897 -67311 51925
17460 188623 140691 295092 234706 194113 206147 202289 141076 109668 74891 267717 -7028
17448 391503 414850 325575 396585 228822 246409 370922 441553 200564 127610 130786 -116689
17436 -6113 73740 -26795 401515 161967 354914 485807 498842 228317 296517 164646 95847
17425I5847J09757q1282M2380K5595r4512L76607B18595N8462R4641F9933K90486
17414C60419M478j56033N8310K65868A99928L22777a7049j52152A04082c9423
17403b31703c3078D29578j48614r614M7l9333E1250R9607a04044I6194C5120R3841
17391A28961f9381F338J20851k2519G110J80681J95340A30583M74665f6486c644
17379a25675B09811Q4590A04322M92050a428B43024P400A5814J26168J68219a23421
17367B70019r9698R1893B3720h9580c1792H2258a11296C06175H4513A9350K1321
17356D0671L53984K37581A33738J02629P6229D0158K66308m3780d6882B37496
17345c6695D85419A47420c8660n0743A26362e7495B44840A7119J80738j466F1643
$$ plain form
17425 95847 205604 124322 166702 192297 97785 474392 218595 277057 371698 69933 360419
17414 360419 364897 208864 267174 533042 199928 522705 -17049 -169201 104082 -39423
17403 -231703 -33078 429578 280964 271350 271397 232064 51250 150857 -104044 96194 35120 128961
17391 128961 -69381 6338 127189 104670 7110 187791 383131 130583 605248 -66486 -3644
17379 -125675 209811 294401 104322 596372 -1428 243024 250424 15814 141982 310201 -123421
17367 270019 170321 262214 23720 -89580 -31792 82258 -111296 306175 84513 19350 40671
17356 40671 394655 632236 133738 236367 312596 40158 306466 262686 -46882 237496
17345 -36695 485419 147420 -38660 -89403 126362 -57495 244840 17119 197857 196391 61643
17333A65869n9152K78087E2858M47403k5480C3401M46699B36307a2404A7196c5447
17321B38623r0256A605a60232G2309a11251k55841C10636A8001J39516L4382o1690
17310A30209K80008A29888J75253j38305M4567K09266A83183K3742o1797L35421
17300D80549j16869M3401I1041b6377B43910c0126C341K33664J49017q9967I5526
17288B40850I7643B1895c808C2369K53717F0272J58975H3757L7353I469M12146
17277D21615A6049L76243A71200K01986j19106J13885j33366G0544L05975k1236
17267C55283j29587P5671A29803b9283A75911K31012a52587A30530h0256B14630
17256E2828L98759C9056K38059o9660K2398P2878A41221L14799c6895D05476A21549
$$ plain form
17333 165869 106717 384804 52858 500261 474781 33401 480100 236307 -12404 17196 -35447
17321 238623 148367 1605 -160232 72309 -111251 -367092 310636 18001 157517 191899 130209
17310 130209 410217 129888 305141 166836 211403 420669 183183 206925 145128 480549
17300 480549 363680 407081 91041 -26377 243910 -30126 3341 237005 386022 296055 95526
17288 240850 97643 21895 -3808 32369 286086 60272 219247 83757 121110 9469 421615
17277 421615 16049 392292 171200 373186 254080 367965 234599 70544 376519 355283
17267 355283 225696 301367 129803 -29283 175911 406923 -152587 130530 -80256 214630
17256 52828 451587 39056 277115 207455 229853 302731 141221 456020 -36895 405476 121549
17244B94030n5754C3030L5487J89748M3115H7341J22815c2191q580C89332G5879
17232B26849I9569O8513J65058j22433r9752K74853A8938L4548K50075C7137K82228
17221C19365K84713A30215K67393A36978K61963A65991Q5981L44701k85119J042
17211C12596A47221o903M8365a19882A18625M40103A35115L1554L09804j58670
17201C17803j16991p7857h4537C73735l0489o1113L14035B50330d8026B20813
17190F2877g435D24848j99872L78224A52592L7708K99372j38565j39475L70365
17180E81997k88910A40709l2906J67453p122K66099k06305n5761J9362M7463J39945
17169D78937A64458K79020j45177J8138N4549j56940A2593N06197B42667J33260
$$ plain form
17244 294030 238276 33030 68517 258265 301380 87341 210156 -32191 -40771 389332 75879
17232 226849 99569 168082 333140 210707 110955 385808 18938 53486 303561 37137 319365
17221 319365 604078 130215 397608 136978 398941 165991 251972 596673 311554 312596
17211 312596 147221 140318 188683 -119882 118625 558728 135115 166669 476473 317803
17201 317803 200812 122955 -84537 373735 343246 282133 596168 250330 -48026 220813
17190 62877 -7435 424848 224976 603200 152592 190300 489672 351107 211632 581997
17180 581997 293087 140709 107803 275256 268134 534233 327928 272167 291529 338992 478937
17169 478937 164458 443478 298301 316439 370988 214048 12593 518790 242667 375927
17159C75927H1453L7403j8240K2146b209E35057B12739o1597g5364B68125L1941
17148C00066p0458r7239K9018p9221P5205K51098j17534j22435L4088J64770J98797
17137E66155B04151R6178J40182k8819j13892M5194L59225k69393A97003K11795
17127D08798j11781j16241M34889A04605K68125o1739L5419J3189C9501K145J58441
17116B00087L09250j95133K67435k53053o8564d170B19081N46986B49833n3101
17106A96732O8471m0301J57520K58010B52146N5969j47805K01418J7652J72718
17096E52098H3291N38729j10928J68313B59664L7359K24731j52978H7329L93569
17086D80898J78112B66788o7260L23984j88466A00800L82591J06360r8010p0839
$$ plain form
17159 375927 81453 118856 100616 122762 -2209 535057 212739 151142 -75364 268125 300066
17148 300066 229608 132369 161387 82166 157371 408469 290935 168500 202588 367358 566155
17137 566155 204151 300329 440511 411692 297800 342994 702219 432826 197003 408798
17127 408798 297017 180776 615665 104605 372730 310991 346410 359599 39501 41646 200087
17116 200087 509337 314204 581639 328586 260022 -4170 219081 766067 249833 196732
17106 196732 265203 224902 382422 640432 252146 308115 160310 361728 379380 552098
17096 552098 83291 622020 511092 679405 259664 297023 521754 368776 87329 480898
17086 480898 659010 266788 199528 523512 335046 100800 483391 589751 491741 420902
17076D20902L32312l75115C8615N03614j82208J06678O0617K16275k10221J2776
17066E46146j48417J16694J385j98089K05083J50235B21115J43956J84976K6301
17056E76348k19115J3349K84063C13170M2287L0906K22681B73525N38306B66143
17045A332297D56396N12872k60731j35320K44316l18582j0038K76447k17418J01709
17035F49651L26062l38412J27302K04316j35842l04835J17025j33632k19556L05347
17025E97426k6202B05002O26645j53756B14874N56913l14358J04180j96667A49207
17014G26181p5896l20237N12427j61595k76296L22872J3505j95420R5394K12808
17004H53743J65876l9492j7268l0318l54962K49846j24831M7108o9733M47355
$$ plain form
17076 420902 753214 378099 38615 542229 360021 466699 527316 743591 533370 546146
17066 546146 397729 514423 515808 317719 522802 673037 221115 365071 550047 576348
17056 576348 357233 370582 654645 313170 355457 386363 609044 273525 811831 266143
17045 1332297 456396 969268 708537 573217 817533 498951 488913 765360 547942 649651
17035 649651 975713 637301 764603 968919 833077 528242 645267 511635 292079 597426
17025 597426 571224 205002 831647 677891 214874 771787 457429 561609 364942 149207
17014 726181 650285 330048 842475 680880 404584 727456 740961 545541 640935 853743
17004 853743 1019619 980127 962859 932541 577579 827425 702594 749702 679969 1127324
16994A127324n23306J65624L64020j42139J73772m59773Q9319K0309j36913j65587
16984E12650K77336J50698j75442k1595K34611j23859Q9130k26135j4693K11942
16974I14643K04496l52524N4405L98282m30042J23070l9564O6193p3810j65313
16964F99836N2230k7959M66264m84963M09943r2327K02281l52113J22671j83240
16954H12623K29711K17248m25865J18649L43287m32304J51278j74526L914M57299
16944A301314l09066K27162k50782L31993N2618l1747P8110j62629K00556j95874
16934A241655k54961J33752L11720m7257l82604J44809K31446J26242p5874J39543
16924A568471k66083l5959J99286p7466J87402j97112K18273J65618j66963j39655
$$ plain form
16994 1127324 604018 769642 1133662 991523 1165295 705522 794841 815150 678237 512650
16984 512650 789986 940684 765242 743647 978258 854399 943529 717394 702701 914643
16974 914643 1119139 766615 821020 1219302 789260 912330 872766 938959 865149 699836
16964 699836 752066 724107 1190371 705408 1115351 1023024 1225305 873192 995863 812623
16954 812623 1042334 1259582 833717 952366 1295653 863349 1014627 840101 844015 1301314
16944 1301314 992248 1219410 968628 1300621 1353239 1321492 1399602 1236973 1437529 1241655
16934 1241655 986694 1120446 1432166 1384909 1002305 1147114 1378560 1504802 1428928 1568471
16924 1568471 1302388 1266429 1465715 1388249 1575651 1378539 1596812 1762430 1595467 1455812
16914A455812j53633J58091j26494J39100M7538J70325m5706j26573q2538P9389
16904A515311L3329J19334M8633K23691M3089k68496J51097l94100K53690O18608
16894B344186m26553J24022J02773l00254L43179n11536J22951M30335l26270
16885A902833M17398R5078k64631J03780o9950L0980J41290l89537M04655m54793
16875A917103N27594L3712k48701J08791J07427K64289R4093k94666L13783k45877
16865B577548M4812L74417Q0320k35447j17494J34773l19566M65084N0124k73934
16855B780637M90783k864J4064q3858O5729J84996p313J57361k76594n057K22848
16844C540732K12427k53606M11719r7530J64588k5331l30196M09878P7628N17915
$$ plain form
16914 1455812 1302179 1460270 1333776 1472876 1520414 1690739 1645033 1518460 1435922 1515311
16904 1515311 1548640 1667974 1716607 1940298 1983387 1714891 1865988 1471888 1725578 2344186
16894 2344186 1917633 2041655 2144428 1844174 2187353 1675817 1798768 2229103 1902833
16885 1902833 2320231 2415309 2150678 2254458 2184508 2215488 2356778 1967241 2371896 1917103
16875 1917103 2444697 2478409 2229708 2338499 2445926 2710215 2804308 2509642 2823425 2577548
16865 2577548 2622360 2996777 3077097 2841650 2724156 2858929 2539363 3004447 3054571 2780637
16855 2780637 3271420 3268556 3282620 3198762 3264491 3449487 3442174 3599535 3322941 3317884 3540732
16844 3540732 3753159 3499553 3911272 3813742 3978330 3952999 3622803 4032681 4110309 4628224
16834D628224l57397j61855J66685R0701L57561k69517M17925j59260r3346L45445
16824D965166J74374J65511j86097J68971R8639j42681N62154j47321J98246p448
16814E849514K58022M4375J36825M1531K67127j61432J80695K88627P9226K83011
16804G267521P1599N11089j53121K87688J14887L17516O5363M05497j4141K52015
16794I125913L16078P2244O29889J64908L61496J67553K20821q2284N92183L91380
16784A1960181K26055L50585L97174N74252N20699L54159O68244L65121M8774
16775A5465244N10452N84320L04596P80595Q00610L12347J009753M94710J159543
16766B1422170M86093Q03970J070951O84743J274037O21171J388206J073154Q16725
$$ plain form
16834 4628224 4270827 4108972 4275657 4366358 4723919 4454402 4872327 4713067 4619721 4965166
16824 4965166 5139540 5305051 5118954 5287925 5386564 5243883 5806037 5658716 5856962 5849514
16814 5849514 6107536 6151911 6288736 6330267 6597394 6435962 6616657 6905284 6984510 7267521
16804 7267521 7339120 7850209 7697088 7984776 8099663 8417179 8482542 8888039 8873898 9125913
16794 9125913 9441991 9514235 10144124 10309032 10670528 10838081 11058902 10976618 11568801 11960181
16784 11960181 12186236 12536821 12933995 13508247 14028946 14383105 15051349 15416470 15465244
16775 15465244 15975696 16560016 16864612 17645207 18445817 18758164 19767917 20262627 21422170
16766 21422170 21908263 22712233 23783184 24467927 25741964 26363135 27751341 28824495 29641220
16757B9641220J529061J481839J411368J512870K084408J134458K187858J749278
16749D2732360K152143K244539K607601K548640K880834K910474L075584L420319
16741F4572494L955412L538223M160242M642026M703689M993704N999174N670090
16733A02235054O145965O643340O794088P339461P720162P447640Q248980P836911
16725A60411601P643627P675418P107487O208895N550151M609677L423734K226285
16717B04856875M31918r10536k056843l965634m730287o025780o632869p508076
16709A73458768p881350q089516p929066q238607p960546p684424p677121o453298
16701A11544840o781759o355645o022240n385186n261203m452709m734436m091585
$$ plain form
16757 29641220 31170281 32652120 34063488 35576358 37660766 38795224 40983082 42732360
16749 42732360 44884503 47129042 49736643 52285283 55166117 58076591 61152175 64572494
16741 64572494 68527906 72066129 76226371 80868397 85572086 90565790 96564964 102235054
16733 102235054 108381019 115024359 121818447 129157908 136878070 144325710 152574690 160411601
16725 160411601 168055228 175730646 182838133 189047028 194597179 199206856 202630590 204856875
16717 204856875 205288793 204378257 202321414 198355780 193625493 187599713 180966844 173458768
16709 173458768 165577418 157487902 149558836 141320229 133359683 125675259 117998138 111544840
16701 111544840 104763081 98407436 92385196 87000010 81738807 77286098 72551662 68460077
16693F8460077l288032m072321l133539l295078l166508k823090k183852k480242
16685D4017415k286293j910194j845435j854361j776168j309699j389880j827601
16677B9817784j307277r41111j023716j399672j034216j006060l76072j069448
16669B1660212r56662q49921p80845p35493o18731n24324o94124m16162n24057
16660A5559893n57395k11066r54631k04465l74513m18718j95274o19486n29690
16651A1494655m9643l25173l55760j14121k38233n71185l01207l30471n9385k31450
16641H918027k90711k66860k00874K13583o89031K4784k90473j67858j2908m66917
16631F770762l64962L91280n26216j00240m72564K97706J37248o49641M30887
$$ plain form
16693 68460077 65172045 61099724 57966185 54671107 51504599 48681509 46497657 44017415
16685 44017415 41731122 39820928 37975493 36121132 34344964 33035265 31645385 29817784
16677 29817784 28510507 27569396 26545680 25146008 24111792 23105732 22729660 21660212
16669 21660212 20703550 19853629 19072784 18337291 17718560 17194236 16500112 16083950 15559893
16660 15559893 15002498 14791432 13836801 13632336 13257823 12839105 12643831 12024345 11494655
16651 11494655 11445012 11119839 10764079 10649958 10411725 9840540 9539333 9208862 9149477 8918027
16641 8918027 8627316 8360456 8159582 8373165 7684134 7708918 7418445 7250587 7237679 6770762
16631 6770762 6405800 6797080 6270864 6170624 5698060 5995766 6133014 5483373 5914260
16622E914260l22757l33634M51356k67978n09365k38653K36661j9424Q7996l47117
16612D651345j92209j91209M09937m69887k89020J78872Q0212j87898j69089J34841
16602C955895p150l05945J22548j47713l82723M04695k28336j80339K20687m48133
16592C003486K84761k25322l2977K00925r4111k50756k65370n4800O15412m99531
16582B681717K2883P5936n7203J8669j17224j00449l7935j14174j13264K95231
16572B554187L1363m54590R6216j34590O0430j01327k17489O72927m10480k88709
16562A807938J40447O6225J7639j75609J56583j77060k20458L54324j13455l8973
16552A817601J14851k01936j92762M5633K50879k6240o0804l0791N171l93300
$$ plain form
16622 5914260 5591503 5257869 5709225 5441247 4931882 4693229 4929890 4910466 4998462 4651345
16612 4651345 4459136 4267927 4677864 4207977 3918957 4097829 4178041 3990143 3821054 3955895
16602 3955895 3948745 3642800 3765348 3617635 3234912 3639607 3411271 3230932 3451619 3003486
16592 3003486 3288247 3062925 3029948 3230873 3136762 2886006 2620636 2565836 3181248 2681717
16582 2681717 2704600 2780536 2723333 2742002 2624778 2524329 2486394 2372220 2258956 2554187
16572 2554187 2585550 2130960 2227176 2092586 2153016 2051689 1834200 2507127 2096647 1807938
16562 1807938 1948385 2014610 2032249 1856640 2013223 1836163 1615705 1970029 1856574 1817601
16552 1817601 1932452 1730516 1537754 1583387 1834266 1808026 1747222 1716431 1721602 1328302
16542A328302P0660K76569j28767Q481j36071r0315j43511J80529K90088j45607
16532A510358j34046Q5572J6053l2594k65620K93746j85699J43146j45854M7432
16522A332494o4518K45404l34204J94834j84567k24680M86377l23495j44241J63750
16512A147154j64382P0392K0910J61938Q8092J6217J84013l96888K3589j13653
16502A037382J5524O6116o0331K0914j06366l70843O33415l56071K4641p2816
16492H31565n3564K66587P7059k93953K96832j35929k15562M72448l59898J08898
16482I94483k04686O7737k09465n0377j5525J02003N01261m66158j60666O2750
16472F21357J20124N754j37357j63420K89495j65073L71710j84527C42787N02160
$$ plain form
16542 1328302 1398962 1675531 1546764 1555245 1419174 1328859 1185348 1365877 1655965 1510358
16532 1510358 1376312 1461884 1477937 1445343 1179723 1473469 1287770 1430916 1285062 1332494
16522 1332494 1267976 1513380 1179176 1374010 1189443 964763 1451140 1127645 983404 1147154
16512 1147154 982772 1053164 1074074 1236012 1324104 1340321 1524334 1127446 1151035 1037382
16502 1037382 1052906 1119022 1058691 1079605 973239 602396 1235811 879740 904381 831565
16492 831565 778001 1044588 1121647 827694 1124526 988597 773035 1245483 885585 994483
16482 994483 789797 857534 648069 597692 582167 684170 1185431 719273 558607 621357
16472 621357 741481 747235 609878 446458 735953 570880 942590 758063 342787 844947
16462H44947j31747L20653k16791k7516J62076k24692k38584J69820J43871j46395
16452F55642k55847K14730L78852l44768K06290j82448M62058D90060M7995J04495
16442F42550q0109Q0913l7309o1947r9972P5236K51408C85382J19196n5413J80543
16431F29708j64766J1240L01482j77159j47774J46635n12R480p4222J79490l55968
16420C57634J80064Q3610p9826O0709B06994M04098C02244j6898P08629C88975
16409D56497q5556j84643Q6110K07827k09071L6271K40329k58586K73982D4624
16398D13349J30976E9016M28045j90904L53582A36253K85641k02984K42506G1698
16387C29874R8104j40612L71643j45503k15758K47764P3014L2599B46971p0726
$$ plain form
16462 844947 713200 1033853 817062 789546 951622 726930 488346 658166 802037 655642
16452 655642 399795 614525 993377 648609 854899 672451 1134509 490060 538055 642550
16442 642550 562441 643354 606045 544098 444126 519362 770770 385382 504578 449165 629708
16431 629708 464942 476182 777664 600505 452731 599366 598854 608334 534112 713602 357634
16420 357634 537698 621308 541482 602191 206994 611092 302244 285346 993975 388975
16409 456497 370941 186298 272408 480235 271164 307435 547764 289178 563160 44624
16398 413349 544325 59016 487061 296157 649739 136253 421894 218910 461416 71698
16387 329874 427978 287366 659009 513506 297748 545512 618526 651125 246971 176245
16377A76245M64732A62977K78367n4216e5375B66447J07787F9196K89901R9803
16367D58900A32765J60135N2747F2239L01102A02691L37371E3601J25061J86839
16357C65501M141j80238J95326r1082K5983J84293B02968J19174P5636a14025
16346B06312J42688R9989j77580L80824k46065A60461M89523j57130N5469k56034
16336B92289G8145K18256A04194O6307n157L1696n698M78629B10051K3483M169
16325B37703O2393j42315n6568C6380K20277J05536j21804O4232f6089m0695F3692
16313B33891j532q0037l2035J75677E5351J25084E9701P2275K00581n4696R8123
16302C75984J63994l5746A67026Q9994q9782G3998K04896g3523C13716J33674
$$ plain form
16377 176245 640977 162977 441344 387128 -55375 266447 374234 69196 359097 458900
16367 458900 132765 292900 345647 62239 363341 102691 440062 53601 178662 365501
16357 365501 369642 189404 384730 293648 319631 503924 202968 322142 397778 -114025
16346 206312 349000 448989 271409 652233 406168 160461 649984 492854 548323 292289
16336 292289 78145 296401 104194 170501 165344 197040 191342 669971 210051 233534 237703
16325 237703 300096 157781 101213 36380 256657 362193 240389 304621 -66089 -106784 63692
16313 233891 232359 152322 120287 295964 55351 180435 59701 131976 332557 277861 375984
16302 375984 539978 504232 167026 257020 167238 73998 278894 -73523 313716 447390
16292D47390j90034m9163k6765K26572l9917j80970L88856k87302l9007K38621
16282D88281H2709g4144C52577I8980k5881J97622G8080K72608N5150j54178J73010
16271D24670A22779K95778E545g1987B27320o2510J31270l5655K10641A52149
16260B88151Q8462K03018A86464k1133L36290a97445D78563F7928J29640j2262
16250A85306O6550C9505J55027C840J47348D2073J0042J62648K10050A57582E4935
16238B32451B4211d0698D75518n5660A00777a86578A8965N57878B77929n5316
16228B22613H1184M7230B403L43249F6100Q9345D7628N05331B00808d0421k85715
16217c26136J54317D43632A77629b2459B16612g6618A47352a41387A55064n6321
$$ plain form
16292 447390 257356 208193 181428 408000 368083 187113 575969 288667 249660 488281
16282 488281 82709 -74144 352577 98980 73099 270721 78080 350688 405838 251660 424670
16271 424670 122779 418557 5545 -71987 227320 164810 296080 260425 471066 152149
16260 288151 376613 579631 186464 165331 501621 -197445 478563 67928 197568 185306
16250 185306 251856 39505 194532 3840 151188 42073 52115 214763 424813 157582 54935
16238 232451 24211 -40698 475518 419858 100777 -186578 18965 576843 277929 222613
16228 222613 81184 128414 2403 345652 66100 155445 47628 552959 200808 -40421 -326136
16217 -326136 -171819 443632 177629 -22459 216612 -76618 147352 -141387 155064 98743
16207I8743b0162B01341r4505e18508C15054j6582q1918a9758B45426d1556D30751
16195C99607c84432A06778g283F4515M6141c3874C1422g0516j83255A15775j8479
16184I7296b42724B06818J8044b06083d3222p9288c0319B64694c11248a38998
16173h0986C5570e8533A35884K41215a18156B2297J77487I5950a18004o6908B13839
16161B90151b4642m2226A05964a8908E2473J42267E6126J26413b509D48382a76921
16149h6104o3783A32649F1665J51992J21027E3513J28089l345k3600a7291A27471
16137C01893A27005b9510C7738J27263p2438i4552A73946i9966H8494i980B52068
16125d00122B4770a22205a9569A62310a79526b3505c08A69719a45238B00992i3346
$$ plain form
16207 98743 -20162 201341 106836 -518508 315054 298472 216554 -19758 245426 -41556 430751
16195 399607 -384432 106778 -7283 64515 110656 -33874 31422 -70516 -253771 115775 97296
16184 97296 -242724 206818 224862 -206083 -43222 -122510 -30319 264694 -311248 -138998
16173 -80986 35570 -58533 135884 377099 -118156 22297 199784 95950 -118004 -184912 213839
16161 290151 -24642 -66868 105964 -18908 52473 194740 56126 182539 -2509 448382 -176921
16149 -86104 -149887 132649 61665 213657 334684 53513 181602 178257 154657 -17291 127471
16137 301893 127005 -29510 37738 165001 92563 -94552 173946 -99966 88494 -9980 252068
16125 -400122 24770 -122205 -19569 162310 -179526 -23505 -308 169719 -145238 200992 -93346
16113I7300a01683G6794J05897K28896A3718c01951k27647g6219C3415L18719
16103C52134I7942e3177C75431E9536d8898A3819b4480A17845n870a02605A47199
16091A87018d37878A55169b95868a04488a460G8856f8677A0468L1541J8842e4851
16079c9158B74138d9025P604D4955Q6155F1858a58321L2293E5189A8529a42817
16067d8273C88614j9735b8165j30672M2139j43712c0136I5031c67325J13774m5151
16056b98702B30039K9605a13348B32401b32623a11059D34227h3836c6656C81312
16045B3463Q6609h0940L7503I4922l4130N1126a90686g295k08444i1685E508M6604
16033E2112c02681h6964A18880J80373Q1301h7256j36797A52722n1632J63651
$$ plain form
16113 97300 -101683 76794 182691 411587 13718 -301951 -529598 -76219 33415 352134
16103 352134 97942 -53177 375431 59536 -48898 13819 -24480 117845 111975 -102605 147199
16091 187018 -437878 155169 -295868 -104488 -1460 78856 -68677 10468 42009 60851 -54851
16079 -39158 274138 -49025 -41421 44955 131110 61858 -158321 -126028 55189 18529 -142817
16067 -48273 388614 368879 -28165 -158837 -116698 -260410 -30136 95031 -367325 -253551 -298702
16056 -298702 230039 259644 -113348 232401 -232623 -111059 434227 -83836 -36656 381312
16045 23463 110072 -80940 -43437 94922 60792 111918 -190686 -7295 -215739 -91685 5508 52112
16033 52112 -302681 -86964 118880 299253 380554 -87256 -224053 152722 101090 264741
16023B64741r4342g1830j21712g7870D116J01772h298q6673A28087a89656A13047
16011A5258J28238m7779a93681A13198e2049n8800j97814F7313c9000I9278f3258
15999c47825Q7305n072p0421a55140E1214O6950A195K46334e0463q0567K4727
15988a06303A0590D774a38482K3815A64184K69662A20304n6477J58235O5139I0867
15976B77311a11940M2788C0649f0799B77997H3795g8733N902j40242A06493e19930
15964c981j24532e8286A99406a6446I1966k5497g2218j10214b1508r0182D8077
15952a23380l791J8766k13006J6246J4082p0232r087d4843B3143a16513k29826
15941c46339a7839E1318E971J0989a52337F5421j3165M2753m0955d68389f0756
$$ plain form
16023 264741 170399 -71830 -193542 -77870 4116 105888 -8298 -94971 128087 -189656 113047
16011 15258 143496 95717 -193681 113198 -52049 -110849 -308663 67313 -39000 99278 -63258
15999 -347825 -260520 -265592 -336013 -155140 51214 118164 1195 247529 -50463 -131030 -106303
15988 -106303 10590 4774 -138482 -114667 164184 433846 120304 63827 222062 287201 90867
15976 277311 -111940 -69152 30649 -60799 277997 83795 -78733 -72831 -213073 106493 -519930
15964 -3981 -128513 -58286 199406 -16446 91966 66469 -72218 -182432 -21508 -111690 48077
15952 -123380 -127171 -108405 -321411 -305165 -291083 -361315 -370402 -44843 23143 -116513 -346339
15941 -346339 -17839 51318 5971 16960 -152337 65421 52256 95009 54054 -468389 -60756
15929A64318o5781P2064c24146A91971a26697L6577A46499a07811N1304q8598
15919a45105c9064j14313C1113a27999C19503a44201J4267A60395f993j33060
15909a40053N473f279k62317F326b80404G1947k0769f1217l14742A87104l2938
15898A54166a81109J7446A78110b82667a16376j35443f597j49150K0105j02968
15888b38610B7875h990E741K77134a08488j59709A58694p5866f3015d960j12325
15877a17285b9203k4190L671A25917a66978B84221j28661n0043a22121A60626
15866A4004c44834J63916j56228C13657c24259a14164j0623j71325b147q5112
15856h7259F9676a36039B01934P4245a0223j57480c1512A97164o60d4961k01438
$$ plain form
15929 164318 98537 170601 -324146 191971 -126697 -90120 146499 -107811 -56507 -145105
15919 -145105 -39064 -153377 31113 -127999 319503 -144201 -129934 160395 -6993 -140053
15909 -140053 -134580 -6279 -268596 6326 -280404 71947 51178 -61217 -375959 187104 154166
15898 154166 -181109 -163663 178110 -282667 -116376 -251819 -6597 -155747 -135642 -238610
15888 -238610 27875 -8990 5741 282875 -108488 -268197 158694 82828 -63015 -4960 -117285
15877 -117285 -29203 -53393 -49722 125917 -166978 284221 155560 105517 -122121 160626
15866 14004 -344834 -180918 -337146 313657 -324259 -114164 -124787 -296112 -2147 -87259
15856 -87259 69676 -136039 201934 276179 -10223 -167703 -31512 197164 196504 -44961 -246399
15845b46399N1106J7057N317a1033l36691a44156A24484b03910Q4484C3170K80063
15834C13233A13999m2934c5477n583B36073a61584P8508B0205c83481a48188j6527
15823a64715c8732k13582J09230C86197G3199K29187c21112B7640g0119H4335
15812c29896B18668d6059j82602i6123l96089f6313A15139C314a18620j5329a3932
15800b47351a20247j67389Q5033A09296k3435c08733J31795F9093i4215k03200
15790b97415g3481k6258A11816c3266l5184B76262c8752J3142q5794m31998B2604
15778b00893A97855c36428a0449A64541K71528E5289a7751A70412k7466d33293
15767a06489B9318c53536J69217C02610b8261F7692A1245K15113G2285c9376A73020
$$ plain form
15845 -246399 -195293 -178236 -172919 -11033 -347724 -144156 124484 -203910 -119426 33170 313233
15834 313233 113999 71065 -35477 -41060 236073 -161584 -83076 20205 -383481 -148188 -164715
15823 -164715 -38732 -252314 -143084 386197 73199 302386 -321112 27640 -70119 84335
15812 -329896 218668 -46059 -228661 -96123 -492212 -66313 115139 3314 -118620 -133949 -13932
15800 -247351 -120247 -287636 -202603 109296 85861 -308733 -176938 69093 -94215 -297415
15790 -297415 -73481 -99739 111816 -33266 -68450 276262 -38752 -25610 -111404 -543402 22604
15778 -200893 197855 -336428 -10449 164541 436069 55289 -17751 170412 142946 -433293
15767 -106489 29318 -353536 -184319 302610 -28261 67692 11245 226358 72285 -39376 173020
15755i660B3477c66463A45965j2930a41462O5764n485m1948B17762c45346a21500
15743h12o3770M574B62636a15028j7575A80937i391r5326E4603d38184A05798
15731a5220I9455J8636a96117A16023i0242K1451E0080a26262e9565j2187A1463
15719g594A3942K14926b6833D2059K5405K39993E3793c7641D8482J32380G7696
15707i3935J2154A00087J55314b12102K6290M4042b6827q1359B23951a09859o9857
15696a79716m6515A58736K6839A6053b70824A82275c3402A9327f1501E5976d4087
15684A19685P5880a45105E8716i8994D60783a63206A27216a65862B7445f1738
15673b11573R7296G5321M9250f0876I0991L12706a17975K9839C23662a20714d5491
$$ plain form
15755 -9660 23477 -366463 145965 133035 -141462 -75698 -81183 -123131 217762 -345346 -121500
15743 -812 -64582 -60008 262636 -115028 -132603 180937 -9391 -104717 54603 -438184 105798
15731 -15220 99455 118091 -196117 116023 -90242 -68791 50080 -126262 -59565 -71752 11463
15719 -7594 13942 228868 -26833 42059 67464 307457 53793 -37641 48482 180862 77696
15707 -93935 -81781 100087 255401 -212102 -185812 -141770 -26827 -108186 223951 -109859 -179716
15696 -179716 -226231 158736 185575 16053 -270824 182275 -33402 19327 -61501 55976 -44087
15684 119685 195565 -145105 58716 -98994 460783 -163206 127216 -165862 27445 -61738
15673 -211573 -114277 75321 124571 -60876 90991 403697 -117975 -88136 323662 -120714 -45491
15661a37504c2197k61391A42473d1179l42524A04716Q45J50869a79542k08867
15651c88409A98511h8358C05184H7607c0810k86238c2436m2166k56498D7707J37367
15640A85074I939Q2522K386b91162J25137e1692k04955E2675a21557C5632d1208
15628b65884h3209m09986C1642e7331m3647j52119d8003j20164B5836J01152k829
15617A24159a39971r758D24107g5748h942q4078G1383j6614a03347m5224P0130
15606g8441A10642l9843b93092f2521B11816E0682L9802c6026r1427E9380F210
15594A2538a21964e3438C12420b27247C46212a80691M5599a7435D156J93782d81974
15582C06524I9318R698a93202L6564d113B65916A03324a84190k2481K5089h7306
$$ plain form
15661 -137504 -32197 -293588 142473 -41179 -383703 104716 105561 256430 -179542 -388409
15651 -388409 198511 -88358 305184 87607 -30810 -317048 -32436 -74602 -331100 47707 185074
15640 185074 9939 92461 94847 -291162 -166025 -51692 -256647 52675 -121557 35632 -41208
15628 -265884 -83209 -493195 31642 -57331 -100978 -253097 -48003 -168167 25836 126988 124159
15617 124159 -139971 -149729 424107 -75748 -8942 -93020 71383 54769 -103347 -148571 -78441
15606 -78441 110642 70799 -293092 -62521 211816 50682 90484 -36026 -127453 59380 6210
15594 12538 -121964 -53438 312420 -227247 346212 -180691 -135092 -17435 4156 197938 -481974
15582 306524 99318 109016 -193202 -156638 -4113 265916 103324 -184190 -206671 -181582 -87306
15570B40807a15376j76158J23588A14947b47203E6917K40468i6107A8307K08398
15560B26705k2616a40563D8879M4136a30973B2877e7017o2744H6730M8887a86939
15548A09509c12448F3509a26655j20845A54477o1244O6367L6930n2219c4544G3610
15536a11542l0548A5676M2968L05146d9255l48636E20885a06940q3091C5065a33839
15524C23027b8103A42521K2688b25414F0143J49754A0927Q1792f1463A90805a32149
15512A29904c50990A52653C736a10113H0545a48036B41366a11433j15872D27742
15501b918j0040C56326f7495H4782P700b3125l2466I7737N8832d8304j4081j12412
15489a74797b2509D95971d47986A70195a33165j36372H0299i3452H7779b5617
$$ plain form
15570 240807 -115376 -291534 -167946 114947 -247203 56917 297385 -96107 18307 226705
15560 226705 204089 -140563 48879 93015 -130973 22877 -57017 -119761 86730 135617 -186939
15548 109509 -312448 63509 -126655 -247500 154477 93233 159600 196530 144311 -34544 73610
15536 -111542 -142090 15676 58644 363790 -49255 -397891 520885 -106940 -190031 35065 -133839
15524 323027 -28103 142521 165209 -225414 60143 209897 10927 92719 -61463 190805 -132149
15512 129904 -350990 152653 3736 -110113 80545 -148036 241366 -111433 -227305 427742
15501 -2918 -12958 356326 -67495 84782 92482 -23125 -55591 97737 156569 -48304 -62385 -174797
15489 -174797 -22509 495971 -447986 170195 -133165 -269537 80299 -93452 87779 -25617
15478A5474J9289b9525C5915j5401h3784B1969K57944a08349A20669a00508k1273
15467a21781C2222g2725H6398j7332O3013P5491E0230K18369n5024n7416c0273
15455b34143m0488b2011l50433G3625a38351E8546j8851E160a89402B14450r673
15444B04777b40923h8829k65819h8435D9396b04888A17521J516E6214a47250h8
15432C20984a01351C19155a7231H7354a11395F2082J16339l8159O0093a03120
15421i2229k01087J14812K9290A3274a35987A0101d9392q0360D8362a55435d7132
15409B60639m2249H8997l4473J0935e5126N097A20660J61197b91477B65085n6273
15398B08812b83079A91900E8074M5410b16276B27016J35195a12279n721A480a8802
$$ plain form
15478 15474 34763 -29525 35915 20514 -83784 21969 279913 -108349 120669 -100508 -121781
15467 -121781 32222 -72725 86398 69066 132079 207570 50230 268599 213575 156159 -30273
15455 -234143 -274631 -22011 -372444 73625 -138351 58546 39695 5160 -189402 214450 204777
15444 204777 -240923 -88829 -354648 -88435 49396 -204888 117521 119037 56214 -147250 -88
15432 320984 -101351 319155 -17231 87354 -111395 62082 178421 140262 200355 -103120
15421 -92229 -293316 -178504 -149214 13274 -135987 10101 -49392 -129752 48362 -155435 -47132
15409 260639 218390 88997 54524 65459 -55126 -50029 120660 281857 -291477 265085 208812
15398 208812 -283079 191900 58074 103484 -216276 227016 362211 -112279 -118000 1480 -18802
15386F9708c55788D09175H0890p629K9139a10043m3414A14623A0351e7690j90015
15375b47705B32190a21278m3317D37351e5267j79872a11295H6411J69589f3492
15364a25317j63923A20428A3365a1787j7657B60662D5398M36757k30723p5610
15354A75822J81986a11720b913F3526h2994B51594E8517f4788A28452a61993g8842
15342a09551o7626g8528a3225A84340J19538p9805K37157b189n3665C51699a82292
15330b46109A90459n9709E6865b15428R1966J938A42171L55445j74704b23826
15319d1888A1945J02788a03493C47898q3594e97j07744C5120J46949F41a5885
15307b04763A14911K8672A446b04076c4543j9011L948l05930f383j17473G3298
$$ plain form
15386 69708 -355788 409175 80890 73261 102400 -110043 -153457 114623 10351 -57690 -247705
15375 -247705 232190 -121278 -164595 437351 -55267 -235139 -111295 86411 256000 -63492
15364 -125317 -289240 120428 13365 -11787 -29444 260662 45398 482155 251432 175822
15354 175822 357808 -111720 -2913 63526 -82994 251594 58517 -64788 128452 -161993 -78842
15342 -109551 -177177 -78528 -13225 184340 303878 224073 461230 -2189 -55854 351699 -182292
15330 -246109 190459 130750 56865 -215428 -123462 -121524 142171 497616 322912 -223826
15319 -41888 11945 114733 -103493 347898 264304 -597 -108341 35120 182069 641 -15885
15307 -204763 114911 143583 1446 -204076 -34543 -53554 -49606 -355536 -6383 -123856 73298
15295A80589m7187P14329a24015A42261E4113M57928B05949B2589i6215d3497
15284A81801L86348H2699f1554p5533E1908k3150c13683B36963D486g5477A09064
15272B07590P7919G707J47258m8273a09114A24566A0845a1883o6209p5230A37468
15260b10508L5920A42104b56054d376A12395D6751N0868i1023l646A37152f3364
15248B57254R6294M9326K77827J016256J237642j029838P54777p28230H92225
15238D20168c9803A45265J68237q8880i3267B72066L6062j23034M8202B0703P3630
15227I4333A5064g6748k7461B15565a93267B50923p6198Q7115J71336A30955F2380
15215B50666E9489h9340A79616L6659a934C38535H2221a0650n338H8043P7249
$$ plain form
15295 180589 133402 847731 -124015 142261 54113 512041 205949 22589 -96215 -43497
15284 181801 568149 82699 -61554 -137087 51908 28758 -313683 236963 4486 -75477 109064
15272 207590 285509 7707 154965 106692 -109114 124566 10845 -11883 -78092 -153322 137468
15260 -210508 -174588 142104 -256054 -4376 112395 46751 97619 -91023 -94669 137152 -63364
15248 257254 353548 402874 680701 1696957 2934599 1904761 2659538 1931308 892225
15238 420168 -39803 145265 313502 224622 -93267 272066 308128 185094 233296 20703 94333
15227 94333 15064 -76748 -104209 215565 -193267 250923 174725 261840 433176 130955 62380
15215 250666 59489 -89340 179616 216275 -1934 338535 82221 -10650 -15988 88043 165292
15204A65292b6356E4127a71066A52732n0163B258J14830C3632K97424E3663J26702
15193A80365B0382P7713a98005A00135K42589I1597M451c8553j78211B50299o3170
15182A87129a27930D3209J81712b62942q0590A69043e4840J8963m6917G2927d7370
15170a07416C38863A66820c7730G4443h7192b1198q2532B4853g9424D42469F5096
15158B05380i1026B0098a77130D16829j0750e6917A07616A1735K77077d07686
15147B3624K44388Q8786A5334J10456a16965k04703C86111F4260a53745B07702
15136B14059K3282j3075j05897a3257C62337F3592N100a36553C55017h8990B53072
15124B81096K46994h9318B64344J91173F9491Q3897c4362C30227A31921J88138
$$ plain form
15204 165292 -26356 54127 -171066 152732 102569 2258 117088 33632 331056 53663 180365
15193 180365 20382 98095 -198005 100135 342724 91597 96048 -38553 -216764 250299 187129
15182 187129 -127930 43209 224921 -262942 -343532 169043 -54840 -35877 -82794 72927 -47370
15170 -107416 338863 166820 -37730 74443 -87192 -21198 -103730 24853 -79424 442469 65096
15158 205380 -91026 20098 -177130 416829 406079 -56917 107616 11735 288812 -407686
15147 23624 268012 356798 15334 125790 -116965 -321668 386111 64260 -153745 207702
15136 214059 237341 224266 118369 -13257 362337 63592 68692 -136553 355017 -88990 253072
15124 281096 528090 -89318 264344 455517 69491 153388 -34362 330227 131921 320059
15114C20059K7268b0252n7974n0574I8939J26658e520D61106A30896Q4517P651
15103B23064E6299a76628A67819F339J39574i0855A66152I277L59929o1170K3596
15092C31632m4305G1271c8383B12710j3660J87387A88715L0431C4267K43716m3986
15081B33997I0772K12360A08920R9034i8379M7558E03342H9861K39261i960D95087
15069b86382B42768M125o2682J66825A5384J18732K20392E1989J23492a53537
15058A48996a553o6171C01310n007C399J47222g5011K606a3155B2963J74736K26070
15046D23769I187M14030A94845K39149B1912J52625J01458M293R2993r4732P8544
15035C57093n1104a12566C3580M58237k07645J89544H531K19312E4303K98806
$$ plain form
15114 320059 347327 -20252 -78226 -128800 98939 225597 -5520 461106 130896 215413 223064
15103 223064 56299 -176628 167819 6339 145913 -90855 166152 9277 369206 308036 331632
15092 331632 287327 71271 -38383 212710 199050 386437 188715 219146 34267 277983 233997
15081 233997 90772 303132 108920 207954 -98379 -50821 503342 89861 329122 -9960 495087
15069 -286382 242768 246893 184211 351036 15384 134116 354508 51989 175481 -153537
15058 148996 -1553 -67724 301310 296303 3399 150621 -75011 -72405 -13155 22963 197699 423769
15046 423769 9187 423217 194845 433994 21912 174537 275995 280288 373281 278549 357093
15035 357093 305989 -112566 33580 491817 284172 473716 8531 227843 54303 353109
15025C53109C1093L23735k6273P9951l3022a01420D26128j18798g768B56295l2850
15014B23445j09050L60243G7531J59068c9151B82929O1644G5077J30695J67004
15004C72776m4953J36284B3157R9840J64891d0874B75551m5425K0535H9378N9345
14993A48723N905K80638p115A73852J57858B820L98284a35919C43873r9487g6757
14981E28494A98386l1330k3698K15692H7768J19868P6411K64753k26047i5598
14970A62384j6453J23879I6268P7759J78723A13548J74873A31158L35856A52942
14959D61820j22300l7381L65182E1160J39564k4762J53331j09772p2584N92077
14949G29014A62297k7570K97726k6751r6390E0385K0446L08685J71111H0020J64985
$$ plain form
15025 353109 31093 354828 328555 408506 375484 -101420 426128 307330 -7768 256295 223445
15014 223445 114395 474638 77531 236599 -39151 282929 344573 75077 205772 372776
15004 372776 327823 464107 23157 122997 287888 -40874 275551 230126 250661 89378 148723
14993 148723 154628 435266 428151 173852 331710 2820 401104 -135919 343873 244386 -76757
14981 528494 198386 167056 143358 359050 87768 207636 284047 548800 322753 -95598
14970 162384 145931 269810 96268 174027 352750 113548 288421 131158 467014 152942
14959 461820 339520 302139 667321 51160 190724 165962 319293 209521 136937 729014
14949 729014 162297 134727 432453 405702 309312 50385 70831 379516 550627 80020 245005
14938B45005A08034O6792O8819E958M81391B10897p9152J86549n3659L7672o2113
14927B40194M41955l03464j68269H8865M18418B04757l7606K84770L38442C60197
14916C84129l1585q3557A32983J99953O0190K0356E9162P14140l15883k06785
14906B50634N8097m7476Q696J31577a94664B91907M2308K34925m8161j15311j74006
14895B31662m1488K0132o6813l0620K36227G1744K02760I9047K15069M33303k67425
14884D79994k13447J75439R7818B11750J49793L57861j41695J20355l46668K26108
14874E77504k21875O5250Q2129j64623K36853J29733l29951j04777M8357J95235
14864E13835K74653C87914J93055j54264A73488J71338N6297q4825N32589C41890
$$ plain form
14938 245005 108034 174826 243645 5958 487349 210897 131745 318294 264635 302307 240194
14927 240194 682149 378685 210416 88865 507283 204757 167151 451921 790363 360197
14916 384129 352544 268987 132983 332936 393126 413482 59162 773302 457419 250634
14906 250634 308731 261255 269951 401528 -194664 291907 334215 569140 520979 405668 231662
14895 231662 190174 210306 143493 112873 349100 71744 274504 99047 314116 747419 479994
14884 479994 266547 441986 539804 211750 361543 719404 577709 698064 351396 577504
14874 577504 355629 420879 503008 338385 575238 704971 375020 270243 318600 513835
14864 513835 788488 387914 580969 426705 173488 344826 401123 316298 848887 341890
14853C91519Q0950R6027p3409B43599L9476K29761p8552j5996m1139J18043j05006
14842C90186p3118J85418J55640E9106J00773J29513Q0095j53474J64490j47312
14832B33191J74554O2104J34850j61553K32248j78990L06973l66449Q3568K0557
14822E41053L21040l78315r1400l1318J52231j31160M07873j84163J77559k68442
14812E14958J45114n9197m6461B42706K00259n7827J44361K03649j71809q6815
14802D74524k1669m1805L53868l55968A56529M22695j27639L08000j32645O6906
14792F93846j94864k8749O4646p6254l252K76256j90449n6911Q0624R6560J52195
14781H13648j62140P9998m0414j89453K33760k49985K66250q2321k35873M41814
$$ plain form
14853 391519 472469 568496 495087 243599 283075 512836 434284 418288 377149 495192 390186
14842 390186 317068 502486 658126 59106 159879 289392 369487 216013 380503 233191
14832 233191 407745 469849 604699 443146 675394 496404 803377 436928 520496 541053
14822 541053 862093 483778 392378 361060 513291 382131 790004 605841 783400 514958
14812 514958 660072 600875 554414 242706 442965 385138 529499 733148 561339 474524
14802 474524 452855 411050 764918 408950 156529 579224 451585 759585 626940 693846
14792 693846 498982 470233 534879 458625 455373 731629 541180 484269 564893 661453 813648
14781 813648 651508 731506 691092 501639 735399 485414 751664 669343 433470 875284
14771H75284k91293j40883J49093j45955J50393J75377k51346L96743j88942k71539
14761D56932K39383K59730K502k45906n4698M8265K25314j9442j24836M1610j70324
14750F58530R3217O7453j28035K68066D12452L89028j50333K65303j24757L0338
14740H22031j25298J07309m273M7612k85218L37265J18031J1103l79511J63245
14730H12296L2235J55106r4317j06031J10332j69623M01309n46856M4183K16714
14720H55348q9037J28464j14388j15570J04336K60964m14798j82804L0105O49778
14710A112398l32947K4556R2643L57363n30367J69469j5592j33062P3382K41667
14700A059510j38511k13385K2074J27800K8357j3601n3416r2390L15910m63953
$$ plain form
14771 875284 583991 443108 592201 446246 596639 772016 520670 917413 728471 456932
14761 456932 696315 956045 958547 712641 657943 706208 931522 912080 787244 828854 658530
14750 658530 751747 819200 691165 959231 412452 801480 651147 916450 791693 822031
14740 822031 696733 804042 799769 847381 562163 899428 1017459 1028562 649051 812296
14730 812296 844531 999637 905320 799289 909621 739998 1141307 594451 638634 855348
14720 855348 766311 894775 780387 664817 769153 1030117 615319 432515 462620 1112398
14710 1112398 779451 804007 896650 1254013 723646 893115 877523 744461 817843 1059510
14700 1059510 920999 707614 729688 857488 885845 872244 818828 726438 1042348 578395
14690E78395M55994J50696L16591o80412j75425J64821K42638n1358K45267j16246
14680A130961j51021L684N9163J21261r7883R1430J00212l35320m5764M35060
14670A311783j96653q0152K06746n30338O44867j21384k44427R7893M7322K85211
14660A420868l24628J85096P1626P6613k07616r2031R6982K20839j10855n0737
14650A286157l99387K29800K35950K17736o88498M94422J46912l08135L37672
14641A552629l40339P4749L16563m8855m35483L87200N1064j34867l62760M22941
14631A482842k53341J99694o606Q5425l02771L04758L93878k65417r9690o2760
14621A476012J74024K63139l95802q6647K92887j95041R0443J2047p2713L2149
$$ plain form
14690 578395 1034389 1185085 1501676 821264 645839 810660 1053298 1001940 1247207 1130961
14680 1130961 979940 983624 1042787 1164048 1066165 1157595 1257807 922487 876723 1311783
14670 1311783 1115130 1034978 1241724 711386 1356253 1234869 990442 1088335 1135657 1420868
14660 1420868 1096240 1281336 1352962 1429575 1221959 1129928 1226910 1447749 1336894 1286157
14650 1286157 886770 1116570 1352520 1570256 881758 1376180 1523092 1214957 1552629
14641 1552629 1212290 1287039 1603602 1554747 1119264 1506464 1557528 1422661 1059901 1482842
14631 1482842 1229501 1429195 1422589 1508014 1205243 1510001 1903879 1638462 1538772 1476012
14621 1476012 1650036 1913175 1517373 1430726 1723613 1528572 1619015 1631062 1558349 1590498
14611A590498J97334M9493M1414j41961j42588r9951L57313j43031l82111L19518
14601A645928Q9096j00775j9379L80584J65799l34091r904J15837k01177J19180
14591A851098K26863k39285J77358n8975L02369n71800M71266j63568J87516j8429
14581B164413j48709J45459P4757l41598M72287n6181k87905k8675J70078K47573
14571B411499m52009K08245K40296o9415N9381J73584K00721o3700q5202J46942
14561B770342j02069K76824Q4138J31488O9674J65338J20258M53313j28754R26931
14551D767483K86629J102227J420865L567965R855558J8233408R045988B1647302
14542I179071l765884j5607K393269k852819j964104p72469Q8759J27444l22173
$$ plain form
14611 1590498 1787832 1837325 1878739 1736778 1594190 1494239 1851552 1708521 1326410 1645928
14601 1645928 1735024 1634249 1614870 1995454 2161253 1827162 1817258 1933095 1731918 1851098
14591 1851098 2077961 1838676 2016034 1957059 2259428 1687628 2158894 1995326 2182842 2164413
14581 2164413 2015704 2161163 2235920 1894322 2366609 2310428 2022523 1993848 2163926 2411499
14571 2411499 1959490 2167735 2408031 2338616 2397997 2571581 2772302 2708602 2623400 2770342
14561 2770342 2668273 2945097 3029235 3160723 3230397 3395735 3515993 3969306 3840552 4767483
14551 4767483 5054112 6156339 7577204 11145169 21000727 39234135 48280123 21647302
14542 9179071 5413187 5397580 7790849 4938030 2973926 2201457 2290216 2417660 2095487
14533B095487J520l7204N0729L52634j86318J64298j42966K97649m2946J95183
14523B748066l6487p9100n3899M5448L95787l45868P3211L24496j74809j94078
14513B702767K16269j26600N03919m14730J31252K26525J46158l27630P1685K28980
14503C358595j86136J18754P0608Q4341j95365J86487m517L50687J08855m36791
14493C455518Q6230J54220k14443L20269k3598M28481j07159j18940L73K41240
14483D222191j05445L4084n6704p7238q7309K90983M01574m09454J53335R9053
14473D465070p2762J06152j80991L89597J26743k75885L32820P6768k62205L40715
14463E046022L3980J37987j62712j4990J75074R5703Q5142j84449M38937l90016
$$ plain form
14533 2095487 2097007 2059803 2110532 2463166 2276848 2441146 2298180 2595829 2552883 2748066
14523 2748066 2711579 2632479 2578580 2624028 3019815 2673947 2747158 3071654 2896845 2702767
14513 2702767 2919036 2792436 3296355 2881625 3012877 3239402 3385560 3057930 3129615 3358595
14503 3358595 3172459 3291213 3361821 3446162 3250797 3437284 3432767 3783454 3892309 3455518
14493 3455518 3541748 3695968 3481525 3801794 3778196 4206677 4099518 3980578 3980951 4222191
14483 4222191 4116746 4150830 4094126 4016888 3929579 4220562 4622136 4212682 4366017 4465070
14473 4465070 4392308 4498460 4317469 4707066 4833809 4557924 4890744 4967512 4705307 5046022
14463 5046022 5080002 5217989 5055277 5040287 5215361 5311064 5396206 5211757 5650694 5260678
14453E260678K90017J20240L8522N86K63216K97755k42847k51788N98836N4005
14443F429220j58025o6412L31758k91886L96050L8902R1447J48746j21568L05216
14433G103448Q2754K77672j80626K30902n5469J39072m3187L55659l05658J70998
14423G775565Q54505k29937k32483K66119j2670K55696P1516K09001K78640K24926
14413I460878j70864J15573n358N22609Q1177r9316M16586L05912J17154n54801
14403A0189550Q98706L6110n7774J62742K96568L90012L01268n0051K97414K04293
14393A2668838L8080Q8109P11829L67377Q7912J10777L00529M6526J84939M58877
14383A5063793K45891L72754P8528M4734P17022K71818K55267L73799q3617P65102
$$ plain form
14453 5260678 5550695 5670935 5709457 5710043 5973259 6271014 6028167 5776379 6375215 6429220
14443 6429220 6271195 6204783 6536541 6244655 6640705 6679607 6771054 6919800 6798232 7103448
14433 7103448 7186202 7463874 7283248 7514150 7458681 7597753 7554566 7910225 7604567 7775565
14423 7775565 8630070 8400133 8167650 8433769 8421099 8676795 8748311 8957312 9235952 9460878
14413 9460878 9290014 9405587 9400229 9922838 10004015 9904699 10321285 10627197 10744351 10189550
14403 10189550 11088256 11124366 11066592 11229334 11525902 11915914 12217182 12167131 12464545 12668838
14393 12668838 12706918 12795027 13506856 13874233 13962145 14072922 14373451 14419977 14604916 15063793
14383 15063793 15309684 15682438 15760966 15805700 16522722 16794540 17049807 17423606 17339989 18105091
14373A8105091M48582L3253L50199N64740O99475J84199K88935O08291M41764
14364B1724529L01856M98051M99957L92758P31258N46345M59712O14354N11564
14355B6280384O69670M87271Q97741N63848P81050M88058J059911M66851J039132
14346C2733916O01918R98511J177476Q17359Q34946J179959P46478J380007J169785
14337D1640355J407489J071476J193115R00190J634952J976546J133704J579171
14329E2536998J743439J497622J836252K268766J926747J879030K443832K199735
14321F8332421K758693J973871K761441K576222K968622L272565L301212L250722
14313I1195769L704683L552610M278956M192359M360507N058544M789014N149981
$$ plain form
14373 18105091 18553673 18586926 18937125 19501865 20201340 20385539 20674474 21282765 21724529
14364 21724529 22026385 22524436 23024393 23417151 24148409 24694754 25154466 25768820 26280384
14355 26280384 26950054 27437325 28335066 28898914 29679964 30168022 31227933 31694784 32733916
14346 32733916 33335834 34334345 35511821 36329180 37164126 38344085 39090563 40470570 41640355
14337 41640355 43047844 44119320 45312435 46212625 47847577 49824123 50957827 52536998
14329 52536998 54280437 55778059 57614311 59883077 61809824 63688854 66132686 68332421
14321 68332421 71091114 73064985 75826426 78402648 81371270 84643835 87945047 91195769
14313 91195769 94900452 98453062 102732018 106924377 111284884 116343428 121132442 126282423
14305A26282423N660228N860611O261450O569339P247285P322518P936644Q030380
14297A81170878Q744214Q977571R705332J0141116J0562090J1633794J1480943
14290B52415938J2582727J2937070J3001673J3790411J4463154J4391338J4896878
14283C48479189J4750144J5067282J4428193J4234263J3715492J3003472J1761523
14276D45439558J0738106Q847760O404168M673458J182416j793717m298668k891058
14268D68302023l772846o780520q954675j1123223j2338227j3648746j4195262
14261C97488524j5137483j5842331j5789574j5737805j5572763j4670630j4923511
14254B89814427j3976848j3836546j3162405j1438248r791577j1334260j0609323
$$ plain form
14305 126282423 131942651 137803262 144064712 150634051 157881336 165203854 173140498 181170878
14297 181170878 189915092 198892663 208597995 218739111 229301201 240934995 252415938
14290 252415938 264998665 277935735 290937408 304727819 319190973 333582311 348479189
14283 348479189 363229333 378296615 392724808 406959071 420674563 433678035 445439558
14276 445439558 456177664 465025424 471429592 476103050 477285466 475491749 471193081 468302023
14268 468302023 464529177 457748657 448793982 437670759 425332532 411683786 397488524
14261 397488524 382351041 366508710 350719136 334981331 319408568 304737938 289814427
14254 289814427 275837579 262001033 248838628 237400380 227608803 216274543 205665220
14247B05665220j0253344r388036q897235p610098p998772p586037p097788o497228
14239A40336682n935834n933104n509517m990802n122115m754462m240234m053755
14231I9796859l891835l348658l851639l443365l119333l154916l032289k610910
14223G3343914k490685k542283k187528k092007j877106k142299j893853j958107
14215E6160046k068807j164077j367260j990765j423809j538321j176158j123476
14207D4307373l90724j394056j653950j288427j296806r30243m92092q15265r22996
14198C5122814j285140j049136p09271q13212n51280l82875j151759l78471j127352
14189B7674318o36490n05506q05453l11535o94406k01779j036082m17831m69991
$$ plain form
14247 205665220 195411876 186023840 177126605 169516507 161517735 153931698 146833910 140336682
14239 140336682 134400848 128467744 122958227 117967425 112845310 108090848 103850614 99796859
14231 99796859 95905024 92556366 88704727 85261362 82142029 78987113 75954824 73343914
14223 73343914 70853229 68310946 66123418 64031411 62154305 60012006 58118153 56160046
14215 56160046 54091239 52927162 51559902 49569137 48145328 46607007 45430849 44307373
14207 44307373 43916649 42522593 40868643 39580216 38283410 37353167 36861075 36045810 35122814
14198 35122814 33837674 32788538 32079267 31266055 30714775 30331900 29180141 28801670 27674318
14189 27674318 27037828 26532322 25726869 25415334 24720928 24519149 23483067 23065236 22595245
14180B2595245j92871p71337j85069o05021m12236k54593m68547q79869j01239
14171A8724463k51106k07656k57837l92057l67589l5283n81012n72801k82480
14162A5776642M2595o47807N7500j77119l12503k57901k86133m18083l18763j75920
14152A3282508r8090j90501r8834j83425k41362k09876j16702l00871j14197k77698
14142A1450952k47177R4782j53478l2237n15245k88693o3134k11331K0722k33969
14132I821192j71889Q66n44892L5917J64520n0242k20486k27244j331K8414l26374
14121H508451j89946j30196k12294L04855m70966l04225N92751l83942l40668
14112G373820K59917k83302j9526M6510o34292K74475p3161r9369j46960k45575
$$ plain form
14180 22595245 22402374 21631037 21445968 20840947 20428711 20174118 19705571 18825702 18724463
14171 18724463 18473357 18265701 18007864 17615807 17248218 17212935 16631923 16059122 15776642
14162 15776642 15819237 15171430 15228930 15051811 14739308 14481407 14195274 13777191 13458428 13282508
14152 13282508 13184418 12993917 12895083 12711658 12470296 12260420 12143718 11842847 11728650 11450952
14142 11450952 11203775 11298557 11145079 11112842 10597597 10308904 10245770 10034439 10055161 9821192
14132 9821192 9649303 9650169 9105277 9141194 9305714 9255472 9034986 8807742 8806411 8834825 8508451
14121 8508451 8318505 8188309 7976015 8280870 7809904 7505679 8098430 7714488 7373820
14112 7373820 7633737 7350435 7330909 7377419 6743127 7017602 6944441 6845072 6698112 6452537
14102F452537p7093K64732k70393M00618l43157j95785p2185M0331k79511K30415
14092F150509l12720R8507K15385l60638k94144m3771K72618p08736L21472K7829
14082E366311k50905M45674m78779j74917J39126p436m9177J93862k41883k13516
14072D728360j06874K08189l22331L17084j76001k55177j94941J70833k04379
14063D164763K02155k54465J45761j03082K02579k28368j33184k8391l3734J6919
14053C950953O4213j96010M5379J43911l43480J32583j82245l80196L60782k49135
14043C346755L56272k00896k67939K31905m6566m1414J81646k82736k37383J66308
14033C205952j36033j73814M96192n1753j74049K70232l61750R3092J26686j75520
$$ plain form
14102 6452537 6375444 6640176 6369783 6770401 6427244 6231459 6159274 6199605 5920094 6150509
14092 6150509 5837789 5936296 6151681 5791043 5496899 5453128 5725746 5017010 5338482 5366311
14082 5366311 5115406 5561080 5082301 4907384 5046510 5039074 4989897 5183759 4941876 4728360
14072 4728360 4621486 4829675 4507344 4824428 4648427 4393250 4198309 4369142 4164763
14063 4164763 4366918 4112453 4258214 4155132 4357711 4129343 3996159 3967768 3934034 3950953
14053 3950953 4015166 3819156 3864535 4008446 3664966 3797549 3615304 3235108 3595890 3346755
14043 3346755 3703027 3502131 3234192 3466097 3419531 3378117 3559763 3277027 3039644 3205952
14033 3205952 3069919 2896105 3392297 3340544 3166495 3436727 3074977 3168069 3294755 3119235
14023C119235n6855j98349l561k20334K49687j97830L24347k27579l22975Q9345
14013B555131L36214j21900j63549L08804l46096O2781k09490L1836J51640k81621
14003B323750J92357J42795k03458P9222j6957o4347q6942n9421M9895O0939j87136
13992B230697m0342J35172N52013R41694K164533P622494J8150216J7191467k1152658
13983B7795286j3862972n528731j723842j649692l84873j049250J09550l33086
13975C372390j21369j73394j73475O8622j95481O9050j03345j46615j10469J98480
13965B684394j50092r8629P8115l78571p2904K76150K89057q0304r1416l71132
13955B084668R7673N8730m15084M43761k90762O2071M7151J88851m6518l54116
$$ plain form
14023 3119235 3062380 2864031 2860470 2640136 2889823 2691993 3016340 2788761 2465786 2555131
14013 2555131 2891345 2769445 2605896 2914700 2568604 2631385 2421895 2453731 2605371 2323750
14003 2323750 2516107 2658902 2455444 2534666 2517709 2453362 2366420 2306999 2356894 2417833 2230697
13992 2230697 2190355 2325527 2877540 3819234 5983767 13606261 31756477 48947944 27795286
13983 27795286 13932314 8403583 6679741 5030049 4645176 3595926 3705476 3372390
13975 3372390 3251021 3077627 2904152 2972774 2777293 2846343 2742998 2596383 2485914 2684394
13965 2684394 2534302 2435673 2513788 2135217 2062313 2338463 2627520 2547216 2455800 2084668
13955 2084668 2182341 2241071 1825987 2269748 1978986 2041057 2088208 2277059 2230541 1876425
13945A876425K99634j49386k70269L1435O308K9659m7512K26461J18237j73990
13935A947002m7286j15771M5246n2356K54841j71949j55256M66645n80297M31122
13925B021941l05863O2564M2647K41265o79808J10461r809K56325L05684m02830
13915A642577j90855L00098k96799L26922k56095j42896L64587r7k25439J67134
13905A689137j60940K23078o419K01265k84131l36219k9236k3593K41577l12961
13895A201558r5456K88554J21298j68138L32010j58806j87767K52703O083o39609
13885I52430K95075K6188q9885m5552J51399j4624L7934J61469m1414l36472L19944
13874A416492J2995l53755M9991j52616K67721j43593J12773J37700J72478m74012
$$ plain form
13945 1876425 2176059 2026673 1756404 1787839 1794147 1823806 1776294 2002755 2120992 1947002
13935 1947002 1899716 1783945 1829191 1776835 2031676 1859727 1704471 2171116 1590819 2021941
13925 2021941 1716078 1778642 1821289 2062554 1382746 1493207 1483398 1739723 2045407 1642577
13915 1642577 1451722 1751820 1455021 1781943 1525848 1382952 1747539 1747442 1522003 1689137
13905 1689137 1528197 1751275 1744856 1946121 1661990 1325771 1296535 1272942 1514519 1201558
13895 1201558 1106102 1394656 1515954 1347816 1679826 1521020 1333253 1585956 1592039 952430
13885 952430 1247505 1273693 1183808 1138256 1289655 1275031 1312965 1474434 1433020 1096548 1416492
13874 1416492 1429487 1075732 1125723 973107 1240828 1097235 1210008 1347708 1520186 1046174
13864A046174j20441J03545K08514l96480N98298l05744J59496j67286r7427J85707
13854A214356j42967L1284j02599J03366L27043k86345l49744n0459K52506K95989
13844A292430q1436r8877j84708N6569J00089J39743m93442J72540K05471J0835
13834A119214o3087k12826K29051N852j95088L01818l8149l31098m5665L40304
13824A110326m2442l46694J86969K3970O5606J79172J3492l44235J26202J7043
13814I89409L4064j33966L71974m96768k01512N28407J842k29795p5434j80225
13804F07996N79174k65734k29916M85550l31410l12640K16570j45906N73463E25458
13793E30514L19710q2222R5209K1343l52347K42504J05644k14372K45754J15830
$$ plain form
13864 1046174 925733 1029278 1237792 841312 1439610 1133866 1293362 1126076 1028649 1214356
13854 1214356 1071389 1102673 1000074 1103440 1430483 1144138 794394 743935 996441 1292430
13844 1292430 1210994 1112117 927409 983978 1084067 1223810 730368 902908 1108379 1119214
13834 1119214 1056127 843301 1072352 1078204 883116 1184934 1146785 815687 770022 1110326
13824 1110326 1067884 721190 908159 932129 997735 1176907 1190399 846164 972366 989409
13814 989409 1023473 889507 1261481 764713 563201 1091608 1093450 863655 788221 607996
13804 607996 1187170 921436 691520 1177070 845660 533020 749590 603684 1177147 525458
13793 530514 850224 768002 863211 884554 532207 774711 880355 665983 911737 1027567
13783A027567j20609k48719L11108k44532M9319q8490j79855L09834k45753R5222
13773F65092L14454k78580j9768k16536J03958O6387L05277p0091l10232M82772
13763A042733m91905R1988N6990N1504J43510k78519J21505p8724J99017r3427
13753G64672j1680K6554k12328L5441J20790j31317J17745J8310j96699J14100
13743F45588L8781C30054K1545J74075Q8335P462B93907N99698k87633P6295B66152
13731F47833K41084j25265l37161L51966j69382O2854M3388R9747j96731k58786
13721C59547L97700j98135J9734J57089m9839M9444L417P6953C46897O8599K66833
13710F82329K77169k55439k6170j23707N2685k85874K02561J14286B21282K17854
$$ plain form
13783 1027567 906958 658239 969347 724815 774134 685644 505789 815623 569870 665092
13773 665092 979546 700966 681198 464662 568620 635007 940284 870193 559961 1042733
13763 1042733 550828 642816 699806 751310 894820 616301 737806 659082 858099 764672
13753 764672 752992 779546 567218 602659 723449 592132 709877 728187 531488 645588
13743 645588 684369 330054 351599 525674 614009 621471 293907 893605 605972 682267 266152
13731 647833 888917 763652 426491 778457 609075 671929 715317 815064 618333 359547
13721 359547 757247 559112 578846 735935 686096 735540 738957 815910 346897 415496 682329
13710 682329 959498 704059 677889 554182 606867 320993 523554 637840 221282 439136
13700D39136J17013k50040K74854K9981k56197L66223l1006j14281R0316k07847
13690D58152J5778p2740P5794P2827K04150j42928j62348J94960o9572j90506
13680C83567P012L74365j64875p4660j6632J5865O6718j6109A79891L75866p5872
13669D79885J39755A64541N00648B52718L77774Q3008p1531p4607A83589M01854
13659E85443O1062j37109O7170o2602J8770J70866J81100B70054L65910A21351
13648F40808j31109k54795K83446J60976j88663K8008k0004J96135B31644K71547
13638E03191M54509C55827l980J15612J79257j76966K15672J11566C43464J1512
13628C54976L77677l00231A58030K60413J03980p8858K03764N6581B89321J28861
$$ plain form
13700 439136 556149 306109 580963 610944 354747 720970 689964 575683 665999 458152
13690 458152 473930 401190 476984 549811 753961 611033 448685 643645 574073 383567
13680 383567 390579 764944 600069 525409 508777 524642 591360 575251 179891 555757 479885
13669 479885 619640 164541 665189 252718 630492 713500 641969 567362 183589 585443
13659 585443 646505 509396 576566 513964 532734 703600 884700 270054 635964 121351
13648 640808 509699 254904 538350 699326 510663 538671 518667 714802 231644 503191
13638 503191 957700 355827 351847 467459 646716 469750 685422 796988 343464 354976
13628 354976 732653 432422 158030 418443 522423 443565 647329 703910 289321 418182
13618D18182j47830O4263O7690J29684r8002K3988A09782M91244B02247L22177
13608E24424B22693K19022J83414k87187O1023J6734j9935k8895A04350L49347
13598D53697j01907J94766j25794A56167J48699j32311L66565k35344R921R0861
13588D04558J7819A84028M09270B71840A27377K26989K58994P7115C05885J13488
13578D19373j84168K2965J89034A03609J2790J84806r83n2200g4270D91902B17909
13566E34112j07454A43330L12799Q6599k67283J22410j00687M6967j41002k4226
13556A78907L77938G5713L85887k3828J5373j26854K98920A74992J72628J21759
13546D69379J8864p278j78926j13393K62569A91031K2250P6924l6363J40040J85350
$$ plain form
13618 418182 270352 334615 402305 531989 433987 457975 109782 601026 202247 524424
13608 524424 222693 441715 625129 337942 398965 415699 395764 366869 104350 453697
13598 453697 351790 546556 420762 156167 304866 172555 539120 303776 313697 404558
13588 404558 422377 184028 593298 271840 127377 354366 613360 690475 305885 419373
13578 419373 235205 258170 447204 103609 116399 301205 300222 248022 -74270 491902 217909
13566 534112 426658 143330 456129 542728 275445 397855 297168 344135 203133 178907
13556 178907 556845 75713 461600 437772 453145 326291 625211 174992 347620 469379
13546 469379 488243 480965 302039 188646 451215 191031 213281 290205 253842 393882 579232
13535E79232o6278k31146q8172J18975F8963L21888q108q0984J09080J63235k31002
13524C43072j24453q6214L34794B0077L13481o8020K27345k22528O2486D7648
13513A68147J38256j51499G3231L57008R4158F7803K53336j8570A50377J91303
13503C41680K44975A50796J56126A11330O30341A94072M29320j94556m1730j63521
13493B23585i8960B44327J63645A32790J24364J6076o0255a54442B79440E2809
13482B35615j17153K6115K57471q0299j43863L68634k25844A11966J29641B6930
13471D36082j41951J92293k39560P7137j49858D1290M02068j59915l7917L98591
13461F44117k22482H5998m0614K17527J79942D4437J34336P5207C2702M92675
$$ plain form
13535 579232 512954 281808 193636 312611 68963 390851 382743 301759 410839 574074 343072
13524 343072 218619 132405 467199 20077 333558 265538 492883 270355 332841 47648
13513 168147 306403 154904 73231 430239 524397 67803 321139 302569 150377 341680
13503 341680 586655 150796 306922 111330 741671 194072 623392 428836 387106 223585
13493 223585 -98960 244327 407972 132790 257154 273230 212975 -154442 279440 52809
13482 235615 118462 144577 402048 321749 177886 546520 320676 111966 241607 26930
13471 436082 294131 486424 246864 324001 174143 41290 443358 283443 245526 644117
13461 644117 421635 85998 45384 262911 442853 44437 178773 253980 32702 525377
13451E25377B07089R1030A32097K14051A47404F386L40630l5249A41687Q7875
13441B29562J12616j8851I0884L93042J42680k45059M1103E6315P0967M16192
13431E43474A64363j2446O7088J10422j58792a83702A85362C3799J10943L9399
13421A84141J1747b3556C10423J1945J6273k8663Q26a30649B53376J2965o326
13410B60015C1625K72139j07150J99882I4655d1613E73995a38329B24441a47922
13399b14818A63492m9566J90897a87077N5413D4113L9261b6324B58934B2916L25518
13388C48434k1695p1842A21982L28706A15295C0330M4536k4603a6251C30595F5669
13376D19227b5920A88065H7950L06417j75969K20037j27364A22138C9246J31339
$$ plain form
13451 525377 207089 298119 132097 346148 147404 6386 347016 311767 141687 229562
13441 229562 342178 323327 90884 483926 626606 381547 422650 56315 127282 543474
13431 543474 164363 151917 219005 329427 170635 -183702 185362 33799 144742 184141
13421 184141 195888 -23556 310423 322368 338641 309978 310804 -130649 253376 266341 260015
13410 260015 31625 303764 196614 396496 94655 -41613 573995 -138329 224441 -147922
13399 -214818 163492 113926 304823 -187077 -131664 44113 83374 -26324 258934 22916 348434
13388 348434 326739 254897 121982 450688 115295 30330 74866 50263 -16251 330595 65669
13376 419227 -25920 188065 87950 394367 218398 438435 311071 122138 39246 170585
13366A70585l1947M22747d2796H7459N44145A07436K91705M2854p1266k1543h0876
13354H8674N3144Q8555o9784M1476e7376B69044G2911K29350L47805k98571r8980
13343B52515J44829O9782j44789K21047n7570k0824k22837J82713K3442P4104
13333E22412g0006B60218J42236B6969L25417A22363J74602J56021E8113c2676
13322D76355j62719a72420C16840A25624d563B89013L6498p0287J83926B17324
13311C43060I1881F148M0860J11918p075L6830f735C10074A41797N9454K9973
13300B31224J65651A42185J4165J73479E0995L01597A55718J48164J6826A27837
13289a2219A97271m8470h9511D98313a07094C58465a11816B17798G8957b20769
$$ plain form
13366 170585 138638 561385 -42796 87459 631604 107436 399141 441995 370729 349186 -80876
13354 88674 141818 230373 160589 202065 -57376 269044 72911 302261 650066 351495 252515
13343 252515 397344 467126 322337 543384 485814 464990 242153 424866 448308 522412
13333 522412 -70006 260218 402454 26969 352386 122363 296965 452986 58113 -32676
13322 476355 313636 -172420 316840 125624 -4563 289013 325511 255224 439150 217324
13311 343060 91881 6148 47008 158926 151851 188681 -6735 310074 141797 201251 231224
13300 231224 396875 142185 156350 329829 50995 352592 155718 303882 320708 127837
13289 -12219 197271 148801 -89511 498313 -107094 358465 -111816 217798 78957 -220769
13278A953J84465r1381J79930L2232b5535j85959A62517A3030K10862Q5759j25912
13267A83739O1913e590A53749a04890C69440j24589a66465A53973M9494K56563
13257D60030k08513P0721A01121J50174E1373c96663g3148B35612a18170B28241
13246D74815a23943I0722J02411J1152J44457A24127P8800I9003d446j02618M7782
13235e9282G1214L00893r9964F433h6871J1139A43289J79902E3369h9267B00721
13223C00404L40311B55697b9730C52904d3575I0946d664A67426k41a6937k92240
13212c09177D6694L45455C3270J16304R9896a39173o6452A81905e0A43742R5777
13201B39519j1267C4298K71273j37228R7874P2016A68135k4004g3755m1513C73036
$$ plain form
13278 1953 186418 95037 274967 307199 -25535 -211494 162517 13030 223892 309651 183739
13267 183739 245652 -5590 153749 -104890 369440 244851 -166465 153973 203467 460030
13257 460030 251517 322238 101121 251295 51373 -396663 -73148 235612 -118170 228241
13246 474815 -123943 90722 193133 204285 348742 124127 202927 99003 -4446 -107064 -59282
13235 -59282 71214 372107 272143 6433 -86871 -75732 143289 323191 53369 -89267 200721
13223 300404 640715 255697 -29730 352904 -43575 90946 -4664 167426 167185 -16937 -309177
13212 -309177 46694 392149 33270 149574 249470 -139173 -205625 181905 -50 143742 239519
13201 239519 228252 34298 305571 168343 266217 338233 168135 144131 -73755 -115268 373036
13189A72351p7399i273F4936J77606P1531g5299l91421A02152p586A5996K42076
13178B58072m7410J81178K444A93325D4132J94563c01057b4742B47684b7604F0061
13166B86029N331Q521b5388A48022j9844K6903D196N10548b6786j48105A03849
13154a4656n8741A83579f8059D8270i2991A70160l7445i0484D97133a03048B92690
13142C66007I1992a8569A69033C6622A5780f2446D42325k9620Q5610k39346J80207
13131D39176l7286i7218H8421K7158g0674B56723a75641c8558A19828O108J02031
13120B27967a6771j30642B49168q9392p5595L52797A77390l539o0827N3205p6248
13109H9981E617f7761c2019B18610i0694c1469k63789A00285m3133K07702G0021
$$ plain form
13189 172351 94952 -9273 64936 242542 314073 -75299 -466720 102152 94566 15996 258072
13178 258072 210662 391840 394284 193325 44132 238695 -301057 -24742 247684 -27604 60061
13166 286029 291360 299881 -25388 148022 128178 155081 4196 514744 -26786 -174891 103849
13154 -14656 -73397 183579 -68059 48270 -92991 170160 132715 -90484 497133 -103048 292690
13142 366007 91992 -18569 169033 36622 15780 -62446 442325 412705 498315 258969 439176
13131 439176 401890 -97218 88421 115579 -70674 256723 -175641 -38558 119828 125936 227967
13120 227967 -16771 -147413 249168 159776 84181 436978 177390 173851 113024 166229 89981
13109 89981 5617 -67761 -32019 218610 -90694 -31469 -295258 100285 57152 264854 70021
13097B06669c7675A28137P5959A6978P7510m0190a01270k7116M8596F818M70472
13086D77290c3064j2362A47742a60461A32658J10179c18928a26673j15640I1021
13075A30086J5999J18475a16492J5337j25586M9338N4067A84416J67144j36379
13065B15181H0959K93083j40742b09786d0504B61621A14623c05608c2620k04939
13055b37559J8741A94377o7556M6553d3128D99104A39958K54051I3633C8784K28646
13044B67430d1233B88041a2814p2222A06827L3585L0678a36399A30441J03676
13034B34117e7347j97597h3110f82B93799A18169J08033L5547c5796A30675P8109
13023B08784L1449A8908L2191L230P186j5874a1038j03558F0202J70876j4152
$$ plain form
13097 206669 -37675 128137 204096 16978 94488 54298 -101270 -128386 -79790 6818 477290
13086 477290 -33064 -45426 147742 -160461 132658 242837 -318928 -126673 -242313 91021
13075 130086 146085 264560 -116492 -101155 -226741 -177403 -123336 184416 351560 215181
13065 215181 80959 374042 233300 -209786 -40504 261621 114623 -305608 -32620 -237559
13055 -237559 -218818 194377 126821 173374 -43128 499104 139958 394009 93633 38784 267430
13044 267430 -41233 288041 -12814 -85036 106827 140412 171090 -136399 130441 234117
13034 234117 -57347 -254944 -83110 -682 293799 118169 226202 261749 -35796 130675 208784
13023 208784 240233 18908 51099 54329 61515 45641 -11038 -114596 60202 231078 216926
13012B16926h8100B53035a12875b6442B59905A363b6082o0615H0873a5410L572
13001a1838c763C7015M98348I179a51048J6476C29685H2495J1924l0560r421M16774
12989D71212A15737L26287H0174j9319J74664a697r2733A6987f9956C3913F447
12977a19519I0886a6406F1208b49833D6286a91508A76635K2392J32836h0866D2739
12965i0538M1611a0524I1587j9961K1876J51579K68150B00818a40686C14656q9262
12954B25394A5835J40388J95151A23562j9938g578F07253a43231D7009a20932
12943a96724A6298b15087B6181K93367j14324h0183A78947H5770J57700r5335
12933A48135p3161M8426n0652Q3295b76524B08597Q8891E4512J1350a29355p1710
$$ plain form
13012 216926 -88100 253035 -112875 -26442 259905 1363 -26082 -86697 80873 -15410 -11838
13001 -11838 -3763 37015 535363 9179 -151048 -134572 329685 82495 94419 63859 54438 471212
12989 471212 115737 442024 80174 60855 235519 -1697 -94430 16987 -69956 33913 6447
12977 -119519 90886 -16406 61208 -249833 46286 -191508 176635 199027 331863 -80866 42739
12965 -90538 -48927 -10524 91587 71626 93502 245081 513231 200818 -140686 314656 225394
12954 225394 15835 156223 351374 123562 103624 -7578 607253 -143231 47009 -120932
12943 -196724 16298 -215087 26181 319548 205224 -80183 178947 85770 243470 148135
12933 148135 74974 123400 72748 156043 -276524 208597 297488 54512 65862 -129355 -201065
12922b01065I2556d4549o0435C07986g1701B18494a82239A28392b68173C02886
12911h991A60309n5398M6473h1299A86778J0198l6292J12848F1142B4888J42738
12900A67626C0386d16690d1958j28823b9439k87494F3199a31484a2723I3682a35185
12888a15513A97896E777L23692A07877Q8419J12788e6450l4367j13503A00691
12877A63142l0833H625c7552J428C35102g3148C7782i8370d4358r1976o2221b3680
12864E5328a1542B4530b2369p2966A65439J90391k0107a36694A66484K7369h76
12852A63797n0918f798l54270D1384J27108a7692A84075r937k533e1860K5372
12841b6488A86747K0913M1601i0518A47455d1438A3788O951O8899a39158J2675
$$ plain form
12922 -201065 92556 -44549 -104984 307986 -71701 218494 -182239 128392 -268173 302886
12911 -8991 160309 104911 151384 -81299 186778 196976 160684 273532 61142 24888 167626
12900 167626 30386 -416690 -41958 -170781 -29439 -316933 63199 -131484 -12723 93682 -135185
12888 -115513 197896 5777 329469 107877 196296 309084 -56450 -90817 -204320 100691
12877 163142 132309 8625 -37552 -36124 335102 -73148 37782 -98370 -44358 -136334 -198555 -23680
12864 55328 -11542 24530 -22369 -95335 165439 355830 335723 -136694 166484 193853 -876
12852 163797 112879 -6798 -361068 41384 168492 -17692 184075 174138 171605 -51860 -26488
12841 -26488 186747 207660 249261 -90518 147455 -41438 13788 20739 89638 -139158 -126483
12830a26483K0281j15530J5229B09665c3200A56002C736a30296q1268g0026m7083
12819a17109k01833B10098H5733D2812R7574b14291A5555J61997L7817J4203a65979
12807A9907c95932A77512J37630i0612A95013f1904A16239b77347a05136G8188
12796A51989h1417k7849E3423M770A3613J81918a34810B27801I8469c5136C82527
12784e5938l84332i091B65784i9128B32429r591c2189j37636B49693g2910A09808
12772A97996a30518C99045A55655o6613D0001P591b27226A71655M9632G0727k3250
12761D7477J63536d444m5487B74800a33867a6845A42732O5571b21442a2146B71497
12749G5552b32293A87000E1316k0M1160b74304a5097H006K99339A890K6899a477
$$ plain form
12830 -126483 -106202 -221732 -206503 209665 -33200 156002 3736 -130296 -211564 -70026 -117109
12819 -117109 -318942 210098 85733 42812 140386 -214291 15555 177552 215369 229572 -165979
12807 19907 -395932 177512 315142 -90612 195013 -61904 116239 -277347 -105136 78188
12796 151989 -81417 -109266 53423 58193 13613 195531 -134810 227801 98469 -35136 382527
12784 -55938 -440270 -9091 265784 -99128 232429 222838 -32189 -169825 249693 -72910 109808
12772 197996 -130518 399045 155655 89042 40001 47592 -227226 171655 221287 70727 47477
12761 47477 211013 -4444 -49931 274800 -133867 -16845 142732 208303 -221442 -12146 271497
12749 75552 -232293 187000 51316 51296 92456 -274304 -15097 8006 307345 1890 28789 -1477
12736A62737a03628A3006e437A09595J69604j29353e4313B4931J07235o3455A0437
12724B01135a20093B55076b04313A69539A5937e7452F7213k3780K16833r2027
12714A68239K27144b6484o7203B56847q0860a8950j15893B239f6150A25739J66653
12703B92392l1960j18476h0242B32704c33228G190J49324a0839r158B62401d49978
12691C56053a89559A24859i4855p0074K3058D5994J177M3640B3140R4284b5651
12679c33129f4218n4132H0257J86h6861A27638c3660j1587n37k1840C73586D2553
12666e9837C73353A33118J36811b72972A90033r1252m0305N69510A15188l1555
12656H3633J44577J05629j11945B8813K79645A22841m3575J95939a93718f8222
$$ plain form
12736 162737 -103628 13006 -5437 109595 279199 149846 -54313 24931 132166 68711 10437
12724 201135 -120093 255076 -204313 169539 15937 -57452 67213 43433 260266 168239
12714 168239 395383 -26484 -93687 256847 175987 -18950 -134843 2239 -66150 125739 292392
12703 292392 260432 141956 -80242 232704 -333228 7190 156514 -10839 -19997 262401 -449978
12691 356053 -189559 124859 -94855 -164929 -141871 45994 47171 90811 23140 117424 -25651
12679 -333129 -64218 -118350 80257 80443 -86861 127638 -33660 -45247 -45784 -67624 373586 42553
12666 -59837 373353 133118 269929 -272972 190033 98781 58476 627986 115188 83633
12656 83633 228210 333839 221894 28813 308458 122841 79266 275205 -193718 -68222
12645A31152j8848G827d6169D0342K01974C2188m503c33829A35558D3613J66953
12634B10566h0187K7348A37999E1196h5270F9196J06513Q1629j6102C6847K16071
12623B52918n6227b0334D78468A19451N63477i6216G5488b23281C22173a69923
12612I0040B4089O4005j5393j7156J00491B997K24207c5844C33526f6238F8518
12600B13730N9183j03621J37549k0389A8313C672J17480K167e6962B32366o5618
12589A66748a17084C91310G9903J14928K0606b15102B29052a90337B9561K28060
12579B57621a89717B4378J20989b50810b2883C79679H1337P6901E2672R5256F3620
12567a87989A30673k8597f9507r5730P1012b2402A59816a75595A74441j5361h0368
$$ plain form
12645 131152 112304 7827 -46169 40342 242316 32188 27685 -333829 135558 43613 210566
12634 210566 -80187 -52839 137999 51196 -85270 69196 175709 257338 241236 36847 252918
12623 252918 196691 -20334 478468 119451 682928 -96216 75488 -223281 322173 -169923
12612 90040 24089 88094 72701 55545 156036 2997 227204 -35844 333526 -66238 68518
12600 213730 272913 169292 306841 286452 18313 3672 121152 123319 -56962 232366 166748
12589 166748 -117084 391310 79903 194831 215437 -215102 229052 -190337 29561 257621
12579 257621 -189717 24378 145367 -250810 -22883 379679 81337 158238 52672 147928 63620
12567 -187989 130673 102076 -69507 -165237 -94225 -22402 159816 -175595 174441 159080 -80368
12555a23303E8476K7505e8031o217H8451e166G8782f5606k3863E0800M8973J75076
12543B74849G4024g1484k6980j0644I9515D8065a0081A6131J1916L17527a69504
12531F3875b91986H0619a24899E4894J76657l3534E5469a85147A4390i1511A81087
12519b95139I2320L3752J46283f6509A04762L38762H1775O1676J20640l293h6652
12507A47763a85493A59960J46719j39418o0464A6490l652J24234E8307g9274H9044
12495A29496j2011i8829k30097J58864M3195A27072C8447a65148A33296c7888
12484A49770o2802b07994E8998J98909j27141a25261I4801a06938C6019J07224
12474A43243J6877B082b2679j16764A05810k2242f2167I4950P6821i9085F005
$$ plain form
12555 -123303 58476 85981 -58031 -64248 88451 -5166 78782 -65606 -89469 50800 99773 274849
12543 274849 74024 -71484 -98464 -109108 99515 48065 -10081 16131 28047 345574 -169504
12531 63875 -291986 80619 -124899 54894 231551 198017 55469 -185147 14390 -91511 181087
12519 -295139 92320 126072 272355 -66509 104762 443524 81775 143451 264091 260798 -86652
12507 147763 -185493 159960 306679 167261 106797 16490 12838 137072 58307 -79274 89044
12495 129496 117485 -98829 -328926 -170062 -126867 127072 38447 -165148 133296 -37888
12484 149770 86968 -207994 58998 257907 130766 -125261 94801 -106938 36019 143243
12474 143243 160120 2082 -22679 -139443 105810 83568 -62167 94950 171771 -99085 6005
12462b63760i215G2894K88416a67572I1562B1619a26704k1344A68186e3517B33308
12450C8888J35975a69826A29524a60737C0228J34206k8318a47759B0014J94478
12440B14492a85280B70960A25590E2657M02300a4131o4401k16117F252a44188
12429a36241K6644b7247B09773b11248B57743c56854i6349E4441b18703K381j6245
12418b32567e2522h922n6428r673A41523o5898b53665A2661a90950Q0229a0665
12406e193D47444b60122a23152C2367Q6837K11466F1949K40402k4480D2324J4906
12395E7230a38017j58626J28675B8169a79859B9080J04490K4871b2634n1190l7559
12384a11383h809o5689B31773G7195R469O9478c9816l08544A14163b94994e2909
$$ plain form
12462 -263760 -9215 72894 361310 -167572 91562 21619 -126704 -148048 168186 -53517 233308
12450 38888 174863 -169826 129524 -160737 30228 164434 136116 -147759 20014 214492
12440 214492 -185280 270960 125590 52657 454957 -14131 -78532 -294649 6252 -144188
12429 -136241 -109597 -27247 209773 -211248 257743 -356854 -96349 54441 -218703 -216322 -232567
12418 -232567 -52522 -8922 -65350 -75023 141523 75625 -253665 12661 -190950 -110721 -10665
12406 -5193 447444 -260122 -123152 32367 119204 330670 61949 302351 277871 42324 57230
12395 57230 -138017 -296643 -167968 28169 -179859 29080 133570 158441 -22634 -73824 -111383
12384 -111383 -8809 -74498 231773 77195 86664 156142 -39816 -348360 114163 -294994 -52909
12372A70743J7635F9896M0794j6990K37978r0196b43768f0083o9915c6057A64755
12360g1363E6747b14608O5179A06472a9016j41958e1419p5359j22320B37220a6788
12348b08152P0804A74328b28158b673G0502K00644a09371k0445D18843b39621
12337g2188B28313J57859D3193g8839e198K226H3255a31471b3240j90585a5089
12325A13921b62696A13825J5514L10223d313k11395A36376b20646G0612f046D4124
12313b93598a18558A40141c29366A15230C5217e884k1451A31061h439o0540b6829
12301A1148a49412P2224A87938G7365N0493b0466k30348A01432J43549b81094
12290h8678J8183o1297I6346a61680J3337B67737K5328b02679B25018n0354n2625
$$ plain form
12372 170743 188378 69896 110690 93700 331678 241482 -243768 -60083 -129998 -36057 164755
12360 -71363 56747 -214608 -149429 106472 -19016 -160974 -51419 -126778 -249098 237220 -16788
12348 -208152 -137348 174328 -228158 -2673 70502 271146 -109371 -129816 418843 -239621
12337 -72188 228313 386172 43193 -78839 -5198 -2972 83255 -131471 -23240 -213825 -15089
12325 113921 -262696 113825 129339 439562 -4313 -215708 136376 -220646 70612 -6046 44124
12313 -293598 -118558 140141 -329366 115230 35217 -5884 -27335 131061 -8439 -68979 -26829
12301 11148 -149412 -77188 187938 77365 127858 -20466 -250814 101432 244981 -281094
12290 -88678 -70495 -131792 96346 -161680 -148343 267737 293065 -202679 225018 174664 122039
12279A22039K8541Q8519b86926e2199A87816a57157H846K93832D9492P1593Q257
12268A29342a13505K1212B34869c03796C53849j4169A15063A468L09290k0207
12258B90551a97631B30750a61720C17594a04627j0243G3868k0528K55398p3190
12248B35548O288f0168A39885J32654J58857e0395C72009b98153D08013n8385
12238C49628m7394G3060g8542B04109b14510C3465J8169L93919j76842A00098
12227E0908M8551L50425A08370J90730A44858o4485M74412j80607A64304e0023
12216D10994A44679a56831A77901j5762G3826P0268D1608d8722B60910a53577
12205A52977c3836A09182L41801A54669J742N2348o7866K57395d64147D11309
$$ plain form
12279 122039 150580 239099 -286926 -52199 187816 -157157 8846 302678 49492 121085 129342
12268 129342 -113505 -92293 234869 -303796 353849 339680 115063 1468 310758 290551
12258 290551 -197631 230750 -161720 317594 -104627 -114870 73868 53340 308738 235548
12248 235548 241836 -60168 139885 272539 431396 -50395 372009 -298153 408013 349628
12238 349628 302234 73060 -78542 204109 -214510 33465 51634 445553 268711 100098
12227 50908 99459 449884 108370 299100 144858 80373 554785 374178 164304 -50023
12216 410994 144679 -156831 177901 162139 73826 144094 41608 -48722 260910 -153577
12205 152977 -33836 109182 450983 154669 156411 208759 140893 398288 -464147 411309
12194D5246J64575k5034a43910A07348e2029D09979E6139b09742B27824C9535
12183B22072a44030A16099B0028M7155r528J16360M2011p2695d2684I0749J00093
12172A90842J67779A71040j6842o8973M12902P4341k69493N212L28g7115a4173
12160B93842N1411G6699J57133j0258m2828K41902B01439e6178A26833a68881
12149c71966A0828Q6248J63324G7991a06964C68511a20443C93558i3826B75973
12138A20667a16459b8866j4893B4395J43183e64181a70818a801n3072I0213K99944
12127C90157a67523A21419L1582g7662F3702K86813f6955B64309o7708i0674K4256
12116f6418F9915h5787M0533B5141i1115b663F5805b16974O8597A50980b1278
$$ plain form
12194 45246 209821 184787 -143910 107348 -52029 409979 56139 -209742 227824 39535
12183 222072 -144030 116099 20028 67183 57655 174015 216026 143331 -42684 90749 190842
12172 190842 358621 171040 154198 85225 498127 572468 302975 308187 308515 -77115 -14173
12160 293842 345253 76699 233832 223574 180746 422648 201439 -56178 126833 -168881
12149 -371966 10828 97076 260400 77991 -106964 368511 -120443 393558 -93826 275973
12138 120667 -116459 -28866 -43759 24395 167578 -564181 -170818 -1801 -54873 90213 390157
12127 390157 -167523 121419 153001 -77662 63702 350515 -66955 264309 196601 -90674 -66418
12116 -66418 69915 -85787 -45254 25141 -91115 -2663 65805 -216974 -148377 150980 -21278
12104F1137g0876a3574k06320Q0224I4084Q3560g0400C66079b35195D7009a22817
12092D7797c32513a65157P4564C2701B826b20469p6233j01225a01974A52774a43948
12080c9448j23488k84703d3317A04017J945d8781K3686q9401C70902d6425B21289
12068f0951q6779D5568J25432E0872f0497K3899A0585b10019b2523A44964n5797
12057H9167e0889B86237F006M69738J196554G17228B2176Q4690B6697K40504j30797
12046A36404a99766l64303a80038P0874A17290N0019k4163d5589j89858D778a4357
12034i7171j1378L721A06970l5913k7543d60006A33066i2927o9374F0356b99040
12022A380c18719A30606G987O215K0007P8083b53965M2770C23478b13607A76626
$$ plain form
12104 61137 -70876 -13574 -219894 -139670 94084 177644 -70400 366079 -235195 47009 -122817
12092 47797 -332513 -165157 -90593 32701 2826 -220469 -296702 -397927 -101974 152774 -143948
12080 -39448 -162936 -447639 -43317 104017 105962 -48781 -25095 -114496 370902 -46425 221289
12068 -60951 -147730 45568 171000 50872 -60497 -36598 10585 -210019 -22523 144964 89167
12057 89167 -50889 286237 6006 475744 1672298 717228 22176 106866 26697 267201 136404
12046 136404 -199766 -564069 -180038 -109164 117290 167309 143146 -45589 -235447 4778 -14357
12034 -97171 -108549 -104828 106970 71057 43514 -460006 133066 -92927 -162301 60356 -299040
12022 1380 -318719 130606 7987 14202 34209 112292 -253965 -211195 323478 -213607 176626
12010B04827b0424F0947c15898D3229K60905O7315D4022b43291I5656a78481B28698
11998a483H0185h5880E728g3352m5807A88923K60150a65655C10412D6594b33373
11986a06393b3479j30827B94648a52423d9655A71251C8271b45771O6212Q8182
11976i1377B96794E4567Q5527B6133R523O3374N4031a24540A00972K49085g654
11964h7358j82938J08433q232H8959l4877a80384P8792H5388c35457g2301B09312
11952b79805d5462J7941n5337A91678F3655i6333C1413b1697D1543a0357j52387
11941a62744D9434d8657j67363A3594J89565h6599B16785a88558B721L49643A01578
11929A90343J04659h8066k0476B7337J4898a60956I2706c99703M2205D6040e2836
$$ plain form
12010 204827 -20424 60947 -315898 43229 304134 371449 44022 -243291 95656 -178481 228698
11998 -1483 80185 -85880 5728 -73352 -119159 188923 449073 -165655 310412 46594 -233373
11986 -106393 -23479 -154306 294648 -152423 -49655 171251 38271 -245771 -179559 -91377
11976 -91377 296794 54567 140094 26133 35656 99030 153061 -124540 100972 350057 -7654
11964 -87358 -270296 -161863 -170095 88959 54082 -180384 -101592 85388 -335457 -72301 209312
11952 -279805 -45462 -27521 -82858 191678 63655 -96333 31413 -21697 41543 -10357 -162744
11941 -162744 49434 -48657 -216020 13594 203159 -86599 216785 -188558 2721 352364 101578
11929 190343 295002 -88066 -108542 27337 42235 -160956 92706 -399703 -357498 46040 -52836
11917c4421p7621c3585C88718A23299f0019A61948e3233k9585k90741C91404C9485
11905a00471A77698b29198c7127B74621A19553m0666b1610C1610M62112a15263
11894b93040A17253l9192a47470e1432q0258a5126j0396A02648i6448A76579G8562
11882a997j12018G1998b35900N5373A50745L3385M2466J76611a70603A41798D8060
11870a8543D1172a39327e7592j21457K2426A4947B719N6432b17291c4443p6330
11859a10773A82807f8516j49955j4826L1911B61554c01187i4480C91371a49754
11848a17465E280J03448D615b16518l8652E0390K141a41056A73666i6597B08065
11836A25317B1221a06693k22972B63643h1283d709C26310g6065k48069C88318
$$ plain form
11917 -34421 -112042 -33585 388718 123299 -60019 161948 -53233 -82818 -373559 391404 39485
11905 -100471 177698 -229198 -37127 274621 119553 78887 -21610 31610 493722 -115263
11894 -293040 117253 78061 -147470 -51432 -131690 -15126 -25522 102648 -96448 176579 78562
11882 -1997 -114015 71998 -235900 -180527 150745 184130 226596 403207 -170603 141798 48060
11870 -18543 41172 -139327 -57592 -179049 -156623 14947 2719 59151 -217291 -34443 -110773
11859 -110773 182807 -68516 -218471 -233297 -201386 261554 -301187 -94480 391371 -149754
11848 -117465 5280 108728 4615 -216518 -255170 50390 52531 -141056 173666 -96597 208065
11836 125317 21221 -106693 -329665 263643 -81283 -4709 326310 -76065 -324134 388318
11825a63776k4705i4120H8902a11635i935o3841A37319c02927J9212H3316c08180
11813b28663a9161l50240J79582B6849g4703C02144j27443g7814n6516A3692K57092
11802B70784h0037D6631a09148A00312c37350c9496k13309a03683D3811i1551
11791g608F5326f4273l18669c4342R543B4947a64261j30410b5586F4668J2242
11780G6910R9609b8670j62948P0318j64562a1362B12420b28738B95896i7608I5045
11768h1011A47915m3188L7805e6581k7812k36753a22902o1577N9635j97457M2040
11757b80261j09128a94141c8704A8863J5233L6393e040j89270H9254l2543R6993
11746A53704f36089A26957N9155a07965H9296c415B8392K2316f3412H468J296
$$ plain form
11825 -163776 -188481 -94120 88902 -111635 -9935 -73776 137319 -302927 -283715 83316 -308180
11813 -228663 -19161 -369401 -189819 26849 -74703 302144 174701 -77814 -134330 13692 270784
11802 270784 -80037 46631 -109148 100312 -337350 -39496 -252805 -103683 43811 -91551
11791 -7608 65326 -64273 -382942 -34342 -24799 24947 -164261 -294671 -25586 64668 76910
11780 76910 176519 -28670 -191618 -121300 -285862 -11362 212420 -228738 295896 -97608 95045
11768 -81011 147915 104727 142532 -56581 -84393 -321146 -122902 -184479 -124844 -322301 -280261
11757 -280261 -389389 -194141 -38704 18863 34096 70489 -5040 -194310 89254 56711 153704
11746 153704 -636089 126957 186112 -107965 89296 -3415 28392 50708 -63412 8468 9764
11735I764L4877J52780a2586k74755J39583A23158b2353l95679J60321A90196
11724A52067c25312A98375B8815e27780c1876A81825a82624B27396a81229A57186
11713a45422B53398c07554A86294F2371c891k59716e2802k38114d3788H4692a51
11701b67724J22253l1263P0615G4334a81511l5922A91496a46074n2876B5784N3490
11690G9274n074a96834A04388c7957j03094J3912q4822G329a12828C1011b08108
11678b7526j96511a05975N1244j21031a6321n9345j61051A0381K7620K00383b6177
11666e5964D6914d05971a25087K0087j33502E3281c0926A60486e0766b4665j08483
11655a33148c772j98014B82923b26554o3162a33347j35780e452A47205b1921k92814
$$ plain form
11735 9764 44641 197421 -12586 -287341 -147758 123158 -22353 -418032 -257711 190196
11724 152067 -325312 198375 28815 -527780 -31876 181825 -182624 227396 -181229 157186
11713 -145422 253398 -307554 186294 62371 -3891 -263607 -52802 -290916 -43788 84692 -151
11701 -267724 -145471 -176734 -106119 74334 -181511 -217433 191496 -146074 -198950 25784 79274
11690 79274 74200 -196834 104388 -37957 -141051 -127139 -211961 7329 -112828 31011 -208108
11678 -27526 -224037 -105975 -54731 -175762 -16321 -75666 -236717 10381 38001 238384 -26177
11666 -55964 46914 -405971 -125087 -105000 -238502 53281 -30926 160486 -50766 -24665 -133148
11655 -133148 -3772 -201786 282923 -226554 -289716 -133347 -269127 -5452 147205 -21921 -314735
11644c14735I8090c1801p1009m4442b8429j94302A00136h6129k06286D3471b2335
11632D7872a42368G6783C2207b2327k03381j29315a03560c9233B09470H749J35953
11621A44702C1742o851a25639r5730M864C40524e5462B76632E7223a66909n4499
11610b21408P6169c0362B9387M8752R3165N6973n2724h7092D5213a86822i1314
11598d18391a07675B57981q0314b42509A61031C0417e5967A6606h6884b0079j902
11587b1981j9445I4575b1165A1011f9665A9921a68179I996a68501b9109N899B72277
11574A80628J1424A9394K19088a46498k77954c2741J009A1795b10398B71282B2080
11562B9654b28400c3487C81253b49790b6903j06075b5513A38950a11100A3883
$$ plain form
11644 -314735 98090 -31801 -102810 -147252 -28429 -222731 100136 -86129 -292415 43471 -22335
11632 47872 -142368 76783 32207 -22327 -225708 -355023 -103560 -39233 209470 8749 144702
11621 144702 31742 24891 -125639 -221369 -216505 340524 -55462 276632 57223 -166909 -221408
11610 -221408 -145239 -30362 29387 78139 171304 228277 175553 -87092 45213 -186822 -91314
11598 -418391 -107675 257981 177667 -242509 161031 30417 -55967 16606 -86884 -20079 -21981
11587 -21981 -41426 94575 -21165 11011 -69665 19921 -168179 9996 -168501 -29109 -23210 272277
11574 180628 192052 19394 238482 -146498 -424452 -32741 -31732 11795 -210398 271282 22080
11562 29654 -228400 -33487 381253 -249790 -26903 -132978 -25513 138950 -111100 13883
11551b72587A08568f3971B43240j05843K56685b35995B62967a10928F048J52889
11541A58937A410J0199J54723h7586r6616A2431L612J60514g1324A67972c46687
11529c5174B15632f2674I6768B8290J06783J00687B9008h1484E2782L80333a68697
11517A01729M6812J50391h796L846j4731Q723L915H3119Q5015o5857m2061P5277
11505A35493K21658F3337J3748K08236o5192b53720A87616p9277K8922A4096e053
11493B04042a1648A80398A5822K48375A29208P3478q5541K35482e7627B29195
11482B47293J61210j29478C0240i2752F937b8465A04258b9444B53596o5344K1358
11471B09610A0565J41375d4807j26275A24469l6226a72768B89640m7842a47280
$$ plain form
11551 -272587 108568 -63971 243240 137397 394082 -235995 262967 -110928 6048 158937
11541 158937 1410 11609 166332 -87586 -184202 12431 16043 176557 -71324 167972 -346687
11529 -35174 215632 -62674 96768 28290 135073 235760 29008 -81484 52782 433115 -168697
11517 101729 148541 298932 -8796 -4950 -19681 -10958 -7043 83119 168134 102277 60216 135493
11505 135493 357151 63337 77085 285321 220129 -253720 187616 108339 137261 14096 -5053
11493 204042 -11648 180398 15822 264197 129208 202686 117145 352627 -57627 229195
11482 247293 408503 279025 30240 -92752 6937 -28465 104258 -29444 253596 188252 209610
11471 209610 10565 151940 -44807 -171082 124469 88243 -172768 289640 241798 -147280
11460A93832a69125P6336C3705K70722I871J12733D5523R7762O1519O4953O129
11449B75886h0808D4667b79231e8798p8459I8581m6621K20564A31536L2153K4865
11438A88554I2650J29489M9339j32141K8471K23294H5031J6932J87367f9546j7451
11427h6997p6717D44724c7342k21237p7146C39553e6648r7328B81914a89628k27756
11416d17384A20644a47054n723N8944D43605a66684r549A19812C3129b2510l0502
11405e3012D21778f2781p0102p2333C28753A56495L25212e4608A61030N70R022
11394A70622F9929b30798P6274d4661C2593a47279H966J06028a5596H2038B4720
11382F4450a78376d7336j05149J7302B60071j25248b89609E6329o244a05763k47488
$$ plain form
11460 193832 -169125 -92789 33705 304427 9871 122604 45523 143285 204804 269757 275886
11449 275886 -80808 44667 -279231 -58798 -137257 98581 51960 272524 131536 163689 188554
11438 188554 92650 222139 271478 139337 167808 391102 85031 101963 289330 -69546 -86997
11427 -86997 -163714 444724 -37342 -258579 -335725 339553 -56648 -153976 281914 -189628 -417384
11416 -417384 120644 -147054 -152777 -93833 443605 -166684 -176233 119812 33129 -22510 -53012
11405 -53012 421778 -62781 -132883 -205216 328753 156495 481707 -54608 161030 161600 170622
11394 170622 69929 -230798 -154524 -44661 32593 -147279 8966 114994 -15596 82038 24720
11382 64450 -178376 -47336 -152485 -135183 260071 134823 -289609 56329 50085 -105763 -353251
11371c53251E4016c57494j36732J42770B3362a14970A9995b56786H5237a69455
11360a39143a2232E0314a83710A35265b73735b3931o8082j40150A45810m4223
11350A01587e8415F6838a81887A69061p3764C0782J51740b79801R0179e2271k62387
11339c14658j9007a6148j26014k07192Q4702A99734m8399K789J13490B7599B388
11327A81199a54094F8572J26844p1138k0616C0796d7518J5735o4928A33896d24510
11315e8243j51197A51608B2275M6530c858j74159B52016I4961K77408d3499k10025
11304b53524a02404B33196a06053A1921K2436K74950a40099h185l3175J5318E23163
11292c4653q6534K914H4081a23123D050L34699c1346J1885D2998b68966O6365
$$ plain form
11371 -353251 54016 -357494 -494226 -351456 23362 -114970 19995 -256786 85237 -169455
11360 -139143 -12232 50314 -183710 135265 -273735 -23931 -92013 -232163 145810 101587
11350 101587 -58415 66838 -181887 169061 95297 30782 182522 -279801 -189622 -52271 -314658
11339 -314658 -333665 -16148 -142162 -349354 -264652 199734 151335 154124 267614 27599 2388
11327 181199 -154094 68572 195416 124278 103662 30796 -47518 -31783 -96711 133896 -424510
11315 -58243 -209440 151608 22275 68805 -3858 -178017 252016 94961 372369 -43499 -253524
11304 -253524 -102404 233196 -106053 11921 34357 309307 -140099 -8185 -41360 -26042 523163
11292 -34653 -121187 -118273 84081 -123123 4050 338749 -31346 -19461 42998 -268966 -202601
11281b02601H4654b72485A03273f60365I2216O2106a30399A90460q6030b39114
11270A03131A8581A891a18832A44043o3612a33083O5888n1759F3121b01884D3048
11258b81595H9931k0974Q070b68249R5375l8282C8323f3147B27710a54177A69288
11246c985l08068B27336f7985E5945h84F6706R6303b55706M3924e5770j86725
11235b42495Q4520B95488a74174p097d0497A31209a91189N2853d9906l78271C4438
11223b59027D2978a64495j01290a24855n9340d0905D3283J48083o6792a44232
11212A31978J98439a51749B81662n4028e125j72014A18787b74512N3977A76845
11201B6361b02403A05414Q3265H8995J34392a64026g6503B44310o5382a40394
$$ plain form
11281 -202601 84654 -272485 103273 -660365 92216 154322 -130399 190460 104430 -239114
11270 103131 18581 1891 -118832 144043 80431 -133083 -67195 -118954 63121 -201884 43048
11258 -281595 89931 68957 77027 -268249 -172874 -211156 38323 -63147 227710 -154177 169288
11246 -3985 -312053 227336 -67985 55945 -884 66706 163009 -255706 -211782 -55770 -242495
11235 -242495 -157975 295488 -174174 -181271 -40497 131209 -191189 -138336 -49906 -428177 34438
11223 -259027 42978 -164495 -265785 -124855 -184195 -40905 43283 191366 124574 -144232
11212 131978 330417 -151749 281662 227634 -5125 -177139 118787 -274512 -220535 176845
11201 26361 -202403 105414 188679 88995 223387 -164026 -76503 244310 178928 -140394
11190b05127A59468P743b59029L6909C0832c29421a0850p4063a9830k04982B02832
11178d6918k23535P0242Q3409J625n5335Q035C613a73948m198j6342H2256i7443
11165c385B7514R856a50454G9721b6616j4025B17761f262B81204N0084B9802M0379
11153G0181c37291C8847K20084i3064B31737C5179b31935b1768j46713B14606
11142c10160b7194D6508a98686q5091J24109A94220b46523i5515m6482D91473
11131f840C0903a10861A10161L3116a460j54483A78920N6620m3604i9197k10327
11120c09524C44342b90463A35888l9226b0370A91804p1464P810b4938D07558A92070
11108b8523k9248a3068B66714N8043A45703N0092M2288q7600J63281b6198m5751
$$ plain form
11190 -205127 159468 167211 -259029 -222120 30832 -329421 -10850 -84913 -19830 -224812 202832
11178 -46918 -270453 -200211 -116802 -115177 -170512 -162477 3613 -173948 -178146 -194488 82256 -97443
11165 -3385 27514 37370 -150454 79721 -26616 -40641 217761 -6262 281204 331288 29802 70181
11153 70181 -337291 38847 258931 -93064 231737 35179 -231935 -21768 -168481 214606
11142 -310160 -27194 46508 -198686 -283777 -159668 194220 -246523 -95515 -141997 491473
11131 -6840 30903 -110861 110161 143277 -1460 -155943 178920 235540 191936 -99197 -309524
11120 -309524 344342 -290463 135888 96662 -20370 191804 120340 128150 -24938 407558 192070
11108 -28523 -57771 -13068 266714 324757 145703 195795 238083 150483 313764 -26198 -71949
11097g1949C24610F9424J58848k2471b060k9923k932E03250D5535Q2813L4397
11086A62745m2309P2689N1451a37026O5389B30206l9957m523J46530K00292A39096
11074A0505Q1982a36526B00863G0238J37538P9069j01417K13357j33505N5289
11064C20569b6944E06722A85409K56061J00258j67969L17283j3650C34757K33794
11054E68551L24141k44114J60088p2175l20826M25840k60073L26561j56726O7834
11044H19101j08788K76228D06098P5308M79229k19878J31300p2974k25356p8993
11034D94734M71516k94873j65713K48980k55485M68722l79734L01010k9736o1485
11024G97936o9085l4457K40222C89224J05057J5893J90065k95714j95882O97876
$$ plain form
11097 -71949 324610 69424 228272 205801 -2060 -31983 -34915 503250 45535 128348 162745
11086 162745 120436 193125 244576 -137026 -71637 230206 190249 185726 332256 532548 139096
11074 10505 92487 -136526 200863 70238 207776 286845 185428 398785 265280 320569
11064 320569 -26944 506722 185409 441470 541728 373759 691042 677392 334757 568551
11054 568551 892692 648578 808666 736491 415665 841505 581432 907993 751267 819101
11044 819101 710313 986541 406098 481406 960635 740757 872057 799083 573727 494734
11034 494734 966250 671377 505664 754644 499159 967881 588147 889157 859421 797936
11024 797936 728851 694394 934616 389224 494281 510174 700239 404525 208643 906519
11014I06519l63233N7911J58173k42374j43711j07065K59446J34079j44321J32192
11004F47616j35468P0571k13793K81370Q6842j58574J8176M5311r7312m8799P5101
10993E71041J09584p0733K51002k03041K50701k58278M28648m53007L82060L16019
10983A323996k68414K9260Q4793o891M3674L40529J05402N2648M73347j1447L12281
10972B479178O28974o06991L13239K3893j95293k05525l37887Q9340p53237j84739
10962A250952j09829j16472L2736m54999J68463J58541k20991j88104M00735j32531
10952G88501l23413G9793N39708j71614P9493B22398i6495C19379E9158O5106
10942A24264a0674D7133J46579N0676a5568D25005A28129J09740F7057b4256j66356
$$ plain form
11014 906519 543286 601197 759370 516996 373285 266220 525666 659745 515424 647616
11004 647616 512148 582719 368926 650296 737138 578564 596740 642051 544739 495940 571041
10993 571041 680625 609892 860894 657853 908554 650276 1078924 625917 1007977 1323996
10983 1323996 1055582 1084842 1169635 1162744 1206418 1546947 1652349 1704997 2178344 2166897 2479178
10972 2479178 3108152 2501161 2814400 2838293 2643000 2437475 2099588 2188928 1435691 1250952
10962 1250952 1141123 1024651 1057387 602388 770851 929392 708401 520297 921032 788501
10952 788501 465088 79793 619501 447887 527380 222398 -96495 319379 59158 124264
10942 124264 -10674 47133 193712 244388 -15568 425005 128129 237869 67057 -24256 -190612
10931a90612A72101a7902j07470B3198a04487G078a21856j872B03819C0219a5230
10919a92410a3084A91242n1365E3331c0313A25372b80476B06348d08358G6435
10908c84971B26836B7139K37913A28348a03678J372A38379L976f1766Q319n184
10897e8631k6250a8510j79190P5247F7033A2027b21357d1228J4232k10666A4730
10885B52233a20565A14353j8302g5150a5218j40121K2750K3198j75786a02168
10874C3159b46459J07136e6492C36078h0298A24698n8179J69937a66169J8158
10864a48011d8210l586D0492h4222q0775P6883H3080f5472j93196R7424A28725
10852c09199G3990e39B91273c56433J60734P6209L3231j68541A76555a88953m5328
$$ plain form
10931 -190612 172101 -17902 -125372 23198 -104487 7078 -121856 -123728 203819 30219 -15230
10919 -192410 -13084 191242 139877 53331 -30313 125372 -280476 206348 -408358 76435
10908 -384971 226836 27139 265052 128348 -103678 -102306 138379 142355 -61766 -53447 -58631
10897 -58631 -84881 -18510 -197700 -122453 67033 12027 -221357 -41228 -26996 -237662 14730
10885 252233 -120565 114353 96051 -75150 -15218 -155339 -132589 -109391 -285177 -102168
10874 33159 -246459 -139323 -56492 336078 -80298 124698 66519 236456 -166169 -148011
10864 -148011 -48210 -51796 40492 -84222 -164997 -88114 83080 -65472 -258668 -161244 128725
10852 -309199 73990 -539 291273 -356433 -195699 -119490 -86259 -254800 176555 -188953 -234281
10841b34281M1713C55298A3471a28743B36192E7892a50775e7194A633O570K67660
10830B75863b36377B58372a45857N8741l3846c6617D63571a37047A34648D403
10819D27131H2333b4142k11663E7476i2351A7600e2696O187H4898b46121D9773
10807B4799O5550J78271a04148A23467c4387j53943A4823b73117r76O4219N8641
10796a51233A16927m5443a71781j12632i269m9228R698j27390b2121E6323b41598
10784a01523K9049A43425C7683a41085D3001b93543J4269d3909m1931A8197b82376
10772b16963R4895o9314B4510a07604J4566B3261b03200O8781e1131j2881q5167
10761a49179C47986j63276l0069b87188J11746P4549J9004n3763B01061c8148
$$ plain form
10841 -234281 -192568 355298 13471 -128743 236192 57892 -150775 -57194 1633 8203 275863
10830 275863 -236377 258372 -145857 -87116 -120962 -36617 463571 -137047 134648 4403
10819 427131 82333 -24142 -235805 57476 -92351 17600 -52696 -46509 84898 -246121 49773
10807 24799 90349 268620 -104148 123467 -34387 -188330 14823 -273117 -274093 -209874 -151233
10796 -151233 116927 71484 -171781 -284413 -9269 -58497 -48799 -176189 -22121 56323 -241598
10784 -101523 -72474 143425 37683 -141085 43001 -293543 -279274 -43909 -85840 18197 -282376
10772 -216963 -122068 -191382 24510 -107604 -93038 23261 -203200 -134419 -51131 -64012 -149179
10761 -149179 347986 184710 154641 -287188 -175442 -100893 -81889 -135652 201061 -38148
10750e4533J7465A23550J82372A1443b29734C12656a08509k67537A15648b60549
10739A24653J41078H4398c26354c5520l2120d126B21026M1516E5575b64925B04932
10727b06366I15K49357f0298j43128e7442H1007g8704A33314K6121h0284j24117
10716b04401c4809A80060q8228e19319E8243e5123A40363g2952a8498j38205m3024
10705a99727B90500p2423a96717a5333j05894j43152A6640J46868G1586b22027
10694c08617d4704a7996j2237m2948C3226J07386b3576j37829l2974j37627A3028
10682B41646l1278a3522j12816o7146a666k18456A3537K30202b03558A94824j7484
10671A77340q6061a3619j74975o9974g8586A14817a47627F568i1864m298B05449
$$ plain form
10750 -54533 -37068 123550 305922 11443 -229734 312656 -108509 -376046 115648 -260549
10739 124653 265731 84398 -326354 -35520 -67640 -4126 221026 262542 55575 -264925 204932
10727 -206366 915 250272 -60298 -203426 -57442 81007 -78704 133314 159435 -80284 -204401
10716 -204401 -34809 180060 91832 -519319 58243 -55123 140363 -72952 -18498 -156703 -199727
10705 -199727 290500 218077 -196717 -15333 -121227 -264379 16640 163508 71586 -222027
10694 -308617 -44704 -17996 -30233 -73181 33226 140612 -23576 -161405 -194379 -332006 13028
10682 241646 210368 -13522 -126338 -193484 -1666 -220122 13537 243739 -203558 194824 177340
10671 177340 91279 -13619 -188594 -258568 -78586 114817 -147627 6568 -91864 -96162 205449
10659b57782E776J24221b5799r3933k21786a04462l0654A05172P8013c84373b7499
10647a24789c254j05921n6193K7327A70433c07234B5789K7482K04584q3922b16377
10635b24736O2373e0355A6312N8002J35390f0863M926p4099C2515d9169F8948
10623a39958A47647F2392n328a69748J8553b4243F1904k6404P4643a26218j30443
10612b56661J27419m6249l8319h085m4673K1923A52198b29059Q7772j6313B34744
10600c51685A0266a97321k9941I0972h2793J2977k73696N0249i5404k5462I5019
10588a05161C29540A36252c5172H1880O4882o9078J5723d9184k15807d1962n5999
10577i7961j47101f6590H9487J02321o8030b82972A80413a71488N5149A81824
$$ plain form
10659 -257782 5776 129997 -25799 -119732 -341518 -104462 -135116 105172 183185 -384373 -27499
10647 -124789 -3254 -109175 -165368 -138041 170433 -307234 25789 53271 257855 173933 -216377
10635 -224736 -162363 -50355 16312 74314 209704 -60863 -55937 -130036 32515 -49169 68948
10623 -139958 147647 62392 57064 -169748 -151195 -24243 61904 35500 110143 -126218 -256661
10612 -256661 -129242 -175491 -213810 -8085 -52758 -30835 152198 -229059 -141287 -157600 234744
10600 -351685 10266 -197321 -227262 90972 -82793 -69816 -343512 -293263 -95404 -120866 95019
10588 -105161 329540 136252 -35172 81880 146762 77684 93407 -49184 -264991 -41962 -97961
10577 -97961 -245062 -66590 89487 191808 123778 -282972 180413 -171488 -116339 181824
10566b10446h7483j73163H3927f655H2690J37689a9547f764j33656R712k9241
10555a59949A002c7538j66506f7765C7990h7768j27693C082h9715A44679B8673
10543A85741k822m0698E5299a5107o7I3932a28849A40676h6034j31942f9477B91493
10530b47309d9340B29986G9910A6887J59476a43280D8224a14906o4878A28121
10519A50060b44670f2455k59630N3577i135q946n4962B41348l7924b74344a0306
10507a40067J576k97911l2783c0796j61449j66807d5836l16623f2162k24621b133
10495a79778A60913a58639k14243c3399p66k23057A00250J68149B3851J3588a36688
10483A12922b18239E6737h0567G3764a98093g1559B4173c68488H8764e7307j216
$$ plain form
10566 -210446 -87483 -260646 83927 -6655 82690 220379 -19547 -6764 -140420 -130708 -159949
10555 -159949 1002 -37538 -204044 -67765 37990 -87768 -215461 3082 -89715 144679 28673
10543 185741 182919 142221 55299 -15107 -15174 93932 -128849 140676 -86034 -217976 -69477 291493
10530 -247309 -49340 229986 79910 16887 176363 -143280 48224 -114906 -179784 128121
10519 150060 -244670 -62455 -322085 -268508 -9135 -18081 -73043 241348 203424 -274344 -10306
10507 -140067 -138491 -436402 -469185 -30796 -192245 -359052 -45836 -362459 -62162 -286783 -2133
10495 -179778 160913 -158639 -372882 -33399 -34165 -257222 100250 268399 23851 37439 -136688
10483 112922 -218239 56737 -80567 73764 -198093 -71559 24173 -368488 88764 -57307 -58523
10472e8523l087A38099a36509p0203C12640a9626N639A66512C5084K46282d6680
10460A60562d8991n832k5510j10980b2311e955B29013b05495r1779f2050l7053
10449i9103l91574B1895a52586N7376B9072M4405d9638H8814J6741J96925a37220
10437G3732B3973K59091a05375L2344k2435k26629M1830f2170m419n310R656A74159
10424a81533o5099B26748b18770B07659I7205k6797b03981g5280L1132j64935
10414b09083d7433p9996B04596b2703j8630k33389i8521o2219P0761A00965b49398
10402d8556A96486J42745F9665b03231M4043C17858j54509J65061E8576J68041
10392B26617F0350J92752o0568o5279K0189R4905q6722N438K79937j86108A26254
$$ plain form
10472 -58523 -61610 138099 -136509 -206712 312640 -19626 -13987 166512 35084 281366 -46680
10460 160562 -48991 -54823 -80333 -191313 -22311 -5955 229013 -205495 -297274 -62050 -99103
10449 -99103 -490677 21895 -152586 -95210 29072 73477 -49638 88814 105555 302480 -137220
10437 73732 23973 283064 -105375 -73031 -95466 -322095 -280265 -62170 -66589 -71899 -62243 174159
10424 -181533 -246632 226748 -218770 207659 97205 70408 -203981 -75280 -44148 -209083
10414 -209083 -47433 -127429 204596 -22703 -41333 -274722 -98521 -160740 -89979 100965 -249398
10402 -48556 196486 339231 69665 -203231 -159188 317858 163349 328410 58576 226617
10392 226617 60350 253102 192534 127255 147444 242349 155627 161065 441002 254894 126254
10380A16502L17020L1266k31736j7690L95018a12510c1949h678A64822J88524
10370C53346J86824B21057k6282L23412Q8118k99678K51710m7853F7607K69667
10360C37274A62081K58375I5964P9878J0997l1811P210K77910K96629k25504M3773
10349E55046k17094A60950m1138J57676k5425G5675B7565P603R2211L14842C9259
10337C34015j22994I4202K03531d2749A76683J22263a228C22646D2212L78705
10327D20917a17756B55499j27274J09586q3545m5709C2398J29015n7673a94957
10316A61514C4091j1464K65206q8679a51014L127C5604J79581E1501c0450a2067
10304H9747a02787b8317A8472J71868b07076a2255l12159A22626J0660M6659L0426
$$ plain form
10380 116502 433522 464788 233052 215362 610380 -112510 -31949 -8678 164822 353346
10370 353346 540170 221057 194775 518187 606305 306627 558337 510484 67607 337274
10360 337274 162081 420456 95964 175842 186839 155028 162238 440148 736777 511273 555046
10349 555046 337952 160950 119812 277488 252063 75675 27565 35168 127379 442221 39259
10337 334015 211021 94202 297733 -42749 176683 298946 -1228 322646 42212 420917
10327 420917 -117756 255499 128225 237811 154266 108557 32398 161413 103740 -194957
10316 161514 34091 22627 287833 199154 -151014 -147887 35604 215185 51501 -30450 -12067
10304 89747 -102787 -28317 18472 190340 -207076 -12255 -324414 122626 133286 179945 210371
10293B10371r2318d14486J87728b6764q7808d0187j71024A12379J45185a74993
10282A1934J8007d07566A36264i1981k31097e701r3444j92559B51339a02328H0329
10270d3886q3836N9281c2562I4716J29871F6692a45514a2888j0905D01M76J61835
10258A62712E6965L09381J33111G7493h4443B31169a02666D04024h4444C74203
10247F2189J26168a0178j6611D7934F02N9675K02560D7656h7831j85605i7779
10235a01768A55336R4733g3287k15081A02000O5186C3108c1946o0041A59853F4929
10223H282J09908a5290k1275m7551A65262E9856c1761m21276A22355e26294I4598
10211h5871A14548c37296A77151b03345B2830c62417a58272O396L273d0294j76572
$$ plain form
10293 210371 118053 -414486 -226758 -26764 -114572 -40187 -211211 112379 257564 -174993
10282 11934 29941 -407566 136264 -91981 -323078 -5701 -99145 -291704 251339 -102328 80329
10270 -43886 -127722 -68441 -32562 94716 224587 66692 -145514 -12888 -23793 401 877 162712
10258 162712 56965 366346 499457 77493 -84443 231169 -102666 404024 -84444 374203
10247 62189 188357 -10178 -26789 47934 602 60277 262837 47656 -87831 -273436 -97779
10235 -101768 155336 250069 -73287 -288368 102000 167186 33108 -31946 -91987 159853 64929
10223 8282 118190 -15290 -36565 -84116 165262 59856 -31761 -453037 122355 -526294 94598
10211 -85871 114548 -337296 177151 -203345 22830 -362417 -158272 -151876 -148603 -40294 -216866
10200b16866f8479K8141F9682d655k55244R1264A64848i315n0926j14338A31997
10188D0060K6188J22806Q0299A16215a24863c6165j75366L0345N3127n9647F9974
10176c75354A34923a21874J8622B9314i5891j11249h4870l478I6003d6975G0858
10164C6577g2535b0717J730A02245b26652J05742e0325A2388h4137F9921Q9057
10153A58978M7872C4734i7387A4431Q0422h7058a6255k2634C1476c92615A75425
10141c82058M4377b3370p3241G2145a20462j01524M4809r0894P8561I0054b0613
10129D9555B2719K70695c74515I9524B1920a94066F8882J2821M7631Q1055I3542
10117A47020a97542E0937d10858e7497l1759p2438j76191g6898C4448c287n3227
$$ plain form
10200 -216866 -68479 -40338 69682 -4655 -259899 -168635 164848 -9315 -60241 -174579 131997
10188 40060 66248 189054 269353 116215 -124863 -36165 -211531 -181186 -128059 -187706 69974
10176 -375354 134923 -121874 -103252 29314 -95891 -207140 -84870 -88348 96003 -46975 70858
10164 36577 -72535 -20717 -18987 102245 -226652 -120910 -50325 12388 -84137 69921 158978
10153 158978 206850 34734 -97387 14431 94853 -87058 -16255 -38889 31476 -392615 175425
10141 -382058 -337681 -23370 -96611 72145 -120462 -221986 -177177 -268071 -189510 90054 -20613
10129 49555 22719 293414 -374515 99524 21920 -194066 68882 81703 129334 210389 93542
10117 147020 -197542 50937 -410858 -57497 -89256 -161694 -337885 -76898 34448 -3287 -56514
10106e6514J3599A33961a35824N9936K7339j10372A29265J14880A05283a12309
10095F6628F672a02603A01683k1591j7433a45549N2403b8074F406J70337h8166
10083A99440b14351A7315d1674m1350A81358e9346m8285j34903j7998J19200k2092
10072a63424B51433A21155J70438d55424a86383A8893b16044f2220G8733d11031
10061d98083c981p7479A32438O2865a27046G1447K01016a67862k61579A30606
10050B06486e1234j574j58018m3821a3520j978A16384a50866l01896d4640k82490
10039c27130e1356a8082A97474g592j79935C21587i4598G6622J17589a93762K3284
10028a70478c3134D3891N4415c27300a15720A82290a12849k41291J53011B19693
$$ plain form
10106 -56514 -42915 133961 -135824 -75888 -48549 -158921 129265 244145 105283 -112309
10095 66628 6672 -102603 101683 80092 62659 -145549 -93146 -28074 6406 176743 -88166
10083 199440 -214351 17315 -41674 -83024 181358 -59346 -107631 -242534 -260532 -141332 -163424
10072 -163424 251433 121155 291593 -455424 -186383 18893 -216044 -62220 78733 -411031
10061 -498083 -3981 -81460 132438 195303 -127046 71447 272463 -167862 -429441 130606
10050 206486 -51234 -52808 -210826 -254647 -13520 -15498 116384 -150866 -452762 -44640 -327130
10039 -327130 -51356 -18082 197474 -7592 -187527 321587 -94598 76622 194211 -193762 -170478
10028 -170478 -33134 43891 98306 -327300 -115720 182290 -112849 -354140 -201129 219693
10017h5492B41470E1852a10462p0811B60968a53488a4100j06778A75497a19915
10006b80441B70672A2444J71213d14146Q5664J50070r7803N7111L3645P0619q998
9995a23838N2399C3083c43358a53030G4329c4469k1750J1170J0430r4476c2288
9983b42100g4885A6076a78198f2149k47872B64687A22893a92180j01656k8957
9973c22793a42425A03473c7518E8813a32922A93274C5879o222M4883c83866i9024
9961E6558K53715a85869k08529J97032C753b23560M3419A20799J4561c59996B57709
9949b9273j64013B31515g9467r5629n3265k05396H8864a87522A8456h6314B45169
9937a41888B01648c42980P9E3678b12925A9373K60070k3936a65473M3555j01177
$$ plain form
10017 -85492 241470 51852 -110462 -181273 260968 -153488 -14100 -120878 175497 -119915
10006 -280441 270672 12444 183657 -414146 -328482 -178412 -276215 -219104 -185459 -114840 -123838
9995 -123838 -71439 33083 -343358 -153030 74329 -34469 -56219 -45049 -34619 -129095 -32288
9983 -242100 -74885 16076 -178198 -62149 -310021 264687 122893 -192180 -293836 -322793
9973 -322793 -142425 103473 -37518 58813 -132922 193274 35879 29657 74540 -383866 -99024
9961 56558 310273 -185869 -394398 -197366 3753 -223560 -180141 120799 135360 -359996 257709
9949 -29273 -193286 231515 -79467 -175096 -228361 -433757 88864 -187522 18456 -86314 245169
9937 -141888 201648 -342980 -342901 53678 -212925 19373 279443 255507 -165473 -121918 -223095
9926b23095a0322j83741f0875E1573c4224j20079A80187k9705p4348b99345j12213
9915d11558B69964p0440G6516a19646j19104j68870B56196P4376a15244A55790
9904a42548j51006J29761j1595l461D5335R3069a43707e9577B6446R2367d24196
9892b1990n3224n102o1735f4536J7553J9583j81024P5565F8041c10360B96389
9880A89622b9579j96389b7863r7292j59717A9702b03894j89849J71910J09553
9870a12280L6012B69522b52271O2055G5467c7633p8949l2334B67562a29526j0307
9859a39833A4733b5779j84876n3448g4791k31390J06829C25170H8133Q7117b55532
9847E3027b08315R7959A93345d7943C08208L1557a78481G0034a04897j80835A47944
$$ plain form
9926 -223095 -10322 -194063 -60875 51573 -34224 -154303 180187 150482 76134 -299345 -411558
9915 -411558 269964 199524 76516 -119646 -238750 -407620 256196 330572 -115244 155790
9904 -142548 -293554 -163793 -175388 -178849 45335 138404 -143707 -59577 26446 118813 -424196
9892 -21990 -75214 -80316 -142051 -64536 -46983 -27400 -208424 -132859 68041 -310360 296389
9880 189622 -29579 -225968 -27863 -125155 -284872 19702 -203894 -393743 -221833 -112280
9870 -112280 -76268 269522 -252271 -190216 75467 -37633 -116582 -148916 267562 -129526 -139833
9859 -139833 14733 -25779 -210655 -264103 -74791 -306181 -199352 325170 88133 175250 -255532
9847 53027 -208315 -110356 193345 -47943 308208 339765 -178481 70034 -104897 -285732 147944
9835c29245a04771m4453E9101K8370l7390d281A63831b24683j50395A43248a47980
9823E0201q610L6881j667K33524b314F1592O3500e0688r2691j46527a23092o3790
9811a86882N619M3097j5651f7800A26115b97069i5141B68578p3381E974L4173
9800D0147p300P816A0477P5394D474a25449c4473A65823C8949J1437i5555B21884
9787E5725K4001O3739N1734g1386m4154J5747a4843C73350I9787b9735m8669o9162
9775a47566A22983b18813A8538f035j94942B6310O591i1987A37452b97885L9323
9764b58562A20154K167J0725c73550J56170B86263b75547J20551n2570B15163
9753B08029J25405A47400b49317g1482C4513J38816c3551J4977A02113f931E7244
$$ plain form
9835 -329245 -104771 -149224 59101 87471 50081 -4281 163831 -224683 -375078 143248 -147980
9823 50201 41591 78472 76805 310329 -2314 61592 125092 -50688 -143379 -289906 -123092 -186882
9811 -186882 -181263 -138166 -153817 -67800 126115 -297069 -95141 268578 195197 5974 40147
9800 40147 32847 40663 10477 85871 4474 -125449 -34473 165823 38949 50386 -95555 221884
9787 55725 79726 143465 195199 -71386 -115540 -99793 -14843 373350 99787 -29735 -78404 -147566
9775 -147566 122983 -218813 18538 -6035 -200977 26310 32901 -91987 137452 -297885 -258562
9764 -258562 120154 122321 133046 -373550 -217380 286263 -275547 -154996 -207566 215163
9753 208029 333434 147400 -249317 -71482 34513 173329 -33551 -18574 102113 -6931 57244
9741a58369A0429P9863K44633a12316b1887j74433l0324k36449G3593P960J3391
9730I4944c194l08206d2239A6701a98228P9741N4807k0317E0706a41190N6930
9719h4260A82888a3710F8338b74141C3800a06045C01783b31454C0115K95375a97618
9707a20460J7110D8567b41415g6595j84936C79018i2712p1635F299b03338h1242
9695A82570I1098D89a12586j74983P1482B28036b40355r8864a09936A07209a86145
9683d27245C990J30568a19310A62147o3623b3364r5374q787j63718J27289N3850
9672a10104q1405P7594C6810N0742a65212B14775h8820C3953A2168a58096p5303
9661b33399h9677L3094A13124N8105b64604G1270a96317M9455K1645q7818M2353
$$ plain form
9741 -158369 10429 90292 334925 -112316 -21887 -196320 -226644 -463093 73593 81553 94944
9730 94944 -3194 -311400 -42239 16701 -198228 -118487 -63680 -83997 50706 -141190 -84260
9719 -84260 182888 -13710 68338 -274141 33800 -106045 301783 -231454 30115 325490 -197618
9707 -120460 -103350 48567 -241415 -76595 -261531 379018 -92712 -164347 6299 -203338 -81242
9695 182570 91098 489 -112586 -287569 -216087 228036 -240355 -339219 -109936 107209 -186145
9683 -427245 3990 134558 -119310 162147 98524 -23364 -118738 -127525 -291243 -163954 -110104
9672 -110104 -191509 -113915 36810 87552 -165212 214775 -88820 33953 12168 -158096 -233399
9661 -233399 -89677 -56583 113124 171229 -264604 71270 -196317 -146862 -125217 -213035 -170682
9650a70682B6609J2432b37777a09489n4260A48132b13572M7871j25832g6398G4956
9638E4211K46583b0697N233j30735j76878L2648f4465j29895L3150D9959J09895
9627A59854p2213O6614a90737A36985F566a65436E425c0483A41131e8503k8296
9616h6799K8198j3194F2130Q9974d40695C6203i0413k1189A26131a02023b4305
9604b152k24172G7533L3017a54023A52934l4400k1618a73527C9608c57802N3478
9593c04324B0320a13028p7961B3807L3443f7382j10082B70570a50485D7045c87109
9581e08952A47705c76492a7987k36687Q3217M4712M0048k4755B28205a0506m69140
9570d79646h905k12714D8822b07728b7183j24750M5018B88768c90145A28474h1059
$$ plain form
9650 -170682 26609 39041 -237777 -109489 -163749 148132 -213572 -165701 -291533 -76398 74956
9638 54211 300794 -20697 -15464 -146199 -323077 -290429 -64465 -194360 -161210 49959 159854
9627 159854 87641 154255 -190737 136985 6566 -165436 5425 -30483 141131 -58503 -86799
9616 -86799 -58601 -71795 62130 152104 -440695 36203 -90413 -111602 126131 -102023 -24305
9604 -2152 -226324 77533 110550 -154023 152934 118534 96916 -173527 39608 -357802 -304324
9593 -304324 20320 -113028 -190989 23807 57250 -67382 -177464 270570 -150485 47045 -387109
9581 -508952 147705 -376492 -17987 -254674 -171457 -126745 -86697 -111452 228205 -10506 -479646
9570 -479646 -8905 -221619 48822 -207728 -27183 -151933 -106915 288768 -390145 128474 -81059
9558b12908g3265C7973J20925b15055A14583N9255o6678b19846a9468B208a02585
9546F4779i3017o9749B822J79695d44863a40443A59352f0037A42103f8114l70435
9535d38549a08489b6419I7420a43658O7637A67945d3309K402I4877a40517l4118
9524a74635a9710m0523A58616E7343b88104m2202E8876b69071I1590c50204H7816
9512e6435A64369a50416k2961f3028F7132R9238C4667f9099o0990C5470a79264
9500d9689a134j82158A98221N506a90980b1614k65963n6684D7284j0754h3872
9488d07283R2868f4476n333A34313b56429J14129D6198j4223c45849B76701f3458
9476c6513B06915a07857K188P633B59939b12525j3990f2745a1600n7129m35703
$$ plain form
9558 -212908 -73265 37973 158898 -215055 114583 173838 107160 -219846 -19468 2208 -102585
9546 64779 -93017 -162766 2822 182517 -444863 -140443 159352 -60037 142103 -68114 -438549
9535 -438549 -108489 -26419 97420 -143658 -76021 167945 -43309 -40907 94877 -140517 -174635
9524 -174635 -19710 -60233 158616 57343 -288104 -330306 58876 -269071 91590 -350204 87816
9512 -56435 164369 -150416 -173377 -63028 67132 166370 34667 -69099 -130089 35470 -179264
9500 -49689 -1134 -183292 198221 203727 -190980 -21614 -287577 -344261 47284 36530 -83872
9488 -407283 -314415 -64476 -69809 134313 -256429 -142300 46198 31975 -345849 276701 -63458
9476 -36513 206915 -107857 -105669 -98036 259939 -212525 -226515 -62745 -11600 -68729 -504432
9465e04432B74589g888j8838G3243K2252a994o7830A02282e6588l02888A34961
9453b07631j00514H4715a49066a3234E6383K36575a77078F58R0993d72267R4887
9442c77380B18020b52767J15487L5242o755j51497J12268K7983C9464a47688q7650
9431b35338k6799m3744B17439H7603l2499a70881l5383j22913J62609D3990K3668
9420F7658p472a92322K0591A44706c02838D6843i2750K7239C5651f9163m5002
9409a14165N0738l63325F7316a92099A21168m6420K32302c78512E9795c1287a5089
9397a94495m53I672J3230h7321C8751B559L01221G676J66243k1170a41702D02075
9384b03770p500A83885o2393d073k2959A36982a4365j09557N4811A60044g7466
$$ plain form
9465 -504432 274589 -7888 -26726 73243 95495 -1994 -69824 102282 -56588 -359476 134961
9453 -207631 -308145 84715 -149066 -13234 56383 292958 -177078 658 91651 -472267 -377380
9442 -377380 218020 -252767 -137280 -102038 -108793 -260290 -148022 -120039 39464 -147688 -235338
9431 -235338 -262137 -305881 217439 87603 55104 -170881 -206264 -329177 -166568 43990 67658
9420 67658 60186 -192322 -171731 144706 -302838 46843 -92750 -65511 35651 -69163 -114165
9409 -114165 -63427 -426752 67316 -192099 121168 74748 307050 -378512 59795 -31287 -15089
9397 -194495 -194948 9672 22902 -87321 38751 2559 303780 7676 173919 152749 -141702 402075
9384 -203770 -211270 183885 121492 -4073 -27032 136982 -14365 -123922 -69111 160044 -77466
9372A59976b61648a751k59420C86437G499b67533a846F3526c93596h4227L2612
9361e1615k29402c5485j07690A07252b98518a33504A9454L50536c90599e5564
9350f6043k3190e671j25088A7486c1190H0411a95522c0484m9813C70977b49052
9338b99146h9465l944A81743g9681l0803j27372j4667b6674G32a07919D0282K38460
9326B78742c7832q139A58606B2695L05568a46850N4461n9681M9119A73408P722
9315A81130C9546R9453c73418c2377n5379a9051I1295b40807c3435A46558n9594
9304H6964b74192K024A00863O6746e2085n23992e7368a399j86105a0776B3985
9292A57261J27048a26215j81411a02405m6240b6475k89734A97704a59078A27580
$$ plain form
9372 159976 -261648 -1751 -261171 386437 7499 -267533 -1846 63526 -393596 -84227 -51615
9361 -51615 -281017 -35485 -143175 107252 -298518 -133504 19454 369990 -390599 -55564
9350 -66043 -89233 -5671 -130759 17486 -31190 80411 -195522 -30484 -80297 370977 -249052
9338 -299146 -89465 -93409 181743 -79681 -110484 -237856 -252523 -26674 732 -107919 40282 278742
9326 278742 -37832 -45971 158606 22695 328263 -146850 -92389 -152070 -102951 173408 181130
9315 181130 39546 138999 -373418 -32377 -87756 -19051 91295 -240807 -33435 146558 86964
9304 86964 -274192 -272168 100863 167609 -52085 -576077 -57368 -1399 -187504 -10776 23985
9292 157261 284309 -126215 -307626 -102405 -148645 -26475 -316209 197704 -159078 127580
9281b58944g2404l19406B9757K3648k547a76777d9936g166E5375b70264f4525
9269b14788A72130b6879n2547C4350b72697A77431p7552b23858A04462d60268
9258b34131e1510J7658H2725a7917A26287j2292a3896A11930b66964g0123o2639
9247a32762j24200E3185J99062A01497c75908J85714f3252m08232a97802m8224
9237b46026F3192c82078h2288c567l15924a4501j72897L7217A00348K77611c84194
9225b41085G9728B3567a5527j75017g9884A3044i3725j40930B8701a99261O8759
9214a30502N376q0515r5539D7795B817J12105r393f460j68207j9328e1495B88834
9201c94652Q4216A61356N232N4007D5122J6888N8621b50492a6652l1706k91524
$$ plain form
9281 -258944 -72404 -391810 29757 53405 50858 -176777 -49936 -7166 55375 -270264 -64525
9269 -214788 172130 -26879 -79426 34350 -272697 177431 99879 -223858 104462 -460268
9258 -234131 -51510 -33852 82725 -17917 126287 113995 -13896 111930 -266964 -70123 -132762
9247 -132762 -256962 53185 252247 101497 -375908 -190194 -63252 -471484 -197802 -246026
9237 -246026 63192 -382078 -82288 -3567 -319491 -14501 -187398 -150181 100348 377959 -384194
9225 -241085 79728 23567 -15527 -190544 -79884 13044 -93725 -234655 28701 -199261 -130502
9214 -130502 -125126 -205641 -301180 47795 2817 114922 105529 -6460 -174667 -193995 -51495 288834
9201 -394652 -310436 161356 166588 220595 45122 62010 120631 -250492 -16652 -48358 -339882
9190c39882a39536k07559J71846D2883c9392o3075o6368A81242c2004C43536g8621
9178a58450J5527j5766A42654P5777a36010k49366a03147A56835f35962D257J53584
9167A57841b26889a03383j08360A35189a25349j07602d5775H4501c3140M779l19623
9156c47984d5474A20926C4302J11623K00492g7608L6221J0726B45101A823c5525
9144b14867j34637I620b21514B51963b4760B70761a85485f6900k57403p2130B12633
9132b1676I4389g4414K7618A82187e51273D6389c58152a36082d8306p162C4146
9120f522F4438b66325D01862E2411J50308c5332A36225b95815E7500a58132F5207
9108a85376j395F4995c2265A7543c0530A9909J6832K93311j60869k2313b56016
$$ plain form
9190 -339882 -139536 -347095 -175249 42883 -39392 -102467 -168835 181242 -32004 343536 -78621
9178 -158450 -142923 -158689 142654 218431 -136010 -385376 -103147 156835 -635962 4257 157841
9167 157841 -226889 -103383 -211743 135189 -125349 -232951 -45775 84501 -33140 -28361 -347984
9156 -347984 -45474 120926 34302 145925 346417 -77608 -41387 -30661 245101 1823 -35525
9144 -214867 -349504 9620 -221514 251963 -24760 270761 -185485 -66900 -324303 -396433 212633
9132 -21676 94389 -74414 -46796 182187 -551273 46389 -358152 -136082 -48306 -55468 34146
9120 -6522 64438 -266325 401862 52411 202719 -35332 136225 -295815 57500 -158132 65207
9108 -185376 -186771 64995 -32265 17543 -30530 19909 36741 330052 169183 146870 -256016
9096b43593h4844p6427A34444J02015j04202f415l20491f7124q0004A06402a45971
9084B2219b64843a1821l02542B36658c73133a32298g446n6157r2656E8113h2250
9072b93777G6999a43549A56404a81475C5440a87710b7593l16326J12426D7560
9061G7363O4090b20859i9068m0024n4698c2664j02030B61500L8984a89637p4813
9050b64450b8242j20680A60564C154K35256A6152L6535a67986Q1614D5510i0842
9038b35941F6749r996b05672A37755L0067f8085k69954c0009p8234G2641a59933
9026c46584d7517m182j26759A08919h7086j139D2982c89169a84112i458A53949
9014A59935b43387e2685j0745D2873b64189F5173J74814a05952a3649m14165A03363
$$ plain form
9096 -243593 -84844 -161271 134444 236459 132257 -6415 -326906 -67124 -147128 106402 -145971
9084 22219 -264843 -11821 -314363 236658 -373133 -132298 -7446 -63603 -156259 58113 -82250
9072 -293777 76999 -143549 156404 -181475 35440 -187710 -27593 -343919 -231493 47560
9061 77363 141453 -220859 -99068 -139092 -193790 -32664 -134694 261500 300484 -189637 -264450
9050 -264450 -28242 -148922 160564 3154 238410 16152 52687 -167986 -86372 45510 -90842
9038 -235941 66749 56753 -205672 137755 167822 -68085 -338039 -30009 -108243 72641 -159933
9026 -346584 -47517 -51699 -178458 108919 -87086 -88225 42982 -389169 -184112 -9458 153949
9014 159935 -243387 -52685 -63430 42873 -264189 65173 239987 -105952 -13649 -427814 103363
9002A29742c22903N5547j79274g8462m3961m41745B8686a92386C3382h5344c2598
8990a75560r8472a00140a651H5389a33973d1091C5128i5423l01503a82077A23274
8978i7857K1884l6073C4841i3542L0237A7572a63401H8229h9273j21273A55122
8966b16169h468F9722a05894b6419C9577J25076B319K6870Q4284L8090m1156b26642
8953b30339F6109a06359D4914a93193B50733a86952C7864j0433a54268A41841
8942a56556B9334K6537d097A12505n5374a92858i2995A22863Q0938b6444M251
8931b2193m1465r8081A53431C1904J13587J14154k64J77820J237859N128211O485861
8920A3289132B659005I29675A17221K67833a5758A42118a86577A6307b8280A33503
$$ plain form
9002 129742 -322903 -267356 -446630 -78462 -122423 -564168 28686 -192386 33382 -85344 -32598
8990 -175560 -274032 -100140 -1651 85389 -133973 -41091 35128 -95423 -396926 -182077 123274
8978 -97857 -75973 -112046 34841 -93542 -63305 17572 -163401 88229 -89273 -210546 155122
8966 -216169 -8468 69722 -105894 -26419 39577 164653 2319 29189 113473 151563 110407 -226642
8953 -230339 66109 -106359 44914 -193193 250733 -186952 37864 27431 -154268 141841
8942 -156556 29334 55871 -4097 112505 57131 -192858 -92995 122863 203801 -26444 -22193
8931 -22193 -63658 -161739 153431 31904 145491 259645 259381 437201 1675060 6803271 13289132
8920 13289132 2659005 929675 117221 385054 -15758 142118 -186577 16307 -28280 133503
8909h2472N150E15182d5447B26124R2369A00339M3657F3761a18619l1274D36631
8897A6166h9369F4806L0420c65256B34247b73292A61814c2431n576o3293M4733
8886e6567o2589d6677D0265e1520B37325G3762a20979b3406j49812L2084H0008
8874b51491f287j25802G1625a68348I9653a90988d0046A0282R3512a103k54852
$$ plain form
8909 -82472 -77322 515182 -45447 226124 318493 100339 143996 63761 -118619 -149893 436631
8897 16166 -89369 64806 95226 -365256 234247 -273292 161814 -32431 -38007 -101300 -56567
8886 -56567 -119156 -46677 40265 -51520 237325 73762 -120979 -23406 -173218 -141134 80008
8874 -251491 -6287 -132089 71625 -168348 99653 -190988 -40046 10282 103794 -1103 -255955
$$ [...]
##END NTUPLES=NMR SPECTRUM
##END=
