
##TITLE=AC1239_CCAAH12094_6610175_9lQ1fpr3CV
##JCAMPDX= 6.0         $$ Bruker NMR JCAMP-DX V2.0
##DATA TYPE= NMR SPECTRUM
##DATA CLASS= NTUPLES
##ORIGIN= BRUKER
##OWNER= Administrator
$$ 1.72 TOPSPIN		Version 2.1
$$ 2012-08-02 12:57:27.578 -0500  Administrator@TOPSPIN
$$ Compression mode = diff/dup
##.OBSERVE FREQUENCY= 400.02188249412
##.OBSERVE NUCLEUS= ^1H
##.ACQUISITION MODE= SIMULTANEOUS (DQD)
##.ACQUISITION SCHEME= undefined
##.AVERAGES= 8
##.DIGITISER RES= 22
##SPECTROMETER/DATA SYSTEM= spect
##.PULSE SEQUENCE= zg30
##.SOLVENT NAME= COFFEE_meoh
##.SHIFT REFERENCE= INTERNAL, COFFEE_meoh, 1, 14.98509
##AUDIT TRAIL= $$ (NUMBER, WHEN, WHO, WHERE, PROCESS, VERSION, WHAT)
$$ ##TITLE= Audit trail, TOPSPIN		Version 2.1
$$ ##JCAMPDX= 5.01
$$ ##ORIGIN= Bruker BioSpin GmbH
$$ ##OWNER= Administrator
$$ $$ C:\Bruker\TOPSPIN/data/COFFEE/nmr/AC1239_CCAAH12094_6610175_9lQ1fpr3CV/10/pdata/1/auditp.txt
$$ ##AUDIT TRAIL=  $$ (NUMBER, WHEN, WHO, WHERE, PROCESS, VERSION, WHAT)
(   1,<2012-08-02 12:57:19.578 -0500>,<Administrator>,<TOPSPIN>,<go>,<TOPSPIN 2.1>,
      <created by zg
	started at 2012-08-02 12:56:12.875 -0500,
	POWCHK enabled, PULCHK disabled,
       configuration hash MD5:
       6B 1B 68 BB D9 2E 58 E2 7F 35 AD 54 07 DF 0E 41
       data hash MD5: 64K
       34 7D 15 E0 70 14 90 87 25 6C 26 72 13 05 98 09>)
(   2,<2012-08-02 12:57:23.312 -0500>,<Administrator>,<TOPSPIN>,<proc1d>,<TOPSPIN 2.1>,
      <Start of raw data processing
       efp LB = 0 FT_mod = 6 PKNL = 1 PHC0 = 0 PHC1 = 0 SI = 32K 
       data hash MD5: 32K
       79 F8 27 8E 01 70 80 44 C1 98 D8 5D 9A D6 FF 3B>)
(   3,<2012-08-02 12:57:23.609 -0500>,<Administrator>,<TOPSPIN>,<proc1d>,<TOPSPIN 2.1>,
      <pk PHC0 = 181.1755 PHC1 = 0 
       data hash MD5: 32K
       BD 2A CF 36 E7 D3 EC 04 A2 F8 E6 2A 44 D6 AC FF>)
(   4,<2012-08-02 12:57:23.796 -0500>,<Administrator>,<TOPSPIN>,<proc1d>,<TOPSPIN 2.1>,
      <abs ABSG = 1 
       data hash MD5: 32K
       97 79 DE 2E C7 66 DD D0 F4 0B DF 7D 6A E4 3A 20>)
(   5,<2012-08-02 12:57:23.906 -0500>,<Administrator>,<TOPSPIN>,<proc1d>,<TOPSPIN 2.1>,
      <abs ABSG = 2 
       data hash MD5: 32K
       1D AB 77 8B 21 21 DF D6 9A C9 C2 F6 09 4C 85 0C>)
(   6,<2012-08-02 12:57:23.937 -0500>,<Administrator>,<TOPSPIN>,<proc1d>,<TOPSPIN 2.1>,
      <abs ABSG = 3 
       data hash MD5: 32K
       14 10 75 8A 28 45 33 A8 6C 3F 56 BF 29 37 C4 76>)
(   7,<2012-08-02 12:57:23.984 -0500>,<Administrator>,<TOPSPIN>,<proc1d>,<TOPSPIN 2.1>,
      <abs ABSG = 4 
       data hash MD5: 32K
       B0 E9 06 E9 D2 26 B3 0D 80 14 BD 83 24 A2 C8 B3>)
(   8,<2012-08-02 12:57:24.015 -0500>,<Administrator>,<TOPSPIN>,<proc1d>,<TOPSPIN 2.1>,
      <abs ABSG = 5 
       data hash MD5: 32K
       EF D6 9D 99 4C 66 4C E9 53 39 24 90 92 AD 11 02>)
$$ ##END=
$$ 
$$ $$ hash MD5
$$ $$ 4D 31 C2 AF AA D4 0E A4 59 5E 50 BC E7 FA 2E CF
##$RELAX= 
##$RELAX= 
##$RELAX= 
##$RELAX= 
##$RELAX= 
##$RELAX= 
##$RELAX= 
$$ Bruker specific parameters
$$ --------------------------
$$ [...]
150 150 150 150 150 150 150 150
##$TP07= 0
##$TPNAME0= <>
##$TPNAME1= <>
##$TPNAME2= <>
##$TPNAME3= <>
##$TPNAME4= <>
##$TPNAME5= <>
##$TPNAME6= <>
##$TPNAME7= <>
##$TPOAL= (0..7)
0.5 0.5 0.5 0.5 0.5 0.5 0.5 0.5
##$TPOFFS= (0..7)
0 0 0 0 0 0 0 0
##$TUNHIN= 0
##$TUNHOUT= 0
##$TUNXOUT= 0
##$USERA1= <user>
##$USERA2= <user>
##$USERA3= <user>
##$USERA4= <user>
##$USERA5= <user>
##$V9= 5
##$VALIST= <valist>
##$VCLIST= <CCCCCCCCCCCCCCC>
##$VD= 0
##$VDLIST= <DDDDDDDDDDDDDDD>
##$VPLIST= <PPPPPPPPPPPPPPP>
##$VTLIST= <TTTTTTTTTTTTTTT>
##$WBST= 1024
##$WBSW= 4
##$XGAIN= (0..3)
0 0 0 0
##$XL= 0
##$YL= 0
##$YMAX_a= 485774
##$YMIN_a= -636929
##$ZGOPTNS= <>
##$ZL1= 120
##$ZL2= 120
##$ZL3= 120
##$ZL4= 120
##$ABSF1= 14.98509
##$ABSF2= -5.573092
##$ABSG= 5
##$ABSL= 3
##$ALPHA= 0
##$AQORDER= 0
##$ASSFAC= 0
##$ASSFACI= 0
##$ASSFACX= 0
##$ASSWID= 0
##$AUNMP= <proc_prof1d_extract_pilot.lims>
##$AXLEFT= 0
##$AXNAME= <>
##$AXNUC= <1H>
##$AXRIGHT= 0
##$AXTYPE= 0
##$AXUNIT= <>
##$AZFE= 0.1
##$AZFW= 0.1
##$BCFW= 0
##$BC_mod= 0
##$BYTORDP= 0
##$COROFFS= 0
##$CY= 15
##$DATMOD= 1
##$DC= 0
##$DFILT= <>
##$DTYPP= 0
##$F1P= 0
##$F2P= 0
##$FCOR= 0.5
##$FTSIZE= 32768
##$FT_mod= 6
##$GAMMA= 0
##$GB= 0
##$INTBC= 1
##$INTSCL= 1
##$ISEN= 128
##$LB= 0
##$LEV0= 0
##$LPBIN= 0
##$MAXI= 10000
##$MC2= 0
##$MEAN= 0
##$ME_mod= 0
##$MI= 0
##$NCOEF= 0
##$NC_proc= -8
##$NLEV= 6
##$NOISF1= 0
##$NOISF2= 0
##$NSP= 0
##$NTH_PI= 0
##$NZP= 0
##$OFFSET= 14.98509
##$PC= 1
##$PHC0= 181.1755
##$PHC1= 0
##$PH_mod= 1
##$PKNL= yes
##$PPARMOD= 0
##$PPDIAG= 0
##$PPIPTYP= 0
##$PPMPNUM= 2147483647
##$PPRESOL= 1
##$PSCAL= 4
##$PSIGN= 0
##$PYNMP= <proc.py>
##$REVERSE= no
##$SF= 400.02
##$SI= 32768
##$SIGF1= 0
##$SIGF2= 0
##$SINO= 400
##$SIOLD= 32768
##$SPECTYP= <>
##$SREGLST= <1H.CDCl3>
##$SSB= 0
##$STSI= 32768
##$STSR= 0
##$SW_p= 8223.68421052631
##$SYMM= 0
##$S_DEV= 0
##$TDeff= 65536
##$TDoff= 0
##$TI= <>
##$TILT= no
##$TM1= 0
##$TM2= 0
##$TOPLEV= 0
##$USERP1= <user>
##$USERP2= <user>
##$USERP3= <user>
##$USERP4= <user>
##$USERP5= <user>
##$WDW= 1
##$XDIM= 32768
##$YMAX_p= 460075692
##$YMIN_p= -738090
##$CURPLOT= <Network HP LaserJet P1505>
##$CURPRIN= <$Network HP LaserJet P1505>
##$DFORMAT= <normdp>
##$LAYOUT= <+/1D_H.xwp>
##$LFORMAT= <normlp>
##$PFORMAT= <normpl>
##$SURQMSG= 1
$$ End of Bruker specific parameters
$$ ---------------------------------
##NTUPLES= NMR SPECTRUM
##VAR_NAME=  FREQUENCY,     SPECTRUM/REAL,   SPECTRUM/IMAG
##SYMBOL=    X,             R,               I
##VAR_TYPE=  INDEPENDENT,   DEPENDENT,       DEPENDENT
##VAR_FORM=  AFFN,          ASDF,            ASDF
##VAR_DIM=   32768,         32768,           32768
##UNITS=     HZ,            ARBITRARY UNITS, ARBITRARY UNITS
##FACTOR=    0.250966925370066, 1,           1
##FIRST=     8223.43324360094, -155334,      -22167
##LAST=      0,             -98884,          -300247
##MIN=       0,             -738090,         0
##MAX=       8223.43324360094, 460075692,    0
$$ Real data points
##PAGE= N=1
##DATA TABLE= (X++(R..R)), XYDATA
$$ [...]
23783 166554 -158968 19615 -277567 124972 312132 15167 172208 -33689 -11069 45452
23772 -36009 83014 -46794 -1365 -111488 -22944 9916 82043 -410133 -204406 338312 351444
23761 351444 -235518 37637 -76118 363867 222013 -54567 4685 -61347 -218352 -191008 -61002
23749 -253710 178803 164728 -227462 -334774 -4018 -110175 68003 -79422 -286835 -7148 165414
23737 -5696 -30717 92393 -75175 89971 44162 -96853 -136333 240881 312255 172398 81244
23725 -52410 114720 -52640 189718 -22858 135691 181495 -151963 -622447 107808 348020
23715 348020 -43101 21395 -467941 43735 396171 -310437 -213889 -174704 247179 189658 132908
23704 132908 -391071 73812 -255350 -16087 -68937 98159 6426 -64856 178843 23478 -20292
23692 26646 18811 -107499 -410831 43484 -20989 7232 29388 -120674 -297793 326298 -168072
23680 43459 30323 170177 -331349 -188992 -172427 -110939 148789 -40929 -149988 -152004 -27149
23668 85083 -123366 -44806 -49243 -347030 -163114 75150 -270438 67345 -114724 -25302 -238494
23657 -238494 196199 -64960 -14539 -435282 -16567 69912 116160 -227261 147315 -147179
23646 44638 195819 -312227 168266 53468 13373 -220805 -138478 -61443 -224569 -274944 -431934
23635 -431934 -139183 40969 32003 -154171 124092 -57101 -20190 127657 -180077 256266
23624 198121 -94486 197651 -50695 346774 320702 62004 150432 102073 170174 244543 -38007
23612 -44919 156210 56442 -231241 23926 731 -17425 219917 -58886 19462 -117637 359388
23600 -89838 8250 -209768 282676 39894 -48891 -278334 24849 363400 425833 -44188 292879
23588 -61903 33817 26487 -68955 98505 33951 -77796 -86474 -65606 372269 308397 -61091 -379953
23576 -379953 -242722 59196 -245963 -105628 151555 78292 -11584 -148709 -111176 88305
23565 -87028 -264627 54720 52825 127161 -132581 275887 86651 -115005 -71628 69914 -104743
23553 -51685 39857 76398 162575 141463 101609 -59763 11690 388682 51452 300420 137672
23541 -22233 227531 247361 -74639 41766 -68720 -61805 -46475 -104299 20426 -32271 -14460 70626
23528 3918 -20077 -76030 77167 -110751 100431 273264 74645 -129083 42258 -191537 -73792
23516 -293986 -42689 301729 177705 -278727 34722 -269572 -194378 148927 -139470 108933
23505 40811 -266735 77603 -90444 -15829 -53452 43981 195428 -69843 -139418 110126 -246887
23493 100259 106128 -32917 -92926 -1056 176615 156900 183235 -172478 -70129 23297 -336382
23481 32260 137637 -112456 266856 -441321 337391 -507988 -367740 -193797 154099 -320775
23470 236302 156454 -308329 4151 -336527 149749 -175431 305896 -266937 -6452 -43360 122050
23458 -201102 114101 -145736 46192 -227172 -112293 86208 -6214 -174544 120985 60492
23447 344477 -106401 -251488 34802 -120807 118301 -107394 331510 93444 22810 -64470
23436 126453 228384 -185655 12880 -122090 46313 -181557 64532 128754 33994 -259820
23425 -19028 -171989 25322 -168839 237287 207706 128909 158008 -85142 -67560 -40854 282318
23413 -37906 -136072 143331 82075 -70002 -69218 -46522 36148 -194447 69198 -428590 -212107
23401 69675 -25035 170620 87945 -44968 64057 -224192 -150276 -86508 -105021 52869 -208975
23389 263609 -363871 265379 -74293 55590 -196923 -218255 76810 -224383 -42313 -544363
23379 -544363 -229151 -75719 -355273 220142 -4563 19964 14146 -98912 -53411 -3709 37997
23367 -83076 -313618 220923 -23374 -302446 617227 -85794 -65695 25237 164181 57153 86528
23356 86528 -49304 -29512 188568 -105849 -63401 -321393 -193626 54511 52490 -153116 -30661
23344 -113368 13095 29901 -270091 39511 345281 244100 -150214 136407 -49570 -52875 -39776
23333 -39776 26401 -115176 -91992 -1561 -25696 -443761 -103330 90752 154469 -84106 -72679
23322 -72679 192876 -201131 -3912 52749 -57831 -95690 -193412 -247347 -22762 -106705 89297
23310 -174792 -42561 -15699 -208313 -80551 11809 257854 -184706 186472 -210536 -160223
23300 -160223 -165602 -111131 -108329 98476 -94663 134407 85778 -254201 -64572 -177463 -206465
23289 -206465 -94235 -50487 -60460 -154271 -277772 79341 -57085 -136020 39759 48413 -58514 73780
23276 200051 -24196 259896 -92512 344522 43781 -81461 -320679 -12889 -69476 -141756 -42845
23264 -41827 148980 32630 25441 -23222 18779 22534 -66942 162151 -170877 -224289 171679
23252 1264 100290 -511124 -295522 -152015 -157908 -103731 9655 312677 -54061 123242 129199
23241 129199 119178 -161946 221432 -161190 80842 62452 209643 -72791 80596 71721 -160569
23229 -264805 144771 334440 158302 144217 54250 2035 77166 89913 20705 127804 -115966
23217 45960 216621 -488816 -40150 -23575 -77377 192634 40408 45055 88898 17691 -183354
23205 -242083 65083 -121563 94417 -111756 206193 -379644 81255 88092 -49864 225414 -73014
23193 76058 9671 6757 40017 376276 -75772 -198877 -141259 -47483 -79493 -287344 -237422
23182 -237422 -264616 -62088 60930 81337 279277 -31594 -178667 -256413 121184 194199 -69852
23170 -37932 -48270 -179804 -99558 40874 -274158 -209421 -43097 202374 -171148 -202430 104515
23158 -71271 -110119 71301 -73551 -83578 -55651 -292829 23411 12417 -212394 -322296 11797
23146 -148670 -58072 75954 -206394 83366 188782 105038 -158798 -136414 -136280 -150248 -156957
23135 -156957 95594 190810 139158 -130166 23716 -15977 97764 123434 -41238 -187196 182448
23123 137991 232258 115178 111755 -8049 155178 157662 152130 -276032 -34010 12509 -197359
23111 39272 -374866 -142374 183716 -93416 -221299 -413109 -59049 -233673 68445 -58002
23100 -187859 537521 64938 340615 -78738 328581 -18290 275202 298055 178901 29568
23089 -58140 -267002 296686 163285 -152428 89532 -146633 -168148 -255484 58873 102816 18369
23077 245836 -392101 -100209 158025 -124571 -12840 -381757 -107308 -184399 -111574 -255109
23067 -255109 -265227 219263 131838 -283358 -191095 -56866 -73988 -195164 -238229 186180 126116
23056 126116 414562 -241032 356753 -145050 50607 19271 209496 215540 106399 315706
23046 315706 -314193 -63052 72301 156683 -85122 28520 65277 -55007 40567 -19625 -20593 351293
23033 250915 211096 285981 305801 -262384 312766 219381 306563 185862 -204126 125085
23022 248694 -177195 -252065 -23014 -147527 95447 -48587 61226 34154 136668 153456 -124266
23010 21452 -282214 -148715 38067 -28759 264203 -46415 212005 200862 -174691 -43134 77075
22998 -177094 138830 201991 202928 -15280 110085 -330351 -458539 151730 -24658 32807 -258006
22986 60766 185396 -47719 51717 -98636 -114417 -71787 29161 46490 14775 134827 27447
22974 14060 -74495 188404 -58656 234743 -95874 186800 38554 -423662 25981 -151978 -25923
22962 -88068 1738 -535830 242664 123573 -277249 66343 -18058 -179241 23003 -87914 94856
22950 -14128 -94903 -289958 261404 -59719 19907 41352 -164565 107604 -13087 -108464 -340864
22939 -340864 -46617 113003 -54599 -209478 -56788 -178021 -155896 45307 -243163 -13919 -43741
22928 -43741 121732 -441416 -265366 -129227 -8345 -13488 233578 -134374 190737 -292668
22917 107944 17908 40477 -124573 -96518 -85757 296750 -235102 80572 -292135 17929 -157863
22905 -108432 25469 -73320 -79674 75272 -91768 204788 251893 183058 -66583 -125876 -166457
22894 -166457 176503 128532 -136798 59665 -72453 -175661 -425474 -53612 -352903 224693
22883 -96220 39511 -18326 103750 187353 -154676 22492 -39677 42240 -7856 -302270 -155582
22872 -155582 76851 -216748 -253712 -55920 105922 -39172 167928 356201 68120 85750 -318642
22860 -6508 87131 -132317 16211 -157647 -217206 -236787 180509 -127329 -196826 -185784 27273
22848 -237437 -140977 -323900 240260 -305740 -165819 105918 -213730 -209782 -77739 -39185
22838 -39185 -63381 -197175 217574 30128 -65157 79268 167462 95687 35971 -41321 53235
22826 -153776 -5968 56661 15748 -47858 227553 -3330 -165737 184136 -130510 -81585 -204990
22815 -204990 66685 -135240 7035 -112187 126421 -235161 253703 -163188 -309477 70656
22804 -96451 -43039 95677 -181388 -36120 -38185 70014 -259221 102432 89687 42666 -265195
22792 -324482 124722 131534 66270 -181453 156786 -29582 -177311 -84793 -34486 -229636 -314347
22781 -314347 25997 37628 -317561 -268302 -94719 92831 -16605 132634 -304198 -212257 -332287
22770 -332287 79658 -214038 -65696 -141517 258328 22117 237445 -76003 44018 -56759 56788
22758 -99812 -362566 -68574 111032 152785 -229326 -143815 -112317 143750 -13153 -122227 -186836
22747 -186836 -10586 54548 -148124 -49687 -295687 -180436 -158448 -253427 -59128 -277568 45978
22735 89119 -92578 112710 -26452 -83852 -151439 -265866 -152153 -272439 -25121 -51991 401712
22723 168853 -212888 -334547 -132308 -96463 301394 238232 -126884 -63986 -214045 67800
22712 -47363 -75801 100018 -3532 -24298 214546 92408 -192635 41795 -25769 121087 -355798
22700 -97494 18173 -130041 73634 -468036 35336 321626 -185189 145556 1128 -34005 74881
22688 -33877 -375770 257000 -15986 261747 191455 194033 -237309 89142 48167 33746 -146174
22676 147266 60254 -35310 -58598 106291 -2583 -110136 -389858 -121146 114130 -165302
22665 -143913 -31909 -151511 -164973 -148065 -55339 -140124 -11074 266525 12015 -124965 -100719
22654 -100719 211096 -285571 11097 -325649 -170593 -487587 84765 -322804 -25080 247930
22643 -321430 -136622 -151858 95597 -141901 -148791 -77716 -265073 222562 -29684 -200114 53324
22631 -211604 -58880 -357592 258189 249047 18290 100579 -172572 -81825 276164 -121938 65843
22619 93385 21967 -19969 96739 -155278 -115238 -210213 31488 54532 22690 457914 -260594
22607 85087 -38875 83581 123642 -273970 -208382 178552 -160220 -137300 351881 -288040 139591
22595 171268 -79441 122440 120592 74677 -117076 -25779 -334041 55263 -57551 -1858 66422
22583 172835 -5052 -19556 27553 -12137 -174601 -337759 -25295 227562 -58216 -63097 -119409
22572 -119409 -204826 127814 259059 13987 -185251 172640 -46874 -177568 -264539 -11077
22561 -50139 -81776 -423940 -72805 47123 -85476 -69245 -71338 -327466 26253 -320484 -202381
22550 -202381 -72816 -68562 71990 -5460 164241 -122556 103023 36889 -151042 -146252 56198
22538 176870 -49597 -2190 -121378 -97671 26330 15030 215180 207483 95731 -161206 -115703
22527 -115703 1801 29410 -58411 231917 -76327 -50502 184143 -44964 -43306 -120380 -170971
22516 -170971 -40828 253694 -32034 -152222 -213653 407140 13834 212239 73934 143196 232539
22505 232539 226839 -126723 -63909 46431 -104718 -141433 -293919 15668 -149724 -200352 39279
22493 -18813 -102914 -393466 -162951 103229 -300052 -453811 -201287 -299282 -51425 -85733
22483 -85733 31000 -111489 -166070 92293 86768 50110 226705 -47245 161933 -16754 -254113
22472 -254113 -4979 -294900 -189984 -163628 50007 -21750 136827 -292048 -58950 87398 45638
22461 45638 407527 22092 -9395 -137572 -315300 -98706 -307501 -133496 193737 -240392
22450 -162892 -219561 -9985 75852 -285650 91258 294681 -84880 -210555 207110 202636 -108499
22438 46418 -25407 -120824 -516964 34257 257702 -108869 -87106 78577 -209014 -400355 -18489
22426 -43715 -12436 101740 60347 66248 -188908 -209604 -44504 -488533 194651 200369 -192453
22414 308036 9891 2433 -255345 -84338 -51375 123814 -188706 -136477 243 -278475 132788
22402 -17920 -64238 -259945 -314702 -40903 -269138 -448543 -276991 54044 42684 72162 252373
22391 252373 40622 -117240 -9148 -367249 -850 -180227 -36757 112998 912 91584 -242013
22379 265777 1309 -50822 166009 49568 -127591 -84704 -257207 -283918 77775 -26767 -61563
22368 -61563 166555 206347 -117073 -110514 -199626 -127707 -206687 307181 -476862 -43705 171076
22356 54845 -216578 69139 -75352 53419 -124621 -179789 -80560 -61991 101559 -77900 -215107
22345 -215107 24603 103517 20815 -151589 -103531 -280637 -105313 -93671 -328753 313677
22334 77261 -35951 -230055 -266285 -94970 -40202 126133 -61507 -285942 17840 127704 -70539
22322 -242493 -135697 160671 -160328 28900 159950 -29834 43641 -81229 -83956 106 -208864
22310 152551 47494 -39316 185499 -77525 187 -102826 159771 -48475 -66688 -9975 -31017
22299 -31017 99815 -223725 57654 14193 -115294 141597 393729 97304 -37202 10696 -61399
22287 -108714 271272 211272 -179756 21010 377096 61791 -42732 -6783 196031 -179710 175538
22275 -493 438609 -147235 -420024 167774 -79423 -97205 -333852 -58430 -134481 -184972 153129
22263 117066 -7840 5765 282392 -394435 -306507 114958 -164101 -90752 -251011 375869 -307304
22251 124675 130934 -104546 -181561 92146 -111310 -278180 186860 218199 144721 70657 -263248
22239 -157097 100092 -73103 140237 303874 73336 -174803 -186720 204925 5085 -509176
22228 -159822 -42154 -222814 -110705 -122724 44821 -43489 -179348 -30884 19109 -93646 -54291
22217 -54291 10110 -524340 157736 -205182 -274124 -54941 -294031 -103029 -234684 -129231
22207 -129231 62381 -144438 -182221 75951 -20527 -226541 -316624 54832 -240536 -170860 -130162
22196 -130162 223924 -235926 -265710 -51533 48581 -36813 -174633 -166164 76002 162608 -158744
22184 -28153 -54586 958 114724 171558 -12631 -333428 -19409 -291851 -155388 -42501 -196254
22173 -196254 -216294 105776 55552 -25643 100729 -103799 -144266 -8994 127640 129775 1998
22161 84986 -14888 5644 -145969 -336680 3331 -4970 75776 -193374 -282506 -67982 -5715 -262536
22149 -262536 -220405 -77598 -49934 4204 -346382 -210564 155900 135832 -240386 -400374 31908
22137 46715 -214476 -437167 148313 228617 65189 -241851 18097 -138047 111014 -110906
22126 -19075 -542763 -253025 398855 26593 -180921 157617 242038 114898 -96111 -40423
22115 88639 -304935 -180250 -322293 -242295 -52578 189163 -249572 196821 -83194 -231570
22105 -231570 278824 -179267 -174617 239526 -13413 -110160 -116263 -267622 -273194 209907 -17085
22093 -248956 -31918 -138604 -19080 217066 294219 -408472 199829 -624098 -43506 106712
22082 -164241 -343646 -27504 -213122 -175038 101705 -51168 -62255 113860 -349071 181385
22071 -127499 110540 126519 -213931 -7907 -69634 -224956 108406 51618 -157911 -232650 104595
22059 137809 -42434 -21725 -326106 139208 20976 4024 109655 156770 -238536 -79004 -93654
22048 -93654 -54615 74637 39268 -251704 260254 -348898 -179981 18457 -80841 -415 47819
22036 -128282 -56831 -293214 -44477 -15604 90543 78646 -62189 125855 -80568 -37015 -244061
22025 -244061 -66474 -147209 65494 35473 36772 -65410 -166377 72671 -11882 -189442 -61040
22013 57514 -125739 -152039 -158325 -227804 29703 -306627 -69594 -199631 -236977 108513 -303654
22001 194916 -109951 -21946 46509 -202775 -117825 -4373 -189070 -76753 -152560 -261041 334036
21989 274240 -402259 122105 -353580 56173 -169798 -285884 -252501 -125079 103865 -61108
21978 374383 -116322 138112 -53835 -423223 -151545 -232198 -62300 -1753 224047 -96772 1841
21966 -184794 -129848 -268912 -74087 -141774 144752 -125165 -133231 -19914 -81544 -166330 285337
21954 -196655 -542403 -32661 -55202 123855 -99348 30966 -65548 -78610 3541 32913 122065
21943 122065 -273925 -222522 28051 129208 120037 -189406 231904 -123826 -255283 -169536
21933 -169536 -189090 -361623 87152 131379 -110528 -181529 -127107 -9435 84756 -371859 -89645
21921 -286988 -162769 25144 -34304 -119986 1790 -34723 7981 -175553 -64166 33241 119305
21910 119305 -247894 -93555 -15182 75847 43762 185600 -273765 212015 -174370 123864
21899 175593 -19896 32869 -319932 57681 -192993 -316007 183846 189275 42583 84111 -337513
21887 -86172 121502 -171535 -297123 -14686 16675 3097 150143 13066 -19371 -15505 -27527
21876 -27527 -236689 -629286 -176190 54653 52011 -5799 -149702 -279371 -10856 16261 -7231
21864 -88770 231334 -11536 -303957 -262843 -254235 -23458 -283150 13583 123322 -46388 -61811
21853 -61811 -59139 -34420 68841 -186834 -44282 -171833 295420 -44364 12814 -16370 -279469
21842 -279469 37938 -24634 2678 209246 -279188 283962 -175550 132050 -55585 139629
21831 155921 117106 -335023 -165775 -283667 428 77180 -30231 -81064 -106418 -156316 -37640
21819 -1088 -402299 56313 -129053 118781 -18505 -320136 -103885 -176915 132426 -68833 -101519
21808 -101519 -106227 250429 -85322 -52323 -198143 37301 125116 -88512 86628 -59770 24458
21796 -50178 30174 303160 181190 79309 24805 80435 -132812 7063 -117744 -39932 262079
21784 41144 69734 80283 -250064 -191269 -301737 -22920 136225 47078 -291490 -13718 -7996
21773 -7996 130362 99560 265678 -35417 63108 -102056 47682 98562 -184834 -127147 -76701
21762 -76701 -84717 1895 68251 202167 152812 353 66241 230873 -151686 58965 294284 -99654
21749 133307 46821 8623 86989 176130 -83155 -148036 -344950 71827 104433 -173991 -270348
21738 -270348 129567 89623 -149360 16295 -303412 19390 373685 154733 76770 10289
21727 113009 104330 -87170 57483 216807 -17554 -198171 -116603 -72895 31438 66212 -52649
21715 139119 -148003 146788 252807 157626 -10622 -148237 -176540 148619 -127182 27063
21704 -162389 35357 34793 54428 -324619 -175830 -202655 43192 -103542 -160850 -80865 -29827
21692 139053 -174821 34639 -306724 267754 303709 67444 10772 -152698 -197869 185653
21681 31914 -149325 -227189 -47776 -162813 -62247 103241 137349 -50785 -134085 -62617 290938
21669 283070 -588749 -195077 323304 -69400 -63127 150806 -192965 -393838 -57486 -26663
21658 215773 29345 -347552 -181515 10047 56154 -203513 163363 -102669 -73048 -471238
21648 -471238 37175 -49263 235468 -86340 -168035 -228569 -181745 91559 -176271 -12219 -29030
21637 -29030 -174417 63044 -94247 171792 98217 -212562 -79331 -47292 145038 -106632 130130
21625 -261057 63088 90747 -184850 245382 -502038 -76831 -100327 -156135 -168412 -27539 181153
21613 -318728 -188287 181422 -59282 -350601 -58752 -22254 21774 -86145 -171978 -426288 -129620
21601 198385 -42736 -13206 9333 -254840 33213 -126266 44535 30623 -141740 -282342 -247325
21590 -247325 -229067 117626 -14750 369727 -303853 92050 -210763 -335195 -235746 -176393
21580 -176393 -203637 -420633 -105115 -63372 -54063 -63176 180245 99657 -127261 273432 -72003
21568 96705 -41001 134436 53174 39281 48688 -115319 30731 -95611 -138776 -83611 68304
21556 -47470 -130643 -55652 102225 -159257 105405 -268926 116581 -245815 117083 -12730
21545 -256180 -160037 -156528 67837 17937 -452758 -204526 -16537 -59574 -285928 -216646 216559
21533 -160674 -465933 -125837 227160 -149704 -379111 179099 -332958 -86414 60601 -162625
21522 -131741 48317 -277002 30125 -234641 92075 153079 -70546 29273 -216848 64962 -295960
21510 -140988 143776 -37672 -40756 -308516 -79493 124271 84063 -151286 -55386 -164240 250729
21498 -66295 -69545 117042 170463 -35422 -7271 -227381 9514 15423 -83884 64880 45623 151847
21486 151847 -248324 -280361 -441366 144450 98949 -94103 -50110 -40344 130779 17199 -60234
21474 -50203 54219 50128 -155958 412882 -39234 -77143 73617 294998 -195551 -213430 -598403
21463 -598403 35024 36670 65277 170676 176171 -105207 -212478 -25433 -226964 116430 -121476
21451 37976 -64246 139318 124254 55693 -204547 405014 6670 -12570 390108 53652 113574
21440 113574 -47292 100188 92757 192685 -7236 84716 276369 207181 -36023 -172700 358067
21428 -8482 460029 -224238 -195093 194411 -296100 -200099 -97558 92845 -295931 148533 -392578
21416 294079 -49665 -41715 7268 -263122 -370240 53730 -67113 -8408 -75806 86134 49783 238534
21404 238534 -29870 72500 131926 -318964 -188585 -287222 -222241 16219 147126 -102531 -449151
21393 -449151 60983 193331 -37238 -245467 -104926 272339 50570 -133832 43139 -12396
21382 25542 271971 -132096 -418141 -146875 -117341 -3799 -69279 -243450 -146127 -24269 -35041
21371 -35041 -60812 -27619 -15275 -71298 40543 -141628 -124590 -193712 -132576 -149783 -90871
21360 -90871 45476 -176101 -202348 -243929 -5182 272048 174898 80191 -207886 -134546 -60997
21348 -333701 1037 -77103 -363865 -54903 -199385 -273435 -283499 -160104 -108840 -23761 213496
21336 25437 109973 -328055 -135039 -277932 -50898 -59525 -342924 -89332 -126784 -376146 132492
21324 185359 -86375 -180819 -10933 64734 -121093 -52448 -77390 -128311 -63253 -211601 -179568
21313 -179568 -136189 -79760 -406770 71325 -19780 -219864 192076 -126274 271124 -382740
21302 -125052 11988 166316 1944 339143 -59116 229695 -40948 -185918 -72194 -72035 -199309
21291 -199309 -145498 -93694 -83890 -313775 -94354 157354 -224317 -16948 -40026 -160596 -19007
21279 -306571 -252659 91692 -2213 -106688 47666 -130570 -150087 -255829 -31279 -322474 -91090
21267 77047 -164810 25589 -307498 -40856 -124461 -220605 -133210 -301047 55927 23437 -142143
21255 52527 -85438 26670 -55014 -410365 -12649 -41391 102562 -259138 94611 -174226 -163544
21244 -163544 17632 -158100 -132584 -247729 -277312 -330121 63394 -49769 123022 190372 249233
21233 249233 -30434 174989 -33742 -195769 -71693 132858 18356 -34695 253032 -285345
21222 -276190 144871 -102332 62989 51900 -147982 -107072 -417845 -127730 164473 -234102
21211 47824 20927 -292324 7689 -151516 -122771 158276 -241580 -54732 -82973 271194 -95157
21199 -194765 -66248 54171 -73733 -52127 58748 -69409 89309 24569 -112359 -97024 115997
21187 -239132 -234876 7495 -119914 -163584 -306762 -296996 -104220 -81573 65770 -11483 -173021
21176 -173021 -113523 -118717 -233965 -95475 29503 -175984 -55518 -130774 5582 -141179 -120391
21165 -120391 107479 218388 -10573 -220744 -70100 -218890 -12899 -181832 -190645 51000 64545
21154 64545 -119717 130933 -79810 -134636 175500 159596 -91634 -33374 -326519 331577 -175657
21142 -18044 -126677 45012 -139863 175045 37419 -15715 -216057 2440 -250249 -149014 183292
21130 -362 -423083 8761 -232494 239536 448187 49962 33881 26050 85041 -29960 341320
21118 30732 63309 191711 -112432 -83914 46717 -244032 -33798 -317738 -72804 204788 140283
21107 140283 452003 168576 -98536 -82803 141518 40166 -735 -31177 -122925 -314876 -8451
21095 -103948 78700 64711 -125295 -80706 41427 158491 23918 78752 -69656 -141993 -462273
21084 -462273 -105161 274570 -3964 5362 246936 60329 135058 61537 -47698 -27335 -43883
21073 -43883 -159859 7780 95374 193337 -184548 137061 -57255 -457750 75007 -94988 -28587
21061 -20768 -157251 242071 -364609 -895 182591 -253548 160123 -292291 -89644 -149243 5593
21049 113297 -248382 62384 -316384 -50648 153878 196363 72424 -65313 -245239 124719
21038 38237 -82465 301010 87580 45540 55011 19444 39572 327906 -97109 -114803 -223773
21027 -223773 -282733 -91334 -109751 -3653 -119167 -8606 -184630 -38671 -234903 381976 145452
21015 225681 -140251 -289962 -152473 -56478 93643 -163873 -67315 628992 192382 563786
21005 563786 434915 453771 455006 19200 -41669 79496 -14145 -4352 -128860 -332792 -216799
20994 -216799 -62750 -367313 59685 -95479 -138919 166063 58201 27045 108323 59458 23695
20982 -202974 31261 -185856 -145138 -270283 289815 -282667 495421 -189701 -330633 -275501
20972 -275501 103827 -231799 56717 5846 34258 -396800 53868 -251130 -24555 147682 -296865
20960 -137926 -156410 148361 -140621 -411476 -40443 -322930 100770 -124379 -211843 -94042
20949 17085 62209 -270579 190964 21508 10522 316107 390404 556583 217352 191251 191689
20938 191689 -272600 73973 -173158 -271675 -188640 -168146 141303 205754 52765 -318613 82609
20926 -367589 35872 -24998 -84338 7250 -14029 33784 36729 -60185 210065 -31779 -54241 210808
20913 40666 2115 -52265 -80638 790 148150 -469993 -221184 58281 -119913 -100580 -486117
20902 -486117 103579 -142474 266843 143553 123434 90897 -98036 -129933 143371 -226868
20891 21737 122534 -423687 124823 -243244 -170933 -10788 135725 86935 -332941 18778
20880 82800 -183396 -170010 18254 -240000 131617 73061 -16950 7618 -70890 -194457 -114033
20869 -114033 55410 -412592 -15285 182648 -240277 -171781 -231215 -106683 93461 -180374
20858 295969 -206472 -399290 347887 105954 -148172 46912 6374 -53417 114015 -314010
20847 -202238 -27008 210090 -130430 -228493 54053 6597 -188484 58182 66663 159743 26804
20835 -245626 -261128 5683 188340 -333055 -325909 -42428 -373585 31836 -190839 -203353 168571
20823 -277584 -237007 -38806 297826 24215 269520 -67563 -51015 -60041 -128931 -186856 -67361
20811 39236 -458157 -297728 -241236 34646 112104 89096 220582 151054 291597 185419 -53850
20799 -250003 -75557 -191463 -94271 20622 -189748 -91207 47033 104266 14120 10182 -324219
20787 -78974 -153619 -484343 22633 -38430 -28230 -54731 17503 181434 6050 -21709 45281
20775 -97329 -235813 -281820 -141416 -50403 142690 -224031 -121577 -289502 -69473 335704
20764 110849 103599 78643 -290637 -410110 12010 -36182 22214 57980 86152 252508 -82045
20752 -260011 -71151 72976 -206182 -317194 -105231 -103330 -36022 41469 -266924 259615 -78068
20740 -173263 -110892 -278618 66338 -181492 -56575 -256414 -154196 38475 -40982 -243101
20730 -243101 45966 -87373 -300035 -153769 258994 40433 111584 82386 -44451 -145748 -90976
20719 -90976 -67618 -5268 -82132 -206340 34059 -176071 -219253 70722 15029 -25982 -113510
20708 -113510 -10704 47422 -191090 88471 -270605 -258652 -521230 27903 -78881 -194290 -126403
20697 -126403 204927 67704 31505 -223163 101856 289784 33229 -145774 -17258 159619
20686 -85818 -170953 -66326 141693 -37941 424 -126252 -329824 -319262 -49279 -162745 -13518
20674 -582903 -13581 -227041 -376989 -227295 -88387 -48442 -116436 -160060 -17619 55891 -48147
20662 244995 277598 -251003 -159143 18730 -111579 -188513 -180692 -270390 -6449 -395489 117635
20650 39928 66559 34078 -23671 10862 -5987 -36436 206775 -151457 314247 -15421 -168355
20639 -168355 -373506 302320 46369 -140177 163911 279461 -340138 192123 83149 -103282
20628 -26105 -41607 -5027 -264861 14737 69941 216433 -163017 48892 134582 -106531 -305792
20617 -305792 -288850 -217365 82089 115478 -143166 -142467 -54859 168372 33186 -52479 153056
20605 75182 23532 26986 -369393 -65735 -125871 -26468 -98763 19593 -320586 165599 -38405
20593 -44906 -153235 -558281 -100033 73921 122320 -273252 -78135 132664 216091 -190320
20582 -15836 99874 16287 -304612 -220561 111328 -188851 209033 -62937 -67263 11621 -141749
20570 -77264 -85314 271804 148562 -308675 -16965 -170755 18544 -85055 37762 -51361 -155176
20559 -155176 5479 241755 -20494 -20331 -203251 11083 184575 111866 -375527 -171066 -72816
20547 -148709 -273251 -82981 -25534 -283370 -188394 -366598 -153844 -6694 36843 301005 -457197
20535 149910 120589 -221825 -345371 192365 17178 117616 -174779 8930 63365 -216926
20524 -87636 -2319 -268368 32992 -284080 -19186 -175702 31854 59027 -117271 315105 52482
20512 -302492 -194416 -245188 -61331 133095 -299044 178253 33026 161503 -359320 324264
20501 -39167 122631 205690 -123305 -155331 -400670 143386 47163 -86318 -144159 -12155 -21306
20490 -21306 -244900 -35239 30917 -382913 -81293 126942 -346353 -276810 -85773 -22682 -228418
20479 -228418 150639 -54688 -52245 43123 293789 -341510 -323965 16503 -159632 -260292 -98175
20467 -300095 -128018 -15407 136030 173791 -112488 40751 -195585 92254 -80954 -86589 9455
20455 -285041 120262 52972 15699 -170358 452822 -24843 -21938 42111 1643 -132952 -62633
20443 -378456 -472124 -182874 6196 -273932 39394 -239267 -96227 158047 -247668 -44486 -109126
20432 -109126 -328058 -40024 -215005 22041 88818 104284 1552 -352067 -89129 59318 8998
20420 192604 -69518 -19747 5791 139962 103989 -246628 39451 4317 219291 39232 -169143
20408 232253 -545207 -231625 -266774 62494 -40456 -137579 -316589 89893 419380 -47913 -463426
20397 -463426 -32434 2652 -161730 11112 -39213 -138475 332217 -312222 -232148 72543 54851
20386 54851 -324259 11914 -195270 167139 -267729 -42582 -91057 145271 -882 -192864 -71642
20374 -72999 129088 -61084 1341 -123734 40125 -278843 -82525 90450 -261662 232232 -41154
20362 -133668 107383 -208511 -118781 295289 -217961 -425915 31794 -109359 116990 -28872
20351 84059 114339 61544 -218743 1717 -127681 -75378 196940 -212781 -285155 -151139 137880
20339 -217113 15790 2619 -254787 -374746 32227 -19839 -222481 -400922 -102067 -150680 396542
20327 -143609 -203924 75435 -55642 211968 165363 -173200 -61076 206791 -62568 -218670 55971
20315 73956 42699 -32866 193132 -89547 68603 -200265 -110412 -292480 -203663 -333800 -126940
20303 -92038 -277868 -217106 -304886 -241589 -159051 7222 -385178 -128811 50975 -135766 38825
20291 -68762 -116812 -507679 -73289 -118196 343240 -122705 -122880 79049 -45866 -33686 -415664
20280 -415664 -231290 111611 -236691 120306 -212391 -34858 -133328 105651 -27353 226571
20269 -92778 -77560 108492 221652 -117001 101255 -104580 -22991 -33595 -83549 -44441 40237
20257 -86858 -101766 -45132 -161319 -25231 34166 67168 199678 -268837 -119509 -157357 66344
20245 -159706 200195 30557 86978 28437 -52819 -207174 118741 30626 -332417 87711 -381555
20233 -534552 2900 60891 -51708 -214424 116252 51603 12628 -175809 -68288 -292446 -98470
20221 -206494 -22092 53255 -230624 -200041 -107960 273045 46500 -52586 -63992 -311489 -1053
20209 -82733 955 -363268 -241577 -75637 -217118 -7781 -203245 -379731 108537 76424 160528
20198 160528 315724 33783 -130389 173221 -52206 142161 174334 238309 19076 -138729
20187 -254743 180416 295518 -21223 18851 -145401 398651 -114789 -38307 -126944 111905
20176 96360 249988 28098 -155030 10406 -162844 5413 359582 -26780 -171040 106380 67202
20165 67202 110874 -79144 -97166 418203 -194235 -169073 -27295 11336 285410 -6039 -138301
20154 -138301 -201308 -109666 1409 174176 -29940 391895 374588 487029 321365 382009 -24897
20142 208351 338956 67287 448535 305200 416249 524455 91068 -38693 -178329 450514
20131 -316546 -236423 356419 84802 -67214 284026 -101692 37097 -129609 -87081 -88109 -281606
20120 -281606 -43166 -55975 -159327 -423272 204472 -69293 -12667 -40416 -7642 -76710 82674
20108 -201445 153545 -147984 142759 -165471 -347309 -87598 115799 -14186 -212764 114858
20097 225319 107925 -472072 -201748 -361932 51205 -138253 -183634 -27928 -58780 114016
20086 -222371 -120415 51629 -73066 -12695 -273745 86817 35315 -191214 203360 -246028
20075 67024 -181250 9756 -80649 79969 92567 90728 -90739 -5341 -300342 -230123 -112776 -116507
20063 -116507 -242626 20851 -142542 -62319 77862 -268732 109859 12589 309907 -196170
20052 270954 -11182 36047 114488 50691 303034 -86063 -98952 -219998 -9402 -112927 -339403
20041 -339403 -62256 74158 140520 -1678 -259249 -296936 -31826 -225480 323481 -12289 -252723
20030 -252723 114156 16256 -127509 118912 -435392 -268132 -65524 -285745 -64536 -316602
20020 -316602 -237714 -5286 -373212 -215246 213391 119349 -58964 -87265 -295055 259274 168189
20009 168189 -338834 -6605 -293581 207609 262892 -215557 -249246 24234 -143017 -357215
19999 -357215 -342753 238336 45304 241565 286757 205727 341307 -73601 263772 156588
19989 156588 538897 -25476 151804 470900 124557 217813 -20665 124960 151012 -113343
19978 97593 165758 -72331 76902 -333310 28734 1145 148162 -116494 1584 121112 57788
19966 -11163 -235116 -137133 192836 11554 -8680 234277 -148399 -851 14125 -13754 -162709
19955 -162709 170301 237848 157344 -11730 -332576 -224065 243624 -133894 -240990 527296
19944 109679 -294344 -15808 -172656 49892 -139430 -88447 164079 61831 281033 77583
19933 -102904 -115398 -337800 -161295 19899 19877 1146 -82467 -213448 -339153 -126298 74433
19921 -66988 82228 -292914 -187575 -8349 -218666 -297342 -233062 -81664 -134569 125480 144663
19910 144663 -95033 231067 204861 -269009 -16114 -228667 -166601 181921 258343 75956 340704
19899 340704 114861 -51620 78772 171996 153179 148212 -5888 2009 103782 -21427 -38125 34625
19886 116693 25713 -175989 -262157 293111 109277 -208790 -260429 145992 -315636 81812
19875 -120745 -227423 -212631 -64816 -166614 -149679 -231764 -194680 104993 -224658 -208749 -165363
19864 -165363 -91333 -37403 -55891 -198409 -266804 -298320 -28981 33430 75479 -27976 -150568
19853 -150568 79015 -198949 -105911 -60252 -106854 106432 127578 11636 19093 57624 -285801
19841 -16346 60064 -126708 147695 46465 -50465 -388057 -6478 -88831 40548 -114804 137210
19829 -426348 -201122 230134 -18918 129291 139078 2650 -34893 133565 -26115 -316769 -291588
19818 -291588 144615 25440 -132991 -207928 -250508 -282652 -21040 -14398 207002 -83491 -274449
19807 -274449 -235375 -9171 230364 -247291 -211419 170288 136858 156908 -424658 232853 -55943
19795 -45512 -124182 -125035 -185573 161108 -424385 219689 8448 -118579 45901 190102 -419431
19783 212699 6081 16381 -124410 22547 -41134 -2486 217094 -28985 -65067 -325471 -253699
19772 -253699 -211604 -72671 -55887 1790 259564 -146823 145029 -43142 116270 -95704 74737
19760 121103 191998 -201134 252908 -67413 348471 60222 294125 -21491 52220 78293 36286
19748 149090 -341710 -186456 128445 -19666 183519 -288411 177559 -240508 73154 25596
19737 -24438 162107 -91866 85057 164675 -334252 -43741 401352 484620 782769 497799 473585
19726 473585 314872 -436894 -269531 -199761 -20388 66384 209134 -33202 296707 -279520
19715 -62789 -131021 -13208 -251376 -255661 68303 -55072 -19205 107445 26213 93348 211130
19704 211130 140701 -17762 164214 15338 407293 -189242 424933 334081 223484 575035
19694 575035 -205078 117725 -142504 131262 230048 -220280 -562304 -429905 -178408 -107080
19684 -107080 -168143 -55306 -127547 -259804 -164126 82041 -466 -185230 150291 -332442 -246913
19673 -246913 -299227 -103873 -243467 1653 -225908 -103484 4993 -56747 28760 -89493 -54444
19662 -54444 -118674 -201418 202340 24938 -151081 -398246 -396015 303392 -343029 -287181 -253778
19651 -253778 -299745 -286921 -141419 -310126 -47195 21886 -391814 -227716 -140251 -92866 -78841
19640 -78841 76856 -257510 208907 -45603 -101608 159984 159867 47108 -187994 -264452 -151367
19629 -151367 84141 -180608 41549 118130 -277312 208314 -5973 -154911 -129836 -96146 94592
19617 12690 -335166 108653 -123361 -61465 -129818 -224307 83451 8207 209913 81468 -326756
19605 252940 85451 -23262 -175457 135850 371247 110712 -99324 -114900 99737 -168707
19594 -76701 135438 34883 -90330 188883 106776 -148380 -163293 -369292 150667 -47764 -245215
19583 -245215 -143676 -97411 -75462 16847 90658 -169103 8695 -1 62091 -255331 -117106 -55052
19570 -186324 160969 -187238 199096 -114142 -130043 -328622 -216827 39605 -358374 -19598
19559 -219279 -186520 -277612 36225 118723 -87414 -110399 -74231 208174 -190512 -288721 -189925
19548 -189925 230696 -113173 -213306 -200076 -113878 121726 -242123 11402 -332600 -344173
19538 -344173 58889 128677 139969 15182 -95503 10523 270253 -170665 -92875 78267 -77660
19526 -71487 -123792 -403099 -197636 -28592 -146038 -326755 -292015 -22814 -165262 -46570 -42481
19515 -42481 -70906 71453 -162668 -133888 -161789 37470 106011 -60983 -162082 -91255 167 165253
19503 165253 -129934 101404 -230683 -392607 -114690 140729 -300433 -134589 36849 117681
19493 117681 -76120 -107752 -351356 36471 -392803 -254808 -114554 25644 -23980 217297
19482 -81737 91364 -226573 -92939 -48209 -178927 -85663 -43809 117195 -153054 -353156 -173010
19470 -404133 66354 100652 207173 -415545 61215 74445 114070 196003 -147406 132919 156522
19459 156522 189156 178281 -66984 -160029 -165052 -329118 53911 -49178 -32278 212250 91525
19447 -159877 -171031 -260297 -118680 -106400 -71428 -25826 195937 -65047 67246 157419 -217529
19435 -45696 -125169 -283158 -432229 -248535 354031 -484208 -175115 -76680 -27656 -99434
19425 -99434 -152969 -125524 -32999 -67138 -9389 -346230 -152123 -136708 -163191 -45438 156713
19413 51820 211092 -77580 25181 -109675 -40088 -111366 129863 -38825 -23434 -550666 -256698
19401 91160 -18153 -59249 73602 100711 -173946 -66864 -78697 -293402 -508722 -194451 -70994
19389 -95823 -232198 -49565 -33537 -260641 -189058 391165 -12051 135419 -140280 -10322 -9710
19378 -9710 276735 -184859 -202294 -174943 -43781 -263564 -239731 -116651 -193166 11976 49783
19367 49783 -277735 229104 42905 8785 -165781 81653 255233 -41527 -99498 249966 -206565
19355 -70353 21763 -250 -133882 -317037 -123991 265541 -67352 -169856 -83196 -116140 100112
19343 59941 93894 -423491 -210701 -68668 -331830 29377 -170696 -452391 16514 94559 -386768
19331 -239960 -119202 -309952 -119360 -15937 -228936 -32983 -136823 -132920 -28358 -297617
19321 -297617 -104660 222081 51480 2611 -84228 13784 -110799 -273862 -169354 6051 -161827
19309 -74242 67364 -75156 55641 27176 -116594 -61028 204537 -235435 -81300 109250 -26245
19297 -11190 -129986 -104514 23835 210824 -57308 -98895 32231 -116662 -91593 153502 -70604
19285 127786 -222870 51459 -40145 -17080 -360677 -117006 -31519 -290394 -107993 -268145
19275 -268145 186551 -662600 44437 17412 -361910 -327351 88124 44391 -198902 93244 87290
19264 87290 -16437 -165846 -20796 -91880 -52263 -14431 83439 -141253 24443 121155 -466405
19252 77091 -35095 -232688 -240829 35768 -488238 -331841 -247871 -64047 52050 -70809 -189751
19241 -189751 -29981 69546 17170 59450 -108557 -167833 -59040 -161701 -109905 -205181 67799
19229 139423 -70246 67790 -260199 -78612 72276 -96257 51744 -104059 -322552 -259186 -317854
19218 -317854 -101150 -172989 -89792 -69502 -80458 86931 -13953 -39971 73625 119623 -92652
19206 -135604 -109308 -40155 -80729 197223 -240051 -119659 -95951 -268201 -72577 -138891 -475580
19195 -475580 -141167 -165275 -18890 -46602 -193494 -122378 -244285 162974 -157795 -139093
19185 -139093 135539 151405 -132110 -169049 141152 -241045 -65968 -42357 -253146 50555
19174 -139385 -263462 25687 -156716 -14955 -84079 46618 -101176 -91230 -306628 128756 -1297
19162 -50811 82650 -330289 -35235 -478239 -53783 679 184766 -164595 -217676 -63425 -35870
19151 -35870 140400 -214877 -247730 74909 -91996 -44966 140575 24719 233462 -74790 49608
19139 -145940 135277 -139006 5296 -246941 279807 229588 -190737 -275620 -122137 -156288
19129 -156288 12795 403769 -101807 -473016 -82226 -29409 211532 -64683 19206 -219365
19118 -167780 -53772 133419 14115 156606 2795 -35491 -72046 -96018 158069 41499 -148517
19106 55390 -52912 -351787 -87381 -229150 -93054 -74772 -23758 -164953 -101485 30558 188364
19095 188364 -155854 192346 -123110 -61148 -17328 108885 -292783 40295 143707 107515
19085 107515 97771 -68072 114845 84497 -295334 -109247 115799 -107255 -104435 -327755 -251223
19074 -251223 -80098 26319 -146173 89934 123893 -20986 27099 16784 -363045 -134461 -124498
19063 -124498 -80015 -257841 78170 136904 -37669 195426 21446 -145823 83896 -168111 -118591
19052 -118591 -63757 -178244 -47438 75665 -305749 -166997 -338313 170974 -14241 -165234
19042 -165234 -127320 58564 66730 -5100 20424 76112 -40414 -62595 -266068 -7505 -296516 -280862
19030 -280862 209400 276819 -61617 -69538 -3583 -193996 27769 188251 612 -19553 -10749 79527
19017 -363606 -65345 29414 -93350 -332923 8483 -195013 9123 -257489 157876 -38169 52568
19005 -227553 180550 -49676 -143168 264205 -182084 -307012 -198491 -79736 -121712 -67518
18995 -67518 48248 -129403 -36039 -90255 -1601 -156034 140728 -11790 43888 61780 -152763
18983 -198721 70673 -42656 54322 306991 -152989 193697 28977 -64873 69678 -106009 165110
18971 368737 759193 561157 265729 140896 77416 -417679 -163339 -224524 150128 -122852
18960 -386306 -175416 -33871 223655 -203448 -117931 479694 -225389 135170 -130238 232668
18949 -170816 -379323 -414438 -120388 -30417 -263662 -208387 -28965 -262826 -73272 109934
18938 333052 -145026 53896 30503 -93918 -217731 276884 -60428 -75814 -11930 66938 19734
18926 -157469 185274 140771 -115407 17666 -14173 234791 -87854 -72722 -77618 -51157 -264034
18915 -264034 -282819 -13345 -77286 306777 42220 372550 83029 566512 381561 -74291 221024
18903 120122 -102337 -176944 23236 -226085 -22077 117583 -213741 -144717 227557 -68248
18892 -20934 -79286 -15118 23058 120093 234663 -10337 11161 -102721 224471 -147568 -88857
18881 -88857 -431162 -122367 -171794 -161060 8539 118823 -299457 154527 346981 253898 -132417
18869 -155992 39626 -45075 -421968 -13273 -142046 55539 65551 -146800 342304 7533 84262
18858 84262 114485 -33958 -70977 103860 -253200 218840 -41214 -86147 162795 159176 -79176
18846 -278874 -194514 161237 -98850 -107573 -8729 -480926 108194 -296516 174236 110767 -238115
18834 -345749 92834 -274638 -190701 175929 -170257 246534 -148627 -156414 -25927 -422511
18824 -422511 -159662 -281878 80055 256832 -265218 75112 40936 -21095 48911 -80940 150602
18812 -42535 -3167 331246 119599 -121727 228250 75368 -80267 -235251 -119585 51096 32963
18801 32963 134729 -70897 -371775 -59927 -212098 -289724 142349 198131 -337105 -64369 -349827
18790 -349827 -370842 237502 -8788 -345706 -276867 -75145 189600 -196864 -250873 -346589 -304016
18779 -304016 -43942 -119816 -31201 -87484 -144389 38587 -534507 -184191 -192900 -22564 -36266
18768 -36266 159359 36668 -473277 -138022 -199083 -41612 -46898 -47304 -55402 -29645 -190782 -100850
18756 -100850 298804 146628 -70649 197363 -1632 -53736 -262359 -87766 -346210 401354
18745 -197597 389562 -240845 -115816 -157865 -13338 -164054 -207017 139346 -165388 75373
18734 -92431 -44506 -25411 -149592 90925 -435426 15496 -93846 125774 -99600 119667 133438
18723 133438 174732 -86340 -295556 -289415 242209 57753 -177420 -242023 225491 -221105 -345443
18712 -345443 -102348 -142590 213933 33615 168956 -246634 -28373 -421852 34693 -124410
18701 392066 -153484 -41209 302368 214839 4208 -51821 -321748 -162728 247248 110551
18690 157613 79065 38241 -388313 -142938 183637 -43713 -196339 -132251 45812 -145227
18679 -197386 101901 154430 -66193 121745 -191780 -128157 -164074 -13040 212634 -3582 -79032
18668 -79032 -31704 -407523 -313918 38967 17228 -266447 -186279 -20744 -4659 -302376 9420
18656 202168 287973 -180124 -83116 118662 -215463 -21432 -66511 -5074 38987 66740 90488
18645 90488 -164651 -88940 993 21613 84892 -3945 -62919 -150459 -170536 -47654 -233686 -244220
18633 -244220 -399156 -33632 -90868 -50907 -314483 68536 236721 -139523 -80067 -154091 226210
18621 275239 167953 -165106 46328 -89489 -146314 -126422 119570 -381454 -320396 137794
18610 206099 -370846 -372662 32907 240750 211355 -36869 -165568 -24313 -343099 117564 80234
18599 80234 -15522 -125996 -215409 -134575 103621 140248 -36532 44666 -142557 -27545 -19572
18588 -19572 65178 51221 51919 -137927 -262138 -14417 -120998 -101132 -8344 -39432 -106519 -216585
18576 -216585 -28447 240707 -277219 57998 33981 -46863 115634 -40541 196190 -54201 24468
18564 87111 279017 -277880 187995 -13972 -94919 135158 -4670 -106788 184440 -486916
18553 -24643 -104557 -109567 -46343 -1333 15054 -192502 -59668 -236314 -294190 85177 -138301
18541 206786 -203862 -122084 -157667 -90190 126389 -69132 136220 -202076 89069 86068 -132658
18529 -280726 -394664 179938 -81923 -233827 -90875 -64032 103420 29766 -48984 -427208
18519 -427208 21840 -310581 -34796 308878 61731 -158325 -265085 57712 -31691 -10487 113161
18507 212959 198230 -488096 2003 -84400 -65308 -144940 -9491 437516 -64341 33658 -183226
18495 -282003 228316 -60643 -246713 75305 -140813 -82494 -43056 -392781 74875 -99582 -260132
18484 -260132 180409 67676 -247204 -16516 233720 -81608 -127366 114425 -178901 47912
18473 -241661 -70989 129091 -62178 -114943 -58344 -250825 192580 -260853 -106576 -246683
18463 -246683 -39874 -116801 -66096 -290901 -87096 250710 119187 -417002 86938 65786 -27193
18451 -316023 -139694 -298940 259476 104457 -146973 -22895 101968 14209 -142173 -97793
18441 -97793 -51922 85375 23490 -243367 -46991 -8791 -175197 -63274 -348186 -498089 -131160
18429 18908 94267 -50001 78756 184572 267377 185761 -180641 114064 190389 -264253 123338
18417 260350 -163927 70856 208973 -68148 32426 -31822 -116930 -74337 288621 128337 149768
18406 149768 -204004 -35835 -283876 -126778 55330 66308 -24603 -15515 -388194 -16824 396123
18394 211820 293510 242816 49785 -51107 -241992 127211 -294265 144025 -1630 41159 324367
18383 324367 -239242 -60708 128502 191506 -360837 37617 -40032 -28786 230832 -112838
18372 -171483 124668 44263 -446336 -171467 30441 165892 -35443 -238100 -212705 -11068
18361 -172143 146880 -7954 -139174 -335472 66429 -239312 180565 -13609 -167100 -78133
18350 87980 -106263 -53499 180672 -156955 -168817 -161061 -47383 -91158 172700 -61449 -276693
18339 -276693 40477 70243 67936 117707 -16254 -213786 124605 214751 147225 -391069 76063
18327 181510 -202977 -23363 99432 -66744 145232 -143960 -23981 62914 -263066 -194677 182689
18315 -138779 177564 -78143 -51846 33962 -20364 2040 127932 -110985 220216 -217412 261582
18303 27755 -70750 -134106 45564 -50583 3576 307398 314434 94919 357491 183647 -202471
18291 2441 -112076 320920 -95561 123671 7959 -265320 234215 70311 114959 111044 -119342
18279 -165845 232740 217235 153841 46739 2219 9497 -209484 -98627 -88048 -97109 82029 -103145
18266 193857 -149303 -160573 125039 -174586 -70284 -290972 -249125 -155745 -117899 83224 -121200
18254 -180817 -1111 -122395 222233 62760 12413 -222943 117728 -195618 -9769 221092 -15709
18242 -40327 -381657 -124978 -14213 -324393 -156669 -41622 -47058 45869 141952 -246124 263869
18230 -163053 -34172 108016 -88470 -8638 -58833 -255597 -347902 -311750 -83102 -116667 -49100
18218 -259457 46718 275688 179526 -35086 73291 -166200 -247813 -141144 416153 -129215
18207 -99217 50970 221289 -154019 -267622 -165942 6897 -236117 104213 -86813 309020
18196 144453 -300327 27146 -267711 -31158 63645 -89329 60186 98804 236615 -54413 164173
18184 13822 20279 232552 61450 -82966 -325118 -79629 -67315 -292062 -143300 -70410 64641
18172 -61414 -97891 -205746 -79599 -150120 240303 -101731 -170978 -25972 -115174 -357331 -175600
18160 -31589 -346286 151552 209736 50920 -16768 -340651 -213089 222570 -108495 -361748
18150 -361748 -421304 13112 -58833 110821 229067 -62094 -7939 -509690 133672 16505 311212
18139 311212 -38726 58793 122744 125476 1242 294466 246442 95723 -118930 192625 38079
18127 47951 -124565 81621 37415 108357 141407 -285064 173715 -268624 129364 31817 -220093
18115 -236433 -40905 183580 -65652 -3143 216870 236154 -223415 4323 -146231 65380 227334
18104 227334 -21087 172760 -20519 -187087 56388 -331992 -76927 -127949 29573 -466469 -59594
18092 -223212 109805 -128118 -3590 -42068 -40914 -388676 -370803 -130809 -639712 -82250 206101
18080 15974 -395440 277609 -156158 168846 135460 -120464 225372 -311891 -145030 60636
18069 -33586 12239 352968 -19285 -79395 329393 -39408 142820 197025 -85183 17527 153449
18058 153449 62045 186609 -36562 327528 394587 19438 104553 -206723 -37874 69088 285469
18047 285469 -380421 -133250 56815 -276071 -4140 221599 -145833 276979 -131049 -150909
18037 -150909 -35361 -25775 163072 50586 -253993 40143 -38277 317798 -109295 -184488 -295813
18026 -295813 182333 -216520 92429 304683 100721 166605 -208370 -122464 -75141 -216612
18016 -216612 -106220 107235 -221266 -90805 -138637 -2211 -48664 -130398 -97205 -98906 -110066
18005 -110066 124031 -224870 205522 143768 -15534 -35782 202472 -349228 -153092 -80108
17995 -80108 137732 275037 -154267 147202 245298 77660 -211636 57698 134335 -198289
17984 57650 130107 117402 37949 -75853 66058 -20717 186589 96492 250154 -110290 -39221
17972 -103383 -95442 17784 -106901 42905 193997 -244251 -107497 179312 -43182 -47756 -9582
17960 268989 -10978 -159340 44637 38737 -103569 113687 260719 7899 -22513 -179225 -137937
17949 -137937 12267 36891 -61684 -140064 324659 216505 230555 100540 225827 -29718 -140987
17938 -140987 71646 142415 -148540 -82716 -62206 -398127 7823 -239409 8801 90186 13406
17926 449906 -97255 -28723 106964 -47544 -148551 29092 237301 116345 -131130 -199473
17916 -199473 -63550 -183215 -35125 54967 20869 -104471 61206 -244465 -120123 51457 31641
17905 31641 -123256 117099 -427703 -87937 -146764 65614 -5058 -170703 178104 -122098 -189095
17894 -189095 70871 240931 -2510 -4650 405122 -41441 38601 -88272 -176998 184755 10001
17882 315416 -90996 -419364 -82822 43585 149085 168657 -183776 6346 296050 101613 -195004
17870 95123 -258258 -189874 133864 -130589 17837 31593 -6295 17110 -54086 -107430 170301
17858 -134177 -176267 -154977 196075 251161 21619 164250 209574 197474 129232 273632 -51887
17846 -24611 -125665 111269 84457 201523 13159 164283 11772 341640 63492 -13450 135788
17834 -231146 170483 -28728 106269 -75621 58281 175476 406747 346920 -74008 49273 71739
17823 71739 233486 -198683 -251694 60697 296900 -139193 196121 -38751 -55952 -3103 57653
17811 19609 103671 94273 -23722 114822 81211 158408 219060 -199930 -164932 120728 24844
17799 227169 -198541 177061 -237467 255820 45506 -30650 214032 147414 165967 -182025
17788 158933 57011 -2584 374110 -12111 307111 330284 -270437 347336 313543 211906 17090
17776 95723 9478 297433 136189 -267141 229551 16550 -173410 251759 98752 171589 -55085
17764 349523 -51568 61438 172979 34487 -101831 -238451 133694 463105 -93710 166236
17753 -38741 69122 189850 -96258 -154111 63547 106968 182683 241227 -58873 341195 -321942
17741 69591 2881 36486 -140455 5309 47283 -36680 23057 174616 92745 199480 -39936
17729 -87356 12091 135286 208814 -230479 68691 -56110 56624 -10439 7928 71984 -354986
17717 107489 407539 230017 74067 212309 104040 -85994 223437 184300 42120 -104678
17706 -177866 275727 24361 198761 257571 147350 380982 88557 -49503 1709 6197 -8613
17694 -182519 155488 76454 -54931 -71134 190839 179412 126617 101045 32942 291565 411954
17683 411954 -50053 57857 143209 -199062 -18905 120050 54404 347248 270102 -9375 218278
17671 -36913 28194 -167069 -180503 -29396 490311 -158269 -10635 -111667 120122 -89656 146146
17659 78394 -27082 -215060 166885 246466 18632 -180230 325502 193874 83847 -41614 -64084
17648 -64084 47962 172446 28456 3997 467618 -181105 410831 5907 57432 159222 75212
17636 -79301 123815 2383 20197 74660 25159 116436 -12495 59690 42208 206160 137187
17625 137187 -56829 65626 -161552 99994 41556 54868 69656 192228 387760 131371 139297
17614 139297 89763 -223997 21805 266935 192208 56268 123569 -168252 52077 164788 255690
17603 255690 132231 -99040 295222 230442 92769 268411 389699 170728 320608 230192
17593 230192 107778 290312 149310 714 -17096 245898 105697 547367 70643 296646
17583 296646 105430 -250564 -30861 282829 283870 85140 197529 -103840 102656 226274
17573 226274 330127 -103383 82536 -111526 265465 100724 95778 159314 305005 -25380
17562 317625 93660 -103155 316255 295322 376573 445453 184149 285214 30145 142547
17552 142547 426491 106917 240738 203813 181718 217130 452491 -87840 248068 152034
17542 152034 341935 212150 105242 -3743 117431 109726 240027 177791 -26500 168986 112946
17531 112946 305424 405524 494435 500966 414298 438128 783710 1300959 1329647 870792 795485
17520 795485 731227 390074 457749 377459 562058 -69071 537365 212366 341251 652394
17510 652394 803070 954605 1524828 854545 843257 368126 365748 161345 334004 610331
17500 610331 220611 362048 322403 371726 345242 604924 284970 125433 24335 69619
17490 69619 160996 -31283 241489 349839 380438 29926 225215 246103 535106 509083 107778
17478 155187 147710 694528 249607 398764 1276 453058 242675 493349 228182 555314
17468 555314 337835 108144 517822 451136 425981 393381 197606 267410 31032 526763
17458 526763 619869 151980 -59551 75151 296527 670753 287104 174546 503620 406832
17448 406832 623462 482613 165642 527693 483007 605923 586690 491090 300042 640037
17438 640037 110442 351709 108704 435812 391484 436192 229453 114965 423042 286908
17428 286908 739278 594975 310394 566117 237035 371474 150817 205787 482964 170980
17417 287720 520123 135913 126966 497974 507755 139012 524084 89962 70856 346270 278540
17406 278540 302453 237628 -209129 245107 262660 259102 177141 293904 430951 -71547 146220
17394 33787 408682 167133 63232 111074 314943 19837 452023 173303 362502 581403
17384 581403 -90772 126450 438188 -44585 282796 219072 321862 175223 327533 -166189
17373 405582 281226 464257 699321 551384 239040 79637 -63420 196083 324600 260040
17363 260040 302168 168387 73236 139183 373425 413255 -96580 299241 156798 7319 278134
17352 278134 156681 338617 380445 552078 325298 199584 394342 63426 423695 265465
17342 265465 322604 291349 316355 458970 241941 93149 316877 -80681 481460 175787
17331 -179688 467530 403588 234619 605757 263590 480239 443961 431623 145780 203193
17321 203193 128151 345365 161363 227716 231512 256911 240740 597889 66259 318894 330152
17310 330152 -99375 487250 318433 491833 49379 101619 493294 262282 256121 -62979 253093
17298 338228 143163 549018 380742 5658 433534 -234892 340013 96430 428758 137202
17287 182806 340998 211808 366942 265134 349499 300247 491788 240227 75737 82967
17277 82967 242574 280125 398810 324032 355936 240966 -7554 503795 522212 332136 320996
17266 320996 248243 82986 385644 267108 324636 195096 335408 421147 341449 53896 473907
17255 473907 56400 55407 246936 59995 258946 349085 259005 544164 -12674 426888 372155
17244 372155 437693 418697 433566 -64391 502386 558510 480737 274426 489293 336990 276446
17233 276446 218616 718471 298492 329454 689347 379596 479717 578622 625431 348638
17223 348638 425120 -125053 105038 618964 45601 419373 -70007 113201 466834 152615
17212 488405 563755 413972 184067 339189 414763 302733 710367 654456 406184 433504
17202 433504 245875 444324 41740 372220 357158 224713 316782 630181 505426 97407
17191 322387 489957 180878 537777 415923 184320 372634 429444 649775 602013 274500
17180 664463 565998 195191 767639 564974 529256 604972 490507 513116 392510 511040
17170 511040 453087 384388 382223 401821 727675 590094 585079 595433 590052 186682 592631
17159 592631 650731 650490 491479 459390 847991 515865 570804 693565 267161 331708 496382
17148 496382 742464 452396 293114 605726 363117 606297 575115 379477 462407 529273
17138 529273 747513 671996 846566 840088 715947 546738 339183 550392 339939 383859
17128 383859 499033 570014 498965 693773 710207 819811 557911 619408 512497 575783
17118 575783 639851 555915 607120 601043 676396 636997 485450 485653 526928 600251 703540 617598
17106 617598 625715 610148 858488 667631 893890 636063 925575 543650 579233 834035
17096 834035 618776 927792 675023 538591 468409 700087 437482 585391 582135 915219
17086 915219 573155 576188 605058 914879 1059460 457636 741176 629041 514966 292084
17076 292084 675398 803176 921836 620256 620073 649600 570515 896853 626053 675787 734224
17065 734224 563434 710647 743949 899889 1120444 910457 937861 792147 1078397 741942
17055 741942 711482 955124 799276 742710 1509397 734189 622711 628763 1049566 912785
17045 912785 1053073 1093695 614807 1139584 865419 1064180 1126564 846954 1039442 1084328
17035 1084328 907943 889971 999070 982194 839627 698501 848928 1085079 793255 847779
17025 847779 844256 1085893 1311021 919293 978499 776312 898114 836283 878627 1179140
17015 1179140 1268287 1003910 1210165 1364483 1234248 1094401 1196620 1120413 1231607 1320191
17005 1320191 1234646 1255322 752842 949114 1091012 1396672 1132899 1297537 1204761 1329308
16995 1329308 1220009 1288605 1778500 1442179 1539060 1295876 1711892 1343538 1439333 1148492
16985 1148492 1359283 1721327 1425560 1165008 1206514 1498863 1620946 1662654 1587819 1421375
16975 1421375 1226345 1547418 1128256 1400108 1353920 1584418 1482098 1608855 1645236 1336802
16965 1336802 1379226 1578620 1454968 1687252 1484670 1684355 1516281 1583747 1925500 1672358
16955 1672358 1757636 1763465 1744269 1802467 1952697 1532029 1726786 1769471 1828217 1689801 1801605
16944 1801605 1879667 2034129 2110859 1875992 1919708 1964796 1922245 2323979 1851615 1730662
16934 1730662 1976994 2044909 1968679 2112381 2108459 2146821 2390507 2007626 2435983 2089338
16924 2089338 1977928 2301769 2312153 2473486 2105283 2299646 2080101 2448912 2300604 2272850
16914 2272850 2259589 2651911 2593138 2546802 2738437 2802334 2641319 2785726 2961037 2763138
16904 2763138 2821138 3107343 2770200 2983987 2632631 2977683 2989127 2929736 3059889 3301164
16894 3301164 3102607 3079188 3222959 3093255 3171320 3269632 3434351 3340188 3498308 3365205
16884 3365205 3466904 3635195 3211732 3592520 3668316 3962688 3738331 3832738 3362558 3831235
16874 3831235 3798925 3706442 4184510 3915010 3907046 4107078 4412855 4355994 4063238 4553600
16864 4553600 4613466 4256036 4511009 4454091 4535956 5014823 4563714 4676159 4626941 4726350
16854 4726350 5161719 4880833 5118805 5446979 5502640 5590289 5537518 5558889 5519290 5824008
16844 5824008 5861604 5982885 6014153 5863543 6428851 6413224 6252014 6628452 6621024 6701682
16834 6701682 6864153 7033540 7312872 7020889 7520432 7353079 7424840 7743693 7992879 8078689
16824 8078689 8031103 8297153 8164609 8526530 9070006 8830503 8890473 9408320 9376996 9793762
16814 9793762 9752740 9738607 10240913 10059218 10628407 10884242 11059644 11445110 11381278 11734247
16804 11734247 11794527 12349418 12409951 12457877 12887298 13453592 13926340 14160474 14157688 14831180
16794 14831180 15284600 15449733 15703263 16105310 16290333 17013586 17574937 17871959 18358937
16785 18358937 19147450 19036222 19548548 20447302 20871203 21564083 22010754 23017602 23413561
16776 23413561 24032686 24754949 25358408 26394639 26820865 27472584 28373654 29613951 30636979
16767 30636979 31367129 32439432 33264031 34455774 35571797 36748882 38020140 39507009
16759 39507009 40572009 41949734 43567362 45049850 46532517 48565590 49624541 51655818
16751 51655818 53633571 55177326 57422105 59327659 61682060 63430687 66398005 68409499
16743 68409499 70708246 73218011 75923257 78423952 80885143 83340533 86126662 88645001
16735 88645001 91508368 94317896 96902113 99565484 101648642 104193935 106340144 108357990
16727 108357990 110504498 112135059 113462504 115000649 116152420 116742079 116830159 117367156
16719 117367156 117156308 117139416 115875681 115371676 114019147 112652373 110974106 109053066
16711 109053066 106858117 104954575 102384346 99723133 97389309 94619544 91908868 89332182
16703 89332182 86710497 83793205 81065144 78465763 75651481 73538800 70875445 68620558
16695 68620558 66170537 63703892 61414982 59361204 57462366 55485616 53479713 51590640
16687 51590640 49640928 48214768 46646586 44516979 43673826 41727436 40329369 38878341
16679 38878341 37847362 36423197 35551541 34169979 33317015 32320796 30848418 29943363 29221597
16670 29221597 28446631 27274103 26757080 25838567 25350884 24312710 23608065 23273197 22312346
16661 22312346 21690812 21370709 20509637 20206032 19444978 19317650 18535709 18237986 17541609
16652 17541609 17293761 16902785 16196719 16216345 15352382 14857544 14743455 14207347 13959942
16643 13959942 13780543 13603877 13470234 13060538 12978323 12239798 11794835 11995795 11626067
16634 11626067 11326036 10970318 10713410 10523594 10558186 10191172 10003038 9806489 9494726
16625 9494726 9708221 9198658 9064765 9157576 8448685 8768841 8484525 7855440 8146928 7566455
16615 7566455 7953017 8009165 7766637 7435732 7108252 7494314 7117197 6987593 6919979 6482641
16605 6482641 6675621 6445033 6279744 6271153 6173643 6042045 5917750 5734327 5683519 5678472
16595 5678472 5916652 5712852 5437864 5349965 5423167 5483881 5105207 5194236 4967691 4980300
16585 4980300 4772130 4565663 4418219 4794371 4608709 4232272 4237018 4044140 4217575 4106889
16575 4106889 4241471 3753452 4176720 3971395 3823493 4079066 3699485 4216514 3467202
16566 3467202 3875952 3630859 3932863 3643030 3542742 3776490 3758843 3371140 3273366 3469581
16556 3469581 3378889 3529651 3110853 3087400 3220076 3201659 2944637 3049855 3072324 2961245
16546 2961245 3062778 3049714 2751853 2485092 2672474 3070386 2553969 2943704 2811156 2536114
16536 2536114 2777928 3041775 2808599 2392139 2219296 2550338 2596632 2488789 2410499 2622028
16526 2622028 2196592 2256655 2468050 2387780 1912012 2231295 2106624 1984691 1936931 2328274
16516 2328274 1767061 2241279 2061302 1892571 1911827 1982725 2265640 1622219 1864671 2248212
16506 2248212 2114021 1986585 1890550 1933373 2221396 2169845 1774811 1995572 1116164 1474213
16496 1474213 2204099 1551502 1671560 1846928 1618177 1907132 1602026 1571877 1558684 1270391
16486 1270391 1612149 1706279 1650346 1626224 1520174 1379417 1770442 1424069 1807991 1355437
16476 1355437 1491921 1723185 1386294 1694571 1593320 1476274 1640043 1377036 1321039 1605397
16466 1605397 1516164 1163642 1383783 1358900 1177049 1348154 1318156 1030765 891047 1310154
16456 1310154 1048920 1187865 1174660 1458530 1212354 1401431 1085204 1453119 1240834 1315199
16446 1315199 1167849 1453630 1425259 1451122 1355230 1076238 991912 1110237 548849 763406
16436 763406 1176283 1070241 898123 707116 799357 833039 761265 956637 956193 1078779 1095494
16425 1095494 846217 1068074 963986 739817 1128817 742766 986799 1084828 871080 962578
16415 962578 994095 762409 1090425 951866 951693 855747 811034 871023 796278 1140963 1034726
16404 1034726 584993 1049815 1251824 1157385 685642 851565 1255540 811879 1059436 684163
16394 684163 793624 648788 1046709 688732 762955 692713 696193 1063073 819356 575832
16384 575832 785290 600491 765843 413803 609579 1016387 777145 985374 723259 818666
16374 818666 514055 730437 935160 608908 790967 704452 442797 941827 745768 520802
16364 520802 554582 623570 405066 1019272 746527 415835 559377 830515 534205 609883
16354 609883 791389 283025 742210 729480 609962 848053 721944 922034 625215 762188
16344 762188 321484 781499 891424 781534 608232 1032923 695317 306220 685485 841894
16334 841894 611517 603879 501384 641517 514395 720497 448076 390315 472297 480864 410501
16323 410501 377576 617436 754863 408852 177121 457838 644234 822143 360688 886311
16313 886311 734400 464565 529534 574719 337717 632763 314550 528959 438322 758183
16303 758183 825726 430514 365994 558895 808179 627297 752886 338996 293799 459431
16293 459431 456228 443765 390199 435559 462408 570304 175289 679510 448891 455233 393326
16282 393326 329908 434365 236204 497634 381746 146601 514678 484347 339893 116988
16271 246690 342986 366409 320835 417633 60104 481737 330873 468513 540526 313049 429265
16260 429265 168821 302631 202064 619160 272473 59724 170850 612814 450678 432195
16250 432195 687762 352712 571481 115664 418798 373773 515959 390453 652433 325328
16239 145971 292367 361658 123304 224991 54351 119651 429838 382360 101459 180774
16229 180774 200208 287740 -66227 444468 124209 82100 381828 333309 651114 307888
16218 279654 267489 51570 255497 64301 196270 432428 606677 81917 669652 206138
16207 304346 362492 264647 248686 207277 231891 223007 151616 105940 227049 388526 315612
16196 315612 174488 179051 74638 475041 196345 249662 150948 271322 486626 227360
16185 399337 18010 338662 67969 70566 298880 179224 82294 42914 433128 -51509 174577
16173 15797 369459 126802 585255 589511 -56740 228757 366246 189595 459569 -5208 326174
16161 276991 228699 145253 429912 125281 196184 57579 -38067 -72157 385177 314121 268876
16150 268876 330038 198110 93505 18690 144182 172845 368594 -22665 289694 175503
16140 175503 -2584 154308 -14780 342236 96027 438354 -115956 340985 156267 -41483
16129 -109453 -80336 366373 268585 147125 -24409 46804 193612 234687 261206 100 250214
16118 250214 80992 214901 -152970 87812 -820 -99106 183484 310239 239311 249725 281864
16107 281864 10242 363165 384977 352803 161151 -30400 -124340 -216188 -347569 50919 329084
16096 329084 29406 -55308 -98982 209156 40467 -154761 -125804 92934 75307 143966 173370
16085 173370 294738 446907 430135 156945 37710 197646 83492 214163 243829 -36020
16074 -65112 70972 -33675 207705 1064 -127008 238331 98620 448339 115097 198722 -193356
16062 -12631 363520 174407 166333 221494 88871 268986 116551 -67973 16533 -62034 -69670
16051 -69670 -98880 -7481 -131676 58341 93102 343416 359826 308399 122778 54400 199736
16040 199736 227664 -106847 198320 -50822 158223 109112 -101383 63838 254440 151204
16030 151204 -36675 373160 82208 -135411 403146 21516 232017 311733 -106713 -194101
16020 -194101 -187830 84459 -240907 -5720 376334 180517 110106 -254160 137228 -134076 -150608
16009 -150608 259641 187729 98136 -33459 -101410 -85931 -174459 95553 252910 107248 39127
15997 111689 -176933 115007 289788 200389 242801 -192248 154606 114572 162473 441461
15987 441461 580860 785562 987285 1293357 775685 1101097 769782 495647 81339 81846
15977 81846 268373 93130 -18425 -106030 332817 9457 -11357 38506 48917 50459 -262647
15965 180160 55112 -16312 25076 -23076 -381054 227283 86526 163948 -27217 88607 28134
15953 21955 -50599 36886 -317046 274158 -54372 102743 -120637 -122436 159565 -380201 -153631
15941 121452 -112505 93029 -113466 18655 -23659 -153623 -135525 79673 31363 -40799 -38426
15930 -38426 74479 25823 -104622 -273882 -184783 192246 143978 71483 -188817 -80761 -213006
15919 -213006 283268 -97106 -214416 -58864 86910 -125877 -164488 -141430 -108575 -189685 19506
15907 -66713 -54891 21775 250228 74537 -90299 -112491 412918 31664 38705 -279891 -29369
15895 -108771 248364 -21856 78775 156704 54178 -49396 -249569 -99999 25441 8554 -51866
15883 35277 69526 -31187 91585 -132126 -75756 -54216 -84089 -135162 -132815 46113 -138059
15871 106164 -325297 151499 -84993 118944 -114146 106761 82649 22111 46598 54114 -136710
15859 74631 -221015 211045 60007 154672 277189 208900 -128603 165102 -91344 -13675 162717
15847 -12088 230186 -130948 -171428 -365808 13330 -38121 26441 98040 -125596 23317 191305
15836 191305 68224 11650 -135642 92412 51608 -316965 81896 -142583 27172 -207016 63951
15824 -39617 4188 10254 -91798 -267509 -170834 67436 57683 -9303 161545 246555 -273411 134710
15811 -148593 37380 -103239 -317838 143294 59914 -120364 222201 -220914 133424 110703
15801 110703 68082 346965 -36201 127523 9276 261136 -41314 -110173 -66022 -119343 11698
15789 -196524 41876 -221499 209852 312789 -97041 -53959 113410 193922 146918 -175237
15778 -197958 103407 -88886 -247793 86562 210863 109122 300116 -94988 -140898 45458
15767 52414 17506 197306 -173284 -225791 138338 13228 52416 -35751 -188171 441348 33992
15755 -279637 -1800 144726 187860 -154204 -43801 74157 82576 165331 203790 253091 163654
15744 163654 177659 154792 79976 -78416 53830 197427 -96464 -69597 84007 5296 166379
15733 166379 -66308 -9639 176898 102137 -312328 33307 -203895 -138453 -226598 -389586 194097
15721 -146724 -37848 57494 70435 137399 134767 -350225 14778 -32972 -88521 -64389 126547
15709 91355 -35202 -380858 11464 -57948 167932 -143080 -15551 -370217 -144827 -73286 -136367
15698 -136367 119362 62423 -29819 -34187 155085 -65308 -117343 -9305 43774 -151562 -177165
15687 -177165 62203 275596 -82728 61986 -311675 90033 153153 -8977 136164 -306936 106562
15675 337750 20091 104778 26678 -77010 -268329 189180 -147189 419049 95722 70996 284249
15664 284249 -158140 19466 -79610 -33145 -342866 -197955 -286537 168998 104194 -212533
15653 15364 -13602 -306061 275870 464246 41896 -120708 -272762 -288559 105742 3718 252537
15642 252537 -21709 40714 -225856 -181624 -102379 83414 35745 -291789 -84099 -111605 -302799
15631 -302799 -64047 -299872 131715 -232344 -165752 82708 -28439 -14086 -381431 -57901 27458
15619 335751 120934 59734 -190727 19493 -21507 -1597 176199 -148578 -221977 34963 -266526
15607 -48958 -393065 184438 -59573 415958 190842 -206960 -442497 -284268 -80599 -101939
15597 -101939 101745 227366 -6539 126658 -204199 -166082 62682 57513 141272 270673 -101542
15585 36476 120338 -89200 39221 32914 -122357 277429 16114 343332 -96153 -131210 -245417
15574 -245417 -219846 611 144230 215075 -16247 164873 -156843 30770 -411237 -155045 -33062
15562 37552 -26690 1589 223695 125848 16780 257021 -6608 -373994 -94606 -152422 -119874
15551 -119874 137183 -217065 -137569 40999 -72156 47801 -17938 -238115 -95216 81870 -115970
15539 -92551 109946 234147 117635 -9031 -120189 310893 -62888 152857 110806 -22575 -92998
15528 -92998 256233 -217461 -33378 235508 129956 374803 144010 191266 127664 176767
15518 176767 149779 -13586 113022 31029 320036 90670 203341 131816 30679 83375 396997
15507 396997 318380 191880 495510 209127 78463 18035 595652 256841 313893 335626
15497 335626 279855 -38459 121446 194484 53574 40308 48627 -23717 -150242 91459 -87542
15485 -199124 98620 -116922 195043 90938 11014 224041 -292980 237905 -32097 69571
15474 323639 330752 711950 625268 663300 160319 168896 -117252 -166520 -575991 416685 -209116
15462 -309247 243558 -114021 -131182 147633 88230 -127173 45514 288291 -149575 180639
15451 21583 -170684 22287 -25203 -86251 -30476 110019 58007 130409 242505 665614 1322694
15440 1322694 1555846 933317 772417 162090 175803 241074 -27565 160210 -134015 156050
15429 90934 -65517 83226 248366 26138 -121930 188059 -59102 -103003 173508 111074 -13848
15417 -118259 153153 -41375 -283099 237200 -40834 151936 28094 330267 119486 -44749
15406 219447 -183015 49537 -88593 1438 -128741 -62479 269354 280359 -132810 97696 -113233
15394 142126 205014 -38496 43622 -185161 -833 339142 232405 6676 -98074 -289008 49653
15382 -39837 -40570 -37492 -1083 351108 -15443 255929 360259 135306 114472 317465 68785
15370 508497 128064 -9983 117963 -13253 70279 198893 415952 83436 111137 100724 32130
15358 292131 -15570 59375 120206 233575 355107 -84081 75613 179574 376671 98512 115158
15347 115158 356179 -50233 311854 277705 253913 292522 508715 434247 505264 -143423 134832
15335 -44591 136290 95862 341560 -46758 63066 42684 148836 118448 -67445 133975 350297
15324 350297 125041 48716 93973 117196 216401 164498 373351 62812 -165605 253232 107032
15312 202275 64402 28608 370885 315871 126972 -79855 235230 147177 217259 115996 299182
15301 299182 -126571 34481 9518 87164 232384 105314 361686 88147 -54268 -61294 -27994
15289 137900 327043 -5635 -96747 -106342 243499 -74391 -20364 101152 230085 19213 69935
15278 69935 192404 153478 151084 -41692 -141961 -84739 34193 141714 -448314 258788 -15804
15266 187662 -193193 178276 -49837 -51531 139274 -82124 126699 277147 14515 -40003 127926
15254 317294 -8882 -1494 21695 -72337 24808 32759 -111727 335326 205422 158900 -119698
15242 410962 1749429 1371104 1317113 1811373 916895 536998 411675 -277114 388033 166844
15231 371008 -95609 -59442 -131641 -252290 -11102 116900 54350 -1221 -166152 421676 -64601
15219 180018 -2418 6510 154469 181702 241656 472516 -44814 34614 -385785 77322 249264
15208 249264 -46684 -210004 168165 184021 10867 333843 154908 42506 3755 214611 474836
15197 474836 -10415 -96607 182356 -83543 175747 9918 208841 -43868 205599 -181421 168892
15185 437348 66158 74593 191523 64420 323740 -66038 -285552 98215 -59712 -59900 102714
15173 -24857 109304 152232 171906 -90904 -93606 -44107 -231185 277621 8284 385015 144816
15161 110071 26311 120250 452801 238105 -196314 269205 63115 -52203 164156 134138
15151 134138 -11779 -89866 161731 -27802 -94649 447077 -212088 -61704 -26387 149111 -58537
15139 303890 415323 265133 93440 -197221 283527 128262 360215 -146628 108333 5895
15128 -13198 -43171 138250 286825 4710 316360 55455 250397 317065 -72907 209021 740403
15117 740403 111802 552559 161019 135364 -33258 96413 64212 -138337 -83019 -132278 126547
15105 -155009 126690 49735 -75138 -5683 5555 220734 52449 257237 102833 38170 -49577
15093 366347 339413 302087 285883 170360 3029 -101252 33251 284930 247221 214106 11164
15081 145504 -120261 318084 229287 120595 -166327 -130146 -78460 172 195041 83479 -109195
15069 530153 44196 27445 -54649 74240 12589 259606 500823 174459 304439 196547
15059 196547 -18732 460556 262639 526838 314997 488450 459315 633031 282769 48217
15048 235619 84348 522892 224278 636598 385348 178996 231174 285405 225125 396195
15038 396195 285595 325401 421795 259957 174257 159948 515560 822608 735280 780952 876454
15027 876454 429918 500147 441620 231175 494140 417912 333832 524632 580790 624591 328768
15016 328768 381380 314088 714659 -87469 91743 -160746 427174 209814 179710 553552
15006 553552 414275 411342 315475 407992 470277 599579 246883 831165 537097 541113 522757
14995 522757 366425 626958 396824 349841 433518 137933 544392 458005 468084 367413
14985 367413 640830 788969 855740 718019 945759 1019453 1034621 817564 677024 439557
14975 439557 247978 566102 715308 885208 905614 1073043 435839 481390 404707 524359
14965 524359 369636 237471 312137 280660 609987 467558 211860 328773 538959 535622
14955 535622 626444 515710 458955 407255 203540 592092 386050 440374 235296 225633 149032
14944 149032 611267 598565 727216 519858 625196 253384 774836 333335 301620 943045
14934 943045 727290 404288 527524 685738 807357 1280366 1258234 1579282 1629171 1869136
14924 1869136 2015562 1866127 1551509 1305078 1707706 1970225 1667868 2429349 2204504
14915 2204504 2075385 1880097 1598534 1446629 1069110 943748 447322 575084 516558 486346
14905 486346 459636 339390 612761 495197 571578 400263 146771 435867 250277 522209
14895 522209 407055 341873 432530 487271 270359 317299 673254 690023 756736 689773 765800
14884 765800 1013459 830627 955730 814862 534573 770280 1092644 761176 640927 612543
14874 612543 479779 414797 373387 445628 373232 145373 475257 185313 796072 606340
14864 606340 894373 890842 343397 390004 655022 561882 655479 422137 495616 592060 186845
14852 514638 560313 484398 274580 480176 538224 326429 739226 689333 1200227 1148263
14842 1148263 1569844 841394 1164126 1125592 972718 942627 1012725 841107 753470 693045
14832 693045 727311 204108 116096 1010980 401558 687671 748142 783069 946189 742509
14822 742509 464319 640314 728145 546427 971751 697457 703003 674627 803551 606162
14812 606162 391890 526393 817512 554042 524520 889891 812513 909255 999773 725165
14802 725165 808887 984872 745802 437079 741986 738550 440696 1058453 511111 705081
14792 705081 605344 540182 268964 366659 818630 448209 590329 721897 640259 989852
14782 989852 450669 721057 554715 769340 339061 721406 1092115 880163 1204169 888290
14772 888290 579557 704692 783443 424309 449267 335027 478421 935276 570377 548034
14762 548034 628789 593517 618637 533544 519252 498224 528370 541983 428077 736438 130732
14750 845398 603121 498277 299228 378918 413704 485551 666249 485797 506506 772528
14740 772528 766509 923318 636702 650629 526939 848884 897690 795516 927606 1148055
14730 1148055 875463 1383839 1411969 1503373 1685301 1923439 1850134 1714127 1061583 1153549
14720 1153549 1338492 911512 1196048 784791 979874 863242 761318 596550 777496
14711 777496 963779 770815 961227 842019 996949 1038890 1125927 1141857 1450725 1614695
14701 1614695 1832697 1933149 1721355 1656513 1256727 1325028 988191 1190625 1003799 1077873
14691 1077873 956092 1076765 922809 912886 816963 936012 874679 1063206 593500 901077
14681 901077 873507 760847 747616 844974 865211 911137 820941 903859 1241896 702586 684584
14670 684584 1127131 679503 937845 1381465 1347702 1027562 748280 919896 783217 1101467
14660 1101467 935071 1122259 1125380 649829 1067223 851820 1222847 1391178 1245708 1360651
14650 1360651 1338420 1351932 1411466 1347970 1228286 1324768 1022005 1152871 1090031 1165003 1265679
14639 1265679 1304228 1256083 1001047 1307462 1047888 1021776 1455272 1123214 1320048 1320260
14629 1320260 1300219 1012903 1039312 811544 1155676 1229712 1349099 1389264 1234422 1507770
14619 1507770 1467189 1062924 1474087 1198519 1507029 1077610 1369255 1282300 1432966 1569684
14609 1569684 1203369 1534118 1293869 1388326 1517234 1678718 1408817 1573333 1408750 1672065
14599 1672065 1415280 1605255 1545036 1579490 1592368 1531033 1335667 1793069 1782895 1718479
14589 1718479 1474806 1536711 1699813 1993208 1764736 1602545 1449362 1687042 2004036 1885828
14579 1885828 1749612 1722833 1565003 1736994 1892230 1891518 1741255 2212541 2088196 2131813
14569 2131813 1866736 2126622 2128500 2198396 2501639 2201310 2637836 2437990 2181065 2351868
14559 2351868 2494370 2433509 3069798 2842069 2999886 3367325 3554923 3695870 4221068 5237400
14549 5237400 6737996 10248156 18492709 37645977 46651703 21976660 8882038 4303023
14540 2836226 2854844 3257060 4933675 4293192 2128587 2115455 2239811 1930887 1756650
14531 1756650 1898948 1910188 2256585 2041092 2053566 2018212 2464291 2045107 2074328 1953389
14521 1953389 2349201 2395331 2290581 2456883 2129927 2787975 2685239 2726859 2733673 2598492
14511 2598492 2609551 2972109 2738776 2941861 2702516 2866521 2725657 2887291 2817382 3022563
14501 3022563 3230871 3121163 2994600 3152008 2898344 3439910 3201242 3202611 3368633 3065839
14491 3065839 3506658 3223254 3551881 3307668 3559541 3298135 3571519 3666536 3346369 3651053
14481 3651053 4136802 3828240 3781033 3508902 3635418 3660956 3890814 4134194 3860665 4195802
14471 4195802 4143075 4225510 4158976 4170818 4167657 4545930 4408385 4416185 4581986 4646283 4721185
14460 4721185 4601367 4725054 4958276 4424184 4513965 4917447 5047376 5187219 5171680 5460376
14450 5460376 5066249 4998100 5238551 5630255 5412626 5568892 5669523 5886863 5968243 5435813
14440 5435813 6057273 6022150 6050199 5944178 6214991 6387611 6580614 6290322 6612520 6614422
14430 6614422 6531584 7031309 6870054 7044400 6948552 7131978 7268175 7426470 7801018 7780745
14420 7780745 8150773 8349822 8333486 8301882 8529768 8246236 8673391 8514050 8731767 8915563
14410 8915563 8592895 8778759 8819817 9610659 9589636 10045649 9852964 10167849 10385773 10145662
14400 10145662 10491908 10447677 10451874 10250710 10901605 10875769 11268735 11098993 11393694 11802711
14390 11802711 11908126 12495296 12617230 12263167 12759683 13431248 13000422 13839713 13967929
14381 13967929 14134010 14688784 14768245 14923853 15005781 15381641 15358007 15617838 16160639 16598553
14371 16598553 16858100 16909769 17471593 18198998 18548474 18788097 19058645 19610380 19805627
14362 19805627 20502769 20579763 20917948 21597531 22021472 22707615 22778981 23461651 24055504 24785701
14352 24785701 25028882 25892684 26424050 27087707 28058454 28533260 29294690 30073121 30779455
14343 30779455 31428038 32510009 33193062 34286681 34951172 36055727 37300244 38496364
14335 38496364 39200865 40476261 41732361 43157429 44274195 45549298 47049586 48530890
14327 48530890 50668988 51761013 53774735 55532336 57404918 59526826 61638292 63888176
14319 63888176 65780636 68148048 70738787 73688552 76203078 79082493 82166579 85646589
14311 85646589 88645570 92571782 96531250 100634241 104973941 109620036 114437087 119554795
14303 119554795 124918748 130748624 137165199 143649016 150513034 157602141 165378290 173757611
14295 173757611 182230986 191824217 201271589 211645101 222525023 234180188 246443414
14288 246443414 258642853 271747649 285494631 299681961 314139842 328938311 344067334
14281 344067334 359086075 374192346 388874585 403345152 416630746 429114690 440112970
14274 440112970 448783341 454779872 458311100 459819370 460075692 459024596 455401152 452787709
14266 452787709 448028734 439633693 429203232 417539462 404245860 390207847 375080646
14259 375080646 359770868 344040466 328728354 313354548 298404939 283802085 269605030
14252 269605030 256332306 243474006 231107697 219957766 210254016 199858643 189489471
14245 189489471 180390155 171838575 163775867 156041145 148960009 141842322 135338803 129758112
14237 129758112 124180408 118620720 113356099 108579633 104015540 99721567 95899183 92421247
14229 92421247 88493442 85009306 81492615 78796253 75736957 72854956 69681140 67588510
14221 67588510 65080001 63544491 61256336 59315480 57067847 55002515 53337808 51973919
14213 51973919 50558402 48980770 47498308 46054219 44485564 43354082 42759150 41604857
14205 41604857 39925803 39088241 37981889 36454136 36073424 35463596 34498404 32875871 32151746
14196 32151746 31789277 30805459 30244201 29272838 28762504 27752883 27331404 26369972 25666509
14187 25666509 25091020 25012605 24173688 23602276 23038705 22924915 22503052 21404462 21450033
14178 21450033 20866261 20223952 20365003 19283902 18873321 18925871 18323877 18164691 17705705
14169 17705705 17507869 17034677 16582120 16379350 16397378 15832608 15457131 15352035 14899491
14160 14899491 14593643 14253377 13910866 14027270 13626710 13522434 13107576 13093582 12852274
14151 12852274 12437928 12606255 12555714 12103505 11698541 11500797 11035591 11435236 11249992
14142 11249992 10844992 10788098 10599356 10318135 10270425 10345107 9821682 9861593 9565566 9572358
14132 9572358 9545109 9134205 8988120 9172954 8906322 8824823 8574269 8468030 8476390 8496715
14122 8496715 8312594 8054973 8144963 7636957 7660294 7566956 7646214 7311553 7143174 7229970
14112 7229970 6914119 7005023 7064093 7017729 6972459 6576300 6511287 6791330 6478817 6416843
14102 6416843 6285276 6355297 6140932 6051221 6220551 5548041 5842675 6121631 5441452 5481834
14092 5481834 5564088 5501638 5558943 5438614 5282126 5390476 5271067 5155740 5129838 5250140
14082 5250140 4864278 4954655 4900615 4768772 4845838 4853886 4691975 4379805 4588469 4696749
14072 4696749 4843954 4204062 4882300 4213498 4537611 4231025 4368059 4237020 4489801
14063 4489801 4459685 4287215 4144289 4395174 4261915 4129063 4581642 3915239 4001437 3793637
14053 3793637 4012013 4215763 3704870 3761793 3557688 3470635 3523892 3613408 3611478 3438209
14043 3438209 3486495 3389404 3156032 3593938 3486813 3258769 3196782 3228216 2976481 2831020
14033 2831020 3160168 3345295 3207559 3400235 3112276 3233163 3192715 3062287 2947790 3188525
14023 3188525 3131488 2866735 2808878 2612436 2392248 2704770 2879063 2631816 2510089 2911735
14013 2911735 2603141 2683930 2638156 2253091 2472082 2627753 2439161 2305517 2342089 2364052
14003 2364052 2448752 2336253 2040738 2340299 2284080 2483785 2397375 2056559 2147334 2166387
13993 2166387 2035619 2219018 2259067 2539480 3473758 5154958 11370211 27968062 49137282
13984 49137282 30339882 15139520 9052390 6213480 5052252 4044612 3802030 3447307
13976 3447307 3186644 3032936 2943601 2801290 2731924 2601998 2741806 2451397 2231321 2247647
13966 2247647 2396370 2386187 2311616 1992805 2584266 2238211 2179783 2082054 2315643 2350175
13956 2350175 2193449 2328187 2266336 1974073 1929150 2106176 1998165 1917716 1637636 2156822
13946 2156822 2171248 1941496 1766698 1618296 1585120 1744116 1981013 1852870 1844120 1792489
13936 1792489 1837299 1637991 1735597 1619442 1858819 1797102 1320325 1846741 1704265 1388547
13926 1388547 1717883 1619470 1362951 1646173 1499789 1629672 1531811 1631503 1764169 1515173
13916 1515173 1609671 1502779 1492213 1230784 1422863 1586931 1264088 1501953 1438465 1183530
13906 1183530 1498889 1498175 1294109 1372315 1262020 1487239 1544144 1308648 1305598 1542843 1260419
13895 1260419 1602718 1343968 1258573 1287250 1409381 1184036 1118845 1230189 1197703 1282578
13885 1282578 1468770 1251438 1169065 1049706 1072183 1357853 1202288 1423139 1443010 1258972
13875 1258972 1446956 1422046 1250245 1169298 1221626 1360721 892354 877982 1017950 1062968
13865 1062968 1122251 1339096 889697 923338 1346156 1046233 1468952 1283422 1036615 1091244
13855 1091244 757958 1106638 873631 939312 882785 898816 1125804 1277332 1088989 952570
13845 952570 1145175 1015575 972382 1119572 882522 1171141 1119152 950451 779679 980787
13835 980787 1176255 1129110 1176687 1037449 1074530 866121 1188721 907072 1020488 851738
13825 851738 742992 1088126 1414756 901739 760269 805728 1098413 1166220 560198 689143
13815 689143 1204517 860165 1115492 1066032 901390 796439 1054748 401567 573028 1344097
13805 1344097 572956 556371 1084308 844793 939374 967647 625081 1186074 1036242 897098
13795 897098 1022895 632753 783991 1028155 1086117 865826 560766 746407 1134537 745016
13785 745016 950314 902009 806265 943544 1020775 840745 989871 819190 754287 743278
13775 743278 922077 613862 801353 617948 862513 985028 1066685 550607 763254 528298
13765 528298 932507 703049 686799 758113 569779 929480 713744 645102 418913 348756
13755 348756 446399 469542 520887 357502 530962 806398 800500 658926 509475 687950
13745 687950 483997 570812 810149 289385 888399 491862 668475 724389 696636 575617
13735 575617 776235 698706 711289 674979 622274 310014 643285 714676 687118 578883 489671
13724 489671 711117 716569 878782 632812 494312 981040 501535 605104 466338 782007
13714 782007 482614 753661 542855 716896 688949 982748 656529 742059 477003 499576
13704 499576 441606 623827 635577 599723 459174 355371 527192 474313 460845 702492
13694 702492 704925 696655 432209 743565 367325 892031 408130 416983 659639 448389 607055
13683 607055 663714 176908 360343 683317 406741 152303 412146 474178 427413 496265
13673 496265 740537 576093 483895 526478 365518 966347 425947 593879 589123 655748
13663 655748 494943 660795 269231 563244 416161 673678 104695 583558 170738 458113
13653 458113 237481 541224 619564 464008 791758 546688 122024 270020 709914 485874
13643 485874 510720 287368 408488 699803 440509 324620 774094 305116 527199 584579
13633 584579 414700 647666 483949 596005 505296 403029 643477 265857 479985 215460
13622 547221 531372 630753 440957 487263 485530 158189 527231 20392 497072 430815 481466
13611 481466 115608 241968 439240 602543 342523 724821 493205 349274 374761 442524
13601 442524 488691 409220 160657 451603 582601 191789 555771 239448 346143 439604
13591 439604 425604 530604 42651 630373 356794 359893 414659 460978 533421 783905 302934
13579 143235 -25879 464240 191395 717714 238418 432198 562576 604763 432239 372044
13569 372044 523484 115540 381832 320211 240193 308409 180328 -74420 254140 212615
13559 212615 185807 392054 247968 286944 463631 236307 327371 358819 125521 159120
13549 159120 253146 162167 484631 367746 163346 212869 310817 280322 62138 285611 345387
13538 345387 174390 310852 333831 384890 72852 454887 357935 343115 507194 387244
13528 387244 6915 286942 460459 538609 225131 102848 309773 501263 88677 246392
13518 246392 54656 177950 651063 368542 366156 184109 470704 547256 649096 357601
13508 357601 198152 269205 443124 212505 165961 216440 164326 199965 252092 424382 475068
13497 475068 388844 577046 474142 199137 391768 428532 152941 185321 249741 162294
13487 162294 423381 234719 532129 326488 195518 255399 73410 324323 571273 160880
13476 322242 271855 261765 511769 605322 389674 201494 352752 134643 350479 437045
13466 437045 48904 274973 376539 161977 422939 6252 351043 292936 313294 207256
13456 207256 310527 205892 458271 391086 376241 328063 156420 330547 342323 472319
13446 472319 342767 210570 56159 288723 15154 226248 318020 -5651 -142154 149350
13435 271109 12356 229401 -92037 227769 110488 170593 118083 488164 21790 441240
13425 441240 -63592 109112 -16858 143897 169440 -161076 243569 -44137 281495 118678
13414 -168710 77824 -161148 407552 282460 224283 146642 432290 -157509 227532 175854
13404 175854 63292 -33943 310164 332374 -149669 243559 290297 170488 -33657 198500
13393 244670 235923 151563 51166 125215 219910 305344 -124423 201522 196409 104039 110311 249765
13381 249765 -72435 458925 130471 -38521 325344 244497 253213 83388 62116 139515 138221
13370 138221 464333 397206 177557 204534 137236 4495 -98265 365078 390139 34145 383912
13359 383912 158335 93773 285325 238884 46297 292529 -211212 65658 16698 140420
13349 140420 249707 689650 441559 5851 96325 318744 459997 193146 298993 313645
13339 313645 207166 265802 70538 243545 285785 409591 488178 475670 149480 152082 243116
13328 243116 584176 82079 -94667 219706 143396 107336 217675 274038 557857 293691
13318 293691 519724 362127 241192 141951 191869 286509 -54457 23354 197968 500908
13308 500908 -24320 41607 488329 185896 271986 224344 62140 153288 -16879 467648 375829
13297 375829 236605 121027 223163 111205 359160 215243 158139 231340 151149 172027
13287 172027 379009 -99389 440731 403037 240267 95909 -11120 131902 -48791 132137
13276 383915 -167560 170310 -19679 -31502 298091 43123 155564 312545 299759 223067
13266 223067 217896 4649 53112 201056 82187 -78473 245262 330171 92597 131976 -193288
13254 211815 203593 128011 -5704 184529 -115759 141559 -164620 336792 66687 740785 174903
13242 -200699 -77186 169287 337903 145129 315367 -33964 38190 287236 177568 208478
13232 208478 167810 311951 260975 300290 186865 86492 545080 -65804 161222 176347 338319
13221 338319 -101533 155776 210483 -31084 394235 149159 -295739 195698 32295 58102
13211 58102 189517 163924 -16375 144484 396246 202878 168860 -146831 -121255 354203
13200 292575 22552 401403 70034 136321 -45682 182572 149707 189598 -207757 329676 117847
13188 -120776 299298 -132319 157303 306539 556413 -16629 124155 123048 -283468 43879
13177 71957 251256 63491 -127016 111030 -217300 165653 251989 226369 -101000 182826
13166 -92162 35837 51366 176277 -372210 115482 452641 430564 4418 -101456 2628 162264
13155 162264 292950 -173586 12767 159783 284460 333753 29808 -11898 350659 189055
13145 189055 95052 -284224 -303834 50621 260270 300989 41884 -122335 361191 239500
13135 239500 69549 74378 184570 -58186 -127703 243866 -63717 243709 19904 -57179 -282018
13124 -282018 208758 -243532 163291 296028 70793 73745 33008 -291655 114249 -262106
13113 -39582 -65769 123922 -30792 20023 113958 1551 84544 -56066 -117738 -194481 92701 301361
13101 301361 155294 172822 250452 269555 73533 -21039 13092 278420 -23681 -14767 -94324
13090 -94324 112826 -54685 -192660 96585 105675 339333 216068 -37967 44709 179549 199313
13079 199313 454064 97990 122274 309943 -82730 -157455 23429 234972 -186130 -51890 9360
13067 157440 39651 -53309 223345 141208 121380 536598 175493 2454 122559 170931 1267
13055 -112798 -171987 41984 309519 -101242 181341 129951 -156352 60554 -251916 117447
13044 255658 6204 16840 270326 291297 -24181 -105615 207300 -25395 46049 -36729 25764
13032 201372 43157 -363399 160906 65331 -65493 270747 43276 31377 -74057 -13627 -257696
13021 -257696 -53884 248102 164157 400337 311017 379515 303056 110696 -103278 32468 69910
13010 69910 171528 274354 252835 -34674 89257 56027 435038 402873 189955 100812 -185251
12998 -45207 -68895 122810 -90632 -113105 12479 152513 -199479 352763 115092 -77198 -193811
12987 -193811 -17537 86480 -14171 -108934 73768 190197 166119 14043 -21932 -148359 118042
12975 -82217 362396 134612 221847 -31743 -232438 117228 357199 18581 171230 -399601
12964 104482 128958 164876 43385 182130 -119336 -18929 39320 262058 144082 -126420
12953 82154 -20287 98204 94545 -6219 -85944 23881 216521 83214 -354834 -59991 193035
12941 -103370 138839 320873 -270834 89592 260311 330171 -61936 -87283 -144714 -20630 151128
12929 156630 -147445 -23914 80287 212185 145892 34560 -205045 398714 258729 -40517
12918 107321 376136 -2267 145870 77378 -25617 247786 124998 -97611 49653 -58117 -515139
12907 -515139 19961 -343147 29225 -61391 -99285 22640 -59726 -164846 30258 -245499 286264
12895 430330 -2447 -93281 48403 -206066 105820 -297454 -151206 -307050 249123 127814
12885 127814 43203 232809 -275882 20982 -201233 -82416 90452 -97032 -104965 -103677 -93330
12874 -93330 -65100 -44981 -170408 3052 78926 5710 58661 -141932 10323 102541 235909
12863 235909 14303 81945 22386 111726 47401 108760 265011 36130 40870 -318526 51723
12851 193411 56705 -52787 -107653 -384307 158846 -94535 73505 -69606 27174 213797 138850
12840 138850 35122 74970 107085 -46947 257638 38169 -27503 67207 176722 -124533 129674
12828 -8097 50140 -7557 187070 -98785 110060 72048 -140154 -83025 -33005 396144 -22700
12816 70508 -16197 158173 -31053 55812 157195 -367860 -64629 386308 -28899 -209195 -52300
12804 -138654 141278 -27959 -268954 -346701 -135047 53260 78970 -24755 -57289 126203 -53913
12792 -50480 -117517 195098 9515 -172791 -228349 -105647 -256007 -177659 -127820 -391 301072
12780 189095 -41671 -47152 145504 -87812 -51640 -329334 -57297 106700 53030 -94901 221340
12768 -104347 -45050 67835 685780 10857 -260471 70677 -142780 36537 246045 -230765
12757 34597 271597 73419 203847 11545 -203977 -63388 63062 183672 -15327 -134763 87667
12745 119945 86875 69928 -233514 -239784 13353 162230 98871 103263 70965 -201558 177447
12733 -98632 216715 104457 195737 298270 128781 -309857 77374 78943 53528 172376 10803
12721 -58762 -158201 4158 -162087 -299755 -249441 4303 -195304 39586 -68096 286381 -39916
12709 294474 -30218 160544 144225 174215 10423 261818 96386 59011 -239671 -127106 -81381
12698 -81381 52421 21963 -15735 -172978 -24555 134781 194279 113994 170166 -191964 -29178
12686 -90694 -54856 215434 68102 5409 122386 -246851 79357 33817 -59230 252463 -146459
12674 -425216 327517 -152870 -29712 -22877 -57226 -204600 287630 -197711 151667 56443
12663 62837 5333 -86978 164228 220138 214376 -72985 -24761 164159 199347 73027 36209 67429
12651 67429 270131 197206 408829 71063 247509 443086 -261202 -43671 84100 -10181 107234
12639 -68077 202774 -4087 -108321 329620 191227 304926 -14612 -116154 108557 -284014
12628 -4614 249480 247583 126888 -69158 111314 53650 -24545 132077 91207 90902 103231 -118461
12615 31530 75848 77290 117349 173962 64071 108781 -182470 -149428 63108 35554 204175
12604 204175 118442 -164503 -159150 124255 3273 -84329 -7440 56609 81385 267379 -76965
12592 -89587 -184616 237801 98095 -232393 14504 79015 -63399 190818 15980 -243601 347396
12580 260661 -206806 105447 -5713 164375 -98121 -29235 -79644 204717 -33528 285357 34074
12568 14285 -143834 63216 296674 -96158 116567 151837 96285 -88427 -38813 -631536 -192223
12556 111312 170628 -228198 6709 -24119 71353 -167171 149730 -127818 168629 -110872
12545 55698 62829 -207924 256320 174972 87860 248373 -9550 27877 97343 -35403 126975
12533 -48896 68924 -60346 -15664 -98426 -233897 99713 -85572 135735 -73260 -147727 357808
12521 -34437 90249 -355660 269561 42654 46092 187838 -3393 13476 180974 128513 62845
12509 -23668 105276 226596 -120046 179406 9962 -163136 -141108 52860 137086 -84055 8041
12497 -22310 131135 401554 268805 121554 135928 -102475 -62253 -206493 -156109 196397
12486 157854 340793 -229154 240829 342278 -20157 -136801 -33306 -56864 61340 -106810
12475 431247 -28152 74744 150727 -54924 407724 -43776 -307753 -142248 -9876 -215046 119281
12463 -75182 -166448 -58659 93140 -407090 -122810 -107594 -193658 133176 43050 -213238 -209681
12452 -209681 -238877 37744 33713 12544 -385421 7661 192425 148159 114266 153701 14059
12440 178386 -924 -390745 -78058 -50865 100581 16362 241328 7790 -36631 65176 306695
12429 306695 -2444 123349 -105981 35764 -284792 279895 219651 113490 143821 190820 142163
12418 142163 -132694 -153466 -173624 85776 -88251 131184 95929 124543 -290937 1348 -123010
12406 139471 -242359 33853 -43689 -240063 320131 234866 213947 174426 -93808 -156002 -78297
12395 -78297 189919 69456 -143334 -165286 31567 -68364 143861 -102044 4291 -128110 73052
12383 420815 85241 -53584 -24043 239396 158562 131221 184629 107789 172934 -55415 84638
12371 -227553 173214 -143265 276321 226499 9410 -323789 -28418 -21284 69806 91359 -324395
12359 -161450 119774 -20056 -512382 -161869 162450 328959 263412 -247845 -230189 -321122
12349 -321122 -263401 105577 85040 28830 122437 23441 -88355 78505 -6465 107885 212153
12338 212153 -315738 220678 105292 370329 222266 53271 230241 232478 325494 359460
12328 359460 79912 743851 241786 264195 72354 477744 160729 122925 152640 263026
12318 263026 202436 -99104 115332 100094 371020 132509 96666 175535 -79209 4688 84158
12307 84158 94897 -306295 78303 144326 42111 482063 204312 156788 -109517 -189038 427458
12295 45454 128489 318626 279471 398947 232853 129784 111531 -193732 162248 463791
12285 463791 442937 -63460 180408 464498 -119316 106589 146703 60432 114361 212729 179018
12274 179018 268591 -28126 400125 101194 288315 128261 471520 269004 180955 262176
12264 262176 -25147 186708 205002 302934 -246046 170606 -42026 2734 10690 -167527 51890
12252 22215 -135698 311693 175677 39776 76891 171032 67314 42754 45013 18885 -282399
12240 173525 -147370 -33233 -56621 71056 -58883 18299 43030 58512 25522 -207508 79140
12228 -7459 499637 75737 82626 216581 367595 219954 485685 510375 114082 37128 205885
12217 205885 74806 338998 266250 105321 343584 127493 48652 5713 172596 99272 -73682
12205 250808 71485 271621 -51151 -105815 102471 160648 90096 317692 439007 223491
12195 223491 254483 317097 120990 421107 -81628 516872 -127969 269978 92428 -56939
12184 211267 192524 -20062 -29879 -72408 278507 80521 175162 332380 -36684 170557 31181
12172 190133 294246 33653 208379 -57099 332394 402195 388864 103396 378325 275184
12162 275184 241993 406548 58894 115227 -30907 202689 272641 158944 71071 205275 136954
12151 136954 -33973 240504 202349 22756 250700 234694 347221 -111955 155494 -151887
12140 219817 9355 327399 21669 140761 112281 154413 103709 134151 232289 338321 144675
12128 135115 70054 119066 6773 335723 21560 -826 67040 9474 170838 393490 261707
12117 261707 -18868 307429 259040 936 55900 15345 90502 -104857 4788 163022 -158805
12105 -136882 -174408 177792 245154 287196 70123 -128040 287391 239685 -61101 143941 112567
12094 112567 153663 121803 49115 94094 -80339 5621 -121175 -354200 36131 76053 236991
12083 236991 197583 422569 130481 132218 -29467 77510 -100116 69140 100578 312066 277636
12072 277636 112876 179726 77839 475225 76251 136638 272251 -3294 303980 24141 269952
12061 269952 19743 183302 -187364 154351 -124491 -125731 -154258 133524 -140361 -146777 -14990
12049 18252 9886 348433 -218384 60995 253750 26478 243600 94104 24111 387444 -251444
12037 -36703 8671 171769 138617 -62932 -217525 165299 152306 33323 46538 -55845 232595
12025 152309 -252981 293022 227356 -222536 114459 -235394 -171746 -76204 64517 414563
12015 414563 103293 22169 46982 51329 99341 559446 275813 160682 107897 -22332 -52424
12004 -52424 -136240 -37490 -114795 -139829 -228924 -112311 102698 152283 44699 -115574 -220304
11993 -220304 -136326 -58879 -189458 -150744 190467 143721 -59262 -388541 -144426 28581 -172818
11981 280902 7367 155163 110083 142912 195955 -243586 -301839 -181584 333332 48554 -176911
11969 -114981 -93631 -211421 -229264 -325741 269432 -202130 -119183 -102562 403515 -472665
11958 44292 110723 -32229 -132657 -43978 -42531 -79110 158739 39087 -70179 -13160 -148768
11947 -148768 -87324 -14323 -104453 117366 -95767 -108322 -28727 9129 -111206 -81199 118353
11935 182958 135329 112818 -254456 226885 205144 -22982 50105 175736 147544 45571 178201
11924 178201 58596 -274280 -159414 -98240 -174077 150870 -50959 360694 -112865 -79081
11914 -79081 274353 -16729 604 73271 -83711 -26380 -97979 -12037 89382 -322937 116168
11902 -132896 -37974 170304 2479 93113 95306 -153143 -205042 123103 -72206 -27826 218717
11890 25565 -57935 -46077 77483 -9810 -192695 -243390 -147861 -110149 82514 -547052 119363
11878 -35076 26575 -166313 63040 204357 -8272 123054 194799 127078 -95514 77491 -222279
11866 47697 -42867 -119261 70233 -57294 97142 -233383 -48137 25496 -128562 168381 14719
11854 160424 -32333 -95930 -99666 -192456 -167753 -233018 -297383 2269 -147738 -187011 -19349 -260697
11842 -260697 19804 -9098 -21181 -143230 51831 27598 -156712 -71644 -170460 -274396 114106
11830 66359 26433 -45139 86439 147742 -361442 86774 -90301 -223490 -14172 -20156 -383390
11819 -383390 190067 -136193 239410 -136553 -96980 -134165 -37336 -118513 -104417 99944 56459
11808 56459 -40328 7990 -28489 6046 -339185 196885 14844 -240662 -158332 108765 -105112
11796 31348 -66873 42636 54551 -212603 120620 80741 28777 -201594 -260877 -26665 -329586
11785 -329586 485563 -253341 28693 -210672 98523 -171850 60909 82655 274516 -92888
11774 -134462 -184686 161338 -151871 83811 -117592 -34910 -12127 127977 -286465 170364
11763 -381103 -66052 394800 81095 18071 86682 235574 -281885 -348302 215260 -254801
11752 -188324 -194849 -11537 242679 -185545 94106 187388 7565 -3845 -104238 -248205 -73821
11740 57565 146366 2811 1509 -172342 -385291 -290539 187288 111054 -101275 107919 -34110
11728 193255 53230 230344 -183062 193330 -90419 66244 13690 -105397 -52610 164497
11717 -94671 -139389 200932 75846 389489 -332643 -76271 112559 -50520 62428 -207409 -34853
11705 -223002 402060 34650 -57043 141404 -53187 -155611 251677 247713 -48023 229828 65389
11693 56846 203860 37801 6822 -24509 -263123 -154431 1539 -255125 -19822 52809 42176
11682 42176 -11755 122554 -137558 59403 135121 41483 233924 -143323 15001 -227068 -47961
11670 -3638 155290 -378022 -123897 -95993 -331808 142112 168299 111753 289155 -144086
11659 -299259 -74498 -11270 -84262 47785 73443 58250 35112 248010 277826 191760 85145
11647 -73199 29855 325874 -112852 -217407 -97564 277871 -44169 83447 -11528 -228778 -139431
11636 -139431 -123575 -152183 130327 -339391 122528 94150 203188 177468 651 274957 -62877
11624 -248431 -57234 -199604 -269057 117150 -113409 -269634 6379 -21677 186412 -114461
11613 -60418 54200 100172 -167621 -37582 -230087 102146 442869 -242310 -97442 -37810 64624
11601 225871 -66134 -89080 -89618 -183233 -200750 -257721 36462 155379 16657 104628 -74309 178678
11588 -249522 92185 49799 -287155 277874 -147711 -43587 -198554 391979 203070 990 306376
11577 306376 347536 -149872 132999 210708 87314 178666 266750 262143 50228 422571 153312
11565 110319 251115 169025 194025 264250 27540 296366 -322897 -84976 381819 120135
11554 228348 -183325 3064 -103312 -78460 -30081 148966 80711 63384 -51715 62974 74489
11543 74489 -19924 -223944 -134955 144471 97010 67841 -69380 -20436 109355 284728 -274964
11531 -141893 16811 311579 -145644 189250 -175903 223645 -13286 51224 107770 -15474
11520 -13919 -23376 193975 -182636 -47557 78048 52562 276164 86471 48381 243484 -34027
11508 -214 -28478 263470 293704 -192662 307571 72815 218879 325026 340044 66708 -105254
11496 186376 146190 86580 86794 123914 -17881 -246978 321127 518832 -83799 10985 218713
11485 218713 -95902 221616 283229 4742 109543 153219 301057 -134086 -35255 352745 -53485
11473 163742 -6252 -25707 82209 -55458 -23 236064 134857 127199 135946 77659 95966 184966
11461 184966 195342 101448 112578 55465 -61729 542 246661 180713 141283 34695 -181743
11449 -112528 -171157 -64083 196806 198411 337534 -144749 329871 62914 32579 98810 -170553
11437 160341 36285 -32453 117823 188914 -223757 61569 -180964 328426 140828 -144020
11426 124334 -206663 216503 -116083 -42896 -6638 73786 -135066 65953 297172 129700
11415 -158630 -298187 382864 13676 -21245 157233 -175826 -229629 -3909 -140184 -149922 88878
11403 -222677 -221068 55821 136135 54738 217438 40125 -162053 114237 69775 -40694 -274476
11392 -274476 -315420 39023 84695 -116375 -86247 -359711 76209 -21998 -140295 28049 -110201
11380 -34555 8105 -321247 18347 -194041 -41243 -294183 -85963 45806 2138 185011 6486
11368 309480 -220027 191066 -795 -146021 37393 -287873 107226 89485 160689 20597 -42850
11356 -398243 -105968 -65380 -168596 -317633 -24329 7295 572557 -365322 3973 102779 -214139
11344 23581 -214459 -66689 269785 21767 54830 247543 -57478 192358 -262334 -82716 199888
11332 -151884 -146290 100159 389531 97902 107773 250188 -317763 151043 126865 30572 -446658
11320 182603 -104610 -258757 161007 -140439 -214957 -413886 165916 -262926 -2025 260310
11309 -84999 -11167 44511 -176460 40108 -197047 283483 179791 -203006 -299485 116990
11298 -151821 109123 -93169 117692 137296 32564 49514 -35017 327615 271462 -161899 -122923
11287 -122923 146162 67481 200283 120513 -298681 -236588 46843 -18309 178573 -2224 -303390
11276 -303390 46194 153324 190736 -198312 -95419 -154020 -168502 -80701 219794 -127277 194875
11264 -76534 -200850 -879 -162361 -172598 29870 17814 80752 -11419 147355 41548 -184964
11252 42960 23321 198125 -229011 -2018 -20978 -45937 -102413 -118126 66091 182088 -53012
11240 35981 270298 147199 -123426 -99260 -148813 -420919 -33287 -76477 -92988 175170 -192997
11228 218751 15818 6279 -19770 29044 -19860 -469426 41159 205663 -203955 -25144 -93001
11217 -93001 -13249 121700 -105626 69616 148360 20249 -66206 163958 -22984 -80880 20881
11205 75963 90326 -83138 166094 -46684 124501 71925 318006 43182 47624 50233 -291170
11193 -296805 -97333 -18929 -27878 109966 -184138 154943 -131919 -105069 286460 -81456 -303471
11182 -303471 -86659 -93163 -291883 327576 -2282 64848 -71433 74611 194433 -74867 -27957
11170 110171 -27127 -79399 -362338 -58358 -329003 -135741 53264 154285 -235771 57202
11159 -73059 -145962 69560 -310006 -102540 -187826 -211830 -274511 -196166 119823 -160470 -230285
11148 -230285 280495 -63107 63033 -172583 -179150 -132891 -42969 50032 11309 245645 49507
11136 -307582 -186318 -106177 234652 -269155 -16670 -54625 5627 -120083 226998 211066 152104
11125 152104 -64250 -22823 -46241 45242 -16620 59590 -247138 65660 -16963 -38367 -111050
11114 -111050 -278351 -318296 8312 -99465 14213 -69459 106136 261840 78878 46488 -297739
11102 -130889 96164 298523 -273470 215573 130108 -103890 208503 69677 44358 202746
11092 202746 391895 202116 334669 43430 504863 373897 227564 115442 -270848 248562
11081 277525 89686 317566 -46013 380808 232133 161054 422229 55419 284550 333899
11071 333899 229976 356299 83085 150614 379598 114324 283029 437777 110153 474940
11061 474940 509644 405986 492746 253538 277686 654180 437355 375397 880318 774294
11051 774294 618409 745584 418327 385911 671077 677907 759885 832519 486205 961332
11041 961332 713066 606224 594372 503255 638740 596966 1074008 779696 836849 465564
11031 465564 856398 653219 696992 747379 834686 804711 603813 665162 568689 331707 584565
11020 584565 603175 642579 685348 960646 765981 665043 796442 585783 553251 800618
11010 800618 790533 513644 590777 437092 419524 615334 259955 302921 529624 207282
10999 693287 721535 467070 784642 605118 712000 497173 835367 398408 749402 477615
10989 477615 664766 547256 710010 625434 622392 468275 959036 901737 786569 918480
10979 918480 1024764 1351403 982746 1354899 1297022 1343023 1726871 1933675 2244586 2159719
10969 2159719 2440839 2600073 2382319 2373041 2368016 2530912 2082189 1876111 1898326 2081240
10959 2081240 1417573 1283429 1013697 1595245 1696660 1658521 1510022 1580462 1289161 1361182
10949 1361182 1213057 1137711 832639 1009210 452945 572647 226081 552530 313750 333346
10939 333346 10194 15203 49574 266804 284938 -146659 97901 68235 66651 24739 293835
10928 293835 57525 247428 -188991 288845 236663 -11586 95708 -156362 227336 -17093
10917 331044 31052 -19166 -41040 44712 -350475 81913 116099 98228 132367 -147491 -222097
10906 -222097 66173 -108841 182492 -27804 222906 51889 -7931 -256798 -60713 -135193 20671
10894 -15826 -40721 93170 265062 -73463 144688 -33988 29267 -233834 262403 -121377 -21937
10882 49713 119965 -189473 -269060 242043 277908 13640 -41060 -25564 67349 -104482 -15267
10870 -447675 5404 -184819 550730 -5836 -200177 133746 -76180 -151439 -23268 110808 35823
10858 279870 32725 599 242154 -75944 26226 393213 -178853 -135350 -94291 -202131 -82784
10846 49658 -15158 91511 -9693 13516 -196104 -89592 -66682 -276630 -242730 -210293 88527
10834 43488 -305327 191571 -12712 -156808 260188 -294823 -23955 -404114 -168798 -103705
10824 -103705 -96464 33113 -258701 -76483 141812 186934 -283993 -165419 -250604 8916 -146649
10812 -342650 -138037 38554 -197312 -181565 93039 -67664 239905 -31304 44906 -23128 -11329
10800 -32033 20006 -203689 -65870 -30868 -213171 -248651 -239265 -66000 -171173 89066 -112133
10788 -250116 302156 -156887 66137 -71628 -135759 -47933 133770 -130143 15429 -50370 -18014
10776 -36854 39603 160041 -58876 -363514 118127 -183961 104752 -97894 67447 -31336 -94508
10765 -94508 104298 29009 170808 -186608 -38676 -3536 -33838 -162700 -355742 -206851 20594
10753 -140395 -34377 -21068 86063 -214657 -16660 51222 -185197 141099 -214808 -401782
10743 -401782 -278200 3424 -22151 286696 -141528 -59019 127 -166067 -619 -93852 -170556 -59996
10730 -228760 -101553 -194881 -351542 -181406 -40001 91784 -143123 -54801 268180 45631
10719 139187 -180373 114504 -113660 -282773 -47896 -217359 -516757 93801 -57709 57077
10708 -94747 -37028 23952 -213358 -74651 -45348 -12849 -177728 -231922 145185 -314629 -71532
10696 9575 -183688 -135293 72181 -122900 -152237 -53983 175709 -49430 -73967 -136259 -139018
10685 -139018 -156351 -41016 68325 -284729 -275234 -281169 -307666 -204349 202994 -232506 -361411
10674 -361411 -45629 11486 89 -92796 -480373 59911 99198 491677 -150709 218184 215985
10663 215985 453164 190299 129022 14142 -56732 -74493 -158847 -115130 127141 -138518 -397282
10652 -397282 43962 307 -321417 62557 11366 -264885 -381454 -20788 -92866 -61599 -4761
10640 -80359 80832 147438 109737 -50254 -31688 181573 -64572 -381445 -17635 341259 103152
10628 -46286 114148 -227583 69928 -53139 232876 -124145 206551 -108120 -109841 148357
10617 -253823 -8670 208404 -3597 -248476 -223731 236049 62906 -183113 -308480 -141806 -36256
10605 73781 -24149 78878 42530 230267 191301 -213422 324574 -263351 12150 118829 -173084
10593 -398388 159436 121339 -78505 250295 70926 -310472 243260 19620 -289973 -264178
10583 -264178 150138 -84017 49464 20776 142972 13323 467422 -282040 -30614 74346 -126435
10571 -38234 50885 -388357 -334893 54306 156590 8857 -287465 -76166 11885 16341 4885 -249518
10558 150773 167498 13145 426846 187852 305570 -223117 280395 99189 34333 63564
10548 63564 62995 -24710 -344797 109790 -654784 -308301 -31834 -151829 127455 179399 201001
10537 201001 -147560 41372 -508297 -26830 -167911 387104 -261933 -141529 192941 -62170
10526 -223134 -207528 61919 -80357 30406 84392 -310393 77999 -77224 288256 39832 -149301
10514 422 -112061 -204309 93017 -71126 -36154 -37118 157792 -359277 48790 -211759 266176
10502 201042 -143899 32514 236475 -24191 -46597 142806 -37807 -255088 219609 -177832
10491 169503 38638 281368 -32060 132354 -82996 -287709 -118594 -223248 -14760 -235963
10481 -235963 6157 -12662 42239 82185 67407 527510 328376 529772 207423 372833 -118049
10469 78873 10847 201536 54370 -108146 14335 105962 -64986 159040 -192179 65015 231805
10458 231805 362496 33117 -87618 47679 17666 -63248 13768 -317688 28207 138554 -280875
10446 48338 -35069 -176838 231615 70574 -288153 32111 -217916 91850 -276268 133836
10435 -62288 144699 -23504 -173967 201972 228788 -137214 64711 2537 29643 -132571 107598
10423 -105642 17609 161074 56401 -94717 131191 54824 -338273 -292569 -122556 82278 175981
10412 175981 39819 -123522 -91601 -18999 -213646 -32632 -63324 -369756 -74629 -160460 280371
10400 109723 -38272 -108057 351617 147318 -195119 -6949 -55694 -114385 -172684 331130 -14859
10388 15835 153833 168919 372651 184595 48928 159454 -23819 -61286 -27416 -197115 -103574
10377 -103574 451960 -58770 375626 63940 153626 498222 342509 68917 321757 432728
10367 432728 267279 248246 417949 331651 240938 594477 230174 397966 272604 6668
10356 54210 199623 237128 259928 342879 289059 369899 466282 494032 548238 719741 422809
10345 422809 352225 24429 240090 252292 52410 291181 182031 223178 149378 225291 69994
10333 148955 42941 211847 -77376 -27616 -92361 314428 219687 228263 -110378 218304 54070
10321 51293 184828 126671 -89406 -147726 -39456 477308 71048 162818 106223 161069 492171
10310 492171 210493 -61239 167007 -119561 142776 62505 -38450 147138 -122240 -146620
10300 -146620 -59642 -184450 -179949 -142513 -199214 490855 301359 242663 -170434 -213219 81911
10288 -156647 -228209 134756 -162569 -233655 -96966 132448 -12274 -12361 -147602 174060 -520232
10276 -111463 147406 -179469 -5243 -151963 -452551 -147275 38061 70989 -492040 -70333
10265 -276507 -207624 86600 -133709 79902 -93339 38718 44061 -112595 238855 167916 240721
10254 240721 341722 326617 43105 193756 307874 -66998 142374 104730 433017 101222
10243 27297 -246491 26361 -44971 74060 -340350 103160 -172445 -255619 181096 313166
10233 313166 -112494 120680 -32377 -28795 -50883 60664 -198190 -166058 -3947 6729 -108849
10221 -266018 -316550 -362456 59617 -180178 -20652 -303491 -34006 -125405 -15535 -129736 -105022
10210 -105022 -212266 24617 -60036 137583 121588 -345189 -138856 545930 61872 -40345
10199 199819 -312276 -89921 -196570 -108961 -44004 -135357 334986 -342867 -42626 -443884
10189 -443884 79142 -71045 9226 25724 -11464 -191690 -8772 -122714 -34883 18177 -111396
10177 1569 -80252 -123926 -108163 -92905 -396889 -142655 -172911 -55552 81892 -119650 -246615
10166 -246615 64193 -41978 -62349 -135908 -387314 -20488 -79319 346304 -184583 174229 -80342
10154 -76072 -136522 -183640 344900 -349016 157212 47902 -389923 -261268 65257 -246064
10143 189772 -20283 80888 67827 -204299 -227243 -190783 53536 79012 128806 -170248 414229
10131 172268 -60730 94562 233411 89387 -107328 -40756 -20551 -328544 459812 277780
10121 277780 -219974 -32107 -110944 142689 -57480 -120940 -341174 33389 -95253 -89878 -61425
10110 -61425 -95488 -132545 158706 -59619 215708 210472 -176535 228441 63044 101495 -351523
10098 -77988 116235 -57506 110487 67919 56960 -246282 -336612 -55072 -272455 221345 -130159
10086 120364 -155505 -261257 122655 -108940 34162 54591 145151 85677 -58938 -95110 -110664
10075 -110664 168035 -6352 19252 75875 49687 -276811 -64415 84510 -2843 37436 297600
10064 297600 -146551 -117333 -186256 66927 -115048 -106274 7919 150950 -105462 -298590 35074
10052 -82283 -174400 -186623 -8674 267335 -61225 -47510 20147 -472570 -264577 -222185 -114386
10041 -114386 -106539 200074 -238865 -120312 261390 52038 181562 192908 75189 -104982
10030 -104927 -173599 139456 -129847 -193733 -170123 -138353 -91303 -26942 -99041 -380207 125537
10018 -258794 22419 -91203 -207098 146614 -73424 -323212 -20958 -30820 81406 -493139 -137367
10006 -215996 42720 -317591 60981 -184785 -90411 -36762 -22938 124124 101727 -62394 -61981
9995 -61981 -242941 -120147 -49143 143718 -180481 -192279 -120833 -73574 25496 -28724 -168308
9984 -168308 -226053 41243 -458689 -89447 125933 -9372 78403 -88275 -252009 1491 -59349
9972 37367 12336 -201199 -17739 206515 -294246 -360672 -48322 -188615 215638 -87807 68981
9960 -209207 -198818 -32215 -417554 -135580 -85067 -262962 40450 116782 31603 -30716 114118
9948 -160524 -19799 -9444 -296197 -220 638 -47440 38295 -300450 59261 -362224 -73042 -6645
9935 152812 -296726 148486 -15535 -170908 -314325 -520417 174070 -181347 -90883 -120129
9925 -120129 111642 -29574 -148865 -142835 -112655 -189927 -33155 -48152 -140151 -74440 -228015
9914 -228015 -87148 -196373 -40039 -131920 77546 -6306 -63976 -508975 -13585 -130278 109818
9902 -134228 291701 -234934 150846 -56492 -290836 -119278 -91132 -21869 -454393 -123278
9891 156040 69194 -249526 466564 302994 41519 -203729 -103494 -36132 -138165 -170923
9881 -170923 -137778 -15075 1795 60569 134418 103522 194803 -301545 -94943 -24679 -40940 -157308
9869 -157308 -346578 -111382 107293 63645 15464 -49017 -53506 -304152 -232562 -64770 -150085
9858 -150085 -197020 -268818 -62604 154167 95770 -203578 101157 167056 -43362 -83694 -202156
9847 -202156 40167 -164545 -128151 5022 75309 170965 197203 163476 -55962 26865 -500276
9835 196766 -179361 -196834 8348 -203434 2098 -54356 -36933 63688 -90108 -316522 -111619
9823 -132217 -2496 -340050 -240563 104662 138014 299883 -19426 -176220 686 12430 7679 153108
9811 153108 429481 -126877 -6957 -148796 294067 -38452 -117551 41289 -119374 -175858 -108525
9800 -108525 -62498 -142605 -57469 233270 -141778 -192790 -40822 212850 -98864 -146536 68893
9788 -7223 -224827 134876 -252245 -37904 64342 -351740 9962 -129785 158216 -415255 224762
9776 126089 -185388 118983 -117073 92953 226167 -181774 202173 96479 -166183 98373
9765 272974 -274523 5039 -150403 -60138 173167 -267072 -172198 -274320 154391 140603 440623
9754 440623 -174115 -251473 -108321 104557 16040 -32488 -155189 134097 95305 16969 -135217
9742 -36423 -247855 -71463 121086 26870 153213 -288602 -188478 -12222 -303124 39651 -43352
9730 196755 -199253 -217449 6353 128846 7057 -40277 -478352 57122 -139854 -185933 55483
9718 -4891 18137 192033 -96922 -90324 -92434 -229172 -63649 -76046 -259007 101084 -67585 -183996
9706 -183996 -7780 -239610 -321020 218893 88520 -94427 -314175 -102234 -162189 -550 -222200
9695 -222200 -396811 65146 -176698 259724 -493043 168322 -268977 -222985 -40975 -116895
9685 -116895 -365747 -16817 104252 94572 -336836 -39661 -40473 144022 12035 100665 143981
9674 143981 -131965 -207267 -254602 -206804 -135627 -179412 -317346 -60666 201400 126759 84825
9663 84825 32496 214894 -135348 -207792 66176 -2746 -337320 57105 201927 140317 -145128
9651 160990 73186 -236962 -362501 140282 -38050 228918 -140218 -102793 103375 -136887
9640 21840 -45504 -24489 -12524 118412 -332940 6387 -86800 -86791 1554 -25268 -100410 189836
9627 -77773 -84796 -35029 182318 -281176 113522 -186158 -279748 -9309 185501 -58824 -232945
9616 -232945 -390152 -148637 124787 -79185 4802 -159176 -4627 -102327 -130337 201280 5078
9604 -79165 -156035 -171752 126088 -79390 -60181 119730 -149851 -226270 101154 217434 39758
9592 -51757 112838 16396 188475 109208 -341468 -404488 93573 123899 44218 -277225 -30076
9580 -193189 170384 -249965 -280253 139490 -75099 -163903 13454 -156025 -256910 36541 -154744
9568 -204582 -284630 -244720 -198396 119188 15919 -10020 -265476 -106645 212078 -81085 -71874
9557 -71874 206553 246420 92676 73384 66569 26892 -361031 -230598 10819 -72955 149926
9545 -44752 37834 -103046 -178014 -368649 -22220 -39965 26474 157073 3881 -207977 101205
9533 18411 148777 54881 -62907 -397825 -283469 -65972 362136 -254575 -193130 -187378 103470
9521 68940 161046 -133610 -204869 -282523 -222152 -225973 -498767 -120418 -124291 -237577 101104
9509 -364059 -202543 194536 -218250 -175996 217701 -123180 -226886 89933 -128504 -53558
9498 -145377 -22828 -41727 1671 -178197 -129778 -116899 150734 -126513 -93514 -91585 -80734
9487 -80734 -151749 67623 62990 -227275 -146716 -7511 201520 -112913 280407 -358156 -179489
9476 -179489 -114955 -60838 325204 -448346 -205978 -37284 -52773 301060 70508 81542 78505
9465 78505 19932 -55692 -226415 -57874 -136683 -304486 -339581 -103677 87772 -29368 -76336
9454 -76336 17594 12986 -17095 34352 62962 -460927 163578 -301441 75754 -125260 -21922
9442 -75597 -355081 -75365 -173682 106956 -130606 126177 98167 6217 70081 71888 -102690
9430 21142 55686 -15163 222572 -210443 -5099 297423 262286 157804 72792 -157943 -166854
9419 -166854 -144830 40974 -250048 -202829 207377 -62405 146344 -308191 -260725 -191988 -88421
9407 10787 208983 40110 191241 -65675 -172223 24674 -219000 53460 -390527 -174828 10744
9395 70236 -3199 -242150 -125263 110539 32156 -285485 -94964 -228994 -194953 -194525 -213490
9384 -213490 -33054 -13961 -80217 -178816 52290 -146906 -86290 -123373 123007 -207372 -88793
9372 257505 42328 234991 -170252 91281 -162477 -206784 179269 -191380 -47549 -175253
9362 -175253 -464919 -162051 -98684 -9959 -116105 -118754 115644 35375 -276400 210786 28568
9350 -79127 -238981 -10487 79032 208017 44629 -75525 -321887 -397130 -304910 -253276 -8673
9338 32907 -106510 -443603 -316827 -149541 -201148 152596 -1771 191834 -88945 -177633 -284204
9327 -284204 -21396 119559 -174179 -213245 -100317 98154 -124316 -446779 172014 -138357
9316 -86249 91278 -145454 30499 -219278 -226920 245048 26637 6936 -19081 60307 78862 102475
9304 102475 -77195 -269933 26795 -310279 46846 22953 -92492 11698 -16387 156062 -37612
9292 -484174 -395090 -174396 38299 109460 -58969 -141596 -193113 60220 -66977 -120222 135477
9280 157100 -74968 -223846 -54932 131365 -333618 -243842 -5607 840 -115250 113759 -31290
9268 -252252 110334 -77246 -134770 -109511 198021 -411719 107240 -188990 99901 -322336
9257 -304420 165882 86488 65993 -76903 -302313 -375509 -7983 -152798 166866 -91714 -133986
9246 -133986 -668 70396 -98187 -383599 7767 -248979 -128255 -6222 -14562 -204918 -5277 -207472
9234 -207472 -111311 56320 67015 147043 102167 -348886 22054 -77819 409875 -103223 -110899
9223 -110899 408696 -158885 -136140 -92033 -212441 38493 -261548 28314 -108640 7550 8307
9212 8307 -206660 -291344 355591 3483 243005 -99680 148936 108282 133543 -18598 65843
9200 -399396 55768 -296310 50290 -74256 -196596 41753 272768 -145649 -262335 -201814 -498374
9189 -498374 -279780 -156432 -738090 -160020 90971 -363522 -73437 253832 109471 94099
9179 94099 -116014 -355567 127026 295497 -68068 350368 21350 109490 -192394 -160712 109336
9167 -268566 -20143 -107382 -138576 -109702 126919 18069 -433359 -79571 -110204 4946 -101408
9155 -43856 238802 108981 -137988 51965 -218771 60974 -234926 29728 6066 -208819 106678
9143 -95119 -24450 9811 -226233 123143 168521 125067 -210723 -51474 -138409 -152976 -94216
9132 -94216 58633 8304 -146162 71385 -188881 44845 -92187 -156179 234167 135808 20530
9120 -156629 -7586 -249504 -60178 -165920 -49566 243647 -9502 -167176 -140453 -319712 -101083
9108 -280048 -342564 -103614 -230394 -93339 -237584 193948 -406804 -184724 107013 19700
9097 -180589 -145338 -176669 -127882 121142 -221940 -232666 -210780 -148838 -222428 138696 -52822
9085 -241253 -108301 -264973 -258229 115061 -198815 -119996 -156566 -361027 210794 138215 -111284
9073 -131316 130703 1436 -99598 -287732 64239 -84570 -21539 116869 10875 -306341 -96646
9061 -431505 73093 -9817 -301202 107867 -4461 -72613 123501 77693 -197830 42003 -43698
9049 -129591 -304081 20165 381019 2572 -146031 -119173 62904 56350 -180143 10575 18989
9038 18989 32731 -28996 -94961 266600 -543859 -297716 507339 186500 40970 -75148 -22471
9026 112159 -287291 -271543 -146444 196895 260170 -150606 252831 -111814 -446816 -98889
9015 -350781 -195841 -4903 54387 -3366 49310 -205549 -90329 -93130 -212000 -60632 -159656 -203120
9003 -203120 -314605 165628 155004 -283792 -138146 -308861 -4578 -357436 -327342 50907 -404765
8991 83144 38682 138280 -177932 180631 -147777 11923 -43413 -23110 -127132 -39282 -159841
8980 -159841 -13258 -111779 -45037 -295856 146374 47627 -78547 -221734 -45165 -136560 -12544
8968 77331 75351 -33622 -61408 3631 -148164 -163385 -42261 124523 32018 59842 229763 376
8955 269887 -135078 -277432 158935 -24940 15261 -195342 66022 -213577 -38665 -5251 -36041
8944 -36041 -539100 164982 -87290 -228380 -200689 -102457 137296 -12562 191978 21482 -26105
8932 128576 172421 208051 196057 -110529 -9669 -227434 -35870 -244445 113838 60204 391352
8921 391352 1283676 3370297 11202268 5019415 1329171 550125 390434 13749 132626
8912 132626 93298 -57909 176862 121336 17654 57287 510188 230961 48249 -29256 -349362
8901 -349362 -243081 -29321 8808 109583 -6757 -22748 27741 -151651 83770 42868 -39279
8889 100555 -152532 -90986 283882 -86796 -217918 156178 -275934 -250908 -378737 93130
8878 -52311 -220153 -47643 -267991 -87252 -63080 -80856 -427766 -2777 78484 283195 -81128
8866 -17401 -96300 -128952 19372 -123934 -239754 -353404 -133697 -81740 -319520 51717 104941
8855 104941 -242190 -61043 -184321 -14119 -318229 268156 -52316 -88394 6759 54719 -33916
8843 117706 -303086 -215508 96604 -17634 -82708 -61445 -397754 61487 10450 -100314 -78720
8832 -78720 -68957 -118745 125037 -44868 -112759 130078 64664 159289 -92113 -76470 74659 -47512
8819 -166778 4282 -144923 -262172 110953 56929 -60463 -271247 -97640 46782 39934 -254178
8807 -80347 261023 -399527 34034 -73406 -149149 271372 8869 -541038 -279012 -301127 61798
8795 191583 38762 -120497 -226349 -53933 102478 58733 94495 -217138 -7825 148629 -965
8783 -351599 196995 -66908 -51572 -107306 -46654 15484 -404888 130959 -269567 -176255 -426291
8772 -426291 28403 -364378 -309267 -123648 284829 100327 35923 -251167 -47228 89106 -170501
8760 26774 -57983 76722 -276672 111130 -116712 -3277 -81055 -353956 -37333 118919 -186797
8748 -237196 -201075 -27584 -162320 75347 11681 -12039 -4481 3947 -39965 -328660 77385 -115186
8735 13989 -64527 -199823 -116576 -29113 -3147 -189429 180050 -37131 87861 160106 -163584
8723 -255222 -30443 -168647 213462 35924 -92405 -144601 32645 -244766 -63089 116816 -39047
8711 -13612 190576 23424 -122694 -126993 121343 -221555 -216051 -120782 -120857 -190803 -323143 71736
8698 148957 -231794 346266 -20921 237238 -43008 -38196 -110801 79579 -30907 -161639 -248453
8687 -248453 15820 177697 43257 13997 -219306 217800 -121077 -114590 -328570 -30608 318106
8675 -8614 127419 -75298 130800 261091 -166041 32250 -219540 -223014 -356068 185617 19745
8663 -12576 -193877 40413 -134083 -191448 -116939 -301389 -88454 -298147 -108200 189260 97000
8652 97000 -123311 -67504 136327 -132999 223702 258974 294641 78613 348529 -244125 77269
8640 17758 -59150 -190068 198744 109365 -280193 -51091 215719 -198721 -5078 -202858 49115
8628 190110 -154067 -111152 -66366 -56344 -19549 -50317 -37103 -68690 -408311 -57410 -253871
8617 -253871 -217949 100453 -158939 -303533 -53040 168307 183548 -93858 446361 28517 -347708
8605 -70189 38348 156260 7222 -400615 45465 -80227 238951 50962 -61297 74504 107670
8594 107670 -225146 174680 50884 -75560 258809 -187728 -6304 -393091 -217575 -53253 87466
8582 -83451 -99988 -49835 139684 -278531 -48025 69768 -82656 245820 82164 -101830 -214005
8571 -214005 -200518 -234977 -126184 238257 -135802 -171728 59750 -17250 -202473 -73783 -100943
8560 -100943 -428514 -118318 159678 -90988 -385065 -7167 2619 -53994 -116448 67197 281910
8549 281910 109571 -181342 -101694 340213 -117673 239779 291913 2742 108380 158777 -204771
8537 -190076 184339 63862 39395 -38390 -140148 125136 -234731 -23445 -153312 230905
8526 -85404 117393 -345316 181448 -59785 -102995 128037 74520 -43545 -44994 -225008 -151412
8515 -151412 59749 -108418 11309 -25434 67732 -189987 68506 51978 -48 -76795 -112844 -148604
8503 -148604 -162188 31003 -283419 331653 63650 -207637 -1022 -141998 -358156 -168540 41304
8491 -10846 179351 62791 -110138 -213357 45742 -27223 -236557 91801 -225700 -226589 22991
8479 -402681 83398 -22396 26239 230707 -115938 -237917 133222 -19324 215847 145192 -95413
8467 -107323 -200342 131722 -45833 127068 -77884 60384 -173068 -101177 -95761 -59006 -212606
8456 -212606 222401 -201531 -161285 68973 -241498 101791 -243696 -76653 -99608 -118168 -68796
8445 -68796 215324 143255 -106395 -434454 -240656 28660 -202005 -7223 547493 -498374 -214482
8433 -380176 135473 -331695 -116394 128828 -198992 -372704 174402 -203415 -209087 -103672
8422 -77745 144413 -61253 50075 -153148 -40059 164407 136136 22100 -125072 -410127 233408
8410 162077 270873 451570 -75586 -128647 -200613 251578 191103 12049 -106647 -31844 123763
8398 -126283 -156626 -83709 -400405 -105004 -3501 -249814 -140942 -19814 -169543 -66054 212598
8386 -172974 222374 212922 -270617 -436644 -27148 -175234 135588 -182561 -250451 -87203 -226857
8375 -226857 -137980 181699 -159460 77590 23350 -170866 33751 47810 203304 -151660 -22577
8363 -187179 95423 -62345 96696 333383 -168622 -361903 11963 -112128 -10059 115313 60196
8352 60196 -294947 146209 -183447 -245722 162314 -62757 8310 -123690 13464 -9253 -279099
8341 -279099 84024 -49048 66492 379982 260054 -349286 275045 -238242 -94950 -88575 122149
8329 -31292 111354 -266985 -103006 130099 143002 -314230 59402 -305882 41509 26308 -261447
8317 -107013 -63591 -33800 -62559 33854 50257 -45348 -227618 -137232 9144 -66130 39302 -91879
8304 59406 -38387 -104516 -138181 6488 -204828 155291 -77630 100701 -124678 -164209 -391458
8293 -391458 -253584 380487 -39768 -89886 -162304 -189478 -239199 -241697 -39176 -397 34919 8161
8280 -67630 11639 -131382 -287623 76761 -295682 98675 -27374 137508 -289474 117837 -30557
8268 234421 55210 23804 -303776 442560 -24723 -204430 -158321 -94387 -124960 -201608 74410
8256 -237306 -440567 -46833 252036 121155 148180 -198734 -4804 -371428 30530 -68799 126182
8244 -185850 -285249 12251 78721 -279377 236640 50804 -326669 -48584 165131 -31143 138373
8232 -303341 73668 114503 142990 170993 -237308 58715 173737 243957 -53284 -174277 -101929
8221 -101929 95476 107608 -583 -156730 -76743 78176 -36539 106011 -26339 -210751 -147432
8210 -147432 6324 89942 -255823 -280646 -120276 -108924 25535 -238662 -10121 -142563 392581
8198 255426 106883 -255163 -384008 -207960 72348 -239160 -124458 42966 111258 -272708
8187 89384 269958 -159421 35994 50112 -402610 -136058 -33879 -96602 72290 298617 -114770
8175 -170114 -15203 -128288 -58985 -170742 48289 58892 113634 385213 69322 24407 -270663
8163 97092 -187360 16206 -11225 -183439 149458 204818 -96002 -93088 -11747 -86686 -115191
8152 -115191 -194340 -23695 -289550 26133 -349985 -217683 -133680 182120 1315 137438 -219241
8140 167676 -87031 13236 -198816 -47479 247484 -33422 -110488 -202145 85304 7241 -89314
8128 -41334 282334 28851 102573 23577 114680 -120035 43538 87649 -193228 -181574 -42207
8116 -142242 -287160 -43495 48223 -179359 -304164 -147105 9079 208740 -139454 211871
8105 170289 -194836 -286205 -291297 -15491 -121693 208436 -35292 -291027 -95994 53744 -62121
8093 56802 86479 111883 -168787 -98662 244802 -87373 167854 -200142 -54869 182395 35090
8081 -170611 -101217 -29621 -188468 26269 32830 -10353 96557 35383 -135449 8497 122987
8070 122987 180631 -211928 127859 42535 65510 -174229 -85183 -140180 146158 -164657 208713
8058 463006 -59875 100931 -73966 -174029 12252 -231337 -290409 206559 -255537 -190179 -140453
8047 -140453 53896 -137865 -244233 -191189 -85966 -262091 -287899 201527 122723 69104 47535
8036 47535 13389 41972 -234563 -144254 -101663 391263 35270 -169779 17528 -111945 -8974
8024 -19472 142329 2334 -117722 -224744 -24716 -124875 -17815 -217398 79717 -60149 -97747
8013 -97747 -175203 -123139 1704 180740 138448 58153 -34516 -127162 305185 -141110 -232582
8002 -232582 -213788 85171 -215853 -270107 -187985 -16776 -85425 -43293 -227354 -233896 -198211
7991 -198211 14329 -280061 -132339 -79539 166103 35164 -26847 58158 233642 -153510 31442
7979 -130736 93028 200823 -85364 -45283 -63298 151688 188984 82864 -73780 -355638 41634
7967 50282 -117784 -38612 233497 -270625 9667 -271524 130688 95757 -57031 -406385 167841
7955 -188938 -327646 -16839 -24070 -21419 -131144 -167560 136023 131509 145006 -136888 -546548
7944 -546548 -41302 263274 163046 -281649 -138347 86128 3931 -10174 -62935 39275 -29651
7932 -287664 -53434 -40859 -9235 -397149 99708 230105 -180371 72507 -48107 -187644 -86835
7920 -163456 -215031 136597 44388 -135099 206212 111820 14359 164757 90619 -99548 -27450
7908 -120788 242816 262489 147494 -32503 -163 50518 -82096 -8071 -97420 -176114 -380771 -130966
7895 -106716 122789 85005 -381861 16776 41435 17671 34259 20020 -232485 -128970 -45480
7883 -125479 -73947 -60729 46545 -6461 -207614 44042 -89151 -433749 -160673 123974 -314085
7871 28360 -103483 101318 262248 112197 -200612 -197703 -162459 162749 -219676 -173572 30970
7859 86988 -114131 131828 -17657 -112995 129075 41329 95813 138785 -143517 -154262 -33251
7847 -189895 -49900 232273 -73987 -269023 122616 -141113 98389 55284 2607 -32802 -390655
7836 -390655 185430 -197024 -191936 -32889 -308632 86314 -227104 221498 -100915 91263 -48925
7824 -729 -218556 132505 23971 223093 -83396 329819 98210 14733 -123765 -170360 -122131
7813 -122131 136028 -364027 191235 -204608 284221 -14474 -151859 -197185 -175485 54355
7802 -174799 149115 -30221 -20952 -66233 66355 -105382 47406 -72883 -277996 -130647 81907
7790 79799 -77690 69687 -154507 98614 -117959 -189943 -14581 -149969 -260871 187800 205762
7779 205762 35454 92241 -203920 -152325 136498 -237215 112693 -83213 -173447 -87441 178742
7767 -326077 29321 180309 405635 -449791 -150400 71170 148552 6537 14906 -88431 84483
7755 -31805 -20986 -191897 -85938 -91307 70090 -107440 213313 -242368 74344 -462754 -229015
7743 -26231 198797 -92 237329 78968 370037 -44829 292073 -243252 -52212 138896 16485
7731 -207674 -177074 -135660 -57826 83629 189030 -349701 46479 -13242 90163 4441 176019
7720 176019 -195091 -79541 30485 101578 -101719 -246839 22643 28376 -129374 292433 -188011
7708 130989 -179260 -32282 -88942 123418 13173 -192522 -395229 -49279 13705 -34173 26639
7696 -361277 257977 66906 -5942 191198 116340 8366 -85148 -207231 -112559 -77105 -104175
7685 -104175 214013 217759 -380070 -29334 -50403 133126 -137354 -116557 239643 51479 -85420
7673 70884 -6807 28907 -81323 -296000 102251 33465 -219228 167641 -165513 262845 -204485
7661 -212691 10530 -198929 -95180 23557 -7649 99731 45267 -203303 85209 -96915 -159987
7650 -159987 -83816 125321 -45271 -109770 -282178 -138639 178837 -118602 -185036 -328794
7640 -328794 -297002 -539433 -139487 -36705 355376 -61272 -51953 55572 -397764 -164620 -101980
7629 -101980 -18222 86002 -279678 173520 171928 -155969 -278051 -295291 -185556 183122 3957
7617 11590 -242927 39984 -168946 -62840 180831 -472104 -67957 299884 84699 351172 -135868
7605 -175790 106156 -42314 -114542 -476183 -97829 147911 -104425 -150581 -180817 78444 4061
7593 19547 70171 -228204 -29395 -268995 -205033 13166 2341 19638 109499 -69181 5713 -157938
7580 -20113 37508 65152 88087 101399 -175262 -251781 258346 -384473 -10326 -7346 76696
7568 201835 245958 186195 136583 81217 34522 144932 55071 -171037 -181106 35308 -139500
7556 -16815 20989 -203152 -29423 94465 46361 -367022 -28636 -181560 239814 232807 -75380
7544 18506 -164041 66449 170106 -195223 -538216 197287 -202365 -368018 -141880 58310
7533 3988 115757 -9516 101772 -147659 -2560 -14915 53561 -38403 -167997 4206 -14080 -42358
7521 -42358 131310 144033 -67781 151222 112986 207876 148627 -20533 -251188 -145943 -13294
7509 -250176 -58387 -257262 417457 -339230 -70763 -114696 -10430 -115765 115548 251280
7499 251280 -104536 201481 18011 74606 -59083 24110 79203 77215 -43781 -236650 -336759
7488 -336759 -201821 -145601 17464 109187 105319 60792 27934 -158980 -124216 36856 -128190
7476 50700 -22607 31700 133956 81012 22175 -111796 23972 94792 -352668 -41106 -70045
7465 -70045 -112647 51011 -22854 20565 -292080 -112939 36083 158461 -68780 -307912 -99744
7453 46126 -21255 55074 311986 -228333 38659 -226459 -279732 -143799 -63366 137134 -19457
7441 -277838 159041 283334 323425 150741 -207803 -162392 124818 -319319 140192 -348681
7430 -62295 -83830 -186401 -244987 103528 79030 -335437 -346412 416285 -99165 -193245 188717
7418 -174350 -114731 -52129 -69438 201875 272042 -30084 -211779 -395351 -944 191945 -351628
7406 7629 -77627 -56642 -82068 -58687 187851 -288050 28900 201184 -351824 -322092 -107164
7394 79188 -70254 204459 -150744 185236 -273185 -153314 -62441 197982 -232144 -255908
7384 -255908 44172 -26755 -97168 240834 247792 -300324 -65520 -32456 -108987 1347 -118929
7372 -449731 -194152 -167513 -472958 144589 -200306 53141 -290331 -38155 45526 -167767
7361 264520 138688 -73042 10675 19088 -70582 -38626 -513670 -9461 315088 -257529 75042
7349 -97590 -4867 170075 -134814 -72024 67889 -44815 -56707 -81287 137673 -225549 67270
7337 7281 -166996 30 -183482 61897 250451 220536 -199378 -93183 -46591 -190378 -357051
7326 -357051 119759 159235 -182165 48611 123703 -64858 24208 38699 -139202 -161317 85030
7314 -207964 -53916 145157 12414 -22185 56029 204047 -181113 264735 318020 158597 -36422
7302 -54155 56205 -67823 -58817 -175084 20175 194134 -50757 246329 -39097 -361586 168719
7290 -221923 52706 116095 137469 -3131 386409 44004 -44073 -263905 132175 -369192 -1423
7278 183335 -459998 -90622 -125036 -28200 -139014 -41113 48700 94407 -331580 230649 266849
7267 266849 133476 -265854 -359536 -347282 95753 -43509 -22113 23804 91402 281592 -109471
7255 -235573 -199060 -145099 185280 130080 98474 -15255 49791 -27137 101785 379555 190401
7244 190401 -5184 23255 -150863 89662 -240937 -180426 -26312 -34316 -119345 10714 -11222 -161114
7232 -161114 -372368 -112322 -63704 142042 314448 -26139 -160803 -127876 225021 -88532
7221 215038 -70553 170620 17408 155454 -33742 264391 -243425 -31358 -140071 -153869 -128327
7210 -128327 -81206 123116 166640 79410 -15274 93316 400451 -206417 220636 -67105 -181688
7199 -181688 73660 -20254 124963 -294980 -238821 210306 -245017 113291 -181942 -246116
7189 -246116 14440 -475985 14586 87903 -56955 -173427 -187378 91898 -296115 88451 112409
7178 112409 -193261 -129163 123691 194507 -50584 -86365 208973 -371731 -37343 51621 -70347
7166 223550 -161315 -79115 -175512 114098 -84621 -48397 -5217 123370 -130159 192949 -218847
7154 158727 -279340 -111158 -185505 40054 -197177 103795 95913 50532 -54836 -243548 -202520
7143 -202520 3126 -70279 -19792 109440 160042 46742 -147455 -82867 -51871 146088 -238633
7131 -12010 -150878 36064 -172306 119736 -187953 90650 107343 101314 30425 -284376 -136376
7119 -65664 347325 390392 -40957 222492 -72586 20486 -29636 179888 -37194 -288370 -31500
7107 91931 -134970 215595 -199257 150889 -58478 -204512 -262610 63406 213886 46400 43363
7096 43363 13322 -12996 178751 44967 125442 164848 -4720 -268845 -5598 -5872 -213876 23188
7083 -158669 -218433 -209711 -1464 78639 100096 -157076 173186 10056 19544 -57606 -135885 198372
7070 120686 -86095 -281126 274006 394845 201724 -178210 68448 -43482 107945 -192960
7059 -114555 -256727 -16320 -338603 -154378 150339 -106052 56060 233 41603 66810 -223904
7047 246754 192532 -13840 -82811 -248486 58247 -417177 -14965 95957 131725 -32858 -36504
7036 -36504 17193 -48513 -279273 139212 -181190 -80741 -36237 166468 -89753 -68405 167511
7024 -473846 118155 165082 -48898 -79235 -71453 -9105 -110216 -128660 60408 102294 -60653 -4401
7011 -37524 -121642 102107 -106268 -37880 -6891 345693 -228458 160098 -82861 -177516 33132
6999 -34796 -45386 15776 -135611 96312 -46527 -74146 179267 -59392 229841 -309535 -39616
6987 -43556 33582 -244610 -262587 170188 -153345 238279 33258 21744 -135037 41282 -106464
6975 -115261 50816 54690 242687 -20572 -110478 -190009 -216983 -402184 23051 84780 -264144
6963 91322 87673 -37357 29106 57494 9879 26271 -134210 -160075 153992 -857 -102210 -25376
6950 331054 24280 194723 78126 33666 -56188 205863 -91945 -247293 -38421 132208 66618
6939 66618 -159985 160706 104313 -214644 -119144 -7332 -233601 -169037 -105814 -135338 -92500
6928 -92500 -156127 -125186 47210 -94120 112536 -159108 -100875 84583 52456 -143638 -330839
6917 -330839 -48049 60571 -7601 -188672 -266196 -43229 218892 -153006 -177133 111930 -234461
6905 119497 24350 147254 -25510 -99942 237096 178238 -273739 55585 -1539 12176 -26226
6893 142470 -433031 -46921 -69624 79000 -18696 -187484 -183687 320034 92967 -29464 -285855
6882 -285855 -360928 -147035 122953 -247333 -148351 13408 -414161 225634 -142459 -52989
6871 133760 225052 -112400 52780 -171209 1607 137947 -7292 114983 181259 -157085 175477
6859 -82346 58235 -21016 -231362 -156704 -109159 79651 165721 -58976 54856 -65765 356851
6847 -62463 -209526 35251 -154665 4591 -224056 -300488 9081 160454 357762 -397173 252464
6835 98298 310075 -2615 86332 39615 16659 -93901 -217987 -71662 -66758 -35152 185058 -128687
6822 114229 121506 -61298 -100412 -80518 135168 -75893 -1238 -208822 -37827 -40704 -218551 -9900
6809 -9333 -91999 -29643 -9701 135571 -163783 -94941 171410 -42908 -454862 -51866 -375524
6798 -375524 -367760 -207298 80831 -147551 -189781 19734 55993 -126605 155157 -103054 39065
6786 -9167 137510 -12089 73390 338609 -220778 -61047 -212591 777364 -184805 -65834 217598
6774 -278781 81933 36619 -114385 -165310 65822 5782 -74498 -272590 -156605 208511 386816
6763 386816 214531 6708 -366136 30896 139453 37617 -284364 -9939 5140 -329110 -46892
6751 76084 87881 -133814 -40852 -289704 -101917 34303 -117926 13123 -79905 2700 -35163
6739 -15400 -70923 307296 -273718 212591 -131247 123927 -20295 -247509 -183366 -293123
6729 -293123 -28086 244071 215202 110617 -49370 127820 -81518 -149430 61385 -16748 -60826
6718 -60826 -101713 43327 291858 190923 -153774 26578 130228 7174 -3503 133972 -185298
6706 92275 142498 190660 233841 -40588 43970 70621 -173889 109895 43248 -368931 140933
6694 86259 -83712 -75431 127355 -65445 86413 -24109 -98944 105040 55134 12038 -61543 -211375
6682 -211375 232539 88451 -41739 -133719 262254 -108079 -179016 -141762 153544 161675 -73323
6670 -98586 113607 193808 17442 -361926 205244 192286 64782 -225840 -18479 -87734 -218787
6659 -218787 556304 270072 107192 75952 -52729 110054 -217135 -134311 321776 118608
6648 -256419 -214482 -24526 144081 -184392 -170149 168591 37002 -63855 237521 71617 154364
6637 154364 -172891 10679 -414733 -81920 16122 49039 -69036 -167109 86867 -54477 -50979
6626 -50979 -143181 97007 -8709 -44707 -102293 -28439 -303640 74475 -222455 -23203 -111229 -62539
6614 -62539 -170696 -286424 -8946 114695 -212170 -162476 -131490 -220251 -88672 -127005 -302931
6603 -302931 137216 -279221 165479 199426 82649 116079 -135525 -175055 175863 -250931
6592 -83733 128460 -96247 101816 174056 -114998 317213 74730 19021 87876 -8994 -20471
6581 -20471 284029 -302668 -194066 -550057 70768 -112469 -137915 -15132 100480 -149747
6570 181558 528068 1777 -239645 -9054 -158521 -5792 -115729 -308960 210826 181305 94878
6559 94878 117273 64766 -67175 228418 124423 158447 -529808 3791 109596 -208565 -49462
6547 120275 150837 112081 155041 -96245 -228383 -90680 11275 112793 -95493 -40536 -392369
6536 -392369 -130961 -519476 170843 -68234 -128844 -45339 183378 -128158 -155674 172557
6525 5870 -205312 67850 -351118 -314857 172624 110971 393241 -37924 115678 -63682 27771
6513 -175839 -23923 -50931 -122745 -10452 206759 -63669 -109624 232402 -345859 -159599 267021
6501 -85491 -403711 217212 350560 46823 91640 9931 -124267 -280971 -81932 -73652 166006
6489 -126624 100366 -118490 -42243 -128063 -259538 70348 -317776 144810 16031 -302156
6478 -120771 -46220 -110006 290174 76753 122967 -65528 63414 92947 261616 413803 85147
6466 -74322 -25596 -168320 50365 -78275 56301 64733 -115565 82011 76164 100990 -128244 148845
6453 -16352 -7829 16403 14663 146055 -151556 -150533 -49313 108132 -149826 -158447 56741 66496
6441 66496 75451 107784 118699 -20965 -59873 -115218 -247021 60851 42271 -369388 32554 -317840
6428 -152544 39893 130051 -116795 -133856 133140 102487 -96794 634950 30569 223031 -190512
6416 -184371 46419 326670 -120977 173689 58746 91508 89526 148495 -130767 81967 -151310
6404 140112 -37832 -162461 -253912 36894 16802 238154 132466 158893 -97284 55965 -222850
6392 164967 -106778 -162061 20900 -12241 17577 -135270 322974 -327385 153315 131263 169619
6381 169619 -213675 89963 -139008 -295110 -407981 -15732 65765 169933 249700 -18211 -12168
6370 -12168 -17915 187319 -121112 -250463 -246451 -7043 305430 87777 -257673 -207199 -265504
6359 -265504 139772 -117779 -213639 148991 100851 177166 -302829 -345144 60504 -216590 -102691
6347 244164 -14650 -133925 -133198 -137931 355701 17377 28566 -219913 -458970 -365877 105661
6335 111329 79242 -122020 6238 -235458 -222328 208408 299452 146234 14331 137406 -13171
6323 152643 -24513 -83729 65073 9733 2910 100254 159817 -155000 16006 44395 -29178 159576
6310 11819 -122361 187031 194525 -26343 -180139 111197 -134776 156364 41936 63803 -72578
6298 -56385 89207 -195745 -128886 -195414 -100619 -217096 30309 -164113 -176002 -125648 -31514
6286 320164 139354 163929 -44953 -293419 30538 -37073 -118097 374736 66336 130921 -265352
6274 -12554 -165300 -305680 -17506 -19590 77884 -73607 -125989 303832 -11862 65874 -81909
6262 51253 -179234 294087 -22833 215615 -344119 -113520 -1307 96323 -167466 47211 133400
6251 133400 26955 252221 131758 -14646 -24735 217258 138639 54848 -45821 145719 -355
6239 13994 202628 -254239 8458 -162173 -268782 -2821 134315 -269064 -215638 -204204 -282905
6228 -282905 -172866 -69329 -13072 508714 199686 350584 -55006 74734 -189784 148688
6217 188287 -159135 66105 20758 -255316 113792 203854 -37912 -21222 115246 343037 32301
6205 101354 170167 53238 -35118 -54266 171464 -257043 -183675 -108091 -312350 -148051 166862
6193 50272 -2665 -48183 -75399 -54865 -153651 12322 -126793 257483 19815 -70845 62589 -256444
6180 -121227 -132486 -149298 -150670 -56219 99309 22495 -46090 33485 -297934 -139514 -298488
6169 -298488 -320251 -112093 -269110 -116968 -129932 -29815 -6390 94439 -3004 -85108 84046
6157 314579 34368 -14850 -107162 -53404 200960 215695 -117999 -252647 157668 71113 -21519
6145 -231967 -133134 -426379 -30510 -128866 -53120 83918 12229 28310 -4319 177701 12658
6133 -322400 -125689 -43206 14153 -115124 -284388 -254230 80434 -104607 28398 -56067 -309482
6122 -309482 -172627 46776 -105257 -69699 83239 -282118 93952 -197064 -209430 42032 -194779
6110 90899 50989 -56022 304156 169948 17077 114381 -118564 78244 89210 -155860 22068
6098 -134211 -376800 28785 -265133 32833 -7209 -201372 -188398 130956 -194911 31036 -26176
6086 128990 -28965 -800 -265133 -224965 -193973 -93066 258725 -157104 97939 225134 31122
6074 110356 -116168 -210950 -197439 218888 106420 151069 64663 -263977 -388290 -139765
6063 -285950 -1722 -144906 11070 703 36146 88816 100902 -44313 -102507 251552 45254 -90415
6050 22621 -46068 83847 -157949 157321 -147029 -11587 122845 -97581 285240 153192 -66997
6038 91628 27896 -76432 -167358 -42362 -267342 -206615 11291 223021 1665 -91318 105113
6026 10051 -23738 113739 -77192 62362 137469 -9669 129486 234310 16419 -137068 -125895
6015 -125895 273021 -14666 51620 134832 324603 96150 8575 -60282 80961 54655 110074
6004 110074 -85899 30497 -123801 332525 -130753 399278 -53211 16005 -108211 44578 178223
5993 178223 -184035 33148 -215229 23066 95602 232005 158416 -66255 131708 -111149 97094
5981 45323 -15966 131033 -317154 148626 -153812 -79297 -81720 -53159 -28861 438256 168576
5969 -141839 173250 28843 -174625 64613 104843 38407 149920 -233440 94236 137869 150008
5958 150008 -18456 -559589 -105448 -205274 58770 -184050 71469 -220355 60190 -24816 -147529
5947 -147529 34592 -181755 61771 -80250 -70219 -222060 -326272 -66655 203741 -14167 126773
5935 -149 -100715 -234099 -93601 95294 41854 15871 -123566 -229276 -86162 -109752 117746
5923 253325 -10680 -37779 133710 39701 127706 104701 -257852 27334 -63074 234490 250722
5912 250722 -136773 -11422 -93437 150113 40352 217483 -313929 189221 200301 218873 27103
5900 143001 -103036 80718 172135 28284 -437501 169728 47377 220443 252011 -126095 -17993
5888 45306 -220384 80733 -256657 -136307 86275 59671 -91536 56755 304103 -80056 -5408
5876 -140792 150042 168296 -12722 332905 -230066 -71272 310056 -369758 -81368 25097 -136709
5864 -40733 42541 96722 -245051 72940 -100411 311517 101737 67843 -323724 192198 -253417
5852 -47528 49491 49662 -11030 190843 -43372 237216 -32077 68660 -503508 61460 -112165
5840 234954 -30111 332102 -74134 181273 -281826 100747 3972 -89025 29597 65344 -179036
5828 134232 -10247 128257 332566 -42751 86219 132483 -179334 -57551 -130876 -35238 36460
5816 145352 5532 -65283 46157 -167344 53808 -107425 -144951 -171107 58434 -231549 33758
5804 328799 58902 168639 -25938 -135647 -128235 91936 3389 -37116 138782 -292895 64009
5792 24055 248919 243065 -71237 -147632 7947 -146667 -60294 115541 113491 91633 358325 -10550
5779 195821 -130759 -125352 -265512 -233497 -49565 182549 -71777 50685 -117412 258262 83436
5767 3484 78693 -62136 -104180 210533 -234477 -104188 60590 27603 -10843 127037 129527
5756 129527 -357157 124139 -39897 -21628 86789 379838 -180204 -15571 70968 -5577 -91577
5745 -91577 -131725 10632 -34660 123795 268533 -96536 -214905 16693 -143339 -159330 -10441
5733 -26304 280399 -212954 94132 180509 -82593 104667 94800 223653 17802 103531 192250
5722 192250 -327749 -366064 -172486 -237679 322679 28081 -173813 139143 21348 -90785 230698
5710 18138 153153 158867 181367 -320191 -95850 141923 112307 102690 -79764 -151335 -144481 -155651
5698 -155651 -324983 3428 129602 -78084 40842 -128649 144595 -59008 -303694 264302 23021
5686 221808 -42468 -247357 5210 10653 -41275 46513 181543 17340 -56735 -14965 87692 338616
5674 338616 24540 31695 416256 74583 156771 226282 -283785 -70606 -191221 -223157 170639
5662 153618 243468 -172111 -234762 -85796 24061 -155315 21914 6513 38996 -190887 -72635
5650 -189645 178096 -81713 -31425 30415 103084 175484 -99749 575555 223368 -82677 -6274
5638 96520 -80320 -104479 -150119 -210575 274030 65414 -103400 247884 -171098 76378 -43692
5626 -362527 197531 -45022 -150744 -21364 29960 261464 60607 -187597 20169 85998 -237022
5614 -181697 -28774 33600 251272 150474 -179123 454857 -198184 21764 57707 -204690
5603 156285 165070 -94949 -105103 -131256 -360115 -152705 11266 70996 188892 -62753 -121211
5592 -121211 -209741 49409 -31064 -78923 -54827 -148949 -185850 -114143 17846 27146 4484 216
5579 269636 -207196 -486101 104224 -217987 -53436 65934 273464 -516029 -54484 183262
5568 -98989 236892 14357 274652 4158 96234 22058 94612 79113 -23005 38506 29282 -257601
5555 100862 -44780 -79080 111250 -42834 -323281 -29868 25070 23997 -73568 311492 182107
5544 182107 144054 -67952 -215828 102452 75981 5426 -87911 -166928 85737 44564 -289140
5532 126093 147815 -292493 240673 -67735 158205 -116516 -32829 128086 101785 -42690 -52894
5521 -52894 147835 76939 -23257 -35542 83695 84391 -1852 -16794 62160 -81211 -159071 214112
5508 -18391 158190 222633 -253743 92181 210243 34527 434160 -44712 129165 76933 -180251
5496 181702 -217810 34194 -182690 155036 144133 416120 -245204 -74912 -116521 249702
5485 -93664 84961 -236598 -19440 59784 30595 27673 -193105 -45119 -75755 136881 121849
5474 121849 -139645 -41427 111781 9310 -191090 -27809 12173 -111825 8801 -276765 82702
5462 -18889 333235 -55138 435733 -17057 -227252 99598 133901 2046 -18893 251750 -270595
5450 32777 -26294 105401 -194813 46995 124785 312022 50051 -27685 -256406 34796 189004
5439 189004 -134939 71775 -122665 -107089 3665 -43441 -205357 -165693 82388 290346 211448
5428 211448 131853 212490 -88965 -100311 -17553 -94086 -203558 377860 80462 99512 150979
5417 150979 173708 -213203 124437 291012 285799 -246418 70467 -392684 -60906 -122448 106472
5405 -238425 -23953 84522 -192499 -27073 -131634 47475 262730 150690 -37399 284128 19750
5393 -28769 -127464 75908 -117730 -343401 -12754 -253836 210646 -115402 -322653 155615
5382 -192945 114551 97715 71928 -11809 -92286 -25985 -166693 -8152 150530 -161301 -31837
5370 35289 -132495 159715 -138586 -90064 111235 360863 -290023 141447 -182473 -144259
5360 -144259 -23114 -95906 -110752 225786 -8053 -292465 168606 -130471 141104 -172507 -181896
5349 -181896 -229048 136865 20812 149326 113740 58657 230534 163248 106027 633609 -70846
5337 -326952 393788 14427 61209 -1988 219540 14191 -154069 -278937 -262578 -161937 158651
5325 137179 -42305 45703 -149066 140299 85769 -345415 -291549 -69768 -200522 284211 180718
5314 180718 -81808 268516 -29371 -89577 270083 285692 130327 68210 -26436 185708 -199363
5302 -239951 15853 -155663 288836 -212323 -356104 69380 -97032 -142543 -105334 -39460 166057
5290 -175435 140476 192754 292834 -235663 -71548 97433 -73500 135980 7079 44847 72916
5279 72916 -73025 -1242 53323 -33316 -459787 -221260 113634 69361 -35211 133170 -23471
5267 202448 205135 -27490 2287 -116842 -215847 224666 -139135 -64636 66004 61521 31164 93902
5255 93902 180647 -114040 -243888 36681 -418591 -20281 -163826 -62800 60743 -226408 45338
5243 167584 -25198 62658 99925 -13712 340616 -48931 -274229 127142 35801 215885 26365
5231 12971 19259 -44454 -62068 225515 86601 65929 -385521 -54307 -167892 -193292 -253304
5220 -253304 75725 -73665 185725 51259 -134334 -194459 43586 96831 240327 139251 -155592
5208 -220388 81972 -331475 58191 61299 152661 154402 121238 -38536 87370 276398 125925
5196 50085 -150357 -76123 -77288 43092 -92275 -29867 123519 -118449 198905 291143 -218451
5184 -155228 2143 -175721 238455 125738 156174 -163411 -44471 -18321 -31768 53669 365315
5173 365315 111840 225091 17204 87164 71311 -186839 92489 54808 -32239 116001 -43190
5161 273658 92862 -123232 -190615 -43861 -227473 -101006 -31533 54569 172477 -163377 -88799
5150 -88799 140347 -17967 31278 -10055 94914 -135840 120517 2692 -107033 175433 142292
5139 142292 26882 3552 -32796 202804 247446 252031 91305 19496 -201673 252606 133655
5128 133655 -43289 -3178 133614 205492 19081 70326 255223 -156405 60940 433563 147891
5116 238030 113052 -50785 -20212 175337 353658 -118135 -254654 100531 139617 123126
5106 123126 -13463 -324008 -104469 -129079 -294476 -7748 -415109 119739 -38353 -130008 11771
5094 6007 174365 -80018 89387 35868 -40598 71486 9742 97726 57324 71378 54753 68928
5082 68928 5881 -10982 -61251 -244340 63218 -15838 -80813 -288490 125470 -177515 -82033
5070 34466 -356866 125412 123919 120375 -107530 -118492 -50180 -17715 67591 468551 -7638 -206153
5058 -206153 -237769 295144 -187073 -40739 -106398 152194 -171602 171139 -653651 117008
5047 -131954 52891 137084 12061 140391 -37445 -2865 -295191 -13159 -316636 -26064 -470444
5036 -470444 49690 -54252 127812 71856 -29863 -15210 189549 291163 -92084 -88944 131875
5024 -292881 -118416 175882 144951 307754 -173351 -200093 241604 235496 37338 66544 258364
5013 258364 5376 -38401 11940 -57059 57082 -7957 -13767 14966 -10224 189099 -130460 155455
5000 -7997 22729 117926 -70974 208016 75796 23224 432917 -152950 15384 -85720 -33896
4988 -292694 52144 -35826 -116155 42459 34745 -338250 80791 -91306 13141 27840 -24688 -221637
4976 -221637 -45428 5391 -103739 220252 -161817 -191790 346489 -33230 81184 341283 6078
4964 217709 -39607 103226 494752 23509 198862 -18062 -277342 -103484 -344431 91074
4953 -121311 -64147 -36443 -50260 -143782 -182301 -1146 132045 -137765 -119818 -38050 -123170
4942 -123170 -202698 -17387 19104 -128936 -127979 26681 185712 -82339 -254674 38395 35387 24911
4930 24911 -28031 -193656 179173 -89557 -289291 -106838 7632 49285 176722 -19482 68034
4918 16624 -40484 -17914 -104027 -257264 -39879 -7957 -291092 -290113 172303 154864 -981 -220463
4906 -220463 342383 -215791 -151463 -21435 -219641 321425 -76788 98994 -31302 103847 -3685
4894 173014 -64440 -171118 -88463 -181138 -99866 154404 177958 260203 29993 4831 95571
4883 95571 313141 24755 341551 144689 -413210 -152759 6175 -190870 84116 158060 108819
4872 108819 -111210 -140175 66334 -118129 -39131 158146 25876 -93169 44631 104025 -43694
4860 131598 -225084 15702 -156702 -33662 -9367 -138 335097 94130 -169811 -44403 -131428
4849 -131428 -18777 98774 267892 42761 -34208 54510 -302702 -62516 -54010 74901 184415
4838 184415 243408 125063 74026 -317071 -3026 208326 252168 82747 158637 -342853 19195
4826 64100 33319 26927 -162212 -110777 -306755 76598 232895 72956 68442 85220 33155 142915
4814 142915 -90215 7791 269705 -88734 230198 110167 8506 -128138 -124033 100781 -107834
4802 286770 89220 55635 23157 229197 -276441 -120962 -130736 105494 47708 -224466 -362662
4791 -362662 119496 30985 117668 281878 -328489 219966 -183074 -158285 140514 -145087
4780 -384745 112140 -156075 6444 -233753 99441 -120296 -2524 -21123 124322 3686 5886
4769 5886 -237633 -223711 -178293 -66668 -131635 -42236 61270 133828 85027 -410793 -265615
4758 -265615 68062 115049 5026 275978 66695 241289 7174 -93318 87887 242739 224451
4747 224451 -276325 389417 136073 -275067 -141418 150404 211335 -57423 -200807 -363914
4737 -363914 129105 187095 90742 159008 260818 -12254 -150542 26087 65734 -85306 -106864
4726 -106864 -17903 -10089 -243819 -18455 -70966 22797 -128367 -39813 149433 -154761 73146
4714 167823 36711 -123007 -266958 74064 -52120 -145589 180204 -258519 120862 113311 -55289
4702 -126296 -246641 44298 -24671 -292761 -396941 290404 -114328 32979 -9761 138665 41926
4690 -166176 59250 -178028 27041 122846 -186415 213534 -41954 28865 -3462 35397 202689
4679 202689 145248 -22297 25229 188498 -112534 75973 -79616 -3543 -58108 81886 153252
4668 153252 31570 -250446 -36495 -86993 158328 104022 -146065 56757 74286 149501 193258
4657 193258 -77409 208588 -146552 181517 -188103 354301 133415 102579 189275 259087
4647 259087 38179 16023 17381 -113214 393022 -77614 -264236 205628 -198816 313453 126394
4635 134441 -159469 -43399 -318361 12618 161961 42976 147856 32947 -81328 -24911 78367
4623 -52819 -160469 734 72415 -24300 -152551 48564 -356255 70013 51880 -41487 96357 -217642
4610 82427 -87761 -57156 60211 -1816 107862 -200764 71813 67211 -100140 71148 283941
4599 283941 -138115 -286479 -156517 -218239 152918 -47641 101909 5626 404629 43103 38358
4588 38358 -203272 25466 -194582 -44188 -398461 178144 -5606 61939 82278 -70754 -423864
4577 -423864 159373 99933 -358848 -213797 -102706 31898 128494 105768 825 338484 -136310
4565 185778 -29054 191083 247403 -70309 199797 119432 962 -144234 -6600 26523 -172088
4553 -11866 -188021 247559 -29760 -198155 30623 -60364 173406 222333 -5420 134009 -133366
4541 28373 131886 -249952 -40938 330516 239926 175737 -65276 -169807 -258793 232735 334480
4530 334480 -142634 34109 233242 -11466 -52421 -356233 -194305 -220269 34307 65047 48850
4519 48850 203325 -282377 -51933 -51752 -109177 179938 194796 -261125 -341653 198202 -157687
4507 -624701 -251309 -221649 -410517 267420 -14589 319823 -238455 -197239 -149047 274753
4496 143058 54773 -79799 83958 85060 -76281 -384994 157996 66751 -332290 -41009 11656
$$ [...]
##END NTUPLES=NMR SPECTRUM
##END=
