
##TITLE=AC1239_CCAAH12094_6610175_9lQ1fpr3CV
##JCAMPDX= 6.0         $$ Bruker NMR JCAMP-DX V2.0
##DATA TYPE= NMR SPECTRUM
##DATA CLASS= NTUPLES
##ORIGIN= BRUKER
##OWNER= Administrator
$$ 1.72 TOPSPIN		Version 2.1
$$ 2012-08-02 13:10:30.515 -0500  Administrator@TOPSPIN
$$ Compression mode = diff/dup
##.OBSERVE FREQUENCY= 400.02188249412
##.OBSERVE NUCLEUS= ^1H
##.ACQUISITION MODE= SIMULTANEOUS (DQD)
##.ACQUISITION SCHEME= undefined
##.AVERAGES= 64
##.DIGITISER RES= 22
##SPECTROMETER/DATA SYSTEM= spect
##.PULSE SEQUENCE= noesygpps1d.comp
##.SOLVENT NAME= COFFEE_meoh
##.SHIFT REFERENCE= INTERNAL, COFFEE_meoh, 1, 14.96248
##AUDIT TRAIL= $$ (NUMBER, WHEN, WHO, WHERE, PROCESS, VERSION, WHAT)
$$ ##TITLE= Audit trail, TOPSPIN		Version 2.1
$$ ##JCAMPDX= 5.01
$$ ##ORIGIN= Bruker BioSpin GmbH
$$ ##OWNER= Administrator
$$ $$ C:\Bruker\TOPSPIN/data/COFFEE/nmr/AC1239_CCAAH12094_6610175_9lQ1fpr3CV/12/pdata/1/auditp.txt
$$ ##AUDIT TRAIL=  $$ (NUMBER, WHEN, WHO, WHERE, PROCESS, VERSION, WHAT)
(   1,<2012-08-02 13:10:25.500 -0500>,<Administrator>,<TOPSPIN>,<go>,<TOPSPIN 2.1>,
      <created by zg
	started at 2012-08-02 12:58:55.359 -0500,
	POWCHK enabled, PULCHK disabled,
       configuration hash MD5:
       6B 1B 68 BB D9 2E 58 E2 7F 35 AD 54 07 DF 0E 41
       data hash MD5: 64K
       32 58 D8 8C 16 B5 EE 79 E7 FF 4B 8D B6 76 EB E7>)
(   2,<2012-08-02 13:10:28.390 -0500>,<Administrator>,<TOPSPIN>,<proc1d>,<TOPSPIN 2.1>,
      <Start of raw data processing
       efp LB = 0.3 FT_mod = 6 PKNL = 1 PHC0 = 0 PHC1 = 0 SI = 128K 
       data hash MD5: 128K
       8F 90 23 23 98 9E AA 5F 6D 40 8F 6E 65 FC 36 41>)
(   3,<2012-08-02 13:10:29.453 -0500>,<Administrator>,<TOPSPIN>,<proc1d>,<TOPSPIN 2.1>,
      <pk PHC0 = 3.12561 PHC1 = 0 
       data hash MD5: 128K
       55 82 63 A7 CB 61 F3 F6 4C 51 BE A0 C9 65 DB AA>)
(   4,<2012-08-02 13:10:30.140 -0500>,<Administrator>,<TOPSPIN>,<proc1d>,<TOPSPIN 2.1>,
      <abs ABSG = 1 
       data hash MD5: 128K
       DA F5 81 CA 64 3A DE FF B2 12 0C C5 D0 27 94 0B>)
(   5,<2012-08-02 13:10:30.234 -0500>,<Administrator>,<TOPSPIN>,<proc1d>,<TOPSPIN 2.1>,
      <abs ABSG = 2 
       data hash MD5: 128K
       0B 42 BD EB ED C4 C9 D7 C2 70 AD 87 D7 B4 1B 3D>)
(   6,<2012-08-02 13:10:30.281 -0500>,<Administrator>,<TOPSPIN>,<proc1d>,<TOPSPIN 2.1>,
      <abs ABSG = 3 
       data hash MD5: 128K
       42 CC 67 AC DE 5A 28 85 50 A0 64 AE 77 BE 22 EB>)
(   7,<2012-08-02 13:10:30.359 -0500>,<Administrator>,<TOPSPIN>,<proc1d>,<TOPSPIN 2.1>,
      <abs ABSG = 4 
       data hash MD5: 128K
       17 15 E1 A2 45 01 38 2E 5A 9C 64 4D 44 35 FF F1>)
(   8,<2012-08-02 13:10:30.421 -0500>,<Administrator>,<TOPSPIN>,<proc1d>,<TOPSPIN 2.1>,
      <abs ABSG = 5 
       data hash MD5: 128K
       BD 11 95 E9 F9 FF 4E F1 D6 F3 52 46 F2 E0 8E C6>)
$$ ##END=
$$ 
$$ $$ hash MD5
$$ $$ C7 DE 7C 96 B3 F7 8B CB 7C D8 0E 5A B7 AB B4 60
##$RELAX= 
##$RELAX= 
##$RELAX= 
##$RELAX= 
##$RELAX= 
##$RELAX= 
##$RELAX= 
##$RELAX= 
$$ Bruker specific parameters
$$ [...]
150 150 150 150 150 150 150 150
##$TP07= 0
##$TPNAME0= <>
##$TPNAME1= <>
##$TPNAME2= <>
##$TPNAME3= <>
##$TPNAME4= <>
##$TPNAME5= <>
##$TPNAME6= <>
##$TPNAME7= <>
##$TPOAL= (0..7)
0.5 0.5 0.5 0.5 0.5 0.5 0.5 0.5
##$TPOFFS= (0..7)
0 0 0 0 0 0 0 0
##$TUNHIN= 0
##$TUNHOUT= 0
##$TUNXOUT= 0
##$USERA1= <user>
##$USERA2= <user>
##$USERA3= <user>
##$USERA4= <user>
##$USERA5= <user>
##$V9= 5
##$VALIST= <valist>
##$VCLIST= <CCCCCCCCCCCCCCC>
##$VD= 0
##$VDLIST= <DDDDDDDDDDDDDDD>
##$VPLIST= <PPPPPPPPPPPPPPP>
##$VTLIST= <TTTTTTTTTTTTTTT>
##$WBST= 1024
##$WBSW= 4
##$XGAIN= (0..3)
0 0 0 0
##$XL= 0
##$YL= 0
##$YMAX_a= 16457610
##$YMIN_a= -9248178
##$ZGOPTNS= <>
##$ZL1= 120
##$ZL2= 120
##$ZL3= 120
##$ZL4= 120
##$ABSF1= 14.96248
##$ABSF2= -5.595702
##$ABSG= 5
##$ABSL= 3
##$ALPHA= 0
##$AQORDER= 0
##$ASSFAC= 0
##$ASSFACI= 0
##$ASSFACX= 0
##$ASSWID= 0
##$AUNMP= <proc_prof1d_extract.lims>
##$AXLEFT= 0
##$AXNAME= <>
##$AXNUC= <1H>
##$AXRIGHT= 0
##$AXTYPE= 0
##$AXUNIT= <>
##$AZFE= 0.1
##$AZFW= 0.1
##$BCFW= 0
##$BC_mod= 0
##$BYTORDP= 0
##$COROFFS= 0
##$CY= 15
##$DATMOD= 1
##$DC= 0
##$DFILT= <>
##$DTYPP= 0
##$F1P= 0
##$F2P= 0
##$FCOR= 0.5
##$FTSIZE= 131072
##$FT_mod= 6
##$GAMMA= 0
##$GB= 0
##$INTBC= 1
##$INTSCL= 1
##$ISEN= 128
##$LB= 0.3
##$LEV0= 0
##$LPBIN= 0
##$MAXI= 10000
##$MC2= 0
##$MEAN= 0
##$ME_mod= 0
##$MI= 0
##$NCOEF= 0
##$NC_proc= -2
##$NLEV= 6
##$NOISF1= 0
##$NOISF2= 0
##$NSP= 0
##$NTH_PI= 0
##$NZP= 0
##$OFFSET= 14.96248
##$PC= 1
##$PHC0= 3.12561
##$PHC1= 0
##$PH_mod= 1
##$PKNL= yes
##$PPARMOD= 0
##$PPDIAG= 0
##$PPIPTYP= 0
##$PPMPNUM= 2147483647
##$PPRESOL= 1
##$PSCAL= 4
##$PSIGN= 0
##$PYNMP= <proc.py>
##$REVERSE= no
##$SF= 400.020009046079
##$SI= 131072
##$SIGF1= 0
##$SIGF2= 0
##$SINO= 400
##$SIOLD= 131072
##$SPECTYP= <>
##$SREGLST= <1H.CDCl3>
##$SSB= 0
##$STSI= 131072
##$STSR= 0
##$SW_p= 8223.68421052631
##$SYMM= 0
##$S_DEV= 0
##$TDeff= 65536
##$TDoff= 0
##$TI= <>
##$TILT= no
##$TM1= 0
##$TM2= 0
##$TOPLEV= 0
##$USERP1= <user>
##$USERP2= <user>
##$USERP3= <user>
##$USERP4= <user>
##$USERP5= <user>
##$WDW= 1
##$XDIM= 131072
##$YMAX_p= 434670498
##$YMIN_p= -24207
##$CURPLOT= <Network HP LaserJet P1505>
##$CURPRIN= <$Network HP LaserJet P1505>
##$DFORMAT= <normdp>
##$LAYOUT= <+/1D_H.xwp>
##$LFORMAT= <normlp>
##$PFORMAT= <normpl>
##$SURQMSG= 1
$$ End of Bruker specific parameters
$$ ---------------------------------
##NTUPLES= NMR SPECTRUM
##VAR_NAME=  FREQUENCY,     SPECTRUM/REAL,   SPECTRUM/IMAG
##SYMBOL=    X,             R,               I
##VAR_TYPE=  INDEPENDENT,   DEPENDENT,       DEPENDENT
##VAR_FORM=  AFFN,          ASDF,            ASDF
##VAR_DIM=   131072,        131072,          131072
##UNITS=     HZ,            ARBITRARY UNITS, ARBITRARY UNITS
##FACTOR=    0.0627417313425164, 1,          1
##FIRST=     8223.62146879497, -1352,        -57229
##LAST=      0,             80,              -58655
##MIN=       0,             -24207,          0
##MAX=       8223.62146879497, 434670498,    0
$$ Real data points
##PAGE= N=1
##DATA TABLE= (X++(R..R)), XYDATA
$$ [...]
$$ plain form
60973 11776031 13853364 16294182 18977637 21624971 23878258 25456802 26276702 26454527
60965 26454527 26226532 25868125 25643499 25745956 26209876 26854850 27339753 27317196 26585515
60956 26585515 25143603 23144897 20813501 18375007 16013118 13847333 11932586 10277945
60948 10277945 8869475 7683957 6694127 5872232 5193109 4634378 4175049 3795540 3478741
60939 3478741 3210254 2978222 2773819 2591276 2426576 2276495 2139076 2013767 1899988
60930 1899988 1796156 1700849 1614025 1535993 1465650 1400707 1339277 1280468 1223856 1169345 1117384
60919 1117384 1068524 1022819 980159 940875 905354 873297 844070 817588 794182 773672 755271
60908 755271 738478 723545 710901 700431 691428 683112 675289 668552 663539 659856 656245 652175 648738
$$ packed form
60973A1776031K077333K440818K683455K647334K253287J578544Q19900J77825
60965B6454527k27995l58407k24626J02457M63920O44974M84903k2557p31681
60956B6585515j441912j998706k331396k438494k361889k165785j914747j654641
60948A0277945j408470j185518r89830q21895o79123n58731m59329l79509l16799
60939C478741k68487k32032k04403j82543j64700j50081j37419j25309j13779
60930A899988j03832r5307q6824p8032p0343o4943o1430n8809n6612n4511n1961
60919A117384m8860m5705m2660l9284l5521l2057k9227k6482k3406k0510j8401
60908G55271j6793j4933j2644j0470r003q316p823o737n013l683l611m070l437
$$ plain form
60895 648738 647350 647949 649310 650968 653917 659141 666145 673412 679908 685675 691118 696202 700553 703996
60881 703996 706582 708031 707541 704511 699225 692395 684207 674434 663409 652112 641107 630207 619574
60868 619574 610268 602947 596704 590201 583607 578447 575662 574818 575207 576642 578912 581451 584182 588022 593875
60853 593875 601519 610043 619093 629135 640636 653540 667591 682772 699312 717404 736949 757423
60841 757423 777963 797598 815394 830489 842414 851441 858328 863477 866702 868041 868395 868822 869442 869567
60827 869567 868762 867199 864961 861723 857358 852335 847136 841679 835651 829105 822236 814757 806023 795770
60813 795770 784396 772473 760286 747933 735695 724143 713894 705155 697469 690058 682663 675878
60801 675878 670448 666395 663138 660392 658515 657927 658572 660115 662400 665545 669792 675386 682427 690749 700123
$$ packed form
60895F48738j388N99J361J658K949N224P004P267O496N767N443N084M351L443
60881G03996K586J449m90l030n286o830q188r773j1025j1297j1005j0900j0633
60868F19574r306p321o243o503o594n160k785q44L89J435K270K539K731L840N853
60853E93875P644Q524R050J0042J1501J2904J4051J5181J6540J8092J9545K0474
60841G57423K0540J9635J7796J5095J1925R027O887N149L225J339L54M27O20J25
60827H69567q05j563k238l238m365n023n199n457o028o546o869p479q734j0253
60813G95770j1374j1923j2187j2353j2238j1552j0249q739p686p411p395o785
60801F75878n430m053l257k746j877n88O45J543K285L145M247N594P041Q322R374
$$ plain form
60786 700123 710582 722316 735184 748711 762724 777578 793403 809379 824243 837508 849761
60775 849761 861690 873171 883541 892587 900917 909343 918138 926985 935454 943267 950217 956173 961236
60762 961236 965534 968709 970017 969310 967561 965919 964377 961958 958111 953377 948580 944009 939625 935533
60748 935533 931915 928844 926422 924709 923227 920891 916833 911058 904094 896381 888321 880486 873210 866214
60734 866214 859121 852204 846166 841303 837468 834779 833724 834339 835749 836926 837722 838899 841187 844515 848178
60719 848178 851565 854579 857360 859797 861502 862227 862084 861344 860203 858790 857172 855247 852820 849892 846750
60704 846750 843710 840885 838149 835160 831500 827142 822646 818498 814289 809064 802490 795098 787240 778488
60690 778488 768382 757123 745141 732610 719915 707966 697326 687471 677532 667464 657832 648846
$$ packed form
60786G00123J0459J1734J2868J3527J4013J4854J5825J5976J4864J3265J2253
60775H49761J1929J1481J0370R046Q330Q426Q795Q847Q469P813O950N956N063
60762I61236M298L175J308p07j749j642j542k419l847m734m797m571m384m092
60748I35533l618l071k422j713j482k336m058n775o964p713q060p835p276o996
60734H66214p093o917o038m863l835k689j055O15J410J177P96J177K288L328L663
60719H48178L387L014K781K437J705P25j43p40j141j413j618j925k427k928l142
60704H46750l040k825k736k989l660m358m496m148m209n225o574p392p858q752
60690G78488j0106j1259j1982j2531j2695j1949j0640r855r939j0068r632q986
$$ plain form
60678 648846 640450 633075 627384 623251 619863 616923 615005 614559 615292 616874 619611 624017 630066 637207 644832
60663 644832 652436 659562 665907 671502 676653 681721 686816 691585 695398 697970 699688 701131 702523 703978
60649 703978 706126 709941 715867 723369 731348 738757 745022 750302 755363 760899 766948 773198 779622 786469
60635 786469 793826 801706 810413 820271 830974 841756 852221 862579 873069 883603 893989 904016
60623 904016 913218 921033 927216 931690 934047 933763 930925 926210 920090 912660 904262 895544 886737 877613
60609 877613 868509 860685 855180 851888 850252 850245 851983 854758 857232 858510 858429 856896 853525 848067 840815
60594 840815 832445 823701 815271 807748 801592 797141 794567 793718 794132 795405 797518 800666 804751 809167 813130
60579 813130 816214 818591 820762 823014 825140 826714 827606 828222 829279 831328 834266 837253 839416 840738 841973
$$ packed form
60678F48846q396p375n691m133l388k940j918m46P33J582K737M406O049P141P625
60663F44832P604P126O345N595N151N068N095M769L813K572J718J443J392J455
60649G03978K148L815N926P502P979P409O265N280N061N536O049O250O424O847
60635G86469P357P880Q707R858J0703J0782J0465J0358J0490J0534J0386J0027
60623I04016R202P815O183M474K357k84k838m715o120p430q398q718q807r124
60609H77613r104p824n505l292j636pJ738K775K474J278q1j533l371n458p252
60594H40815q370q744q430p523o156m451k574q49M14J273K113L148M085M416L963
60579H13130L084K377K171K252K126J574Q92O16J057K049K938K987K163J322J235
$$ plain form
60564 841973 843458 844409 843755 841277 837477 832649 826815 820348 813867 807459 800713 793650 786997 781419 777048
60549 777048 773991 772684 773484 776351 781200 788071 796803 807032 818802 832710 849273 868726 891752
60536 891752 919752 953838 993843 1038569 1086406 1135151 1181693 1222628 1255162 1277187 1287010 1283831
60524 1283831 1268529 1243581 1212192 1177708 1143432 1112170 1085635 1064501 1049038 1039407 1035360 1035980
60512 1035980 1039956 1046036 1053292 1061130 1069232 1077562 1086390 1096131 1106915 1118486 1130805 1144714 1161654
60499 1161654 1182756 1208608 1239901 1277773 1323353 1377359 1440288 1512530 1594063 1684507 1783772
60488 1783772 1892327 2010759 2139756 2281156 2438875 2618582 2826726 3069912 3354257
60479 3354257 3683996 4059520 4475278 4917622 5363734 5783617 6145036 6418450 6579880
$$ packed form
60564H41973J485R51o54k478l800m828n834o467o481o408o746p063o653n578m371
60549G77048l057j307Q00K867M849O871Q732J0229J1770J3908J6563J9453K3026
60536H91752K8000L4086M0005M4726M7837M8745M6542M0935L2534K2025R823l179
60524A283831j5302k4948l1389l4484l4276l1262k6535k1134j5463r631m047O20
60512A035980L976O080P256P838Q102Q330Q828R741J0784J1571J2319J3909J6940
60499A161654K1102K5852L1293L7872M5580N4006O2929P2242Q1533R0444R9265
60488A783772J08555J18432J28997J41400J57719J79707K08144K43186K84345
60479C354257L29739L75524M15758M42344M46112M19883L61419K73414J61430
$$ plain form
60470 6579880 6613290 6514189 6292315 5969804 5575262 5137928 4684489 4237477 3813768 3423676
60460 3423676 3071725 2758652 2483336 2243842 2037487 1860542 1708573 1577587 1464825
60451 1464825 1368205 1285291 1213334 1150249 1095051 1047252 1006146 970663 939507 911430 885670
60440 885670 862130 840838 821243 802380 783664 765244 747663 731474 717107 704652 693732
60429 693732 683846 674843 666777 659506 652838 646907 641907 637523 633211 629053 625738 623515 621770 619937
60415 619937 618355 617838 618668 620336 622101 623583 624921 626454 628116 629229 629240 628671 628880 630713 633796 637399
60399 637399 641466 646393 652109 658003 663615 668941 674042 678822 683305 687746 692192 696115 698821 700229
60385 700229 701046 701998 702995 703212 702054 699825 697301 694811 692049 688780 685358 682357 679995 678138 676734
$$ packed form
60470F579880L3410r9101k21874l22511l94542m37334m53439m47012m23709l90092
60460C423676l51951l13073k75316k39494k06355j76945j51969j30986j12762
60451A464825r6620q2914p1957o3085n5198m7799m1106l5483l1156k8077k5760
60440H85670k3540k1292j9595j8863j8716j8420j7581j6189j4367j2455j0920
60429F93732r886r003q066p271o668n931n000m384m312m158l315k223j745j833
60415F19937j582n17Q30J668J765J482J338J533J662J113J1n69K09J833L083L603
60399F37399M067M927N716N894N612N326N101M780M483M441M446L923K706J408
60385G00229Q17R52R97K17j158k229k524k490k762l269l422l001k362j857j404
$$ plain form
60370 676734 675889 675533 675292 674813 674079 673349 672924 673043 673813 675091 676572 678190 680343 683435 687231 691035
60354 691035 694597 698476 703288 708989 715251 722186 730135 738903 747893 756996 766674 777029 787454 797537
60340 797537 807674 818287 828933 838828 847919 856755 865410 873196 879524 884632 889441 895157 903008
60327 903008 913880 927861 944289 962216 980581 998024 1012939 1023941 1030071 1030601 1025049 1013587
60315 1013587 997219 977441 955849 934035 913410 894862 878692 865001 853862 845019 837748 831383
60303 831383 825918 821795 819141 817453 816122 815099 814941 816168 818604 821419 823912 826222 829128 833149
60289 833149 838015 843087 848019 852780 857244 861190 864770 868491 872444 875820 877643 877940 877774 878102 878987
60274 878987 880122 881673 884161 887763 892143 896959 902220 908175 915211 923849 934499 947139 961469
$$ packed form
60370F76734q45l56k41m79p34p30m25J19P70J278J481J618K153L092L796L804
60354F91035L562L879M812N701O262O935P949Q768Q990R103R678J0355J0425J0083
60340G97537J0137J0613J0646R895R091Q836Q655P786O328N108M809N716P851
60327I03008J0872J3981J6428J7927J8365J7443J4915J1002O130N30n552j1462
60315A013587j6368j9778k1592k1814k0625j8548j6170j3691j1139q843p271o365
60303H31383n465m123k654j688j331j023j58J227K436K815K493K310K906M021
60289H33149M866N072M932M761M464L946L580L721L953L376J823K97j66L28Q85
60274H78987J135J551K488L602M380M816N261N955P036Q638J0650J2640J4330
$$ plain form
60261 961469 977358 994875 1014015 1034884 1058123 1084662 1114849 1148262 1184587 1224255 1268008
60250 1268008 1316310 1369533 1428390 1493730 1566051 1645549 1732533 1827521 1931053 2043505 2164835
60239 2164835 2294208 2429960 2570072 2712559 2855410 2996538 3133814 3264753 3386067
60230 3386067 3494242 3586997 3663731 3724151 3767090 3791333 3797150 3786209 3760245 3720648 3669310
60219 3669310 3609066 3543147 3474688 3406771 3342343 3283848 3233185 3191956 3161419 3142469 3136315
60208 3136315 3144951 3170201 3212234 3269805 3342133 3429763 3533224 3651552 3782540 3923685 4072131
60197 4072131 4224019 4374696 4519560 4654423 4775397 4879210 4963689 5027435 5068935 5086540
60187 5086540 5079560 5048969 4996658 4924368 4833951 4728564 4612900 4491881 4369470 4249073
$$ packed form
60261I61469J5889J7517J9140K0869K3239K6539L0187L3413L6325L9668M3753
60250A268008M8302N3223N8857O5340P2321P9498Q6984R4988J03532J12452J21330
60239B164835J29373J35752J40112J42487J42851J41128J37276J30939J21314
60230C386067J08175R2755P6734O0420M2939K4243N817j0941k5964l9597n1338
60219C669310o0244o5919o8459o7917o4428n8495n0663m1229l0537j8950o154
60208C136315Q636K5250M2033N7571P2328Q7630J03461J18328J30988J41145J48446
60197D072131J51888J50677J44864J34863J20974J03813Q4479O3746M1500J7605
60187E086540o980l0591n2311p2290r0417j05387j15664j21019j22411j20397
$$ plain form
60177 4249073 4134525 4029842 3938001 3860668 3799295 3755742 3731390 3726238 3739490 3770681 3819609
60166 3819609 3885363 3965994 4058932 4161034 4268112 4375044 4476681 4568660 4647600 4711124
60156 4711124 4757852 4787173 4799007 4794005 4773824 4740869 4697911 4648267 4596051 4545638 4500810
60145 4500810 4464703 4440243 4429919 4435224 4457036 4496503 4554854 4632453 4729120 4845865 4985429
60134 4985429 5150615 5342775 5562510 5811106 6090281 6400684 6741283 7109999 7504116
60125 7504116 7919882 8352114 8794344 9239105 9678149 10102795 10504396 10874755 11206536
60116 11206536 11493611 11730837 11913438 12036973 12098262 12096028 12030319 11901784 11712212 11465767
60106 11465767 11169148 10830652 10459703 10067192 9665160 9265185 8876946 8508322 8166274
$$ packed form
60177D249073j14548j04683r1841p7333o1373m3553k4352n152J3252L1191M8928
60166C819609O5754Q0631R2938J02102J07078J06932J01637R1979P8940O3524
60156D711124M6728K9321J1834n002k0181l2955m2958m9644n2216n0413m4828
60145D500810l6107k4460j0324N305K1812L9467N8351P7599R6667J16745J39564
60134D985429J65186J92160K19735K48596K79175L10403L40599L68716L94117
60125G504116M15766M32232M42230M44761M39044M24646M01601L70359L31781
60116A1206536K87075K37226J82601J23535O1289k234o5709j28535j89572k46445
60106A1465767k96619l38496l70949l92511m02032l99975l88239l68624l42048
$$ plain form
60097 8166274 7857033 7585573 7355383 7168729 7026695 6928937 6873866 6859405 6883350 6942820
60087 6942820 7033606 7150412 7287604 7439279 7598561 7757356 7907228 8040623 8151303 8234190
60077 8234190 8285477 8303132 8287036 8238453 8159555 8053390 7923726 7774224 7607520 7425348
60067 7425348 7229649 7023374 6810041 6592856 6374697 6158809 5948886 5748204 5559181
60058 5559181 5384230 5226534 5089191 4973623 4879549 4806719 4756070 4728879 4725423 4745099 4787506
60047 4787506 4852750 4940600 5049726 5177688 5321267 5476554 5638873 5802732 5961988 6110364
60037 6110364 6242099 6352317 6437125 6493801 6520943 6517991 6484521 6420448 6327131 6207730 6066218
60026 6066218 5906511 5732980 5551166 5367160 5186287 5012681 4849666 4699840 4565028
$$ packed form
60097H166274l09241k71460k30190j86654j42034r7758n5071j4461K3945N9470
60087F942820R0786J16806J37192J51675J59282J58795J49872J33395J10680Q2887
60077H234190N1287J7655j6096m8583p8898j06165j29664j49502j66704j82172
60067G425348j95699k06275k13333k17185k18159k15888k09923k00682j89023
60058E559181j74951j57696j37343j15568r4074p2830n0649k7191l456J9676M2407
60047D787506O5244Q7850J09126J27962J43579J55287J62319J63859J59256J48376
60037F110364J31735J10218Q4808N6676K7142k952l3470o4073r3317j19401j41512
60026F066218j59707j73531j81814j84006j80873j73606j63015j49826j34812
$$ plain form
60017 4565028 4446759 4346686 4266048 4205077 4163710 4142685 4143135 4165225 4208269 4272385 4359064
60006 4359064 4469654 4603917 4760498 4938069 5135257 5349588 5576864 5811167 6045072
59997 6045072 6270226 6478609 6663779 6821133 6947362 7039963 7097178 7118086 7102589 7051307
59987 7051307 6965530 6847435 6700551 6530039 6342419 6144977 5945212 5750194 5565823 5396552
59977 5396552 5245806 5116323 5009924 4927539 4870101 4838998 4834905 4856304 4900023 4963225 5044191
59966 5044191 5141179 5251489 5371982 5499762 5631887 5764956 5895510 6020517 6137173 6242637
59956 6242637 6334389 6410738 6470888 6514883 6543576 6558208 6559866 6549887 6531067 6507887 6485145 6466765
59944 6466765 6456334 6458327 6478183 6521326 6592522 6695956 6835327 7013722 7233628 7497160
$$ packed form
60017D565028j18269j00073q0638o0971m1367k1025M50K2090M3044O4116Q6679
60006D359064J10590J34263J56581J77571J97188K14331K27276K34303K33905
59997F045072K25154K08383J85170J57354J26229R2601N7215K0908j5497n1282
59987G051307q5777j18095j46884j70512j87620j97442j99765j95018j84371j69271
59977E396552j50746j29483j06399q2385n7438l1103m093K1399M3719O3202Q0966
59966E044191R6988J10310J20493J27780J32125J33069J30554J25007J16656J05464
59956F242637R1752P6349O0150M3995K8693J4632J658r979j8820k3180k2742j8380
59944F466765j0431J993J9856M3143P1196J03434J39371J78395K19906K63532
$$ plain form
59934 7497160 7806119 8161686 8563780 9010218 9496131 10013914 10553293 11100892 11639843
59925 11639843 12150516 12612170 13004296 13307561 13505588 13587704 13550855 13399439 13143963 12799737
59915 12799737 12385364 11920631 11424584 10914670 10406469 9913143 9444861 9008962 8610721
59906 8610721 8254035 7941697 7675304 7455088 7280119 7149197 7061641 7016984 7014008 7050666
59896 7050666 7125115 7236197 7382496 7561112 7767480 7995825 8239220 8489218 8735587 8966411
59886 8966411 9168685 9329637 9438228 9485956 9467061 9379131 9223960 9007380 8737829 8425179
59876 8425179 8080561 7716118 7343740 6973637 6613800 6270165 5946957 5647290 5373716
59867 5373716 5128012 4910461 4719893 4554607 4412762 4291789 4188187 4098291 4018836 3946613
$$ packed form
59934G497160L08959L55567M02094M46438M85913N17783N39379N47599N38951
59925A1639843N10673M61654L92126L03265J98027Q2116l6849j51416k55476l44226
59915A2799737m14373m64733m96047n09914n08201m93326m68282m35899l98241
59906H610721l56686l12338k66393k20216j74969j30922q7556m4657k976L6658
59896G050666P4449J11082J46299J78616K06368K28345K43395K49998K46369K30824
59886H966411K02274J60952J08591M7728j8895q7930j55171k16580k69551l12650
59876H425179l44618l64443l72378l70103l59837l43635l23208k99667k73574
59867E373716k45704k17551j90568j65286j41845j20973j03602q9896p9455p2223
$$ plain form
59857 3946613 3878320 3811281 3743961 3675647 3606414 3537763 3472466 3413033 3360668 3316018 3280076
59846 3280076 3253519 3235612 3224497 3218119 3214194 3209756 3201595 3187106 3164321 3131706 3088877 3037435
59834 3037435 2980388 2920737 2860929 2803164 2749396 2701074 2659421 2625703 2600620 2583676 2573924
59823 2573924 2571317 2576697 2590480 2611863 2639312 2671388 2707320 2747431 2793167 2846249 2907674 2977486
59811 2977486 3054860 3137649 3222044 3303457 3377973 3442824 3496027 3536411 3564067 3580156 3586141
59800 3586141 3583536 3574226 3560465 3544523 3528728 3515745 3508338 3508913 3519660 3542877 3580566 3633802
59788 3633802 3703145 3789796 3896054 4024888 4179629 4364025 4582021 4837391 5133900 5475408
59778 5475408 5864677 6301221 6779492 7287441 7804640 8301018 8739089 9080706 9295713
$$ packed form
59857C946613o8293o7039o7320o8314o9233o8651o5297n9433n2365m4650l5942
59846C280076k6557j7907j1115o378l925m438q161j4489k2785l2615m2829n1442
59834C037435n7047n9651n9808n7765n3768m8322m1653l3718k5083j6944r752
59823B573924k607N380J3783K1383K7449L2076L5932M0111M5736N3082O1425O9812
59811B977486P7374Q2789Q4395Q1413P4516O4851N3203M0384K7656J6089N985
59800C586141k605r310j3761j5942j5795j2983p407N75J0747K3217L7689N3236
59788C633802O9343Q6651J06258J28834J54741J84396K17996K55370K96509L41508
59778E475408L89269M36544M78271N07949N17199M96378M38071L41617K15007
$$ plain form
59769 9295713 9368641 9301158 9110140 8822583 8469577 8081278 7683551 7296114 6932253 6599923
59759 6599923 6303170 6043033 5818389 5627295 5467921 5338287 5235813 5157987 5103239 5070522
59749 5070522 5058294 5064754 5089072 5131563 5192614 5272068 5369740 5485858 5620915 5775698 5951518
59738 5951518 6149802 6371440 6617255 6889246 7190697 7524868 7894240 8301155 8748311
59729 8748311 9238137 9772278 10351937 10977791 11648476 12359040 13100971 13863155 14632342
59720 14632342 15393355 16130250 16828438 17476800 18069334 18606400 19095125 19548394 19982771
59711 19982771 20416264 20866424 21348575 21874220 22449948 23076954 23750897 24461701 25193444
59702 25193444 25924791 26630462 27283515 27857812 28330375 28683738 28907880 29000894 28968394 28822714
$$ packed form
59769I295713P2928o7483j91018k87557l53006l88299l97727l87437l63861l32330
59759F599923k96753k60137k24644j91094j59374j29634j02474p7826n4748l2717
59749E070522j2228O460K4318M2491O1051P9454R7672J16118J35057J54783J75820
59738E951518J98284K21638K45815K71991L01451L34171L69372M06915M47156
59729H748311M89826N34141N79659O25854O70685P10564P41931P62184P69187
59720A4632342P61013P36895O98188O48362N92534N37066M88725M53269M34377
59711A9982771M33493M50160M82151N25645N75728O27006O73943P10804P31743
59702B5193444P31347P05671O53053N74297M72563L53363K24142R3014l2500j45680
$$ plain form
59692 28822714 28582386 28270899 27914285 27538670 27168977 26828217 26536533 26310637 26164453
59683 26164453 26110017 26157372 26314192 26586580 26980379 27501100 28152456 28935243 29847038 30881301
59673 30881301 32025208 33257254 34545542 35846803 37106658 38262160 39246667 39996001
59665 39996001 40455227 40585751 40371252 39820181 38964012 37852459 36547149 35114694 33620333
59656 33620333 32123145 30672762 29306971 28050360 26914088 25895663 24978068 24130325
59648 24130325 23312351 22483629 21611845 20678504 19681135 18632229 17554700 16475219 15418527
59639 15418527 14404602 13447980 12557839 11738590 10990855 10312432 9699203 9146333 8649201
59630 8649201 8203253 7803453 7444757 7123265 6836257 6581077 6354710 6154546 5978712
$$ packed form
59692B8822714k40328l11487l56614l75615l69693l40760k91684k25896j46184
59683B6164453n4436M7355J56820K72388L93799N20721O51356P82787R11795J034263
59673C0881301J143907J232046J288288J301261J259855J155502R84507P49334
59665C9996001M59226J30524k14499n51071q56169j111553j305310j432455j494361
59656C3620333j497188j450383j365791j256611j136272j018425r17595q47743
59648B4130325q17974q28722q71784r33341r97369j048906j077529j079481j056692
59639A5418527j013925r56622q90141q19249p47735o78423o13229n52870m97132
59630H649201m45948l99800l58696l21492k87008k55180k26367k00164j75834
$$ plain form
59621 5978712 5825330 5692157 5577299 5479539 5397337 5328100 5268984 5217884 5172881 5131009 5088432
59610 5088432 5041905 4989529 4930007 4861764 4783295 4694316 4596196 4491171 4381350 4268696 4155694
59599 4155694 4045296 3939853 3840483 3747784 3662801 3586818 3520562 3464068 3417072 3379031 3349117
59588 3349117 3326877 3312734 3307167 3309570 3318503 3332917 3352314 3375820 3401927 3429306 3457160 3484685
59576 3484685 3510929 3535423 3558509 3580977 3603864 3628506 3656166 3687628 3723755 3766269 3817121
59565 3817121 3877177 3946421 4025480 4115890 4218730 4334072 4462224 4604605 4762977 4938693
59555 4938693 5133166 5348133 5584624 5842180 6119567 6415729 6729497 7058861 7400944
59546 7400944 7752159 8107917 8462693 8810934 9147673 9468290 9768602 10045994 10300005
$$ packed form
59621E978712j53382j33173j14858r7760q2202o9237n9116n1100m5003m1872m2577
59610E088432m6527n2376n9522o8243p8469q8979r8120j05025j09821j12654j13002
59599D155694j10398j05443r9370r2699q4983p5983o6256n6494m6996l8041k9914
59588C349117k2240j4143n567K403Q933J4414J9397K3506K6107K7379K7854K7525
59576C484685K6244K4494K3086K2468K2887K4642K7660L1462L6127M2514N0852
59565C817121O0056O9244P9059R0410J02840J15342J28152J42381J58372J75716
59555D938693J94473K14967K36491K57556K77387K96162L13768L29364L42083
59546G400944L51215L55758L54776L48241L36739L20617L00312K77392K54011
$$ plain form
59537 10300005 10531080 10738744 10921099 11075747 11201138 11297885 11369535 11422063 11462530 11498542
59527 11498542 11538583 11591482 11664468 11761833 11885296 12034337 12205006 12388719 12573005 12743589
59517 12743589 12885816 12985270 13028619 13004879 12906511 12730127 12476676 12150879 11760430 11315820
59507 11315820 10830258 10318250 9793304 9267015 8749780 8250952 7777613 7334120 6923418
59498 6923418 6547964 6208811 5904916 5634464 5396366 5189639 5012030 4860451 4732567
59489 4732567 4627132 4543033 4478883 4433535 4406319 4396873 4405188 4431601 4476245 4538771 4619142
59478 4619142 4718377 4837865 4978093 5138641 5319335 5520922 5744606 5991056 6259460 6547029
59468 6547029 6849353 7161226 7476592 7787537 8084019 8355102 8590141 8778795 8911186
$$ packed form
59537A0300005K31075K07664J82355J54648J25391R6747P1650N2528M0467L6012
59527A1498542M0041N2899P2986R7365J23463J49041J70669J83713J84286J70584
59517A2743589J42227R9454M3349k3740r8368j76384k53451l25797l90449m44610
59507A1315820m85562n12008n24946n26289n17235m98828m73339m43493m10702
59498F923418l75454l39153l03895k70452k38098k06727j77609j51579j27884
59489D732567j05435q4099o4150m5348k7216r446Q315K6413M4644O2526Q0371
59478D619142R9235J19488J40228J60548J80694K01587K23684K46450K68404K87569
59468F547029L02324L11873L15366L10945K96482K71083K35039J88654J32391
$$ plain form
59459 8911186 8979399 8979097 8909780 8774324 8578870 8332259 8044421 7725125 7384213 7031805
59449 7031805 6677089 6327129 5987385 5662599 5356187 5069421 4802478 4556059 4330980
59440 4330980 4126628 3941180 3773414 3623125 3489676 3371326 3266377 3174037 3093697 3024129
59430 3024129 2963951 2912406 2869249 2834233 2806990 2787035 2773607 2765797 2763016 2765066 2771536 2781460
59418 2781460 2793891 2808703 2826560 2848091 2873434 2902768 2936900 2976427 3019759 3062489 3099735
59407 3099735 3129407 3153073 3174203 3196624 3224342 3261196 3309682 3370873 3445847 3536094 3641620
59396 3641620 3759514 3885674 4018007 4157843 4309291 4478090 4670305 4890784 5142829
59387 5142829 5429741 5755991 6126098 6543063 7008827 7525394 8093843 8712088 9374369
$$ packed form
59459H911186O8213l02o9317j35456j95454k46611k87838l19296l40912l52408
59449G031805l54716l49960l39744l24786l06412k86766k66943k46419k25079
59440D330980k04352j85448j67766j50289j33449j18350j04949r2340q0340o9568
59430C024129o0178n1545m3157l5016k7243j9955j3428p810k781K050O470R924
59418B781460J2431J4812J7857K1531K5343K9334L4132L9527M3332M2730L7246
59407C099735K9672K3666K1130K2421K7718L6854M8486O1191P4974R0247J05526
59396C641620J17894J26160J32333J39836J51448J68799J92215K20479K52045
59387E142829K86912L26250L70107M16965M65764N16567N68449O18245O62281
$$ plain form
59378 9374369 10072326 10795025 11528001 12253977 12955755 13618650 14231134 14785101 15276605
59369 15276605 15705911 16076227 16392190 16658912 16881194 17062654 17205226 17308816 17370767
59360 17370767 17385894 17347911 17251367 17092712 16870858 16588179 16251159 15869496 15454553 15018645
59350 15018645 14574308 14131980 13697442 13271769 12853385 12439323 12025113 11605709 11177998
59341 11177998 10742278 10301100 9857400 9414330 8976272 8549052 8138743 7750167 7386342
59332 7386342 7049159 6740262 6460857 6210686 5987966 5790823 5618352 5469893 5344004
59323 5344004 5239048 5154262 5089220 5042364 5010958 4992439 4985147 4987851 4999264 5017992 5042275
59312 5042275 5069886 5098760 5127447 5154309 5176664 5191541 5197107 5192667 5177691 5151808 5115627 5070653
$$ packed form
59378I374369O97957P22699P32976P25976P01778O62895O12484N53967M91504
59369A5276605M29306L70316L15963K66722K22282J81460J42572J03590O1951
59360A7370767J5127l7983r6544j58655k21854k82679l37020l81663m14943m35908
59350A5018645m44337m42328m34538m25673m18384m14062m14210m19404m27711
59341A1177998m35720m41178m43700m43070m38058m27220m10309l88576l63825
59332G386342l37183l08897k79405k50171k22720j97143j72471j48459j25889
59323E344004j04956q4786o5042m6856l1406j8519p292K704J1413J8728K4283
59312E042275K7611K8874K8687K6862K2355J4877N566m440j4976k5883l6181m4974
$$ plain form
59300 5070653 5018539 4961137 4900999 4840834 4782625 4728112 4679751 4640122 4610586 4591666 4584548
59289 4584548 4590994 4611922 4647405 4698132 4765557 4850413 4952374 5071445 5208360 5363115 5534256
59278 5534256 5720141 5919711 6131349 6351814 6576896 6802099 7021855 7228674 7413891
59269 7413891 7569325 7688504 7767537 7805698 7805005 7769048 7702359 7610350 7498499 7371093 7231408
59258 7231408 7083084 6930187 6775436 6619335 6461620 6302985 6145056 5989496 5837702
59249 5837702 5690859 5549997 5416432 5292199 5179363 5078873 4991006 4916984 4859098 4819076
59239 4819076 4797525 4795451 4815185 4859274 4929569 5028105 5157857 5321708 5521437 5758574 6035528
59228 6035528 6354941 6718187 7124761 7572012 8054161 8561596 9081490 9598699 10095776
$$ packed form
59300E070653n2114n7402o0138o0165n8209n4513m8361l9629k9536j8920p118
59289D584548O446K0928L5483N0727O7425Q4856J01961J19071J36915J54755J71141
59278E534256J85885J99570K11638K20465K25082K25203K19756K06819J85217
59269G413891J55434J19179P9033L8161o93l5957o6689r2009j11851j27406j39685
59258G231408j48324j52897j54751j56101j57715j58635j57929j55560j51794
59249E837702j46843j40862j33565j24233j12836j00490q7867p4022n7886m0022
59239D819076k1551k074J9734M4089P0295R8536J29752J63851J99729K37137K76954
59228F035528L19413L63246M06574M47251M82149N07435N19894N17209M97077
$$ plain form
59219 10095776 10553167 10950799 11270074 11494995 11613087 11616890 11505039 11281920 10956883 10544036
59209 10544036 10061648 9530132 8969583 8398333 7832307 7284570 6765281 6281968 5839247
59200 5839247 5438258 5077416 4754478 4467692 4215040 3993551 3799989 3631474 3485015
59191 3485015 3357338 3245852 3149015 3065133 2991679 2926518 2868947 2818667 2774544 2735422 2701534
59180 2701534 2673943 2652906 2637696 2627656 2622413 2621347 2623874 2630251 2641368 2657704 2679049 2705129
59168 2705129 2735987 2771873 2813245 2860610 2913984 2972808 3036698 3105711 3179399 3256323 3335156
59157 3335156 3415568 3497091 3577694 3654603 3726174 3791775 3850044 3898503 3935097 3959170 3970719
59146 3970719 3969705 3956529 3932484 3899229 3858231 3810970 3759243 3704910 3649590 3594814 3542229
$$ packed form
59219A0095776M57391L97632L19275K24921J18092L803j11851k23119l25037m12847
59209A0544036m82388n31516n60549n71250n66026n47737n19289m83313m42721
59200E839247m00989l60842l22938k86786k52652k21489j93562j68515j46459
59191C485015j27677j11486r6837q3882p3454o5161n7571n0280m4123l9122l3888
59180B701534k7591k1037j5210j0040n243j066K527O377J1117J6336K1345K6080
59168B705129L0858L5886M1372M7365N3374N8824O3890O9013P3688P6924P8833
59157C335156Q0412Q1523Q0603P6909P1571O5601N8269M8459L6594K4073J1549
59146C970719j014j3176k4045l3255m0998m7261n1727n4333n5320n4776n2585
$$ plain form
59135 3542229 3493453 3449876 3412687 3382927 3361451 3348937 3345972 3353118 3370969 3400175 3441276 3494478
59123 3494478 3559861 3637913 3729648 3836077 3957749 4094774 4246933 4413863 4595621 4793156
59113 4793156 5007681 5239464 5487810 5752269 6032916 6328899 6637353 6954072 7274155
59104 7274155 7590931 7894723 8173748 8416240 8611305 8748648 8819331 8817881 8743718 8600718
59094 8600718 8395864 8138131 7837681 7505197 7151357 6786227 6418409 6054559 5699746
59085 5699746 5358026 5032557 4725555 4438635 4172988 3928892 3705290 3500377 3312687
59076 3312687 3141439 2986022 2845508 2718569 2603602 2498985 2403482 2316451 2237655 2166998
59066 2166998 2104329 2049055 1999861 1955262 1914692 1878771 1848279 1823191 1802818 1786431 1773445
$$ packed form
59135C542229m8776m3577l7189k9760k1476j2514k965P146J7851K9206M1101N3202
59123C494478O5383P8052R1735J06429J21672J37025J52159J66930J81758J97535
59113D793156K14525K31783K48346K64459K80647K95983L08454L16719L20083
59104G274155L16776L03792K79025K42492J95065J37343P0683j450p4163j43000
59094H600718k04854k57733l00450l32484l53840l65130l67818l63850l54813
59085E699746l41720l25469l07002k86920k65647k44096k23602k04913j87690
59076C312687j71248j55417j40514j26939j14967j04617r5503q7031p8796p0657
59066B166998o2669n5274m9194m4599m0570l5921l0492k5088k0373j6387j2986
$$ plain form
59055 1773445 1763309 1755485 1749323 1743799 1737682 1729989 1719868 1706122 1687511 1663806 1635962 1605129
59043 1605129 1572119 1538090 1504872 1474047 1446218 1421604 1400693 1383748 1370273 1359645 1351908
59032 1351908 1347450 1346329 1348468 1354087 1363297 1375595 1390319 1407257 1426142 1445694 1463747 1478361
59020 1478361 1488650 1494777 1497525 1497755 1496026 1492824 1489080 1485979 1484208 1483948 1485727 1490553 1498910 1510210
59006 1510210 1523563 1538437 1554130 1569375 1583064 1594920 1604931 1612607 1617232 1618496 1616497 1611586
58994 1611586 1604507 1596163 1587036 1577418 1568398 1561664 1557946 1556468 1556412 1557973 1561445 1566297 1571931 1578504
58980 1578504 1586185 1594528 1603456 1614022 1627072 1641894 1657301 1673464 1691563 1712074 1734618 1759183
58968 1759183 1786363 1816485 1849390 1884949 1922951 1962709 2003537 2045421 2088522 2132259 2175643
$$ packed form
59055A773445j0136p824o162n524o117p693j0121j3746j8611k3705k7844l0833
59043A605129l3010l4029l3218l0825k7829k4614k0911j6945j3475j0628p737
59032A351908m458j121K139N619R210J2298J4724J6938J8885J9552J8053J4614
59020A478361J0289O127K748K30j729l202l744l101j771k60J779M826Q357J1300
59006A510210J3353J4874J5693J5245J3689J1856J0011P676M625J264j999m911
58994A611586p079q344r127r618r020o734l718j478n6J561L472M852N634O573
58980A578504P681Q343Q928J0566J3050J4822J5407J6163J8099K0511K2544K4565
58968A759183K7180L0122L2905L5559L8002L9758M0828M1884M3101M3737M3384
$$ plain form
58957 2175643 2218216 2259933 2300448 2339300 2376684 2413420 2450468 2489036 2530716 2576685 2627087
58946 2627087 2681844 2741738 2808018 2881360 2961915 3049934 3145682 3249225 3361153 3483024 3616233
58935 3616233 3760907 3916787 4084789 4266814 4464422 4678724 4911234 5163891 5438512
58926 5438512 5737146 6062743 6418566 6807160 7230623 7691532 8192790 8736955 9326597
58917 9326597 9964809 10654174 11395187 12186197 13024036 13903193 14814150 15743018 16672088
58908 16672088 17579463 18438571 19219695 19893133 20431597 20811771 21016492 21037053 20873901
58899 20873901 20536099 20040901 19412532 18678783 17867287 17004191 16114265 15219752 14338585
58890 14338585 13484608 12669092 11900718 11184343 10521415 9911904 9354875 8847613 8385936
$$ packed form
58957B175643M2573M1717M0515L8852L7384L6736L7048L8568M1680M5969N0402
58946B627087N4757N9894O6280P3342Q0555Q8019R5748J03543J11928J21871J33209
58935C616233J44674J55880J68002J82025J97608K14302K32510K52657K74621
58926E438512K98634L25597L55823L88594M23463M60909N01258N44165N89642
58917I326597O38212O89365P41013P91010Q37839Q79157R10957R28868R29070
58908A6672088R07375Q59108P81124O73438N38464L80174K04721K0561j63152
58899B0873901l37802m95198o28369p33749q11496q63096q89926q94513q81167
58890A4338585q53977q15516p68374p16375o62928o09511n57029n07262m61677
$$ plain form
58881 8385936 7965860 7583970 7236152 6917262 6622451 6347974 6090725 5848097 5618479
58872 5618479 5400990 5194740 4999256 4815378 4644459 4486682 4341240 4207877 4086742
58863 4086742 3976720 3875558 3782042 3696646 3619660 3550161 3487462 3432201 3385149 3345928 3313716
58852 3313716 3288340 3269935 3258206 3252747 3253581 3260925 3274877 3295670 3323737 3359253 3402008 3451853
58840 3451853 3508783 3572615 3643198 3720966 3806664 3900576 4002775 4114102 4236141 4370207
58830 4370207 4517023 4677279 4851789 5041286 5246987 5471256 5716845 5985628 6278983
58821 6278983 6599233 6949689 7333481 7753534 8213641 8718221 9270644 9872650 10525380
58812 10525380 11229752 11985357 12789497 13636794 14518180 15419602 16322238 17203849 18039178
$$ packed form
58881H385936m20076l81890l47818l18890k94811k74477k57249k42628k29618
58872E618479k17489k06250j95484j83878j70919j57777j45442j33363j21135
58863D086742j10022j01162r3516q5396p6986o9499o2699n5261m7052l9221l2212
58852C313716k5376j8405j1729n459Q34P344J3952K0793K8067L5516M2755M9845
58840C451853N6930O3832P0583P7768Q5698R3912J02199J11327J22039J34066
58830D370207J46816J60256J74510J89497K05701K24269K45589K68783K93355
58821F278983L20250L50456L83792M20053M60107N04580N52423O02006O52730
58812A0525380P04372P55605Q04140Q47297Q81386R01422R02636Q81611Q35329
$$ plain form
58803 18039178 18799736 19455351 19977535 20342288 20531934 20537384 20359995 20010681 19507042 18871626
58793 18871626 18131325 17315056 16450035 15559988 14665798 13785379 12932069 12114464 11338434
58784 11338434 10608309 9926161 9291708 8703808 8161133 7661339 7201178 6778098 6390538
58775 6390538 6036250 5711694 5413595 5139720 4887572 4653742 4435361 4231066 4039845
58766 4039845 3860165 3690996 3532618 3385510 3249226 3122889 3005914 2897723 2797685
58757 2797685 2705801 2622516 2547381 2478834 2415695 2357931 2305644 2258354 2215613 2177199 2142387
58746 2142387 2110179 2080584 2054433 2031545 2010451 1990404 1972295 1956918 1943533 1930803 1917985
58735 1917985 1904608 1890206 1875012 1859876 1844889 1829165 1812336 1794991 1777184 1757875 1736398
$$ packed form
58803A8039178P60558O55615N22184L64753J89646N450j77389l49314n03639o35416
58793A8871626p40301q16269q65021q90047q94190q80419q53310q17605p76030
58784A1338434p30125o82148o34453n87900n42675m99794m60161m23080l87560
58775F390538l54288l24556k98099k73875k52148k33830k18381k04295j91221
58766D039845j79680j69169j58378j47108j36284j26337j16975j08191j00038
58757B797685r1884q3285p5135o8547o3139n7764n2287m7290m2741l8414l4812
58746B142387l2208k9595k6151k2888k1094k0047j8109j5377j3385j2730j2818
58735A917985j3377j4402j5194j5136j4987j5724j6829j7345j7807j9309k1477
$$ plain form
58724 1736398 1713155 1688279 1661059 1631329 1599991 1567510 1533372 1497779 1462368 1428259 1394878
58713 1394878 1361641 1329421 1299211 1270689 1243310 1217644 1194488 1173635 1154553 1137239 1121510
58702 1121510 1106492 1091803 1078242 1066507 1056218 1046920 1038826 1031848 1025273 1019246 1015096 1013170 1011800
58689 1011800 1009531 1006864 1004529 1001536 996495 989601 981698 972455 961137 948361 935534 923201 911310
58676 911310 900513 891873 885725 881785 879763 879026 878460 877574 876922 876721 876226 875412 875998 879525 885410 892013
58660 892013 898448 904144 907834 908624 907358 905649 904214 903260 903539 905794 909931 915782 923856 934301 946083
58645 946083 958219 970841 984104 997328 1010308 1024196 1039881 1056857 1075015 1096096 1121831
58634 1121831 1151952 1185672 1223754 1267258 1315511 1367408 1423764 1486420 1555891 1631925 1715665
$$ packed form
58724A736398k3243k4876k7220k9730l1338l2481l4138l5593l5411l4109l3381
58713A394878l3237l2220l0210k8522k7379k5666k3156k0853j9082j7314j5729
58702A121510j5018j4689j3561j1735j0289r298q094o978o575o027m150j926j370
58689A011800k269k667k335k993n041o894p903r243j1318j2776j2827j2333j1891
58676I11310j0797q640o148l940k022p37n66q86o52k01m95q14N86L527N885O603
58660H92013O435N696L690P90j266j709j435r54K79K255M137N851Q074J0445J1782
58645I46083J2136J2622J3263J3224J2980J3888J5685J6976J8158K1081K5735
58634A121831L0121L3720L8082M3504M8253N1897N6356O2656O9471P6034Q3740
$$ plain form
58623 1715665 1809257 1913884 2030070 2159392 2304058 2465138 2642841 2837910 3051068 3281616
58613 3281616 3528226 3790330 4066575 4351864 4637290 4912324 5165436 5383474 5553253
58604 5553253 5664873 5713052 5696237 5616430 5479859 5296095 5075920 4830303 4570271 4305869
58594 4305869 4044975 3793601 3556350 3335524 3130879 2941882 2769562 2614993 2477233
58585 2477233 2354481 2246221 2152407 2071521 2001504 1941754 1892142 1850816 1815155 1784289 1758387
58574 1758387 1735894 1713738 1690036 1664450 1636240 1604361 1569594 1534369 1500139 1466726 1434290
58563 1434290 1404010 1376501 1351203 1327558 1305277 1283400 1260667 1237021 1213492 1190749 1169066
58552 1169066 1149414 1133014 1119925 1109355 1100950 1094389 1088290 1081251 1073549 1066118 1058326 1048577 1036685
$$ packed form
58623A715665R3592J04627J16186J29322J44666J61080J77703J95069K13158K30548
58613C281616K46610K62104K76245K85289K85426K75034K53112K18038J69779
58604E553253J11620M8179j6815p9807j36571j83764k20175k45617k60032k64402
58594D305869k60894k51374k37251k20826k04645j88997j72320j54569j37760
58585B477233j22752j08260r3814q0886p0017n9750m9612m1326l5661l0866k5902
58574A758387k2493k2156k3702k5586k8210l1879l4767l5225l4230l3413l2436
58563A434290l0280k7509k5298k3645k2281k1877k2733k3646k3529k2743k1683
58552A169066j9652j6400j3089j0570q405o561o099p039p702p431p792r749j1892
$$ plain form
58539 1036685 1023733 1009969 994828 978750 963000 947849 932790 918277 905321 893635 882143
58528 882143 871057 861337 852337 842270 830993 820097 810071 799587 787894 775883 764454 753687
58516 753687 743933 735897 729340 723338 717942 713947 711113 708443 706128 705250 705602 705876 706105 707782 711322
58501 711322 715445 719376 723719 728888 734576 741035 748899 757404 764739 770567 776448 783497 791400 799836
58487 799836 808923 818019 826092 833575 841919 850937 858564 863557 866467 867599 866097 861709 855575 848558
58473 848558 840421 831128 821357 811225 800051 787786 775350 763397 752135 742261 734470 728123 722072
58460 722072 716538 712426 709192 705554 701921 699763 698700 696787 693720 691167 689687 687940 685452 683635
58446 683635 683439 684294 685992 689383 694521 700241 706157 713186 721653 730877 740940 752683 765609 777894
$$ packed form
58539A036685j2952j3764j5141j6078j5750j5151j5059j4513j2956j1686j1492
58528H82143j1086r720r000j0067j1277j0896j0026j0484j1693j2011j1429j0767
58516G53687r754q036o557o002n396l995k834k670k315q78L52K74K29J677L540
58501G11322M123L931M343N169N688O459P864Q505P335N828N881P049P903Q436
58487G99836R087R096Q073P483Q344R018P627M993K910J132j502m388o134p017
58473H48558q137r293r771j0132j1174j2265j2436j1953j1262r874p791o347o051
58460G22072n534m112l234l638l633k158j063j913l067k553j480j747k488j817
58446F83635j96Q55J698L391N138N720N916P029Q467R224J0063J1743J2926J2285
$$ plain form
58432 777894 788737 798670 807427 813868 818147 821570 824193 825120 825215 826702 829691 831889 832230 831988 831829
58417 831829 830750 828610 826782 825510 823427 820573 819015 819551 820620 821470 823560 827732 832701 837493 842712
58402 842712 848301 852610 854810 855761 855580 852986 847947 842312 836918 830810 824190 819086 816013 812996 809152
58387 809152 806274 805591 805930 806477 808450 812526 817406 822431 828913 837510 846945 856584 867434 879346
58373 879346 890129 898853 907202 916312 925204 933457 942274 951623 959713 966581 974652 984171 991840 995901
58359 995901 998961 1003717 1009470 1015117 1021977 1030963 1040140 1047772 1054962 1062881 1070227 1075725 1080299 1084507
58345 1084507 1086754 1086254 1084854 1083836 1081951 1078709 1076352 1076296 1076860 1076862 1078158 1082236 1087644 1093280 1100847 1111413
58329 1111413 1122910 1133694 1145309 1159089 1173423 1187047 1201546 1217868 1233889 1248271 1263050
$$ packed form
58432G77894J0843R933Q757O441M279L423K623R27R5J487K989K198L41k42j59
58417H31829j079k140j828j272k083k854j558N36J069Q50K090M172M969M792N219
58402H42712N589M309K200R51j81k594n039n635n394o108o620n104l073l017l844
58387H09152k878o83L39N47J973M076M880N025O482Q597R435R639J0850J1912
58373H79346J0783Q724Q349R110Q892Q253Q817R349Q090O868Q071R519P669M061
58359I95901L060M756N753N647O860Q986R177P632P190P919P346N498M574M208
58345A084507K247n00j400j018j885l242k357n6N64KJ296M078N408N636P567J0566
58329A111413J1497J0784J1615J3780J4334J3624J4499J6322J6021J4382J4779
$$ plain form
58318 1263050 1279481 1295166 1308471 1321953 1337933 1354429 1368998 1382867 1397472 1410532 1419703
58307 1419703 1426836 1434633 1442128 1447360 1451536 1456723 1462319 1467430 1473815 1483047 1493728 1504740 1517886
58294 1517886 1534116 1550869 1566532 1583557 1603591 1623694 1641340 1658960 1679334 1700680 1720671
58283 1720671 1741154 1764426 1788980 1813521 1840877 1873206 1907677 1941810 1978729 2021912 2069020
58272 2069020 2116132 2163719 2213108 2261516 2306271 2349687 2394283 2437660 2477685 2517961 2562293
58261 2562293 2608587 2654254 2702460 2756630 2813919 2870914 2930554 2996445 3065671 3134667 3206880
58250 3206880 3286916 3372320 3458974 3549313 3647132 3749743 3853542 3961782 4078288 4199387
58240 4199387 4320920 4447136 4583433 4726766 4872980 5026919 5194850 5373826 5559544
$$ packed form
58318A263050J6431J5685J3305J3482J5980J6496J4569J3869J4605J3060R171
58307A419703P133P797P495N232M176N187N596N111O385R232J0681J1012J3146
58294A517886J6230J6753J5663J7025K0034K0103J7646J7620K0374K1346J9991
58283A720671K0483K3272K4554K4541K7356L2329L4471L4133L6919M3183M7108
58272B069020M7112M7587M9389M8408M4755M3416M4596M3377M0025M0276M4332
58261B562293M6294M5667M8206N4170N7289N6995N9640O5891O9226O8996P2213
58250C206880Q0036Q5404Q6654R0339R7819J02611J03799J08240J16506J21099
58240D199387J21533J26216J36297J43333J46214J53939J67931J78976J85718
$$ plain form
58231 5559544 5757531 5974736 6207346 6449429 6706288 6986112 7286097 7600967 7937628
58222 7937628 8306550 8706358 9132497 9592945 10098701 10647263 11233489 11868396 12568539
58213 12568539 13336165 14170383 15088539 16114779 17257914 18524838 19945594 21560086
58205 21560086 23392843 25470651 27853212 30615468 33815412 37517792 41836604 46917209
58197 46917209 52902255 59974610 68423818 78620729 90962017 105927765 124176663
58190 124176663 146488511 173629160 206334818 245158866 289624342 336889408 381257025
58183 381257025 415623150 434210724 434670498 418327615 389006540 351560821 310707903
58176 310707903 270219435 232526919 198829846 169508411 144484958 123415573 105828567
$$ packed form
58231E559544J97987K17205K32610K42083K56859K79824K99985L14870L36661
58222G937628L68922L99808M26139M60448N05756N48562N86226O34907P00143
58213A2568539P67626Q34218R18156J026240J143135J266924J420756J614492
58205B1560086J832757K077808K382561K762256L199944L702380M318812N080605
58197D6917209N985046P072355Q449208J0196911J2341288J4965748J8248898
58190A24176663K2311848K7140649L2705658L8824048M4465476M7265066M4367617
58183C81257025L4366125J8587574M59774j6342883k9321075l7445719m0852918
58176C10707903m0488468l7692516l3697073k9321435k5023453k1069385j7587006
$$ plain form
58169 105828567 91252361 79258086 69433825 61398256 54855101 49592436 45429617 42211581
58161 42211581 39853800 38338271 37655239 37798039 38814253 40759289 43491412 46498337
58153 46498337 48984423 50194869 49726387 47620644 44246848 40109625 35694744 31383559
58145 31383559 27420572 23918558 20893956 18315631 16139033 14314170 12785078 11498654
58137 11498654 10414404 9500945 8727869 8068020 7503270 7019576 6598823 6222778 5881990
58128 5881990 5572810 5287910 5017501 4757910 4511176 4277638 4056095 3849490 3662666
58119 3662666 3495149 3342730 3204871 3083770 2977450 2880548 2790817 2708051 2627787 2543325
58109 2543325 2453743 2363554 2274983 2186908 2100791 2020857 1948104 1879983 1816032 1758174 1705606
$$ packed form
58169A05828567j4576206j1994275r824261q035569o543155n262665m162819l218036
58161D2211581k357781j515529o83032J42800J016214J945036K732123L006925
58153D6498337K486086J210446m68482k105743l373796m137223m414881m311185
58145C1383559l962987l502014l024602k578325k176598j824863j529092j286424
58137A1498654j084250r13459p73076o59849n64750m83694m20753l76045l40788
58128E881990l09180k84900k70409k59591k46734k33538k21543k06605j86824
58119C662666j67517j52419j37859j21101j06320r6902q9731q2766q0264q4462
58109B543325q9582r0189q8571q8075q6117p9934p2753o8121o3951n7858n2568
$$ plain form
58098 1705606 1655111 1606487 1562402 1523021 1486027 1451615 1422007 1396102 1370000 1342786 1316714
58087 1316714 1291896 1266126 1239869 1215983 1194173 1170943 1145384 1119981 1095398 1069584 1042643
58076 1042643 1017569 995251 973436 951436 931427 914227 898106 882646 869522 858561 847060
58065 847060 833997 821272 810120 799970 791344 785919 782923 779141 773159 766105 757858 746496 732274
58052 732274 718259 705963 693867 681164 669418 659539 650485 642070 635840 632042 628693 624601 620542
58039 620542 616729 612066 606715 602608 600602 599759 599887 601949 605476 608512 610709 613519 616829 618440 617601
58024 617601 616126 615194 613942 611958 610299 609163 607330 604736 602926 602103 600423 597087 593496 590549 587420
58009 587420 583844 580867 578370 574442 568331 561587 555338 548791 541485 534588 528826 523197 516679 509212
$$ packed form
58098A705606n0495m8624m4085l9381l6994l4412k9608k5905k6102k7214k6072
58087A316714k4818k5770k6257k3886k1810k3230k5559k5403k4583k5814k6941
58076A042643k5074k2318k1815k2000k0009j7200j6121j5460j3124j0961j1501
58065H47060j3063j2725j1152j0150q626n425k996l782n982p054q247j1362j4222
58052G32274j4015j2296j2096j2703j1746r879r054q415o230l798l349m092m059
58039F20542l813m663n351m107k006q43J28K062L527L036K197K810L310J611q39
58024F17601j475r32j252j984j659j136j833k594j810q23j680l336l591k947l129
58009E87420l576k977k497l928o111o744o249o547p306o897n762n629o518p467
$$ plain form
57995 509212 500272 488743 475210 462407 452538 445906 442457 442361 444483 446718 448734 452214 457717 463583
57981 463583 468718 474072 480387 486674 492008 496867 501717 506155 510251 514854 519838 523888 526592 528759
57967 528759 530192 529374 526084 522053 518264 513834 508417 503416 499741 496449 492593 488467 484080 478447
57953 478447 471433 464422 458238 452240 446308 441728 439230 438071 437883 439372 442364 445298 447630 450690
57939 450690 455202 460024 464303 468654 473059 475837 476086 475135 474245 472733 469610 465121 459384 451488 441425
57924 441425 431028 421580 412226 402248 393071 386427 382105 379121 377644 378265 380701 384580 390173 397126
57910 397126 403883 409634 415433 422311 429863 437725 446550 456062 464012 468739 471313 473534 475386 476114
57896 476114 476280 476878 477566 477526 477002 476447 475223 472676 469356 465746 460977 454368 447082 440656 434913 428890
$$ packed form
57995E09212q940j1529j3533j2803r869o632l449r6K122K235K016L480N503N866
57981D63583N135N354O315O287N334M859M850M438M096M603M984M050K704K167
57967E28759J433q18l290m031l789m430n417n001l675l292l856m126m387n633
57953D78447p014p011o184n998n932m580k498j159j88J489K992K934K332L060
57939D50690M512M822M279M351M405K778K49r51q90j512l123m489n737p896j0063
57924D41425j0397r448r354r978r177o644m322k984j477O21K436L879N593O953
57910C97126O757N751N799O878P552P862Q825R512P950M727K574K221J852P28
57896D76114J66N98O88m0n24n55j224k547l320l610m769o609p286o426n743o023
$$ plain form
57880 428890 422743 417195 412049 406877 402329 399256 397343 395955 395335 395642 395946 395693 396193 399025 403878
57865 403878 409445 415488 422367 429410 435547 440888 446145 451114 455253 459089 463451 467827 470933 472446
57851 472446 472846 472141 470084 467106 463778 459962 455675 451962 449486 447054 442995 437333 431212 424986 418499
57836 418499 412543 408237 405370 402879 400574 398869 397268 394733 391198 387256 382674 376783 370002 363463
57822 363463 357318 350849 343989 337253 330414 322770 314628 307101 300504 294344 288746 284435 281258 278111
57808 278111 274483 270899 267831 265345 263800 263660 264496 265284 265818 266866 268991 272200 276594 282187 288084
57793 288084 292960 296430 299043 301098 302600 304272 307331 312020 317387 322626 327707 332642 337146 341130
57779 341130 344657 347290 348324 347633 345494 341791 336386 330164 324519 319764 315178 310690 307350 305843
$$ packed form
57880D28890o147n548n146n172m548l073j913j388o20L07L04k53N00K832M853
57865D03878N567O043O879P043O137N341N257M969M139L836M362M376L106J513
57851D72446M00p05k057k978l328l816m287l713k476k432m059n662o121o226o487
57836D18499n956m306k867k491k305j705j601k535l535l942m582n891o781o539
57822C63463o145o469o860o736o839p644q142p527o597o160n598m311l177l147
57808B78111l628l584l068k486j545j40Q36P88N34J048K125L209M394N593N897
57793B88084M876L470K613K055J502J672L059M689N367N239N081M935M504L984
57779C41130L527K633J034o91k139l703n405o222n645m755m586m488l340j507
$$ plain form
57765 305843 305640 306080 307333 309796 313265 317208 321391 325841 330549 335379 339863 343152 344671 344860 344748
57750 344748 344820 344828 344621 344494 344698 345222 346137 347631 349675 352097 354974 358572 362978 368159 374138 380680 387112
57733 387112 392937 398272 403164 406924 408908 409653 410423 411841 413755 416297 420223 426222 434602 445661
57719 445661 459699 476539 495450 515550 536079 556590 577276 598720 620921 643121 665129
57708 665129 688207 713908 742523 773482 806811 843292 883575 928042 977285 1032005 1092714
57697 1092714 1160269 1236177 1321580 1416486 1521023 1637047 1767481 1914496 2079332 2263447
57687 2263447 2468468 2695067 2942732 3210090 3494001 3788270 4084165 4371847 4640196
57678 4640196 4876035 5065948 5200092 5274227 5289101 5249964 5166978 5054165 4926552 4798016
$$ packed form
57765C05843k03M40J253K463L469L943M183M450M708M830M484L289J519J89j12
57750C44748P2Qk07j27K04N24R15J494K044K422K877L598M406N181N979O542O432
57733C87112N825N335M892L760J984P45P70J418J914K542L926N999Q380J1059
57719D45661J4038J6840J8911K0100K0529K0511K0686K1444K2201K2200K2008
57708F65129K3078K5701K8615L0959L3329L6481M0283M4467M9243N4720O0709
57697A092714O7555P5908Q5403R4906J04537J16024J30434J47015J64836J84115
57687B263447K05021K26599K47665K67358K83911K94269K95895K87682K68349
57678D640196K35839J89913J34144P4135J4874l9137q2986j12813j27613j28536
$$ plain form
57668 4798016 4680272 4580244 4495771 4414142 4316599 4186232 4014413 3803219 3563731 3311246
57658 3311246 3060107 2821184 2602037 2407290 2238276 2093552 1970742 1867807 1782839 1713735
57648 1713735 1658561 1615615 1582939 1558482 1541054 1530542 1527059 1530557 1541353 1560228 1587769 1624203
57636 1624203 1669976 1725784 1791958 1868564 1956233 2056288 2170054 2298753 2443946 2607056
57626 2607056 2788287 2986745 3201421 3430839 3671374 3916652 4158532 4387443 4591700
57617 4591700 4758265 4875730 4936772 4938168 4880065 4766250 4604437 4405118 4179610 3938506
57607 3938506 3690670 3442849 3200314 2967720 2748793 2545437 2358181 2187545 2034028
57598 2034028 1896695 1773017 1660646 1558564 1466325 1383215 1308619 1242207 1183199 1130283
$$ packed form
57668D798016j17744j00028q4473q1629r7543j30367j71819k11194k39488k52485
57658C311246k51139k38923k19147j94747j69014j44724j22810j02935q4968o9104
57648A713735n5174m2946l2676k4457j7428j0512l483L498J0796J8875K7541L6434
57636A624203M5773N5808O6174P6606Q7669J00055J13766J28699J45193J63110
57626B607056J81231J98458K14676K29418K40535K45278K41880K28911K04257
57617D591700J66565J17465O1042J396n8103j13815j61813j99319k25508k41104
57607C938506k47836k47821k42535k32594k18927k03356j87256j70636j53517
57598B034028j37333j23678j12371j02082r2239q3110p4596o6412n9008n2916
$$ plain form
57588 1130283 1082654 1040324 1002937 969137 937669 908324 881330 856563 833831 813156 794278
57577 794278 776582 760030 745457 733468 723675 715414 708428 702370 696516 690641 685610 682514 681688
57564 681688 682848 685537 689145 693319 698768 706828 717769 730314 743253 756650 770977 786154 802186
57551 802186 819812 839657 861468 885056 911263 941202 975215 1013457 1056782 1106053 1161106
57540 1161106 1221512 1288123 1363015 1448095 1544451 1652769 1773596 1907308 2054310 2215036
57530 2215036 2389224 2575452 2771567 2974728 3180164 3380232 3565397 3725963 3852723
57521 3852723 3937211 3973111 3958078 3894084 3786386 3642561 3471771 3283534 3086408 2887520
57511 2887520 2692632 2506051 2330546 2167760 2018567 1883060 1760860 1651791 1555750 1471755
$$ packed form
57588A130283m7629m2330l7387l3800l1468k9345k6994k4767k2732k0675j8878
57577G94278j7696j6552j4573j1989r793q261o986o058n854n875n031l096q26
57564F81688J160K689L608M174N449Q060J0941J2545J2939J3397J4327J5177J6032
57551H02186J7626J9845K1811K3588K6207K9939L4013L8242M3325M9271N5053
57540A161106O0406O6611P4892Q5080R6356J08318J20827J33712J47002J60726
57530B215036J74188J86228J96115K03161K05436K00068J85165J60566J26760
57521C852723Q4488L5900j5033o3994j07698j43825j70790j88237j97126j98888
57511B887520j94888j86581j75505j62786j49193j35507j22200j09069r6041q3995
$$ plain form
57501 1471755 1397951 1333052 1277055 1230016 1190941 1158529 1132188 1111520 1095590 1083624 1075823
57490 1075823 1072485 1072923 1076259 1082878 1094002 1110151 1131001 1156555 1187372 1223813 1266029 1314763
57478 1314763 1371310 1436612 1511059 1595188 1690013 1796764 1916819 2051597 2201726 2366248
57468 2366248 2542993 2729287 2921453 3113744 3298361 3466418 3608499 3715076 3777946 3792108
57458 3792108 3756410 3673055 3547316 3387325 3202874 3003573 2797764 2592330 2392512 2201893
57448 2201893 2023066 1858136 1708149 1572524 1449874 1339238 1239969 1150938 1070748 998570
57438 998570 933922 875870 823299 775825 733559 696093 662488 632185 605046 580605 558074
57427 558074 537078 517579 499230 481709 465607 451961 440755 430758 420922 411109 401381 391614
$$ packed form
57501A471755p3804o4899n5997m7039l9075l2412k6341k0668j5930j1966p801
57490A075823l338M38L336O619J1124J6149K0850K5554L0817L6441M2216M8734
57478A314763N6547O5302P4447Q4129R4825J06751J20055J34778J50129J64522
57468B366248J76745J86294J92166J92291J84617J68057J42081J06577O2870J4162
57458C792108l5698q3355j25739j59991j84451j99301k05809k05434j99818j90619
57448B201893j78827j64930j49987j35625j22650j10636r9269q9031q0190p2178
57438I98570o4648n8052n2571m7474m2266l7466l3605l0303k7139k4441k2531
57427E58074k0996j9499j8349j7521j6102j3646j1206r997r836r813r728r767
$$ plain form
57415 391614 382115 373694 366672 360465 354495 348880 343892 339355 335034 331119 327958 325614 323948 322797
57401 322797 321902 320979 319986 319071 318274 317558 317067 316993 317256 317607 317840 317608 316480 314717 313549 313839 314856 315189
57383 315189 314542 313615 312494 310473 307542 304776 302903 301519 300078 298715 297631 296559 295298 294082 292967
57368 292967 291605 290013 288829 288402 288315 288222 288400 288963 289274 288817 288123 288138 289011 290019 290415 289936 288799 287596
57350 287596 286916 286801 286840 286977 287740 289463 291759 294086 296324 298501 300455 302158 304016 306442 309445 312824
57334 312824 316419 319995 323300 326380 329334 331672 332645 332501 332727 334596 338003 342090 346385 350832 355344
57319 355344 359953 365028 370815 377068 383530 390321 397406 404169 410089 415508 421231 427704 435014 443241
57305 443241 452203 461233 469879 478595 488136 498426 508689 518616 528929 540766 554896 571393 589741
$$ packed form
57415C91614r499q421p022o207n970n615m988m537m321l915l161k344j666j151
57401C22797q95r23r93r15p97p16m91p4K63L51K33k32j128j763j168K90J017L33
57383C15189o47r27j121k021k931k766j873j384j441j363j084j072j261j216j115
57368B92967j362j592j184m27q7r3J78N63L11m57o94J5Q73J008L96m79j137j203
57350B87596o80j15L9J37P63J723K296K327K238K177J954J703J858K426L003L379
57334C12824L595L576L305L080K954K338R73j44K26J869L407M087M295M447M512
57319C55344M609N075N787O253O462O791P085O763N920N419N723O473P310Q227
57305D43241Q962R030Q646Q716R541J0290J0263R927J0313J1837J4130J6497J8348
$$ plain form
57292 589741 609293 629940 652200 676413 702150 728760 756224 784970 814985 845587 875971
57281 875971 905577 933937 960538 984793 1005858 1022545 1033727 1038809 1037570 1029760 1015276 994799
57269 994799 969932 942564 914146 885496 857018 829028 801979 776506 753287 732796 715049
57258 715049 699486 685322 672274 660851 651661 644631 639226 635225 632696 631243 629935 628283 626820
57245 626820 626575 628250 631928 637075 642774 648475 654673 662339 671603 681631 691876 702710 714524
57232 714524 726965 739473 751916 764199 775860 786658 797131 808038 819692 832179 845736
57221 845736 860366 875581 891119 907560 925687 945586 966859 989321 1012968 1037656 1063344
57210 1063344 1090221 1117993 1145458 1171475 1196078 1219972 1243243 1265315 1286123 1306662 1328267
$$ packed form
57292E89741J9552K0647K2260K4213K5737K6610K7464K8746L0015L0602L0384
57281H75971K9606K8360K6601K4255K1065J6687J1182N082j239p810j4484k0477
57269I94799k4867k7368k8418k8650k8478k7990k7049k5473k3219k0491j7747
57258G15049j5563j4164j3048j1423r190p030n405m001k529j453j308j652j463
57245F26820k45J675L678N147N699N701O198P666R264J0028J0245J0834J1814
57232G14524J2441J2508J2443J2283J1661J0798J0473J0907J1654J2487J3557
57221H45736J4630J5215J5538J6441J8127J9899K1273K2462K3647K4688K5688
57210A063344K6877K7772K7465K6017K4603K3894K3271K2072K0808K0539K1605
$$ plain form
57199 1328267 1351639 1376426 1401461 1425678 1449181 1473138 1498276 1523904 1548882 1573178 1597928
57188 1597928 1624205 1652187 1681187 1710072 1737993 1765181 1792597 1820438 1847718 1873921 1900271
57177 1900271 1928402 1958379 1989127 2020369 2052805 2086645 2121284 2156566 2193106 2231014 2269264
57166 2269264 2306788 2343474 2379848 2416391 2453536 2491741 2531215 2571901 2613779 2656770 2700380
57155 2700380 2743945 2787170 2830001 2872151 2913458 2954474 2995873 3037283 3077496 3115887 3152848
57144 3152848 3188839 3223958 3258606 3293619 3329260 3364685 3398685 3430396 3459280 3485199 3508814
57133 3508814 3531195 3552706 3572947 3592016 3611139 3631765 3654689 3680331 3709097 3741018 3775625
57122 3775625 3812488 3851363 3891648 3932425 3973339 4014798 4057166 4100640 4146175 4195513 4249847
$$ packed form
57199A328267K3372K4787K5035K4217K3503K3957K5138K5628K4978K4296K4750
57188A597928K6277K7982K9000K8885K7921K7188K7416K7841K7280K6203K6350
57177A900271K8131K9977L0748L1242L2436L3840L4639L5282L6540L7908L8250
57166B269264L7524L6686L6374L6543L7145L8205L9474M0686M1878M2991M3610
57155B700380M3565M3225M2831M2150M1307M1016M1399M1410M0213L8391L6961
57144C152848L5991L5119L4648L5013L5641L5425L4000L1711K8884K5919K3615
57133C508814K2381K1511K0241J9069J9123K0626K2924K5642K8766L1921L4607
57122C775625L6863L8875M0285M0777M0914M1459M2368M3474M5535M9338N4334
$$ plain form
57111 4249847 4309421 4374994 4448663 4532553 4627725 4735383 4858457 5001219 5168344 5365542
57101 5365542 5600371 5881059 6214932 6609277 7073629 7620248 8262859 9016196 9896430
57092 9896430 10920286 12102845 13455893 14986645 16695212 18572037 20598025 22746552
57084 22746552 24984046 27269195 29553093 31779129 33880633 35782452 37415222 38735022
57076 38735022 39724388 40364445 40604479 40367424 39594346 38288182 36518790 34392817 32020698
57067 32020698 29501667 26921971 24354781 21859834 19485043 17267882 15233991 13395847
57059 13395847 11755080 10306539 9040127 7941002 6991361 6173400 5470401 4865879 4343758
57050 4343758 3890185 3494417 3147695 2842070 2570643 2328116 2110539 1914895 1739110
$$ packed form
57111D249847N9574O5573P3669Q3890R5172J07658J23074J42762J67125J97198
57101E365542K34829K80688L33873L94345M64352N46619O42611P53337Q80234
57092I896430J023856J182559J353048J530752J708567J876825K025988K148527
57084B2746552K237494K285149K283898K226036K101504J901819J632770J319800
57076C8735022R89366O40057K40034k37055p73078j306164j769392k125973k372119
57067C2020698k519031k579696k567190k494947k374791k217161k033891j838144
57059A3395847j640767j448541j266412j099125r49641q17961p02999o04522n22121
57050D343758m53573l95768l46722l05625k71427k42527k17577j95644j75785
$$ plain form
57041 1739110 1581790 1441443 1316166 1204115 1103793 1013718 932372 858719 792284 732513
57031 732513 678519 629686 585899 546813 511453 479030 449715 424038 401840 382363 365114
57020 365114 350047 336944 325224 314515 305134 297865 293405 291994 293417 297443 304429 315485 332024
57007 332024 355419 387242 429523 484457 554392 642874 755046 894438 1056369 1223283 1367676
56996 1367676 1462321 1490989 1452952 1360317 1232025 1087939 944227 810752 691533 587594
56986 587594 499337 426739 368707 323433 289052 263173 242101 221668 199173 174123 147284
56975 147284 119823 93338 69599 49539 32901 19261 9015 2989 1459 3937 9704 18220 29248
56962 29248 42930 59630 79513 102385 128055 156552 187506 219153 248117 270406 282975 284763
$$ packed form
57041A739110j57320j40347j25277j12051j00322r0075q1346p3653o6435n9771
57031G32513n3994m8833m3787l9086l5360l2423k9315k5677k2198j9477j7249
57020C65114j5067j3103j1720j0709r381p269m460j411J423M026O986J1056J6539
57007C32024K3395L1823M2281N4934O9935Q8482J12172J39392J61931J66914J44393
56996A367676R4645K8668l8037r2635j28292j44086j43712j33475j19219j03939
56986E87594q8257p2598n8032m5274l4381k5879k1072k0433k2495k5050k6839
56975A47284k7461k6485k3739k0060j6638j3640I015B989A459K478N767Q516J1028
56962B9248J3682J6700J9883K2872K5670K8497L0954L1647K8964K2289J2569J788
$$ plain form
56950 284763 276627 260606 239395 216159 193882 174225 157150 142109 129385 119934 114264 112111
56938 112111 113145 117408 125094 136435 151866 171898 196841 226854 261753 299786 336581 366145
56926 366145 383472 386292 375053 352365 322456 289834 257563 226996 199041 174831 154861 138430
56914 138430 124502 112588 102402 93352 85046 77893 72605 69313 67481 66406 65506 64540 63805 63783 64386
56899 64386 64998 65450 66366 68245 70851 73999 78366 84904 93739 104283 116285 130426 147969 169994
56885 169994 196415 225195 252542 274310 287505 291006 285579 273448 257261 239086 220432 202984
56873 202984 188472 177720 170576 167108 168172 174434 185654 201471 222356 249270 282997 324434
56861 324434 375033 436042 506937 584204 660881 727273 773653 793999 787939 759578 715185 661816
$$ packed form
56950B84763q136j6021k1211k3236k2277j9657j7075j5041j2724r451n670k153
56938A12111J034M263P686J1341J5431K0032K4943L0013L4899L8033L6795K9564
56926C66145J7327K820j1239k2688k9909l2622l2271l0567k7955k4210j9970j6431
56914A38430j3928j1914j0186r050q306p153n288l292j832j075r00r66p35k2O03
56899F4386O12M52R16J879K606L148M367O538Q835J0544J2002J4141J7543K2025
56885A69994K6421K8780K7347K1768J3195L501n427j2131j6187j8175j8654j7448
56873B02984j4512j0752p144l468J064O262J1220J5817K0885K6914L3727M1437
56861C24434N0599O1009P0895P7267P6677O6392M6380K0346o060k8361m4393n3369
$$ plain form
56849 661816 606420 554469 509102 471695 442787 422273 409692 405141 409546 423675 447694 482263
56837 482263 529262 590744 667878 761415 871439 994230 1119045 1229354 1308429 1344913 1335470
56826 1335470 1284823 1203771 1105357 1000963 898690 803982 720390 649627 591841 546396 512476
56815 512476 489349 476726 474910 484364 505419 538720 585542 647010 722720 809501 900170 983049
56803 983049 1044299 1073119 1065869 1025992 961244 881318 796046 713048 636280 567259 507195 457111
56791 457111 416667 384518 359892 342820 333026 329887 333570 345140 365382 394354 431879 477040
56779 477040 526542 574174 612330 634167 635397 615734 579263 532609 482063 432019 385077 342372
56767 342372 303893 269471 239543 214427 193318 175030 159433 147082 137665 130079 123964 119843
$$ packed form
56849F61816n5396n1951m5367l7407k8908k0514j2581m551M405J4129K4019L4569
56837D82263M6999O1482P7134R3537J10024J22791J24815J10309P9075L6484r443
56826A335470n0647q1052r8414j04394j02273r4708q3592p0763n7786m5445l3920
56815E12476k3127j2623j816R454K1055L3301M6822O1468P5710Q6781R0669Q2879
56803I83049O1250K8820p250l9877o4748p9926q5272q2998p6768o9021o0064n0084
56791D57111m0444l2149k4626j7072r794l139L683J1570K0242K8972L7525M5161
56779D77040M9502M7632L8156K1837J230j9663l6471m6654n0546n0044m6942m2705
56767C42372l8479l4422k9928k5116k1109j8288j5597j2351r417p586o115m121
$$ plain form
56755 119843 117556 115789 113446 110533 107469 104518 102140 100864 100458 100022 99151 98220 97408 96375 95066
56740 95066 93918 92977 91682 89828 87895 86236 84666 83040 81446 79693 77485 75196 73559 72474 71045
56725 71045 68970 66925 65418 64245 63244 62527 61738 60211 58240 57063 57217 57955 58702 59880 61686 63132
56709 63132 63117 61697 59673 57675 56170 55575 55777 56182 56631 57497 58559 58810 57923 56892 56552 56421 55773
56692 55773 54952 54679 54778 54579 54086 53886 54227 54892 55692 56520 57201 57721 58261 58685 58480 57530 56417 55685 55370
56673 55370 55472 56098 56821 56724 55515 53832 52058 49804 47109 45117 44727 45424 46287 47345 48953 50570
56657 50570 51358 51655 52754 55375 59148 63429 67819 72004 75794 79328 82704 85485 87112 87709 88064
56642 88064 88784 89746 90305 89959 88927 88141 88370 89355 90142 90211 89736 88863 87485 85838 84475 83425 82179
$$ packed form
56755A19843k287j767k343k913l064k951k378j276m06m36q71r31q12j033j309
56740I5066j148r41j295j854j933j659j570j626j594j753k208k289j637j085j429
56725G1045k075k045j507j173j001p17p89j527j971j177J54P38P47J178J806J446
56709F3132j5j420k024j998j505n95K02M05M49Q66J062K51q87j031l40j31o48
56692E5773q21k73R9j99m93k00L41O65Q00Q28O81N20N40M24k05r50j113p32l15
56673E5370J02O26P23r7j209j683j774k254k695j992l90O97Q63J058J608J617
56657E0570P88K97J099K621L773M281M390M185L790L534L376K781J627N97L55
56642H8064P20R62N59l46j032p86K29R85P87O9m75q73j378j647j363j050j246
$$ plain form
56625 82179 80722 79734 79433 79115 78283 77392 76962 76746 76445 76560 77930 80883 85266 90676 96280 101040 104644
56608 104644 107713 110740 113445 115432 116740 117425 117360 116844 116569 116692 116711 116547 116711 117096 116756 115393 113869
56591 113869 112661 111086 108815 106846 105898 105025 103057 100506 98792 98371 98771 99766 101270 102654 103380 103945
56575 103945 105178 106993 108720 110183 111561 112772 113903 115715 118695 122132 125103 127914 131585 136357
56561 136357 141655 147085 152511 157586 162174 166905 172396 178203 183347 187482 190885 193785 196504 199610
56547 199610 203054 205711 206687 206539 206310 205992 205059 203873 203314 203330 203025 201987 200507 198711 196461 193928
56531 193928 191432 188871 186092 183531 181765 180738 180027 179391 178362 175990 171921 167171 162997 159552 156527
56516 156527 154302 153291 152742 151484 149523 147798 146704 145950 145506 145543 145689 145434 145043 145071 145202 144566 143028
$$ packed form
56625H2179j457r88l01l18q32q91m30k16l01J15J370K953M383N410N604M760L604
56608A04644L069L027K705J987J308O85o5n16k75J23J9j64J64L85l40j363j524
56591A13869j208j575k271j969r48q73j968k551j714m21M00R95J504J384P26N65
56575A03945J233J815J727J463J378J211J131J812K980L437K971K811L671M772
56561A36357N298N430N426N075M588M731N491N807N144M135L403K900K719L106
56547A99610L444K657R76j48k29l18r33j186n59J6l05j038j480j796k250k533
56531A93928k496k561k779k561j766j027p11o36j029k372m069m750m174l445l025
56516A56527k225j011n49j258j961j725j094p54m44L7J46k55l91K8J31o36j538
$$ plain form
56499 143028 141302 139952 138986 138098 136664 134014 130422 127229 125248 123812 122217 121171 121672 123309 124942
56484 124942 126373 128062 129901 131650 133920 137272 140874 143506 145483 148116 151707 155480 159131 163033
56470 163033 167220 171569 176647 182995 189923 196321 202260 208428 214581 220162 225984 233469 242345 250740
56456 250740 257506 262959 267511 271116 274027 276580 278244 278257 277071 275861 274863 273611 272455 272188 272439
56441 272439 272099 271222 270776 270663 269757 267862 265871 263923 261157 257459 253756 250391 246779 242840 239157
56426 239157 235580 231228 226096 221129 216648 212230 208132 205136 202887 200167 196991 194641 193388 192067
56412 192067 190316 189420 190337 192513 195166 198183 201174 203156 203820 203843 203474 202032 199130 195119 190202 184480
56396 184480 178960 175010 172640 170843 169681 170265 172489 174657 175844 176925 178821 181294 183926 186661
$$ packed form
56499A43028j726j350r66q88j434k650l592l193j981j436j595j046N01J637J633
56484A24942J431J689J839J749K270L352L602K632J977K633L591L773L651L902
56470A63033M187M349N078O348O928O398N939O168O153N581N822P485Q876Q395
56456B50740O766N453M552L605K911K553J664J3j186j210r98j252j156k67K51
56441B72439l40q77m46j13r06j895j991j948k766l698l703l365l612l939l683
56426B39157l577m352n132m967m481m418m098k996k249k720l176k350j253j321
56412A92067j751q96R17K176K653L017K991J982O64K3l69j442k902m011m917n722
56396A84480n520l950k370j797j162N84K224K168J187J081J896K473K632K735
$$ plain form
56382 186661 189055 190596 192081 195040 199424 203541 206447 208553 209662 208603 205429 201906 199121 196516
56368 196516 193944 192572 192841 193559 194082 195526 198688 202492 205706 208649 211998 215292 217770 219455 220473
56353 220473 220518 219855 219550 219974 220282 220017 219903 220458 221279 222319 224353 227518 230911 234225 238228 243019 247545
56336 247545 251547 256233 262221 268522 274399 280515 287341 294122 300380 306844 313951 321030 327915 335767
56322 335767 345375 356104 367271 378997 390938 401870 411331 419989 427730 433223 436191 438125 439827
56309 439827 440179 438316 435078 431321 426709 421241 415986 411269 406178 400954 397729 397552 398737 399435 399852
56294 399852 400668 401493 402401 404886 409571 414886 419603 424817 431914 440492 449876 460718 473393 486707
56280 486707 499939 514384 531286 550075 570160 592455 617516 644262 672296 703405 738914
$$ packed form
56382A86661K394J541J485K959M384M117K906K106J109j059l174l523k785k605
56368A96516k572j372K69P18N23J444L162L804L214K943L349L294K478J685J018
56353B20473M5o63l05M24L08k65j14N55Q21J040K034L165L393L314M003M791M526
56336B47545M002M686N988O301N877O116O826O781O258O464P107P079O885P852
56322C35767R608J0729J1167J1726J1941J0932R461Q658P741N493K968J934J702
56309D39827L52j863l238l757m612n468n255m717n091n224l225j77J185O98M17
56294C99852Q16Q25R08K485M685N315M717N214P097Q578R384J0842J2675J3314
56280D86707J3232J4445J6902J8789K0085K2295K5061K6746K8034L1109L5509
$$ plain form
56269 738914 777696 818784 863848 915065 972631 1036486 1108263 1189183 1278138 1374410 1480348
56258 1480348 1598750 1729457 1871121 2024343 2190024 2366084 2548785 2736016 2926339
56249 2926339 3115856 3298844 3470707 3627895 3765983 3880472 3968928 4030306 4063428 4068458
56239 4068458 4048782 4009022 3952106 3880263 3797441 3708100 3614623 3518260 3421373 3326175 3232277
56228 3232277 3138024 3043371 2949146 2854527 2757796 2658628 2557300 2452754 2344054 2232907
56218 2232907 2122231 2013027 1904978 1799086 1697198 1599787 1506650 1418927 1337995 1263210
56208 1263210 1193133 1128091 1069239 1016052 967168 922662 883096 847401 814185 784065 758185
56197 758185 735547 714427 695238 679266 665698 652799 640995 631823 624757 618073 612070 608390
$$ packed form
56269G38914L8782M1088M5064N1217N7566O3855P1777Q0920Q8955R6272J05938
56258A480348J18402J30707J41664J53222J65681J76060J82701J87231J90323
56249B926339J89517J82988J71863J57188J38088J14489Q8456O1378L3122N030
56239D068458j9676l9760n6916p1843q2822q9341r3477r6363r6887r5198r3898
56228C232277r4253r4653r4225r4619r6731r9168j01328j04546j08700j11147
56218B232907j10676j09204j08049j05892j01888r7411r3137q7723q0932p4785
56208A263210p0077o5042n8852n3187m8884m4506l9566l5695l3216l0120k5880
56197G58185k2638k1120j9189j5972j3568j2899j1804r172p066o684o003l680
$$ plain form
56185 608390 606878 606045 606062 608349 612761 617929 623873 631523 640309 649024 658423 670124 683500 696376
56171 696376 708188 719703 730285 738312 743780 747759 749879 749067 746138 742901 739341 734331 728344 722730
56157 722730 717238 711124 705820 703474 703680 704619 706593 711295 718465 726418 735178 745994 758599 772131
56143 772131 787917 808124 832506 859851 891808 931882 981368 1039700 1107939 1188304 1280803
56132 1280803 1383689 1496371 1618166 1744780 1869694 1988596 2099341 2198954 2285033 2359631
56122 2359631 2427579 2490869 2547812 2596569 2635486 2660841 2668972 2660939 2641635 2614762 2582053 2545941
56110 2545941 2508021 2465020 2410757 2342315 2260899 2167752 2063941 1953802 1843836 1737931
56100 1737931 1637412 1544948 1463744 1393216 1330101 1273730 1225838 1185627 1149783 1117182 1089021
$$ packed form
56185F08390j512q33J7K287M412N168N944P650Q786Q715R399J1701J3376J2876
56171F96376J1812J1515J0582Q027N468L979K120q12k929l237l560n010n987n614
56157G22730n492o114n304k346K06R39J974M702P170P953Q760J0816J2605J3532
56143G72131J5786K0207K4382K7345L1957M0074M9486N8332O8239Q0365R2499
56132A280803J02886J12682J21795J26614J24914J18902J10745R9613Q6079P4598
56122B359631O7948O3290N6943M8757L8917K5355Q131q033j9304k6873l2709l6112
56110B545941l7920m3001n4263o8442q1416r3147j03811j10139j09966j05905
56100A737931j00519r2464q1204p0528o3115n6371m7892m0211l5844l2601k8161
$$ plain form
56089 1089021 1064647 1041993 1021724 1006042 993787 981735 970335 962908 959491 956823 954171 953574
56077 953574 954483 954036 952880 954882 960575 966468 971284 977307 985125 992682 1000026 1009395 1020185 1029439
56063 1029439 1037598 1048064 1060830 1072468 1082564 1094033 1106896 1118254 1128686 1141973 1157934
56052 1157934 1172374 1184749 1198965 1215840 1231908 1246685 1263837 1283942 1303204 1320704 1339937
56041 1339937 1361916 1383887 1406020 1431998 1461841 1491680 1521760 1556847 1597342 1637995 1676857
56030 1676857 1717395 1760295 1801634 1840984 1882891 1928480 1973968 2019055 2067870 2119997 2169917
56019 2169917 2217242 2267868 2322995 2376935 2428112 2482042 2540976 2601068 2662417 2730979 2807496
56008 2807496 2885500 2963407 3047325 3138803 3231661 3324486 3423978 3532060 3642293 3753286 3872739
$$ packed form
56089A089021k4374k2654k0269j5682j2255j2052j1400p427l417k668k652n97
56077I53574R09m47j156K002N693N893M816O023P818P557P344R369J0790R254
56063A029439Q159J0466J2766J1638J0096J1469J2863J1358J0432J3287J5961
56052A157934J4440J2375J4216J6875J6068J4777J7152K0105J9262J7500J9233
56041A339937K1979K1971K2133K5978K9843K9839L0080L5087M0495M0653L8862
56030A676857M0538M2900M1339L9350M1907M5589M5488M5087M8815N2127M9920
56019B169917M7325N0626N5127N3940N1177N3930N8934O0092O1349O8562P6517
56008B807496P8004P7907Q3918R1478R2858R2825R9492J08082J10233J10993J19453
$$ plain form
55997 3872739 4003671 4139868 4279761 4431136 4597081 4771241 4952173 5147716 5359669
55988 5359669 5579544 5805473 6047493 6309916 6585302 6872631 7183818 7524822 7888676
55979 7888676 8275200 8698410 9165875 9670931 10214492 10813377 11477562 12202190 12992925
55970 12992925 13875274 14867750 15972215 17203390 18600182 20195253 22005508 24068660
55962 24068660 26455936 29233364 32450583 36189093 40581398 45766632 51886594 59161674
55954 59161674 67920627 78533419 91399869 107059129 126225872 149656548 178068439
55947 178068439 212150330 252135257 296597526 341333637 379814622 405493756 414414606
55940 414414606 406313993 383934028 351587804 313907305 274954971 237657113 203672314
$$ packed form
55997C872739J30932J36197J39893J51375J65945J74160J80932J95543K11953
55988E359669K19875K25929K42020K62423K75386K87329L11187L41004L63854
55979G888676L86524M23210M67465N05056N43561N98885O64185P24628P90735
55970A2992925Q82349R92476J104465J231175J396792J595071J810255K063152
55962B4068660K387276K777428L217219L738510M392305N185234O119962P275080
55954E9161674Q758953J0612792J2866450J5659260J9166743K3430676K8411891
55947A78068439L4081891L9984927M4462269M4736111L8480985K5679134Q920850
55940D14414606q100613k2379965l2346224l7680499l8952334l7297858l3984799
$$ plain form
55933 203672314 173679979 147782158 125760289 107216110 91697994 78780870 68062302
55926 68062302 59151562 51708850 45473507 40233305 35794194 31998318 28739818 25936661
55918 25936661 23505338 21376858 19511275 17875942 16427559 15129925 13968983 12934601
55910 12934601 12004708 11160525 10399389 9718585 9102275 8536729 8022616 7560013 7136189
55901 7136189 6740100 6374584 6042549 5734724 5442544 5170236 4922809 4693988 4476742
55892 4476742 4274185 4089492 3915992 3747576 3588616 3443727 3307699 3175174 3050563
55883 3050563 2938662 2834604 2732577 2635920 2549306 2469093 2390430 2316170 2249889 2187313 2123246
55872 2123246 2060341 2003015 1949189 1895619 1844823 1799252 1754909 1708097 1662437 1622285 1585312
$$ packed form
55933B03672314k9992335k5897821k2021869j8544179j5518116j2917124j0718568
55926F8062302q910740p442712o235343n240202m439111l795876l258500k803157
55918B5936661k431323k128480j865583j635333j448383j297634j160942j034382
55910A2934601r29893q44183p61136o80804o16310n65546n14113m62603m23824
55901G136189l96089l65516l32035l07825k92180k72308k47427k28821k17246
55892D476742k02557j84693j73500j68416j58960j44889j36028j32525j24611
55883C050563j11901j04058j02027r6657q6614q0213p8663p4260o6281o2576o4067
55872B123246o2905n7326n3826n3570n0796m5571m4343m6812m5660m0152l6973
$$ plain form
55861 1585312 1548438 1515000 1489070 1468514 1450361 1437093 1430603 1425455 1415176 1400342 1384091 1364911
55849 1364911 1340552 1314224 1290182 1267432 1243768 1221541 1203404 1186815 1168654 1151014 1136603
55838 1136603 1122715 1105601 1086642 1068445 1048893 1024937 998550 973251 948286 921573 894907
55827 894907 870943 848464 825616 804305 786461 769517 750543 731326 714588 698815 681669
55816 681669 664764 650178 636001 620429 606557 597839 592288 586430 581565 580659 582268 583139 583995 587273
55802 587273 591593 593759 593922 593893 592653 588340 582312 576481 569048 557545 543650 530334 516764 500847
55788 500847 484362 470560 458895 447012 435867 427911 422188 416209 410978 409240 410139 410218 408274 404886
55774 404886 398702 387902 374153 360801 348207 334804 321303 309748 299802 290079 281803 276962
$$ packed form
55861A585312l6874l3438k5930k0556j8153j3268o490n148j0279j4834j6251j9180
55849A364911k4359k6328k4042k2750k3664k2227j8137j6589j8161j7640j4411
55838A136603j3888j7114j8959j8197j9552k3956k6387k5299k4965k6713k6666
55827H94907k3964k2479k2848k1311j7844j6944j8974j9217j6738j5773j7146
55816F81669j6905j4586j4177j5572j3872q718n551n858m865r06J609Q71Q56L278
55802E87273M320K166J63k9j240m313o028n831p433j1503j3895j3316j3570j5917
55788E00847j6485j3802j1665j1883j1145p956n723n979n231j738Q99P9j944l388
55774D04886o184j0800j3749j3352j2594j3403j3501j1555r946r723q276m841
$$ plain form
55762 276962 274041 269627 263199 256579 249956 242335 234701 228738 223471 216916 210032 205424 203257 202037
55748 202037 202133 204773 208676 211478 213451 216199 218726 218611 216191 213968 212607 210934 209075 208263 208262 208042
55732 208042 208103 209208 210137 209648 209210 210571 212178 211344 208377 205021 200539 193319 184979 178749 174812 171133
55716 171133 167793 166415 166180 164597 161729 159843 159406 159126 159402 161996 166733 172082 178422 187067 196637
55701 196637 204205 209606 214944 220229 223324 224007 224332 225079 225333 225478 226994 229273 230056 229038 227769 226177
55685 226177 222571 217020 211381 206101 200311 194879 191822 190701 189056 186533 185138 185343 185403 184770 184755 185469
55669 185469 185431 184582 184469 185112 184864 183674 183205 183396 182293 179805 178285 178693 179380 179401 179940 181593 183219
55652 183219 184364 186008 188065 188912 188172 187298 186588 184245 179264 172790 165933 158691 151654 146187 142092
$$ packed form
55762B76962k921m414o428o620o623p621p634n963n267o555o884m608k167j220
55748B02037R6K640L903K802J973K748K527j15k420k223j361j673j859q12jk20
55732B08042O1J105R29m89m38J361J607q34k967l356m482p220q340o230l937l679
55716A71133l340j378k35j583k868j886m37k80K76K594M737N349O340Q645R570
55701A96637P568N401N338N285L095O83L25P47K54J45J516K279P83j018j269j592
55685B26177l606n551n639n280n790n432l057j121j645k523j395K05O0o33j5P14
55669A85469l8q49j13O43k48j190m69J91j103k488j520M08O87K1N39J653J626
55652A83219J145J644K057Q47p40q74p10k343m981o474o857p242p037n467m095
$$ plain form
55637 142092 137469 131612 125856 121058 116556 112063 108200 104729 100684 96647 94377 93796 92883 90958 89358
55622 89358 88494 87089 84951 83595 83281 82288 80066 78358 78046 77604 75890 73988 72955 72048 70526 69117
55606 69117 68399 67678 66579 65911 65977 65918 65544 65838 66798 66865 65404 63677 62459 60785 58178 56088 55868 57035
55588 57035 58551 60150 61545 62018 61720 61746 62191 61853 60455 59281 58956 58567 57717 57416 58106 58864 59453 61097
55570 61097 64145 66974 68477 69853 72739 77142 82214 87414 91882 94297 94445 93589 92506 90654 87845
55555 87845 84946 82141 78328 73149 67905 63633 59977 56755 54755 54051 53424 52441 52281 53474 54726
55540 54726 55141 55696 57236 58861 59679 60473 62055 63478 63440 62269 61118 60331 59889 60322 61897 63837 65422
55523 65422 67027 69187 71616 73870 75889 77204 76853 74776 72049 69024 64623 58234 50913 43907 37383
$$ packed form
55637A42092m623n857n756m798m502m493l863l471m045m037k270n81r13j925j600
55622H9358q64j405k138j356l14r93k222j708l12m42j714j902j033r07j522j409
55606F9117p18p21j099o68O6n9l74K94R60O7j461j727j218j674k607k090k20J167
55588E7035J516J599J395M73k98K6M45l38j398j174l25l89q50l01O90P58N89J644
55570F1097L048K829J503J376K886M403N072N200M468K415J48q56j083j852k809
55555H7845k899k805l813n179n244m272l656l222k000p04o27r83j60J193J252
55540E4726M15N55J540J625Q18P94J582J423l8j171j151p87m42M33J575J940J585
55523F5422J605K160K429K254K019J315l51k077k727l025m401o389p321p006o524
$$ plain form
55508 37383 31377 26536 22883 19198 14636 9827 5636 2032 -1029 -2946 -3494 -3286 -2561 -784 1937
55492 4442 6124 7463 8417 7941 5837 3302 791 -2863 -8233 -13895 -18386 -21786 -24161 -24207 -20958 -15512
55476 -15512 -9691 -4206 650 3910 4913 4406 3374 1760 -678 -3319 -5444 -6974 -7650 -6756 -4569 -2760
55460 -2760 -2318 -2293 -1491 -129 1067 2034 2746 2839 2797 3972 6420 8239 8183 7370 7238 7410 7002 6519 6834
55441 6834 7498 7583 7197 6843 6262 5137 3940 3069 2168 1220 1059 1958 3077 4181 6178 8902 10305
55424 10305 9319 7800 7957 9462 10795 11828 13115 14016 13678 12884 12931 13505 13442 12804 12535 12841 13464 14721
55406 14721 16730 18427 18881 18805 19397 20568 21626 22605 23480 23290 21727 20456 21043 22581 23112 22435 21693
55389 21693 21140 20289 19445 19144 18780 17683 16815 17456 18887 19388 18951 18926 19372 18874 16827 14040 11219 8636
$$ packed form
55508C7383o006m841l653l685m562m809m191B032a029j917n48K08P25g84A937
55492D442J682J339R54m76k104k535G91b863n370n662m491l400k375m6L249N446
55476a5512N821d206F50L260J003n07j032j614f78k641k125j530o76Q94K187J809
55460b760M42K5Q02a29A067R67P12R3m2J175K448J819n6q13j32J72m08m83L15
55441F834O64Q5l86l54n81j125j197q71r01r48j61Q99J119J104J997K724J403
55424A0305r86j519J57J505J333J033J287R01l38p94M7N74o3o38k69L06O23J257
55406A4721K009J697M54p6N92J171J058R79Q75j90j563j271N87J538N31o77p42
55389B1693n53q51q44l01l64j097q68O41J431N01m37k5M46m98k047k787k821k583
$$ plain form
55371 8636 7076 7281 8441 8890 8285 7595 7069 5883 3822 1733 119 -1371 -2883 -3935 -4228 -3997 -3520
55354 -3520 -3008 -2709 -2454 -1648 -406 96 -665 -1485 -1151 -228 256 764 2235 4085 5023 5193 5643 6261 6155
55335 6155 5548 5405 5545 4983 3829 2990 2264 728 -1174 -1899 -1157 -115 767 2203 4183 5492 5539 5098
55317 5098 4866 4692 4504 4582 4694 4274 3643 3723 4468 4932 4966 5434 6603 7720 8379 8969 9636 10076 10501 11472
55297 11472 12701 13310 13336 13573 13937 13514 12386 11735 11872 11783 11064 10731 11434 12336 12506 12216 12050 11778 10913
55278 10913 9601 8331 7375 6882 6854 6783 6087 5104 4847 5656 6894 8045 9121 9846 9507 7989 6124
55261 6124 4739 4074 4186 5039 6082 6652 6927 7748 9423 11528 13727 15852 17268 17408 16942 17233 18405
55244 18405 19113 18498 17247 16374 15998 15768 15555 15272 14709 13957 13337 12747 11680 10021 8184 6451 4907
$$ packed form
55371H636j560K05J160M49o05o90n26j186k061A733A19a371j512j052k93K31M77
55354c520N12K99K55Q06d06I6f65q20L34b28B56N08J471J850R38J70M50O18j06
55335F155o07j43J40n62j154q39p26G28a174p25P42a15G67J436J980J309M7m41
55317E098k32j74j88P8J12m20o31Q0P45M64L4M68J169J117O59N90O67M40M25R71
55297A1472J229O09K6K37L64m23j128o51J37q9p19l33P03R02J70k90j66k72q65
55278A0913j312j270r56m93k8p1o96r83k57Q09J238J151J076P25l39j518j865
55261F124j385o65J12Q53J043N70K75Q21J675K105K199K125J416J40m66K91J172
55244A8405P08o15j251q73l76k30k13k83n63p52o20n90j067j659j837j733j544
$$ plain form
55227 4907 3980 4217 5473 7065 8664 10320 11791 12718 13330 14054 14647 14691 14698 15510 16783 17343 17099 17287
55209 17287 18651 20541 22019 22721 22414 20934 18906 17597 17654 18744 20437 22471 24112 24414 23387 21990
55193 21990 20827 19726 18614 17743 17005 16088 15394 15676 16671 17239 17003 16702 16769 16742 16271 15609 14872 13937 13218
55174 13218 13367 14055 14196 13605 13146 13088 12660 11564 10544 9997 9324 8211 7327 7228 7645 8355 9634 11285
55156 11285 12380 12469 12079 11534 10443 8817 7603 7466 8037 8821 9812 10775 11064 10742 10765 11455 11905 11528
55138 11528 11125 11656 12950 14301 15470 16427 16998 17329 17864 18435 18372 17961 18495 20263 21754 21758 21143 21524
55120 21524 23123 24942 26232 26808 26619 25964 25522 25390 24715 22995 21061 20010 19908 20266 20990 21975 22525
55103 22525 22189 21613 21696 22407 23261 24404 26262 28543 30512 32008 33359 34558 35246 35436 35641 36298 37412
$$ packed form
55227D907r27K37J256J592J599J656J471R27O12P24N93M4PQ12J273N60k44J88
55209A7287J364J890J478P02l07j480k028j309N7J090J693K034J641L02j027j397
55193B1990j163j101j112q71p38r17o94K82R95N68k36l01O7k7m71o62p37r35p19
55174A3218J49O88J41n91m59n8m28j096j020n47o73j113q84r9M17P10J279J651
55156A1285J095Q9l90n45j091j626j214j37N71P84R91R63K89l22K3O90M50l77
55138A1528m03N31J294J351J169R57N71L31N35N71o3m11N34J768J491Mo15L81
55120B1524J599J819J290N76j89o55m42j32o75j720j934j051j02L58P24R85N50
55103B2525l36n76Q3P11Q54J143J858K281J969J496J351J199O88J90K05O57J114
$$ plain form
55086 37412 38623 39408 39472 39105 38818 38578 37937 36946 36214 35900 35492 34849 34664 35483 36979 38543 39856 40598
55068 40598 40441 39776 39636 40530 42033 43800 45930 47970 48728 47764 46122 44867 43787 42228 40309 38530
55052 38530 36945 35505 34524 34067 33542 32569 31534 30690 29589 28102 27140 27458 28454 29073 29277 29809 31077
55035 31077 33041 35589 38246 40105 40754 40730 40495 39759 38510 37766 38311 39471 40171 40565 41504 42976 44229
55018 44229 45047 45774 46345 46375 46093 46290 47357 48975 50586 51646 51772 51241 50949 51296 51570 51028 50038 49409
55000 49409 49172 48829 48341 47983 47629 47035 46450 46216 46075 45650 45206 45138 45148 44745 44179 43961 43832 43159 42124
54981 42124 41560 41736 42187 42653 43336 44237 44974 45359 45528 45551 45432 45458 46038 47238 48857 50753 52734 54415
54963 54415 55739 57437 60421 64826 70010 75315 80566 86071 92470 100266 109297 118971 129121 140019
$$ packed form
55086C7412J211P85O4l67k87k40o41r91p32l14m08o43j85Q19J496J564J313P42
55068D0598j57o65j40Q94J503J767K130K040P58r64j642j255j080j559j919j779
55052C8530j585j440r81m57n25r73j035q44j101j487r62L18R96O19K04N32J268
55035C1077J964K548K657J859O49k4k35p36j249p44N45J160P00L94R39J472J253
55018D4229Q18P27N71L0k82J97J067J618J611J060J26n31k92L47K74n42r90o29
55000D9409k37l43m88l58l54n94n85k34j41m25m44o8J0m03n66k18j29o73j035
54981D2124n64J76M51M66O83R01P37L85J69K3j19K6N80J200J619J896J981J681
54963E4415J324J698K984M405N184N305N251N505O399P796R031R674J0150J0898
$$ plain form
54949 140019 151504 162937 174269 186079 197940 207748 213465 214796 212391 206421 197027 185402 173127
54936 173127 160769 148118 135425 123426 112473 102583 94031 86988 80968 75558 71308 68919 67850
54923 67850 66804 65363 64116 63356 62733 62226 62480 63936 66372 69402 72853 76682 81068 86552 93613
54908 93613 102243 112304 123948 137035 150530 163113 174172 183546 190603 194294 193947 189551 181575
54895 181575 171001 159121 146696 133764 120730 108917 99291 91348 84240 78337 74582 72771 71625
54882 71625 70254 68542 66441 64012 61890 60603 59591 57966 56007 54801 54586 54620 54511 54450 54153 52886
54866 52886 50743 48751 47417 46201 44709 43423 42845 42663 42211 41202 39814 38570 38235 39220 40993 42581
54850 42581 43591 44258 44688 44780 44758 44998 45334 45198 44341 42837 40647 38010 35979 35586 36499 37412 37654 37534
$$ packed form
54949A40019J1485J1433J1332J1810J1861R808N717J331k405n970r394j1625j2275
54936A73127j2358j2651j2693j1999j0953r890q552p043o020n410m250k389j069
54923F7850j046j441j247p60o23n07K54J456K436L030L451L829M386N484P061
54908I3613Q630J0061J1644J3087J3495J2583J1059R374P057L691l47m396p976
54895A81575j0574j1880j2425j2932j3034j1813r626p943p108n903l755j811j146
54882G1625j371j712k101k429k122j287j012j625j959j206k15L4j09o1k97j267
54866E2886k143j992j334j216j492j286n78j82m52j009j388j244l35R85J773J588
54850D2581J010O67M30R2k2K40L36j36q57j504k190k637k031l93R13R13K42j20
$$ plain form
54832 37534 37239 36568 35877 36126 37636 39629 41320 42736 44180 45671 47192 48828 50378 51411 51942 52498
54816 52498 53380 54335 55076 55642 56203 56988 58313 60204 62119 63621 65119 67301 70110 73083 76506 81305
54800 81305 87849 95744 104752 114963 126047 137323 148803 161293 175118 189329 202280 212495
54788 212495 219013 221651 220979 217466 210827 200921 189005 177112 166287 156353 147274 139553 133278 127899
54774 127899 123209 119494 116604 113943 111644 110590 110882 111366 111178 110855 111349 112772 114690 116953 119805
54759 119805 123731 129527 137843 148334 159927 172263 186143 202267 220220 239031 257987 276508
54747 276508 293854 309393 322558 332215 336676 334799 326783 313821 297530 279705 261810 244308
54735 244308 226954 209777 193224 177518 162759 149660 139127 130924 123760 116939 110921 106030
$$ packed form
54832C7534k95o71o91K49J510J993J691J416J444J491J521J636J550J033N31N56
54816E2498Q82R55P41N66N61P85J325J891J915J502J498K182K809K973L423M799
54800H1305O544P895R008J0211J1084J1276J1480J2490J3825J4211J2951J0215
54788B12495O518K638o72l513o639r906j1916j1893j0825r934r079p721o275n379
54774A27899m690l715k890k661k299j054K92M84j88l23M94J423J918K263K852
54759A19805L926N796Q316J0491J1593J2336J3880J6124J7953J8811J8956J8521
54747B76508J7346J5539J3165R657M461j877q016j2962j6291j7825j7895j7502
54735B44308j7354j7177j6553j5706j4759j3099j0533q203p164o821o018m891
$$ plain form
54723 106030 101828 98231 96023 95444 95253 94130 92318 91022 90695 90737 90494 89817 88841 87807 87008 86583 86442
54706 86442 86416 86222 85447 84101 83039 83122 84022 84704 84943 85304 85654 85073 83549 82408 82461 82946 83034 83185 84105
54687 84105 85428 86502 87624 89351 91211 92240 92397 92513 93144 94292 95900 97891 100017 102291 105156
54672 105156 108608 111749 114001 116272 119989 125283 130991 136211 140999 145647 150078 154052 157392 160009
54658 160009 162045 163911 165851 167695 169343 171124 173278 175522 177596 179871 182916 186856 191691 197827
54644 197827 205633 214865 225207 237055 250958 266500 282514 298389 314294 329948 343831 353951
54632 353951 359012 358634 352862 341881 326254 307241 286619 266038 246501 228552 212733 199423
54620 199423 188344 178741 170206 162910 156974 152151 148317 145733 144516 144292 144637 145360 146122 146337 145803
$$ packed form
54723A06030m202l597k208n79j91j123j812j296l27M2k43o77r76j034p99m25j41
54706H6442k6j94p75j346j062Q3R00O82K39L61L50n81j524j141N3M85Q8J51R20
54687H4105J323J074J122J727J860J029J57J16O31J148J608J991K126K274K865
54672A05156L452L141K252K271L717N294N708N220M788M648M431L974L340K617
54658A60009K036J866J940J844J648J781K154K244K074K275L045L940M835O136
54644A97827P806R232J0342J1848J3903J5542J6014J5875J5905J5654J3883J0120
54632C53951N061l78n772j0981j5627j9013k0622k0581j9537j7949j5819j3310
54620A99423j1079r603q535p296n936m823l834k584j217k24L45P23P62K15n34
$$ plain form
54605 145803 144971 144259 143579 142791 142007 140997 138933 135343 130940 126914 123723 121011 118342 115458 112153
54590 112153 108511 105102 102461 100421 98287 95498 91915 87780 83720 80479 78265 76551 74765 72966
54576 72966 71557 70630 69836 68664 66736 64178 61840 60692 60771 61151 61098 60782 60647 60673 60592 60366 60116 60015
54558 60015 60446 61680 63194 63973 63847 63844 64811 66372 67714 68699 69633 70625 71804 73584 75948 77996 78935
54541 78935 79150 79704 81192 83637 87035 91259 95828 100501 105819 112427 120130 128213 136400 144839 153390
54526 153390 161472 168432 173654 176614 177271 176086 173251 168417 161601 153828 146197 138750 130916 122653
54512 122653 114537 107122 100840 96092 92701 89663 86086 82106 78271 74627 71129 68392 66948 66154
54498 66154 64890 63193 62153 62248 62762 62957 62854 62685 62370 61849 61345 61073 61145 61831 63379 65492 67463 68987
$$ packed form
54605A45803q32p12o80p88p84j010k064l590m403m026l191k712k669k884l305
54590A12153l642l409k641k040k134k789l583m135m060l241k214j714j786j799
54576G2966j409r27p94j172j928k558k338j148P9L80n3l16j35K6q1k26k50j01
54558F0015M31J234J514P79j26lR67J561J342R85R34R92J179J780K364K048R39
54541G8935K15N54J488K445L398M224M569M673N318O608P703Q083Q187Q439Q551
54526A53390Q082O960N222K960O57j185k835m834o816p773p631p447p834q263
54512A22653q116p415o282m748l391l038l577l980l835l644l498k737j444p94
54498F6154j264j697j040R5N14J95j03j69l15n21n04k72P2O86J548K113J971J524
$$ plain form
54480 68987 70448 72325 74634 77020 79085 80683 82094 83859 86136 88367 89750 89879 88832 87067 85467
54465 85467 84910 85329 85592 84753 83019 81109 79278 77547 76240 75483 74670 73252 71671 70702 70255 69705 69039
54448 69039 68719 68632 68224 67578 67342 67541 67350 66216 64483 62836 61767 61526 61939 62262 61891 61130 60639 60340
54430 60340 59721 59008 58991 59616 59823 59051 58027 57721 58276 59319 60545 61638 62255 62500 62915 63693 64417 64830
54412 64830 65253 65976 66783 67538 68731 70957 74158 77770 81401 85013 88653 92350 96206 100363 104901
54397 104901 109851 115207 120835 126452 131692 136155 139570 142007 143821 145236 146119 146334 146020 145302 143954
54382 143954 141665 138438 134479 129949 125143 120606 116686 113174 109760 106561 103840 101500 99277 97147
54368 97147 95109 92902 90421 88125 86519 85467 84540 83792 83656 84279 85439 86893 88282 88977 88611 87615
$$ packed form
54480F8987J461J877K309K386K065J598J411J765K277K231J383J29j047j765j600
54465H5467n57M19K63q39j734j910j831j731j307p57q13j418j581r69m47n50o66
54448F9039l20q7m08o46k36J99j91j134j733j647j069k41M13L23l71p61m91k99
54430F0340o19p13j7O25K07p72j024l06N55J043J226J093O17K45M15P78P24M13
54412F4830M23P23Q07P55J193K226L201L612L631L612L640L697L856M157M538
54397A04901M950N356N628N617N240M463L415K437J814J415Q83K15l14p18j348
54382A43954k289l227l959m530m806m537l920l512l414l199k721k340k223k130
54368I7147k038k207k481k296j606j052r27p48j36O23J160J454J389O95l66r96
$$ plain form
54352 87615 86830 86811 87792 89854 92675 95583 98405 101762 105997 110496 114756 119292 124523 129535 133243
54337 133243 136207 139813 143983 147185 148682 149262 149566 149130 147534 145253 142825 140121 136897 133236 129067
54322 129067 124100 118610 113480 109058 104752 100085 95384 91028 86754 82240 77730 73652 70097 67005
54308 67005 64406 62150 59877 57453 55097 52952 51037 49656 49225 49545 49830 49623 49164 48811 48629 48607 48721
54291 48721 48792 48756 48927 49356 49220 47758 45659 44469 44633 45162 45309 45401 45771 46042 45982 46077 46682 47377 47680 47740
54271 47740 47944 48400 49071 49779 50014 49523 49155 50146 52445 54761 56462 58178 60215 61715 62053 61867 61984
54254 61984 62403 63034 64312 66129 67236 66816 65768 65370 65419 64853 63595 62559 62130 61770 61006 59964 58992
54237 58992 58393 58328 58520 58382 57882 57741 58279 58720 58311 57452 56938 56702 56234 55681 55480 55312 54535 53424 52912
$$ packed form
54352H7615p85j9R81K062K821K908K822L357M235M499M260M536N231N012L708
54337A33243K964L606M170L202J497N80L04m36j596k281k428k704l224l661m169
54322A29067m967n490n130m422m306m667m701m356m274m514m510m078l555l092
54308F7005k599k256k273k424k356k145j915j381m31L20K85k07m59l53j82k2J14
54291D8721P1l6J71M29j36j462k099j190J64N29J47R2L70K71o0R5O05O95L03O0
54271D7740K04M56O71P08K35m91l68R91K299K316J701J716K037J500L38j86J17
54254F1984M19O31J278J817J107m20j048l98M9n66j258j036m29l60p64j042r72
54237E8992n99o5J92j38n00j41N38M41m09q59n14k36m68n53k01j68p77j111n12
$$ plain form
54218 52912 53150 53253 52502 51056 49486 48384 48337 49459 50850 51316 50784 50381 51035 52585 54360 55954 57168
54201 57168 57782 57763 57443 57262 57503 58313 59743 61608 63520 65118 66238 66815 66718 65681 63489 60378 57120
54184 57120 54405 52199 50124 48351 47475 47447 47415 46974 46798 47531 48698 49362 49331 49011 48546 47899 47486 47862
54166 47862 48790 49337 48949 47959 47090 46904 47640 49034 50274 50645 50387 50576 51951 54081 55775 56207 55610
54149 55610 54903 54707 54832 54859 54920 55445 56258 56592 56113 55379 55025 55038 55106 55146 55124 54813 54069 53011 51689 50050
54129 50050 48407 47379 47037 46685 45789 44566 43388 42283 41384 41086 41284 41214 40600 40156 40358 40574 40278 40235
54111 40235 41414 43314 44547 44673 44356 44031 43591 43183 43206 43550 43829 44313 45591 47298 48268 48141 47819 48000
54093 48000 48179 47588 46438 45631 45676 46281 46759 46581 45790 45034 44951 45468 45951 46044 46013 46264 46839 47415 47578 47138
$$ packed form
54218E2912K38J03p51j446j570j102m7J122J391M66n32m03O54J550J775J594J214
54201E7168O14j9l20j81K41Q10J430J865J912J598J120N77r7j037k192l111l258
54184E7120k715k206k075j773q76k8l2m41j76P33J167O64l1l20m65o47m13L76
54166D7862R28N47l88r90q69j86P36J394J240L71k58J89J375K130J694M32n97
54149E5610p07j96J25K7O1N25Q13L34m79p34l54J3O8M0k2l11p44j058j322j639
54129E0050j643j028l42l52q96j223j178j105q99k98J98p0o14m44K02K16k96m3
54111D0235J179J900J233J26l17l25m40m08K3L44K79M84J278J707R70j27l22J81
54093D8000J79n91j150q07M5O05M78j78p91p56q3N17M83R3l1K51N75N76J63m40
$$ plain form
54073 47138 46428 46139 46675 47797 49100 50450 51662 52227 51942 51481 51680 52463 53081 53238 53258 53283 53079 52742
54055 52742 52878 53867 55378 56832 58033 59207 60633 62231 63421 63673 63432 64056 66350 69521 72136 73781
54039 73781 75147 76786 78621 80520 82609 84964 87622 90879 94957 99484 103914 108336 113208 118427
54025 118427 123438 128233 133306 138550 143076 146389 148969 151379 153551 155351 157224 159702 162655 165427
54011 165427 167433 168411 168397 167725 166769 165511 163651 161204 158580 155962 153067 149725 146265 143104 140287
53996 140287 137638 135046 132414 129581 126525 123495 120812 118705 117240 116192 115031 113408 111598 110132
53982 110132 109001 107663 105854 103963 102542 101812 101737 102140 102613 102695 102309 101834 101655 101920 102647 103713 104695
53965 104695 105158 105209 105473 106380 107714 108895 109502 109586 109761 110884 113262 116135 118295 119206 119289 119208 119227 119233 118994
$$ packed form
54073D7138p10k89N36J122J303J350J212N65k85m61J99P83O18J57K0K5k04l37
54055E2742J36R89J511J454J201J174J426J598J190K52k41O24K294L171K615J645
54039G3781J366J639J835J899K089K355K658L257M078M527M430M422M872N219
54025A18427N011M795N073N244M526L313K580K410K172J800J873K478K953K772
54011A65427K006R78j4o72r56j258j860k447k624k618k895l342l460l161k817
53996A40287k649k592k632k833l056l030k683k107j465j048j161j623j810j466
53982A10132j131j338j809j891j421p30p5M03M73Q2l86m75j79K65P27J066R82
53965A04695M63N1K64R07J334J181O07Q4J75J123K378K873K160R11Q3q1J9Ok39
$$ plain form
53946 118994 118433 117944 118350 120199 123193 126572 129929 133314 136849 140721 145229 150277 155014 158594 161079
53931 161079 162943 164007 163795 162753 162053 161992 161632 160348 158821 158010 157910 157945 157997 158403 159314 160589 162127
53914 162127 163941 166084 168708 172011 175958 180375 185329 190981 197019 202768 208068 213420 219011 224068
53900 224068 227572 229184 229152 227784 225482 222912 220653 218743 216829 214637 212187 209771 207769 206124 203927
53885 203927 199981 194086 187377 181218 176109 171799 167904 164050 159859 155322 150936 147193 144105 141479
53871 141479 139290 137444 135493 132988 129928 126622 123301 120095 117081 114074 110722 107143 104144 102360
53857 102360 101412 100401 99058 97844 96969 95915 94154 91885 89704 87772 85782 83762 82426 82351 83009
53842 83009 83112 82038 80427 79190 78387 77556 76745 76541 77160 78121 78898 79459 80054 80877 82006 83267 84130
$$ packed form
53946A18994n61m89M06J849K994L379L357L385L535L872M508N048M737L580K485
53931A61079J864J064k12j042p00o1l60j284j527q11j00L5N2M06R11J275J538
53914A62127J814K143K624L303L947M417M954N652O038N749N300N352N591N057
53900B24068L504J612l2j368k302k570k259j910j914k192k450k416k002j645k197
53885B03927l946n895o709o159n109m310l895l854m191m537m386l743l088k626
53871A41479k189j846j951k505l060l306l321l206l014l007l352l579k999j784
53857A02360r48j011j343j214q75j054j761k269k181j932j990k020j336p5O58
53842H3009J03j074j611j237q03q31q11k04O19R61P77N61N95Q23J129J261Q63
$$ plain form
53825 84130 84127 83431 82640 82045 81509 81052 80963 81284 81655 81840 81915 81891 81680 81587 82258 83895 85974 87923 89614 91015
53805 91015 91995 92785 94067 96185 98705 101123 103569 106385 109494 112687 116174 120304 124924 129507 133729
53790 133729 137558 140965 144028 147164 150718 154257 156722 157512 157232 157170 158100 159691 161091 161875 162216 162165
53774 162165 161278 159245 156573 154128 152233 150719 149664 149369 149582 149516 148796 147759 146581 144811 142153 139167
53758 139167 136636 134661 132734 130440 127711 124773 122204 120694 120311 120223 119535 118231 116996 116346 116261 116512
53742 116512 116965 117596 118432 119413 120261 120601 120366 119912 119711 120016 120742 121388 121201 119893 118160 117015 116584 116091
53724 116091 115064 113843 112787 111728 110562 109697 109409 109360 109212 109171 109400 109479 109117 108933 109764 111487 113296
53707 113296 114961 117055 119934 123182 126140 128446 129965 130756 131302 132388 134436 137173 140096 143108 146494
$$ packed form
53825H4130lo96p91n95n36m57q9L21L71J85P5k4k11r3O71J637K079J949J691J401
53805I1015R80P90J282K118K520K418K446K816L109L193L487M130M620M583M222
53790A33729L829L407L063L136L554L539K465P90k80o2R30J591J400P84L41n1
53774A62165q87k033k672k445j895j514j055k95K13o6p20j037j178j770k658k986
53758A39167k531j975j927k294k729k938k569j510l83q8o88j304j235o50q5K51
53742A16512M53O31Q36R81Q48L40k35m54k01L05P26O46j87j308j733j145m31m93
53724A16091j027j221j056j059j166q65k88m9j48m1K29P9l62j84Q31J723J809
53707A13296J665K094K879L248K958K306J519P91N46J086K048K737K923L012L386
$$ plain form
53692 146494 150427 154649 158679 162307 165808 169611 173749 177760 181132 183780 186039 188290 190609 192755
53678 192755 194549 196239 198251 200504 202300 203158 203416 203636 203801 203575 202988 202227 201085 199382 197696 196759
53662 196759 196213 194954 192727 190404 188563 186862 185088 183712 182945 182216 181221 180530 180478 180305 179201 177486
53646 177486 176038 175209 175051 175875 177625 179235 179591 178818 177837 177087 176478 176131 176234 176442 176350 176282 176769 177527
53628 177527 177885 178050 178874 180432 181855 182779 183960 186121 188938 191564 193688 195666 197984 200777 203671
53613 203671 206054 207788 209590 212363 216175 220385 224657 229304 234472 239580 243860 247229 250382 254081
53599 254081 258444 262880 266777 270265 274089 278734 284017 289613 295445 301277 306451 310583 314130 317728
53585 317728 321285 324327 326931 329686 332880 336318 339782 343086 345801 347547 348548 349403 350355 351284 352306
$$ packed form
53692A46494L933M222M030L628L501L803M138M011L372K648K259K251K319K146
53678A92755J794J690K012K253J796Q58K58K20J65k26n87p61j142j703j686r37
53662A96759n46j259k227k323j841j701j774j376p67p29r95o91n2j73j104j715
53646A77486j448q29j58Q24J750J610L56p73r81p50o09l47J03K08r2o8M87P58
53628A77527L58J65Q24J558J423R24J181K161K817K626K124J978K318K793K894
53613B03671K383J734J802K773L812M210M272M647N168N108M280L369L153L699
53599B54081M363M436L897L488L824M645N283N596N832N832N174M132L547L598
53585C17728L557L042K604K755L194L438L464L304K715J746J001Q55R52R29J022
$$ plain form
53570 352306 353741 355500 356999 357805 357959 357700 357282 356960 356747 356229 355125 353975 353718 354554 355697 356426 356913
53553 356913 357819 359349 360927 361733 361537 361014 361082 361919 362887 363528 364173 365299 366805 368406 370250 372544 374901
53536 374901 376714 377967 379077 380162 381143 382416 384719 388358 393024 398323 403943 409442 414470 419224
53522 419224 424205 429656 435724 442924 451742 461790 471967 481546 490673 499976 510220 522093 535605
53509 535605 549739 563411 576789 590969 606464 622834 639883 658225 678295 699605 721529
53498 721529 744301 768633 794658 821702 849001 876336 904032 932472 961561 990673 1019158
53487 1019158 1046803 1073655 1099661 1124788 1149320 1173729 1198376 1223542 1249393 1275582 1301303
53476 1301303 1326203 1350850 1375763 1400453 1424123 1446933 1469671 1492432 1514531 1535577 1555660
$$ packed form
53570C52306J435J759J499Q06J54k59m18l22k13n18j104j150k57Q36J143P29M87
53553C56913R06J530J578Q06j96n23O8Q37R68O41O45J126J506J601J844K294K357
53536C74901J813J253J110J085R81J273K303L639M666N299N620N499N028M754
53522D19224M981N451O068P200Q818J0048J0177R579R127R303J0244J1873J3512
53509E35605J4134J3672J3378J4180J5495J6370J7049J8342K0070K1310K1924
53498G21529K2772K4332K6025K7044K7299K7335K7696K8440K9089K9112K8485
53487A019158K7645K6852K6006K5127K4532K4409K4647K5166K5851K6189K5721
53476A301303K4900K4647K4913K4690K3670K2810K2738K2761K2099K1046K0083
$$ plain form
53465 1555660 1574461 1591158 1605413 1617684 1628403 1637593 1645409 1652271 1658181 1662591 1665144 1665927 1664830
53452 1664830 1661307 1654965 1645881 1634268 1620439 1605134 1589169 1572611 1554916 1535906 1515856 1494662
53440 1494662 1471823 1447433 1422344 1397101 1371579 1345817 1320242 1294720 1268427 1241188 1214082
53429 1214082 1188139 1163285 1139191 1116329 1095411 1076389 1058815 1042699 1028333 1015654 1004461
53418 1004461 994868 986949 980280 974446 969763 966939 966275 967608 970718 975345 981163 988186 996954 1007899
53404 1007899 1020855 1035561 1052174 1070767 1090778 1111641 1133707 1157877 1184407 1212651 1241932
53393 1241932 1272163 1303630 1336664 1371618 1408840 1448434 1490108 1533330 1577691 1623250 1670502
53382 1670502 1719861 1771269 1824536 1879830 1937324 1996460 2056159 2115769 2175255 2234478 2293046
$$ packed form
53465A555660J8801J6697J4255J2271J0719R190P816O862N910M410K553P83j097
53452A664830l523o342r084j1613j3829j5305j5965j6558j7695j9010k0050k1194
53440A494662k2839k4390k5089k5243k5522k5762k5575k5522k6293k7239k7106
53429A214082k5943k4854k4094k2862k0918j9022j7574j6116j4366j2679j1193
53418A004461r593p919o669n834m683k824o64J333L110M627N818P023Q768J0945
53404A007899J2956J4706J6613J8593K0011K0863K2066K4170K6530K8244K9281
53393A241932L0231L1467L3034L4954L7222L9594M1674M3222M4361M5559M7252
53382A670502M9359N1408N3267N5294N7494N9136N9699N9610N9486N9223N8568
$$ plain form
53371 2293046 2350964 2408539 2465310 2519966 2571738 2621013 2667989 2711495 2749945 2782905 2810969
53360 2810969 2834654 2854289 2870560 2884163 2894902 2901744 2903753 2900499 2891898 2878291 2860580 2839673
53348 2839673 2815745 2788340 2756867 2720610 2678723 2630979 2578434 2522735 2464998 2405907 2346592
53337 2346592 2288472 2232173 2177307 2123455 2070726 2019235 1968693 1918845 1869867 1822023 1775253
53326 1775253 1729383 1684527 1641084 1599439 1559767 1522031 1486210 1452594 1421738 1393898 1368701
53315 1368701 1345622 1324608 1305797 1288697 1272174 1255474 1238917 1223310 1208892 1195190 1181912
53304 1181912 1169664 1159529 1151929 1146177 1141356 1137468 1135381 1135687 1138010 1141501 1145582 1149960 1154333 1158544
53290 1158544 1162983 1168501 1175845 1185245 1196521 1209591 1224850 1242903 1263727 1286362 1309821 1334210
$$ packed form
53371B293046N7918N7575N6771N4656N1772M9275M6976M3506L8450L2960K8064
53360B810969K3685J9635J6271J3603J0739O842K009l254q601j3607j7711k0907
53348B839673k3928k7405l1473l6257m1887m7744n2545n5699n7737n9091n9315
53337B346592n8120n6299n4866n3852n2729n1491n0542m9848m8978m7844m6770
53326A775253m5870m4856m3443m1645l9672l7736l5821l3616l0856k7840k5197
53315A368701k3079k1014j8811j7100j6523j6700j6557j5607j4418j3702j3278
53304A181912j2248j0135p600n752m821l888k087L06K323L491M081M378M373M211
53290A158544M439N518P344R400J1276J3070J5259J8053K0824K2635K3459K4389
$$ plain form
53278 1334210 1360402 1388615 1417887 1447090 1475847 1504239 1532189 1559491 1585910 1610913 1633750
53267 1633750 1654229 1672983 1690549 1706557 1720236 1731325 1740088 1746813 1751790 1755445 1757943 1758855 1757636
53254 1757636 1754189 1748615 1740742 1730347 1717536 1702484 1685110 1665492 1644207 1621741 1597857 1572193
53242 1572193 1545208 1517799 1490179 1461826 1432551 1402877 1373303 1343865 1314640 1286132 1258862
53231 1258862 1232863 1207781 1183294 1159411 1136514 1115131 1095323 1076354 1057264 1037777 1018394
53220 1018394 999577 981193 962876 944771 927738 912785 900221 889399 879370 869735 860524 851384
53208 851384 841523 830697 819659 809132 798828 787930 776189 763910 751174 737808 724057 710585
53196 710585 697712 685173 672725 660581 649024 637934 626805 615113 602610 589473 576161
$$ packed form
53278A334210K6192K8213K9272K9203K8757K8392K7950K7302K6419K5003K2837
53267A633750K0479J8754J7566J6008J3679J1089Q763O725M977L655K498R12j219
53254A757636l447n574p873j0395j2811j5052j7374j9618k1285k2466k3884k5664
53242A572193k6985k7409k7620k8353k9275k9674k9574k9438k9225k8508k7270
53231A258862k5999k5082k4487k3883k2897k1383j9808j8969j9090j9487j9383
53220A018394j8817j8384j8317j8105j7033j4953j2564j0822j0029r635r211r140
53208H51384r861j0826j1038j0527j0304j0898j1741j2279j2736j3366j3751j3472
53196G10585j2873j2539j2448j2144j1557j1090j1129j1692j2503j3137j3312
$$ plain form
53185 576161 563078 550372 538024 525859 513429 500334 486826 473718 461424 449524 437588
53174 437588 425912 414942 404483 394108 384020 374749 366259 358050 350079 342826 336459 330538 324644
53161 324644 318755 312929 307097 301252 295460 289651 283791 278227 273371 269021 264502 259635 255146 251942
53147 251942 250191 249200 247966 245838 242917 239886 237350 235384 233804 232542 231482 230276 228730 227126
53133 227126 225764 224477 223091 222015 221759 222144 222660 223408 224823 226613 227926 228748 230205 233137 237080
53118 237080 241098 244951 248948 253141 257243 261028 264293 266642 267750 267728 266850 264993 261723 256987 251460
53103 251460 246072 241272 236830 232325 227715 223347 219427 215669 211562 206880 201837 196905 192574 189064
53089 189064 186157 183470 180962 178867 177011 174656 171367 167660 164423 161995 160230 159098 158659 158615 158409
$$ packed form
53185E76161j3083j2706j2348j2165j2430j3095j3508j3108j2294j1900j1936
53174D37588j1676j0970j0459j0375j0088r271q490q209p971p253o367n921n894
53161C24644n889n826n832n845n792n809n860n564m856m350m519m867m489l204
53147B51942j751r91j234k128k921l031k536j966j580j262j060j206j546j604
53133B27126j362j287j386j076k56L85N16P48J415J790J313Q22J457K932L943
53118B37080M018L853L997M193M102L785L265K349J108k2q78j857l270m736n527
53103B51460n388m800m442m505m610m368l920l758m107m682n043m932m331l510
53089A89064k907k687k508k095j856k355l289l707l237k428j765j132m39m4k06
$$ plain form
53074 158409 157658 156134 153589 150154 146667 143965 142025 140385 139181 139019 139866 140892 141522 141927 142267 142193
53058 142193 141440 140340 139349 138442 137314 135847 134070 131940 129491 127081 125242 124322 124304 124825 125389 125701
53042 125701 125848 126037 126307 126592 126791 126579 125472 123486 121463 120278 119891 119607 119020 118198 117251 116283 115581
53025 115581 115137 114246 112365 110239 109318 110025 111427 112684 113827 114845 115031 113842 111798 109923 108741
53010 108741 108231 108261 108597 108873 109034 109496 110485 111498 111839 111490 111109 111300 112144 113282 114296 115072 115887 116950
52992 116950 117919 118215 117816 117344 117215 117167 116813 116319 116253 117007 118573 120682 123032 125544 128473 132069 136140
52975 136140 140158 143808 147202 150654 154555 159309 164925 170707 175812 180052 183757 186921 189038 189768
52961 189768 189248 187799 185840 184013 182717 181475 179501 176934 174757 173347 171895 169505 166111 162022
$$ packed form
53074A58409p51j524k545l435l487k702j940j640j204j62Q47J026O30M05L40p4
53058A42193p53j100r91r07j128j467j777k130k449k410j839r20j8N21N64L12
53042A25701J47J89K70K85J99k12j107j986k023j185l87k84n87q22r47r68p02
53025A15581m44q91j881k126r21P07J402J257J143J018J86j189k044j875j182
53010A08741n10L0L36K76J61M62R89J013L41l49l81J91Q44J138J014P76Q15J063
52992A16950R69K96l99m72j29m8l54m94o6P54J566K109K350K512K929L596M071
52975A36140M018L650L394L452L901M754N616N782N105M240L705L164K117P30
52961A89768n20j449j959j827j296j242j974k567k177j410j452k390l394m089
$$ plain form
52947 162022 157366 152512 148311 145291 143051 140959 139008 137505 136351 135173 133880 132604 131366 130173
52933 130173 129189 128510 128006 127615 127493 127662 127928 128395 129568 131601 133830 135462 136386 137007 137588 138065 138217
52916 138217 137735 136472 134895 133865 133710 133882 133810 133643 133822 134397 135143 135963 136759 137262 137357 137255 137071 136668
52898 136668 136236 136466 137638 139032 139822 140193 140991 142561 144555 146697 149139 151987 154866 157044 157895 157439
52882 157439 156529 156213 156723 157421 157821 158187 158870 159689 160375 161080 161939 162626 162936 163435 164864 167140 169486 171386
52864 171386 172920 174330 175703 176995 178045 178713 179253 180219 181767 183434 184900 186511 188689 191370 194532
52849 194532 198729 204401 211019 217505 223158 227671 230832 233004 235422 238984 242901 245410 245721 244469
52835 244469 242404 239630 236171 232306 228077 223247 218065 213434 209913 207061 204084 200751 197365 194186
$$ packed form
52947A62022m656m854m201l020k240k092j951j503j154j178j293j276j238j193
52933A30173r84o79n04l91j22J69K66M67J173K033K229J632R24O21N81M77J52
52916A38217m82j263j577j030j55J72p2j67J79N75P46Q20P96N03R5j02j84m03
52898A36668m32K30J172J394P90L71P98J570J994K142K442K848K879K178Q51m56
52882A57439r10l16N10O98M00L66O83Q19O86P05Q59O87L10M99J429K276K346J900
52864A71386J534J410J373J292J050O68N40R66J548J667J466J611K178K681L162
52849A94532M197N672O618O486N653M513L161K172K418L562L917K509L11j252
52835B44469k065k774l459l865m229m830n182m631l521k852k977l333l386l179
$$ plain form
52821 194186 191173 188130 184877 181417 178018 174968 172303 169965 168090 166884 166244 165808 165286 164496 163251
52806 163251 161547 159691 157886 155910 153623 151582 150532 150384 150298 149748 148902 147911 146501 144524 142375 140510
52790 140510 138927 137473 136310 135755 135813 136167 136519 136744 136727 136230 134998 133034 130749 128739 127375 126665 126480
52773 126480 126600 126559 125853 124609 123654 123541 123839 123792 123376 123140 123208 123077 122400 121393 120363 119318 118140 116751
52755 116751 115005 112784 110320 108088 106292 104721 103184 101715 100278 98657 96858 95325 94510 94347 94344
52740 94344 94108 93584 92810 91628 89834 87666 85954 85506 86297 87500 88338 88691 88904 89357 90289 91599 92707
52723 92707 92976 92484 91914 91516 90818 89658 88795 88843 89206 88869 87855 87076 87026 87519 88554 90463 93021 95268
52705 95268 96595 97471 98845 101198 104418 108153 112065 115965 119863 123675 126932 129099 130156 130528 130442
$$ packed form
52821A94186l013l043l253l460l399l050k665k338j875j206o40m36n22p90j245
52806A63251j704j856j805j976k287k041j050j48q6n50q46r91j410j977k149j865
52790A40510j583j454j163n55N8L54L52K25j7m97j232j964k285k010j364p10j85
52773A26480J20m1p06j244r55j13K98m7m16k36O8j31o77j007j030j045j178j389
52755A16751j746k221k464k232j796j571j537j469j437j621j799j533q15j63l
52740I4344k36n24p74j182j794k168j712m48P91J203Q38L53K13M53R32J310J108
52723I2707K69m92n70l98o98j160q63M8L63l37j014p79n0M93J035J909K558K247
52705I5268J327Q76J374K353L220L735L912L900L898L812L257K167J057L72q6
$$ plain form
52690 130442 129712 128174 126014 123572 121096 118708 116397 114087 111856 109937 108342 106727 104870 102921
52676 102921 100822 97975 94156 90376 87989 87031 86259 84828 83130 81821 80793 79469 77567 75273 73061
52661 73061 71556 71145 71520 71913 71884 71509 70807 69593 68076 66998 66783 66963 66804 66200 65598 65325 65343 65502
52643 65502 65699 65778 65641 65532 66055 67646 69952 71935 72866 73144 73772 74993 76003 76179 75965 76079 76424 76381
52625 76381 75785 74911 73813 72414 71069 70267 69851 69197 68097 66910 65973 65501 65852 67079 68371 68817 68702
52608 68702 69141 70369 71383 71478 71146 71037 70989 70668 70455 70968 72128 73237 73764 73714 73472 73576 74355 75615
52590 75615 76856 77803 78424 78561 78133 77630 77768 78599 79608 80689 82222 84110 85606 86425 87178 88353 89673
52573 89673 90845 92150 93752 95187 96104 96886 97916 98870 99413 100022 101373 103284 104978 106120 106995 107916
$$ packed form
52690A30442p30j538k160k442k476k388k311k310k231j919j595j615j857j949
52676A02921k099k847l819l780k387r58p72j431j698j309j028j324j902k294k212
52661G3061j505m11L75L93k9l75p02j214j517j078k15J80j59o04o02k73J8J59
52643F5502J97P9j37j09N23J591K306J983R31K78O28J221J010J76k14J14L45m3
52625G6381n96q74j098j399j345q02m16o54j100j187r37m72L51J227J292M46j15
52608F8702M39J228J014R5l32j09m8l21k13N13J160J109N27n0k42J04P79J260
52590G5615J241R47O21J37m28n03J38Q31J009J081J533J888J496Q19P53J175J320
52573H9673J172J305J602J435R17P82J030R54N43O09J351J911J694J142Q75R21
$$ plain form
52557 107916 109000 110270 111483 112120 111974 111446 110912 110215 109268 108698 109243 110780 112557 114121 115440 116369
52541 116369 116691 116624 116698 117084 117530 117921 118486 119388 120415 121152 121332 121076 120926 121447 122686 124250 125929 127780
52523 127780 129479 130209 129604 128338 127317 126714 126282 126073 126151 125920 124573 122265 120216 119547 120301 121590 122401
52506 122401 122365 121967 121914 122193 122124 121454 120804 120686 120733 120560 120720 121867 123425 124177 124076 124364 125747 127479 128552
52487 128552 128950 129233 129618 130083 130875 132212 133767 135015 135947 136939 137993 138637 138679 138654 139216 140361 141489
52470 141489 142175 142540 142852 143111 143220 143329 143661 144135 144506 144848 145520 146626 147898 149190 150668 152345 153831
52453 153831 154844 155662 156777 158284 159877 161323 162690 164178 165849 167448 168546 169048 169499 170511 171875
52438 171875 172695 172491 171753 171237 171166 171281 171215 170591 169237 167610 166527 166189 165840 164678 162663 160232 157821
$$ packed form
52557A07916J084J270J213O37j46n28n34o97r47n70N45J537J777J564J319R29
52541A16369L22o7P4L86M46L91N65R02J027P37J80k56j50N21J239J564J679J851
52523A27780J699P30o05j266j021o03m32k09P8k31j347k308k049o69P54J289Q11
52506A22401l6l98n3K79o9o70o50j18M7j73J60J147J558P52j01K88J383J732J073
52487A28552L98K83L85M65P92J337J555J248R32R92J054O44M2k5N62J145J128
52470A41489O86L65L12K59J09J09L32M74L71L42O72J106J272J292J478J677J486
52453A53831J013Q18J115J507J593J446J367J488J671J599J098N02M51J012J364
52438A71875Q20k04p38n16p1J15o6o24j354j627j083l38l49j162k015k431k411
$$ plain form
52421 157821 155975 155283 155642 156090 155889 155322 155013 155063 155420 156410 158053 159441 159700 159245 159100 159300 159007 158117
52403 158117 157632 158213 159266 159794 159492 158754 158212 158511 160018 162346 164485 165603 165565 164757 163802 163397 163888
52386 163888 164878 165607 165745 165563 165475 165832 167001 169005 171073 172205 172291 172203 172640 173445 174201 174940 175969 177372
52368 177372 178979 180556 181911 183019 184138 185515 186992 188228 189283 190527 191981 193273 194344 195676
52354 195676 197594 199829 202015 204217 206596 208947 210993 212902 215081 217555 219871 221681 223174 224843
52340 224843 226961 229364 231713 233797 235506 236670 237296 237969 239560 242245 245136 247257 248594 249802 251165
52325 251165 252457 253637 255077 256998 259273 261876 265037 268720 272340 275323 277724 280133 283117 286896
52311 286896 291356 296316 301823 308112 315179 322602 330050 337780 346312 355747 365838 376591 388287
$$ packed form
52421A57821j846o92L59M48k01n67l09N0L57R90J643J388K59m55j45K00k93q90
52403A58117m85N81J053N28l02p38n42K99J507K328K139J118l8q08r55m05M91
52386A63888R90P29J38j82q8L57J169K004K068J132Q6q8M37Q05P56P39J029J403
52368A77372J607J577J355J108J119J377J477J236J055J244J454J292J071J332
52354A95676J918K235K186K202K379K351K046J909K179K474K316J810J493J669
52340B24843K118K403K349K084J709J164O26O73J591K685K891K121J337J208J363
52325B51165J292J180J440J921K275K603L161L683L620K983K401K409K984L779
52311B86896M460M960N507O289P067P423P448P730Q532R435J0091J0753J1696
$$ plain form
52298 388287 400912 414026 427294 440735 454494 468786 484051 500631 518131 535616 552606
52287 552606 569477 586687 604112 621401 638530 655609 672418 688536 703771 718129 731473
52276 731473 743541 754335 764232 773601 782367 790018 796072 800486 803471 805020 804929 803424 801374 799538
52262 799538 797814 795611 792750 789566 786258 782681 778789 774823 770972 767197 763443 759733 756079 752690
52248 752690 750196 749206 749536 750373 751430 753543 757827 764459 772524 781015 789807 799614 810974 823384
52234 823384 835746 847649 859712 872363 884884 896299 906758 917193 927791 937707 946318 953789
52222 953789 960162 964695 966687 966479 965160 963543 961715 959289 955783 950880 944521 936746 927578 917355
52208 917355 906941 897079 887554 877474 866396 854716 843006 831563 820634 810407 800621 790781
$$ packed form
52298C88287J2625J3114J3268J3441J3759J4292J5265J6580J7500J7485J6990
52287E52606J6871J7210J7425J7289J7129J7079J6809J6118J5235J4358J3344
52276G31473J2068J0794R897R369Q766P651O054M414K985J549r1j505k050j836
52262G99538j724k203k861l184l308l577l892l966l851l775l754l710l654l389
52248G52690k494r90L30Q37J057K113M284O632Q065Q491Q792R807J1360J2410
52234H23384J2362J1903J2063J2651J2521J1415J0459J0435J0598R916Q611P471
52222I53789O373M533J992k08j319j617j828k426l506m903o359p775r168j0223
52208I17355j0414r862r525j0080j1078j1680j1710j1443j0929j0227r786r840
$$ plain form
52196 790781 780957 771884 764117 757560 751919 747024 742592 738316 734365 731222 728881 726884 725235 724406
52182 724406 724150 723300 721261 718943 717531 717028 716618 715842 714711 713251 711747 710941 711136 711424 710583 708527
52166 708527 706150 704026 702055 700187 698588 697081 695160 692683 689959 687108 683935 680496 677176 674026
52152 674026 670574 666574 662500 658967 655941 652875 649541 646389 643967 642069 639706 636152 631883 628107
52138 628107 625327 622812 619627 615710 611603 607622 603807 600359 597562 595373 593522 591864 590221 588111
52124 588111 585207 581969 579338 577724 576700 575617 574120 572085 569649 567397 566118 566174 567332 569268 571916
52109 571916 575289 579352 584243 590294 597568 605558 613637 621778 630742 641510 654554 669561 685794
52096 685794 702667 720005 737914 756544 775968 796134 816885 838153 859985 882136 903750
$$ packed form
52196G90781r824r073p767o557n641m895m432m276l951l143k341j997j649q29
52182G24406k56q50k039k318j412n03m10p76j131j460j504q06J95K88q41k056
52166G08527k377k124j971j868j599j507j921k477k724k851l173l439l320l150
52152F74026l452m000m074l533l026l066l334l152k422j898k363l554m269l776
52138F28107k780k515l185l917m107l981l815l448k797k189j851j658j643k110
52124E88111k904l238k631j614j024j083j497k035k436k252j279N6J158J936K648
52109E71916L373M063M891O051P274P990Q079Q141Q964J0768J3044J5007J6233
52096F85794J6873J7338J7909J8630J9424K0166K0751K1268K1832K2151K1614
$$ plain form
52085 903750 923939 942777 961251 980006 998460 1015377 1029949 1042123 1052319 1061184 1069242 1076396
52073 1076396 1081949 1085414 1086980 1086937 1085098 1081260 1075824 1069433 1062337 1054653 1046887 1039425 1031705 1022700
52059 1022700 1012305 1001595 991650 982708 974573 967154 960346 953891 947685 941958 936989 932971 930257
52046 930257 929264 929963 931776 934231 937419 941631 946834 952735 959082 965716 972581 979918 988167 997342 1006682
52031 1006682 1015188 1022467 1028813 1034540 1039508 1043382 1046129 1048091 1049562 1050444 1050375 1049168 1046971 1044002 1040318
52016 1040318 1035885 1030647 1024430 1016949 1008114 998110 986961 974240 959496 942849 924826 905716
52004 905716 885489 864332 842881 821817 801436 781672 762227 742662 722601 702003 681053
51993 681053 659804 638162 616347 595107 575228 556824 539261 521822 504432 487668 471954
$$ packed form
52085I03750K0189J8838J8474J8755J8454J6917J4572J2174J0196Q865Q058P154
52073A076396N553L465J566m3j839l838n436o391p096p684p766p462p720r005
52059A022700j0395j0710r945q942q135p419o808o455o206n727m969m018k714
52046I30257r93O99J813K455L188M212N203N901O347O634O865P337Q249R175R340
52031A006682Q506P279O346N727M968L874K747J962J471Q82o9j207k197k969l684
52016A040318m433n238o217p481q835j0004j1149j2721j4744j6647j8023j9110
52004I05716k0227k1157k1451k1064k0381j9764j9445j9565k0061k0598k0950
51993F81053k1249k1642k1815k1240j9879j8404j7563j7439j7390j6764j5714
$$ plain form
51982 471954 456878 441570 425822 410480 396488 383856 371934 360422 349610 339687 330289 320921
51970 320921 311492 302379 294153 287208 281365 275829 269874 263684 258224 254189 251294 248673 245713 242383
51956 242383 239004 235861 232967 230125 227251 224548 222164 219750 216719 213012 209381 206709 205199 204310
51942 204310 203364 202173 201129 200670 200671 200533 199942 199205 198527 197414 195423 193271 192296 192714 193257 192882 191934 191038
51924 191038 189662 186946 183562 181461 181541 182555 182836 182259 181741 181469 180703 179283 178231 178385 179067 178787 176921
51907 176921 174167 171492 169268 167496 166243 165505 164958 164175 163030 161659 160214 158817 157664 156943 156689
51892 156689 156749 156796 156383 155267 153782 152619 152078 151775 151282 150737 150475 150373 149997 149260 148490 147865 147203 146421
51874 146421 145822 145788 146394 147417 148527 149413 149897 149994 149768 149186 148315 147628 147847 149375 151997 155063 157813
$$ packed form
51982D71954j5076j5308j5748j5342j3992j2632j1922j1512j0812r923r398r368
51970C20921r429r113q226o945n843n536n955o190n460m035k895k621k960l330
51956B42383l379l143k894k842k874k703k384k414l031l707l631k672j510q89
51942B04310r46j191j044m59Jj38n91p37o78j113j991k152r75M18N43l75r48q96
51924A91038j376k716l384k101Q0J014K81n77n18k72p66j420j052J54O82k80j866
51907A76921k754k675k224j772j253p38n47p83j145j371j445j397j153p21k54
51892A56689O0M7m13j116j485j163n41l03m93n45k62j02l76p37p70o25o62p82
51874A46421n99l4O06J023J110Q86M84R7k26n82q71o87K19J528K622L066K750
$$ plain form
51857 157813 159650 160391 160381 160236 160490 161498 163441 166112 168837 171015 172782 174756 177122 179340 180931
51842 180931 182190 183799 185916 187931 189116 189287 188810 188047 186989 185479 183732 182350 181753 181748 181828 181690 181257
51825 181257 180455 179357 178465 178402 179242 180489 181775 183269 185217 187365 189130 190241 190986 191769 192537 192791
51809 192791 192182 191004 189864 188925 187801 186314 184929 184121 183649 182839 181411 179658 178020 176895 176637 177130
51793 177130 177528 177050 176050 175640 176194 176940 177252 177592 178690 180382 181861 182757 183372 184047 184840 185745 186801
51776 186801 187943 189017 189966 190828 191594 192278 192972 193665 194229 194815 196037 198328 201211 203671 205337 206856
51760 206856 208993 211776 214807 218021 221650 225550 229191 232507 236376 241869 249157 257470 266074 274910
51746 274910 284271 294138 303955 312726 319247 322664 323147 321822 319746 317141 313879 310371 307491 305668
$$ packed form
51857A57813J837P41j0j45K54J008J943K671K725K178J767J974K366K218J591
51842A80931J259J609K117K015J185J71m77p63j058j510j747j382n97nQ0j38m33
51825A81257q02j098q92o3Q40J247J286J494J948K148J765J111P45P83P68K54
51809A92791o09j178j140r39j124j487j385q08m72q10j428j753j638j125k58M93
51793A77130L98m78j000m10N54P46L12L40J098J692J479Q96O15O75P93R05J056
51776A86801J142J074R49Q62P66O84O94O93N64N86J222K291K883K460J666J519
51760B06856K137K783L031L214L629L900L641L316L869N493P288Q313Q604Q836
51746B74910R361R867R817Q771O521L417M83j325k076k605l262l508k880j823
$$ plain form
51732 305668 304538 303545 302600 302163 302950 305439 309312 313379 316480 318443 319831 320865 321161 320584 319738 319332
51716 319332 319474 319867 320253 320347 319740 318318 316554 314992 313640 312253 311000 310385 310511 310784 310460 309238 307286
51699 307286 304906 302360 299953 298127 297309 297588 298621 299977 301506 303211 304841 306058 307033 308507 311026
51684 311026 314417 318256 322666 328256 335267 342936 349721 354102 355378 353927 350756 346778 342552 338581
51670 338581 335504 333839 333698 334858 336930 339327 341350 342542 342870 342502 341530 340016 337993 335263 331442
51655 331442 326441 320673 314539 308017 301138 294568 289113 284667 280180 274825 268778 262671 256781 251153
51641 251153 246132 242144 238956 235694 231885 228136 225434 223972 223009 221794 220224 218535 216831 215152
51627 215152 213668 212483 211396 210184 208924 207687 206134 203933 201555 200071 199954 200485 200619 200108 199435
$$ packed form
51732C05668j130r93r45m37P87K489L873M067L101J963J388J034K96n77q46m06
51716C19332J42L93L86R4o07j422j764j562j352j387j253o15J26K73l24j222j952
51699C07286k380k546k407j826q18K79J033J356J529J705J630J217R75J474K519
51684C11026L391L839M410N590P011P669O785M381J276j451l171l978m226l971
51670C38581l077j665j41J160K072K397K023J192L28l68r72j514k023k730l821
51655C31442n001n768o134o522o879o570n455m446m487n355o047o107n890n628
51641B51153n021l988l188l262l809l749k702j462r63j215j570j689j704j679
51627B15152j484j185j087j212j260j237j553k201k378j484j17N31J34n11o73
$$ plain form
51612 199435 198905 198265 197240 196083 195374 195318 195442 195142 194493 194271 194976 196069 196536 196139 195735 196334 198175 200746
51594 200746 203289 205149 206095 206597 207516 209240 211383 213612 216451 220769 226602 233029 239327 245771 252973
51579 252973 260658 267574 272782 276709 280596 284895 288566 290159 289376 287202 284672 281920 278518 274325
51565 274325 269760 265470 261947 259362 257582 256384 255689 255501 255720 256225 257183 258995 261815 265352 269294
51550 269294 273713 278858 284635 290497 295858 300543 304831 309031 313027 316404 319020 321199 323112 324283
51536 324283 324202 323266 322558 322632 323008 323048 322816 322846 323443 324537 325910 327278 328364 329126 329759 330317 330544 330250 329503
51517 329503 328270 326171 322953 318987 314920 310944 306690 301823 296434 290827 285122 279280 273459 268211
51503 268211 264086 261013 258334 255632 253217 251498 250201 248749 247212 246252 246197 246774 247708 248829 249521 249018
$$ packed form
51612A99435n30o40j025j157p09n6J24l00o49k22P05J093M67l97m04N99J841K571
51594B00746K543J860R46N02R19J724K143K229K839M318N833O427O298O444P202
51579B52973P685O916N208L927L887M299L671J593p83k174k530k752l402m193
51565B74325m565m290l523k585j780j198o95j88K19N05R58J812K820L537L942
51550B69294M419N145N777N862N361M685M288M200L996L377K616K179J913J171
51536C24283q1r36p08P4L76M0k32L0N97J094J373J368J086P62O33N58K27k94p47
51517C29503j233k099l218l966m067l976m254m867n389n607n705n842n821n248
51503B68211m125l073k679k702k415j719j297j452j537r60n5N77R34J121O92n03
$$ plain form
51487 249018 247555 246458 246632 247674 248954 250763 253621 257069 260054 262291 264447 267145 270400 273953
51473 273953 277635 281441 285660 290708 296485 302233 307507 312886 319121 326023 332914 339866 347540 355948
51459 355948 364309 372253 380186 388240 395706 401886 406924 411355 415398 419020 422182 424593 425752 425708 425444
51444 425444 425933 427021 427781 427821 427683 427921 428330 428317 427644 426404 424455 421349 416923 411621 405949 399837 392907
51427 392907 385262 377612 370507 363830 357223 350717 344620 339034 333741 328562 323649 319526 316791 315569
51413 315569 315159 314616 313822 313611 314643 316599 318822 321367 324891 329704 335354 341030 346013 349911 352804
51398 352804 355054 356745 357445 356721 354541 350919 345636 338758 331028 323162 315025 306045 296159 285781
51384 285781 275184 264653 254995 246993 240338 233865 226979 220192 214195 209105 204789 201214 198188 195271
$$ packed form
51487B49018j463j097J74J042J280J809K858L448K985K237K156K698L255L553
51473B73953L682L806M219N048N777N748N274N379O235O902O891O952P674Q408
51459C55948Q361P944P933Q054P466O180N038M431M043L622L162K411J159m4k64
51444D25444M89J088P60M0j38K38M09j3o73j240j949l106m426n302n672o112o930
51427C92907p645p650p105o677o607o506o097n586n293n179m913m123k735j222
51413C15569m10n43p94k11J032J956K223K545L524M813N650N676M983L898K893
51398C52804K250J691P00p24k180l622n283o878p730p866q137q980r886j0378
51384B85781j0597j0531r658q002o655o473o886o787n997n090m316l575l026k917
$$ plain form
51370 195271 192269 189373 186679 184017 181360 178859 176340 173284 169578 165758 162342 159403 157007 155457
51356 155457 154726 154155 153188 152035 151224 150813 150471 150057 149704 149480 149325 149195 149028 148755 148550 148846 149861 151242
51338 151242 152370 152857 152631 151828 150844 150264 150488 151513 153256 155862 159425 163602 167785 171706 175675 180190
51322 180190 185350 190695 195696 200400 205383 210902 216374 221022 224768 227944 230334 231217 230444 228716 226527
51307 226527 223503 219231 214144 208957 203657 197750 191342 185267 180097 175528 170979 166430 162387 159176
51293 159176 156535 154021 151661 149953 149129 148698 148008 147099 146579 146666 146826 146461 145552 144443 143351 142341 141411
51276 141411 140368 138946 137324 136254 136297 137133 137917 138094 137546 136139 133724 130707 128234 127432 128457 130355
51260 130355 131887 132486 132458 132408 132661 133255 134144 135119 135720 135578 134810 133785 132607 131177 129642 128349 127326
$$ packed form
51370A95271l002k896k694k662k657k501k519l056l706l820l416k939k396j550
51356A55457p31n71r67j153q11m11l42m14l53k24j55j30j67k73k05K96J015J381
51338A51242J128M87k26q03r84n80K24J025J743K606L563M177M183L921L969M515
51322A80190N160N345N001M704M983N519N472M648L746L176K390Q83p73j728k189
51307B26527l024m272n087n187n300n907o408o075n170m569m549m549m043l211
51293A59176k641k514k360j708q24m31o90r09n20Q7J60l65r09j109j092j010r30
51276A41411j043j422j622j070M3Q36P84J77n48j407k415l017k473q02J025J898
51260A30355J532N99k8n0K53N94Q89R75O01j42p68j025j178j430j535j293j023
$$ plain form
51243 127326 126287 125163 124145 123163 121867 120335 119217 118827 118529 117481 115748 114248 113704 113949 114290 114356
51227 114356 114520 115379 116844 118019 118267 118054 118250 118884 119335 119566 120233 121435 122381 122716 123226 124597 126228
51210 126228 127061 127041 126963 127290 127877 128558 129205 129442 129054 128555 128664 129289 129641 129362 128909 128771 128880 128923 128801 128655
51190 128655 128788 129597 131288 133539 135632 136866 136779 135327 133167 131440 130773 130653 130180 129227 128406 128167 128545
51173 128545 129600 131350 133191 134117 133736 132636 131601 130880 130379 130046 129779 129279 128250 126670 124795 123054
51157 123054 121842 121118 120255 118696 116728 115233 114635 114483 114117 113384 112595 112097 111928 111686 110835 109482 108661
51140 108661 109283 110873 112036 112259 112595 114255 117173 120362 123150 125545 127765 129979 132280 134430 135710
51125 135710 135483 133883 131632 129285 126974 124847 123319 122668 122561 122159 120752 118427 116134 114943 115109
$$ packed form
51243A27326j039j124j018r82j296j532j118l90k98j048j733j500n44K45L41O6
51227A14356J64Q59J465J175K48k13J96O34M51K31O67J202R46L35N10J371J631
51210A26228Q33k0p8L27N87O81O47K37l88m99J09O25L52k79m53j38J09M3j22j46
51190A28655J33Q09J691K251K093J234q7j452k160j727o67j20m73r53q21k39L78
51173A28545J055J750J841R26l81j100j035p21n01l33k67n00j029j580j875j741
51157A23054j212p24q63j559j968j495n98j52l66p33p89m98j69k42q51j353q21
51140A08661O22J590J163K23L36J660K918L189K788K395K220K214K301K150J280
51125A35710k27j600k251k347k311k127j528o51j07m02j407k325k293j191J66
$$ plain form
51110 115109 115946 116638 116977 117197 117393 117448 117398 117502 117898 118463 119064 119719 120422 121012 121370 121619 122025 122815 124201
51091 124201 126346 129045 131576 133230 134087 134950 136319 137725 138312 137762 136367 134487 132487 131041 130763
51076 130763 131416 132031 132020 131667 131325 130809 129975 129290 129203 129379 129211 128759 128495 128401 128131 127880 128287 129426 130729
51057 130729 131990 133621 135673 137429 138432 139338 141177 144184 147762 151174 153845 155387 155946 156264 156922
51042 156922 157659 157889 157718 157927 159029 160732 162337 163242 163105 161956 160284 158715 157486 156463 155658 155375
51026 155375 155683 156063 155877 155114 154454 154598 155622 157022 158230 158986 159303 159299 159285 159839 161468 164040 166733 168743
51008 168743 169952 170865 171980 173397 174945 176568 178540 181313 185057 189327 193339 196679 199655 202960
50994 202960 207116 212282 218330 224924 231693 238546 245662 253071 260477 267764 275448 284292 294594 306212
$$ packed form
51110A15109Q37O92L39K20J96N5n0J04L96N65O01O55P03N90L58K49M06P90J386
51091A24201K145K699K531J654Q57Q63J369J406N87n50j395j880k000j446k78
51076A30763O53O15j1l53l42n16q34o85q7J76j68m52k64r4k70k51M07J139J303
51057A30729J261J631K052J756J003R06J839L007L578L412K671J542N59L18O58
51042A56922P37K30j71K09J102J703J605R05j37j149j672j569j229j023q05k83
51026A55375L08L80j86p63o60J44J024J400J208P56L17mj4N54J629K572K693K010
51008A68743J209R13J115J417J548J623J972K773L744M270M012L340K976L305
50994B02960M156N166O048O594O769O853P116P409P406P287P684Q844J0302J1618
$$ plain form
50980 306212 319167 333816 350378 368710 388608 410030 432950 457409 483913 513434 546746
50969 546746 584049 625442 671334 721846 776078 832678 891228 952489 1016962 1083595 1150240
50958 1150240 1215082 1277206 1335901 1389992 1437992 1478696 1511456 1536135 1553017 1562666 1565633 1562256
50946 1562256 1552855 1538159 1519490 1498507 1476727 1455205 1434492 1414754 1395945 1377935 1360581
50935 1360581 1343725 1327090 1310179 1292283 1272630 1250546 1225575 1197555 1166572 1132769 1096152
50924 1096152 1056719 1014796 971162 926677 881879 837068 792742 749803 709275 671825 637547
50913 637547 606172 577575 552094 530245 512034 496752 483543 471970 461861 452891 444688 437228
50901 437228 430711 425155 420548 417343 416186 416979 418707 420437 422050 423762 425458 426922 428264 429571
$$ packed form
50980C06212J2955J4649J6562J8332J9898K1422K2920K4459K6504K9521L3312
50969E46746L7303M1393M5892N0512N4232N6600N8550O1261O4473O6633O6645
50958A150240O4842O2124N8695N4091M8000M0704L2760K4679J6882R649K967l377
50946A562256r401j4696j8669k0983k1780k1522k0713j9738j8809j8010j7354
50935A360581j6856j6635j6911j7896j9653k2084k4971k8020l0983l3803l6617
50924A096152l9433m1923m3634m4485m4798m4811m4326m2939m0528l7450l4278
50913F37547l1375k8597k5481k1849j8211j5282j3209j1573j0109q970q203p460
50901D37228o517n556m607l205j157P93J728J730J613J712J696J464J342J307
$$ plain form
50887 429571 430459 430650 430786 432035 434819 438513 442437 446640 451532 457234 463544 470193 476950 483772 491077
50872 491077 499579 509626 520982 533384 546983 561898 577799 594435 612391 632817 656438 683323
50860 683323 713604 747882 786801 830745 880253 936250 999496 1070129 1148228 1234563 1330226
50849 1330226 1435586 1550056 1672810 1803196 1940420 2083398 2230998 2381769 2533040
50840 2533040 2680747 2820438 2948097 3059910 3152223 3222637 3270881 3297949 3304665 3291810 3261281
50829 3261281 3216259 3160207 3096556 3029268 2962659 2900200 2843998 2795464 2755603 2724247 2699661
50818 2699661 2679302 2660449 2639967 2614447 2581387 2539816 2489322 2429090 2358434 2277760 2188322
50807 2188322 2091515 1989015 1883180 1776558 1671190 1568856 1471466 1380456 1296172 1218568
$$ packed form
50887D29571Q88J91J36J249K784L694L924M203M892N702O310O649O757O822P305
50872D91077Q502J0047J1356J2402J3599J4915J5901J6636J7956K0426K3621K6885
50860F83323L0281L4278L8919M3944M9508N5997O3246P0633P8099Q6335R5663
50849A330226J05360J14470J22754J30386J37224J42978J47600J50771J51271
50840B533040J47707J39691J27659J11813R2313P0414M8244K7068O716j2855l0529
50829C261281m5022n6052o3651o7288o6609o2459n6202m8534l9861l1356k4586
50818B699661k0359j8853k0482k5520l3060m1571n0494o0232p0656q0674q9438
50807B188322r6807j02500j05835j06622j05368j02334r7390r1010q4284p7604
$$ plain form
50797 1218568 1148215 1085879 1031504 984505 944798 912601 887391 868143 854543 846882 844569 845886
50785 845886 849612 855905 865002 875818 886567 896225 904756 912322 918861 924162 927828 929297 928297 925131
50771 925131 920207 913509 904848 894425 882736 870040 856297 841629 826540 811576 796971 782846
50759 782846 769653 758241 749285 742742 738141 735424 735235 738273 744722 754552 767857 784481 803669
50746 803669 824671 847454 872270 898830 926629 955996 988040 1023570 1062711 1105669 1153193
50735 1153193 1206148 1265203 1331045 1404269 1484811 1571919 1664607 1761516 1860341 1958184 2052687
50724 2052687 2142216 2224992 2298941 2362472 2414255 2451915 2472241 2473567 2457231 2425987 2381855
50713 2381855 2326472 2262695 2194564 2125817 2059313 1997550 1942592 1895352 1855593 1822729 1796136
$$ packed form
50797A218568p0353o2336n4375m6999l9707l2197k5210j9248j3600p661k313J317
50785H45886L726O293R097J0816J0749R658Q531P566O539N301L666J469j000l166
50771I25131m924o698q661j0423j1689j2696j3743j4668j5089j4964j4605j4125
50759G82846j3193j1412q956o543m601k717j89L038O449R830J3305J6624J9188
50746H03669K1002K2783K4816K6560K7799K9367L2044L5530L9141M2958M7524
50735A153193N2955N9055O5842P3224Q0542Q7108R2688R6909R8825R7843R4503
50724B052687Q9529Q2776P3949O3531N1783L7660K0326J326j6336l1244m4132
50713B381855n5383o3777o8131o8747o6504o1763n4958m7240l9759l2864k6593
$$ plain form
50702 1796136 1774834 1757449 1742409 1727749 1710956 1689705 1662615 1628872 1587509 1537935 1481106
50691 1481106 1419381 1355101 1289903 1225340 1163340 1105650 1053284 1006591 965425 929173 897214
50680 897214 869658 847326 830906 820489 815865 816737 822510 832488 846597 865463 889476 918023
50668 918023 949946 984390 1020856 1058576 1096267 1132583 1166727 1198602 1228341 1255668 1279906
50657 1279906 1300751 1318838 1335136 1349895 1362690 1373558 1383553 1393836 1404587 1415227 1425610
50646 1425610 1436645 1449684 1465567 1484311 1505612 1529413 1555884 1584963 1616237 1649345 1684245
50635 1684245 1720761 1758024 1794693 1829754 1862860 1893904 1922451 1947666 1968589 1984476 1995100
50624 1995100 2000845 2002501 2001000 1997326 1992499 1987491 1983368 1981639 1984152 1992209 2005856 2024327 2046912
$$ packed form
50702A796136k1302j7385j5040j4660j6793k1251k7090l3743m1363m9574n6829
50691A481106o1725o4280o5198o4563o2000n7690n2366m6693m1166l6252l1959
50680H97214k7556k2332j6420j0417m624Q72N773R978J4109J8866K4013K8547
50668I18023L1923L4444L6466L7720L7691L6316L4144L1875K9739K7327K4238
50657A279906K0845J8087J6298J4759J2795J0868R995J0283J0751J0640J0383
50646A425610J1035J3039J5883J8744K1301K3801K6471K9079L1274L3108L4900
50635A684245L6516L7263L6669L5061L3106L1044K8547K5215K0923J5887J0624
50624A995100N745J656j501l674m827n008m123j729K513Q057J3647J8471K2585
$$ plain form
50611 2046912 2072852 2100515 2127418 2151459 2171762 2188091 2199791 2205659 2204609 2196133 2180175 2156835
50599 2156835 2126128 2087811 2041450 1986924 1924993 1857260 1785455 1710785 1634121 1556777 1480807
50588 1480807 1408182 1339699 1275023 1213854 1156669 1104141 1056259 1012430 972193 935404 901876
50577 901876 871376 843971 819952 799355 781890 767421 756130 748093 742978 740317 739874 741710 746126
50564 746126 753524 763994 776899 791241 806599 823565 843133 865928 892128 921755 954701 990616
50552 990616 1029072 1069878 1113089 1158740 1206642 1256310 1306966 1357633 1407307 1455037 1499941
50541 1499941 1541474 1579890 1616351 1652401 1689302 1727819 1768409 1811390 1856868 1904637 1954241
50530 1954241 2005226 2057452 2111239 2167233 2226101 2288242 2353681 2422181 2493550 2567769 2644596
$$ packed form
50611B046912K5940K7663K6903K4041K0303J6329J1700N868j050q476j5958k3340
50599B156835l0707l8317m6361n4526o1931o7733p1805p4670p6664p7344p5970
50588A480807p2625o8483o4676o1169n7185n2528m7882m3829m0237l6789l3528
50577I01876l0500k7405k4019k0597j7465j4469j1291q037n115k661m43J836M416
50564G46126P398J0470J2905J4342J5358J6966J9568K2795K6200K9627L2946L5915
50552I90616L8456M0806M3211M5651M7902M9668N0656N0667M9674M7730M4904
50541A499941M1533L8416L6461L6050L6901L8517M0590M2981M5478M7769M9604
50530A954241N0985N2226N3787N5994N8868O2141O5439O8500P1369P4219P6827
$$ plain form
50519 2644596 2723000 2801190 2877335 2949966 3017479 3077561 3127551 3165339 3189705 3199995 3195944
50508 3195944 3177765 3145973 3100987 3043267 2974002 2895465 2810654 2722774 2635034 2550567 2472324
50497 2472324 2403123 2345645 2301965 2272836 2257621 2254973 2263450 2281553 2307609 2339753 2375785 2412894
50485 2412894 2447733 2476811 2496640 2503673 2494762 2468067 2423380 2361574 2284236 2194015 2094725 1990446
50473 1990446 1884530 1779537 1677578 1580161 1487924 1401090 1320180 1245922 1178593 1117899 1063472
50462 1063472 1015053 972270 934721 902379 875439 853611 835924 821435 809780 800849 794378 790283
50450 790283 789089 791449 797223 805526 815769 828263 843530 861342 880806 901280 922841 945789
50438 945789 970039 995307 1021744 1050135 1081286 1115204 1150932 1187170 1223119 1258743 1294267
$$ packed form
50519B644596P8404P8190P6145P2631O7513O0082M9990L7788K4366J0290m051
50508C195944j8179l1792m4986n7720o9265p8537q4811q7880q7740q4467p8243
50497B472324o9201n7478m3680k9129j5215k648Q477J8103K6056L2144L6032L7109
50485B412894L4839K9078J9829P033q911k6695m4687o1806p7338r0221r9290j04279
50473A990446j05916j04993j01959r7417r2237q6834q0910p4258o7329o0694n4427
50462A063472m8419m2783l7549l2342k6940k1828j7687j4489j1655q931o471m095
50450G90283j194K360N774Q303J0243J2494J5267J7812J9464K0474K1561K2948
50438I45789K4250K5268K6437K8391L1151L3918L5728L6238L5949L5624L5524
$$ plain form
50427 1294267 1329534 1363914 1396850 1428377 1459102 1489656 1520115 1549825 1577841 1603753 1628158
50416 1628158 1652248 1676949 1702652 1729701 1758767 1790467 1824801 1861163 1898692 1936419 1973299
50405 1973299 2008544 2041925 2073429 2102557 2128198 2149242 2165159 2175915 2181394 2180940 2173357 2157442
50393 2157442 2132577 2098628 2055241 2001716 1938079 1866126 1788931 1709353 1629388 1550691 1474929
50382 1474929 1403434 1337204 1277586 1226391 1184852 1152854 1129563 1114420 1107089 1106909 1113067 1125097
50370 1125097 1142467 1163664 1186228 1207707 1226112 1239562 1246284 1245319 1236675 1220534 1196874 1166325
50358 1166325 1130916 1093266 1055108 1016989 979176 942207 906523 872161 839163 807957 779108
50347 779108 752916 729431 708626 690347 674215 659825 646968 635597 625762 617643 611404 606860
$$ packed form
50427A294267L5267L4380L2936L1527L0725L0554L0459K9710K8016K5912K4405
50416A628158K4090K4701K5703K7049K9066L1700L4334L6362L7529L7727L6880
50405A973299L5245L3381L1504K9128K5641K1044J5917J0756N479m54p583j5915
50393B157442k4865l3949m3387n3525o3637p1953p7195p9578p9965p8697p5762
50382A474929p1495o6230n9618n1195m1539l1998k3291j5143p331j80O158J2030
50370A125097J7370K1197K2564K1479J8405J3450O722r65q644j6141k3660l0549
50358A166325l5409l7650l8158l8119l7813l6969l5684l4362l2998l1206k8849
50347G79108k6192k3485k0805j8279j6132j4390j2857j1371r835q119o239m544
$$ plain form
50335 606860 603577 601493 601137 602895 606381 611004 616898 624716 634537 645626 657336 669645 682654
50322 682654 696208 710414 726016 743668 763104 783382 803774 824067 844308 864747 885950
50311 885950 908420 932070 956278 980419 1004064 1026751 1047963 1067413 1085126 1101180 1115486
50300 1115486 1127742 1137481 1144246 1147984 1149181 1148452 1146093 1142174 1136871 1130439 1122938 1114191 1103802 1091047
50286 1091047 1075012 1055326 1032687 1008340 983073 956992 930096 902695 875351 848772 823721
50275 823721 800608 779159 758748 738948 719569 700432 681593 663662 647399 633015 620303
50264 620303 609310 600341 593361 587940 583812 580881 578752 576895 575337 574534 574447 574498 574578 575274 576771 578355
50248 578355 579514 580820 583018 585765 587965 588979 588837 587652 585647 583599 582420 582112 581638 579974 576941
$$ packed form
50335F06860l283k084l56J758L486M623N894P818R821J1089J1710J2309J3009
50322F82654J3554J4206J5602J7652J9436K0278K0392K0293K0241K0439K1203
50311H85950K2470K3650K4208K4141K3645K2687K1212J9450J7713J6054J4306
50300A115486J2256R739O765L738J197p29k359l919n303o432p501q747j0389j2755
50286A091047j6035j9686k2639k4347k5267k6081k6896k7401k7344k6579k5051
50275H23721k3113k1449k0411j9800j9379j9137j8839j7931j6263j4384j2712
50264F20303j0993q969o980n421m128k931k129j857j558q03q7N1Q0O96J497J584
50248E78355J159J306K198K747K200J014j42j185k005k048j179l08m74j664l033
$$ plain form
50233 576941 573082 569124 565580 562436 559074 554805 549619 544301 539806 536659 534820 533801 532965 531991 531185
50218 531185 531146 532166 534104 536747 540035 543937 548332 553066 557978 562845 567427 571561 575128 577945 579815
50203 579815 580805 581365 582139 583458 584901 585461 584439 582182 579730 577727 576015 574315 572820 571832 571183 570375
50187 570375 569126 567546 565958 564730 563942 562929 560477 555869 549514 542218 534233 525598 517135 510325
50173 510325 506033 503925 503304 504022 506255 509777 513847 517734 521122 524002 526325 527776 527869 526247 522800
50158 522800 517502 510364 501684 492183 482664 473645 465480 458521 452821 447863 443068 438545 434919 432398
50144 432398 430437 428446 426453 424839 423732 422915 422189 421616 421444 421860 422759 423777 424681 425678 427157 429257
50128 429257 431986 435639 440543 446275 451647 455897 459621 464061 469590 475371 480480 484977 489643 494938
$$ packed form
50233E76941l859l958l544l144l362m269n186n318m495l147j839j019q36r74q06
50218E31185l9J020J938K643L288L902M395M734M912M867M582M134L567K817J870
50203E79815R90N60P74J319J443N60j022k257k452k003j712j700j495r88o49q08
50187E70375j249j580j588j228p88j013k452m608o355p296p985q635q463o810
50173E10325m292k108o21P18K233L522M070L887L388K880K323J451R3j622l447
50158E22800n298p138q680r501r519r019q165o959n700m958m795m523l626k521
50144D32398j961j991j993j614j107q17p26n73j72M16Q99J018R04R97J479K100
50128D29257K729L653M904N732N372M250L724M440N529N781N109M497M666N295
$$ plain form
50114 494938 500529 505806 510612 515231 519722 523479 525676 526148 525700 525492 526155 527454 528631 528981 528273 526813
50098 526813 525226 524140 524064 525372 528140 531929 535946 539604 542933 546320 550034 554181 559030 565035 572359
50083 572359 580543 588881 597088 605550 614948 625719 637750 650475 663309 676171 689583 704127
50071 704127 719863 736381 753281 770264 786794 802119 815861 828277 839711 850087 859330 868045
50059 868045 877226 887250 897482 906988 915375 922851 929763 936222 942028 946877 950751 954119 957662 961744
50045 961744 966260 970886 975369 979658 983985 988784 994415 1001145 1009578 1020850 1035906 1054744 1076850
50032 1076850 1102336 1132006 1166172 1203900 1243626 1283931 1323400 1360217 1392478 1418875 1438912
50021 1438912 1452734 1461073 1465221 1466866 1467898 1470228 1475226 1482931 1491961 1500261 1505748 1506312 1499879 1484961
$$ packed form
50114D94938N591N277M806M619M491L757K197M72m48k08O63J299J177L50p08j460
50098E26813j587j086p6J308K768L789M017L658L329L387L714M147M849O005P324
50083E72359Q184Q338Q207Q462R398J0771J2031J2725J2834J2862J3412J4544
50071G04127J5736J6518J6900J6983J6530J5325J3742J2416J1434J0376R243Q715
50059H68045R181J0024J0232R506Q387P476O912O459N806M849L874L368L543M082
50045I61744M516M626M483M289M327M799N631O730Q433J1272J5056J8838K2106
50032A076850K5486K9670L4166L7728L9726M0305L9469L6817L2261K6397K0037
50021A438912J3822Q339M148J645J032K330M998P705R030Q300N487N64o433j4918
$$ plain form
50007 1484961 1460949 1427790 1385920 1336851 1283307 1228124 1173114 1119234 1067403 1018510 972871
49996 972871 930365 891156 855752 824240 795830 769325 743919 719547 696651 675653 656559
49985 656559 639036 622796 607716 593683 580735 569349 559994 552224 544799 537109 529882 523975 519078
49972 519078 514333 509811 506460 504743 504142 503947 503753 503148 501698 499571 497633 496632 496595 497096 497674 497874
49956 497874 497335 496093 494558 493077 491757 490648 489759 488915 487971 487160 486870 487082 487482 488070 489215 491023
49940 491023 493237 495956 499964 505971 513817 522679 531886 541326 551207 561668 572674 584362 597476
49927 597476 613143 631878 653081 675949 700728 728509 759891 794530 832157 873518 920008
49916 920008 972783 1032300 1098212 1169396 1244289 1321288 1398476 1473064 1541868 1602804 1655667
$$ packed form
50007A484961k4012l3159m1870m9069n3544n5183n5010n3880n1831m8893m5639
49996I72871m2506l9209l5404l1512k8410k6505k5406k4372k2896k0998j9094
49985F56559j7523j6240j5080j4033j2948j1386r355p770p425p690p227n907m897
49972E19078m745m522l351j717o01j95j94o05j450k127j938j001l7N01N78K00
49956D97874n39j242j535j481j320j109q89q44r44q11k90K12M00N88J145J808
49940D91023K214K719M008O007P846Q862R207R440R881J0461J1006J1688J3114
49927E97476J5667J8735K1203K2868K4779K7781L1382L4639L7627M1361M6490
49916I20008N2775N9517O5912P1184P4893P6999P7188P4588O8804O0936N2863
$$ plain form
49905 1655667 1701326 1740717 1774988 1806067 1836239 1866948 1898161 1928718 1957137 1982146 2002552
49894 2002552 2016445 2020682 2011816 1988097 1950557 1901982 1845051 1781495 1712526 1639484 1564093 1488325
49882 1488325 1413928 1341830 1272108 1204705 1140032 1078700 1020939 966658 916000 869464 827359
49871 827359 789308 754415 721983 692088 665480 642856 624153 608467 594535 581285 568220
49860 568220 555581 544079 534210 525802 518334 511376 504447 496867 488431 480078 473068 467402 461815 455539
49846 455539 449312 444187 440090 436172 432064 428020 424156 420325 416603 413222 410016 406538 402826 399558
49832 399558 397238 395601 393974 391959 389672 387652 386676 387363 389627 392543 394945 396200 396508 396593 397203 398797
49816 398797 401526 405351 410117 415582 421522 427880 434759 442238 450232 458558 467045 475658 484626 494514
$$ packed form
49905A655667M5659L9391L4271L1079L0172L0709L1213L0557K8419K5009K0406
49894B002552J3893M237q866k3719l7540m8575n6931o3556o8969p3042p5391p5768
49882A488325p4397p2098o9722o7403o4673o1332n7761n4281n0658m6536m2105
49871H27359l8051l4893l2432k9895k6608k2624j8703j5686j3932j3250j3065
49860E68220j2639j1502r869q408p468o958o929p580q436q353p010n666n587o276
49846D55539o227n125m097l918m108m044l864l831l722l381l206l478l712l268
49832C99558k320j637j627k015k287k020r76O87K264K916K402J255L08Q5O10J594
49816C98797K729L825M766N465N940O358O879P479P994Q326Q487Q613Q968R888
$$ plain form
49802 494514 506035 519750 535981 554921 576662 601182 628582 659452 694774 735265 780924
49791 780924 831135 884930 940914 997104 1051154 1100809 1144212 1180031 1207662 1227448 1240685
49780 1240685 1249301 1255419 1260990 1267550 1275926 1285992 1296713 1306579 1313880 1316366 1310937 1294468 1265503
49767 1265503 1225001 1175250 1118469 1056713 992503 928674 867544 810628 758892 712678 671531
49756 671531 634757 602238 574214 550376 529785 511701 495891 482156 470190 459994 451683 444828
49744 444828 438651 433022 428464 424992 421817 418572 415950 414553 413858 413044 412227 412110 412829 413943 415306
49729 415306 417123 419210 420823 421355 420823 419671 418352 417032 415523 413610 411519 409746 408287 406498 404021
49714 404021 401381 399279 397709 396242 394787 393596 392752 392178 391917 391964 392027 391838 391489 391134 390677 390174 390200 391245
$$ packed form
49802D94514J1521J3715J6231J8940K1741K4520K7400L0870L5322M0491M5659
49791G80924N0211N3795N5984N6190N4050M9655M3403L5819K7631J9786J3237
49780A240685Q616O118N571O560Q376J0066J0721R866P301K486n429j6469k8965
49767A265503m0502m9751n6781o1756o4210o3829o1130n6916n1736m6214m1147
49756F71531l6774l2519k8024k3838k0591j8084j5810j3735j1966j0196q311o855
49744D44828o177n629m558l472l175l245k622j397o95q14q17j17P19J114J363
49729D15306J817K087J613N32n32j152j319j320j509j913k091j773j459j789k477
49714D04021k640k102j570j467j455j191q44n74k61M7O3j89l49l55m57n03K6J045
$$ plain form
49696 391245 392988 394652 395914 397075 398553 400579 403138 405721 407491 408147 408431 409282 410814 412531 414135
49681 414135 415541 416547 417215 418228 420028 421865 422558 422082 421630 422135 423555 425474 427519 429122 429844 430105
49665 430105 430865 432364 433998 435547 437642 440665 444037 447074 449823 452505 454781 456152 456604 456318 455199
49650 455199 453361 451682 451156 451764 452517 452654 452377 452381 452981 453822 454312 454282 454129 454298 454691 454896 454857 454895 455095 455263
49630 455263 455626 456996 459783 463277 466340 468502 469946 470769 470960 471043 472087 474787 478819 483275 487536
49615 487536 491575 495568 499462 502942 505769 508120 510518 513472 517193 521682 526992 533301 540762 549304
49601 549304 558601 568253 578034 587947 598073 608451 619118 630107 641340 652659 664090 675926
$$ packed form
49696C91245J743J664J262J161J478K026K559K583J770O56K84Q51J532J717J604
49681D14135J406J006O68J013J800J837O93m76m52N05J420J919K045J603P22K61
49665D30105P60J499J634J549K095L023L372L037K749K682K276J371M52k86j119
49650D55199j838j679n26O08P53J37k77MO00Q41M90l0j53J69L93K05l9L8K00J68
49630D55263L63J370K787L494L063K162J444Q23J91Q3J044K700M032M456M261
49615D87536M039L993L894L480K827K351K398K954L721M489N310O309P461Q542
49601E49304R297R652R781R913J0126J0378J0667J0989J1233J1319J1431J1836
$$ [...]
##END NTUPLES=NMR SPECTRUM
##END=
