
##TITLE=AC1241_NBUAH12031_6945042_qgowhEW6Ji
##JCAMPDX= 6.0         $$ Bruker NMR JCAMP-DX V2.0
##DATA TYPE= NMR SPECTRUM
##DATA CLASS= NTUPLES
##ORIGIN= BRUKER
##OWNER= Administrator
$$ 1.72 TOPSPIN		Version 2.1
$$ 2012-10-18 13:43:20.599 -0700  Administrator@X
$$ Compression mode = diff/dup
##.OBSERVE FREQUENCY= 400.02188249412
##.OBSERVE NUCLEUS= ^1H
##.ACQUISITION MODE= SIMULTANEOUS (DQD)
##.ACQUISITION SCHEME= undefined
##.AVERAGES= 8
##.DIGITISER RES= 22
##SPECTROMETER/DATA SYSTEM= spect
##.PULSE SEQUENCE= zg30
##.SOLVENT NAME= COFFEE_meoh
##.SHIFT REFERENCE= INTERNAL, COFFEE_meoh, 1, 14.98509
##AUDIT TRAIL= $$ (NUMBER, WHEN, WHO, WHERE, PROCESS, VERSION, WHAT)
$$ ##TITLE= Audit trail, TOPSPIN		Version 2.1
$$ ##JCAMPDX= 5.01
$$ ##ORIGIN= Bruker BioSpin GmbH
$$ ##OWNER= Administrator
$$ $$ C:\Bruker\TOPSPIN/data/COFFEE/nmr/AC1241_NBUAH12031_6945042_qgowhEW6Ji/10/pdata/1/auditp.txt
$$ ##AUDIT TRAIL=  $$ (NUMBER, WHEN, WHO, WHERE, PROCESS, VERSION, WHAT)
(   1,<2012-10-13 17:29:09.453 -0500>,<Administrator>,<TOPSPIN>,<go>,<TOPSPIN 2.1>,
      <created by zg
	started at 2012-10-13 17:28:02.656 -0500,
	POWCHK enabled, PULCHK disabled,
       configuration hash MD5:
       6B 1B 68 BB D9 2E 58 E2 7F 35 AD 54 07 DF 0E 41
       data hash MD5: 64K
       8D 9D 69 D7 EF 76 CE E3 26 E2 6C FE F2 6B 85 6C>)
(   2,<2012-10-13 17:29:12.031 -0500>,<Administrator>,<TOPSPIN>,<proc1d>,<TOPSPIN 2.1>,
      <Start of raw data processing
       efp LB = 0 FT_mod = 6 PKNL = 1 PHC0 = 0 PHC1 = 0 SI = 32K 
       data hash MD5: 32K
       F3 9C 8E EF 6C 32 9A 9B 6B CA FD 04 CA 3D A2 6A>)
(   3,<2012-10-13 17:29:12.453 -0500>,<Administrator>,<TOPSPIN>,<proc1d>,<TOPSPIN 2.1>,
      <pk PHC0 = 182.3346 PHC1 = 0 
       data hash MD5: 32K
       EC 82 AE 0A 3D 2E A9 70 50 3E 10 85 58 EB C7 EA>)
(   4,<2012-10-13 17:29:12.578 -0500>,<Administrator>,<TOPSPIN>,<proc1d>,<TOPSPIN 2.1>,
      <abs ABSG = 1 
       data hash MD5: 32K
       1B 61 97 A1 45 2D DE 0A B6 AA D7 98 5A F1 48 26>)
(   5,<2012-10-13 17:29:12.625 -0500>,<Administrator>,<TOPSPIN>,<proc1d>,<TOPSPIN 2.1>,
      <abs ABSG = 2 
       data hash MD5: 32K
       F8 38 8F C8 47 27 45 78 9B 5F 89 43 99 E4 CE 42>)
(   6,<2012-10-13 17:29:12.656 -0500>,<Administrator>,<TOPSPIN>,<proc1d>,<TOPSPIN 2.1>,
      <abs ABSG = 3 
       data hash MD5: 32K
       50 82 7A 9F 8C 1B 89 0B DE 47 DF 11 FC A6 32 0B>)
(   7,<2012-10-13 17:29:12.687 -0500>,<Administrator>,<TOPSPIN>,<proc1d>,<TOPSPIN 2.1>,
      <abs ABSG = 4 
       data hash MD5: 32K
       50 7F F2 7A 2D 72 A4 8E 40 49 43 C3 5A D6 43 FC>)
(   8,<2012-10-13 17:29:12.703 -0500>,<Administrator>,<TOPSPIN>,<proc1d>,<TOPSPIN 2.1>,
      <abs ABSG = 5 
       data hash MD5: 32K
       AA F0 57 E2 83 B2 11 03 D2 A2 D2 37 2D A7 28 48>)
(   9,<2012-10-13 17:29:16.312 -0500>,<Administrator>,<TOPSPIN>,<audit>,<TOPSPIN 2.1>,
      <user comment:
       ICON-NMR User ID: COFFEE
       data hash MD5: 32K
       AA F0 57 E2 83 B2 11 03 D2 A2 D2 37 2D A7 28 48>)
$$ ##END=
$$ [...]
##$TP= (0..7)
150 150 150 150 150 150 150 150
##$TP07= 0
##$TPNAME0= <>
##$TPNAME1= <>
##$TPNAME2= <>
##$TPNAME3= <>
##$TPNAME4= <>
##$TPNAME5= <>
##$TPNAME6= <>
##$TPNAME7= <>
##$TPOAL= (0..7)
0.5 0.5 0.5 0.5 0.5 0.5 0.5 0.5
##$TPOFFS= (0..7)
0 0 0 0 0 0 0 0
##$TUNHIN= 0
##$TUNHOUT= 0
##$TUNXOUT= 0
##$USERA1= <user>
##$USERA2= <user>
##$USERA3= <user>
##$USERA4= <user>
##$USERA5= <user>
##$V9= 5
##$VALIST= <valist>
##$VCLIST= <CCCCCCCCCCCCCCC>
##$VD= 0
##$VDLIST= <DDDDDDDDDDDDDDD>
##$VPLIST= <PPPPPPPPPPPPPPP>
##$VTLIST= <TTTTTTTTTTTTTTT>
##$WBST= 2048
##$WBSW= 25
##$XGAIN= (0..3)
0 0 0 0
##$XL= 0
##$YL= 0
##$YMAX_a= 496288
##$YMIN_a= -638255
##$ZGOPTNS= <>
##$ZL1= 120
##$ZL2= 120
##$ZL3= 120
##$ZL4= 120
##$ABSF1= 14.98509
##$ABSF2= -5.573092
##$ABSG= 5
##$ABSL= 3
##$ALPHA= 0
##$AQORDER= 0
##$ASSFAC= 0
##$ASSFACI= 0
##$ASSFACX= 0
##$ASSWID= 0
##$AUNMP= <proc_prof1d_extract_pilot.lims>
##$AXLEFT= 0
##$AXNAME= <>
##$AXNUC= <1H>
##$AXRIGHT= 0
##$AXTYPE= 0
##$AXUNIT= <>
##$AZFE= 0.1
##$AZFW= 0.1
##$BCFW= 0
##$BC_mod= 0
##$BYTORDP= 0
##$COROFFS= 0
##$CY= 15
##$DATMOD= 1
##$DC= 0
##$DFILT= <>
##$DTYPP= 0
##$F1P= 0
##$F2P= 0
##$FCOR= 0.5
##$FTSIZE= 32768
##$FT_mod= 6
##$GAMMA= 0
##$GB= 0
##$INTBC= 1
##$INTSCL= 1
##$ISEN= 128
##$LB= 0
##$LEV0= 0
##$LPBIN= 0
##$MAXI= 10000
##$MC2= 0
##$MEAN= 0
##$ME_mod= 0
##$MI= 0
##$NCOEF= 0
##$NC_proc= -8
##$NLEV= 6
##$NOISF1= 0
##$NOISF2= 0
##$NSP= 0
##$NTH_PI= 0
##$NZP= 0
##$OFFSET= 14.98509
##$PC= 1
##$PHC0= 182.3346
##$PHC1= 0
##$PH_mod= 1
##$PKNL= yes
##$PPARMOD= 0
##$PPDIAG= 0
##$PPIPTYP= 0
##$PPMPNUM= 2147483647
##$PPRESOL= 1
##$PSCAL= 4
##$PSIGN= 0
##$PYNMP= <proc.py>
##$REVERSE= no
##$SF= 400.02
##$SI= 32768
##$SIGF1= 0
##$SIGF2= 0
##$SINO= 400
##$SIOLD= 32768
##$SPECTYP= <>
##$SREGLST= <1H.CDCl3>
##$SSB= 0
##$STSI= 32768
##$STSR= 0
##$SW_p= 8223.68421052631
##$SYMM= 0
##$S_DEV= 0
##$TDeff= 65536
##$TDoff= 0
##$TI= <>
##$TILT= no
##$TM1= 0
##$TM2= 0
##$TOPLEV= 0
##$USERP1= <user>
##$USERP2= <user>
##$USERP3= <user>
##$USERP4= <user>
##$USERP5= <user>
##$WDW= 1
##$XDIM= 32768
##$YMAX_p= 448095564
##$YMIN_p= -694333
##$CURPLOT= <Network HP LaserJet P1505>
##$CURPRIN= <$Network HP LaserJet P1505>
##$DFORMAT= <normdp>
##$LAYOUT= <+/1D_H.xwp>
##$LFORMAT= <normlp>
##$PFORMAT= <normpl>
##$SURQMSG= 1
$$ End of Bruker specific parameters
$$ ---------------------------------
##NTUPLES= NMR SPECTRUM
##VAR_NAME=  FREQUENCY,     SPECTRUM/REAL,   SPECTRUM/IMAG
##SYMBOL=    X,             R,               I
##VAR_TYPE=  INDEPENDENT,   DEPENDENT,       DEPENDENT
##VAR_FORM=  AFFN,          ASDF,            ASDF
##VAR_DIM=   32768,         32768,           32768
##UNITS=     HZ,            ARBITRARY UNITS, ARBITRARY UNITS
##FACTOR=    0.250966925370066, 1,           1
##FIRST=     8223.43324360094, -313985,      55895
##LAST=      0,             -116796,         91222
##MIN=       0,             -694333,         0
##MAX=       8223.43324360094, 448095564,    0
$$ Real data points
##PAGE= N=1
##DATA TABLE= (X++(R..R)), XYDATA
$$ [...]
23849 46694 34528 -127849 -35246 62504 89549 147494 196862 -109811 -125310 178445 -326024
23837 -5969 36717 257479 175822 -32248 -78124 -278759 -359497 -180086 174844 378099 22529
23825 120456 -72499 44486 -46336 -43294 66332 -198815 383792 161097 143058 25462 178266
23814 178266 68476 -285003 -199297 96320 114619 -140644 31400 -208091 39817 258158 117583
23802 113298 141105 -149681 244496 -100504 -9376 -191260 -38259 132679 -331546 126039
23791 155702 -114547 89169 -52281 -2776 111184 66226 246223 -298740 -158632 241406
23780 102504 -55074 -74055 -141844 -347934 -128501 -103303 -238266 -236595 -114885 -110252 172101
23768 297019 116028 238105 -138344 -15663 -201159 220454 235061 124179 45306 218566
23758 218566 -357265 41872 -63181 -43288 -342452 26974 112259 -365370 -115700 34604 49108
23747 49108 107543 114923 91257 95841 137684 60401 76178 66845 -62870 -180556 -15312 2167
23734 43556 67574 -54633 124033 -2562 -85997 -400384 -25298 -105005 -146000 -13396 9196 -180224
23721 84500 83222 -8208 -145637 261765 -199887 121648 86448 22554 -149955 -91198 -141726
23710 -141726 -175995 -217403 9715 19854 -19271 348247 -30891 298571 148463 186386 114646
23699 114646 -13829 157736 -69497 109316 175264 -86798 -127254 -4229 132354 215661 41322
23687 -290871 -36812 101836 -99731 -58061 -212662 -304745 57422 44111 -179496 -116108 56534
23675 -158673 126265 -49910 -136833 324753 151449 -199255 172331 -211515 87733 29579
23664 -45276 97513 52827 -136991 100300 -300011 243284 81221 170574 -152816 -101332 -287748
23653 -287748 38497 317121 64600 73437 -257537 154230 39601 113102 147134 -400021 112311
23641 -140359 -79239 151697 -296662 57088 138556 138165 -138793 -131226 -134514 217454 148825
23630 148825 -54386 -51790 -233 -74593 167834 71765 -26757 75642 -79088 -168250 -274636 -90342
23617 94461 121692 62510 -77405 -139000 165176 -129499 -1653 -137495 53116 69558 -180108
23605 -31352 98952 -72494 -352314 55897 83437 185190 202124 -111923 -115087 171834 143199
23594 143199 93012 -88409 54304 22088 -39839 49203 -138812 -326364 9987 263429 168153
23583 168153 -12007 71032 -300324 144379 43976 -233016 217677 7456 -24701 210798 77996
23571 184795 4717 -223603 -199220 276548 -9863 -84729 -6387 -129242 -349474 -111178 -295487
23560 -295487 1386 -224556 98511 -28289 46927 -192019 38936 162353 53967 -44168 153993
23548 -112057 -65911 236050 -104579 381327 62676 284623 -237090 123498 -116126 -43969
23537 69840 20401 -135712 -95237 -53515 -123226 -207151 113763 -20677 -123613 -16226 -269939
23526 -269939 -39826 -116927 111797 112275 -406374 -75091 -19242 55428 -118393 -85773 -283232
23515 -283232 43924 -623615 -117720 -155727 116270 8961 132026 60973 60015 237024 -389763
23503 -163651 -149642 13406 109648 -30481 -210936 -401624 74999 13622 76162 -136327 -272381
23492 -272381 -36322 6624 -77000 -467765 21531 23427 -316514 20817 18054 319464 28587
23480 -235145 124038 102665 22442 -176222 -163564 172264 186811 81756 -19692 177352 73689
23468 -217705 179540 -34214 10858 -192967 59620 -9205 -181611 -211292 -96208 -376569 -19654
23456 -230182 357931 58489 229859 264950 265314 -79576 268652 207566 -28848 -205356 21977
23444 -175789 -15472 -50101 123733 297739 -335539 -32885 -194167 -94765 148024 -271574
23433 -22376 27410 60688 41745 12902 -187949 -127448 -183693 530722 -84901 132856 -238935
23421 -356891 -192871 -389691 -6695 47965 39385 77528 59313 146101 -280170 -76165 -75863 218040
23408 43949 260190 -142483 264084 -96795 191622 221889 -288816 -63042 187481 -40341
23397 -18852 76851 119391 -290364 -209117 211208 -7859 -254360 -226528 -320977 -226401 195168
23385 -274215 -237648 -43620 -142897 -284453 -421272 34611 -7837 -4754 190539 -378149 -60646
23373 -26222 315439 103666 486173 112587 -111204 117740 -974 119018 231060 -143860
23362 -181026 -177668 -128462 -96906 -103251 -82569 -298775 -245417 58455 36875 197608 -1872 64993
23349 -212503 83259 -119152 -16821 122929 29541 122674 -308517 -163983 -4040 -343121 338305
23337 35358 -204026 -147658 120949 -19375 -484518 128308 -109772 39383 -293234 8684 142931
23326 142931 -316725 -276958 131469 -174687 68563 -49654 85007 169215 92302 -101502 26362
23314 -276221 85072 -297672 341933 -124898 72292 27502 9642 116717 -151232 -140192 235180
23302 100082 -113158 69203 23687 139847 -155518 146692 163881 305763 48217 -161332
23291 275013 390555 86066 226443 -195990 61149 -82430 16087 111652 -148280 -236880 -33564
23279 -171298 -106249 75469 66484 -139680 -110741 177143 -6807 79065 -111457 -110938 118243
23267 -172782 130540 -224837 299954 37922 -50117 -262312 -384950 -130419 -88313 -119173
23257 -119173 -204689 300308 589 -139992 -79567 -171580 165744 152179 157987 -1254 -335652
23246 -335652 299186 64023 -144451 244907 120711 -341516 229736 -245926 32881 -58910
23235 -324250 34161 -84582 -93877 -177636 -160631 -60025 71641 -294083 48102 -242503 -114515
23223 -109658 -68922 -120302 -192578 125156 -111226 -332110 -198371 -38895 7895 90845 -2660
23211 -179737 263057 -105526 13713 90661 354313 -157825 -169414 153534 42143 116575
23201 116575 81046 -201295 -155948 -183744 257623 -443927 311035 -117651 12306 -371 -56609
23190 -56609 -49345 -31662 75796 -38422 119257 -231635 401334 -129300 -26037 77473 -28383
23178 182536 -110789 64464 -235183 -68993 -119585 -2409 108460 -354449 -71824 17175 -223194
23166 -153956 -98572 417075 112913 112010 -142002 -38563 279586 -151715 -297625 -253535 200923
23154 58673 -120244 124896 -123668 297916 -90067 -19842 -79815 33204 30525 -60701 -145626
23143 -145626 -74659 36539 128263 48494 155376 -202889 118601 -39646 20094 10798 -79986
23131 186008 -92124 303189 102853 104819 -114714 -126949 1185 190319 111234 -202235 -182047
23120 -182047 -44209 185883 -154839 -314614 225464 26632 119400 -100976 5479 122833
23110 122833 197273 -188969 -216038 -116578 -86950 -247664 -26776 108271 -38328 335588 117508
23098 -70748 -104300 -120933 -129762 -100024 157766 -292007 -19683 -1264 -63549 124869 -205510
23086 16838 156679 154306 -87050 -152410 183262 72660 237049 242346 -191670 -324867 -75026
23074 77107 -17405 183981 141208 15595 -71188 258781 51418 -39928 -299027 65856 84011
23063 84011 -99432 -269558 147083 -245283 74987 12299 -141497 -78196 -264443 -202908 -217253
23052 -217253 34556 -86831 -260244 34409 296250 174911 -222587 -101757 77671 -4377 390794
23040 291334 -167368 33007 307550 -534382 235419 -73346 -42302 -234882 -138689 272616
23029 -81990 -278106 -17153 215192 -199181 209742 265848 -61974 -12401 -8743 145685 34761
23017 -196776 -34844 40616 162353 12878 11145 164546 5823 123241 -240807 -106136 48902
23005 -207263 -12112 139757 302124 62430 6262 -310088 89919 -69137 257581 8982 -168137
22993 -276109 -122717 -54178 916 -439597 380408 -145930 -94275 -256537 52013 -260260 165518
22981 27215 28322 -2108 -19194 -224111 105577 -23031 254238 164469 -159382 37673 -43106
22969 105423 -86245 -18725 -216412 14449 -87784 -8785 40052 210681 332958 332341 -21071
22957 194331 205716 -7353 -84620 -119593 47200 -99609 -242527 251111 -303560 -30310 149709
22945 -221182 -255861 -249331 -32916 60010 123791 -25497 -182234 -101631 -36103 -288666 131963
22933 -237035 -111514 -32843 -215779 -28515 -60930 92667 31556 -62113 -288159 -30602 -254098
22922 -254098 292615 -143191 -330037 175362 76117 90262 -267668 -89685 -384800 521305
22911 125631 -180474 171391 102780 47594 85751 259770 67295 -352609 -230821 53178
22900 -203966 4342 -117398 -288366 156834 130364 52982 -11708 8579 -59605 -468770 -74598
22888 182221 -293301 -16705 -55364 -272944 51828 96223 229910 -12773 10158 75506 -118965
22876 120054 182169 68812 111847 -149849 -193506 11719 148678 -53685 116943 -418730 -99025
22864 -43 3887 -10291 18552 -77562 191461 -94981 -70981 53173 77181 -116076 46511 -154151
22851 -33381 -231786 -65114 34068 -101631 -55662 -123106 -184562 -202817 -238637 -275980 -67679
22839 -38265 -281784 82267 -101874 -7418 2953 96189 152895 236119 295111 -58087 -16322 310389
22826 -221218 -121704 -177288 -76312 -210989 275712 161020 18508 -43458 -70847 163866 -54305
22814 -316422 -190400 -13127 -48852 -377349 112524 -159798 79178 38696 -79126 196445
22803 17846 -133993 -213045 28426 -182619 381746 80669 -163419 55306 251284 24527 76936
22792 76936 -31684 -345555 -236446 139289 -42390 -109898 187205 -80805 -71792 -253099 -48999
22780 -105905 131663 -77385 -88924 -61625 82980 27120 -130478 131434 234544 -142509
22769 -30016 248494 -249962 -260232 -190184 49793 -390984 -88760 158017 -121316 -159022 -72252
22757 65791 24994 165538 -161981 -35130 238250 -10758 -88755 212181 -324741 109877
22746 21309 -153006 138843 -245861 -67160 -19865 14772 -172369 83954 -24419 200233 -24697
22734 393097 -111477 121193 12831 82971 -183737 210521 317232 -255128 130258 -150477
22723 320372 136283 -251156 186233 -101321 -14514 -316128 -37616 31923 -173924 -43014
22712 47599 -206394 155055 -158767 -179334 75644 90239 -57469 224813 20372 -274658 258750
22700 76370 92093 -177887 145810 -22918 72463 75628 36809 105880 95312 -84055 -216952
22689 -216952 -89101 27205 -47284 50529 167058 -230105 -140837 -112653 74196 108242 -159405
22677 5447 -24150 18153 63795 31542 -83772 -73089 -63688 -90761 -52248 -81257 50625 -307988
22664 -24031 171698 43970 235258 151295 66594 82646 -165796 162753 125137 185155 -73163
22652 -80708 -24541 -193426 -62541 -115597 211228 -217440 146603 264313 156682 -70782
22641 -291782 174437 129192 151011 53167 -259206 -60848 19088 75361 -4100 -122549 -176592
22630 -176592 -367494 -35152 -97498 48415 -289355 153885 -473956 -160625 -195097 78540
22619 -126128 7528 119272 -441958 128086 -352057 -33517 -131409 -6164 -19996 205758 60843
22607 252230 -23982 57877 -163574 185807 188620 52020 -199954 17600 -202526 -129328 91629
22595 -257235 -137797 123139 -127260 -321532 -207006 100473 -80231 -181613 -72706 257319
22584 -293788 -60266 -324006 -168868 2850 -315756 -6034 93910 -195395 -316678 -113419 26161
22572 286288 -289042 223836 -223568 -10765 -245035 -127938 -215161 -146639 409807 115387
22561 130075 -48151 -126204 125637 -440590 -48539 119309 87216 -98474 46747 19786 -91150
22549 118849 -386288 173441 -191335 -119353 -52945 31883 -182547 232220 -95343 -137654
22539 -137654 -72637 -498187 51145 -466809 62315 26435 277376 -245737 -181622 -274532 -210830
22528 -210830 188591 -50787 175316 -117334 -19388 86182 340040 -139844 -134575 -140365 -187132
22517 -187132 -215018 -197997 38619 216768 -147457 -133975 -119238 -66695 -53291 -73831 -83563
22506 -83563 -177538 262355 167635 -1733 -92097 -44589 10855 -98372 136024 -208808 207923
22494 -165858 -544 70546 166047 91883 -64800 -53325 -163711 -14146 -77705 135121 -56248
22482 -3477 -123299 66450 -148472 -89640 -61879 107600 -9251 -317134 -269692 -127425 64537
22470 -24982 163874 -340431 114032 -208253 -252999 163877 279252 -151426 -167682 8918
22459 143785 -125433 -216946 -129331 1401 -3806 -65020 569067 87722 -40057 57360 -120125
22447 60357 -89848 -144219 -35535 10524 144631 15268 70786 26447 -31322 -28821 168797
22435 11106 -109688 -227914 -218653 113622 -88326 90389 61867 -77725 -197151 30164 -161006
22423 -11007 223941 -20602 -209730 38306 275666 -99794 34869 -238272 -413466 -32802 -78887
22412 -78887 143590 -95035 -105276 -30037 202808 114099 -56011 198178 -30491 238350 -337271
22400 239225 -41834 22839 137906 -31909 66246 -7953 -162489 101565 -61491 -147854 35906
22388 -243484 146992 79330 -279213 -34724 -108110 -52065 160317 -151389 -425715 100825
22377 -30126 186230 365657 88799 -85496 119341 -70673 177320 232704 66978 11005 46355
22366 46355 -333180 -141131 -18101 -84593 147572 -285298 -71733 -352557 62523 -185129
22355 -109987 -272942 231345 26144 -121631 -27678 -280198 -217650 -532196 254799 -13450
22344 -239679 -235049 79041 -330371 -159660 -120911 -172266 -112418 -232343 119045 -37293 -304986
22333 -304986 -70502 -213532 -204142 -310451 258172 -327232 179861 -136169 -76950 -14599
22322 -98172 45133 -100843 -332207 115222 -158201 32449 -27886 -118196 -61708 -58920 55936
22310 -271585 43893 -122692 -254892 31838 20432 215035 -255591 7365 39600 -53890 -382322
22299 -382322 96880 122063 118532 -99136 -9891 -87864 49364 -127075 -257068 -217491 -166418
22288 -166418 163241 345876 -241122 94170 48190 -209497 37851 -9341 -39751 -128814 -68896
22277 -68896 -98586 -164310 -100807 144635 140923 105044 -331232 117582 1457 -32601 -133688
22266 -133688 -187155 -45347 102980 -88179 -237736 -391180 -400947 108693 -20504 58855 162158
22255 162158 218490 171942 -408684 -2351 -103881 -58610 -70114 -110352 45766 73567 35402
22243 14572 -205288 -251153 115765 -145544 -452364 163269 -160283 39384 315747 249822
22233 249822 41324 151495 141350 -103829 29982 47690 17411 388836 -28727 -107931 -41686
22221 -5916 68368 -97669 -43182 165866 -492670 252234 21639 215616 -52979 373513 -61395
22209 -179239 68504 -179953 -308841 22121 -165856 -6601 -156667 -422206 140761 -291707
22198 1978 190545 112524 43957 23900 1134 -306877 -119280 131024 267637 -105285 524734
22186 74129 143978 -29036 150294 -34385 -3826 -197686 -34652 -23179 -46303 -39473 25132 -21818
22173 47871 130003 167203 95254 -45623 107779 -134887 103305 -229164 -276624 -132068 -212461
22162 -212461 -219084 -224737 61176 -166119 125335 -81952 49235 153946 -156660 -218515 47864
22150 -80044 -44286 36534 426876 -107031 144609 -122069 -226751 -337626 -201315 -9320
22139 -359007 -162903 110474 66504 -94665 -243140 -257927 -140196 27273 135524 -115032
22128 -247720 68842 139122 -102619 -356508 19582 -130823 -135823 120006 44310 -348509 -48432
22116 85734 -12061 -358759 -44999 -212259 -204401 -1612 -80001 -84277 -107507 164414 261364 80222
22103 -147469 57825 178317 -447100 245626 75543 23367 -193080 -362494 182360 181311
22093 181311 162018 -112270 148885 -4908 86723 -148009 140408 -106898 -63561 49313 -1004
22081 -211318 -148458 -134364 -68885 -115895 -140145 -73096 70513 64186 -185506 -97041 -306731
22070 -306731 -234275 -8744 -210114 40736 94377 -98832 -215086 159102 -129398 73480 -47612
22058 -216929 -76544 -145023 179324 -93270 -48273 76542 -59955 -86031 188355 -361360 134807
22046 -155222 361279 18002 211227 251667 43591 -258047 108092 -46910 -134234 5042 123204
22035 123204 -62965 30508 -60775 248026 -109987 -85966 -370493 -100174 -264374 85085
22024 62091 200351 -35873 329863 215064 -157937 152073 282357 148736 -90005 -204495
22014 -204495 -85398 -238670 -404800 63568 -168301 -273805 -189293 -125566 194901 -130580
22003 20590 -41011 -141583 -104633 175142 107504 -393719 21229 78084 -106385 176952 -241055
21991 35665 -165833 -194292 -105861 -25210 -417554 195788 -88619 -52463 172176 113132 106687
21980 106687 -87146 -47306 -134031 28362 -264487 -36686 -97700 303511 65776 39315 113937
21969 113937 232224 -80170 89942 -6228 -33498 35295 -148188 -259022 -150846 25597 144485
21958 144485 117059 18998 16994 -28661 -141727 -311799 9634 -6974 -208550 -168177 161959
21946 147534 33738 59596 1300 -84430 228266 224384 -239651 86499 -25274 -72145 174588
21934 -252602 -150324 -156579 71763 100828 108029 102017 143025 297478 362845 -68416 187124
21922 230837 -78188 -209812 -11005 87280 85133 -460381 121316 136579 319242 -131440 152129
21910 -224692 250384 76272 116537 -79290 -60608 160438 -143223 -227565 107936 340758
21900 340758 40127 -34753 150183 -5259 -124662 -24080 271731 91062 62599 -17995 -335418
21889 -335418 119641 -2769 -88069 70801 156189 -269770 66244 14357 -78154 -15857 -208401
21878 -208401 12220 -134543 24217 -120458 30411 -62627 -226171 -9555 -323920 170264 -173041
21866 34416 -388443 144811 -36508 -120640 -243050 -58610 -165561 -67760 -326395 42717 -146621
21854 43773 -312429 -15195 109405 -127433 11468 -182313 -215384 247166 -26650 -324334
21844 -324334 -178512 199650 64003 -39197 -53113 -258863 -37207 -257537 -266365 221265 67707
21832 -10921 -208234 131277 -186080 139436 -210868 161975 116570 -53295 -36829 -329104
21822 -329104 -275850 -38895 321954 -122399 17967 -134591 62512 17705 27853 440118 -289393
21810 -94097 -14680 64267 -174912 -24438 45181 -179970 179587 70436 -9883 177326 18011
21798 -17862 -126862 -65593 278626 77488 -178970 -42631 174144 -66900 246369 -146399
21787 414183 -209201 -185660 75455 248554 55899 7277 -314336 -88450 360074 -96917 -309197
21776 -309197 -235728 43661 34497 -294895 44094 -121203 -257228 122579 -222044 -153348 27022
21764 -373929 268231 304907 -159309 103624 328483 68332 -58361 59057 32497 -224681
21753 -29690 -24571 -247116 236735 182310 105879 -152450 135598 83454 92283 -259496 -109436
21741 -75752 -53765 3898 -19445 -59839 -283388 -110681 194986 -6931 4623 -72764 380149
21729 181811 68017 -130320 -275701 -54358 -2616 -150470 96221 256637 39331 271206 -194949
21717 94821 39776 -267834 28065 160861 4160 -173045 -555349 -78847 -998 -148146 167654
21705 76735 166905 141320 123624 -288043 185299 -84631 135450 16114 -62142 285058 -62001
21693 102721 -116189 -106248 24336 -249184 43587 24488 -104116 40123 -281627 -398235 137125
21681 -207674 -188260 102019 -85191 -37708 -46119 -159743 49722 -147970 -117794 -304925 225561
21669 79317 39422 -165820 81388 -16822 2425 555082 169749 -43272 -192842 63946 -121779
21657 40916 -88225 -32794 64904 -405 -161204 -353994 290681 -194947 203182 -77474 -210836
21646 -210836 -276224 -250544 235975 86543 -133048 -86964 96358 -105815 371346 67918 -16708
21634 -166796 89265 12372 202801 -347505 128954 -33860 35269 -227170 -164103 11334 -73414
21622 -131903 142102 -218708 46979 71678 194371 -154827 -126817 10714 -469699 -226994
21611 -147658 72045 -27489 245733 -303483 -257393 -154842 19972 31877 -94766 45876 -129903
21599 -5880 -80517 -172760 -261546 -432638 -30799 118181 -253017 -33656 -126426 -39728 -145340
21588 -145340 -9985 -96237 64231 96688 59873 -62296 185349 142039 -199107 22292 -251666
21576 32131 -52883 43793 -194656 214872 -247721 -261882 -237191 31354 -156956 -293478 -44534
21564 -173053 -164584 231 212083 -268934 -307545 -71417 137155 19311 -150963 365005 -310148
21552 327702 383989 -39584 -13320 -42286 96679 -313043 -160898 -15305 -102417 -275138 -66794
21540 308220 81977 -21264 -275077 -36937 -21435 111651 -62070 416345 -78083 33241 -282336
21528 79885 -56681 69296 83218 141872 -51767 419951 44048 -326932 -23866 197602 -334461
21516 37306 -59340 208969 41244 -65050 -153930 -105985 -48924 136835 59027 94817 -91185
21504 33596 176669 -3570 33936 -55405 186854 -195112 68062 -47302 -290202 -82927 135684
21492 -33078 179157 -193853 13002 -80017 -185538 -318972 18695 -228663 -13207 -215510
21482 -215510 61291 36689 -1101 -79601 -219564 129093 179684 161870 -220481 84221 219664
21471 219664 -114528 169821 -60693 -3865 -114113 -267416 -38466 -233894 174395 -161195
21460 -61413 -246118 -288243 -358654 134755 -287736 315816 -162806 -29119 -288003 157382
21449 106996 327259 -4667 -37770 226398 262912 -96087 -70469 171721 157984 -49116 418596
21437 339727 252571 63550 361865 69894 -78338 21888 8348 -166141 -248199 90316 -40443
21425 76513 -97429 32055 -330198 -22072 -50435 -198937 -206124 103898 -256675 2478 200452
21414 200452 -79856 -37518 185921 -94796 213629 -343619 -88678 -96224 -308278 130143 215415
21403 215415 147117 23063 -162590 -13882 -75467 90225 45551 -102976 -46296 -9310 250810
21391 -38995 -157080 10200 -111744 -168430 -356048 198168 -146420 262717 -86452 216734
21380 -266959 -212766 88460 143098 -356228 -104613 59770 -136249 -266116 107885 178730
21370 178730 111944 -183022 -155101 -254571 -234619 -227134 -333938 31015 -56069 -115530 94556
21358 -227267 -28383 -61292 31542 13998 32353 -66577 82662 -377413 30367 27211 -70320
21346 216013 52345 11257 -211728 -191536 195119 146875 -26626 -322030 -232667 -65241 -208568
21335 -208568 83344 -87646 -35834 -220188 -213673 -217853 -58017 -256215 -108635 -144167 -126378
21324 -126378 165285 -116224 41279 -55828 -167440 -86297 25698 -234647 11188 -154911
21313 -28498 90416 -8002 328101 -398339 -108033 51839 -322432 -464490 181207 -109777
21302 53988 -156302 -47762 -120052 43994 -277525 -156034 239121 78107 -6521 68654 254954
21291 254954 -150735 -108529 -156695 -147791 213453 -151891 -334806 99252 -234411 79674 -289244
21279 150357 -138554 31801 -303081 48765 91260 46181 311409 -9346 -85078 217351 -364643
21267 -340038 -171253 9823 -368337 -94423 -42823 120343 306470 270945 -111954 -186361 130776
21255 -9554 331511 -138539 134627 -203551 -178743 -149285 -132845 87167 126444 78552 -116898
21243 -34352 -200759 270521 -14647 -181037 -156362 -373793 149254 55606 -161179 -386447
21233 -386447 -181507 -214122 -164079 104743 -136570 -127216 42659 84604 -17511 278927 165078
21222 165078 221927 -129904 -224065 -129095 -58345 -21297 90029 -141762 -252383 -137866 165284
21210 -84993 3739 10993 -144662 160972 239853 -28825 119597 39501 -201393 300119 49643
21198 -270679 70581 -39410 121759 2737 273565 -56551 -75207 -273203 174350 -6879 62096
21186 -219075 35512 -312237 246313 6296 121285 -198201 -228374 -202127 108632 -177019
21175 -304875 -215521 -36955 7313 71456 -49190 -163516 -38593 -177738 129460 355458 -16451
21163 -147607 -259918 285116 211955 -241388 -280193 -5405 96550 -5883 -307492 150716 119383
21152 119383 104073 -155334 -33207 -39988 -327075 40177 -49774 -225960 -41985 -93854 53715
21140 51443 -227903 -53230 153675 107479 -41622 70285 205188 157161 -145577 -316653 -125154
21128 99469 -180308 105962 9786 286311 57853 83999 51826 122702 74221 -127198 -14233
21116 -279024 -328554 -85367 -76279 -8709 -19547 -95429 67033 -250307 -305360 72275 83198 75458
21104 75458 -3802 -274902 -171679 -79592 2079 -106283 -227462 -292163 -207143 51386 -234585
21092 -215477 -308752 7349 -162279 -98787 53427 -115089 4924 83628 185656 199253 -234800
21080 -40316 -59234 -277305 -205896 -184560 276947 55852 -319367 304537 203502 269880 -99007
21068 -13249 -254956 30504 176889 -72773 62245 -3251 -377930 -154769 11452 66257 311394
21057 311394 -237328 -171567 -65637 -48086 73556 -13769 44296 -90255 111857 64718 30806
21045 -338477 -271571 -4815 -244484 -200007 -240690 247979 -75679 -150311 -309023 -152479 310637
21033 319598 21994 -33538 -32747 150489 170904 101246 -49742 -148640 -50101 -123772 26251 46058
21021 46058 -194991 -149666 207520 -222493 117497 -122845 184678 187183 121622 68277 83314
21010 83314 147283 -343487 74227 -255954 -103755 -51618 -62362 -63772 -245904 78259 -56214
20998 -185846 64741 9479 -115617 -160217 33365 -180991 185438 -18113 1212 -160643 163438
20986 215910 29246 1198 -244827 -476973 -337726 153470 -151192 -161640 223411 160789
20976 160789 23061 33387 189947 -271504 -72835 -13781 -119960 119017 -100303 132773
20965 -115418 85833 234712 -60955 134358 238830 11681 -31844 -234837 163685 261331
20955 261331 -233423 -41033 25501 -62822 -168366 -64445 107040 132531 65441 341028 -48177
20943 -12640 -130084 -57196 -45692 -9816 -168769 -140715 -203450 151007 383961 -222162 275175
20931 -185725 -231412 -120762 -6313 250569 11805 64071 150311 -369091 133274 119921 85388
20920 85388 -153706 -98974 142881 -15181 -94445 -54831 78711 -165144 -81618 117348 -483939
20908 -100057 -133146 -298973 -134683 180635 -43163 -32292 25697 -373844 28364 28670 -229718
20896 -9163 -22762 38348 75644 174287 -154344 -70246 -68681 -63231 -59970 132391 52833 -242268
20883 133138 -27830 -306795 203025 -313935 44063 98820 101499 -32406 54319 -264628 107361
20871 -186294 -82142 -134106 -301693 -321138 -70347 56717 30995 -80492 -37768 -12267 -84230
20860 -84230 -232171 128506 9960 183697 -56338 23427 187686 -211696 -170037 -355256 -141502
20848 -117719 -69230 -152150 140345 86350 -171002 -416436 -142610 241922 -139992 192507
20837 -112861 98567 -220936 -185960 -6998 157260 -143475 190677 -54913 -370014 119044
20826 222315 130323 66423 -30740 -301354 225058 15233 -263895 -234161 -79835 327508 213246
20815 213246 26013 -202725 -88314 -183848 -203861 -168257 68430 -165016 -272464 210288 71507
20803 265471 -62407 221177 8018 -189192 62393 -73871 3817 9647 92596 12281 37886 -52512
20790 71652 -95753 -82997 -96573 66140 62771 3971 -27913 -222237 193501 75562 -79647 15861
20777 -40333 189600 -173250 248908 193954 170237 -36608 -112555 -133714 -23198 106438 -3489
20765 43879 29758 -1634 -450438 124262 -164092 -254018 -199316 251586 63902 -346915 129458
20753 -105512 -487440 319053 -210667 -42941 225241 -19533 -123074 -88543 -138295 -70019
20743 -70019 189049 198075 -151771 -49691 161984 193387 134212 396006 -477150 -25535 -85983
20732 -85983 88847 -199396 -340795 145225 -166301 122483 -40443 -149582 -168387 155190
20721 2651 285348 -24275 -15561 -75958 -223230 -10752 -269336 139072 -23894 -161639 -186523
20710 -186523 -286967 -147394 -68563 149733 61822 -44903 38356 -98808 176427 183372 -195311
20698 -57530 -80837 -197558 7179 -188399 63573 -202232 315334 21388 -2200 48050 -169604
20686 67065 35916 218140 -53448 -170683 -204141 162867 -221897 -50265 103694 381542
20676 381542 -133745 -28093 -300161 -10165 -231669 104380 -290340 -217723 -47416 -12875
20665 -17436 126056 -68310 8061 -149514 950 -105628 73732 -220886 -163735 -349869 -56241
20653 26258 18720 -324102 -87391 54490 125621 243226 -181583 123177 -163402 -330924 -115407
20641 -137158 32868 -119695 -307286 85573 -129274 -18600 243696 47210 -206803 -32693
20630 -1038 230505 200418 -7057 -93536 -49309 -85702 -66580 -143682 -186953 -120739 -72851 74517
20617 -103416 66198 -31182 11938 99774 -163578 13931 -22099 -173383 128460 17971 -242647
20605 55611 -289805 -210242 -55783 37162 -62723 110900 102757 -8409 -41839 -101195 -92052 -10059
20592 -213545 2793 -347234 -18268 -56468 -67026 42818 280208 -46831 177816 -173637 153522
20580 76366 -222596 -149428 -158717 358718 57531 -131433 98379 -78663 -180533 26354 29973
20569 29973 -316895 50244 18297 -185902 -119640 -291117 -265923 147894 240690 -129438 -149758
20558 -149758 -86842 159474 -206411 287982 65633 -225580 36677 -91121 -52063 -328145
20548 -328145 -142507 -95040 -390952 76672 2811 -289893 -145705 259358 -64733 -99120 -80332
20537 -80332 106071 -44685 -168490 -75505 -254165 46977 -197285 11991 -64066 -180847 85294
20525 -172129 -364916 -9258 -158009 112556 127771 111462 -206782 -200873 132142 -118462 132000
20513 136389 -120764 -125132 -143157 54111 -204294 101698 -169825 106790 -96407 -128396 -56977
20501 -303067 -136956 553553 43255 -235063 -11527 43450 36897 -336141 180990 36671 104401
20490 104401 -172044 -113168 -130699 -265103 -79879 -6252 -97444 72575 91404 -253364 -80671
20478 -169988 -100291 -92458 -96586 155829 -249569 198433 -430441 -11009 80251 -258597 131159
20466 24877 201312 -168937 -19398 -448522 72495 -52237 81041 376159 -186275 134041
20455 64574 209286 -35176 -25487 34926 53308 -67925 -80214 -191832 35183 -179813 207401
20443 143839 -24190 43718 -111703 8218 -119876 -131035 -37315 23197 -59175 43305 -99195
20431 -64475 -179948 171458 -164647 -133067 -104687 91260 -21375 -264834 92006 -317877 161338
20419 1550 23724 285474 55256 -243448 -40320 108566 -182795 -282083 43618 -81217 202714
20407 198690 -75405 94071 -193112 -69599 223620 -329012 81518 -69393 -210390 -428718
20397 -428718 -65930 147747 -184468 -235527 -23207 270974 172950 -130001 -78881 -138196 76106
20385 202606 -298316 -78286 17245 -221481 -34162 -198259 -68256 90450 -73725 159052 61514
20373 229837 -157772 380226 19324 42629 166304 148436 184184 211071 99619 -176275 -315533
20362 -315533 103422 -122468 -147762 -234785 155769 13508 -213313 73149 -313848 -3791 -15138
20351 -15138 -11889 127791 -64191 156550 -33616 -262009 88645 -57570 -294125 47506 -6417
20339 146371 -104243 -69735 -53347 -218823 -13776 -69117 18559 -211707 -432620 -141194
20328 -230932 42093 24553 -481527 179266 38452 -428239 -254739 4962 -49272 -18560 -59437
20317 -59437 -255854 -315838 -424595 93090 -440672 8872 126351 -67054 -122556 -178483 338956
20305 -9378 -139987 -270270 -136397 -94086 -4220 -183146 -182836 229801 -78306 -395320 3472
20293 -149918 -304707 -206012 -207313 126617 -81741 -155948 -232122 86279 -70563 -228658 73167
20281 173873 -128115 119240 107273 241041 206135 -28610 -268226 -127577 -85904 -78847 43186
20269 -9804 -112627 92473 -57223 -51889 2828 -80068 141433 -247348 81667 -6769 -151590 200854
20256 183816 124364 -226148 18649 -72207 19577 -405977 -37348 -9548 353817 212602 -98342
20244 134370 -20634 -358115 114041 -464529 -86181 -213596 -9547 -191659 -336746 -146732
20233 338233 -178252 -85336 185884 -70765 -556 189152 -66685 -397367 -324753 150539 -349939
20221 -256303 -186913 25879 154491 -223126 192901 92858 -57046 -241213 182862 -70765
20210 -282859 97299 -25841 -265480 258702 24056 146526 137597 -163063 -310053 84208 -335411
20198 -9440 129668 -163882 53388 382307 -200513 -98294 -274651 -191892 -56051 -206748 -78771
20186 -78265 -33637 158656 -414782 105631 -243986 -122123 -90132 103075 -254327 -125455
20175 61267 -237720 -106350 -175643 -29285 21085 162175 125512 -118426 115939 -52526 -9360
20163 163297 -150828 85541 -76977 189084 -95881 247044 -291015 -1938 267635 -19182 -280611
20152 -280611 -74667 -50086 -61017 -174292 121142 132490 -17424 146559 88176 -76082 -121273
20141 -121273 -43291 -129945 -122684 5466 -124003 67580 99156 179843 -286415 42421 -187059
20129 -99893 4687 -199953 59005 -244654 -30511 -210753 -205989 371 -68595 -308931 65297 33446
20117 33446 -5072 -251739 -7149 -121753 -144887 280200 -84318 446236 7554 12145 -151781
20105 16782 -128647 -196377 -113858 -134180 -98554 -164274 -275218 -189725 -119838 -90524 -228051
20094 -228051 53968 165216 -69080 -214526 59565 -161879 -253603 -106429 -144999 -500234
20084 -500234 103513 68261 -101139 -232542 74982 -400955 -101153 222961 -142840 148383
20073 189414 -145083 -202391 -372123 -228042 -39876 -105079 131498 345646 -283604 -263463
20063 -263463 -2925 -199243 -47146 82594 -15177 -402561 32142 18284 -157980 137058 40941
20051 -282952 159024 -161186 -54547 194565 66776 -309923 255330 -130310 -132821 -86127
20041 -86127 -114071 285674 -275056 -114848 -283210 -216062 16570 -139382 164376 -274581
20030 172735 -117829 -136756 -280641 -32588 -162197 77690 264767 -76423 149373 22086
20019 -197201 -165487 5206 16237 -84353 124705 -296602 -5840 -43668 239410 -99686 -209587
20008 -209587 306666 -198755 204131 15857 67549 -139258 -294505 -12261 -3427 9856 -130659
19996 129126 -54096 -47164 -472257 -147097 184221 -375987 -58858 455162 -108394 -143018
19986 -143018 175895 -37843 -79951 -61906 -107795 32207 31730 341067 -461386 -157823 3601
19974 41590 -256756 -57964 93567 -87091 -63484 -75475 387288 -77510 5509 36338 87553
19963 87553 -6699 -167629 -18588 59869 -260744 -194686 -157737 75258 -233751 -403003 -31135
19951 -6608 -184187 -53592 280091 -155783 -29120 36440 221803 -37656 -178488 329733 156888
19939 -258345 -286707 326434 -14956 198711 -444936 328024 -153803 15077 -135609 -65771
19928 -149213 11254 -303225 -232268 -87016 -291426 -161706 -216235 142018 -27185 -83700 -64359
19917 -64359 126991 -84244 -24633 33869 -373872 -209925 -86774 -144174 53580 -181105 -70277
19905 -74431 -32742 -51822 137023 -59245 -9171 -342075 -12124 -68920 -101397 271379 9649
19893 107917 73541 -69819 -334250 1273 -182126 -72723 -79336 -63502 -157067 264216 86412
19881 -27378 -88458 -115069 -215724 -103889 267678 30052 69294 151502 88116 -228129 -228095
19870 -228095 -255343 17765 -298014 4311 62758 33758 -336980 -68405 -41227 114021 13687
19858 111156 -227213 -1681 195497 -172576 -34267 104391 -141199 -221920 99152 77538 173180
19847 173180 -132109 -221351 -182394 35796 -259602 -58671 -19345 -160202 -74957 -44191 -30694
19836 -30694 118239 -87308 -270904 135667 182082 1603 44680 139644 -39225 -218234 -102190
19824 -43673 -135787 55677 52721 -29187 279634 -400593 105725 -317553 -115310 -42370 102209
19812 -9427 -87603 -235804 -259777 -197733 -130951 -123967 282731 27505 -233583 154484 -207602
19800 141562 168789 -1443 278945 85036 -204511 -52555 -79525 -38943 -121822 -177380 -326267
19789 -326267 194304 -417921 197739 -52981 -185105 -273279 1882 169248 79367 66122 -310794
19777 37312 -403996 24812 -222986 -244173 -84579 -87455 221816 173565 -219416 -214231 -112553
19766 -112553 -125235 -181828 -120004 -329475 293434 6860 -39945 -362888 -215569 -142073 -244618
19755 -244618 35880 -109729 -267080 188685 -168235 -309560 212472 -50458 -152191 -50426
19744 -174200 -194539 -92124 112321 37907 -348198 145856 -1274 -31885 -37974 337724 -77127
19732 -59362 43873 -28700 39031 229170 -26229 51204 -88464 97525 120709 -78199 204095
19720 -24498 -89678 242456 5900 -274775 -175191 26364 30963 -17863 -110008 -187713 -178235 -5101
19707 -76599 214761 -289810 97429 -171415 -163653 218795 -128410 -165047 -31399 -28514 -135801
19696 -135801 -271483 25927 -171847 -201223 191386 -87743 198615 13360 -1281 195906 106957
19685 106957 -100878 -171041 -377672 -174079 -11488 189955 -272820 -94274 323456 -71730
19674 -165655 -182299 9824 78313 40041 -78649 172005 -397943 -249615 -189032 -203177 -41166
19662 345079 15577 61439 -179482 3822 -134065 -141437 -60899 -246095 87777 -236460 -50873
19650 -6875 33654 -3765 -367980 170730 26095 -182198 -364719 306342 -98319 109263 -68895
19638 32130 -97703 -132073 63055 -96105 -29097 221600 -31841 -30217 -313711 -161180 -250216
19627 -250216 19024 -15258 -66493 43547 76212 -134449 109990 -22397 73929 -174363 -152697
19616 -152697 -63379 167259 -25037 -19187 -264279 -196340 107681 -128005 12975 -182664 31370
19604 -28838 -182761 -316945 268086 -133916 -48537 114532 -68699 -130537 -233247 -337937
19594 -337937 -146291 -42446 203154 10320 84535 -20037 143819 -185715 -44153 -120662 -32415
19582 118263 184129 162966 -202153 -337296 -110477 -184221 -172174 65221 -96058 -42238 -64918
19571 -64918 124100 243362 81732 -92125 62171 -59079 376981 -277473 -136509 196625
19560 109871 -344662 -23829 143086 -16079 -20134 -17459 -229041 116953 -45400 15803 -175491
19548 -159226 68221 268859 28994 -252500 -120756 178072 -126922 -282310 -6545 -114591
19538 -114591 67985 -81871 -175621 -172158 -231502 136401 -287735 -148680 -28827 148746 91000
19527 91000 -105760 95572 -175601 -122366 -216708 180945 -146093 -330934 -59076 213701
19516 -1867 -4442 -54234 -1648 -53678 -610789 -338211 -129724 35398 -30934 -393968 51680
19504 -101842 -99948 116022 252270 -252193 -63874 -255072 76877 -158928 15685 -74534 -103094
19493 -103094 -200999 124357 96001 20202 -70455 10692 104538 -156366 -364234 -40690 -140324
19482 -140324 -266051 -315304 94699 -284296 -191237 -55638 -131194 11483 106957 -68567 28677
19470 -117025 -26845 -59100 117711 -32948 -130324 -94616 -146903 133745 -247665 -181806 -316760
19459 -316760 2819 109319 13657 -80314 -103092 -322335 -99525 5638 69633 -178863 71550
19447 253436 217027 -161270 -211144 41417 20194 -156610 196743 43748 -116444 164901
19436 -93332 7629 -103308 98786 -229177 204947 -511466 -267412 -255608 -23989 -175527 83427
19424 -265089 3557 72879 -241192 -153622 -269593 -4137 -128112 -363629 98419 448916 -190625
19412 -376971 86284 41839 43268 -118051 -85422 -2148 104697 6021 163317 -105527 276838
19400 -66508 -330643 264760 -73743 320198 100317 -85261 -133680 171336 -143841 -52685
19389 -30002 133703 32016 -94311 -112575 -205686 14021 -291836 52325 147960 103492 -16924
19377 -34600 -233532 92271 -160980 -337058 -376337 105277 37267 80705 -86500 46915 258330
19366 258330 217812 -125336 -178075 -15871 36488 -73695 -124434 -220 -156988 -7459 16307 141806
19354 141806 60069 -247054 -109278 -29866 -211559 -116178 301020 -62104 -179669 47570
19343 -13595 -170918 -205470 -195763 -29712 -41849 -18698 75086 95846 -49144 -124556 -150141 39430
19330 -96499 -266166 -2673 -231342 218754 83412 121519 -477566 434232 45946 -195328 -317569
19319 -317569 136484 -174786 -120606 -212673 -267748 -117644 -438227 139766 -155358 -331480
19309 -331480 -49292 -152491 231408 -29131 53931 29033 -3182 -20317 102925 -9713 -185738
19298 -185738 107488 67681 108803 -48513 93729 188519 -42408 -219306 -198806 -46403 -159636
19287 -159636 -39115 -194763 -2122 -74881 -152809 95938 -64658 -106429 -255546 -174114 306583
19275 142362 70548 -73317 -247685 -8843 -265636 -1514 -141229 -257695 -203046 222004 -143378
19263 -134605 35788 487 -173740 -173445 45462 207479 -79988 -197356 243015 -289976 -75254
19251 -60435 387720 227632 -52715 -228723 -2170 -61024 -13236 97188 -90194 -288854 -214285
19240 -214285 -71677 159420 121039 -112141 -87920 -105774 -260899 -6549 110766 -364678 174370
19228 26720 11185 62805 -102061 -110622 -76098 50675 -15954 -155055 20097 -227208 -139605
19217 -139605 -194672 83882 -92775 -410310 -10329 193568 -215484 -138495 -357903 -139369
19206 19496 -145946 120422 -304729 -169928 -76283 -173464 -182572 -110784 78421 28886 -56478
19194 128600 -146031 -341057 -249443 104262 411992 100072 -65730 -134084 -111060 -111699 66333
19182 118626 205841 -286412 -138890 46485 133935 -288010 170096 -244501 -345881 92548
19171 -109429 -8064 -217052 -2491 47775 -211710 276573 -24656 70739 156473 -229545 203169
19159 -439065 28398 -202297 5036 120302 -315673 42591 -48871 -182768 -277433 -132463 -134762
19148 -134762 -299566 237377 -285083 -76520 -403831 -114187 -47072 310508 146352 -121341
19137 -100412 112561 -52970 -400214 225243 -247500 255765 57870 -12932 257948 -233630
19126 -38047 115685 -298223 -229344 -35586 -4249 -119344 29283 -77037 1626 109671 97604
19115 97604 80524 -32901 -254486 -31825 104325 92838 -331228 -82068 -100900 424249 53793
19103 10129 -183667 -34152 156815 -193286 262271 -195488 -214274 -203330 -103899 -359872
19093 -359872 -39732 -297764 -133709 -204096 238123 -251230 -47555 -255691 -247811 -22649 -69607
19082 -69607 -318418 -75920 188038 -118130 -48754 -50189 190971 -210906 85163 102963 125199
19071 125199 49569 -81428 144237 114142 -114847 -22428 -269635 -189521 27745 -43011 219979
19059 -214743 -144897 -115428 -61496 -301308 41179 -207648 176571 86912 140029 90321 80460
19048 80460 75946 -121005 -109990 -100326 113184 -255759 55003 -139079 -309263 -131187 -81718
19037 -81718 217391 -213898 -127889 28032 219307 236965 -253309 165488 414384 -149851
19026 -169675 -48987 -305603 84887 73961 -226140 -64426 -169987 -64942 -65430 173577 75458
19014 -195733 25985 154680 -186799 265976 239482 -120359 -93261 -290851 137477 -189210
19003 3665 -349267 -136785 45359 54559 68832 -130613 -72353 -23072 261926 61517 -262506
18991 283426 190379 6452 69790 -190972 39094 -249298 -147152 -105859 -111402 12741 30383
18980 30383 -206540 180672 -467582 -32318 -90544 -137942 12499 46173 -109019 86443 -149070
18968 312760 317448 -97309 16956 -201909 -34401 64916 -142246 -272046 -67173 -172378 -19192
18956 -63824 -22171 -95311 13921 29161 67438 -112876 314294 -77043 -199898 -225553 1773
18944 -242967 -92084 74 66659 -84035 147902 135576 426815 -522903 -302943 -407976 52806
18932 -200884 188121 -82273 -178568 -196896 -199435 -145619 120111 -51061 -105140 -46869 8787
18920 -269514 -17719 -205032 112213 88484 -115512 29493 -133122 147778 -21685 -114130
18910 -114130 -365801 300285 -187586 -64029 245757 -82745 -272630 19367 254772 -59798
18899 59693 -14099 27330 -36224 389594 -48978 -116765 -254504 114560 159658 -35067 -50215
18888 -50215 44789 -94730 -184069 -342464 -56787 -160121 -72258 -331071 -14821 -173976 17768
18876 13604 -170147 90529 -467659 -175754 -136400 -10699 64169 -197129 -142264 -65744 24729
18864 24978 -312460 -58515 305532 -166902 -2838 -194391 149169 -54808 133485 36801 -339881
18852 -124694 119278 -128134 -163956 -93416 -388681 141094 102696 57699 -162664 91600
18841 -291329 -62531 -104447 64857 -124129 -99691 -287389 -364804 -235726 -479440 -304565
18831 -304565 32698 13291 -78654 287866 -113412 -203258 -306397 190715 -217967 272302
18820 -219993 -73340 88769 -66636 -3583 256936 -13548 182559 -249124 148106 183321 -43889
18808 -245505 199110 39601 -205505 77040 -325868 122553 -232623 127910 -19385 -39538
18798 -39538 125107 199558 -134863 233953 -385817 62345 96431 122187 17153 -138244 -124149
18787 -124149 -83125 -313396 22401 -113695 -16983 -48616 -10396 96438 -333513 -307642 -164198
18776 -164198 42956 158561 -136565 -94874 -336900 -92744 182636 -201988 225414 -51997
18765 -63426 143590 -302881 432453 -207774 -294816 -161195 -18851 50197 -120275 295413
18754 -19361 71512 309604 -83245 -250956 139073 -369184 -270875 -486759 -189152 3779 254571
18743 254571 379071 -197872 -243272 201322 92368 -221928 -357176 82954 -116276 215298
18732 -216821 -125231 433046 -205502 -129912 -380053 6263 -34435 8326 168495 -70722 -400747
18721 -400747 80257 -40422 -94313 -178643 -64514 124415 -199730 23796 24274 -43833 -116372
18710 -116372 100502 -69509 -137488 -107707 123214 -446142 -75778 125613 -38902 175647
18699 -123768 -158997 -167888 -10577 206798 139721 -117794 79553 -207398 -54330 163166 64407
18687 -253 -92851 -134488 18147 -24478 155543 -64722 82335 211948 -108925 14404 110983
18676 110983 -2937 -287265 87242 183613 -189722 -51104 -156078 -14191 56347 424068 -146401
18664 -13948 -71268 277947 -170668 -68090 -23618 -28060 -229003 39282 -9168 37689 47053 113055
18652 113055 -145355 -102911 159518 -271629 147862 220440 -387390 3519 55688 -177068
18641 75618 -61465 147003 159877 -63030 96770 -692 -168760 23224 90670 -225693 -52670
18629 -139067 55049 -24194 -90841 212318 69345 -87111 106161 21233 -59277 260469 -23937
18617 -182133 222523 -434253 31147 -396660 -4478 -158903 77443 -122888 -77582 -438519
18607 -438519 -49451 279761 231511 201291 -57310 95401 110187 -25123 -305011 -288942 126114
18595 -275736 -261154 80270 -459707 -110824 -203489 10833 -236500 188047 39693 -354369
18584 204415 137739 317876 -440564 187476 53914 34377 11760 -36461 -227235 -6199 -10951
18573 -10951 58132 32512 -190039 35399 -402928 -117911 -31497 -175222 -294933 131292
18562 189267 -103522 109480 -65110 102792 8041 -275438 148601 -50624 277542 27140
18551 -197811 -245653 -293602 -190062 193730 -213108 -8353 -103828 -227009 6125 61603 129541
18540 129541 -213538 -329183 -89893 23660 -250845 6951 -139738 -22250 -289861 10808 336059
18529 336059 56273 -174325 36232 -103646 14226 -323010 -42566 -29313 -53541 180754 234719
18518 234719 410270 59470 -53330 200544 -169173 -33321 5951 94215 180442 -38452 -99539
18507 -99539 62752 20640 -17771 305175 -152885 -134401 -232248 -338562 -274686 62800 -334233
18495 -333062 164247 162410 -238819 -87641 -216849 -78882 -91333 30104 -217774 -4364 12171
18483 -245264 -60352 -55521 57690 -33175 -267670 -246072 44037 -127840 -427701 -36778 -69550
18472 -69550 4494 -158115 -52036 53960 -32207 -41504 -240447 -206736 -10439 -372492 38306
18460 -139992 -198696 -134481 -241266 187962 -194308 -81415 -79245 -95729 -27165 -294011 -51645
18448 -125566 -136487 -45784 32098 101100 -118597 -327195 13533 -233849 -389483 57299 -94471
18436 -162566 33991 36686 40252 -418549 -131363 -301290 65796 -121010 9449 -173896 -53046
18424 -87296 -99118 -13097 287067 -277385 -289545 -242264 -109155 -218009 142503 3982 -293586
18412 169160 -221822 428679 -82689 -53784 115464 -136080 282022 -197699 -98865 273661
18401 -42037 4964 199758 -72754 279178 -53097 84844 1994 -23934 461325 40071 855 -278942
18388 -158823 -24832 -41478 -21252 -101240 -287369 -200527 216919 -246777 -88763 -279489 -208829
18377 -208829 415297 -35438 -327079 126483 -7636 -68210 -99864 262569 11291 -144521 94906
18365 274694 40715 367030 -8411 -41507 -257941 142877 -185152 130148 67862 -155653
18354 -193858 -93721 178707 98517 -127954 285964 225649 52120 -79264 -284802 -143709
18344 -143709 -179697 -237010 -48 152760 -33596 -94984 212592 -190288 -183828 101387 -12071
18332 23739 33102 -147088 -142482 -344129 166390 -117756 9147 2868 -48150 -244299 -213091
18321 -213091 35823 149820 20161 159089 137218 5455 -185642 -179574 -205248 3093 -261742
18309 197038 55474 38590 -91931 44823 -231391 -165963 -268697 -13204 -219738 2153 232617
18298 232617 -167753 280782 -100047 -585425 13658 -393654 -175021 -357468 -41410 13906
18287 -491259 39728 -410135 115791 116956 141244 104119 253099 162786 16661 219426 85536
18275 -167493 189391 71151 171478 31648 159454 -75456 -221096 237480 160536 -234334
18264 -405655 -25137 -91284 2780 63329 -30441 -227333 -434741 -78272 -182936 -129470 -54491
18252 265701 -73601 -2122 -246039 -81054 -241602 -68672 88355 -128768 57517 14873 -308072
18240 -120824 -93123 -79585 222154 -9203 -5389 -129539 46756 -86438 -142970 132156 -43757
18228 -129013 -182721 -151620 48978 -249411 -234767 -83443 -176462 12624 -150908 -5224 68501
18216 74992 -57700 -185195 -411222 212173 180523 75158 -49884 -8918 -326062 -48799 37235
18204 163172 19407 154449 113930 104038 174797 24179 -82405 75069 148144 -358180 113563
18192 74857 -304569 -166582 -185032 -199576 -30591 -27560 -247296 144563 -18138 72977 -143520
18180 -125827 -80671 -79107 87670 -84622 -64521 -98640 -367250 316426 -83251 -217695 -98164
18168 -93470 289259 53773 -242620 -199924 -99524 229645 2524 -446771 -641 -175150 -83832
18156 302735 251085 -141064 -82704 -30208 -449591 41790 -113862 -30954 -178587 -100311 -45996
18144 -16873 -116318 -349968 -31896 190201 36117 -16094 -43279 -309109 -35878 34267 37961
18133 37961 163537 -202821 242178 201720 -199645 -118083 -120689 188565 -77477 -114774 -19623
18121 -75410 -250407 77221 -400654 -2222 -55742 -99881 -258136 -149844 -27238 197547 -212792
18109 17294 -269958 -287 -32761 230721 -178743 -37518 -123570 236583 218603 180063 7517
18097 146159 222458 -75233 153156 -285963 355676 -233294 -70207 -166108 -309697 -13559
18086 -179490 -69706 -142659 259258 496486 -128684 -227299 -129935 -325897 -9216 -254845 95669
18074 146161 101732 -58690 43825 -130202 57236 182694 -272424 -694333 -203250 -74876
18063 -74922 -175816 -169553 -196983 13847 -206323 -340280 -80818 24950 -201667 302749 141972
18051 89473 51091 12866 374052 267321 12175 164784 -163370 52765 79717 -116018 228207
18039 81015 -299395 135439 16245 -201398 -18516 61612 -79213 -9475 -34874 -384922 32673
18027 -26661 -77915 22244 182982 220617 102248 -63812 412044 -87584 170032 219183 -70073
18015 19052 -144336 4515 19453 -48105 43822 -195794 66074 254818 -74258 -377262 -52028
18003 158453 -240125 -119146 196701 -112451 131346 -251168 -2354 -182049 -74927 200292
17992 63386 -457667 -238189 -86376 -154252 -138789 -363426 78213 -186360 221995 117992
17982 117992 -145672 -150524 -73708 -151959 -17045 29649 282993 -230573 21186 237963 218035
17971 218035 -46840 -321375 -145279 -197648 -145554 -3506 -1934 63783 -74640 -28364 204269
17959 -45757 88209 -180123 -200838 7584 -52331 -139162 93653 93309 -76455 200764 97318 63806
17947 63806 -205339 277253 275580 -19490 -73983 101435 60950 137948 101661 -56642 -244827
17936 -244827 63309 -53227 -96010 -87180 -251604 -201483 453054 57519 -56902 45278 48260
17925 48260 -74708 153617 -159999 -25281 -34840 134928 -130784 316934 191785 -104760
17914 29538 -268058 24836 109380 46838 13278 -165835 -5072 97160 -147737 -38569 -84451
17903 -84451 31650 -181186 -109287 -155646 179284 30174 177400 -105310 -174046 -88902 302091
17891 -4008 66397 -178060 189390 -20958 61171 231793 159923 -202360 -386233 -28031 -349079
17880 -349079 141469 -225608 -279460 -11036 116554 -180297 670 68400 -112975 -137160 -38042
17868 39884 -23513 1539 -593066 23705 -403393 -48645 86554 11678 -182969 -133979 12960
17856 83652 -90960 -128595 216479 67996 -227475 74933 -36176 327369 -135099 -39377 205742
17844 167013 -49916 298325 -76760 -8766 -150069 2903 -47235 -214234 52376 112451 -11320
17832 -209584 -4874 73236 -197289 -57029 78491 -278971 45068 -8498 -149903 72641 243850
17821 243850 -294713 14837 252366 -116391 135628 -384461 56268 37447 22884 63256
17811 63256 129606 -3132 -75859 149079 -232368 -48003 20724 284035 182296 -271461 132044
17799 -53653 -264625 163990 103147 -15135 36152 390253 45857 44835 152418 -224201 -58726
17787 100560 -11965 89599 -240270 48943 -311587 -306808 15709 210976 68299 -323249 144809
17775 -29034 -129492 49773 -33642 205034 63832 275337 -10993 85695 212825 356445 59597
17763 -58996 -77371 30715 -129063 -322229 154669 -291432 58704 203865 -50240 -211953
17753 -211953 179453 -98791 -242814 216475 56890 98763 -120868 231422 -45768 -351558
17743 -351558 226400 -83511 -54914 -312439 -325537 237291 -168032 -84128 -214142 -268424
17733 -268424 149803 99368 -60084 110815 66408 195823 -142841 44140 -356921 296565
17722 84886 -79219 -68519 -66999 55607 -37461 -109099 -56729 136049 120900 -98517 -149118 210463
17709 -42583 170597 77376 104301 -119312 -171546 128916 -187219 -333909 223172 -121293
17698 261789 52699 -34484 55115 311971 264561 -151689 -82947 40140 292490 -181067 -177109
17687 -177109 40314 -162318 -322901 -153298 53966 -223024 65645 2901 219447 77285 -74522
17675 -21470 -270986 308890 146929 -207080 197407 -9919 36658 -96145 54360 -194186 12356
17663 -330059 183444 -208525 -210803 92501 341810 -125278 129013 212266 -135246 -484266
17653 -484266 77061 -133753 148855 9054 -80338 145432 50134 -56052 -42491 -188090 236837
17641 -91506 -913 -57987 -86292 98243 271189 207992 -113192 175416 124893 119137 250734
17630 250734 -329743 260239 -85807 -29739 -158943 -178582 283864 -119680 -77838 -22788
17619 -174191 110925 1178 -121637 -255416 190408 178702 141437 108128 448797 -120474
17608 215993 -32901 236357 227578 -17251 73988 84626 -284279 188786 460107 126581 33821
17596 -42322 117169 -303937 383674 -306232 129517 360552 104129 -130251 -3692 121291
17585 96490 165189 229771 -107647 -65583 -107013 -34213 -168579 -326173 -28641 -35214 -289899
17574 -289899 207904 -28766 -256309 -220989 -32632 230183 58073 250577 -23101 -203766
17564 -203766 14322 -95628 -255265 -201388 147416 -40439 -82755 136294 505896 -145267
17553 50830 126655 182365 314170 237294 76989 105455 332264 -28830 181707 -59103 -78323
17542 -78323 49801 -258360 -118460 313529 16954 -103610 104338 -8961 23371 -69205 155518
17530 163880 -139855 -41032 188694 -37215 -17606 191821 264957 237125 141882 43976 -314647
17518 87469 11999 237683 -140091 -30395 111258 -13708 200005 -55949 -103574 66980 197380
17507 197380 -129923 281159 -151980 -139080 86958 -11863 -31541 208360 -34139 206828
17496 -132883 32435 -12054 100394 414984 198294 -37670 67990 875 71664 220274 314602
17485 314602 -265979 128712 21482 223304 -58295 218568 -45295 -170301 325708 358429
17475 358429 265908 423033 -67218 87829 252384 292563 207847 33444 174576 -211182 159536
17463 159952 60964 280831 -245222 -182460 -63708 198806 3962 234808 336616 215811
17453 215811 330810 159095 148252 334671 97882 304329 144343 -19365 314311 344067
17443 344067 191285 213235 241533 290225 547923 386518 129787 -66694 145027 50601
17432 -109423 373152 95472 273557 160383 190800 -1015 62175 126598 618673 221567 51478
17420 -20371 45345 62706 -139060 388484 392454 269780 278098 249872 19827 201699 103463
17409 103463 278552 294070 400395 120927 73135 278311 340841 54943 171184 421256
17399 421256 202752 17294 321888 4703 151056 160117 208351 228802 175786 -259003 -401696
17388 -401696 118005 -27762 44178 -63441 41197 180570 308361 510147 118260 -123217
17377 87421 81551 -57174 137305 276094 47369 101874 178426 209028 -127659 89262 -56466
17365 146816 407492 58564 146240 238945 -112580 49923 113645 91887 36245 -274199 41112
17353 -66256 176511 193061 -39781 262797 180501 10311 316051 -23308 -110272 -60528 457042
17341 149065 81163 86590 72705 -92334 -62672 147430 112838 264155 -40697 15223 250374
17330 250374 183603 307199 -63040 -97932 267016 -193919 294529 203795 376814 223272
17320 223272 104993 202176 -59450 189114 -40436 314570 472550 84915 344062 279574
17310 279574 328756 122597 375786 -30742 204720 65217 25774 230374 -85618 124424
17299 273793 383729 -420 165554 -130969 28847 251353 351420 -39652 29123 64877 221848
17288 221848 180020 13456 275602 524921 422751 163065 104692 395609 104435 148061
17278 148061 160309 -324134 231232 300710 204747 8994 445765 169270 -38758 60266 302905
17267 302905 71265 147810 50794 161867 131308 318030 149387 167437 102489 -43003 160090
17255 -72662 130975 401963 8807 44043 49861 349254 -4557 201114 110718 306449 475039
17244 475039 204645 296367 274054 -19390 21755 228817 39851 135442 160689 100188 310968
17233 310968 -162384 105226 143025 89664 450677 164117 -1715 315587 389657 361523 -83669
17221 236639 -11678 79716 164191 236170 400650 -89177 210578 575748 281852 280707 56946
17209 300525 339498 120575 383262 -100125 306632 425430 290668 470200 246448 329197
17199 329197 321566 315101 444692 -139561 42008 -31460 -13931 -96140 394801 -38711 606220
17187 285205 133521 99910 403556 -42022 383276 68527 159705 42811 492863 -47032 147148
17175 324990 199282 355599 423890 221328 440818 554203 269110 323365 340405 408357
17165 408357 389185 349382 496996 467007 484582 278518 765058 469210 235846 321786
17155 321786 253616 -125804 199106 288383 381830 307592 -107765 124836 267641 192874
17145 192874 103001 163387 96522 335690 327186 502090 2246 306094 256021 398678 76393
17133 353309 271114 -48858 410771 260682 446506 471133 73098 496354 330556 549474
17123 549474 436501 352441 293315 150954 142777 153290 251648 284766 397736 307628 499382
17112 499382 336407 338480 450570 188192 335092 385264 353687 140189 294405 319047
17102 319047 361239 315825 441387 211546 581832 368135 573068 443626 566009 170771
17091 456257 302345 251868 297299 332102 626086 431366 584213 484582 108870 555280
17081 555280 535191 443798 295241 621097 377558 586446 652530 513823 652906 291028
17070 583034 551461 326717 753599 432437 559495 584369 425847 510373 607769 694393
17060 694393 187576 413092 205163 597054 619162 382864 301268 590362 849245 531029
17050 531029 612813 489389 24776 726343 614733 579477 567314 474748 541694 509160 582001
17039 582001 480362 566212 791072 544860 636985 764962 461039 424392 690071 557886
17029 557886 631227 465952 624652 635464 801959 496456 752161 643803 737548 822350
17019 822350 675791 815017 492852 646534 326129 865065 348250 721000 490624 852056
17009 852056 717553 765318 691392 750555 672914 600982 642959 884841 395619 730793 761425
16998 761425 744319 819150 573516 897563 851185 526518 893903 581304 490272 961390
16988 961390 749024 686676 842296 1011603 859255 935515 905044 546865 770225 819099
16978 819099 634570 964242 891744 1077879 1070980 1145632 837648 781930 858246 966745 1053984
16967 1053984 1102766 947439 1047216 845191 1023066 837393 879635 889136 1008087 870622
16957 870622 1071321 1265908 936375 1139509 1060059 1011881 1389514 1019627 1380126 1329942
16947 1329942 1059053 1023312 1193573 1556668 981426 1005028 1292982 999468 1194720 1281659
16937 1281659 1703850 1323046 1107388 1259508 1286130 1131160 1290595 1469125 1297783 1277098
16927 1277098 1223041 1269771 1144970 1140668 1301034 1696255 1390647 1400183 1551938 1567845 1776164
16916 1776164 838274 1247264 1268386 1468052 1436265 1779571 1456079 1432641 1913308 1550542
16906 1550542 1813225 1618549 1509760 1751013 1829987 1744908 1742167 1996567 1614093 1838131
16896 1838131 2045973 1757911 1876841 1902954 2161215 2140647 1959553 1842978 2242958 2012133
16886 2012133 1959475 1992977 2172060 1961582 1918481 2172763 2316963 2182449 2400644 2464450
16876 2464450 2442454 2609488 2312196 2445044 2327468 2642378 2623588 2852963 2661163 2486238
16866 2486238 2577353 2607334 2917884 2582066 2628419 3081035 2963205 2764005 3134135 3176221
16856 3176221 3226679 3176260 3108686 3448681 3127633 3430770 3755205 2918784 3200433 3571200
16846 3571200 3285273 3702057 3718946 4030709 3732225 3814181 3557377 3957887 3618659 4110974
16836 4110974 4040353 4120413 4136200 4417542 4610290 4124893 4442219 4907017 4802085 4701320
16826 4701320 5039357 4928257 5453728 4911959 5333087 5393110 5409264 5454810 5753363 5714341
16816 5714341 5950168 6008965 6318139 6342878 6603407 6526966 6522917 7037491 6921702 7185848
16806 7185848 7479201 7669413 7728646 8033353 7656055 8254583 8255994 8419787 8824259 9185503
16796 9185503 9177515 9139937 9480783 9975312 10175752 10348479 10695080 10662908 11358186 11542098
16786 11542098 11555064 12024703 12538020 13168954 13063904 13376590 13977440 14212545 15091887
16777 15091887 15255040 15726452 16096533 16784304 17438188 17870751 18807433 18825810 19724402
16768 19724402 20633011 21406874 21615585 22729410 23760598 24510656 25328989 26483348 27165204
16759 27165204 28689863 29577462 31199084 32375629 34010812 35506808 36956769 38545032
16751 38545032 40434384 42318194 44091761 46453063 48265390 50727969 53552163 56034584
16743 56034584 59198535 62163217 65701238 68833166 72675193 76574467 80562112 85149086
16735 85149086 89314748 94228233 99049475 104218336 109587297 114888839 120565538 126672775
16727 126672775 131651108 137284016 142788146 147919267 152997426 157590427 161331057 164937267
16719 164937267 167234349 169426113 170260539 170203989 169629514 167666295 165213980 161744210
16711 161744210 158195227 153660997 148805228 143453970 138230130 132659113 127220396 121668985
16703 121668985 116481186 111019482 106056552 100771901 96054043 91587234 87374253 83093703
16695 83093703 79140912 75263506 71612554 68278259 65278566 62178160 59435770 56785923
16687 56785923 54025425 51665464 49474563 47129107 45434648 43297336 41315379 39914433
16679 39914433 38412859 36387658 35007387 33556264 32425688 30783108 30239057 28759112
16671 28759112 27510981 26324524 25668224 25001069 23687609 22912569 22355171 21329818 20580859
16662 20580859 19817375 19328603 18589181 18231601 17494926 16765064 16567190 15956790 15327572
16653 15327572 14953726 14196889 13842867 13332891 13122254 12733279 12276218 12154995 11515755
16644 11515755 11294196 11026133 10838363 10605705 9823857 10047594 9671498 9338874 8968341
16635 8968341 8975106 8418561 8064314 8271525 7997389 7334004 7794573 7638179 7301779 7033279
16625 7033279 7139274 6787996 6723267 6387499 6331268 6480328 6190865 5998117 5754447 5577338
16615 5577338 5818782 5320086 5363635 5429517 5363649 4930605 4767253 5117193 5317513 4628482
16605 4628482 4315634 4204688 4642059 4252487 4087800 4287681 4081086 4078698 4064911 3918573
16595 3918573 3654385 3587068 3566180 3454578 3503352 3605262 3013311 3453871 3558604 3427935
16585 3427935 3249206 3279598 3117645 3345488 3002862 2993212 3133750 2792145 2722885 2791767
16575 2791767 2902121 2811550 2881063 3000582 2776448 2814381 2345203 2737472 2423404 2464534
16565 2464534 2267094 2418821 2619870 2525251 2182259 2225554 2387173 2500505 2204994 2192962
16555 2192962 2114915 2233099 2142859 2159026 1702886 1947708 1886004 2049895 2169630 2081013
16545 2081013 1710832 1683435 1744638 1993782 1586678 1690703 1747817 1729084 1540317 1628636
16535 1628636 1397984 1699136 1269595 1512553 1559039 1625395 1875636 1470962 1455764 1495928
16525 1495928 1313799 1364150 1498990 1656357 1702464 1554408 1434301 1178906 1251118 1369481
16515 1369481 1364940 1183716 1138707 1153563 1246803 1578615 1063383 947499 1153185 1167988
16505 1167988 1219761 862082 1357834 1307784 1053004 1322354 1132640 1150137 1285123 976531
16495 976531 1098936 1195582 820135 1203054 860291 960480 1421287 892373 1156715 971340
16485 971340 634700 1109831 770961 1157763 974413 730778 929228 847189 1021053 871093
16475 871093 865137 727768 923046 669069 809700 1247281 959825 830873 722081 945243
16465 945243 616675 829712 980062 954568 603567 626884 929851 607817 714606 293599
16454 802393 607617 527718 936404 1049809 498717 719815 552331 594829 778679 588852
16444 588852 760169 844296 701763 715623 544636 450730 588001 427959 777144 685528
16434 685528 760465 430126 551485 954157 338190 458331 469263 582771 369921 782033
16424 782033 569900 638521 560735 514361 456394 585031 620401 548446 687868 459959 653806
16413 653806 503247 769362 670143 511262 633293 330397 796235 445309 841797 703603
16403 703603 433174 555487 528583 633906 469460 740676 769907 406187 552534 624173
16393 624173 316962 711718 630120 326813 559828 460710 540457 450116 741790 438460
16383 438460 256850 333055 509402 547472 332456 164839 469001 433774 125859 364691
16373 364691 271481 -87568 253267 385761 390704 260776 185172 259743 609845 403591 172136
16361 219227 624631 15869 330034 160325 213588 357496 224135 592226 426942 269863
16351 269863 137227 349203 64201 304852 487524 169162 71804 438613 311419 469087
16341 469087 47753 134709 385590 -34711 251139 484653 748286 228198 361924 390267
16331 390267 239859 280370 278173 501432 336759 157794 116922 160881 377863 358626 326793
16320 326793 170568 79945 125505 243965 106655 322088 309823 298852 326360 215935
16310 215935 -5668 68272 485315 247490 179095 -266687 330888 417897 517061 190235 54062
16298 274072 354549 151076 415795 420880 210119 218027 65775 51954 249563 149486 427851
16287 427851 172957 532292 345010 383992 135348 558838 -4351 -19476 103677 143691
16277 143691 -195425 145079 5450 447893 5827 150131 -23518 274758 336137 305511 108568
16265 -24574 166351 234895 76731 387759 -86505 132012 83184 -89748 287920 70355 365126
16254 365126 80046 419474 371442 100148 151157 145261 82303 201042 123469 316098 52408
16242 -214004 154586 -179801 374773 59489 240603 117836 -27981 235079 207707 -217300
16231 38880 469 151131 -116583 78141 -368628 -102741 -85759 75109 324749 -173207 93671
16219 201741 404282 -45 33610 365519 68288 215599 449879 -158298 49402 395102 -30528
16207 164625 119150 15345 377925 45970 155226 51629 304025 293682 44499 -193789 93352
16195 282539 228190 83267 52948 401578 11281 138944 106098 362983 -94537 -103733 51862
16183 181957 350241 256383 -6718 -90108 84196 318845 128998 155903 277542 -41230 131330
16171 -60714 130238 186004 344582 -188005 -140122 -28720 156943 -120659 202600 134600
16161 134600 -38446 179563 119701 -592576 75029 160061 94949 -8904 373167 -174382 229598
16149 70227 64478 158508 171810 -10335 270154 96500 -68190 97108 25441 142294 230630
16138 230630 -277547 -50328 167390 187077 394452 309627 -190559 -71098 -246098 -23795
16127 -70671 282859 273454 -140939 139012 14685 -24866 97540 67878 200208 -57526 -79886
16116 -79886 101087 -105355 -2911 -190293 16361 209016 -258331 -338520 -94882 58671 405160
16105 405160 -301405 367741 121415 164516 51677 260789 167795 -52106 57668 -137164
16094 115402 -161983 -131502 234529 -94145 11768 -217119 19913 24667 4782 15701 -87734
16082 100614 21634 83499 -297925 -82875 -10256 -310610 -108688 113906 434562 230965
16072 230965 -151195 114618 -106355 235796 -71487 -57927 60793 26001 -269649 -138351
16062 -138351 -160804 -226710 142103 -227637 -43445 -211578 -67999 33157 373703 180938
16051 -261656 -217409 216736 -190128 159244 293777 59703 128759 180673 77605 -466774
16040 42061 -211524 234734 -35757 214879 -373259 -52315 379996 151169 -152969 -198263
16030 -198263 5057 188465 100513 -204275 -24054 136923 -35189 417123 -85063 -186955 -291502
16019 -291502 38924 89329 -155109 105350 -189187 39889 -200405 -85808 189452 148971
16009 148971 161995 -54087 -88140 -2493 -257950 327243 -43361 -64002 87329 131132 -89876
15997 135193 -252035 38192 88868 186604 -70913 -91869 236681 -239572 264809 5998 -1244
15985 139360 8919 50109 503013 547827 280627 128395 457 -120716 89065 -64488 -231391
15974 -231391 -160952 133529 -165846 80004 52338 -210398 -318323 306104 18936 336182
15964 336182 40922 -173375 -183484 -93213 142983 -216229 -64193 -60248 -30546 13373 -21949
15952 231399 -141114 85271 -59023 -118651 -2282 31115 170877 40551 -245663 3669 -165087
15940 92130 -155941 -41642 113398 -203560 291352 33073 84630 -120598 -34328 -216580
15930 -216580 -72727 -34415 39473 87382 215433 -31182 33164 -240517 -45429 -129554 -84109
15919 -84109 144276 116127 -103116 -102157 -31675 -277421 407658 -89071 160195 104670 217239
15908 217239 -130420 269477 -73057 -398238 -1890 -406455 133492 -157913 280204 -74565
15897 -263618 6508 29825 -13698 252743 -9933 -222987 -91283 78377 -58594 132700 -225439
15885 -201673 103830 83355 -263646 187786 -80895 -190688 -279808 20027 44508 -108852
15874 60932 43990 -267899 -236723 -43963 -324333 29570 -63188 -110335 -242440 42313 -231651
15862 14345 15530 -49381 162124 -10179 -56746 -180777 -51683 -843 100727 187915 -288717
15850 91790 394982 -175686 -61696 142001 -160992 -98362 -277523 -25451 -164125 12376
15839 69292 105315 153013 113270 -305163 73189 -17834 -364236 136395 -80510 71482 228836
15828 228836 5712 171674 -524532 44327 14533 -251744 -78202 35826 -29158 71417 -103692
15816 -9571 134926 215760 -54899 83490 54645 -340105 -161588 150311 23346 -50599 107428
15804 -134200 280314 287707 33189 129184 -27 -17358 292816 47809 -18983 55699 111288 128370
15792 128370 19143 75767 73248 147005 65382 -340988 162504 -109234 -119249 -100127 101097
15780 -114794 -94339 -267977 19047 -171935 27337 -79029 -204912 -355138 -65828 -46091 216078
15768 12044 35908 -115915 8306 -29419 135126 -364104 -265934 27415 -47636 25513 -46431
15756 243495 186447 -218154 237452 -61196 285351 119881 -343880 6858 305320 -203633
15745 139239 45821 -316329 -31175 -112275 -52244 38666 11831 44936 -165957 63894 -18744
15733 -114106 123330 51968 -264799 67126 215892 -257345 -74039 -361565 -245307 -20948
15722 -40166 155835 -85892 31024 34116 5121 -244658 283373 -6960 51080 -161895 68503
15710 343047 143154 51667 -123816 778 -170028 331572 -208675 -161259 -83447 -111824 -39028
15698 -52095 368157 -131682 8510 -38508 162731 54101 312561 106385 -2381 -220839 205449
15686 30344 54247 114946 -258097 -283985 -196660 268784 -11927 227036 -215576 -39118 13180
15674 70408 98864 117888 -58101 172679 -335569 41880 7432 89969 -181497 -386401 152220
15662 -189062 147631 54598 245600 -19957 66711 -48401 281256 -213639 24550 255947
15652 255947 43590 114816 -246861 -245949 73531 -4706 72650 -66072 84409 434212 344 54956
15640 54956 -108007 -290222 -233624 154583 -526832 -122044 -50767 94270 71902 -57354 231665
15628 -71824 194536 249793 51486 67417 -50342 25886 -299542 -3251 13472 -83214 79058
15616 -91237 -26115 81797 -2634 -61290 -440609 39894 -320363 51602 301313 54768 -67804
15604 199108 165918 -258336 -379902 164371 181864 -64199 85151 171944 -218267 -167714 -264421
15593 -264421 -173558 30154 -131541 -193830 122379 52320 -109822 176588 -178335 -48538
15582 49743 -62740 22687 37787 -74220 523852 -1917 -42643 -227183 -162623 146461 119851
15571 119851 -202021 -42199 -146301 41753 39635 -213055 -10337 -76479 184346 -313715 12009
15559 -52942 -34358 -222297 25844 32602 -35761 25080 107749 -272815 -87505 -137764 -170408
15548 -170408 -234893 -54505 342101 175772 -111950 -115020 -110930 68229 -316965 -218276 197853
15536 -244949 285292 272893 -16742 -202204 234717 26897 144172 -115533 170012 312661
15526 312661 -332239 19128 -30378 416856 -118589 -175803 -145696 134209 -39115 -82584 -71125
15515 -71125 186808 188404 -89173 -175924 -371111 40528 -16589 -75437 80372 -105439 -70173
15504 -70173 146434 12681 -76824 -556704 -90965 -334746 -66336 -4911 -4952 180139 266377 -422706
15491 238296 -16711 -231013 -80463 83496 135412 368914 -180385 -176607 -231531 -224191 -151379
15480 -151379 -133143 -447581 -182151 186256 -211763 121978 -2738 50801 -307715 -205400
15470 -205400 114688 -118188 234329 179128 -138588 -266118 -182650 30607 -120591 -9909
15459 -40131 -50444 132199 -118927 154929 171270 -98375 -114045 -203269 30697 -24627 53992
15447 246243 42740 17545 -72312 190297 -25558 82015 222832 163521 -36502 184902 -95657
15435 82767 -174762 -207256 27595 -174862 -159999 38131 241164 -109472 21025 76939 -94707
15423 -45981 -46723 81804 49925 -5558 -3634 -47700 -53475 6726 79726 237524 -18694 369869
15410 25285 -118629 -179680 162947 -25864 158418 392564 55462 -178226 144717 214469
15400 214469 215121 -163282 -22021 99089 -90148 -240182 124111 98159 81854 180008 -88155
15388 117743 -142990 287219 -305437 47692 140629 -152055 -113544 196476 -230292 49890
15377 157804 -69310 209875 -111255 -158993 -214866 46128 -90420 453422 -56583 7507 -103904
15365 -83419 -67687 -115271 -159129 -44691 -258668 -52696 -142050 -301872 33102 17971 -217746
15353 -64182 118150 -75232 -29207 -67598 -223398 69679 -16090 13991 -416963 84551 -14931
15341 -254362 169480 283956 -117063 -164292 -17775 -32744 -17368 -148688 18787 -87609 -125788
15330 -125788 184605 181666 -16536 104550 64272 -324496 -51639 -15970 168511 156212 9855
15318 117659 298879 165909 -213551 -56838 -139544 174728 127674 21906 48038 -155244
15307 212745 -20147 -157111 -217874 60409 334043 193595 -116325 -291992 159533 265900
15297 265900 6573 -998 186688 -81672 -13160 -140851 77166 50725 134160 82043 -75785 269216
15284 998 117540 -188802 338526 -112127 133809 356764 124819 -24411 -14488 72811 92662
15273 92662 -79762 -44397 -143723 95955 -45866 63214 -275504 108923 -123709 349891 95735
15261 345355 188230 433951 254949 331987 42317 120190 21699 428262 30569 128478 118049
15250 118049 438050 894337 842464 681788 970482 571125 198195 325127 18956 397015
15240 397015 343905 155359 -66734 -118861 297329 138599 6861 227079 191976 21590 -241004
15228 123273 -199762 80203 58082 -228432 36318 -180409 229307 -7796 60040 42922 -97772
15216 56767 248771 236396 93457 -111697 -341100 -133345 181729 57640 -119334 -161122
15206 -161122 -11982 351084 -208899 -10205 169311 144250 -187051 -51378 321402 220811
15196 220811 43110 62089 90104 109708 -84499 -102880 90368 -129684 -10579 38595 -59651
15184 -325016 385353 103404 279255 88186 -19654 157250 212872 -6736 209575 76304 -129975
15172 -47296 149388 285860 152613 85407 -35510 -12350 -298471 -216250 -55691 -361319 229585
15160 -20758 393352 213652 -64876 230153 -61747 113654 -57801 182893 -97269 -302990
15150 -302990 91769 262489 -50849 55073 103024 126456 287300 -92632 -26366 180061 -36326
15138 21553 148338 -35185 115660 -7262 259737 229975 72596 -115870 347748 3980 113055
15127 113055 153731 -190803 -71532 178253 200711 -114641 358897 95636 44959 285471
15117 285471 338734 258790 -57731 102059 195772 -90553 67847 129009 282470 279880 191013
15106 191013 33360 66600 65907 59086 128246 106266 242321 103220 394010 249947 -81529
15094 101448 403713 128253 -66593 149538 186891 177060 -170049 127275 103791 -10524 241279
15082 265587 -110887 192343 162203 267229 -15700 -21479 185476 -151110 -38595 41805 265453
15071 265453 229841 -52562 55801 153441 234697 249212 -6491 -88889 138213 -6974 182339
15059 -72710 179908 -281103 122285 472774 130674 151862 36800 170025 288062 276105
15049 276105 295628 49063 140597 312244 184412 310935 275036 147062 274683 270005 71664
15037 -17754 426919 400157 197726 275788 357579 188058 399994 332281 75332 188435 252769
15026 252769 25989 -35944 74962 88146 108785 400946 161807 55068 410187 299536 118322
15014 -27867 28019 -86355 192801 217657 172055 265930 246314 348763 203259 195746 506042
15003 506042 -106615 153598 59979 -5487 31506 125874 278395 44801 290838 122536 -117192
14991 450268 85163 407832 237883 56451 -3127 154875 427067 280568 271249 399019 308809
14980 308809 -48016 173856 -46246 368064 266249 322277 -13292 228955 237586 192872 551533
14969 551533 91205 59645 342807 -45309 304303 209649 199907 232460 452024 247266 192983
14958 192983 399882 283746 263269 274618 191063 226043 223177 236930 77024 33036 -8768
14946 326378 275694 253288 417642 -25607 43888 435821 208032 349019 360049 355873 -16751
14934 250468 353940 114891 483163 112724 236065 529839 344298 247629 292944 282350
14924 282350 155736 426811 259408 502494 55186 345746 79176 447141 172341 351502
14914 351502 343130 715791 202815 303859 185951 81167 330691 489157 207311 470923
14904 470923 501334 241329 399148 457785 114712 250807 389188 668273 473512 190818
14893 189923 395697 247476 695843 -57628 203695 187497 447510 64665 496430 463133
14883 463133 536563 39017 298781 625129 396962 348911 95724 611834 367569 267659
14873 267659 472351 521554 243951 116047 287018 569159 -112214 388340 315471 439285
14863 439285 301337 549951 344555 186583 138273 276491 445773 268301 204549 244795
14853 244795 199988 198419 253680 36385 376888 622666 367123 272533 610951 737118 231547
14841 360804 327923 25748 455298 487163 279553 258655 340762 511635 608371 642291 537714
14830 537714 577339 376977 186057 602211 478551 487960 282393 385410 281968 307874
14820 307874 436987 306133 390245 714803 427789 742764 502120 128265 412161 270893
14810 270893 548000 197993 395367 549289 309712 532968 598582 593317 488692 384625
14800 384625 521018 825718 628939 430882 535321 385316 493520 263352 436576 363234
14790 363234 525829 476901 583694 827151 385888 538541 477669 506531 310714 724822
14780 724822 693925 142958 579215 790823 364542 536053 309900 279432 463719 621319
14770 621319 735582 515026 784859 370181 766794 473151 815569 716430 657783 385623
14760 385623 371002 663946 693423 621465 448979 611808 637088 588650 714066 505201
14750 505201 905002 823081 229289 476497 968500 552449 663257 626932 479437 568181
14740 568181 610864 685486 797577 1050997 594457 551980 596052 1036034 908324 800950
14730 800950 725983 797408 882205 656167 995898 1132374 820130 546244 780869 490902
14720 490902 1075118 400142 696622 791458 757234 753564 495841 832297 509596 1066956
14710 1066956 651598 906114 887084 763131 747793 998072 644861 825386 993914 954647
14700 954647 420785 963903 659943 642563 648943 851643 757195 780032 1056246 697916
14690 697916 761754 1072600 902918 1011297 976930 893892 1092715 1004578 914061 769001
14680 769001 1241716 941923 1030725 734562 808102 1086829 1023378 845567 873386 1269123
14670 1269123 1007164 906076 1085996 882577 959452 1188962 1052918 1125999 775336 1321510
14660 1321510 1216166 996242 1042115 1576701 765253 1224458 879305 1251546 1384458 968230
14650 968230 1362906 1415062 1395507 1120793 1008563 1134050 889733 1288929 1286095 1344239
14640 1344239 965443 1361725 1227093 1392688 1241371 1406780 1308538 1302508 1020224 1434071
14630 1434071 1386372 1379696 1521865 1034100 982235 1544657 1296778 1203554 1499340 1362658
14620 1362658 1283572 1358259 1285002 1463701 1636545 1220502 1682747 1545138 1774780 1560517
14610 1560517 1509897 1043523 1432807 1479893 1342699 1566105 1725269 1482403 1759487 1583312
14600 1583312 1669797 1438222 1805014 1687968 1654881 1673027 1667810 1890599 1740445 1687272
14590 1687272 1595481 1925252 1503420 1813761 2015883 1608818 1920454 1974416 2018852 1483538
14580 1483538 1693362 1812807 1975009 1866325 2046619 2045777 1955042 2106014 2002544 2151464
14570 2151464 1871893 2364630 2222690 2305918 2347123 2579857 2465932 2563597 2978722 2514493
14560 2514493 2937050 3101198 3194148 3282990 3820078 3777591 4665344 4770078 5188459 5779473
14550 5779473 6856011 8904635 11922943 18066454 28888476 33330898 18818157 9237310
14541 5692006 4536492 3702258 3340984 3131352 3004411 2785450 2630525 2300728 2647923
14532 2647923 2417634 2402303 2354824 2636900 2473718 2733180 2769500 2554308 2488232 2690535
14522 2690535 2694941 2363285 2591274 2763921 2498691 2599690 2382821 2971310 2918060 2709079
14512 2709079 2737163 2749600 2882854 2902486 3136468 3070424 3213036 3041131 2951931 2838358
14502 2838358 3214090 3243108 2904472 3055523 3217533 2926605 3511708 2961117 3412070 3334755
14492 3334755 3510916 3089202 3393591 3205775 3172904 3409395 3731105 3670634 3415770 3332117
14482 3332117 3778659 3996264 3900636 3783059 4058842 3887162 4070234 3892806 4037083 4227417
14472 4227417 4095219 4201735 4180198 4521831 4300737 4145747 4329103 4535055 4597096 4829601
14462 4829601 4751771 4623555 4556792 4996203 4779897 4953602 5092281 4876418 5393909 5527163
14452 5527163 5246320 5354955 5320029 5231112 5417867 5292012 5522640 5476227 5898477 5721592
14442 5721592 5690066 5933115 6148046 5975077 5946016 6062185 6264911 6507921 6015418 6632666
14432 6632666 6777771 6839378 6762543 6881583 7045439 7021962 7262515 7606987 7366415 7657954
14422 7657954 7183799 7637453 7764473 8270987 8186514 7995156 8309762 8535644 8435158 8694792
14412 8694792 8784054 8883261 8969543 9163684 9486347 9231012 9269886 9978405 9646105 9981049
14402 9981049 9933559 10431532 10618699 10607504 11004168 11057312 11193772 11348968 11415576 11635548
14392 11635548 11867857 11949537 12098492 12506753 12649823 13222993 12978243 13118169 13791569
14383 13791569 14055982 14196139 14316109 14986879 14882345 14823636 15324227 15464145 15913658
14374 15913658 16405234 16635814 16937463 17408995 17408160 17860358 18291791 18794551 18992568 19543555
14364 19543555 20086189 20148651 20469434 21458423 21737312 22103880 22314354 23041834 23736429
14355 23736429 24368676 24941448 25381315 25833257 26551747 27534668 27769725 28554133 29144036
14346 29144036 30158953 30708293 31557721 32368463 33151206 34295231 35107848 36345716 36941681
14337 36941681 38592750 39579451 40348952 41387343 42483326 43994995 45700341 47059833
14329 47059833 48542816 49915842 51697613 53089094 54932335 57105969 58766656 60926572
14321 60926572 63123232 65230527 67836252 70110813 72722032 75770665 78688776 81746764
14313 81746764 84931958 88277460 91889370 95982051 100014543 104457081 108940494 113963338
14305 113963338 119207410 124498263 130478907 136270128 143144681 149595327 156814505 164580680
14297 164580680 172999393 181223241 190556924 200179732 210275130 221155555 232749197
14290 232749197 244572298 257496748 270453146 282949335 296121665 308687126 320851645
14283 320851645 332535760 343641954 354503362 364587522 374803761 385206487 395445043
14276 395445043 406244585 416869675 426561176 435091133 440456398 444511456 448095564 447483215
14268 447483215 442570718 438520127 427615609 414948291 401843541 388397648 375346262
14261 375346262 362405650 349157544 336316715 324100554 311944439 300432489 289007894
14254 289007894 277096404 265323659 254017421 244262925 233990851 224731530 215105135
14247 215105135 205662135 196755118 188431862 181160281 173997288 166557142 159776410 153152391
14239 153152391 146954379 141297708 135788007 130230613 125147802 120344639 116069512 111675297
14231 111675297 107408598 103713762 99209048 95524294 92252849 89300914 85764548 82506497
14223 82506497 79674737 76937776 74537797 71822294 69683327 66693519 64466833 62444750
14215 62444750 60475105 58423449 56995495 55181430 53212965 51322966 50243262 48627441
14207 48627441 47447611 46201199 44682940 43164482 41861575 40632734 39673040 38812029
14199 38812029 37472454 36321750 35141637 34526710 33152861 32288335 31939386 31009013 29964299
14190 29964299 29379854 28313673 27488137 27266857 26118705 25574008 24890593 24819499 23796655
14181 23796655 23227231 23026889 22179599 21884377 21410558 20806474 20350326 20277789 19803261
14172 19803261 18985977 18735692 18326632 18102915 17772225 17354245 17308573 16678484 16358458
14163 16358458 16032310 15608288 15425419 15426697 14812350 14713481 14533483 14180404 13708568 13689621
14153 13689621 13519628 12842020 13065748 12710236 12539105 12432625 12139203 11941819 11769896
14144 11769896 11637439 11411453 11323862 10839643 10819083 10748904 10577216 10566976 10128567 10369225
14134 10369225 10100680 9729075 9563859 9222175 9136448 9008296 9080625 8960420 8711362 8645565
14124 8645565 8785085 8432032 8340233 8333264 8366587 8151913 8245273 8097823 7837548 7537090
14114 7537090 7229235 7521307 7431360 7657731 7071342 7134680 6832135 6664659 6552737 6695131
14104 6695131 6682903 6679749 6582637 6526314 6302751 6602328 6099268 5714783 6067345 6001350
14094 6001350 5977933 5624253 5854654 5593029 5692155 5656568 5559310 5781749 5383531 5303530
14084 5303530 5377065 5310771 4849025 4972027 5331713 5228175 4556483 4934281 4818524 4786550
14074 4786550 4679012 4595370 4404919 4717456 4708203 4327950 4643622 4526219 4559914 4267404
14064 4267404 4646376 4238089 4245675 4215765 4000326 4134928 3934691 4108780 3954372 4198233
14054 4198233 3848253 3723744 3569584 4025096 3412109 3571812 3497356 3569076 3344641 3827073
14044 3827073 3345632 3375174 3366590 3381301 3286244 3258916 3662930 3508014 3177186 3272704 3392025
14033 3392025 2992838 3534051 3075937 3268998 3152809 3245824 3041786 2885310 2834731 2768056
14023 2768056 3052890 2846747 3102697 2731446 2510791 2597926 2608000 2671880 2664105 2419268
14013 2419268 2423180 2592919 2979185 2700828 2584149 2280040 2590633 2359630 2590305 2325410
14003 2325410 2676404 2605364 2685107 2562930 2338647 2663913 2703833 3104916 2758995 2958305
13993 2958305 3197142 3538094 3851003 4711592 5694444 8196850 12906611 23325689 33205468
13984 33205468 22942650 13090200 9021767 6952442 5761145 5093656 5015521 3977768
13976 3977768 3704011 3852396 3759815 3219487 3198024 2943900 3152502 2781938 2797799 2991497
13966 2991497 2623862 2355904 2783935 2443227 2434375 2425351 2193940 2697203 2198382 2345309
13956 2345309 2373372 2093440 2368381 2081942 1993997 2092081 2247636 2133671 2271321 2113801
13946 2113801 2247378 1800972 1761237 2041123 1943275 1792587 2147843 2060153 1798650 2007054
13936 2007054 2003977 1792895 1708712 1984567 1792837 1678034 1777049 2072612 1873850 1642250
13926 1642250 1680177 1738478 1674993 1465464 1756257 1852242 1595443 1673107 1726786 1713200 1458173
13915 1458173 1542357 1089420 1767695 1319412 1422565 1531817 1547754 1772280 1115662 1438015
13905 1438015 1268604 1327517 1254130 1524930 1177788 1710738 1410657 1504619 1233776 1569755
13895 1569755 1329284 1171087 1372182 1575068 1488684 1554083 1375307 1325031 1421457 1085027
13885 1085027 1176137 1405512 1038638 1195532 1419507 1423555 950859 1303412 1403827 952461
13875 952461 1271681 1192685 1139483 1158928 879303 949112 842683 1263148 1154583 741849
13865 741849 1126975 1000329 855609 835032 1132741 1077813 737349 1275837 1125659 1115374
13855 1115374 1063015 1066606 920100 1028383 1055594 968992 884850 730876 1008143 1041598 1054616
13844 1054616 935262 878687 851756 584167 1171967 994083 1122514 980750 1016144 1049019
13834 1049019 690438 939936 899105 1059143 925015 808094 1112153 881950 968759 942132
13824 942132 996053 943849 895026 908827 953748 1094600 894301 1082841 814850 632114
13814 632114 992864 847394 1097441 1001757 909092 1044447 1011014 939941 853492 1237507
13804 1237507 733318 801228 666895 772515 877132 1184016 747282 796519 946449 484099
13794 484099 913187 644987 598939 833564 878674 659241 731924 521319 781251 484606
13784 484606 783278 849014 880242 878096 934128 800261 970451 742605 1037628 673590
13774 673590 673054 839875 669699 744267 1151877 725913 858782 626820 493126 610072
13764 610072 736584 729084 463287 557651 381668 798999 566757 720130 469750 754807
13754 754807 588859 648197 501832 777294 974516 598066 832589 709582 615280 380476
13744 380476 591220 713515 753131 845879 971018 411531 818036 331390 571624 670497
13734 670497 482709 624323 812528 519927 778820 668585 854668 315195 664898 799340
13724 799340 489969 648787 851974 701779 597340 465400 522788 454870 664803 851425
13714 851425 422079 416924 831058 743798 329440 513106 605732 735970 344060 458979
13704 458979 424653 764889 561736 546333 704591 265466 365260 562165 693548 424893
13694 424893 126733 785359 414148 546216 812710 696501 725255 516337 411931 453072
13684 453072 719249 663062 315581 414083 309698 597883 486626 590158 573419 420526
13674 420526 641229 629130 337502 643882 439695 205710 654390 250317 581377 810896
13664 810896 398337 653666 613011 685496 437727 402458 136716 398657 372249 414238
13654 414238 499452 351996 531262 426351 668336 422874 358869 539545 693396 307920
13643 319097 175451 260141 705041 494292 48880 677099 124631 317389 237696 419591
13633 419591 224970 340994 138381 495277 88271 692051 674787 729582 612809 162145
13622 703568 437120 285724 482824 364103 212195 475148 661725 621093 196494 605354
13612 605354 257708 337050 404038 137486 365928 527476 256694 204200 -110524 762517
13601 458549 327080 239662 406231 3628 342953 474356 310514 361097 171908 575180
13591 575180 652798 338936 226981 588514 152021 185912 481773 115808 525785 543499
13581 543499 340337 486279 414660 401230 468921 303743 480564 357625 311289 478043
13571 478043 390097 290742 419515 -12174 552899 346751 391484 107942 615650 501170
13561 501170 465018 51362 355199 446484 315030 152874 353222 192133 386546 442708
13551 442708 678703 74405 500312 333195 182637 300480 344842 118786 109776 351623
13541 351623 428993 96179 376609 483445 223444 171754 314142 762685 387968 447633
13531 447633 358121 161098 99669 332936 -37262 444966 496799 547401 256258 156277 271052
13520 271052 360487 414798 321933 364593 364223 345101 360626 349831 179600 162206 416544
13509 416544 123002 398523 150279 218434 21217 419100 281085 273580 585925 428875
13499 428875 209144 212520 362982 277753 265561 124037 422436 116587 370744 23472
13488 292144 67612 321026 149497 213418 442631 387862 -74697 326617 242598 78959 333312
13477 333312 224864 428384 378293 129037 120126 -40680 593790 80635 -51086 352210 272369
13466 272369 162635 184786 479713 360144 408948 32562 588709 197900 314138 -3053
13455 -94271 249506 464023 81640 435982 313721 306784 303943 211971 430585 208887 416254
13444 416254 281095 422716 88455 174345 383521 46543 302531 585969 575889 298996
13434 298996 118552 172760 328915 256768 177188 287212 24229 234864 466805 159329
13423 190944 156549 127703 -206421 66050 153369 111343 302876 169726 199531 466926 -68398
13411 76339 132961 480795 435032 189471 133343 298622 54979 359200 310452 250416 284445
13400 284445 158991 116482 204455 163618 302572 687467 239956 200112 54687 293764
13390 293764 288207 207654 273116 188335 117342 184915 81040 157494 143797 219292 128300 215678
13378 215678 277076 248265 -196289 -146602 43461 248999 247740 -58619 319678 318028 2992
13366 185407 192389 95088 -256398 105765 170084 305346 109278 82841 -43367 283251 293995
13355 293995 202798 511580 224957 557707 141746 227727 325925 212929 100838 316410
13345 316410 433064 151771 354044 317165 605314 287331 310334 49408 300782 130283
13334 171994 219977 208840 136404 17649 167393 -114477 98807 190980 239935 115731 378781
13323 378781 -17516 365491 307499 260729 342583 14726 405900 145592 186541 226397 254669
13312 254669 -41541 323879 137911 187139 386704 51753 128663 82591 126539 -61839 96082
13300 222719 42870 348364 13024 42170 91578 490037 -36128 37421 -119533 -15307 370557
13288 337356 -173126 400242 157574 30300 86962 158764 297494 350462 -1104 220191 248477
13277 248477 -2435 -75745 196908 278910 -70272 55628 138375 51814 22774 54535 133704
13266 133704 29190 -54880 -145398 223772 221457 80938 -108570 -118848 177824 294456 54120
13254 -14462 72007 -145075 -95935 423837 9063 157390 5394 -31578 26199 -144768 -111674
13243 -111674 175907 294752 431115 -113694 224968 74145 156376 139106 -112663 339977
13232 -106961 305589 25526 149587 149247 157693 26803 -117408 133943 51787 213233 173699
13221 173699 -222285 282126 -79801 -119453 178773 191597 431218 -38361 -26452 295607
13210 13261 120748 206381 -182985 234286 269480 526382 81419 174302 22055 291838 266203
13199 266203 96274 249991 270729 261546 5474 94314 218106 -303698 -6795 237058 87059
13187 215305 62992 290478 133119 212415 -42303 200556 -28578 81273 163880 128165 -30671
13175 -59393 134921 -41368 209979 63669 13096 85270 315078 245337 68247 88553 -193838
13163 350603 -156197 6606 158155 180747 306407 232245 17164 -155429 168017 123800 1900
13151 418656 106879 82580 -170592 -43052 -51130 338759 62974 -33221 63617 130742 58427
13139 -176135 46644 212659 -34005 188809 -139083 38074 279941 30341 170955 20556
13128 123433 100277 452167 -15158 33348 318737 3990 117635 167265 -170690 27699 2583
13116 -39370 28792 236640 223972 126892 224670 159659 -32776 83204 224118 55345 329581
13105 329581 240572 -39753 58105 92403 -102024 6838 241794 161326 5348 57702 459342
13094 459342 260687 9848 -4384 85320 -47111 -168002 -81863 216177 2097 102185 -57779
13082 -100376 -71831 -73307 147083 380548 -1026 239597 157788 133087 -24174 254321 -211727
13070 -87842 213820 -114806 310810 88982 217760 -50289 -3884 192671 197554 98003 302197
13059 302197 -158555 176722 375919 -29381 34302 213226 362324 110065 -145857 4706
13048 69740 83909 -163674 86354 -55963 182213 600376 69900 -37299 5393 -138671 449337
13036 104574 222673 177239 251401 -28750 -117429 -54661 47045 -90484 398329 229524 310834
13025 310834 227670 150882 94772 157464 312163 101889 165762 265918 271017 -167991 134754
13013 409520 -139916 -132104 127301 83783 -77550 122728 -62378 53984 8843 -180940 280226
13001 6191 209151 245092 185304 -16473 190571 -17100 -34843 -292675 166342 524624 134224
12989 -82193 -14475 -202054 19855 112001 -74063 -197762 32014 161982 -93273 90208 115327
12978 115327 -24471 -29620 -120236 8651 21170 -5098 200601 80410 -103911 66481 127103 188442
12966 188442 226088 -315387 -47776 -136291 173457 -133292 -144022 -13391 221081 169124 346222
12955 346222 42781 -31824 131866 -171602 90600 7539 -30601 103649 -157929 -173152 12725
12943 81688 -321829 120549 -123246 350963 86859 242032 126994 155030 -161979 -208169
12933 -208169 96725 73309 63590 140768 107069 21262 -68309 473287 -164277 42331 -238486
12921 -2716 6716 -40716 -253021 -85201 -67844 94606 -134866 76483 -127425 369901 -65170
12909 134004 9958 89369 212833 66710 -146903 72856 21426 -29373 100180 50636 -119027
12897 53471 2815 -105147 5109 239701 -162151 122087 -47167 81721 248178 112944 179154
12886 179154 -25057 98666 113391 182216 -49370 114348 -81064 -230001 178636 -204043 244111
12874 150036 -14828 153773 279585 -86882 -77127 303149 280773 -271790 -59722 147770 -130580
12862 90506 -40548 207514 171746 -100472 -156337 -1606 274927 -173869 92850 -31726 -49042
12851 -49042 227877 -27267 19930 21256 45844 -145855 335904 -57420 38598 -51719 -80342
12840 -80342 95686 178424 200321 4560 8975 186194 202608 -204841 -104055 124169 -42566
12828 87935 -15999 -46388 213308 -15164 143627 -77751 354776 -91398 68279 -174321 -182945
12817 -182945 181170 433390 -47426 103946 125401 -116611 346826 -184226 -93722 -116341
12807 -116341 18032 103892 -39930 -73872 13953 -48219 87714 129057 90053 -189692 -6586
12795 -721 -71701 57031 -23540 135548 -141966 114724 -145955 95617 249289 56544 -85331
12783 -38063 238558 33530 -51719 -40362 -320868 -84214 -98301 220489 174268 241197 -43139
12771 148666 -349023 -76646 341781 267904 157523 86876 53663 326846 81994 -137081
12760 -177385 133049 -9592 -120527 280324 56544 94351 -20732 337261 -185420 -105574 160570
12748 34885 -185424 22243 146858 -48498 58671 100471 188797 152800 216376 58561 428943
12737 428943 227386 242711 183725 94695 132963 352043 228250 -134843 203976 173542
12727 173542 76020 55396 11768 178313 -143752 -120989 311242 36187 -284013 104141
12716 193917 279294 289856 -289070 136236 25469 52608 329104 497371 207840 268957
12706 268957 -28640 176837 17046 251772 309249 152155 239597 -4670 66073 129080 -134088
12694 -150876 -150475 36126 -22068 48188 105751 115318 163053 411543 -60302 144190 -90047 2074
12681 205844 54209 271298 40344 137181 276300 280974 273294 106314 132744 18839 -14385
12669 85437 161454 127318 -178979 81577 248390 273073 -292268 74023 -76946 12037 -188719
12657 209183 153331 66279 -102957 46988 86762 -37675 -32476 439509 -166752 -176724 76386
12645 -129980 126930 205667 136405 -120190 150370 -27131 128920 184349 -48754 -210227
12635 -210227 100767 318562 -44287 2191 128983 356746 251364 297496 76746 -115080
12624 308644 -128860 181309 -12 -8202 -34568 -159715 -41211 145122 181179 -12720 162102
12612 115835 95457 31283 147642 19056 156467 -87612 308721 105755 103176 -308145 -133835
12600 99237 322657 109275 362749 43828 114831 230048 -2440 -289453 -100235 319589
12589 152044 32610 101420 205981 -117299 -114681 124362 -307900 80651 -233689 -284219 11962
12577 88694 -7446 6026 -56425 141997 -192970 159238 70497 105862 233292 -151042 -152628
12566 -152628 -133996 -57024 50015 98306 44761 52517 35669 171757 349945 260415 145589
12555 145589 -4583 -160694 103519 -120060 264396 -111293 -120961 -92452 -78667 345501 -41191
12543 101005 -36264 -85810 237689 -120538 -25771 -97005 126069 -38308 370661 319270 136674
12531 -148934 140613 -26140 -19628 465308 8136 80655 -386288 -132073 40095 -417067 -25319
12519 -7975 253227 -2332 471472 -100177 93166 62094 215161 84716 -218509 -214446 -284337
12508 -284337 219364 -12681 -26197 32526 179438 -97623 -59885 -360416 -150596 -52224 -394323
12497 -394323 -121821 -27877 -105145 237748 200051 -367460 209995 -13363 -33877 59234 -107151
12485 -137675 -190882 149220 269885 149859 -78074 240152 23841 -297793 149532 411234
12475 411234 -206144 -111920 -160198 51557 -71278 -30279 93473 63967 98081 256813 -132725
12463 -78634 254078 -28406 -82447 -113377 -218241 -252382 -21218 8845 88117 14959 446690
12452 446690 -292968 -189789 259237 -342203 83474 -105632 -57537 53659 -52253 178268
12441 -44655 -238459 81298 -86346 -4150 -295030 135195 -38110 293541 123679 67339 140615
12430 140615 7875 213176 288228 -221753 -108854 104286 97939 102707 -121324 -51648 -72431
12419 -72431 136309 223718 80015 14266 242170 -381855 141368 114782 170851 278137 -174042
12407 -245538 -162212 -96667 16111 -428367 168298 78294 244662 -59502 27374 42208 165836
12396 165836 -134746 -92112 -191249 -198652 120900 -212584 238342 156066 -2838 -85007 -78440
12385 -78440 -499 65630 172302 -174480 160282 134446 -18867 -106447 -46769 54429 90602
12374 90602 64033 -165524 395958 134845 137673 -57384 -511653 -197280 -163186 30079 126226
12363 126226 215852 206996 -185828 96780 73252 78457 263891 -31559 183222 -152986 151843
12351 300242 50103 -102199 64537 203888 324315 151711 -384067 -317898 164751 143583
12341 143583 -36747 -149579 172900 150156 276902 -560576 -31197 -70068 -269710 60720
12330 76803 -38964 213613 411064 -9586 -148509 -233794 251229 66563 69489 -185554 46235
12318 -254463 -354241 107304 -73178 11500 39823 158771 -183033 31565 229772 -135871
12307 -112530 218685 -50725 -14966 59485 -71298 133841 93553 -75144 42587 -3327 106888
12295 -14308 -76558 -103287 341468 348394 -74417 -163454 40924 26255 243656 110039 566507
12284 566507 -43458 -44050 -66293 41304 204293 136769 -14588 -41036 216201 486767 151241
12272 -3458 70431 27303 213359 -130838 -106815 300743 94226 52671 160701 -78884 55269
12260 197882 331503 276805 -139201 -117179 -100016 130468 321249 313487 257383 87620 36518
12248 -176181 199939 -202684 -278600 227191 278342 204374 -268211 -56315 244495 -345334
12237 120459 -446031 3232 -204875 179762 256571 272631 170455 122245 149169 391007 49026
12225 168179 307367 54433 561996 157198 288694 327650 85321 145331 325919 22013
12214 400843 223608 105264 -102616 38583 262249 201994 152472 -107439 104281 194720
12204 194720 269625 152804 73638 236118 -337184 104178 186755 243286 12800 217606
12194 217606 54618 259345 -159205 188074 233137 228570 92854 135484 279092 -46839 80770
12182 80071 324311 -184198 211645 214569 16332 -109717 261630 260254 275405 211163 -101682
12170 -71616 124750 -151483 201967 238589 13073 70678 119851 522449 303061 64803 38615
12159 38615 194351 86459 75406 8222 142172 189320 172828 -263424 138108 -263088 -25728
12147 35779 -167541 -29824 -86502 28686 -20318 -126523 -112854 71765 -172425 147764 50161
12135 -176326 272785 -70892 305764 -151817 -170567 178972 216608 13672 -226228 280479
12124 -101624 44161 109865 15403 -134565 30290 -28944 95269 173372 3357 124275 236031
12113 236031 -5920 -6575 -189065 -55975 -172737 43963 72114 211281 -208117 -210192 -170053
12102 -170053 88073 9256 15846 -217415 205723 18799 59613 -152325 -151791 123690 -516452
12090 -8044 133106 168661 -27883 212324 -75409 119278 100519 67941 -256936 -47847 -266689
12079 -266689 -97748 192252 99479 -32522 461254 810391 1605434 843385 457306 71926
12068 -8073 76304 32821 136236 10397 49799 14304 288771 -328538 -47228 183897 -69272
12056 -22952 -159834 -39138 -127696 104236 15352 186782 -66764 -62177 -349375 -150086 32955
12044 -217210 -89929 -335776 -58233 19379 -206693 -164834 -321707 -25936 309956 57952 -75406
12032 89418 -382299 120307 243628 271878 -80891 -189101 19162 215677 65749 48091 -551157
12020 192202 -87124 3450 17124 25651 77993 88058 6184 -23651 280099 -29555 -35542 -213049
12008 -213049 -324733 -86188 -30324 68164 -317297 110632 -12591 213181 104276 -59369
11997 -155731 -146605 -124230 -29621 -113095 -127893 -119579 43073 108406 7028 -33616 -161573 18047
11984 37718 119900 -77694 192236 33799 -191874 132696 -110531 16280 42607 246235 -158671
11972 93429 -117984 236727 -61224 183673 226825 4291 -44452 104867 346267 -62072 308409
11960 -137928 129914 -28046 -257055 -69337 -78398 172022 20917 145596 123795 -65864 -159022
11949 -159022 42861 22854 -103459 218649 -128709 74817 37120 -75420 -393187 119990
11938 22615 -139511 53905 -143812 -167189 29482 -115360 9724 155809 51814 115899 -247779
11926 -212753 66552 199122 -125336 -15063 -60394 185233 -278843 161183 -207356 171903
11915 110260 -24785 -87944 115451 -87901 -174283 102895 -169484 -37518 133559 337595
11905 337595 179652 2135 265599 124987 113921 -50624 -181978 130017 -334400 -38931
11894 -272735 9978 -105731 -112003 96675 99143 -30826 -162880 27288 51305 -92517 -72335 80503
11881 -218456 150142 -154663 305214 -36819 -89032 -63069 -257149 -23202 5138 162489 94202
11870 94202 -75327 51188 23959 -849 137658 -6162 209351 20527 52981 -258414 27804 -347065
11857 -67660 107512 11508 5178 -279667 84126 45684 153078 64159 -76040 -267275 205922
11845 -125639 35161 159365 106670 -237152 -248804 9745 -68350 132430 -335387 -42761 -75274
11834 -75274 -183390 -149493 -68511 164337 -288585 -283199 -179226 -44714 62397 159147 212071
11823 212071 -191842 15161 61820 -281 -55318 124259 -189789 132356 -18778 -254978 -183065
11812 -183065 272419 101578 127265 24423 92063 -35728 -138688 -148549 -228867 -233177 -169425
11801 -169425 -238997 96884 43025 104164 -4979 -421144 97223 -205734 95666 277349 162290
11790 162290 59248 -116781 -121212 -35069 130146 -190143 57759 76054 170738 271196 101027
11778 -175113 81916 -16372 -128140 -185608 -112279 223451 -268836 -21894 -162453 21652 -18862
11766 -128797 -163195 198275 5671 223117 -392389 91049 -118781 -32877 -205690 -17690 55135
11754 182624 -34947 -162040 165081 -198657 47427 129346 -10239 -175471 223912 -7919 410244
11742 183116 -204103 117360 -115665 45464 -334692 -429021 137358 329215 -184696 -72191
11731 165852 144172 -229363 264813 167730 -214537 215974 -132210 169311 74447 -12526
11720 197879 -54462 142113 178408 284155 75412 -103558 151349 42009 29618 -67470 -68372
11709 -68372 2789 -382413 82657 -266370 -229068 70318 48504 -46426 64574 50067 182391
11698 182391 3141 229185 -23245 -67961 81605 -221133 63302 76695 223772 183152 -145116
11686 -331843 -122813 273007 390944 -234656 184139 330486 -44071 -145150 19178 125905
11676 125905 226153 115484 -4404 205275 47554 77937 -3361 -30874 -68066 -44022 212560
11664 -6164 84112 183497 -74913 166310 -169901 124679 -171484 -212502 16041 482039 201830
11652 -30137 308195 304437 -52828 -4314 132461 -95791 154367 225925 -24516 -264892 20466
11640 -378729 78722 125622 255088 121946 -81445 164274 204455 82577 146804 142894 -224089
11628 261322 -15713 -238137 45715 284668 109020 44102 -20043 110821 -2895 -185797 -144294
11617 -144294 -193342 -67546 39265 -115051 316568 -127681 -37984 30119 21332 -56939 170046
11605 226538 187701 26938 -95910 9255 -6702 211443 260776 -45477 -367480 -55034 -258251
11594 -258251 22891 22181 -168197 -227819 230747 29612 100941 291755 -54064 -135736 -96766
11583 -96766 191925 218886 214855 137492 124628 19712 174415 408651 111177 -64238 -125303
11572 -125303 -243621 -523180 89429 107274 84076 169060 127969 -53043 77432 -111697 -55571
11560 -2150 -241170 72528 132377 35565 38308 231963 -21814 132975 -127497 -3519 -54952
11549 -54952 152355 -95747 119425 -7742 -14337 25930 465449 34184 -187863 -49957 -12955
11537 113590 -118316 177954 239335 81019 13323 333835 144486 157459 138197 181366 167699
11526 167699 100882 84170 38224 213563 -27704 185359 -38791 15735 -3745 215699 -83611
11514 -238191 -177749 155953 -125757 73226 95005 35593 -69909 385903 74505 190876 193299
11503 193299 -65871 -134645 33250 119795 61669 -94707 78270 109491 226007 468771 187856
11491 72829 190868 -21343 -236377 193351 181333 -26509 13880 -173340 54737 250300 166798
11480 166798 136489 61920 280221 381568 157639 189379 135354 94484 76333 -61677 150076
11468 229226 49106 265014 387854 274202 321859 -114321 -62277 56971 151907 -133246
11457 4345 147942 -180405 365895 144660 -175786 -61940 -61669 88966 154408 -87345 234024
11445 228319 269348 -75346 9914 52611 334093 147674 80790 129864 -369299 -85688 249875
11433 135142 62462 24814 100507 -80775 149241 364871 -93800 -178380 -99146 275714 -571069
11421 136442 -291472 -95497 -18466 -102938 -183262 -19882 141621 -158470 228296 19185 441242
11410 441242 370853 -221064 -40992 -199026 -182376 -40754 -40050 104053 -63867 92107 -72949
11398 -228351 226127 22996 360954 229602 271232 -2627 -83176 -60223 85467 104524 -125726
11386 -29920 -276630 -553370 260169 -134095 -260796 -167379 318 32883 41986 -367823 141853
11374 -19069 233886 136589 -108233 159751 222097 3312 238767 -121627 186519 -118699
11363 -6062 -65016 -78043 -78407 141465 155239 22958 175065 76594 -9339 -169333 -111619 53019
11350 105700 157056 8333 -411860 94048 87974 -39402 -25385 -9938 441908 37191 24285 -40114
11337 -30324 7138 -226912 -229399 254766 165400 38747 -32333 161632 194980 143723 -141156
11325 -349841 -59237 -89366 -48686 -56350 136872 -131271 -132970 -134834 -171671 35564 146431
11314 146431 221663 -247988 -310029 158574 46876 -93895 85764 -258194 -151208 -45009 -115662
11303 -115662 63121 477409 -171865 -230885 -27299 -14987 -65312 -79839 78380 -6624 -257444
11292 -257444 -140666 90242 202878 -424238 52358 -178667 117671 -119380 98181 90801
11282 90801 87383 -230947 -108363 -145951 -104734 21897 -152669 -230879 130502 -210423 -117489
11271 -117489 115285 67299 68023 -138799 -24729 15947 -148350 -283781 -14154 -288829 -30452
11259 14107 51558 -22667 188247 -154050 -103643 -250978 2283 -6952 33590 -215077 -172308
11248 -172308 -75377 15335 176983 114438 -8962 136687 -299495 101737 306791 77591 102129
11237 102129 -82302 70039 6056 -59502 -195455 -348056 -72092 -139679 -144750 -190145 -207876
11226 -207876 66368 -31727 19896 -55715 -3410 -347782 -239843 -86895 -110015 -182274 -28385
11214 -95217 -63689 -208674 214742 -182089 93486 -131712 -75047 145889 129537 54595 -171990
11202 -102589 -145848 30179 20019 49606 109040 -42253 -87291 -125270 -177449 -96550 -334466
11191 -334466 -208663 66430 -74915 101976 133036 -17553 -207181 348960 47132 -6275 -35532
11180 -35532 144481 19076 64183 51041 -96324 -29281 -293299 -32426 22193 184224 -471961
11168 -46147 62679 -82225 -101597 202161 -192705 -76754 404929 -135748 13085 27884 273576
11157 273576 240782 31988 -220378 -106180 61998 -226468 -286408 -213449 -45472 159570 33297
11145 33278 135508 -22947 -3989 -152156 21505 -285883 172352 5828 -169919 -49710 5493
11133 -385508 203791 284841 -68323 47901 -174566 462857 -151106 275223 -126949 92238
11122 -115837 293419 -60759 -73690 156536 -53534 -83295 5363 93195 -111995 43235 -86264
11110 207558 74317 323628 -51462 376440 240640 109515 282795 30002 -34347 182520
11099 -5860 -219484 -96298 259586 129292 272530 377704 121831 441809 206366 53240
11088 -2466 313771 -203390 219195 111035 -95572 92394 238169 166997 368826 93047 19300
11076 493502 -93237 133812 216495 151148 247867 330454 145672 452099 332098 440818
11066 440818 575343 534680 285476 579460 671125 264830 307159 585169 340151 781774
11056 781774 565732 737758 650290 901132 684592 627529 446498 604765 451232 669114
11046 669114 896157 476964 1064396 534944 595522 589769 532733 411596 456310 864480
11036 864480 989474 507803 530323 672129 548063 663585 667026 512870 789374 652672
11026 652672 809953 532027 815047 728519 610784 844309 718209 279954 567163 572811
11016 572811 491862 688462 364507 567009 476526 526484 205292 600024 291329 716455
11006 716455 476119 693422 343101 619428 640317 598535 644764 771829 604204 504866
10996 504866 734833 652092 480180 524840 748762 603749 935724 841339 697724 916333
10986 916333 1075106 771506 1118237 972836 1071683 869150 1231487 1318323 1286148 1506804
10976 1506804 1669323 1952688 2451212 2171149 2364296 2385208 2145332 2376618 2134559 2047088
10966 2047088 1929133 1986794 1500726 1787098 1443890 1743374 1677896 1642938 1776615 1690989
10956 1690989 1323005 1632690 1434942 1490016 1422262 655674 835957 940598 845550 467217
10946 467217 749484 519331 524009 375386 360312 789149 537280 506460 113631 291179
10936 291179 146968 93268 -31333 -61513 76275 138632 186406 -6886 45563 116339 -19323
10924 -164991 -1414 28016 288644 199271 -4745 46216 -137785 226757 -144634 -32320 -67728
10913 -67728 -56462 11078 -10094 130700 -240608 205691 19882 -142324 -29341 40021 -3398
10901 -220846 130383 195011 257044 34533 -90106 -271151 -165017 -366281 44295 398613
10891 398613 -60510 107438 -160810 226264 -57883 -288908 43135 71110 156208 23891 236066
10880 236066 17084 30225 55146 -192119 -108263 285047 193213 -66166 -131571 -59419 40402
10868 451037 104076 -10677 84814 -241091 -106422 -49470 -95417 281046 253652 -164322
10857 -197442 28425 -158795 103562 -63963 38527 157865 77619 -85648 235443 223455 95630
10845 -132431 -227774 126522 250562 -58845 -384570 -121987 92751 -267241 -52416 -19994
10834 -17803 82657 -105902 -274534 43384 190296 202969 -209615 -26944 -169690 -193385 -158282
10823 -158282 799 -256506 -150794 -4880 35943 261192 -152848 76035 264970 -84367 -128877
10812 -128877 -123568 13554 -16899 -98505 43637 -300321 -67589 -31954 -433994 37020 254812
10801 254812 66959 -72314 110009 -126253 -78699 115341 -181754 70811 -170295 224210
10790 -182068 37775 -104494 -17857 121122 82466 -148773 -165944 -145978 304578 -28436 -129990
10779 -129990 269293 169109 -16719 -175103 -338569 -230054 -231493 113523 17509 -155962
10768 -202014 77083 -247300 -62947 54645 -265436 -320749 27454 59559 -69966 -187077 -49570
10756 -70502 -335447 -330359 5894 -118447 45441 -249958 -6652 51665 106798 92012 121215 -188788
10743 -38205 -336906 -196867 28818 122879 -302466 -44954 -26307 119751 -189256 -153819 -126877
10732 -126877 -84562 141123 176438 59963 -48688 51455 17861 -35663 53941 180266 126798
10721 126798 -260065 -192585 -256188 -200097 -37577 299608 -122670 5811 -151870 79737 60880
10710 60880 -2416 28523 -278037 -15487 294739 214545 117775 20636 168091 56540 -56579
10698 60540 -20389 16862 110057 97719 -147027 -171916 -367916 317034 -148778 217721 -71807
10686 -65538 162301 -27180 -210086 -212416 -52905 -95110 -344307 30417 -349241 54396 117375
10675 117375 38032 225967 -173483 -267982 19875 -48172 73603 -105160 -70873 305216 15227
10663 -334368 -257570 -259963 -8453 198160 -110695 -370118 68062 236683 75459 -179568 -290622
10652 -290622 -306648 -203191 -94327 -140109 140289 172536 89177 23774 162387 -296772 -73587
10640 -420543 -209518 -196295 -106145 -98736 -160386 -272901 -71335 261119 -60905 192224 -45848
10628 -221531 257668 -408100 -257701 117577 -195712 -206620 -103285 105218 -47566 -225645
10618 -225645 -106944 -244258 -65039 -141511 -30546 -33756 114209 250422 -85419 103444 -200274
10606 147939 -231936 -207016 -297634 19695 218945 123671 -57226 -120715 -7389 359075 39909
10594 -138388 91557 -116968 9588 28551 -274791 -113019 -146258 -12279 -27375 -59744 -304735
10583 -304735 145761 14294 138889 -52545 -263887 -186684 143039 -278171 -82159 -140808
10573 -140808 -96727 -157966 57916 -49064 -112613 14 18774 -290413 48566 -183521 50853 -90231
10560 -14072 -28434 -73375 139245 -142098 -63416 -37527 4817 71122 44062 -212186 -69342
10548 -194970 34795 119823 -149362 303815 165336 156644 50246 -98091 -132309 75898 44255
10537 44255 -255799 -303083 -157469 -327442 -125733 -180354 -72843 -279824 -257054 -159082 -111242
10526 -111242 -174253 -64061 17621 -233708 -139173 -458105 -346883 -84335 193815 84351 -7056
10514 18635 -171611 53845 22131 -188079 181736 182006 115991 137136 16965 -59580 102298
10502 131153 -168568 -154354 -90734 -107199 233243 -73387 25049 51355 137318 10993 -25779
10490 -91071 152990 104976 257789 14303 -41808 53026 214481 -150451 472946 416339 191725
10478 355410 299599 84880 327271 -59913 68097 180761 204902 -339779 6349 274769 -27665
10466 233419 -51233 -88478 118581 91427 196153 -106972 150266 3622 27019 129664 -60449
10454 191064 -277266 -137913 -53432 76618 -166594 -30844 -128498 -448708 8395 24656 -230439
10442 15051 71922 -23853 216670 -155451 119383 119675 -122466 -134890 35568 -90242 48283
10430 104914 -283342 -154807 69833 16281 -1568 140840 -117493 -431273 -181492 120693
10419 182270 -126841 -103524 -100800 -264415 -104895 -279323 365252 202125 -148071 -70269
10408 -110207 206166 -62766 -144274 -351743 120519 20645 -81405 44474 -263240 -145510
10398 -145510 -79350 143012 -255430 -49122 460789 -43229 377773 -168940 -111611 -107969 42152
10386 -146431 162712 -112321 -62814 -22286 -157288 19919 -84997 317900 117032 300376
10376 300376 190857 -184817 28968 516205 518795 395792 146121 484532 280256 366783
10366 366783 192360 163411 441819 298131 216955 217569 368943 298978 301639 -102095 -89401
10355 -89401 -21081 236145 196797 597278 706210 82545 460845 243979 534198 323038
10345 323038 201981 399840 490138 207570 301888 -76094 162826 216137 175415 233168 225440
10334 225440 41518 10115 231634 82026 128251 -142741 284273 114588 -73472 273965
10323 -157099 -149849 185852 264051 604975 255748 1679 68474 -247754 143209 115690 242022
10312 242022 -129305 200923 -145346 -142587 -56358 -30895 300101 58914 -117508 -1022 73530
10300 -113665 94549 -441515 209792 76542 26900 -237951 192232 -139557 36508 -41138
10289 252647 56462 56160 3352 -130398 261964 -18167 -94836 -40120 -37730 -236199 4488 139314
10277 139314 150118 19569 -87384 23159 137062 -95973 225596 9371 -300 138354 41857
10265 -36454 227546 254263 -69232 194099 397906 87211 471763 181184 153098 30602 168738
10254 168738 290702 -27730 -133782 -9999 57567 31099 -96117 20187 -230004 -60774 84783
10242 81957 -16806 38754 -233919 -114513 99199 -79756 -203625 -44363 21058 -14422 -51102
10231 -51102 -10517 97857 29400 -211019 112293 119068 -210550 88252 -204601 185413 -29272
10219 2277 -244684 -152705 -16810 -194335 -87324 37534 -75488 -256488 270017 81975 -407618
10207 -116876 -228980 -265280 -150823 251834 -104230 -201460 -135177 84706 147516 -129227
10196 -25225 -57059 -133846 -208903 -16581 -307484 -87954 234503 188622 -262064 -411039 -381576
10185 -381576 -221885 14062 11015 28530 4414 -110377 -158791 76241 -13658 -84699 -121756
10174 -121756 -100888 -130127 259068 -120159 -148962 -264312 229265 -139987 -88227 -67108
10164 -67108 -86244 63953 -75215 -414849 114425 -117823 -400432 -189107 175781 9745 191126
10153 191126 -13090 -86552 241860 -30198 215397 106275 -252553 183167 -99358 -101884 167935
10141 -226495 -57110 130640 -285152 -256402 -143806 -47189 61331 -100333 -200137 -292737 -266277
10130 -266277 36090 216030 -130874 -233724 180091 -33011 -96407 -208871 33768 134633
10120 134633 1304 -82160 93741 191740 -512399 -76808 -58071 -101751 -197137 -220230 -75713
10108 -9669 99483 -18514 30180 -66304 237690 -46040 53815 -230416 68638 -41528 416017
10096 52324 60622 143867 -482295 88765 -101721 -74052 -168831 101449 134694 -274685 -33338
10084 -6048 -154203 260324 -34449 -133981 3688 -254602 20965 -224842 97553 -83297 117247
10072 249218 -96716 -282126 -232931 -170323 56557 162337 -166594 -193740 -85243 114304 8195
10060 -51688 -117299 -204795 -106858 -186028 218022 -137056 -79532 141914 263571 -143321 21412
10048 -308404 106737 121591 -171843 86826 -4391 -56513 -386400 17232 -67634 -31034 -60687
10037 -60687 51304 282540 -14083 29780 83077 100882 -365812 125380 -161401 290586 142463
10025 -168224 -249980 -61979 77496 -95799 -178738 -169918 -132904 200930 213294 -115118 87312
10013 -71624 -73203 -35801 85588 47382 -120227 128254 -167383 -253228 305586 -380850 -269892
10002 -269892 -172399 141979 -162106 -327217 60966 246947 -6119 65880 -76751 292748 -34895
9990 -53689 24829 -242286 -484220 263872 51738 -308325 -30378 1149 -323359 -43086 298152
9978 -71596 134764 -5670 -46690 -48571 18135 -227000 35017 -31842 46239 -232068 -305207 -121237
9965 -382560 71355 -198080 -229601 -338110 -5694 -235360 -490862 -324515 -91789 -524357 19852
9953 -141475 -276753 -191267 -237252 59155 -27125 48000 79429 -88033 89393 -190296 -114267
9942 -114267 -260978 -340120 -53821 154673 139972 -94447 -186837 -48329 185663 -85761 -32593
9930 -465277 -77794 -194756 -260028 330851 173949 54049 -261308 -204137 -290084 -142209 -194331
9919 -194331 -390620 -62691 -98485 -189717 -74177 75599 -262239 -304459 67378 -121058 -157238
9908 -157238 -150513 -283844 79410 -398139 -180677 138313 -18483 -25827 -11115 178000 211414
9897 211414 -171075 -31511 -33135 37997 -162453 -89388 -315076 298113 -309776 92488 -287898
9885 16220 -76824 147169 -185088 -147691 -27199 -308140 -171545 -335096 -361065 -289329 -130652
9873 -81276 150286 -25177 -225512 -47822 -460479 -71569 18009 22535 -447939 151920 14433
9861 -459726 4406 -139132 115020 -82583 -256218 -44686 -79364 182367 -180609 80130 -267183
9849 -142515 16151 -121945 -153488 57352 -5743 40939 26881 -100321 90904 -98004 -156109
9838 -156109 -23134 42212 -168538 -320605 403068 -299616 -119575 -105266 52868 159724
9828 159724 114 163933 19897 6191 198 101862 186435 -211508 134935 -499882 91465 -130127
9815 -482890 -112822 -266973 107904 -143407 6863 -86007 -2923 -20942 -83582 -76170 -79941 -314032
9803 -314032 -321238 -272586 193557 -126060 -123782 -5446 4869 38490 -107419 -301461 -36598 75090
9790 -10235 -108439 -54588 -278950 -38313 -67592 -254749 198812 -204284 -80160 -158000 -197440
9779 -197440 -206220 177320 -2117 348129 1423 -121399 318264 191131 176892 -22350 -110089
9768 -110089 -127651 24527 -112039 21680 -328319 279280 263129 -72863 -42154 -284855 -83687
9756 -134820 41218 -134341 -311430 24344 1541 -139566 -391235 -97478 39548 -113806 74079
9744 60949 -59664 -185610 -129973 -151979 -211885 -448222 140204 -17796 28085 219310 -237096
9732 -188685 75957 -231350 -172926 -235177 148638 -165480 -64760 -199333 48592 -100628 398332
9720 -70437 -20316 -51955 -89208 -150239 -271577 -199101 8860 -232456 -67743 -211775 -274035
9709 -274035 -186206 -305713 34168 -318350 -205210 -151701 295595 -299587 -169013 298805
9698 -92225 -175538 14841 -185442 -133290 41140 -192116 243811 -325146 -217526 -49798 11010
9686 -209765 -116737 288421 -158548 144912 -296942 -305097 -76297 -111424 -113735 -18544 -141630
9675 -141630 -223193 -192705 -144 -29034 127386 129100 -43229 7839 -304095 -293074 398367 13259
9662 -203854 73010 -149724 85387 -31370 173086 85427 -228743 178587 80038 4694 -69408
9650 87346 130462 59564 -267770 -12666 -128079 -62956 958 -73982 -185608 -152886 129961
9638 -206512 -193531 -74080 -90323 -94231 -289094 19031 -199214 -31864 -24558 -76091 -204031
9627 -204031 -215813 -353109 3330 -207100 18357 366182 -108216 -217341 -59794 164957 -104359
9615 -169925 -216422 -171758 32387 -119790 -154376 45253 -46814 -80400 -138567 -166434 -444307
9604 -444307 161397 -233824 117209 2277 -3269 99785 -53711 99767 -393438 -281166 -40456
9592 -142126 255088 -156412 -136136 -321761 -14701 -280283 -196180 86909 -172424 -16082 -165190
9581 -165190 -124273 -62739 146008 172014 -349883 -215350 -37419 -129354 -95597 130777 -311840
9569 78681 292113 88236 -109539 -103301 -277723 147522 -217543 124524 -95297 52750 -182011
9557 9739 147128 66154 -237263 -168876 -75588 39288 174909 -163995 55826 27266 -12767
9545 36063 111868 -22937 -304431 116098 -332522 -72144 111035 -176256 -213185 -185319 -162675
9534 -162675 -319212 -126923 -74275 114081 -78907 -36848 -178923 116262 1673 -253445 -291000
9523 -291000 -141754 -187289 15019 -298031 223499 -98810 -344413 -124018 -2612 8228 17612
9512 17612 199882 174519 -33412 -209789 -66971 -35112 -95520 -286051 54277 25282 -193117
9500 -118572 33710 306603 -283871 -290851 171706 -174283 92550 -80742 -237558 24198 -71194
9488 -285572 -310736 -248468 14089 32222 -160450 -66426 -95828 233207 24967 -137636 -136825
9477 -136825 192446 -70849 -60581 -281882 -10212 -380774 114178 -488894 33421 70643 -100776
9465 87549 -192724 -372605 -7041 -37963 -19298 63807 -237564 218353 185007 75515 -153635
9453 -81498 -105615 -150795 -128796 91986 -146720 -338176 -286914 168474 108284 65185 -84308
9441 145058 112054 18073 -343297 -187612 -28855 -179014 -287073 -43502 -131959 78889 22006
9429 -67466 -83504 33891 -298893 -47705 36782 154799 -18842 -123995 -250765 -64091 -68448
9418 -68448 12261 99720 30094 221666 26883 141290 -445117 6270 7935 -362227 144831
9406 -93233 -62297 36085 -95344 -238176 215460 42283 -324669 70079 -216240 -154724 -7257
9394 -145836 5142 -59473 -44340 -410741 -98879 -14549 -199140 -72593 91833 54142 -377838
9382 -203288 36720 53094 233757 151360 -289368 81799 -83060 -189488 -177486 -295420 -146742
9370 175560 -2070 -270737 -43213 -305126 -260465 -47573 124249 -213009 -2957 -185516 -187182
9359 -187182 -111381 -121822 -401543 59266 146345 80775 -259512 -429899 -197137 -293494 57822
9347 348167 -8832 71848 -11144 -8545 -78413 69909 4803 -7975 -182797 -28767 -327221 374893
9334 51693 -155370 89034 8806 -335807 53402 18557 314104 -60394 -15094 -305451 87800
9322 129406 442908 -126022 -497640 -376377 -69244 -157780 371167 -26662 -73252 -53680 -33709
9311 -33709 183973 -36438 169655 77059 -237291 211633 5598 28998 229188 11150 -204455
9299 115011 30977 14162 -28026 -24792 -211273 -161856 152404 72803 60026 -190568 -941 -282591
9287 -282591 62975 -61935 103723 5750 -98960 -84706 -217717 118933 -133684 6726 -46956
9275 -297596 142163 -78326 -40327 41023 -262048 -110046 88041 -84293 281342 -88227 200660
9263 -267308 81219 47327 37574 -41337 24999 -226175 221180 246805 -124303 147155 -178015
9251 -88219 84168 -34617 -245058 310136 -99732 -357597 -28114 99688 -371784 83741 8577
9239 -161856 294019 -5287 -281712 -99715 -196398 -209588 -74460 -163623 -555473 -340802 85379
9227 -86896 -48184 262872 -24895 23116 -83690 263642 234107 -209193 -127186 -82053 71522
9215 -105913 154070 256371 -195192 -162772 -77753 -277495 -157282 -96932 -27219 65233 34591
9204 34591 80353 -51146 -165837 59475 -385646 -118952 -96666 -105297 45493 245788 -356321
9192 120 294544 -75432 -240332 67470 -332109 -200073 49082 -119467 221567 -243048 230499
9180 75250 -151995 -11827 -238748 90804 20232 -18664 -210592 149331 -298396 -27223 140487
9168 121144 396860 -32127 -275145 -180905 -255130 -98164 -19255 124279 157424 84680 -204983
9156 16918 63460 3356 -143339 -7685 -108740 -231287 -112959 -202974 -220552 -20670 -224301
9145 -224301 -69424 -261526 -34816 -208530 -155139 53544 -108243 -88551 -115607 8484 -505509
9133 -243819 186608 52912 -281623 -232299 -46368 93394 -196733 -132536 9714 368519 227353
9122 227353 74821 -330471 -211410 89524 13051 -169777 82199 -102520 50680 -97718 224814
9110 -274970 248972 -79825 -305503 -410608 106039 70453 -180766 -64131 -129825 -215241 -94968
9098 104735 -105257 -37850 -49797 122620 144968 -523 34009 64466 25363 -285916 250545
9086 -203663 -350953 40756 34597 16253 252004 111085 -255619 60956 -223180 10079 -166336
9074 -20655 147415 -9511 146640 89492 189959 26519 -3704 -351056 -157779 20576 71221
9063 71221 -325991 -160469 157597 -74955 126662 236037 -98051 259431 -312047 -85687
9052 139504 17577 270303 -165792 160877 -84486 32202 -220443 -238353 -68171 -437482 -286109
9041 -286109 191 103896 -324350 -213083 -240618 149002 -293987 -61957 34043 45651 -68274
9029 18803 -82697 37091 -48602 111290 -294029 158126 19094 93544 -334303 153835 -11196
9017 -361300 -97500 -333456 119433 45294 -134340 175960 -82303 40891 112683 -31997 86758
9005 89972 -179482 208265 14873 -70873 240859 227480 155788 -94158 -44047 -89868 -305168
8994 -305168 -334032 15571 -49584 -99307 -274432 18349 161566 133049 14893 279206 -218288
8982 -73345 242347 111162 93956 -200163 -104297 -35896 325167 -253137 -23590 29083 -270922
8970 120622 -285172 64561 297532 -20284 -141682 -215531 -105356 162446 -168383 248431
8959 321029 -92193 -102480 -132280 -202299 -161868 -177642 -91831 -123436 21385 -129565 97364
8947 -74761 2960 -65006 -240435 -40503 -135430 -176130 183987 248632 -27115 62864 279988
8936 279988 280589 480743 123317 279034 134198 280869 367715 53292 315711 284754 571168
8925 571168 761939 1281327 2589694 6014611 8389326 3579560 1737651 805048 795805
8916 795805 387292 447246 -23137 -2927 37428 283494 293971 406285 311359 117801 10312
8904 125584 3572 -69486 -88119 -134466 193478 206625 114860 5001 -211075 -189092 -107408 -56071
8892 -56071 -158889 224407 -150530 -63309 -324174 29263 18110 -125097 -2922 -108781 100483
8880 -149980 419996 75444 -258460 221560 -2466 63250 65523 250392 -78305 190225 -237293
8868 -73935 206784 3710 226059 11392 100245 113009 137661 -5809 23251 -20872 175157 -160403
8855 305934 -326185 139293 -234344 -114294 29536 107328 -23206 -16545 -22384 151023 -77170
8843 110378 -105228 -115100 50044 -81110 128652 106221 849 -27954 -184153 15074 -313509
8831 -109790 100402 -379523 -80363 40207 -163249 47809 -62807 -194817 49415 -62403 -179182
8820 -179182 114368 23601 -172774 -261058 10008 -131663 26105 -168941 -83480 130457 -15755
8808 -124398 262897 84547 44602 -103364 62351 -304437 -90919 347561 53370 -154937 220860
8796 -71810 25323 111904 -294183 245150 159653 -207222 -83741 -110193 -386122 170594 -69604
8784 -151100 -222791 -139883 -104530 9426 27125 98603 -242427 -131991 -403894 -174325 -206246
8773 -206246 116491 460645 49800 -131710 -94832 -37506 -119476 -123814 -395697 -373030 -69338
8761 -53169 26207 -197662 -156771 -206615 -321286 -73577 132955 52280 -315150 120696 17748
8749 -47605 -153376 69498 -187925 192491 -991 -5251 86917 -166252 -113085 -68059 -249580
8738 -249580 31347 -43110 43516 -77211 125619 247199 -16789 154777 -62336 46949 -372041
8726 -187246 -73620 -84097 49955 -176684 188374 -13045 243354 -1397 -132592 -41174 126070
8714 -260257 -7207 -213612 -118147 105765 -129452 21519 55763 -65160 -145003 -223894 -40580
8702 193397 39441 100511 111097 163200 -219848 307681 177178 57272 22926 2084 -156165
8690 96847 82718 -79840 -115246 -57010 -554134 108715 -271020 -133247 -239881 132252 -256843
8678 86688 -479550 -107634 -239236 -75773 -33779 9626 -4470 -211078 -181986 -167712 -35853
8666 -194974 -53060 6156 -100877 107515 137431 -96163 29962 52801 -227785 -353815 -157950
8654 -32297 -182760 54112 -91368 -64350 71948 131772 -85664 82033 235882 -191100 81442
8642 -163445 -186005 -308265 -149716 -363725 -16018 -318098 -249447 188582 67260 -17459 -19397
8631 -19397 46382 223401 43234 -5182 217499 -146883 39709 112226 -106269 168983 -35115
8619 -103310 102321 -58766 563 -343245 -159439 -32585 -123778 -156281 157930 26888 -186037
8607 155951 -217552 267684 -253662 -215932 41818 -55762 153736 151674 33820 -79159 -286522
8596 -286522 -98924 -125307 107717 126563 87196 309910 -94064 -55579 283984 -49693 184507
8584 -54750 57072 56782 -172017 -24168 -206222 127302 -183395 -376243 -102664 -48973 73183
8572 -37660 18937 19596 -130069 -500 330760 70331 15604 11260 195239 -28699 -37383 -254508
8560 -254508 58072 -248519 16770 -115610 -38514 -45252 180056 -12625 -166331 -322284 -255208
8549 -255208 90786 -53341 158654 -187119 -199704 -407337 280391 -102642 -156827 51538 -97890
8537 -115363 -140598 82668 -76884 -22704 -150999 -27103 -93120 132782 154653 -87882 211319
8525 -85196 -134733 -168815 65101 -67613 54363 -25750 257810 142688 52002 -77780 -290537
8514 -290537 129236 264938 37483 112142 -75838 -140481 -126079 -20748 -142233 -164413 -207755
8503 -207755 -67758 -8754 198969 24457 96840 104264 -23817 -54479 246460 -15098 146096
8491 -236780 114402 -5111 -104056 66570 4577 -214718 108169 70594 189749 -122789 -94186
8480 -94186 22194 238855 113197 -55879 -287309 237355 86230 -28477 -20485 -141090 -224346
8469 -224346 -189235 -273341 252759 -122170 65966 -39459 -122614 119279 -258676 -74906 -248263
8458 -248263 -185696 -148889 91634 -15839 -239064 -138616 -171689 -66847 35208 259882 -132530
8446 50641 37884 163286 19781 -103249 112859 -237791 250238 -168641 -263221 160794
8435 -198309 -402223 -16613 -81610 69133 -182658 -224051 -162238 86516 -300642 -4175 94075
8423 -226116 -90868 -30537 -49667 -454808 -79920 -158004 199656 152779 -271144 -90073 -56429
8412 -56429 -563085 212838 136663 -68119 -131885 -207408 -56641 26917 -94311 -151443 -76929
8401 -76929 -285933 -54931 19265 67360 -177949 -265659 101770 -318710 60203 37363 30767
8390 30767 -279235 -446424 -10403 -139052 -147476 -123057 -131957 17408 161842 -8006 -399330
8379 -399330 -121129 -73499 15227 315278 -52232 54648 -244104 104788 -23689 75666 -171779
8367 -99326 -172009 -149111 12551 -76270 -117167 -19636 156559 129036 -144272 -215657 -36171
8355 -215659 38474 519474 -363600 124890 -150526 173909 205674 -185873 195019 -266129
8344 -26176 -50355 -198140 -33155 -109924 57765 -111358 -25573 -259318 -44026 -114619 -68503
8333 -68503 83152 -54752 -18410 123262 36205 -35719 76260 90970 -235918 -2892 -510087
8322 -510087 -126843 -105322 -185360 -159509 -97736 68673 -210816 54874 -48947 153577 -33973
8310 -292686 -469404 -122985 -293468 -351263 98852 -47359 108697 45309 -5378 76123 6776
8298 -197918 -76079 -101490 71618 89251 -77524 -247855 367274 -291791 -189226 59084 -240851
8286 -115026 230845 -180358 68921 -251674 122783 34075 -56770 -82610 -169805 -21406 -200805
8275 -200805 -89533 -169092 331486 103240 20034 -160354 -116734 26840 -179018 4743 42622
8264 42622 -277031 84874 -22817 -124466 -63850 -33539 39191 -14307 -174784 97562 24022
8252 113907 -5270 -158486 42411 -168534 -121541 -112187 59257 -120390 166927 -257906 70798
8240 105702 -24421 -195218 78525 228945 -424296 90555 -10231 -96877 164901 -370543 -358949
8229 -358949 109080 -236859 -389727 -498501 -259501 87016 232514 -159989 37954 -391330
8218 -149876 27175 255522 -105768 -383687 -22287 -207297 -125524 -158827 -38807 464578 20932
8206 -32867 -117251 -235678 -438486 -266885 -21665 -154066 65461 171227 -306984 125309
8195 39507 82190 -259285 -222403 -119607 18407 -83824 26048 -36936 -1862 32571 -150288
8183 -19182 247137 36024 12895 62675 -113103 -232280 -55496 127376 49708 -99920 -299011
8172 -299011 -34339 8509 125038 -468915 85994 16338 -91850 -190985 -2952 112688 172849
8161 172849 -173454 -116581 97560 -74164 -159865 -184840 -366483 -360220 198457 129274 -41905
8149 62467 -265656 -143210 104009 104959 15386 -107038 -375390 -330476 150234 -238318 20889
8137 -121631 -58572 3205 53693 -165672 117545 51702 -5460 -80349 -768 -201824 -148420 272727
8124 -175933 16477 -226082 -35675 20262 297135 280823 -33572 -5250 -43309 -52884 -152578 6393
8111 77447 -28348 13513 -17250 66793 -260146 -190482 226163 -106386 -156526 -197671 270713
8099 -189984 -364737 -43881 -192642 246675 132326 -40696 -176878 87255 320081 -3899 237037
8087 -44151 -402897 130250 -213241 28011 -582210 55377 -183386 178802 -41985 -102557 87003
8075 -62805 -135440 -294957 114473 -267837 295926 92983 123240 -192425 89155 173549 240710
8064 240710 205090 -18161 315610 46207 219359 -229577 -163912 79482 -154449 -69821 -31956
8052 281128 -194689 134966 111158 208789 179143 223120 -23218 143365 -180758 -97853 -114
8040 -109570 13974 -48641 -124790 -26569 -80964 31757 105808 50099 -159032 -238139 -141151
8029 -141151 -319571 79310 155752 45864 200290 67414 36583 -356382 -207229 78862 -127548
8017 -59171 -138605 -210672 122162 -49656 56195 81916 81372 -165697 46633 -205206 19274 -68380
8004 -43678 -94419 -39700 -161974 7113 96623 49167 -118223 180395 -60241 -266734 52006
7992 -37556 81724 317739 77188 22148 95359 -170949 24092 -186164 -126480 105110 -51578
7980 5531 120974 45030 -222354 -112652 104227 -138946 122746 206782 8454 -194344 52354
7968 -131175 -5595 -219277 -132243 -117122 -85196 -36169 92880 -246447 -255238 47120 -60617 -38900
7956 -38900 190144 -54060 -254330 -154297 134109 -103654 -178398 -164842 -263653 47268 -111418
7944 -100854 -19423 -42489 39930 -166362 -153992 42888 -226403 -39493 -222315 -205177 110694
7932 138626 165969 207069 -65924 -370988 41419 24793 109395 248966 288195 -338453 64355
7920 -8510 -54826 -318102 -183668 49815 1010 -225489 -82416 92615 -165471 -149742 -157767 208664
7907 -287382 -137090 -159290 -80330 -368824 182286 -129378 140599 173598 88957 -113547
7896 -107332 116636 135914 -20206 -17012 -111154 -186190 -17196 -144588 -284708 -143859 -25141
7884 -82803 -199967 -142706 278721 -108752 -68685 -53010 50029 71303 128937 63879 -99232
7872 -165950 -244414 -89923 269698 -126578 -244474 -33038 -79904 146220 -7618 -58971 -45410
7861 -45410 -158535 218346 -154517 -275665 -17806 -264073 45862 29232 -55041 -42450 -75372
7850 -75372 -246520 17757 44450 -319484 213552 122159 772 -202182 114194 -108386 -115501
7839 -115501 82530 44070 -70051 -9468 -116158 -346248 -76882 6242 -118889 194598 -176359
7827 -72390 23066 230163 -26769 40877 210633 -139571 -34532 26002 328812 -255789 -59917
7815 8202 -245190 -202975 -235 -181443 5825 25661 189510 -13788 129107 168811 105594 124849
7803 124849 -287830 105905 164334 214437 -12246 -53518 -58079 -91509 -228409 48295 -221357
7791 168958 -116329 -72569 -84408 -118573 -48756 -69667 191195 65756 115177 211113 33050
7779 -77837 -77613 246850 -267330 -679386 113708 -14946 49147 6020 -111703 -13288 -223233
7768 -223233 -137423 -140051 -517489 -192046 -56741 237959 -30837 -102825 210269 78618 45553
7757 45553 -36854 217069 79957 252243 77126 -169554 125975 -339492 -44792 -168770 84193
7745 -66863 -103630 44049 -175587 -41500 -104916 -125935 -70104 -71655 77768 221120 -99814 28645
7732 -2223 -27433 -6259 -162329 80639 187075 -107450 251175 192194 -185489 -159338 -235449
7721 -235449 -92908 134940 -48334 30564 353994 -162410 84170 365930 -525906 -131913
7710 235639 -33748 129233 -107113 205410 -52671 -164232 -112358 150520 -20220 -18914 447328
7698 103892 -57366 -35970 242920 -204846 -6681 293955 -96832 -181380 -208531 -137838 -159804
7687 -159804 -210699 -38752 -155709 86875 72079 -97431 -342591 -16645 -483363 -227052 137786
7675 -260029 -360819 -241527 -29064 83275 -202018 -80402 -177596 2443 59481 -67370 -183229
7664 -183229 31418 -79075 231823 -20722 244064 240320 -24105 -235928 -162933 143941 -178146
7652 -31556 -107125 -146804 -360196 72264 264741 -253558 -127787 52259 -103246 33279 115657
7641 115657 225650 -383428 -163421 -37602 -84191 -26528 -356524 1539 -44017 171583 -124041
7629 60040 -442364 155309 117785 198883 249827 213937 204207 114364 -133813 -195333 106316
7617 -348005 -194910 111993 79468 -308344 -439478 241226 -27615 -166890 26904 138168
7607 138168 134809 -237060 53962 -64823 -92138 -249260 -88467 -85104 131398 63153 -428769
7595 257851 78896 -11101 -22252 -115254 -143569 423065 -180473 197513 -43824 75755 -261739
7583 -142259 -382248 34121 -326105 245947 -209168 -1295 -21408 110873 -66234 65351 -139891
7571 5514 -289391 58721 -327440 56374 208469 -123247 331001 -248924 61321 -246222 -62942
7559 57662 5989 211583 -151554 249930 -11079 -260827 -94829 -260831 -181469 4863 -83069
7547 18229 107144 89143 190462 103983 -27673 54716 -238493 -89990 173607 -399630 -179484
7535 -19912 -302218 -164751 -99632 -50863 197052 -109804 116003 -14346 -48219 -315325 65455
7523 374419 -106842 207598 -368642 -293334 -39534 -176806 -66354 -151384 153470 -281099
7512 69296 -229084 -332210 -270949 91590 -115011 -243615 183594 74281 -5776 -25420 117744
7500 -196259 11626 167896 102874 -407037 -135175 -584417 -32733 270642 -111234 160089
7489 142466 -238759 54012 85448 -103768 -255537 -118708 238982 16148 116099 -233104
7478 -102485 269013 -8841 169740 -8549 -265419 26284 -130419 -68934 -95787 -68910 -112688
7467 -112688 78517 99061 189519 160781 -15727 -450982 30111 -245123 -436952 -318937 -68993
7455 -365147 18142 194741 14936 -206282 -169014 -224978 79332 46548 61115 -41138 -253444
7444 -253444 -37493 -317414 -181616 -94368 -203565 106515 -357239 -67666 29093 -14461 -71425
7433 -71425 7504 -35534 196423 -100617 -114496 -172223 157126 -299066 -95215 -54546 -39491
7422 -39491 -191537 -65601 -47733 -127693 -76040 -13821 3462 228574 68608 -198873 -77575
7410 -139165 -83783 -420485 -133969 178528 169429 7915 173800 95095 19433 -86577 -135168
7399 -135168 169302 -47501 -68764 41253 59981 107873 128354 19195 -47402 -206547 16007
7387 189993 223179 20684 43424 60756 -70879 -6560 -224345 -63833 -248796 -268225 -20142
7375 148396 -148107 100963 140757 -118540 -101967 146248 -20609 -138058 95933 135301 -303696
7363 18689 -238767 277637 -216542 -65690 254762 174799 -797 -23628 58939 86485 47746
7352 47746 -14592 116215 -207700 -52885 -38204 -213753 88575 -87410 -259543 -214753 -283905
7341 -283905 -54164 -203144 55580 41341 66122 3049 -258248 -224545 -190644 -143301 -80592
7330 -80592 -21684 -291266 208504 -194787 -129664 -124568 217372 -214938 79258 350275 -32103
7318 180406 -31324 -41921 -82062 54187 284861 231567 130021 -240530 -58299 119705 -64218
7306 -20652 276762 -71139 186163 -194512 200177 -243031 -167872 507565 334704 -33257
7295 -98876 -236356 -86483 55966 235674 299467 -424128 -113190 -143403 -120165 -120272 32299
7283 -180908 -272320 -5723 -41352 -93128 78198 116329 241672 295055 -62477 132131 252421
7272 252421 62668 -192819 196089 -49683 -127483 -60919 -141792 -145987 6028 -22985 -272631
7261 -272631 -150099 -174328 -198620 -121474 179653 -256974 -248203 87367 -31062 217598 50027
7249 -62087 37594 13185 -31970 127178 198492 16068 205959 -39799 -55774 -185430 267144
7237 -267090 -124190 229946 233546 -54445 -88570 -91718 -117007 -151257 -146225 -207601 48984 37102
7225 37102 -80294 16869 -17767 -353882 -82911 -36367 75794 -134952 -7882 375823 39116
7213 -140914 193086 27690 171342 91605 19456 -377878 21422 -116547 62286 -318301 -102092
7201 -62972 62339 185629 417150 346195 15674 -275661 63356 -316854 -434885 130999 -82547
7189 412916 -29764 -222180 -347050 -36131 176946 -113180 -106921 -113979 -109062 -146492 74749
7177 -57033 -104855 -122999 -57993 -172259 -52540 -110223 -32054 -262692 -87731 -95433 -84668 428095
7164 -116698 168802 -18653 152332 68133 -52389 -90107 -311080 -74181 88092 -199834 61337
7152 73205 19838 72963 -28479 -62565 -516044 -175383 -68935 39247 214369 -479878 75156
7140 -104684 -89345 -10876 242604 -130007 -29921 230630 -116305 -343828 223404 -37189
7129 -393789 -96083 -176507 184330 100297 -54125 27657 189714 194808 123701 7245 -39113 -160779
7117 -160779 -30108 74890 120167 228950 -212882 -71968 -135598 -54976 -38273 -52790 52898
7105 79487 -173248 -316042 -245935 -301868 -64871 -25212 -261585 44639 -175892 483585 96813
7093 -143139 -97970 88785 -357230 -257353 -95885 127713 -61528 -391961 68690 -267470 11154
7081 156368 -116832 94464 -156775 -367231 -319721 -61115 -97844 -562137 416627 221511
7071 221511 -78775 -160908 141978 -29158 -48816 -84790 -58240 -53067 -177019 -31565 131274
7059 -167515 -49712 10071 -287503 376078 -380172 270951 64283 -214199 -418977 -260041
7049 -260041 -65565 -215369 -22804 -81629 -455273 -36575 -155651 -79850 -41261 81468 13670
7037 -307382 -81297 252129 32191 -17975 47086 -192726 -74251 96778 285405 93874 125495
7026 125495 -126125 -12238 -289847 263557 -35878 -19056 -186702 106499 79767 -121217
7015 -291402 13821 -41593 147828 52585 14659 -189991 53134 -65904 56220 -310397 311510
7003 288157 293143 2540 -198967 45309 -176567 -8321 5335 210553 327479 -223827 -99189
6991 197758 -5859 148541 29930 -43490 85603 -23752 237692 -44326 103677 -20607 -171592
6980 -171592 -118927 -268518 -87415 -258626 167158 101952 245322 50798 210543 -64880 158215
6968 -64545 -476 -116147 -71866 -97001 30030 187730 281679 9462 149188 -331570 64952 125308
6956 125308 -36553 159292 -186346 -76233 116448 48907 -222015 -90608 7856 -109209 -140968
6945 -140968 -82487 68334 -211742 -301440 -201880 6632 -65776 100371 -254803 6799 -196505
6933 63762 -177586 -78821 -260285 -499301 227970 -113225 -48393 -55561 183096 -186555 -30665
6921 178796 -60827 -174123 -88475 -254555 -163980 325266 20111 108945 -160376 -251815 -34835
6909 5443 -123386 -17690 -197357 218997 157529 70160 -103003 49016 -99069 -106262 -311447
6898 -311447 -97377 -166843 -59974 141780 -130297 306933 -36830 -187125 -16286 42071 200627
6887 200627 -235037 -191055 -109374 80975 -5531 70299 79008 320685 177783 -171760 -50856
6875 -92010 -181407 -148915 -291629 5442 67467 -199152 218067 -126033 -291284 -59460 9820
6863 -61351 -116100 -293391 246808 -412809 80260 49322 -31735 -44505 149474 61367 -339705
6851 233225 -93151 -222705 -185097 7735 385410 160066 219892 265724 -143645 -116868 -14717
6839 75560 -107264 30617 -280748 -75782 -155986 156823 -38628 211451 21609 -104504 156036
6827 -22139 235943 158622 -375170 -274289 -71838 57322 -253563 -62620 114879 233050 79027
6815 335505 -12862 -58637 11877 -340408 -177284 -268959 -174704 -30455 -161792 -129015 258728
6803 -164975 32349 -33909 177493 83170 -312354 -235011 -20618 -162691 191310 128203 -20250
6791 51827 -32571 -40392 165962 135369 -183021 -281391 258235 -93458 -48516 109618 -145158
6779 136172 215609 4487 144974 -10352 255600 -177549 88798 -168923 -296785 -232426 -2318
6767 -210585 -6419 -94086 153063 304988 -208985 -173161 112938 11341 13686 44096 69354
6756 69354 -217031 181234 -133150 90981 97446 -391258 -150641 -83008 382607 -12372 -209028
6745 -209028 203156 -191802 157955 -248902 -159382 -107421 172498 213012 71194 49928 218712
6734 218712 -53326 -185788 -159278 37063 -239398 125806 51718 -38975 -99477 15975 -223423
6722 -180146 -205424 292503 -267966 -88812 19646 58082 -156698 -22594 -124426 19449 -154496
6710 113842 201916 -108157 5958 -74051 159506 10093 -117089 3453 -130149 -271083 198541
6698 336493 129770 200594 -23772 128421 228593 -55384 -39038 -68944 -49619 -312826 -373286
6687 -373286 -209622 -144479 -21561 206815 -53273 -22217 -54197 -13604 170941 146360 -145565
6675 -357312 61812 -431773 -26953 438801 -185841 185000 -85678 105585 -82940 -34660 -168818
6664 -168818 -61075 207101 -141337 193833 19790 230326 -18979 252297 41781 -182034
6653 23694 -32219 65920 -187889 134377 -116387 -60721 272292 -95558 -55195 235497 57797
6641 55500 -120968 311832 -126121 -154040 33249 336885 -212515 153670 -28229 53926 -145222
6629 13124 -18809 63376 2121 101887 196144 -6226 155806 -22916 99849 -174259 94720 41893
6616 112550 160480 55654 -170461 57137 300427 -188962 132493 95757 -183207 -139708 102477
6604 135124 -40829 10759 -191014 257893 -114735 -207593 -76786 -223496 -142607 295043 12871
6592 37019 155326 61946 68564 -350261 125287 55114 35351 175117 -222313 -296279 37043
6580 -51703 -108866 155176 60868 -6351 -84295 -465455 183894 258 -4933 34905 24088 -62564
6567 275916 1316 -84207 4968 -104848 244594 111693 96512 229104 184188 84553 116691
6556 116691 -190674 -134950 -166904 24748 -118327 -54333 120839 19530 -228418 -95348 -64045
6545 -64045 -14090 213352 -86824 193541 63660 250475 318909 -244722 -46904 96989 -235445
6533 -336015 -40091 -18046 285743 124650 -439749 23410 -265131 -262392 -227202 67364 20925
6521 202760 64555 -79319 232037 149050 290392 283552 259849 103919 52575 -1065 105871
6509 348613 -43466 58469 -126845 -78662 -28348 109755 110446 -190026 83290 -188731 -424288
6498 -424288 142035 163448 -307582 118460 -104888 -38772 -72113 76859 -23350 -144232 224286
6486 -28777 158208 -68728 -404257 -88257 75764 -181525 269759 -121172 -196555 180983 -99455
6474 190739 -222751 -42514 -374086 -157798 47652 -47203 179360 -86727 115855 -36611 195485
6462 -105938 4615 35041 69721 182796 -158663 6288 170895 -3718 -70994 -91637 -59882 205481
6449 -74931 81385 -226454 -11787 115370 -127475 163179 311350 -143051 50703 148959 219877
6438 219877 -242002 -120928 -28793 144796 225205 -129804 -190377 264318 62392 -45373 441120
6426 23632 141542 -71933 -36722 212510 38637 -10928 -213542 -131454 -63284 38952 -21722
6414 -188964 -17703 -262441 99198 -54171 155453 -64339 -82533 8095 -186131 71740 131373
6403 131373 110033 -90204 108423 -129919 -58811 171491 -297726 -274632 -53472 111105 221872
6392 221872 462942 -78723 182020 -144872 -134526 2416 101251 -103527 -1141 1584 -68936
6380 -24796 25859 -451064 -72761 21456 -1412 -100183 11513 -121068 -203343 220295 -117502
6368 126371 149712 83090 238395 -57271 -85015 -108026 25055 93989 -120142 128174 -36268
6356 -119003 -133656 -537 -20008 60634 181281 -123660 -96401 -66493 -164033 -78935 -13311 -235146
6344 -235146 79705 137023 -122595 -209880 -306785 -201550 -289341 51466 42259 86626 33883
6332 -140656 203802 117631 -3705 30046 -205494 298079 15794 198653 43569 92305 -227080
6320 -208420 -427803 181589 1592 -199786 -24651 -153316 -63365 -87736 -122462 -243680 -129512
6309 -129512 44927 233868 -262888 224673 -54806 402227 -153971 -106015 168344 24158
6298 -462426 216430 244990 358879 320579 290112 -43469 -80201 -68190 18372 -58328 -87834
6287 -87834 30284 -207732 26254 -339397 -10549 -216024 -356755 -178526 190323 -111864
6276 -84895 -22853 248201 -126851 -124700 61235 -213938 208772 145667 -34259 100705 96398
6265 96398 308432 124429 35993 -126880 157909 415413 95909 -137091 184570 -471804
6254 137591 29682 147586 175522 -386132 7298 -302672 -27575 -497511 -115410 254523 224515
6243 224515 61937 -142728 -111843 -109200 -69282 186921 101163 -163491 -41192 -101010 164845
6231 443609 65859 -235762 -44278 5112 -97669 365829 -118251 162579 -399844 22327 -12773
6219 374484 -168743 172903 77443 -189167 158537 -117848 28883 -2756 249856 228317 -231794
6207 -259473 92875 11939 -304864 -45339 228212 115154 -146444 -122071 -167753 102900 -374591
6195 -82037 -77425 -193493 93360 -412786 25437 -143912 146571 -108503 -284230 -133450 217291
6183 -24559 75630 -169781 -139138 -4071 -204677 24189 -10099 -256124 6508 -111742 133431
6171 -39419 -82529 -166505 95848 184791 119014 197675 66065 92999 220018 -486348 17306
6159 -155180 101496 16379 257407 -61674 44356 -330410 158857 227825 339063 -371041
6148 94116 238919 -69927 69734 281182 -92056 -34711 13636 -144890 210508 29006 62885
6137 62885 -16214 -163124 -209234 22731 -41329 174863 173771 32848 143919 114192 -57961
6125 346958 171997 92271 121265 226720 -95671 -4245 -131770 -213227 125516 233178 -241043
6113 -191634 -225137 -373160 -252393 160975 155171 -148841 297313 138021 -181852 -304 151400
6101 298179 -146440 -74896 81289 3350 -148175 -88547 113036 43868 -75046 -135150 -187301
6090 -187301 -238291 -133327 121924 16989 175582 -436500 107660 -59727 -216002 14587
6079 -8887 -272052 133074 -156762 -158665 1789 -55890 69900 -78246 -158330 289149 -167383
6067 -110683 99566 21350 -39131 201552 91197 -176735 -57827 -142345 187141 130165 314628
6056 314628 262216 -60698 -158482 -152395 -36477 -13978 -66867 224202 112364 56835 -290811
6044 -82379 -57368 -149194 -296631 33127 -13835 -183459 -60348 -20271 177325 255475 241428
6033 241428 -84388 203897 -349550 -170057 210348 222587 84386 340780 -319874 230209
6022 145536 165259 -39045 -48894 478212 -219740 -321691 162386 32140 84131 72358 -22046
6010 52514 -223703 45530 30719 -89844 -52143 124196 142072 191463 52013 -103238 105138
5998 -235064 136284 133844 299527 164027 823 -80065 174651 85222 -24538 -81865 -78511 -45368
5986 -45368 29442 -316430 -305411 -106863 144207 324814 165404 -136823 178415 -51246
5975 122384 230062 41676 181025 -105502 -117315 135770 27324 -92288 -230741 -15258 347699
5963 -133044 -9591 -13459 -95444 -99537 210395 -16160 -59206 21592 -4484 -4825 87195 243533
5951 243533 -199602 42843 150815 146187 7439 -85968 251365 -95551 -49389 -8163 32093 -121858
5938 -183685 -20116 36310 -282229 55295 -322117 -176479 -318553 -55789 -46829 -41675 77104
5926 -240973 -137999 205531 -175988 123444 12446 3523 -190534 120904 23497 65986 306012
5915 306012 -125186 -37539 -133683 139194 127852 -25888 108026 -60788 -221413 71848 398188
5904 398188 300061 -120771 -169573 26418 198676 -33340 32541 -332726 196322 287274 -285257
5892 -68288 -152732 -368124 250658 -78192 142010 -78712 -63034 78459 -250192 192353 99950
5881 99950 -68047 310478 26654 143553 188570 -268170 79260 144002 -33773 18685 64592
5870 64592 82127 117 76666 -74914 -590888 -336353 -29268 91985 250238 217466 -85556 -99331
5858 -99331 -51438 301775 188258 -247744 200423 -117902 -104889 -337731 -160448 -196975
5848 -196975 -65989 -204411 -37753 -16091 -226204 -124975 -113626 76932 44979 26504 31941
5837 31941 -263969 -208136 58768 -222167 -218466 -28786 10506 233769 -115694 75054 -17480
5825 9425 -90581 38888 16689 107974 -46862 95869 160492 -207447 -125557 11942 -86867 -82495
5813 -82495 -29424 -168822 -230166 63439 -122909 -88121 -35127 -59775 57054 98964 143419
5802 143419 47621 -55041 100227 96513 -26904 533710 -19025 21647 -23970 -159716 -13292
5790 279136 -320180 287729 258713 163283 122769 41380 235546 -97154 -150618 -100382 234672
5778 -25409 -450539 -16352 33767 207044 -75385 74090 -19864 -120236 20714 -176822 -32111
5766 -56178 -468716 59608 -188626 -78728 -203927 -14765 95148 -354146 -86639 -300225 43882
5754 -5930 -52115 106030 273158 -48673 -61092 54764 -129171 30893 -71055 96014 183350
5743 183350 118720 306138 57772 -21263 -150176 131440 161424 -82708 166162 -30758 -317913
5732 -317913 14568 67417 -303473 -104379 -158496 -54478 -125702 105921 -200259 41297 14502
5720 380421 -147236 -143780 -253354 54114 264262 243848 -121421 -1239 -164575 194678 136943
5709 136943 189431 250605 133308 -298603 260679 -62818 104273 283113 298251 169695
5699 169695 -390561 107571 11755 -125146 -161249 96425 183565 85093 321806 107835 261900
5688 261900 190966 157805 -136709 -155416 -44688 -74155 144576 3274 -99076 198132 114074
5677 114074 -222640 -237533 -70721 49759 -140422 -50956 -80842 139122 186362 -122595 30929
5665 40958 -147108 83434 12903 -187654 84163 -327770 82108 -164646 -7915 -29341 -11643
5653 66246 -227732 -171820 -69859 39900 56784 -112358 182570 140011 48939 -231247 -221408
5642 -221408 -80945 -130904 -96511 31634 -191020 54504 24732 2518 -85208 -121947 -55460 1637
5629 30341 430798 -113394 354977 -67767 209051 -404517 -29187 -10337 42995 206795 -289808
5617 -227407 75216 314598 39167 -47948 -319388 3926 32209 151050 -8879 163309 -182242
5605 -147315 202394 -40100 -38636 65744 -19081 9571 -129926 -248961 -137804 106467 -233523
5593 106302 -153382 156649 -127868 65774 24494 -207243 140306 207862 -190311 -9340 166351
5581 -207629 17221 -168459 -277416 6488 -327827 -135089 84995 -175425 -80206 92049 -206270
5569 -89129 -202361 -144124 -200610 139622 179996 172527 31803 106064 81054 225169 -191858
5557 -70159 -372880 14995 154294 -106298 -19009 -10087 54868 113092 117995 -123353 -207596
5546 -207596 32368 24357 -328319 -80467 -44329 -148557 -35952 -118581 62088 60071 88824 -264375
5533 51673 172431 73043 -42124 -147801 -23072 -241803 -278400 -150597 -40365 293874 45143
5521 -110859 181836 -73145 47893 -20263 -71722 139176 -136718 -174598 107709 -296229 119923
5509 26698 -107907 -5748 -146305 491159 359773 18479 116337 -86504 -46328 142083 62599
5497 -109065 -58668 -59584 98595 66140 313754 -151597 40944 -138191 100596 -223546 -93051
5485 -7385 -53087 -322574 339896 -252341 -298133 12775 22386 57435 298515 -200025 2399
5473 321854 -17421 8700 -75099 -67918 271218 -136281 -178742 66264 -173577 360563 -51636
5461 -36971 -169100 -247999 -210208 861 62944 34236 154432 316309 -186632 51053 -329892
5449 185023 -394919 -192354 126699 342042 164398 55154 -101164 91154 -133053 -3155
5438 49746 -106354 84669 37117 13392 594363 -53454 -112840 -12167 116612 205052 -54361
5426 -24712 57146 185171 23196 -71680 25468 -259573 -79286 -75910 73639 -48069 65533 65659
5414 65659 55868 -266738 -433777 -98444 128205 -7598 426971 74673 -319303 292540 -211059
5402 -75348 -9561 -16252 29519 -162605 95524 -277279 131402 -278742 -33576 -13876 -547853
5391 -547853 274340 96780 -649 42371 3039 -327215 181795 277082 -14958 -39809 13910 -293422
5378 -43198 -88625 144511 189990 -279998 36375 101657 134883 170058 26050 125243 -201770
5366 275383 -4535 -27137 4157 121953 21751 133671 -46873 97576 -2295 -8614 100305 -72506
5353 -176759 -132922 -34010 -277971 -88396 176849 24253 1981 76829 -254538 -72782 -115361
5342 -115361 98998 -157310 -72401 73639 77607 -162531 41211 42670 305556 -241509 217341
5330 150465 39862 -44842 -216798 75114 -133400 -141821 -1844 -68696 -237313 -66101 66813
5318 -12721 170709 1688 195720 25972 173113 154878 -168707 -68515 98987 160596 20661
5306 -302765 50352 -274302 -219694 -44011 -269233 219126 172585 297367 84023 30909 103173
5295 103173 -154127 -126976 -4148 78087 33819 338341 -264223 93651 68474 9936 105236
5284 105236 89260 150129 -61851 34527 461706 129372 -107717 -222762 -22914 110202 205835
5273 205835 -266251 -27383 -12301 222812 236959 122087 134942 -42555 -92591 54159 95530
5262 95530 -241549 -204043 139671 257245 -291392 -340239 272044 -10716 30614 -232339 -196446
5251 -196446 -87917 163289 3464 -124203 32210 -134208 27125 -278492 -110603 6604 -247383
5239 -8442 223380 -137575 -104210 76016 -60839 -122237 346396 91965 -85438 2649 -35081 -30588
5227 -30588 -434404 107270 -51741 68716 -90580 -126455 97463 187727 40660 65323 -117500
5215 -352267 -93649 61052 -345556 -29532 -113918 -301270 -175839 -213163 11768 256199 229623
5204 229623 -431703 158936 129835 -109464 -157598 -202838 304176 -125468 -4613 195862 -107827
5192 -101542 304 135165 -178471 -20136 171885 104781 -123958 446 -292450 -115194 187043
5180 20388 -59346 124776 49276 -25090 216607 -40904 108146 57198 -104084 108168 193164
5169 193164 -96041 62088 28928 36378 -37372 116303 -56390 -149308 -69376 290806 221631
5158 221631 -66147 121252 -21231 29070 136692 -207684 -38741 21469 395903 129807 209958
5147 209958 -343869 -160458 75587 -44448 -109416 25072 102836 -129528 160732 7888 -98409
5135 -86939 295060 244167 182929 -318747 -26123 -142727 237479 47334 179966 256686 145696
5124 145696 237796 -125784 150435 12367 23420 128126 144216 172283 87469 125652 63995
5113 63995 -278595 -47061 87184 80369 -348331 -70586 -38791 -22381 -20671 71170 -60355 -160252
5101 -160252 441187 -118700 -141173 -109245 -3424 -183446 -156732 -281047 212415 53290 157113
5090 157113 -53497 304017 -30097 121058 -67837 56611 101411 270499 369167 11336 -116855
5078 -82811 173266 37003 351599 96405 204359 103579 -103108 -109239 -170412 179001 -227245
5066 -23222 -85671 -37078 -7137 -21293 40465 156933 -195437 -139784 -54363 -63823 167303 -50432
5053 -171733 185754 48253 159709 54165 66595 -103413 38075 -121397 -150687 17020 -32923
5041 68322 -296760 384934 34387 326583 25944 -149985 172431 193799 256831 196747 -22044
5029 214363 25424 -286501 154619 -318974 -191014 -45079 -86006 289624 -29715 -11414 -115999
5018 -115999 269228 86647 42522 291352 -16261 -309128 59227 -176165 -11544 11912 61409
5007 61409 -71841 -186387 -47128 222055 -1971 178817 55780 -53455 -72695 -13890 248668
4995 -194954 38668 -37708 -10213 97457 -150392 164212 7530 -126675 221325 -92407 -400601
4984 -400601 -60117 -214092 -190455 29628 -67409 -96012 -39038 103274 169 -186296 -226936
4973 -226936 -52187 -173614 292534 111579 -322150 -45416 70785 116691 81790 -104952 -108939
4962 -108939 -179598 -207173 269157 33838 -11937 -188710 -303138 -258412 -4251 81348 92107
4951 92107 104799 -397873 -78239 182484 -190093 -21782 -46248 130557 -202554 -7666 269324
4939 366986 -43677 10334 -244648 40546 68558 -133568 3395 62142 105492 -3045 131262
4927 321909 52133 23156 -40070 -99162 -87272 133944 -125247 242939 125981 -83523 16224
4915 31501 -488855 -310703 -72689 32467 189399 106420 -74972 -65032 -14421 176682 99057
4904 99057 31987 -60141 30335 -119213 -143085 140476 -285674 -158943 -7191 -40478 -53173
4893 -53173 -209241 209585 121136 242419 21543 129830 59510 161727 -154849 -237416 20302
4881 -49325 80946 -76199 -52913 -63687 148897 144499 303686 -324812 -48328 3197 15424 78877
4869 78877 -167779 48150 -138567 -45050 -54512 -19598 -203776 -7644 50854 234031 267941
4858 267941 -299540 -81148 197832 61047 -39172 -317078 -109329 109687 -86025 82745 -250722
4846 95148 185803 -104279 -74443 -3584 137042 -86145 -92556 -66926 -625 253908 -273992 68931
4833 -10135 21377 -251860 8356 -201328 -410546 -306087 -314228 611812 -461584 -32958 -59159
4822 -59159 -54720 -52729 -339998 -176150 175318 249605 61629 31211 112110 32937 -57584 -105356
4810 -105356 132511 294805 131383 101901 -129225 225074 -140840 163903 541897 14483
4799 -65646 131958 131784 110142 -195477 34425 168088 155568 -107878 289120 -130823 -116860
4788 -116860 -68332 68554 -224837 150493 184619 -185559 6791 -282696 -198373 -35202 -10870
4776 -45076 163236 -12316 113684 -140629 -300209 128578 104008 172252 -126795 -87109 53959
4764 -158209 -58544 168380 302227 -273771 27818 345981 75425 115015 -65296 213443 -315360
4752 -188136 -266219 191116 4258 295264 142929 -50703 58927 -266878 35734 -19031 -96707
4741 -96707 40438 200548 -232859 10125 15386 202075 -218835 -97751 -116433 126411 238532
4730 238532 208615 254402 14376 95971 -143092 256210 -380210 36505 -135258 -111704 -232013
4719 -232013 140053 88991 -200607 -163665 -314992 -27370 -21350 220226 13850 155514 -185867
4707 170617 44395 6614 226416 -248144 291766 244400 192952 -319224 188000 19321 192228
4696 192228 -286706 177716 334341 -327730 257796 -236584 -209724 -42493 -85846 -197958
4686 -197958 115347 32610 38808 -458754 25272 196757 122557 -49530 -129638 -361612 -272584
4675 -272584 -8476 78340 350609 244500 199305 163523 153995 97422 -33908 -17697 48691 14304
4662 -158109 89975 -261235 182024 -216404 2893 150564 -16249 -117837 -79816 -174008 -33339
4650 108929 131817 -86110 124459 -11041 138804 -171616 -318218 90921 4874 -232028 -382605
4639 -382605 64793 295379 -2340 39111 -46900 311808 121533 -23159 -407506 234805 -311942
4627 98379 -2013 346471 96503 187732 -49022 25084 263434 145786 176644 -169383 -198519
4616 -198519 -375820 271283 1738 -171301 -465738 118474 131912 294049 38100 -263811
4605 22959 209877 21085 88638 98974 -124920 -138571 117811 -126821 -381278 105248 -130831
4593 198236 -188357 146797 89313 -147289 102664 122868 -244666 101926 156623 89142
4583 89142 -131909 265488 -53590 -146899 435438 270377 -313936 112357 -142405 -52446
4572 -96246 -7368 283208 135384 -115808 -35196 -168780 -152169 59083 108579 205265 -247814
4560 -25717 221448 118150 89154 -230109 -246286 -13120 -135843 -62153 20916 221652 -184672
4548 -28212 88026 -309429 83219 298481 -88110 -521766 190114 -178728 209479 378284
4538 378284 38860 3958 -306321 108252 341767 202838 229561 370027 -182740 -227161 101593
4526 91212 -55817 235690 -11370 -49525 68267 58388 181321 306111 -66360 235026 -290837
4514 -151364 139770 81369 -41882 90697 79292 -104588 -34389 242082 170936 -86415 -85052
4503 -85052 -3765 -290543 51695 -137285 -133457 -141508 -50692 130023 -73531 77697 133321 -183702
4490 432656 156809 -155822 -264296 183009 -92382 2218 311627 -415343 -115928 -2972 -29805
4479 -29805 197763 -8473 38766 243837 -211869 108628 86596 -118182 92939 -115800 -17440
$$ [...]
##END NTUPLES=NMR SPECTRUM
##END=
