
##TITLE=AC1241_NBUAH12031_6945042_qgowhEW6Ji
##JCAMPDX= 6.0         $$ Bruker NMR JCAMP-DX V2.0
##DATA TYPE= NMR SPECTRUM
##DATA CLASS= NTUPLES
##ORIGIN= BRUKER
##OWNER= Administrator
$$ 1.72 TOPSPIN		Version 2.1
$$ 2012-10-18 13:43:32.364 -0700  Administrator@X
$$ Compression mode = diff/dup
##.OBSERVE FREQUENCY= 400.02188249412
##.OBSERVE NUCLEUS= ^1H
##.ACQUISITION MODE= SIMULTANEOUS (DQD)
##.ACQUISITION SCHEME= undefined
##.AVERAGES= 64
##.DIGITISER RES= 22
##SPECTROMETER/DATA SYSTEM= spect
##.PULSE SEQUENCE= noesygpps1d.comp
##.SOLVENT NAME= COFFEE_meoh
##.SHIFT REFERENCE= INTERNAL, COFFEE_meoh, 1, 14.96096
##AUDIT TRAIL= $$ (NUMBER, WHEN, WHO, WHERE, PROCESS, VERSION, WHAT)
$$ ##TITLE= Audit trail, TOPSPIN		Version 2.1
$$ ##JCAMPDX= 5.01
$$ ##ORIGIN= Bruker BioSpin GmbH
$$ ##OWNER= Administrator
$$ $$ C:\Bruker\TOPSPIN/data/COFFEE/nmr/AC1241_NBUAH12031_6945042_qgowhEW6Ji/12/pdata/1/auditp.txt
$$ ##AUDIT TRAIL=  $$ (NUMBER, WHEN, WHO, WHERE, PROCESS, VERSION, WHAT)
(   1,<2012-10-13 17:42:16.046 -0500>,<Administrator>,<TOPSPIN>,<go>,<TOPSPIN 2.1>,
      <created by zg
	started at 2012-10-13 17:30:45.828 -0500,
	POWCHK enabled, PULCHK disabled,
       configuration hash MD5:
       6B 1B 68 BB D9 2E 58 E2 7F 35 AD 54 07 DF 0E 41
       data hash MD5: 64K
       6B 86 31 D1 42 4F 2E E2 57 88 D7 3E 64 64 E0 19>)
(   2,<2012-10-13 17:42:19.046 -0500>,<Administrator>,<TOPSPIN>,<proc1d>,<TOPSPIN 2.1>,
      <Start of raw data processing
       efp LB = 0.3 FT_mod = 6 PKNL = 1 PHC0 = 0 PHC1 = 0 SI = 128K 
       data hash MD5: 128K
       D5 BB 38 D8 40 F5 B8 82 8E 0E B8 F0 41 5F 0B F9>)
(   3,<2012-10-13 17:42:20.265 -0500>,<Administrator>,<TOPSPIN>,<proc1d>,<TOPSPIN 2.1>,
      <pk PHC0 = 4.015503 PHC1 = 0 
       data hash MD5: 128K
       55 99 44 20 46 A3 F8 37 06 AB 0F B7 59 9C 7F D4>)
(   4,<2012-10-13 17:42:20.484 -0500>,<Administrator>,<TOPSPIN>,<proc1d>,<TOPSPIN 2.1>,
      <abs ABSG = 1 
       data hash MD5: 128K
       3C CF E6 11 68 9A AD 50 49 F5 4D B7 77 3B CA E9>)
(   5,<2012-10-13 17:42:20.562 -0500>,<Administrator>,<TOPSPIN>,<proc1d>,<TOPSPIN 2.1>,
      <abs ABSG = 2 
       data hash MD5: 128K
       26 49 84 B9 4D 70 E6 B6 D4 4E 88 F1 B9 4F C8 4B>)
(   6,<2012-10-13 17:42:20.718 -0500>,<Administrator>,<TOPSPIN>,<proc1d>,<TOPSPIN 2.1>,
      <abs ABSG = 3 
       data hash MD5: 128K
       A7 1A 75 E8 36 D9 D3 FE 26 93 AA A8 CA 27 89 8F>)
(   7,<2012-10-13 17:42:20.875 -0500>,<Administrator>,<TOPSPIN>,<proc1d>,<TOPSPIN 2.1>,
      <abs ABSG = 4 
       data hash MD5: 128K
       25 53 B0 66 4A 0F D1 D7 29 EF 7F 62 E0 27 5E 99>)
(   8,<2012-10-13 17:42:20.921 -0500>,<Administrator>,<TOPSPIN>,<proc1d>,<TOPSPIN 2.1>,
      <abs ABSG = 5 
       data hash MD5: 128K
       81 A0 4A 13 00 AB 4C 26 00 BF 46 4D 4C F4 D9 BF>)
(   9,<2012-10-13 17:42:21.171 -0500>,<Administrator>,<TOPSPIN>,<audit>,<TOPSPIN 2.1>,
      <user comment:
       ICON-NMR User ID: COFFEE
       data hash MD5: 128K
$$ [...]
150 150 150 150 150 150 150 150
##$TP07= 0
##$TPNAME0= <>
##$TPNAME1= <>
##$TPNAME2= <>
##$TPNAME3= <>
##$TPNAME4= <>
##$TPNAME5= <>
##$TPNAME6= <>
##$TPNAME7= <>
##$TPOAL= (0..7)
0.5 0.5 0.5 0.5 0.5 0.5 0.5 0.5
##$TPOFFS= (0..7)
0 0 0 0 0 0 0 0
##$TUNHIN= 0
##$TUNHOUT= 0
##$TUNXOUT= 0
##$USERA1= <user>
##$USERA2= <user>
##$USERA3= <user>
##$USERA4= <user>
##$USERA5= <user>
##$V9= 5
##$VALIST= <valist>
##$VCLIST= <CCCCCCCCCCCCCCC>
##$VD= 0
##$VDLIST= <DDDDDDDDDDDDDDD>
##$VPLIST= <PPPPPPPPPPPPPPP>
##$VTLIST= <TTTTTTTTTTTTTTT>
##$WBST= 2048
##$WBSW= 25
##$XGAIN= (0..3)
0 0 0 0
##$XL= 0
##$YL= 0
##$YMAX_a= 12730552
##$YMIN_a= -9456843
##$ZGOPTNS= <>
##$ZL1= 120
##$ZL2= 120
##$ZL3= 120
##$ZL4= 120
##$ABSF1= 14.96096
##$ABSF2= -5.597221
##$ABSG= 5
##$ABSL= 3
##$ALPHA= 0
##$AQORDER= 0
##$ASSFAC= 0
##$ASSFACI= 0
##$ASSFACX= 0
##$ASSWID= 0
##$AUNMP= <proc_prof1d_extract.lims>
##$AXLEFT= 0
##$AXNAME= <>
##$AXNUC= <1H>
##$AXRIGHT= 0
##$AXTYPE= 0
##$AXUNIT= <>
##$AZFE= 0.1
##$AZFW= 0.1
##$BCFW= 0
##$BC_mod= 0
##$BYTORDP= 0
##$COROFFS= 0
##$CY= 15
##$DATMOD= 1
##$DC= 0
##$DFILT= <>
##$DTYPP= 0
##$F1P= 0
##$F2P= 0
##$FCOR= 0.5
##$FTSIZE= 131072
##$FT_mod= 6
##$GAMMA= 0
##$GB= 0
##$INTBC= 1
##$INTSCL= 1
##$ISEN= 128
##$LB= 0.3
##$LEV0= 0
##$LPBIN= 0
##$MAXI= 10000
##$MC2= 0
##$MEAN= 0
##$ME_mod= 0
##$MI= 0
##$NCOEF= 0
##$NC_proc= -2
##$NLEV= 6
##$NOISF1= 0
##$NOISF2= 0
##$NSP= 0
##$NTH_PI= 0
##$NZP= 0
##$OFFSET= 14.96096
##$PC= 1
##$PHC0= 4.015503
##$PHC1= 0
##$PH_mod= 1
##$PKNL= yes
##$PPARMOD= 0
##$PPDIAG= 0
##$PPIPTYP= 0
##$PPMPNUM= 2147483647
##$PPRESOL= 1
##$PSCAL= 4
##$PSIGN= 0
##$PYNMP= <proc.py>
##$REVERSE= no
##$SF= 400.02000965438
##$SI= 131072
##$SIGF1= 0
##$SIGF2= 0
##$SINO= 400
##$SIOLD= 131072
##$SPECTYP= <>
##$SREGLST= <1H.CDCl3>
##$SSB= 0
##$STSI= 131072
##$STSR= 0
##$SW_p= 8223.68421052631
##$SYMM= 0
##$S_DEV= 0
##$TDeff= 65536
##$TDoff= 0
##$TI= <>
##$TILT= no
##$TM1= 0
##$TM2= 0
##$TOPLEV= 0
##$USERP1= <user>
##$USERP2= <user>
##$USERP3= <user>
##$USERP4= <user>
##$USERP5= <user>
##$WDW= 1
##$XDIM= 131072
##$YMAX_p= 315661928
##$YMIN_p= -12066
##$CURPLOT= <Network HP LaserJet P1505>
##$CURPRIN= <$Network HP LaserJet P1505>
##$DFORMAT= <normdp>
##$LAYOUT= <+/1D_H.xwp>
##$LFORMAT= <normlp>
##$PFORMAT= <normpl>
##$SURQMSG= 1
$$ End of Bruker specific parameters
$$ ---------------------------------
##NTUPLES= NMR SPECTRUM
##VAR_NAME=  FREQUENCY,     SPECTRUM/REAL,   SPECTRUM/IMAG
##SYMBOL=    X,             R,               I
##VAR_TYPE=  INDEPENDENT,   DEPENDENT,       DEPENDENT
##VAR_FORM=  AFFN,          ASDF,            ASDF
##VAR_DIM=   131072,        131072,          131072
##UNITS=     HZ,            ARBITRARY UNITS, ARBITRARY UNITS
##FACTOR=    0.0627417313425164, 1,          1
##FIRST=     8223.62146879497, 275,          -62504
##LAST=      0,             2060,            -62727
##MIN=       0,             -12066,          0
##MAX=       8223.62146879497, 315661928,    0
$$ Real data points
##PAGE= N=1
##DATA TABLE= (X++(R..R)), XYDATA
$$ [...]
64032C92875M656K569J06j640k205k300k798l546l763l314k771k349j755j237
64018C72528j646l041m171m069l337l113l433l530l262l209l526l640l142k252
64004C27157j310m48K21O37J052J733K428K657K600K975L895M521M262L731M020
63989C60131N334O898P983Q495Q590Q330P908P801Q275Q982R406R672J0468J2028
63975D80301J3550J3996J3329J2553J2601J3525J4835J6223J7679J9093K0183
63964F47868K0825K1334K2196K3564K5046K6215K7370K9543L3365L8145M2484
63953I57955M5945M9569N4594O1097O8336P5988Q4425R3848J03784J13615J23126
63942A832282J32207J40335J46888J51870J55807J58717J59515J56882J50453
$$ y = [392875, 397531, 400100, 400206, 398566, 396361, 394061, 391263, 387717, 383954, 380640, 377869, 375520, 373765, 372528, 370882, 367841, 363670, 359601, 356264, 353151, 349718, 346188, 342926, 339717, 336191, 332551, 329409, 327157, 325847, 325399, 325620, 326257, 327309, 329042, 331470, 334127, 336727, 339702, 343597, 348118, 352380, 356111, 360131, 365465, 372363, 380346, 388841, 397431, 405761, 413669, 421470, 429745, 438727, 448133, 457805, 468273, 480301, 493851, 507847, 521176, 533729, 546330, 559855, 574690, 590913, 608592, 627685, 647868, 668693, 690027, 712223, 735787, 760833, 787048, 814418, 843961, 877326, 915471, 957955, 1003900, 1053469, 1108063, 1169160, 1237496, 1313484, 1397909, 1491757, 1595541, 1709156, 1832282, 1964489, 2104824, 2251712, 2403582, 2559389, 2718106, 2877621, 3034503, 3184956]
63933C184956J40789J28266J12652R3900P2807N0447K7319L486k0716m4571o7419
63922C681916q8717j07839j24245j37791j48425j55733j59300j59421j56897j52185
63912B291363j45337j36707j27084j17012j06676r6561q7439p9379p1567o3559
63902A260042n6068m9967m5065m0515l6034l2002k8642k5780k3285k1206j9457
63891H82021j7881j6549j5627j4975j4241j3378j2685j2267j1693j0293p697m265
63879G30470j058Q50J333J381K089L660N554P326Q946J0491J1900J3067J3870
63866H09879J4189J4083J3843J3708J3658J3564J3281J2481J0786Q357N988M128
63854I47945K246l88l520o188q055r763j1883j4122j5849j6990j8111j9771k1938
$$ y = [3184956, 3325745, 3454011, 3566663, 3660563, 3733370, 3783817, 3811136, 3814622, 3793906, 3749335, 3681916, 3593199, 3485360, 3361115, 3223324, 3074899, 2919166, 2759866, 2600445, 2443548, 2291363, 2146026, 2009319, 1882235, 1765223, 1658547, 1561986, 1474547, 1395168, 1323601, 1260042, 1203974, 1154007, 1108942, 1068427, 1032393, 1000391, 971749, 945969, 922684, 901478, 882021, 864140, 847591, 831964, 816989, 802748, 789370, 776685, 764418, 752725, 742432, 734735, 730470, 729412, 730262, 731595, 732976, 735065, 738725, 744279, 751605, 760551, 771042, 782942, 796009, 809879, 824068, 838151, 851994, 865702, 879360, 892924, 906205, 918686, 929472, 937829, 943817, 947945, 950191, 949803, 946283, 940095, 932040, 922277, 910394, 896272, 880423, 863433, 845322, 825551, 803613]
63841H03613k3909k4864k4653k3968k3573k3476k3185k2543k1863k1345k0862
63830E49372k0308j9690j8772j7163j4997j3095j2159j2055j2100j1784j0995
63819C86254r845q571p494o784o294n766n136m504l955l515l248l186l272l438
63805C11246l695l985m014l436k377j628k036l518m865m836l489k112j750k209
63791B67296k660k776k771k682k293j762j683k262k890k850k125j272p17n01m78
63776B37574m92l62k5L10L27L9j29J53N88M63m54j447j617j046p79j401k188k083
63758B27431j215o55q16q67k5J237J783J209J02p76j116r41l87K98Q35J118J210
63741B28425J163J063J079J246J269R18N49P46J423J764J346P75Q38J413J805
$$ y = [803613, 779704, 754840, 730187, 706219, 682646, 659170, 635985, 613442, 591579, 570234, 549372, 529064, 509374, 490602, 473439, 458442, 445347, 433188, 421133, 409033, 397249, 386254, 376409, 367838, 360344, 353560, 347266, 341500, 336364, 331860, 327905, 324390, 321142, 317956, 314684, 311246, 307551, 303566, 299552, 296116, 293739, 292111, 290075, 286557, 281692, 276856, 273367, 271255, 269505, 267296, 264636, 261860, 259089, 256407, 254114, 252352, 250669, 248407, 245517, 242667, 240542, 239270, 238553, 238052, 237574, 237082, 236720, 236695, 237005, 237332, 237371, 237242, 237395, 237983, 238446, 237992, 236545, 234928, 233882, 233103, 231702, 229514, 227431, 226216, 225561, 224745, 223878, 223853, 225090, 226873, 228082, 228184, 227408, 226292, 225351, 224964, 225262, 226097, 227215, 228425, 229588, 230651, 231730, 232976, 234245, 235163, 235712, 236458, 237881, 239645, 240991, 241766, 242604, 244017, 245822]
63726B45822J826J917K231K375K199K117K327K280J502M96K01P49J362J403R12
63711B69719J26r06k000k633k445j654p70r7K77K97N9n6L16J080J776K041J876
63694B67006J468R89N72L87O09J209J849K135K065K033K231K238J560M17l69l66
63678B86033M6K78K02J8k01n13q07q03l21N09J259J472J143Q47J131J737J818
63661B93848R71k76j154j443j434j489j810k336k656k357j613j112j181j392j247
63646B73319q35n30l73j84P3L74Q19J367J683J621J559J892K454K808K846K791
63630B91684K841L207M122N402O285O284N896N958O496O942P231P963R407J1038
63616C80756J2259J3036J3624J4125J4487J4714J4860J5003J5322J5998J6935
$$ y = [245822, 247648, 249565, 251796, 254171, 256370, 258487, 260814, 263094, 264596, 265092, 265293, 266042, 267404, 268807, 269719, 269845, 268939, 266939, 264306, 261861, 260207, 259437, 259340, 259617, 259914, 259973, 259917, 260233, 261313, 263089, 265130, 267006, 268474, 269463, 270035, 270422, 271031, 272240, 274089, 276224, 278289, 280322, 282553, 284791, 286351, 286768, 286399, 286033, 286079, 286357, 286559, 286577, 286376, 285863, 285056, 284253, 283932, 284441, 285700, 287172, 288315, 289162, 290293, 292030, 293848, 294819, 294543, 293389, 291946, 290512, 289023, 287213, 284877, 282221, 279864, 278251, 277139, 275958, 274566, 273319, 272484, 271954, 271581, 271397, 271470, 271844, 272663, 274030, 275713, 277334, 278893, 280785, 283239, 286047, 288893, 291684, 294525, 297732, 301854, 307256, 313541, 319825, 325721, 331679, 338175, 345117, 352348, 360311, 369718, 380756, 393015, 406051, 419675, 433800, 448287, 463001, 477861, 492864, 508186, 524184, 541119]
63605E41119J7685J7657J6384J3816J0449O957L629M13k392m118m667m861n389
63592F06682n937o001n963o551p737q983j0227j1621j2590j2356j1325j0815j1259
63579D85317j1755j1538j0805r765q055n680l567k408j710o71O51J710K453L218
63565D27395M062M788N359N775N951O131O995Q699J0294J0713J0103R582R930
63552E25777J1067J2620J4351J6120J7881J9632K1080K1563K0682J8730J6073
63541G15576J2506P773K451k363o093q823j0496j0707r464p622o292o069o839
63528F63538q013r032r910j1231j3310j5573j7124j7805j8142j8450j8574j8414
63516D87960j8040j7224j5581j3444j1811j1166j0846j0053q927q095p608o933
$$ y = [541119, 558804, 576461, 592845, 606661, 617110, 624067, 627696, 628109, 625717, 621599, 616932, 612071, 606682, 600745, 594744, 588781, 582230, 574493, 565510, 555283, 543662, 531072, 518716, 507391, 496576, 485317, 473562, 462024, 451219, 441454, 433399, 427719, 424152, 421744, 420034, 419363, 420014, 421724, 424177, 427395, 431457, 436245, 441604, 447379, 453330, 459461, 466456, 475155, 485449, 496162, 506265, 515847, 525777, 536844, 549464, 563815, 579935, 597816, 617448, 638528, 660091, 680773, 699503, 715576, 728082, 735855, 738306, 735943, 729850, 721027, 710531, 699824, 690360, 682738, 676446, 670377, 663538, 655525, 646493, 636583, 625352, 612042, 596469, 579345, 561540, 543398, 524948, 506374, 487960, 469920, 452696, 437115, 423671, 411860, 400694, 389848, 379795, 370868, 362773, 355165, 348232]
63504C48232n801m505l394k600k282k559l130l312k707j549l53N42R18N85l86
63489C17699j431j877j535p74n1M68Q16J066J305J669K222K866L443L857L995
63474C33738L630K593J124j09n15j58K70J25o08j453k077k522k839k808k268j497
63458C24626r50p16n38k80rM17J287K496L500M041M491N198N934O365O648P100
63442C69610P585P891Q409R759J1798J3690J5076J6426J8017J9157J8915J7214
63430E33547J4751J2204R858P869O342N170M210L730M361O419R407J2401J4892
63417F45161J7017J8952K0418K0976K0536J9193J6730J2893Q181L786L87k394
63405H01836n036p150q117q160q128q457r074j0117j1901j4190j6200j7471j8168
$$ y = [348232, 342431, 337926, 334532, 331932, 329650, 327091, 323961, 320649, 317942, 316393, 316040, 316582, 317500, 318085, 317699, 316268, 314391, 312856, 312082, 312031, 312499, 313315, 314381, 315686, 317355, 319577, 322443, 325886, 329743, 333738, 337368, 339961, 341085, 340976, 340461, 340303, 340573, 340698, 340090, 338637, 336560, 334038, 331199, 328391, 326123, 324626, 323676, 322960, 322422, 322142, 322133, 322550, 323837, 326333, 329833, 333874, 338365, 343563, 349497, 355862, 362510, 369610, 377195, 385086, 393495, 403254, 415052, 428742, 443818, 460244, 478261, 497418, 516333, 533547, 548298, 560502, 570360, 578229, 584571, 589741, 593951, 597681, 602042, 608461, 617868, 630269, 645161, 662178, 681130, 701548, 722524, 743060, 762253, 778983, 791876, 800057, 803843, 804230, 801836, 796800, 789650, 781533, 773373, 765245, 756788, 747714, 737597, 725696, 711506, 695306, 677835, 659667]
63392F59667j8514j8569j8541j8575j8212j6774j4466j2344j1001j0007q885p784
63380D85995o840n675m124k692j746q13O19K226L450M440N603O664P084P176P867
63365E09234R357J0827J1674J2303J3433J5102J6701J7729J8273J8811J9666K0569
63353F93679K0758J9559J6888J3237R363N917L041K07l072o324q420q999r026
63340G46808r437r933r808r442j0041j2011j4472j6433j7685j8398j8591j8300
63328E82257j7714j6785j5151j2784j0307q311o639m793k834j544j649l178n535
63315D75033p984r963j1219j1813j1983j1850j1241r975q305o915o251o063n772
63302C55699n182m474l738k886k013j408j074p73n91r72j920k707k688k054j404
$$ y = [659667, 641153, 622584, 604043, 585468, 567256, 550482, 536016, 523672, 512671, 502664, 493779, 485995, 479155, 473480, 469356, 466664, 464918, 464105, 464724, 466950, 470400, 474840, 480443, 487107, 494191, 501367, 509234, 518591, 529418, 541092, 553395, 566828, 581930, 598631, 616360, 634633, 653444, 673110, 693679, 714437, 733996, 750884, 764121, 773484, 779401, 782442, 782649, 779577, 773253, 764833, 755834, 746808, 737371, 727438, 717630, 708188, 698147, 686136, 671664, 655231, 637546, 619148, 600557, 582257, 564543, 547758, 532607, 519823, 509516, 501205, 494566, 489773, 486939, 485395, 483746, 480568, 475033, 467049, 457086, 445867, 434054, 422071, 410221, 398980, 389005, 380700, 373785, 367534, 361471, 355699, 350517, 346043, 342305, 339419, 337406, 335998, 334924, 334151, 333560, 332588, 330668, 327961, 325273, 323219, 321815]
63287C21815j008q82j141j705j982j483o15l08p84j263r33J23J100J320Q32L31
63271C13417M25R73J298J154J054J465K033K176K021K177K723L109L037K890L097
63256C43049L522L769L753L696L793M046M407M890N502O088O417O525O893P917
63242D14267R256J0081J0148J0207J1064J2583J3957J4713J5132J5853J7269J9161
63230E73691K0745K1373K1227K0953K0609J9614J7949J6565J6126J6119J5883
63219G80854J5731J6221J6893J6819J5989J5099J4169J2560J0267Q042O030L379
63207I32053m70m922r053j2551j5461j7700j9261k0390k1130k1113k0044j8093
63195G51865j5639j3008j0588q696p138n337l047n33J989M482O642P976Q662R605
$$ y = [321815, 320807, 319925, 318784, 317079, 315097, 313614, 312999, 312691, 311907, 310644, 309711, 309834, 310934, 312254, 313086, 313417, 313842, 314815, 316113, 317267, 318321, 319786, 321819, 323995, 326016, 328193, 330916, 334025, 337062, 339952, 343049, 346571, 350340, 354093, 357789, 361582, 365628, 370035, 374925, 380427, 386515, 392932, 399457, 406350, 414267, 423523, 433604, 443752, 453959, 465023, 477606, 491563, 506276, 521408, 537261, 554530, 573691, 594436, 615809, 637036, 657989, 678598, 698212, 716161, 732726, 748852, 764971, 780854, 796585, 812806, 829699, 846518, 862507, 877606, 891775, 904335, 914602, 922644, 928674, 932053, 931583, 926661, 917608, 905057, 889596, 871896, 852635, 832245, 811115, 790002, 769958, 751865, 736226, 723218, 712630, 703934, 696796, 691459, 688412, 687879, 689868, 694350, 700992, 708968, 717630, 727235]
63181G27235J1308J3178J4407J4982J5400J5804J5976J5915J5851J5788J5457
63170H91301J4700J3641J2403J0902Q905O318L333K53k891o332j0083j3694j6811
63157I11945j9593k2226k4334k5475k5940k6357k6665k6246k5074k3857k2852
63146F43326k1415j9081j6354j4010j2147j0442q840p520o531n887n729o031o298
63133E03041n929m715l004j510r25j287j730j317j74O78O82L54M64J183K224L182
63117D91217L599L269K667K495K682K530J925J574J795K011J813J598J619J366
63103E22160N93M9L81J040J169R01Q79J054J001Q95J162J545J557J519K076K898
63087E40879L014K420K187K825L595L756L595L764M355N133O063P112P910Q114
$$ y = [727235, 738543, 751721, 766128, 781110, 796510, 812314, 828290, 844205, 860056, 875844, 891301, 906001, 919642, 932045, 942947, 951852, 958170, 961503, 961756, 958865, 952533, 942450, 928756, 911945, 892352, 870126, 845792, 820317, 794377, 768020, 741355, 715109, 690035, 666178, 643326, 621911, 602830, 586476, 572466, 560319, 549877, 541037, 533517, 526986, 521099, 515370, 509339, 503041, 497112, 492397, 489393, 487883, 486958, 485671, 483941, 482624, 482450, 483128, 483810, 484164, 484628, 485811, 488035, 491217, 494816, 498085, 500752, 503247, 505929, 508459, 510384, 511958, 513753, 515764, 517577, 519175, 520794, 522160, 522753, 522802, 523183, 524223, 525392, 526293, 527172, 528226, 529227, 530122, 531284, 532829, 534386, 535905, 537981, 540879, 543893, 546313, 548500, 551325, 554920, 558676, 562271, 566035, 570390, 575523, 581586, 588698, 596608, 604722]
63073F04722P954Q049Q758R890J0975J1736J2302J2975J3825J4683J5554J6648
63061G48071J7897J8904J9686K0978K3253K5868K7867K9336L1196L3794L6503
63050A033353L8806M0930M3136M4984M5750M5292M4241M3408M3149M3111M2603
63039A508763M1355L9841L8736L8223L8073L8036L7791L6816L4789L1989K8709
63028A913121K4539J8788J1560L791l782j1182j8691k6339l3841m0585m5690m8578
63016A743111m9540m9261m7885m5074m0903l6031l0972k5885k1011j6581j2162
63005A367806o990j207L941P631J0471J3535J6980K0163K2645K4458K5640K6111
62993A531184K5995K5683K5597K5898K6273K5951K4317K1620J8687J5843J2560
$$ y = [604722, 612676, 620725, 629483, 639373, 650348, 662084, 674386, 687361, 701186, 715869, 731423, 748071, 765968, 784872, 804558, 825536, 848789, 874657, 902524, 931860, 963056, 996850, 1033353, 1072159, 1113089, 1156225, 1201209, 1246959, 1292251, 1336492, 1379900, 1423049, 1466160, 1508763, 1550118, 1589959, 1628695, 1666918, 1704991, 1743027, 1780818, 1817634, 1852423, 1884412, 1913121, 1937660, 1956448, 1968008, 1971799, 1968017, 1956835, 1938144, 1911805, 1877964, 1837379, 1791689, 1743111, 1693571, 1644310, 1596425, 1551351, 1510448, 1474417, 1443445, 1417560, 1396549, 1379968, 1367806, 1360816, 1359609, 1363550, 1371181, 1381652, 1395187, 1412167, 1432330, 1454975, 1479433, 1505073, 1531184, 1557179, 1582862, 1608459, 1634357, 1660630, 1686581, 1710898, 1732518, 1751205, 1767048, 1779608]
62982A779608Q394L663j152o189j1936j8479k5452l2437l9049m4809m9299n2330
62970A510533n3807n3728n2524n0943m9344m7432m4946m2163l9360l6372l3118
62959A006796l0127k7910k6194k4409k2644k1401k0644j9825j8721j7596j6564
62948G60761j5527j4642j4229j4155j3956j3586j3340j3037j2050j0365q786p833
62936F09255p166o482o196o611p122o969o325n849n542m901m000l510l644l844
62922E31094l677l332l033k636k148k062k660l402l488k848k128j817j821j874
62908D94168k014k480l304m120m397l936l112k487k162j713q78l1K17k97j188
62893D62266j977k431k548k426k144j706j177q69j073j502j461q22l27n23q55
$$ y = [1779608, 1788002, 1791665, 1790513, 1784324, 1772388, 1753909, 1728457, 1696020, 1656971, 1612162, 1562863, 1510533, 1456726, 1402998, 1350474, 1299531, 1250187, 1202755, 1157809, 1115646, 1076286, 1039914, 1006796, 976669, 948759, 922565, 898156, 875512, 854111, 833467, 813642, 794921, 777325, 760761, 745234, 730592, 716363, 702208, 688252, 674666, 661326, 648289, 636239, 625874, 617088, 609255, 602089, 595607, 589411, 582800, 575678, 568709, 562384, 556535, 550993, 546092, 542092, 538582, 534938, 531094, 527417, 524085, 521052, 518416, 516268, 514206, 511546, 508144, 504656, 501808, 499680, 497863, 496042, 494168, 492154, 489674, 486370, 482250, 477853, 473917, 470805, 468318, 466156, 464443, 463565, 463534, 463751, 463454, 462266, 460289, 457858, 455310, 452884, 450740, 449034, 447857, 446988, 445915, 444413, 442952, 442130, 441803, 441280, 440425]
62878D40425m90L59P42M92M24R54J398J092L12l42q26j274j356q33l09n80j353
62861D38835j484n77M31N27j38n96k85M82J044J012M94o5j87K37Q07R65N97K21
62843D42320M04J017J286P30j74n50k30J03p6m27k70N10J391J882J926J797J785
62826D53424J990K267K377K290K232K383K699L047L367L670M025M540N142N514
62812D98967N563N800O733P919Q316P718P104P283P909Q313Q604R220R928J0183
62798F09560J0152J0622J1914J3524J4811J5564J5989J6602J7972K0136K2497
62787G79343K4647K6899K9575L2339L4916L7916M1917M6215M9668N2566N6277
62776A212278O0894O4648O6088O5699O4654O2946N9629N4269M7299L9294L0593
$$ y = [440425, 439935, 440294, 441036, 441528, 441952, 442906, 444304, 445396, 445708, 445366, 444540, 443266, 441910, 441077, 440768, 440188, 438835, 437351, 436774, 437205, 437732, 437594, 436998, 436713, 437195, 438239, 439251, 439745, 439680, 439493, 439730, 440537, 441502, 442099, 442320, 442724, 443741, 445027, 445757, 445583, 445033, 444803, 444906, 444830, 444403, 444133, 444643, 446034, 447916, 449842, 451639, 453424, 455414, 457681, 460058, 462348, 464580, 466963, 469662, 472709, 476076, 479746, 483771, 488311, 493453, 498967, 504530, 510330, 517063, 524982, 533298, 541016, 548120, 555403, 563312, 571625, 580229, 589449, 599377, 609560, 619712, 630334, 642248, 655772, 670583, 686147, 702136, 718738, 736710, 756846, 779343, 803990, 830889, 860464, 892803, 927719, 965635, 1007552, 1053767, 1103435, 1156001, 1212278, 1273172, 1337820, 1403908, 1469607, 1534261, 1597207, 1656836, 1711105, 1758404, 1797698, 1828291]
62765A828291K1379J1628J136r989k1096l1412m0432m7712n2865n6088n8245o0025
62753A484570o1324o1726o1095n9382n6433n2500m8484m5154m2378l9572l6555
62742I19967l3523l0615k7948k5661k3500k0753j7256j3991j2001j1037j0060
62731F93622q796p877p536p092n900m137k322p09N95J436J917K506L551M903O191
62716F70352P258Q141Q893R583J0331J1276J2632J4710J7535K0471K2699K4233
62704H38114K6081K9126L3105L6956L9983M2323M4461M6667M8980N1446N4031
62693A291273N6307N7456N6833N4527N1192M7187M2104L5274K6615J6692O086
62682A741546m947j6109k6768l6237m4235n0754n5658n8704n9996o0155n9815
$$ y = [1828291, 1849670, 1861298, 1862434, 1852445, 1831349, 1799937, 1759505, 1711793, 1658928, 1602840, 1544595, 1484570, 1423246, 1361520, 1300425, 1241043, 1184610, 1132110, 1083626, 1038472, 996094, 956522, 919967, 886444, 855829, 827881, 802220, 778720, 757967, 740711, 726720, 714719, 703682, 693622, 684826, 676949, 669413, 662321, 656421, 652284, 649962, 649253, 649848, 651284, 653201, 655707, 659258, 664161, 670352, 677610, 685751, 694644, 704227, 714558, 725834, 738466, 753176, 770711, 791182, 813881, 838114, 864195, 893321, 926426, 963382, 1003365, 1045688, 1090149, 1136816, 1185796, 1237242, 1291273, 1347580, 1405036, 1461869, 1516396, 1567588, 1614775, 1656879, 1692153, 1718768, 1735460, 1741546, 1736599, 1720490, 1693722, 1657485, 1613250, 1562496, 1506838, 1448134, 1388138, 1327983, 1268168]
62671A268168n9045n7502n5090n2199m9239m6171m2720l8840l4718l0531k6574
62660G75539k3473k1743k1046k0340j8892j6832j4619j2551j1045j0684j1407
62649E92907j2088j1688j0533r718r407q638o937n183m410m474m470m004l338
62636D98019k671j958j364j204j425j633j703j848j997j735j074o86r36j186o16
62621D75983N77J468J680J726K116K769L474M177M621M372L602L321M190N559
62607E19635O276O163O066O671P907R491J1302J3213J5047J6863J8830K0744K2235
62594F80443K3483K5166K7439K9497L0484L0347K9582K8494K7059K5078K2227
62583I79299J8259J3423Q271K876l185r739j5548j9648k2597k5617k8742l0784
$$ y = [1268168, 1209123, 1151621, 1096531, 1044332, 995093, 948922, 906202, 867362, 832644, 802113, 775539, 752066, 730323, 709277, 688937, 670045, 653213, 638594, 626043, 614998, 604314, 592907, 580819, 569131, 558598, 548880, 539473, 530835, 523898, 518715, 514305, 509831, 505361, 501357, 498019, 495348, 493390, 492026, 490822, 489397, 487764, 486061, 484213, 482216, 480481, 479407, 478721, 477785, 476599, 475983, 476560, 478028, 479708, 481434, 483550, 486319, 489793, 493970, 498591, 502963, 506565, 509886, 514076, 519635, 525911, 532074, 538140, 544811, 552718, 562209, 573511, 586724, 601771, 618634, 637464, 658208, 680443, 703926, 729092, 756531, 786028, 816512, 846859, 876441, 904935, 931994, 957072, 979299, 997558, 1010981, 1019252, 1022128, 1018943, 1009204, 993656, 974008, 951411, 925794, 897052, 866268]
62571H66268l1080l0336k9530k8784k7688k6180k4510k2749k0792j8725j6763
62560E89131j4976j3369j2089j1154j0098q370o190m600m286m709m761m105l312
62547D87112k753k050r17Q3J95m10q10n00K73J194K176K915K899K232J786K152
62531D95577K957L619M189M888N438N597N985P472R832J1867J2986J3899J5489
62518E99795J7699J9938K1970K3950K5934K7820K9626L1324L2549L2928L2683
62507H96216L2460L2390L1726K9646K6133K1715J6605J0691M371j301n683r275
62495A085694j2936j6610j9366k0534k0183j8651j6257j3489j0817q183n144j748
62483I21776J461M287P016R500J0987J1332J1444J1819J1464R230N550J813j589
$$ y = [866268, 835188, 804852, 775322, 746538, 718850, 692670, 668160, 645411, 624619, 605894, 589131, 574155, 560786, 548697, 537543, 527445, 519075, 512885, 508285, 503999, 499290, 494529, 490424, 487112, 484359, 482309, 481392, 481475, 481670, 481260, 480450, 479950, 480223, 481417, 483593, 486508, 489407, 491639, 493425, 495577, 498534, 502153, 506342, 511230, 516668, 522265, 528250, 535722, 545554, 557421, 570407, 584306, 599795, 617494, 637432, 659402, 683352, 709286, 737106, 766732, 798056, 830605, 863533, 896216, 928676, 961066, 992792, 1022438, 1048571, 1070286, 1086891, 1097582, 1101953, 1100652, 1094969, 1085694, 1072758, 1056148, 1036782, 1016248, 996065, 977414, 961157, 947668, 936851, 928668, 923524, 921776, 923237, 927524, 934540, 944040, 955027, 966359, 977803, 989622, 1001086, 1010316, 1015866, 1017679, 1016090]
62470A016090n355r675j3830j7469k1106k4973k8373l0626l1818l2222l1713l0329
62458G38601k8694k7257k5632k3298k0554j8173j6372j4712j2795j0580q192n923
62446E26419m243l358k862k234j538j130q84k49Q58J830K165J998J654J112L08
62431E19846m87r81j363k098l304m642n796o701p342p685p844p960p856p119n765
62416D42903m488l969m201m698n040m949m138k668j217n23n87q75j155j569j954
62401D00872j859j314q99p37j64J228K766L437L097K435K084K175K472K575K256
62386D20424J867K064K896L669L984M278M901N439N558N790O563P219P060O778
62372D88490P484Q738R041Q220P737Q384R278R690J0393J2288J4867J7122J9059
$$ y = [1016090, 1010735, 1001060, 987230, 969761, 948655, 923682, 895309, 864683, 832865, 800643, 768930, 738601, 709907, 682650, 657018, 633720, 613166, 594993, 578621, 563909, 551114, 540534, 532342, 526419, 522176, 518818, 515956, 513722, 512184, 511054, 510170, 509921, 510779, 512609, 514774, 516772, 518426, 519538, 519846, 519359, 518378, 517015, 514917, 511613, 506971, 501175, 494474, 487132, 479447, 471603, 463643, 455787, 448668, 442903, 438415, 434446, 430245, 425547, 420507, 415558, 411420, 408752, 407535, 407012, 406425, 405550, 404395, 402826, 400872, 399013, 397699, 396800, 396063, 395899, 397127, 399893, 403330, 406427, 408862, 410946, 413121, 415593, 418168, 420424, 422291, 424355, 427251, 430920, 434904, 439182, 444083, 449522, 455080, 460870, 467433, 474652, 481712, 488490, 495974, 504712, 513753, 521973, 529710, 538094, 547372, 557062, 567455, 579743, 594610, 611732, 630791]
62359F30791K1206K3288K4626K5455K6695K8575L0387L1537L1908L1242K9061
62348I34771K5401K0967J6344J1575O698K095j947n605r125j2360j5006j7058
62336I56750j8807k0411k1641k2122k1791k1071k0447j9832j8592j6409j3931
62325G41696j2195j1528j1333j0951j0396j0173j0613j1576j2607j3264j3438
62314F13622j3409j3481j3490j2884j1410r615q369p992q005p771p134o275n266
62301D88521m097k991k275j882j402p41k60j05J27P05J210J234J219J910L117
62286D84290L864L724L293L211L435L716L982L994L311K095J382J926L227M277
62272E29727M897N658O773P748Q143Q105Q146Q750J0183J2255J4321J5917J7333
$$ y = [630791, 651997, 675285, 699911, 725366, 752061, 780636, 811023, 842560, 874468, 905710, 934771, 960172, 981139, 997483, 1009058, 1015756, 1017851, 1015904, 1010299, 1001174, 988814, 973808, 956750, 937943, 917532, 895891, 873769, 851978, 830907, 810460, 790628, 772036, 755627, 741696, 729501, 717973, 706640, 695689, 685293, 675120, 664507, 652931, 640324, 627060, 613622, 600213, 586732, 573242, 560358, 548948, 539333, 530964, 522972, 514967, 507196, 500062, 493787, 488521, 484424, 481433, 479158, 477276, 475874, 475133, 474873, 474768, 474895, 475600, 476810, 478044, 479263, 481173, 484290, 488154, 491878, 495171, 498382, 501817, 505533, 509515, 513509, 516820, 518915, 520297, 522223, 525450, 529727, 534624, 540282, 547055, 554803, 562946, 571051, 579197, 587947, 598130, 610385, 624706, 640623, 657956]
62259F57956J9199K1634K4291K7066L0165L3334L5781L7076L7597L7651L6647
62248I98397L3765K9189K4048J9129J4272R169M161j97m022q024j2602j7416k1919
62235A067950k5866k9188l1726l3348l4056l3853l2721l0942k9075k7358k5473
62224G34344k3245k1163j9702j8478j6767j4590j2604j1038r563q206p435p151
62212E64402o579n536m925n350o005n717m500l256k388j574o51J33O94J205J598
62197E21551J626J462J657K405L344M150M849N473N894O132O449O948P420P719
62183E87079P980Q315Q560Q479Q016P272O411N659N191N000N005N237N760O509
62169F80473P463Q865J0969J3595J6232J8544K0534K2186K3346K3890K3753K2697
$$ y = [657956, 677155, 698789, 723080, 750146, 780311, 813645, 849426, 886502, 924099, 961750, 998397, 1032162, 1061351, 1085399, 1104528, 1118800, 1127969, 1132130, 1131933, 1127911, 1119887, 1107285, 1089869, 1067950, 1042084, 1012896, 981170, 947822, 913766, 879913, 847192, 816250, 787175, 759817, 734344, 711099, 689936, 670234, 651756, 634989, 620399, 607795, 596757, 587194, 578988, 571553, 564402, 557823, 552287, 547362, 542012, 536007, 530290, 525790, 522534, 520146, 518572, 517921, 518054, 518748, 519953, 521551, 523177, 524639, 526296, 528701, 532045, 536195, 541044, 546517, 552411, 558543, 564992, 571940, 579360, 587079, 595059, 603374, 611934, 620413, 628429, 635701, 642112, 647771, 652962, 657962, 662967, 668204, 673964, 680473, 687936, 696801, 707770, 721365, 737597, 756141, 776675, 798861, 822207, 846097, 869850, 892547]
62157H92547K0366J6760J2473Q336M845J901r70m070p140r651j1543j3360j5440
62144H95054j7366j8582j9098j9129j8387j6547j4177j2352j1305j0184q380o299
62132G23248m629l487k720k334k141j549k81J074J827K247L237N033O768P355
62118G33648O501M890L558L044K915K306R96k86q20p76q34j332k288l815n822
62103G41885p468p757o778n705n315n129m304k781j108M55K006L434M328M545
62089G10308M390M202M024L855L875M202M664N028N364N970O928P994Q924R725
62075G89453J0506J1202J1710J2134J2655J3153J3230J2782J2263J2173J2424
62064I23685J2556J2495J2700J3409J4107J4001J2803J0792Q267N356K321l47
$$ y = [892547, 912913, 929673, 942146, 950482, 955327, 957228, 956258, 952188, 945048, 935397, 923854, 910494, 895054, 877688, 859106, 840008, 820879, 802492, 785945, 771768, 759416, 748111, 737927, 729547, 723248, 718619, 715132, 712412, 710078, 707937, 706388, 706107, 707181, 709008, 711255, 714492, 719525, 726293, 733648, 740149, 745039, 748597, 751641, 754556, 756862, 757858, 757572, 756752, 755976, 755142, 753810, 751522, 747707, 741885, 734417, 726660, 719882, 714177, 708862, 703733, 699429, 696648, 695540, 695995, 698001, 701435, 705763, 710308, 714698, 718900, 722924, 726779, 730654, 734856, 739520, 744548, 749912, 755882, 762810, 770804, 779728, 789453, 799959, 811161, 822871, 835005, 847660, 860813, 874043, 886825, 899088, 911261, 923685, 936241, 948736, 961436, 974845, 988952, 1002953, 1015756, 1026548, 1034815, 1040171, 1042492, 1042145]
62052A042145k371l991n702p760j0088j2474j4746j6862j8930k1042k2959k4194
62040H81026k4570k4517k4542k4501k3811k2348k0767j9696j8958j7824j5980
62029F43512j3932j2400j1509j0688r438q044p335p625q188q022p034o059n724
62016E27514n745n512m996m679m838n255n606n742n523m723l388k113j575j662
62002D66157j400j4J971L164K875J878J339J442J472R70J49o34j218j442j307
61987D75402j433k632m738o429o580n371l797k629k209k608l343l498k769k062
61973D25304k326l147l280k342j171n29l25k77m67r56j398j405r79l32L69R26
61957D07665J170J226J308J276Q08J59J46J099K412L432M313N468O641P141O847
$$ y = [1042145, 1039774, 1035783, 1030081, 1022321, 1012233, 999759, 985013, 968151, 949221, 928179, 905220, 881026, 856456, 831939, 807397, 782896, 759085, 736737, 715970, 696274, 677316, 659492, 643512, 629580, 617180, 605671, 594983, 585545, 577501, 570166, 562541, 554353, 546331, 539297, 533238, 527514, 521769, 516257, 511261, 506582, 501744, 496489, 490883, 485141, 479618, 474895, 471507, 469394, 467819, 466157, 464757, 464743, 466714, 469878, 472753, 474631, 475970, 477412, 478884, 479854, 480003, 479369, 478151, 476709, 475402, 473969, 471337, 466599, 460170, 453590, 448219, 444422, 441793, 439584, 436976, 433633, 430135, 427366, 425304, 422978, 419831, 416551, 414209, 413038, 412509, 412184, 411907, 411440, 410484, 409086, 407681, 406702, 406370, 406739, 407665, 408835, 410061, 411369, 412645, 413453, 413612, 413758, 414857, 417269, 420701, 425014, 430482, 437123, 444264, 451111]
61942D51111O462O721P775R274J0769J1943J2693J3043J2932J2208J1018R977
61930E75926R645R861R875R190Q073P123O479N574L781J251j041k267k645l107
61916F37718m056m794m425k954j244j8P52J551K735M312O068P714Q964R490Q991
61901F70804P410N182L026J390J31j104k373l431m182m915n970p278q317q598
61887F41775q138p492p241p494p848p797p144o167n481n548o173o548o070n012
61873E47622m184l950l936l683l204k792k519k139j286K73K334M093M654L968
61859E35251L089L274M888P323R739J1679J3154J4442J5705J6772J7391J7796
61847F70503J8609J9970K1067K0928J9467J7411J5270J2876R908O512L216M26
$$ y = [451111, 457573, 464294, 472069, 481343, 492112, 504055, 516748, 529791, 542723, 554931, 565949, 575926, 585571, 595432, 605307, 614497, 622570, 629693, 636172, 641746, 645527, 646778, 645737, 643470, 640825, 637718, 633662, 628868, 624443, 621489, 620245, 620227, 620979, 622530, 625265, 629577, 635645, 643359, 652323, 661813, 670804, 678214, 683396, 686422, 687812, 687943, 686839, 684466, 681035, 676853, 671938, 665968, 658690, 650373, 641775, 633637, 626145, 618904, 611410, 603562, 595765, 588621, 582454, 576973, 571425, 565252, 558704, 552634, 547622, 543438, 539488, 535552, 531869, 528665, 525873, 523354, 521215, 519929, 520202, 522536, 526629, 531283, 535251, 538340, 541614, 546502, 553825, 563564, 575243, 588397, 602839, 618544, 635316, 652707, 670503, 689112, 709082, 730149, 751077, 770544, 787955, 803225, 816101, 826009, 832521, 835737, 836163]
61835H36163j870l942n848p148p291o383n218m293l165j221J191L078M047M634
61821H02734N308N804N589M428K320n98l806o711r427j2651j6281j8901j9376
61808G38432j8417j7729j7913j8185j7918j7315j6459j4890j2650j0764r986r649
61796E56557q597o844n460n086n297n422n282n012m723m471m230l814l192k774
61782D86353k988l559l753l409l148l380l655l302k319j256n81m76r61j821k542
61767D49203k741k477k012j388n44L86J125J479J323O44j72m31J10P76O95j40
61751D45836r55j190r67o71n49p03j089j377j254r17r26j387j677j187j50N66
61735D31403M40j73m77j56L27L62k2k99l18n21j094j405q04M25J475K058K438
$$ y = [836163, 834293, 830351, 824503, 817355, 810064, 803681, 798463, 794170, 791005, 789784, 790975, 794053, 798100, 802734, 808042, 813846, 819435, 823863, 826183, 825585, 821779, 815068, 805641, 792990, 776709, 757808, 738432, 720015, 702286, 684373, 666188, 648270, 630955, 614496, 599606, 586956, 576192, 566206, 556557, 547960, 541116, 535656, 530570, 525273, 519851, 514569, 509557, 504834, 500363, 496133, 492319, 489127, 486353, 483365, 479806, 476053, 472644, 469496, 466116, 462461, 459159, 456840, 455584, 455003, 454527, 453566, 451745, 449203, 446462, 443985, 441973, 440585, 440041, 440427, 441552, 443031, 444354, 444998, 444826, 444395, 444505, 445281, 445976, 445836, 444881, 443691, 442724, 442053, 441504, 440801, 439712, 438335, 437081, 436164, 435238, 433851, 432174, 430987, 430837, 431403, 431843, 431670, 431193, 431037, 431364, 431726, 431704, 431405, 431087, 430566, 429472, 428067, 427263, 427688, 429163, 431221, 433659]
61718D33659K539J989J029N58R07J334J132O12M28M71J20o65j278j418j464j843
61702D38110k455k923l055k879k515k221k373l112m051m527m217l454k879k837
61688C94612l153l386l238k728k170j945k137k370k181j680j458j756k018j645
61674C62747q39k84j72j07J19K05p5n20r13j304j664j690j216n38RM49Q78J119
61656C56204J032R19J120J333Q53m07j571j725r06M5N06O67J037J750K523L128
61640C66508L484L336K333O33r30j597j388q48l80j70m36j199k021k438k572k795
61624C59520k991k740k104j622j495j402j161r31p28l94j62n17j305j683j283
61609C39002p65q24j344j921k557l276l658l383k814k469k374k372k555k854k790
$$ y = [433659, 436198, 438187, 439216, 439774, 440681, 442015, 443147, 443759, 444187, 444658, 444778, 444113, 442835, 441417, 439953, 438110, 435655, 432732, 429677, 426798, 424283, 422062, 419689, 416577, 412526, 407999, 403782, 400328, 397449, 394612, 391459, 388073, 384835, 382107, 379937, 377992, 375855, 373485, 371304, 369624, 368166, 366410, 364392, 362747, 361908, 361624, 361452, 361345, 361464, 361669, 361594, 361074, 360161, 358857, 357193, 355503, 354287, 353749, 353758, 354207, 355085, 356204, 357236, 358155, 359275, 360608, 361461, 361054, 359483, 357758, 356852, 356897, 357403, 358070, 359107, 360857, 363380, 366508, 369992, 373328, 375661, 376294, 375364, 373767, 372379, 371531, 371151, 370981, 370545, 369346, 367325, 364887, 362315, 359520, 356529, 353789, 351685, 350063, 348568, 347166, 346005, 345074, 344346, 343952, 343790, 343273, 341968, 340285, 339002, 338237, 337413, 336069, 334148, 331591, 328315, 324657, 321274, 318460, 315991, 313617, 311245, 308690, 305836, 303046]
61594C03046k230j889k278k739k418j755j865k686k962k140j118q10r42q39n25
61579B75850m19m55k39K32N33L91j20q05j412j536q31N33J765J959Q51q05j759
61562B73733j415m24O0k79o84l78N04J258J536J577J676J767J592J112N60J60
61546B82355n2j24L1N00J079J334J058N29J19j00k21j28L84J130J479J034J97
61529B90604j31M84J444J711R65q1o08o25o21p18o58m98o17r91j135q92o36m83
61511B86514n8N73N91l45j215q59L37R35L32o39r92o87l35m36j035j717j835j118
61493B78011p3N65O80P16R22J072R28N07k8m18l43J91P00Q27Q51J103J250Q40
61475B88301K23Q3K25j09p19m04J247K925L121J868M05l37l33j3J75k9m31n10
$$ y = [303046, 300816, 298927, 296649, 293910, 291492, 289737, 287872, 285186, 282224, 280084, 278966, 278156, 277214, 276375, 275850, 275431, 274976, 274737, 274969, 275502, 275893, 275773, 274968, 273556, 272020, 271189, 271722, 273487, 275446, 276297, 275492, 273733, 272318, 271894, 271954, 271675, 270991, 270613, 271117, 272375, 273911, 275488, 277164, 278931, 280523, 281635, 282195, 282355, 282303, 282179, 282210, 282710, 283789, 285123, 286181, 286710, 286829, 286729, 286508, 286380, 286764, 287894, 289373, 290407, 290604, 290473, 290957, 292401, 294112, 295077, 294996, 294388, 293763, 293142, 292424, 291766, 291268, 290651, 289660, 288525, 287633, 286997, 286514, 286456, 287029, 287620, 287275, 286060, 285201, 285538, 286473, 286805, 286166, 285174, 284487, 284152, 283716, 282681, 280964, 279129, 278011, 277938, 278503, 279183, 279899, 280821, 281893, 282821, 283328, 283300, 282882, 282539, 282730, 283430, 284257, 285108, 286211, 287461, 288301, 288524, 288607, 288832, 288723, 288004, 287600, 288847, 291772, 294893, 296761, 297166, 296829, 296496, 296483, 296658, 296629, 296198, 295688]
61457B95688j26J75j03o50p13n3Q42J381J371J042P53P22Q75J040J179J336J357
61440C06116J055O61O81J219J795K026K118K400K792K984K893K613K171J606J094
61425C34224P40M33J47J16M70R04J030R14R28J156J231Q27J14l43j42N59J157
61408C44465J179O70j1n73q94r65j083j761l013l842l179j296K96O02J20j79j76
61391C30360l41o79p12l83k68p69j505j687r70K55J273J649J532J397J589K086
61375C32827K539K528J915J170J063J770K492K335J455P97Q84J391J880K298K617
61360C59961K624K381K345K692K966K731K236K096K601L605M820N881O465O559
61346D09963O405O087N457M544L651K896K098J301R55J279J929K498K902L050
$$ y = [295688, 295562, 295737, 295634, 294984, 294271, 294218, 295060, 296441, 297812, 298854, 299607, 300329, 301204, 302244, 303423, 304759, 306116, 307171, 307832, 308513, 309732, 311527, 313553, 315671, 318071, 320863, 323847, 326740, 329353, 331524, 333130, 334224, 334964, 335397, 335544, 335660, 336130, 337034, 338064, 338978, 339906, 341062, 342293, 343120, 343234, 342891, 342749, 343308, 344465, 345644, 346314, 346303, 345730, 344836, 343871, 342788, 341027, 338014, 334172, 330993, 329697, 329993, 330595, 330715, 330536, 330360, 330019, 329340, 328628, 328245, 327977, 327208, 325703, 324016, 323046, 323301, 324574, 326223, 327755, 329152, 330741, 332827, 335366, 337894, 339809, 340979, 342042, 343812, 346304, 348639, 350094, 350891, 351775, 353166, 355046, 357344, 359961, 362585, 364966, 367311, 370003, 372969, 375700, 377936, 380032, 382633, 386238, 391058, 396939, 403404, 409963, 416368, 422455, 427912, 432456, 436107, 439003, 441101, 442402, 443357, 444636, 446565, 449063, 451965, 455015]
61332D55015K677J864J167Q45M56l38j120j367j220j069q26k75K53K73m9j63J4
61315D56137J40J62L35O75J031J575K634M043N284O198P018P779Q307Q693R154
61300E19165R344Q558O729M698L209K153R79n07k059l353m169m464m427m361m401
61285E27094m466m508m571m615m450l910l011j973j147p36m49K33J279J943J682
61270D98395R86P95J307J953K305K510K815L262L867M679N552O202O572O788O816
61255E54804O494N835M974L907K683J669J177R01K86o57j413j778j996k123j914
61240E72849j500j423j832k178k021j580j229r65p07o36q56j049q32j66P64J797
61224E58436K691L223L531L982M515M604M142L784M014M409M375M129M262M732
$$ y = [455015, 457692, 459556, 460723, 461568, 462024, 461686, 460566, 459199, 457979, 456910, 456084, 455809, 456062, 456335, 456286, 456123, 456137, 456277, 456439, 456774, 457449, 458480, 460055, 462689, 466732, 472016, 478214, 485232, 493011, 501318, 510011, 519165, 528509, 537067, 543796, 548494, 551703, 553856, 554835, 554328, 552269, 548916, 544747, 540283, 535856, 531495, 527094, 522628, 518120, 513549, 508934, 504484, 500574, 497563, 495590, 494443, 493707, 493258, 493491, 494770, 496713, 498395, 499381, 500176, 501483, 503436, 505741, 508251, 511066, 514328, 518195, 522874, 528426, 534628, 541200, 547988, 554804, 561298, 567133, 572107, 576014, 578697, 580366, 581543, 582444, 582730, 582073, 580660, 578882, 576886, 574763, 572849, 571349, 569926, 568094, 565916, 563895, 562315, 561086, 560121, 559414, 558778, 557922, 556873, 556041, 555875, 556639, 558436, 561127, 564350, 567881, 571863, 576378, 580982, 585124, 588908, 592922, 597331, 601706, 605835, 610097, 614829]
61210F14829M942M677M221L653K819K022J994K838L691L787L484L738M872O314
61196F67881P437Q172Q826R594J0393J0906J0754R776Q274O776N493M136K442
61183G70860O61o92j454j934k461l003l314l280l107l292m235n629o511o299n730
61168G20580o089p421q303p736o561o326p299q375q700q500q322q296q281q112
61154F12259p439n902l738j817p28j91M16J182J600J180j12j882l604m879n561
61139E80784n672n303m641l873k943j678l39L81K49R3R22K697M520N862O902P780
61123E85741Q316Q620R212J0299J1507J2500J3356J4181J4892J5555J6354J7106
61111G37639J7385J7243J7102J6814J5663J3630J1762J0750R963Q524O602M872
$$ y = [614829, 619771, 624448, 628669, 632322, 635141, 637163, 639157, 641995, 645686, 649473, 652957, 656695, 661567, 667881, 675318, 683490, 692316, 701910, 712303, 723209, 733963, 743739, 752013, 758789, 764282, 768418, 770860, 771521, 770829, 769375, 767441, 764980, 761977, 758663, 755383, 752276, 748984, 744749, 739120, 732609, 726310, 720580, 714491, 707070, 698767, 691031, 684470, 678144, 670845, 662470, 653770, 645270, 636948, 628652, 620371, 612259, 604820, 598918, 595180, 593363, 592635, 592444, 592860, 594042, 595642, 596822, 596710, 594828, 591224, 586345, 580784, 575112, 569809, 565168, 561295, 558352, 556674, 556335, 556716, 556965, 557058, 557980, 560677, 565197, 571059, 577961, 585741, 594057, 602677, 611889, 622188, 633695, 646195, 659551, 673732, 688624, 704179, 720533, 737639, 755024, 772267, 789369, 806183, 821846, 835476, 847238, 857988, 867951, 876475, 883077, 887949]
61099H87949L352J615k81k046l868o066q300j0003j1342j2866j4333j4867j4290
61086G94654j3430j2909j2466j1705j0825j0223r853r309q225o494m479l000k605
61073F79131k793k462j264J34J286K688M801P001Q230Q451Q665R559J0754J1601
61059G45782J2182J3142J4745J6571J8113J9351K0555K1753K2753K3598K4691
61048I53236K6349K8501L0888L3293L5510L7321L8726L9930M1026M1972M2974
61037A349726M4528M6780M9229N1358N3213N5034N6728N8095N9255O0362O1308
61026A945616O2189O3747O6679P0777P5342Q0183Q5600R1740R8665J06834J16742
61015B864114J28391J42035J58958J80511K06668K36806K71486L11991L58672
$$ y = [887949, 891301, 892916, 892635, 890589, 886721, 880655, 872355, 862352, 851010, 838144, 823811, 808944, 794654, 781224, 768315, 755849, 744144, 733319, 723096, 713243, 703934, 695709, 689215, 684736, 681736, 679131, 676338, 673876, 672612, 672746, 674032, 676720, 681521, 688522, 696752, 705203, 713868, 723427, 734181, 745782, 757964, 771106, 785851, 802422, 820535, 839886, 860441, 882194, 904947, 928545, 953236, 979585, 1008086, 1038974, 1072267, 1107777, 1145098, 1183824, 1223754, 1264780, 1306752, 1349726, 1394254, 1441034, 1490263, 1541621, 1594834, 1649868, 1706596, 1764691, 1823946, 1884308, 1945616, 2007805, 2071552, 2138231, 2209008, 2284350, 2364533, 2450133, 2541873, 2640538, 2747372, 2864114, 2992505, 3134540, 3293498, 3474009, 3680677, 3917483, 4188969, 4500960, 4859632]
61006D859632M12040M75173N51845O41892P42299Q53179R73568J081814J124765
60997A1716207J044353Q28932N36723K59748O2082m5162p7460m6833K9045R9537
60987A4407172Q9247m9424k93242n64072p87097r31711j004855j021940r92544
60978H851534r25542q34338p32950o31288n35967m52039l81607l23027k73778
60969C760998k33242k01566j77381j58259j42595j29704j18731j08845j00075
60960B390600r2751q6363p9966p3473o7552o2427n7746n3547n0351m8197m6455
60949A671772m4738m3260m2056m0645l8740l6733l5053l3609l2256l1255l0797
60938A262630l0393k9399k7928k6780k6404k6351k5934k5032k4060k3267k2376
$$ y = [4859632, 5271672, 5746845, 6298690, 6940582, 7682881, 8536060, 9509628, 10591442, 11716207, 12760560, 13589492, 14126215, 14385963, 14448045, 14402883, 14325423, 14278590, 14307635, 14407172, 14496419, 14446995, 14153753, 13589681, 12802584, 11870873, 10866018, 9844078, 8851534, 7925992, 7091654, 6358704, 5727416, 5191449, 4739410, 4357803, 4034776, 3760998, 3527756, 3326190, 3148809, 2990550, 2847955, 2718251, 2599520, 2490675, 2390600, 2297849, 2211486, 2131520, 2058047, 1990495, 1928068, 1870322, 1816775, 1766424, 1718227, 1671772, 1627034, 1583774, 1541718, 1501073, 1462333, 1425600, 1390547, 1356938, 1324682, 1293427, 1262630, 1232237, 1202838, 1174910, 1148130, 1121726, 1095375, 1069441, 1044409, 1020349, 997082, 974706]
60927I74706k0944j8967j7001j5724j5330j5374j5164j4356j3242j2347j1788
60916H04469j1167j0203r216q688q535q210p531o895o589o339n803n102m565m292
60902G01334m258m501m798m515l334j863j093j328k110l025l952m692m956m847
60888F52062m798m946n027n021n288n971o679p078p328p651p863p691p250o868
60874E62603o569o089n297m411l864l976m634n217n109m347l468k756k066j520
60860E03280j703k772l848l904l001k108j830j835j552q98j98K89M91M00M3m93
60844D80361j075j593k003k300k456k409k248k282k722l216l115k316j545j511
60830D49570k011k239j817j160q70j139j758k410k816k815k510k204k089k021
$$ y = [974706, 953762, 934795, 917794, 902070, 886740, 871366, 856202, 841846, 828604, 816257, 804469, 793302, 783099, 773883, 765195, 756660, 748450, 740919, 734024, 727435, 721096, 715293, 710191, 705626, 701334, 697076, 692575, 687777, 683262, 679928, 678065, 676972, 675644, 673534, 670509, 666557, 661865, 656909, 652062, 647264, 642318, 637291, 632270, 626982, 621011, 614332, 607254, 599926, 592275, 584412, 576721, 569471, 562603, 556034, 549945, 544648, 540237, 536373, 532397, 527763, 522546, 517437, 513090, 509622, 506866, 504800, 503280, 501577, 498805, 494957, 491053, 488052, 485944, 484114, 482279, 480727, 479829, 479631, 479920, 480411, 480811, 480854, 480361, 479286, 477693, 475690, 473390, 470934, 468525, 466277, 463995, 461273, 458057, 454942, 452626, 451081, 449570, 447559, 445320, 443503, 442343, 441473, 440334, 438576, 436166, 433350, 430535, 428025, 425821, 423732, 421711]
60816D21711j694r90j59L77L64j58j000j975k849l300l138k551j984j745j837
60801C99072k084k287k304k145j974j906j909k042k522l317l887l737l070k464
60787C63424k123j883j768j854j814j304p94j057j849k006j145k11L6R2O30J280
60771C47654J354J058J050J357J613J875K334K595K216J640J637K071K134J619
60757C72207J007M57k80r60r02j08N26M41Pk65m11n88o62n60m98o06p78j069j711
60738C65247k547l015k953k907l374m089m405m054l353k842k776k840k446j584
60724C22062j032j373k071k208j774j414j189n41M90J105R69O61N55K54m51r16
60708C13127n32L75J056J253J081O12Ol43k48P0M37R44J511J804J806J871J957
$$ y = [421711, 420017, 419027, 418868, 419245, 419609, 419451, 418451, 416476, 413627, 410327, 407189, 404638, 402654, 400909, 399072, 396988, 394701, 392397, 390252, 388278, 386372, 384463, 382421, 379899, 376582, 372695, 368958, 365888, 363424, 361301, 359418, 357650, 355796, 353982, 352678, 351884, 350827, 348978, 346972, 345827, 345616, 345652, 345744, 346374, 347654, 349008, 350066, 351116, 352473, 354086, 355961, 358295, 360890, 363106, 364746, 366383, 368454, 370588, 372207, 373214, 373671, 373391, 372431, 371529, 371421, 371947, 372388, 372395, 372130, 371719, 371131, 370469, 369909, 369411, 368805, 368027, 366958, 365247, 362700, 359685, 356732, 353825, 350451, 346362, 341957, 337903, 334550, 331708, 328932, 326092, 323646, 322062, 321030, 319657, 317586, 315378, 313604, 312190, 311001, 310460, 310950, 312055, 313024, 313685, 314240, 314494, 314043, 313127, 312595, 312970, 314026, 315279, 316360, 316972, 316978, 316635, 316387, 316457, 316894, 317838, 319349, 321153, 322959, 324830, 326787]
60691C26787J592R12Q40J736K664K662K096J936K322K651K629K425K068J446P70
60676C55536L86K94K80L16M15L88J77Q1J84K1p19j577j949j921j887j810j553
60659C46662j507k073k804k838k087j211n25K63J191J704J415P42N48J319K663
60644C43462L514K978J225o98k033k823l215k971k184j656j816j917j162p2K49
60629C30881k26o31p32j041j479j192pJ036J006K00m63n01m4M94O42K54j37J58
60611C28218J064J816J987J829J568J081M24J7k3j20n67j039j058n07M92J659
60595C36841K390K071Q67k49m75P3P65J115R71M55k5r9K07O84J402K414L133K815
60577C55355J753J217J902L181M168M795N383N841N928N874O134O755P374P649
$$ y = [326787, 328379, 329291, 330131, 331867, 334531, 337193, 339289, 341225, 343547, 346198, 348827, 351252, 353320, 354766, 355536, 355922, 356216, 356496, 356812, 357227, 357615, 357792, 357873, 358057, 358078, 357359, 355782, 353833, 351912, 350025, 348215, 346662, 345155, 343082, 340278, 337440, 335353, 334142, 333617, 333880, 335071, 336775, 338190, 338932, 339480, 340799, 343462, 346976, 349954, 351179, 350481, 348448, 345625, 342410, 339439, 337255, 335599, 333783, 331866, 330704, 330632, 330881, 330655, 330024, 329292, 328251, 326772, 325580, 325573, 326609, 327615, 327815, 327352, 326851, 326807, 327301, 327943, 328197, 328060, 328218, 329282, 331098, 333085, 334914, 336482, 337563, 337987, 338004, 337981, 337861, 337294, 336255, 335197, 334690, 335182, 336841, 339231, 341302, 342169, 341920, 341445, 341518, 342283, 343398, 344369, 344824, 344799, 344700, 344907, 345591, 346993, 349407, 352540, 355355, 357108, 358325, 360227, 363408, 367576, 372371, 377754, 383595, 389523, 395397, 401531, 408286, 415660, 423309]
60563D23309P450O887O334O043N625M403K419N29p58j802k874l494l306k844k631
60548D45290k109m45J976L826M520M750N288O162P095Q116R343J0707J2093J3396
60534E30008J4270J4186J2997J1070Q760O036K880k63k723m138m618m523m288
60521E79654m294m592m790m407l381k142j182o18k38J93P76J570K645L935N214
60506E68343O342P481Q877J0451J1842J2951J4323J6739K0366K4434K7786K9803
60494G59738L0713L0995L0742K9690K7718K4869K0972J5760R519L126k855q705
60482I72282j4836k0960k6385l0752l3931l5582l5521l4298l2724l0877k8370
60471F48046k5464k3096k1604k0253j8265j5711j3119j0874r305q711q814q716
$$ y = [423309, 430759, 437646, 443980, 450023, 455648, 460051, 462470, 462999, 462241, 460439, 457565, 454071, 450765, 447921, 445290, 443181, 442736, 444712, 448538, 453058, 457808, 463096, 469258, 476353, 484469, 493812, 504519, 516612, 530008, 544278, 558464, 571461, 582531, 591291, 597327, 600207, 599944, 597221, 593083, 588465, 583942, 579654, 575360, 570768, 565978, 561571, 558190, 556048, 554866, 554248, 554010, 554203, 554979, 556549, 559194, 563129, 568343, 574685, 582166, 591043, 601494, 613336, 626287, 640610, 657349, 677715, 702149, 729935, 759738, 790451, 821446, 852188, 881878, 909596, 934465, 955437, 971197, 980716, 983842, 980987, 972282, 957446, 936486, 910101, 879349, 845418, 809836, 774315, 740017, 707293, 676416, 648046, 622582, 599486, 577882, 557629, 539364, 523653, 510534, 499660, 490355, 481644, 472830, 464114]
60459D64114p877o707n845n354n004m823m813m582l879l154k949l051k846k347
60445D00883k123k289k304j860j359j285j543j711j631j468j371j327j277j170
60431C78165r18m66L9K49m8o18r82j027j143j520j642r50J86P89O35N05Q77J128
60413C73259N98j39O2J269K328K354J651J007P11O23P52J202J725J791J216M26
60397C90835l8m4J67M57Q99J443J849K000K085K201K139J805J594J899K478K713
60381D14482K400J841J322J038J286K114K864K798K212K106K684L086K838K525
60367D45596K566K335J286J56K6P62J389J551J675J927K058K231K934M048M813
60352D75353M911M813M930N104N150N168N097M579L518K229Q00r92k913m126m306
$$ y = [464114, 456237, 449530, 443685, 438331, 433327, 428504, 423691, 419109, 415230, 412076, 409127, 406076, 403230, 400883, 398760, 396471, 394167, 392307, 390948, 389663, 388120, 386409, 384778, 383310, 381939, 380612, 379335, 378165, 377247, 376781, 376820, 377069, 377021, 376403, 375421, 374394, 373251, 371731, 370089, 369139, 369325, 370114, 370749, 371254, 372131, 373259, 373857, 373718, 373780, 375049, 377377, 379731, 381382, 382389, 383100, 383723, 384475, 385677, 387402, 389193, 390409, 390835, 390797, 390753, 390920, 391377, 392276, 393719, 395568, 397568, 399653, 401854, 403993, 405798, 407392, 409291, 411769, 414482, 416882, 418723, 420045, 421083, 422369, 424483, 427347, 430145, 432357, 434463, 437147, 440233, 443071, 445596, 448162, 450497, 451783, 451939, 451965, 452727, 454116, 455667, 457342, 459269, 461327, 463558, 466492, 470540, 475353, 480264, 485077, 490007, 495111, 500261, 505429, 510526, 515105, 518623, 520852, 521652, 520660, 517747, 513621, 509315]
60337E09315m275m863n674n704m836l881l295k767k171k083k847l753l750k727
60323D56689j476n79jK28k68j374j976r95J180L003L529L376L721M896O350P552
60307D83855Q452R155R656R988J0341J0837J1192J0716Q820N639K086j001l727
60294E76009o801j0316j3297j4695j4460j3309j1799j0079q303o767n600m713
60282D55870m022l437k662j499l65j13j035k329k874k444j834j809k252k500k298
60267D24397j989j862j745j426j061r04r04r29j050j202r28p8N74K24o25o59L44
60250D10177J149Q78J62L3N17J016J286J285P77r5m46K18J050J021N05N99J265
60233D21397J456J003R49J747K402J979R80N46R61J617K026K181K269K494K989
$$ y = [509315, 505040, 500177, 494503, 488799, 483963, 480082, 476787, 474020, 471849, 469766, 466919, 463166, 459416, 456689, 455213, 454634, 454633, 454861, 454593, 453219, 451243, 450248, 451428, 454431, 457960, 461336, 465057, 469953, 476303, 483855, 492307, 501462, 511118, 521106, 531447, 542284, 553476, 564192, 573012, 578651, 580737, 579736, 576009, 569208, 558892, 545595, 530900, 516440, 503131, 491332, 481253, 472950, 466183, 460583, 455870, 451848, 448411, 445749, 444250, 443885, 443772, 442737, 440408, 437534, 435090, 433256, 431447, 429195, 426695, 424397, 422408, 420546, 418801, 417375, 416314, 415410, 414506, 413577, 412527, 411325, 410397, 410319, 410893, 411117, 410492, 409833, 410177, 411326, 412204, 412366, 412399, 412916, 413932, 415218, 416503, 417280, 417185, 416739, 416957, 418007, 419028, 419533, 420132, 421397, 422853, 423856, 424805, 426552, 428954, 430933, 431913, 432459, 433420, 435037, 437063, 439244, 441513, 444007, 446996]
60218D46996L536L657L199K619K393K467K529K542K655K855L053L326L800M397
60204D90024M897N150N096M738M258L915L743L503L027K403J731R68K27j25N2
60189E33607L38J64n21j312j861k075j923j416q18n85r48j701k462k986l144k792
60173E09565j908r08n15j118k283l113l064k287j233k60L34L31o9k68R1O65R15
60156D94875P80N52L33J08J10N90J227J398J054Q29J096J471J487J240J132J302
60140E09584J680K188K619K600K155J928K436L251L452K796J982J686J807J860
60126E42024J711J601J630J565J205O62K64K08M17O77Q57R75J105J222J208J017
60110E58348P82O34M86J12n03j110j541j956k536l069l155k738k216j965j953
$$ y = [446996, 450532, 454189, 457388, 460007, 462400, 464867, 467396, 469938, 472593, 475448, 478501, 481827, 485627, 490024, 494921, 500071, 505167, 509905, 514163, 518078, 521821, 525324, 528351, 530754, 532485, 533453, 533680, 533555, 533607, 533945, 534109, 533588, 532276, 530415, 528340, 526417, 525001, 524183, 523598, 522650, 520949, 518487, 515501, 512357, 509565, 507657, 506749, 506234, 505116, 502833, 499720, 496656, 494369, 493136, 492876, 493210, 493541, 493472, 493204, 493295, 493960, 494875, 495655, 496207, 496540, 496648, 496758, 497348, 498575, 499973, 501027, 501856, 502952, 504423, 505910, 507150, 508282, 509584, 511264, 513452, 516071, 518671, 520826, 522754, 525190, 528441, 531893, 534689, 536671, 538357, 540164, 542024, 543735, 545336, 546966, 548531, 549736, 550398, 550662, 550870, 551287, 551964, 552821, 553796, 554901, 556123, 557331, 558348, 559130, 559764, 560250, 560362, 559859, 558749, 557208, 555252, 552716, 549647, 546492, 543754, 541538, 539573, 537620]
60095E37620j914j669j231p56m46l78l70k04R8L84O27Q38Q18L71k73o89q60j120
60077E30846j462j539j423j694k437k865k444j823k003k932l678l752l612l901
60063D95281m660n322n183l991k373j448j697k436k756k613k465k306j764r37
60049D55330l39m7L69J018J460J429J272J423J939K658L347L625L181K264J494
60034D80423J081O55k7o63r63j208j848k811l538l634l273k951k922k952k724
60019D52645k410k599l489m453m697m114l217k503k227k472l026l335l099k691
60005D08313k570k517k012j143m80k31j32j21l80p18o22m3N48R27J313J637J444
59988D03213P46L26P71J656K158K021J589J202R06O22K64j92o71j181j885k765
$$ y = [537620, 535706, 534037, 532806, 532050, 531604, 531226, 530856, 530652, 530750, 531134, 531761, 532599, 533417, 533788, 533515, 532826, 531966, 530846, 529384, 527845, 526422, 524728, 522291, 519426, 516982, 515159, 513156, 510224, 506546, 502794, 499182, 495281, 490621, 485299, 480116, 476125, 473752, 472304, 470607, 468171, 465415, 462802, 460337, 458031, 456267, 455330, 454991, 454944, 455313, 456331, 457791, 459220, 460492, 461915, 463854, 466512, 469859, 473484, 476665, 478929, 480423, 481504, 482159, 482132, 481469, 480506, 479298, 477450, 474639, 471101, 467467, 464194, 461243, 458321, 455369, 452645, 450235, 447636, 444147, 439694, 434997, 430883, 427666, 425163, 422936, 420464, 417438, 414103, 411004, 408313, 405743, 403226, 401214, 400071, 399591, 399360, 399228, 399107, 398727, 398009, 397387, 397344, 397892, 398819, 400132, 401769, 403213, 403959, 404285, 405056, 406712, 408870, 410891, 412480, 413682, 414588, 415210, 415474, 415282, 414611, 413430, 411545, 408780]
59972D08780l303k991k036j093l95L19J013J214Q29M70O82J277J731J772J352
59957D09621M62o64j454j382l72J141K311K272Q80q32j480o88O83J566J514O25
59941D14203o55j661j978j831j563r86J31J095Q56m28j347r80J51J110J601J770
59925D09488J804K095K993M097M581M560M992N896N820L922J504M64R85J773J971
59910D56945J747J425J038P12O48Q19J136J753K676L357L235K446J572R55O64
59895D81128P39J024J103Q89Q44J261J753J890J827J820J713J402J304J734K375
59880E02806K900L496M138M057K814J291O83R33J077P00R3o14j459k046j952j504
59864E17413j275j056l67L60K42n05p56k14K26N9k0P37K140L615M897N790N944
$$ y = [408780, 405477, 402486, 400450, 399357, 398962, 399281, 400294, 401508, 402337, 402807, 403489, 404766, 406497, 408269, 409621, 410083, 409419, 407965, 406583, 406211, 407352, 409663, 411935, 412815, 411983, 410503, 409815, 410498, 412064, 413578, 414203, 413548, 411887, 409909, 408078, 406515, 405529, 405660, 406755, 407611, 407183, 405836, 404856, 405007, 406117, 407718, 409488, 411292, 413387, 416380, 420477, 425058, 429618, 434610, 440506, 446326, 450248, 451752, 452216, 453201, 454974, 456945, 458692, 460117, 461155, 461867, 462515, 463334, 464470, 466223, 468899, 472256, 475491, 477937, 479509, 480464, 481128, 481867, 482891, 483994, 484883, 485727, 486988, 488741, 490631, 492458, 494278, 495991, 497393, 498697, 500431, 502806, 505706, 509202, 513340, 517397, 520211, 521502, 522185, 523118, 524195, 524895, 524988, 524374, 522915, 520869, 518917, 517413, 516138, 515082, 514715, 515075, 515317, 514812, 514056, 513842, 514068, 514127, 514107, 514844, 516984, 520599, 525496, 531286, 537230]
59847E37230N271M074K491N12j351k186j843j211r78q45m54l08j113k684m210
59832E32395n232n764n760n113m092l171k435j594o71k17o34j530k031j725j043
59817D91383p04r45j544k299l116l624l318k276j277r02q65n84M7P56J362J639
59801D73733J166m1j125j297r08r45j593k124k064j730j512j362j183j100j148
59786D56767j166j122j164j265j265j178j044o21K10Q57O29r6k29M10P69K37l34
59769D50395J11J243J856J561J115J237J824K441K983L557M062M171L756L189
59755D83501L058L567M335M838M911M639M029L189K624K849L602L972L499K782
59741E35395K725L433M122M034L174K166J500J045M10l63p79o61n03p18r68p22
$$ y = [537230, 542501, 546575, 549066, 549578, 548227, 546041, 544198, 542987, 542009, 541164, 540710, 540402, 539289, 536605, 532395, 527163, 521399, 515639, 510526, 506434, 503263, 500828, 499234, 498563, 498346, 497712, 496182, 494151, 492426, 491383, 490679, 489734, 488190, 485891, 482775, 479151, 475833, 473557, 472280, 471378, 470513, 469929, 469976, 470732, 472094, 473733, 474899, 474858, 473733, 472436, 471528, 470583, 468990, 466866, 464802, 463072, 461560, 460198, 459015, 457915, 456767, 455601, 454479, 453315, 452050, 450785, 449607, 448563, 447942, 448152, 449009, 449638, 449542, 449313, 449723, 450492, 450729, 450395, 450506, 451749, 453605, 455166, 456281, 457518, 459342, 461783, 464766, 468323, 472385, 476556, 480312, 483501, 486559, 490126, 494461, 499299, 504210, 508849, 512878, 516067, 518691, 521540, 525142, 529114, 532613, 535395, 538120, 541553, 545675, 549709, 552883, 555049, 556549, 557594, 558004, 557641, 556862, 556201, 555698, 554980, 554012, 553290]
59725E53290k22j99p34j148j099j080j508j919j649q99n31q60j275j187q76r95
59709E37109j467j455n64M94Q27N83O09J060J228P91L62L96L46m50j579k016j461
59692E34813n28J77O02Q79R92Q42L70k87p30o67m60p99j648k193k131k212k968
59675E24052l824m184m473n105n274m127k466j859k360k664k287k040k268k223
59661D78898j543r40r08r16m86JJ85M19J010J544J663J691J980K254K132J736
59645D88720J305P68J19l88p87j524k595l212k748j549m60m2m68j558k602k838
59629D70141k349j940j926j860j602j705k279k570k226k014k498k941k484j641
59615D40106j532k164k568k307j835j483j056m60Q0N09J099J944K735L153L111
$$ y = [553290, 553068, 552869, 552135, 550987, 549888, 548808, 547300, 545381, 543732, 542833, 542302, 541442, 540167, 538980, 538104, 537109, 535642, 534187, 533623, 534117, 534944, 535527, 536136, 537196, 538424, 539215, 539577, 539973, 540319, 539869, 538290, 536274, 534813, 534285, 534462, 535064, 535943, 536935, 537777, 538147, 537860, 537130, 536463, 536003, 535204, 533556, 531363, 529232, 527020, 524052, 520228, 516044, 511571, 506466, 501192, 497065, 494599, 492740, 490380, 487716, 485429, 483389, 481121, 478898, 477355, 476415, 475507, 474591, 474105, 474106, 474291, 474710, 475720, 477264, 478927, 480618, 482598, 484852, 486984, 488720, 490025, 490793, 490912, 490524, 489737, 488213, 485618, 482406, 479658, 478109, 477649, 477607, 477139, 475581, 472979, 470141, 467792, 465852, 463926, 462066, 460464, 458759, 456480, 453910, 451684, 449670, 447172, 444231, 441747, 440106, 438574, 436410, 433842, 431535, 429700, 428217, 427161, 426701, 426781, 427290, 428389, 430333, 433068, 436221, 439332]
59600D39332K680J987J231O12K47K08M44P43R53J206J561J621J046K79k3j50r72
59583D53005k290k726j634p3P34Q30P50L13p50j785j926j305o39j36K94L15k85
59566D42692q42o51k40n88j383j324j07J147J635J840K372K883K704J914J121
59551D53173P14P02J035J657K377K928L062K744K371K697M069N884P291Q333R830
59536E08867J1967J3560J3018R873N149M70l049n188o203o228n221l472j760q18
59522E30965p32j020j144q36k49N6l84j312j949k057k256l072m104m690m855n053
59506D97308n329n420n387n467n461m959m116l517l255k815j909r19k89O3M90
59491D49018J091J563J422M05j101k168k106j146p0O11R10J003J104J467K062
$$ y = [439332, 442012, 443999, 445230, 445842, 446089, 446297, 446741, 447484, 448437, 449643, 451204, 452825, 453871, 454150, 454127, 453977, 453005, 450715, 447989, 446355, 446282, 447016, 447846, 448596, 448909, 448159, 446374, 444448, 443143, 442504, 442368, 442662, 442977, 442692, 441850, 441199, 440959, 440371, 438988, 437664, 437557, 438704, 440339, 442179, 444551, 447434, 450138, 452052, 453173, 453887, 454589, 455624, 457281, 459658, 462586, 465648, 468392, 470763, 473460, 477529, 483413, 490704, 499037, 508867, 520834, 534394, 547412, 557285, 562434, 562904, 559855, 554667, 548464, 542236, 537015, 533543, 531783, 530965, 530233, 529213, 528069, 527233, 526984, 527040, 526656, 525344, 523395, 521338, 519082, 516010, 511906, 507216, 502361, 497308, 491979, 486559, 481172, 475705, 470244, 465285, 461169, 457652, 454397, 451582, 449673, 448754, 448465, 448528, 449018, 450109, 451672, 453094, 453499, 452398, 450230, 448124, 446978, 446908, 447519, 448429, 449432, 450536, 452003, 454065]
59476D54065K396K100J650J857K744L484L534L238L146L273L321L170K826K266
59462D93070J651J395J674K094K204K206K661L551M133L930L496L724M611N221
59448E35621M884L971L201K658J912Q14l54j380k254k828k868k511k236k272k377
59433E33981k312k083j638p77M82J745K629L076L252L454M045N152O442P548Q613
59418E73609R942J1343J2375J3087J3933J5113J6573J8236J9313J7810J2249M048
59406G37631l202p220q677r156r010p826n541k190K181O277P470M269j823p951
59392F95232j2513j5259j6000j4786j2707j0986r586p841n944m560l497k145q30
59379E78578l57m92k61M00O97N49P32J428J988K185K420K621K167J186O67R68
$$ y = [454065, 456461, 458561, 460211, 462068, 464812, 468296, 471830, 475068, 478214, 481487, 484808, 487978, 490804, 493070, 494721, 496116, 497790, 499884, 502088, 504294, 506955, 510506, 514639, 518569, 522065, 525789, 530400, 535621, 540505, 544476, 547677, 550335, 552247, 553061, 552707, 551327, 549073, 546245, 543377, 540866, 538630, 536358, 533981, 531669, 529586, 527948, 527171, 527653, 529398, 532027, 535103, 538355, 541809, 545854, 551006, 557448, 564996, 573609, 583551, 594894, 607269, 620356, 634289, 649402, 665975, 684211, 703524, 721334, 733583, 737631, 734429, 727209, 718532, 709376, 700366, 692540, 686999, 684809, 686990, 693267, 700737, 705006, 703183, 695232, 682719, 667460, 651460, 636674, 623967, 612981, 603395, 595554, 589610, 585050, 581553, 579408, 578578, 578221, 577729, 577468, 577868, 578565, 579114, 579846, 581274, 583262, 585447, 587867, 590488, 592655, 593841, 594508, 595476]
59363E95476J325J227J223J870K877L665M082M186M052M041M542N307N747N977
59349F45597O702Q015R187R833J0320J0748J0548R475Q108O956N820M484L234
59336G49027K228J074n23k283l919n544p209q586r466r940r908r114p928p315
59322F70594p601q025p904p462p039o375n344m656m933n599n531m467l054j770
59308E90834o17L46R41J418K350L835N125N294L979J405j945n418q159r455r336
59293E80597q629q136p793o971n528m110l184k439j486n68k8M68J377K373K732
59278E38675K494K395K844L670M763O136P421Q139Q497R055R579R146P568N811
59264F26193M749M256L869L530L241K637J429j14j539k649l398l789m036m440
$$ y = [595476, 596801, 598028, 599251, 601121, 603998, 607663, 611745, 615931, 619983, 624024, 628566, 633873, 639620, 645597, 652299, 660314, 669501, 679334, 689654, 700402, 710950, 720425, 728533, 735489, 741309, 745793, 749027, 751255, 752329, 751806, 749523, 745604, 740060, 732851, 724265, 714799, 704859, 694951, 685837, 677909, 670594, 662993, 654968, 647064, 639602, 632563, 626188, 620844, 616188, 611255, 605656, 600125, 595658, 592604, 590834, 590217, 590563, 591504, 592922, 595272, 599107, 604232, 609526, 613505, 614910, 612965, 607547, 599388, 589933, 580597, 571968, 563832, 556039, 549068, 543540, 539430, 536246, 533807, 532321, 531753, 531725, 532193, 533570, 535943, 538675, 541169, 543564, 546408, 550078, 554841, 560977, 568398, 576537, 585034, 594089, 603668, 612814, 620382, 626193, 630942, 635198, 639067, 642597, 645838, 648475, 649904, 649790, 648251, 645602, 642204, 638415, 634379, 629939]
59250F29939m865m781m032l100k460k101j797j427q95j62N84J121J562K130K670
59235F12386K868K768K599K231J499Q06O62Q09N84j2m84r83k158l896n217n653
59219F08809n697n755n660n429n467n681n452m815m582m905m821l788k625k260
59205E41872k433k384j971j422p28j1K37p3k00L32Q85O75m8m73l63J2N87J396
59187E35890K124K436K463K457K328K031J951K369K858K845K455K269K536L018
59173E70030L418L554L315K790K276J993J995K319K830K985K362J400R69J125
59159F03361J037K61q03j795k819l777m281m532n232o209o346n400m743n437o619
59144E46666o745n600m136l026k355k106k082j834j429j638k721l715l730l106
$$ y = [629939, 625074, 620293, 616261, 613161, 610701, 608600, 606803, 605376, 604481, 604319, 604903, 606024, 607586, 609716, 612386, 615254, 618022, 620621, 622852, 624351, 625157, 625819, 626628, 627212, 627200, 626716, 625733, 623575, 619679, 614462, 608809, 603112, 597357, 591697, 586268, 580801, 575120, 569668, 564853, 560271, 555366, 550545, 546757, 544132, 541872, 539439, 537055, 535084, 533662, 532934, 532923, 533160, 533087, 532887, 533219, 534104, 534779, 534731, 534258, 533895, 533907, 534494, 535890, 538014, 540450, 542913, 545370, 547698, 549729, 551680, 554049, 556907, 559752, 562207, 564476, 567012, 570030, 573448, 577002, 580317, 583107, 585383, 587376, 589371, 591690, 594520, 597505, 599867, 601267, 602236, 603361, 604398, 604659, 603856, 602061, 599242, 595465, 591184, 586652, 581420, 575211, 568865, 563465, 558722, 553285, 546666, 539921, 534321, 530185, 527159, 524804, 522698, 520616, 518782, 517353, 515715, 512994, 509279, 505549, 502443]
59130E02443k453j481P7J248R80K8K01J839L466L948L789L996M733N487N907O038
59114E40246O098O268O528O689O788P102P575P619O882N838N140M778M335L657
59100F25543K773J613L05o13r04j126j803k594k826k573k439k651k934l030k781
59085F03960k028r77l55o34j443k187k833l555m167m485m802n261n259m281k946
59070E58747k395k879l614l875l560k902k251k002k226k487k405k095j801j561
59056E22694j517j952k617k669j806p86l00j02J50P5n99j177j027o28o36n78K84
59039E06809J400J517N36m07n09M1P98J425J604J402J567K529L570L858L895M779
59023E34814O386P478P517P154P001O979O928O834O394N279L881K937K465J868
$$ y = [502443, 499990, 498509, 498586, 499834, 500814, 500842, 501043, 502882, 506348, 510296, 514085, 518081, 522814, 528301, 534208, 540246, 546344, 552612, 559140, 565829, 572617, 579719, 587294, 594913, 601795, 607633, 612773, 617551, 621886, 625543, 628316, 629929, 630234, 629621, 628717, 627591, 625788, 623194, 620368, 617795, 615356, 612705, 609771, 606741, 603960, 601932, 600955, 600600, 599966, 598523, 596336, 593503, 589948, 585781, 581296, 576494, 571233, 565974, 561693, 558747, 556352, 553473, 549859, 545984, 542424, 539522, 537271, 535269, 533043, 530556, 528151, 526056, 524255, 522694, 521177, 519225, 516608, 513939, 512133, 511347, 511047, 510945, 511095, 511170, 510571, 509394, 508367, 507739, 507103, 506525, 506809, 508209, 509726, 510262, 509855, 509346, 509387, 510185, 511610, 513214, 514616, 516183, 518712, 522282, 526140, 530035, 534814, 541200, 548678, 556195, 563349, 570350, 577329, 584257, 591091, 597485, 602764, 606645, 609582, 612047, 613915]
59009F13915J013L34m2m09p55p29l55J3L60R67J748K368K819L223L344L021K722
58992F33557K866K940K217R88J50j41l06k51L68J024P14n01j524j706j273l45
58976F38777J208K876L688L583L591M406N659O740P471P807P657P223O814O403
58962G13903N921N821O443P131O923N923M919L930K267j03k485m657o924q966
58948G40046r985j0125j0431j1196j1516j0820r633q552p586o808o547o566o035
58935F24246m704l230k135j348q80r15j051n92K18L96j52m63j89j21o41r61o07
58918F06871l18p51j269r47J3O98P65O45Q97J780L081M099M326M199M533N287
58902F33909N721N764O157P136Q035Q483Q861R333R491R340R546J0240J0658J0416
$$ y = [613915, 614928, 615262, 615220, 614811, 614056, 613327, 612972, 612985, 613345, 614312, 616060, 618428, 621247, 624470, 627814, 630835, 633557, 636423, 639363, 641580, 642568, 642718, 642577, 642271, 642020, 642388, 643412, 644126, 643625, 642101, 640395, 639122, 638777, 639985, 642861, 646549, 650132, 653723, 658129, 663788, 670528, 677999, 685806, 693463, 700686, 707500, 713903, 719824, 725645, 732088, 739219, 746142, 752065, 756984, 760914, 763181, 763078, 760593, 755936, 749012, 740046, 730061, 719936, 709505, 698309, 686793, 675973, 666340, 657788, 650202, 643394, 636847, 630281, 624246, 619542, 616312, 614177, 612829, 611949, 611034, 609983, 609391, 609609, 610005, 609853, 609390, 609201, 609080, 608439, 607478, 606871, 606553, 605802, 604533, 603586, 603599, 604297, 605062, 605707, 606604, 608384, 611465, 615564, 619890, 624089, 628622, 633909, 639630, 645394, 651551, 658687, 666722, 675205, 684066, 693399, 702890, 712230, 721776, 732016, 742674, 753090]
58888G53090J0209J0686J1572J2373J3024J3351J2798J1213R171P124M986K807
58876H72404Q55j142l767o605q380q831r228j0461j1794j2152j1503j0265q499
58863G70632o574n477n578n965n828n598n865o160n846n397n702o668p493p831
58849F84650p835p551p066o777o828o721o104n400n035m668l938l346l557m284
58835F05540m678m529m368m530m747m566l814k741j911j668j636j227n05K8M75
58820E65123J460K853L610L224K402J922J761J697J889K250K202J588R99P32L23
58805E94035m10q25o10m97j123k021k463k575k831l157l266l281l378l435l487
58790E60676l839m300m094l078k168j975j871j025L68J572K258K416K062J543
$$ y = [753090, 763299, 773985, 785557, 797930, 810954, 824305, 837103, 848316, 857487, 864611, 869597, 872404, 873259, 872117, 868350, 861745, 853365, 844534, 835306, 824845, 813051, 800899, 789396, 779131, 770632, 764058, 758581, 753003, 747038, 741210, 735612, 729747, 723587, 717741, 712344, 706642, 699974, 692481, 684650, 676815, 669264, 662198, 655421, 648593, 641872, 635768, 630368, 625333, 620665, 616727, 613381, 609824, 605540, 600862, 596333, 591965, 587435, 582688, 578122, 574308, 571567, 569656, 567988, 566352, 565125, 564620, 564648, 565123, 566583, 569436, 573046, 576270, 578672, 580594, 582355, 584052, 585941, 588191, 590393, 591981, 592980, 593712, 594035, 593625, 592800, 592190, 591693, 590570, 588549, 586086, 583511, 580680, 577523, 574257, 570976, 567598, 564163, 560676, 556837, 552537, 548443, 545365, 543197, 541222, 539351, 538326, 538694, 540266, 542524, 544940, 547002, 548545]
58776E48545J417J573J327P10N94J050Q96m83k087k893l314m067m751m633l986
58761E29898l535l295k934k490j962r72L18R62O76N24J221J921J729J304J615
58746E24980K250K304K119K555L299L464L271L610M342M488L936L543L720M105
58732E71986M501N019N420N281M774M369L997L268K322J695J551J704K058K398
58718F20343K251J642J424K096K838K568J518R60J581K827L489K607L19j879k543
58703F42041k171k698m688o549p161p631r202j1015j1519j0903j0350r836q542
58690E39776o790n787n758n889n831n776n451m409l090k321k041j682j385j586
58676D81980j848j405n42j10n6L61J218K020K720L522M089M176M539N909P536
$$ y = [548545, 549962, 551535, 552862, 553572, 554166, 555216, 556112, 555629, 553542, 550649, 547335, 543268, 538517, 533884, 529898, 526363, 523068, 520134, 517644, 515682, 514710, 515028, 515990, 516666, 517190, 518411, 520332, 522061, 523365, 524980, 527230, 529534, 531653, 534208, 537507, 540971, 544242, 547852, 552194, 556682, 560618, 564161, 567881, 571986, 576487, 581506, 586926, 592207, 596981, 601350, 605347, 608615, 610937, 612632, 614183, 615887, 617945, 620343, 622594, 624236, 625660, 627756, 630594, 633162, 634680, 635640, 637221, 640048, 643537, 646144, 646463, 644584, 642041, 639870, 637172, 632484, 625935, 618774, 611143, 601941, 590926, 579407, 568504, 558154, 548318, 539776, 532986, 527199, 521441, 515552, 509721, 503945, 498494, 494085, 490995, 488674, 486633, 484951, 483566, 481980, 480132, 478727, 478185, 478075, 478019, 478380, 479598, 481618, 484338, 487860, 491949, 496125, 500664, 506573, 514109]
58661E14109Q116P641O957N950L797P49j905l570m662n288n054m108l186k596
58647E16950k208k208k716l002k368j493j586k384k468j435m05l44j046j785j914
58632D89588r40R56K591K956K478K147J890J009k01o22J10J362K524L252L136
58617E12236K412K417L957N747N940M751L914L962L807K889J907J362R38N44N20
58602E57303P07N33J08K1J67%k33J41P73O67r5m50n6M85J068K285M108N690O588
58583E79810P083P288P095O825O869O937O692O648P157P267O100M731M894O283
58569F71679P044O672O445P115Q191R471J1388J3605J5024J5483J5816J6209J6042
58556H20184J5309J4493J3151J0399O793L870J823m22k842m105m024m114n191
$$ y = [514109, 522225, 529866, 536823, 542773, 546570, 547319, 545414, 541844, 537182, 531894, 526840, 522732, 519546, 516950, 514742, 512534, 509818, 506816, 504448, 502955, 501369, 498985, 496517, 495082, 494677, 494333, 493287, 491502, 489588, 488648, 489604, 492195, 495151, 497629, 499776, 501666, 502675, 502474, 501852, 501962, 503324, 505848, 509100, 512236, 514648, 517065, 521022, 526769, 532709, 537460, 541374, 545336, 549143, 552032, 553939, 555301, 556239, 556783, 557303, 558010, 558543, 558651, 558672, 558839, 558839, 558606, 558747, 559520, 560187, 560092, 559642, 559586, 560071, 561139, 563424, 567532, 573222, 579810, 586893, 594181, 601276, 608101, 614970, 621907, 628599, 635247, 642404, 649671, 655771, 660502, 665396, 671679, 678723, 685395, 691840, 698955, 707146, 716617, 728005, 741610, 756634, 772117, 787933, 804142, 820184, 835493, 849986, 863137, 873536, 880329, 884199, 886022, 885600, 882758, 878653, 874629, 870515, 865324]
58543H65324o318o634o594o779p138p891r623j1982j3676j4110j3747j2798j1089
58530G36945r240q275p929p037n634m914m973m596l514k841k892k555j369l98
58516F70778m08q58j230j717k134j833j131j193k049k437j917j456j572j635j404
58501F47804j468j813j635r62p02q28l44O74R70L54J23P84J352J321J437K038
58485F49105K545K997M137N693O539O833P872R558J0332R946R832J0274R772P872
58471G53307O035M878L133L05k105l115l702m602n035m619m326m467l938k449
58457G29300j225m92J196M045N999N954N486N921O163N030L439K426J166j179
58443G73229l520m521m634m870n066m714l968k740n16J995K964K194J734K753
$$ y = [865324, 859006, 852372, 845778, 838999, 831861, 823970, 814347, 802365, 788689, 774579, 760832, 748034, 736945, 727705, 719430, 711501, 704464, 698830, 693916, 688943, 684347, 680833, 677992, 675100, 672545, 671176, 670778, 670370, 669512, 668282, 666565, 664431, 662598, 661467, 660274, 658225, 655788, 653871, 652415, 650843, 649208, 647804, 646336, 644523, 642888, 641926, 641224, 640396, 640052, 640726, 641696, 642050, 642173, 642957, 644309, 645630, 647067, 649105, 651650, 654647, 658784, 664477, 671016, 677849, 685721, 695279, 705611, 715557, 725389, 735663, 745435, 753307, 759342, 764220, 767353, 767658, 765553, 762438, 758736, 754134, 749099, 744480, 740154, 735687, 731749, 729300, 728075, 727583, 728779, 732824, 738823, 744777, 750263, 756184, 762347, 767377, 770816, 773242, 774408, 773229, 769709, 765188, 760554, 755684, 750618, 745904, 741936, 739196, 738680, 740675, 743639, 745833, 747567, 750320]
58429G50320L940M061L800L861L626K967L083M136M447L365K499K728K561R96
58415G96390n79j103j799l562m903m553l774m024m538m272l980m335m150k530
58401G48288p34M1O42J880K748K604K837M299N397M834L918M038M271L690L586
58386G92339M930O010N164L681L453L879L678L571M519N252M292K605J778J414
58372H46565P86J030L116N502O411O619P521Q382Q056P503Q063R000R140R127
58358I36821R750J0070R440R205J0025R908P435M603L812M388M694N124O277O722
58344A038274N562M785O013P512P368P022Q358J0036J0177J0161J2034J4520J5355
58331A157177J5263J5992J6614J5504J3838J3404J3178J1677J0305J0648J0898
$$ y = [750320, 754260, 758321, 762121, 765982, 769608, 772575, 775658, 779794, 784241, 787606, 790105, 792833, 795394, 796390, 795811, 794708, 792909, 789347, 784444, 779891, 776117, 772093, 767555, 763283, 759303, 754968, 750818, 748288, 747554, 747595, 748237, 750117, 752865, 755469, 758306, 762605, 768002, 772836, 776754, 780792, 785063, 788753, 792339, 797269, 803279, 808443, 812124, 815577, 819456, 823134, 826705, 831224, 836476, 840768, 843373, 845151, 846565, 847351, 848381, 851497, 856999, 863410, 870029, 877550, 885932, 893988, 901491, 909554, 918554, 927694, 936821, 946571, 956641, 966081, 975286, 985311, 995219, 1002654, 1007257, 1011069, 1015457, 1020151, 1025275, 1031552, 1038274, 1043836, 1048621, 1054634, 1062146, 1069514, 1076536, 1084894, 1094930, 1105107, 1115268, 1127302, 1141822, 1157177, 1172440, 1188432, 1205046, 1220550, 1234388, 1247792, 1260970, 1272647, 1282952, 1293600, 1304498]
58320A304498Q994O893P434R314R599R039J0349J3040J4575J4997J6049J7178
58308A441959J6745J5791J6505J8368J9573K0528K2293K3510K2820K2135K3606
58297A663833K5647K5889K5621K7043K8880K9100K9265L1501L3948L4102L3908
58286A988737L6356L9867M1294M1752M3980M6685M7209M7183M9601N2933N4042
58275B489639N4470N7664O2447O5461O7558P1582P6317P9036Q1469Q6799R3398
58264C285840R8158J03103J11752J21941J29519J36198J46044J57184J64957J70570
58254D625266J78498J88048J95833K03775K16005K30471K42459K53642K68690
58245F602687K85887L00430L14037L31471L50756L67052L82899M03710M26335
$$ y = [1304498, 1313492, 1320385, 1327819, 1337133, 1346732, 1355771, 1366120, 1379160, 1393735, 1408732, 1424781, 1441959, 1458704, 1474495, 1491000, 1509368, 1528941, 1549469, 1571762, 1595272, 1618092, 1640227, 1663833, 1689480, 1715369, 1740990, 1768033, 1796913, 1826013, 1855278, 1886779, 1920727, 1954829, 1988737, 2025093, 2064960, 2106254, 2148006, 2191986, 2238671, 2285880, 2333063, 2382664, 2435597, 2489639, 2544109, 2601773, 2664220, 2729681, 2797239, 2868821, 2945138, 3024174, 3105643, 3192442, 3285840, 3383998, 3487101, 3598853, 3720794, 3850313, 3986511, 4132555, 4289739, 4454696, 4625266, 4803764, 4991812, 5187645, 5391420, 5607425, 5837896, 6080355, 6333997, 6602687, 6888574, 7189004, 7503041, 7834512, 8185268, 8552320, 8935219, 9338929, 9765264]
58236I765264M43527M56765M72812M90785N05146N18504N38093N62138N83264
58227A4336298O02942O28423O57961O83930P08392P40150P78439Q15138Q50943
58218B0802616Q93007R39306R82820J028686J088860J162645J241839J331467
58210B9471246J443672J574347J709359J851614K017970K213296K435076K700063
58202D5416643L035738L447683L927457M489208N162096N950570O844090P863802
58194H6137287R055136J0441044J2034632J3881712J6015085J8377948K0874041
58187A86816885K3415789K5655336K6566794K4617616J8819827R769681m97451
58180C15164477r783723j6869890k1596347k4249546k5130701k4555365k2927272
$$ y = [9765264, 10208791, 10665556, 11138368, 11629153, 12134299, 12652803, 13190896, 13753034, 14336298, 14939240, 15567663, 16225624, 16909554, 17617946, 18358096, 19136535, 19951673, 20802616, 21695623, 22634929, 23617749, 24646435, 25735295, 26897940, 28139779, 29471246, 30914918, 32489265, 34198624, 36050238, 38068208, 40281504, 42716580, 45416643, 48452381, 51900064, 55827521, 60316729, 65478825, 71429395, 78273485, 86137287, 95192423, 105633467, 117668099, 131549811, 147564896, 165942844, 186816885, 210232674, 235888010, 262454804, 287072420, 305892247, 315661928, 315164477, 305380754, 288510864, 266914517, 242664971, 217534270, 192978905, 170051633]
58173A70051633k0668188j8131758j5598645j3273148j1248984r523939q070604
58166G3536367o870118n888831n075111m394170l835293l380090k995152k661141
58158C8436461k380064k148031j946686j766171j611822j482623j365011j252930
58150B4483123j153571j068666r88962r11423q43840p88241p36470o86032o44137
58141A6661781o12271n81970n49723n21640m99726m77351m52002m29357m11190
58132A2126551l91792l69844l51721l39481l27038l11593k97844k87595k76000
58123I173643k61404k48582k38944k27540k13011k00793j93156j85493j75653
58114G229067j67842j63991j60036j54128j49945j48631j45771j39752j35122
$$ y = [170051633, 149383445, 131251687, 115653042, 102379894, 91130910, 81606971, 73536367, 66666249, 60777418, 55702307, 51308137, 47472844, 44092754, 41097602, 38436461, 36056397, 33908366, 31961680, 30195509, 28583687, 27101064, 25736053, 24483123, 23329552, 22260886, 21271924, 20360501, 19516661, 18728420, 17991950, 17305918, 16661781, 16049510, 15467540, 14917817, 14396177, 13896451, 13419100, 12967098, 12537741, 12126551, 11734759, 11364915, 11013194, 10673713, 10346675, 10035082, 9737238, 9449643, 9173643, 8912239, 8663657, 8424713, 8197173, 7984162, 7783369, 7590213, 7404720, 7229067, 7061225, 6897234, 6737198, 6583070, 6433125, 6284494, 6138723, 5998971, 5863849]
58105E863849j34230j33301j30049j27634j27575j26146j21369j16698j14236
58096D732611j10886j04743r8851r5211r1179q5108p9731p6764p3847o9836o7411
58085C779044o7503o6790o3762o1661o2419o3147o1807o0883o2110o2766o0668
58074C085528n8026n6916n5522n2310m9537m9217m9594m8740m7837m7909m7124
58063B522796m4317m1612m0741m0173l8506l7182l7373l7565l6640l6024l6480
58052B096183l6149l4001l1875l0962k9714k7333k5832k6428k7254k6873k6725
58041A773037k7906k8827k8214k7257k6725k5298k2715k1227k1795k2279k1476
58030A499318k1444k3520k5506k5363k4372k4119k3538k1626k0009k0134k0610
$$ y = [5863849, 5729619, 5596318, 5466269, 5338635, 5211060, 5084914, 4963545, 4846847, 4732611, 4621725, 4516982, 4418131, 4322920, 4231741, 4146633, 4066902, 3990138, 3916291, 3846455, 3779044, 3711541, 3644751, 3580989, 3519328, 3456909, 3393762, 3331955, 3271072, 3208962, 3146196, 3085528, 3027502, 2970586, 2915064, 2862754, 2813217, 2764000, 2714406, 2665666, 2617829, 2569920, 2522796, 2478479, 2436867, 2396126, 2355953, 2317447, 2280265, 2242892, 2205327, 2168687, 2132663, 2096183, 2060034, 2026033, 1994158, 1963196, 1933482, 1906149, 1880317, 1853889, 1826635, 1799762, 1773037, 1745131, 1716304, 1688090, 1660833, 1634108, 1608810, 1586095, 1564868, 1543073, 1520794, 1499318, 1477874, 1454354, 1428848, 1403485, 1379113, 1354994, 1331456, 1309830, 1289821, 1269687, 1249077]
58019A249077j9967j9249j9433j9085j7189j5604j5971j6741j5956j4518j4076
58008A061288j3983j2993j1874j1727j1729j0909j0228j0605j0908j0049r152
57997I37131r450j0040r861r759j0488j0736r493q310q923j0381j0865j0583j0667
57984H07575j0893j0627j0427j0747j0655r710r311j0328j1221j0471r086q623
57972F85476q617p965p144o997o885o102n437n498n194l822k859l596m756m600
57958F06004l722l637m140m241m230m692m907m312m097n274o528o134m671l771
57944E41648l525l199l104l652l790k526q73k45p8Q88K228K765K805L322L843
57929E36507L186J472m00k342m430n766n759n502o070o645o088n219n457o325
$$ y = [1249077, 1229110, 1209861, 1190428, 1171343, 1154154, 1138550, 1122579, 1105838, 1089882, 1075364, 1061288, 1047305, 1034312, 1022438, 1010711, 998982, 988073, 977845, 967240, 956332, 946283, 937131, 927681, 917641, 907780, 898021, 887533, 876797, 867304, 858994, 850071, 839690, 828825, 818242, 807575, 796682, 786055, 775628, 764881, 754226, 744516, 735205, 724877, 713656, 703185, 694099, 685476, 676859, 668894, 661750, 654753, 647868, 641766, 636329, 630831, 625637, 621815, 618956, 615360, 610604, 606004, 602282, 598645, 594505, 590264, 586034, 581342, 576435, 572123, 568026, 562752, 556224, 550090, 545419, 541648, 538123, 534924, 531820, 528168, 524378, 521852, 520979, 520734, 520656, 521544, 523772, 526537, 529342, 532664, 536507, 539693, 541165, 540765, 538423, 533993, 528227, 522468, 516966, 510896, 504251, 498163, 492944, 487487, 481162]
57915D81162o377n689n361n366m896m090l585l017j796o45o08j265j503j363j492
57900D34109j640j321j109j643k219j928j290j151j035k82K22o63k171k684k129
57885D13066j619j446j223j179j679k127k049k288l546m701m388l293l005l529
57871C76994l794l714l819l658k645j593j472j436k07J467J940J492J683K557
57857C63795K880K728L338M561M899M066L279K968K326J305R31J293J149p8j510
57842C97930k379k849l097l037l039l648m421m391l614l011k821k593k474k995
57828C53561l639l172j545n4M83N21O36P30N24l4q26j392j154m48n78j973l275
57811C38365l352l054l600m411m342l976m557n458m967l158j718j209o41L82J137
$$ y = [481162, 474785, 469096, 463735, 458369, 453473, 449383, 445798, 442781, 440985, 440340, 439732, 438467, 436964, 435601, 434109, 432469, 431148, 430039, 428396, 426177, 424249, 422959, 421808, 420773, 420491, 420713, 420050, 417879, 415195, 413066, 411447, 410001, 408778, 407599, 405920, 403793, 401744, 399456, 395910, 391209, 386821, 383528, 380523, 376994, 373200, 369486, 365667, 362009, 359364, 357771, 356299, 354863, 354656, 356123, 358063, 359555, 361238, 363795, 366675, 369403, 372741, 377302, 382201, 386267, 389546, 392514, 394840, 396145, 397076, 398369, 399518, 399440, 397930, 395551, 392702, 389605, 386568, 383529, 379881, 375460, 371069, 367455, 364444, 361623, 359030, 356556, 353561, 349922, 346750, 345205, 345151, 345634, 346155, 346791, 347521, 348045, 348011, 347185, 345793, 344639, 344191, 343613, 341640, 338365, 335013, 331959, 328359, 323948, 319606, 315630, 311073, 305615, 300648, 297490, 295772, 294563, 293922, 294304, 295441]
57796B95441J402J657J741J182P20J572L193L772K964K221K328K607K738L300
57782C26838M184M402L896L797M420M700M060L175K468J479J31r07j511k246k987
57767C55899k939k332k395l281l737l285k991l424l646k979k259k372k921l120
57753C14218k920k458j567m52J93K80N64J282J679J311P64N96O67Q90J533K277
57737C18857K116P55q10j533j309m94N56J292J329J208J788K832L322L121K993
57722C36023K966K268J045N42J054J288L25j150k187k671k692k173j715k329l691
57707C26903m124l038j904j956k454k241j624j498j762j821j765j857j657q00
57693B98402M6np80j469j725j627j091j57O80J078J380J973K656L147L636M365
$$ y = [295441, 296843, 298500, 300241, 301423, 302143, 303715, 306908, 310680, 313644, 315865, 318193, 320800, 323538, 326838, 331022, 335424, 339320, 343117, 347537, 352237, 356297, 359472, 361940, 363419, 363550, 362643, 361132, 358886, 355899, 352960, 350628, 348233, 344952, 341215, 337930, 334939, 331515, 327869, 324890, 322631, 320259, 317338, 314218, 311298, 308840, 307273, 306821, 307014, 307294, 307858, 309140, 310819, 312130, 312894, 313490, 314157, 315047, 316580, 318857, 320973, 321728, 320918, 319385, 318076, 317582, 318138, 319430, 320759, 321967, 323755, 326587, 329909, 333030, 336023, 338989, 341257, 342302, 342844, 343898, 345186, 345511, 344361, 342174, 339503, 336811, 334638, 332923, 330594, 326903, 322779, 319741, 317837, 315881, 313427, 311186, 309562, 308064, 306302, 304481, 302716, 300859, 299202, 298402, 298448, 298443, 297663, 296194, 294469, 292842, 291751, 291594, 292274, 293352, 294732, 296705, 299361, 302508, 306144, 310509]
57677C10509N214O169P623R784J2323J4964J7821K0921K4035K7352L1461L6133
57665E24309L9649L9729L4787K4511J0270m852j7508k6197l1474l4199l4587l3025
57653D91413l0419k7263k3394j9142j5620j3398j1896j0558r558q842p641n647
57641C08035l664k432j760j341j444k031k242j541n58j02j29l48q37j497j714
57626B86395j365j236j754k209j999j712k102k834l110k850k423j854j144o98
57612B59105o91o68m49o56j594k379k131j290q45q44o97m38o56j419k199k686
57596B39463k983l114k870k186j316p76j125k359l542l627k751j917j451p75J55
57581B08826M94L7k41K07N32%p13p28m12n40q59o77k27k70q12j225j264j072o37
$$ y = [310509, 315723, 321892, 329515, 339299, 351622, 366586, 384407, 405328, 429363, 456715, 488176, 524309, 563958, 603687, 638474, 662985, 673255, 668403, 650895, 624698, 593224, 559025, 524438, 491413, 460994, 433731, 410337, 391195, 375575, 362177, 350281, 339723, 330165, 321323, 313682, 308035, 304371, 301939, 300179, 298838, 297394, 295363, 293121, 291580, 291022, 290920, 290791, 290443, 289606, 288109, 286395, 285030, 283794, 282040, 279831, 277832, 276120, 274018, 271184, 268074, 265224, 262801, 260947, 259803, 259105, 258414, 257746, 257297, 256641, 255047, 252668, 250537, 249247, 248402, 247558, 246861, 246423, 245767, 244348, 242149, 239463, 236480, 233366, 230496, 228310, 226994, 226218, 225093, 222734, 219192, 215565, 212814, 210897, 209446, 208671, 208826, 209320, 209357, 209116, 209323, 209855, 209855, 209142, 208414, 208002, 207462, 206603, 205926, 205699, 205429, 204617, 203392, 202128, 201056, 200419]
57562B00419l2J79l45r89r15k00M17N30K77o0r0N44J596K293K315K145K097J870
57544B12051J456J409J701J402K59n20o0P10M99l91q18p42j021j791k308k122
57528B09714j405m60K52J13p47j141l86N11K80o56r35k95L75P25J197J798J912
57511B10852J383P84N57O91J080J428J086j30j263j289n65k70o83j019p95l27
57495B11520J1J35l5l70k15R43K599L796M268M331M010L206K412K281K582K505
57479B43979J783Q28km77k33O81J347R99J49k86m74j205k290k710k174j337o12
57462B37966Q3M81J76l72k40M57O73J43k15J59P05Q47Q27R67J020P05K06j92l39
57443B44057j8Q63J729J790J107N26M57N32N22O56Q84P30J65j90o4pm42r73r83
$$ y = [200419, 200387, 200566, 200221, 199232, 198317, 198117, 198534, 199064, 199341, 199281, 199191, 199735, 201331, 203624, 205939, 208084, 210181, 212051, 213507, 214916, 216617, 218019, 218278, 217758, 217698, 218408, 218907, 218516, 217698, 216956, 215935, 214144, 211836, 209714, 208309, 207849, 208101, 208214, 207467, 206326, 205940, 206451, 206731, 206075, 205140, 204845, 205220, 205945, 207142, 208940, 210852, 212235, 213019, 213576, 214267, 215347, 216775, 217861, 217731, 216468, 215179, 214614, 214344, 213661, 212642, 211847, 211520, 211531, 211666, 211631, 211261, 211046, 211989, 214588, 218384, 222652, 226983, 230993, 234199, 236611, 238892, 241474, 243979, 245762, 246590, 246588, 246111, 245878, 246559, 247906, 248905, 249054, 248768, 248294, 247089, 244799, 242089, 239915, 238578, 237966, 238049, 238530, 238706, 238334, 238094, 238551, 239224, 239367, 239152, 239311, 240016, 240863, 241690, 242657, 243677, 244382, 244588, 244396, 244057, 244039, 244902, 246631, 248421, 249528, 250054, 250511, 251043, 251565, 252221, 253105, 253835, 254000, 253810, 253746, 253739, 253297, 252324, 251341]
57424B51341m43K47P34Q72P36O49Q15R66Q09O39Q76J144O79l61q58j89J020J830
57406B61506J915J414N79p0L3P81J372J358J184J442K045K521K671K546K108J349
57390B84754O50O77J783L484M650M458L256K183J873J987K124K523L373M182M456
57375C26413M508M793M996M596L951L864M353M697M531M034L321K535K242K760
57361C81594L364L114K294J958K273K495K494K996M129M954M803M070L366K842
57347D26746K614K947L621L968L892M095M965N954O384O175N562M731M056L986
57333D89696M426M808M927N114N535N960O336O855P341P330O861O491O342N948
57319E73970N163M492M358M768N764P346Q850R248Q375P157O421O268O616P435
$$ y = [251341, 250898, 251145, 251879, 252751, 253487, 254136, 254951, 255917, 256726, 257365, 258241, 259385, 260064, 259703, 258845, 258656, 259676, 261506, 263421, 264835, 265414, 265344, 265377, 266158, 267530, 268888, 270072, 271514, 273559, 276080, 278751, 281297, 283405, 284754, 285404, 286081, 287864, 291348, 295998, 300456, 303712, 305895, 307768, 309755, 311879, 314402, 317775, 321957, 326413, 330921, 335714, 340710, 345306, 349257, 353121, 357474, 362171, 366702, 370736, 374057, 376592, 378834, 381594, 384958, 388072, 390366, 392324, 394597, 397092, 399586, 402582, 406711, 411665, 416468, 420538, 423904, 426746, 429360, 432307, 435928, 439896, 443788, 447883, 452848, 458802, 465186, 471361, 476923, 481654, 485710, 489696, 494122, 498930, 503857, 508971, 514506, 520466, 526802, 533657, 540998, 548328, 555189, 561680, 568022, 573970, 579133, 583625, 587983, 592751, 598515, 605861, 614711, 623959, 632334, 639491, 645912, 652180, 658796, 666231]
57305F66231Q268Q501Q343Q631R388R659R066Q505Q796R539R988J0139J0348J0579
57291G95981J0653J0721J0924J1083J1117J1283J1686J2112J2572J3333J4164
57280I25629J4361J3810J3278J3250J3236J2646J1547J0156Q425O707N932O474
57268A055451P500Q167Q824J0313J2572J4754J6440J7987J9766K1585K2900K3443
57256A239702K3681K4505K6158K7694K8139K7936K8366K9612L0563L0676L0829
57245A547861L1806L3096L3907L4452L5376L6637L7777L8755L9767M0664M1211
57234A951309M1496M1677M1786M2188M3540M5768M7747M8616M8811M9215M9969
57223B452122N0750N1632N2806N3954N4718N5451N6825N8909O1239O3459O5322
$$ y = [666231, 674499, 683000, 691343, 699974, 709362, 719021, 728087, 736592, 745388, 754927, 764915, 775054, 785402, 795981, 806634, 817355, 828279, 839362, 850479, 861762, 873448, 885560, 898132, 911465, 925629, 939990, 953800, 967078, 980328, 993564, 1006210, 1017757, 1027913, 1036338, 1043045, 1048977, 1055451, 1062951, 1071118, 1079942, 1090255, 1102827, 1117581, 1134021, 1152008, 1171774, 1193359, 1216259, 1239702, 1263383, 1287888, 1314046, 1341740, 1369879, 1397815, 1426181, 1455793, 1486356, 1517032, 1547861, 1579667, 1612763, 1646670, 1681122, 1716498, 1753135, 1790912, 1829667, 1869434, 1910098, 1951309, 1992805, 2034482, 2076268, 2118456, 2161996, 2207764, 2255511, 2304127, 2352938, 2402153, 2452122, 2502872, 2554504, 2607310, 2661264, 2715982, 2771433, 2828258, 2887167, 2948406, 3011865, 3077187]
57212C077187O6478O6937O7421O8603P0169P1222P1405P1054P0444O9468O8010
57201C838398O6180O4172O2165O0334N8814N7788N7682N8824O0722O2210O2596
57190D509885O2323O2209O2429O2621O2650O2806O3417O4503O5714O6546O6827
57179E211930O6933O7203O7249O6419O4751O2812O0684N7991N4952N2512N1229
57168E884665N0917N1540N3406N6180N8864O1259O4456O9245P4957Q0645Q6504
57157F592638R3207J00575J07829J14666J21112J26655J30355J31710J30845J28125
57147G777717J24128J19798J16060J13272J11168J09107J06293J02256R7285R1957
57137H869041Q6233P9567P1899O3656N4679M4087L1522J7658L116j2082k7579
$$ y = [3077187, 3143665, 3210602, 3278023, 3346626, 3416795, 3488017, 3559422, 3630476, 3700920, 3770388, 3838398, 3904578, 3968750, 4030915, 4091249, 4150063, 4207851, 4265533, 4324357, 4385079, 4447289, 4509885, 4572208, 4634417, 4696846, 4759467, 4822117, 4884923, 4948340, 5012843, 5078557, 5145103, 5211930, 5278863, 5346066, 5413315, 5479734, 5544485, 5607297, 5667981, 5725972, 5780924, 5833436, 5884665, 5935582, 5987122, 6040528, 6096708, 6155572, 6216831, 6281287, 6350532, 6425489, 6506134, 6592638, 6685845, 6786420, 6894249, 7008915, 7130027, 7256682, 7387037, 7518747, 7649592, 7777717, 7901845, 8021643, 8137703, 8250975, 8362143, 8471250, 8577543, 8679799, 8777084, 8869041, 8955274, 9034841, 9106740, 9170396, 9225075, 9269162, 9300684, 9318342, 9321458, 9309376, 9281797]
57126I281797m2210n5189o6957p8229q8920r8532j06924j14128j20181j25644
57116H384883j31385j37176j41256j41917j38865j32496j22674j09038r1802p1505
57106G166769m8204k1136J1670N3906J10074J82893K71355L71101M76025N79986
57096I154439O78978P73352Q68425R73335J099450J257876J454885J687560J943701
57087A9892001K205568K453721K670381K843207K964821L023105K990176K826183
57079D1869163K500166K010540J390208O99412J3812n94239j080548j443282j710799
57070D3654433j913279k064316k163013k204404k185796k109488j984672j825935
57062B7203530j648007j462386j278297j103685r43676q00037o73395n64522m72848
$$ y = [9281797, 9239587, 9184398, 9117441, 9039212, 8950292, 8851760, 8744836, 8630708, 8510527, 8384883, 8253498, 8116322, 7975066, 7833149, 7694284, 7561788, 7439114, 7330076, 7238274, 7166769, 7118565, 7097429, 7109099, 7163005, 7273079, 7455972, 7727327, 8098428, 8574453, 9154439, 9833417, 10606769, 11475194, 12448529, 13547979, 14805855, 16260740, 17948300, 19892001, 22097569, 24551290, 27221671, 30064878, 33029699, 36052804, 39042980, 41869163, 44369329, 46379869, 47770077, 48469489, 48483301, 47889062, 46808514, 45365232, 43654433, 41741154, 39676838, 37513825, 35309421, 33123625, 31014137, 29029465, 27203530, 25555523, 24093137, 22814840, 21711155, 20767479, 19967442, 19294047, 18729525, 18256677]
57053A8256677l95760l30575k75880k30273j91462j57533j27749j01389p7203
57044A6368853n4770l5035j8732n366N752J4827K2464K9818L7089M2944M6239
57033A6454083M7430M7855M8450M9123M8240M2779L0695J3758l299j6801k6162
57022A6736151l2063l4642l4211l1908k8419k3161j5494n758N467J7758K9951
57011A6583671M0202M7727N3362N7765O0317O0478N8877N6210N2357M7362M2109
57000A7160437L6931L0753K2738J3945O432J418r36q45J168M433Q910J5077K2504
56987A7322965K9563L5235M0252M5587N0768N4425N5622N3990M9410M2493L4646
56976A7814956K6895J9246J1646M793m94l854m880l161O43M794Q156J0904J3083
$$ y = [18256677, 17860917, 17530342, 17254462, 17024189, 16832727, 16675194, 16547445, 16446056, 16368853, 16314083, 16279048, 16260316, 16254950, 16260702, 16275529, 16297993, 16327811, 16364900, 16407844, 16454083, 16501513, 16549368, 16597818, 16646941, 16695181, 16737960, 16768655, 16782413, 16779114, 16762313, 16736151, 16704088, 16669446, 16635235, 16603327, 16574908, 16551747, 16536253, 16530495, 16535962, 16553720, 16583671, 16623873, 16671600, 16724962, 16782727, 16843044, 16903522, 16962399, 17018609, 17070966, 17118328, 17160437, 17197368, 17228121, 17250859, 17264804, 17271236, 17272654, 17271718, 17270873, 17272041, 17276474, 17285384, 17300461, 17322965, 17352528, 17387763, 17428015, 17473602, 17524370, 17578795, 17634417, 17688407, 17737817, 17780310, 17814956, 17841851, 17861097, 17872743, 17877536, 17877042, 17873188, 17868308, 17865147, 17865790, 17870584, 17878740, 17889644, 17902727]
56963A7902727J3873J2999J1569J0529R507Q177P430P803P826N317l11q029j6605
56950A7972812k4804l1188l5074l7162l8132l7377l4354l0329k7309k5720k4645
56939A7626718k3815k3919k5139k6833k8642l0641l2309l2458l0522k7273k4301
56928A7320866k3387k6046l2734m2403n3343o4215p3849q0750q3900q3782q1680
56917A6674777p8192p3407o8182o4007o1481n9992n9201n9936o3162o8643p5191
56906A5943383q1870q8485r4931j00469j03950j04825j03690j01515r8584r4628
56896A4970436q9770q4648p9728p5285p2052p0932p1848p3830p6413p9976q4386
56885A4111568q8621r2329r6622j02436j09053j15115j20243j24595j27634j28459
$$ y = [17902727, 17916600, 17929599, 17941168, 17951697, 17961204, 17969381, 17976811, 17984614, 17992440, 17997757, 17997446, 17989417, 17972812, 17948008, 17916820, 17881746, 17844584, 17806452, 17769075, 17734721, 17704392, 17677083, 17651363, 17626718, 17602903, 17578984, 17553845, 17527012, 17498370, 17467729, 17435420, 17402962, 17372440, 17345167, 17320866, 17297479, 17271433, 17238699, 17196296, 17142953, 17078738, 17004889, 16924139, 16840239, 16756457, 16674777, 16596585, 16523178, 16454996, 16390989, 16329508, 16269516, 16210315, 16150379, 16087217, 16018574, 15943383, 15861513, 15773028, 15678097, 15577628, 15473678, 15368853, 15265163, 15163648, 15065064, 14970436, 14880666, 14796018, 14716290, 14641005, 14568953, 14498021, 14426173, 14352343, 14275930, 14195954, 14111568, 14022947, 13930618, 13833996, 13731560, 13622507, 13507392, 13387149, 13262554, 13134920, 13006461]
56875A3006461j26977j23829j19521j14430j09249j04636j00665r7203r4367r2041
56865A1923543q9493q6126q2170p8041p3559o8396o2929n8354n6443n9271o7934
56854A1140827q0827r4095j04565j11508j15344j16080j14044j10693j07266j03547
56844A0082858r9196r5305r3163r2261r1030q8883q6089q2327p7027p0735o4579
56833I142263n8781n3627n1702n7147p1842r3235j16226j36386j51477j61270
56823H190570j66594j68079j65605j59261j50349j40725j31386j22537j14514
56814F871520j07615j01328r4746q7715q0623p3385o5648n7968n1939m9336n1827
56803F049390o0858p6271r5089j12890j26727j36114j41620j43732j43109j40562
$$ y = [13006461, 12879484, 12755655, 12636134, 12521704, 12412455, 12307819, 12207154, 12109951, 12015584, 11923543, 11834050, 11747924, 11665754, 11587713, 11514154, 11445758, 11382829, 11324475, 11268032, 11208761, 11140827, 11060000, 10965905, 10861340, 10749832, 10634488, 10518408, 10404364, 10293671, 10186405, 10082858, 9983662, 9888357, 9795194, 9702933, 9611903, 9523020, 9436931, 9354604, 9277577, 9206842, 9142263, 9083482, 9029855, 8978153, 8921006, 8849164, 8755929, 8639703, 8503317, 8351840, 8190570, 8023976, 7855897, 7690292, 7531031, 7380682, 7239957, 7108571, 6986034, 6871520, 6763905, 6662577, 6567831, 6480116, 6399493, 6326108, 6260460, 6202492, 6150553, 6101217, 6049390, 5988532, 5912261, 5817172, 5704282, 5577555, 5441441, 5299821, 5156089, 5012980, 4872418]
56793D872418j36514j31142j25129j19395j14096j08724j03107r7462r1560q4876
56783C760413p7599p0562o4163n8293n3493n1286n2970n8562o6834p5841q3564
56772C047246q8824r1656r2484r1282q8104q3830p9480p5171p0659o6418o3234
56761B156104o1048n9245n7722n6657n5616n4055n2428n1501n0887m9545m7567
56750A559833m6063m5334m4508m3102m1586m0214l8560l6520l4663l3262l1922
56739A124099l0423k9029k7786k6422k5030k4019k3360k2723k2231k2160k2066
56728H48850k1324k0371k0222k0858k1300k1249k1296k1475k1085k0087j9331
56717F20252j9084j8695j8006j7664j7674j7059j5522j4154j3764j3750j3305
$$ y = [4872418, 4735904, 4604762, 4479633, 4360238, 4246142, 4137418, 4034311, 3936849, 3845289, 3760413, 3682814, 3612252, 3548089, 3489796, 3436303, 3385017, 3332047, 3273485, 3206651, 3130810, 3047246, 2958422, 2866766, 2774282, 2683000, 2594896, 2511066, 2431586, 2356415, 2285756, 2219338, 2156104, 2095056, 2035811, 1978089, 1921432, 1865816, 1811761, 1759333, 1707832, 1656945, 1607400, 1559833, 1513770, 1468436, 1423928, 1380826, 1339240, 1299026, 1260466, 1223946, 1189283, 1156021, 1124099, 1093676, 1064647, 1036861, 1010439, 985409, 961390, 938030, 915307, 893076, 870916, 848850, 827526, 807155, 786933, 766075, 744775, 723526, 702230, 680755, 659670, 639583, 620252, 601168, 582473, 564467, 546803, 529129, 512070, 496548, 482394, 468630, 454880, 441575]
56706D41575j2689j2459j2373j1873j0964r961q972q149p788p714p247o215n352
56693C19819n186n246m851m050l357l031l020l205l385l354l184l106l125l136
56679B68583l267l585l688l225k605k488k826l103l187l111k492j178k6J05k74
56664B33633j33K67j32j213j809j668j691k180k395k096j921k036j856j316j018
56649B12436r98p40n60j330k711l377l117l039l410l302k647k638l500l917l382
56634A73768l055l492l517k484j638j997k681k635k286k178j726p65o39k098l608
56619A38969l491k421k048k380k299j646r84j89R65J642J019j46n96m74o07o81
56603A24633N6R51O70n18r97k56N32M82Q2J17O40J246J481R30k96j226r95K6P03
$$ y = [441575, 428886, 416427, 404054, 392181, 381217, 371256, 362284, 354135, 346347, 338633, 331386, 325171, 319819, 314633, 309387, 304536, 300486, 297129, 294098, 291078, 287873, 284488, 281134, 277950, 274844, 271719, 268583, 265316, 261731, 258043, 254818, 252213, 249725, 246899, 243796, 240609, 237498, 235006, 233828, 233802, 233907, 233633, 233500, 233767, 233635, 232422, 230613, 228945, 227254, 225074, 222679, 220583, 218662, 216626, 214770, 213454, 212436, 211438, 210698, 210138, 208808, 206097, 202720, 199603, 196564, 193154, 189852, 187205, 184567, 181067, 177150, 173768, 170713, 167221, 163704, 161220, 159582, 157585, 154904, 152269, 149983, 147805, 146079, 145314, 144675, 142577, 138969, 135478, 133057, 131009, 128629, 126330, 124684, 123700, 123511, 124476, 126118, 127137, 126991, 126395, 125921, 125314, 124633, 124689, 125640, 126310, 125792, 124795, 124539, 125071, 125553, 125635, 125752, 126392, 127638, 129119, 130049, 129753, 128527, 127532, 127558, 128261]
56584A28261N43j5m94p74q09n36J0Q11J826K574K395J436O52N08M70J72J11O33
56566A37774J310J931K943M176M375L078J801K147L677M815M992M609L742K296
56552A83666Q63J01k38o31p64k98O4m44j202j041n0O72P09N40M14J45j69k56l10
56533A81771p20j391k004k488k649k032q32j75o69j522j855j892k043j855j041
56518A58603m65q25j329r74k27q3l58l33k38n71q20l87M4l77r80p11j02l24r92
56499A48551q55j18r5q20j043m47rk16n75q99j397j618r21P0R1p19j010l73K89
56480A37886N07P33J071J101J036J462J912J302j43r68o91k67k35n4M23M18k52
56463A45241o45j85M33L98k72j158j840j684l27J433K287K049J597J293P11q1
$$ y = [128261, 128804, 128789, 128295, 127521, 126712, 126176, 126186, 126997, 128823, 131397, 133792, 135228, 135880, 136388, 136858, 137030, 137141, 137774, 139084, 141015, 143958, 148134, 152509, 155587, 157388, 159535, 163212, 168027, 173019, 177628, 181370, 183666, 184529, 184630, 184392, 183761, 182997, 182699, 182763, 182319, 181117, 180076, 180026, 180698, 181407, 181947, 182361, 182506, 182337, 182081, 181771, 181051, 179660, 177656, 175168, 172519, 170487, 169655, 169480, 168811, 167289, 165434, 163542, 161499, 159644, 158603, 158138, 157313, 155984, 155010, 154783, 154700, 154342, 154009, 153771, 153200, 152380, 151993, 152037, 151660, 150680, 149969, 149867, 149543, 148551, 147696, 147578, 147483, 146663, 145620, 145173, 145164, 144948, 144373, 143474, 142077, 140459, 139538, 139608, 139699, 138980, 137970, 137597, 137886, 138393, 139126, 140197, 141298, 142334, 143796, 145708, 147010, 146867, 145899, 145208, 144941, 144706, 144652, 145075, 145493, 145241, 144596, 144411, 144844, 145242, 144970, 143812, 141972, 140288, 139961, 141394, 143681, 145730, 147327, 148620, 149331, 149250]
56447A49250l18J41N85O65P37Q64O73K85K97O97R51J072J479J792J176j42j018
56430A59186j108j147j454j507j124p37l76L71J267J561J280J123J120O63r9l76
56414A58643k11m21j040j256r54p13l43Q78K379K565J292L28Q07J821K162J899
56398A67836J592J269Q99P15O26L24J82Q87K003K292J602J047J093J001M34M2
56382A83844J11J35J04O40J502J587Q48N89J313J983J916J811K165K269J601P99
56366B03217M67L03R9L02R97J516J543J422J106K07p33o65M9l9r06r04L35J085
56348B09401M38j59M89J295R25Q5J75J025J590J696J705J470R19P46J458K494
56332B25752L201L682L973L516K276J276J181J504J736K078K415K123J518J912
$$ y = [149250, 148932, 149073, 149658, 150323, 151060, 151924, 152597, 152882, 153179, 153876, 154827, 155899, 157378, 159170, 160346, 160204, 159186, 158078, 156931, 155477, 153970, 152846, 152109, 151733, 152104, 153371, 154932, 156212, 157335, 158455, 159118, 159019, 158643, 158432, 158011, 156971, 155715, 154761, 154048, 153705, 154583, 156962, 159527, 160819, 161147, 161954, 163775, 165937, 167836, 169428, 170697, 171596, 172311, 172937, 173261, 173443, 174330, 176333, 178625, 180227, 181274, 182367, 183368, 183802, 183844, 183955, 184090, 184194, 184834, 186336, 187923, 188771, 189360, 190673, 192656, 194572, 196383, 198548, 200817, 202418, 203217, 203684, 203987, 204086, 204388, 205385, 206901, 208444, 209866, 210972, 211179, 210446, 209781, 209830, 209791, 208885, 207981, 208316, 209401, 209839, 209680, 210169, 211464, 212389, 212474, 212649, 213674, 215264, 216960, 218665, 220135, 221054, 221800, 223258, 225752, 228953, 232635, 236608, 240124, 242400, 243676, 244857, 246361, 248097, 250175, 252590, 254713, 256231, 258143]
56318B58143L393M271L666K824K845K893K082J275J444J853J565J390K483M154
56304B94281M935M810M761M903M742M561M956N516N396M789M614N201O258P544
56290C67267Q640Q760P771O758O697P261P713Q071Q580Q926Q947R234J0181J1201
56276D86007J1745J2187J3023J4023J4877J5706J6406J6525J6348J6849J8082
56265F51778J9039J9605K0951K3305K5192K5898K6833K9252L2384L5228L8426
56254I47891M2802M7578N1732N5837O0928O6719P2443P8267Q4406R0022R4324
56243A692949R7665J00285J01291J00125R7574R3948Q7801P8074O5960N2969L8698
56232B607339K2325M950j1582k7003m1830n5379o6490p5281q2414q7522r0116
$$ y = [258143, 261536, 265807, 269473, 272297, 275142, 278035, 280117, 281392, 282836, 284689, 286254, 287644, 290127, 294281, 299216, 304026, 308787, 313690, 318432, 322993, 327949, 333465, 338861, 343650, 348264, 353465, 359723, 367267, 375907, 384667, 392438, 399196, 405893, 413154, 420867, 428938, 437518, 446444, 455391, 464625, 474806, 486007, 497752, 509939, 522962, 536985, 551862, 567568, 583974, 600499, 616847, 633696, 651778, 670817, 690422, 711373, 734678, 759870, 785768, 812601, 841853, 874237, 909465, 947891, 990693, 1038271, 1090003, 1145840, 1206768, 1273487, 1345930, 1424197, 1508603, 1598625, 1692949, 1790614, 1890899, 1992190, 2092315, 2189889, 2283837, 2371638, 2449712, 2515672, 2568641, 2607339, 2629664, 2634614, 2623032, 2596029, 2554199, 2498820, 2432330, 2357049, 2274635, 2187113, 2096997]
56221B096997r1034r1294r0501q7995q4535q1109p7235p2238o7091o3076n9595
56210A231294n5275n0427m6436m3455m0431l6914l3258k9707k6529k4240k2537
56199H22085k0186j7054j4825j4382j4177j2749j1048j0373r925q562p233p248
56187F74323p662o928n678n309n103l569j536j048j913k146j191j53N64J412K025
56172F36088J812J605K489L667L713L194L694M966N556N523O088P146P595P612
56158G00748Q255R269R636R681J0446J1609J2255J3038J5101J7727J9491K1039
56146H58295K4064K8194L1612L4312L8099M3604M9796N6077O2437O7851P0808
56135A365149P1152O9392O4976N7507M8855M1603L6189L1810K8898K7872K6511
$$ y = [2096997, 2005963, 1914669, 1824168, 1736173, 1651638, 1570529, 1493294, 1421056, 1353965, 1290889, 1231294, 1176019, 1125592, 1079156, 1035701, 995270, 958356, 925098, 895391, 868862, 844622, 822085, 801899, 784845, 770020, 755638, 741461, 728712, 717664, 707291, 697366, 688804, 681571, 674323, 666661, 659733, 654055, 648746, 643643, 640074, 638538, 637490, 635577, 633431, 632240, 632087, 632651, 634063, 636088, 637900, 639505, 641994, 645661, 649374, 652568, 656262, 661228, 666784, 672307, 678395, 685541, 693136, 700748, 709003, 718272, 727908, 737589, 748035, 759644, 771899, 784937, 800038, 817765, 837256, 858295, 882359, 910553, 942165, 976477, 1014576, 1058180, 1107976, 1164053, 1226490, 1294341, 1365149, 1436301, 1505693, 1570669, 1628176, 1677031, 1718634, 1754823, 1786633, 1815531, 1843403, 1869914]
56124A869914K1866J4304O730L77n620j1149j4934j7385k0667k5874l2498m0302
56112A744762m9070n6948o1719o3435o3503o1908n7861n2328m7055m1892l5835
56101A153208k9741k5151k1411j6972j2530r701p751m935j988p69n92N12K027
56088A024206K257K184L938O502P248O759P715R767J0238R290R571J1067J1222
56075A121964J0045J0246J2206J3543J3854J5135J7250J7736J6546J6324J7558
56064A282407J8115J7850J8991K1427K2476K1877K2282K4157K4961K4075K3845
56053A522463K4992K5629K5437K6222K7860K8341K8174K9935L3136L4668L4583
56042A841440L6105L9508M1617M1975M3740M7610N0581N1742N3661N7051N9617
$$ y = [1869914, 1891780, 1906084, 1912814, 1913191, 1907571, 1896422, 1881488, 1864103, 1843436, 1817562, 1785064, 1744762, 1695692, 1638744, 1577025, 1513590, 1450087, 1388179, 1330318, 1277990, 1230935, 1189043, 1153208, 1123467, 1098316, 1076905, 1059933, 1047403, 1037702, 1029951, 1025016, 1023028, 1022259, 1021667, 1022179, 1024206, 1026463, 1028647, 1032585, 1039087, 1046335, 1053094, 1060809, 1070576, 1080814, 1090104, 1099675, 1110742, 1121964, 1132009, 1142255, 1154461, 1168004, 1181858, 1196993, 1214243, 1231979, 1248525, 1264849, 1282407, 1300522, 1318372, 1337363, 1358790, 1381266, 1403143, 1425425, 1449582, 1474543, 1498618, 1522463, 1547455, 1573084, 1598521, 1624743, 1652603, 1680944, 1709118, 1739053, 1772189, 1806857, 1841440, 1877545, 1917053, 1958670, 2000645, 2044385, 2091995, 2142576, 2194318, 2247979, 2305030, 2364647]
56031B364647O1087O3815O7617O9797P0958P4736Q1134Q6459R0448R6782J05855
56020C233335J13977J20650J29350J40078J48738J55082J63490J74491J83618
56011D562809J90361J99806K13379K26461K37408K50271K66077K80295K91817
56002F718684L05591L23324L40472L55452L72594L92694M10149M22997M36420
55993A0078377M52834M68223M81675M98393N19551N39633N57452N78838O04841
55984A4779817O29120O50944O78175P12914P47353P78708Q14339Q56961Q99638
55975B1547969R41629R93681J060962J136551J218597J316610J433199J558224
55967C1207422J689974J843340K028534K242762K492293K799101L174378L610414
$$ y = [2364647, 2425734, 2489549, 2557166, 2626963, 2697921, 2772657, 2853791, 2940250, 3030698, 3127480, 3233335, 3347312, 3467962, 3597312, 3737390, 3886128, 4041210, 4204700, 4379191, 4562809, 4753170, 4952976, 5166355, 5392816, 5630224, 5880495, 6146572, 6426867, 6718684, 7024275, 7347599, 7688071, 8043523, 8416117, 8808811, 9218960, 9641957, 10078377, 10531211, 10999434, 11481109, 11979502, 12499053, 13038686, 13596138, 14174976, 14779817, 15408937, 16059881, 16738056, 17450970, 18198323, 18977031, 19791370, 20648331, 21547969, 22489598, 23483279, 24544241, 25680792, 26899389, 28215999, 29649198, 31207422, 32897396, 34740736, 36769270, 39012032, 41504325, 44303426, 47477804, 51088218]
55959E1088218M110739M700440N393837O184638P084585Q137122R376178J0812184
55951A06887941J2472203J4393373J6549796J8850603K1204022K3383715K4661149
55944B38402802K3742329J9490251J1964201K675362o317053j3581543j8700362
55937B57675987k1837388k3249242k3191192k2003681k0085700j7796047j5420516
55930A14092221j3176535j1189117r484226q041287o841197n858428n047453m367635
55922E0086343l803074l341666k956315k623232k338738k102200j899841j719156
55914B9302121j562322j431659j316815j208586j111102j028673r54107q81117
55906A9807740q15371p62236p15359o67966o24294n89691n59729n28904n00488
$$ y = [51088218, 55198957, 59899397, 65293234, 71477872, 78562457, 86699579, 96075757, 106887941, 119360144, 133753517, 150303313, 169153916, 190357938, 213741653, 238402802, 262145131, 281635382, 293599583, 296274945, 289957892, 276376349, 257675987, 235838599, 212589357, 189398165, 167394484, 147308784, 129512737, 114092221, 100915686, 89726569, 80242343, 72201056, 65359859, 59501431, 54453978, 50086343, 46283269, 42941603, 39985288, 37362056, 35023318, 32921118, 31021277, 29302121, 27739799, 26308140, 24991325, 23782739, 22671637, 21642964, 20688857, 19807740, 18992369, 18230133, 17514774, 16846808, 16222514, 15632823, 15073094, 14544190, 14043702]
55897A4043702m78250m57523m33524m10145l91831l74841l54913l35792l21876
55888A0485007l09734k94866k80208k70102k62180k52608k43289k36712k29469
55879H105839k18000k05460j96185j88434j78943j69749j64126j60332j55381
55870F469229j50677j48293j45962j41274j36616j34790j33773j30828j27592
55861E219424j26185j24441j20005j15048j12068j08994j03304r7109r3197q9862
55851D129211q4544p8988p5927p4010p0825o7719o7051o7598o7153o6606o7219
55840C341571o7028o4261o1287o0833o1189n9409n6344n4281n2495m9510m6980
55829B707954m6934m7585m6210m3768m2649m2181m0577l8926l9143m0049l9564
$$ y = [14043702, 13565452, 13107929, 12674405, 12264260, 11872429, 11497588, 11142675, 10806883, 10485007, 10175273, 9880407, 9600199, 9330097, 9067917, 8815309, 8572020, 8335308, 8105839, 7887839, 7682379, 7486194, 7297760, 7118817, 6949068, 6784942, 6624610, 6469229, 6318552, 6170259, 6024297, 5883023, 5746407, 5611617, 5477844, 5347016, 5219424, 5093239, 4968798, 4848793, 4733745, 4621677, 4512683, 4409379, 4312270, 4219073, 4129211, 4044667, 3965679, 3889752, 3815742, 3744917, 3677198, 3610147, 3542549, 3475396, 3408790, 3341571, 3274543, 3210282, 3148995, 3088162, 3026973, 2967564, 2911220, 2856939, 2804444, 2754934, 2707954, 2661020, 2613435, 2567225, 2523457, 2480808, 2438627, 2398050, 2359124, 2319981, 2279932, 2240368]
55818B240368l8659l9180l9838l8460l6246l5710l6144l5128l2861l1201k9909
55807A847032k7670k5358k4616k4542k3295k1575k1142k1264k0112j8281j7565
55796A601612j7565j6860j6138j6896j8308j8657j8593j9733k1322k1567k1043
55785A394930k1522k2616k2810k2666k3719k5234k5275k4080k3297k2846k1519
55774A139346j9728j8626j7514j5222j3030j3113j4882j5920j5747j5669j5734
55763I64161j4924j3711j3408j3613j3059j2276j2567j3238j2754j1801j2124
55752H20686j3203j3239j2736j3649j5522j5974j4808j4209j4786j4787j3553
55741F64220j2528j2335j1816j0618j0044j0540j0806j0118r376r134q681p657
$$ y = [2240368, 2201709, 2162529, 2122691, 2084231, 2047985, 2012275, 1976131, 1941003, 1908142, 1876941, 1847032, 1819362, 1794004, 1769388, 1744846, 1721551, 1699976, 1678834, 1657570, 1637458, 1619177, 1601612, 1584047, 1567187, 1551049, 1534153, 1515845, 1497188, 1478595, 1458862, 1437540, 1415973, 1394930, 1373408, 1350792, 1327982, 1305316, 1281597, 1256363, 1231088, 1207008, 1183711, 1160865, 1139346, 1119618, 1100992, 1083478, 1068256, 1055226, 1042113, 1027231, 1011311, 995564, 979895, 964161, 949237, 935526, 922118, 908505, 895446, 883170, 870603, 857365, 844611, 832810, 820686, 807483, 794244, 781508, 767859, 752337, 736363, 721555, 707346, 692560, 677773, 664220, 651692, 639357, 627541, 616923, 606879, 596339, 585533, 575415, 566039, 556905, 548224, 540567]
55729E40567o761o379o137o142p011q407r151q956q582q321p836p324p262p149
55715D35149o202m942m430m306l382j915j302j743k202k446l166m131m308l789
55701C86885l731m255m355l956m192n415o647p256p556p624p053o088n472n146
55687C08139m442l490k975k639j658l41J33k61l37L59R85R38N04j07j042k092
55671B91674k846l468m201m557m089l563l911m612m537l806l286k872j962j038
55657B42926q97q50K67J784J917N50p99j493k144k677k300j428j411k145k157
55642B29143j307j203k520l969m529m773n280n532n180m821m840m750m240l701
55628A72498l292k742k300k559l166l052k096j236q07l04K11L2o59q53n40q56
$$ y = [540567, 533806, 527427, 521290, 515148, 508137, 499730, 490579, 481623, 473041, 464720, 456884, 449560, 442298, 435149, 428947, 424005, 419575, 415269, 411887, 409972, 408670, 406927, 404725, 402279, 399113, 394982, 390674, 386885, 383154, 378899, 374544, 370588, 366396, 360981, 354334, 347078, 339522, 331898, 324845, 318757, 313285, 308139, 303697, 300207, 297232, 294593, 292935, 292594, 292727, 292466, 292129, 292488, 293473, 294411, 294915, 294808, 293766, 291674, 288828, 285360, 281159, 276602, 272513, 268950, 265039, 260427, 255890, 252084, 248798, 245926, 243964, 242926, 242029, 241179, 241446, 243230, 245147, 245697, 244898, 243405, 241261, 238584, 236284, 234856, 233445, 231300, 229143, 227836, 226633, 224113, 220144, 215615, 210842, 205562, 200030, 194850, 190029, 185189, 180439, 176199, 172498, 169206, 166464, 164164, 161605, 158439, 155387, 153291, 152055, 151248, 150944, 151155, 151187, 150528, 149675, 149135, 148279]
55612A48279k113l192l311k921k540k037j468j225j111o34k49q98k192k680k025
55597A19683j350j206r83n62p28j506j794j190n81m35j71L04J55p16j182p60l30
55580A06648m03k58M27P70L40J17P90J542J518J230J496K145K647K996L110K424
55564A27539R33l44p37q38j322j866j960j876k048k229j983j326m69M85J215J343
55548A14517J105J051J034M66l64n48j30j08o58p99j51M38M21K40O8o18j708k163
55530A12093j703j300j438j396r08r08j758k343j882j200j182j347j125j122j911
55515I0570k706k545j761j122n64J16L02l98j009m37Q45J499J157M95jk50j06
55498H4085M81J082J284J176R10L94j84l15r4k69r20j116m81Qm30j133j201r13
$$ y = [148279, 146166, 142974, 139663, 136742, 134202, 132165, 130697, 129472, 128361, 127727, 127478, 126580, 124388, 121708, 119683, 118333, 117127, 116144, 115582, 114854, 113348, 111554, 110364, 109783, 109348, 109177, 109481, 109636, 108920, 107738, 106978, 106648, 106245, 105987, 106414, 107184, 107524, 107641, 108431, 109973, 111491, 112721, 114217, 116362, 119009, 122005, 125115, 127539, 128472, 128128, 127391, 126553, 125231, 123365, 121405, 119529, 117481, 115252, 113269, 111943, 111474, 111959, 113174, 114517, 115622, 116673, 117707, 118173, 117809, 117261, 117131, 117023, 116365, 115566, 115415, 115853, 116274, 116514, 116582, 115964, 114256, 112093, 110390, 109090, 107652, 106256, 105348, 104440, 102682, 100339, 98457, 97257, 96075, 94728, 93603, 92481, 90570, 87864, 85319, 83558, 82436, 81872, 81988, 82290, 81892, 80883, 80446, 81291, 82790, 83947, 84442, 84441, 84191, 84085, 84566, 85648, 86932, 88108, 89018, 89412, 89228, 88913, 88819, 88550, 87630, 86514, 86033, 86041, 85611, 84478, 83277, 82364]
55480H2364r16r35m08L20N40L40K91M76N62M05n1q58j583j475o83l43q82j270
55462G5894p04P9J00k70j67J75j25j085j873j933j264j17R11J100N90M20R84J334
55444G4049P42j4P1O01N12k88j033j269r44k3J080J373N29l94m06pj42n79m19
55425G3439L22R22J196J440J593J395J031P07J43p37j232r22m96n47m66L43J006
55408G9137M48o48p78r1j46j396k540k601k059j655j290o34J16O13Q47J001J233
55391F9557J620J866J344j4j184j193m79l00r16j281n19J024K255K355J291j33
55375G5293q78p11m07o39j053r20k04N56R58Q43J56p24j096q66p44j009r66k53
55357F7336K77p0n44k15L89K46l21k32M69P98N76M88O05L16l59p08o13n86n56
$$ y = [82364, 81448, 80513, 80105, 80425, 80965, 81305, 81596, 82072, 82634, 83039, 82988, 82130, 80547, 79072, 78389, 78046, 77164, 75894, 75190, 75269, 75369, 75099, 74932, 75107, 74982, 73897, 72024, 70091, 68827, 68710, 69621, 70721, 71311, 71731, 72715, 74049, 74791, 74777, 74848, 75449, 75961, 75673, 74640, 73371, 72427, 72404, 73484, 74857, 75386, 74992, 74586, 74579, 74437, 73858, 73439, 73761, 74683, 75879, 77319, 78912, 80307, 81338, 82045, 82188, 81451, 80219, 79297, 78801, 78254, 77788, 78131, 79137, 79585, 78937, 78159, 78068, 77922, 76526, 73986, 71385, 69326, 67671, 66381, 65747, 65863, 66476, 67323, 68324, 69557, 71177, 73043, 74387, 74373, 73189, 71996, 71517, 71217, 70301, 69020, 68501, 69525, 71780, 74135, 75426, 75293, 74415, 73704, 73297, 72658, 71605, 70685, 70481, 71037, 71995, 72838, 72994, 72270, 71174, 70308, 69564, 68555, 67589, 67336, 67613, 67543, 66999, 66784, 67173, 67419, 67098, 66866, 67335, 68133, 68709, 69197, 69802, 70118, 69759, 69051, 68438, 67852, 67296]
55338F7296K5Q03O58n64j628j592q69k64lk7l25n65k30N44R63O87K79K57M34M63
55318F6342M13M54M40J55l72q81j021n56K43O29K54k64j47M40O98L40j72l32m
55299F6659O10Q73O4j504k259j111R59K064J693Q43K77q7k17K15R55J185P13J55
55281G2087j92o96j455j897j646r33J6J235K407K760J963N86n12r11p01l21k70
55264G1520n59n86k2N48M93J54K15M53J39n83q31l49K79O66Q70P19Pp07o00M2
55244G1868J31n01q30l04M32P31P52O56J25q36j545j573j283j027n92J69Q48J098
55226F8319J083J046R79Q81P79M27l57j054r60k97N4l8J46P75J048N36j16k09
55208G3042J54O02R64R93M26k90l42J40J07p26j372j149n90k15M48J693K598K163
$$ y = [67296, 67321, 68124, 68782, 68218, 66590, 64998, 64129, 63865, 63862, 63835, 63510, 62945, 62715, 63259, 64222, 64909, 65188, 65445, 65879, 66342, 66755, 67209, 67649, 67804, 67432, 66551, 65530, 64974, 65217, 65846, 66100, 65836, 65689, 66129, 66827, 67167, 66995, 66663, 66659, 67269, 68142, 68206, 66702, 64443, 63332, 64291, 66355, 68048, 68891, 69168, 69081, 68864, 69079, 70034, 71219, 71932, 72087, 71895, 71199, 69744, 67847, 66201, 65268, 65284, 66519, 68926, 71686, 73649, 74235, 73723, 72812, 72111, 71790, 71520, 70961, 70375, 70353, 70901, 71394, 71548, 71763, 72216, 72355, 71772, 70941, 70592, 70871, 71537, 72407, 73126, 73133, 72426, 71826, 71868, 71999, 71498, 70668, 70364, 70796, 71527, 72279, 72935, 73060, 72224, 70679, 69106, 67823, 66796, 66204, 66373, 67221, 68319, 69402, 70448, 71427, 72308, 73087, 73514, 73157, 72103, 71143, 70846, 70900, 70862, 71008, 71783, 72831, 73367, 73251, 73042, 73196, 73798, 74762, 75755, 76181, 75891, 75549, 75689, 75796, 75070, 73698, 72549, 71959, 71744, 72192, 73885, 76483, 78646]
55190G8646P95l20p33p74o19k22K29M75N75O04L89m0k18n6j76q66j311o76N60
55171G6262J189Q51J63m54j140j790j764p24P27J607J537R64N07L31K37K23N07
55154G9233Q85O01n93j768j823q81N5N95J053J260N84o98j305p47j04l78j040
55137G4929j029l69J22J35N6J81M65Q30J109R35J90o43r73p32k51J70L17J01j74
55118G5369K8P47J388J514J311J014M93k16n86l02J92L21J74J79L91N72O37O36
55100H3862N41L82L24L23R9l36n24k33J29R1k36l82p9N71J241J526J270Q20O02
55081H9991N34K76j19l64n85r68j026j65J010J176K03o32n92l71o10q17n37l62
55063H6042q19j185n73N73J056N72j23l27M9O62Q94K72q33j457j310j117j293
$$ y = [78646, 79441, 79121, 78388, 77614, 76995, 76773, 77002, 77477, 78052, 78656, 79045, 79005, 78787, 78731, 78555, 77689, 76378, 75702, 76262, 77451, 78302, 78465, 78011, 76871, 75081, 73317, 72593, 73320, 74927, 76464, 77428, 77935, 78266, 78503, 78726, 79233, 80118, 80719, 80126, 78358, 76535, 75654, 75709, 76304, 77357, 78617, 79201, 78503, 77198, 76451, 76347, 75969, 74929, 73900, 73531, 73653, 73788, 73844, 74025, 74490, 75320, 76429, 77364, 77554, 76911, 75938, 75206, 74955, 75125, 75442, 75543, 75369, 75397, 76144, 77532, 79046, 80357, 81371, 81864, 81648, 81062, 80760, 80952, 81273, 81447, 81626, 82017, 82589, 83226, 83862, 84403, 84785, 85109, 85432, 85531, 85195, 84671, 84438, 84567, 84658, 84422, 84040, 83961, 84532, 85773, 87299, 88569, 89389, 89991, 90525, 90801, 90682, 90318, 89733, 88765, 87739, 87574, 88584, 89760, 89963, 89331, 88739, 88368, 87758, 86941, 86404, 86042, 85223, 84038, 83465, 84038, 85094, 85666, 85543, 85216, 85265, 85927, 86821, 87093, 86260, 84803, 83493, 82376, 81083]
55046H1083j187k96P75J270J373J532J503J001N03N07O54M55J54P3j52p28r82
55029H7538m61M2k63p76n55M0J35k5K85O46J98n45l22O83J086O17M01Q25Q94J05
55009I0548p21r60j064j309j091j58O31O14L15L98N54K81r7m2K35K73L09Q93J841
54990I1450K314J826P30k68p44q00q71j122j127m15P04J303R74K75o5N5K53K53
54972I4725O0j33j38J5J04J37M15Q96Q85K5q19n44N78J253J057Q26J057J083L22
54953A01804o39r08m81K1K93M05L53J69P4J76K84L64O20Q70M78n74j230o77M26
54934A01828Q72O27O51J254J683J492J254J517J899J840J632J961K764L320L394
54919A27988L532M057M481M257L580K944K371J569N93k25r26j842k951l793m131
$$ y = [81083, 79896, 79600, 80375, 81645, 83018, 84550, 86053, 87054, 87557, 88064, 88718, 89173, 89327, 89400, 89248, 88520, 87538, 87077, 87119, 86856, 86080, 85525, 85565, 85700, 85675, 85960, 86606, 86804, 86259, 85937, 86620, 87706, 88323, 88724, 89549, 90443, 90548, 89827, 88867, 87803, 86494, 85403, 85245, 85876, 86490, 86805, 87203, 87757, 88038, 87941, 87899, 88134, 88407, 88716, 89609, 91450, 93764, 95590, 96320, 96052, 95308, 94508, 93637, 92515, 91388, 90973, 91677, 92980, 93954, 94229, 94164, 94219, 94472, 94725, 94785, 94652, 94514, 94529, 94633, 94770, 95185, 96081, 96966, 96991, 96172, 95628, 96206, 97459, 98516, 99342, 100399, 101482, 101804, 101165, 100257, 99776, 99797, 100090, 100495, 100848, 101017, 101091, 101267, 101551, 101915, 102535, 103405, 103883, 103309, 102079, 101402, 101828, 102700, 103327, 103978, 105232, 106915, 108407, 109661, 111178, 113077, 114917, 116549, 118510, 121274, 124594, 127988, 131520, 135577, 140058, 144315, 147895, 150839, 153210, 154779, 155372, 155147, 154221, 152379, 149428, 145635, 141504]
54904A41504m103l821l309k931l106l485l144j904p47n57j023j304j154q37m37
54889A09642J39P13R92R03O11L92O41J477K258K273K000K645M143M862M027L092
54873A40810L582M721M651L147J473K45r22j982k431k601l354m396m443l293k258
54858A32949k244k790l241l558l550k714j421r55j698k466k245j524j194j208
54844A02141j149j122j252j097m17J79J52j87m06p35j320j537q63J58P13Q43R87
54827I5088J067R33J073J814K375J841O56M5K03K65j22m10l73n37j110j458j116
54810A00234m72q7N3J85K54K27L58P91J156J001L29n34j298j641j178J09J568
54793A01055K363K180J237n1j140j343m09R08J436R54M26N87Q45K29r89j422l68
$$ y = [141504, 137401, 133580, 130271, 127340, 124234, 120749, 117605, 115701, 114954, 114397, 113374, 112070, 110916, 110079, 109642, 109781, 110494, 111486, 112389, 113000, 113392, 114033, 115510, 117768, 120041, 122041, 124686, 128829, 133691, 137718, 140810, 144392, 149113, 153764, 156911, 158384, 158629, 157707, 155725, 153294, 150693, 147339, 142943, 138500, 135207, 132949, 130705, 127915, 124674, 121116, 117566, 114852, 113431, 112476, 110778, 108312, 106067, 104543, 103349, 102141, 100992, 99870, 98618, 97521, 97104, 97283, 97435, 97248, 96842, 96107, 94787, 93250, 92387, 92545, 93258, 94101, 95088, 96155, 97088, 98161, 99975, 102350, 104191, 104847, 104892, 105095, 105360, 105238, 104828, 104455, 103918, 102808, 101350, 100234, 99762, 99675, 99728, 99913, 100167, 100394, 100752, 101543, 102699, 103700, 104029, 103495, 102197, 100556, 99378, 99487, 101055, 103418, 105598, 106835, 106784, 105644, 104301, 103892, 104800, 106236, 107190, 107616, 108203, 109048, 109277, 108288, 106866, 106498]
54776A06498J363K564K940K849K505K007J780K167K812L084L006L180L780M265
54762A44800M114L439K709K283K219K175J499j60k230l636l877l382k837k589
54748A44527k746l243l695l574k803j922j506j632j912j834j126r8N13L65j4J33
54732A19433Q33J533J931K069J862J259P58R45J550J846J924K645M108N150M889
54717A52735L859L099K758K246J239r4j541k934m005m565m725m735m771m877m895
54702A28794m446l447k513k273k334j710l68N43L05l78n14j34J11M6rJ23L98P55
54684A12949R57N95l45j239j542j358j031o40k13P0K41N35Q30O45Q5j11J92O5
54666A10685r95k023j905j011m75m55k42K52L72oj62L21R64J165R03M93K09K21
$$ y = [106498, 107861, 110425, 113365, 116214, 118719, 120726, 122506, 124673, 127485, 130569, 133575, 136755, 140535, 144800, 148914, 152353, 155062, 157345, 159564, 161739, 163238, 163078, 160848, 157212, 153335, 149953, 147116, 144527, 141781, 138538, 134843, 131269, 128466, 126544, 125038, 123406, 121494, 119660, 118534, 118436, 118949, 119314, 119300, 119433, 120266, 121799, 123730, 125799, 127661, 128920, 129678, 130623, 132173, 134019, 135943, 138588, 142696, 147846, 152735, 156594, 159693, 162451, 164697, 165936, 165842, 164301, 161367, 157362, 152797, 148072, 143337, 138566, 133689, 128794, 124348, 120901, 118388, 116115, 113781, 112071, 111703, 112246, 112551, 112173, 111659, 111525, 111636, 111682, 111673, 111796, 112194, 112949, 113906, 114501, 114156, 112917, 111375, 110017, 108986, 108346, 108133, 108203, 108444, 108979, 109809, 110454, 110539, 110428, 110620, 110685, 109690, 107667, 105762, 104751, 104276, 103821, 103579, 103831, 104203, 104197, 104035, 104356, 105320, 106485, 107388, 107881, 108090, 108311]
54648A08311N01O72L53l09q10r18p48m42j46j44m95o90k35N63Q97N00j26m55l96
54629A05883o5M14P48O55K40m5N0L37M94L47p0n16o50l96o7M7J2m7k84p77j111
54608A05199p89M6P50R77R31Q54O86K88k44o30o59l94r2R8L09N92N99O4n82o63
54588A07340k90j82m22l00L34O21R6m29j80L02J01n80q75o90n85o81p13q10j199
54569A00858j345m85J090K222K315J754J031L61K0J67K93j88r06r07m8Q50J243
54552A08325J325J229P59N9k95j74l6n7J31O63J167J426J623J754J547J083P39
54535A21268M61j58r80j355j147q13m43K80J025R53J96NQ45J555J131K10q3Q4
54517A23034k31j167k001k235j843q60L96J106P97J09n1J82K1n79q79n82j88m2
$$ y = [108311, 108812, 109484, 109837, 109528, 108718, 107800, 107052, 106610, 106464, 106320, 105825, 105135, 104900, 105463, 106360, 106860, 106734, 106279, 105883, 105818, 106232, 106980, 107635, 107875, 107830, 107880, 108217, 108711, 109058, 108988, 108472, 107822, 107426, 107359, 107406, 107418, 107371, 107087, 106310, 105199, 104410, 104456, 105206, 106183, 107114, 107968, 108654, 108942, 108698, 108068, 107409, 107015, 106923, 107021, 107330, 107922, 108521, 108585, 108003, 107340, 107050, 106868, 106446, 106146, 106480, 107101, 107197, 106768, 106588, 106890, 106991, 106411, 105536, 104846, 104261, 103580, 102867, 102057, 100858, 99513, 99028, 100118, 102340, 104655, 106409, 107440, 107801, 107821, 107988, 108281, 108093, 107187, 106280, 106232, 107082, 108325, 109650, 110879, 111638, 111697, 111402, 111228, 111192, 111135, 111266, 111929, 113096, 114522, 116145, 117899, 119446, 120529, 121268, 121729, 121571, 120591, 119236, 118089, 117276, 116833, 117113, 118138, 119091, 119287, 119292, 120137, 121692, 122823, 123033, 122950, 123034, 122803, 121636, 119635, 117400, 115557, 114697, 115093, 116199, 116996, 117105, 117054, 117236, 117257, 116678, 115799, 115217, 115029, 114987]
54499A14987Q7K98K25k50n85l08K45L86j5m54n37l58j64N5L93O07L20m12r61q51
54479A12708l25J02L55O68J002J135J212J552J938J732Q58L7j75JJ36J91K68K65
54461A23660J59J72L85N76O45P44O89k5j332k315k294j666j116o66m9N23P04P10
54443A19504Q82R30M15k90l95P4L05o3n13n90n01n93q00q64o52j29N72J001P63
54424A19056J36j63P7L69M06N31J045J510J282M25l21l47K91J051J374J082N71
54407A28375M19P07Q51L47m94r24p52n03n23l79M65J668K238J766R53O96J022
54390A35932J313J249J012O57q0j125j766j418m77J02n2l53q5O69J122P97J61
54373A37658J02Q11J480J305N15mJ54O14R98J324J528J319P79O12J288K323K897
$$ y = [114987, 115074, 115372, 115597, 115347, 114762, 114454, 114699, 115085, 115070, 114616, 114079, 113721, 113557, 113612, 114005, 114612, 114932, 114520, 113559, 112708, 112383, 112485, 112840, 113508, 114510, 115645, 116857, 118409, 120347, 122079, 122937, 122974, 122799, 122800, 122936, 123127, 123395, 123660, 123819, 123991, 124376, 124952, 125597, 126341, 127030, 127005, 125673, 123358, 121064, 119398, 118282, 117616, 117567, 118090, 118794, 119504, 120386, 121316, 121731, 121441, 121046, 121120, 121425, 121362, 120849, 120259, 119758, 119165, 118365, 117501, 116849, 116720, 117292, 118293, 119056, 119192, 119029, 119106, 119475, 119881, 120412, 121457, 122967, 124249, 124674, 124353, 124006, 124297, 125348, 126722, 127804, 128375, 128794, 129501, 130352, 130699, 130205, 129281, 128529, 128026, 127503, 127124, 127589, 129257, 131495, 133261, 134214, 134910, 135932, 137245, 138494, 139506, 140163, 140083, 138958, 137192, 135774, 135297, 135399, 135347, 134994, 134909, 135578, 136700, 137497, 137658, 137760, 138571, 140051, 141356, 141871, 141867, 142021, 142635, 143633, 144957, 146485, 147804, 148583, 149195, 150483, 152806, 155703]
54356A55703K785K249J422M20k51j14M92P03K20m77r84j417j895k157k025j803
54340A52871j863k147k357k290j892j220n79l70n69o81n09n07r93j408r48K30
54324A34768J143J291J140J114Q48j04j283j737j289p29p66j215j410j026k74
54309A30471M40P96O99L54J26J44J95P6j09j62j40k45m64n17j30P09J668K167
54291A36078J818R04J97O8Q1k63p33p72m15k01k70j93K50O81O88L16j64n90q15
54272A36665o90l67j92j35K99J239J998J853R79K05K3K21L76K69p9m70n85k93
54254A41316K00O13R52J298J440J102M76J04J13l0q24j967k634k377j492n51J15
54237A37854M14L13n2k47R7P96J267J224R60P86N61k8r00j575j605q80K62J073
$$ y = [155703, 158488, 160737, 162159, 162579, 162328, 162214, 162706, 163409, 163629, 163152, 162168, 160751, 158856, 156699, 154674, 152871, 151008, 148861, 146504, 144214, 142322, 141102, 140523, 140153, 139584, 138903, 138394, 137887, 136894, 135486, 134538, 134768, 135911, 137202, 138342, 139456, 140304, 140200, 138917, 137180, 135891, 135162, 134396, 133181, 131771, 130745, 130471, 130911, 131707, 132406, 132760, 132886, 133030, 133225, 133301, 133192, 133030, 132890, 132645, 132181, 131664, 131534, 132243, 133911, 136078, 137896, 138800, 138997, 139065, 139146, 138883, 138150, 137378, 136963, 136762, 136492, 136299, 136549, 137230, 137918, 138234, 138070, 137480, 136665, 135975, 135608, 135416, 135281, 135580, 136819, 138817, 140670, 141649, 141854, 141877, 142098, 142474, 142743, 142664, 142194, 141609, 141316, 141516, 142129, 143081, 144379, 145819, 146921, 147397, 147501, 147614, 147584, 146760, 144793, 142159, 139782, 138290, 137739, 137854, 138268, 138581, 138529, 138282, 138379, 139175, 140442, 141666, 142626, 143412, 143973, 143945, 143045, 141470, 139865, 138985, 139247, 140320]
54219A40320R10Qo05l37J89N8n88q26l83Mk22p41j002r46o71j2J010J768J530
54200A39464L64q36j147m49N01P44R0p15r43p91q33q96k70R95J786J346K39n05
54182A38144o47o23o69n82j34O87J662K323K188J290K45l92n55m41k62l14p86
54165A41134j312j222m22M93J127J617J931J615O77j18l18m11q04r76m38K47K85
54148A43105o9l5L73N10K15j35m23p22p25j83L68L56L31J224K591K880J602M3
54130A51306n06j54K98M98M29N2l79l43J22K24m10j070r79m38k53n02n06J54J205
54111A48748K107K479K220J588J044P77O02M00L30L58P2o35j108p00K79R97J270
54094A60828J601K123K290J810J214J069J153R98Q54J488K999M540N277N175M608
$$ y = [140320, 141230, 141238, 140633, 140296, 140485, 140543, 139955, 139129, 138746, 138750, 138528, 137787, 136785, 135839, 135168, 135156, 136166, 137934, 139464, 139828, 138992, 137845, 137396, 137897, 138641, 138731, 138016, 137073, 136282, 135449, 134553, 134283, 135278, 137064, 138410, 138649, 138144, 137497, 136874, 136205, 135623, 135489, 136176, 137838, 140161, 142349, 143639, 143884, 143492, 142937, 142496, 142234, 141920, 141134, 139822, 138600, 138178, 138671, 139798, 141415, 143346, 144961, 145638, 145520, 145202, 144791, 143987, 143011, 142573, 142820, 143105, 143036, 143001, 143374, 143884, 144099, 143964, 143541, 142819, 142094, 141911, 142279, 142635, 142966, 144190, 146781, 149661, 151263, 151306, 150800, 150646, 150944, 151442, 151871, 151923, 151544, 151201, 151323, 151547, 151137, 150067, 149088, 148650, 148397, 147895, 147389, 147543, 148748, 150855, 153334, 155554, 157142, 158186, 158963, 159565, 159965, 160295, 160653, 160725, 160090, 158982, 158282, 158561, 159558, 160828, 162429, 164552, 166842, 168652, 169866, 170935, 172088, 173086, 173940, 175428, 178427, 182967, 188244, 193419, 198027]
54079A98027L720K563J366J88j311l121m315m000k678j729j571j337n02K81L95
54064A85976K81N04P29N03K93P27J364J346Q50P24R47P08q2m97j1Q29J401J759
54046A98351K071K183K157K445L214M031M549M852N005M923M907N491O497O983
54032B57659O503N619M900M173L278K620K316J631J15j371j665r56m72q39j593
54017B81918k239k815l434l976m349m552m384l602k472j723j803k504l348l996
54003B36721m243l996l419k918k818l124l508l480k791j773j178j359j878k095
53989A98141j931j709j530j259j023j096j271q74K61J324J394O02k3J57O75P66
53973A92604M72M68R12J107N82q6j5P08J240J261J289J663J987J863J529J306
$$ y = [198027, 201747, 204310, 205676, 205864, 204553, 201432, 197117, 193117, 190439, 188710, 187139, 185802, 185300, 185581, 185976, 186257, 186761, 187490, 187993, 188286, 189013, 190377, 191723, 192573, 193297, 194244, 194952, 194870, 194373, 194362, 195191, 196592, 198351, 200422, 202605, 204762, 207207, 210421, 214452, 219001, 223853, 228858, 233781, 238688, 244179, 250676, 257659, 264162, 269781, 274681, 278854, 282132, 284752, 287068, 288699, 288814, 287443, 285778, 284822, 284350, 283511, 281918, 279679, 276864, 273430, 269454, 265105, 260553, 256169, 252567, 250095, 248372, 246569, 244065, 240717, 236721, 232478, 228482, 225063, 222145, 219327, 216203, 212695, 209215, 206424, 204651, 203473, 202114, 200236, 198141, 196210, 194501, 192971, 191712, 190689, 189593, 188322, 187448, 187709, 189033, 190427, 191029, 191006, 191163, 191838, 192604, 193076, 193544, 194456, 195563, 196145, 196059, 196044, 196752, 197992, 199253, 200542, 202205, 204192, 206055, 207584, 208890]
53957B08890J034N52L09Q51J996L053L674M007M188M205M307M913O038P184P939
53942B63140Q460R181J0175J0863J0374Q329N347K615Q14l05j226j912k093j889
53928C21873j701j592j300p64k05L61J159K164K939L146K981K894L157L768M563
53913C43443N274N622N550N229M847M395L707K598J047o41j909k431k488k652
53899C71591l080l410l391l262l372l668l867l960m264m970n910o779p355p487
53885C06816p097o366n674n197m710m041l554l764m501m892m348l238k329j954
53871B45151j954k136k367k433k256k177k574l234l491k985j963r54m33o89j510
53856B13995k084j751q97n74j170j987k218j833j268q12n64n17l97J63J014J507
$$ y = [208890, 209924, 210476, 210785, 211636, 213632, 216685, 220359, 224366, 228554, 232759, 237066, 241979, 248017, 255201, 263140, 271600, 280781, 290956, 301819, 312193, 320522, 325869, 328484, 329298, 328993, 327767, 325855, 323762, 321873, 320172, 318580, 317280, 316516, 316311, 316672, 317831, 319995, 322934, 326080, 329061, 331955, 335112, 338880, 343443, 348717, 354339, 359889, 365118, 369965, 374360, 378067, 380665, 381712, 381071, 379162, 376731, 374243, 371591, 368511, 365101, 361710, 358448, 355076, 351408, 347541, 343581, 339317, 334347, 328437, 321658, 314303, 306816, 299719, 293353, 287679, 282482, 277772, 273731, 270177, 266413, 261912, 257020, 252672, 249434, 247105, 245151, 243197, 241061, 238694, 236261, 234005, 231828, 229254, 226020, 222529, 219544, 217581, 216627, 216194, 215505, 213995, 211911, 210160, 209263, 208689, 207519, 205532, 203314, 201481, 200213, 199401, 198837, 198320, 197923, 198086, 199100, 200607]
53840B00607J371J029P90L08o68j561j647j068m94q1M69J052J111N54M0J40O89
53823B02641J147J254J131R44P57O02N45O82J004J331J501J619J886K169K084
53808B21297J654J438J882K846M000N190O105O173N309M368M143M263L801K701
53794B75170J772J396J108O01L49P97J555J806J256L34l72o74r94j955l604n034
53778B73511n250m408l701l908m537m628l899k790j789j172j146j728k500k897
53764B29158k769k447k228k038j710j398j480k077k771l005k693k226j844j336
53750A99136n31K10M21K30K16N28P20N33L46N09O70K62n58r87o01J06M27L15L08
53731B02260P38J288J372P44k56r23p29J71R27Q64L58M90J605K661K525J499R02
$$ y = [200607, 201978, 203007, 203797, 204105, 203437, 201876, 200229, 199161, 198667, 198586, 199055, 200107, 201218, 201772, 201812, 201952, 202641, 203788, 205042, 206173, 207117, 207874, 208476, 209021, 209703, 210707, 212038, 213539, 215158, 217044, 219213, 221297, 222951, 224389, 226271, 229117, 233117, 238307, 244412, 250585, 255894, 260262, 264405, 268668, 272469, 275170, 276942, 278338, 279446, 280047, 280396, 281193, 282748, 284554, 285810, 286144, 285772, 285098, 284104, 282149, 278545, 273511, 268261, 263853, 260152, 256244, 251707, 247079, 243180, 240390, 238601, 237429, 236283, 234555, 232055, 229158, 226389, 223942, 221714, 219676, 217966, 216568, 215088, 213011, 210240, 207235, 204542, 202316, 200472, 199136, 198605, 198815, 199236, 199466, 199682, 200210, 200930, 201463, 201809, 202318, 202988, 203250, 202692, 201705, 201104, 201210, 201637, 201952, 202260, 202998, 204286, 205658, 206402, 206146, 205223, 204494, 204665, 205592, 206456, 206814, 207304, 208909, 211570, 214095, 215594, 216496]
53714B16496J289J866J784J268J053J324J682J799J698J580J685K113K570K599
53700B40806K199J889J972K218K398K609K729K292J358Q34J303K071K172J752
53686B68602J601J717J354L13q33j670k188k136j231m5K96l20p26j16Q41J073
53670B66532N41L1j7J98L55L37K01M8j60o82j559k138j660l77N58N21L6k69m79
53651B62017p29n46L57J261J283O54L83Q42J479J773J763J566J150O70N36R05
53635B75364J471J785J622J038M28L57R85J778K177K385K898L455L252K297J732
53620C03024K331L396L749L420L499M520N777O329O031N277M304L249K507K448
53606C59861K799K840K265J456Q70N28K99K59M74P02O33L19J1j80k33k4M86R66
$$ y = [216496, 217785, 219651, 221435, 222703, 223756, 225080, 226762, 228561, 230259, 231839, 233524, 235637, 238207, 240806, 243005, 244894, 246866, 249084, 251482, 254091, 256820, 259112, 260470, 261304, 262607, 264678, 266850, 268602, 270203, 271920, 273274, 273587, 272754, 271084, 268896, 266760, 265529, 265484, 265780, 265460, 264734, 264618, 265459, 266532, 267073, 267104, 267087, 267285, 267640, 267977, 268178, 268226, 268066, 267384, 265825, 263687, 262027, 261650, 262208, 262729, 262765, 262496, 262017, 261288, 260742, 261099, 262360, 263643, 264297, 264680, 265522, 267001, 268774, 270537, 272103, 273253, 273923, 274459, 275364, 276835, 278620, 280242, 281280, 281708, 282065, 283050, 284828, 287005, 289390, 292288, 295743, 298995, 301292, 303024, 305355, 308751, 312500, 315920, 319419, 323939, 329716, 336045, 342076, 347353, 351657, 354906, 357413, 359861, 362660, 365500, 367765, 369221, 370091, 370619, 370918, 371177, 371651, 372353, 372986, 373305, 373316, 373136, 372903, 372879, 373365, 374331]
53588C74331R81M84j96p76j069r18m38j81m94q64m76N69J242R19R1n23q43j068
53570C70771r86l43M48O24M9o05p15l49J8J77L43P27J124J135Q12Q12J564K520
53552C78126K704J982J250J312K015K643K715K151J254P47J325K734L753L557
53538D08268K700K326K811L692M556N330N873O005N962O316P312Q628R716J0142
53524D89637R812R170Q973R447R962R957R821J0223J0952J1277J1329J2063J3754
53511F26377J5486J6459J6906J7277J7404J7147J7041J7485J7847J7260J6021
53500H12710J5238J5294J5561J5573J5558J5658J5525J4997J4450J4107J3658
53489I78329J2990J2645J2968J3366J3094J2372J1961J1983J1995J2009J2452
$$ y = [374331, 375312, 375796, 375600, 374824, 373755, 372837, 372399, 372218, 371724, 370860, 370384, 370953, 372195, 373114, 373205, 372682, 371839, 370771, 369785, 369442, 369890, 370514, 370563, 369958, 369243, 368894, 368912, 369089, 369432, 370159, 371283, 372418, 373230, 374042, 375606, 378126, 380830, 382812, 384062, 385374, 387389, 390032, 392747, 394898, 396152, 396899, 398224, 400958, 404711, 408268, 410968, 413294, 416105, 419797, 424353, 429683, 435556, 441561, 447523, 453839, 461151, 469779, 479495, 489637, 499449, 508619, 517592, 527039, 537001, 546958, 556779, 567002, 577954, 589231, 600560, 612623, 626377, 641863, 658322, 675228, 692505, 709909, 727056, 744097, 761582, 779429, 796689, 812710, 827948, 843242, 858803, 874376, 889934, 905592, 921117, 936114, 950564, 964671, 978329, 991319, 1003964, 1016932, 1030298, 1043392, 1055764, 1067725, 1079708, 1091703, 1103712, 1116164]
53478A116164J3078J2934J1729J0375R632Q984P509N311L320K011J058P1j056
53465A201120k463m310o287p702q211q103p850p676p686p941q313q596q843r270
53451A097869r827j0203j0297j0279j0167r816r418r464r926j0013r102p582o304
53438I75471n459m486k976j258k0L65J24j07K85J469L003M141M373L895L584M307
53422I86711O086Q087R588J0678J1785J2889J3711J4444J5572J7015J8129J8657
53410A143352J9007J9507K0063K0761K2030K3782K5165K5682K6013K7038K8627
53399A401027L0065L1212L2417L3542L4017L3836L3794L4474L5557L6308L6358
53388A772607L5866L5222L4742L4425L3956L3026L1671L0148K8660K7270K5907
$$ y = [1116164, 1129242, 1142176, 1153905, 1164280, 1173912, 1182896, 1190405, 1195716, 1199036, 1201047, 1202105, 1202176, 1201120, 1198657, 1194347, 1188060, 1180358, 1172147, 1164044, 1156194, 1148518, 1140832, 1132891, 1124578, 1115982, 1107139, 1097869, 1088042, 1077839, 1067542, 1057263, 1047096, 1037280, 1027862, 1018398, 1008472, 998459, 989357, 981775, 975471, 970012, 965526, 962550, 961292, 961272, 961637, 961761, 961654, 961939, 963408, 966411, 970552, 974925, 978820, 982404, 986711, 992797, 1000884, 1010472, 1021150, 1032935, 1045824, 1059535, 1073979, 1089551, 1106566, 1124695, 1143352, 1162359, 1181866, 1201929, 1222690, 1244720, 1268502, 1293667, 1319349, 1345362, 1372400, 1401027, 1431092, 1462304, 1494721, 1528263, 1562280, 1596116, 1629910, 1664384, 1699941, 1736249, 1772607, 1808473, 1843695, 1878437, 1912862, 1946818, 1979844, 2011515, 2041663, 2070323, 2097593, 2123500]
53377B123500K4238K1871J8935J6129J3814J1397Q100M089K79k812n537q494j2018
53364B213491j6133k0465k4215k6727k8207k9417l0677l1679l2266l2742l3215
53353A907748l3177l2131l0270k8249k6615k5655k5479k5935k6576k7021k7214
53342A599426k7253k7044k6318k4908k3026k1293k0360k0241k0070j8885j6671
53331A353357j4381j2904j2335j2179j1907j1270j0458j0094j0663j1796j2480
53320A222890j2216j1524j1130j1036j0752j0096r296q475p487o281n088m162
53308A115347l523k950k168j085P6J007J766K720L970N101N858O660Q068R860
53294A150707J1261J2094J3074J4674J6233J6723J6095J5299J5000J4840J4110
$$ y = [2123500, 2147738, 2169609, 2188544, 2204673, 2218487, 2229884, 2237984, 2242073, 2242352, 2239540, 2234003, 2225509, 2213491, 2197358, 2176893, 2152678, 2125951, 2097744, 2068327, 2037650, 2005971, 1973705, 1940963, 1907748, 1874571, 1842440, 1812170, 1783921, 1757306, 1731651, 1706172, 1680237, 1653661, 1626640, 1599426, 1572173, 1545129, 1518811, 1493903, 1470877, 1449584, 1429224, 1408983, 1388913, 1370028, 1353357, 1338976, 1326072, 1313737, 1301558, 1289651, 1278381, 1267923, 1257829, 1247166, 1235370, 1222890, 1210674, 1199150, 1188020, 1176984, 1166232, 1156136, 1146840, 1138365, 1130878, 1124597, 1119509, 1115347, 1111824, 1108874, 1106706, 1105621, 1105697, 1106704, 1108470, 1111190, 1115160, 1120261, 1126119, 1132779, 1140847, 1150707, 1161968, 1174062, 1187136, 1201810, 1218043, 1234766, 1250861, 1266160, 1281160, 1296000, 1310110]
53283A310110J2711J1102R680Q556P731P047O059M349K066k80k531m966p551r564
53269A354519j0440j0635j1230j2720j4578j6034j6850j7308j7740j8307j8967
53258A189710j9470j9461j8870j8172j8081j8807j9745k0042j9449j8442j7524
53247I81647j6766j6199j6249j7197j8407j8726j7833j6685j6283j6430j6121
53236G94751j4939j3549j2829j2849j2891j2323j1244j0280r734r306q710q272
53224F57825q474r176r810j0230j0708j1152j1120j0732j0722j1240j1503j1096
53212E31862j0784j1210j1603j0757q843p212o608o591o561o507o594o855p372
53199D24365q127q648q434p743p311p265p049o415n764n349m870m155l556l347
$$ y = [1310110, 1322821, 1333923, 1343603, 1352159, 1359890, 1366937, 1372996, 1377345, 1379411, 1379131, 1376600, 1371634, 1364083, 1354519, 1344079, 1333444, 1322214, 1309494, 1294916, 1278882, 1262032, 1244724, 1226984, 1208677, 1189710, 1170240, 1150779, 1131909, 1113737, 1095656, 1076849, 1057104, 1037062, 1017613, 999171, 981647, 964881, 948682, 932433, 915236, 896829, 878103, 860270, 843585, 827302, 810872, 794751, 779812, 766263, 753434, 740585, 727694, 715371, 704127, 693847, 684113, 674807, 666097, 657825, 649351, 640175, 630365, 620135, 609427, 598275, 587155, 576423, 565701, 554461, 542958, 531862, 521078, 509868, 498265, 487508, 478665, 471453, 464845, 458254, 451693, 445186, 438592, 431737, 424365, 416238, 407590, 399156, 391413, 384102, 376837, 369788, 363373, 357609, 352260, 347390, 343235, 339679, 336332]
53185C36332l280l037k739k667k877l238l534l465k907k246k023k187k265k196
53171B97671k443l076l464l158k470j953j759j785j937j989j668j180j117j602
53157B68070k027j874j327p50k08J98J11n02j029r74o00m61o76j118j771k420
53141B52642k479j693o59j22l2J68P31J495K246K598J998N17p70q76j65K40K9
53124B55868j69l5K8j78k48M9L02K12J24L64O12M08l6j22J83K72k76j154j799
53105B54405k035k099k185k242k228k231k256k052j469q39o04o13k06P79J580
53090B35705J399M57k61k01K04J76n50j547k141j969j223m17P3K58L06K76J51
53073B30696k1j63k57k81j73L9J97J72m7m61j102j797k063j435%J425J810Q63
$$ y = [336332, 333052, 330015, 327276, 324609, 321732, 318494, 314960, 311495, 308588, 306342, 304319, 302132, 299867, 297671, 295228, 292152, 288688, 285530, 283060, 281107, 279348, 277563, 275626, 273637, 271969, 270789, 269672, 268070, 266043, 264169, 262842, 262092, 261884, 262082, 262193, 261691, 260662, 259688, 259088, 258627, 257951, 256833, 255062, 252642, 250163, 248470, 247811, 247689, 247657, 247825, 248556, 250051, 252297, 254895, 256893, 257410, 256640, 255764, 255599, 255839, 255868, 255699, 255664, 255692, 255514, 255266, 255315, 255617, 255829, 255953, 256317, 256929, 257337, 257301, 257179, 257362, 257634, 257358, 256204, 254405, 252370, 250271, 248086, 245844, 243616, 241385, 239129, 237077, 235608, 234769, 234165, 233552, 233346, 234125, 235705, 237104, 237561, 237300, 237099, 237303, 237479, 236929, 235382, 233241, 231272, 230049, 229632, 229705, 229963, 230269, 230545, 230696, 230675, 230512, 230255, 229974, 229801, 229840, 230037, 230209, 230162, 229701, 228599, 226802, 224739, 223304, 223304, 224729, 226539, 227402]
53055B27402m48p17L22J352J024l98j514j572r45j19P99J428J132M0q30r69r61
53038B25026j219j138l13M05J41m75k76M66M20o20j310p01N36J244J264J242J576
53021B26268K049K155J576N14l77o75o41o56m97K20J082J256P36L94O45R49Q58
53004B35856P09Q66R88O17j07p67j225j419j130m35O4L2k2M18Q61L97q34j589
52986B33280j004M25J557J784J292N49k7j35K75R02J334J413J282J070P57M05
52970B45159K89N53Q62P14J98PN58J335J467P95kl15k62m28j084j894k238j826
52952B43888j015m47m18o72q39p90n20k8M56M72q7o49o15j23J75j6m28p27p80
52933B36837n61k16j74p34j532j857j480q02k78r6l76j067j629j386l89N29P57
$$ y = [227402, 226954, 226237, 226559, 227911, 228935, 228537, 227023, 225451, 224506, 224387, 225186, 226614, 227746, 227786, 226956, 225987, 225026, 223807, 222669, 222356, 222761, 222902, 222427, 222151, 222617, 223037, 222417, 221107, 220406, 220942, 222186, 223450, 224692, 226268, 228317, 230472, 232048, 232562, 232185, 231510, 230869, 230213, 229716, 229936, 231018, 232274, 233010, 233404, 234049, 234998, 235856, 236565, 237431, 238419, 239036, 238929, 238162, 236937, 235518, 234388, 233953, 234017, 234049, 234027, 234445, 235306, 235703, 234869, 233280, 232276, 232701, 234258, 236042, 237334, 237883, 237856, 237721, 237996, 238898, 240232, 241645, 242927, 243997, 244754, 245159, 245448, 246001, 246863, 247577, 247775, 247782, 248340, 249675, 251142, 251937, 251935, 251620, 251358, 250930, 249846, 247952, 245714, 243888, 242873, 242426, 242008, 241336, 240497, 239707, 239187, 239159, 239615, 240087, 240000, 239351, 238736, 238613, 238788, 238772, 238344, 237617, 236837, 236276, 236060, 235886, 235152, 233620, 231763, 230283, 229481, 229203, 229107, 228731, 227664, 226035, 224649, 224260, 224789, 225546]
52916B25546N43M75P05R36Q77N00O2q4Q0O7m84j133j112m31J40K74M55R21J031
52897B29368K80o42o12M01J306J283O05M5l0J91L75L99M37P03J041Q98q5j461
52879B34502k232j817o36L38N47K73J02J77K23J99M82J204J869J988J786J775
52863B40780J858J533Q23K92R8k27q54j236j022p36j039j703j979j639j119q11
52847B33019o56n08m67p14j220j648j627j222j016j478k232k409j737q90m67k37
52831B14491L17J060J328P87k11j002j108n31J97M28P1l14k77j8M9k5J60P19J287
52812B17408J380Q45N9k31M22J570K240J950R74k94j599k334j813m50J82p26j968
52795B17615j916p91j67n78r36l68N50Q41M60j1l05n45p83r19q20l11O55J609
$$ y = [225546, 226089, 226564, 227269, 228205, 229082, 229582, 229644, 229560, 229640, 229707, 229223, 228090, 226978, 226547, 226687, 226961, 227416, 228337, 229368, 229648, 229006, 228394, 228795, 230101, 231384, 231989, 232034, 232004, 232195, 232570, 232969, 233406, 234109, 235150, 236048, 235963, 234502, 232270, 230453, 229817, 230155, 230702, 230975, 231077, 231254, 231477, 231676, 232158, 233362, 235231, 237219, 239005, 240780, 242638, 244171, 244994, 245286, 245384, 245157, 244303, 243067, 242045, 241309, 240270, 238567, 236588, 234949, 233830, 233019, 232363, 231855, 231388, 230674, 229454, 227806, 226179, 224957, 223941, 222463, 220231, 217822, 216085, 215195, 214728, 214491, 214808, 215868, 217196, 217983, 217772, 216770, 215662, 215131, 215328, 215756, 215827, 215513, 215236, 215218, 215267, 215242, 215402, 216121, 217408, 218788, 219633, 219692, 219461, 219883, 221453, 223693, 225643, 226617, 226323, 224724, 222390, 220577, 220127, 220309, 219583, 217615, 215699, 214908, 214741, 214163, 213227, 212859, 213409, 214250, 214710, 214699, 214394, 213849, 213066, 212147, 211327, 211016, 211671, 213280]
52777B13280J789J055K12O1M33N46J00m14m26L9M42L13k72p11m30N25J436J594
52759B19572R47K5o60j028j204j129o39jL5q42j719j214P97K801L316K450J412
52742B22919R84J131J600K097K035J145K63N51J762K243J180j82k08R44J696J209
52726B41369J46n25o20l79Q7N84O00j82j334k082k149j889j655j433j149r21q20
52709B27648o54l26j80n16r20o33L13R75Q05M56P29J300J263O49M17R22J357J015
52691B34620L02oJ12J12k33o82r70r14l70M64R28O86K95M52Q56N76n04j400j363
52672B32961p93m70m77m26k24j13j40j74k86o09q44m91L90J081J152J047J405
52655B32989K125K514K255J749J413J094M11m85r64o96j17J02j45m10m07l82o06
$$ y = [213280, 215069, 216124, 216336, 216397, 216830, 217376, 217476, 217062, 216636, 216675, 217117, 217430, 217158, 216447, 216017, 216542, 217978, 219572, 220519, 220544, 219884, 218856, 217652, 216523, 215884, 215883, 215918, 215076, 213357, 212143, 212940, 215741, 219057, 221507, 222919, 223903, 225034, 226634, 228731, 230766, 231911, 232174, 232725, 234487, 236730, 237910, 237728, 237520, 238464, 240160, 241369, 241515, 240990, 240370, 239991, 240078, 240662, 241262, 241080, 239746, 237664, 235515, 233626, 231971, 230538, 229389, 228468, 227648, 226994, 226668, 226488, 225972, 225052, 224419, 224732, 225707, 226512, 226968, 227697, 228997, 230260, 230909, 231326, 232248, 233605, 234620, 234922, 234916, 235028, 235140, 234907, 234225, 233255, 232341, 231971, 232435, 233363, 234049, 234344, 234796, 235652, 236228, 235724, 234324, 232961, 232168, 231698, 231221, 230795, 230571, 230458, 230318, 230144, 229858, 229249, 228405, 227914, 228304, 229385, 230537, 231584, 232989, 235114, 237628, 239883, 241632, 243045, 244139, 244550, 244065, 243101, 242405, 242288, 242390, 242245, 241835, 241428, 241046, 240440]
52638B40440q36n89J03O24N52J95K10Q72J873K704L033K826K324J850J525J176
52622B58882O73J85m6q7k20o27j262j999k574k594j928j021m57k35J28P71J258
52605B48847J267R81N99k3q63j328r04QM58Q7o01r74q83m61J61P44R33O24J43
52586B48815j62k97m64o37o12m16l72o35q94p16j48L80O52Q77J180J280R54M73
52568B49258J78j19p05j141o04Q22J974J954J044k7r83j679j616o41L56L35m62
52551B47944q74n15k26o31j181j018j94M86N07R4j76O4O52R59N05m04q65l48P34
52532B45513J551J634J055K15l39j87M90R56O91j2m33k74J88N61O51M14l3l67
52514B52274k60K87J008J751K518L093K970J958O52l3J28L91o7j097j722j330
$$ y = [240440, 239604, 239015, 239118, 239742, 240294, 240489, 240699, 241571, 243444, 246148, 249181, 252007, 254331, 256181, 257706, 258882, 259555, 259740, 259694, 259607, 259387, 258760, 257498, 255499, 252925, 250331, 248403, 247382, 246925, 246690, 246818, 247589, 248847, 250114, 251095, 251694, 251671, 250808, 249480, 248576, 248584, 249042, 249129, 248528, 247554, 246671, 246210, 246371, 247115, 248048, 248672, 248815, 248653, 248356, 247892, 247255, 246643, 246227, 245855, 245220, 244326, 243610, 243462, 243842, 244494, 245371, 246551, 247831, 248785, 249258, 249436, 249317, 248612, 247471, 246867, 247689, 249663, 251617, 252661, 252634, 251651, 249972, 248356, 247715, 248071, 248406, 247944, 247070, 246555, 246329, 245698, 244517, 243499, 243305, 243791, 244298, 244392, 244216, 244280, 244932, 245891, 246396, 245992, 245127, 244779, 245513, 247064, 248698, 249753, 249968, 249629, 249442, 249932, 250888, 251579, 251567, 251134, 250860, 251048, 251609, 252260, 252674, 252641, 252274, 252014, 252301, 253309, 255060, 257578, 260671, 263641, 265599, 266251, 266218, 266346, 266737, 266670, 265573, 263851, 262521]
52498B62521m68k05q90j784k032j644j334j499j699j311m41J99K31R5L12O76N99
52481B51326P2k49J5N14Q01Q99R49P57K50rN99J737K284J625L64m56m21O9M54
52462B61580N44N56Q16J423K115K399J855M47j259k226j714j55J041Q60k81j196
52446B66805j341j192j318j684j920j866j666j532j525j408q33K00J131J430J185
52431B54466Q32M50j59q23j031o87k66o3J93P10J112R64M80L34Q76J849K757L284
52413B65278L444L492L650L902M104M344M915N891O872P252O664N108K894M36
52399C28246j932m015n514o004n421m387l618l143k544j817j371j230r14k70K77
52384B86343M95P68J338J772J665J369J452J837K090K228K577L042L157K836K513
$$ y = [262521, 262053, 261848, 260958, 259174, 257142, 255498, 254164, 252665, 250966, 249655, 249214, 249413, 249644, 249739, 250051, 250727, 251326, 251398, 251149, 251164, 251678, 252479, 253378, 254327, 255084, 255334, 255325, 255924, 257661, 259945, 261570, 261934, 261478, 261057, 261126, 261580, 262124, 262680, 263496, 264919, 267034, 269433, 271288, 271735, 270476, 268250, 266536, 266381, 267422, 268282, 268001, 266805, 265464, 264272, 262954, 261270, 259350, 257484, 255818, 254286, 252761, 251353, 250520, 250720, 251851, 253281, 254466, 255298, 255748, 255589, 254766, 253735, 253048, 252782, 252719, 252912, 253622, 254734, 255698, 256178, 256512, 257388, 259237, 261994, 265278, 268722, 272214, 275864, 279766, 283870, 288214, 293129, 299020, 305892, 313144, 319808, 324916, 327810, 328246, 326314, 322299, 316785, 310781, 305360, 300973, 297355, 294212, 291668, 289851, 288480, 287250, 286336, 286066, 286343, 286838, 287606, 288944, 290716, 292381, 293750, 295202, 297039, 299129, 301357, 303934, 306976, 310133, 312969, 315482]
52369C15482K518K778L163L626L930L719L027K366K068J921J597J208J151J540
52355C50094K109K575K816K796K529K262K392L000L642L757L299K713K438K637
52341C89059L371M554N734O377O638P314Q639R704R606Q802Q564R349J0579J1833
52327E00123J3315J4936J5939J5948J5660J5947J6765J7463J7787J7984J8188
52316F80055J8185J7758J6923J5958J5268J5075J5083J4753J3943J2940J1882
52305H47823J0720R794R710J0279J0318R072P223N882N115M185K875J648P01l33
52291I35012j648k919l804m304m486m267l662k938k357j894j302m31N67J366J972
52276I04905K926M640O627P910Q277Q486R063R644R904J0273J1070J1677J1424
$$ y = [315482, 318000, 320778, 323941, 327567, 331497, 335216, 338243, 340609, 342677, 344598, 346195, 347403, 348554, 350094, 352203, 354778, 357594, 360390, 362919, 365181, 367573, 370573, 374215, 377972, 381271, 383984, 386422, 389059, 392430, 396984, 402718, 409095, 415733, 423047, 431686, 441390, 450996, 459798, 468362, 477711, 488290, 500123, 513438, 528374, 544313, 560261, 575921, 591868, 608633, 626096, 643883, 661867, 680055, 698240, 715998, 732921, 748879, 764147, 779222, 794305, 809058, 823001, 835941, 847823, 858543, 868337, 878047, 888326, 898644, 907716, 914939, 920821, 925936, 930121, 932996, 934644, 935345, 935012, 933364, 930445, 926641, 922337, 917851, 913584, 909922, 906984, 904627, 902733, 901431, 901000, 901567, 902933, 904905, 907831, 912471, 919098, 927008, 935285, 943771, 952834, 962478, 972382, 982655, 993725, 1005402, 1016826]
52263A016826J0787J0707J1074J0929J0040R213R067R274R218Q640P489N812M019
52250A133095K696J928J219J43j295k933m569n836o473o737p130p733q267q671
52236A079437r025r060q466p596p148p098o683n547m209l212k580k218k147k065
52222A002383j421k67N64N85L50P11J795L148M275M832M692M309M469N301N927
52207A041653N505M273L183K836L191L911M624N042N138N019M605L777K967K951
52193A098675L760M356L930K968K470K535K321J224m96k176l328l914m313m931
52179A103081n605n690n000m296m408n126n565n318m714m053l240k188j104j80
$$ y = [1016826, 1027613, 1038320, 1049394, 1060323, 1070363, 1079576, 1088643, 1097917, 1107135, 1115775, 1123264, 1129076, 1133095, 1135791, 1137719, 1138938, 1139081, 1137786, 1134853, 1130284, 1124448, 1117975, 1111238, 1104108, 1096375, 1088108, 1079437, 1070412, 1061352, 1052886, 1045290, 1038142, 1031044, 1024361, 1018814, 1014605, 1011393, 1008813, 1006595, 1004448, 1002383, 1000962, 1000695, 1001259, 1001844, 1002194, 1002905, 1004700, 1007848, 1012123, 1016955, 1021647, 1025956, 1030425, 1035726, 1041653, 1047158, 1051431, 1054614, 1057450, 1060641, 1064552, 1069176, 1074218, 1079356, 1084375, 1088980, 1092757, 1095724, 1098675, 1102435, 1106791, 1110721, 1113689, 1116159, 1118694, 1121015, 1122239, 1121743, 1119567, 1116239, 1112325, 1108012, 1103081, 1097476, 1091786, 1086786, 1082490, 1078082, 1072956, 1067391, 1062073, 1057359, 1053306, 1050066, 1047878, 1046774, 1046594]
$$ [...]
##END NTUPLES=NMR SPECTRUM
##END=
