
##TITLE=AC1243_NTAAH12033_6610012_zTQ3Pv6xJF
##JCAMPDX= 6.0         $$ Bruker NMR JCAMP-DX V2.0
##DATA TYPE= NMR SPECTRUM
##DATA CLASS= NTUPLES
##ORIGIN= BRUKER
##OWNER= Administrator
$$ 1.72 TOPSPIN		Version 2.1
$$ 2012-08-02 00:12:20.843 -0500  Administrator@TOPSPIN
$$ Compression mode = diff/dup
##.OBSERVE FREQUENCY= 400.02188249412
##.OBSERVE NUCLEUS= ^1H
##.ACQUISITION MODE= SIMULTANEOUS (DQD)
##.ACQUISITION SCHEME= undefined
##.AVERAGES= 64
##.DIGITISER RES= 22
##SPECTROMETER/DATA SYSTEM= spect
##.PULSE SEQUENCE= noesygpps1d.comp
##.SOLVENT NAME= COFFEE_meoh
##.SHIFT REFERENCE= INTERNAL, COFFEE_meoh, 1, 14.96244
##AUDIT TRAIL= $$ (NUMBER, WHEN, WHO, WHERE, PROCESS, VERSION, WHAT)
$$ ##TITLE= Audit trail, TOPSPIN		Version 2.1
$$ ##JCAMPDX= 5.01
$$ ##ORIGIN= Bruker BioSpin GmbH
$$ ##OWNER= Administrator
$$ $$ C:\Bruker\TOPSPIN/data/COFFEE/nmr/AC1243_NTAAH12033_6610012_zTQ3Pv6xJF/12/pdata/1/auditp.txt
$$ ##AUDIT TRAIL=  $$ (NUMBER, WHEN, WHO, WHERE, PROCESS, VERSION, WHAT)
(   1,<2012-08-02 00:12:15.125 -0500>,<Administrator>,<TOPSPIN>,<go>,<TOPSPIN 2.1>,
      <created by zg
	started at 2012-08-02 00:00:44.812 -0500,
	POWCHK enabled, PULCHK disabled,
       configuration hash MD5:
       6B 1B 68 BB D9 2E 58 E2 7F 35 AD 54 07 DF 0E 41
       data hash MD5: 64K
       42 74 78 43 B2 C0 5D 5B 6E 6D C7 23 2F 48 2A 27>)
(   2,<2012-08-02 00:12:18.343 -0500>,<Administrator>,<TOPSPIN>,<proc1d>,<TOPSPIN 2.1>,
      <Start of raw data processing
       efp LB = 0.3 FT_mod = 6 PKNL = 1 PHC0 = 0 PHC1 = 0 SI = 128K 
       data hash MD5: 128K
       12 5A A8 90 45 40 BF A4 CE 67 DB 3D A8 62 6E CA>)
(   3,<2012-08-02 00:12:19.843 -0500>,<Administrator>,<TOPSPIN>,<proc1d>,<TOPSPIN 2.1>,
      <pk PHC0 = 1.906128 PHC1 = 0 
       data hash MD5: 128K
       6D 58 8A 6E 6F 39 4C 49 A8 5D 0D 2C B9 F1 D3 B9>)
(   4,<2012-08-02 00:12:20.515 -0500>,<Administrator>,<TOPSPIN>,<proc1d>,<TOPSPIN 2.1>,
      <abs ABSG = 1 
       data hash MD5: 128K
       2E 98 2C 32 04 69 B0 37 25 37 38 CC 99 F0 8B C5>)
(   5,<2012-08-02 00:12:20.593 -0500>,<Administrator>,<TOPSPIN>,<proc1d>,<TOPSPIN 2.1>,
      <abs ABSG = 2 
       data hash MD5: 128K
       3D 6D 8A 26 42 A9 22 6F 72 DB 89 9D 67 84 C1 A2>)
(   6,<2012-08-02 00:12:20.640 -0500>,<Administrator>,<TOPSPIN>,<proc1d>,<TOPSPIN 2.1>,
      <abs ABSG = 3 
       data hash MD5: 128K
       7E AE 59 68 CA 00 B8 81 1B B4 05 F7 3A 31 E7 D9>)
(   7,<2012-08-02 00:12:20.687 -0500>,<Administrator>,<TOPSPIN>,<proc1d>,<TOPSPIN 2.1>,
      <abs ABSG = 4 
       data hash MD5: 128K
       9C 25 2C 28 65 99 1A AB C2 A3 70 74 D6 AF 0F F7>)
(   8,<2012-08-02 00:12:20.750 -0500>,<Administrator>,<TOPSPIN>,<proc1d>,<TOPSPIN 2.1>,
      <abs ABSG = 5 
       data hash MD5: 128K
       21 8A 95 ED 81 6B E2 D3 E8 E3 C4 AB 1A C2 5C 5D>)
$$ ##END=
$$ 
$$ $$ hash MD5
$$ $$ E0 8C 62 81 33 EB 28 7C B6 47 5D 04 84 CF 8A 89
##$RELAX= 
##$RELAX= 
##$RELAX= 
##$RELAX= 
##$RELAX= 
##$RELAX= 
##$RELAX= 
##$RELAX= 
$$ Bruker specific parameters
$$ [...]
##$TP07= 0
##$TPNAME0= <>
##$TPNAME1= <>
##$TPNAME2= <>
##$TPNAME3= <>
##$TPNAME4= <>
##$TPNAME5= <>
##$TPNAME6= <>
##$TPNAME7= <>
##$TPOAL= (0..7)
0.5 0.5 0.5 0.5 0.5 0.5 0.5 0.5
##$TPOFFS= (0..7)
0 0 0 0 0 0 0 0
##$TUNHIN= 0
##$TUNHOUT= 0
##$TUNXOUT= 0
##$USERA1= <user>
##$USERA2= <user>
##$USERA3= <user>
##$USERA4= <user>
##$USERA5= <user>
##$V9= 5
##$VALIST= <valist>
##$VCLIST= <CCCCCCCCCCCCCCC>
##$VD= 0
##$VDLIST= <DDDDDDDDDDDDDDD>
##$VPLIST= <PPPPPPPPPPPPPPP>
##$VTLIST= <TTTTTTTTTTTTTTT>
##$WBST= 1024
##$WBSW= 4
##$XGAIN= (0..3)
0 0 0 0
##$XL= 0
##$YL= 0
##$YMAX_a= 17191048
##$YMIN_a= -10251318
##$ZGOPTNS= <>
##$ZL1= 120
##$ZL2= 120
##$ZL3= 120
##$ZL4= 120
##$ABSF1= 14.96244
##$ABSF2= -5.595742
##$ABSG= 5
##$ABSL= 3
##$ALPHA= 0
##$AQORDER= 0
##$ASSFAC= 0
##$ASSFACI= 0
##$ASSFACX= 0
##$ASSWID= 0
##$AUNMP= <proc_prof1d_extract.lims>
##$AXLEFT= 0
##$AXNAME= <>
##$AXNUC= <1H>
##$AXRIGHT= 0
##$AXTYPE= 0
##$AXUNIT= <>
##$AZFE= 0.1
##$AZFW= 0.1
##$BCFW= 0
##$BC_mod= 0
##$BYTORDP= 0
##$COROFFS= 0
##$CY= 15
##$DATMOD= 1
##$DC= 0
##$DFILT= <>
##$DTYPP= 0
##$F1P= 0
##$F2P= 0
##$FCOR= 0.5
##$FTSIZE= 131072
##$FT_mod= 6
##$GAMMA= 0
##$GB= 0
##$INTBC= 1
##$INTSCL= 1
##$ISEN= 128
##$LB= 0.3
##$LEV0= 0
##$LPBIN= 0
##$MAXI= 10000
##$MC2= 0
##$MEAN= 0
##$ME_mod= 0
##$MI= 0
##$NCOEF= 0
##$NC_proc= -2
##$NLEV= 6
##$NOISF1= 0
##$NOISF2= 0
##$NSP= 0
##$NTH_PI= 0
##$NZP= 0
##$OFFSET= 14.96244
##$PC= 1
##$PHC0= 1.906128
##$PHC1= 0
##$PH_mod= 1
##$PKNL= yes
##$PPARMOD= 0
##$PPDIAG= 0
##$PPIPTYP= 0
##$PPMPNUM= 2147483647
##$PPRESOL= 1
##$PSCAL= 4
##$PSIGN= 0
##$PYNMP= <proc.py>
##$REVERSE= no
##$SF= 400.020009061275
##$SI= 131072
##$SIGF1= 0
##$SIGF2= 0
##$SINO= 400
##$SIOLD= 131072
##$SPECTYP= <>
##$SREGLST= <1H.CDCl3>
##$SSB= 0
##$STSI= 131072
##$STSR= 0
##$SW_p= 8223.68421052631
##$SYMM= 0
##$S_DEV= 0
##$TDeff= 65536
##$TDoff= 0
##$TI= <>
##$TILT= no
##$TM1= 0
##$TM2= 0
##$TOPLEV= 0
##$USERP1= <user>
##$USERP2= <user>
##$USERP3= <user>
##$USERP4= <user>
##$USERP5= <user>
##$WDW= 1
##$XDIM= 131072
##$YMAX_p= 429343471
##$YMIN_p= -10639
##$CURPLOT= <Network HP LaserJet P1505>
##$CURPRIN= <$Network HP LaserJet P1505>
##$DFORMAT= <normdp>
##$LAYOUT= <+/1D_H.xwp>
##$LFORMAT= <normlp>
##$PFORMAT= <normpl>
##$SURQMSG= 1
$$ End of Bruker specific parameters
$$ ---------------------------------
##NTUPLES= NMR SPECTRUM
##VAR_NAME=  FREQUENCY,     SPECTRUM/REAL,   SPECTRUM/IMAG
##SYMBOL=    X,             R,               I
##VAR_TYPE=  INDEPENDENT,   DEPENDENT,       DEPENDENT
##VAR_FORM=  AFFN,          ASDF,            ASDF
##VAR_DIM=   131072,        131072,          131072
##UNITS=     HZ,            ARBITRARY UNITS, ARBITRARY UNITS
##FACTOR=    0.0627417313425164, 1,          1
##FIRST=     8223.62146879497, -2982,        -63202
##LAST=      0,             -1721,           -64365
##MIN=       0,             -10639,          0
##MAX=       8223.62146879497, 429343471,    0
$$ Real data points
##PAGE= N=1
##DATA TABLE= (X++(R..R)), XYDATA
$$ [...]
63226G10200K9475K8531K6923K5379K4313K3359K1972K0419J9596J9792K0271
$$ 710200 739675 768206 795129 820508 844821 868180 890152 910571 930167 949959 970230
63215I70230K0349K0285K0604K0972K0447J8610J5880J2667Q825L969k059r095
$$ 970230 990579 1010864 1031468 1052440 1072887 1091497 1107377 1120044 1128869 1132838 1130779 1121684
63203A121684j6584k3492k8772l2191l4358l5830l6444l5721l3578l0440k6934
$$ 1121684 1105100 1081608 1052836 1020645 986287 950457 914013 878292 844714 814274 787340
63192G87340k3621k0695j7775j4303j0328o565l411m39K840O172R010J1423J3866
$$ 787340 763719 743024 725249 710946 700618 694053 690642 690203 693043 699215 708225 719648 733514
63179G33514J6273J8040J8905J9300J9718K0248K0752K1052K0888K0122J9155
$$ 733514 749787 767827 786732 806032 825750 845998 866750 887802 908690 928812 947967
63168I47967J8706J8973J9289J8785J7087J4307J0749O880L243l0l512p988j3647
$$ 947967 966673 985646 1004935 1023720 1040807 1055114 1065863 1072743 1075986 1075956 1072444 1064456 1050809
63155A050809j9771k5094k8550k9927k9947k9588k9241k8653k7643k6418k5152
$$ 1050809 1031038 1005944 977394 947467 917520 887932 858691 830038 802395 775977 750825
63144G50825k3668k1808j9791j7908j6043j3886j1492r314p649o334m990l477
$$ 750825 727157 705349 685558 667650 651607 637721 626229 616915 609266 602932 597942 594465
63132E94465k045j099p47n67N2J194K224K451J907J275J133J460J908K319K817
$$ 594465 592420 591321 590574 590007 590059 591253 593477 595928 597835 599110 600243 601703 603611 605930 608747
63117F08747L525M286M761M718M249L680L322L258L330L325L206L159L368L738
$$ 608747 612272 616558 621319 626037 630286 633966 637288 640546 643876 647201 650407 653566 656934 660672
63103F60672L969L867L459K836K065J355R71Q61N65k04j110j557j366q42l28j3
$$ 660672 664641 668508 671967 674803 676868 678223 679194 680055 680620 680416 679306 677749 676383 675541 675213 675200
63087F75200Kk00j92M79J773L164M179M706M930N185N825O895Q008Q779R291R910
$$ 675200 675202 675002 674810 675289 677062 680226 684405 689111 694041 699226 705051 711946 719954 728733 738024 747934
63071G47934J0774J1797J2909J3932J4463J4392J4330J5012J6412J8038J9834
$$ 747934 758708 770505 783414 797346 811809 826201 840531 855543 871955 889993 909827
63060I09827K2043K4331K6054K7395K9261L1893L4557L6897L9493M2563M5236
$$ 909827 931870 956201 982255 1009650 1038911 1070804 1105361 1142258 1181751 1224314 1269550
63049A269550M6909M8354N0478N2772N4084N4468N4933N5665N5694N4425N2438
$$ 1269550 1316459 1364813 1415291 1468063 1522147 1576615 1631548 1687213 1742907 1797332 1849770
63038A849770N0547M8968M7698M7048M7304M8298M9491N0229M9848M7997M4955
$$ 1849770 1900317 1949285 1996983 2044031 2091335 2139633 2189124 2239353 2289201 2337198 2382153
63027B382153M1180L6454K9873K0859R747k680j5791k9027m1674n2999o2455o9586
$$ 2382153 2423333 2459787 2489660 2510519 2520266 2517586 2501795 2472768 2431094 2378095 2315640 2246054
63015B246054p4053p5888p5545p3560p0334o6182o1286n5503m8631m0981l3301
$$ 2246054 2172001 2096113 2020568 1947008 1876674 1810492 1749206 1693703 1645072 1604091 1570790
63004A570790k5981j8737j1311m184J908O900J1457J6054K0428K3979K6522K8354
$$ 1570790 1544809 1526072 1514761 1510577 1512485 1519385 1530842 1546896 1567324 1591303 1617825 1646179
62992A646179K9798L0880L1515L1728L1555L0955K9998K9029K8253K7118K4631
$$ 1646179 1675977 1706857 1738372 1770100 1801655 1832610 1862608 1891637 1919890 1947008 1971639
62981A971639K0426J5169R592L584l338j1049j8960k7022l5752m5039n3584n9989
$$ 1971639 1992065 2007234 2016826 2020410 2017072 2006023 1987063 1960041 1924289 1879250 1825666 1765677
62969A765677o4063o6644o8304o8754o7502o4657o0887n6766n2483m8170m4141
$$ 1765677 1701614 1634970 1566666 1497912 1430410 1365753 1304866 1248100 1195617 1147447 1103306
62958A103306m0593l7209l3466k9386k5626k2683k0293j7996j5960j4785j4493
$$ 1103306 1062713 1025504 992038 962652 937026 914343 894050 876054 860094 845309 830816
62947H30816j4224j3161j1479j0104r651r889j0268j0608j1016j1342j1154j0417
$$ 830816 816592 803431 791952 781848 772197 762308 752040 741432 730416 719074 707920 697503
62935F97503r773r742r934r507q300o954o003n391m995m881m846m385l533l061
$$ 697503 687730 677988 668054 658547 650247 643293 637290 631899 626904 622023 617177 612792 609259 606198
62921F06198l345l618l072k203k170l105l901l773l171k967l326l683l491k753
$$ 606198 602853 599235 596163 593960 591790 588685 584784 581011 577840 574873 571547 567864 564373 561620
62907E61620j939j470j199o32K53P38L35l93n26n3K68N2m06r00j564k279k559
$$ 561620 559681 558211 557012 556380 556633 557371 557706 557313 556787 556734 557002 557054 556648 555748 554184 551905 549346
62890E49346k326k144k443k995l419l701l931l966l633k941j944p92qj73j120
$$ 549346 547020 544876 542433 539438 536019 532318 528387 524421 520788 517847 515903 515111 515103 514930 513810
62875E13810j896j840j269q65p37m94M8N74O43J48m42l94M55J304J255N06N2K70
$$ 513810 511914 510074 508805 507940 507203 506709 506757 507331 507974 508122 507680 507286 507741 509045 510300 510806 510858 511128
62857E11128M70J12m16n90o66j172j997k577k711k604k383k034j665j411j182
$$ 511128 511598 511710 511294 510704 510038 508866 506869 504292 501581 498977 496594 494560 492895 491484 490302
62842D90302q60n33k26K80J017J490J185K64o32j100j214j184j173j270j350j110
$$ 490302 489442 488909 488683 488963 489980 491470 492655 492919 492287 491187 489973 488789 487616 486346 484996 483886
62826D83886m88P7J28l12r16j486j909j945j456o99r1J97J68j60n26l13Q19K341
$$ 483886 483398 483475 483603 483291 482375 480889 478980 477035 475579 474880 474789 474986 475154 474994 474468 474155 474974 477315
62808D77315L318L452L325L608M399N226N565N365N277O115P832R361R815R593
$$ 477315 480633 484085 487410 491018 495417 500643 506208 511573 516850 522965 530797 540158 549973 559566
62794E59566R888J1281J3241J4908J5902J6493J7376J9240K2107K5168K7582K9420
$$ 559566 569454 580735 593976 608884 624786 641279 658655 677895 700002 725170 752752 782172
62782G82172L1528L4544L8483M3129M8306N3730N9094O4387O9853P5513Q1049
$$ 782172 813700 848244 886727 929856 978162 1031892 1090986 1155373 1225226 1300739 1381788
62771A381788Q6168R0740R4508R6990R7785R6640R3141Q6696P7057O4705N0477
$$ 1381788 1467956 1558696 1653204 1750194 1847979 1944619 2037760 2124456 2201513 2266218 2316695
62760B316695L4964J8411J151j6072l2318m6985n9993p1354q0690q7482r1764
$$ 2316695 2351659 2370070 2371221 2355149 2322831 2275846 2215853 2144499 2063809 1976327 1884563
62749A884563r4105r4861r3874r1255q7831q4322q0419p5320o9048o2672n7196
$$ 1884563 1790458 1695597 1601723 1510468 1422637 1338315 1257896 1182576 1113528 1050856 993660
62738I93660n2712m8648m4471m0073l5829l2274k9529k7140k4611k1900j9174
$$ 993660 940948 892300 847829 807756 771927 739653 710124 682984 658373 636473 617299
62727F17299j6493j4118j2664j2332j2256j1322r482p566o002m538l095j986j109
$$ 617299 600806 586688 574024 561692 549436 538114 528632 521066 515064 510526 507431 505445 504336
62714E04336J67K029L879N261O521Q106R845J1335J2614J3961J5484J7198J9248
$$ 504336 504503 506532 510411 515672 522193 530299 540144 551479 564093 578054 593538 610736 629984
62701F29984K1686K4401K7423L0953L4882L8788M2632M6905N1720N6323N9991
$$ 629984 651670 676071 703494 734447 769329 808117 850749 897654 949374 1005697 1065688
62690A065688O2966O5912O8765P0700P1014O9577O6435O1468N4481M5432L4564
$$ 1065688 1128654 1194566 1263331 1334031 1405045 1474622 1541057 1602525 1657006 1702438 1737002
62679A737002K2366R287m461j8499l1712m2654n0797n6881o1861o5914o8780p0328
$$ 1737002 1759368 1768655 1764194 1745695 1713983 1671329 1620532 1563651 1501790 1435876 1367096 1296768
62667A296768p0421o8820o5841o2552n9634n6506n2267m7165m2329l8357l4947
$$ 1296768 1226347 1157527 1091686 1029134 969500 912994 860727 813562 771233 732876 697929
62656F97929l1809k9075k6808k4789k2858k0935j8757j6232j3973j2793j2628
$$ 697929 666120 637045 610237 585448 562590 541655 522898 506666 492693 479900 467272
62645D67272j2578j2087j1368j0653r760q688p926p752p767p460o842o182n530
$$ 467272 454694 442607 431239 420586 410826 402138 394212 386460 378693 371233 364391 358209 352679
62632C52679m822m098l404k796k570l043l852m024l080j674p47m76m25l71m12
$$ 352679 347857 343759 340355 337559 334989 331946 328094 324070 320990 319316 318569 318093 317668 317297 316885
62617C16885m63k95PJ28J50O62K032L825N220N928O396P066P627P481O934P276
$$ 316885 316422 316127 316134 316262 316412 317074 319106 322931 328151 334079 340475 347541 355168 362649 369583 376859
62601C76859R262J1954J3781J4503J5320J7139J9670K2383K5359K8676L1866L4639
$$ 376859 386121 398075 411856 426359 441679 458818 478488 500871 526230 554906 586772 621411
62589F21411L7535M1096M4877M7975N0109N1420N1679N0527M8206M5143M0901
$$ 621411 658946 700042 744919 792894 843003 894423 946102 996629 1044835 1089978 1130879
62578A130879L4545K6046J6558P118k078j1017j9252k6350l2295l7087m0437m2199
$$ 1130879 1165424 1191470 1208028 1215146 1213068 1202051 1182799 1156449 1124154 1087067 1046630 1004431
62566A004431m2662m2205m1049l9603l8421l7522l6177l3844l0877k7996k5404
$$ 1004431 961769 919564 878515 838912 800491 762969 726792 692948 662071 634075 608671
62555F08671k2969k0869j9466j8618j7702j6347j4780j3467j2654j2285j2134
$$ 608671 585702 564833 545367 526749 509047 492700 477920 464453 451799 439514 427380
62544D27380j1937j1504j0742r568p988o322n058m353l835l149k362j713j102
$$ 427380 415443 403939 393197 383629 375641 369319 364261 359908 356073 352924 350562 348849 347747
62531C47747k15R32J894K286K268K472L444N066O580P325P404P476Q019R101J0693
$$ 347747 347532 348464 350358 352644 354912 357384 360828 365894 372474 379799 387203 394679 402698 411799 422492
62516D22492J2676J4577J5927J7081J8997K1996K5311K8203L0811L3426L5699
$$ 422492 435168 449745 465672 482753 501750 523746 549057 577260 608071 641497 677196
62505F77196L7323L8819M0633M1879M1007L7675L2974K7850K2191J5600Q172K66
$$ 677196 714519 753338 793971 835850 876857 914532 947506 975356 997547 1013147 1021319 1021585
62493A021585p717j5045k0912k5288k8941l2249l4679l5722l5703l5152l3985
$$ 1021585 1013868 998823 977911 952623 923682 891433 856754 821032 785329 750177 716192
62482G16192l1909k9181k6381k3718k1063j8439j6023j3787j1611r601p991o794
$$ 716192 684283 655102 628721 605003 583940 565501 549478 535691 524080 514479 506488 499694
62470D99694n847n021m150k978j513j86O09R96J381J980K814L906N104O014O438
$$ 499694 493847 488826 484676 481698 480185 479999 480608 481604 482985 484965 487779 491685 496789 502803 509241
62455E09241O721P252P905Q404Q898R589J0025R501Q170O997O433N836M524K676
$$ 509241 515962 523214 531119 539523 548421 558010 568035 577536 585706 592703 599136 604972 609496 612172
62441F12172P62j439m389p667j0170j1542j2737j4650j6719j7587j6898j5684
$$ 612172 612934 611495 607106 599439 589269 577727 564990 550340 533621 516034 499136 483452
62429D83452j4816j3869j2058r731q042p328o720n536m201l327k558j069J160
$$ 483452 468636 454767 442709 432978 424936 417608 410888 405352 401151 397824 395266 394197 395357
62416C95357L249M500M984N153N390O004P140Q477R407R627R414R153Q909Q533
$$ 395357 398606 403106 408090 413243 418633 424637 431777 440254 449661 459288 468702 477855 486764 495297
62402D95297P975P324O634N896N051L985K520N56j747l894n245n529n217n193
$$ 495297 503272 510596 517230 523126 528177 532162 534682 535238 533491 529597 524352 518823 513606 508413
62388E08413n882o812p157o560n318l960k878k153j514n26J018K972N184P702
$$ 508413 502531 495719 488562 482002 476684 472724 469846 467693 466179 465653 466671 469643 474827 482529
62374D82529J0491J3267J5923J8810K2143K5437K8057L0237L2894L6490M0497
$$ 482529 493020 506287 522210 541020 563163 588600 616657 646894 679788 716278 756775
62363G56775M4148M7204M9861N2303N4559N6458N7534N7117N4667M9906M2785
$$ 756775 800923 848127 897988 950291 1004850 1061308 1118842 1175959 1230626 1280532 1323317
62352A323317L3652K3428J3232L628n378j3610k0416k5341k8813l1839l5089l8378
$$ 1323317 1356969 1380397 1393629 1397257 1391879 1378269 1357853 1332512 1303699 1271860 1236771 1198393
62340A198393m0877m1772m0936l9091l7178l5525l3750l1441k8720k6080k4017
$$ 1198393 1157516 1115744 1074808 1035717 998539 963014 929264 897823 869103 843023 819006
62329H19006k2763k2099k1381k0053j8309j6831j5855j4840j3231j1159r095p183
$$ 819006 796243 774144 752763 732710 714401 697570 681715 666875 653644 642485 633390 626207
62317F26207n271l414j970j199r77q87n71j43j90j147k636l834m518n324o751
$$ 626207 620936 617522 615552 614353 613376 612489 611918 611775 611585 610438 607802 603968 599450 594126 587375
62302E87375q329r152q907q048p225o833o869o846o092m462k651j422p86k55L33
$$ 587375 579046 569894 560987 552939 545714 538881 532012 525166 519074 514612 511961 510539 509753 509498 509831
62287E09831P85J165J835K851L796M392M852N517O430P453Q536R694J0902J2080
$$ 509831 510616 511781 513616 516467 520263 524655 529507 535024 541454 548907 557443 567137 578039 590119
62273E90119J3082J3708J3992J4410J5477J7111J8766K0255K2032K4507K7470
$$ 590119 603201 616909 630901 645311 660788 677899 696665 716920 738952 763459 790929
62262G90929L0557L3913L7919M2447M6843N0598N3572N5522N5842N4071N0225
$$ 790929 821486 855399 893318 935765 982608 1033206 1086778 1142300 1198142 1252213 1302438
62251A302438M4446L6551K6412J4747L150o860j4765k1056k6485l1428l5771l9246
$$ 1302438 1346884 1383435 1409847 1424594 1427744 1420884 1406119 1385063 1358578 1327150 1291379 1252133
62239A252133m1790m3512m4407m4199m2643l9912l6488l2767k8946k5238k1835
$$ 1252133 1210343 1166831 1122424 1078225 1035582 995670 959182 926415 897469 872231 850396
62228H50396j8579j5102j1523q617o909n942m910l750l047k879k549j684r28j083
$$ 850396 831817 816715 805192 796575 789666 783724 778814 775064 772017 769138 766589 764905 763977 762894
62214G62894j907k326j762p58k30l98o37k46Q52K131L123L910M915O357Q085R906
$$ 762894 760987 758661 756899 756141 755911 755513 754876 754630 755482 757613 760736 764646 769561 775918 784003 793909
62198G93909J1796J3752J5678J7572J9606K1902K4328K6712K9067L1445L3613
$$ 793909 805705 819457 835135 852707 872313 894215 918543 945255 974322 1005767 1039380
62187A039380L5082L5417L4393L1861K7710K2096J5786R993N644K751P16p00j014
$$ 1039380 1074462 1109879 1144272 1176133 1203843 1225939 1241725 1251718 1257362 1260113 1260829 1260129 1259115
62174A259115J26K217M495P046J0701J5781K1496K6664L0523L2732L3228L2423
$$ 1259115 1259241 1261458 1265953 1272999 1283700 1299481 1320977 1347641 1378164 1410896 1444124 1476547
62162A476547L0923K8718K5107J9961J4456R957O565L425K48k422m305n891p603
$$ 1476547 1507470 1536188 1561295 1581256 1595712 1605669 1612234 1615659 1615907 1613485 1609180 1603289 1595686
62149A595686r161j0118j0562j0835j0823r960p857m772j492J185K959M077M836
$$ 1595686 1586525 1576407 1565845 1555010 1544187 1534227 1526370 1521598 1520106 1521291 1524250 1528327 1533163
62136A533163N190N058M815N032N758O562P345Q571J0462J2493J4078J5362J6784
$$ 1533163 1538353 1543411 1548226 1553258 1559016 1565578 1572923 1581494 1591956 1604449 1618527 1633889 1650673
62123A650673J8275J9431K0330K1441K2741K3639K3925K4181K4896K5741K6221
$$ 1650673 1668948 1688379 1708709 1730150 1752891 1776530 1800455 1824636 1849532 1875273 1901494
62112A901494K6572K7363K8419K8945K8705K8395K8639K9210K9632K9965L0588
$$ 1901494 1928066 1955429 1983848 2012793 2041498 2069893 2098532 2127742 2157374 2187339 2217927
62101B217927L1522L2510L3549L4859L6429L8085L9852M1865M4047M6355M9153
$$ 2217927 2249449 2281959 2315508 2350367 2386796 2424881 2464733 2506598 2550645 2597000 2646153
62090B646153N2655N6026N7770N7275N5441N3638N2673N2993N5031N8659O2636
$$ 2646153 2698808 2754834 2812604 2869879 2925320 2978958 3031631 3084624 3139655 3198314 3260950
62079C260950O5247O5367O2638N7229N0042M2839L7342L4104L2642L2448L3306
$$ 3260950 3326197 3391564 3454202 3511431 3561473 3604312 3641654 3675758 3708400 3740848 3774154
62068C774154L4816L6296L7298L7708L7346L5955L3498K9980K5053J8554J1506
$$ 3774154 3808970 3845266 3882564 3920272 3957618 3993573 4027071 4057051 4082104 4100658 4112164
62057D112164N702J904r79m475q899j3510j7737k1582k5148k8378l1234l3561
$$ 4112164 4117866 4119770 4118791 4114316 4105417 4091907 4074170 4052588 4027440 3999062 3967828 3934267
62045C934267l4966l5201l4574l3539l2085l0031k7670k5493k3352k0673j7607
$$ 3934267 3899301 3864100 3829526 3795987 3763902 3733871 3706201 3680708 3657356 3636683 3619076
62034C619076j5159j3824j2781j1021q759p053o311n893n125m053l159k840l330
$$ 3619076 3603917 3590093 3577312 3566291 3557532 3550479 3544168 3538275 3533150 3529097 3525938 3523098 3519768
62021C519768m587o041o890o808o136n256m299l573l663m640n655n923n781o084
$$ 3519768 3515181 3509140 3502250 3495442 3489306 3484050 3479751 3476178 3472515 3467875 3462220 3456297 3450516 3444432
62007C444432o845p140o392n048l869l169k936l204l972n210p176j0428j5249
$$ 3444432 3437587 3430447 3424055 3419007 3415138 3411969 3409033 3405829 3401857 3396647 3389471 3379043 3363794
61994C363794k1370k8381l5995m3644n0269n4933n7481n8298n7748n6114n3771
$$ 3363794 3342424 3314043 3278048 3234404 3184135 3129202 3071721 3013423 2955675 2899561 2845790
61983B845790n1055m8114m5199m2730m0783l8762l6073l2961l0224k8256k6802
$$ 2845790 2794735 2746621 2701422 2658692 2617909 2579147 2543074 2510113 2479889 2451633 2424831
61972B424831k5547k4500k3753k3202k2582k1606k0180j8655j7635j7247j6920
$$ 2424831 2399284 2374784 2351031 2327829 2305247 2283641 2263461 2244806 2227171 2209924 2193004
61961B193004j6191j5447j5242j5260j4689j3579j2952j3340j3970j3722j2318
$$ 2193004 2176813 2161366 2146124 2130864 2116175 2102596 2089644 2076304 2062334 2048612 2036294
61950B036294j0165p637n033k882j584p92L13K119M269O290Q244J0500J3090J5469
$$ 2036294 2026129 2018492 2013459 2010577 2008993 2008201 2008514 2010633 2014902 2021192 2029436 2039936 2053026 2068495
61936B068495J7096J8098J9186K0817K2726K4510K6338K8667L1358L3744L5701
$$ 2068495 2085591 2103689 2122875 2143692 2166418 2190928 2217266 2245933 2277291 2311035 2346736
61925B346736L8095M1807M6767N2397N8695O6340P5908Q7494J01062J16685J34259
$$ 2346736 2384831 2426638 2473405 2525802 2584497 2650837 2726745 2814239 2915301 3031986 3166245
61914C166245J53468J74224J96913K21994K49676K80297L14715L53843L97754
$$ 3166245 3319713 3493937 3690850 3912844 4162520 4442817 4757532 5111375 5509129
61905E509129M45693M97008N51477O08111O63580P11870P45056P54087P29641
$$ 5509129 5954822 6451830 7003307 7611418 8274998 8986868 9731924 10486011 11215652
61896A1215652O64099N54509M04612K24525K8759j66224l44597m93883o06955
$$ 11215652 11879751 12434260 12838872 13063397 13092156 12925932 12581335 12087452 11480497
61887A1480497o82314p22816p33819p21507o91886o50562o02713n52459n02081
$$ 11480497 10798183 10075367 9341548 8620041 7928155 7277593 6674880 6122421 5620340
61878E620340m52547m05051l61429l22769k88473k57415k29311k04220j81533
$$ 5620340 5167793 4762742 4401313 4078544 3790071 3532656 3303345 3099125 2917592
61869B917592j60647j42232j27290j15136j03649r1781q0460p0679o2043n3844
$$ 2917592 2756945 2614713 2487423 2372287 2268638 2176857 2096397 2025718 1963675 1909831
61859A909831m6267l9594l3223k6476j9703j3628q244l357M61K585L628M778O055
$$ 1909831 1863564 1823970 1790747 1764271 1744568 1730940 1722696 1719339 1719800 1722385 1726013 1730791 1736846
61846A736846O393N354L638J798l31k664m369m977n081n330n319m166j705J443
$$ 1736846 1743239 1748593 1752231 1754029 1753698 1751034 1746665 1741688 1736607 1731277 1725958 1721792 1720087 1721530
61832A721530M697P716J0095J1414J1583J0811R327P385N259K951J07l293o390
$$ 1721530 1726227 1733943 1744038 1755452 1767035 1777846 1787173 1794558 1799817 1802768 1802875 1799582 1793192
61819A793192q139q467q241q002p277n400k478Q80M496Q757J3819J9131K3987
$$ 1793192 1785053 1776586 1768345 1760343 1753066 1747666 1745188 1746068 1750564 1759321 1773140 1792271 1816258
61806A816258K8292L2525L7057M1779M6507N1537N7494O4603P2310P9812Q6869
$$ 1816258 1844550 1877075 1914132 1955911 2002418 2053955 2111449 2176052 2248362 2328174 2415043
61795B415043R3992J01894J10988J21300J32669J44957J58403J73824J92180K13722
$$ 2415043 2509035 2610929 2721917 2843217 2975886 3120843 3279246 3453070 3645250 3858972
61785C858972K37857K64166K93323L26711L65248M09086M58287N13358N75078
$$ 3858972 4096829 4360995 4654318 4981029 5346277 5755363 6213650 6727008 7302086
61776G302086O44361P22258Q09316R04439J004597J105583J201965J285236J342251
$$ 7302086 7946447 8668705 9478021 10382460 11387057 12492640 13694605 14979841 16322092
61767A6322092J356500J311793J195868J003215P37900M15622O2481k90441o13958
$$ 16322092 17678592 18990385 20186253 21189468 21927368 22342990 22405471 22115030 21501072
61758B1501072q85805j092787j230968j304356j322298j296369j238217j158637
$$ 21501072 20615267 19522480 18291512 16987156 15664858 14368489 13130272 11971635
61750A1971635j067245r71883q77886p88107p03955o26614n57154m95722m41379
$$ 11971635 10904390 9932507 9054621 8266514 7562559 6935945 6378791 5883069 5441690
61741E441690l93165l50842l14164k81887k52468k25595k02134j82379j65182
$$ 5441690 5048525 4697683 4383519 4101632 3849164 3623569 3421435 3239056 3073874
61732C073874j49118j33795j19568j06676r5263q5730p8305p2451o7316o2696
$$ 3073874 2924756 2790961 2671393 2564717 2469454 2383724 2305419 2232968 2165652 2102956
61722B102956n9017n6508n4854n3631n2552n1274m9409m6921m4154m1354l8394
$$ 2102956 2043939 1987431 1932577 1878946 1826394 1775120 1725711 1678790 1634636 1593282 1554888
61711A554888l5119l1746k8725k6306k4356k2573k0879j9475j8514j7776j6867
$$ 1554888 1519769 1488023 1459298 1432992 1408636 1386063 1365184 1345709 1327195 1309419 1292552
61700A292552j5735j4727j4056j3482j2811j2404j2764j3657j4040j3086j1148
$$ 1292552 1276817 1262090 1248034 1234552 1221741 1209337 1196573 1182916 1168876 1155790 1144642
61689A144642r522r247j0156j1166j1401j0965j0500j0267j0002r559r299r562
$$ 1144642 1135120 1125873 1115717 1104551 1093150 1082185 1071685 1061418 1051416 1041857 1032558 1022996
61677A022996j0129j0434j0174r499q745q209q003p944p672p010o167n528n312
$$ 1022996 1012867 1002433 992259 982760 974015 965806 957803 949859 942187 935177 929010 923482 918170
61664I18170n444n579n269m432l639l594m155m332l459j981o91K53J176K006K312
$$ 918170 912726 907147 901878 897446 893807 890213 886058 881726 878267 876286 875595 875848 877024 879030 881342
61649H81342K089J958K433L406M396M956M787L816K421J323J034J460K081K507
$$ 881342 883431 885389 887822 891228 895624 900580 905367 909183 911604 912927 913961 915421 917502 920009
61635I20009K763L126L706M297M726N204O068P160P832P656O699N010K297j488
$$ 920009 922772 925898 929604 933901 938627 943831 949899 957059 964891 972547 979246 984256 986553 985065
61621I85065n605r078j1457j2747j2979j2453j2037j2326j2658j1828r905q403
$$ 985065 979460 970382 958925 946178 933199 920746 908709 896383 883725 871897 861992 853589
61609H53589q304q782q445p190o035n568n440n270n189n308n293m807l972l057
$$ 853589 845285 836503 828058 820868 814833 809265 803825 798555 793366 788058 782765 777958 773986 770929
61595G70929k082j071l36o2K02J029K229L012L129L236L861M679N242N934P415
$$ 770929 768847 767776 767440 767378 767580 768609 770838 773850 776979 780215 784076 788755 793997 799931 807346
61580H07346R440J1016J1729J2155J2881J3879J5107J6904J9309K1547K2784K3212
$$ 807346 816786 827802 839531 851686 864567 878446 893553 910457 929766 951313 974097 997309
61568I97309K3865K5520K7930L0031L0737K9850K8368K7467K7125K6334K4784
$$ 997309 1021174 1046694 1074624 1104655 1135392 1165242 1193610 1221077 1248202 1274536 1299320
61557A299320K3483K3208K3234K2456K1103K0218J9823J8860J6879J4597J2591
$$ 1299320 1322803 1346011 1369245 1391701 1412804 1433022 1452845 1471705 1488584 1503181 1515772
61546A515772J0482P831M911K022j224n261r665j3464j6072j7505j8009j7914
$$ 1515772 1526254 1534085 1538996 1541018 1539794 1534533 1524868 1511404 1495332 1477827 1459818 1441904
61534A441904j7647j7400j6837j5496j3338j0721q009n446l193j111J358M773
$$ 1441904 1424257 1406857 1390020 1374524 1361186 1350465 1342456 1337010 1333817 1332706 1334064 1338837
61522A338837R074J3688J8167K2536K7021L1816L7198M3569N1100N9421O7924
$$ 1338837 1347911 1361599 1379766 1402302 1429323 1461139 1498337 1541906 1593006 1652427 1720351
61511A720351P6443Q5585R6172J08504J22171J36627J51801J68140J85969K04810
$$ 1720351 1796794 1882379 1978551 2087055 2209226 2345853 2497654 2665794 2851763 3056573
61501C056573K23312K39960K53806K64126K69222K66002K51396K24315J86069
$$ 3056573 3279885 3519845 3773651 4037777 4306999 4573001 4824397 5048712 5234781
61492E234781J39239Q6859L2541j9723o6733j06880j39590j64473j81364j90747
$$ 5234781 5374020 5460879 5493420 5473697 5406964 5300084 5160494 4996021 4814657 4623910
61482D623910j93580j90931j84005j74090j62024j48116j32911j17561j02884
$$ 4623910 4430330 4239399 4055394 3881304 3719280 3571164 3438253 3320692 3217808
61473C217808q8629p4247n9945m6268l3219k0681r268L59Q803J7342K6072L3815
$$ 3217808 3129179 3054932 2994987 2948719 2915500 2894819 2885551 2885910 2894713 2912055 2938127 2971942
61461B971942L9955M5206N0050N3620N4880N4128N2475N0415M7742M4628M1980
$$ 2971942 3011897 3057103 3107153 3160773 3215653 3269781 3322256 3372671 3420413 3465041 3507021
61450C507021M0618M0508M0923M1291M1878M3520M6480M9798N2143N3155N3358
$$ 3507021 3547639 3588147 3629070 3670361 3712239 3755759 3802239 3852037 3904180 3957335 4010693
61439D010693N2999N1765M9636M6983M3528L8219L0691K2089J3703N461l454j3044
$$ 4010693 4063692 4115457 4165093 4212076 4255604 4293823 4324514 4346603 4360306 4365767 4362313 4349269
61427D349269k2428l0976l8587m4960m9460n1859n2629n2285n0921m8427m4778
$$ 4349269 4326841 4295865 4257278 4212318 4162858 4110999 4058370 4006085 3955164 3906737 3861959
61416C861959m0005l4248k7940k1692j5790j0053m365Q49M802P020P688P286O003
$$ 3861959 3821954 3787706 3759766 3738074 3722284 3712231 3707866 3708715 3713517 3720537 3728225 3735511 3741514
61403C741514L627P0m260q736j2900j6322j8317j8327j6390j2818p425L26J0393
$$ 3741514 3745141 3745211 3740951 3732215 3719315 3702993 3684676 3666349 3649959 3637141 3629716 3630042 3640435
61390C640435K1954L4375M7949O3368Q0895J00217J20769J41975J63512J85468
$$ 3640435 3662389 3696764 3744713 3808081 3888976 3989193 4109962 4251937 4415449 4600917
61380D600917K07855K29900K50182K67558K81321K90181K91661K82994K62461
$$ 4600917 4808772 5038672 5288854 5556412 5837733 6127914 6419575 6702569 6965030
61371F965030K29929J86806J36027Q1578K7355k3748o9964j10518j45621j75904
$$ 6965030 7194959 7381765 7517792 7599370 7626725 7602977 7533013 7422495 7276874 7100970
61361G100970k01460k21884k37284k48487k55923k59102k57706k52451k44298
$$ 7100970 6899510 6677626 6440342 6191855 5935932 5676830 5419124 5166673 4922375
61352D922375k33666k21135k08045j95322j82320j67999j52819j38279j24879
$$ 4922375 4688709 4467574 4259529 4064207 3881887 3713888 3561069 3422790 3297911
61343C297911j11812r8553q5501p2890o0296m7702l5945k5591j6073o519L168
$$ 3297911 3186099 3087546 3002045 2929155 2868859 2821157 2785212 2759621 2743548 2737029 2740197
61332B740197J2508K1119K8683L4699L8902M1772M4192M6641M8811M9898M9180
$$ 2740197 2752705 2773824 2802507 2837206 2876108 2917880 2962072 3008713 3057524 3107422 3156602
61321C156602M6651M3209L9905L6998L4032L0905K8277K6698K5863K5100K4161
$$ 3156602 3203253 3246462 3286367 3323365 3357397 3388302 3416579 3443277 3469140 3494240 3518401
61310C518401K3102K1594J9020J5162J0468N461J71n754j2430j9356k5732l1177
$$ 3518401 3541503 3563097 3582117 3597279 3607747 3613208 3613379 3607625 3595195 3575839 3550107 3518930
61298C518930l6066m1011m6081n0745n4505n7294n9211o0195o0166n9243n7515
$$ 3518930 3482864 3441853 3395772 3345027 3290522 3233228 3174017 3113822 3053656 2994413 2936898
61287B936898n4749n0622m5309l9502l3754k8007k2045j6274j1661q693o790n056
$$ 2936898 2882149 2831527 2786218 2746716 2712962 2684955 2662910 2646636 2634975 2626282 2619492 2614436
61275B614436l466k808l524n145o983q834j0655j1929j1965j0754r124p928p275
$$ 2614436 2610970 2608162 2604638 2599493 2592510 2583676 2573021 2561092 2549127 2538373 2529249 2521321 2514046
61262B514046o555n120k809J81L926Q969J5677K3738L2750M3136N5672O9953Q4160
$$ 2514046 2507491 2502371 2499562 2499743 2503669 2512638 2528315 2552053 2584803 2627939 2683611 2753564 2837724
61249B837724R6763J07770J17826J26668J33054J35638J33129J23974J06885Q1818
$$ 2837724 2934487 3042257 3160083 3286751 3419805 3555443 3688572 3812546 3919431 4001249
61239D001249N0010J3304k5911o4375r8558j26043j46101j59099j65732j66834
$$ 4001249 4051259 4064563 4038652 3974277 3875719 3749676 3603575 3444476 3278744 3111910
61229C111910j63300j56043j46156j34862j23006j10809r8658q7640p8637p1155
$$ 3111910 2948610 2792567 2646411 2511549 2388543 2277734 2179076 2091436 2012799 1941644
61219A941644o3981n6829n0452m5086l9828l4007k8309k3916k0924j8161j4380
$$ 1941644 1877663 1820834 1770382 1725296 1685468 1651461 1623152 1599236 1578312 1560151 1545771
61208A545771r412m251p5L004O102J0111J4409J7548J9077J9790K0236J9915J8256
$$ 1545771 1536359 1532108 1532033 1535037 1541139 1551250 1565659 1583207 1602284 1622074 1642310 1662225 1680481
61195A680481J5512J2224Q477M321L01k991n549p719r696j1697j4119j7032j9850
$$ 1680481 1695993 1708217 1716694 1721015 1721316 1718325 1712776 1705057 1695361 1683664 1669545 1652513 1632663
61182A632663k2020k3708k5299k6611k7210k7293k7533k8114k8491k8250k7644
$$ 1632663 1610643 1586935 1561636 1535025 1507815 1480522 1452989 1424875 1396384 1368134 1340490
61171A340490k7140k6753k6172k5355k4737k4772k5402k6085k6343k6158k5682
$$ 1340490 1313350 1286597 1260425 1235070 1210333 1185561 1160159 1134074 1107731 1081573 1055891
61160A055891k4792k3260k1308j9532j8192j6906j5280j3589j2622j3031j4812
$$ 1055891 1031099 1007839 986531 966999 948807 931901 916621 903032 890410 877379 862567
61149H62567j7270j9330k0226j9994j9241j8436j7574j6465j4983j2991j0461
$$ 862567 845297 825967 805741 785747 766506 748070 730496 714031 699048 686057 675596
61138F75596p708n266l391j941p21L84J585L030M507N688O674P823R074J0025
$$ 675596 667888 662622 659231 657290 656569 656953 658538 661568 666075 671763 678437 686260 695334 705359
61124G05359J0675J1365J1961J1898J1309J1175J1896J2571J2347J1682J1489
$$ 705359 716034 727399 739360 751258 762567 773742 785638 798209 810556 822238 833727
61113H33727J1656J1448J0927J0891J1428J1473J0034P211L819N38k400m991p209
$$ 833727 845383 856831 867758 878649 890077 901550 911584 918795 922614 923152 920752 915761 908552
61100I08552q853r698r907j0005j0231j0267r939r843j0662j2154j3387j3881
$$ 908552 899699 890001 880094 870089 859858 849591 839652 829809 819147 806993 793606 779725
61088G79725j3906j3744j3347j2766j2341j2240j2188j1877j1297j0585r786q907
$$ 779725 765819 752075 738728 725962 713621 701381 689193 677316 666019 655434 645648 636741
61076F36741p921o738n333l876k519j222n8N67N38N59J407K716L263K645J872
$$ 636741 628820 622082 616749 612873 610354 609132 609074 609641 610179 610738 612145 614861 618124 620769 622641
61061F22641J981K651K815K180J436J211J350J301P79J7m58k40N91J562K345L065
$$ 622641 624622 627273 630088 632268 633704 634915 636265 637566 638345 638362 637904 637664 638255 639817 642162 645227
61045F45227L893M636N061N467O427P906R146R681J0006J0805J1884J2463J2397
$$ 645227 649120 653756 658817 664284 670711 678617 687763 697444 707450 718255 730139 742602 754999
61032G54999J2382J2862J3377J3374J3055J2851J2549J1651J0453R867J0160J0554
$$ 754999 767381 780243 793620 806994 820049 832900 845449 857100 867553 877420 887580 898134
61020H98134J0326R699R373R626J0279J1122J2077J3177J4644J6708J9147K1461
$$ 898134 908460 918159 927532 937158 947437 958559 970636 983813 998457 1015165 1034312 1055773
61008A055773K3573K6007K9130L2784L6928M1938M7809N3555N8125O1512O4424
$$ 1055773 1079346 1105353 1134483 1167267 1204195 1246133 1293942 1347497 1405622 1467134 1531558
60997A531558O7304P0457P4730Q1227R0375J01926J15670J31414J48411J65660
$$ 1531558 1598862 1669319 1744049 1825276 1915651 2017577 2133247 2264661 2413072 2578732
60987B578732J82930K01021K21223K45186K75128L13313L61373M20831M94090
$$ 2578732 2761662 2962683 3183906 3429092 3704220 4017533 4378906 4799737 5293827
60978E293827N84354O95524Q33793J008837J232014J514227J864917K281560K718486
$$ 5293827 5878181 6573705 7407498 8416335 9648349 11162576 13027493 15309053 18027539
60969A8027539L055430L117490K770792K034974J108184K66370k81492m64920
$$ 18027539 21082969 24200459 26971251 29006225 30114409 30380779 30099287 29634367
60961B9634367l24359L8513M68378P55015O94846K06478o00685j482333k199557
$$ 29634367 29310008 29348521 29816899 30571914 31266760 31473238 30872553 29390220 27190663
60952B7190663k629292k775735k710908k514320k247903j955812j668300j403540
$$ 27190663 24561371 21785636 19074728 16560408 14312505 12356693 10688393 9284853
60944I284853j170219r70964q04514o67117n54505m63598l92202l37434k95224
$$ 9284853 8114634 7143670 6339156 5672039 5117534 4653936 4261734 3924300 3629076
60935C629076k61651k34346k12187j93917j77623j61803j46350j31994j18927
$$ 3629076 3367425 3133079 2920892 2726975 2549352 2387549 2241199 2109205 1990278
60926A990278j06599r4804q4398p6546p1591o8821o7030o5065o2181n8304n3935
$$ 1990278 1883679 1788875 1704477 1627931 1556340 1487519 1420489 1355424 1293243 1234939 1181004
60915A181004m9590m5382m1254l7354l3876l0680k7462k4315k1726j9871j8158
$$ 1181004 1131414 1086032 1044778 1007424 973548 942868 915406 891091 869365 849494 831336
60904H31336j5828j2992j0700r755r673r151p553n442l619k153p51M38J068J396
$$ 831336 815508 802516 791816 782061 772388 763237 755684 750242 746623 744470 743719 744157 745225 746621
60890G46621K109L272M076L872K953K058J470R02m4j563l569n724p613r013r827
$$ 746621 748730 752002 756078 759950 762903 764961 766431 767333 767289 765726 762157 756433 748820 739807 729980
60875G29980r889r200q355q175q725r174q854p986p085o186n124m111l417k716
$$ 729980 720091 710891 702536 694361 685636 676462 667608 659622 652537 646351 641227 637116 633699 630983
60861F30983j428L66J924K770L211L847M929O292P627Q689R475J0274J1398J2826
$$ 630983 629555 629921 631845 634615 637826 641673 646602 652894 660521 669210 678685 688959 700357 713183
60847G13183J4264J5522J6653J7716J8575J8993J8838J8179J7191J5864J3906
$$ 713183 727447 742969 759622 777338 795913 814906 833744 851923 869114 884978 898884
60836H98884J1188Q280O100M794L515J646j08n71K19R12M03j070k574l645m494
$$ 898884 910072 918352 924452 929246 932761 934407 934299 933728 933947 934859 935262 934192 931618 927973 923479
60821I23479n459o588p656q353q646q887r471j0304j0917j1066j0972j0928j0973
$$ 923479 918020 911432 903776 895423 886777 877890 868419 858115 847198 836132 825160 814232 803259
60808H03259j1002j0876j0305r022p268n792n105m931m577l684k458j297l62O53
$$ 803259 792257 781381 771076 762054 754786 748994 743889 738958 734381 730697 728239 726942 726580 727233
60794G27233K278M649P114Q839R750J0495J1407J2115J2383J2702J3595J4788
$$ 727233 729511 734160 741274 750113 759863 770358 781765 793880 806263 818965 832560 847348
60782H47348J5576J5667J5126J3905J2065J0191Q926Q173P442O803O786P334P583
$$ 847348 862924 878591 893717 907622 919687 929878 938804 946977 954419 961222 968008 975342 982925
60769I82925O951N778M643L677K841K307K099J819J210O51O08Q21M60r27k917
$$ 982925 989876 995654 1000297 1003974 1006815 1009122 1011221 1013040 1014250 1014901 1015509 1016330 1016790 1015863 1012946
60754A012946m577n135m572l713l539m094m352l450j807o96q77k037l377m293
$$ 1012946 1008369 1003234 998662 994949 991410 987316 982964 979514 977707 977011 976134 974097 970720 966427
60740I66427m620m639m878n515o016n722m730l832l538l640l707l588l239k462
$$ 966427 961807 957168 952290 946775 940759 935037 930307 926475 922937 919297 915590 912002 908763 906301
60726I06301j228rM86j9j076j866j842j236q67j345k418l276l498l389l413l619
$$ 906301 905073 905064 905550 905531 904455 902589 900747 899511 898644 897299 894881 891605 888107 884718 881305 877686
60710H77686l871m196m600m734m197l218k616k876l493l542k818k077k107k870
$$ 877686 873815 869619 865019 860285 856088 852870 850254 847378 843885 840343 837525 835448 833341 830471
60696H30471l802m667n662o798p713q245q753r590j0581j1363j1862j2146j2065
$$ 830471 826669 822002 816340 809542 801829 793584 784831 775241 764660 753297 741435 729289 717224
60683G17224j1450j0523r687r054q463p801o968n767m171k500j008M09J628K046
$$ 717224 705774 695251 685564 676510 668047 660246 653278 647511 643340 640840 639832 640241 641869 643915
60669F43915J593J512L001N307O433N839N128N577O359O064M878M092M053L924
$$ 643915 645508 647020 650021 655328 661761 667600 672728 678305 684664 690728 695606 699698 703751 707675
60655G07675L256K666K829L683M815N949O816P109O877O632O812P349P847Q031
$$ 707675 710931 713597 716426 720109 724924 730873 737689 744798 751675 758307 765119 772468 780315 788346
60641G88346P889P620P471P548P821Q306R155J0399J1757J2893J3649J3963J3794
$$ 788346 796235 803855 811326 818874 826695 835001 844156 854555 866312 879205 892854 906817 920611
60628I20611J3297J2760J2154J1041R202P082N169L309J104j246l136m511o070
$$ 920611 933908 946668 958822 969863 979065 986147 991316 994625 995729 994483 991347 986836 980766
60615I80766q332j0874j2704j3135j2276j0867r612q542p068m845k294j2J959
$$ 980766 972434 961560 948856 935721 923445 912578 902966 894424 887356 882511 880217 880205 882164
60602H82164L851N377N888N271M105K803J150j077l533n643p145p981p944o874
$$ 882164 886015 891392 897280 902551 906656 909459 910609 909532 905999 900356 893211 885230 877286 870412
60588H70412n050l084j400l0J076J819K129K192K293K497K695K902L240L493L089
$$ 870412 865362 862278 860878 860848 861924 863743 865872 868064 870357 872854 875549 878451 881691 885184 888273
60573H88273J902P20M01P06O73P2l58k92n40j801l471m438m622m939n987p523
$$ 888273 890175 890895 891296 892002 892675 892747 892389 892097 891557 889756 886285 881847 877225 872286 866299 858776
60557H58776r050j0228j0733j0322r085p324n194k837o54R81K075K806L286L929
$$ 858776 849726 839498 828765 818443 809358 802034 796840 794003 793349 794330 796405 799211 802497 806426
60543H06426N498Q127J0760J2443J3898J6799K1627K7291L2835L8422M4327M9786
$$ 806426 811924 820051 830811 843254 857152 873951 895578 922869 955704 994126 1038453 1088239
60531A088239N3414N4104N1271M4801L5097K2822Q631o315j9754k9280l4203l5673
$$ 1088239 1141653 1195757 1247028 1291829 1326926 1349748 1358379 1352064 1332310 1303030 1268827 1233154
60519A233154l4836l1804k6657k0346j3893p574j583L264O316P988R050R549R228
$$ 1233154 1198318 1166514 1139857 1119511 1105618 1098044 1096461 1099725 1106041 1114029 1123079 1132628 1141856
60506A141856Q581Q478R043R687J0270J1426J3754J7296K1883K7493L4128M1799
$$ 1141856 1150437 1158915 1167958 1177645 1187915 1199341 1213095 1230391 1252274 1279767 1313895 1355694
60494A355694N0650O0831P2199Q4242R6222J07302J16982J25733J34976J46159
$$ 1355694 1406344 1467175 1539374 1623616 1719838 1827140 1944122 2069855 2204831 2350990
60484B350990J60159J77844K00702K30285K67161L10630L58575M06417M46153
$$ 2350990 2511149 2688993 2889695 3119980 3387141 3697771 4056346 4462763 4908916
60475D908916M67512M61069M21057L46546K41560J14556k2861j57791k77738l72352
$$ 4908916 5376428 5837497 6258554 6605100 6846660 6961216 6938355 6780564 6502826 6130474
60465F130474m35630m67422m72506m57606m28958l91803l50687l09203k69663
$$ 6130474 5694844 5227422 4754916 4297310 3868352 3476549 3125862 2816659 2546996
60456B546996k33490k01699j74708j51984j32471j15443j00707q8061p6993o6989
$$ 2546996 2313506 2111807 1937099 1785115 1652644 1537201 1436494 1348433 1271440 1204451
60446A204451n7876m9704m2553l6629l2306k9660k7939k5972k3334k0878j9662
$$ 1204451 1146575 1096871 1054318 1017689 985383 955723 927784 901812 878478 857600 837938
60435H37938j9541j9310j8207j6712j5578j4650j3176j1023q953p633o885o111
$$ 837938 818397 799087 780880 764168 748590 733940 720764 709741 700788 693155 686270 680159
60423F80159n106m159l525l136k806k456k094j673j148n42J45R62J838K459K619
$$ 680159 675053 670894 667369 664233 661427 658971 656877 655204 654056 653514 653659 654621 656459 658918 661537
60408F61537K630K981L549L621K937K240K335K987L358L318L565M503N636O268
$$ 661537 664167 667148 670697 674318 677255 679495 681830 684817 688175 691493 695058 699561 705197 711465
60394G11465O291O069N986O199O472O165M851L012J586P67j31j423k460k643k382
$$ 711465 717756 723825 729811 736010 742482 748647 753498 756510 758096 758863 758732 757309 754849 752206 749824
60379G49824k457k930l285l334l321l346l227k843k233j428n28K30O96R48R92
$$ 749824 747367 744437 741152 737818 734497 731151 727924 725081 722848 721420 720892 721122 721818 722766 723758
60364G23758O80K01K25J144K384L023K844K404K261K585L322M182M666M569M406
$$ 723758 724438 724639 724864 726008 728392 731415 734259 736663 738924 741509 744831 749013 753679 758248 762654
60349G62654M843N777O494O707O936P701Q808R579R586Q977Q192P498O732N538
$$ 762654 767497 773274 779768 786475 793411 801112 809920 819499 829085 838062 846254 853752 860484 866022
60335H66022L836J969L77o34q69l78L42P34J027K152M441O844P916P272N653L812
$$ 866022 869858 871827 872204 871570 870701 870323 870665 871399 872426 874578 879019 885863 893779 901051 906704 910516
60319I10516J981J45j689l515n235o618p538q106q293p821o702n494m563l561
$$ 910516 912497 912642 910953 907438 902203 895585 888047 879941 871648 863827 857125 851631 847068 843507
60305H43507k173r48o18r93j293j348j526j649r48P68K727M212N163N639N488
$$ 843507 841334 840386 839768 838775 837482 836134 834608 832959 832011 832779 835506 839718 844881 850520 856008
60290H56008M930M690N048N308M678L295J966J196R08Q26P58O58O63R35J341J579
$$ 856008 860938 865628 870676 875984 880662 883957 885923 887119 888027 888853 889611 890269 890932 891867 893208 894787
60274H94787J694K116K984L875M445M941N802P038Q449J0117J2197J4353J5953
$$ 894787 896481 898597 901581 905456 909901 914842 920644 927682 936131 946248 958445 972798 988751
60261I88751J6924J7968J9764K2234K4834K7351L0091L3339L6995M0888M5147
$$ 988751 1005675 1023643 1043407 1065641 1090475 1117826 1147917 1181256 1218251 1259139 1304286
60250A304286N0001N5405O1220O7664P5064Q3101R0828R7712J04165J10677J16822
$$ 1304286 1354287 1409692 1470912 1538576 1613640 1696741 1787569 1885281 1989446 2100123 2216945
60239B216945J21688J24985J27073J27911J26602J22214J14673J04681R3038Q0158
$$ 2216945 2338633 2463618 2590691 2718602 2845204 2967418 3082091 3186772 3279810 3359968
60229C359968O6089N0818L4629J8215K360j2378k5658l7193m6734n3944n8252
$$ 3359968 3426057 3476875 3511504 3529719 3532079 3519701 3494043 3456850 3410116 3356172 3297920
60218C297920n9106n6706n2131m6386l9450l0649j9826p711M809J7430L0430M4103
$$ 3297920 3238814 3182108 3129977 3083591 3044141 3013492 2993666 2985955 2990764 3008194 3038624 3082727
60206C082727N8268P2287Q5633R8291J10267J20792J28581J32996J34317J32595
$$ 3082727 3140995 3213282 3298915 3397206 3507473 3628265 3756846 3889842 4024159 4156754
60196D156754J27074J17204J03559Q7159O8540M8168K7112O324j4201l4616n4036
$$ 4156754 4283828 4401032 4504591 4591750 4660290 4708458 4735570 4741894 4727693 4693077 4639041
60185D639041p1063q5159r6396j04235j07884j07604j04496r8849r0042p8098
$$ 4639041 4567978 4482819 4386423 4282188 4174304 4066700 3962204 3863355 3773313 3695215
60175C695215o4122m8946l2546j5155K318J9354L6226N2753O7722Q0167R0158
$$ 3695215 3631093 3582147 3549601 3534446 3536764 3556118 3592344 3645097 3712819 3792986 3883144
60164C883144R7662J01589J00894R5832Q7261P5441O0534M3692K6565R945o241
$$ 3883144 3980806 4082395 4183289 4279121 4366382 4441823 4502357 4546049 4572614 4582559 4576318
60153D576318k1710l5282m5559n1652n3483n1674m6949l9327k8306j4110J853
$$ 4576318 4554608 4519326 4473767 4422115 4368632 4316958 4270009 4230682 4202376 4188266 4190119
60142D190119J8326L5334N3467P2622R2355J12992J35350J59477J84581K10181
$$ 4190119 4208445 4243779 4297246 4369868 4462223 4575215 4710565 4870042 5054623 5264804
60132E264804K36490K63590K90907L17616L42840L65267L83250L95725M02515
$$ 5264804 5501294 5764884 6055791 6373407 6716247 7081514 7464764 7860489 8263004
60123H263004M03402L97310L82946L60037L29453K92213K48984K00789J49490
$$ 8263004 8666406 9063716 9446662 9806699 10136152 10428365 10677349 10878138 11027628
60114A1027628R6834M3083j2605p0073j27152j81087k30368k74360l11731l40303
$$ 11027628 11124462 11167545 11154940 11084867 10957715 10776628 10546260 10271900 9960169 9619866
60104I619866l58482l65992l63306l51349l31853l06883k77562k44035k06964
$$ 9619866 9261384 8895392 8532086 8180737 7848884 7542001 7264439 7020404 6813440
60095F813440j68101j28981r0056n1678j4942J9252N1053Q0586J06531J26893
$$ 6813440 6645339 6516358 6426302 6374624 6359682 6378934 6429987 6510573 6617104 6743997
60085F743997J40704J48111J49022J42720J28747J07570Q0522M9730J7761j3391
$$ 6743997 6884701 7032812 7181834 7324554 7453301 7560871 7641393 7691123 7708884 7695493
60075G695493m2938p0509r5260j16552j34973j51608j66445j78469j87188j92943
$$ 7695493 7652555 7582046 7486786 7370234 7235261 7083653 6917208 6738739 6551551 6358608
60065F358608j95684j94720j90009j82720j73906j63428j50711j35914j19713
$$ 6358608 6162924 5968204 5778195 5595475 5421569 5258141 5107430 4971516 4851803
60056D851803j02491q4341o5468m5969k5472l646J8947M1024O1643Q0752R8549
$$ 4851803 4749312 4664971 4599503 4553534 4528062 4524416 4543363 4584387 4646030 4726782 4825331
60045D825331J14623J27921J37395J42427J42602J37387J26454J10319R0268O7433
$$ 4825331 4939954 5067875 5205270 5347697 5490299 5627686 5754140 5864459 5954727 6022160
60035F022160M2235J4999j3243m1050o7512r2290j14792j33885j48655j58857
$$ 6022160 6064395 6079394 6066151 6025101 5957589 5865299 5750507 5616622 5467967 5309110
60025E309110j64442j65092j60791j52525j41790j29377j15104r8922q1763o4844
$$ 5309110 5144668 4979576 4818785 4666260 4524470 4395093 4279989 4181067 4099304 4034460
60015D034460m8332l1261j2880O425K5763M4941O4533Q4917J05758J26425J46492
$$ 4034460 3986128 3954867 3941987 3948412 3974175 4019116 4083649 4168566 4274324 4400749 4547241
60004D547241J65539J82764J96948K06660K10481K07463J97482J81112J59193
$$ 4547241 4712780 4895544 5092492 5299152 5509633 5717096 5914578 6095690 6254883
59995F254883J32774J03323P2381M0815Q759k3555n5293q5349j12692j36096j54171
$$ 6254883 6387657 6490980 6563361 6604176 6612935 6589380 6534087 6448738 6336046 6199950 6045779
59984F045779j66173j72503j74002j70898j62910j50187j33773j15101r5199p4351
$$ 6045779 5879606 5707103 5533101 5362203 5199293 5049106 4915333 4800232 4705033 4630682
59974D630682n2474k9835p321J4196L4491N3560P0766Q5137R6599J06145J14360
$$ 4630682 4578208 4548373 4541052 4555248 4589739 4643299 4714065 4799202 4895801 5001946 5116306
59963E116306J20426J22976J21478J16321J08100R7317Q4479P0025N4433L8609
$$ 5116306 5236732 5359708 5481186 5597507 5705607 5802924 5887403 5957428 6011861 6050470
59953F050470K3790J0700p56j0564j7825k1332k0468j5171n519Q245K5719M6971
$$ 6050470 6074260 6084960 6084204 6073640 6055815 6034483 6014015 5998844 5993325 6001570 6027289 6074260
59941F074260P2585J02500J35332J69602K05304K43455K84218L26169L67261M05737
$$ 6074260 6146845 6249345 6384677 6554279 6759583 7003038 7287256 7613425 7980686 8386423
59931H386423M40009M68040M86976M93252M83396M55083M07529L41115K57500
$$ 8386423 8826432 9294472 9781448 10274700 10758096 11213179 11620708 11961823 12219323
59922A2219323J60401N5471n1197j54060k47626l26473l87107m29280m54526m64026
$$ 12219323 12379724 12435195 12383998 12229938 11982312 11655839 11268732 10839452 10384926 9920900
59912I920900m58851m41574m15911l84711l49368l11041k71267k31188j91211
$$ 9920900 9462049 9020475 8604564 8219853 7870485 7559444 7288177 7056989 6865778
59903F865778j51659j12910p4917l7438r16L3786O6618R8366J29243J58086J83132
$$ 6865778 6714119 6601209 6526292 6488854 6487938 6521724 6588342 6686708 6815951 6974037 7157169
59892G157169K02837K15795K20606K16106K01335J75344J37832R0066L4685k5329
$$ 7157169 7360006 7575801 7796407 8012513 8213848 8389192 8527024 8617090 8651775 8626446
59882H626446q6864j46250j99805k45220k81709l08819l25916l33008l31217l22126
$$ 8626446 8539582 8393332 8193527 7948307 7666598 7357779 7031863 6698855 6367638 6045512
59872F045512l07208k87928k65669k41424k16153j91340j68349j47291j27435
$$ 6045512 5738304 5450376 5184707 4943283 4727130 4535790 4367441 4220150 4092715
59863D092715j08843r2692p9951p0672o4581o1291n9824n9056n8900n9733o0557
$$ 4092715 3983872 3891180 3811229 3740557 3675976 3614685 3554861 3495805 3436905 3377172 3316615
59852C316615n9088n4316m7566m0327l2431k3409j4390p247k584M8M52k321q467
$$ 3316615 3257527 3203211 3155645 3115318 3082887 3059478 3045088 3037841 3035257 3035305 3035757 3033436 3024969
59839C024969j6820k5833l4459m2088m8171n2112n3413n2170m9342m5915m1712
$$ 3024969 3008149 2982316 2947857 2905769 2857598 2805486 2752073 2699903 2650561 2604646 2562934
59828B562934l5725k7930j9793j2450n320K700J1481K0092K8162L5786M2479M7413
$$ 2562934 2527209 2499279 2479486 2467036 2461716 2464416 2475897 2495989 2524151 2559937 2602416 2649829
59816B649829N0628N3182N6164O0109O5000P0085P3856P5004P3169O8304N9782
$$ 2649829 2700457 2753639 2809803 2869912 2934912 3004997 3078853 3153857 3227026 3295330 3355112
59805C355112M7238L2110J7284N043m065j0408j4206j5503j4454j1260o029J151
$$ 3355112 3402350 3434460 3451744 3456787 3452722 3442314 3428108 3412605 3398151 3386891 3380862 3382013
59793C382013J0193K1042L3476M7119O1909P8265R6515J16561J38590J63597J92553
$$ 3382013 3392206 3413248 3446724 3493843 3555752 3634017 3730532 3847093 3985683 4149280 4341833
59782D341833K25393K61595L01148L43769L86989M25681M53260M62363M44980
$$ 4341833 4567226 4828821 5129969 5473738 5860727 6286408 6739668 7202031 7647011
59773G647011L94377L09160J95960O7959n9396j72355k61331l22022l55078l64317
$$ 7647011 8041388 8350548 8546508 8614467 8555071 8382716 8121385 7799363 7444285 7079968
59763G079968l54883l32323l02076k68483k34056k00063j67635j37895j11160
$$ 7079968 6725085 6392762 6090686 5822203 5588147 5388084 5220449 5082554 4971394
59754D971394q6787o4106m3069k3737n582J2118K9443M5949O1683P7452R3869
$$ 4971394 4884607 4820501 4777432 4753695 4748113 4760231 4789674 4835623 4897306 4974758 5068627
59743E068627J10692J27531J44772J63295J83457K04974K27667K51761K77550
$$ 5068627 5179319 5306850 5451622 5614917 5798374 6003348 6231015 6482776 6760326
59734F760326L05344L35699L68970M04663M41901M80627N21374N63404O03923
$$ 6760326 7065670 7401369 7770339 8175002 8616903 9097530 9618904 10182308 10786231
59725A0786231O39535O67813O86811O94008O86962O65049O30061N85507N35988
$$ 10786231 11425766 12093579 12780390 13474398 14161360 14826409 15456470 16041977 16577965
59716A6577965M86888M43556M10403L90789L87116L99996M27394M65405N10065
$$ 16577965 17064853 17508409 17918812 18309601 18696717 19096713 19524107 19989512 20499577
59707B0499577N57895O04692O44720O71575O79655O64934O25242N60655M73705
$$ 20499577 21057472 21662164 22306884 22978459 23658114 24323048 24948290 25508945 25982650
59698B5982650L69070K52957J32495J5010r2688j84713k56412l04805l28892l29382
$$ 25982650 26351720 26604677 26737172 26752182 26659494 26474781 26218369 25913564 25584672 25255290
59688B5255290l08163k67989k12087j43307o3581K5566J22273K24689L31904M43727
$$ 25255290 24947127 24679138 24467051 24323744 24260163 24285729 24408002 24632691 24964595 25408322
59678B5408322N59342O76645P92838R04640J007152J092783J151809J173956J149518
$$ 25408322 25967664 26644309 27437147 28341787 29348939 30441722 31593531 32767487 33917005
59669C3917005J070047R29913P28868M74168J80538j32080m41798p27636r71670
$$ 33917005 34987052 35916965 36645833 37120001 37300539 37168459 36726661 35999025 35027355
59660C5027355j160924j288995j356336j368545j333877j261985j164222j053959
$$ 35027355 33866431 32577436 31221100 29852555 28518678 27256693 26092471 25038512
59652B5038512r45662q53263p88552p59316p66985q05113q60676r18169r64219
$$ 25038512 24092850 23239587 22451035 21691719 20924734 20119621 19258945 18340776 17376557
59643A7376557r90220r92672r72431r33578q81756q22226p58696o93768o29921
$$ 17376557 16386337 15393665 14421234 13487656 12605900 11783674 11024978 10331210 9701289
59634I701289n69595n14240m63820m17529l74887l36046l01248k70274k42413
$$ 9701289 9131694 8617454 8153634 7736105 7361218 7025172 6723924 6453650 6211237
59625F211237k16836j93035j70912j50486j31582j13892r7316q2118o8821n7986
$$ 6211237 5994401 5801366 5630454 5479968 5348386 5234494 5137178 5055060 4986239 4928253
59615D928253m9964m4646m1614m0777m2645m7640n5230o4093p3025q1362q8705
$$ 4928253 4878289 4833643 4792029 4751252 4708607 4660967 4605737 4541644 4468619 4387257 4298552
59604D298552r4789r9583j02927j04100j02349r7957r2152q5802p8861p1220o3302
$$ 4298552 4203763 4104180 4001253 3897153 3794804 3696847 3604695 3518893 3440032 3368812 3305510
59593C305510n5380m7074l8088k9016k0755j3516o917p46M886R917J4410J8381
$$ 3305510 3250130 3203056 3164968 3135952 3115197 3101681 3094764 3094018 3098904 3108821 3123231 3141612
59581C141612K1822K4644K6438K6714K5668K4272K3249K2461K1706K1593K3042
$$ 3141612 3163434 3188078 3214516 3241230 3266898 3291170 3314419 3336880 3358586 3380179 3403221
59570C403221K6261L0845L6569M3450N1287N9708O8611P8154Q8428R9448J11255
$$ 3403221 3429482 3460327 3496896 3540346 3591633 3651341 3719952 3798106 3886534 3985982 4097237
59559D097237J23803J37098J51662J68229J86546K05174K23002K40385K58057
$$ 4097237 4221040 4358138 4509800 4678029 4864575 5069749 5292751 5533136 5791193
59550E791193K75594K91797L05877L17175L24277L25795L21994L14420L03842
$$ 5791193 6066787 6358584 6664461 6981636 7305913 7631708 7953702 8268122 8571964
59541H571964K89789K72268K52829K33288K14119J94382J72655J48019J21096
$$ 8571964 8861753 9134021 9386850 9620138 9834257 10028639 10201294 10349313 10470409
59532A0470409R4640P2460N7264M9765M9680N6632O9714Q7053J06349J25360J41381
$$ 10470409 10565049 10637509 10694773 10744538 10794218 10850850 10920564 11007617 11113966 11239326 11380707
59521A1380707J50943J50721J38621J13857P6527K7667l0646r5698j64427k33129
$$ 11380707 11531650 11682371 11820992 11934849 12011376 12039043 12008397 11912699 11748272 11515143
59511A1515143k97599l54214m00955m37066m62127m75904m78806m71893m56490
$$ 11515143 11217544 10863330 10462375 10025309 9563182 9087278 8608472 8136579 7680089
59502G680089m34185m06998l77037l45741l13732k81458k49715k19489j91547
$$ 7680089 7245904 6838906 6461869 6116128 5802396 5520938 5271223 5051734 4860187
59493D860187j66207j43318j22322j02515q3504o5409m8480l2467j6621l94J6015
$$ 4860187 4693980 4550662 4428340 4325825 4242321 4176912 4128432 4095965 4079344 4078950 4094965
59482D094965L2114M7916O3949Q0524R7458J14627J32321J50805J69902J89357
$$ 4094965 4127079 4174995 4238944 4319468 4416926 4531553 4663874 4814679 4984581 5173938
59472E173938K09200K29204K48191K64354K76288K83282K84627K78886K64029
$$ 5173938 5383138 5612342 5860533 6124887 6401175 6684457 6969084 7247970 7511999
59463G511999K38344K01515J55075J01686M3871j6416p7061j35241j87957k32886
$$ 7511999 7750343 7951858 8106933 8208619 8252490 8236074 8159013 8023772 7835815 7602929
59453G602929k68553k94276l10422l18301l19243l14006l03356k88750k71936
$$ 7602929 7334376 7040100 6729678 6411377 6092134 5778128 5474772 5186022 4914086
59444D914086k54068k35758k17433j99240j81029j63136j46634j32101j18657
$$ 4914086 4660018 4424260 4206827 4007587 3826558 3663422 3516788 3384687 3266030
59435C266030j05226r2311q1326p2359o3851n4634m5214l6652k9254k2818j7295
$$ 3266030 3160804 3068493 2987167 2914808 2850957 2796323 2751109 2714457 2685203 2662385 2645090
59424B645090j2583q153l496J335N898R823J3025J5801J8784K2501K6921L1721
$$ 2645090 2632507 2624354 2620858 2622193 2628091 2637914 2650939 2666740 2685524 2708025 2734946 2766667
59412B766667L6680M1207M3765M2746L8221L2261K7497K5849K8395L5254M5330
$$ 2766667 2803347 2844554 2888319 2931065 2969286 3001547 3029044 3054893 3083288 3118542 3163872
59401C163872N7040O9823Q4178R9830J14594J25863J33155J38837J46616J59384
$$ 3163872 3220912 3290735 3374913 3474743 3589337 3715200 3848355 3987192 4133808 4293192
59391D293192J78014K01665K29205K60290K95066L33232L74063M17062M61817
$$ 4293192 4471206 4672871 4902076 5162366 5457432 5790664 6164727 6581789 7043606
59382G043606N07106N50751N90264O22899O45248O53963O47461O26409N92559
$$ 7043606 7550712 8101463 8691727 9314626 9959874 10613837 11261298 11887707 12480266
59373A2480266N48016M95747M39716L83652L30064K80493K35757J95506J58262
$$ 12480266 13028282 13524029 13963745 14347397 14677461 14957954 15193711 15389217 15547479
59364A5547479J22494Q7006N0050R064l7778r0182j46106k02823k57064l05160
$$ 15547479 15669973 15756979 15807029 15816093 15778315 15688133 15542027 15339204 15082140 14776980
59354A4776980l44085l72265l89075l94377l89466l77948l64581l53127l45555
$$ 14776980 14432895 14060630 13671555 13277178 12887712 12509764 12145183 11792056 11446501
59345A1446501l42687l44716l51043l60212l70197l78645l83374l83107l77622
$$ 11446501 11103814 10759098 10408055 10047843 9677646 9299001 8915627 8532520 8154898
59336H154898l67116l51883l32809l11449k88920k65217k40192k14708j90127
$$ 8154898 7787782 7435899 7103090 6791641 6502721 6237504 5997312 5782604 5592477
59327E592477j67015j45085j24177j04487q6029o8516n1923l6602k2798j0438
$$ 5592477 5425462 5280377 5156200 5051713 4965684 4897168 4845245 4808643 4785845 4775407
59317D775407N93J0286J8598K5400L0360L3166L3825L2613K9697K4972J8140R111
$$ 4775407 4776000 4786286 4804884 4830284 4860644 4893810 4927635 4960248 4989945 5014917 5033057 5042168
59305E042168j489j2298k2164l1052l9520m7269n2999n5780n5882n3926m9979
$$ 5042168 5040679 5028381 5006217 4975165 4935645 4888376 4835377 4779597 4723715 4669789 4619810
59294D619810m4015l6506k7917j8066o627O105J9542L3484M8035O3077P8389R3936
$$ 4619810 4575795 4539289 4511372 4493306 4486679 4492784 4512326 4545810 4593845 4656922 4735311 4829247
59282D829247J09595J24914J39547J53625J67254J79903J90593J98253K01683
$$ 4829247 4938842 5063756 5203303 5356928 5524182 5704085 5894678 6092931 6294614
59273F294614J99806J92567J80991J65819J46522J22126R2556N8590K1316j7363
$$ 6294614 6494420 6686987 6867978 7033797 7180319 7302445 7395001 7453591 7474907 7457544
59263G457544n4122q5377j09400j26823j39148j47380j51954j53370j52580j50867
$$ 7457544 7403422 7318045 7208645 7081822 6942674 6795294 6643340 6489970 6337390 6186523
59253F186523j49139j47202j44117j39447j33683j27173j19428j10013r9371q7982
$$ 6186523 6037384 5890182 5746065 5606618 5472935 5345762 5226334 5116321 5016950 4928968
59243D928968p5335o0648m4135k6615q178J1753L3313N6227Q0870J08239J38728
$$ 4928968 4853633 4792985 4748850 4722235 4714057 4725810 4759123 4815350 4896220 5004459 5143187
59232E143187J71666K06229K42122K79195L17022L54830L91144M23224M47379
$$ 5143187 5314853 5521082 5763204 6042399 6359421 6714251 7105395 7528619 7975998
59223G975998M60079M58696M41379M06921L55002K86453K03395J09315Q666r3906
$$ 7975998 8436077 8894773 9336152 9743073 10098075 10384528 10587923 10697238 10705904 10611998
59213A0611998j93803k86004l65427m28480m73952n01849n12378n06963m89388
$$ 10611998 10418195 10132191 9766764 9338284 8864332 8362483 7850105 7343142 6853754
59204F853754m64252m34295m00455l64182l28109k94113k62183k31846k03628
$$ 6853754 6389502 5955207 5554752 5190570 4862461 4568348 4306165 4074319 3870691
59195C870691j78436j56361j36850j19562j04412r1183p9666o9847o1664n4717
$$ 3870691 3692255 3535894 3399044 3279482 3175070 3083887 3004221 2934374 2872710 2817993
59185B817993m8464m2495l6527l0518k4787j9655j4869r847m507N95N023Q871
$$ 2817993 2769529 2727034 2690507 2659989 2635202 2615547 2600678 2590831 2586324 2586919 2591942 2600813
59173B600813J2440J5998J9933K4548K9548L4212L8264M2177M6516N1434N6776
$$ 2600813 2613253 2629251 2649184 2673732 2703280 2737492 2775756 2817933 2864449 2915883 2972659
59162B972659O2164O6942P0568P3225P5490P7298P7770P6154P2409O6793N9500
$$ 2972659 3034823 3101765 3172333 3245558 3321048 3398346 3476116 3552270 3624679 3691472 3750972
59151C750972N0832M1108L0279J8270N825n661j5541k4455l3063m0842m6557m9518
$$ 3750972 3801804 3842912 3873191 3891461 3897286 3891625 3876084 3851629 3818566 3777724 3731167 3681649
59139C681649m9922m8381m5547m1852l7216l1289k4187j6566q675J10J0289K1287
$$ 3681649 3631727 3583346 3537799 3495947 3458731 3427442 3403255 3386689 3378014 3378124 3388413 3409700
59127C409700L2102M2680N3925O6413P9792R3489J07422J21701J36054J50045
$$ 3409700 3441802 3484482 3538407 3604820 3684612 3778101 3885523 4007224 4143278 4293323
59117D293323J63760J77791J92430K07205K21512K35425K49417K63330K76105
$$ 4293323 4457083 4634874 4827304 5034509 5256021 5491446 5740863 6004193 6280298
59108F280298K86581K93792K96136K90950K75820K50055K14342J69325J15456
$$ 6280298 6566879 6860671 7156807 7447757 7723577 7973632 8187974 8357299 8472755
59099H472755N4263j1125p6904j39511j95745k43055k80424l08393l27840l39042
$$ 8472755 8527018 8515893 8438989 8299478 8103733 7860678 7580254 7271861 6944021 6604979
59089F604979l42375l39345l32157l22214l09513k93603k74947k55201k36211
$$ 6604979 6262604 5923259 5591102 5268888 4959375 4665772 4390825 4135624 3899413
59080C899413k18758k02229j85626j68815j52733j38541j26689j16683j07511
$$ 3899413 3680655 3478426 3292800 3123985 2971252 2832711 2706022 2589339 2481828
59071B481828r8355q9199q0717p3458o7236o1482n5965n0813m6091m1714l7705
$$ 2481828 2383473 2294274 2213557 2140099 2072863 2011381 1955416 1904603 1858512 1816798 1779093
59060A779093l4113l0726k7279k3902k1071j9112j7995j7527j7435j7393j7357
$$ 1779093 1744980 1714254 1686975 1663073 1642002 1622890 1604895 1587368 1569933 1552540 1535183
59049A535183j7685j8646j9933k0971k1554k1677k1018j9180j6357j3278j0458
$$ 1535183 1517498 1498852 1478919 1457948 1436394 1414717 1393699 1374519 1358162 1344884 1334426
59038A334426p886n396k866j68K657N241P371R499J2355J6084K0117K3662K5960
$$ 1334426 1326540 1321144 1318278 1318110 1320767 1326008 1333379 1342878 1355233 1371317 1391434 1415096 1441056
59025A441056K6401K5037K2675J9896J6320J1480O128J721j167k974l941l807
$$ 1441056 1467457 1492494 1515169 1535065 1551385 1562865 1568993 1570714 1569547 1566573 1562632 1558825
59013A558825k737j384K53K979P034J1405J4934J7370J8949J9631J9166J7440
$$ 1558825 1556088 1554704 1554957 1557936 1564970 1576375 1591309 1608679 1627628 1647259 1666425 1683865
59001A683865J4416J0297N786J582k522p141j1725j4520j4586j3075j1795j1232
$$ 1683865 1698281 1708578 1714364 1715946 1713424 1706283 1694558 1680038 1665452 1652377 1640582 1629350
58989A629350j0581r183p110m747k486o71O88K034L777N831P849R614J1023J2020
$$ 1629350 1618769 1609586 1602476 1597729 1595243 1594572 1595260 1597294 1601071 1606902 1614751 1624365 1635388 1647408
58975A647408J2817J3845J5332J7196J9469K2372K5777K9084L1819L3990L5712
$$ 1647408 1660225 1674070 1689402 1706598 1726067 1748439 1774216 1803300 1835119 1869109 1904821
58964A904821L6948L7768L8381L8706L8399L7484L6471L5727L5212L4936L5104
$$ 1904821 1941769 1979537 2017918 2056624 2095023 2132507 2168978 2204705 2239917 2274853 2309957
58953B309957L5650L6309L7299L9361M2780M7091N1872N7193O3006O8841P4603
$$ 2309957 2345607 2381916 2419215 2458576 2501356 2548447 2600319 2657512 2720518 2789359 2863962
58942B863962Q0947Q8399R6607J04959J13438J22441J32237J42981J54817J67687
$$ 2863962 2944909 3033308 3129915 3234874 3348312 3470753 3602990 3745971 3900788 4068475
58932D068475J81508J96735K14095K33576K54409K76462L00783L28230L58385
$$ 4068475 4249983 4446718 4660813 4894389 5148798 5425260 5726043 6054273 6412658
58923F412658L90416M24363M60883N00203N42068N86157O31855O77915P22794
$$ 6412658 6803074 7227437 7688320 8188523 8730591 9316748 9948603 10626518 11349312
58914A1349312P64812Q01496Q29247Q44200Q42833Q21401P75727P02786O02378
$$ 11349312 12114124 12915620 13744867 14589067 15431900 16253301 17029028 17731814 18334192
58905A8334192M76910L30381J68560m90j67540l24340m64546n83315o77299p45336
$$ 18334192 18811102 19141483 19310043 19309553 19142013 18817673 18353127 17769812 17092513 16347177
58895A6347177p88549q09636q12089p99498p74789p40127o97953o51546o03962
$$ 16347177 15558628 14748992 13936903 13137405 12362616 11622489 10924536 10272990 9669028
58886I669028n56730n10401m65951m24822l87774l54693l25420k99953k77762
$$ 9669028 9112298 8601897 8135946 7711124 7323350 6968657 6643237 6343284 6065522
58877F065522k57897k39965k24312k10895j98653j86402j73848j61399j49357
$$ 6065522 5807625 5567660 5343348 5132453 4933800 4747398 4573550 4412151 4262794
58868D262794j37766j26786j16708j07514r8676q9661q0667p2585o5933o0024
$$ 4262794 4125028 3998242 3881534 3774020 3675344 3585683 3505016 3432431 3366498 3306474
58858C306474n3557m6082l8390l1388k5186j9510j4356r635m620J523Q764J6272
$$ 3306474 3252917 3206835 3168445 3137057 3111871 3092361 3078005 3068370 3063750 3065273 3074037 3090309
58846C090309K3360K9961L6282M2486M8780N5388O2266O9007P5207Q0999Q7247
$$ 3090309 3113669 3143630 3179912 3222398 3271178 3326566 3388832 3457839 3533046 3614045 3701292
58835C701292R5031J04757J15803J27208J38563J50085J62213J75608J91097K08808
$$ 3701292 3796323 3901080 4016883 4144091 4282654 4432739 4594952 4770560 4961657 5170465
58825E170465K27761K47206K68229K92793L21231L52058L84536M19897M59240
$$ 5170465 5398226 5645432 5913661 6206454 6527685 6879743 7264279 7684176 8143416
58816H143416N01633N45401N90181O36273O82574P26346P64533P94021Q10900
$$ 8143416 8645049 9190450 9780631 10416904 11099478 11825824 12590357 13384378 14195278
58807A4195278Q10776P89959P45735O75877N79163M56779L12847J53670j3003
$$ 14195278 15006054 15796013 16541748 17217625 17796788 18253567 18566414 18720084 18707081
58798A8707081j78426l33981m72663n89705o82338p49617p92424q13025q14434
$$ 18707081 18528655 18194674 17722011 17132306 16449968 15700351 14907927 14094902 13280468
58789A3280468q00182p74162p39973p00507o58184o15152n72668n30863m89679
$$ 13280468 12480286 11706124 10966151 10265644 9607460 8992308 8419640 7888777 7399098
58780G399098m49870m12537l78182l46709l18025k92012k68388k47169k28864
$$ 7399098 6949228 6536691 6158509 5811800 5493775 5201763 4933375 4686206 4457342
58771D457342k13540k00151j87517j75571j64850j55101j45313j35007j24629
$$ 4457342 4243802 4043651 3856134 3680563 3515713 3360612 3215299 3080292 2955663
58762B955663j14739j05485r6856q8792q1042p3340o5648n8027n0503m3493l7762
$$ 2955663 2840924 2735439 2638583 2549791 2468749 2395409 2329761 2271734 2221231 2177738 2139976
58751B139976l3516l0005k6545k3379k0922j8817j6547j4424j3045j2277j1683
$$ 2139976 2106460 2076455 2049910 2026531 2005609 1986792 1970245 1955821 1942776 1930499 1918816
58740A918816j1515j2257j3583j4706j5531j6454j7410j8120j8980k0463k1963
$$ 1918816 1907301 1895044 1881461 1866755 1851224 1834770 1817360 1799240 1780260 1759797 1737834
58729A737834k2439k2168k2574k4299k6577k8659l0609l2516l3998l4933l5623
$$ 1737834 1715395 1693227 1670653 1646354 1619777 1591118 1560509 1527993 1493995 1459062 1423439
58718A423439l5940l5199l3420l1716l0851l0152k8530k6097k4057k3128k2586
$$ 1423439 1387499 1352300 1318880 1287164 1256313 1226161 1197631 1171534 1147477 1124349 1101763
58707A101763k1041j8060j4876j3149j3078j3174j2188j0445q852p414n697m117
$$ 1101763 1080722 1062662 1047786 1034637 1021559 1008385 996197 985752 976900 969486 963789 959672
58695I59672l531l838m080l822l389k958k565k836m447o755q220q425q504r274
$$ 959672 956141 952303 948223 944401 941012 938054 935489 932653 928206 921451 913231 904806 896302 887028
58681H87028j0113j0161r532q689p517n749l652j655J83J846K967L243K920K424
$$ 887028 876915 866754 857222 848533 841016 835267 831615 829960 830143 831989 834956 838199 841119 843543
58667H43543J940J607J778K726M309N994P013O549M374J380r55j813j552j052
$$ 843543 845483 847090 848868 851594 855903 861897 868910 875459 879833 881213 880258 878445 876893 875841
58653H75841r26j247j438n62J785M842P386Q994J0083J0961J1572J2100J3096
$$ 875841 874915 873668 872230 871668 873453 878295 885681 894675 904758 915719 927291 939391 952487
58640I52487J4864J7239J9935K2631K4923K6881K9457L3563L8821M3991M8580
$$ 952487 967351 984590 1004525 1027156 1052079 1078960 1108417 1141980 1180801 1224792 1273372
58629A273372N3226N8554O4529P1090P8604Q7394R7372J08278J19968J32484J46341
$$ 1273372 1326598 1385152 1449681 1520771 1599375 1686769 1784141 1892419 2012387 2144871 2291212
58618B291212J62409J80828K00192K18578K35050K49413K60671K66734K65409
$$ 2291212 2453621 2634449 2834641 3053219 3288269 3537682 3798353 4065087 4330496
58609D330496K54778K32858J98343J52145R7381L7774k3128q1333j32506j73573
$$ 4330496 4585274 4818132 5016475 5168620 5266001 5303775 5280647 5199314 5066808 4893235
58599D893235k03694k23509k34104k36786k33044k24272k11844j97430j82574
$$ 4893235 4689541 4466032 4231928 3995142 3762098 3537826 3325982 3128552 2945978
58590B945978j67963j53664j39819j26502j13232r9661q6536p4908o4606n4651
$$ 2945978 2778015 2624351 2484532 2358030 2244798 2145137 2058601 1983693 1919087 1864436
58580A864436m5056l6931l0771k5948k2130j9919j9690k0885k2811k5138k7326
$$ 1864436 1819380 1782449 1751678 1725730 1703600 1683681 1663991 1643106 1620295 1595157 1567831
58569A567831k8548k8548k7726k6202k3807k1125j9415j9123j9470j9798k0329
$$ 1567831 1539283 1510735 1483009 1456807 1433000 1411875 1392460 1373337 1353867 1334069 1313740
58558A313740k1306k2343k2994k3109k2478k0995j9225j7793j6218j3568j0408
$$ 1313740 1292434 1270091 1247097 1223988 1201510 1180515 1161290 1143497 1127279 1113711 1103303
58547A103303q573q778r793j0421j0872j1696j2727j3790j5149j6521j6860j5868
$$ 1103303 1094730 1085952 1076159 1065738 1054866 1043170 1030443 1016653 1001504 984983 968123 952255
58535I52255j4601j3915j3403j2553j1743j1239j0386q808p508p669q999j0196
$$ 952255 937654 923739 910336 897783 886040 874801 864415 855607 848099 840430 831431 821235
58523H21235j0466r934r075q440q451q949r288r150q720p984o754n420m678m295
$$ 821235 810769 800835 791760 783320 774869 765920 756632 747482 738762 730778 724024 718604 713926 709631
58509G09631l301j650m24J1O67K204L771M358M182L978M021M508N865P847R297
$$ 709631 706330 704680 704256 704267 704934 707138 710909 715267 719449 723427 727448 731956 737821 745668 754965
58494G54965R567R365R599J0275J1031J1752J2053J1260R544Q056P276O308M383
$$ 754965 764532 773897 783496 793771 804802 816554 828607 839867 849411 857467 864743 871051 875434
58481H75434J937m60l009n780q020r281j0166j1183j1866j1817j1560j1556j1399
$$ 875434 877371 876911 873902 868122 860102 850821 840655 829472 817606 805789 794229 782673 771274
58468G71274j0764j0157r876r314q057o702n794n009m111l611l690l608k953k377
$$ 771274 760510 750353 740477 731163 723106 716404 710610 705601 701490 697879 694189 690581 687628 685251
58454F85251k298k033j079j07K17K50M70P17J057K148L931N356O151P439R689
$$ 685251 682953 680920 679841 679734 679951 680201 680671 681388 682445 684593 688524 693880 700031 707470 717159
58439G17159J1683J2536J3101J4077J4377J2906J0467Q333O277L616J049l21q36
$$ 717159 728842 741378 754479 768556 782933 795839 806306 814639 820916 824532 825581 825260 824424
58426H24424j527k364k658k437k154j803j477j751k469k366j008J87J94J16J277
$$ 824424 822897 820533 817875 815438 813284 811481 810004 808253 805784 803418 802410 802597 802791 802907 804184
58411H04184L076M366N533P295Q790Q784P836P270O929N815M033K208r6l377o445
$$ 804184 807260 811626 817159 824454 833244 842028 849864 857134 864063 869878 873911 876119 876023 872646 866201
58396H66201p671p356o996o797n848m236l043k493j875j054n33k01O05J955L376
$$ 866201 858530 851174 844178 837381 831533 827297 824254 821761 819886 818832 818299 818098 818703 820658 824034
58381H24034M626N603O020O014O212O511O027N024N263P272R124R350R179J0033
$$ 824034 828660 834263 840283 846297 852509 859020 865047 870071 875334 882606 891730 901080 910259 920292
58367I20292J0806R870Q155P628Q092Q012P503P802Q732R128R129R602R991R175
$$ 920292 931098 940968 949123 956751 964843 972855 980358 988160 996892 1006020 1015149 1024751 1034742 1043917
58353A043917P870P880R253J0331J0160Q997P017M439K278J184K63j264k329j786
$$ 1043917 1051787 1059667 1068920 1079251 1089411 1098408 1105425 1109864 1112142 1113326 1113589 1112325 1109996 1108210
58339A108210o07j50L63K282M755O071O712Q283J0427J1513J1656J2304J3501
$$ 1108210 1107603 1107453 1107816 1110098 1114853 1120924 1127636 1135919 1146346 1157859 1169515 1181819 1195320
58326A195320J4128J4172J4376J4359J3557J3062J4098J5642J6123J6277J7597
$$ 1195320 1209448 1223620 1237996 1252355 1265912 1278974 1293072 1308714 1324837 1341114 1358711
58315A358711J9176J9069J7680J6735J6018J4277J2244J1456J1059R257O940O405
$$ 1358711 1377887 1396956 1414636 1431371 1447389 1461666 1473910 1485366 1496425 1505682 1512622 1519027
58303A519027P395P998Q517J0612J3437J4614J4494J5452J7454J8320J8034J8706
$$ 1519027 1526422 1534420 1542937 1553549 1566986 1581600 1596094 1611546 1629000 1647320 1665354 1684060
58291A684060K0501K1605K2055K3580K5809K6689K6513K7436K9249K9847K9739
$$ 1684060 1704561 1726166 1748221 1771801 1797610 1824299 1850812 1878248 1907497 1937344 1967083
58280A967083L1685L5793L9300M1302M3442M5781M6500M5823M5850M6230M4537
$$ 1967083 1998768 2034561 2073861 2115163 2158605 2204386 2250886 2296709 2342559 2388789 2433326
58269B433326M1081L8863L8509L7973L7341L9007M2744M5649M7465N0916N6181
$$ 2433326 2474407 2513270 2551779 2589752 2627093 2666100 2708844 2754493 2801958 2852874 2909055
58258B909055O0244O2357O5036O8915P1825P3672P6999Q1856Q5402Q7291R0184
$$ 2909055 2969299 3031656 3096692 3165607 3237432 3311104 3388103 3469959 3555361 3642652 3732836
58247C732836R4429R7747J00599J05917J13108J18540J22386J28427J36670J43275
$$ 3732836 3827265 3925012 4025611 4131528 4244636 4363176 4485562 4613989 4750659 4893934
58237D893934J48458J56813J68760J79524J88056J98926K13624K28227K41604
$$ 4893934 5042392 5199205 5367965 5547489 5735545 5934471 6148095 6376322 6617926
58228F617926K57435K76065K93170L08925L29343L55956L83612M11164M44259
$$ 6617926 6875361 7151426 7444596 7753521 8082864 8438820 8822432 9233596 9677855
58219I677855M84437N26178N68424O17858O76830P39726Q05905Q83919R77896
$$ 9677855 10162292 10688470 11256894 11874752 12551582 13291308 14097213 14981132 15959028
58210A5959028J083049J200538J342715J517306J721779J961109K254218K613149
$$ 15959028 17042077 18242615 19585330 21102636 22824415 24785524 27039742 29652891
58202B9652891L033193L514573M075434M732535N493212O385124P472595Q826309
$$ 29652891 32686084 36200657 40276091 45008626 50501838 56886962 64359557 73185866
58194G3185866J0506822J2606332J5277273J8684629K2956865K8186361L4302887
$$ 73185866 83692688 96299020 111576293 130260922 153217787 181404148 215707035
58187B15707035M0643303M5499628M6318098M0853663K8646246J1675498o404020
$$ 215707035 256350338 301849966 348168064 389021727 417667973 429343471 422939451
58180D22939451k1939450l2726398l8412248l9914351l8534271l5396137l1336389
$$ 422939451 401000001 368273603 329861355 289947004 251412733 216016596 184680207
58173A84680207k6983904k2792860j9025476j5778124j3053023j0808914q975516
$$ 184680207 157696303 134903443 115877967 100099843 87046820 76237906 67262390
58166F7262390p469755o221777n182221m307794l554165k885323k278350j713314
$$ 67262390 59792635 53570858 48388637 44080843 40526678 37641355 35363005 33649691
58158C3649691j163357n97555J1196O87311J459987K345787L275192M003810M137173
$$ 33649691 32486334 31888779 31899975 32587286 34047273 36393060 39668252 43672062 47809235
58149D7809235L349283J662205m83962k476976l883250m604185m774505m583556
$$ 47809235 51158518 52820723 52336761 49859785 45976535 41372350 36597845 32014289
58141C2014289m183986l685787l164957k667163k218969j837325j526215j275256
$$ 32014289 27830303 24144516 20979559 18312396 16093427 14256102 12729887 11454631
58133A1454631j071212r06695p74824o64913n69727m90364m28734l81078l42737
$$ 11454631 10383419 9476724 8701900 8036987 7467260 6976896 6548162 6167084 5824347
58124E824347l13060k91515k74596k59963k48244k37885k24041k05354j86112
$$ 5824347 5511287 5219772 4945176 4685213 4436969 4199084 3975043 3769689 3583577
58115C583577j68993j51574j32547j15241j01863r0269p9748p4167p5460p9317
$$ 3583577 3414584 3263010 3130463 3015222 2913359 2823090 2743342 2669175 2593715 2514398
58105B514398q1178q1711q2671q2179p8290p3111o9275o5757o0752n5437n1517
$$ 2514398 2433220 2351509 2268838 2186659 2108369 2035258 1965983 1900226 1839474 1784037 1732520
58094A732520m8182m4546m2042m1498m0860l8591l6429l6030l5894l4236l2072
$$ 1732520 1684338 1639792 1597750 1556252 1515392 1476801 1440372 1404342 1368448 1334212 1302140
58083A302140l0783k9522k7548k6349k6794k6919k5099k2826k1813k0958j8773
$$ 1302140 1271357 1241835 1214287 1187938 1161144 1134225 1109126 1086300 1064487 1043529 1024756
58072A024756j6378j5408j5138j4157j2856j1961j0717q725p489p899q272p075
$$ 1024756 1008378 992970 977832 963675 950819 938858 928141 919416 911927 904028 895756 888681
58060H88681n543n454o274o713p197q591j0151j0885j1319j2010j2007j0619r032
$$ 888681 883138 877684 871410 864697 857500 848909 838758 827873 816554 804544 792537 781918 772886
58047G72886q422q045o903n556m705l762k407j666j876j543P5J350J008M15J198
$$ 772886 764464 756419 749516 743960 739255 735493 733086 731420 729544 728001 728076 729426 730434 730849 732047
58032G32047K567L067L053L332L109J568j67p12o74j173j667j223n32o71j156
$$ 732047 734614 737681 740734 744066 747175 748743 748576 747864 747190 746017 744350 743127 742595 741924 740768
58017G40768j126j089j675k150j941k133l498m670m338l669m341n614n697m717
$$ 740768 739642 738553 736878 734728 732787 730654 727156 722486 718148 714479 710138 704524 698827 694110
58003F94110m028l704l104k831l680m555l856k282j889k957m008m428m837n226
$$ 694110 690082 686378 683274 680443 676763 672208 668352 666070 664181 661224 657216 652788 647951 642725
57989F42725m837l768k887k252j235P3J091J967L075L816L459K722K907L858M355
$$ 642725 637888 634120 631233 628981 627746 627819 628910 630877 633952 637768 641227 643949 646856 650714 655069
57974F55069M035L495K862J864Q95M74M1j220k778l465l422l827m931n786n764
$$ 655069 659104 662599 665461 667325 668220 668694 668735 667515 664737 661272 657850 654023 649092 643306 637542
57959F37542n044l851k483j779k338l498m175m340m569m635l810k194n60P79J913
$$ 637542 632498 628647 626164 624385 622047 618549 614374 610034 605465 600830 597020 594826 594266 595045 596958
57944E96958K626K806K996L498L548K439Q10m00j465l003m431m798m581n035o239
$$ 596958 599584 602390 605386 608884 612432 614871 615681 615281 613816 610813 606382 601584 597003 591968 585729
57929E85729p252p826q458r153r530r767j0070r674p840n405l810l011j915m62
$$ 585729 578477 570651 562193 553040 543510 533743 523673 513999 506159 500754 496944 493933 492018 491556
57915D91556N49J396L279O144Q365Q947Q613Q470Q833R579J0417J0621R604P893
$$ 491556 492105 493501 496780 502924 511289 520236 528849 537319 546152 555731 566148 576769 586373 594266
57901E94266O606O019N575N071M692M097K783J220L43l9j075l091n201o694p660
$$ 594266 600872 606891 612466 617537 622229 626326 629109 630329 630672 630633 629558 626467 621266 614572 606912
57886F06912q157p942p154o297n498m642m023l915l786l029k100j756j535l93
$$ 606912 598755 590813 583659 577362 571864 567222 563199 559284 555498 552469 550369 548613 547078 546685
57872E46685J447K726L115L504M362N281O074O881P249O579N507N239N508M903
$$ 546685 548132 550858 553973 557477 561839 567120 573194 580075 587324 593903 599410 604649 610157 615060
57858F15060L347K376K575K544J221m66j263j432j887k642l138l236l021k373
$$ 615060 618407 620783 623358 625902 627123 626657 625394 623962 622075 619433 616295 613059 610038 607665
57844F07665j499j123j427j583r63j44j9o15j425k292l257m013m247m214m493
$$ 607665 606166 605043 603616 602033 601070 600926 600907 600292 598867 596575 593318 589305 585058 580844 576351
57829E76351n283o251o958p261p479q000q586q455p471o671o825p186o740o068
$$ 576351 571068 564817 557859 550598 543119 535119 526533 518078 510607 503936 497111 489925 483185 477117
57815D77117o434p405p184n380l676l275l334k717j683r42l19N76J390J724J959
$$ 477117 470683 463278 456094 450714 447038 443763 440429 437712 436029 435087 434768 435344 436734 438458 440417
57800D40417K459K792K673K947M579P263R898J1951J3446J4046J3216J1138Q724
$$ 440417 442876 445668 448341 451288 455867 463130 473028 484979 498425 512471 525687 536825 545549
57787E45549O740N340M319L377K221P77p44k083l046l530l778m543o247q064q578
$$ 545549 552289 557629 561948 565325 567546 568323 567579 565496 562450 558920 555142 550599 544352 536288 527710
57772E27710p532o106n295m859m200l351k571j765q57r1N49J521K899M002M392
$$ 527710 520178 514072 508777 503918 499718 496367 493796 492031 491174 491083 491632 493153 496052 500054 504446
57757E04446M554N052N648N874N878N988O062N851N624N731N909N673N098M727
$$ 504446 509000 514052 519700 525574 531452 537440 543502 549353 554977 560708 566617 572290 577388 582115
57743E82115M894N511O225O578O381O081O280O734O571N670M945M928N029M810
$$ 582115 587009 592520 598745 605323 611704 617785 624065 630799 637370 643040 647985 652913 657942 662752
57729F62752M876N737O679O893O979Q076J0031J1646J2588J3731J5606J7585J8853
$$ 662752 667628 673365 680044 686937 693916 701992 712023 723669 736257 749988 765594 783179 802032
57716H02032J9299J9230J8977J9095K0221K2236K4072K4812K4813K5382K7447
$$ 802032 821331 840561 859538 878633 898854 921090 945162 969974 994787 1020169 1047616
57705A047616L0784L4519L8199M2173M6941N2427N8239O4441P1589P9875Q8880
$$ 1047616 1078400 1112919 1151118 1193291 1240232 1292659 1350898 1415339 1486928 1566803 1655683
57694A655683R8321J08643J20488J34017J49095J65736J83839K02715K21294K38668
$$ 1655683 1754004 1862647 1983135 2117152 2266247 2431983 2615822 2818537 3039831 3278499
57684C278499K53903K65370K70479K66234K50234K21629J81679J33501Q1250K9520
$$ 3278499 3532402 3797772 4068251 4334485 4584719 4806348 4988027 5121528 5202778 5232298
57674E232298j6885n3539p7316q6817q2094o4974m0490j7786q373k1625n9798
$$ 5232298 5215413 5161874 5084558 4997741 4915647 4850673 4810183 4792397 4784024 4762399 4702601
57663D702601j15795j75780k25620k56840k68205k63139k46617k23542j97948
$$ 4702601 4586806 4411026 4185406 3928566 3660361 3397222 3150605 2927063 2729115
57654B729115j72247j47395j23977j02750q4075o7714n3539m1843l2505k4516
$$ 2729115 2556868 2409473 2285496 2182746 2098671 2030957 1977418 1935575 1903070 1878554
57644A878554j6762q824p32P407J5236K2361K9207L7000M6330N6496O6758P7430
$$ 1878554 1861792 1852968 1852236 1859643 1874879 1897240 1926447 1963447 2009777 2066273 2133031 2210461
57632B210461Q9129J01739J14987J29304J45074J61533J77402J92258K06070K17443
$$ 2210461 2299590 2401329 2516316 2645620 2790694 2952227 3129629 3321887 3527957 3745400
57622C745400K23334K20759K08226J85566J53168J11830O3111R747m4272r4501
$$ 3745400 3968734 4189493 4397719 4583285 4736453 4848283 4911394 4921141 4876869 4782368
57612D782368j37461j71458j96096k11538k18545k18609k13358k04073j91977
$$ 4782368 4644907 4473449 4277353 4065815 3847270 3628661 3415303 3211230 3019253
57603C019253j78465j64513j50318j36070j22618j10796j00545r1314q2877p5186
$$ 3019253 2840788 2676275 2525957 2389887 2267269 2156473 2055928 1964614 1881737 1806551
57593A806551o7915o0929n4760m9839m5615m1245l6821l3046k9955k6895k3647
$$ 1806551 1738636 1677707 1622947 1573108 1527493 1486248 1449427 1416381 1386426 1359531 1335884
57582A335884k0745j8656j7303j6304j5176j3447j1165r017p434n971m232k850
$$ 1335884 1315139 1296483 1279180 1262876 1247700 1234253 1223088 1214071 1206637 1200666 1196434 1193584
57570A193584k559k752k085l32J519K927M347O018P425Q313R268J0816J2719J4542
$$ 1193584 1191025 1188273 1186188 1185856 1187375 1190302 1194649 1200667 1208092 1216405 1225673 1236489 1249208 1263750
57556A263750J6267J7947J9341K0244K0819K1430K2513K4570K7755L1475L4982
$$ 1263750 1280017 1297964 1317305 1337549 1358368 1379798 1402311 1426881 1454636 1486111 1521093
57545A521093L8306M2065M6490N1352N6737O3051P0260P8002Q6490R6330J07388
$$ 1521093 1559399 1601464 1647954 1699306 1756043 1819094 1889354 1967356 2053846 2150176 2257564
57534B257564J18812J30377J42664J55480J67144J75934J81306J82878J79017
$$ 2257564 2376376 2506753 2649417 2804897 2972041 3147975 3329281 3512159 3691176
57525C691176J67400J46735J17338Q0604L8725n220m7757q5862j17403j41174
$$ 3691176 3858576 4005311 4122649 4203253 4241978 4236758 4189001 4103139 3985736 3844562
57515C844562j56973j65482j67782j64972j58203j48713j37539j25452j13181
$$ 3844562 3687589 3522107 3354325 3189353 3031150 2882437 2744898 2619446 2506265
57506B506265j01310q9941p8935o8598n9660n2328m5911l9594l3226k7097k1436
$$ 2506265 2404955 2315014 2236079 2167481 2107821 2055493 2009582 1969988 1936762 1909665 1888229
57495A888229j6332j1733p355k888J512N442Q999J2755J6858K0761K4105K7321
$$ 1888229 1871897 1860164 1852809 1849921 1851433 1856875 1865874 1878629 1895487 1916248 1940353 1967674
57483A967674L1137L5984M2062M9333N7248O5091P2935Q1578R1271J01396J11767
$$ 1967674 1998811 2034795 2076857 2126190 2183438 2248529 2321464 2403042 2494313 2595709 2707476
57472B707476J23252J36321J49713J61424J70380J76157J77480J72161J58484
$$ 2707476 2830728 2967049 3116762 3278186 3448566 3624723 3802203 3974364 4132848
57463D132848J35944J04922O6602K3407k1204o3684j01102j31363j53504j67808
$$ 4132848 4268792 4373714 4440316 4463723 4442519 4378835 4277733 4146370 3992866 3825058
57453C825058j75123j76092j71384j62432j51203j39167j26941j14863j03313
$$ 3825058 3649935 3473843 3302459 3140027 2988824 2849657 2722716 2607853 2504540
57444B504540r2499q2428p3268o5276n8291n1793m5567l9933l5170l1104k7403
$$ 2504540 2412041 2329613 2256345 2191069 2132778 2080985 2035418 1995485 1960315 1929211 1901808
57433A901808k3971k0857j8079j5703j3872j2536j1356j0002q392o553m443k173
$$ 1901808 1877837 1856980 1838901 1823198 1809326 1796790 1785434 1775432 1767040 1760487 1756044 1753871
57421A753871k56O85N85J51L06J411L076M650N715O203O298O359O676P138P384
$$ 1753871 1753615 1754300 1754885 1755036 1755342 1756753 1759829 1764479 1770194 1776397 1782695 1789054 1795730 1802868 1810252
57406A810252P450P905Q944R715R262P945P251Q056R789J1416J2544J3223J3375
$$ 1810252 1817702 1825607 1834551 1844266 1853528 1861473 1868724 1876780 1886569 1897985 1910529 1923752 1937127
57393A937127J3087J2941J3442J4201J4286J3348J2059J1396J1687J2378J2637
$$ 1937127 1950214 1963155 1976597 1990798 2005084 2018432 2030491 2041887 2053574 2065952 2078589
57382B078589J2260J1860J2041J2642J3144J3604J4476J5550J5908J5239J4392
$$ 2078589 2090849 2102709 2114750 2127392 2140536 2154140 2168616 2184166 2200074 2215313 2229705
57371B229705J4220J4512J4580J4297J4015J3905J3944J4205J4678J5145J5565
$$ 2229705 2243925 2258437 2273017 2287314 2301329 2315234 2329178 2343383 2358061 2373206 2388771
57360B388771J6170J6813J6874J6246J5754J6005J6502J6593J6646J7321J8264
$$ 2388771 2404941 2421754 2438628 2454874 2470628 2486633 2503135 2519728 2536374 2553695 2571959
57349B571959J8581J8286J8160J8418J8551J8463J8647J9219J9719J9964K0267
$$ 2571959 2590540 2608826 2626986 2645404 2663955 2682418 2701065 2720284 2740003 2759967 2780234
57338B780234K0651K0748K0606K0710K1058K1046K0588K0421K1003K1812K2155
$$ 2780234 2800885 2821633 2842239 2862949 2884007 2905053 2925641 2946062 2967065 2988877 3011032
57327C011032K1974K1535K0972K0552K0753K1643K2680K3470K4154K4774K4946
$$ 3011032 3033006 3054541 3075513 3096065 3116818 3138461 3161141 3184611 3208765 3233539 3258485
57316C258485K4694K4771K5578K6369K6361K6044K6494K7696K8584K8664K8626
$$ 3258485 3283179 3307950 3333528 3359897 3386258 3412302 3438796 3466492 3495076 3523740 3552366
57305C552366K9149K9917L0243L0191L0501L1666L3439L5214L6566L7472L8152
$$ 3552366 3581515 3611432 3641675 3671866 3702367 3734033 3767472 3802686 3839252 3876724 3914876
57294C914876L8807L9547M0477M1759M3441M5239M6750M7831M8714M9568N0155
$$ 3914876 3953683 3993230 4033707 4075466 4118907 4164146 4210896 4258727 4307441 4357009 4407164
57283D407164N0120M9547M8916M8288M6855M3599L8383L2054K5488J8884J2154
$$ 4407164 4457284 4506831 4555747 4604035 4650890 4694489 4732872 4764926 4790414 4809298 4821452
57272D821452N575j64m480p257q854r884j0714j1052j0260q213n550k991p60J132
$$ 4821452 4827027 4826863 4822383 4815126 4806272 4796388 4785674 4774622 4764362 4756149 4750599 4747608 4746848 4747980
57258D747980K591L732N052O817Q600R913J0901J2009J3286J4563J5948J7520
$$ 4747980 4750571 4754303 4759355 4766172 4774772 4784685 4795586 4807595 4820881 4835444 4851392 4868912
57246D868912J8877J9627K0039K0544K0918K0778K0578K1105K2096K2435K1810
$$ 4868912 4887789 4907416 4927455 4947999 4968917 4989695 5010273 5031378 5053474 5075909 5097719
57235E097719K1155K1183K1443K1207K0475J9642J8870J8218J7833J7578J7086
$$ 5097719 5118874 5140057 5161500 5182707 5203182 5222824 5241694 5259912 5277745 5295323 5312409
57224E312409J6446J6252J6595J6800J6560J6591J7559J8989K0050K0868K2285
$$ 5312409 5328855 5345107 5361702 5378502 5395062 5411653 5429212 5448201 5468251 5489119 5511404
57213E511404K4548K6974K8764K9597K9553K9034K8620K8501K8160K7058K5489
$$ 5511404 5535952 5562926 5591690 5621287 5650840 5679874 5708494 5736995 5765155 5792213 5817702
57202E817702K4237K3504K2733K1583K0461J9859J9602J9137J8437J8113J8520
$$ 5817702 5841939 5865443 5888176 5909759 5930220 5950079 5969681 5988818 6007255 6025368 6043888
57191F043888J9003J8448J6546J4168J2340J1231J0424R764R315Q812P763O179
$$ 6043888 6062891 6081339 6097885 6112053 6124393 6135624 6146048 6155812 6165127 6173939 6181702 6187881
57179F187881M561L250K285J912K413L321L544K652J520J274K044K988L237K483
$$ 6187881 6192442 6195692 6197977 6199889 6202302 6205623 6209167 6211819 6213339 6214613 6216657 6219645 6222882 6225365
57165F225365J013o05k074l619n474p309q714j0022j1870j3986j5326j5579j5644
$$ 6225365 6226378 6225773 6223699 6220080 6214606 6207297 6198583 6188561 6176691 6162705 6147379 6131800 6116156
57152F116156j6346j7603j9124k0998k3085k4758k5770k6654k7721k8409k8224
$$ 6116156 6099810 6082207 6063083 6042085 6019000 5994242 5968472 5941818 5914097 5885688 5857464
57141E857464k7481k6449k4634k1699j8417j5854j4015j2113r763p332n447m690
$$ 5857464 5829983 5803534 5778900 5757201 5738784 5722930 5708915 5696802 5687039 5679707 5674260 5669570
57129E669570n325o882q534j0246j2893j6916k1644k6291l0656l4338l6314l6066
$$ 5669570 5664245 5657363 5648829 5638583 5625690 5608774 5587130 5560839 5530183 5495845 5459531 5423465
57117E423465l4084l0685k5431j8546j1701o383k607k1J256K254O136J5829L1660
$$ 5423465 5389381 5358696 5333265 5314719 5303018 5296635 5294028 5294007 5295263 5297517 5303653 5319482 5351142
57104E351142N2721P9300J12215J51107J95490K46594L06233L74868M52810N42416
$$ 5351142 5403863 5483163 5595378 5746485 5941975 6188569 6494802 6869670 7322480 7864896
57094G864896O47162P69573R11746J075432J258109J450061J638216J810880J954651
$$ 7864896 8512058 9281631 10193377 11268809 12526918 13976979 15615195 17426075 19380726
57085A9380726K049122K070975K004809J848432J613682J332012J055339Q30995
$$ 19380726 21429848 23500823 25505632 27354064 28967746 30299758 31355097 32186092
57077C2186092O61006M91799K57058o6843m49307q39693j200432j510361j754585
$$ 32186092 32847098 33338897 33595955 33529112 33079805 32240112 31039680 29529319 27774734
57068B7774734j923309k016220k040272k004033j917493j794453j650059j495916
$$ 27774734 25851425 23835205 21794933 19790900 17873407 16078954 14428895 12932979
57060A2932979j339684j187949j046543r18596q04720p04850o18438n43614m78165
$$ 12932979 11593295 10405346 9358803 8440207 7635487 6930637 6312199 5768585 5290420
57051E290420m21384l73649l34500l02209k75030k51836k31689k13710j97283
$$ 5290420 4869036 4495387 4160887 3858678 3583648 3331812 3100123 2886413 2689130
57042B689130j81947j67411j53961j42237j32142j22659j13171j04177r6214q8923
$$ 2689130 2507183 2339772 2185811 2043574 1911432 1788773 1675602 1571425 1475211 1386288
57032A386288q1893p5507p0162o5320o0221n4931m9967m5498m1534l8291l5661
$$ 1386288 1304395 1228888 1158726 1093406 1033185 978254 928287 882789 841255 802964 767303
57021G67303l2907k9620k6312k3397k0442j7165j4321j2543j1153r145o687m465
$$ 767303 734396 704776 678464 655067 634625 617460 603139 590596 579443 570298 563611 559146
57009E59146k212Q51M701Q944J4101K1114L0013M0446N3168O9669R0846J17423
$$ 559146 556934 557785 562486 571430 585531 606645 636658 677104 730272 799941 890787 1008210
56997A008210J50121J85570K11296K08817J66198Q8776k805q4973j42681j72765
$$ 1008210 1158331 1343901 1555197 1764014 1930212 2018988 2016183 1931210 1788529 1615764
56987A615764j80363j73076j56778j35067j11349q9895p4007o3954n7757n3648
$$ 1615764 1435401 1262325 1105547 970480 859131 769236 695229 631275 573518 519870
56977E19870n0936m8941m6460m2503l6905l0165k3214j7199j2735r303n967k490
$$ 519870 468934 419993 373533 331030 294125 263960 240746 223547 210812 201509 195542 193052
56965A93052P97L984P515J1176J4217J6675J9667K3843K8158L0622K9814K5289
$$ 193052 193849 197833 205348 216524 230741 247416 267083 290926 319084 349706 379520 404809
56953D04809J7339P112l372j2139j8285k1839k2928k1702j8928j5881j3250j0645
$$ 404809 422148 429260 425888 413749 395464 373625 350697 328995 310067 294186 280936 270291
56941B70291p484l975q00J959M968Q650J2603J6370K0330K5216L0769L5268L6500
$$ 270291 262807 258832 258032 259991 264959 273609 286212 302582 322912 348128 378897 414165 450665
56928D50665L2840K3746J0175n117j8503k7553l2160l3517l2569k9962k6685k3637
$$ 450665 483505 507251 517426 512309 493806 466253 434093 400576 368007 338045 311360 287723
56916B87723k0731j7386j3780j0783q725p152n853n091m653l764k326j213q09
$$ 287723 266992 249606 235826 225043 216318 209166 203313 198222 193569 189805 187479 186266 185457
56903A85457k68J101K643L490M076N434P514R304J0352J1089J1872J2709J3944
$$ 185457 185189 186290 188933 192423 196499 201933 209447 218751 229103 240192 252064 264773 278717
56890B78717J6066J8732K0986K2656K4612K7094K8509K6607K0550J1484J487p563
$$ 278717 294783 313515 334501 357157 381769 408863 437372 463979 484529 496013 497500 489937
56878D89937j4449j8652k0273j9828j8007j5491j2716r703o177j954K825P800
$$ 489937 475488 456836 436563 416735 398728 383237 370521 360818 354641 352687 355512 363312
56866C63312J2710J7732K3582L1026M0148N0187N9949O7788P1068O6564N2564
$$ 363312 376022 393754 417336 448362 488510 538697 598646 666434 737502 804066 856630
56855H56630L0689N315j8732l7811m9831n4421n3050m8117m1412l3631k5143j6480
$$ 856630 887319 892634 873902 836091 786260 731839 678789 630672 589260 555629 530486 514006
56843E14006p951N60R165J7810K6767L6832M8763O2814P8729R5421J10087J17875
$$ 514006 506055 506615 515780 533590 560357 597189 645952 708766 787495 882916 993003 1110878
56831A110878J13233R2625N7246J3669k8767o2611q5105r6918r9376r3947q3442
$$ 1110878 1224111 1316736 1373982 1387651 1358884 1296273 1211168 1114250 1014874 920927 837485
56820H37485p1491o0148m9153l7929k7066j7215p733K458J3435K4618L6040M8264
$$ 837485 765994 705846 656693 618764 591698 574483 566750 569208 582643 607261 643301 691565
56808F91565O1155P3133Q1198Q1345O9926M6136J3698k0392m9154o8436p7788
$$ 691565 752720 825853 907051 988396 1058322 1104458 1118156 1097764 1048610 980174 902386
56797I02386p9494p6487p0532o2232n2422m2623l3859k5859j8041j0553l709K860
$$ 902386 822892 746405 675873 613641 561219 518596 484737 458878 440837 430284 426575 429435
56785D29435R618J6370K2878K9645L6861M2799M4313L9067K6938R769r318k6611
$$ 429435 439053 455423 478301 507946 544807 587606 631919 670986 697924 707693 698375 671764
56773F71764l9184m6144m8352m7085m3467l8708l3871k9264k4684k0355j6922
$$ 671764 632580 586436 538084 490999 447532 408824 374953 345689 321005 300650 283728
56762B83728j4604j2882j1101q968o571m442l339l425l792l508k783k427k393
$$ 283728 269124 256242 245141 236173 229602 225160 221821 218396 214604 211096 208313 205886 203493
56749B03493j881q42k46o58j468j855j822j826k026k234k179j583m52N71O92j07
$$ 203493 201612 200770 200524 199866 198398 196543 194721 192895 190869 188635 186456 184873 184421 184992 185684 185577
56733A85577j056j604j846j973j978k030k366k644k185j116m29o16r87q32m74
$$ 185577 184521 182917 181071 179098 177120 175090 172724 170080 167895 166779 166350 165734 164747 163915 163441
56718A63441m81n93j63P58J521J743J459O82n13j670k290k421k397k223j730j196
$$ 163441 162960 162367 162204 162962 164483 166226 167685 168367 167854 166184 163894 161473 159076 156853 155123 153927
56702A53927j131j443j454q74k51j60m01l19K81Q97R90O27K95K55K62P6o9K61
$$ 153927 152796 151353 149899 149025 148774 148614 148213 147894 148175 149072 150062 150689 150984 151239 151501 151577 151508 151769
56684A51769J000J563J641J573J729J843J443P05L35N66P47K39o28r53m61J27
$$ 151769 152769 154332 155973 157546 159275 161118 162561 163266 163601 164167 164914 165153 164525 163572 163111 163238
56668A63238O3m77p07k73M50R52J085R28O23M69Q30J641K254K053J049k47j299
$$ 163238 163301 162824 162117 161844 162294 163246 164331 165259 165882 166351 167181 168822 171076 173129 174178 173931 172632
56651A72632j704j289l74L02L21M6K6J62r2q66j700k159k182j888j443j210j612
$$ 172632 170928 169639 169265 169567 169888 169934 169960 170122 170030 169164 167464 165305 163123 161235 159792 158582 156970
56634A56970k651l795m417m325l803l306l033k758k209j596j423j705j804j305
$$ 156970 154319 150524 146107 141782 137979 134673 131640 128882 126673 125077 123654 121949 120145 118840
56620A18840n69n7L71R74J481J527J457J784K188J876R10K72N71J402K183K792
$$ 118840 118271 118214 118585 119559 121040 122567 124024 125808 127996 129872 130782 131054 131625 133027 135210 138002
56604A38002L133K841J920J133J198J860K222J830J046M80L53M96P61J230J869
$$ 138002 141135 143976 145896 147029 148227 150087 152309 154139 155185 155665 156018 156514 157275 158505 160374
56589A60374K230J801Q01J18K50O79O84K98K0r2l31o58o91k86M14J272K008K050
$$ 160374 162604 164405 165206 165324 165574 166253 166937 167235 167255 167163 166832 166174 165483 165197 165611 166883 168891 170941
56571A70941J280O86J467L456N200N696N322N015N156N476N552N220M891N333
$$ 170941 172221 172907 174374 177830 183030 188726 194048 199063 204219 209695 215247 220467 225358 230691
56557B30691O631P645P166N543M303M200M485M181L226K112J058n5j394k955m343
$$ 230691 237322 244967 252133 257676 261979 266179 270664 274845 278071 280183 281241 281186 279792 276837 272494
56542B72494m838m231l407l401m081m552m693n218o187o709o339n689n269m676
$$ 272494 267656 263425 260018 256617 252536 247984 243291 238073 231886 225177 218838 213149 207880 203204
56528B03204l513k211j340q77o08o75j096j376j122o73o34j171j974k603k707
$$ 203204 199691 197480 196140 195263 194655 193980 192884 191508 190386 189713 189079 187908 185934 183331 180624
56513A80624k312j863j592r92L40J642J774R91O88J307J804J451Q70P52Q47Q51
$$ 180624 178312 176449 174857 173865 174205 175847 177621 178612 179300 180607 182411 183862 184732 185484 186331 187182
56497A87182J114J668J755J102O21R63J384J012K66j4M1l8J40J110K305K709K341
$$ 187182 188296 189964 191719 192821 193442 194405 195789 196801 197067 197053 197094 197056 197196 198306 200611 203320 205661
56480B05661J934J616J077O79J127K132K640K398K198K450K565K058J435J491
$$ 205661 207595 209211 210288 210967 212094 214226 216866 219264 221462 223912 226477 228535 229970 231461
56466B31461K260L064L367L247L144L274L418L304L104L135L189K688J583N05
$$ 231461 233721 236785 240152 243399 246543 249817 253235 256539 259643 262778 265967 268655 270238 270743
56452B70743j12m75q12r80r03p84n78M5R05J232P54J34l0J22L38O84R82P21K5
$$ 270743 270631 270156 269344 268364 267461 266677 266099 266144 267049 268281 269035 269169 269139 269261 269599 270283 271265 271986 272011
56433B72011k78o5k97j326k107j963j857k761l803l581k464k066k839l670l667
$$ 272011 271733 271668 271371 270045 267938 265975 264118 261357 257554 253973 251509 249443 246604 242934 239267
56418B39267l098k539k181j984j780j235l57K68K75J05J87J76l03q12q92r90j579
$$ 239267 236169 233630 231449 229465 227685 226450 226093 226361 226636 226741 226928 227104 226801 225989 225097 224107 222528
56401B22528k051j611p60o17j191j503j203q49o84k43P38J906K804L125K679J711
$$ 222528 220477 218866 218106 217489 216298 214795 213592 212743 212059 211816 212554 214460 217264 220389 223068 224779
56385B24779R60P61O05J26q9M40J019Q42M54J011K579M244N416N929N426L947
$$ 224779 225739 226500 227105 227231 227142 227582 228601 229443 229897 230908 233487 237731 243147 249076 254502 258449
56369B58449K608K433K882K796K210J949J925J494J027J419K261K155R49l2k5
$$ 258449 261057 263490 266372 269168 271378 273327 275252 276746 277773 279192 281453 283608 284557 284525 284500
56354B84500L81O94J180J836K115K000K145K658K924K851L059L681M174M460N011
$$ 284500 284881 285575 286755 288591 290706 292706 294851 297509 300433 303284 306343 310024 314198 318658 323669
56339C23669N656N687N371N912P469Q589Q249P221O740O844O825O498O351O913
$$ 323669 329325 335012 340383 346295 353764 362353 370602 377823 384563 391407 398232 404730 411081 417994
56325D17994Q366J0197J1269J0839R600Q908R026R042Q422P527O557N203L545
$$ 417994 426360 436557 447826 458665 468265 477173 486199 495241 503663 511190 517747 522950 526495
56312E26495K227J388M10r88k312l160l632l734l306k682k463k546k294j693j293
$$ 526495 528722 530110 530520 529532 527220 524060 520428 516694 513388 510706 508243 505697 503403 501710 500417
56297E00417r75N2J921L880N482O868P882Q181Q273R050J0242J0735J0675J1622
$$ 500417 499442 499494 501415 505295 510777 517645 525527 533708 541981 551031 561273 572008 582683 594305
56283E94305J4180J7019J8926K0410K2494K5173K7923L0652L3333L5639L7724
$$ 594305 608485 625504 644430 664840 687334 712507 740430 771082 804415 840054 877778
56272H77778M0532M4667M9722N5211O1324O8248P5671Q3506R2312J02474J13653
$$ 877778 918310 962977 1012699 1067910 1129234 1197482 1273153 1356659 1448971 1551445 1665098
56261A665098J25459J37888J50769J63608J76165J88336J99177K07087K11264
$$ 1665098 1790557 1928445 2079214 2242822 2418987 2607323 2806500 3013587 3224851
56252C224851K12015K09357K02350J90186J72857J50389J22600R0264N5675K1422
$$ 3224851 3436866 3646223 3848573 4038759 4211616 4362005 4484605 4574869 4630544 4651966
56242D651966j0742l9682o4531q5039j01500j14065j22743j28041j30706j30917
$$ 4651966 4641224 4601542 4537011 4451972 4350472 4236407 4113664 3985623 3854917 3724000
56232C724000j28814j25579j22743j20524j18369j16892j17391j19260j19992
$$ 3724000 3595186 3469607 3346864 3226340 3107971 2991079 2873688 2754428 2634436
56223B634436j18402j15983j14307j12888j10595j07513j04103r9936r4580q8746
$$ 2634436 2516034 2400051 2285744 2172856 2062261 1954748 1850645 1750709 1656129 1567383
56213A567383q3326p8176p2753o7158o1684n6149n0467m5141m0543l6505l2978
$$ 1567383 1484057 1405881 1333128 1265970 1204286 1148137 1097670 1052529 1011986 975481 942503
56202I42503l0274k8202k6043k3717k1884k0545j8766j6247j3820j1929r953p627
$$ 942503 912229 884027 857984 834267 812383 791838 773072 756825 743005 731076 721123 713496
56190G13496n701m547l506k267j447j108j29K018M311N842P113Q720J0140J0854
$$ 713496 707795 703248 699742 697475 696028 694920 694791 696809 701120 706962 714075 722795 732935 743789
56176G43789J1363J2113J2492J1999J1312J1154J1062J0192Q515O447M190K111
$$ 743789 755152 767265 779757 791756 803068 814222 825284 835476 843991 850438 854628 856739
56164H56739P71N3q29j999k692k625k357j903n52J640L619N039O627Q549J0158
$$ 856739 857510 857563 856734 854735 852043 849418 847061 845158 844606 846246 849865 854904 861531 870080 880238
56149H80238J1724J4431J8177K1517K4386K8611L4917M1796M8478N6578O7508
$$ 880238 891962 906393 924570 946087 970473 999084 1034001 1075797 1124275 1180853 1248361
56138A248361Q0419R4088J08507J22969J34731J41366J42670J38767J28765J13294
$$ 1248361 1328780 1422868 1531375 1654344 1789075 1930441 2073111 2211878 2340643 2453937
56128B453937R6423Q2643P3120O6504O1515N6781M9880L9042K5046R981m640j7274
$$ 2453937 2550360 2633003 2706123 2772627 2834142 2890923 2940803 2979845 3004891 3014872 3010232 2992958
56116B992958k5996l0800l4917m1916n2637o6158q1760r8005j11750j20321j23557
$$ 2992958 2966962 2936162 2901245 2859329 2806692 2740534 2658774 2560769 2449019 2328698 2205141
56105B205141j22186j15970j05310r2800q1010p0109n9582n0497m4011l9256l4967
$$ 2205141 2082955 1966985 1861675 1768875 1687865 1617756 1558174 1507677 1463666 1424410 1389443
56094A389443l1617k9811k8180k5218k1804j9551j8053j5905j3226j0973r018
$$ 1389443 1357826 1328015 1299835 1274617 1252813 1233262 1215209 1199304 1186078 1175105 1166087
56083A166087o911n197m136k604o3K031K638L073M535N853N832N735P019Q673
$$ 1166087 1159176 1153979 1149843 1147239 1147176 1149207 1151845 1154918 1159453 1165306 1171138 1176873 1183892 1192565
56069A192565R354J0005J1728J3193J2988J2553J3758J5583J6136J6080J6979
$$ 1192565 1201919 1211924 1223652 1236845 1249833 1262386 1276144 1291727 1307863 1323943 1340922
56058A340922J8102J8055J7767J8696J9807J9542J8951J9728K0946K1051K1144
$$ 1340922 1359024 1377079 1394846 1413542 1433349 1452891 1471842 1491570 1512516 1533567 1554711
56047A554711K2883K5033K5620K5656K7091K8969K9339K9149L0403L2275L2908
$$ 1554711 1577594 1602627 1628247 1653903 1680994 1709963 1739302 1768451 1798854 1831129 1864037
56036A864037L3291L5320L7797L8471L8341L9803M2186M3335M3912M5795M7957
$$ 1864037 1897328 1932648 1970445 2008916 2047257 2087060 2129246 2172581 2216493 2262288 2310245
56025B310245M8365M8324N0486N4099N6685N8685O1872O4937O5466O4698O5560
$$ 2310245 2358610 2406934 2457420 2511519 2568204 2626889 2688761 2753698 2819164 2883862 2949422
56014B949422O7692O9051P0542P4086P8163Q0393Q2511Q7428R3588R7703J00832
$$ 2949422 3017114 3086165 3156707 3230793 3308956 3389349 3471860 3559288 3652876 3750579 3851411
56003C851411J05955J11916J15916J19646J26611J35557J43020J50043J59685
$$ 3851411 3957366 4069282 4185198 4304844 4431455 4567012 4710032 4860075 5019760
55994E019760J70534J79708J89479K03402K18767K30745K41156K54752K70150
$$ 5019760 5190294 5370002 5559481 5762883 5981650 6212395 6453551 6708303 6978453
55985F978453K83462K97655L18431L43867L68499L94571M28220M67613N06779
$$ 6978453 7261915 7559570 7878001 8221868 8590367 8984938 9413158 9880771 10387550
55976A0387550N48347N99877O60309P23495P92480Q75999R73714J080452J202488
$$ 10387550 10935897 11535774 12196083 12919578 13712058 14588057 15561771 16642223 17844711
55967A7844711J353069J534858J745182J995632K305635K678901L108903L605412
$$ 17844711 19197780 20732638 22477820 24473452 26779087 29457988 32566891 36172303
55959C6172303M190931M875369N667226O610860P779347R232942J1030181J3284419
$$ 36172303 40363234 45238603 50905829 57516689 65296036 74528978 85559159 98843578
55951I8843578J6157129J9786647K4272788K9668772L5712425M1290563M4221844
$$ 98843578 115000707 134787354 159060142 188728914 224441339 265731902 309953746
55944C09953746M1992225L3228500J8815187J706871j4448111k6873540l4470883
$$ 309953746 351945971 385174471 403989658 405696529 391248418 364374878 329903995
55937C29903995l7632460l7493733l5234383l1768252k7758926k3702739j9936415
$$ 329903995 292271535 254777802 219543419 187775167 160016241 136313502 116377087
55930A16377087j6625112j3808636j1470971r567761q027114o770712n741799
$$ 116377087 99751975 85943339 74472368 64904607 56877493 50106781 44364982
55923D4364982m901966m211870l633850l146593k739612k397379k102721j849871
$$ 44364982 39463016 35251146 31617296 28470703 25731091 23333712 21230991 19381120
55915A9381120j638923j461273j303779j163284j043706r41988q49546p64908
$$ 19381120 17742197 16280924 14977145 13813861 12770155 11828167 10978621 10213713
55907A0213713o92621o31451n74920n22087m77160m39483m03814l69524l40267
$$ 10213713 9521092 8889641 8314721 7792634 7315474 6875991 6472177 6102653 5762386
55898E762386l15447k90799k66502k46404k30121k13888j98116j86159j76646
$$ 5762386 5446939 5156140 4889638 4643234 4413113 4199225 4001109 3814950 3638304
55889C638304j64974j51596j41098j33737j25500j16020j08897j04276r8462r1036
$$ 3638304 3473330 3321734 3180636 3046899 2921399 2805379 2696482 2592206 2493744 2402708
55879B402708q5379q1790p6821o9999o4820o2327n9581n5266n1309m8319m4662
$$ 2402708 2317329 2235539 2158718 2088719 2023899 1961572 1901991 1846725 1795416 1747097 1702435
55868A702435m0660l8656l8432l7376l5387l4841l5514l4556l1712k9653k8673
$$ 1702435 1661775 1623119 1584687 1547311 1511924 1477083 1441569 1407013 1375301 1345648 1316975
55857A316975k5908k0461j4616r359l251L278O760N022p98q897j7918k5278k8302
$$ 1316975 1291067 1270606 1255990 1246631 1243380 1246658 1253418 1258440 1257642 1248745 1230827 1205549 1177247
55844A177247k7666k6391k5380k3294k0631j9769k0851k1555k1273k1764k3291
$$ 1177247 1149581 1123190 1097810 1074516 1053885 1034116 1013265 991710 970437 948673 925382
55833I25382k4000k3509k3447k3957k3312k1431k0148j9536j7644j4422j2305
$$ 925382 901382 877873 854426 830469 807157 785726 765578 746042 728398 713976 701671
55822G01671j2196j2346j1903j2099j3170j3509j2689j2107j1800r945o389l487
$$ 701671 689475 677129 665226 653127 639957 626448 613759 601652 589852 579907 573518 570031
55810E70031k390j549J24J637K435L561N145N518M066K421J705Q92j006l415n741
$$ 570031 567641 566092 566216 567853 570288 573849 578994 584512 588578 590999 592704 593596 592590 589175 583434
55795E83434q335j1045j2867j3674j4368j4923j4363j2960j2196j2189j1583j0265
$$ 583434 575099 564054 551187 537513 523145 508222 493859 480899 468703 456514 444931 434666
55783D34666r628r713q661n756k628p12J84J89j402m410p364r536j1472j3136
$$ 434666 425038 415325 406664 400908 398280 397568 397752 397941 396539 392129 384765 375229 363757 350621
55769C50621j3481j2333j0691q962o779m642l578l277k755k683m430p010p866
$$ 350621 337140 324807 314116 305154 298375 293733 290155 286878 284123 281440 277010 270000 262134
55756B62134o751n868n992n661m560m266m911m501k616j543k470l631l631l564
$$ 262134 255383 249515 243523 237862 233302 229036 224125 219624 217008 215465 212995 209364 205733 202169
55742B02169m247m298k835j473j635k178j572l41M38J074J951K212J401O87Q01
$$ 202169 197922 193624 190789 189316 187681 185503 183931 183590 184028 185102 187053 189265 190666 191353 192154
55727A92154N59j020k903l917m603n646o172n350m101l551l194k262j423j477
$$ 192154 192713 191693 188790 184873 180270 174624 168452 163102 159001 155450 152256 149994 148571 147094
55713A47094j665r19L23J137J831L172M818N949O601P224P692P734P503O881N314
$$ 147094 145429 144510 144833 145970 147801 150973 155791 161740 168341 175565 183257 190991 198494 205375 210689
55698B10689L080J552J396J713J724J830K224K012P73m57q70j179k142l126l307
$$ 210689 213769 215321 216717 218430 220154 221984 224208 226220 226993 226536 225666 224487 222345 219219 215912
55683B15912k971k519j498K12J549J843J960K716L379L026K164J686J316M05o79
$$ 215912 212941 210422 208924 209136 210685 212528 214488 217204 220583 223609 225773 227459 228775 229180 228501
55668B28501j168j121r13l57O31J402J530J562K000K412K373K181K014J482P64
$$ 228501 227333 226212 225299 224942 225573 226975 228505 230067 232067 234479 236852 239033 241047 242529 243293
55653B43293Q43J710J767M3k342l979n123o596q068q776q936r120r136q738q526
$$ 243293 244136 245846 247613 247656 245314 241335 236212 229616 221548 212772 203836 194716 185580 176842 168316
55638A68316q919r150q393p142o380o144n867n392m811m122l664l942m440l865
$$ 168316 159397 150247 141854 134712 128332 122188 116321 110929 106118 101996 98332 94390 89950 86085
55624H6085k223j209j698k361j861q41n00o43n33l83n89o48k47k07r69j437p51
$$ 86085 83862 82653 80955 78594 76733 75892 75392 74749 74216 73833 73244 72596 72349 72142 71173 69736 68985
55607F8985J6m42j507j824j574j685j874j301m14k52m96q3Q08J074O29L78N88
$$ 68985 69001 68559 67052 65228 63654 61969 60095 58794 58380 58128 57632 57549 58357 59431 60060 60438 61026
55590F1026P45P20O92L76l94q38l38K58j43j026j199r53j451k407k313r67J15
$$ 61026 61771 62491 63183 63559 63165 62327 61989 62247 62104 61078 59879 58926 57475 55068 52755 51788 51903
55573E1903k8o69q15l96L63J476K674L303L152K723K465K249J709O15r88k582
$$ 51903 51875 51206 50391 49995 50358 51834 54508 57811 60963 63686 66151 68400 70109 70724 69736 67154
55557F7154l390l209k653k187j523l98P11J299J457J319O73j13P3J429K486K088
$$ 67154 63764 60555 57902 55715 54192 53794 54505 55804 57261 58580 59253 59140 59213 60642 63128 65216
55541F5216J166J264K249K858K759K619K704K797L003L414L452K784K240K509
$$ 65216 66382 67646 69895 72753 75512 78131 80835 83632 86635 90049 93501 96285 98525 101034
55527A01034K719J771L87Q7N84J27j750l502l781k846j679j008j299k498l620
$$ 101034 103753 105524 105911 105998 106582 106709 104959 101457 97676 94830 93151 92143 90844 88346 84726
55512H4726l694l088k954l428l567k923k126j860k231l057l846l727k421r69n57
$$ 84726 81032 77944 74990 71562 67995 65072 62946 61086 58855 55798 51952 48225 45804 44835 44278
55497D4278r30r84n25k23k69l77p53j703k550k341j501j308j901k216j867j608
$$ 44278 43348 42364 41839 41616 41347 40970 40217 38514 35964 33623 32122 30814 28913 26697 24830 23222
55481B3222j833k008j856j786j932j869j510j238j039n31J43M72N71R35J309J032
$$ 23222 21389 19381 17525 15739 13807 11938 10428 9190 8151 7620 7763 8235 8806 9741 11050 12082
55465A2082L64J85M54L14k64m46j92m01j116j167j02R58J115R51J272J698J424
$$ 12082 12446 12631 13085 13399 13135 12689 12497 12096 10980 9813 9711 10669 11784 12735 14007 15705 17129
55448A7129N52j70l45j14J62k5r29j916j886p01M50N05k49p19l01P01J509J553
$$ 17129 17681 17511 17166 17052 17214 17189 16260 14344 12458 11757 12207 12712 12463 11744 11443 12144 13653 15206
55430A5206J039P79J205J736J672J259J201J355R17k70j467k051j986j423o21
$$ 15206 16245 17024 18229 19965 21637 22896 24097 25452 26369 26099 24632 22581 20595 19172 18551
55415A8551q1j5Q7O21J022O70R5J08K93k12q70l20J288K301J943J101N12j79j105
$$ 18551 18470 18455 18542 19163 20185 20855 20950 21058 21351 21139 20269 19949 21237 23538 25481 26582 27094 26915 25810
55396B5810j569j306r98r70o54J09N59L44N9q0p57k023k623j798n79k59o19o88
$$ 25810 24241 22935 21937 20967 20313 20422 20981 21325 21384 21304 20547 18524 15901 14103 13524 13265 12646 11958
55378A1958l84k75m32n13n11n54l71K20O81L31o78j478j444o66K90Q49R10Q67
$$ 11958 11574 11299 10867 10354 9843 9289 8918 9138 9819 10150 9472 7994 6550 5884 6174 7023 7933 8800
55360H800R64P94Q5m72j13N99M51m39p73k62p9p18j073m04L49K00k21M2N00J25
$$ 8800 9764 10558 10643 10171 10058 10657 11108 10669 9896 9634 9555 8837 7764 7360 7709 7909 7688 7730 8230 8355
55340H355p66r59k55L74L54N7n4M3K20L38J20m81r53p31P7R09J450J719J704J395
$$ 8355 7589 6630 6375 6749 7103 7160 7106 7149 7369 7707 7827 7346 6393 5662 5739 6648 8098 9817 11521 12916
55320A2916J002P77P06N98K80l59j218j815j722j263j207j708k088j848j216n19
$$ 12916 13918 14695 15401 15999 16279 15920 14702 12887 11165 9902 8695 6987 4899 3051 1835 1316
55304A316K39R00J015N79K35L69N65L66j5q2L00R82J666J867J331N80L79N49K77
$$ 1316 1555 2455 3470 4049 4284 4653 5218 5584 5569 5487 5787 6769 8435 10302 11633 12213 12592 13141 13418
55285A3418l61k94P20J456J033K12O1L05P3n49p73n03l24m54n18k59J56M60M44
$$ 13418 13057 12763 13483 14939 15972 16184 16245 16550 16623 16074 15301 14798 14474 14020 13502 13243 13399 13859 14303
55266A4303J02j73R5P23R78O69L96M06J15o65j043l70N22M14n81j316j223p26
$$ 14303 14405 14232 14327 15050 16028 16697 17093 17499 17614 16949 15906 15536 16058 16472 15891 14575 13352 12626
55248A2626l25q2P6K31M93P78P71M56K50K74R6m39p59n41l83q19j318j136n58
$$ 12626 12301 12219 12295 12526 13019 13797 14568 15024 15274 15548 15644 15205 14446 13905 13522 12703 11385 10249 9691
55229I691l72n19k63N02J084J062P86P88J235J904K309J989J029R6k94k29L5M53
$$ 9691 9319 8800 8537 9039 10123 11185 11971 12759 13994 15898 18207 20196 21225 21321 21027 20798 20833 21286
55211B1286Q23O82O0l35j43J04k2l5N39J158J039L73j23l22n10n71l46l34j056
$$ 21286 22109 22791 22851 22516 22373 22477 22455 22420 22959 24117 25156 25529 25406 25084 24574 24003 23657 23323 22267
55192B2267k038k385k076j756j453o56M96J170J054O85M22m8r30j819k177j872
$$ 22267 20229 17844 15768 14012 12559 11903 12399 13569 14623 15308 15730 15682 14752 12933 10756 8884
55176H884j063n3P14R59Q93R24J112J274J395J436J011j50j556k361k330j869
$$ 8884 7821 7768 8482 9441 10334 11258 12370 13644 15039 16475 17486 17336 15780 13419 11089 9220
55160I220j249m15N11J118J142O72k9n35l42N81J523J742J275O71J93k17m63m23
$$ 9220 7971 7556 8067 9185 10327 10999 10970 10435 10093 10674 12197 13939 15214 15885 16078 15861 15398 14975
55142A4975l15l99m94k73J14K83K71M34Q28J151J181Q65K52l24l52K09P70J041
$$ 14975 14660 14261 13767 13494 13608 13891 14162 14596 15424 16575 17756 18621 18873 18549 18197 18406 19176 20217
55124B0217J460K213K507J726O46M32Q45O18n42j534j524q74k42K83P70J001P97
$$ 20217 21677 23890 26397 28123 28769 29201 30046 30664 30122 28588 27064 26190 25948 26231 27001 28002 28799
55107B8799L45j04m32l96K36J221J931K049J862J794J985K254K216J529M17l55
$$ 28799 29144 29040 28608 28212 28448 29669 31600 33649 35511 37305 39290 41544 43760 45289 45706 45351
55091D5351l48j4P7R7M63Q82P86M05N41J327K042K156J789J151K93m99p67m69
$$ 45351 45003 44989 45066 45163 45626 46508 47294 47699 48240 49567 51609 53765 55554 56705 56998 56499 55732 55263
55073E5263ML97O63O28K06k67m57o15r90j028j35J033J146P3r11r73o73p75j112
$$ 55263 55267 55664 56327 56955 57161 56894 56437 55822 54832 53804 53669 54702 55848 55921 55010 54037 53364 52589 51477
55054E1477j111o42K6N27M34l24r78o72J68K07p98j542j195o80j071j762j395
$$ 51477 50366 49724 49750 50277 50711 50387 49409 48737 48905 49112 48314 46772 45577 44897 43826 42064 40669
55037D0669j8R22N84m31j180j412j227n51N84J643J947J407O34L47P63J510K071
$$ 40669 40651 41573 42157 41726 40546 39134 37907 37356 37940 39583 41530 42937 43571 43918 44681 46191 48262
55020D8262K190J939J514J071O42J85j80j24N06J222J250N21j55j25L38N72L81
$$ 48262 50452 52391 53905 54976 55618 55803 55623 55499 56005 57227 58477 58998 58843 58718 59056 59628 60009
55003F0009m5n66r56q56l51j73o73j118p75j64k65r11j054m56R9K35M43Q93R27
$$ 60009 59964 59398 58442 57586 57235 57062 56389 55271 54496 54332 54067 53156 52102 51646 51745 51980 52423 53316 54243
54984E4243J85p15j048q08k59O35J769K509K320J462O98M94P35R69Q72N96O33
$$ 54243 54428 53713 52665 51857 51598 52233 54002 56511 58831 60293 60991 61485 62220 63189 64061 64657 65290
54967F5290J073J388J332J534K525L690M179M438N599P456Q518Q283Q030Q875
$$ 65290 66363 67751 69083 70617 73142 76832 81011 85449 91048 98504 107022 115305 123335 132210
54953A32210J0388J1727J3004J4539J5742J5699J4297J2010R051N475J587k355
$$ 132210 142598 154325 167329 181868 197610 213309 227606 239616 248667 254142 255729 253374
54941B53374o414j0356j3348j4842j5241j5106j4274j2512j0516r340r097q854
$$ 253374 246960 236604 223256 208414 193173 178067 163793 151281 140765 131425 122328 113474
54929A13474p811o040m180k890k447k469k217j375l80K78O91J233K022K945L925
$$ 113474 105663 99623 95443 92553 90106 87637 85420 84045 83665 83943 84634 85867 87889 90834 94759
54914I4759M804N424N984O996Q561J0254J1821J3439J4994J5792J5417J4149J2142
$$ 94759 99563 104987 110971 117967 126528 136782 148603 162042 177036 192828 208245 222394 234536
54901B34536Q973M554j96m356p996j1490j4399j5983j6309j5930j4890j2986j0751
$$ 234536 243509 248063 247867 243511 235515 224025 209626 193643 177334 161404 146514 133528 122777
54888A22777r113q227p439o399n369m484l534k551j864j493j098o26l49k84j49
$$ 122777 113664 105437 97998 91599 86230 81746 78212 75661 73797 72304 71206 70580 70231 69947 69798
54873F9798j7k81r03j331j303j187j295j478j557j672j858j822j424r92q12o76
$$ 69798 69781 69500 68597 67266 65963 64776 63481 62003 60446 58774 56916 55094 53670 52678 51866 51190
54857E1190l12P4O1l14n67m04n2J09L7K5K49M55J75o68j516j716j269q20q64j121
$$ 51190 50878 50952 51013 50699 50132 49728 49676 49785 49822 49847 50096 50551 50726 50058 48542 46826 45557 44737 43873 42752
54837D2752q71J42J290J683J137L01j43j12K11R02J961K702K219O46p06p87J03
$$ 42752 41881 42023 43313 44996 46133 46434 46291 46179 46390 47292 49253 51955 54174 54820 54114 53327 53430
54820E3430R83J437J692J859J766J409J070R71J145J616K312K918L142L144L402
$$ 53430 54413 55850 57542 59401 61167 62576 63646 64617 65762 67378 69690 72608 75750 78894 82296
54805H2296M141N138O108O984P823Q702R737J1015J2488J3986J5322J6244J6392
$$ 82296 86437 91575 97683 104667 112490 121192 130929 141944 154432 168418 183740 199984 216376
54792B16376J5487J3536J0735P220L122j238n340q671j0920j2104j2556j2652
$$ 216376 231863 245399 256134 263354 266476 265238 259898 251227 240307 228203 215647 202995
54780B02995j2410j1553j0084q571p609p146o622n679m442l148j835n50L83O60
$$ 202995 190585 179032 168948 160377 152768 145622 139000 133321 128879 125731 123896 123346 123729 124389
54766A24389N20P31J808L363M542N139N883P392R290J0815J2027J3734J6250J8877
$$ 124389 124909 125640 127448 130811 135353 140492 146375 153767 163057 173872 185899 199633 215883 234760
54752B34760K0796K1929K2590K2684K1558J8518J3341O642k59o186j1018j5375
$$ 234760 255556 277485 300075 322759 344317 362835 376176 382818 382559 376373 365355 349980
54740C49980j9337k2036k2809k2164k1117k0006j8466j6278j3717j1207r063p495
$$ 349980 330643 308607 285798 263634 242517 222511 204045 187767 174050 162843 153780 146285
54728A46285o490n763n109m646m463m224l547k623k020j929j961j752j431j313
$$ 146285 139795 134032 128923 124277 119814 115590 112043 109420 107400 105471 103510 101758 100327 99014
54714I9014j402j398j150q76r19j296j715j918j836j305j13J455K448K140R75
$$ 99014 97612 96214 95064 94188 93269 91973 90258 88340 86504 85199 85086 86541 88989 91129 92104
54699I2104M5k16k81n08n93k04M06P53O99M39K88N37J163J601J273L60m44q87
$$ 92104 92149 91933 91652 91144 90551 90347 90753 91506 92205 92644 92932 93469 94632 96233 97506 97866 97422 96535
54681I6535j156j025J04J922L069K781J909J675K111K485K581K732K997L161L299
$$ 96535 95379 94354 94458 96380 99449 102230 104139 105814 107925 110410 112991 115723 118720 121881 125180
54666A25180L629M012M171M137L983L491K641K086K386L094L318L017K925L386
$$ 125180 128809 132821 136992 141129 145112 148603 151244 153330 155716 158810 162128 165145 168070 171456
54652A71456M007M501N079N881O649P211P852Q958J0532J2207J3590J4595J5413
$$ 171456 175463 179964 185043 190924 197573 204784 212636 221594 232126 244333 257923 272518 287931
54639B87931J6141J6326J5209J2452Q373L432j957p045j0969j3754j6326j8925
$$ 287931 304072 320398 335607 348059 356432 359864 357907 350862 339893 326139 309813 290888
54627B90888k0309j9338j6747j4352j2906j1790j0526r427q682p892o828n844
$$ 290888 270579 251241 234494 220142 207236 195446 184920 175493 166811 158919 152091 146247
54615A46247n192m538l451j978m90O91J439J804J925J765J064j82j443k222k630
$$ 146247 141055 136517 133066 131088 130598 131289 132728 134532 136457 138222 139286 139104 137661 135439 132809
54600A32809k950l028k633k093j914j995j888j665j735k010k071k124k874m311
$$ 132809 129859 126831 124198 122105 120191 118196 116308 114643 112908 110898 108827 106703 103829 99518
54586I9518n412n352m344l090j996j267j088j376j642j478r80n31m00o17r80j190
$$ 99518 94106 88754 84410 81320 79324 78057 76969 75593 73951 72473 71493 70962 70562 69945 68965 67775
54570F7775j080p77m38j09R3o7m35l98K42Q28P97O07R78J624J656J003M76N27
$$ 67775 66695 65918 65480 65371 65464 65397 64962 64564 64806 65634 66431 67038 68016 69640 71296 72299 72775 73302
54552G3302Q56J227J709K083J907J296Q46P52P52R62J750K738L033K701K923M282
$$ 73302 74158 75385 77094 79177 81084 82380 83226 83978 84730 85692 87442 90180 93213 95914 98837 103119
54536A03119N894O771P066P363P594P478P316P448P388O337M271J885l92k604
$$ 103119 109013 115784 122850 130213 137807 145285 152601 160049 167437 173774 178045 179930 179538 176934
54522A76934m612n917o280o182o403p175p869p679o667n837n851o009n120l189
$$ 176934 172322 166405 160125 153943 147540 140365 132496 124817 118150 112313 106462 100453 95333 92144
54508I2144j468r27j328j925k264k143j496p46n72j039j459j333q80l99J37O08
$$ 92144 90676 89749 88421 86496 84232 82089 80593 79847 79275 78236 76777 75444 74564 74165 74302 74910
54492G4910N41r3n16n1J027J893K041J474N86R4N24J439J786J294Q36J057J460
$$ 74910 75451 75358 74842 74791 75818 77711 79752 81226 81812 81906 82430 83869 85655 86949 87785 88842 90302
54475I0302J375J044R62Q49K02n78n97J75P81N66j49o57p03n54n81q62j045q31
$$ 90302 91677 92721 93683 94532 94734 94156 93559 93734 94515 95081 94932 94275 93572 93018 92437 91575 90530 89699
54457H9699m76n35r71j130p68m19m40l65K13P39M52m16r87j016j061j493k032
$$ 89699 89223 88688 87717 86587 85819 85400 84960 84595 84808 85547 85999 85583 84596 83580 82519 81026 78994
54440G8994k260k034j426o65j18P5K01M87O30K46m84r77r44m72L25J330K195K584
$$ 78994 76734 74700 73274 72609 72491 72566 72767 73254 73884 74130 73646 72669 71725 71253 71578 72908 75103 77687
54422G7687K541K248J669Q10Q8k6L54O71O60N15N19Q28J481K278K742K556J968
$$ 77687 80228 82476 84145 84955 85043 85017 85371 86042 86702 87217 87736 88564 90045 92323 95065 97621 99589
54405I9589J495J414J721K339L012L345L286L294L674M045L859L120K179J216
$$ 99589 101084 102498 104219 106558 109570 112915 116201 119495 123169 127214 131073 134193 136372 137588
54391A37588L84R7M92R37O64k91j299k052k645l049l177l292l616l768l254k427
$$ 137588 137972 138069 138561 139498 140162 139871 138572 136520 133875 130826 127649 124357 120741 116973 113719 111292
54375A11292k196k779l444l538l076k331j502r18q64j136j245j174j265j361q56
$$ 111292 109096 106317 102873 99335 96259 93928 92426 91508 90644 89508 88263 87089 85824 84463 83607
54360H3607K01R05P18K35K66P56J157J293J349J358J270J363J998L023L801L894
$$ 83607 83808 84713 85431 85666 85932 86688 87845 89138 90487 91845 93115 94478 96476 99499 103300 107194
54344A07194L478L105L196L692M132M083L561K939K433J900J143K01p34j486j920
$$ 107194 110672 113777 116973 120665 124797 128880 132441 135380 137813 139713 140856 141057 140323 138837 136917
54329A36917k080k263k744l356l651l523l446l871m612m975m439l207k119j936
$$ 136917 134837 132574 129830 126474 122823 119300 115854 111983 107371 102396 97957 94750 92631 90695
54315I0695k570l129k949k273j751j520j310j171j389j768j749j338j169j403
$$ 90695 88125 84996 82047 79774 78023 76503 75193 74022 72633 70865 69116 67778 66609 65206
54301F5206j359o48N5k4o37j013r98r06o38J74J149J294L11r02j399j228r48o78
$$ 65206 63847 63199 63254 63230 62593 61580 60582 59676 59038 59212 60361 61655 61966 61064 59665 58437 57489 56811
54283E6811j75M59P89P08O23Q94J367J615J423R58N80N49P80Q36L20n79j076n40
$$ 56811 56636 57095 57884 58592 59215 60109 61476 63091 64514 65472 66052 66601 67381 68217 68537 67958 66882 66342
54265F6342P26J658J549Q17M59Q02J076M74o74j181m86N84Q65L14o8L37R85R92
$$ 66342 67068 68726 70275 71092 71551 72353 73429 73903 73229 72048 71562 72146 73011 73325 73257 73594 74579 75571
54247G5571K58n71r63r16o94n49o25q18p61k58L20M09Ok91j44P4j60p92j283j284
$$ 75571 75829 75258 74295 73379 72685 72136 71511 70693 69932 69674 69994 70403 70409 70118 69974 70048 69888 69096 67813 66529
54227F6529r50o33l97J5P88J625J974J656J078O47K75j97m49j02M94N79Q3k27
$$ 66529 65579 64946 64549 64564 65352 66977 68951 70607 71685 72332 72607 72410 71961 71859 72353 72932 73015 72788
54209G2788J29P03R04P91O64M24j07n87n21m8J60k00p31r55q55o97o03n12l96
$$ 72788 72917 73620 74524 75315 75979 76403 76296 75709 75188 75140 75300 75100 74369 73414 72559 71862 71259 70747 70351
54190G0351l66m69n38l80r1J7r7q7J87K65k58r88j201r52r61j346j305l57P40
$$ 70351 69985 69516 68978 68598 68507 68524 68427 68340 68527 68792 68534 67546 66345 65393 64432 63086 61781 61424 62164
54171F2164Q65r2j201j505q20K53Q28N30j03k30K04M87K77N2K11M88N28M79N63
$$ 62164 63029 62937 61736 60231 59411 59664 60492 61022 60919 60689 60893 61380 61657 61709 61920 62408 62936 63415 63978
54152F3978O92Q56J317J886J783P94j14m5N83Q00M88J58k08j018k039k476k059
$$ 63978 64670 65526 66843 68729 70512 71306 71192 71147 71730 72530 73018 73176 72968 71950 69911 67435 65376
54135F5376j259n55j03ok75n95p06q06j049j024m28J52N7k93J2Q32J190Q38M83
$$ 65376 64117 63562 63459 63453 63178 62583 61877 61071 60022 58998 58570 58722 58779 58486 58498 59330 60520 61358 61841
54116F1841L93Qq20j319j021n46n73p96m88M24J341J679J266L68m14o08l47o8
$$ 61841 62234 62242 61422 60103 59082 58536 57963 57167 56679 57103 58444 60123 61389 61757 61343 60735 60388 60320
54098F0320J62N18P62M17l51p88o61n87j020j555j595j075l21L69P30O73N03N61
$$ 60320 60482 61000 61762 62179 61828 61040 60379 59792 58772 57217 55622 54547 54226 54595 55325 55998 56501 57062
54080E7062N58m0r95j428j088o29m91l30P6L97O15J311K459K833J549m38j323
$$ 57062 57620 57580 56585 55157 54069 53440 52949 52619 52695 53092 53707 55018 57477 60310 61859 61421 60098
54063F0098n24R77K063K452K424K287K124J767J074L55K45Q78J636J909J714J273
$$ 60098 59574 60551 62614 65066 67490 69777 71901 73668 74742 75097 75342 76220 77856 79765 81479 82752
54047H2752O84L02P43J905K636K078Q69K78O07J250J868K587L218L349L221L626
$$ 82752 83436 83738 84481 86386 89022 91100 91969 92247 92854 94104 95972 98559 101777 105126 108347 111973
54031A11973M777N930O434O454O465O499O320O030O035O400O547N770M096K434
$$ 111973 116750 122680 129114 135568 142033 148532 154852 160882 166917 173317 179864 185634 189730 192164
54017A92164J628J476J123L93Q5O89J528J664J198R27R97O87m60k000l189l777
$$ 192164 193792 195268 196391 196784 196869 197558 199086 200750 201948 202875 203872 204559 204099 202099 198910 195133
54001A95133m017m263m650m951m680l637k326j575j670k133k382k381k492k854
$$ 195133 191116 186853 182203 177252 172572 168935 166609 165034 163364 161231 158849 156468 153976 151122
53987A51122l156k954k182j252o66o44j103j816k393k379j738j108j098j466j433
$$ 151122 147966 145012 142830 141578 140912 140268 139165 137349 134956 132577 130839 129731 128633 127167 125734
53972A25734q01r8L63Q36J356J472J110R72J461J874J375L17j72L29J121J336
$$ 125734 124933 124835 125198 126034 127390 128862 129972 130944 132405 134279 135654 135971 135799 136128 137249 138585
53956A38585P81p7n15j10P54J128O23r1j96K37O63J053J791K829L692M204M651
$$ 138585 139366 139289 138774 138664 139418 140546 141169 141078 140882 141119 141782 142835 144626 147455 151147 155351 160002
53939A60002N231N830O267O284N570M200K846K049J526P49j60p89j322k231l225
$$ 160002 165233 171063 177330 183614 189184 193384 196230 198279 199805 200554 200394 199605 198283 196052 192827
53924A92827l457k719j591m44Q21J991K532K621L170M438N492N560N157N185N630
$$ 192827 189370 186651 185060 184616 185437 187428 189960 192581 195751 200189 205681 211241 216398 221583 227213
53909B27213N877N860O055O573O975O962O677O249N521M335K858J472M48k14o76
$$ 227213 233090 238950 245005 251578 258553 265515 272192 278441 283962 288297 291155 292627 293075 292861 292185
53894B92185r92j043q55p85j121j667k121k739m044n852p198p501p203o992o893
$$ 292185 291193 290150 289295 288510 287389 285722 283601 280862 276818 270966 263768 256267 249064 242072 235179
53879B35179o641o387o383o378n951n265m787m359l370j950j206j881l293m151
$$ 235179 228538 222151 215768 209390 203439 198174 193387 189028 185658 183708 182502 180621 177328 173177
53865A73177m035l544l232l040k830k832l240l723l719l120k371j953j977k285
$$ 173177 169142 165598 162366 159326 156496 153664 150424 146701 142982 139862 137491 135538 133561 131276
53851A31276k625k738k441j847j314j113j199j333j368j368j467j657j710j431
$$ 131276 128651 125913 123472 121625 120311 119198 117999 116666 115298 113930 112463 110806 109096 107665
53837A07665r81p56q10p34k73K09K98K19M06O51M12j11r7N41Q32K24n01l46M61
$$ 107665 106684 105928 105118 104384 104111 104320 104618 104837 105243 105894 106306 106195 106098 106639 107471 107695 107194 106848 107309
53818A07309R04N67j30o74q06l99L14O78M12J97Q35K069K998L310L340L111K343
$$ 107309 108213 108780 108650 107976 107170 106771 107085 107763 108175 108372 109207 111276 114274 117584 120924 124035 126378
53801A26378J388J244K347M075N571O431O481N685M536L849L865M089M110M011
$$ 126378 127766 129010 131357 135432 141003 147434 153915 159600 164136 167985 171850 175939 180049 184060
53787A84060L773L072J983J225J248J692K017K122J993J443O42K81N52O49q5j114
$$ 184060 187833 190905 192888 194113 195361 197053 199070 201192 203185 204628 205270 205551 206103 206752 206667 205553
53771B05553j514j392j573k173k524k360k193k344k458k260k079k233k484k469
$$ 205553 204039 202647 201074 198901 196377 194017 191824 189480 187022 184762 182683 180450 177966 175497
53757A75497k332k449k774k864k476j824j279j017r78r80q42n34k52k34n19q61
$$ 175497 173165 170716 167942 165078 162602 160778 159499 158482 157504 156524 155682 155148 154896 154662 154143 153282
53741A53282r93r09q76j153j749k391k716k510j830r97l68j74m71j180j952k209
$$ 153282 152289 151380 150504 149351 147602 145211 142495 139985 138155 137158 136790 136616 136145 134965 133013 130804
53725A30804j614o17j12l72o28n7J134J982J936J304O63K48L7j6J05M54J060J713
$$ 130804 129190 128573 128461 128089 127461 127404 128538 130520 132456 133760 134423 134671 134708 134692 134797 135251 136311 138024
53707A38024K006J897J931K546L347L642L462L366L343K784J710J094J563K513
$$ 138024 140030 141927 143858 146404 149751 153393 156855 160221 163564 166348 168058 169152 170715 173228
53693A73228L059L220L549M048M194L785L169K720K556K604K582K148J404J019
$$ 173228 176287 179507 183056 187104 191298 195083 198252 200972 203528 206132 208714 210862 212266 213285
53679B13285J441K209K512K139J457P06n4n49m96j63p6j66J05P13R05K91n63j020
$$ 213285 214726 216935 219447 221586 223043 223749 223695 223146 222650 222487 222411 222245 222350 223063 223968 224259 223696 222676
53661B22676j243j679k130j962j069r2L37J24m63j079j313q04L41J451J807J271
$$ 222676 221433 219754 217624 215662 214593 214501 214838 214962 214499 213420 212107 211303 211644 213095 214902 216173
53645B16173L31m29p69q21q32q74p55k35O05J252J223O30J19J49N16O90M82J57
$$ 216173 216504 216075 215306 214485 213653 212779 212024 211789 212394 213646 214869 215499 215618 215767 216283 216973 217455 217612
53627B17612L6K30O48J087J306J307J449K078K956L423L197K738K657K994L249
$$ 217612 217648 217878 218526 219613 220919 222226 223675 225753 228709 232132 235329 238067 240724 243718 246967
53612B46967L012K413J997K237L018L671L699L405L494M084M563M554M484M891
$$ 246967 249979 252392 254389 256626 259644 263315 267014 270419 273913 277997 282560 287114 291598 296489
53598B96489N592N997N931N671N374N001M706M764N110N356N317N078M651L990
$$ 296489 302081 308078 314009 319680 325054 330055 334761 339525 344635 349991 355308 360386 365037 369027
53584C69027L437L527M118M290L495K421K153K739L150K670J719J110R89Q82N51
$$ 369027 372464 375991 380109 384399 387894 390315 392468 395207 398357 401027 402746 403856 404845 405727 406278
53569D06278L09M75Q90J175J243J281J252P35n32k076k908k470j266l96m31r09
$$ 406278 406587 407062 407952 409127 410370 411651 412903 413638 413106 411030 408122 405652 404386 403990 403559 402650
53553D02650r97n27r2j30l20l2Q26J742K243K285K016J523R25N00M60P05R52J044
$$ 402650 401653 401126 401034 400904 400584 400552 401378 403120 405363 407648 409664 411187 412112 412612 413072 413777 414729 415773
53535D15773J064J202J545K002K413K779L267L883M237L955L350L333M422O069
$$ 415773 416837 418039 419584 421586 423999 426778 430045 433928 438165 442120 445470 448803 453225 459294
53521D59294P204P380P154P437Q626J0354J1878J2663J2755J2643J2750J3121
$$ 459294 466498 473878 481032 488469 497095 507449 519327 531990 544745 557388 570138 583259
53509E83259J3612J4220J5084J6217J7471J8735J9997K1157K2004K2535K3095
$$ 583259 596871 611091 626175 642392 659863 678598 698595 719752 741756 764291 787386
53498G87386K4038K5284K6433K7275K8021K8948K9975L0750L1022L0771L0135
$$ 787386 811424 836708 863141 890416 918437 947385 977360 1008110 1039132 1069903 1100038
53487A100038K9398K8962K9029K9271K9150K8561K7911K7547K7423K7494K7927
$$ 1100038 1129436 1158398 1187427 1216698 1245848 1274409 1302320 1329867 1357290 1384784 1412711
53476A412711K8696K9344K9519K9408K9283K8913K7941K6567K5245K3897K2089
$$ 1412711 1441407 1470751 1500270 1529678 1558961 1587874 1615815 1642382 1667627 1691524 1713613
53465A713613J9996J8446J7787J7346J6335J4793J3250J1910J0561R082P454N481
$$ 1713613 1733609 1752055 1769842 1787188 1803523 1818316 1831566 1843476 1854037 1863119 1870573 1876054
53453A876054K858l40l583o352q609j0743j3069j5389j7083j7788j7880j8236
$$ 1876054 1878912 1878572 1874989 1868637 1860028 1849285 1836216 1820827 1803744 1785956 1768076 1749840
53441A749840j9532k1887k4943k7893k9715k9857k8858k7878k7575k7756k8071
$$ 1749840 1730308 1708421 1683478 1655585 1625870 1596013 1567155 1539277 1511702 1483946 1455875
53430A455875k8506k8981k9042k8199k6390k3890k1084j8490j6554j5251j4160
$$ 1455875 1427369 1398388 1369346 1341147 1314757 1290867 1269783 1251293 1234739 1219488 1205328
53419A205328j3066j2084j1163r923q198o253m295k222j39J532K785M300O538
$$ 1205328 1192262 1180178 1169015 1159092 1150894 1144641 1140346 1138124 1137985 1139517 1142302 1146602 1153140
53406A153140R124J1577J4091J6969J9757K1710K2816K3753K4992K6514K8106
$$ 1153140 1162264 1173841 1187932 1204901 1224658 1246368 1269184 1292937 1317929 1344443 1372549
53395A372549K9461L0313L1062L2839L6178M0047M2988M4934M6938M9387N1614
$$ 1372549 1402010 1432323 1463385 1496224 1532402 1572449 1615437 1660371 1707309 1756696 1808310
53384A808310N3281N4952N6996N8992O0630O2316O4351O6238O7387O7866O7964
$$ 1808310 1861591 1916543 1973539 2032531 2093161 2155477 2219828 2286066 2353453 2421319 2489283
53373B489283O7615O6876O6325O6352O6352O5378O3253O0498N7417N3861M9770
$$ 2489283 2556898 2623774 2690099 2756451 2822803 2888181 2951434 3011932 3069349 3123210 3172980
53362C172980M5276M0425L5281L0225K5655K1420J7040J2421P812L099k146p852
$$ 3172980 3218256 3258681 3293962 3324187 3349842 3371262 3388302 3400723 3408535 3411634 3409488 3401636
53350C401636j3255j7909k2342k7335l2959l8705m4298m9842n5208n9850o3280
$$ 3401636 3388381 3370472 3348130 3320795 3287836 3249131 3204833 3154991 3099783 3039933 2976653
53339B976653o5418o6414o6460o5847o4945o3876o2483o0788n9273n8458n8261
$$ 2976653 2911235 2844821 2778361 2712514 2647569 2583693 2521210 2460422 2401149 2342691 2284430
53328B284430n8019n7137n5565n3744n2170n0977m9791m8058m5631m2863m0016
$$ 2284430 2226411 2169274 2113709 2059965 2007795 1956818 1907027 1858969 1813338 1770475 1730459
53317A730459l6937l3544l0303k7778k5875k4122k2561k1691k1500k1182k0104
$$ 1730459 1693522 1659978 1629675 1601897 1576022 1551900 1529339 1507648 1486148 1464966 1444862
53306A444862j8462j6744j5100j3525j2157j0971r579p766n836m127k620j324
$$ 1444862 1426400 1409656 1394556 1381031 1368874 1357903 1348324 1340558 1334722 1330595 1327975 1326651
53294A326651n38k22L40J650L216M368N408P150R629J2142J4377J6670J9184K1695
$$ 1326651 1326113 1325891 1326231 1327881 1331097 1335465 1340873 1348023 1357652 1369794 1384171 1400841 1420025 1441720
53280A441720K4129K6563K8615K9719L0070L0477L1108L1306L0863L0510L0714
$$ 1441720 1465849 1492412 1521027 1550746 1580816 1611293 1642401 1673707 1704570 1735080 1765794
53269A765794L0814K9951K8189K6126K3978K1626J9101J6443J3535J0592Q300
$$ 1765794 1796608 1826559 1854748 1880874 1904852 1926478 1945579 1962022 1975557 1986149 1994449
53258A994449O882N544L463R49j200l083n549q875j2438j5691j8637k1227k3133
$$ 1994449 2001331 2006875 2010338 2011287 2010087 2007004 2001455 1992580 1980142 1964451 1945814 1924587 1901454
53245A901454k4438k5904k8134l0788l2995l4200l4471l4244l4051l4229l4671
$$ 1901454 1877016 1851112 1822978 1792190 1759195 1724995 1690524 1656280 1622229 1588000 1553329
53234A553329l4910l4616l3843l2824l1759l0867l0353l0146k9876k9230k8213
$$ 1553329 1518419 1483803 1449960 1417136 1385377 1354510 1324157 1294011 1264135 1234905 1206692
53223A206692k7015k5843k4920k4372k4000k3421k2572k1753k1047k0027j8363
$$ 1206692 1179677 1153834 1128914 1104542 1080542 1057121 1034549 1012796 991749 971722 953359
53212I53359j6424j4863j3833j3029j2331j1975j2084j2540j3334j4577j5988
$$ 953359 936935 922072 908239 895210 882879 870904 858820 846280 832946 818369 802381
53201H02381j6851j6830j6445j6381j6565j6355j5447j4176j2995j2015j1199
$$ 802381 785530 768700 752255 735874 719309 702954 687507 673331 660336 648321 637122
53190F37122j0581j0317j0651j1771j3394j4600j4612j3792j3353j3927j4842
$$ 637122 626541 616224 605573 593802 580408 565808 551196 537404 524051 510124 495282
53179D95282j5066j4387j3328j2273j1275j0453j0029r936r798r351q665p983
$$ 495282 480216 465829 452501 440228 428953 418500 408471 398535 388737 379386 370721 362738
53167C62738p547p471p549p309o559n743n416n526n552n274m934m679m324l764
$$ 362738 355191 347720 340171 332862 326303 320560 315144 309618 304066 298792 293858 289179 284855 281091
53153B81091l229l027l257l803m306m230l286j937j040r40j226j421j484j519
$$ 281091 277862 274835 271578 267775 263469 259239 255953 254016 252976 252036 250810 249389 247905 246386
53139B46386j440j154q15o19o34q85j328j624j376p08k37k42l18p8L08O11J098
$$ 246386 244946 243792 242977 242358 241724 240839 239511 237887 236511 235803 235566 235324 235006 234928 235236 235847 236945
53122B36945K069L174L757L693L354K923K295J493O70k34j294k101k088j428j029
$$ 236945 239014 242188 245945 249638 252992 255915 258210 259703 260373 260139 258845 256744 254656 253228 252199
53107B52199j412k162k636k752k730k640k636l193m443n596n700m842l949l453
$$ 252199 250787 248625 245989 243237 240507 237867 235231 232038 227595 221999 216299 211457 207508 204055
53093B04055k869j919j250j540k384k787k494k171k346k864l392l837m027l573
$$ 204055 201186 199267 198017 196477 194093 191306 188812 186641 184295 181431 178039 174202 170175 166602
53079A66602k511j548j288j436j315r09q11j194j478j186o44n20r04j226r61k31
$$ 166602 164091 162543 161255 159819 158504 157595 156784 155590 154112 152926 152282 151762 150858 149632 148671 148440
53063A48440L81M73J95oN1J52P3p4m8J62L03Q0o00j447j774j134j06Rj258k714
$$ 148440 148821 149294 149489 149483 149534 149686 149759 149685 149637 149799 150102 150182 149582 148135 146361 145227 145121 145130 143872 141158
53043A41158k801j508k86j90q74j473j676j621j353r07n01l01j95j66m59j076
$$ 141158 138357 136849 136563 136373 135499 134026 132350 130729 129376 128469 127968 127667 127472 127306 126847 125771
53027A25771j377p32N52J373J011p9p33l19O07R46L18n27p14l19o4j69j86J08
$$ 125771 124394 123662 124214 125587 126598 126519 125786 125467 126074 127020 127338 126811 126097 125778 125714 125545 125359 125467
53009A25467L53L42M45R23J342J164N06q9l51l35q4L28O39O39M26J15m03j089
$$ 125467 125820 126162 126607 127530 128872 130036 130542 130453 130102 129767 129683 130011 130650 131289 131715 131830 131427 130338
52991A30338j434j060l86j74n22q40p69n18k30L98J545K738L300L153K864K954
$$ 130338 128904 127844 127458 127284 126762 125922 125153 124635 124405 124803 126348 129086 132386 135539 138403 141357
52975A41357L398L851M135M275M214L788L177K975L474M013L624K269R16K65k4
$$ 141357 144755 148606 152741 157016 161230 165018 168195 171170 174644 178657 182281 184550 185466 185731 185707
52960A85707n58j232j545j488j489j671j680j273o78l29n46j354k338k802k381
$$ 185707 185149 183917 182372 180884 179395 177724 176044 174771 174093 173764 173218 171864 169526 166724 164343
52945A64343j465p89o48q54j182j518j637j243l81N14J014R91N38r3n18m02K59
$$ 164343 162878 162089 161441 160587 159405 157887 156250 155007 154626 155140 156154 157145 157683 157590 157072 156670 156929
52928A56929J111J681J622Q74j34o81m00K98O65M31nq3L68J017J237O53l69r34
$$ 156929 158040 159721 161343 162217 162083 161402 161002 161300 161965 162396 162391 162308 162676 163693 164930 165583 165214 164280
52910A64280o10N6L02J94L86J025J475J250O74L80M95O69O81O88Q68J060R65O38
$$ 164280 163670 163726 164028 164222 164608 165633 167108 168358 169032 169412 169907 170576 171257 171945 172813 173873 174838 175476
52892A75476N33R06J331J148L51l44m03rL89O64Q50Q76Q06R74J425J565Q54l56
$$ 175476 176009 176915 178246 179394 179745 179401 178998 178989 179378 180042 180892 181768 182574 183548 184973 186538 187392 187036
52874A87036j146j041k68P32J562J801J351P43P15J336J969K045J503O48l7o8
$$ 187036 185890 184849 184581 185313 186875 188676 190027 190770 191485 192821 194790 196835 198338 198986 198949 198881
52858A98881N76J280J524J602K132L075L844M209M365M268L731L204L449M244
$$ 198881 199457 200737 202261 203863 205995 209070 212914 217123 221488 225756 229487 232691 236140 240384
52844B40384M324L058J341L61J49Rk71m15n08j034k087l156l743l825l632l307
$$ 240384 244708 247766 249107 249468 249617 249626 249355 248940 248432 247398 245311 242155 238412 234587 230955 227648
52828B27648k873k427k224k552l320l909l689k784k037k049k531k768k448j858
$$ 227648 224775 222348 220124 217572 214252 210343 206654 203870 201833 199784 197253 194485 192037 190179
52814A90179j495j592j940k097j888j653j767k014j852j176m01J52M69M17k36
$$ 190179 188684 187092 185152 183055 181167 179514 177747 175733 173881 172705 172304 172456 172925 173342 173106
52799A73106j257k026k341k546k706k379j505p83o69p08m34k85q32j684j947j485
$$ 173106 171849 169823 167482 164936 162230 159851 158346 157563 156894 156186 155752 155467 154635 152951 151004 149519
52783A49519r41p03o24n93o45n84k85k21r89k177k581j694m18P0l98j138j608
$$ 149519 148578 147875 147251 146658 146013 145429 145144 144923 143934 141757 139176 137482 137064 137134 136736 135598 133990
52766A33990j825k024k196k020j285m00k29j088k153k390j847j394j363j279r90
$$ 133990 132165 130141 127945 125925 124640 124240 124011 122923 120770 118380 116533 115139 113776 112497 111507
52751A11507j099j828k404k158j598j547j766j403n16j28o45j220j009l30p0m43
$$ 111507 110408 108580 106176 104018 102420 100873 99107 97704 97188 97060 96415 95195 94186 93856 93786 93343
52735I3343r54j237j396j551j622j532j307q24J03J331K265K400J779Q55N9l84
$$ 93343 92389 91152 89756 88205 86583 85051 83744 82920 83023 84354 86619 89019 90798 91653 91712 91328
52719I1328l59J03P17J082R66M85l1k77j59J22K85L05M74J004J679K041J947J729
$$ 91328 90969 91072 91789 92871 93837 94322 94291 94014 93855 93977 94262 94567 95041 96045 97724 99765 101712 103441
52701A03441J796K204K631K672K227J580J103Q26M29j98o88p37o82j103j926k417
$$ 103441 105237 107441 110072 112744 114971 116551 117654 118480 118909 118711 118023 117286 116604 115501 113575 111158
52685A11158k191j768j840k338k598k246j539q91m44j94k71p91j508j868j565
$$ 111158 108967 107199 105359 103021 100423 98177 96638 95747 95303 95109 94838 94047 92539 90671 89106
52670H9106j009r34j525k187k308j978j651j364p64J29P28N56k13j035j496j464
$$ 89106 88097 87163 85638 83451 81143 79165 77514 76150 75386 75515 76243 76799 76586 75551 74055 72591
52654G2591j012l77K68R42J590J772J127P4n57o11o84j008j041n42j93n30r28
$$ 72591 71579 71202 71470 72412 74002 75774 76901 76975 76418 75807 75123 74115 73074 72532 72339 71809 70881
52637G0881n28M31J025J103J223J409J003r1r70r20k82K57N52P79Q53O22K64N1
$$ 70881 70353 70784 71809 72912 74135 75544 76547 76456 75486 74566 74284 74541 75093 75872 76725 77347 77611 77662
52619G7662n5j95k71j06K21N04P36R81J123J027Q42Q61J093J226R47K63m37n86
$$ 77662 77607 77412 77141 77035 77256 77760 78496 79477 80600 81627 82469 83330 84423 85649 86596 86859 86422 85836
52601H5836J15J281K059J918J109K68k10k19K23Q61J107N85l26q15n60P0O48J134
$$ 85836 85951 87232 89291 91209 92318 92586 92376 92157 92380 93241 94348 94933 94607 93792 93232 93302 93950 95084
52583I5084J569J797J757J749K038K384K341J873J415J294J313J056M06k62m19
$$ 95084 96653 98450 100207 101956 103994 106378 108719 110592 112007 113301 114614 115670 116076 115814 115395
52568A15395J02Q79J366J548J906K575K911K325J291Q78J355J870J764J404J351
$$ 115395 115497 116376 117742 119290 121196 123771 126682 129007 130298 131176 132531 134401 136165 137569 138920
52553A38920J383J021N37N51Q79P57K10J87J023J731J433O75N01P93O03j49m20
$$ 138920 140303 141324 141861 142412 143291 144048 144258 144445 145468 147199 148632 149307 149808 150601 151204 151055 150635
52536A50635K64R28N37m21n97L19J189J023K19j35K77P87P70K83l40r67j434j289
$$ 150635 150899 151827 152364 151943 151346 151665 152854 153877 154096 153961 154238 155025 155795 156078 155738 154771 153337 152048
52518A52048k87J025J707J352L20q49j774k060j480n11j03m60o35K07J509K019
$$ 152048 151761 152786 154493 155845 156165 155316 153542 151482 150002 149491 149388 148928 148293 148500 150009 152028
52502A52028J408N00Pj88l86m83l23q6M9K06M49N67N10O84J314J841J566P26K76
$$ 152028 153436 153936 153943 153755 153369 152886 152563 152477 152526 152732 153181 153748 154258 154942 156256 158097 159663 160389 160665
52483A60665O82J405J773J723J533J194N63j49m78k44K81P17Q39O29K99K07M63
$$ 160665 161347 162752 164525 166248 167781 168975 169538 169389 168911 168667 168948 169665 170504 171133 171432 171639 172102
52466A72102O75M14q3p6P05J609J874J508J071Q21N03o6o31q35n79MP01J288J578
$$ 172102 172777 173191 173108 173032 173737 175346 177220 178728 179799 180620 181123 181057 180426 179591 179012 179016 179717 181005 182583
52447A82583J554J329R45L53l55q81j006q63p70q65r66q18m96m04p94j246j004
$$ 182583 184137 185466 186411 186764 186409 185528 184522 183659 182889 182024 181058 180240 179744 179340 178546 177300 176296
52430A76296N1J026R86O4p74j022j107j511j969j861j082j39M68O66O23M61J77
$$ 176296 176347 177373 178359 178423 177649 176627 175520 174009 172040 170179 169097 168958 169426 170092 170715 171176 171353
52413A71353k49p01r29p87m52k73l97o20o14j96N41J179J226O54R9K24R44J563
$$ 171353 171104 170403 169474 168687 168235 167962 167565 166945 166331 166135 166676 167855 169081 169735 169834 170058 171002 172565
52395A72565J639J314Q66M51L35Q24J759K508K675K399J875J107L83L21R76J482
$$ 172565 174204 175518 176384 176835 177170 177994 179753 182261 184936 187335 189210 190317 190700 191021 191997 193479
52379A93479J122L49J04N07R10J048J289J794K194K270K299K449K371J810J180
$$ 193479 194601 194950 195054 195561 196471 197519 198808 200602 202796 205066 207365 209814 212185 213995 215175
52364B15175J089J498J840J907K078K565K863K405J532J206J686K139J926J696
$$ 215175 216264 217762 219602 221509 223587 226152 229015 231420 232952 234158 235844 237983 239909 241605
52350B41605K440L793M244L072J269K22L28J153K238L152L431L036K522K245J932
$$ 241605 244045 247838 252082 255154 256423 256645 256973 258126 260364 263516 266947 269983 272505 274750 276682
52335B76682J408J099J199J032J12p32l53J009K090K442K707L111K954K017J347
$$ 276682 278090 279189 280388 281420 281532 280800 280447 281456 283546 285988 288695 291806 294760 296777 298124
52320B98124J968L460M440M105K927K072K363L521M393M283L907M461N834O689
$$ 298124 300092 303552 307992 312097 315024 317096 319459 322980 327373 331656 335563 340024 345858 352547
52306C52547O469O322P481R564J1216J1800J1695J1339J0881J0637J1140J2558
$$ 352547 359016 365338 372819 382383 393599 405399 417094 428433 439314 449951 461091 473649
52294D73649J4486J6283J7415J7621J7199J6970J7486J8258J8270J7307J6319
$$ 473649 488135 504418 521833 539454 556653 573623 591109 609367 627637 644944 661263
52283F61263J6345J7362J8447J8748J8123J7033J6106J5729J5725J5422J4259
$$ 661263 677608 694970 713417 732165 750288 767321 783427 799156 814881 830303 844562
52272H44562J2481J1003J0397J0220R608Q356P008N938M863L437J862N87k47p47
$$ 844562 857043 868046 878443 888663 898271 906627 913635 919573 924436 927873 929735 930322 930075 929328
52258I29328r87j149j625k511l264l358l042k956l213l385l271l049k716k054
$$ 929328 928341 927192 925567 923056 919792 916434 913392 910436 907223 903838 900567 897518 894802 892748
52244H92748j186n69k67K82J571L494N638P723R548J0887J1595J1764J1720J1962
$$ 892748 891562 890993 890726 891008 892579 896073 901711 909434 918982 929869 941464 953228 964948 976910
52230I76910J2839J4026J4685J4435J3912J3804J3818J3269J2253J1320J0295
$$ 976910 989749 1003775 1018460 1032895 1046807 1060611 1074429 1087698 1099951 1111271 1121566
52219A121566Q533O285M608L783K991J728M13p28k150l821m831m952n462p371
$$ 1121566 1130099 1136384 1140992 1144775 1147766 1149494 1149907 1149179 1147029 1143208 1138377 1133425 1127963 1120592
52205A120592r824j1348j1926j2515j3157j3025j2136j1601j1931j2239j1499
$$ 1120592 1110768 1099420 1087494 1074979 1061822 1048797 1036661 1025060 1013129 1000890 989391
52194I89391r875q351p556p373p389p361p227o834n821m084k284j440j837k717
$$ 989391 979516 971165 963609 956236 948847 941486 934259 927425 921604 917520 915236 913796 911959 909242
52180I09242l267l382l262k889k366k107k193k052j391r08j347k349k995l074
$$ 909242 905975 902593 899331 896442 894076 891969 889776 887724 886333 885425 884078 881729 878734 875660
52166H75660l049l116l092l075l327l756m097m408m781m891m576m444n010n620
$$ 875660 872611 869495 866403 863328 860001 856245 852148 847740 842959 838068 833492 829048 824038 818418
52152H18418n249m044l058k629k263j991k464l532m127l857l585l882m121l738
$$ 818418 813169 809125 806067 803438 801175 799184 796720 793188 789061 785204 781619 777737 773616 769878
52138G69878l306l537m131m420m485m764n107n040m542l855k954j889j250j550
$$ 769878 766572 763035 758904 754484 749999 745235 740128 735088 730546 726691 723737 721848 720598 719048
52124G19048k448l228l736m220m570m460l995l450k621j214K48P95M06J63P95
$$ 719048 716600 713372 709636 705416 700846 696386 692391 688941 686320 685106 685354 686149 686555 686718 687513
$$ [...]
##END NTUPLES=NMR SPECTRUM
##END=
