
##TITLE=AC1243_NTAAH12033_6945137_80XQF47wmx
##JCAMPDX= 6.0         $$ Bruker NMR JCAMP-DX V2.0
##DATA TYPE= NMR SPECTRUM
##DATA CLASS= NTUPLES
##ORIGIN= BRUKER
##OWNER= Administrator
$$ 1.72 TOPSPIN		Version 2.1
$$ 2012-10-18 13:44:00.083 -0700  Administrator@X
$$ Compression mode = diff/dup
##.OBSERVE FREQUENCY= 400.02188249412
##.OBSERVE NUCLEUS= ^1H
##.ACQUISITION MODE= SIMULTANEOUS (DQD)
##.ACQUISITION SCHEME= undefined
##.AVERAGES= 8
##.DIGITISER RES= 22
##SPECTROMETER/DATA SYSTEM= spect
##.PULSE SEQUENCE= zg30
##.SOLVENT NAME= COFFEE_meoh
##.SHIFT REFERENCE= INTERNAL, COFFEE_meoh, 1, 14.98509
##AUDIT TRAIL= $$ (NUMBER, WHEN, WHO, WHERE, PROCESS, VERSION, WHAT)
$$ ##TITLE= Audit trail, TOPSPIN		Version 2.1
$$ ##JCAMPDX= 5.01
$$ ##ORIGIN= Bruker BioSpin GmbH
$$ ##OWNER= Administrator
$$ $$ C:\Bruker\TOPSPIN/data/COFFEE/nmr/AC1243_NTAAH12033_6945137_80XQF47wmx/10/pdata/1/auditp.txt
$$ ##AUDIT TRAIL=  $$ (NUMBER, WHEN, WHO, WHERE, PROCESS, VERSION, WHAT)
(   1,<2012-10-13 18:40:14.781 -0500>,<Administrator>,<TOPSPIN>,<go>,<TOPSPIN 2.1>,
      <created by zg
	started at 2012-10-13 18:39:07.859 -0500,
	POWCHK enabled, PULCHK disabled,
       configuration hash MD5:
       6B 1B 68 BB D9 2E 58 E2 7F 35 AD 54 07 DF 0E 41
       data hash MD5: 64K
       49 24 76 5B 5C D3 AE 3C CD 6C 8D 40 66 A4 39 DC>)
(   2,<2012-10-13 18:40:17.421 -0500>,<Administrator>,<TOPSPIN>,<proc1d>,<TOPSPIN 2.1>,
      <Start of raw data processing
       efp LB = 0 FT_mod = 6 PKNL = 1 PHC0 = 0 PHC1 = 0 SI = 32K 
       data hash MD5: 32K
       5F 26 04 D1 81 48 90 D7 41 F3 0A A6 62 4C D4 14>)
(   3,<2012-10-13 18:40:17.812 -0500>,<Administrator>,<TOPSPIN>,<proc1d>,<TOPSPIN 2.1>,
      <pk PHC0 = 182.2522 PHC1 = 0 
       data hash MD5: 32K
       D1 57 C3 3E 52 18 B7 AA 6D D0 DD ED 9A EF FE F3>)
(   4,<2012-10-13 18:40:17.921 -0500>,<Administrator>,<TOPSPIN>,<proc1d>,<TOPSPIN 2.1>,
      <abs ABSG = 1 
       data hash MD5: 32K
       AB 3A 82 BD 68 3B 13 53 D6 C6 45 C8 7D 53 A0 14>)
(   5,<2012-10-13 18:40:17.984 -0500>,<Administrator>,<TOPSPIN>,<proc1d>,<TOPSPIN 2.1>,
      <abs ABSG = 2 
       data hash MD5: 32K
       CF 5A 9C E7 AF 69 D7 A8 91 87 A3 13 4F B4 ED 7D>)
(   6,<2012-10-13 18:40:18.000 -0500>,<Administrator>,<TOPSPIN>,<proc1d>,<TOPSPIN 2.1>,
      <abs ABSG = 3 
       data hash MD5: 32K
       C8 59 E2 E4 D2 FD 5D 7F C0 A5 6F BC 58 63 6F 0A>)
(   7,<2012-10-13 18:40:18.031 -0500>,<Administrator>,<TOPSPIN>,<proc1d>,<TOPSPIN 2.1>,
      <abs ABSG = 4 
       data hash MD5: 32K
       4D EC 6A 69 83 71 40 32 96 EB 1D 5C 60 59 5A 49>)
(   8,<2012-10-13 18:40:18.062 -0500>,<Administrator>,<TOPSPIN>,<proc1d>,<TOPSPIN 2.1>,
      <abs ABSG = 5 
       data hash MD5: 32K
       A6 CE E3 79 0B 87 AA 7D 97 9B 7C 73 28 07 6E AF>)
(   9,<2012-10-13 18:40:21.703 -0500>,<Administrator>,<TOPSPIN>,<audit>,<TOPSPIN 2.1>,
      <user comment:
       ICON-NMR User ID: COFFEE
       data hash MD5: 32K
       A6 CE E3 79 0B 87 AA 7D 97 9B 7C 73 28 07 6E AF>)
$$ ##END=
$$ [...]
##$TP= (0..7)
150 150 150 150 150 150 150 150
##$TP07= 0
##$TPNAME0= <>
##$TPNAME1= <>
##$TPNAME2= <>
##$TPNAME3= <>
##$TPNAME4= <>
##$TPNAME5= <>
##$TPNAME6= <>
##$TPNAME7= <>
##$TPOAL= (0..7)
0.5 0.5 0.5 0.5 0.5 0.5 0.5 0.5
##$TPOFFS= (0..7)
0 0 0 0 0 0 0 0
##$TUNHIN= 0
##$TUNHOUT= 0
##$TUNXOUT= 0
##$USERA1= <user>
##$USERA2= <user>
##$USERA3= <user>
##$USERA4= <user>
##$USERA5= <user>
##$V9= 5
##$VALIST= <valist>
##$VCLIST= <CCCCCCCCCCCCCCC>
##$VD= 0
##$VDLIST= <DDDDDDDDDDDDDDD>
##$VPLIST= <PPPPPPPPPPPPPPP>
##$VTLIST= <TTTTTTTTTTTTTTT>
##$WBST= 2048
##$WBSW= 25
##$XGAIN= (0..3)
0 0 0 0
##$XL= 0
##$YL= 0
##$YMAX_a= 496446
##$YMIN_a= -637122
##$ZGOPTNS= <>
##$ZL1= 120
##$ZL2= 120
##$ZL3= 120
##$ZL4= 120
##$ABSF1= 14.98509
##$ABSF2= -5.573092
##$ABSG= 5
##$ABSL= 3
##$ALPHA= 0
##$AQORDER= 0
##$ASSFAC= 0
##$ASSFACI= 0
##$ASSFACX= 0
##$ASSWID= 0
##$AUNMP= <proc_prof1d_extract_pilot.lims>
##$AXLEFT= 0
##$AXNAME= <>
##$AXNUC= <1H>
##$AXRIGHT= 0
##$AXTYPE= 0
##$AXUNIT= <>
##$AZFE= 0.1
##$AZFW= 0.1
##$BCFW= 0
##$BC_mod= 0
##$BYTORDP= 0
##$COROFFS= 0
##$CY= 15
##$DATMOD= 1
##$DC= 0
##$DFILT= <>
##$DTYPP= 0
##$F1P= 0
##$F2P= 0
##$FCOR= 0.5
##$FTSIZE= 32768
##$FT_mod= 6
##$GAMMA= 0
##$GB= 0
##$INTBC= 1
##$INTSCL= 1
##$ISEN= 128
##$LB= 0
##$LEV0= 0
##$LPBIN= 0
##$MAXI= 10000
##$MC2= 0
##$MEAN= 0
##$ME_mod= 0
##$MI= 0
##$NCOEF= 0
##$NC_proc= -8
##$NLEV= 6
##$NOISF1= 0
##$NOISF2= 0
##$NSP= 0
##$NTH_PI= 0
##$NZP= 0
##$OFFSET= 14.98509
##$PC= 1
##$PHC0= 182.2522
##$PHC1= 0
##$PH_mod= 1
##$PKNL= yes
##$PPARMOD= 0
##$PPDIAG= 0
##$PPIPTYP= 0
##$PPMPNUM= 2147483647
##$PPRESOL= 1
##$PSCAL= 4
##$PSIGN= 0
##$PYNMP= <proc.py>
##$REVERSE= no
##$SF= 400.02
##$SI= 32768
##$SIGF1= 0
##$SIGF2= 0
##$SINO= 400
##$SIOLD= 32768
##$SPECTYP= <>
##$SREGLST= <1H.CDCl3>
##$SSB= 0
##$STSI= 32768
##$STSR= 0
##$SW_p= 8223.68421052631
##$SYMM= 0
##$S_DEV= 0
##$TDeff= 65536
##$TDoff= 0
##$TI= <>
##$TILT= no
##$TM1= 0
##$TM2= 0
##$TOPLEV= 0
##$USERP1= <user>
##$USERP2= <user>
##$USERP3= <user>
##$USERP4= <user>
##$USERP5= <user>
##$WDW= 1
##$XDIM= 32768
##$YMAX_p= 450381241
##$YMIN_p= -819159
##$CURPLOT= <Network HP LaserJet P1505>
##$CURPRIN= <$Network HP LaserJet P1505>
##$DFORMAT= <normdp>
##$LAYOUT= <+/1D_H.xwp>
##$LFORMAT= <normlp>
##$PFORMAT= <normpl>
##$SURQMSG= 1
$$ End of Bruker specific parameters
$$ ---------------------------------
##NTUPLES= NMR SPECTRUM
##VAR_NAME=  FREQUENCY,     SPECTRUM/REAL,   SPECTRUM/IMAG
##SYMBOL=    X,             R,               I
##VAR_TYPE=  INDEPENDENT,   DEPENDENT,       DEPENDENT
##VAR_FORM=  AFFN,          ASDF,            ASDF
##VAR_DIM=   32768,         32768,           32768
##UNITS=     HZ,            ARBITRARY UNITS, ARBITRARY UNITS
##FACTOR=    0.250966925370066, 1,           1
##FIRST=     8223.43324360094, 28933,        62889
##LAST=      0,             85476,           -34216
##MIN=       0,             -819159,         0
##MAX=       8223.43324360094, 450381241,    0
$$ Real data points
##PAGE= N=1
##DATA TABLE= (X++(R..R)), XYDATA
$$ [...]
19549B14338a94799A72965m1855b16121A09605c03328f9345j32164j7797i8808
19538a19571A10607a4295A29778C6163D907N7570a71833p6410M6978M6824K7823
19527a26618j5519n24364A49445a77502E3609j6635J64773c03099e1072j05457
19517a56529d7381A62018o2888e2163B44579a51459L5964c5784B10504b1865A13257
19505G6166a08042a4266j05325A34239a79521J9613c8083B64097c35735D5192
19494a42793A68834A0109b672j89640j03552J02832l1360l6082r0371I7098b94760
19482B08907f504B30711K1046B7901K05039b857j11003A32788d02613a12986A37415
19470a19692j25792e1285n009B59992b4709B46113A7979b25583N4994l4714B34081
$$ y = [214338, -194799, 172965, 131110, -216121, 109605, -303328, -69345, -201509, -219306, -98808, -119571, 110607, -14295, 129778, 36163, 4907, 62477, -171833, -248243, -201265, -154441, -126618, -142137, -666501, 149445, -177502, 53609, 36974, 201747, -303099, -51072, -156529, -47381, 162018, 99130, -52163, 244579, -151459, -115495, -35784, 210504, -21865, 113257, 76166, -108042, -14266, -119591, 134239, -179521, -159908, -38083, 264097, -335735, 45192, -142793, 168834, 10109, -2672, -192312, -295864, -193032, -224392, -260474, -350845, 97098, -294760, 208907, -6504, 230711, 251757, 27901, 232940, -2857, -113860, 132788, -402613, -112986, 137415, -119692, -245484, -51285, -56294, 259992, -24709, 246113, 17979, -225583, -170589, -205303, 234081]
19458b65348f4456H222d989G1579E690c61999C3083C379d34957A25413B925b87114
19445b8740k64003e0356a289A40807a18278A1808a8014j15359E4037P6694J05500
19434B36231g0910i507o282A75464a94828Q7822A11364a71466G0466c7755l4045
19423g1800l1217J906A12087J69150j04522a55035F1433A6502c00675B37798A8785
19411a948o3422c0935j05868A82215q6253d3574k6841B3989h8516C1853b15183
19399h9935p044H7160c07904J47768G7343a0311k61053a22223E127L8933k304
19388D1756b26033C7639g9446L9139p6059A80582f2684j73539E0337a39374k2074
19377a61448e0207A03482M203a65784c2028l25824Q5493I2562C8343a51675k29781
$$ y = [-265348, -64456, 8222, -4989, 71579, 5690, -361999, 33083, 3379, -434957, 125413, 2925, -287114, -28740, -292743, -50356, -1289, 140807, -118278, 11808, -18014, -133373, 54037, 130731, 236231, -70910, -9507, -15789, 175464, -194828, -107006, 111364, -171466, 70466, -37755, -71800, -103017, -101111, 112087, 281237, 176715, -155035, 61433, 16502, -300675, 237798, 18785, -1948, -65370, -30935, -136803, 182215, 95962, -43574, -70415, 23989, -88516, 31853, -215183, -89935, -96979, 87160, -307904, -160136, 77343, -10311, -271364, -122223, 5127, 44060, 41756, -226033, 37639, -79446, -40307, -116366, 180582, -62684, -236223, 50337, -139374, -161448, -50207, 103482, 107685, -165784, -32028, -357852, -272359, 92562, 38343, -151675, -381456]
19366c81456a17946N1782B65624b03884A30794a66764A54087a10504J6247p5852
19356a70109j62824J12120p2471F7562L956f13965h3583j8386K0008k8563A52595
19344c01619f4790m5033A26137J66822E0164b04097Q0242C8767c59659C1444i2528
19332B22419b14981B55400A2197g864A32510N361c62147a27664H2164a50074a951
19320a48234r7938G7040a55150a0419r2234F0411L1809h6879A10083K6805q414
19309A28474a93939m2799d6211k2144D4288c7201m0618j88378A57500I365b88353
19297f3855n6279r7037k0758P8547f7347k06621J34217A91374b52157c4782D9675
19285A95426e5459B16668D1853e013A50853a82833l4596a2823j37505O7901A70613
$$ y = [-381456, -117946, -66164, 265624, -203884, 130794, -166764, 154087, -110504, -94257, -170109, -332933, -220813, -293284, 67562, 71518, -613965, -83583, -101969, -81961, -110524, 152595, -301619, -64790, -109823, 126137, 292959, 50164, -204097, -123855, 38767, -359659, 31444, -92528, 222419, -214981, 255400, 12197, -7864, 132510, 137871, -362147, -127664, 82164, -150074, -1951, -148234, -246172, 77040, -155150, -10419, -102653, 60411, 92220, -86879, 110083, 136888, 128474, -193939, -236738, -46211, -68355, 44288, -37201, -77819, -266197, 157500, 9365, -288353, -63855, -120134, -217171, -237929, -159382, -67347, -273968, -139751, 191374, -252157, -34782, 49675, 195426, -55459, 216668, 41853, -5013, 150853, -182833, -217429, -12823, -150328, -82427, 170613]
19273H0754a51859q4655R3858B56412a60714j55942h7375B0348g464l75763i3395
19261a22271c6481E8465a7932j07772k90400B00747a49399c3377l931k77929a27246
19249b03949A12399a9124j33960j13177A05937N8095b36619N4788l8814a08717
19238b81941d0010A4328c69585I2084b40685m0828a5684j29940A8605K36384a21330
19226a48785p8405d1395k16876f1891A82939I1182j4184j5416b4798m12979a30199
19214E4028a9674D2337f3631J1311l7995r4398L6303k39605F972a52169B2292
19202A67772J75757d5178j4489a1166B6050b91557a07705d0522m3733c717H5818
19190d3977I5569a07218n0583B62296L614A08156a72502r0198R9917m1840B63488
$$ y = [80754, -151859, -236514, -142656, 256412, -160714, -316656, -87375, 20348, -7464, -383227, -93395, -122271, -36481, 58465, -17932, -125704, -416104, 200747, -149399, -33377, -37308, -315237, -127246, -203949, 112399, -19124, -153084, -266261, 105937, 164032, -236619, -181831, -220645, -108717, -281941, -40010, 14328, -369585, 92084, -240685, -281513, -15684, -145624, 18605, 254989, -121330, -148785, -227190, -41395, -258271, -61891, 182939, 91182, 76998, 61582, -24798, -437777, -130199, 54028, -19674, 42337, -63631, -52320, -90315, -184713, -148410, -388015, 6972, -152169, 22292, 167772, 343529, -45178, -59667, -11166, 26050, -291557, -107705, -40522, -84255, -3717, 85818, -43977, 95569, -107218, -157801, 262296, 265910, 108156, -172502, -262700, -162783, -204623, 263488]
19178i2003F9729o084J09157c9257C25510B9018b63793E3160a28416B3298g4868
19166a18393o0544b6759l9201A46401o8971d25313A12627g213n5129j35031A71139
19154i7490b0265j76822J6437m8723K8650l3991b3528A73733d9030j71909e1399
19142b95972g1903L4908q493F2297F826a27719E0375a88849E2980J23379n8450
19131A17909d1494G4210K96459l6394a0858j48290j24116a21169A78246e585F3
19119E2804L1126c1255Q477p9386f444H8050b81569P4774i6317d0560J9386j43098
19107a64272O2548k69268J84373h1045l3810K6810q5847D04249f8945l5531A82384
19095A98138d39939i8216k1789A72278A0766b01226j84969D5354b38899C12908
$$ y = [-92003, 69729, 63645, 172802, -39257, 325510, 29018, -263793, 53160, -128416, 23298, -74868, -118393, -178937, -26759, -65960, 146401, 77430, -425313, 112627, -7213, -62342, -197373, 171139, -97490, -20265, -197087, -180650, -229373, -200723, -234714, -23528, 173733, -49030, -220939, -51399, -295972, -71903, -36995, -45488, 62297, 6826, -127719, 50375, -188849, 52980, 176359, 117909, -41494, 74210, 370669, 334275, -10858, -159148, -283264, -121169, 178246, -5585, 63, 52804, 83930, -31255, -22778, -102164, -6444, 88050, -281569, -206795, -96317, -40560, -21174, -164272, -101724, -370992, -186619, -81045, -114855, -88045, -173892, 404249, -68945, -104476, 182384, 198138, -439939, -98216, -120005, 172278, 10766, -201226, -386195, 45354, -238899, 312908]
19084a37282b8966D1341j9663N9706d0880p9627j27025g1000J793j46447I4403
19072a82338E3214J92353a6935o0771q0283C53307I6481J55877F9008b277j02966
19061a05243B9449d8860q3026f3745k02978A208a58469A70410b16484F175R6712
19050A02887J3781J71291f0661K3553m4869k08784R8072h2795c7260j37591B30741
19038a16740H3951a08364j33276R3879B27823d0846j32665M8178D15441E7636
19027a95362B733L32905d45003D4176k0281L20532a92453d0157m9467A78559h6034
19015A52059c41854C58758I3559i1139p9501a3565A43664b90978A03078a27584
19004b3796j01873f0745k81969A57078c827j74246D0198b14916O4228i527k19452
$$ y = [-137282, -28966, 41341, 21678, 81384, -40880, -120507, -247532, -71000, -69207, -215654, 94403, -182338, 53214, 245567, -16935, -77706, -157989, 353307, 96481, 252358, 69008, -2277, -105243, 29449, -48860, -131886, -63745, -266723, 1208, -158469, 170410, -216484, 6175, 102887, 116668, 287959, -60661, -37108, -81977, -290761, -192689, -82795, -37260, -174851, 230741, -116740, 83951, -108364, -241640, -147761, 227823, -40846, -173511, -125333, 415441, 57636, -195362, 2733, 335638, -445003, 44176, 23895, 344427, -192453, -40157, -89624, 178559, -86034, 152059, -341854, 358758, 93559, -91139, -170640, -13565, 143664, -290978, 103078, -127584, -23796, -125669, -60745, -342714, 157078, -3827, -178073, 40198, -214916, -150688, -9527, -228979]
18993b28979I971J49034c30364J18090H6941l8299a47795E7718J16639a92008
18982A4196a85170g3186K4306k32732h03l41576D4620a16905A73133M832h4262
18970A85751f4058k98945B81633f1531o0773r9835b9288j19054E3146j6908L4300
18959G0538f7954D8650a48194P2332j9382l3466k59616J09899b0385j15041A2114
18947c194l43923a17782A70056N4117F669d1741H3250J17884F1485a6038D0366
18935D7241a28969r4777A7009b85349A62386o4430b8970m3844B16989a52074c8069
18923d15120A05217C8906c73208B207f1768d8m0393l78909e0130E0325g3604j78482
18911b52086B56790j20375k372b91121A32217a84853E1522a4005j32795k3002
$$ y = [-228979, 9971, 159005, -330364, -212274, 86941, 48642, -147795, 57718, 174357, -192008, 14196, -185170, -73186, -48880, -281612, -803, -342379, 44620, -116905, 173133, 177965, -84262, 185751, -64058, -363003, 281633, -61531, -122304, -222139, -29288, -148342, 53146, 36238, 70538, -67954, 48650, -148194, -75862, -95244, -128710, -388326, -278427, -20385, -135426, 12114, -3194, -347117, -117782, 170056, 224173, 6669, -41741, 83250, 201134, 61485, -16038, 40366, 47241, -128969, -223746, 17009, -285349, 162386, 97956, -28970, -72814, 216989, -152074, -38069, -415120, 105217, 38906, -373208, 2207, -61768, -48, -40441, -419350, -50130, 50325, -73604, -252086, 256790, 136415, 134043, -291121, 132217, -184853, 51522, -14005, -146800, -169802]
18901a69802p5478a05917A58859d06177n4953C11852G6062R8289D2926e6967L886
18890e3081o9980k39383a13996j5986j3953A01892b54471F5439Q7889b05499g4501
18878H3631d06283C56616n4185F1652O1883j6537a62337o2175R6013k5321G5968
18866e69068b61892l4951a7301B9393d6911A72631a44148B4516b31817J08628
18856a23189I7258b08419F7266b15978I5898J07027a72913A43851a41951A42315
18845a96092A76419F9368a28594f0485q9844f37A26136c45003A7235a60645e2798
18833b9348k06277B04792a60961r9561g949k48160B09308J02856c3193n8742d1426
18821b7248C38175A020M97J65655a30778C59475r4487F2033b57359a05113B5083
$$ y = [-169802, -245280, -105917, 158859, -406177, -461130, 311852, 76062, 174351, 42926, -56967, -53081, -123061, -362444, -113996, -129982, -143935, 101892, -254471, 65439, 153328, -205499, -74501, 83631, -406283, 356616, 302431, 61652, 123535, 106998, -162337, -224512, -128499, -153820, 75968, -569068, -261892, -296843, -17301, 29393, -46911, 172631, -144148, 24516, -231817, -123189, 97258, -208419, 67266, -215978, 95898, 202925, -172913, 143851, -141951, 142315, -196092, 176419, 69368, -128594, -60485, -150329, -637, 126136, -345003, 17235, -160645, -52798, -29348, -235625, 204792, -160961, -260522, -7949, -256109, 209308, 312164, -33193, -91935, -41426, -27248, 338175, 1020, 1517, 167172, -130778, 359475, 264988, 62033, -257359, -105113, 25083]
18809A17476h8823j41263B98835j26072a54103A36126j4287J01654a68400c7904
18798A33958o0673L2136c15845j06384O7321J32846O7921C23452j60016L5083
18788A98519H4821L04242b19949D8058J39001b5685B15682f21150b30203f05l3591
18777c4196l9609A15626J12741H7122b87453a40968L72I4668b5050j70613c4290
18765F3470B845J6533c71437h9287D6021b4524j1367F2214Q8994f9993A27873
18753e48368H4485a478A73266E6697a6123j70160F1373J49804c23263A52381a39798
18741i5917c8121k7512k48092L0029J29668C1398K52897p4159f2097O940b3097
18729b26046d3183n8711L0713A59760b41165A87688a54008H593h113l92633P3026
$$ y = [117476, -88823, -230086, 298835, 172763, -154103, 136126, 121839, 223493, -168400, -37904, 133958, 73285, 105421, -315845, -422229, -354908, -222062, -154141, 323452, 163436, 198519, 84821, 389063, -219949, 48058, 187059, -25685, 215682, -621150, -230203, -605, -34196, -73805, 115626, 228367, 87122, -287453, -140968, -140596, 94668, -25050, -195663, -34290, 63470, 2845, 19378, -371437, -89287, 46021, -24524, -35891, 62214, 151208, -69993, 127873, -548368, 84485, -1478, 173266, 56697, -16123, -186283, 61373, 211177, -323263, 152381, -139798, -95917, -38121, -65633, -313725, -283696, -154028, 31398, 284295, 210136, -62097, -55157, -23097, -226046, -43183, -101894, -71181, 159760, -241165, 187688, -154008, 8593, -8113, -400746, -327720]
18718c27720a21891m194a3356A40072c90019A12400P4141l2723a82888A06074
18707b56526h5476D2969R2209c62568A12672m2663a0105l5111l88024f83m6963
18696d7646B2111N6483c55404Q2877R8055f199A7131b4191j27026k3152L7025
18685a37344j06144d0882A03806c5736r8519d3889A49338a52909P1946L6309r2064
18674a36718E4481i0999k28183d3572j30799e7145J6271A11768c98161J95547
18664b02614J0878E2603h8697E3729J50806b42604A0145b16716d3590k10277H580
18652g7382j52142H1237c12955B17305a91880B6065a03965E7488J1219K75072
18642C43779A08755c6673I8640J71937a43196c0007l00584i1764J5412H075R1399
$$ y = [-327720, -121891, -126085, -13356, 140072, -390019, 112400, 186541, 153818, -182888, 106074, -256526, -85476, 42969, 135178, -362568, 112672, 70009, -10105, -45216, -433240, -683, -47646, 22111, 78594, -355404, -272527, -174472, -6199, 17131, -24191, -151217, -174369, -137344, -243488, -40882, 103806, -35736, -134255, -43889, 149338, -152909, -80963, -44654, -136718, 54481, -90999, -319182, -43572, -174371, -57145, -40874, 111768, -398161, -202614, -191736, 52603, -88697, 53729, 204535, -242604, 10145, -216716, -43590, -253867, 8580, -77382, -229524, 81237, -312955, 217305, -191880, 26065, -103965, 57488, 68707, 343779, 108755, -36673, 98640, 270577, -143196, -30007, -330591, -91764, -76352, 8075, 99474]
18631I9474h9609o5188n0374J4493I7699b8350n4484b0668N886A2741J47454a02836
18618e3008j14372c877j95021C9876a6249j49836C9665J07153p474E1647j2639
18607C9008d78128b37465A86622G8415Q5199G1628J06879a04661A39712F9206
18596A14202c150D11323a2752q4189r4542J4419l13981a51615I5249J57569b1419
18584a56105J7517N8510d0034j80487B7075K1360a18982n1656D159d88604b29211
18572A94695b36595A80990g3113j58723b8296p5606G3258R973Q207R884d32533
18560b26401A81595c32703D4214J62563q0371a6962p4567a9832D25374c400j6794
18549b0194B9530N0108C1661c44969B31872f8257k10318A40797b2170r1454A46258
$$ y = [99474, -89609, -154797, -205171, -190678, 97699, -28350, -82834, -20668, -14782, 12741, 160195, -102836, -53008, -167380, -3877, -198898, 39876, -16249, -166085, 39665, 146818, 139344, 51647, 39008, -478128, -237465, 186622, 78415, 163614, 71628, 178507, -104661, 139712, 69206, 114202, -3150, 411323, -12752, -96941, -191483, -177064, -491045, -151615, 95249, 252818, -21419, -156105, -138588, -80078, -40034, -220521, 27075, 48435, -118982, -170638, 4159, -488604, -229211, 194695, -236595, 180990, -73113, -231836, -28296, -103902, 73258, 83231, 91438, 101322, -432533, -226401, 181595, -332703, 44214, 206777, 126406, -16962, -91529, -19832, 425374, -3400, -20194, 29530, 79638, 31661, -344969, 231872, -68257, -278575, 140797, -22170, -113624, 146258]
18537b76127j03867d9870m9538A42514C5838J53212c90008A70068P8466b4848
18526b2489N619B85669c38931i8462k14039J7690J14561A42447a61633P1067k2127
18515a12693c5278A70824g8633K8149G2611c96447E2439b28356p9501a24228h248
18503a36217r1779b599B6563f5019k92107D6112K30824m6158a89391l8408A0398
18491b00779f6464j6397B50843r7774K00474a29391j23862i8591E1689P1495n6170
18480F7014k2322M6217b95498E3366e4140H4448B4574P3648J30363b70508C1650
18468b87728n7939B32808D0465L0556c33602J40391A48288o161B3326b69078a8976
18456F1214c2634M091A5082c2680A0479a35367N499m3976A22902a0396A50148
$$ y = [-276127, -379994, -49870, -99408, 142514, 35838, 189050, -390008, 170068, 248534, -24848, -22489, -16870, 285669, -338931, -98462, -312501, -294811, -180250, 142447, -161633, -90566, -112693, -35278, 170824, -78633, -50484, 72611, -396447, 52439, -228356, -307857, -124228, -8248, -136217, -227996, -2599, 26563, -65019, -357126, 46112, 276936, 230778, -189391, -227799, 10398, -200779, -66464, -82861, 250843, 153069, 353543, -129391, -253253, -98591, 51689, 123184, 67014, 44692, 90909, -295498, 53366, -54140, 84448, 24574, 98222, 228585, -270508, 31650, -287728, -345667, 232808, 40465, 71021, -333602, -193211, 148288, 142127, 23326, -269078, -18976, 61214, -32634, -28543, 15082, -32680, 10479, -135367, -129868, -173844, 122902, -10396, 150148]
18444a33741B72769e6625n0974d5642j84660F0435a03708j46654G0217c07536
18433b2536r3195j0683b0281l56k96898C56799d27506b2150l07552a64127d0710
18421c0676j04345K0333l04494A78376J15879a10274J1832j96049J587I6241N8802
18410A55043n2226l5122M3809a24840b0765k94333A40255l3893a74117b1073j2372
18399c3445C22543a82693h7152C01340j38004d1858k89583C25848A5648a85051
18388i6906A62709n2697a36191B74496b02627R5141L3665F5173a38714B75981
18377b10444B58071A21933f4258j73710a14085A41631j1143i9453A68681C13a4735
18365A73355P3759H6638h345k895H3121N8466o7517c1213j66362N7957J770A0887
$$ y = [-133741, 272769, -56625, -107599, -45642, -230302, 60435, -103708, -250362, 70217, -307536, -22536, -115731, -126414, -20281, -20637, -317535, 356799, -427506, -22150, -329702, -164127, -40710, -30676, -135021, -114688, -419182, 178376, 294255, -110274, -98442, -294491, -292904, 96241, 155043, 102817, 67695, 111504, -124840, -20765, -315098, 140255, 106362, -174117, -21073, -33445, 322543, -182693, -87152, 301340, 163336, -41858, -331441, 325848, 15648, -185051, -96906, 162709, 110012, -136191, 274496, -202627, -107486, -73821, 65173, -138714, 275981, -210444, 258071, 121933, -64258, -237968, -114085, 141631, 130488, -99453, 168681, 313, -14735, 173355, 247114, 86638, -8345, -11240, 83121, 141587, 74070, -31213, -197575, -139618, -137848, 10887]
18352h3338C7434n810f8640k06807j15058G4545L7527a5576l11660J09073A03536
18340F4028c29318O4082f6452A41934O4995K8423L374a10125G893a46956h734
18328A52182B0929j408b35848B14534b48677E683b06282h2327j14683i1809j2214
18317a04023B52611G8249b03007A33112l856i3000m2647J9609b2125e264k19437
18306b24701A09243a32064B75721e1935A90272a67422c7051i065k70728A4372
18295e4403j96445g1586k29561a5041G0436c0732J033H8419Q9113a39760A86088
18283d06376g5691l60603D373K232J61239o2704P9000F8205k4221R6009c7540
18271B29843I6572b90972a13046d9357k5322j32511i4973a7939A71730h7044n9785
$$ y = [-83338, 37434, 31624, -68640, -275447, -390505, 74545, 112072, -15576, -327236, -218163, 103536, 64028, -329318, -265236, -66452, 141934, 206929, 235352, 238726, -110125, 7893, -146956, -8734, 152182, 20929, 19521, -235848, 214534, -248677, 5683, -206282, -82327, -197010, -91809, -104023, 252611, 78249, -203007, 133112, 129256, -93000, -135647, -116038, -22125, -5264, -224701, 109243, -132064, 275721, -51935, 190272, -167422, -37051, -9065, -279793, 14372, -54403, -250848, -71586, -301147, -15041, 70436, -30732, -29699, 88419, 177532, -139760, 186088, -406376, -75691, -436294, 4373, 6605, 167844, 105140, 184140, 68205, 43984, 139993, -37540, 229843, 96572, -290972, -113046, -49357, -74679, -207190, -94973, -17939, 171730, -87044, -146829]
18260a46829m0012A88784b61171O8216B10285c04004Q1866o0559g2250r4018O1291
18249a04977K4841J6214H1412a76675l12018A8407b3415j47198C4315P2458d841
18237A7558i4985A32437C8136o733a69269H9243D3662f5438j60419B15760a85149
18225B2089N3559C0646b81608J04346k4241j92669J09137g505A10344l0940L3246
18214A12650B1262F189J3617L0126b5032B19448b16688B0504a33058B98808M4762
18203C43570a34544B42105g668C32756A40465K34443f8338D690b5724j19877O866
18192a38735j65966I0547c6519D3822J02378F8403b80060A66743a37914G033g6482
18180a2015B29528C6422a20106j46345D5267a62997J4416o0060a0910j94664n225
$$ y = [-146829, -186841, 188784, -261171, -192955, 210285, -304004, -222138, -282697, -72250, -166268, -104977, -80136, -63922, 81412, -176675, -488693, 18407, -23415, -170613, 34315, 106773, -4841, 17558, -94985, 132437, 38136, 31403, -169269, 89243, 43662, -65438, -225857, 215760, -185149, 22089, 75648, 30646, -281608, -177262, -201503, -394172, -285035, -7505, 110344, 79404, 112650, 21262, 6189, 19806, 49932, -25032, 219448, -216688, 20504, -133058, 298808, 343570, -134544, 242105, -7668, 332756, 140465, 374908, -68338, 4690, -25724, -145601, -138735, -304701, 90547, -36519, 43822, 146200, 68403, -280060, 166743, -137914, 7033, -76482, -12015, 229528, 36422, -120106, -266451, 45267, -162997, -148581, -208641, -10910, -205574, -210799]
18169b10799c0893j7979A52004h9966c4134p2021j16192b8234A18961C0210j0559
18158A9651K32003G7232K86725a77360E0325a04531e2051e657C0766a95379O8814
18147a26565m5641P2402b8363q1622K6639k67127a4793m14759a59875F4416b47003
18135f6049r3954j38930e2938J0094E4240Q714b40205A7765P3661b9429B69328
18123b70005I4571J06523c48951J55819A36189b72332A66769h8830D0685Q3468
18113A24153b977k36533i9634L6391C6112c19724B32482a72182A02104a10636
18102e764j35007A35687M4171a55798r385g3858B447a20341r7565f3002D2049
18090e4864j24975I7271O7467A9110b256B07334c07029p4951B17401j04069m576
$$ y = [-210799, -30893, -48872, 152004, -89966, -34134, -106155, -222347, -28234, 118961, 30210, 19651, 251654, 77232, 363957, -177360, 50325, -104531, -52051, -5657, 30766, -195379, -126565, -172206, -99804, -28363, -109985, -83346, -350473, -14793, -429552, -159875, 64416, -247003, -66049, -160003, -298933, -52938, -42844, 54240, 62954, -240205, 17765, 91426, -29429, 269328, -270005, 94571, 201094, -348951, -193132, 136189, -272332, 166769, -88830, 40685, 124153, -2977, -239510, -99634, -63243, 36112, -319724, 232482, -172182, 102104, -110636, -5764, -140771, 135687, 179858, -155798, -165183, -73858, 2447, -120341, -217906, -63002, 42049, -54864, -179839, 97271, 164738, 19110, -2256, 207334, -307029, -381980, 217401, 113332, 108756]
18079A08756c0153n3088b7932n9504m5500E3750c3424m1504B27887d4527k48263
18068b92790A34497a59317A39307A9907L54041b69875L7298N5558E2480i3746
18057B08439C2929c22283a49008H8150b16709c4175j11111j08064J19074A95565
18046A72353c4306A38800h9935a8578j92664q603B4453M24429I5066L8629a80107
18034a51394A08610c783j26780B52654b24846i6974j62101k0725p4046I9928a18286
18022D3244b89759A46092l1713H960i7359J3106L7531G5742R4331g96j85316O8635
18010a17477B18940o5883g8122A28210b38137J10288B4420a85562h0904A95779
17999A56439C0446G341h0072C96542a29168J7627H3032M8066D3053b67888f7666
$$ y = [108756, -30153, -83241, -27932, -87436, -132936, 53750, -33424, -74928, 227887, -44527, -292790, 134497, -159317, 139307, 19907, 373948, -269875, -232577, -177019, 52480, -93746, 208439, 32929, -322283, -149008, 88150, -216709, -34175, -145286, -253350, -134276, 195565, 172353, -34306, 138800, -89935, -18578, -211242, -219845, 24453, 448882, 95066, 133695, -180107, -151394, 108610, -3783, -130563, 252654, -224846, -96974, -259075, -279800, -353846, 99928, -118286, 43244, -289759, 146092, 114379, 8960, -97359, -84253, -46722, 75742, 170073, -796, -186112, -117477, 218940, 153057, -78122, 128210, -238137, -127849, 24420, -185562, -80904, 195779, 156439, 30446, 7341, -80072, 396542, -129168, -111541, 83032, 131098, 43053, -267888, -67666]
17987A21331L0785g395G2452g10A36999b82172K9602B93809l218c10270a52018
17975b73265E4644l518P1423e3666k43749H3534h6298k86156a47034A8052P9344
17964I7396c00523D6737d0699A87818C0539b37760g1633K9582A37950E4167c8464
17952A5123K32838d0598k12998P5007A96027d17685G9687b45206f3080m7714J7624
17941i3170k11043h0799I2987J0783a22370l3629k308A21630a58179G3907B6793
17929b33877N9448D801a35044a7295l6910D5306c5323A4363M4696L0447a35650
17917c21368l5845A38735a81203j3851H4287P4531j6770a24379j46105A20544
17906E3988a25927J2999j8644A94091A6526a66845D1859a86805a9318o2062R256
$$ y = [121331, 152116, -7395, 72452, -710, 136999, -282172, -252570, 293809, 290591, -310270, -152018, -273265, 54644, 51126, 122549, -53666, -297415, 83534, -86298, -372454, -147034, 18052, 97396, -300523, 46737, -40699, 187818, 30539, -237760, -71633, -42051, 137950, 54167, -38464, 15123, 247961, -40598, -253596, -178589, 196027, -417685, 79687, -245206, -63080, -110794, -93170, -304213, -80799, 92987, 103770, -122370, -155999, -158307, 121630, -158179, 73907, 26793, -233877, -174429, 4801, -135044, -17295, -54205, 45306, -35323, 14363, 59059, 89506, -135650, -321368, -357213, 138735, -181203, -195054, 84287, 158818, 142048, -124379, -270484, 120544, 53988, -125927, -112928, -131572, 194091, 16526, -166845, 41859, -186805, -19318, -81380, -72124]
17895g2124l279J4752j01019k6059g0800j92428A43483f7617C9461J78134P3521
17884B91116d1551j58273a1421o5908j27943i2287q2553Q3683E6569b9023q533
17873c7556j58480a4941e074B4159d5146J0743j19695C5576R3941F3509e9332
17861D963b26545B1982a39876E0959J81285b79629f2158j12851h2203F5359O8240
17850A33599A838a2297B27737c97391B52604f3163m0690k05287I6528L5712a24252
17838c8957E4499G47Q8835a59201B16653A7639a20623L7835A19811R1634a31560
17826C698Q2474A0897a38150A13992P9934c7827F762g0880r5613j09946f2931
17814A26618c35191r866J17544A13775A9933L1903b1248Q479C033J61790n755
$$ y = [-72124, -75403, -60651, -161670, -187729, -70800, -263228, 143483, -67617, 39461, 217595, 291116, -41551, -199824, -11421, -77329, -205272, -92287, -174840, -91157, 56569, -29023, -37556, -196036, -14941, -5074, 24159, -45146, -34403, -154098, 35576, 129517, 63509, -59332, 4963, -226545, 21982, -139876, 50959, 232244, -279629, -62158, -175009, -82203, 65359, 133599, 1838, -12297, 227737, -397391, 252604, -63163, -103853, -309140, 96528, 132240, -124252, -38957, 54499, 747, 89582, -159201, 216653, 17639, -120623, -82788, 119811, 211445, -131560, 3698, 86172, 10897, -138150, 113992, 193926, -37827, 6762, -70880, -166493, -276439, -62931, 126618, -335191, -345057, -227513, 113775, 19933, 51836, -21248, -12769, 3033, 164823, 159068]
17803A59068J31081e1897j05080j24726J9203J2413N9123B2657L18304a543l4275
17792c5818A64948a578j00119b783n24j80508C2566h545k67908A03037e0920G7119
17779d6635j31394Q2604n6155B4822K51646d5104A62529a88740b6595k72514a30822
17767f5708j55587B07263Q280b3142l1777m3460I1178K13032A31578L9455C9032
17755C6955b53459A42804n279B4665Q2111n0444i3401c8071j35538H442L4704
17744D3146R1727B4037I663J98428C5706a41405A41696h4825k76373a72492E6040
17732a9722j6961C35747b95970A58976k1430a5442B996K53701a59547N9232A86622
17720a28945H1611l4480I652d945A34682a47282D9882K425k4395K52982C0173
$$ y = [159068, 290149, -51897, -156977, -281703, -262500, -250087, -190964, 22657, 340961, -1543, -35818, 164948, -1578, -101697, -2783, -3307, -183815, 32566, -8545, -276453, 103037, -50920, 77119, -46635, -178029, -95425, -151580, 24822, 276468, -45104, 162529, -188740, -26595, -299109, -130822, -65708, -221295, 207263, 215543, -23142, -54919, -98379, 91178, 304210, 131578, 171033, 39032, 36955, -253459, 142804, 137525, 24665, 106776, 56332, -93401, -38071, -173609, 8442, 43146, 134873, 24037, 9663, 208091, 35706, -141405, 141696, -84825, -361198, -172492, 56040, -19722, -36683, 335747, -295970, 158976, 137546, -15442, 2996, 256697, -159547, -100315, 186622, -128945, 81611, 47131, 9652, -4945, 134682, -147282, 49882, 52307, 27912, 280894, 30173]
17708C51773i4001l3126C47939h1506C43712o2216a6563j37467C75936b04440
17697b7248k07024O0645g8314C1895a3283k55385A83498B9360i8894E2579A3981
17685b44155A89299a29981A77896d8480G2657d8393J6418I3283b74786b1921k94688
17674c16609J42908B0616G097J36880a67973j35023A70811G8097b09527R2943
17664a16584C6683a12915k6339j8593a9239A15410K15177c57687R1441n0191i791
17652a34357j44351C27950A57087e7589k69183A17109l7074J00013k6884i0672
17641A80988i7256A10538k298d55280a9102M973D13067b74939M2400B94879C9120
17629D4567a46985F7671d2429N233C99957O0238A51209J91749A64012b65772A71520
$$ y = [351773, -94001, -127127, 347939, -81506, 343712, 281496, -16563, -154030, 375936, -204440, -27248, -234272, -173627, -78314, 31895, -13283, -268668, 183498, 29360, -98894, 52579, 13981, -244155, 189299, -129981, 177896, -48480, 72657, -48393, -31975, 93283, -274786, -21921, -316609, -173701, 20616, 7097, 143977, -167973, -302996, 170811, 78097, -209527, -116584, 36683, -112915, -139254, -157847, -19239, 115410, 330587, -357687, -266246, -316437, -9791, -134357, -278708, 327950, 157087, -57589, -326772, 117109, 80035, 180048, 153164, -90672, 180988, -97256, 110538, 108240, -455280, -19102, -14129, 413067, -274939, -232539, 294879, 39120, 44567, -146985, 67671, -42429, -37196, 399957, 460195, 151209, 342958, 164012, -265772, 171520]
17617C0051K56678H6584d40858A81610M3117N5271i1964p4945D5421M5308R1152
17606A81881N600a02620f991j87738A32160A6172J66347A5659b73461A06565n1809
17595E4756J4274B1499a75847a5090r0425E1168d4691j46645j7166B41523J18785
17584C60308A19188E227a55002j48284H2620A4132R429d843j10406o4972A26574
17572B49071F3746a82131r8033J11624j42608A64859a30980A30820R845a93568
17561B69134A20888L490a31448B11731F8938K58950b2818A18513l4970o040a08393
17549B88148F3829J82524j13003J1847b8478j27022I9285R8122F4931e8927A43621
17537E3282K31766A21797a4757B40729C6992Q9863O2917b25176d8543A76072A7378
$$ y = [30051, 286729, 86584, -440858, 181610, 224727, 279998, -91964, -166909, 45421, 90729, 181881, 187481, -102620, -6991, -194729, 132160, 16172, 182519, 15659, -273461, 106565, 54756, 69030, 21499, -175847, -15090, -105515, 51168, -44691, -191336, -208502, 241523, 360308, 119188, 5227, -155002, -303286, 82620, 14132, 23561, -4843, -115249, -180221, 126574, 249071, 63746, -182131, -280164, -168540, -311148, 164859, -130980, 130820, 140665, -193568, 269134, 120888, 124378, -131448, 211731, 68938, 327888, -22818, 118513, 83543, 77503, -108393, 288148, 63829, 246353, 133350, 145197, -28478, -155500, 99285, 197407, 64931, -58927, 143621, 53282, 285048, 121797, -14757, 240729, 36992, 126855, 189772, -225176, -48543, 176072, 17378]
17525A33483J1892f773A58099C5279c84603A2333N0546K1784a72099a9784q5946
17514a05730J4529R143D55444B17001i4870A31630i8118B49446o8206n6749P3130
17503A97621F538J28805e4795B74663a02285B07313m1930l3694a7190k9547B6095
17491I160a42665H4147a33079A21616N2314a24453E78K5812J03748Q1655M0048
17480B51841j9676j03005E9451R4577E9775A7833J0923c01495E11698j52045l0915
17469C28738j31176a47440B04378J90685L1221A83628i3268B0031Q8506K4355
17459A32892b30760A53125C2214K14570g2794L0258q2296B05166n3194J07882
17449B59854f4461B20055m638H7553J59139a88034F58464G1346b0898A95407Q1572
$$ y = [133483, 145375, -6773, 158099, 35279, -384603, 12333, 62879, 84663, -172099, -19784, -105730, -91201, -82058, 455444, 217001, -94870, 131630, -98118, 249446, 181240, 124491, 197621, 6538, 135343, -54795, 274663, -102285, 207313, 165383, 131689, -17190, -46737, 26095, 9160, -142665, 84147, -133079, 121616, 173930, -124453, 578, 26390, 130138, 211793, 251841, 232165, 129160, 59451, 154028, 59775, 17833, 28756, -301495, 511698, 359653, 328738, 197562, -147440, 204378, 395063, 426284, 183628, -93268, 20031, 108537, 132892, -230760, 153125, 32214, 246784, -72794, -42536, -124832, 205166, 151972, 259854, -64461, 220055, 215417, 87553, 246692, -188034, 658464, 71346, -20898, 195407, 276979]
17438B76979F9914h6755E8218M08643F7060J64633p7582J71668j14279P9606j06261
17427A84845K61979A15439J19348A08719M35458j24536k05612q5477j0283L28448
17417D46717j55120c469I732K89538K8947A142K30964I4395J87794o5844n9477
17406A56868J74379g0839A33979K65595K4976E1618d7796B57821L0652k7950n050
17395B55473j8978a4039C21715j44700m8522K42234G3697J8898i5939B48768K5992
17384B74760E2061J91345J19207e5584C2251L27002a33611B26106P4092e3084
17373c7804C01170o4038j08962b1585l8753D67625D2906g4629j64602A00882L28319
17362D29201a97323B2054f0978n3494k31055B74630a23035A72572l1603N8376
$$ y = [276979, 69914, -86755, 58218, 466861, 67060, 231693, 154111, 325779, 211500, 291106, 184845, 446824, 115439, 234787, 108719, 544177, 419641, 214029, 128552, 118269, 446717, 291597, -3469, 9732, 299270, 328217, 1142, 232106, 94395, 282189, 216345, 156868, 331247, -70839, 133979, 399574, 424550, 51618, -47796, 257821, 288473, 260523, 255473, 236495, -14039, 321715, 177015, 128493, 370727, 73697, 92595, -95939, 248768, 274760, 52061, 243406, 362613, -55584, 32251, 359253, -133611, 226106, 300198, -53084, -37804, 301170, 237132, 128170, -21585, -60338, 467625, 42906, -74629, -239231, 100882, 429201, -197323, 22054, -60978, -114472, -345527, 274630, -123035, 172572, 140969, 199345]
17352A99345c6972j12148I9621J13431H0394K00416m3232p0471a12930I5143A6971
17340A81607N2784n4741B3501J18561J76135b37745Q0901p7957B10627J97914
17330D08541j99602q6224R1869M3695N1107A30983j8269J24829J57993A35463
17319C05669B5006m007L26689A13803P1788b63994B64252l6843j942G9858J89777
17308B69635c1745A95342g998C47495G2101C2907J62662k9213J38041j1229O8559
17297C61727A01664L21077j09347f5445B77916G5819O5489J0267R0439f7966E3964
17285B58862C5277c8109A06294a53514H9679J30177J01320j17013K55843A28208
17274B56048A20714J43949p5721N5704M1303J7886a72627O7946m8620A99875o2922
$$ y = [199345, -36972, -149120, 99621, 213052, 80394, 280810, 237578, 167107, -112930, 95143, 16971, 181607, 234391, 179650, 23501, 142062, 318197, -237745, -156844, -234801, 210627, 408541, 208939, 122715, 214584, 258279, 309386, 130983, 112714, 237543, 395536, 135463, 305669, 25006, 20999, 347688, 113803, 185591, -263994, 264252, 227409, 225467, 79858, 269635, -31745, 195342, -7998, 347495, 72101, 32907, 195569, 166356, 304397, 293168, 361727, 101664, 422741, 313394, -65445, 277916, 75819, 141308, 151575, 242014, -67966, 53964, 258862, 35277, -38109, 106294, -153514, 89679, 219856, 321176, 204163, 460006, 128208, 256048, 120714, 264663, 188942, 244646, 285949, 303835, -172627, -104681, -153301, 199875, 136953]
17263A36953k2893m5487g6262A99738p8961L11110j97128r7673P0600b9799O282
17252b3517D1189J7260J64228b12468D16104l2290O4113K0965B05313F8808M65104
17241E33912I3168r361h4913I2958J62911e8300I6496J84660J6999J6978l0150
17230B84983g6640B42518J06483h231B39093O7904C9946L10738j25874J32926
17220C57736I723K07735n300n4622J42916j3961L7106R1083j84093m833k0629
17209B05125K29078o5890A66171j9672M8R1372A5585L30162a15953D9183L85167
17198D34350j37799K57109n5719A54114J69845A16085g7747B77185r1580q1340
17188A04265N1076b2536D79798A71686D7772K19049j21704M13613k64495J19116
$$ y = [136953, 114060, 68573, -76262, 199738, 120777, 431887, 234759, 137086, 207686, -29799, -23517, 41189, 58449, 222677, -212468, 416104, 383814, 447927, 468892, 205313, 68808, 533912, 93168, 83807, -84913, 92958, 255869, -58300, 96496, 281156, 298155, 315133, 284983, -76640, 242518, 349001, -8231, 239093, 306997, 39946, 350684, 224810, 357736, 9723, 217458, 212158, 157536, 300452, 286491, 323597, 414680, 230587, 225754, 205125, 434203, 368313, 166171, 146499, 146547, 237919, 15585, 345747, -115953, 49183, 434350, 296551, 553660, 497941, 154114, 323959, 116085, -77747, 277185, 185605, 104265, 155341, -22536, 479798, 171686, 47772, 266821, 145117, 558730, 294235, 413351]
17178D13351j29076b1548C57538j29075j11251n8250R2797Q668j9980K84168k06380
17167B18235m5692o5694L85278j47144m4759j28540J57049j0428o1241J09714
17157C66778j31021m994M9068l5144F2500L97701j18761m8107J70300k04491K87719
17146E46861J2733C5457K62026n8333M03140k62421p041l4171a51609B06538k0433
17135A86105E2271L68291j55930K34057A55769a53912C93390J25306k55187D8971
17124A68466J84965A45045F0209J33492N2517K50196H7307J85203L7714E1571
17113F99906B12172J25551m9186L0609H465N95081A58158L26815B21352A02280
17102E77897j46216j49597A30688L04261J99588C16733j31072J2783K42416k11030
$$ y = [413351, 284275, -21548, 357538, 228463, 117212, 58962, 151759, 160427, 140447, 424615, 218235, 172543, 106849, 492127, 344983, 300224, 171684, 328733, 318305, 257064, 366778, 235757, 230763, 279831, 244687, 62500, 460201, 341440, 293333, 463633, 259142, 546861, 559594, 35457, 297483, 239150, 642290, 379869, 372828, 338657, -151609, 206538, 186105, 52271, 420562, 264632, 498689, 155769, -153912, 393390, 518696, 263509, 48971, 168466, 353431, 145045, 60209, 193701, 246218, 496414, 87307, 272510, 310224, 51571, 699906, 212172, 337723, 288537, 319146, 8465, 603546, 158158, 484973, 221352, 102280, 577897, 431681, 282084, 130688, 434949, 634537, 316733, 185661, 198444, 440860, 229830]
17092B29830L460M97898l39830J13507J72997B18185J42602L08614B08104K88753
17082D96857L1580j0262K1045r7072o9484k4980N8473k9661o7016J11334J41329
17071E62143j49711J95250B92572M01547A71327K1119L54061K7724o3068E6984
17060B81102R8308J73711m2059P354k47766J99272J76202K48816k98655I2284
17049F10617j08182J21484l04643j29398L05912k37998J68409N6521A59297J80697
17039C39994J69533k18991J71067O3278J38273r1229m4829Q8704k46107J53571
17029E23264K62042j35669n2750N0487k5292q9224k5905r9219L19480j93645A68080
17017H41553k91537K85586l65479K24785j77768q0423L07655j60957r1774l8885
$$ y = [229830, 233290, 731188, 391358, 504865, 677862, 218185, 360787, 669401, 208104, 496857, 528437, 518175, 539220, 442148, 372664, 347684, 406157, 376496, 309480, 420814, 562143, 412432, 607682, 292572, 694119, 171327, 192446, 546507, 574231, 511163, 56984, 281102, 379410, 553121, 511062, 518416, 270650, 469922, 646124, 894940, 596285, 92284, 610617, 502435, 623919, 319276, 189878, 495790, 257792, 426201, 482722, 159297, 339994, 509527, 290536, 461603, 524881, 663154, 571925, 527096, 615800, 369693, 523264, 785306, 649637, 596887, 647374, 622082, 532858, 506953, 407734, 727214, 533569, 168080, 841553, 550016, 835602, 470123, 694908, 517140, 436717, 744372, 583415, 491641, 452756]
17007D52756n7822K22456Q9417P4599J08784K7478k75831j04964j78075M69970
16997H28768r0225k54723Q2737J41695J48028j93296O7471J45309j6610K54826
16987A113980l74283L9781J08820n1258K70709m84372p9281K88493l84718K1710
16977D69581M22850l90336N85445m29009k3838J66036j09365k5007K54657N2198
16967I73212q0677r5642P1332J76726J93064k96738R2135k1643k3879O9402l99057
16956F58235L01684J0145L9418k17105L12016J9564k21619J79155K1688j87058
16946I16123L10676j08370k57708L29660k31682J66057Q8719O6876K41901k23012
16936A299240j27300J6688j69744L13201M02186o09284L37584j86655J23406r9861
$$ y = [452756, 394934, 617390, 706807, 781406, 890190, 917668, 641837, 536873, 358798, 828768, 738543, 483820, 566557, 708252, 856280, 662984, 730455, 875764, 859154, 1113980, 739697, 779478, 888298, 837040, 1107749, 623377, 544096, 832589, 447871, 469581, 892431, 502095, 1087540, 658531, 634693, 800729, 691364, 666357, 921014, 973212, 892535, 796893, 868225, 1044951, 1238015, 941277, 1033412, 1011769, 987890, 1057292, 658235, 959919, 970064, 1009482, 792377, 1104393, 1123957, 902338, 1081493, 1103181, 916123, 1226799, 1118429, 860721, 1190381, 958699, 1124756, 1213475, 1280351, 1522252, 1299240, 1171940, 1188628, 1018884, 1332085, 1734271, 1124987, 1462571, 1275916, 1399322, 1299461]
16926A299461j41989o8664N40099j31797j78216Q5944k7214q4051N9525j57761
16916A195337L49287l75562M71967P2191l60851J22278K45780J76059m20399N2421
16906A528508k3086J14863m8533N6621M328k5345N71952n81077L6821J62843j36400
16895A661495j6122K53893j38204j42940Q4401J9495N95471m49443j02344M90995
16885B256697J65953l44842l25803O13526j99897p4340R4512k5877J92216j78776
16875B173369K56055j25085N2112J15356k92679N54759k1834l39779L56983r9094
16865B630163l21985L84529N6536K06230l52783K6427N22760j66740m564j10096
16855B870477J57837m23121P38540l28074O7922J0286L88444m42841N80800k82096
$$ y = [1299461, 1157472, 1088808, 1628907, 1497110, 1318894, 1404838, 1377624, 1293573, 1353098, 1195337, 1544624, 1169062, 1641029, 1713220, 1352369, 1474647, 1720427, 1896486, 1476087, 1528508, 1505422, 1620285, 1571752, 1628373, 1632701, 1607356, 2179308, 1598231, 1635052, 1797895, 1661495, 1645373, 1899266, 1761062, 1618122, 1702523, 1722018, 2317489, 1868046, 1765702, 2256697, 2422650, 2077808, 1752005, 2365531, 2165634, 2091294, 2185806, 2159929, 2352145, 2173369, 2429424, 2304339, 2356451, 2471807, 2179128, 2733887, 2712053, 2372274, 2729257, 2630163, 2308178, 2692707, 2749243, 2955473, 2602690, 2629117, 3151877, 2985137, 2980573, 2870477, 3028314, 2605193, 3343733, 3015659, 3083581, 3093867, 3482311, 3039470, 3620270, 3338174]
16845C338174J43075R5015n4514L61803m49574L53367p2893J58385J18579O9118
16835D060535n9770J70473m5613N9281J46081N5456R6127J28523j71663J38560
16825D577990K06118J96471Q7307P1172k04995L00227M04932K84641N3990L0211
16815F008064k24139O51401l55631K75341K1789K66667M3895j38495N25664j5464
16805G059092L14306L07096j86340n2542O51563L0107J70010J59282J03126K27084
16795H782784L44194J26743L46527k8277N94772K49404M10814L0111L57901M03774
16785A1618747L58616L53171J29993N45795K05513L52337K83844P70653M08036
16776A5026705M86036M33337M72211Q10859O96431M59205M34637O97787O65002
$$ y = [3338174, 3481249, 3576264, 3521750, 3883553, 3433979, 3787346, 3714453, 3872838, 3991417, 4060535, 4000765, 4171238, 4125625, 4184906, 4330987, 4386443, 4482570, 4611093, 4439430, 4577990, 4784108, 4980579, 5067886, 5139058, 4934063, 5234290, 5639222, 5923863, 5977853, 6008064, 5783925, 6435326, 6079695, 6355036, 6376825, 6643492, 6687387, 6548892, 7074556, 7059092, 7373398, 7680494, 7494154, 7441612, 8093175, 8123282, 8293292, 8452574, 8555700, 8782784, 9126978, 9253721, 9600248, 9571971, 10166743, 10416147, 10826961, 10857072, 11214973, 11618747, 11977363, 12330534, 12460527, 13006322, 13211835, 13564172, 13848016, 14618669, 15026705, 15512741, 15946078, 16418289, 17229148, 17925579, 18384784, 18819421, 19517208, 20182210]
16767B0182210P27575O26716R51381J280308M75194R19560J010785R43027J171596
16758B8288352J101632J218650J481828J508605J266731J922920J573444J457511
16750C9819673J767820J699095K849801K109407K285983K279542L023228K877521
16742E8712070L097576L217315L399476L648740L959657M557041M314256M595103
16734H9501234M507833N486367M883466N770514N520247O171364N973522N682317
16726A33496864N943996O195689N640441N665941M965900M612577L742993K946458
16718A73210859K305389J402202J49652n96686j835996k776560l575894m432306
16710A63850660m723130n438313n790150n515189o382409o036460n931767o052133
$$ y = [20182210, 20909785, 21536501, 22487882, 23768190, 24243384, 25162944, 26173729, 27116756, 28288352, 29389984, 30608634, 32090462, 33599067, 34865798, 36788718, 38362162, 39819673, 41587493, 43286588, 46136389, 48245796, 50531779, 52811321, 55834549, 58712070, 61809646, 65026961, 68426437, 72075177, 76034834, 80591875, 84906131, 89501234, 94009067, 99495434, 104378900, 110149414, 115669661, 121841025, 127814547, 133496864, 139440860, 145636549, 151276990, 156942931, 161908831, 166521408, 170264401, 173210859, 175516248, 176918450, 177068102, 176471416, 174635420, 171858860, 168282966, 163850660, 159127530, 153689217, 147899067, 142383878, 136001469, 129965009, 124033242, 117981109]
16702A17981109n592855n931904n001987n446321m372253m655694m479037m382770
16694G8118288l869410l938543l219883l092681l340181k919801k843352k622931
16686E2271506j930061k621302k341913k073088j797812j852422j872883j718124
16678C6063901j518398j397706j369374j445700r48333j233432j291523q82380
16670B5977055j246514q40827q02191q71057j061623l34880j052812q56213o59648
16661A8251290n40070l05377m35673r04976k78197o93231l87845q41885L11916
16652A4175952r31908l02264m97959l84308l04670m66364p5164j86538m45325
16643A0581452k18729n48562k27999q9826l88094l36280J51881o42830j1509m28805
$$ y = [117981109, 112388254, 106456350, 101454363, 96008042, 91635789, 86980095, 82501058, 78118288, 74248878, 70310335, 67090452, 63997771, 60657590, 57737789, 54894437, 52271506, 50341445, 47720143, 45378230, 43305142, 41507330, 39654908, 37782025, 36063901, 34545503, 33147797, 31778423, 30332723, 29384390, 28150958, 26859435, 25977055, 24730541, 23889714, 23087523, 22216466, 21154843, 20819963, 19767151, 18910938, 18251290, 17711220, 17405843, 16970170, 16065194, 15786997, 15093766, 14705921, 13864036, 14175952, 13244044, 12941780, 12443821, 12059513, 11754843, 11288479, 11213315, 11026777, 10581452, 10362723, 9814161, 9586162, 9496336, 9108242, 8771962, 8923843, 8281013, 8269504, 7840699]
16633G840699k44961J43604l04047m58061J63087p08501R5201R9396j13762k00151
16623F312504j95873l19275K18613m8202l31551l329k03855j81336m5670j66557
16613E035469N5217j35808k77354m6091p2379J13515k41123K60331m52104J17353
16603D357026j93470P2413o11653L62989l29322j35068L88364j71468l06673K24199
16593C657337p0422o4298j05378k26188L5094k24083o2748j5349J02679k01975
16583B824669R4182n8078j61367o1027J34306j97373K00755l57445L3871J15027
16573B567520k09553J95312m1710L2764r5569k72024M93877j36673l35381K16060
16563B414623k15942M8783k8883R2129j59480j04929J83876O3440j05122j40833
$$ y = [7840699, 7595738, 7739342, 7435295, 6977234, 7140321, 6431820, 6527021, 6626417, 6512655, 6312504, 6116631, 5797356, 6015969, 5967767, 5636216, 5632887, 5429032, 5247696, 5202026, 5035469, 5090686, 4954878, 4677524, 4631433, 4559054, 4672569, 4431446, 4691777, 4239673, 4357026, 4163556, 4235969, 3624316, 3987305, 3657983, 3522915, 3911279, 3739811, 3433138, 3657337, 3586915, 3522617, 3417239, 3191051, 3226145, 3002062, 2939314, 2923965, 3026644, 2824669, 2918851, 2860773, 2699406, 2638379, 2772685, 2575312, 2776067, 2418622, 2452493, 2567520, 2357967, 2553279, 2511569, 2544333, 2448764, 2176740, 2670617, 2533944, 2198563, 2414623, 2198681, 2247464, 2218581, 2310710, 2151230, 2046301, 2230177, 2293617, 2188495, 2047662]
16553B047662j56136j28043k6826J3194j90697J05708Q8957l3597q1702J81939
16543A820459k67859M03K76250o66539N75905n0343l87011J79607P7376l64639
16533A193609K16576J52926l3196k94699N3118K16150P3365j50583j68238J97438
16523A456466k66307K35765k1830n075O474N4844n62075L3959N08755k26119j16881
16512A097976m9297P3874k9820j4104j75081L88463l19276N70165k95265p1341
16502A176294n1502n4883j32855j10634K07127j24946J22837j0987j05391L41452
16492A256512D95673J34956J31875O0720K51914l85716J32110M51682D97868M42923
16482I40791q0254l21950N48669o7935l71952K97539O4831l49172J06830K29784
$$ y = [2047662, 1891526, 1763483, 1736657, 1749851, 1559154, 1664862, 1753819, 1720222, 1638520, 1820459, 1552600, 1553003, 1829253, 1162714, 1738619, 1688276, 1301265, 1480872, 1558248, 1193609, 1410185, 1563111, 1529915, 1235216, 1288334, 1504484, 1577849, 1427266, 1259028, 1456466, 1190159, 1425924, 1404094, 1399019, 1405493, 1460337, 898262, 932221, 1440976, 1214857, 1097976, 1048679, 1122553, 1092733, 1078629, 903548, 1292011, 972735, 1542900, 1247635, 1176294, 1124792, 1069909, 937054, 826420, 1033547, 908601, 1031438, 1020451, 915060, 1256512, 495673, 630629, 762504, 823224, 1075138, 689422, 821532, 1273214, 497868, 940791, 860537, 538587, 1087256, 1019321, 647369, 944908, 1009739, 660567, 767397, 997181]
16472I97181j89094O1968k11855L8521P5233N1377l7255J10747Q4121j78059J31681
16461I34566p7833m9475j47765j18959N6127N87520n27522j39149R7997j77917
16451D37590O6889K87285j26281o7703R622j37917K21174B59490N23310j82994
16441E99806k00487J59897j55585L69609j65567R3645P4670R632Q9659j19337
16431G55942l51105R8424J10477j16416n8814K83190j33023J91884k63478A19103
16420G69708k71146j73443K61298j3932J53153k0297k41526B00809K93543J68148
16410F62500l8594k70219q8817J26636J09850A43479N23980k98718O1271n3992
16400C76020A28567K57376K18401q5390L8392B10173K79186B26537M29691A95076
$$ y = [997181, 808087, 870055, 658200, 696721, 771954, 823331, 786076, 896823, 980944, 802885, 934566, 856733, 807258, 659493, 540534, 596661, 1184181, 656659, 517510, 615507, 437590, 504479, 791764, 665483, 597780, 607402, 469485, 690659, 259490, 782800, 599806, 399319, 559216, 403631, 773240, 607673, 701318, 775988, 785620, 875279, 755942, 404837, 503261, 613738, 497322, 438508, 721698, 588675, 780559, 517081, 119103, 769708, 498562, 325119, 586417, 572485, 725638, 705341, 463815, 200809, 494352, 662500, 623906, 353687, 264870, 391506, 501356, 143479, 667459, 368741, 430012, 376020, 128567, 385943, 604344, 518954, 557346, 210173, 489359, 226537, 656228, 195076]
16389C29030K21990j59211j12062J83491j68553J9058M29137k67732q8174J34752
16379E21726L02372l96984M2232j66964A35228L39959I6576K45163M1150p0060
16369C12829o2502J8711K48072B46538K3140p3964j7563N4837n9751n7746M36112
16358E51603B63865P3230j61779L68755j48362j10504A14809M61699B84887D8310
16347D53762O8495j77584j21385J80245I4143J62772J45751O9255A37236M20612
16337E57848j62809B9791K46531e0732H8240K85030l1645j11070L70946A47361
16326C09606L5196j49819K02775I5106L28511F8990J47842B4856J81367P0955
16316B77178P6099A26126L4778Q7354O4187A1232J09571J74072A03879L28979
$$ y = [329030, 551020, 391809, 279747, 463238, 294685, 313743, 742880, 475148, 386974, 521726, 824098, 427114, 469346, 302382, 135228, 475187, 96576, 341739, 382889, 312829, 250327, 269038, 517110, 246538, 269678, 195714, 178151, 232988, 173237, 115491, 551603, 263865, 337095, 175316, 544071, 395709, 285205, 114809, 576508, 284887, 48310, 453762, 522257, 344673, 223288, 403533, 94143, 256915, 402666, 471921, 137236, 557848, 395039, 29791, 276322, -50732, 88240, 373270, 341625, 230555, 601501, 147361, 309606, 344802, 194983, 397758, 95106, 423617, 68990, 216832, 24856, 206223, 277178, 353277, 126126, 160904, 248258, 312445, 11232, 120803, 294875, 103879, 432858]
16306D32858j06955l7296j28126l8901L645n0434C5466K25567F6730K90927A58271
16294B17295J03258c2255n1195C46392N4320j94804O4700J94598d3596B86914
16283B40351i8497K4473C59223J20668A27136J37102N7168B3340K80571j50049
16273A53862P2443q3290L39519H48a67343A04919K619K4861J32358p3779G7098
16261D56623D8312a37109A28822B6846J02162n3299K4642a3471C86967A3608K18854
16250B32462j04791L59056D4311a43596e1931B7691b08234b0305A03269M01620
16240E04889C4814L61773h0672A82172F1275M9092J74451G1647a44743j36332
16230b81075B72909A07564R8193F2727a743l85538B08474n4352E0365K18775D6924
$$ y = [432858, 325903, 288607, 160481, 121580, 125225, 74791, 35466, 261033, 66730, 357657, 158271, 217295, 320553, -32255, -83450, 346392, 400712, 205908, 270608, 465206, -43596, 286914, 240351, -98497, -74024, 359223, 479891, 127136, 264238, 321406, 23340, 303911, 153862, 226305, 143015, 482534, 848, -167343, 104919, 107538, 132399, 264757, 190978, 77098, 456623, 48312, -137109, 128822, 26846, 129008, 75709, 100351, -13471, 386967, 13608, 232462, 127671, 486727, 44311, -143596, -51931, 27691, -208234, -20305, 103269, 504889, 34814, 396587, -80672, 182172, 61275, 110367, 284818, 71647, -144743, -281075, 272909, 107564, 205757, 62727, -1743, -387281, 208474, 154122, 50365, 269140, 46924]
16218C3385J32206Q9002a0653k3443r9828C14580q6915l2932b16670B97486q9141
16207B08345F9193b25524F416K13830H2107b86819B76780q0243j4326b04327C30694
16195d924m1983C29080A48764c6830C54614a37064B18117j8096B9337J72367d44319
16183I36J56161f446A75898k0570e1986a1366j45968I8109M0936n192J8432b29945
16170a60294F2729C0788L40178A00200J7060J69734E903a7432A00677g990H566
16158A99178H179N7502L4366h0686I3458d1396A68340Q6198H4646i8723B17411
16146B24506n1990a01050C0864K14982l6980a18758R80B05901B7904J2124J7115
16135E7143K91394e8244C89242f5038k3437A784J16029g0391I4630a18080A79422
$$ y = [33385, 165591, 254593, -10653, -34096, -133924, 314580, 227665, 194733, -216670, 297486, 208345, 69193, -225524, 6416, 220246, 82107, -286819, 276780, 196537, 182211, -204327, 330694, -4924, -46907, 329080, 148764, -36830, 354614, -137064, 218117, 200021, 29337, 201704, -444319, 936, 157097, -6446, 175898, 155328, -51986, -11366, -157334, 98109, 139045, 133853, 152285, -229945, -160294, 62729, 30788, 370966, 100200, 117260, 286994, 5903, -17432, 100677, -7990, 8566, 199178, 8179, 65681, 100047, -80686, 93458, -41396, 168340, 254538, 84646, -98723, 217411, 224506, 172516, -101050, 30864, 245846, 208866, -118758, -117778, 205901, 27904, 40028, 57143, 348537, -58244, 389242, -65038, -88475, 1784, 117813, -70391, 94630, -118080, 179422]
16123b55216C07652A42363j0656j8068b76712a29593a4625m9301L1944A25126
16112I0356a23510c711B23544H1154J27631a0216A88191a55029A5092J96235b4958
16100G5008d2897p0834A11052j4394a71206e6807B16496f7059k38977J13231c4903
16088C25144f7261C6102h134I0261J11030a15538m9760M9698A71274C9167a5281
16076a48094k31279a23815C46227b53744I8958b6422A385K09673g5152A51356
16065A44966L4845a53220I3737f0157A03293d0170B4617J18160h8219j99801B42404
16053c5096j10728j33750F8715C707a00555f855A83718H1011d1323c638j55788
16042a59426f4832k4753A60526n0485b84218g0990r3115a8874n1867p5410J6752
$$ y = [-255216, 307652, 142363, 131707, 113639, -276712, -129593, -14625, -63926, -31982, 125126, 90356, -123510, -3711, 223544, 81154, 208785, -10216, 188191, -155029, 15092, 211327, -24958, 75008, -42897, -113731, 111052, 96658, -171206, -56807, 216496, -67059, -306036, -192805, -34903, 325144, -67261, 36102, -8134, 90261, 201291, -115538, -165298, -115600, 171274, 39167, -15281, -148094, -379373, -123815, 346227, -253744, 98958, -26422, 1385, 211058, -75152, 151356, 144966, 179811, -153220, 93737, -60157, 103293, -40170, 24617, 142777, -88219, -288020, 242404, -35096, -145824, -279574, 68715, 3707, -100555, -6855, 183718, 81011, -41323, -3638, -159426, -64832, -89585, 160526, 110041, -284218, -70990, -164105, -18874, -70741, -146151, -129399]
16031a29399l6013A36891c03043B3790b61469c4637I6213m7137g3042j9382A03063
16019c7677B27440a46204A57255c2246B77862F8842h8237j4642a676C36768c8035
16007H7271c38869b3805k39956A98063l2769d8668n1624k34537c633p2487E4262
15995I4357L6923J36588A19575m5277c1792C62726a02107C210a23614M4184n085
15984h4515B90871C7538E370L91310E7014b9252A16426a68995C26470G2705a49243
15972c44399A71507D0120r733a38279G9269b8774m4540C3925b3800j96984l595
15961b24379A58092e9140o9422D273J27736R8105b62243A66574B1724a37093l3516
15950a70609j15746C92769A02869a48395n7970J03045r6050B2068Q0158b34957
$$ y = [-129399, -165412, 136891, -303043, 23790, -261469, -34637, 96213, 49076, -73042, -92424, 103063, -37677, 227440, -146204, 157255, -32246, 277862, 68842, -88237, -102879, -1676, 336768, -38035, 87271, -338869, -23805, -263761, 198063, 165294, -48668, -100292, -334829, -3633, -76120, 54262, 94357, 131280, 267868, 119575, 74298, -31792, 362726, -102107, 3210, -123614, -79430, -84515, 290871, 37538, 5370, 396680, 57014, -29252, 116426, -168995, 326470, 72705, -149243, -344399, 171507, 40120, 30387, -138279, 79269, -28774, -73314, 33925, -23800, -220784, -224379, 158092, -59140, -128562, 4273, 132009, 230114, -262243, 166574, 21724, -137093, -170609, -286355, 392769, 102869, -148395, -206365, -103320, -199370, 22068, 102226, -234957]
15939C1407e7384q1514D7021e4915A83055h7367A96004e0038A25356A7483i9829
15927B1810r195b76280A81493a18698l4748B1568f9601A32033o98J77392J38849
15916D47576h070H5581a94496P8132A48224b39928L8082l7846C85758I4325c59357
15904d8428A12989h7390B2765P2277a36445C47798C2393b723j52204k28472e6413
15892a13260j8670A13319d23132F1798a56088F730M727K36882C1798k987c36052
15880a82611b8341A46650a00722J5976B78132E6269b29076A51123o8982b40694
15869g4075k99830A02469c0988A3422b4241A74399c3051I3352c26139j0502E3332
15857A13529K09141A31214b35641C63337b9418I4119a56631O23r5379I9508b16120
$$ y = [31407, -57384, -138898, 47021, -54915, 183055, -87367, 196004, -50038, 125356, 17483, -99829, 21810, 12615, -276280, 181493, -118698, -153446, 21568, -69601, 132033, 131335, 308727, 447576, -8070, 85581, -194496, -116364, 148224, -239928, -201846, -239692, 385758, 94325, -359357, -48428, 112989, -87390, 22765, 95042, -136445, 347798, 32393, -2723, -154927, -383399, -56413, -113260, -131930, 113319, -423132, 61798, -156088, 6730, 11457, 248339, 31798, 28811, -336052, -182611, -28341, 146650, -100722, -84746, 278132, 56269, -229076, 151123, 82141, -240694, -74075, -373905, 102469, -30988, 13422, -24241, 174399, -33051, 93352, -326139, -336641, 53332, 113529, 322670, 131214, -235641, 363337, -29418, 94119, -156631, -156008, -251387, 99508, -216120]
15845a66479e3681J34B46294H6533q003j9643a64105A8227a01466H460a06464
15833B31812G2395c39987J33880B36278c4701m4056q692q3473m0075B81405K03393
15822D84798a50940N7841d3013k52198a20184r0775Q2172p6404R309A09003a80430
15810g2730k38137E1843J87251I8638a44417j56452h0239B61724f405p0101J1391
15799f5115D8151J17861b48167e7480k66531A5407K31036a46378P1805A18798
15788c6958j30536N6356A46111L6173N9748b37930i461A03927j2793i8465m855
15777a03320A01864B4851a61759A41878a61673A81386b72194C29228j58090G2985
15766a32859I0383B3058a0882I3078c24759b9199G543K03212j9025D7660e3657
$$ y = [-166479, -53681, -53547, 246294, 86533, 78530, 58887, -164105, 18227, -101466, 8460, -106464, 231812, 72395, -339987, -206107, 236278, -34701, -78757, -87449, -170922, -210997, 281405, 484798, -150940, -93099, -43013, -295211, -120184, -210959, -128787, -205191, -195882, 109003, -180430, -72730, -310867, 51843, 239094, 98638, -144417, -300869, -80239, 261724, -6405, -76506, -65115, 48151, 166012, -248167, -57480, -324011, 15407, 246443, -146378, -74573, 118798, -36958, -167494, -111138, 146111, 182284, 242032, -237930, -9461, 103927, 91134, -98465, -103320, 101864, 24851, -161759, 141878, -161673, 181386, -272194, 329228, 171138, 72985, -132859, 90383, 23058, -10882, 93078, -324759, -29199, 7543, 210755, 191730, 47660, -53657]
15754c21917J43217D78835a60925j3184B79725l8147A03740a42622d3089I623
15743E9184J85399a88020P0044j883A41928C9589m708L32527C0609a45487j29831
15732b75318C4966M39641d069j2861A03391e71907e4792o6580A85447a72324j17821
15721b90145b807A20664n3311Q3598A9633g7884C6110O3935N3090a22040A80531
15709A16903l3875e6718j8222B00687n9955a09158D2947b55316a4997D6761K6981
15698G3742a62584n6370J04914F6254M6050A7972b41922B27661G0922b1964l9760
15687f1724q3713I1492e0665J1210l43441i0579C08451b81829G3245J81943a62593
15675A21197f4847M943a7679k40439e2846A45519C5013b73430L1998H1308L22331
$$ y = [-321917, -178700, 478835, -160925, -174109, 279725, 241578, 103740, -142622, -43089, 9623, 59184, 244583, -188020, -117976, -119859, 141928, 39589, 34881, 367408, 30609, -145487, -275318, 34966, 474607, -4069, -16930, 103391, -571907, -54792, -121372, 185447, -172324, -290145, -2807, 120664, 67353, 150951, 19633, -77884, 36110, 100045, 153135, -122040, 180531, 116903, 83028, -56718, -74940, 200687, 140732, -109158, 42947, -255316, -14997, 46761, 73742, -162584, -218954, -114040, 66254, 112304, 17972, -241922, 227661, 70922, -21964, -61724, -145437, 91492, -50665, -39455, -382896, -90579, 308451, -281829, 73245, 255188, -162593, 121197, -64847, -59904, -17679, -258118, -52846, 145519, 35013, -273430, -241432, 81308, 403639]
15664D03639e6111p0255a6859n5947A54282D4158h1982k31388A31707a48300j61420
15653c09720b9787A82320c09064g4773K5378n9237A24451R0207q181H8095a64992
15641a08743I419e849B85863g1525k26251D211J04977c77794D9643b1284k16458
15630b37742i5545B6173K9759R000a40671A61420a48058o5830Q9306A11064m6814
15619F4250a92746F2818a17690M1147C2250A3271c12095i9736a8008D2650N2955
15608I5605C0788J49716a40423e6452m4624q6883E18O7103c7558C7078M7997b60569
15595A04079l1070J71574j01666b74885I349a18762m8835O7504B94454b57842
15584d4642C20818i2457D1276b21484f4853E27737A22294h2147G7353l3267j9439
$$ y = [403639, -56111, -126366, -16859, -72806, 154282, 44158, -81982, -313370, 131707, -148300, -309720, -29787, 182320, -309064, -74773, -49395, -108632, 124451, 214658, 206477, 88095, -164992, -108743, 9419, -5849, 285863, -71525, -297776, 4211, 109188, -377794, 49643, -21284, -237742, -95545, 26173, 55932, 64932, -140671, 161420, -148058, -213888, -124582, 111064, 64250, -192746, 62818, -117690, -76543, 32250, 13271, -312095, -99736, -18008, 42650, 95605, 30788, 180504, -140423, -56452, -101076, -187959, 518, 67621, -37558, 37078, 85075, -260569, 104079, 73009, 244583, 142917, -274885, 9349, -118762, -167597, -100093, 294454, -257842, -44642, 320818, -92457, 41276, -221484, -64853, 527737, 122294, -82147, 77353, 44086, 24647]
15573B4647a91474A56981a68952B3147J49021B2245b07055j29650B54213a01919
15562I5272J18550o0237f0575B2548f7491B18620a11230A14046C5595J40296a07743
15550B39426b15810E9872b15163A43754A7172b77705H8397d1214B21688e3651
15539a33350C2288M1448a48437O4729j27072j16635g9198A58335D2429N8923a25391
15527b17131f7779A53741c1946n6236C50649a2523E807b40718A0385g3146k3843
15516i6989A22466a2165A03232J22233b082j43702k1223d2462k14872D51467k12525
15505B38942a89054B89335j23919c09620e4137j22299A44996i432m60828B06062
15494B26877M1220A29660K09554N6686A20708g5149L1626k70663J40882j59748
$$ y = [24647, -191474, 156981, -168952, 23147, 172168, 22245, -207055, -336705, 254213, -101919, 95272, 213822, 153585, -60575, 22548, -67491, 218620, -111230, 114046, 35595, 175891, -107743, 239426, -215810, 59872, -215163, 143754, 17172, -277705, 88397, -41214, 221688, -53651, -133350, 32288, 73736, -148437, -83708, -210780, -327415, -79198, 158335, 42429, 101352, -125391, -217131, -67779, 153741, -31946, -88182, 350649, -12523, 5807, -240718, 10385, -73146, -96989, 122466, -12165, 103232, 225465, -2082, -145784, -167007, -42462, -257334, 451467, 238942, -189054, 289335, 165416, -309620, -54137, -176436, 144996, -9432, -470260, 206062, 226877, 268097, 129660, 339214, 395900, 120708, -75149, -43523, -314186, -173304, -333052]
15484c33052A95544b04956a3764A86544a35655j71457e0789A50277G2745J95810
15474B68555b53330A17198L0321A3879a13862F8404a05981j10461o3513F8932
15463A27711f0152n2186k6733C12925a79115j33371F4313J71245G8341b31230
15452E5243f2802C0540J1729A492b23591N3027B64731j30850B9136a11749D1571
15440B77252A6182a57219f4841j5861C0366b5568F4364b2272D21360I4004a30401
15428a62863A56272a21130C6634h5614o1219k96559G033i186k01518j2234g8208
15416d8150E4062P2357a4913I3584b65578J12631A42974n1983J7938i3751B99657
15404a20894A38542i4140k8041j00274h1592a9412k01951d6843b3136k89279a50621
$$ y = [-333052, 195544, -204956, -13764, 186544, -135655, -307112, -50789, 150277, 72745, 268555, -253330, 117198, 147519, 13879, -113862, 68404, -105981, -216442, -279955, 68932, 127711, -60152, -112338, -139071, 312925, -179115, -312486, 64313, 235558, 78341, -231230, 55243, -62802, 30540, 42269, 1492, -223591, -170564, 264731, 133881, 29136, -111749, 41571, 277252, 16182, -157219, -64841, -80702, 30366, -25568, 64364, -22272, 421360, 94004, -130401, -162863, 156272, -121130, 36634, -85614, -146833, -443392, 7033, -9186, -210704, -222938, -78208, -48150, 54062, 126419, -14913, 93584, -265578, -152947, 142974, 90991, 108929, -93751, 299657, -120894, 138542, -94140, -122181, -222455, -81592, -19412, -221363, -46843, -23136, -312415, -150621]
15392B58018G5090A6571i3716C80214d68682A46679d04981A76173H0616a21588
15381A31059g6159N129j23909f7558E742f7597k82194D8187K58899a24493A2204
15369A88420a79352d4567K0339A80415b56562i5488m1300A66286b34024j53414
15359c87438i9500B96309b30165N1433L7141B1369K79524b32502e7196k50707
15349c07903e7691g70B52375c35462F8163O3380C5470O5415b47567J12678A04750
15337B9790b22797d780H2386R4230a02873L4752j49986c4165G1731a77797A34624
15325D864K96242q915D7090j0806a68984C12935G5317a71647P0551j11460H5898
15313A68386c14469A63436K83833A38963a24288a6932l1423F5600J3742J01283
$$ y = [258018, 75090, 16571, -93716, 380214, -468682, 146679, -404981, 176173, 80616, -121588, 131059, -76159, -71030, -194939, -67558, 5742, -67597, -349791, 48187, 307086, -124493, 12204, 188420, -179352, -44567, -24228, 180415, -256562, -95488, -136788, 166286, -234024, -387438, -99500, 296309, -230165, -178732, -141591, 21369, 300893, -232502, -57196, -307903, -57691, -770, 252375, -335462, 68163, 131543, 35470, 100885, -247567, -134889, 104750, 29790, -222797, -4780, 82386, 176616, -102873, -68121, -218107, -34165, 71731, -177797, 134624, 4864, 301106, 292191, 47090, 36284, -168984, 312935, 75317, -171647, -101096, -212556, 85898, 168386, -314469, 163436, 447269, 138963, -124288, -16932, -48355, 65600, 79342, 180625]
15303A80625a3398l74341B01005e1375K543k8701E1778K54486a7961l3027B68962
15291C525O9046Q6509A2504R726h7941B08333b42240a13957A05649J75029F3821
15279b11459C21525b29522h535B61792K2381c9227a642m6845j76707P7067C03313
15267A22886n4d0813A77040f8404A58507C7056J73596B9921R6085M988c08882
15255a89270A25216J16480j3988R5006l1702J91342M61227k3774O7198J03608
15245A090613E12972B38444r4077b8530E45732A3219c19844A05651j0539K01325
15235B96437b80464d3229I1899C3398f8681B57936b89621B0625Q633K39208m8701
15224B19765a22358E5258a20899C35706j21892m5528D5011J76835D3524N1660
$$ y = [180625, -13398, -387739, 201005, -51375, -48832, -77533, 51778, 306264, -17961, -50988, 268962, 3525, 72571, 159080, 12504, 22230, -87941, 208333, -242240, -113957, 105649, 280678, 63821, -211459, 321525, -229522, -8535, 261792, 284173, -39227, -1642, -48487, -225194, -148127, 303313, 122886, 122832, -40813, 177040, -68404, 158507, 37056, 210652, 29921, 126006, 130994, -308882, -189270, 125216, 241696, 227708, 322714, 291012, 482354, 943581, 919807, 987005, 1090613, 512972, 238444, 144367, -28530, 545732, 13219, -319844, 105651, 95112, 296437, -280464, -43229, 91899, 33398, -68681, 257936, -289621, 20625, 29258, 268466, 219765, -122358, 55258, -120899, 335706, 213814, 168286, 45011, 221846, 43524, 95184]
15214I5184c8886A28217a65806A6379J13205h7953b5143D4337b8799B01451R4317
15203B95768H1388J90865a15304A62078d3479J4820A8423a19989A3545a81117
15192D3176b66454D8252a96242B66460p2372c22135a10991j3G4361b3764B16547
15180a5541a035j57844j3851G2201J12212f4624Q711J3385o0140A88950p2004
15169A16946m6277P416J7373r904b21191i6091A10249d5229A7605J05142K6954
15158A49701n1968D2576a11879Q825G0435l4755L13006c9150a1594j1900k07459
15147b30953G7660L01873I9095K62914A00165J48900a82465A30310a40543B96601
15136A15292K00971a07467O090A79411g7985B24787C2451h5883A66029i0684H7416
$$ y = [95184, -38886, 128217, -165806, 16379, 129584, -87953, -25143, 44337, -28799, 201451, 295768, 81388, 272253, -115304, 162078, -43479, -28659, 18423, -119989, 13545, -181117, 43176, -266454, 48252, -196242, 266460, 194088, -322135, -110991, -111004, 74361, -23764, 216547, -15541, -1035, -158879, -172730, 72201, 184413, -64624, -55913, -42528, -102668, 188950, 116946, 70669, 78085, 95458, 85554, -221191, -96091, 110249, -45229, 17605, 122747, 149701, 97733, 42576, -111879, -103054, 70435, 35680, 348686, -39150, -11594, -23494, -230953, 77660, 379533, 99095, 362009, 100165, 249065, -182465, 130310, -140543, 296601, 115292, 316263, -107467, -101377, 179411, -77985, 224787, 32451, -85883, 166029, -90684, 87416]
15124B97635J04068B3577a10842j44713B80019O2007I5623a0669C29344j39434
15114A89910h6254j12633A5449L49618i6341A33033l3746J69926k3827I7677e8420
15102A25978J28107g5974J548B23981h9434A8888J42163J44977F8484N047P6321
15091A49852p4912J69015i8064L8889C24368j24641a26814c0939C7060k271i7734
15079B11120b0375n9518B71242b6069p7947A42656a7003E8925J47209b45006F0990
15067B22365K466b7644j14153A62022m4817J3017L7962L5620G6207L22171j10983
15056B87395h0534D7678c4473B38865O2621l592E1817J78714J48103A00941J9887
15045A20828k0758Q0699K00469q0029p0351L20973A78737L28468g4769A63235
$$ y = [297635, 401703, 23577, -110842, -255555, 280019, 342026, 95623, -10669, 329344, 189910, -86254, -198887, 15449, 365067, -96341, 133033, 99287, 269213, 245386, 97677, -58420, 125978, 254085, -75974, -74426, 223981, -89434, 18888, 161051, 306028, 68484, 73531, 149852, 74940, 243955, -98064, -59175, 324368, 199727, -126814, -30939, 37060, 34789, -97734, 211120, -20375, -79893, 271242, -26069, -104016, 142656, -17003, 58925, 206134, -245006, 60990, 222365, 224831, -27644, -141797, 162022, 117205, 130222, 168184, 203804, 76207, 398378, 287395, -80534, 47678, -34473, 238865, 301486, 297894, 51817, 230531, 378634, 100941, 120828, 100070, 180769, 381238, 301209, 230858, 551831, 178737, 507205, -74769, 163235]
15034a04638B47483a119B21851j6277F9477K69422m1473E3544P9402c7479G4869
15022e8670D30263j70496j19940A8278Q8737B538J57440Q7646r0582k6174a15447
15010A05642a43794a1230F6046j2401L14038F6097K21103J82325f3363B65821
14999C41116A64277N4054B2858b5389j05228E4396K2633O7059l9974L65762A27121
14987G9609K43761m2014N9537j58860C8635h3395D80227B18977r7574O1778K98645
14976D81826j97424L6171j4455m2893a61146A50194G2762L43612k06402L13798
14966E23770q9369G2824J62795J48625G1442R7515K39837a2710A95144D9885N8951
14955A08836J18585f1458E1664J60400K59968j70216j45419l382J30393O4388
$$ y = [-104638, 247483, -1119, 221851, 205574, 69477, 338899, 297426, 53544, 132946, -37479, 74869, -58670, 430263, 259767, 139827, 18278, 107015, 2538, 159978, 247624, 157042, 130868, -115447, 105642, -143794, -11230, 66046, 53645, 367683, 66097, 287200, 469525, -63363, 265821, 341116, 164277, 218331, 22858, -25389, -130617, 54396, 77029, 144088, 104114, 469876, 127121, 79609, 323370, 281356, 340893, 182033, 38635, -83395, 480227, 218977, 121403, 183181, 481826, 284402, 320573, 306118, 263225, -161146, 150194, 72762, 416374, 209972, 523770, 434401, 72824, 235619, 384244, 71442, 168957, 408794, -12710, 195144, 49885, 108836, 227421, -61458, 51664, 212064, 472032, 301816, 156397, 153015, 283408, 347796]
14945C47796j39595k0633O2667J27110A03117J9930J83314O0341p6786J90795
14935D80711F1534K30638j37491J87401R1529N4567j26993A72587D7540J53929
14925B01469K82263j34623n1722A35356J23790n6558R2286J41100l2399A86930
14914D19346M8269B26888q6909L8346L34187A96911K76658A59463K73679A25900
14903A21797N9629M96958A87210l2685Q9070J10971q524P8465M861j23092r4448
14892B11828G9573J84161j0533N4631K023J8239R2210j27164J61019b24045E41050
14880B74259p8765J54452J02800K0404j61119J22026j71927K09955j54380A35276
14869G196L39486J17931A07965J6195J73246M7758K0339R6884j7613k2036A25611
$$ y = [347796, 208201, 187568, 250235, 377345, 103117, 123047, 306361, 366702, 289916, 480711, 61534, 292172, 154681, 342082, 433611, 488178, 361185, 172587, 47540, 201469, 483732, 349109, 297387, 135356, 259146, 202588, 294874, 435974, 403575, 186930, 419346, 467615, 226888, 139979, 178325, 512512, 196911, 473569, 159463, 433142, 125900, 121797, 181426, 678384, 187210, 154525, 243595, 354566, 346042, 424507, 429368, 306276, 211828, 79573, 263734, 253201, 307832, 309855, 328094, 420304, 293140, 454159, -224045, 541050, 274259, 195494, 349946, 452746, 473150, 312031, 434057, 262130, 472085, 317705, 135276, 7196, 346682, 464613, 107965, 124160, 297406, 345164, 365503, 462387, 444774, 422738, 125611]
14857C94964A27436J81782J68631k7654q1392A61147P7109N55755B85028o7457
14847B17571K76332N3307j87595n3848J56136j93204K121p0735N6780m6468J33969
14836C44366P0857M72878l96751K39185L3975B35434J90365D5564O7411M29010
14826E41985r373N8107B82172L36653B78864L83749C26750L04527B03787K45833
14816D49620M2855B03475L56002k34821J92908J7134j5851J27913B46425L87551
14806F33976j65588J73207k23026Q7928k03509K73936j61772r56L24096k96013
14796D42279M06180k49599O1443j9194k83946R6291j54421J95828P6464j30063
14786D41262j65437M64345j92334j3223k20255K56064N1573J22202j94759j18047
$$ y = [394964, 127436, 309218, 477849, 450195, 368803, 161147, 238256, 794011, 285028, 217571, 493903, 547210, 359615, 305767, 461903, 268699, 270820, 200085, 256865, 210397, 344366, 415223, 888101, 491350, 730535, 764510, 235434, 425799, 45564, 112975, 541985, 532612, 590719, 282172, 618825, 278864, 662613, 326750, 631277, 203787, 449620, 492475, 203475, 559477, 324656, 517564, 534698, 518847, 646760, 246425, 633976, 468388, 641595, 418569, 506497, 302988, 576924, 415152, 414196, 738292, 442279, 848459, 598860, 660303, 641109, 357163, 453454, 299033, 494861, 571325, 441262, 275825, 740170, 547836, 534613, 314358, 570422, 621995, 744197, 549438, 431391]
14776D31391O5176J03690k31136K45881N5082J5543m4939P4443k75042P8627K9743
14765E48459o1668K51667N7740l69604K84708j49357J71000j42095J50282o0792
14755F80340K16192j42240K34414l40314l8230J11363J45059B13444K72532J5833
14745E01809M6045J59577M7859r4275B58039N84354m7833k56773N9019K67047
14735H63853j56703K92021k04812k9718j84886l6625J01995M2944p5321J61674
14725G74422p7429J16096C78115N44049K06741j24432k68672n8502k98933N00363
14715H78729k0149j6590j34611K7665j02495K73112l97860J45152M35548m23386
14705F65115K42001q1370M643m8907J2172n3273O9403N2796j16636R4154l46799
$$ y = [431391, 496567, 600257, 369121, 615002, 670084, 685627, 640688, 715131, 440089, 518716, 548459, 486791, 738458, 796198, 426594, 711302, 561945, 732945, 590850, 741132, 680340, 896532, 754292, 988706, 648392, 610162, 721525, 866584, 213444, 485976, 501809, 547854, 707431, 755290, 661015, 258039, 842393, 794560, 537787, 596806, 863853, 707150, 999171, 794359, 764641, 579755, 543130, 645125, 688069, 612748, 774422, 696993, 813089, 378115, 922164, 1128905, 1004473, 735801, 677299, 378366, 878729, 858580, 841990, 707379, 735044, 632549, 905661, 507801, 652953, 1088501, 665115, 907116, 825746, 830389, 781482, 793654, 740381, 809784, 862580, 745944, 840098, 493299]
14694D93299K40804n3798j0916K47658J69918n1248j16515J75859J18554m73930
14684G39685R5932K86303k75218j7607J4673P1018C43828Q24309k36825o0565
14674H70747M7189j54252Q797L34776j17085j58725K04534j43680K05578j72534
14664I25345k86706L42133r9103J64249j08576K73102m43314L76217l7964j49211
14654I56172J67881m812o8205j16890L55666l19036L57319j66248m0230j9165
14644A102452o8513K44361n2901K29454j23075j47533k67887N14459m49666J71134
14634A152285K52488k04235K68063m83768R6020R2453K12103m28157M21368M6738
14624A425358M7761j96922J89226j0228k57814j00840J72485L61391m87139N51434
$$ y = [493299, 734103, 680305, 669389, 917047, 1086965, 1035717, 919202, 1095061, 1213615, 739685, 835617, 1121920, 846702, 829095, 843768, 914786, 343828, 1168137, 931312, 870747, 917936, 763684, 772481, 1107257, 990172, 831447, 1035981, 892301, 1097879, 925345, 638639, 980772, 881669, 1045918, 937342, 1210444, 767130, 1143347, 1105383, 956172, 1124053, 1119241, 1051036, 934146, 1289812, 970776, 1328095, 1161847, 1121617, 1102452, 1033939, 1278300, 1225399, 1454853, 1331778, 1184245, 916358, 1430817, 981151, 1152285, 1404773, 1200538, 1468601, 984833, 1080853, 1173306, 1385409, 957252, 1378620, 1425358, 1473119, 1276197, 1465423, 1455195, 1197381, 1096541, 1269026, 1630417, 1143278, 1694712]
14614A694712l71485k39569P32144l66487L6421Q4216J37388N7454j21333r3186
14604A550275o5552l3328M14793k96306J0831l72241J63149K25631j29806M31684
14594A899130q4162j65163j51350K04806N1485K60097j67662L00694j50067j66687
14584A831121J50157j01812K10908m53862J72672K15519p8029R5926M0788J17039
14574B200427j01793J20048m8542J84353p4662Q8671k70218J08219J60146M75297
14564B841946k67768j87566N93564k61383K21704K53631P8762L15109l06629L47943
14554C629313N36431N62835L99300J242274Q39708J434965L452699O611687J2088885
14545C0798097K077434j6008619p275583l347287k082721q61355j14995j10222
$$ y = [1694712, 1323227, 1083658, 1815802, 1449315, 1485736, 1569952, 1707340, 1764794, 1643461, 1550275, 1484723, 1451395, 1866188, 1569882, 1580713, 1208472, 1371621, 1597252, 1467446, 1899130, 1814968, 1649805, 1498455, 1703261, 1754746, 2014843, 1847181, 2147875, 1997808, 1831121, 1981278, 1879466, 2090374, 1636512, 1809184, 2024703, 1946674, 2042600, 2083388, 2200427, 2098634, 2218682, 2170140, 2354493, 2279831, 2368502, 2098284, 2206503, 2366649, 2841946, 2574178, 2386612, 2980176, 2718793, 2940497, 3194128, 3272890, 3587999, 3281370, 3629313, 4165744, 4728579, 5127879, 6370153, 7209861, 8644826, 12097525, 18709212, 30798097, 32875531, 16866912, 9591329, 6244042, 4161321, 3299966, 3184971, 3074749]
14537C074749k28042r7537L2018j09410q5702k75872r7238j266N32423K7959m07610
14526B364472Q9596P8563j63415R1693k17095J80954k8329K36512K43677k54908
14516B621720k39249J25429K45434J48925l14343L59938l77307K69992j1246J02931
14506B932224K27506m14568J34122n2980K79563j89819L17425K5447m20751K270
14496B840439L35693J4393Q9713j6700k49855J70521J30817K76175k49631J51969
14486C493534j88661J19814L26073L4594J25893k21593R4280K13621p7487j58510
14476C761558L01099k13823K54931l03741N76514j22996j40871L36251j0050j64862
14466D274010L9453K47430p0053l1424L10226Q1426k06196J68514o1094l1170
$$ y = [3074749, 2846707, 2749170, 2781188, 2671778, 2586076, 2310204, 2212966, 2211700, 2744123, 2772082, 2364472, 2454068, 2532631, 2369216, 2460909, 2243814, 2424768, 2396439, 2632951, 2876628, 2621720, 2382471, 2507900, 2753334, 2902259, 2587916, 2947854, 2570547, 2840539, 2829293, 2932224, 3159730, 2745162, 2879284, 2826304, 3105867, 2916048, 3233473, 3258920, 2838169, 2840439, 3176132, 3190525, 3280238, 3263538, 3013683, 3184204, 3315021, 3591196, 3341565, 3493534, 3304873, 3424687, 3750760, 3785354, 3911247, 3689654, 3783934, 3997555, 3920068, 3761558, 4062657, 3848834, 4103765, 3800024, 4376538, 4253542, 4112671, 4448922, 4438872, 4274010, 4313463, 4560893, 4490840, 4459416, 4769642, 4851068, 4644872, 4813386, 4752292, 4721122]
14456D721122K09363Q1930J35894P3832P1232M023o8374J20816R2708K62737k90997
14445E414286K29907O9551L00802k94926J52121q8963K64841k51509J84760L85556
14435F366426k08143K64453L05135m6552K60239j6719k30859K97466J50500J09141
14425G251087K56878n64345N70630p139K30050j03062l9526N50704k67719J67348
14415H044906K78046o146K37349L96321k83502M42773M4899K22434j39455K90789
14405I528414J63267L54641m58419L51391k40711O33043J93526K10503K48596
14396A0984251K81983m735M17100N0029K43253n0882J89792L74986K63961K97015
14386A3046753J76282J48806M59468P0745L94824J24938O00824J23122J43250
$$ y = [4721122, 4930485, 5012415, 5148309, 5222141, 5293373, 5297396, 5229022, 5349838, 5442546, 5705283, 5414286, 5644193, 5713744, 6014546, 5719620, 5871741, 5782778, 6047619, 5796110, 5980870, 6366426, 6158283, 6422736, 6727871, 6681319, 6941558, 6924839, 6693980, 6991446, 7141946, 7251087, 7507965, 6943620, 7514250, 7507111, 7737161, 7634099, 7594573, 8145277, 7877558, 8044906, 8322952, 8316806, 8554155, 8950476, 8666974, 9109747, 9154646, 9377080, 9237625, 9528414, 9691681, 10046322, 9587903, 9939294, 9698583, 10331626, 10525152, 10735655, 10984251, 11266234, 11261499, 11678599, 11728628, 11971881, 11920999, 12110791, 12485777, 12749738, 13046753, 13223035, 13371841, 13831309, 13902054, 14296878, 14421816, 15022640, 15145762, 15289012]
14377A5289012R7710L64536N57970K94938J03180K85938M75787M36162N2186N96705
14367A8554124M96602O54671k30077P55228P14058J84826N27032N18015L13174
14358B2487653J94963O91090O17692N90229O11447K22240Q23472Q81472O48966
14349B7769224N73676N99680J098850O45300Q99804R83063M43163R40096J176026
14340C5128882Q98726J277162N06633J358050R97115J232170Q89906J373294J811415
14331D5473353J253993J321421J922731J210777K034610J588070K322285J627663
14323E8754903K220662K103382K153353K433393K762365K549467K542372K940810
14315G8460707L184346L283860L066654L810370L666975M119079M212654M237021
$$ y = [15289012, 15386722, 15751258, 16309228, 16604166, 16707346, 16993284, 17469071, 17905233, 17957419, 18554124, 19050726, 19705397, 19475320, 20230548, 20944606, 21129432, 21656464, 22174479, 22487653, 22682616, 23373706, 23991398, 24581627, 25193074, 25415314, 26238786, 27120258, 27769224, 28342900, 28942580, 30041430, 30686730, 31586534, 32569597, 33012760, 33952856, 35128882, 36027608, 37304770, 37811403, 39169453, 40166568, 41398738, 42288644, 43661938, 45473353, 46727346, 48048767, 49971498, 51182275, 53216885, 54804955, 57127240, 58754903, 60975565, 63078947, 65232300, 67665693, 70428058, 72977525, 75519897, 78460707, 81645053, 84928913, 87995567, 91805937, 95472912, 99591991, 103804645, 108041666]
14307A08041666M931229M773842N188339N621539N512288N849059O690045O943961
14299A53551968P186129P957203P780210R018574R286616R085476J0330344J0690273
14291B24886793J1243739J1476373J2203525J2000416J1563300J1446993J2025192
14284C06846331J1711838J1871784J2454140J2304670J1696471J1083442J0544248
14277C88512924J0469940J0359310R250879R020683Q862472P402186L718981K783866
14269D50381241j556464o170441p303481o916620j0785798j3614470j3936319
14262C90097648j4244832j3457908j3520994j3118990j3057952j2495168j1830156
14255B98371648j1782407j2226907j1530315j0962398j0323561j0421517r980840
$$ y = [108041666, 112972895, 117746737, 122935076, 128556615, 134068903, 139917962, 146608007, 153551968, 160738097, 168695300, 176475510, 185494084, 194780700, 203866176, 214196520, 224886793, 236130532, 247606905, 259810430, 271810846, 283374146, 294821139, 306846331, 318558169, 330429953, 342884093, 355188763, 366885234, 377968676, 388512924, 398982864, 409342174, 418593053, 427613736, 436476208, 443878394, 447597375, 450381241, 448824777, 442654336, 435350855, 428434235, 417648437, 404033967, 390097648, 375852816, 362394908, 348873914, 335754924, 322696972, 310201804, 298371648, 286589241, 274362334, 262832019, 251869621, 241546060, 231124543, 221143703]
14248B21143703r004198q962369q787699q678529p829374p509243p261162o785388
14240A56325741n979663o493222n708623n756142n264007n175905m742632m473072
14232A12732475m312754m031793l974421m065579l908111l163468l541819l202166
14224H2532364l200629l205666k378631k560918k168108k457166k421524k173834
14216F1965888k197514k010994j638366j529049j931357j828037j604098j481804
14208D7744669j346185r59667j487372j551822j235119j769359q56104n80185
14200C7958856j419039q32817j121523j081683q50413p87825q95220q30554n89295
14191B9550487r67764m78965r32561o29652p65151q02311l25020l02617j005720
$$ y = [221143703, 212139505, 203177136, 194389437, 185710908, 177881534, 170372291, 163111129, 156325741, 150346078, 143852856, 138144233, 132388091, 127124084, 121948179, 117205547, 112732475, 108419721, 104387928, 100413507, 96347928, 92439817, 89276349, 85734530, 82532364, 79331735, 76126069, 73747438, 71186520, 69018412, 66561246, 64139722, 61965888, 59768374, 57757380, 56119014, 54589965, 52658608, 50830571, 49226473, 47744669, 46398484, 45438817, 43951445, 42399623, 41164504, 39395145, 38539041, 37958856, 36539817, 35707000, 34585477, 33503794, 32653381, 31865556, 30970336, 30139782, 29550487, 28582723, 28103758, 27171197, 26541545, 25776394, 24974083, 24649063, 24346446, 23340726]
14182B3340726o29528j92337q7336q77246k91551m78171o20240k84994o03894
14173A9275429N8813p70210j00602l05198m59663n67311l35412k37167m18087
14164A6140592l9932n86439j12563k60255k4295q65206K13635m75162j68229l67650
14154A3454496M4574j90233l90698j96856n96620K55788J44867m25009j57524
14145A1942785k00161k52690j52423k9718k67599j97446K046k19709l64308l59012
14135I901765K30636k44054m14085M48k8014j12078k87863M9949j09771m59004
14125H527929L64212l87185K2131n86896K68544j75546k45568j7381j73301J06929
14115G703868q491j52556j32115l0040l53638J12536k90587L4809j77897p8012
$$ y = [23340726, 22711198, 22518861, 22431525, 21554279, 21262728, 20784557, 20164317, 19879323, 19275429, 19334242, 18564032, 18463430, 18158232, 17698569, 17131258, 16795846, 16558679, 16140592, 16100660, 15514221, 15401658, 15141403, 15117108, 14251902, 14465537, 13990375, 13822146, 13454496, 13499070, 13308837, 12918139, 12721283, 12124663, 12380451, 12525318, 12100309, 11942785, 11742624, 11489934, 11337511, 11307793, 11040194, 10842748, 10844794, 10625085, 10260777, 9901765, 10132401, 9888347, 9474262, 9474710, 9446696, 9334618, 9046755, 9096704, 8986933, 8527929, 8892141, 8504956, 8527087, 7940191, 8208735, 8033189, 7787621, 7770240, 7596939, 7703868, 7695377, 7542821, 7410706, 7380666, 7027028, 7139564, 6848977, 6883786, 6705889, 6627877]
14105F627877j7970l43739K68745J8267j84094K7541l3825k91872j90491J37839
14095F018278k23446J9701J6504j44623o3593j81968L3200J98326l06555r6737
14085E269087l1039k97471L45824l3992k73058J20847j21544k33511K44560J49976
14075E139679m06437k41302J85138L00119o63585L70603k69692J86126j4313l56902
14065D229434R080L01152l96024K84134l35811M4667K7441J00982O9875l02729
14055D032201L15158l95948k80756L4976P2833j88290J95209p3238J40447m96232
14045C356360K81456Q4124R021l10953q1831o4748J27354j73593J21951j31797
14035C217344M8503N1884J87352j26510k13759J00928M53599n98426J5864N2470
$$ y = [6627877, 6609907, 6266168, 6534913, 6553180, 6369086, 6396627, 6362802, 6070930, 5880439, 6018278, 5794832, 5814533, 5831037, 5686414, 5622821, 5440853, 5474053, 5672379, 5365824, 5269087, 5238048, 4940577, 5286401, 5252409, 4979351, 5100198, 4978654, 4745143, 4989703, 5139679, 4733242, 4491940, 4677078, 4977197, 4313612, 4684215, 4414523, 4600649, 4586336, 4229434, 4238514, 4539666, 4143642, 4427776, 4091965, 4136632, 4164073, 4265055, 4334930, 4032201, 4347359, 3951411, 3670655, 3705631, 3778464, 3590174, 3785383, 3712145, 3852592, 3356360, 3637816, 3721940, 3730961, 3420008, 3338177, 3273429, 3400783, 3227190, 3349141, 3217344, 3265847, 3317731, 3505083, 3378573, 3164814, 3265742, 3719341, 3120915, 3136779, 3189249]
14025C189249r9297l60533J63500l1606N5398J29083n45170N20501q5886j47733
14015B787506m7088r7610J98589l62763K16550J1937q7431J96965J03496j88640
14005B731511k54934j09419J80770L0195O0439k79966M40644k86437Q932K76044
13995B797779O4590K87426M249M27461L76296P30408P91249K390916N965116J1586265
13985B5421755Q089115j3227589p212949m137709k335700j195488m58003o50900
13977D292532j66239l08465j15422k95215m32584K77699j98940j34890j53745
13968B764731J17423l50784L12946q6458j53790n18326L15390K23772J15690j38310
13958B602284k07263m9282j23743k91805J3147J68007O319R9915j58913k21006
$$ y = [3189249, 3089952, 2729419, 2892919, 2861313, 2916711, 3045794, 2500624, 3021125, 2935239, 2787506, 2740418, 2642808, 2841397, 2478634, 2695184, 2707121, 2619690, 2816655, 2920151, 2731511, 2476577, 2367158, 2547928, 2578123, 2638562, 2358596, 2799240, 2512803, 2521735, 2797779, 2862369, 3149795, 3154044, 3581505, 3957801, 4688209, 5479458, 7870374, 13835490, 25421755, 33510870, 20283281, 13070332, 8932623, 6596923, 5401435, 4943432, 4292532, 4126293, 3817828, 3702406, 3407191, 2974607, 3252306, 3053366, 2918476, 2764731, 2882154, 2531370, 2844316, 2757858, 2604068, 2085742, 2401132, 2624904, 2740594, 2602284, 2395021, 2345739, 2221996, 1930191, 1943338, 2111345, 2117664, 2217579, 2058666, 1837660]
13948A837660Q3904Q1361j37356K19673J71389l75750j40445M92946m18318N1824
13938A866888L92114n01956k13282K86766J11598r0733r4839L3763O2051k05985
13928A646385l8394r8609J25570J52093j27155j16747O6104K4903K41120m5455
13918A829815k35455q7355J79702j30530k1577K26168j20922j96497k24366R0861
13908A309844K12077k40997J00263k2726l593L38271j71063m04240J32748J29688
13898A380272K12080l12101J62348J6474p3484j63218L04678n81425M19965k7338
13888A338251M5562j83602J66196j21854R660N5389J04091k12275K29284m4665
13878A386037n4294j62127q982l8818K24522q2704J92499m08392M9478l5526N7080
$$ y = [1837660, 1921564, 2002925, 1865569, 2085242, 2256631, 1880881, 1740436, 2233382, 1815064, 1866888, 2259002, 1757046, 1543764, 1830530, 1942128, 1851395, 1756556, 1790319, 1852370, 1646385, 1607991, 1509382, 1634952, 1787045, 1659890, 1543143, 1609247, 1634150, 1875270, 1829815, 1594360, 1507005, 1686707, 1556177, 1534600, 1760768, 1639846, 1443349, 1218983, 1309844, 1521921, 1280924, 1381187, 1358461, 1354868, 1693139, 1522076, 1117836, 1250584, 1380272, 1592352, 1280251, 1442599, 1459073, 1385589, 1222371, 1527049, 945624, 1365589, 1338251, 1383813, 1200211, 1366407, 1244553, 1254213, 1309602, 1413693, 1201418, 1430702, 1386037, 1331743, 1169616, 1160634, 1121816, 1346338, 1263634, 1456133, 1047741, 1097219, 1061693, 1118773]
13867A118773K32835j13764K8874k50420L0294K30876l89969K15172k24955K59772
13857A137488K0533l1314j833J15737q4146O1681j08852J11163K2201q4481k19807
13846I38370J46788j47771J64836k826Q2290j94612l280Q905O7797K89755m58986
13835H91266N5991J51298m56238L50363J04898j36012k53561K37090K60591l98681
13825H07005L41587k13151K1254K7265K43621k64790k6262O2010k90954J05729
13815H13314N214j14805n9794N00973m6966k56471j03563J39287J11861J03905
13805A092955k31433j72872k36333L59878j1611J39777j80805K45350n4626k59576
13795F90704k0110L92688k98718J2597K35616j32705k13319L6679J52249o0396
$$ y = [1118773, 1351608, 1237844, 1266718, 1016298, 1046592, 1277468, 887499, 1102671, 877716, 1137488, 1158021, 1126707, 1124874, 1240611, 1156465, 1218146, 1109294, 1220457, 1242658, 1158177, 938370, 1085158, 937387, 1102223, 1099397, 1181687, 987075, 983795, 992700, 1060497, 1350252, 891266, 947257, 1098555, 642317, 992680, 1097578, 961566, 708005, 945095, 1205686, 807005, 1148592, 935441, 956695, 983960, 1227581, 962791, 936529, 998539, 707585, 813314, 818528, 703723, 643929, 1144902, 1097936, 841465, 737902, 877189, 989050, 1092955, 861522, 688650, 452317, 812195, 800584, 940361, 759556, 1004906, 950280, 690704, 670594, 1063282, 764564, 777161, 1012777, 880072, 666753, 703432, 855681, 795285]
13785G95285r3030K84398M8881l55617K63647k22028K87621l17430j94843M54593
13775I51477k29844j69234K84072o5969K27638r5463j60670P799j74167J57409
13765G33048J7276P1283J4666j94852m2765L14976l72432L32438l52932J17404
13755F38110K47028r2058k6899j20010K01324o2060o6932j07161J49321k7701
13745G32962j91470O4160N9603j52173J85120R862j34933R4021k55395K60939
13735F72696j38675Q9693j18193P4828J00209A89655N68835k78938R8753L615
13725E81920O2498l7150j24961N16014k37337p9762P5842k73074J98676j22212
13715E60454L5838q7325J5309P4722j47124J7806K11654k73943K61541q991j61616
$$ y = [795285, 702255, 986653, 1035534, 679917, 943564, 721536, 1009157, 691727, 496884, 951477, 721633, 552399, 836471, 770502, 998140, 902677, 742007, 749806, 575639, 733048, 750324, 821607, 836273, 641421, 598656, 913632, 541200, 873638, 520706, 638110, 885138, 793080, 766181, 646171, 847495, 785435, 718503, 611342, 760663, 732962, 541492, 605652, 665255, 513082, 698202, 708064, 573131, 667152, 411757, 672696, 534021, 623714, 505521, 580349, 680558, 189655, 758490, 479552, 578305, 581920, 644418, 607268, 482307, 998321, 760984, 681222, 757064, 483990, 682666, 560454, 596292, 508967, 524276, 598998, 451874, 469680, 681334, 407391, 668932, 659941, 498325]
13704D98325J21835j2443L3143q6900j05967K45127A92592L15037o7148J24004
13694E64485j29931L14604C55495J53281o1434L05988k25146K11690j23493B10253
13683B32540L48245J8941N6267j49214M3074N7471l03007J83283J54687L22149
13673I64436k20021p7300j56119j65981M13081j75812J68244l33570J14042p5717
13663D55283K12705m8517B54715R9633J93596A69056L89948J29470B43365J82555
13653D25920K23059k89646L03717J97465k65758Q2794A27615J59744K69866j39548
13643D17677R5654j27474J80652j21077j16775K94583J28785l75863L79056j60015
13633E95203K7914l10122K69115j99055L47922C52379K70672l08490N0166P0395
$$ y = [498325, 620160, 607717, 640860, 553960, 447993, 693120, 192592, 507629, 440481, 564485, 434554, 749158, 355495, 508776, 447342, 753330, 528184, 739874, 616381, 210253, 232540, 580785, 599726, 655993, 506779, 549853, 607324, 304317, 487600, 642287, 964436, 744415, 667115, 510996, 345015, 758096, 582284, 750528, 416958, 531000, 455283, 667988, 619471, 254715, 354348, 547944, 169056, 559004, 688474, 243365, 425920, 648979, 359333, 663050, 860515, 594757, 677551, 127615, 287359, 557225, 417677, 513331, 385857, 566509, 445432, 328657, 623240, 752025, 376162, 755218, 595203, 623117, 312995, 582110, 383055, 730977, 352379, 623051, 314561, 364727, 435122]
13623D35122k03918K80641j82717L76058j32245B23049J89821L01405l35592n2648
13613C26035I9447M82833k90216L46614k82353N1581N7673J16318k83547j27433
13603A70917L20460A03949J57112J29177j64432N3302J15684J30211B62302L64
13593B62666N7792F9135D420K17271b4894D58456A92517P2632J01940j1885M7249
13582D02453J08517B49146n3574L14925A85889M94828k18899r6936O2797m5934
13572C81745q4313L76341k29135I2501M38185j333A41779L18120j54463J90135
13562D95571k33838K07048J43046A51004M72507k32291n0374A55216K13179A50933
13551D49400k00579l4376q1444J76166a43150D88200j61347n6639O4879M4202
$$ y = [435122, 231204, 511845, 329128, 705186, 572941, 223049, 412870, 714275, 378683, 326035, 99447, 582280, 292064, 638678, 356325, 407906, 465579, 581897, 298350, 170917, 491377, 103949, 261061, 390238, 225806, 279108, 394792, 525003, 262302, 262666, 320458, 69135, 4420, 221691, -24894, 458456, 192517, 265149, 367089, 355204, 402453, 510970, 249146, 195572, 510497, 185889, 680717, 461818, 364882, 427679, 381745, 297432, 673773, 444638, 92501, 530686, 529353, 141779, 459899, 305436, 495571, 261733, 468781, 611827, 151004, 623511, 391220, 340846, 155216, 368395, 150933, 449400, 248821, 214445, 133001, 309167, -143150, 488200, 326853, 270214, 335093, 379295]
13541C79295q4749K24368k57563M8448J7236n7615J30010j17879A29919L13393
13531D43312J07237k41654J89712C2347J43488K09094j07733N1364A16058K94602
13521D10660A07395B9127a25806F30975k17516A26449L21181A21114R1252K15498
13511D27864j24572m4898o3135J45994J84351j44570A55954j3946a51908B65935
13500C82669J20520A81012B2065O3211n219d9439D20561j68275l0673l992I1677
13488D25089F8694J04389J27713A15279L24590n8094j89610B7768L16182a4795
13477E77867L0560k41031N2040m1283j24951M1039B9217L72357K38998C19468
13466C34028A38580K02787J39915j59049E3596N7773O56237l08550j45778A41046
$$ y = [379295, 294546, 518914, 261351, 309799, 327035, 269420, 399430, 281551, 129919, 443312, 550549, 308895, 498607, 32347, 175835, 384929, 277196, 328560, 116058, 410660, 107395, 29127, -125806, 630975, 413459, 126449, 447630, 121114, 212366, 427864, 303292, 258394, 195259, 341253, 525604, 381034, 155954, 142008, -151908, 265935, 382669, 503189, 181012, 22065, 85276, 80057, -49439, 420561, 252286, 221613, 217621, 91677, 425089, 68694, 173083, 300796, 115279, 439869, 381775, 192165, 27768, 343950, -14795, 577867, 608427, 367396, 419436, 378153, 253202, 294241, 29217, 401574, 640572, 319468, 334028, 138580, 341367, 481282, 322233, 53596, 111369, 767606, 459056, 313278, 141046]
13455g4849B83081J36181j77839j04639J33001n2568n608J16841M9265A85021
13444B13254L378J83467A55234K00650j23342M0225A0000L08358a09762c8552
13433G0995L19730j60283N241H2216K73778J62238j93012H1325A9815J66511K47249
13422D33575Q0890N94B28033L4073c1620D2174K41840J34083K4627A9780K53018
13411B72798a10883B39216J02690P3601j09462p8859J00197A27060J08809J11965
13401C47834j14756r1727K5477J86284A21385L4775o6618J50958q7881G3813J30793
13390B04606K4555J9410r9657R3341K9866r1742J49460L72129B25607O4371r3773
13379A96205A7849J35588f9912A90649K55863j05350M1446n5118a25648A32021
$$ y = [-74849, 283081, 419262, 241423, 136784, 269785, 217217, 211609, 328450, 377715, 185021, 213254, 216632, 400099, 155234, 355884, 232542, 272767, 10000, 318358, -109762, -38552, 70995, 390725, 230442, 235683, 82216, 355994, 518232, 325220, 81325, 19815, 186326, 433575, 514465, 515059, 228033, 262106, -31620, 42174, 284014, 418097, 442724, 19780, 272798, -110883, 239216, 341906, 415507, 306045, 227186, 327383, 127060, 235869, 347834, 233078, 141351, 166828, 353112, 121385, 156160, 89542, 240500, 152619, 73813, 204606, 229161, 248571, 148914, 242255, 272121, 180379, 329839, 701968, 225607, 289978, 196205, 17849, 153437, -69912, 190649, 446512, 341162, 382608, 327490, -125648, 132021]
13368C54014e492A96494a54735C54216N6765A13646J21144j1091N8948L697b6267
13356E65296j2804B58942H7696J69684o9073C0206M49517k08903m2278Q2797o7698
13345B43641j08430K42729J73718B31846p9918L73959A23280J44716M23576C06083
13334H0975K95733j65627j4824q902H1439J73000M1242M6897j24007n9645o0634
13323I8292J72079M4653J45903p9244K42464B89522p282I6199a02258A39472J81308
13312C20780O8236F3749L46765E0830J91595e2110K0312n6069B97312l1086c2878
13300A58323a44343B89281B1706f0093B7173L1412j0471d6412j06744B46455N0998
13289B97453O9245d902B86503A11521R364a56771A95176b3071j17731H6909a8151
$$ y = [354014, -5492, 196494, -154735, 354216, 410981, 113646, 234790, 223699, 282647, 286344, -26267, 565296, 552492, 258942, 87696, 257380, 188307, 30206, 479723, 270820, 228542, 311339, 243641, 135211, 377940, 551658, 231846, 151928, 525887, 123280, 267996, 691572, 306083, 80975, 376708, 211081, 196257, 187355, 81439, 254439, 295681, 342578, 218571, 158926, 98292, 270371, 315024, 460927, 381683, 624147, 289522, 282240, 96199, -102258, 139472, 320780, 389016, 63749, 410514, 50830, 242425, -52110, -31798, -87867, 297312, 266226, -32878, 158323, -144343, 289281, 21706, -60093, 27173, 58585, 48114, -46412, -153156, 246455, 297453, 366698, -4902, 286503, 111521, 120885, -156771, 195176, -23071, -140802, 86909, -18151]
13277a16663D1856b77481B62218I1786L265a43358G5592b15781B90618A21153
13266F7997J99786G3749a35941B49559J68295j70489J65551B1443g7078A02795
13255C3620J23010G5954j5859O3969J22674A11026j8525a847C45427A41917g7700
13243C94238F8320b84579I0440J19562F3910R5136c6984A8610J55566n3752b72208
13231B49114a32265F29K53224D5683a27441p3986I2734a2075C74309J00855f0233
13219D54396j86902A24731K67196f8331A24054f0753A61196Q0208c00073F8524
13208C22393b48955A65878a74138f217A77272A59K53917f5881B19554A3403K2842
13197C6245K03148C1432K47329C6186J76768C0115e6769B68027C1032J8298d0840
$$ y = [-116663, 41856, -277481, 262218, 91786, 95051, -143358, 75592, -215781, 290618, 121153, 67997, 267783, 73749, -135941, 249559, 417854, 247365, 412916, 21443, -77078, 102795, 33620, 156630, 75954, 60095, 124064, 246738, 111026, 92501, -1847, 345427, 141917, -77700, 394238, 68320, -284579, 90440, 210002, 63910, 159046, -36984, 18610, 174176, 120424, -272208, 249114, -132265, 629, 253853, 45683, -127441, -201427, 92734, -12075, 374309, 475164, -60233, 454396, 267494, 124731, 391927, -68331, 124054, -60753, 161196, 241404, -300073, 68524, 322393, -248955, 165878, -174138, -6217, 177272, 159, 254076, -65881, 219554, 13403, 36245, 239393, 31432, 278761, 36186, 212954, 30115, -56769, 268027, 31032, 49330, -40840]
13185B66584A28950J50605L9603G3750J66387h0306c6069C50258A65567p1202
13175I4365B3568c1696D08028A35289D7315I280M6378J4178J40440i3063c9980
13163A58828M8663I6952d5465A72740J44279A35716C3638J47306b49884A91662
13152B31506a45569b9639C4157a958A82786b56915F848M00430b24257A45904K89488
13141D35392B03193E2524J44788b32085F3713A897h2506q6441D84575a96777B04283
13129B25881H0931C4808K58863J27856A83096F6359b61715L9860A42834j1272
13119A31562L3742P5150o9252b18389L577G1788d28133B8059N72747A79804f0467
13107b06410C57528F6331J43713B1088f8630r5459j04929C35128f6222J1362B90220
$$ y = [266584, 128950, 279555, 319158, 73750, 240137, -80306, -36069, 350258, 165567, 94365, 23568, -31696, 408028, 135289, 47315, 9280, 55658, 69836, 210276, -93063, -39980, 158828, 207491, 96952, -45465, 172740, 317019, 135716, 33638, 180944, -249884, 191662, 231506, -145569, -29639, 34157, -1958, 182786, -256915, 6848, 407278, -224257, 145904, 435392, 203193, 52524, 197312, -232085, 63713, 1897, -82506, -168947, 484575, -196777, 204283, 225881, 80931, 34808, 293671, 421527, 183096, 66359, -261715, -221855, 142834, 131562, 165304, 240454, 171202, -218389, -214812, 71788, -428133, 28059, 600806, 179804, -60467, -206410, 357528, 66331, 210044, 21088, -68630, -164089, -269018, 335128, -66222, -54860, 290220]
13095h1860C8820L61141A61754J70511c7887a5260C46915H0920b8277q4300A21006
13083b20300c2960C05697d2135A01567J00436d2237E2150f2263B4467h1421F5685
13071C26677H7029a2773A91124b5887l372j88088n8273A29476b8107j06511e1237
13059D7062R4389K5448K72058b00255C6211A817J74264B363J37030B0482a7363
13047d2820B33259A3361R9402J52837a76020I7062a56661A21475Q951J36108c13499
13035B73990A20958a6344p3271n3791C1855P8114a33593A84402R151b8168A81240
13023c9973K144m4372A27154i6246a8086A14999j4347J19944j8896N4020j08002
13012A47718J06326K55128c9659B60979F2376c3170F967K76925r631o0394e5040
$$ y = [-81860, 38820, 399961, 161754, 332265, -37887, -15260, 346915, 80920, -28277, -112577, 121006, -220300, -32960, 305697, -42135, 101567, 202003, -42237, 52150, -62263, 24467, -81421, 65685, 326677, 87029, -12773, 191124, -25887, -29259, -217347, -275620, 129476, -28107, -134618, -51237, 47062, 141451, 166899, 438957, -200255, 36211, 1817, 176081, 2363, 139393, 20482, -17363, -42820, 233259, 13361, 112763, 265600, -176020, 97062, -156661, 121475, 130426, 266534, -313499, 273990, 120958, -16344, -89615, -143406, 31855, 109969, -133593, 184402, 193553, -28168, 181240, -39973, -37829, -82201, 127154, -96246, -18086, 114999, 100652, 220596, 201700, 255720, 147718, 254044, 509172, -39659, 260979, 62376, -33170, 6967, 283892, 274261, 213867, -55040]
13000B98507I1964a50227j26808A48615D3552a17832c8300B49663H2011a02916
12989B67434L625b00170i0028e80j91099g7967a1081c08A30578F2631a02627c9039
12976B50449j09688M5630G997a13191a8452D9076J8253b0336C28759j46825a00090
12964A95131e6088A42387i7603G6962J06254a43773A52012a76928J1054A5546
12953I4128O9834A5023J38838e1792j37727A37753P0977n7514j8756l2959N1688
12942A51189b5725l05277C29514G7059J042J26739P6826n7503p8314J07498C0487
12930a65624B52404O5233F8845a22923A13757a01607n3423A51301d3067k99743
12920c42810B27560a71371P6276E26514a50673J0401A4367J32095g6432k6700
$$ y = [298507, 91964, -150227, -277035, 148615, 43552, -117832, -38300, 249663, 82011, -102916, 267434, 271059, -200170, -90028, -580, -191679, -77967, -11081, -308, 130578, 62631, -102627, -39039, 250449, 140761, 186391, 7997, -113191, -18452, 49076, 67329, -20336, 328759, 181934, -100090, 195131, -56088, 142387, -97603, 76962, 183216, -143773, 152012, -176928, -165874, 15546, 94128, 163962, 15023, 153861, -51792, -189519, 137753, 208730, 151216, 132460, 99501, 151189, -25725, -331002, 329514, 77059, 78101, 204840, 281666, 224163, 145849, 253347, 30487, -165624, 252404, 317637, 68845, -122923, 113757, -101607, -155030, 151301, -43067, -342810, 227560, -171371, -95095, 526514, -150673, -140272, 14367, 146462, -76432, -103132]
12910a03132k38964A28907a31291D9692K56875I1044e5740H8064f6321D00491
12899b24636B15550g3345K209A17502B5815K8965B6598J79879C0388N5750J04889
12888A91027g4372a7657A73847K6682a01385o520j34010A32806B6641i7245A24256
12876A63563D4871K00285M5682j22750c36858A83871a18324A52422k3418A3616
12865a82382A25315i6587D7229b1996B74417h4243A26937d6107j8762A10944J04064
12854B15008q9737Q5963B4458a18634k33990A90979a01744A1344C821a07791F9146
12842b1670k8478B51994h5636p5101A52025C9356A1378a25400A49992E9373A15
12830B91930j44950Q9736A15299R142D2095O1461J22690L8180a91003L6590A69013
$$ y = [-103132, -342096, 128907, -131291, 49692, 306567, 91044, -55740, 88064, -66321, 400491, -224636, 215550, -73345, -71136, 117502, 25815, 54780, 26598, 206477, 30388, 86138, 191027, -74372, -17657, 173847, 200529, -101385, -107905, -241915, 132806, 26641, -97245, 124256, 163563, 44871, 245156, 290838, 168088, -336858, 183871, -118324, 152422, 129004, 13616, -182382, 125315, -96587, 47229, -21996, 274417, -84243, 126937, -46107, -64869, 110944, 215008, 125271, 211234, 24458, -118634, -352624, 190979, -101744, 11344, 3821, -107791, 69146, -21670, -50148, 251994, -85636, -160737, 152025, 39356, 11378, -125400, 149992, 59373, 115, 291930, 146980, 236716, 115299, 124441, 42095, 103556, 226246, 264426, -191003, -154413, 169013]
12818D3048c2701j539O637D64961b7921L030E7898i8229k97989J23968P8573A15300
12805F235a65987e9475k65322G6488j9589j1351A6451N885j822R8306a83378j90179
12793c73557J19393J24777M8938B22652D8498c20738a310A91454R4692a89286
12782B00262E9831A3420b35058B19976r9600c7378I0455b01694j2304A48330K42169
12771C90499a45382I2493a67925E3254J75084p3531m2074a94489c8757B64800
12760A69295e0492K3521C88693a02699p7209n0735A20311P2545a18085l3348B63044
12748a34748I1527m737l4800J77861H4800j6487Q9463E7472j9947j7481a72821
12736e3575A49482b0924A42011d7441B04134l6501I588K92485I1217A9422J1186
$$ y = [43048, -32701, -34240, -27603, 464961, -27921, -24891, 57898, -98229, -396218, -272250, -193677, 115300, 6235, -165987, -59475, -324797, 76488, 56899, 45548, 16451, 22336, 20514, 118820, -183378, -373557, -254164, -129387, -80449, 222652, 48498, -320738, -1310, 191454, 286146, -189286, 200262, 59831, 13420, -235058, 219976, 120376, -37378, 90455, -201694, -213998, 148330, 390499, -145382, 92493, -167925, 53254, 228338, 154807, 112733, -194489, -38757, 264800, 169295, -50492, -26971, 388693, -102699, -179908, -230643, 120311, 192856, -118085, -151433, 263044, -134748, 91527, 86790, 51990, 229851, 84800, 68313, 157776, 57472, 37525, 20044, -172821, -53575, 149482, -20924, 142011, -47441, 204134, 167633, 9588, 302073, 91217, 19422, 30608]
12725C0608K05265N1537A27447R6517d5926A84839B9363f4087C09381A44502J70464
12714C14966n0921g9646D78044L652A00006D9678J04652M3812p5841d8483E84507
12702B10668e1753A90829C3337K9688C1490c9084r9086A81668m1641J21975A00832
12690A27838J12437B2996c3230B4143g9267j14827g2630B34605A6649J26069a74617
12678A78617q6431J94488M33346A45576J9956n6710J57961J12710H1832j492d7777
12666A90507g994m5562d052B22032a8705B33583n5413G603a31974D4700K01535
12655B46235a26717L3369F3013l0306b09804A00310B6249e4497b2076l43535A61384
12643a14678J8302j5401B04629a87998C47119A11176M0374D6072K1785L12791
$$ y = [30608, 235873, 287410, 127447, 223964, -45926, 184839, 29363, -64087, 309381, 144502, 314966, 264045, -79646, 478044, 481696, 100006, 49678, 154330, 198142, 122301, -48483, 584507, 210668, -51753, 190829, 33337, 63025, 31490, -39084, -138170, 181668, 140027, 262002, 100832, 127838, 240275, 22996, -33230, 24143, -79267, -194094, -72630, 234605, 16649, 142718, -174617, 178617, 92186, 286674, 720020, 145576, 165532, 108822, 266783, 379493, 81832, 80340, -47777, 190507, -7994, -53556, -4052, 222032, -18705, 233583, 178170, 7603, -131974, 44700, 246235, -126717, -93348, 63013, 32707, -209804, 100310, 26249, -54497, -22076, -365611, 161384, -114678, -96376, -111777, 204629, -187998, 347119, 111176, 151550, 46072, 67857, 380648]
12633C80648D5651J90791A08482L542b7600B05897R5905j44067M262b29654e9989
12621C809P5922g2400C08006H2254l3234K11275a6259B87906a23097K1310p4157
12610a75944a7592q7086C2479J35980K01157A9242O0020K65182e0624B15601a57521
12598h3924D241J13077f1120o3726B15681a53644A66666R5490L1913A0879K08697
12587B19576A06170c6408D944K21043A02526a64392A72100D5305i8125A45853
12576C752N307J13497B960h6327A73626h1606B98958B4902Q2495a35321j4313
12565a49634g620A96880P9850b7678A83619J61020j53694o2878a7685B13830k9672
12554A84158J60014G773J12144J99702A2728N3566P8372b50915E3241e0418B25975
$$ y = [380648, 45651, 236442, 108482, 112024, -27600, 205897, 301802, 157735, 161997, -229654, -59989, 3809, 79731, -72400, 308006, 82254, 49020, 260295, -16259, 287906, -123097, -101787, -175944, -17592, -104678, 32479, 168459, 369616, 19242, 79262, 344444, -50624, 215601, -157521, -83924, 4241, 117318, -61120, -124846, 215681, -153644, 166666, 262156, 294069, 10879, 219576, 106170, -36408, 4944, 225987, 102526, -164392, 172100, 45305, -98125, 145853, 3752, 9059, 122556, 2960, -86327, 173626, -81606, 298958, 24902, 107397, -135321, -149634, -7620, 196880, 276730, -27678, 183619, 344639, 190945, 128067, -17685, 213830, 184158, 344172, 7773, 119917, 319619, 12728, 66294, 144666, -250915, 53241, -50418, 225975]
12542C89759a24310H5304b65969B68316A19646b12534A65261p1145d5661k8808
12532g4469D7673K09331c224B0573e2754k20131D7973c5324D7984a31774k66028
12521c97802B31462i2983C33434a39293F8784j1152O2589J05034p0155J094O4276
12510B20470C6896a44271O6435B90548c1344m571B56663A01348N6724a2150p0611
12499h2761C7341f0660A87601P0688H6162M79b7042A67510a69273M6197D4961
12487a23530I9217d2968H0061J78710a31477j97173a58990C54637a25260B66003
12476A163J88150d1722P516R454A15606f0725A41916a72907A891J99082q1511
12465A19462E2737d723j30650F4381a53546F7998i085r023A88756A3217K85769
$$ y = [389759, -124310, 85304, -265969, 268316, 119646, -212534, 165261, 94116, -45661, -74469, 47673, 257004, -3224, 20573, -52754, -272885, 47973, -35324, 47984, -131774, -397802, 231462, -92983, 333434, -139293, 68784, 57632, 120221, 225255, 155100, 156194, 220470, 36896, -144271, -77836, 290548, -31344, -35915, 256663, 101348, 158072, -12150, -82761, 37341, -60660, 187601, 258289, 86162, 86641, -27042, 167510, -169273, -123076, 44961, -123530, 99217, -42968, 80061, 258771, -131477, -328650, -158990, 354637, -125260, 266003, 1163, 189313, -41722, -34206, -24752, 115606, -60725, 141916, -172907, 1891, 200973, 119462, 52737, -4723, -135373, 64381, -153546, 67998, -9085, -18108, 188756, 13217, 298986]
12454B98986A45095a90037H425d28197A70198b87155a9632A68291B8023M6035
12444G4058J92413h9808A89650a17112C35314c34848C9953e6349A22072b33429
12433B7957F150R9422N013O7668J79504C1401K5339j8942J47411b9411B45185
12421A73488a74190D7941M3685K8568I893i3627F3977e3969J4711D503N7586A3180
12408I9614O0048a90912A70903F1753I577J96847l4028K07491a05282C49622c42618
12396a89918P7782L8870C0910J40373R2451j18596Q6165g2492A03902b54049b4682
12384h2574E4689M7892J43960C283K05392a3986A72599h1520j00103N3032D6727
12372H2370C1894a24761A24416n3870g3975A48722a25913A47113d20120a6614
$$ y = [298986, 145095, -190037, 8425, -428197, 170198, -287155, -19632, 168291, 28023, 74058, 266471, -89808, 189650, -117112, 335314, -334848, 39953, -56349, 122072, -233429, 27957, 6150, 105572, 110585, 178253, 357757, 31401, 56740, 37798, 185209, -29411, 245185, 173488, -174190, 47941, 91626, 120194, 9893, -93627, 63977, -53969, -39258, 4503, 62089, 13180, 99614, 159662, -190912, 170903, 61753, 9577, 206424, 172396, 379887, -105282, 349622, -342618, -189918, -112136, -73266, 30910, 171283, 263734, 145138, 231303, -72492, 103902, -254049, -24682, -82574, 54689, 102581, 246541, 3283, 208675, -13986, 172599, -81520, -181623, -128591, 46727, 82370, 31894, -124761, 124416, 70546, -73975, 148722, -125913, 147113, -420120, -16614]
12361E0995j5505f1332A76873n5563C8091d3809j26020A34247C4557d7846F0493
12349A3531b47160a13176B67737r7719b6231B34264B2788N5597b40186A92444
12338d49161a52316j50061b7496g921A92277d1703j17317C17520B863b5491F6089
12326A76300p8756b9088B26894k951n9938a9775j22077I6876R3267a73900C40707
12314a70482A44894B5894a73974g9644C06202H5444H491J4034J28215p2207e1739
12302d82052a78911B28134a17513M420r018A49463a5056A40763C0883K20270g9017
12290a70349E1459j3933K78544I9046D6771O4255K92368a21716A20217D4b80909
12278b46974A79749b56228C46566j25118a8197B91626j5654a44355L4053B9095
$$ y = [50995, 35490, -61332, 176873, 121310, 38091, -43809, -169829, 134247, 34557, -47846, 60493, 13531, -247160, -113176, 267737, 170018, -26231, 234264, 22788, 78385, -240186, 192444, -449161, -152316, -302377, -27496, -7921, 192277, -41703, -159020, 317520, 2863, -25491, 66089, 176300, 97544, -29088, 226894, 223943, 164005, -19775, -141852, 96876, 190143, -173900, 340707, -170482, 144894, 25894, -173974, -79644, 306202, 85444, 8491, 22525, 150740, 78533, -51739, -482052, -178911, 228134, -117513, -113093, -122111, 149463, -15056, 140763, 30883, 251153, -79017, -170349, 51459, 37526, 316070, 99046, 46771, 111026, 403394, -121716, 120217, 44, -280909, -246974, 179749, -256228, 346566, 221448, -18197, 291626, 275972, -144355, -110302, 29095]
12267E9455K32165c7441C6200J68292j0893b28217h6314C59797j25725b96709
12256C09989a86966D6985J23717b18823f3584b632j42226j85950B45178a93118
12245I0212i156j31552o981L0022B67754a616H0386b8517n1085C26277A40218
12233d4729B4849J03886k6588J18040J1332J180K3303I8895L23841q9489b0819
12221F11557g9707B32319b18897A73704B4007M56819A52991h0151r9068H1816
12210b33683h6788D23372n2864D0815f7983B95416f9673l7631C99545A99622E9755
12198A33917k0706P7512d3385B60388K22113o264B02114H8213M6670h3095p9506
12187a62601A26341F0648J60211R422Q7614j25562o4157J45943r2182a17131H5317
$$ y = [59455, 291620, -37441, 36200, 204492, 193599, -228217, -86314, 359797, 234072, -296709, 309989, -186966, 46985, 170702, -218823, -63584, -2632, -144858, -330808, 245178, -193118, 90212, -9156, -140708, -147689, -117667, 267754, -1616, 80386, -28517, -79602, 326277, 140218, -44729, 24849, 128735, 102147, 220187, 231519, 232699, 256002, 98895, 422736, 333247, -20819, 611557, -79707, 232319, -218897, 173704, 24007, 480826, 152991, -80151, -179219, 81816, -233683, -86788, 423372, 370508, 40815, -67983, 295416, -69673, -107304, 399545, 199622, 59755, 133917, 113211, 190723, -43385, 260388, 482501, 476237, 202114, 88213, 134883, -83095, -162601, 126341, 60648, 220859, 230281, 317895, 192333, 128176, 274119, 181937, -117131, 85317]
12175B19700d0112C14088E7147a69827B03904J10195h6008G2953R8995j5281J75254
12164C31921j20894a06812B76715G3975a28720A48917m2037k4740C6726b6771
12153a93073E0002J2208a47079D4498L34771A03855m6329a69986C3871Q6263J90283
12142C10417M5605A38234b13706j6303D7821b57785F0599P0327k7344a49505B26885
12130a18363k36967B01259J06847A3024J16326k1212a40739J6803M3835j17884
12120a97985A91214l5095e766A36973J73875H7373k6582c36271a31656D81820
12109b50675A1225g6484a0234A6923j410b25875A058a44367B51916c3886o5698
12098i9584E9946A0766K30829q3795J31389c0056A32693j2292a21605d8856B668
$$ y = [219700, -40112, 314088, 57147, -169827, 203904, 314099, -86008, 72953, 171948, 156667, 331921, 211027, -106812, 276715, 73975, -128720, 148917, 106880, 82140, 36726, -26771, -193073, 50002, 62210, -147079, 44498, 379269, 103855, 57526, -169986, 33871, 120134, 310417, 356022, 138234, -213706, -230009, 47821, -257785, 60599, 130926, 103582, -149505, 226885, -118363, -355330, 201259, 308106, 13024, 129350, 108138, -140739, -123936, -80101, -197985, 191214, 156119, -5766, 136973, 310848, 87373, 60791, -336271, -131656, 481820, -250675, 11225, -76484, -10234, 16923, 15513, -225875, 1058, -144367, 251916, -33886, -99584, 59946, 10766, 241595, 157800, 289189, -30056, 132693, 120401, -121605, -48856, 2668]
12086A40414f7054D8292Q280J00422E2985L5773i3533B03035J04297j33886J40331
12075C13777M17205N44482m77959A28966J39900I3060J85805j24471c8372k3404
12065f1776K1835a9042D07323H1242b23374J00333e8276j04405B76507q6322F4529
12053c82885c8671E4758a25871C4183h2084D9022E08K2087a78346F0537a21172
12041h4324j47887g3514j75623A40942j0020c88714J16296R235a17235A31510
12030h3073G1601b42020m1574c9818q5076B00430P9202C26M78434e9269f52A85342
12017F0487J71039b1002j63839h0539B11735q8956E9526d3588B56446b37993Q1020
12006a56973A81856D5720a59054A06230a00635C4428a17805e3558p4332e8105
$$ y = [140414, -67054, 48292, 56572, 156994, 52985, 88758, -93533, 203035, 307332, 173446, 313777, 730982, 1275464, 797505, 128966, 268866, 93060, 278865, 154394, -38372, -61776, -39941, -19042, 407323, 81242, -223374, -123041, -58276, -162681, 276507, 190185, 64529, -382885, -38671, 54758, -125871, 34183, -82084, 49022, 508, 22595, -178346, 60537, -121172, -84324, -232211, -73514, -249137, 140942, 130922, -388714, -272418, -263183, -117235, 131510, -83073, 71601, -242020, -283594, -39818, -124894, 200430, 279632, 326, 478760, -59269, -652, 185342, 60487, 231526, -21002, -184841, -80539, 211735, 122779, 59526, -43588, 256446, -237993, -156973, 181856, 45720, -159054, 106230, -100635, 34428, -117805, -53558, -127890, -58105]
11995E9991a9637Q849A83421b07651e937G9294g9141B28666a9040A702f0192a3128
11982A26569e1534D2083K7511M5386A4333a4951A05902a99287a982n2568j2578
11971f7128D2187K19147q1996a49562L6025A63852c64025A47719a4106j62896
11961a77002B52589i479l30514a62949P3279l10695E5793J12591b07445A15863
11950A5693K02215F2062b09656B3748b93622E5175R6495b18580l6716g0973E1511
11938B92190b40219A66986E9391k8332J79051e3070I7713k021b22891A526J51650
11927A53176b18693C49950H3998a0298m75162c2440e694B96996H2328h6356A26234
11915A23747i1837l1670J266m5644F0214A6159J24080K3505Q4393h0258J7581
$$ y = [59991, -19637, -10788, 183421, -207651, -5937, 79294, -79141, 228666, -19040, 1702, -60192, -13128, 126569, -51534, 42083, 69594, 114980, 14333, -14951, 105902, -199287, -1982, -54550, -67128, 42187, 261334, 179338, -149562, -113537, 163852, -364025, 147719, -14106, -177002, 252589, -9479, -339993, -162949, -89670, -400365, 55793, 168384, -207445, 115863, 15693, 217908, 62062, -209656, 23748, -293622, 55175, 151670, -218580, -255296, -70973, 51511, 292190, -240219, 166986, 59391, 31059, 210110, -53070, 97713, 95692, -222891, 1526, 153176, -218693, 349950, 83998, -10298, -485460, -32440, -5694, 296996, 82328, -86356, 126234, 123747, -91837, -123507, -122241, -167885, 60214, 16159, 140239, 163744, 248137, -80258, -62677]
11904f2677k58871A21088B1134c24226a9143F3150d01988A55486l9141h8125G2545
11892A49256i5068B5306a33036b8188K047A16786h8241C0788Q588L6789B8323
11880A53351J22150a06081a2523l5337B02013i2001b2540B50370m2590c7029k37631
11869b74660A07706P4234c11867a40108C12206b5121o0894A69732N7586b0490
11858I0094h2359q9226r3450A72792E1369f6753j08569B04992C3954b3068r7131
11847a20199d2951m22434c2403j27187j53877E4681A3691a84461o0956N3579O8686
11836a23152A96652E0544a4072k9584k12947P8269d96j10313H0880J76076G0249
11824A72427a66841M6062m0620c3426j12491B05219j4577a41580j35734B6393
$$ y = [-62677, -321548, 121088, 21134, -324226, -19143, 63150, -401988, 155486, 116345, -88125, 72545, 149256, -95068, 25306, -133036, -28188, -26141, 116786, -88241, 30788, 39376, 76165, 28323, 153351, 275501, -106081, -12523, -47860, 202013, -92001, -22540, 250370, 207780, -37029, -274660, 107706, 181940, -311867, -140108, 312206, -25121, -86015, 169732, 227318, -20490, 90094, -82359, -171585, -265035, 172792, 51369, -66753, -175322, 204992, 33954, -23068, -120199, -42951, -465385, -32403, -159590, -313467, 54681, 13691, -184461, -245417, -191838, -123152, 196652, 50544, -14072, -43656, -256603, -178334, -496, -110809, 80880, 256956, 70249, 172427, -166841, -120779, -161399, -33426, -145917, 205219, 190642, -141580, -277314, 26393]
11813a30001j66093i3799j71308a4366l52819g0671a9304r324n9102A16682C7645
11801i4732j54014h5599k1516M5514E4977b12159g148l2157J1416B25485n9365
11790A66120Q0556j9245o9946k0708J52712i6431G2724L8493g7084A69588H1116
11778b92116B84126b18749G7650Q9485b35453a7761j77072c6982j47321H7016
11767A28844b15619B63797a49285A62236d0096q561l13189B1756a40332B3401
11756g689l50835a47334J7096M6986j66k20932C17170d43868D0309A7761J3451
11745C1212a62292F488K36131a49840i221o83B52855a02369A67347l4144i950
11733B39434B6273q094Q6511g900k02677a7625k13389L7113G426P4735J09530
$$ y = [-130001, -296094, -93799, -265107, -14366, -367185, -70671, -19304, -28628, -87730, 116682, 37645, -94732, -248746, -85599, -107115, -61601, 54977, -212159, -7148, -39305, -27889, 225485, 166120, 246676, 227431, 157485, 136777, 289489, -96431, 72724, 111217, -77084, 169588, 81116, -292116, 284126, -218749, 77650, 167135, -235453, -17761, -194833, -36982, -184303, 87016, 128844, -215619, 263797, -149285, 162236, -40096, -48657, -361846, 21756, -140332, 23401, -7689, -358524, -147334, -130238, -83252, -83418, -304350, 317170, -443868, 40309, 17761, 31212, -162292, 6488, 242619, -149840, -9221, -9904, 252855, -102369, 167347, 133203, -9950, 239434, 26273, 18179, 104690, -7900, -210577, -17625, -231014, -193901, 7426, 82161, 191691]
11722A91691a81902O6699A82240q3043i8445C06236I9568D8758K29804j12807
11712A65755b526C85422a27674N4324p0465j4927B25973b2456A23861q252J32562
11701B48171J0629A28049m7731P463b98295B1920J16581a94690C05141e0603A00568
11689A1398a467j76469L6648j15368d0159B10182O9979j16468G0579K35292b57566
11677B63406C4525d9522n840a5245C77479j30182j23570n4035J948M8276a28546
11665A25572e4509C69629A11434L128B7659L2877M6130a57387g0286j76722P7646
11654a69362d2247A37880J85332a12964C9294a26874H9821P3619b72422B21126
11643b89244D4579J67262n416q1297L5842b217D86167A89939E2171b62453P2546
$$ y = [191691, -181902, -115203, 182240, 99197, -98445, 306236, 99568, 48758, 278562, 165755, -2526, 385422, -127674, -73350, -143815, -158742, 225973, -22456, 123861, 115609, 248171, 258800, 128049, 80318, 87781, -298295, 21920, 138501, -194690, 305141, -50603, 100568, 11398, -1467, -177936, -141288, -256656, -40159, 210182, 280161, 163693, 70579, 305871, -257566, 263406, 34525, -49522, -55362, -15245, 377479, 247297, 123727, 69692, 71640, 119916, -128546, 125572, -54509, 369629, 111434, 114562, 27659, 60536, 106666, -157387, -70286, -247008, -169362, -42247, 137880, 323212, -112964, 39294, -126874, 89821, 163440, -272422, 221126, -289244, 44579, 211841, 206425, 125128, 160970, -2217, 486167, 189939, 52171, -262453, -189907]
11632a89907B57219j15896I959g2866A20663K19783A08509a0669A22708J03004
11622B25712p7959i0168A52503a85285O7291C88979a04472C1261g3252B66929
11611B14769g3873b0984B471a78867f3557k59365D4217C052c4916j24804A67708
11599c73886A86779i800C62330F5616J21105K75355A83074J39580a08089k9338
11589a37427q5260h0800C62635A11491L38606n3969F6786a54071B6042J99581
11579B25623J40235I9446b36083a3334n1673A13763L13694r9412j441J81793C457
11567b0284l50122F7438R7770n2800b64586a15214N5527j88495J0205C7259R6086
11556A33345a39100f2184B35734a71442Q0065L1685B20546g8364I206f6535A52547
$$ y = [-189907, 257219, 141323, 9959, -72866, 120663, 340446, 108509, -10669, 122708, 225712, 147753, -90168, 152503, -185285, -117994, 388979, -104472, 31261, -73252, 266929, 214769, -73873, -20984, 2471, -178867, -63557, -322922, 44217, 3052, -34916, -159720, 167708, -373886, 186779, -9800, 362330, 65616, 186721, 462076, 183074, 322654, -108089, -137427, -222687, -80800, 362635, 111491, 450097, 396128, 66786, -154071, 26042, 225623, 365858, 99446, -236083, -13334, -65007, 113763, 427457, 328045, 326604, 508397, 3457, -20284, -370406, 67438, 165208, 112408, -264586, -115214, -59687, -248182, -237977, 37259, 133345, -139100, -62184, 235734, -171442, -91377, -59692, 220546, -78364, 9206, -66535, 152547]
11544E2257K67702K14265F7755B2030L31573a14443A56243I470e920F25300C4830
11532b35752A54056d8462A15373l2109J1375O1674G0496b68291L6144A42778n1935
11521I0843M61762a18049H6426c19789A45617J73034F0388N412a40910B0112c01802
11509A02023P0777i5525H6709n921J23273J24841G4107K6085L0363j7101J16889
11498B30343a9322A34755M3194f9883A52539E9636a29116N4841E8328Q6418i773
11486D7007K36755B8609P1374b13824g6239f316B44317A7818K1447a91345A93314
11474I1073M05056A91394j0943J8379q2346K23557b0800C18479C6462M87221j68230
11463C55453j07717b10866B88735o9686A1355f6926B01886d38733b6181q5960
$$ y = [52257, 319959, 534224, 67755, 22030, 353603, -114443, 156243, 9470, -5920, 625300, 34830, -235752, 154056, -48462, 115373, 83264, 94639, 156313, 70496, -268291, -232147, 142778, 90843, 552605, -118049, 86426, -319789, 145617, 318651, 60388, 65800, -140910, 20112, -301802, 102023, 172800, -95525, 86709, 80788, 204061, 328902, 74107, 100192, 130555, 113454, 230343, -19322, 134755, 177949, -69883, 152539, 59636, -129116, -74275, 58328, 144746, -9773, 47007, 283762, 28609, 99983, -213824, -76239, -6316, 244317, 17818, 39265, -191345, 193314, 91073, 496129, 191394, 180451, 198830, 116484, 340041, -20800, 318479, 36462, 523683, 355453, 247736, -210866, 288735, 219049, 11355, -66926, 201886, -438733, -26181, -112141]
11453a12141B7440K12570N7781f4913B86139a31346K3632A49005N9515o4890R9360
11442B42990Q6655b675A65571d329C25966c39635A98734K5225a11148i573p7210
11431h6783K5864A49243a93096C84572h454A39508j9589E1099I649a75829B06
11419c1176D5099f4483C79223A28916f0893I6256K7453a08836M124A26945e1233
11407E5555J45640b4362B7821J83843c8210A60612M4819p3814L0465K6755a00904
11395D4189J01853R0236l7729Q1809r5077c67953C08269D6246a15473r090F2515
11383A66831o4790b15636e5839j24409j6979A36013b08495k7025c4368q2164j1615
11372a28147A42631B8149M1704P164B2624b4895C29028a20461o1246g0237L3830
$$ y = [-112141, 27440, 240010, 297791, -64913, 286139, -131346, -107714, 149005, 208520, 143630, 242990, 329645, -2675, 165571, -4329, 325966, -339635, 198734, 223959, -111148, -9573, -86783, -60919, 149243, -193096, 384572, -8454, 139508, 119919, 51099, 9649, -175829, 206, -31176, 45099, -64483, 379223, 128916, -60893, 96256, 123709, -108836, -104712, 126945, -51233, 55555, 201195, -24362, 27821, 211664, -38210, 160612, 205431, 131617, 162082, 188837, -100904, 44189, 146042, 236278, 198549, 280358, 185281, -367953, 308269, 46246, -115473, -124563, 62515, 166831, 102041, -215636, -55839, -180248, -197227, 136013, -208495, -235520, -34368, -116532, -128147, 142631, 28149, 69853, 77017, 22624, -24895, 329028, -120461, -181707, -70237, -36407]
11361c6407j40530j18855b6745k39990c7065A04786b66344F3494a35969A84751
11350I9609d9600A48890i9540C4700J9816a81225j99008J8609F3123b4D9224c888
11337D0660K0720a10205o6367B3485c08664N9913O1633B87655q2834r7100J6242
11326A23963l8545L4587K3680a81479a2376A76608b68964A36473L0270a3838I8781
11314a84338r7816h1442k17336b9598k0506C4462a41200C8061h1459L6451B18356
11302A72821H2735e6803A50288b80380g3435k04108J4587A92056e077I5009K02459
11291B97468C0070c9040D6164c7604m9541C3854h4332k36286F137g708A42099
11279B64044a19429j70565Q8067d5835k8215l2197j95748L7346h5442n6959I1207
$$ y = [-36407, -176937, -295792, -26745, -266735, -37065, 104786, -266344, 63494, -135969, 184751, 99609, -49600, 148890, -99540, 34700, 54516, -181225, -380233, -361624, 63123, -24, 49224, -3888, 40660, 61380, -110205, -176572, 23485, -308664, -248751, -187118, 287655, 204821, 107721, 123963, 85418, 120005, 143685, -181479, -12376, 176608, -268964, 136473, 166743, -13838, 98781, -184338, -282154, -81442, -298778, -29598, -50104, 34462, -141200, 38061, -81459, -45008, 218356, 172821, 82735, -56803, 150288, -280380, -73435, -277543, -262956, 192056, -5077, 95009, 297468, 30070, -39040, 46164, -37604, -87145, 33854, -84332, -320618, 6137, -7708, 142099, 264044, -119429, -289994, -201927, -45835, -74050, -106247, -301995, -264649, -85442, -142401, 91207]
11267a43959B1667P9351a69844I3127J36839G4928J2509c0787k0553C691b12326
11255f6226k79117g9006B95291A37710b35911B44642c56793J21030c5597C017
11244H965f7749K4274j18759A33871a4176I7121P3687P3934H1607J10967a46807
11232G4629F745a57489j43351A00683C1839b86165J02093a360j02065D2282J48330
11221A90612r4569j3989L2598a9219k46543A019a58351A65924a8061A84936A2350
11209A048b3475k79572G973P0329a32190A21004c07433a1408B7882a02538d3001
11197A98568i7631j9606n1156O5417M0920D2586J71677b96734G8896i2872D2197
11185D3952c3273B09505m6392b22761B9713K2194O4843d80303B2557J38295P5160
$$ y = [-143959, 21667, 101018, -169844, 93127, 229966, 74928, 87437, -30787, -51340, 3691, -212326, -66226, -345343, -79006, 295291, 137710, -235911, 244642, -356793, -235763, -35597, 3017, 8965, -67749, -43475, -162234, 133871, -14176, 97121, 170808, 244742, 81607, 192574, -146807, 74629, 6745, -157489, -300840, 100683, 31839, -286165, -184072, -1360, -103425, 42282, 190612, 96043, 82054, 114652, -19219, -265762, 1019, -158351, 165924, -18061, 184936, 12350, 1048, -23475, -303047, 7973, 78302, -132190, 121004, -307433, -11408, 27882, -102538, -43001, 198568, -97631, -117237, -168393, -102976, -62056, 42586, 214263, -296734, 78896, -92872, 42197, 43952, -33273, 209505, 163113, -222761, 29713, 51907, 116750, -480303, 22557, 160852, 236012]
11174B36012m2663a48471H8562b50697e6741E8544c54285a19875A52100R500b56879
11162a56852A7738m249O4453a96521p1404p1267a2179k3782F8256a88022l4699
11151b22721i051A74525F122a55198A66525b8704j64764E4902a10966n4495N4432
11140a11029E1685p248L9733a01081A22912N7707E3022J39503G773N7021k1770
11129D3024R0396P1161G3744C1482d8710j22132A66344e4558I6668O3151P0302
11118B30121a63721q94B14700D7855M031Q1418l5135l4561K8208a57570A13208
11106A8035a81525d0947j3360C58951j09595G6422R3856K59878j66332A06751
11095c5960B20993K57180B19473m9207p2425J32345J40162e5056G3642b37885
$$ y = [236012, 193349, -148471, 88562, -250697, -56741, 58544, -354285, -119875, 152100, 161600, -256879, -156852, 17738, 13489, 77942, -196521, -267925, -339192, -12179, -35961, 68256, -188022, -222721, -9051, 174525, 6122, -155198, 166525, -28704, -193468, 54902, -110966, -165461, -111029, 51685, 44437, 84170, -101081, 122912, 180619, 53022, 192525, 7773, 64794, 43024, 133420, 204581, 73744, 31482, -48710, -170842, 166344, -54558, 96668, 159819, 230121, -163721, -164615, 214700, 47855, 51886, 133304, 98169, 63608, 91816, -157570, 113208, 18035, -181525, -40947, -54307, 358951, 249356, 76422, 170278, 430156, 263824, 106751, -35960, 220993, 478173, 219473, 170266, 97841, 230186, 370348, -55056, 73642, -237885]
11084D2515a2562j05647C34220A05355B0760J04329I079J43433O2136J68960A52273
11072A46261L71591A83605a2413B96665J56653G8089N47945B53921b7338E22978
11061E36864j48636L68210C41007M37948k64969N33026D05307L10240m6394j10780
11051E58373r6239L13510k37062J98886j88392K34939K24895m48225K06219l2941
11041G33963j45324J62654J1534K4265j07203J68907D05553K42428K25890n7198
11031H16673j75777Q1145M7242o7899J73930l6007M24017D40278K73899J63546
11021H77723m35870K53454j73603K86095j35559j94532L3018J35925J39556K5158
11011H11365Q0878o8625j25498l08759K14579m3855j03631J79089K53549j2620
$$ y = [42515, -12562, -118209, 334220, 105355, 20760, 125089, 9079, 152512, 214648, 383608, 152273, 146261, 517852, 183605, -12413, 296665, 453318, 78089, 626034, 253921, -27338, 522978, 536864, 388228, 756438, 341007, 778955, 513986, 1047012, 405307, 715547, 669153, 558373, 462134, 775644, 538582, 737468, 549076, 784015, 1008910, 560685, 766904, 733963, 588639, 751293, 762827, 787092, 679889, 848796, 405553, 647981, 873871, 816673, 640896, 722041, 769283, 701384, 875314, 839307, 1263324, 440278, 714177, 877723, 441853, 695307, 521704, 807799, 672240, 477708, 510726, 646651, 786207, 811365, 892243, 823618, 698120, 389361, 603940, 560085, 456454, 635543, 889092, 876472]
11001H76472l28101M34634k54319k39481M15345D46333K44797M7935l544q8600
10991F46921L39205k96131K19639K41418E09165K74332K13315R2517r9472K01959
10981A191816l71585O90034k33764J88310M09659R1756M9638j82541O71192l01635
10971B202880J87024Q3900j8600o0275o43428j5775L1107j30204j61060K94364
10961A769933k04179O4347O1552j96882m8845L16395l87874n7096k58776J49211
10951A207786k90180k31693L2245m4378k62499R2774j34725N7873R2449j08737
10941D10915N0333A46859o7738O5431K23454n8301b2449F02434h596G9453b7984
10929a94458A00195J55615q6537c0605k17492R7218B85567e2529k53236J33943
$$ y = [876472, 548371, 983005, 728686, 489205, 904550, 446333, 691130, 739065, 735521, 646921, 986126, 689995, 909634, 1151052, 509165, 783497, 996812, 1089329, 989857, 1191816, 820231, 1510265, 1276501, 1464811, 1874470, 1966226, 2015864, 1833323, 2504515, 2202880, 2389904, 2473804, 2455204, 2394929, 1751501, 1735726, 1766833, 1636629, 1475569, 1769933, 1565754, 1630101, 1691653, 1494771, 1445926, 1762321, 1374447, 1317351, 1058575, 1207786, 917606, 685913, 718158, 673780, 411281, 504055, 369330, 427203, 519652, 410915, 461248, 146859, 79121, 144552, 368006, 309705, -22449, 602434, -8596, 79453, -27984, -194458, 100195, 255810, 169273, -30605, -248097, -150879, 285567, -52529, -305765, -171822]
10919a71822K102C5538J62323D1875c9322o7146a4677A3394a18537l1900p211
10908a57648A2808L93748b06446B4950K19206L4097c225j69548B45871c6317A52810
10896a33031n3456n0285E344B602a03110r1160A44595l9252b20130h268l7347
10885d5615A2421a07901e1072j6238B42273E7434P3295i3731A66376a73712k318
10874a76030H0133K2924c4199j11361B9358J71521q0183h0356C30037j30203R0099
10863B89933c4298o1586C9432R0143i9583k19909J31347B32910I7964J22395O8833
10852B89192a32132F1218R6092i0131b4981F4759k6939K56484F1877J03724L9817
10841B05418e8373A35471h1776n479A23202B0122J07654h8094d125k38694G9145
$$ y = [-171822, -169720, 35538, 197861, 41875, -39322, -106468, -14677, 13394, -118537, -150437, -157648, 12808, 406556, -206446, 24950, 244156, 278253, -3225, -172773, 245871, -36317, 152810, -133031, -186487, -236772, 5344, 2602, -103110, -194270, 144595, 105343, -220130, -8268, -45615, 12421, -107901, -51072, -67310, 242273, 57434, 130729, -93731, 166376, -173712, -176030, 80133, 103057, -34199, -145560, 29358, 200879, 120696, -80356, 330037, 199834, 289933, -34298, -95884, 39432, 129575, -99583, -319492, -188145, 232910, 97964, 220359, 289192, -132132, 61218, 157310, -90131, -24981, 64759, 37820, 294304, 61877, 165601, 205418, -58373, 135471, -81776, -87255, 123202, 20122, 127776, -88094, -4125, -242819, 79145]
10829i3286p0320j1878j944M0007N6533l2227m01292B1310J55835a60349r2864
10818b53213B15133j0345B3164a79220h8916k607r1827d6712j37085A2143f3417
10806i9599F9558J08087d37579a41202n1013j17235E150c51630L6392N1823d7591
10794B30351d1548m5086D4735a94635M2929b4017A03214O630c43104B08438f544
10782B22309o1261c05106C41300c25307e9007k67858i2493D8535R6159b61194
10771b03383g8308B1766K50542Q318R1698a96848k74847H1514b13576f5041K7527
10760c7514l913B8266N013L88262a69058A88956l4704K09462C0514a22524D3251
10748a6510n2622j12625d0235A40763J43580C0067A0921J25125a27390B4991M5358
$$ y = [-93286, -163606, -175484, -177428, -137421, -80888, -113115, -514407, 21310, 177145, -160349, -253213, 215133, 204788, 23164, -179220, -88916, -91523, -183350, -46712, -183797, 12143, -63417, -99599, 69558, 177645, -437579, -141202, -192215, -309450, 5150, -351630, -315238, -263415, -47591, 230351, -41548, -86634, 44735, -194635, -151706, -24017, 103214, 109844, -343104, 208438, -6544, 222309, 161048, -305106, 341300, -325307, -59007, -326865, -92493, 48535, 144694, -261194, -203383, -78308, 21766, 272308, 280626, 372324, -196848, -471695, 81514, -213576, -65041, -37514, -41427, 28266, 33279, 421541, -169058, 188956, 154252, 363714, 30514, -122524, 43251, -16510, -69132, -181757, -40235, 140763, 284343, 30067, 10921, 136046, -127390, 24991, 70349]
10737G0349A815K1520a90547g042B68599b69181H5096d1107l944j26580c0107
10725b60721a14349M6322K0937r0783a6969j90781P3912j63307J26775j8178p649
10714a96197L5791j2861n1350J737k5027N6190K7719j19195I010g6546H404K6120
10702C4524a4739q7344M1395H0988J72670a7098j46861G9010N1434g3556B1770
10690i8101B87614A16437J10372c04142e2639j31785C41614f1360J2917A05124
10679A06144D8022b14786f6116k28810q0299A17474a16733q8775a9230m1810C31358
10667a31804F4118K72877c33501A57179b10850c6745A05623b38130B00875c5347
10656a56351C0188e7948j19886p4038C52158a99767A25048h2886J9578o7912O2489
$$ y = [70349, 1815, 23335, -190547, -7042, 268599, -269181, 85096, -41107, -45051, -171631, -30107, -260721, -114349, -68027, -47090, -137873, -16969, -207750, -133838, -297145, -170370, -188548, -196197, -160406, -173267, -224617, -222880, -247907, -191717, -163998, -283193, 9010, -76546, 8404, 34524, -14739, -102083, -60688, 80988, 253658, -17098, -163959, 79010, 130444, -73556, 21770, -98101, 287614, 116437, 226809, -304142, -52639, -184424, 341614, -61360, -48443, 105124, 106144, 48022, -214786, -66116, -294926, -375225, 117474, -116733, -205508, -19230, -61040, 331358, -131804, 64118, 336995, -333501, 157179, -210850, -36745, 105623, -238130, 200875, -35347, -156351, 30188, -57948, -177834, -251872, 352158, -199767, 125048, -82886, -63308, -131220, -68731]
10645f8731j28142n7437B40046a63471e4696A75383b0856p4285k43899b1709A62302
10633i5834A85343g3608k0257a6727n7621h875j92360N4676I6108O7632F6801
10621a44327k06882I1981k8174k6066P2584e0929q7477j73323h2891A8883h8660
10609a46752k07471A47530a35511j09429l1114h1044H3139a20048A83113a20855
10598A00546e7781B47100b56072i0243n7524r2671Q4406I5629a1304H5646a93579
10586b73358F0552g6860B14722a25306K8663m12376a10968H9292M6504n6870a75691
10574C5048a42890B31012O6448d7721F8935b30478k19591B2667K6900h1968K8945
10563e3023K2772A80643a81060B6814c653q0838C32994j30693K9512N8629n4021
$$ y = [-68731, -196873, -254310, 240046, -163471, -54696, 175383, -20856, -95141, -339040, -21709, 162302, -95834, 185343, -73608, -93865, -16727, -74348, -8875, -201235, -146559, 96108, 163740, 66801, -144327, -351209, 91981, 63807, 37741, 110325, -50929, -138406, -311729, -82891, 18883, -88660, -146752, -354223, 147530, -135511, -244940, -276054, -81044, 83139, -120048, 183113, -120855, 100546, -57781, 247100, -256072, -90243, -147767, -240438, -156032, 95629, -11304, 85646, -193579, -273358, 60552, -76860, 214722, -125306, -96643, -509019, -110968, 89292, 135796, 78926, -175691, 35048, -142890, 231012, 297460, -47721, 68935, -230478, -450069, 22667, 49567, -81968, -53023, -30251, 180643, -181060, 26814, -3653, -84491, 332994, 202301, 231813, 290442, 236421]
10552B36421B1246b5235k66843D9802a02477a641A2322b93122l5815J34468D7049
10540I2439e2939k27832g0719O487A7961K85036f744A7956R6937b43978B5218
10528I4466f903k24975c8463l07691C3537a88441q4742D3942j9165M8859g0316
10516A29194P8669G571R5341N0980J53596h2640G6668b26129j30435e9169M141
10505e5028J7852B85073N6575b09595d8211r322J6473j82324g9636J0695e796
10493A89202a9802j31154f5544m88147C14856H612K34259a75048R315A96451e322
10481C37247K82049j54001J1238A03061N5735b88811a06657A48338k8219Q7476
10471B07595a96404B26272g6794A12482R9350d1840o7626C43692j65844a97779
$$ y = [236421, 21246, -25235, -292078, 49802, -102477, -1641, 12322, -293122, -328937, -194469, 47049, 92439, -52939, -280771, -70719, -64232, 17961, 302997, -6744, 17956, 114893, -243978, 25218, 94466, -6903, -231878, -38463, -346154, 33537, -188441, -273183, 43942, 24777, 73636, -70316, 129194, 207863, 7571, 102912, 153892, 307488, -82640, 76668, -226129, -356564, -59169, -55028, -37176, 285073, 341648, -209595, -48211, -57533, -41060, -223384, -79636, -68941, -5796, 189202, -19802, -150956, -65544, -553691, 314856, 8612, 242871, -175048, -165733, 196451, -5322, 337247, 619296, 465295, 476533, 103061, 158796, -288811, -106657, 148338, 120119, 207595, -196404, 226272, -76794, 112482, 211832, -41840, -109466, 343692, 177848, -197779]
10460c1657l0347j937k6875A31360g3744l3077C55906a20121B3897a42285A66202
10448A89266a27161A19810i7948m0846K4896j20127N8940j23172j22988J62348
10438b58897B3729J34561a1110j0659p0160L2896H7883a44958B91049G6405P275
10427H3680P920a22539j43788C1926l493c78902A02419C1599J37745b17210j3732
10416b30942C20144A44820a86400L4883C725a96791l29284c0623j87215A58887
10405I9628P3306f9382A05447b94179a18488a6486p4772B6608c6141d623B4549
10393A50584J07539b48558C20998G6514f2953B21876a61746A76805c1310C00853
10382A98060e5754C94637A90305H692P5667j0147a48848A24739K21824o9520J25745
$$ y = [-31657, -62004, -63941, -90816, 131360, -73744, -106821, 355906, -120121, 23897, -142285, 166202, 189266, -127161, 119810, -97948, -138794, -113898, -234025, -175085, -298257, -421245, -258897, 23729, 158290, -11110, -21769, -91929, -59033, 87883, -144958, 291049, 76405, 83680, 91600, -122539, -266327, 31926, 28433, -378902, 102419, 31599, 169344, -217210, -230942, 320144, 144820, -186400, -151517, 3725, -196791, -526075, -30623, -217838, 158887, 99628, 172934, -69382, 105447, -294179, -118488, -16486, -91258, 26608, -36141, -4623, 24549, 150584, 258123, -248558, 320998, 76514, -62953, 221876, -161746, 176805, -31310, 300853, 198060, -55754, 394637, 190305, 8692, 84359, 74212, -148848, 124739, 346563, 277043, 402788]
10371D02788J51092A5966K11115j00380J78469N3418j20388J09280J10567J12244
10361E70291k05928L29474j63836A18295e4018p7109E45126A14425J0309J65538
10351B90272J44003k6246m4523H8837M10085j99128j6223K83759k58074q2609
10341B26647R8068n5869b2411A37948o4100P4570j5799R0995f6467A45895b10156
10329D34298a19125C46843F7556M0108B8766b4486j4477A83153L08172A05758
10318H7596b30235a4016C60980C1641a2794C99914A5297P691K55918H2582g1928
10306b1500I3507a52459D1001d2346A36352i0759A18397A0892L384c00347F7470
10294d2487B47294g068q4849M0380A00227a9732j23302e362j84517g3577q332
$$ y = [402788, 553880, 15966, 227081, 126701, 305170, 358588, 238200, 347480, 458047, 570291, 364363, 693837, 530001, 118295, -54018, -131127, 545126, 114425, 124734, 290272, 434275, 408029, 363506, 88837, 498922, 299794, 283571, 567330, 309256, 226647, 324715, 268846, -22411, 137948, 73848, 148418, 132619, 223614, -66467, 145895, -210156, 434298, -119125, 346843, 67556, 107664, 28766, -24486, -38963, 183153, 491325, 105758, 87596, -230235, -14016, 360980, 31641, -12794, 399914, 15297, 22988, 278906, 82582, -71928, -21500, 93507, -152459, 41001, -42346, 136352, -90759, 118397, 10892, 14276, -300347, 67470, -42487, 247294, -7068, -91917, -51537, 100227, -19732, -143034, -5362, -189879, -73577, -81909]
10283h1909C13241e6596F9788a99144C0008a06158H9101K01729a60443C338J14029
10272A17367f3879A63109b2889B37725D5503a36312C61209G7359M2739c3536C88666
10260A74261m7070n326O296O502R9809r7820K79458A03644a99222J9611o39548
10249h19159B820h8534m8942j02486i9657a4845C9795A5396b7932C7230g6757
10237a60085C5113a73002K6424C28754b40673A46177b39480L8262h3709b187l19478
10226c21665A60890b00619I6271a07141k51954E828L3338d0184A66829a18997
10215D1343g4502k3381j4822G4818J87006a07629c2695B4173j1100J29284I137
10203A5661J08635b25794i1583l2432D5526G332J12878B7256a92163B55261a89712
$$ y = [-81909, 313241, -56596, 69788, -199144, 30008, -106158, 89101, 290830, -160443, 3338, 117367, -63879, 163109, -22889, 237725, 45503, -136312, 361209, 77359, 120098, -33536, 388666, 174261, 127191, 121865, 128161, 134663, 234472, 136652, 416110, 103644, -199222, -179611, -819159, 2820, -88534, -137476, -239962, -99657, -14845, 39795, 15396, -27932, 37230, -76757, -160085, 35113, -173002, -146578, 328754, -240673, 146177, -239480, -201218, -83709, -2187, -321665, 160890, -200619, 96271, -107141, -359095, 5828, 39166, -40184, 166829, -118997, 41343, -74502, -97883, -112705, 74818, 261824, -107629, -32695, 24173, 13073, 142357, 9137, 15661, 124296, -225794, -91583, -124015, 45526, 7332, 120210, 27256, -192163, 255261, -189712]
10191E9345c2499A09398c60428a28928k30358J67657a8261k80142B43674i895
10180a50343j10740r6626J73019A74732a35654j88751g2512A69836a59722P5170
10170h4552L2291l42315C3355g2643k47691h7670B47094d62564a50063A31337
10159d68179A37440c14365G3801b65104a08306L9060b7396j92955A06582a9226
10148D2924d31204o2177e089r9158j8589E0143e6370j27630A07978d9557A9196
10136d7073j31308f7198j03413A41422l0294b63260E5361a22106B9945L20143
10126C50088C3531a39995j53982J15239h3588A96700b06457D570a55148l31996
10116d87144A05783b1236B20354p1465g4015H8329D2413j6823q759b49446A95918
$$ y = [59345, -32499, 109398, -360428, -128928, -359286, -191629, -18261, -298403, 243674, -9895, -150343, -261083, -357709, -184690, 174732, -135654, -324405, -72512, 169836, -159722, -84552, -52261, -394576, 33355, -72643, -320334, -87670, 247094, -462564, -150063, 131337, -468179, 137440, -314365, 73801, -265104, -108306, -69246, -27396, -220351, 106582, -19226, 42924, -431204, -493381, -5089, -104247, -122836, 50143, -56370, -184000, 107978, -49557, 19196, -47073, -178381, -67198, -170611, 141422, 111128, -263260, 55361, -122106, 29945, 350088, 33531, -139995, -293977, -178738, -83588, 196700, -206457, 4570, -155148, -487144, 105783, -21236, 220354, 148889, -74015, 88329, 42413, 25590, 16831, -249446, 195918]
10104g1061l54483b06974j39k62755a81497q8593i1844n5372O6299A17998K6871
10093A44869b60658B5223a34152a9107A1204b6650j41478E3837K13650H1494f3422
10081A31826h0473q5920A18989l3231D319e9650C44853c3530r9600J3483n4536
10070a74183a6532j38150C06650L7066j45096k7313e9557B0134a58949j47345
10060c06294e5252j89350Q2526o7922A60191b10425A01352h6371B17698c83825
10049a6755A12627b99427A80798h4714m6073J3343A63756a57845H403c61383C65710
10037b59783A51982c2207Q94D1124a03838L6104m22k05016c2119H7040g2j97489
10025a97561j57399E6975g4366m3352A39748A7165J06974R7754l357F7892P1816
$$ y = [-71061, -425544, -206974, -207113, -469868, -181497, -270090, -91844, -147216, -80917, 117998, 144869, -260658, 25223, -134152, -19107, 11204, -26650, -168128, 53837, 267487, 81494, -63422, 131826, -80473, -166393, 118989, 85758, 4319, -59650, 344853, -33530, -133130, -119647, -174183, -16532, -154682, 306650, 343716, 198620, 171307, -59557, 20134, -158949, -306294, -55252, -244602, -162076, -229998, 160191, -210425, 101352, -86371, 217698, -383825, -16755, 112627, -299427, 180798, -84714, -130787, -117444, 163756, -157845, 8403, -361383, 365710, -259783, 151982, -32207, -31313, 41124, -103838, -67734, -68156, -273172, -32119, 87040, -72, -197561, -354960, 56975, -74366, -117718, 139748, 17165, 124139, 221893, 218536, 67892, 139708]
10014A39708l6437b41783B86605e4782B68260H3697p893B6554a33603C13571a35940
10002A07692f4013H3214a06527K4610b3678j59940N8187n2010O6012L7317B69860
9990b02000K3148O8215B9292d60490a49126H8441O656a145C0172b4191j3766j50811
9978a88768O6677j56619k6974G7753c10468f4155B40453F7917c66415B77177Q5746
9967C62923c10790i7658j8644j43271P8606p3521J5143Q7999L5094k03892k0188
9956c40332h5671j0665B07170M6000p1976b8551F584a45807A51331i0438K3356
9945f7082C67656b55282I4081a92661C15969b28065c3234m03201a21169G2680
9934b2205k53564B41502a91688f251m469H960b45507h7874k48794a34351B0374
$$ y = [139708, 103271, -241783, 286605, -54782, 268260, 83697, 75804, 26554, -133603, 313571, -135940, 107692, -64013, 83214, -106527, -81917, -23678, -183618, -125431, -177441, -111429, -74112, 269860, -202000, -178852, -110637, 29292, -460490, -149126, 88441, 95097, -1145, 30172, -24191, -37957, -188768, -122091, -278710, -305684, 77753, -310468, -64155, 240453, 67917, -366415, 277177, 362923, -310790, -97658, -116302, -259573, -180967, -254488, -239345, -151346, -116252, -320144, -340332, -85671, -96336, 207170, 253170, 181194, -28551, 6584, -145807, 151331, -90438, -67082, 367656, -255282, 94081, -192661, 315969, -228065, -33234, -436435, -121169, 72680, -22205, -275769, 241502, -191688, -6251, -10720, 8960, -245507, -87874, -336668, -134351, 20374]
9922h0933L0421A58287h3951p9388O9137l3412j23291B32317e2269I8706a55239
9910B7685a79844p149H2367h3894C7659K83761c52011J10316J13483p3152r8417
9899b99781b9289k49551a23375I2673d06113a93950A52324b10592B35833A4138
9888e9611A0492L3549d4489p7000d9976k46027J31826J2814j54430a33647d6391
9876C05108g4065A1018g5451A0087b01980H6763a5196l7094j48249D80e510j00391
9864a05901j08676l2528M3352R4662A58441d5204l5613J6556j71207f2931B25153
9852a75151C4617K1630J09279J3201C4577g1767h496a675I1432j2845J66034a06705
9839a63608l51095a74851G0816a14496K4561C89076a52517A28379b03425H9240
$$ y = [-80933, -50512, 158287, -83951, -163339, -94202, -127614, -250905, 232317, -52269, 98706, -155239, 27685, -179844, -186993, 82367, -83894, 37659, 321420, -352011, -241695, -128212, -201364, -299781, -29289, -278840, -123375, 92673, -406113, -193950, 152324, -210592, 235833, 14138, -59611, 10492, 44041, -44489, -121489, -49976, -296003, -164177, -151363, -305793, -133647, -46391, 305108, -74065, 11018, -75451, 10087, -201980, 86763, -15196, -52290, -200539, 480, -5510, -105901, -214577, -247105, -203753, -109091, 158441, -45204, -80817, -64261, -235468, -62931, 225153, -175151, 34617, 56247, 165526, 178727, 34577, -71767, -8496, -1675, 91432, 78587, 244621, -106705, -163608, -514703, -174851, 70816, -114496, -89935, 389076, -152517, 128379, -203425, 89240]
9828b50377q4360J31585l1168A88694b4223m9925m8443A98002a30106H8938g3272
9816a36836B62164K1205J27174b52702i0071n6950O3504B34514A5555a49258j9913
9805a69171l269A1453f8739j23771E1220N6691a78288A27732a40302k87974Q6231
9794c42045a37070n143L4138A14592E1259E51b41632k8332a30878M917F2386M8311
9782A10697f0483C5262M6169l7856J94011G1596a14401j04406e3198j71535d0252
9770a68216G9229g6058A06473A7493b23290a4015n7477A04579a51202A12313e7950
9758D9229c5982m355k01038C33521A393a52343H6082J89086a04227j31827A3269
9746b62568A27714b01962A50255d4601o830e349l51698A59779a68296L9236A01064
$$ y = [-250377, -334737, -203152, -234320, 188694, -24223, -74148, -122591, 198002, -130106, 88938, -73272, -136836, 262164, 283369, 410543, -252702, -90071, -147021, -83517, 234514, 15555, -149258, -169171, -172440, 11453, -68739, -192510, 51220, 107911, -178288, 127732, -140302, -428276, -342045, -137070, -142213, -108075, 114592, 51259, 551, -241632, -269964, -130878, -125961, 62386, 110697, -60483, 35262, 81431, 43575, 237586, 71596, -114401, -218807, -53198, -224733, -40252, -168216, 79229, -76058, 106473, 17493, -223290, -14015, -71492, 104579, -151202, 112313, -57950, 49229, -35982, -40337, -241375, 333521, 1393, -152343, 86082, 275168, -104227, -236054, 13269, -262568, 127714, -201962, 150255, -44601, -51431, -5349, -357047, 159779, -168296, -129060, 101064]
9734a68620L2698J5794G6066b19924P6609L0769r012F3694A724b23067B51133
9722D5835O8269c9618o9499l8196j24548o7451d6590K1529g341j68759B98598
9710G8201a05350K7789L5837A73160I549h5742K7970B60542a82001k27116i2805
9698b11774N3982m8775f0125q4754f149j92125A69495a41957l8201m996e7831
9686e6820j43916l51925B0439K6696b19720A29394c8119B3120h4401j58214J00010
9675a42605K7990l0263A43615A4703h0960j21379i9441k58346a3153l87944j34939
9664e36036a07938j15629h322A67794o417M4987b38930A99416b21489C7085Q3735
9653A20820a72921j81905F7767P0328a02622j20646o3543A86191b22250J03660
$$ y = [-168620, -135922, -120128, 76066, -219924, -143315, -112546, -121558, 63694, 1724, -223067, 251133, 45835, 114104, -39618, -109117, -147313, -271861, -339312, -46590, -25061, -7341, -176100, 298598, 78201, -105350, -77561, -41724, 173160, 9549, -85742, -57772, 260542, -182001, -409117, -92805, -211774, -157792, -206567, -60125, -144879, -6149, -198274, 169495, -141957, -180158, -185154, -57831, -56820, -200736, -552661, 20439, 47135, -219720, 129394, -38119, 23120, -84401, -242615, -142605, -114615, -144878, 143615, 14703, -80960, -202339, -99441, -357787, -13153, -401097, -536036, -107938, -223567, -8322, 167794, 161377, 206364, -238930, 199416, -221489, 37085, 120820, -172921, -354826, 67767, 138095, -102622, -223268, -286811, 186191, -222250, -118590]
9643a18590a7831j01001b9267o8099J6884A15293a65122B04371p0301k3151E0183
9631g193l83488J82223P2699F844e3777I5728J75855Q0137F3072N3778A2038K48538
9619B60576f5723p2562k6909N2996N5091j58004J0A26416b3510j33379K446B18611
9606b03949C06577G1931a67839l78491b68499c6286i103E1772c47030J06098C3235
9594i0114j02810Q4866A49951G3459Q6723h5583j05569c771o4968A18906C7404
9582a32142r2016M7012e1575B3744i4796l6381K1699m7697a685p918B13995F5738
9569a77193A9245J12117D4562J10144E8579P2237J64847n9763j4298a47506o5134
9558b12640e212G5456Q769A6564e8363j24923A13692b26070g9535A72399b53342
$$ y = [-118590, -17831, -118832, -29267, -97366, -80482, 115293, -165122, 204371, 134070, 110919, 50183, -7193, -390681, -208458, -135759, 6844, -53777, 95728, 271583, 351720, 63072, 116850, 12038, 260576, -65723, -138285, -165194, -112198, -57107, -215111, -215101, 126416, -23510, -156889, -154443, 218611, -203949, 306577, 71931, -167839, -546330, -268499, -36286, -9103, 51772, -347030, -240932, 33235, -90114, -192924, -108058, 149951, 73459, 160182, -85583, -191152, -3771, -68739, 118906, 37404, -132142, -224158, -177146, -51575, 23744, -94796, -131177, -109478, -157175, -1685, -9603, 213995, 65738, -177193, 19245, 131362, 44562, 154706, 58579, 130816, 295663, 235900, 221602, -147506, -212640, -5212, 75456, 84225, 16564, -58363, -183286, 113692, -226070, -79535, 172399, -253342]
9546B10898b17807P3672c2424j62531g1118l04696a32332q2203j16855J13315
9536b18075I2561L8602h982k43458h2822k2983n2770b9685p1366k0580F0596d0073
9523A22350c30173B57102d2720F1697i7176E0844k5031J76002a55397C5421b74418
9511i0113A4324b83954I0838a93318e9708j76100B38115A7341a08970C7802M5557
9500H3359c2239k33594i9421n039I2095b65397a19581A20431D7150F824O0912
9489F7736R7599c69941a69565j84227f9118k01489J8785A76697a24119N4605l1036
9478a00550F9295J0811c7144A32598a93488i0425A40532b49997J13979B14555
9467C37420A49367d7223J1610E4961k0901N3496J55810f2339A72771o2272a92293
$$ y = [210898, -217807, -144135, -32424, -194955, -71118, -375814, -132332, -214535, -331390, -218075, 92561, 131163, -8982, -252440, -82822, -105805, -158575, -29685, -101051, -121631, 60596, -40073, 122350, -330173, 257102, -42720, 61697, -97176, 50844, 25813, 201815, -155397, 35421, -274418, -90113, 14324, -283954, 90838, -193318, -59708, -235808, 238115, 17341, -108970, 37802, 83359, -32239, -265833, -99421, -104460, 92095, -265397, -119581, 120431, 47150, 6824, 67736, 165335, -369941, -169565, -353792, -69118, -270607, -251822, 176697, -124119, -69514, -100550, 69295, 80106, -37144, 132598, -193488, -90425, 140532, -249997, -136018, 214555, 337420, 149367, -47223, -35613, 54961, 34060, 87556, 243366, -62339, 172771, 110499, -192293]
9455b49264i1225A87588b28254I7442O4361b06499A29959a81073p551O9415A00172
9443h9019A42379a16607A19090b48250e6850j08524g5028c5047A66268b6710j74522
9432b01232F9804C0669b19271H0456b07092J2970D6523N3224b74083A32896a62817
9420b69731K0636K6820A35771o4747d9368q9420l3560f7851C2262a53044p2586
9409b25630P2997k9023o9036B02760b94440D28922a63078D6627e0806k01686B85740
9397c1458C7793d5551k76189A29237H004b45189k4882B75830e7054C81952b37526
9385f4180B9305f9311j68497A82714b65600a8959j99043Q5474k47676a83479k0014
9374b03493O5159A34613b91026a13856J8696q7274I1692O132D2869c5607j50556
$$ y = [-249264, -91225, 187588, -228254, 97442, 161803, -206499, 129959, -181073, -188624, -119209, 100172, -89019, 142379, -116607, 119090, -248250, -56850, -165374, -75028, -35047, 166268, -26710, -201232, 69804, 30669, -219271, 80456, -207092, -194122, 46523, 99747, -274083, 132896, -162817, -269731, -249095, -222275, 135771, 71024, -49368, -138788, -172348, -67851, 32262, -153044, -225630, -152633, -181656, -250692, 202760, -294440, 428922, -163078, 46627, -50806, -252492, 285740, -31458, 37793, -45551, -321740, 129237, 8004, -245189, -270071, 275830, -57054, 381952, -237526, -64180, 29305, -69311, -237808, 182714, -265600, -18959, -218002, -132528, -380204, -183479, -203493, -138334, 134613, -291026, -113856, -95160, -182434, 91692, 97824, 42869, -35607, -186163]
9363a86163P0546j16651a06742k94434e4375o6653J2244j59288A91361c14324
9352A72577K2345p673a63096B04446g3308E4916a76560K1424B01632g281j41412
9341a48693f2117K8764I8573l9057J15715B1544Q884J06431K21195e7219k21282
9330b78501D300h3944j51494d2140G6410a62348A60410c00798J33521F0026c48008
9318a7740A60188E7910a09373r2490E4966e7607j4046c2254B2276a77317D9828
9306b64840E7069D107h6641D2630q509a4301I8591J5516A3850a41028e3987j39180
9294a93167L8526D9679J87126a96740C42415d8222E645K67224a86724A9717g0690
9282b51470e2261A69713a76992N1852a0873G0829d6192k56783F373b26275F4674
$$ y = [-186163, -115617, -232268, -106742, -401176, -54375, -121028, -108784, -268072, 191361, -314324, 172577, 194922, 187249, -163096, 204446, -73308, 54916, -176560, -155136, 201632, -7281, -148693, -62117, -33353, 98573, 59516, 175231, 21544, 30428, 136859, 358054, -57219, -278501, 4300, -83944, -235438, -42140, 76410, -162348, 160410, -300798, -167277, 60026, -348008, -17740, 160188, 57910, -109373, -201863, 54966, -57607, -71653, -32254, 22276, -177317, 49828, -264840, 57069, 4107, -86641, 42630, 34121, -14301, 98591, 114107, 13850, -141028, -53987, -193167, -154641, 49679, 236805, -196740, 342415, -48222, 5645, 272869, -186724, 19717, -70690, -251470, -52261, 169713, -176992, -125140, -10873, 70829, -46192, -302975, 6373, -226275, 64674]
9270b10692a3516G886J7329K50559g8974o9535g3885C5031J68621H8032L29249
9259D17281a53955m10590A38239a10123H0275M1850e7395H0962d3610A21869b04646
9247c73773c9980k25648c8924H9129a46053N2584k34755a53969I5414b6949j44362
9236a71311D42K02130F7369a90205G4514b95191C404b18846n0690e0918D3823
9224b5815A11993L00505a15055N4484k32107i0862E6719b86662B4933d1273j65846
9213b07119F0573Q2611a47225C13446g9536C90636A27869a48663B0176b03359
9202a18387N4144A14443a00339q8258Q2577B46088j05564a70455r430d8506n65080
9191f13586F7706k3921L9008a47078B09142g4854j19361A20451m3067a84107A15213
$$ y = [-210692, -13516, 7886, 25215, 275774, -78974, -148509, -73885, 35031, 203652, 88032, 417281, -153955, -564545, 138239, -110123, 80275, 122125, -57395, 80962, -43610, 121869, -204646, -373773, -39980, -265628, -38924, 89129, -146053, -93469, -328224, -153969, 95414, -26949, -171311, 442, 202572, 67369, -190205, 74514, -295191, 3404, -218846, -269536, -50918, 43823, -25815, 111993, 412498, -115055, -60571, -292678, -90862, 56719, -286662, 24933, -41273, -207119, 60573, 143184, -147225, 313446, -79536, 390636, 127869, -148663, 20176, -203359, -118387, -64243, 114443, -100339, -188597, -106020, 246088, 140524, -170455, -179885, -48506, -613586, 67706, 43785, 82793, -147078, 209142, -74854, -194215, 120451, 77384, -184107, 115213]
9179G8652c78131H8278f0121k7801k12008d0155A19754a35739E284h9568n8516
9168a48084K0594j57432A15721e6121o7270H7769b27040b2227j70792A37610b41
9156e4114j19969B75361c17787a677A33495b42260H7864N3327E0927d16611E6417
9144g5591c5028C51026A69720a6685M244j81412f6164q7002B2548P1800a41497
9132g1487j42223g2679j35033d2027A91511c05309B07807a27287J7987k6336B21018
9120a3306B08161c23985J59031h494j58588c9606A94695a87041k4175f4604j06944
9109a71548l4007m6371J21117C3514b00776I2057c7105o5932A6653J17401a56992
9097D1684j1735N69P0935k986d7119r3193j30166d017n4489l56621a70448j21074
$$ y = [78652, -378131, 88278, -60121, -87922, -299930, -40155, 119754, -135739, 5284, -89568, -148084, -127490, -284922, 115721, -56121, -123391, 87769, -227040, -22227, -193019, 137610, -241, -54114, -174083, 275361, -317787, -1677, 133495, -242260, 87864, 141191, 50927, -416611, 56417, -75591, -35028, 351026, 169720, -16685, -12441, -193853, -66164, -153166, 22548, 94348, -141497, -71487, -213710, -72679, -207712, -42027, 191511, -305309, 207807, -127287, -109300, -135636, 221018, -13306, 208161, -323985, -164954, -8494, -167082, -39606, 194695, -187041, -211216, -64604, -171548, -205555, -251926, -130809, 33514, -200776, 92057, -37105, -103037, 16653, 134054, -156992, 41684, 29949, 30518, 101453, 98467, -47119, -140312, -270478, -4017, -58506, -415127, -170448, -291522]
9085b91522c9266k18796d8705j90362c2067j11923C77874e4746l44578a67930
9074I970K76284d5461l804E833a27814p1653L417J8501B9747J71489e9077B23482
9061A01806b75358a06203D6282O1213e222n6368F2538g6391A13846N7800J12046
9050B83692l3174a68866N6658j70722O9773O6969o826E7193a74390A09976i451
9038h5232B1215e0296m59584f1198r6455A77587a6281n8033F9150B2939c3174
9026a50974C3704a07653j24300a9494F993i1595A21853c06365I2689d2284q8270
9015a30554L8234j12712L0101P2280B6864K2489g3642m8469j2597n8105M2786
9004a50027M8087j807k19179A72686B394a32726j86392A63640L9694E9257Q4590
$$ y = [-291522, -39266, -258062, -48705, -239067, -32067, -143990, 377874, -54746, -399324, -167930, 9970, 286254, -45461, -49265, 5833, -127814, -199467, -196050, -177549, 29747, 201236, -59077, 223482, 101806, -275358, -106203, 46282, 107495, -5222, -61590, 62538, -76391, 113846, 171646, 283692, 250518, -168866, -112208, -282930, -213157, -146188, -153014, 57193, -174390, 109976, -9451, -85232, 21215, -50296, -509880, -61198, -157653, 177587, -16281, -74314, 69150, 22939, -33174, -150974, 33704, -107653, -231953, -19494, 6993, -91595, 121853, -306365, 92689, -42284, -130554, -92320, -205032, -174931, -102651, 26864, 49353, -73642, -122111, -134708, -192813, -150027, -101940, -103747, -322926, 172686, 2394, -132726, -319118, 163640, 203334, 59257, 143847]
8993A43847C7273a18681M6353b2803l8779A98568H8893K37623l4791B6831c33792
8981A29207D7115c01806d056l13783D3326a5495F7036a00547k79692J04656a4073
8969g6352j91623R6796B32287c6160j00247I5798a20102q4185i8197d99E3742
8957B94810d9488A98328n5136F1808K94561b49615B66529a00808j25589f2845
8946c1840k3790j89945A7150a45180f6491A25527e2414m6710A16536c5071A14566
8934D00079r8184C3102A5555L32601A39340m5384L77016m3846K24726M53116L49058
8923A454026K312226N342997l308129B442613j069248o65710l10436q7420K85455
8914E95254j25451B04741J83018Q909j82611I9729M96366G1453J72969k8245h8898
$$ y = [143847, 37273, -118681, -72328, -22803, -61582, 198568, 88893, 326516, 291725, 26831, -333792, 129207, 47115, -301806, -4056, -317839, 43326, -15495, 67036, -100547, -380239, -275583, -14073, -76352, -267975, -171179, 232287, -36160, -136407, 95798, -120102, -204287, -98197, -499, 53742, 294810, -49488, 198328, 143192, 61808, 356369, -249615, 266529, -100808, -226397, -62845, -31840, -55630, -245575, 17150, -145180, -66491, 125527, -52414, -99124, 116536, -35071, 114566, 400079, 301895, 33102, 15555, 348156, 139340, 93956, 470972, 427126, 651852, 1104968, 1454026, 3766252, 9109249, 5801120, 2442613, 1373365, 707655, 397219, 309799, 595254, 469803, 204741, 387759, 396668, 214057, 99729, 596095, 71453, 244422, 216177, -88898]
8902D58489H8867c9820H3223b23050A46848F8648A9358M9514b26085F3390c77923
8890D7634b67646N4743i7802D0414a50330g5118b4359a0683j00617A30340a489
8878A7454J52271d6011A8316o823f7471A84931l2338h1790i033J897k1142A27504
8865c0028D7606A7389K73308d8531m0808e376k10086K3843F739c72528a44585
$$ y = [458489, 88867, -39820, 83223, -223050, 146848, 68648, 19358, 68872, -226085, 63390, -377923, 47634, -267646, -212903, -97802, 40414, -150330, -75118, -24359, -10683, -111300, 130340, -1489, 17454, 169725, -46011, 18316, 11493, -67471, 184931, 152593, -81790, -9033, -7136, -28278, 127504, -30028, 47606, 17389, 290697, -48531, -89339, -5376, -215462, -191619, 6739, -372528, -144585]
$$ [...]
##END NTUPLES=NMR SPECTRUM
##END=
