
##TITLE=AC1243_NTAAH12033_6945137_80XQF47wmx
##JCAMPDX= 6.0         $$ Bruker NMR JCAMP-DX V2.0
##DATA TYPE= NMR SPECTRUM
##DATA CLASS= NTUPLES
##ORIGIN= BRUKER
##OWNER= Administrator
$$ 1.72 TOPSPIN		Version 2.1
$$ 2012-10-18 13:44:08.771 -0700  Administrator@X
$$ Compression mode = diff/dup
##.OBSERVE FREQUENCY= 400.02188249412
##.OBSERVE NUCLEUS= ^1H
##.ACQUISITION MODE= SIMULTANEOUS (DQD)
##.ACQUISITION SCHEME= undefined
##.AVERAGES= 64
##.DIGITISER RES= 22
##SPECTROMETER/DATA SYSTEM= spect
##.PULSE SEQUENCE= noesygpps1d.comp
##.SOLVENT NAME= COFFEE_meoh
##.SHIFT REFERENCE= INTERNAL, COFFEE_meoh, 1, 14.96076
##AUDIT TRAIL= $$ (NUMBER, WHEN, WHO, WHERE, PROCESS, VERSION, WHAT)
$$ ##TITLE= Audit trail, TOPSPIN		Version 2.1
$$ ##JCAMPDX= 5.01
$$ ##ORIGIN= Bruker BioSpin GmbH
$$ ##OWNER= Administrator
$$ $$ C:\Bruker\TOPSPIN/data/COFFEE/nmr/AC1243_NTAAH12033_6945137_80XQF47wmx/12/pdata/1/auditp.txt
$$ ##AUDIT TRAIL=  $$ (NUMBER, WHEN, WHO, WHERE, PROCESS, VERSION, WHAT)
(   1,<2012-10-13 18:53:21.671 -0500>,<Administrator>,<TOPSPIN>,<go>,<TOPSPIN 2.1>,
      <created by zg
	started at 2012-10-13 18:41:51.468 -0500,
	POWCHK enabled, PULCHK disabled,
       configuration hash MD5:
       6B 1B 68 BB D9 2E 58 E2 7F 35 AD 54 07 DF 0E 41
       data hash MD5: 64K
       2E 3B A8 CC 4C C4 C8 D8 25 49 5E 0B D4 69 2E EC>)
(   2,<2012-10-13 18:53:24.515 -0500>,<Administrator>,<TOPSPIN>,<proc1d>,<TOPSPIN 2.1>,
      <Start of raw data processing
       efp LB = 0.3 FT_mod = 6 PKNL = 1 PHC0 = 0 PHC1 = 0 SI = 128K 
       data hash MD5: 128K
       4B 16 A2 15 6B FA 72 67 A9 7C 9F D0 1F 36 75 48>)
(   3,<2012-10-13 18:53:25.609 -0500>,<Administrator>,<TOPSPIN>,<proc1d>,<TOPSPIN 2.1>,
      <pk PHC0 = 3.543091 PHC1 = 0 
       data hash MD5: 128K
       F7 E0 BA 1F 84 CF 35 7D F9 A6 29 9B DF 88 E9 28>)
(   4,<2012-10-13 18:53:25.843 -0500>,<Administrator>,<TOPSPIN>,<proc1d>,<TOPSPIN 2.1>,
      <abs ABSG = 1 
       data hash MD5: 128K
       B5 99 60 82 47 30 52 4E 22 7C 1D 84 83 3A 4E 7F>)
(   5,<2012-10-13 18:53:25.921 -0500>,<Administrator>,<TOPSPIN>,<proc1d>,<TOPSPIN 2.1>,
      <abs ABSG = 2 
       data hash MD5: 128K
       F1 E2 7B 32 2F 36 F5 42 0F 67 34 EC 8F 25 F7 2A>)
(   6,<2012-10-13 18:53:26.031 -0500>,<Administrator>,<TOPSPIN>,<proc1d>,<TOPSPIN 2.1>,
      <abs ABSG = 3 
       data hash MD5: 128K
       25 B9 CD 37 8B ED 93 65 C7 62 C0 14 4C 63 89 45>)
(   7,<2012-10-13 18:53:26.203 -0500>,<Administrator>,<TOPSPIN>,<proc1d>,<TOPSPIN 2.1>,
      <abs ABSG = 4 
       data hash MD5: 128K
       F1 8B 84 C6 64 D9 CB 44 B8 16 91 66 65 AF 61 04>)
(   8,<2012-10-13 18:53:26.265 -0500>,<Administrator>,<TOPSPIN>,<proc1d>,<TOPSPIN 2.1>,
      <abs ABSG = 5 
       data hash MD5: 128K
       A9 59 6E A7 60 5E 49 CB 3D 83 9D 22 BE FB 8A 97>)
(   9,<2012-10-13 18:53:26.500 -0500>,<Administrator>,<TOPSPIN>,<audit>,<TOPSPIN 2.1>,
      <user comment:
       ICON-NMR User ID: COFFEE
       data hash MD5: 128K
$$ [...]
##$TP07= 0
##$TPNAME0= <>
##$TPNAME1= <>
##$TPNAME2= <>
##$TPNAME3= <>
##$TPNAME4= <>
##$TPNAME5= <>
##$TPNAME6= <>
##$TPNAME7= <>
##$TPOAL= (0..7)
0.5 0.5 0.5 0.5 0.5 0.5 0.5 0.5
##$TPOFFS= (0..7)
0 0 0 0 0 0 0 0
##$TUNHIN= 0
##$TUNHOUT= 0
##$TUNXOUT= 0
##$USERA1= <user>
##$USERA2= <user>
##$USERA3= <user>
##$USERA4= <user>
##$USERA5= <user>
##$V9= 5
##$VALIST= <valist>
##$VCLIST= <CCCCCCCCCCCCCCC>
##$VD= 0
##$VDLIST= <DDDDDDDDDDDDDDD>
##$VPLIST= <PPPPPPPPPPPPPPP>
##$VTLIST= <TTTTTTTTTTTTTTT>
##$WBST= 2048
##$WBSW= 25
##$XGAIN= (0..3)
0 0 0 0
##$XL= 0
##$YL= 0
##$YMAX_a= 12528696
##$YMIN_a= -9401335
##$ZGOPTNS= <>
##$ZL1= 120
##$ZL2= 120
##$ZL3= 120
##$ZL4= 120
##$ABSF1= 14.96076
##$ABSF2= -5.597422
##$ABSG= 5
##$ABSL= 3
##$ALPHA= 0
##$AQORDER= 0
##$ASSFAC= 0
##$ASSFACI= 0
##$ASSFACX= 0
##$ASSWID= 0
##$AUNMP= <proc_prof1d_extract.lims>
##$AXLEFT= 0
##$AXNAME= <>
##$AXNUC= <1H>
##$AXRIGHT= 0
##$AXTYPE= 0
##$AXUNIT= <>
##$AZFE= 0.1
##$AZFW= 0.1
##$BCFW= 0
##$BC_mod= 0
##$BYTORDP= 0
##$COROFFS= 0
##$CY= 15
##$DATMOD= 1
##$DC= 0
##$DFILT= <>
##$DTYPP= 0
##$F1P= 0
##$F2P= 0
##$FCOR= 0.5
##$FTSIZE= 131072
##$FT_mod= 6
##$GAMMA= 0
##$GB= 0
##$INTBC= 1
##$INTSCL= 1
##$ISEN= 128
##$LB= 0.3
##$LEV0= 0
##$LPBIN= 0
##$MAXI= 10000
##$MC2= 0
##$MEAN= 0
##$ME_mod= 0
##$MI= 0
##$NCOEF= 0
##$NC_proc= -2
##$NLEV= 6
##$NOISF1= 0
##$NOISF2= 0
##$NSP= 0
##$NTH_PI= 0
##$NZP= 0
##$OFFSET= 14.96076
##$PC= 1
##$PHC0= 3.543091
##$PHC1= 0
##$PH_mod= 1
##$PKNL= yes
##$PPARMOD= 0
##$PPDIAG= 0
##$PPIPTYP= 0
##$PPMPNUM= 2147483647
##$PPRESOL= 1
##$PSCAL= 4
##$PSIGN= 0
##$PYNMP= <proc.py>
##$REVERSE= no
##$SF= 400.020009734278
##$SI= 131072
##$SIGF1= 0
##$SIGF2= 0
##$SINO= 400
##$SIOLD= 131072
##$SPECTYP= <>
##$SREGLST= <1H.CDCl3>
##$SSB= 0
##$STSI= 131072
##$STSR= 0
##$SW_p= 8223.68421052631
##$SYMM= 0
##$S_DEV= 0
##$TDeff= 65536
##$TDoff= 0
##$TI= <>
##$TILT= no
##$TM1= 0
##$TM2= 0
##$TOPLEV= 0
##$USERP1= <user>
##$USERP2= <user>
##$USERP3= <user>
##$USERP4= <user>
##$USERP5= <user>
##$WDW= 1
##$XDIM= 131072
##$YMAX_p= 316380242
##$YMIN_p= -10742
##$CURPLOT= <Network HP LaserJet P1505>
##$CURPRIN= <$Network HP LaserJet P1505>
##$DFORMAT= <normdp>
##$LAYOUT= <+/1D_H.xwp>
##$LFORMAT= <normlp>
##$PFORMAT= <normpl>
##$SURQMSG= 1
$$ End of Bruker specific parameters
$$ ---------------------------------
##NTUPLES= NMR SPECTRUM
##VAR_NAME=  FREQUENCY,     SPECTRUM/REAL,   SPECTRUM/IMAG
##SYMBOL=    X,             R,               I
##VAR_TYPE=  INDEPENDENT,   DEPENDENT,       DEPENDENT
##VAR_FORM=  AFFN,          ASDF,            ASDF
##VAR_DIM=   131072,        131072,          131072
##UNITS=     HZ,            ARBITRARY UNITS, ARBITRARY UNITS
##FACTOR=    0.0627417313425164, 1,          1
##FIRST=     8223.62146879497, 697,          -63833
##LAST=      0,             2381,            -63739
##MIN=       0,             -10742,          0
##MAX=       8223.62146879497, 316380242,    0
$$ Real data points
##PAGE= N=1
##DATA TABLE= (X++(R..R)), XYDATA
$$ [...]
64009C60749k915l017l157k715j697r73j257j974j740nK153L192K782J971J899
63994C53296K703L741M447M765M987N408O089O798P208P232P101P088P262P590
63980D35715Q125Q977J0106J1267J2149J2587J2692J2788J3088J3467J3752J4141
63968E78854J5047J6417J7669J8546J9603K1428K3623K5279K6341K7792L0280
63957H20879L3162L5447L7237L9742M3944M9740N6375O3355P0718P8771Q7696
63946A417066R7309J07004J16070J24210J31728J39032J45923J51496J54824J55565
63936B740227J53778J49299J41627J30423J15831R8169P7776N5343L2046Q796
63926C703315j4363l7674o0657q2257j01807j19068j33360j43591j49571j52482
$$ plain form
64009 360749 357834 354817 351660 348945 347248 346275 345018 343044 341304 341299 343452 346644 349426 351397 353296
63994 353296 355999 359740 364187 368952 373939 379347 385436 392234 399442 406674 413775 420863 428125 435715
63980 435715 443840 452817 462923 474190 486339 498926 511618 524406 537494 550961 564713 578854
63968 578854 593901 610318 627987 646533 666136 687564 711187 736466 762807 790599 820879
63957 820879 854041 889488 926725 966467 1010411 1060151 1116526 1179881 1250599 1329370 1417066
63946 1417066 1514375 1621379 1737449 1861659 1993387 2132419 2278342 2429838 2584662 2740227
63936 2740227 2894005 3043304 3184931 3315354 3431185 3529354 3607130 3662473 3694519 3703315
63926 3703315 3688952 3651278 3590621 3508364 3406557 3287489 3154129 3010538 2860967 2708485
63916B708485j53492j52531j49031j43248j36013j27643j18012j07567r7334q7917
63906A435697p9236p1233o4046n7421n0872m4657l9712l6204l2997k9107k5031
63895I05181k1957k0164j8938j7730j6573j5552j4594j3806j3389j3126j2466
63884G26886j1228r768q377o908n140l173j246N37K165L612M964O421Q042R590
63870G16377J0773J1558J2131J2687J3276J3803J4048J3813J3039J1820J0329
63859H53654Q751P255N856M311K322j31k721n101p260r446j1755j3828j5107j5498
63845H01302j5671j6494j8134j9914k1088k1545k1654k1741k1906k2097k2033
63834E79025k1274j9704j7875j6567j6024j5831j5430j4506j3033j1354j0167
$$ plain form
63916 2708485 2554993 2402462 2253431 2110183 1974170 1846527 1728515 1620948 1523614 1435697
63906 1435697 1356461 1285228 1221182 1163761 1112889 1068232 1028520 992316 959319 930212 905181
63895 905181 883224 863060 844122 826392 809819 794267 779673 765867 752478 739352 726886
63884 726886 715658 705890 697513 690605 685465 682292 681046 681583 683748 687360 692324 698745 706787 716377
63870 716377 727150 738708 750839 763526 776802 790605 804653 818466 831505 843325 853654
63859 853654 862405 869660 875516 879827 882149 882018 879297 874196 866936 857490 845735 831907 816800 801302
63845 801302 785631 769137 751003 731089 710001 688456 666802 645061 623155 601058 579025
63834 579025 557751 538047 520172 503605 487581 471750 456320 441814 428781 417427 407260
63823D07260r940j0270j0289r714r087q739q120o656m833l857m180m949n051m347
63809C07228l595l393l544l501l110k685k514k554k717l096l698m096l747k719
63795B62259j808j761k503l249l307k664j872j487j562j683j472r93o41o78j000
63780B35579j316j340q57J30J142J436O82o04j519j665j402j229j188r56l72L22
63764B26843P49P08K04n82j276j409q87k51j68o43j034q86m28r3P6K13K07j46
63746B21197o18o90j67O95J549K180K360J981J406J291J882K684L014K666J920
63731B43350J166O46M14L70M27O82J288K145K884L203L044K476J696J140J237
63716B66168J873K370K192J423M16o78j782k498k341j393m26j87o90j277j338
$$ plain form
63823 407260 397320 387050 376761 367047 357960 349221 341101 334445 329612 325755 321575 316626 311575 307228
63809 307228 303633 300240 296696 293195 290085 287400 284886 282332 279615 276519 272821 268725 264978 262259
63795 262259 260451 258690 256187 252938 249631 246967 245095 243608 242046 240363 238891 237898 237257 236579 235579
63780 235579 234263 232923 232066 232196 233338 234774 235456 234852 233333 231668 230266 229037 227849 226893 226521 226843
63764 226843 227592 228300 228504 227922 226646 225237 224350 224099 223931 223288 222254 221368 220940 220847 220923 221136 221343 221197
63746 221197 220579 219889 219722 220417 221966 224146 226506 228487 229893 231184 233066 235750 238764 241430 243350
63731 243350 244516 245162 245576 245946 246373 247055 248343 250488 253372 256575 259619 262095 263791 264931 266168
63716 266168 268041 270411 272603 274026 274442 273764 271982 269484 267143 265750 265324 265137 264447 263170 261832
63701B61832q71k99J56O29J150J391J179R89J418K274K744K515K161K193K313
63686B81774J992J368J021J081J039N17j88m36J6P10R30M92L9K27P94Q74L21Q4
63668B92655Q83K058K327J380M9q65j292j421j282j030j137j846k741l150k875
63653B81713k283j793j439r67k02O73J236J249R63Q89J276J870K156J843J116
63638B88300M84L33O71J285K073K965L678L969M152M873O109O942O692N923N757
63623C44206O508P607Q672R834J1023J1695J1630J1420J1775J2777J4086J5551
63611D76784J7192J8844K0271K1419K2203K2265K1354J9804J8143J6224J3268
63600F87771Q948M056j98l240n146n984n683m646l880m225n618p402r141j0856
$$ plain form
63701 261832 260961 260662 260818 261447 262597 263988 265167 266156 267574 269848 272592 275107 277268 279461 281774
63686 281774 283766 285134 286155 287236 288275 288792 288604 288168 288184 288894 289824 290316 290355 290582 291376 292250 292571 292655
63668 292655 293538 295596 297923 299303 299352 298487 297195 295774 294492 293462 292325 290479 287738 284588 281713
63653 281713 279430 277637 276198 275231 275029 275702 276938 278187 279150 280039 281315 283185 285341 287184 288300
63638 288300 288784 289117 289788 291073 293146 296111 299789 303758 307910 312783 318892 325834 332526 338449 344206
63623 344206 350714 358321 366993 376827 387850 399545 411175 422595 434370 447147 461233 476784
63611 476784 493976 512820 533091 554510 576713 598978 620332 640136 658279 674503 687771
63600 687771 696719 700775 700577 697337 692191 686207 680524 675878 671998 667773 662155 654753 645612 634756
63586F34756j2569j4069j5194j5988j6469j6396j5490j3823j1885j0303r377q783
63574D74410p784n972l794k123j297q69k41P91K140L649N054O115O931P836Q826
63559D93672R523R852J0215J0809J1293J1513J2005J3191J4696J6047J7561J9745
63547F50122K2153K3803K4513K4844K4662K2748J8192J1501M083k716p861j0691
63535H05353j1326j0672r642q626p817p526p868q647r786j1508j3813j6257j8547
63522F63318k0800k2818k3794k3292k2012k0946k0075j8708j6804j5128j4085
63511D44856j3210j1984j0532r237q190p366o912o872o833o273n145l860k755
63498C45687j850j134p76q77j153j159q22n48o71r71r52n17ML81P40J141J326
$$ plain form
63586 634756 622187 608118 592924 576936 560467 544071 528581 514758 502873 492570 483193 474410
63574 474410 466626 460654 456860 454737 453440 452571 452330 453121 455261 458910 463964 470079 477010 484846 493672
63559 493672 503195 513047 523262 534071 545364 556877 568882 582073 596769 612816 630377 650122
63547 650122 672275 696078 720591 745435 770097 792845 811037 822538 826621 823905 816044 805353
63535 805353 794027 783355 773713 765087 757270 749744 741876 733229 723443 711935 698122 681865 663318
63522 663318 642518 619700 595906 572614 550602 529656 509581 490873 474069 458941 444856
63511 444856 431646 419662 409130 399893 391703 384337 377425 370553 363720 357447 352302 348442 345687
63498 345687 343837 342703 341927 341050 339897 338738 337916 337368 336697 335726 334774 334257 334261 334642 335382 336523 337849
63481C37849J146R45J211J950K702L083L031K632J989J247N11k43r89j454j354
63466C54256q90o64j008j605j882j623j048m65o3L6k04n85o82j36J034K387L402
63449C50260L915M279M989O078P023P403P549Q227R666J1261J2400J3223J4231
63436D60504J5521J6894J8421K0139K1282K0623J7945J4473J1521R306P508O314
63424F40451O176P070Q715J1127J4097J6618J7879J8656K0473K3315K5266K4793
63412H34636K2264J8721J4371R137L861k42k989n159p188q776r652r973r905r578
63398H39528r635j1088j4185j7819k0478k1687k2174k2680k2948k2180k0302j8311
63386F16041j7136j6496j5403j3567j1693j0367r275p788n771l461j116Q99K115
$$ plain form
63481 337849 338995 339940 341151 343101 345803 348886 351917 354549 356538 357785 358296 358053 357064 355610 354256
63466 354256 353366 352702 351694 350089 348207 346584 345536 345071 345008 345044 344840 344255 343573 343437 344471 346858 350260
63449 350260 354175 358454 363443 369521 376544 383947 391496 399723 409389 420650 433050 446273 460504
63436 460504 476025 492919 511340 531479 552761 573384 591329 605802 617323 626629 634137 640451
63424 640451 646627 653697 662412 673539 687636 704254 722133 740789 761262 784577 809843 834636
63412 834636 856900 875621 889992 899129 902990 902748 899759 894600 887412 878636 868984 859011 849106 839528
63398 839528 829893 818805 804620 786801 766323 744636 722462 699782 676834 654654 634352 616041
63386 616041 598905 582409 567006 553439 541746 531379 522104 514316 508545 505084 503968 504867 506982
63373E06982K605L180M541O400P905Q647Q906R242J0200J2029J4256J5918J6694
63360F27505J7400J8795K0434K1441K1931K2665K3554K3582K2280K0153J7524
63349H57264J3927R126L890p91m599p559r408j0012r909r888j0174j0581j1216
63336H00070j2509j4584j7070j9509k1625k3158k3795k3380k2022j9948j7397
63325E85073j4712j2358j0632r281p640n404l311k685m131o861r517j1378j2451
63312D74712j2772j2234j1062r866r097q755q652q572q185p278o137n277m746
63299C62079m129l292k584k159j751j305j225j626j891j481p26l98p48j439k008
63284C35317k067j346j65M91oj044j503j170p85p34n59R0P92J010Q99J008J579
$$ plain form
63373 506982 509587 512767 517308 523708 531613 540260 549166 558408 568608 580637 594893 610811 627505
63360 627505 644905 663700 684134 705575 727506 750171 773725 797307 819587 839740 857264
63349 857264 871191 880317 884207 883416 878817 871258 861850 851838 841929 832041 821867 811286 800070
63336 800070 787561 772977 755907 736398 714773 691615 667820 644440 622418 602470 585073
63325 585073 570361 558003 547371 538090 530450 525046 521735 519050 514919 508058 498541 487163 474712
63312 474712 461940 449706 438644 428778 419681 410926 402274 393702 385517 378239 372102 366825 362079
63299 362079 357950 354658 352074 349915 348164 346859 345634 344008 342117 340636 339910 339512 338764 337325 335317
63284 335317 333250 331904 331739 332230 332224 331180 329677 328507 327722 326988 326429 326519 327311 328321 329220 330228 331807
63267C31807K464L410M047L944L114K279K065K175J905J365J462K528L726M252
63253C70543M435M997N737N852N371N228N826O485O745P265Q774J0720J1939J2283
63239D72200J2644J3541J4567J5353J6201J7436J8726J9477J9525J9212J8993
63228F57875J9152J9569J9711J9199J8411J8103J8342J8398J7817J7091J6873
63217H60541J7083J7123J6609J5507J3864J1788R405O564K969j215n291q915j2473
63204I43559j6184j9407k1464k2580k3295k3375k2247k0231j8296j6586j4269
63193G25625j1017p718n248l387j471N29K279L962O082Q573J0717J2028J2722
63180G53676J3250J3727J3972J3917J3762J3772J3970J4040J3658J2833J1852
$$ plain form
63267 331807 334271 337681 341728 345672 348786 351065 353130 355305 357210 358575 360037 362565 366291 370543
63253 370543 374978 379975 385712 391564 396935 402163 407989 414474 421219 428484 437258 447978 459917 472200
63239 472200 484844 498385 512952 528305 544506 561942 580668 600145 619670 638882 657875
63228 657875 677027 696596 716307 735506 753917 772020 790362 808760 826577 843668 860541
63217 860541 877624 894747 911356 926863 940727 952515 961920 968484 971453 970238 964947 956032 943559
63204 943559 927375 907968 886504 863924 840629 817254 795007 774776 756480 739894 725625
63193 725625 714608 706890 701642 698255 696784 697313 699592 703554 709636 718209 728926 740954 753676
63180 753676 766926 780653 794625 808542 822304 836076 850046 864086 877744 890577 902429
63169I02429J0824R509P684N495L219Q47j924n336r284j3369j7102k0093k2232
63156H50667k3687k4681k5295k5477k5167k4385k3253k1961k0587j9002j7119
63145F00053j5218j3805j2984j2276j1196r833q507p164n537l846k809k722k956
63132D91200k591j448j42N91M66l26j216j538j012l7P80J382K210L320M079M023
63116D99741L614L656M116M077K992J493O88R56J732K351K655K807K868K799K685
63101E39230K589K293J501L99l24j92N06J189J675K026J993J301M84N93J810L021
63085E60094L263K993L277M230N088N462N643N832N959O292P282Q610R337R334
63071F42696R691J1137J2823J3477J3187J3211J4280J5888J7220J8088J8863J9972
$$ plain form
63169 902429 913253 922762 930446 935941 939160 940007 938083 932747 923463 910094 892992 872899 850667
63156 850667 826980 802299 777004 751527 726360 701975 678722 656761 636174 617172 600053
63145 600053 584835 571030 558046 545770 534574 524741 516234 509070 503533 499687 496878 494156 491200
63132 491200 488609 487161 487019 487610 488076 487750 486534 484996 483984 483947 484727 486109 488319 491639 495718 499741
63116 499741 503355 507011 511127 515204 518196 519689 520377 521333 523065 525416 528071 530878 533746 536545 539230
63101 539230 541819 544112 545613 546012 545688 545496 546002 547191 548866 550892 552885 554186 554670 555263 557073 560094
63085 560094 563357 566350 569627 573857 578945 584407 590050 595882 601841 608133 615415 624025 633362 642696
63071 642696 652387 663524 676347 689824 703011 716222 730502 746390 763610 781698 800561 820533
63059H20533K1660K3913K6445K8958L1362L3689L5928L8076M0225M2354M4228
63048A187371M5655M6592M6942M6561M5727M5113M4931M4555M3475M2211M1556
63037A680689M1306M0608L9390L8475L8092L7135L4387K9838K4378J8626J2505
63026B035429N620k339j1310k0611k9150l6212m1899m6583n0208n2368n2870n1857
63014A645642m9431m5615m0756l5659l1066k6956k2532j7104j0991n354r71K601
63002A361808O353J0518J4396J7405J9684K1496K2674K3074K3171K3574K4209
62991A568362K4461K4081K3349K2338K0664J8163J5350J2706R819N751J94o175
62979A739063j2565j8839k5195l1470l7223m2248m6585m9994n1934n2246n1493
$$ plain form
63059 820533 842193 866106 892551 921509 952871 986560 1022488 1060564 1100789 1143143 1187371
63048 1187371 1233026 1279618 1326560 1373121 1418848 1463961 1508892 1553447 1596922 1639133 1680689
63037 1680689 1721995 1762603 1801993 1840468 1878560 1915695 1950082 1979920 2004298 2022924 2035429
63026 2035429 2041049 2038710 2027400 2006789 1977639 1941427 1899528 1852945 1802737 1750369 1697499 1645642
63014 1645642 1596211 1550596 1509840 1474181 1443115 1416159 1393627 1376523 1365532 1360178 1359207 1361808
63002 1361808 1368161 1378679 1393075 1410480 1430164 1451660 1474334 1497408 1520579 1544153 1568362
62991 1568362 1592823 1616904 1640253 1662591 1683255 1701418 1716768 1729474 1739293 1745044 1745238 1739063
62979 1739063 1726498 1707659 1682464 1650994 1613771 1571523 1524938 1474944 1423010 1370764 1319271
62968A319271n0355m8932m6913m4186m0979l7567l4175l1134k8738k6883k5115
62957I04294k3183k1351k0074j9440j9054j8456j7570j6709j6114j5663j5137
62946G01543j4551j3942j3039j1696j0550j0480j1182j1200r861q354q089q651
62934E69948q476p137n671m781m034l113k576k795l176l117k980l323l786l562
62920E11421k557j410o30m21r98k319l671m193l886l497l520l691l545k985k285
62905D71813j852j896k118j904j139n82q90j596j701j106p09j014j466j422j064
62890D51354r61j158j265j136r87r86j030r48o38j31L77O24N90N14N06K67n06
62873D44486j525j999j334K38J736K133J137n21j684j801j375j252j559j601q13
$$ plain form
62968 1319271 1268916 1219984 1173071 1128885 1087906 1050339 1016164 985030 956292 929409 904294
62957 904294 881111 859760 839686 820246 801192 782736 765166 748457 732343 716680 701543
62946 701543 686992 673050 660011 648315 637765 627285 616103 604903 595042 586688 578599 569948
62934 569948 561472 554335 548664 543883 539849 536736 534160 531365 528189 525072 522092 518769 514983 511421
62920 511421 508864 507454 506824 506403 505405 503086 499415 495222 491336 487839 484319 480628 477083 474098 471813
62905 471813 469961 468065 465947 464043 462904 462322 461432 459836 458135 457029 456320 455306 453840 452418 451354
62890 451354 450393 449235 447970 446834 445847 444861 443831 442883 442245 442114 442491 443115 443705 444219 444725 444992 444486
62873 444486 442961 440962 439628 439866 441602 443735 444872 444351 442667 440866 439491 438239 436680 435079 434266
62858D34266M35J258J233P47L58K17K28M64R95J509J543J099O76N54M65J37k29
62841D45955k98j48p3j1L80J141J841K016J604R40N06O12J117J539J600J616K077
62824D62414K961L739L947L563K905K520K935M128N251N441M931M881N991P704
62810E23311Q967R291Q836P975P186P052P789Q881R579R750R893J0394J1141J1860
62796F51905J2551J3463J4818J6596J8459J9950K0953K2006K3872K6734K9981
62785H71288L2990L5946L9597M4163M8827N2566N5400N8389O2224O6190O8900
62774A436480O9781O9367O8095O5491O0819N4132M6150L7292K7337J6056L812
62763A954812q579k0340l0947m0097m7668n3700n8346o1754o4043o5340o5758
$$ plain form
62858 434266 434701 435959 437192 437939 438297 438514 438742 439206 440201 441710 443253 444352 445028 445582 446047 446184 445955
62841 445955 445657 445509 445436 445425 445805 446946 448787 450803 452407 453347 453853 454465 455582 457121 458721 460337 462414
62824 462414 465375 469114 473061 476624 479529 482049 484984 489112 494363 499804 504735 509616 515607 523311
62810 523311 532278 541569 550405 558380 565566 572618 580407 589288 598867 608617 618510 628904 640045 651905
62796 651905 664456 677919 692737 709333 727792 747742 768695 790701 814573 841307 871288
62785 871288 904278 940224 979821 1023984 1072811 1125377 1180777 1239166 1301390 1367580 1436480
62774 1436480 1506261 1575628 1643723 1709214 1770033 1824165 1870315 1907607 1934944 1951000 1954812
62763 1954812 1946233 1925893 1894946 1854849 1807181 1753481 1695135 1633381 1569338 1503998 1438240
62752A438240o5323o3943o1541n8274n4557n0777m7056m3404l9952l6810l3816
62741H82787l0723k7621k4847k2437k0109j7828j5950j4524j2958j0768q386o659
62729F69977n761n121m308l490k918k387j401L15K474M294N024M739M475N245
62715F71157P006Q890J0361J1636J3061J4647J6336J8224K0302K2371K4413K6693
62703H65097K9383L2395L5643L9047M2210M4685M6726M9132N1994N4252N4923
62692A345487N4225N2895N0916M7669M2923L6827K9142J9482Q302l081j3707k3513
62680A647567l2520m0250m6291n0927n4675n7518n9037n9102n8038n6167n3583
62669A079459n0419m7103m4122m1548l8902l5702l2157k9034k6715k4742k2526
$$ plain form
62752 1438240 1372917 1308974 1247433 1189159 1134602 1083825 1036769 993365 953413 916603 882787
62741 882787 852064 824443 799596 777159 757050 739222 723272 708748 695790 685022 676636 669977
62729 669977 664216 659095 654787 651297 648379 645992 644591 644906 647380 651674 656698 661437 665912 671157
62715 671157 678163 687053 697414 709050 722111 736758 753094 771318 791620 813991 838404 865097
62703 865097 894480 926875 962518 1001565 1043775 1088460 1135186 1184318 1236312 1290564 1345487
62692 1345487 1399712 1452607 1503523 1551192 1594115 1630942 1660084 1679566 1687868 1684787 1671080 1647567
62680 1647567 1615047 1574797 1528506 1477579 1422904 1365386 1306349 1247247 1189209 1133042 1079459
62669 1079459 1029040 981937 937815 896267 857365 821663 789506 760472 733757 709015 686489
62658F86489k0139j8046j6369j4925j3709j2754j1775j0594r727r745j0161r872
62646E28673q729p678p181o515n123l619k808k533k241j898j600r36K57J105O69
62631D79843o24j522j594j411j287r49l99m2J45O04J223J311Q18O68J440K576
62615D80800L356L903M625N325N544N379N338N660O278P247Q620J0092J1236J2057
62601E75460J3005J4400J6126J7822J9333K0902K2978K5649K8388L0562L2147
62590H16772L3432L4166L3592L1462K8429K5071K1089J5952R802L309l045r035
62578A040996j4354j8759k2413k5643k8429l0462l1551l1762l1281l0376k9257
62567G46709k7808k5819k3602k1900k0847j9610j7575j5299j3634j2411j0845
$$ plain form
62658 686489 666350 648304 631935 617010 603301 590547 578772 568178 558451 548706 538545 528673
62646 528673 519944 512266 505085 498570 493447 489828 487020 484487 482246 480348 478748 477812 478069 479174 479843
62631 479843 479219 477697 476103 474692 473405 472456 472057 472015 472160 472764 473987 475298 476116 476784 478224 480800
62615 480800 484156 488059 492684 498009 503553 508932 514270 519930 526208 533455 542075 552167 563403 575460
62601 575460 588465 602865 618991 636813 656146 677048 700026 725675 754063 784625 816772
62590 816772 850204 884370 917962 949424 977853 1002924 1024013 1039965 1049767 1053076 1050031 1040996
62578 1040996 1026642 1007883 985470 959827 931398 900936 869385 837623 806342 775966 746709
62567 746709 718901 693082 669480 647580 626733 607123 589548 574249 560615 548204 537359
62556E37359q894p296o385n850n594n862o273n783m017j911n24J55O90J139J188
62541D82142R55R69J413J941K193K177K135K335K864L444L548L060K618L038M406
62526E19238O058P442Q668J0137J1898J3623J5092J6478J8131K0175K2435K4644
62514F94019K6623K8207K9293L0049L0886L1917L2581L2136L0450K8025K5214
62503A019400K1852J7715J3008Q116L189j784o659j1080j4675j7102j8123j7830
62491I96027j6703j5236j3534j1424q792n686k217J461N128Q611J1858J4772J7063
62478I81328J8495J9118J9069J8176J6049J2563Q144L485r12n016r204j3935j9216
62465A048144k4415k8687l1607l3333l4289l4829l5102l4894l3662l1082k7738
$$ plain form
62556 537359 528465 521169 514784 508934 503340 497478 491205 485422 481405 479494 478970 479125 479815 480954 482142
62541 482142 483097 484066 485479 487420 489613 491790 493925 496260 499124 502568 506116 509176 511794 514832 519238
62526 519238 525296 532738 541406 551543 563441 577064 592156 608634 626765 646940 669375 694019
62514 694019 720642 748849 778142 808191 839077 870994 903575 935711 966161 994186 1019400
62503 1019400 1041252 1058967 1071975 1080091 1083280 1081496 1074837 1063757 1049082 1031980 1013857 996027
62491 996027 979324 964088 950554 939130 930338 924652 922435 923896 929024 937635 949493 964265 981328
62478 981328 999823 1018941 1038010 1056186 1072235 1084798 1092942 1096427 1095515 1090499 1081295 1067360 1048144
62465 1048144 1023729 995042 963435 930102 895813 860984 825882 790988 757326 726244 698506
62454F98506k4835k2972k1467j9268j6315j3517j1471r816q045o360n251m614
62442E34575l896k946k081j361m17P83J578J441P52K96K35N9o39j723k858l842
62426E19956m642n368o147o829o962o467o022o288o893o926o331n921n863n196
62412D34101l406j589j110j739k121j805j618k021k265j579l57M21M15L2k51j68
62396D14940M77J629K842L636L934L869L402K584J988K291L422M519M877M601
62382D59011M253M214M523N045N592O033O463P156Q186R235R831R827R628R936
62368E58933J1104J2577J3279J2867J2392J3248J5571J8306K0743K3262K6313
62357G38595K9473L2124L4365L6528L8212L8608L7566L5549L2635K8354K2663
$$ plain form
62454 698506 673671 650699 629232 609964 593649 580132 568661 558845 550800 544440 539189 534575
62442 534575 530679 527733 525652 524291 523874 524657 526235 527676 528428 528724 528959 529018 528379 526656 523798 519956
62426 519956 515314 509946 503799 496970 490008 483541 477519 471231 464338 457412 451081 445160 439297 434101
62412 434101 430695 429106 427996 426257 424136 422331 420713 418692 416427 414848 414491 414912 415327 415359 415108 414940
62396 414940 415417 417046 419888 423524 427458 431327 434729 437313 439301 441592 445014 449533 454410 459011
62382 459011 463264 467478 472001 477046 482638 488671 495134 502290 510476 519711 529542 539369 548997 558933
62368 558933 570037 582614 595893 608760 621152 634400 649971 668277 689020 712282 738595
62357 738595 768068 800192 834557 871085 909297 947905 985471 1021020 1053655 1082009 1104672
62346A104672J6382J0466N345J004k804o608j0861j5309j9226k2402k5273k7838
62334A007548k9204k8720k7001k5261k3981k2755k1187j9332j7428j5687j4333
62323G62659j3490j3050j2899j3067j3436j3603j3400j3274j3716j4506j4914
62312F13304j4520j3488j2143j0765r623q832q134p217o137n223m617m234l964
62299E04407l630k960j933r59l80L2O37J294J583J493J403J556J995K750L658
62284E10946M225M222M141M526N164N597N970O532O672N663M165L745M777O059
62270E82404O773P514Q938J0602J1938J3303J5180J7227J8984K0770K3009K5331
62258G61973K7351K9674L3013L6793L9696M1363M2443M3191M3050M1603L8860
$$ plain form
62346 1104672 1121054 1131520 1136865 1137869 1135065 1128457 1117596 1102287 1083061 1060659 1035386 1007548
62334 1007548 978344 949624 922623 897362 873381 850626 829439 810107 792679 776992 762659
62323 762659 749169 736119 723220 710153 696717 683114 669714 656440 642724 628218 613304
62312 613304 598784 585296 573153 562388 552765 543933 535799 528582 522445 517222 512605 508371 504407
62299 504407 500777 497817 495884 494925 494545 494577 495214 496508 498091 499584 500987 502543 504538 507288 510946
62284 510946 515171 519393 523534 528060 533224 538821 544791 551323 557995 563658 567823 571568 576345 582404
62270 582404 589177 596691 605629 616231 628169 641472 656652 673879 692863 713633 736642 761973
62258 761973 789324 818998 852011 888804 928500 969863 1012306 1055497 1098547 1140150 1179010
62247A179010L4556K8234K0365J2450N611l12n964j1453j6568k1388k6166l0846
62235A167529l5088l8568m1014m2183m2060m0906l8974l6384l3389l0478k7995
62224G60490k5819k3569k1056j8429j5984j3903j2134j0527r135q266q024q014
62212E85630p684o915n960m955l829k680j807j296q96m31j5K67O46J386K323K927
62196E56711K890K594K808L786M837N150M910N064N876O539O582O833Q113R621
62182F32314R816Q645P622P594P731P099O118N711N899O146O496P443R033J0898
62168G38565J2988J5543J8443K1272K3849K6080K7460K7490K6590K5696K4774
62157I88750K2585J8341J2925P889L715j63m081p671j0638j3145j5286j6874j8100
$$ plain form
62247 1179010 1213566 1241800 1262165 1274615 1280226 1279914 1273950 1262497 1245929 1224541 1198375 1167529
62235 1167529 1132441 1093873 1052859 1010676 968616 927710 888736 852352 818963 788485 760490
62224 760490 734671 711102 690046 671617 655633 641730 629596 619069 609934 601668 593644 585630
62212 585630 577946 571031 565071 560116 556287 553607 551800 550504 549608 549177 549162 549429 550075 551461 553784 556711
62196 556711 559601 562195 565003 568789 573626 578776 583686 588750 594626 601165 607747 614580 622693 632314
62182 632314 642130 650775 658397 665991 673722 680821 686939 692650 698549 704695 711191 718634 727667 738565
62168 738565 751553 767096 785539 806811 830660 856740 884200 911690 938280 963976 988750
62157 988750 1011335 1029676 1042601 1050490 1054205 1054042 1049961 1042290 1031652 1018507 1003221 986347 968247
62144I68247j9723k2001k3903k4088k2485k0258j8268j6319j4004j1518r299p411
62132G58970n781m472l331j836O2J385J223K14K4J348L202M370M823N271N921
62117G71393O229N594L935J741j67j200j529j871k624l540m411n561p287r154
62103G51548j0312j0315r278p498n371l475k157j131J31J560K555K848K929L392
62089G15426M293N274O026O326N998N153M424M574N769P387Q627R259R706J0466
62075H08708J1578J2706J3610J4325J4903J5240J5284J5276J5549J6169J6850
62064I70198J7233J7141J6681J6195J5979J5882J5267J3590J0915P702M189L65
62052A121337l439o490q469j0058j2303j5417j8608k1104k2948k4604k6115k7073
$$ plain form
62144 968247 948524 926523 902620 878532 856047 835789 817521 801202 787198 775680 766381 758970
62132 758970 753189 748717 745386 743550 743612 744997 746220 746434 746458 747806 751008 755378 760201 765472 771393
62117 771393 777622 783216 787151 788892 788725 787525 785996 784125 781501 777961 773550 767989 760702 751548
62103 751548 741236 730921 721643 714145 708774 705299 703142 702011 702142 703702 706257 709105 712034 715426
62089 715426 719719 724993 731019 737345 743343 748496 752920 757494 763263 770650 779277 788536 798242 808708
62075 808708 820286 832992 846602 860927 875830 891070 906354 921630 937179 953348 970198
62064 970198 987431 1004572 1021253 1037448 1053427 1069309 1084576 1098166 1109081 1116783 1120972 1121337
62052 1121337 1117898 1111408 1102939 1092881 1080578 1065161 1046553 1025449 1002501 977897 951782 924709
62040I24709k7357k7420k7666k7777k7039k5284k3232k1758k0958k0091j8475
62029F57652j6274j4342j3301j2914j2461j1599j0597r789r135q479p922p633
62017E23206p513p386p330p448p368o510m940l521k927k874k582j765q10j69J18
62002D60181L49Q58J734K645L007K525J562P58L82K30P1r4j90k98n77j091j767
61985D70285k471l124l808m626n405n720n375m686m087l627l138k778k873l206
61971D15361l017j957o52j5k20p42j127j305j265r16l62N2J43J10K38O20J248
61954D06194K083K855L125K806K421K514K992L456M002N188P054Q737R359R001
61940D71787Q490Q454Q980J0006J1459J2961J3820J3666J2837J1921J1053J0005
$$ plain form
62040 924709 897352 869932 842266 814489 787450 762166 738934 717176 696218 676127 657652
62029 657652 641378 627036 613735 600821 588360 576761 566164 556375 547240 538761 530839 523206
62017 523206 515693 508307 500977 493529 486161 479651 474711 471190 468263 465389 462807 461042 460232 460063 460181
62002 460181 460530 461388 463122 465767 468774 471299 472861 473619 474001 474231 474302 474208 474018 473720 473143 472052 470285
61985 470285 467814 464690 460882 456256 450851 445131 439756 435070 430983 427356 424218 421440 418567 415361
61971 415361 412344 410387 409735 409720 409500 408758 407631 406326 405061 404145 403783 403835 403978 404088 404326 404946 406194
61954 406194 408277 411132 414257 417063 419484 421998 424990 428446 432448 437636 444690 453427 462786 471787
61940 471787 480277 488731 497711 507717 519176 532137 545957 559623 572460 584381 595434 605439
61928F05439Q842Q077P924P714O441L950J204p36j796k645l633m383m455l894
61914F28049k979j771k13J523L141M571O008P601R243J0588J1148J0602R169P508
61900G04188O043M570K746O15j608l941o299q042q548q251q341r288j0259j0346
61886F43239r695r036q591q098p535p210p112o843o265n799n896o458o918o785
61872E40998n988m815l650k659j737p16L75J330J999K453K894L488M290N312O626
61857E50200Q246R930J1264J2183J3167J4648J6287J7305J7586J7928J8937K0140
61845G27821K0611K0153J9319J8398J6923J4307J0562O270K112j412m014n652
61833H45398o505o846o879o665o121n094l508j423J044L732O243P909Q256P408
$$ plain form
61928 605439 614281 622358 630282 637996 644437 648387 649591 648855 647059 644414 640781 636398 631943 628049
61914 628049 625070 623299 623086 624609 627750 632321 638329 645930 655173 665761 676909 687511 696680 704188
61900 704188 710231 714801 717547 718162 716554 712613 706314 698272 689724 681473 673132 663844 653585 643239
61886 643239 633544 624508 615917 607819 600284 593074 585962 579119 572854 567055 561159 554701 547783 540998
61872 540998 535010 530195 526545 523886 522149 521433 521808 523138 525137 527590 530484 533972 538262 543574 550200
61857 550200 558446 568376 579640 591823 604990 619638 635925 653230 670816 688744 707681 727821
61845 727821 748432 768585 787904 806302 823225 837532 848094 854364 856476 855064 851050 845398
61833 845398 838893 832047 825168 818503 812382 807288 803780 802357 803401 807133 813376 821285 829541 836949
61819H36949N883L902J220k313o238r772j2466j4481j6204j7766j8977j9588j9564
61806G10585j9091j8418j7634j6601j5135j3323j1622j0520j0046r767r305q660
61794E50463p993p347o805o558o498n960m519k860k222k844l615l566l051k939
61780D83686l240l205k535j748j392j529k022k752l386l414k710j766j169j049
61766D51769j157j165p81R0J079J490J003J09l69j64K47K96m2k59J39J065J805
61749D55155J551J35j775l198l593l196k688k530k568k274j438m94n3k05n41p10
61733D31578p45p43n95k14K32N22O67P84Q50P73O36N96O55P12Q05J050J372J558
61715D40493J563J474J197N08n01j351j780k067k517k945l046k973l128l468l515
$$ plain form
61819 836949 842832 846734 847954 845641 839403 829631 817165 802684 786480 768714 749737 730149 710585
61806 710585 691494 673076 655442 638841 623706 610383 598761 588241 578195 568428 559123 550463
61794 550463 542470 535123 528318 521760 515262 509302 504783 501923 499701 496857 493242 489676 486625 483686
61780 483686 480446 477241 474706 472958 471566 470037 468015 465263 461877 458463 455753 453987 452818 451769
61766 451769 450612 449447 448666 448756 449835 451325 452328 452437 452068 451904 452151 452447 452405 452146 452285 453350 455155
61749 455155 456706 456841 455066 451868 448275 445079 442391 439861 437293 435019 433581 433087 433034 432829 432288 431578
61733 431578 430833 430090 429495 429281 429513 430035 430702 431486 432336 433109 433745 434341 434996 435708 436513 437563 438935 440493
61715 440493 442056 443530 444727 445235 444734 443383 441603 439536 437019 434074 431028 428055 424927 421459 417944
61700D17944l086k511k160k123k397k918l294l035k283j796j987k463k814l210
61686C81867l724l712k675j300p82j265j825j910j891k007j782r05J8J52n16j281
61670C56462j528j127l54K32J35n35j104j086o46j55L51R46J420J413Q16j46j024
61653C54070j281p28O8K96o7j98L44J005J196J203J603K298K791K968L005K818
61637C71391K289J693J230M75r62k480l059k695k424k826l283k964j908q63m18
61622C53196o08j100j599k094k632k857k270j123m67p38j009l94L89lj371k226
61606C33094k081k060k811l330k618j357r07j385j864j939k101k691l344l504
61592C01102k965j911q47l82p00j347j724j704j529j436j541j823j918j367l82
$$ plain form
61700 417944 414858 412347 410187 408064 405667 402749 399455 396420 394137 392341 390354 387891 385077 381867
61686 381867 378143 374431 371756 370456 369674 368409 366584 364674 362783 360776 358994 358089 358107 358259 357743 356462
61670 356462 354934 353807 353453 353685 353820 353285 352181 351095 350449 350294 350645 351591 353011 354424 355240 355094 354070
61653 354070 352789 352061 352129 352425 352358 352160 352504 353509 354705 355908 357511 359809 362600 365568 368573 371391
61637 371391 373680 375373 376603 377078 376116 373636 370577 367882 365458 362632 359349 356385 354477 353614 353196
61622 353196 352588 351488 349889 347795 345163 342306 340036 338913 338446 337708 336699 336305 336694 336691 335320 333094
61606 333094 331013 328953 326142 322812 320194 318837 317930 316545 314681 312742 310641 307950 304606 301102
61592 301102 298137 296226 295379 294997 294297 292950 291226 289522 287993 286557 285016 283193 281275 279908 279526
61577B79526R3m61j323j405o41J20L62L65M99P69J118J612K126K226J684Q26J74
61560B87670j15l33p76j364j625j178k32N73Q43Q05Q55J035J182J326J583J812
61544B92061J720J323R81J011J354J623J339L71p18j046m01L70L82j40k33M42
61528C00439J179J225O76J52m7j26l69p29r02o89l26k87p14j154j119p80p12j076
61510B94641j400j231o48o0K81L44K55K76O37J239J676J664J296P77J56m75q54
61493B98574q00n31l98m06k80%N1l99j043j228o46L89J254J574J399R42L70j58
61475B98664l77j42K92M11R9j34K43R95J321Q59J69ML86O47L19l61p84n96j1M15
61455C02419L13l3P0P90J387J087K04k46O9N12O65R50J676K246K016J382J242
$$ plain form
61577 279526 279619 279158 277835 276430 275789 275909 276271 276636 277135 277904 279022 280634 282760 284986 286670 287496 287670
61560 287670 287555 287222 286446 285082 283457 282279 282047 282620 283463 284268 285123 286158 287340 288666 290249 292061
61544 292061 293781 295104 296085 297096 298450 300073 301412 301783 301065 300019 299618 299988 300370 300230 299997 300439
61528 300439 301618 302843 303519 303671 303624 303498 303129 302400 301498 300809 300483 300196 299482 298328 297209 296429 295717 294641
61510 294641 293241 292010 291362 291302 291583 291927 292182 292458 293095 294334 296010 297674 298970 299747 299903 299428 298574
61493 298574 297774 297243 296845 296439 296159 296159 296210 295811 294768 293540 292894 293283 294537 296111 297510 298452 298822 298664
61475 298664 298287 298145 298437 298848 298947 298813 299056 300051 301372 302231 302400 302404 302790 303437 303756 303395 302611 302015 302004 302419
61455 302419 302732 302699 302769 303559 304946 306033 306237 305991 306060 306572 307237 308187 309863 312109 314125 315507 316749
61438C16749J693K071K077K071K261K377K226J987J825J723J722J846J809J339
61424C43776P81P44J128J175N73j33l73j17N09J414K124J920Q12k90p51r05j199
61407C51188j394j167q02o92o88n94p98j629k517k556j714q17m88o57r18q89l99
61390C32469K93O75P15R52J511J605P12l83n50J27O56O39M79L50L2k51J15J079
61372C41225J878K142K278K542K634K428K299K386K346K135K232K653K580J545
61358C73303M03L72J601L231M477N050M896M258L853M347N528O411O319N551M884
61343D34484M634M355L573K534K013K284K752K854K877L251L475K601P93o35r13
61328D70932p36j035j653j827j424r63p88q10q24n95J38J208J919J850J504J688
$$ plain form
61438 316749 318442 320513 322590 324661 326922 329299 331525 333512 335337 337060 338782 340628 342437 343776
61424 343776 344557 345301 346429 347604 348177 348044 347671 347554 348063 349477 351601 353521 354333 354043 353292 352387 351188
61407 351188 349794 348627 347825 347133 346445 345851 345053 343424 340907 338351 336637 335820 335332 334675 333757 332868 332469
61390 332469 332762 333437 334152 335104 336615 338220 338932 338549 337999 338126 338782 339421 339900 340250 340282 340031 340146 341225
61372 341225 343103 345245 347523 350065 352699 355127 357426 359812 362158 364293 366525 369178 371758 373303
61358 373303 373706 374078 375679 378910 383387 388437 393333 397591 401444 405791 411319 417730 424049 429600 434484
61343 434484 439118 443473 447046 449580 451593 453877 456629 459483 462360 465611 469086 471687 472480 471845 470932
61328 470932 470196 469161 467508 465681 464257 463294 462506 461696 460872 460277 460415 461623 463542 465392 466896 468584
61312D68584K495L372M020M634N384O218P095P904Q285Q019P531P382P335O518
61298E54776M673K564J014Oq98j791k467k935l430m039m633n039n089m730m261
61283E23721m239m793n272m949l974l085k478j593j78J075J466J368J729K732
61269E01530L636L907L816L746L572L160K903L281M108M729M826M638M533M733
61255E57118N236N712N543M451K955J882J457J256R33N32J40k94p30j041j257
61240E83893j472j561j412j298j566k030k207k094k020j795q45O35J609J608J425
61225E70870J891K664K860K327J634J267J478K488M094N404N720N417N322N476
61211F18912N268M605M088L994L906L539L172L013K740K099J556J924L480N639
$$ plain form
61312 468584 471079 474451 478471 483105 488489 494707 501802 509706 517991 526010 533541 540923 548258 554776
61298 554776 559449 562013 563027 563033 562135 560344 557877 554942 551512 547473 542840 537801 532712 527982 523721
61283 523721 519482 514689 509417 504468 500494 497409 494931 493338 493160 494235 495701 497069 498798 501530
61269 501530 505166 509073 512889 516635 520207 523367 526270 529551 533659 538388 543214 547852 552385 557118
61255 557118 562354 568066 573609 578060 581015 582897 584354 585610 586543 587075 587215 586921 586191 585150 583893
61240 583893 582421 580860 579448 578150 576584 574554 572347 570253 568233 566438 565593 566228 567837 569445 570870
61225 570870 572761 575425 578285 580612 582246 583513 584991 587479 591573 596977 602697 608114 613436 618912
61211 618912 624180 628785 632873 636867 640773 644312 647484 650497 653237 655336 656892 658816 662296 667935
61197F67935P390Q007P667P307P712Q684R404R437Q933P939O273M232K757K380
61183G66057K443J926P64k28o09r05j757k991l907m272m538m994n172m573l788
61168G33456m165o054p994q310p221o534p336q816r566r267q524p738o920o262
61154F28749o035n884m980l092j025K79O91P12O15J51r51k541m061m902m838m244
61138E88644l804l860m071l774k699j183K08J137J656K131K915M020N079N858
61124E92257O646P885R458J0718J1287J1458J1739J2367J3468J5186J7259J8814
61112G38542J9135J8468J7681J7228J6958J6685J6373J5783J4602J3034J1632
61101I16121J0379Q546N784K773L22j656l736n907p581q568r444j0762j2281j3169
$$ plain form
61197 667935 675325 683332 690999 698306 706018 714702 724106 733543 742476 750415 756688 760920 763677 766057
61183 766057 768500 770426 771190 770962 770353 769448 767691 764700 760793 756521 751983 746989 741817 737244 733456
61168 733456 729291 723237 715243 706933 699712 693178 685842 677026 667460 658193 649669 641931 635011 628749
61154 628749 622714 616830 611850 608758 607733 608012 608703 609415 610030 610181 609230 606689 602628 597726 592888 588644
61138 588644 584840 580980 576909 573135 570436 569253 569461 570598 572254 574385 577300 581320 586399 592257
61124 592257 598903 606788 616246 626964 638251 649709 661448 673815 687283 702469 719728 738542
61112 738542 757677 776145 793826 811054 828012 844697 861070 876853 891455 904489 916121
61101 916121 926500 935046 940830 943603 943925 942269 938533 932626 925045 916477 907033 896271 883990 870821
61087H70821j2866j1701j0630j0325j0537j0524r961r090q063o728n234m129l468
61074G57565k492p24J153K232K743L592M938O146P015Q016R263J0222J0770J1626
61060H32065J3264J5118J6383J7027J7544J8166J8847J9651K0649K1718K2840
61049A033272K4305K6247K8273K9956L1453L3233L5446L7863M0174M2031M3192
61038A405445M4015M5433M7941N0913N3428N5417N7437N9701O2037O4493O7218
61027B013478O9868P2042P4187P7285Q1572Q6480R1835R8115J05387J13042J20924
61016C004215J29726J39926J51591J65790J84818K10069K41065K77733L22206
61007D827139L76604M40426N12468N94091O87599P92365R05764J024546J134314
$$ plain form
61087 870821 857955 846254 835624 825299 814762 804238 794277 785187 777124 770396 765162 761033 757565
61074 757565 755073 754349 755502 757734 760477 764069 769007 775153 782168 790184 799447 809669 820439 832065
61060 832065 845329 860447 876830 893857 911401 929567 948414 968065 988714 1010432 1033272
61049 1033272 1057577 1083824 1112097 1142053 1173506 1206739 1242185 1280048 1320222 1362253 1405445
61038 1405445 1449460 1494893 1542834 1593747 1647175 1702592 1760029 1819730 1881767 1946260 2013478
61027 2013478 2083346 2155388 2229575 2306860 2388432 2474912 2566747 2664862 2770249 2883291 3004215
61016 3004215 3133941 3273867 3425458 3591248 3776066 3986135 4227200 4504933 4827139
61007 4827139 5203743 5644169 6156637 6750728 7438327 8230692 9136456 10161002 11295316
60998A1295316J193155J138814R33437O10349K68579J0579j17648j29878o2024
60989A5140679M8698J49066J62298K5109k58216o06134r11171j103771j174709
60980A1471849j153084j075562r71921q63076p60554o67093n81419n03357m34028
60971D461755l73309l19750k72775k33147k01167j75757j55442j39149j25876
60962B465383j14507j04354r5267q7010p9114p1457o4458n8459n3410m9317m6476
60951A641554m4889m3884m2653m0998l9233l7533l5706l3569l1303k9296k7755
60940A234735k6605k5740k5182k4848k4410k3690k3031k2821k2756k2172k1139
60929I72341k0448k0260j9645j7946j5882j4483j3638j2662j1720j1517j1811
$$ plain form
60998 11295316 12488471 13627285 14560722 15171071 15439650 15450229 15332581 15202703 15140679
60989 15140679 15189377 15338443 15500741 15525850 15267634 14661500 13750329 12646558 11471849
60980 11471849 10318765 9243203 8271282 7408206 6647652 5980559 5399140 4895783 4461755
60971 4461755 4088446 3768696 3495921 3262774 3061607 2885850 2730408 2591259 2465383
60962 2465383 2350876 2246522 2151255 2064245 1985131 1913674 1849216 1790757 1737347 1688030 1641554
60951 1641554 1596665 1552781 1510128 1469130 1429897 1392364 1356658 1323089 1291786 1262490 1234735
60940 1234735 1208130 1182390 1157208 1132360 1107950 1084260 1061229 1038408 1015652 993480 972341
60929 972341 951893 931633 911988 894042 878160 863677 850039 837377 825657 814140 802329
60918H02329j1542j0539r843j0059j0392r845q474o962n695m827m625n069n487
60905F98970n201m272l228k402j916j980k658l507l863l476k747k368k764l686
60891F54902m351m309m080m535n724o859p423p595p625p494p372p575p832p429
60877E64699o462o080o930q104q245p120n481m044l199l146l509l331k208r85
60863D95855o41r55j076q75r00j235j397j248j124j136j061q75p62o55m08k74
60847D81233n99j149j372j187r44p56n57n83j053j561j550j316j673k638l352
60832D60943l335l020k850k696k422k284k430k539k305j820j271p13l37m55j000
60817D31466j489j654j732j982k321k557k642k588k492k607l002l257k911k201
$$ plain form
60918 802329 790787 780248 770405 760346 749954 740109 731635 724673 718978 714151 709526 704457 698970
60905 698970 693769 689497 686269 683867 681951 679971 677313 673806 669943 666467 663720 661352 658588 654902
60891 654902 650551 646242 642162 637627 631903 625044 617621 610026 602401 594907 587535 579960 572128 564699
60877 564699 558237 552157 545227 537123 528878 521758 516277 512233 509034 505888 502379 499048 496840 495855
60863 495855 495214 494259 493183 492308 491408 490173 488776 487528 486404 485268 484207 483332 482570 481915 481507 481233
60847 481233 480634 479485 478113 476926 475982 475226 474669 474086 473033 471472 469922 468606 466933 464295 460943
60832 460943 457608 454588 451738 449042 446620 444336 441906 439367 437062 435242 433971 433258 432921 432466 431466
60817 431466 429977 428323 426591 424609 422288 419731 417089 414501 412009 409402 406400 403143 400232 398031
60803C98031j845k185k916l598l899l540k631j897j908k256k173j790j880k428
60789C63085k509j702o59m7J58R8l12q46r54o50n21o00j97P52J306J006P07J141
60771C59256J699J554J109J250J811J957J529J030O23J40j83k7K22m0n53n36k9
60754C70812J19l87q89r04p75r19j187j281j256j184q81k91K04J64m57j399k411
60737C57078l265l743l780l478k966k343j807j615j868k426k997l211k786j853
60723C18940r86o13n25k62J16O6n88j252j207m06N24R73R20Q16R53J071P60J60
60705C19460r3K94Q10Q90O74P20J116J443J494J494J588J580J432J557K255L092
60689C39806L240K459J414R27J078J311J225J020J030J205J315J399J652J916
$$ plain form
60803 398031 396186 394001 391085 387487 383588 380048 377417 375520 373612 371356 369183 367393 365513 363085
60789 363085 360576 358874 358215 358168 358326 358424 358112 357266 356312 355662 355141 354541 354344 355096 356402 357408 358115 359256
60771 359256 360955 362509 363618 364868 366679 368636 370165 371195 371818 371958 371775 371748 371970 371930 371377 370841 370812
60754 370812 370931 370544 369655 368751 367976 367057 365870 364589 363333 362149 361268 360977 361181 361345 360888 359489 357078
60737 357078 353813 350070 346290 342812 339846 337503 335696 334081 332213 329787 326790 323579 320793 318940
60723 318940 317954 317341 316816 316554 316670 316736 316148 314896 313689 313283 313807 314780 315700 316516 317469 318540 319300 319460
60705 319460 319367 319661 320471 321361 322035 322755 323871 325314 326808 328302 329890 331470 332902 334459 336714 339806
60689 339806 343046 345505 346919 347846 348924 350235 351460 352480 353510 354715 356030 357429 359081 360997
60675C60997J730R20j23q79j111q85m56k25m52r20j139r81p78q25j088j458j867
60658C50460k080j807j180p20o56o66m43q6K50O28J045J299J380J548J780J581
60642C52333O67n44j433j793j739j450j254j441j745j540q06k87l32l35J43N16
60626C38960J49m89n19j3K95L12N90J161J326P06k71j031j366j317j011o71l55
60609C36456K54J323K350K658K224J524Q33K72K31R11J685J687J021O07Q35J163
60593C56034J067O13L5m76n36J40J034J250P19K74L69O35R17J649K798L367K762
60576C72651J831J718K284K595K603L294N083P045P973P738P241P331Q047Q741
60562D46175Q709P678N865L716J635j42j548k617l355l748l859l740l173j785
$$ plain form
60675 360997 362727 363647 363524 362645 361534 360649 360193 359968 359516 358596 357457 356476 355698 354873 353785 352327 350460
60658 350460 348380 346573 345393 344673 344017 343351 342908 342822 343072 343700 344745 346044 347424 348972 350752 352333
60642 352333 353000 352456 351023 349230 347491 346041 344787 343346 341601 340061 339255 338968 338636 338301 338444 338960
60626 338960 339109 338620 338101 338088 338383 338695 339285 340446 341772 342478 342207 341176 339810 338493 337482 336811 336456
60609 336456 336710 338033 340383 343041 345265 346789 347622 347894 348125 349036 350721 352408 353429 354036 354871 356034
60593 356034 357101 357714 357749 357273 356737 356877 357911 359161 359880 360154 360523 361158 362075 363724 366522 369889 372651
60576 372651 374482 376200 378484 381079 383682 386976 392059 399104 407077 414815 422056 429387 437434 446175
60562 446175 454884 462562 468427 472143 473778 473636 472088 469471 466116 462368 458509 454769 451596 449811
60548D49811L42K379L505L796M059M863O057P196Q051Q688R345J0206J1134J1703
60534E41135J1670J1208J0498R343P583N541L635J844O3j360k057k383l017l976
60520E89727m716m985m876m246k943j538q54p52l30O23J373J651K178L445M982
60505E78739O370P980J0092J2156J3734J5385J7830K0798K3485K5643K7395K8537
60493G88144K8795K8441K7785K6362K3463J9248J4559R778M650r52o760j2626
60481I50887j8532k4083k8559l1583l3204l3477l2540l1102l0039k9335k8008
60470F30425k5425k2202j9474j7660j6241j4583j2625j0844r665q971q194o973
60458D57568n528m326l608l477m079n181n807m985l002j276q39j329j771j836
$$ plain form
60548 449811 450153 452532 456037 459833 463892 468755 474812 482008 490059 498747 508092 518298 529432 541135
60534 541135 552805 564013 574511 583854 591437 596978 600613 602457 602520 601160 599103 596720 593703 589727
60520 589727 585011 580026 575150 570904 567961 566423 565569 564817 564487 565110 566483 568134 570312 573757 578739
60505 578739 585109 593089 603181 615337 629071 644456 662286 683084 706569 732212 759607 788144
60493 788144 816939 845380 873165 899527 922990 942238 956797 966575 971225 970273 963513 950887
60481 950887 932355 908272 879713 848130 814926 781449 748909 717807 687768 658433 630425
60470 630425 605000 582798 563324 545664 529423 514840 502215 491371 481706 472735 464541 457568
60458 457568 452040 447714 444106 440629 436550 431369 425562 420577 417575 416299 415460 414131 412360 410524
60444D10524j893k185k463k407k018j550j244j122r60n67k02m24j315k108k031
60429C88035j356j048j354j462p82O7J34n09r91r27o83m13K62J409K383K641K347
60412C87753J865J240O20N18J079J634J587J289J318J450J189P89Q65J206J094
60397D05496O57P41J406J698J198P31J090J994K758L166L130K393J196N42J031
60382D29227J951K222J747J202R46Q77R83J296J539J509J517J948K565K953L273
60367D55755L840M197L542K068J002J012J405J249P37Q29J886L241M090M310M332
60352D93495M484M791N178N563N686N189M053K714J492K09j325k748l592l990
60338E21199m344m449l790k654k047k276k561k326k027k164k429k445k553l081
$$ plain form
60444 410524 408631 406446 403983 401576 399558 398008 396764 395642 394682 394115 393913 393489 392174 390066 388035
60429 388035 386679 385631 384277 382815 382033 382100 382234 381725 380734 379807 379124 378711 378973 380382 382765 385406 387753
60412 387753 389618 390858 391478 391996 393075 394709 396296 397585 398903 400353 401542 402331 403196 404402 405496
60397 405496 406153 406894 408300 409998 411196 411927 413017 415011 417769 420935 424065 426458 427654 428196 429227
60382 429227 431178 433400 435147 436349 437295 438172 439155 440451 441990 443499 445016 446964 449529 452482 455755
60367 455755 459595 463792 467334 469402 470404 471416 472821 474070 474807 475636 477522 480763 484853 489163 493495
60352 493495 497979 502770 507948 513511 519197 524386 528439 531153 532645 532854 531529 528781 525189 521199
60338 521199 516855 512406 508616 505962 503915 501639 499078 496752 494725 492561 490132 487687 485134 482053
60324D82053l472l109k471k483l023l058k060m49J231K715L684L937L978M653
60310D82126O047P431Q357R116J0010J0926J1808J2803J3521J2840J0016N738
60298F00739J501j857m627p334r818j1473j2169j2546j3115j3337j2151r470o615
60285D87728m883m251l922l581l423l320k888k278k055k232k147j512r33j059
60271D49244j732k266k247j780j266j094j336j654j674j451j305j287j181r60
60257D28011q20p66n47q8M20Q68J255J381J003L98K34P73J575K104K179J750Q07
60240D40537k56p57n64l24n25p30k77O33J156J018Q69J340K190K649K329J561
60224D50849R26P04Q63J303J929K513K777K719K628K713K921L192L643M226M522
$$ plain form
60324 482053 478581 475472 473001 470518 467495 464437 462377 461928 463159 465874 469558 473495 477473 482126
60310 482126 488173 495604 503961 513077 523087 534013 545821 558624 572145 584985 595001 600739
60298 600739 602240 600383 595756 588422 578604 567131 554962 542416 529301 515964 503813 494343 487728
60285 487728 482845 478594 474672 471091 467668 464348 461460 459182 457127 454895 452748 451236 450303 449244
60271 449244 447512 445246 442999 441219 439953 438859 437523 435869 434195 432744 431439 430152 428971 428011
60257 428011 427191 426425 425878 425790 426210 427078 428333 429714 430717 431115 431349 432122 433697 435801 437980 439730 440537
60240 440537 440281 439524 438960 438636 438111 437381 437104 437737 438893 439911 440780 442120 444310 446959 449288 450849
60224 450849 451775 452479 453342 454645 456574 459087 461864 464583 467211 469924 472845 476037 479680 483906 488428
60209D88428M221L678L545L973M533M883N061N155N092M878M690M559M183L289
60195E50168K043R78N75Q32J233J216O90L9m67r03j340j597j688k040k864l655
60179E43220l809l440l082k867k598k430k657k957k630j696r87r97j295j310j043
60164E09422p10k70K60N27K93j43l07r3L30P75R62N41m61j423j622q96L51J557
60146E09093K246K229J760J424J632K287K976L344L309L121L214L741M264M204
60132E48844L505K653K097K020K459L101L139J985K32p83n11L51R93J364J616
60117E73065J543J071P16R17J351J447J184Q83N73J19l18n49p37j077j345j313
60101E77530j347j953k855l228k808k174j882j870j799j495r46k42K62J54m63
$$ plain form
60209 488428 492649 496327 499872 503845 508378 513261 518322 523477 528569 533447 538137 542696 546879 550168
60195 550168 552211 553189 553764 554596 555829 557045 557735 557774 557307 556404 555064 553467 551779 549739 546875 543220
60179 543220 539411 535971 532889 530022 527424 524994 522337 519380 516750 515054 514067 513070 511775 510465 509422
60164 509422 508712 508442 508702 509229 509522 509379 509072 508979 509309 510084 511046 511587 511126 509703 508081 507185 507536 509093
60146 509093 511339 513568 515328 516752 518384 520671 523647 526991 530300 533421 536635 540376 544640 548844
60132 548844 552349 555002 557099 559119 561578 564679 567818 569803 570035 569252 568741 569092 570085 571449 573065
60117 573065 574608 575679 576395 577312 578663 580110 581294 582177 582750 582869 582551 582002 581265 580188 578843 577530
60101 577530 576183 574230 571375 568147 565339 563165 561283 559413 557614 556119 555173 554931 555193 555347 554884
60086E54884r44q08k66J36K26K81N49R12J023O54j43j114j989k599k915l064l284
60069E41539l753m372m857n015m885m562m142l872m089m796n423n310m466l544
60055D78453l063k860k478j864j311q10J29J668L081L441K831K255K263K385K139
60040D86259J927K302K835K596J558P20P42J176J240O97k11j228k114k629k774
60025D93096k820k964l224l661m304m774m568l900l690m380n288n538n134m615
60011D34236m059l110j896j190j511k419k992k774k070j407r23l46M46J127J241
59996D12353P32j8n08l23P12K230L317L299K487J715J239O03l72j102r41K6J116
59979D26565J649J328L98n05r28j114j548k092k128j522q40m72k32MLj64O8Q75
$$ plain form
60086 554884 553940 553132 552866 553002 553228 553509 554058 554970 555993 556647 556504 555390 553401 550802 547887 544823 541539
60069 541539 537786 533414 528557 523542 518657 514095 509953 506081 501992 497196 491773 486463 481997 478453
60055 478453 475390 472530 470052 468188 466877 466067 466196 467864 470945 474386 477217 479472 481735 484120 486259
60040 486259 488186 490488 493323 495919 497477 498197 498939 500115 501355 502052 501841 500613 498499 495870 493096
60025 493096 490276 487312 484088 480427 476123 471349 466781 462881 459191 454811 449523 443985 438851 434236
60011 434236 430177 427067 425171 423981 422470 420051 417059 414285 412215 410808 409885 409539 409985 411112 412353
59996 412353 413085 413067 412559 412236 412948 415178 418495 421794 424281 425996 427235 427838 427466 426364 425423 425449 426565
59979 426565 428214 429542 429940 429435 428507 427393 425845 423753 421625 420103 419263 418791 418559 418563 418566 418402 418470 419345
59961D19345J587J607J237J026R35P04N43P53J023Q37L38Q8J74J48j96n83p45
59944D28821o74m11j3K31n4q59j740k238k193j688q85N5R85J628J670J203R42
59927D24780J486K453K955K884K976L471L735L474L338L650L549K343R11O11J307
59912D63923J692J290R02J082J363J289J207J561K055K092J640J290J567K375
59898D85328L058L024K440K080K297K509K053J211Q22J138J696K144K606L205
59884E15611L798M169M148L602K772K313K543K889K674K177K145K427K045O53
59870E53966q82j653j707j634j757k109k614k937k599j564m09L92R38J527K139
59855E39097K559K680K556K400K682L758N214N947N150L083P07j109j881j546
$$ plain form
59961 419345 420932 422539 423776 424802 425737 426441 426984 427737 428760 429597 429935 430023 430197 430345 430149 429566 428821
59944 428821 428147 427736 427723 427954 427900 427041 425301 423063 420870 419182 418297 418352 419337 420965 422635 423838 424780
59927 424780 426266 428719 431674 434558 437534 441005 444740 448214 451552 455202 458751 461094 462005 462616 463923
59912 463923 465615 466905 467807 468889 470252 471541 472748 474309 476364 478456 480096 481386 482953 485328
59898 485328 488386 491410 493850 495930 498227 500736 502789 504000 504822 505960 507656 509800 512406 515611
59884 515611 519409 523578 527726 531328 534100 536413 538956 541845 544519 546696 548841 551268 553313 553966
59870 553966 553084 551431 549724 548090 546333 544224 541610 538673 536074 534510 534101 534493 535431 536958 539097
59855 539097 541656 544336 546892 549292 551974 555732 560946 566893 572043 575126 575833 574724 572843 571297
59841E71297n16M34P67N23m9j008k557m456n932o351n807m947m237l620k911k328
59825E28302k204k388k322j888j645k018k666k989k828k370j707j017p70j214
59811E00276j885k156k021j870j675j083k12L33K34j75m16l13J2J97j68j023j686
59794D86369j635j223j128j404j653j850k167k217j452k75J89l72j037j037p30
59779D68378p66j042j039o56j41M04R26J098O47p4k15P12K228L213L031K282K126
59762D81112K702K852J834O66Q75K324L464L579L610M403N364N478M806M258M360
59747E31687M867N308N344M850M027L286K866K743K879L201L321K811J796P99
59733E79785o1j008j818j874j246q66j236j765j778j468j295j180q90o14m89j52
$$ plain form
59841 571297 570781 571215 571982 572505 572456 571448 568891 564435 558503 552152 546345 541398 537161 533541 530630 528302
59825 528302 526098 523710 521388 519500 517855 515837 513171 510182 507354 504984 503277 502260 501490 500276
59811 500276 498391 496235 494214 492344 490669 489586 489374 489707 489941 489766 489350 489037 489049 489246 489078 488055 486369
59794 486369 484734 483511 482383 480979 479326 477476 475309 473092 471640 471365 471554 471182 470145 469108 468378
59779 468378 467612 466570 465531 464875 464734 465138 466064 467162 467809 467735 467520 468232 470460 473673 476704 478986 481112
59762 481112 483814 486666 488500 489166 490041 492365 495829 499408 503018 507421 512785 518263 523069 527327 531687
59747 531687 536554 541862 547206 552056 556083 559369 562235 564978 567857 571058 574379 577190 578986 579785
59733 579785 579724 578716 576898 575024 573778 572912 571676 569911 568133 566665 565370 564190 563300 562686 562197 562045
59717E62045N19P12l90k284l546l461k598j827j359q92k06N38R32P92M71N39J009
59700E50994J279R48L27j52m78p07n62P9O79N49l01j298j999k268k035j393p99
59683E42863o30o68m11J31L75j28j198k302l066l533l949m315m192l263k003j337
59667E12374j534j950k008j919k096k421k485k194j670r81l22n8j51L0Q25J597
59651D95037J552Q72M84Q28J478J789J486O69k81r60j360j874k574k858k243j202
59635D90843o36q10j305j746k016j929j375o98m38p43j402k190k770k522j263
59620D69000M8M0j500l396m413m282l438k379j494r63n92n9N94J009J093J122
59604D50390J351J788K374K872K752J733M12j62L33J235J813J885J513Q05K47
$$ plain form
59717 562045 562564 563276 562886 560602 557056 553595 550997 549170 547811 546919 546713 547251 548183 548975 549446 549985 550994
59700 550994 552273 553221 553548 553396 552918 552211 551649 551728 552407 552956 552655 551357 549358 547090 545055 543662 542863
59683 542863 542233 541565 541154 541285 541660 541532 540334 538032 534966 531433 527484 523169 518977 515714 513711 512374
59667 512374 510840 508890 506882 504963 502867 500446 497961 495767 494097 493116 492794 492736 492585 492615 493440 495037
59651 495037 496589 497461 497945 498773 500251 502040 503526 504195 503914 502954 501594 499720 497146 494288 492045 490843
59635 490843 490207 489397 488092 486346 484330 482401 481026 480328 479890 479147 477745 475555 472785 470263 469000
59620 469000 469048 469088 467588 464192 459779 455497 452059 449680 448186 447223 446631 446572 447166 448175 449268 450390
59604 450390 451741 453529 455903 458775 461527 463260 463672 463510 463843 465078 466891 468776 470289 471094 471341
59589D71341M79J306J552M92j026j557q65j13k79r95j192m76M05M23n98j769k084
59572D65044j441o62m66p50r06o36j86P6N3j04j44J54Q07J522J872J690J213P60
59554D67896L85K0k08n4M40Q63R49R62J386K328L466M449N161N678O169O850P870
59537E14610R263J0936J2378J2316R433M023j489m607n185n005n092m725l285
59524E43571j703j156j235o44P33J647J336N14K50N39M62o13k310l694m267m482
59508E28948n101o112o643o146n198m682m567m029k744j390p97j090j740k149
59494D76560j996j361o55k85k56k20Q3N32P95P59P03J051J886K770L136K867K313
59477D88682J839J597J683K169K899L528L800L604K871J779R78J046J675J963
$$ plain form
59589 471341 471820 473126 474678 475170 474144 472587 471722 471609 471330 470335 469143 468667 469072 469495 468897 467128 465044
59572 465044 463603 462941 462475 461725 460819 460183 459997 460073 460126 460022 459878 460032 460839 462361 464233 465923 467136 467896
59554 467896 468281 468301 468093 468039 468479 469342 470291 471253 472639 474967 478433 482882 488043 493721 499890 506740 514610
59537 514610 523873 534809 547187 559503 568936 572959 571470 566863 561678 556673 551581 546856 543571
59524 543571 541868 540712 539477 538833 539566 541213 542549 543063 543313 543852 544314 543701 541391 537697 533430 528948
59508 528948 523847 517735 511092 504946 499748 495066 490499 486470 483726 482336 481539 480449 478709 476560
59494 476560 474564 473203 472548 472263 472007 471787 471870 472402 473197 473956 474659 475710 477596 480366 483502 486369 488682
59477 488682 490521 492118 493801 495970 498869 502397 506197 509801 512672 514451 515429 516475 518150 520113
59463E20113J583J155J296J890K501K904L028K959L146L984N001N277M832M695
59449E64364N177N243M172K818K251K107J390J49q57j602k570l489l583k947k495
59434E70128k522k427j899j365j127r49n79P9J222K785M002M296M498O012Q653
59419E90807J0620J0975J0920J1991J3962J5432J5899J6305J7559J8976J8354
59408G51800J3845N993k160p534r418r146p945o072l704j284J150L698N243L687
59394G38153j571q294j3335j5373j5161j3859j2115j0323q781p476o213n005l992
59381F16655l218k705k441k124j279P1J173J359P36j29q17j077p22K9N20L72k
59364F06401M2O38J523K504L384L779L592L443M082N403O525O818O545O423O876
$$ plain form
59463 520113 521696 522851 524147 526037 528538 531442 534470 537429 540575 544559 549560 554837 559669 564364
59449 564364 569541 574784 578956 581774 584025 586132 587522 587671 586814 585212 582642 579153 575570 572623 570128
59434 570128 567606 565179 563280 561915 560788 559839 559260 559339 560561 563346 567348 571644 576142 582154 590807
59419 590807 601427 612402 623322 635313 649275 664707 680606 696911 714470 733446 751800
59408 751800 765645 771638 769478 761944 752526 743380 735435 729363 725659 724375 725525 729223 734466 738153
59394 738153 736582 728288 714953 699580 684419 670560 658445 648122 639341 631865 625652 620647 616655
59381 616655 613437 610732 608291 606167 604888 604959 606132 607491 608227 608098 607281 606204 605482 605511 606031 606403 606401
59364 606401 606443 607081 608604 611108 614492 618271 621863 625306 629388 634791 641316 648134 654679 661102 667978
59349F67978P711Q406Q666Q748R107R799J0402J0564J0262R434P866N658L490
59336G78091J972J001J1j347l067n035p055q760r828j0297j0377j0181r802r553
59322F95773r665r863r542q554p459o872o730o430n587m394l283k503k123k165
59308F10603k376k124r64P55K338L696N192O405N995L323n08l839o150p763q595
59293F05988q274p255o536o290n839n032m532m409l657j767K62J212J267J502
59279E56640K271L012L374L696M348N229O047O721P309P812Q152Q321Q442Q640
59265F40014Q770Q386P231N682M432L670K910J634j09j796k940l490l923m762
59251F65709n787o020m946l425k766l051l162k421j348o63k87K44J039J918K791
$$ plain form
59349 667978 675689 684095 692761 701509 710616 720415 730817 741381 751643 761077 768943 774601 778091
59336 778091 780063 781064 781075 779728 776661 771626 764571 755811 745983 735686 725309 715128 705326 695773
59322 695773 686108 676245 666703 658149 650690 643818 637088 630658 625071 620677 617394 614891 612768 610603
59308 610603 608227 606103 605139 605894 608232 611928 617120 623525 629520 632843 632335 628496 622346 614583 605988
59293 605988 597714 590459 583923 577633 571794 566762 562230 557821 554164 552397 552659 553871 555138 556640
59279 556640 558911 561923 565297 568993 573341 578570 584617 591338 598647 606459 614611 622932 631374 640014
59265 640014 648784 657170 664401 670083 674515 678185 681095 682729 682620 680824 677884 674394 670471 665709
59251 665709 659922 653902 648956 645531 642765 639714 636552 634131 632783 632120 631833 632077 633116 635034 637825
59236F37825L558L990L996L715L202K359J334N19j0o36j629k808l943n045o040
59221F40387o559o327n526m685m458n320o975q145p686o002m675m544m856m610
59207E60019l875l325l062k577j558k56P61J008M67k54m19M5N84Q55J053J360
59191E50826J606J631J548J472J413J490J745J815J352P93R74J910K723K851K594
59176E76743K291J851J360J274J686K144K472K984L599L672L096K639K708K683
59162F11202K067J373J128Q37k86k086l726m706n044m929m719m854n291n513n373
59147E70080n257n217m769l967l684m249m770m481l879l716l805l590l146k710
59133E12840j949o49N74J116J231J332J138M73P0O93K084L643N280O719O993N855
$$ plain form
59236 637825 641383 645373 649369 653084 656286 658645 659979 660498 660488 659852 658223 655415 651472 646427 640387
59221 640387 633828 627501 621975 617290 612832 607512 600537 592392 584706 578704 574029 569485 564629 560019
59207 560019 556144 552819 549757 547180 545622 545366 546127 547135 547602 547348 546929 546974 547558 548413 549466 550826
59191 550826 552432 554063 555611 557083 558496 559986 561731 563546 564898 565691 566665 568575 571298 574149 576743
59176 576743 579034 580885 582245 583519 585205 587349 589821 592805 596404 600076 603172 605811 608519 611202
59162 611202 613269 614642 615770 616607 616321 614235 610509 605803 600759 595830 591111 586257 580966 575453 570080
59147 570080 564823 559606 554837 550870 547186 542937 538167 533686 529807 526091 522286 518696 515550 512840
59133 512840 510891 510242 510816 511932 513163 514495 515633 516106 516176 516869 518953 522596 527876 534595 541588 547443
59117E47443M800N248O543P173P169P537Q018P394N837M961N389N935N597M758
59103F33802M053L367K500J713J118M67j82m56n42j074k029k681k849l076l407
59088F30724l087j868o03q8k13o15j259j980k376k601l409m887n988n877m981
59073E90892m167l568k911k352k240k423k485k414k522k851l124l208l227l288
59059E50112l308l127k684k115j642j299r13m58k71n85j110j378j342j207r90
59044E27683o37l55k81o0O86J606J978J630J044N90L04K56N59J061J542K106K896
59027E42608L631M027M378N141O088O675O943P351P821P838P429P165P168O890
59013F31153N976M629L078J418n2r75j496j971k163j514k40P41J047J241J813
$$ plain form
59117 547443 552243 557491 564034 571207 578376 585913 593931 601325 607162 612123 617512 623447 629044 633802
59103 633802 637855 641222 643722 645435 646553 647020 646838 646382 645840 644766 642737 640056 637207 634131 630724
59088 630724 627637 625769 625166 625078 624865 624250 622991 621011 618635 616034 612625 607738 601750 595873 590892
59073 590892 586725 583157 580246 577894 575654 573231 570746 568332 565810 562959 559835 556627 553400 550112
59059 550112 546804 543677 540993 538878 537236 535937 535024 534566 534295 533710 532600 531222 529880 528673 527683
59044 527683 527046 526691 526410 526350 527036 528642 530620 532250 533294 533884 534188 534444 535003 536064 537606 539712 542608
59027 542608 546239 550266 554644 559785 565873 572548 579491 586842 594663 602501 609930 617095 624263 631153
59013 631153 637129 641758 644836 646254 646202 645227 643731 641760 639597 638083 637843 638584 639631 640872 642685
58998F42685K492K828K807K673K675K939L224K865J568J76j62N65J335J497J161
58983F71328L98r07k266k678j818l65R99K097K772K833K751L396M838O216P015
58968F96609P554Q016Q037P624P481P885Q094P473O427N684N297M885M274L344
58954G88684J759o31l464o197q439r845j0288j0256j0457j0853j0757r954q963
58941F90339q072p035n984n615n989o067n092l662k738k266j536l85O49J091R37
58926F38575M80J34J39K52Pn77r77r39p33n11j45J91l0p93j307r63L8J341K898
58907F37080M477N348N112M376M128M829O293Q032R417J0011R976R772R433Q705
58893G36989P910P841Q606R456R994J0744J2109J3602J4588J4984J4813J3716
$$ plain form
58998 642685 645177 648005 650812 653485 656160 659099 662323 665188 666756 666932 666770 667335 668670 670167 671328
58983 671328 671726 670819 668553 665875 664057 663692 664691 666788 669560 672393 675144 678540 683378 689594 696609
58968 696609 704163 712179 720216 727840 735321 743206 751300 758773 765200 770884 776181 781066 785340 788684
58954 788684 790443 789812 786348 780151 771712 761867 751579 741323 730866 720013 709256 699302 690339
58941 690339 682267 675232 669248 663633 657644 651577 646485 642823 640085 637819 636283 635898 636547 637638 638575
58926 638575 639055 639189 639328 639580 639587 639010 638033 637094 636361 635850 635705 635896 635866 635073 633766 632803 632841 634182 637080
58907 637080 641557 646905 652017 656393 660521 665350 671643 679675 689092 699103 709079 718851 728284 736989
58893 736989 744899 752740 761346 770802 780796 791540 803649 817251 831839 846823 861636 875352
58881H75352J1584R022O676M565K451L41j759m005o276q119r436j0588j1528j1570
58867H46710j0360q568p204o766p175p890p957o816n272m771n538o434o852p453
58853G47654q528r057q279p056o616o872p043p047p140o944o025m999m802n229
58839F52017n345n070n215n971o451n934m838m098m068m228l816k673j443p93
58825E92074n69k04K25J31k71J16J597K882K713J568Q71J140J724K035K084K037
58809F10153J883J594J173O02k2n33j004j646k277k442k202k207k735l302l501
58794E93534l513l541l437l194l080k942k251j149o13j038j590j503j091q20l43
58779E63429P29J849K202J853J444J241J059O68k30j852l682m627m281l371k573
$$ plain form
58881 875352 886936 895958 902634 907199 909650 909991 908232 904227 897951 889832 880396 869808 858280 846710
58867 846710 836350 827782 820578 813812 806637 798747 790790 783974 778702 773931 768393 761959 755107 747654
58853 747654 739126 730069 721790 714734 708118 701246 694203 687156 680016 673072 667047 662048 657246 652017
58839 652017 646672 641602 636387 630416 623965 618031 613193 609095 605027 600799 596983 594310 592867 592074
58825 592074 591505 591301 591526 591657 591386 591502 593099 595981 598694 600262 601133 602273 603997 606032 608116 610153
58809 610153 612036 613630 614803 615405 615383 614850 613846 612200 609923 607481 605279 603072 600337 597035 593534
58794 593534 590021 586480 583043 579849 576769 573827 571576 570427 569814 568776 567186 565683 564592 563772 563429
58779 563429 564158 566007 568209 570062 571506 572747 573806 574474 574244 572392 568710 564083 559802 556431 553858
58764E53858j797j088j131k125l010k719j517l43M04P58O93N12R58K155L159L253
58748E52020K842K505K108J581J563K290K927K889K878L577M441M870N388O387
58734E98266O791N621L955L587M445N011M852M811N016M565L313K303K143K255
58720F56934K129K100K494K972L143L186L509M244N154N724N466M429L146J863
58706G06493L05j500k952l899n094o988q886j0022j0691j1442j2002j1934j1587
58693F09801j1422j1046r986q668p692o834n786n065n154n449n201m674m317l654
58679E14853k289j084r49j254r49l94n48r73m51R60K140K878L905N221O036O222
58663E33324O382O590O429O057N830N181L291O82j304k355l134l696l521k892
$$ plain form
58764 553858 552061 550973 549842 547717 544707 541988 540471 540128 540532 541290 541983 542495 543453 545608 548767 552020
58748 552020 554862 557367 559475 561056 562619 564909 567836 570725 573603 577180 581621 586491 591879 598266
58734 598266 605057 610678 614633 618220 622665 627676 632528 637339 642355 646920 650233 652536 654679 656934
58720 656934 659063 661163 663657 666629 669772 672958 676467 680711 685865 691589 697055 701484 704630 706493
58706 706493 706798 705298 702346 698447 693353 686365 677479 667457 656766 645324 633322 621388 609801
58693 609801 598379 587333 577347 568679 560987 554153 548367 543302 538148 532699 527498 522824 518507 514853
58679 514853 512564 511480 510531 509277 508328 507934 507386 506413 505962 506922 509062 511940 515845 521066 527102 533324
58663 533324 539706 546296 552725 558782 564612 569793 573084 573766 572462 570107 566973 563277 559756 556864
58649E56864k677k791k430j712j593k250k956l495m165m507l625j842m80J02Q13
58634E23256K049L042L235K967K556J918J235R36R02P36P00J247J877J747J195
58619E49598J277J932K104J646J569K311L155L554L738L842L635L192K801K213
58605E86567J084n2l67m5J89L77Q70J072K32r16r64j1O64Q32J352K209K468K238
58587E97799K732M203N566O333P147Q200Q812Q854Q927Q888P868O010M594M145
58573F90078L948L687L909M701N424O031P122Q556R601J0489J2133J4263J5611
58560G95553J6031J6579J7314J6966J5130J2911J1005Q908O392L981J660j120
58548I21310l823n072m840m652n220n691n614n769o640p768q990j0634j2240j2863
$$ plain form
58649 556864 554187 551396 548966 547254 545661 543411 540455 536960 532795 528288 524663 522821 522341 522443 523256
58634 523256 525305 528347 531582 534549 537105 539023 540258 541194 542096 542832 543532 544779 546656 548403 549598
58619 549598 550875 552807 554911 556557 558126 560437 563592 567146 570884 574726 578361 581553 584354 586567
58605 586567 587651 587599 587232 587187 587376 587753 588623 589695 589927 589011 588047 588036 588700 589532 590884 593093 595561 597799
58587 597799 600531 604734 610300 616633 623780 631980 640792 649646 658573 667461 675329 681339 685933 690078
58573 690078 694026 697713 701622 706323 711747 717778 724900 733456 743057 753546 765679 779942 795553
58560 795553 811584 828163 845477 862443 877573 890484 901489 910397 916789 920770 922430 921310
58548 921310 917487 912415 907575 902923 897703 892012 886398 880629 873989 866221 857231 846597 834357 821494
58534H21494j2793j3090j3412j2406j0292q759q040o667m452l126l328l536k860
58521G18733k396k859l213k750k336k497k412j835j885k908l593l221k675k381
58507F81772j440R9N00q96k296k147j106k66M73J089P71k09j68J188J866Q54q8
58490F79996O29J997K543K700L293L760L630L906N245O553P003P551Q897R893
58476G47596R592Q962Q898Q481O902N082L749J983o05k415k543k725m451o162
58462G82344n659l528j715m36J138K614L228L706M981O269O509O456P199P792
58448H20898O548L730R51j143k743l513l223k828l228l804l675l232l036k492
58434G99210j101K59P94J164K008K587K385K404L403M394M471M417M978N290M675
$$ plain form
58534 821494 808701 795611 782199 769793 759501 750742 742702 736035 731583 728457 725129 721593 718733
58521 718733 716337 713478 710265 707515 705179 702682 700270 698435 696550 693642 690049 686828 684153 681772
58507 681772 680332 680431 680931 680035 677739 675592 674486 674220 674693 675782 676553 676344 676176 677364 679230 680084 679996
58490 679996 680625 682622 685165 687865 691158 694918 698548 702454 707699 714252 721255 728806 737703 747596
58476 747596 757188 766150 775048 783529 790431 795513 799262 801245 800640 798225 795682 792957 788506 782344
58462 782344 776685 773157 771442 771006 772144 774758 777986 781692 786673 792942 799451 805907 813106 820898
58448 820898 827446 831176 832127 830984 828241 824728 821505 818677 815449 811645 807970 804738 801702 799210
58434 799210 798109 798368 799162 800326 802334 804921 807306 809710 813113 817507 821978 826395 831373 836663 841338
58419H41338M132M357M148K541O44m40j509l234m354l935l350l868m364l698l114
58404H25294l829m317k777l87O66P20J382K456K900L290M531N527M920L804L946
58389H48126M634M097K827K696L830M916N687O652P400P382P397Q170Q755Q328
58375I30897Q041R000J0045R772R018R066R187Q328P416P547P812P305P306Q905
58361A049645J0599J0916J1142J2652J3859J2917J1210J0889J1064R897Q335Q284
58349A181409Q969Q666Q160Q978J0050R689R016R858J1111J0893J0327J1497J3534
58336A312157J4493J5201J7258J9264J9066J7925J8302J9370J8925J7797J7980
58325A507738J8300J6530J4011J3511J4147J3170J1306J1427J3227J4102J4059
$$ plain form
58419 841338 845470 849827 853975 856516 857160 856720 855211 851977 847623 843688 840338 836470 832106 828408 825294
58404 825294 821465 817148 814371 813984 814650 815370 816752 819208 822108 825398 829929 835456 840376 844180 848126
58389 848126 852760 856857 859684 862380 866210 871126 876813 883465 890865 898247 905644 913814 922569 930897
58375 930897 938938 947938 957983 967755 976773 985839 995026 1003354 1010770 1018317 1026129 1033434 1040740 1049645
58361 1049645 1060244 1071160 1082302 1094954 1108813 1121730 1132940 1143829 1154893 1164790 1173125 1181409
58349 1181409 1190378 1199044 1207204 1216182 1226232 1235921 1244937 1254795 1265906 1276799 1287126 1298623 1312157
58336 1312157 1326650 1341851 1359109 1378373 1397439 1415364 1433666 1453036 1471961 1489758 1507738
58325 1507738 1526038 1542568 1556579 1570090 1584237 1597407 1608713 1620140 1633367 1647469 1661528
58314A661528J5101J6840J7410J7599J9452K2025K3020K3297K5187K7768K8544
58303A897771K8296K9507L1494L1981L1816L3203L5038L5074L4799L6857L9588
58292B265424L9772L8840M0459M3805M5305M5349M7096N0196N1993N3311N6759
58281B778309O0904O2562O3150O6208P0464P2292P3148P7244Q3645Q8212R1672
58270C587810R7926J05974J11635J15856J23014J32277J39136J44253J52070J61770
58260D871721J68593J73098J79935J88303J93095J94797J98612K04505K07990
58251F580649K10236K17175K28806K39565K48749K60081K71516K76848K77352
58242H810977K80601K87813K93970L00111L13079L32815L52493L71748L96808
$$ plain form
58314 1661528 1676629 1693469 1710879 1728478 1747930 1769955 1792975 1816272 1841459 1869227 1897771
58303 1897771 1926067 1955574 1987068 2019049 2050865 2084068 2119106 2154180 2188979 2225836 2265424
58292 2265424 2305196 2344036 2384495 2428300 2473605 2518954 2566050 2616246 2668239 2721550 2778309
58281 2778309 2839213 2901775 2964925 3031133 3101597 3173889 3247037 3324281 3407926 3496138 3587810
58270 3587810 3685736 3791710 3903345 4019201 4142215 4274492 4413628 4557881 4709951 4871721
58260 4871721 5040314 5213412 5393347 5581650 5774745 5969542 6168154 6372659 6580649
58251 6580649 6790885 7008060 7236866 7476431 7725180 7985261 8256777 8533625 8810977
58242 8810977 9091578 9379391 9673361 9973472 10286551 10619366 10971859 11343607 11740415
58233A1740415M27070M54937M79792N08444N40921N69920N95158O23824O56222
58224A6596703O86170P15954P54425P99650Q40918Q78976R26073R84979J047489
58215B4231337J114806J197895J295418J393850J492576J605779J736458J873607
58207C5941726K018514K187070K382142K593093K827986L115781L472127L897094
58199E8435533M411455N056502N852954O804786P948759R343891J0997876J2862021
58191A21713777J4909495J7143196J9507668K1873224K4075564K5730298K5868428
58184B70821650K3039420J6282892O236280m857832j4429559k0959799k4320915
58177B51812137k5189369k4395986k2662400k0540158j8359089j6249032j4258388
$$ plain form
58233 11740415 12167485 12622422 13102214 13610658 14151579 14721499 15316657 15940481 16596703
58224 16596703 17282873 17998827 18753252 19552902 20393820 21272796 22198869 23183848 24231337
58215 24231337 25346143 26544038 27839456 29233306 30725882 32331661 34068119 35941726
58207 35941726 37960240 40147310 42529452 45122545 47950531 51066312 54538439 58435533
58199 58435533 62846988 67903490 73756444 80561230 88509989 97853880 108851756 121713777
58191 121713777 136623272 153766468 173274136 195147360 219222924 244953222 270821650
58184 270821650 293861070 310143962 316380242 311522410 297092851 276133052 251812137
58177 251812137 226622768 202226782 179564382 159024224 140665135 124416103 110157715
58170A10157715j2431323j0787689r310708p990916o844337n873218n048691m346285
58162D7524548l763381l289630k893410k551204k262631k025519j822178j640701
58154B7275894j485861j358649j246343j141603j051185r77371r09571q42021
58146A8263290p81976p32979o86837o39271n97432n65007n34845n02866m74887
58137A2747190m53432m31637m06408l84460l69255l54473l36223l19646l07740
58128I383916k95287k79473k65446k55852k45525k31783k19622k11715k03284
58119G175929j91937j82671j77976j72700j63925j56611j54065j51673j45563
58110E678808j39132j35531j31702j25163j19292j16571j13644j08055j03290
$$ plain form
58170 110157715 97726392 86938703 77627995 69637079 62792742 56919524 51870833 47524548
58162 47524548 43761167 40471537 37578127 35026923 32764292 30738773 28916595 27275894
58154 27275894 25790033 24431384 23185041 22043438 20992253 20014882 19105311 18263290
58146 18263290 17481314 16748335 16061498 15422227 14824795 14259788 13724943 13222077 12747190
58137 12747190 12293758 11862121 11455713 11071253 10701998 10347525 10011302 9691656 9383916
58128 9383916 9088629 8809156 8543710 8287858 8042333 7810550 7590928 7379213 7175929
58119 7175929 6983992 6801321 6623345 6450645 6286720 6130109 5976044 5824371 5678808
58110 5678808 5539676 5404145 5272443 5147280 5027988 4911417 4797773 4689718 4586428
58101D586428j02325j02444j00856r9274r8942r7238r3188r0299r0077q8848q4539
58090C538398q0504p8938p6735p1748o7052o5041o3204n9627n6933n6747n6014
58079B805855n2806n0365n1137n2118n0372m8200m8512m9681m9180m8098m8027
58068B257359m7562m5516m3723m3260m1840l8231l5188l4718l4531l2440l0299
58057A830051l0190l0575k9499k8055k7614k7129k6000k5939k7373k7757k6056
58046A523864k4972k6047k6680k4878k2855k2898k3550k3033k2606k3393k3595
58035A259357k2004k0678k1098k1229j9432j7758j8246j9429j9543j9727k1033
58024A039180k1726k0618j9672k0271k0381j8432j6456j6236j5932j3921j2291
$$ plain form
58101 4586428 4484103 4381659 4280803 4181529 4082587 3985349 3892161 3801862 3711785 3622937 3538398
58090 3538398 3457894 3378956 3302221 3230473 3163421 3098380 3035176 2975549 2918616 2861869 2805855
58079 2805855 2753049 2702684 2651547 2599429 2549057 2500857 2452345 2402664 2353484 2305386 2257359
58068 2257359 2209797 2164281 2120558 2077298 2035458 1997227 1962039 1927321 1892790 1860350 1830051
58057 1830051 1799861 1769286 1739787 1711732 1684118 1656989 1630989 1605050 1577677 1549920 1523864
58046 1523864 1498892 1472845 1446165 1421287 1398432 1375534 1351984 1328951 1306345 1282952 1259357
58035 1259357 1237353 1216675 1195577 1174348 1154916 1137158 1118912 1099483 1079940 1060213 1039180
58024 1039180 1017454 996836 977164 956893 936512 918080 901624 885388 869456 855535 843244
58013H43244j2978j3813j2206r630q655q582p794p519r221j0910j0078q039p492
58000G16327p915p168n669n265n632n339m897n522o336n918n105n432o389o843
57986F32897p501r240j0867j1091j0882j1361j1442j0155r062r626j0347r392
57974E11931p909p718p872o618m883m597n252n152m465m161l614k074r19j508
57960D45189k551k328j844k802m228m137l027k657k943k903l202m699n973n296
57946C96599l692l171l282k398r58m68m73M94K055K910L401M466N232M467L135
57931D08317K787K763J699L79J32r9j952m291m973m738n892q054q727p479o239
57916C63633n832n358m677m525m417l242j627j135j514j270m29j53k54K86R30
$$ plain form
58013 843244 830266 816453 804247 794617 785962 777380 769586 762067 752846 741936 731858 723819 716327
58000 716327 708412 701244 695575 690310 684678 679339 674442 668920 662584 656666 651561 646129 639740 632897
57986 632897 625396 616156 605289 594198 583316 571955 560513 550358 541296 531670 521323 511931
57974 511931 504022 496304 488432 481814 476931 472334 467082 461930 457465 453304 449690 447616 446697 445189
57960 445189 442638 440310 438466 435664 431436 427299 424272 421615 418672 415769 412567 407868 401895 396599
57946 396599 392907 389736 386454 384056 383098 382630 382157 382651 384706 387616 391017 395483 400715 405182 408317
57931 408317 411104 413867 415566 415945 416077 415978 414026 409735 404762 400024 394132 386078 377351 369872 363633
57916 363633 357801 352443 347766 343241 338824 335582 333955 332820 331306 330036 329607 329454 329200 329486 330416
57901C30416M26n80m49M76N63p6j6N54K35o29l52R39J412P18L78Q83J003J78p86
57882C35293j437k036k246j600r89j605k763k939k481k894l939l927k697j787
57868C01953j817k019k151k534k454r04J282K374K510L161M272M517M101M489
57854C16780N464N219L594K490K786L256K983K465J986J136K76L22Q09K52j348
57839C48470k482k659k820l178k918k281k543l639m038l306k635k521k082j110
57825C10258n71o47m06K22J95m80m84M65J052O16n0o09j803l597m719m743m761
57808B89938n323n558m976m372m325m314m004l774l564k753j625j380k195k855
57794B38920k664k200j807r55M06J453J825K015K167J910J591K133L481M611N178
$$ plain form
57901 330416 330842 330262 329813 330289 330852 330776 330760 331314 331549 330920 330568 331507 332919 333637 334015 334898 335901 336079 335293
57882 335293 333856 331820 329574 327974 326985 325380 322617 319678 317197 314303 310364 306437 303740 301953
57868 301953 300136 298117 295966 293432 290978 290074 291356 293730 296240 299401 303673 308190 312291 316780
57854 316780 322244 327463 331057 333547 336333 339589 342572 345037 347023 348159 348435 348757 349566 349818 348470
57839 348470 345988 343329 340509 337331 334413 332132 329589 325950 321912 318606 315971 313450 311368 310258
57825 310258 309687 309040 308634 308856 309051 308571 308087 308552 309604 310220 310170 309561 307758 304161 299442 294699 289938
57808 289938 284615 279057 274081 269709 265384 261070 257066 253292 249728 246975 245350 243970 241775 238920
57794 238920 236256 234056 232249 231294 231700 233153 234978 236993 239160 241070 242661 244794 248275 252886 258064
57779B58064N705O162N957N317M998M775L929L047L341M262L977K306J001Q84
57765C13725Q43Q1q29j513k468l584m018l921m435n526n853n054m199l594k292
57750B67363k76J041J096R24J107J033O60Q60J413R64l51n48J021K485K388J620
57734B82800J351J220Q02Q17J489J616N78l74j51N22O77O84J070J300R63P46J121
57717B97231J422J137P33L78m96j699k036j428j366k382l003k319j593k039k916
57702B79624l148l088l251l033k125j448j338n62J319K478J485k95p78j05L66
57687B66101N64J117J548J146O96J348K616L310L693M870O749Q426J0006J2295
57673C24485J5108J7536J9626K2327K5942K9930L3874L7359L8961L6438K8235
$$ plain form
57779 258064 263769 269931 275888 281205 286203 290978 294907 297954 301295 305557 309534 311840 312841 313725
57765 313725 314568 314649 313820 312307 309839 306255 302237 298316 293881 288355 282502 277448 273249 269655 267363
57750 267363 267087 268128 269224 270148 271255 272288 272948 273808 275221 276185 275834 275286 276307 278792 281180 282800
57734 282800 284151 285371 286173 286990 288479 290095 290673 290299 290148 290670 291347 292031 293101 294401 295364 296110 297231
57717 297231 298653 299790 300523 300901 300405 298706 296670 295242 293876 291494 288491 286172 284579 282540 279624
57702 279624 276476 273388 270137 267104 264979 263531 262193 261631 262950 265428 266913 266618 265840 265735 266101
57687 266101 266665 267782 269330 270476 271172 272520 275136 278446 282139 287009 293758 302184 312190 324485
57673 324485 339593 357129 376755 399082 425024 454954 488828 526187 565148 601586 629821
57662F29821J4624j996j7662k8777l4410l6230l5928l3830l0296k6722k3990k1359
57650C53245j8088j4937j2841j1327r579p943p038o381n297m214l721l320k392
57637B46167j453j094o92L85J269Q76j53l90J95N29K62k12r47k099k879k399j200
57620B36165o09q82j292j560j913k092j666j057j077j659k056k026j820j431p85
57605B14240k96k74k73J20M38J57l33n39q39j593k100j626p52n07q44j168j679
57588B02132k759l700l448k263j305j009j014j248j749j914j206k61n4l80l86
57573A79436j49l62r01j041q11q27j034q91n73p05j079r06k41J36J08L08Q44J098
57555A72410Q79P05Q35R68R30Q84Q45O39L65K40K23L01P16J366J470O17m01o07
$$ plain form
57662 629821 644445 642449 624787 596010 561600 525370 489442 455612 425316 398594 374604 353245
57650 353245 335157 320220 307379 296052 286473 278530 271492 265111 259814 255600 251879 248559 246167
57637 246167 244714 243620 242928 243313 244582 245458 245305 244915 245110 245639 245901 245689 244742 242643 239764 237365 236165
57620 236165 235556 234674 233382 231822 229909 227817 226151 225094 224017 222358 220302 218276 216456 215025 214240
57605 214240 213944 213670 213397 213517 213955 214112 213779 213240 212401 210808 208708 207082 206330 205823 204979 203811 202132
57588 202132 199373 195673 192225 189962 188657 187648 186634 185386 183637 181723 180517 180256 180202 179822 179436
57573 179436 179287 178925 178024 176983 176172 175345 174311 173420 172847 172142 171063 170157 169916 170052 170160 170468 171312 172410
57555 172410 173289 173994 174829 175797 176727 177611 178456 179095 179460 179700 179923 180224 180940 182306 183776 184393 183992 183385
57537A83385j28L16N96R23J006M98j83m45m32n26n07j23K10J52K23Q11J189P10
57519A87675J07L74J037J051O48P72J187Q73n3m92k57k74q56j273j133q72p21
57502A87793l52K78P22Q00P10M78N1k14m5J32j34m26k14P8k37q35r61p87r94j416
57482A84427j328p05m2N88J170J056lq16k11R87J109J65m85n61r33j515j169J36
57464A81870J013Q96Q83J770K822L056K477J571O52J45M17J051J210Q74P57J034
57448B02498J277J533K287L280L628L161K483J797R24L64Q83K018K459K006J710
57433B32308J948J870J103M59N46R41J218J539J822J570R08O99J204J666J560
57418B51361J284J318J712K502L646M475M324L673L593M099M343M271M592N118
$$ plain form
57537 183385 183257 183573 184169 185092 186098 186596 186413 185968 185536 185010 184503 184380 184590 184742 184965 185776 186965 187675
57519 187675 187782 188156 189193 190244 190892 191664 192851 193724 193671 193179 192922 192648 191792 190519 189386 188514 187793
57502 187793 187441 187719 188441 189241 189951 190429 190480 190266 190221 190353 190219 189793 189579 189657 189420 188585 187624 186837 185843 184427
57482 184427 183099 182394 182352 182940 184110 185166 185163 184347 184136 185123 186232 186397 185912 185351 184418 182903 181734 181870
57464 181870 182883 183779 184662 186432 189254 192310 194787 196358 197010 197155 197572 198623 199833 200707 201464 202498
57448 202498 203775 205308 207595 210875 214503 217664 220147 221944 222868 223232 224115 226133 228592 230598 232308
57433 232308 234256 236126 237229 237688 238234 239175 240393 241932 243754 245324 246232 246931 248135 249801 251361
57418 251361 252645 253963 255675 258177 261823 266298 270622 274295 277888 281987 286330 290601 295193 300311
57404C00311M798L663K967L103L016K185J561J878K517K851L300M260N209N637
57390C47256N814N989N875N538N700O536P188P023O479O149O034O131O696P545
57376D35953Q046Q175Q491Q898Q618P681P160P573Q323R047J0043J1053J1124
57363E50185J0291R813J0144J0217R503R122R954J1161J1724J2069J2892J3634
57351F80709J3487J2936J3061J3957J4943J5657J6063J6042J5779J5863J6281
57340H44778J6179J5255J4485J4699J5455J6049J6643J7511J8165J8220J8241
57329A025680J8800J9546K0112K1034K2760K4610K5733K6363K7068K7545K7257
57318A286508K6667K6622K7027K7158K6988K7179K8008K9092L0071L0883L1550
$$ plain form
57404 300311 305109 308772 311739 314842 317858 320043 321604 323482 325999 328850 332150 336410 341619 347256
57390 347256 353070 359059 364934 370472 376172 382708 389896 396919 403398 409547 415581 421712 428408 435953
57376 435953 443999 452174 460665 469563 478181 485862 493022 500595 508918 517965 528008 539061 550185
57363 550185 560476 570289 580433 590650 600153 609275 619229 630390 642114 654183 667075 680709
57351 680709 694196 707132 720193 734150 749093 764750 780813 796855 812634 828497 844778
57340 844778 860957 876212 890697 905396 920851 936900 953543 971054 989219 1007439 1025680
57329 1025680 1044480 1064026 1084138 1105172 1127932 1152542 1178275 1204638 1231706 1259251 1286508
57318 1286508 1313175 1339797 1366824 1393982 1420970 1448149 1476157 1505249 1535320 1566203 1597753
57307A597753L2168L2954L3998L5185L6489L7832L8756L8938L8999L9866M1208
57296B004146M1778M1418M1356M2077M2428M1591M0564M0670M1772M2935M3906
57285B464641M4831M5515M5954M6834M8559N0508N2091N3681N5784N8124O0301
57274C026823O2509O4865O6927O8605P0448P2374P3308P2953P2539P2747P2252
57263C796350O9750O6247O3793O2842O2383O1962O1992O2660O3877O5929O8943
57252D506728P2143P4765P7217Q0236Q3529Q6264Q8363R0081R0976R0471Q8984
57241E429757Q7317Q5472Q3076Q0437P8061P5714P2979P0142O7469O4400O0603
57230F255427N7060N4853N3612N2517N1975N2796N4396N5457N5921N6601N7275
$$ plain form
57307 1597753 1629921 1662875 1696873 1732058 1768547 1806379 1845135 1884073 1923072 1962938 2004146
57296 2004146 2045924 2087342 2128698 2170775 2213203 2254794 2295358 2336028 2377800 2420735 2464641
57285 2464641 2509472 2554987 2600941 2647775 2696334 2746842 2798933 2852614 2908398 2966522 3026823
57274 3026823 3089332 3154197 3221124 3289729 3360177 3432551 3505859 3578812 3651351 3724098 3796350
57263 3796350 3866100 3932347 3996140 4058982 4121365 4183327 4245319 4307979 4371856 4437785 4506728
57252 4506728 4578871 4653636 4730853 4811089 4894618 4980882 5069245 5159326 5250302 5340773 5429757
57241 5429757 5517074 5602546 5685622 5766059 5844120 5919834 5992813 6062955 6130424 6194824 6255427
57230 6255427 6312487 6367340 6420952 6473469 6525444 6578240 6632636 6688093 6744014 6800615 6857890
57219F857890N6863N5296N3568N1964M9879M7404M5619M5016M4898M4573M4062
57208G397032M3499M2881M2487M2739M3587M4767M6321M8199M9709N0414N1001
57197G902636N2240N3555N3924N3674N4008N5037N5743N5735N5582N5414N4594
57186H502142N2864N0753M8789M7278M6716M7270M8059M8104M7792M8222M9388
57175I037377N0311N0657N0763N0333M8729M6666M5992M7500N0327N3721N7921
57164I590297O3023O8397P3713P9317Q5176R0520R4823R7976R9218R7136R1302
57153A0530898Q2816P2893O1864M9896L7566K5169J2524R8j0627j8498k3906k8333
57141A0792360l3336m0296n0140o2787p7120r1769j05571j17422j26415j32319
$$ plain form
57219 6857890 6914753 6970049 7023617 7075581 7125460 7172864 7218483 7263499 7308397 7352970 7397032
57208 7397032 7440531 7483412 7525899 7568638 7612225 7656992 7703313 7751512 7801221 7851635 7902636
57197 7902636 7954876 8008431 8062355 8116029 8170037 8225074 8280817 8336552 8392134 8447548 8502142
57186 8502142 8555006 8605759 8654548 8701826 8748542 8795812 8843871 8891975 8939767 8987989 9037377
57175 9037377 9087688 9138345 9189108 9239441 9288170 9334836 9380828 9428328 9478655 9532376 9590297
57164 9590297 9653320 9721717 9795430 9874747 9959923 10050443 10145266 10243242 10342460 10439596 10530898
57153 10530898 10613714 10686607 10748471 10798367 10835933 10861102 10873626 10873724 10863097 10844599 10820693 10792360
57141 10792360 10759024 10718728 10668588 10605801 10528681 10436912 10331341 10213919 10087504 9955185
57131I955185j35475j36266j35118j32716j29554j25641j21357j18100j17176
57122H803782j18541j21558j26175j31936j36580j37507j34584j29843j24567
57113G642491j18394j11259j04198r7677r0725q2086p0678n4731l2368l693K9157
57102F905839O4579J02836J44786J91270K44290L06882L81005M67297N67624O86026
57092A0062434Q26301R90089J176969J383008J598049J808550K006482K193186
57084B2045068K370699K529548K645416K683142K600434K355689J929093J347038
57076D0506127O83567K9913n43674j003864j345612j578907j723160j803431j842158
57067C1378801j851687j835024j792002j723002j628723j510525j372661j222901
$$ plain form
57131 9955185 9819710 9683444 9548326 9415610 9286056 9160415 9039058 8920958 8803782
57122 8803782 8685241 8563683 8437508 8305572 8168992 8031485 7896901 7767058 7642491
57113 7642491 7524097 7412838 7308640 7210963 7120238 7038152 6967474 6912743 6880375 6876682 6905839
57102 6905839 6970418 7073254 7218040 7409310 7653600 7960482 8341487 8808784 9376408 10062434
57092 10062434 10888735 11878824 13055793 14438801 16036850 17845400 19851882 22045068
57084 22045068 24415767 26945315 29590731 32273873 34874307 37229996 39159089 40506127
57076 40506127 41189694 41219607 40675933 39672069 38326457 36747550 35024390 33220959 31378801
57067 31378801 29527114 27692090 25900088 24177086 22548363 21037838 19665177 18442276
57059A8442276j070092r21736p83656o59947n51936m58114l76325l05572k45186
57050A3069712j93454j48497j09929p8279n3051l2559j5409j000J1316K2209L1527
57039A2502586L8646M3853M8222N2099N4845N6383N7755N9897O2930O6837P1267
57028A3115320P3932P0684N8772L9813J8865R51j1137j6805j6991j3582q624l505
57016A3307693J181N287Q893J2082J4662J6205J6522J5912J4937J4130J3900J4407
57004A3455811J5554J7375K0188K3883K7401K9553L0182K9851K8503K5319J9905
56993A3723525J2937N563j221o682j0572j3222j4809j4718j2410q678n076k254
56981A3652383J31K020K785K555K484L258M287M706M258K957Q36j701m120o635
$$ plain form
57059 18442276 17372184 16450448 15666792 15006845 14454909 13996795 13620470 13314898 13069712
57050 13069712 12876258 12727761 12617832 12539553 12486502 12453943 12438534 12437534 12448850 12471059 12502586
57039 12502586 12541232 12585085 12633307 12685406 12740251 12796634 12854389 12914286 12977216 13044053 13115320
57028 13115320 13189252 13259936 13318708 13358521 13377386 13378337 13367200 13350395 13333404 13319822 13311198 13307693
57016 13307693 13308874 13314161 13323054 13335136 13349798 13366003 13382525 13398437 13413374 13427504 13441404 13455811
57004 13455811 13471365 13488740 13508928 13532811 13560212 13589765 13619947 13649798 13678301 13703620 13723525
56993 13723525 13736462 13742025 13740804 13734122 13723550 13710328 13695519 13680801 13668391 13659713 13654637 13652383
56981 13652383 13652514 13654534 13657319 13659874 13662358 13665616 13669903 13674609 13678867 13681824 13682660 13680959 13676839 13670204
56967A3670204r939j3993j7877k0921k2991k3713k2690k0603j8813j7598j6125
56956A3464941j4407j3862j5417j8434k2014k5944k9664l1822l1835l0804l0067
56945A3200671k9918l0412l2150l5300l9022m2742m6851n1280n4659n6049n6362
56934A2725926n6736n6546n4494n0894m7620m6367m8080n3334o1733p1328p9962
56923A2098832q7093r3439r9302j04243j07996j10613j11920j11765j10531j08677
56913A1053253j06121j02809r9493r7055r5423r3963r2488r1106q9491q7275q4917
56902A0013112q3272q2476q1985q1540q1469q2160q3756q6087q8505r0060r0284
56891I081518q9382q7468q4282p9999p5481p1268o7257o4051o3479o6758p2876
$$ plain form
56967 13670204 13660265 13646272 13628395 13607474 13584483 13560770 13538080 13517477 13498664 13481066 13464941
56956 13464941 13450534 13436672 13421255 13402821 13380807 13354863 13325199 13293377 13261542 13230738 13200671
56945 13200671 13170753 13140341 13108191 13072891 13033869 12991127 12944276 12892996 12838337 12782288 12725926
56934 12725926 12669190 12612644 12558150 12507256 12459636 12413269 12365189 12311855 12250122 12178794 12098832
56923 12098832 12011739 11918300 11818998 11714755 11606759 11496146 11384226 11272461 11161930 11053253
56913 11053253 10947132 10844323 10744830 10647775 10552352 10458389 10365901 10274795 10185304 10098029 10013112
56902 10013112 9929840 9847364 9765379 9683839 9602370 9520210 9436454 9350367 9261862 9171802 9081518
56891 9081518 8992136 8904668 8820386 8740387 8664906 8593638 8526381 8462330 8398851 8332093 8259217
56880H259217p9724q6161r2065r7143j00907j03296j04329j03609j01125r8009
56870G292849r5441r3265r0578q7164q3336p8939p3680o8112o3216n9246n5918
56859F443954n3572n3403n6752o4666p7290r2773j07445j18223j24487j26986
56849E568357j25985j21753j15885j10270j05126r9525r3580q8449q4313q0063
56839D543408p5198p0544o6783o3489n9993n6182n2369m9630n0521n8039p2834
56828C867826r1975j10794j25509j34215j36606j33730j27541j19979j12183j04434
56818B670860r6602q8679q1049p4117o7521o0319n2229m4167l7011l0520k4099
56807B014547j8134j3973j3138j7137k6928m1410n6883o9360p7204q0922q1234
$$ plain form
56880 8259217 8179493 8093332 8001267 7904124 7803217 7699921 7595592 7491983 7390858 7292849
56870 7292849 7197408 7104143 7013565 6926401 6843065 6764126 6690446 6622334 6559118 6499872 6443954
56859 6443954 6390382 6336979 6280227 6215561 6138271 6045498 5938053 5819830 5695343 5568357
56849 5568357 5442372 5320619 5204734 5094464 4989338 4889813 4796233 4707784 4623471 4543408
56839 4543408 4468210 4397666 4330883 4267394 4207401 4151219 4098850 4049220 3998699 3940660 3867826
56828 3867826 3775851 3665057 3539548 3405333 3268727 3134997 3007456 2887477 2775294 2670860
56818 2670860 2574258 2485579 2404530 2330413 2262892 2202573 2150344 2106177 2069166 2038646 2014547
56807 2014547 1996413 1982440 1969302 1952165 1925237 1883827 1826944 1757584 1680380 1599458 1518224
56796A518224p8637p4215o9201o3799n7657n1327m5923m1505l7096l2302k7634
56785I38928k3254j8641j3660q842m610j315m5k087p399j4646k2719l0977l8013
56772G52720m1824m1875l9895l7919l6307l4157l0885k6880k3102k0405j8797
56761D00674j7445j5786j4428j4092j4097j3037j0886r118q571q406p635o531
56749B60642n875n712n493m930m231l780l843m266m454m027l367l005k822k506
56735B02331k404k935l538l287k491k392l235l777l009j406j11L29J24j53K6N83
56719A74655P44J11n28k52N36P49L04o2l15j010j769j447PJ363J977K332K454
56702A79849J460o41k239k054p29L23O10L94j66r10j431j584j638j651j435j418
$$ plain form
56796 1518224 1439587 1365372 1296171 1232372 1174715 1123388 1077465 1035960 998864 966562 938928
56785 938928 915674 897033 883373 874531 869921 868606 868561 866474 859075 844429 821710 790733 752720
56772 752720 710896 669021 629126 591207 554900 520743 489858 462978 439876 419471 400674
56761 400674 383229 367443 353015 338923 324826 311789 300903 291785 283214 274808 267173 260642
56749 260642 254767 249055 243562 238632 234401 230621 226778 222512 218058 214031 210664 207659 204837 202331
56735 202331 199927 196992 193454 190167 187676 185284 182049 178272 175263 173857 173746 174075 174199 174046 174072 174655
56719 174655 175399 175510 174982 174730 175266 176015 176319 176257 175942 174932 173163 171716 171723 173086 175063 177395 179849
56702 179849 181309 180668 178429 176375 175646 175969 176579 176973 176807 175897 174466 172882 171244 169593 168158 166740
56686A66740k370l946m564l385j430j68R5j78p32j347j532j133o42m11j85J82
56670A44994L93M85J037K049K559J948R05L74L86N00O47Q23O83J19l14k04N5n2
56652A57387l66m76l47o5M70J080J129L47o50j058o38M45J853K872K725J539L73
56635A66620r2k43n94r75r98o91j62O14J326J241J23j358k382k694k420j887j753
56618A53675k465l459l609k718j635q70k33J26m11j554j930r41L52P78M84J51
56602A35741j73o37r63r41q17o35nR68J466J133N25K2n92j054m85R78J812J219
56584A37562L58M48R40P48P8k43k37l13j70N01J079J013J030J958L033K821J414
56567A52020L72O78J954L449M693N282N053M475M158M089L908L630L432L095K305
$$ plain form
56686 166740 164370 160424 155860 152475 151045 150877 150972 150794 150062 148715 147183 146050 145408 144997 144812 144994
56670 144994 145387 145872 146909 148958 151517 153465 154370 154744 155130 155630 156277 157100 157783 157902 157588 157384 157439 157387
56652 157387 157021 156545 156198 156133 156603 157683 158812 159159 158509 157451 156813 157258 159111 161983 164708 166247 166620
56635 166620 166528 166285 165691 164716 163718 163027 162865 163479 164805 166046 166169 164811 162429 159735 157315 155428 153675
56618 153675 151210 147751 144142 141424 139789 138919 138686 138812 138401 136847 134917 133976 134328 135106 135590 135741
56602 135741 135568 134931 133968 133027 132210 131575 131570 132538 134004 135137 135662 135684 135092 134038 133553 134531 136343 137562
56584 137562 137920 138368 139308 140056 140134 139891 139654 139341 139171 139672 140751 141764 142794 144752 147785 150606 152020
56567 152020 152392 153070 155024 158473 163166 168448 173501 177976 182134 186223 190131 193761 197193 200288 202593
56552B02593J285M75l0l53n24p61j447k360k603j861j069j187j939k360k034j219
56536A84606l60M5l07r83j190r76j103j557j387l92L57K94J74M65M56p5oJ065
56518A79126J588M03j154j232l39k67j210j941k082k256k413j922j040o68q58
56503A63735j011j102j327j111L8J112Q08l28o55RL81O2j0N14Q01M10q2k88m93
56484A61463o82l70L80R26J136J406J572J002j35q48p32l25m3K83P28J106J491
56467A68358J965K068J422O01L75M18o8q42j026o45l56J7J060K089J663o0j233
56450A75806q79LK67P2k9n0K0N67J466J860J368O44K87P0l29p20q83r11o91R1
56430A78029J141J537R29N4k80o7L17P45J255J747K048J992J491Q44O24Q69P99
$$ plain form
56552 202593 203878 204353 204323 203970 203446 202685 201238 198878 196275 194414 193345 192158 190219 187859 185825 184606
56536 184606 184246 184291 183984 183001 181811 180835 179732 178175 176788 176396 176753 177047 177221 177686 178142 178067 178061 179126
56518 179126 180714 181117 179963 178731 178392 178125 176915 174974 172892 170636 168223 166301 165261 164593 163735
56503 163735 162724 161622 160295 159184 159222 160334 161142 160814 160159 160168 160549 160611 160601 161115 161916 162326 162244 161956 161463
56484 161463 160781 160411 160791 161717 162853 164259 165831 166833 166698 165850 165118 164793 164750 165033 165761 166867 168358
56467 168358 170323 172391 173813 174414 174789 175207 175139 174297 173271 172626 172270 172287 173347 175436 177099 177039 175806
56450 175806 174927 174930 175197 175269 175240 175190 175210 175777 177243 179103 180471 181115 181402 181472 181143 180423 179540 178629 177938 178029
56430 178029 179170 180707 181636 181690 181410 181343 181660 182405 183660 185407 187455 189447 190938 191782 192406 193275 194074
56413A94074J1o68l52M90Q10O78R06J377J197L82l8L01O43N65N64R33J134P89
56395B03796L57M06Q97J469J813J703J218Q81J063J416J472J410J542J586J286
56380B22315J159J553J675P89j93J24J332J729R19J41R8J60p0j7N94J143J197
56363B34648J033P79K15m16m76RM80R81J949K894K776J808J420K075K544J852
56347B54571O82K52Q10J778K574K931K979L190L682L776K954J764R07J0j450k673
56331B78737k473j200j29N98J720K904L157K869L390M503M523L079J721J319J098
56316C05816O62Q49J804K264J719J417K230L203L274K903K932L239L537M255N546
56301C45650O485O243N252M543M615N347O127O010M766L822M762O962Q196P735
$$ plain form
56413 194074 194085 193417 193065 193555 194365 195043 195949 197326 198523 198905 198867 199168 199811 200376 200940 201873 203007 203796
56395 203796 204153 204559 205456 206925 208738 210441 211659 212540 213603 215019 216491 217901 219443 221029 222315
56380 222315 223474 225027 226702 227491 227298 227422 228754 230483 231402 231543 231641 231801 231731 231714 232308 233451 234648
56363 234648 235681 236460 236675 236259 235783 235792 236272 237253 239202 242096 244872 246680 248100 250175 252719 254571
56347 254571 255253 255505 256315 258093 260667 263598 266577 269767 273449 277225 280179 281943 282850 282860 281410 278737
56331 278737 276264 275064 274935 275533 277253 280157 283314 286183 289573 294076 298599 301678 303399 304718 305816
56316 305816 306478 307327 309131 311395 313114 314531 316761 319964 323238 326141 329073 332312 335849 340104 345650
56301 345650 352135 358378 363630 368173 372788 378135 384262 390272 395038 398860 403622 410584 418780 426515
56287D26515P070P380Q119Q602R129R828J0082R806R842J0469J0945J0990J1201
56274E49978J1673J1817J1912J3006J4966J6437J7174J8320K0016K0983K1136
56263G27418K2228K4897K7450K8738L0010L2532L5504L7904M0526M4507M9424
56252A101138N4343N9422O5064P0870P6548Q2483Q8376R2883R5612R7793R9864
56241A984396J00240R7662R2953Q7071P9218O8444N5405M1091K5393Q432q324
56230B631981k3773l8455n2609o4693p3433p9778q5169q9257r1101r1169r0442
56219A852102q8734q5591q1640p7576p2953o7498o2317n8370n4943n0980m6704
56208A104796m2652l8533l4399l1359k9762k8168k5566k3016k1584k0349j8130
$$ plain form
56287 426515 433585 440965 449084 457686 466815 476643 486725 496531 506373 516842 527787 538777 549978
56274 549978 561651 573468 585380 598386 613352 629789 646963 665283 685299 706282 727418
56263 727418 749646 774543 801993 830731 860741 893273 928777 966681 1007207 1051714 1101138
56252 1101138 1155481 1214903 1279967 1350837 1427385 1509868 1598244 1691127 1786739 1884532 1984396
56241 1984396 2084636 2182298 2275251 2362322 2441540 2509984 2565389 2606480 2631873 2640305 2631981
56230 2631981 2608208 2569753 2517144 2452451 2379018 2299240 2214071 2124814 2033713 1942544 1852102
56219 1852102 1763368 1677777 1596137 1518561 1445608 1378110 1315793 1257423 1202480 1151500 1104796
56208 1104796 1062144 1023611 989212 957853 928091 899923 874357 851341 829757 809408 791278
56197G91278j5547j3619j1906r831q305q118q207p384o432o491o772n828l960
56184F78878k529j915j780k149k707k347q85K03J93M69J930L061K525J730K558
56169F77235M305N168N233N593N985N647N275N874O884P469Q293R975J1349J1451
56155G75736J1633J3380J5597J6515J6730J7842J9615K1030K2735K5822K9494
56144I86129L2635L6308M2047M8902N4872O0004O5339P0003P2046P1187O8118
56133A607590O2437N3912M4713L7632L3098L0085K8417K7530K4771J8140R444
56122A977769J874m121r666j4032j5989j7273k1068k7871l5967m4710n3908o1181
56110A673857o3751o2187n8988n4444m7467l9483l3485k9677k5684k0779j6443
$$ plain form
56197 791278 775731 762112 750206 740375 732070 723952 715745 708361 701929 695438 688666 682838 678878
56184 678878 676349 674434 672654 670505 667798 665451 664566 664769 664962 665431 667361 670422 672947 674677 677235
56169 677235 681540 686708 691941 697534 703519 709166 714441 720315 727199 734668 742961 752936 764285 775736
56155 775736 787369 800749 816346 832861 849591 867433 887048 908078 930813 956635 986129
56144 986129 1018764 1055072 1097119 1146021 1200893 1260897 1326236 1396239 1468285 1539472 1607590
56133 1607590 1670027 1723939 1768652 1806284 1839382 1869467 1897884 1925414 1950185 1968325 1977769
56122 1977769 1979643 1975522 1965856 1951824 1935835 1918562 1897494 1869623 1833656 1788946 1735038 1673857
56110 1673857 1610106 1547919 1488931 1434487 1387020 1347537 1314052 1284375 1258691 1237912 1221469
56099A221469j3127r910o968n204l809j327J443K732L120M379N960O128N685O858
56085A217429R275J0645J0764J1270J2213J2470J2728J4349J6138J6020J5027
56074A358328J5712J7610J8397J8493K0109K2584K3244K2373K2765K4756K6140
56063A590511K6592K7740K9278K9436K8930K9958L1801L1934L0968L1728L4003
56052A922879L5015L4687L5457L7316L8064L8082L9743M2516M3903M4675M7758
56041B360095N2354N4875N5447N7581O1534O4074O4937O7480P2508P7365Q1432
56030C069682Q6711R2838R7485J01735J08878J17896J24570J28950J35022J42968
56020D206735J48886J52474J57596J64729J70277J74028J79746J87552J93479
$$ plain form
56099 1221469 1208342 1198432 1191464 1186260 1182451 1181124 1182567 1185299 1188419 1192798 1198758 1204886 1210571 1217429
56085 1217429 1226704 1237349 1248113 1259383 1271596 1284066 1296794 1311143 1327281 1343301 1358328
56074 1358328 1374040 1391650 1410047 1428540 1448649 1471233 1494477 1516850 1539615 1564371 1590511
56063 1590511 1617103 1644843 1674121 1703557 1732487 1762445 1794246 1826180 1857148 1888876 1922879
56052 1922879 1957894 1992581 2028038 2065354 2103418 2141500 2181243 2223759 2267662 2312337 2360095
56041 2360095 2412449 2467324 2522771 2580352 2641886 2705960 2770897 2838377 2910885 2988250 3069682
56030 3069682 3156393 3249231 3346716 3448451 3557329 3675225 3799795 3928745 4063767 4206735
56020 4206735 4355621 4508095 4665691 4830420 5000697 5174725 5354471 5542023 5735502
56011E735502J97569K04585K15557K26289K35242K44917K54623K60246K62344
56002G836874K66106K72370K77474K82634K93868L11464L29390L46466L67861
55993A0584507L94037M19054M41717M67314M96134N21812N43505N68067N97566
55984A5033713O26762O55427O90182P31254P70835Q07948Q51120R03293R58879
55975B2029413J018924J092902J181322J273565J367534J473704J595142J723169
55967C2755675J858468K015639K200428K404911K632615K904887L235289L624279
55959E3632191M087383M659250N361601O201719P211803Q446413R924009J1615124
55951A11139493J3501668J5586779J7821131K0082653K2216917K3903203K4335629
$$ plain form
56011 5735502 5933071 6137656 6353213 6579502 6814744 7059661 7314284 7574530 7836874
56002 7836874 8102980 8375350 8652824 8935458 9229326 9540790 9870180 10216646 10584507
55993 10584507 10978544 11397598 11839315 12306629 12802763 13324575 13868080 14436147 15033713
55984 15033713 15660475 16315902 17006084 17737338 18508173 19316121 20167241 21070534 22029413
55975 22029413 23048337 24141239 25322561 26596126 27963660 29437364 31032506 32755675
55967 32755675 34614143 36629782 38830210 41235121 43867736 46772623 50007912 53632191
55959 53632191 57719574 62378824 67740425 73942144 81153947 89600360 99524369 111139493
55951 111139493 124641161 140227940 158049071 178131724 200348641 224251844 248587473
55944B48587473K2238901J6636184P858521k277733j1453384j8098115k1859467
55937B41632380k3208564k2863184k1494226j9637941j7642099j5670352j3792304
55930A07323710j2057106j0489293r078899p815515o709452n764922m961311m276412
55922D6170800l703340l231657k835752k495390k208019j970170j766073j584738
55914B6375661j429943j303205j193357j092146j004249r32768q69391q07551
55906A7743051p51696p05277o62395o19052n80448n49471n19671m86937m57016
55897A2411088m34220m13287l89578l67281l50361l34825l16943l00287k87911
55888I216395k75920k61325k48238k39994k32706k22799k13583k08254k03325
$$ plain form
55944 248587473 270826374 287462558 295321079 293043346 281589962 263491847 241632380
55937 241632380 218423816 195560632 174066406 154428465 136786366 121116014 107323710
55930 107323710 95266604 84777311 75698412 67882897 61173445 55408523 50447212 46170800
55922 46170800 42467460 39235803 36400051 33904661 31696642 29726472 27960399 26375661
55914 26375661 24945718 23642513 22449156 21357010 20352761 19419993 18550602 17743051
55906 17743051 16991355 16286078 15623683 15004631 14424183 13874712 13355041 12868104 12411088
55897 12411088 11976868 11563581 11174003 10806722 10456361 10121536 9804593 9504306 9216395
55888 9216395 8940475 8679150 8430912 8190918 7958212 7735413 7521830 7313576 7110251
55879G110251j95105j86220j79955j74255j66769j60012j56165j52428j46446
55870E592896j40825j37590j33745j27015j20443j16591j12744j06581j01201
55861D496161r9612r9255r6938r4337r3833r3587r1443q9283q8832q7523q3217
55850C478301p8804p7413p7064p4656p1399o9609o7887o4175o0231n8481n7512
55839B721070n5019n2274n1318n0721m8423m6018m6055m7438m7480m6299m5483
55828B184542m4653m2857m1122m0396l9260l6699l4643l4674l4951l3558l2050
55817A769679l2292l2641l0934k8657k8258k8665k7374k4994k3872k3855k3130
55806A465007k1869k1539k1817k1324k0309j9781j9231j7755j6098j5185j4268
$$ plain form
55879 7110251 6915146 6728926 6548971 6374716 6207947 6047935 5891770 5739342 5592896
55870 5592896 5452071 5314481 5180736 5053721 4933278 4816687 4703943 4597362 4496161
55861 4496161 4396549 4297294 4200356 4106019 4012186 3918599 3827156 3737873 3649041 3561518 3478301
55850 3478301 3399497 3322084 3245020 3170364 3098965 3029356 2961469 2897294 2837063 2778582 2721070
55839 2721070 2666051 2613777 2562459 2511738 2463315 2417297 2371242 2323804 2276324 2230025 2184542
55828 2184542 2139889 2097032 2055910 2015514 1976254 1939555 1904912 1870238 1835287 1801729 1769679
55817 1769679 1737387 1704746 1673812 1645155 1616897 1588232 1560858 1535864 1511992 1488137 1465007
55806 1465007 1443138 1421599 1399782 1378458 1358149 1338368 1319137 1301382 1285284 1270099 1255831
55795A255831j2777j2248j3828j5813j6223j5911j6540j7467j7452j7471j8878
55784A081223k0467k0503k0022k1120k3268k4339k4032k3392k2211j9734j6936
55773H45199j5271j4098j1888r117p575p655q612j0358j2842j4724j4963j4617
55761G03479j5066j5609j4999j3884j3479j3127j1649r873r398r920j0114j0028
55749E56333j0339j0389r371q354q740r696r511q504q197q572q450p860p727p900
55735D32723p602p057o816o402n428m919n596o182n493m760n547o833o740n894
55721C47454o242p570p988p141o166n191l600k175k199k885k317p19j23j046j942
55706B90150j960j795j885j885k036k984m244m715m617n090o103o552o148n502
$$ plain form
55795 1255831 1243054 1230806 1216978 1201165 1184942 1169031 1152491 1135024 1117572 1100101 1081223
55784 1081223 1060756 1040253 1020231 999111 975843 951504 927472 904080 881869 862135 845199
55773 845199 829928 815830 803942 794825 787250 779595 770983 760625 747783 733059 718096 703479
55761 703479 688413 672804 657805 643921 630442 617315 605666 595793 586395 576475 566361 556333
55749 556333 545994 535605 526234 517880 509140 499444 489933 481429 473232 464660 456210 448350 440623 432723
55735 432723 425121 418064 411248 404846 399418 394499 388903 382721 377228 372468 366921 360088 353348 347454
55721 347454 341212 333642 325654 318513 312347 307156 303556 301381 299182 296297 293980 293261 293138 292092 290150
55706 290150 288190 286395 284510 282625 280589 277605 273361 268646 264029 258939 252836 246284 240136 234634
55692B34634m701l556k784l141l838l630k889k728k803k066r56o26n64O11K350
55677B03313K723J615R02J372J779J216K76n33j578k881l772m001l840l078j380
55662A92133M78J268J039P17M00l57j003o16L04M70m1j48J06k07q56p22l9j85
55644A92741j308k173k447l067m180m743m428m091m068l769l204l147l610l745
55630A44761l427l308l306k751j951j868k233j878r31o78j221j279n72l35j060
55615A17963j703j637j478j524j174m82n01j504k373k357j918j448o78J31Q4p99
55599I8602j353j075p42q73j044j033j165j213n43L68K47q05j174k78N23J89n26
55582H8105o03k12J26M76Q43P58K43M9M17P76R22J263J703J669J482K082L109
$$ plain form
55692 234634 229933 226377 223593 220452 216614 212984 210095 207367 204564 202498 201542 200916 200352 200963 203313
55677 203313 206036 207651 208553 209925 211704 212920 213196 212663 211085 208204 204432 200431 196591 193513 192133
55662 192133 192611 193879 194918 195635 196035 195678 194675 194059 194363 194833 194792 194644 194750 194543 193687 192965 192926 192741
55644 192741 191433 189260 186813 183746 179566 174823 170395 166304 162236 158467 155263 152116 148506 144761
55630 144761 141334 138026 134720 131969 130018 128150 125917 124039 123108 122430 121209 119930 119358 119023 117963
55615 117963 116260 114623 113145 111621 110447 109965 109464 107960 105587 103230 101312 99864 99186 99317 99401 98602
55599 98602 97249 96174 95432 94559 93515 92482 91317 90104 89561 89929 90176 89371 88197 87919 88442 88631 88105
55582 88105 87502 87290 87416 87892 88735 89493 89736 89785 90202 90978 91900 93163 94866 96535 98017 100099 103208
55565A03208L001J441nl24l92j148k082k467k582k822k862k618k650k939k592
55550H2167j504q96j314j619q84Q7K02j70p1M89R51J303J724J942J776J609J685
55533H7477J627J199P10K44m78j129q78P7L85m45j231j064o99j128j976k388k456
55516G7847k718l069l082k710k027r89lK15j70j15O29J019N24J20O20J261J005
55499F8357K12j14J19K91J36k18o96j052r26n64o67j132r47J64J115J131P78P32
55481F6719P25N51Q00J568J705M85r71j206m16J38k0m48p45o46P5R79R12m87j992
55462F7726k346j767j114n26J63N77M79M44Q86J182P65K16K29L68m2o46q07q23
55444F4964j164j256l81Q67J291Q34L59J61r6m06n14o78j169j435p90L46R90J007
$$ plain form
55565 103208 106209 107650 107645 107321 106929 105781 103699 101232 98650 95828 92966 90348 87698 84759 82167
55550 82167 80663 79767 78453 76834 75950 76037 76239 76069 75998 76487 77438 78741 80465 82407 84183 85792 87477
55533 87477 89104 90303 91013 91257 90779 89650 88772 88849 89234 88789 87558 86494 85795 84667 82691 80303 77847
55516 77847 75129 72060 68978 66268 64241 63252 63249 63464 63294 63179 63808 64827 65351 65471 66091 67352 68357
55499 68357 68569 68455 68574 68865 69001 68783 68087 67035 66109 65545 64878 63746 62799 62963 64078 65209 65987 66719
55481 66719 67444 67995 68795 70363 72068 72553 71582 70376 69960 70098 70078 69630 68885 68239 68314 69293 70205 69718 67726
55462 67726 65380 63613 62499 61973 62136 62713 63192 63636 64522 65704 66469 66685 66914 67282 67240 66594 65787 64964
55444 64964 63800 62544 62163 63030 64321 65155 65514 65675 65579 65173 64659 63981 62812 61377 60587 60933 61923 62930
55426F2930R95J041O61k21j118j673j731j046L14J592K110K021J710J005j24q19
55410F7647l20O89Q59l6j051j496j489j247q46n42n48n86l08Q9K08J64L18N95
55392F2100O61M45K7n30q48m47L26L94l94p47O9Q63K78j076j599j091o07m70p7
55373E7277N92P65K04m10n92m63j30L93P07L83k52n11l30q7K70R72J576J401O94
55354F2459M10Q70J456J519Q91l18j638k214j672p81m52m79j33M80O74M64M15
55337F1951N09K65j86k36M3km09n17j41J81J34q4l67p44q59l05N31Q41N22J62
55317F1289J8p5K6N56J090J024O95Q59J213P36m37r07j46O29L20m77o16k19l24
55298F5254j148j713j209p0N82K73l34m16j08j57o17o52P0P14N84K73O49J392
$$ plain form
55426 62930 63925 64966 65627 65406 64288 62615 60884 59838 60152 61744 63854 65875 67585 68590 68466 67647
55410 67647 67327 68016 68875 68839 67788 66292 64803 63556 62710 62168 61620 61034 60726 60815 61023 61187 61505 62100
55392 62100 62761 63206 63233 62703 61855 61408 61734 62128 61734 60987 61056 61919 62197 61121 59522 58431 57824 57354 57277
55373 57277 57869 58634 58838 58428 57836 57373 57243 57636 58343 58726 58474 57963 57633 57546 57816 58788 60364 61765 62459
55354 62459 62869 63739 65195 66714 67605 67287 65649 63435 61763 60982 60530 60051 59918 60398 61072 61536 61951
55337 61951 62460 62725 62539 62303 62346 62344 61935 61418 61277 61458 61592 61508 61141 60397 59538 59233 59764 60605 61127 61289
55317 61289 61307 61232 61258 61814 62904 63928 64623 65482 66695 67431 66994 66087 65941 66570 66890 66413 65797 65578 65254
55298 65254 64106 62393 61184 61114 61696 61969 61635 61219 61111 60954 60337 59685 59755 60469 61053 61326 61975 63367
55280F3367J565J115P89Q00O79K60r8j88j43m8p3o14j634k256j763o41J90N84
55262F1891P76N23k50n90L53J760K150J502R75Q54M27l45o72n60q75j601j590
55245F4728m63O90R26N19K0m87q15n59j3k1o06q28l63J1j88m55m21m12m69j4R35
55224F1715J355P13j65l07K64J095J972K514K138R95N7k53n37j132j450j133p05
55207F7136m97o9O39P99J11m14LO73O90L74M45O86O25O06J017J212M74n50p05
55188G3255j77j81j045j849j889j370o25L41J320J731J293L73m09o13j00Q44J508
55171G2407J385P13J62K4K9j53n41q61p79k47L39N30L75K76K62j3n25p35m14k5
55151G2209L5n7m8j00l69o24o02l46O8N73P81K37p19j062m54K78M05K94N71J058
$$ plain form
55280 63367 64932 66047 66836 67636 68315 68575 68477 68289 68146 68098 68025 67411 65777 63521 61758 61117 61307 61891
55262 61891 62667 63190 62940 62350 62703 64463 66613 68115 69090 69944 70371 70026 69354 68794 67919 66318 64728
55245 64728 64265 64955 65881 66400 66420 65933 65118 64559 64546 64525 63919 63091 62728 62739 62551 62096 61675 61263 60794 60780 61715
55224 61715 63070 63783 63618 63311 63575 64670 66642 69156 71294 72289 72346 72093 71556 70424 68974 67841 67136
55207 67136 66639 66570 67209 68008 68119 67705 67708 68381 69071 69445 69890 70576 71201 71807 72824 74036 74510 73960 73255
55188 73255 73078 72897 71852 70003 68114 66744 66119 66460 67780 69511 70804 71177 70768 70155 70055 70899 72407
55171 72407 73792 74505 74667 74691 74720 74567 74026 73165 72386 72139 72478 73008 73383 73659 73921 73908 73383 72648 72234 72209
55151 72209 72244 72187 72139 72039 71670 71046 70444 70098 70166 70739 71520 71757 71038 69976 69522 69800 70205 70499 71070 72128
55131G2128J239J150J113J037O86K51jk49p31j164j075m90J82O28O90L12j99l08
55113G5199j6R5j20L1R02J658J338K59l89n7P36J236J127N61M4O1L93J77r26k077
55093H0232k280j619q86m06M2M57N36L20K38N46J107J654J898J574P51m4l41k28
55075H3551m5J60N38J045J424J466J102M57j15l93o06j014j191m88P29J177K96
55058H8093j003j647j649j507j229o39k7K18J68J9l02o97p33m25m57j019j198
55041G5966l36P77R03O5p34r08o14m2O57J047Q75N47M81L94n2m21j09O16J100
55022H0212J339J597J486M95r08j712j744j559j253m52O15J142R31O46P43R79
55006H2557R93O66l8q46r33K20J802K394J704P30K82K54L38M69M19r3o78n31L76
$$ plain form
55131 72128 73367 74517 75630 76667 77353 77604 77603 77354 76623 75459 74384 73894 74076 74704 75394 75706 75507 75199
55113 75199 75183 75278 75158 75189 76091 77749 79087 79346 78957 78900 79636 80872 81999 82560 82604 82665 83058 83235 82309 80232
55093 80232 77952 76333 75447 75041 75083 75540 76076 76396 76634 77180 78287 79941 81839 83413 84164 84120 83779 83551
55075 83551 83506 83666 84204 85249 86673 88139 89241 89698 89583 89190 88584 87570 86379 85891 86620 87797 88093
55058 88093 87090 85443 83794 82287 81058 80419 80392 80610 80778 80797 80495 79798 79065 78640 78183 77164 75966
55041 75966 75630 76407 77310 77375 76641 75733 75119 75077 75734 76781 77656 78203 78684 79078 79026 78605 78496 79112 80212
55022 80212 81551 83148 84634 85129 84221 82509 80765 79206 77953 77501 78116 79258 80189 80835 81578 82557
55006 82557 83550 84216 84178 83332 82399 82619 84421 86815 88519 89249 89531 89785 90123 90592 91011 90918 90240 89709 90085
54987I0085J082R06J65n40j006j107o17K72Q69Q19N41M92N44L56l2l24l31q1K42
54968I2335L30R7q1J73O20O47J28m76q08r02p66l13K42M65K83J04K11N07P90R45
54948I4531Q52N07J69j5k72p32r78o20KL28M57P90J121R57N20M47O24L92j53j43
54928I8784N95J209J198J099J473K120K715L363M069M414M266M090M180M225L954
54913A41754L525K933J812J75j433k769m067m997m627k918j338j117j799k347
54899A22787k738l373l674k736r70K10L11K33O59J116R41L65M0P1M1l05o90n98
54881A11690K24J475K456K712K490K483L157M396N609O061N385L986K691J734
54867A56549M87j473l393m083l488k775k838l359l632l631l736l840l369k227
$$ plain form
54987 90085 91167 92073 92238 91698 90692 89585 88968 89240 90109 90928 91469 91961 92505 92861 92829 92505 92174 92093 92335
54968 92335 92665 92762 92681 92854 93474 94121 94249 93773 92965 92063 91297 90984 91226 91691 91974 92078 92289 92796 93586 94531
54948 94531 95383 95890 96059 96044 95772 95040 94062 93442 93444 93772 94229 95019 96140 97097 97617 98064 98688 99080 98927 98784
54928 98784 99379 100588 101786 102885 104358 106478 109193 112556 116625 121039 125305 129395 133575 137800 141754
54913 141754 145279 148212 150024 150199 148766 145997 141930 136933 132306 129388 128050 126933 125134 122787
54899 122787 120049 116676 113002 110266 109296 109506 109817 110050 110709 111825 112766 113131 113171 113242 113283 112978 112288 111690
54881 111690 111914 113389 115845 118557 121047 123530 126687 131083 136692 142753 148138 152124 154815 156549
54867 156549 157036 155563 152170 148087 144599 141824 138986 135627 131995 128364 124628 120788 117419 115192
54853A15192j142q62j364k036k453k607k562k261j760j346j231j314j361j274
54839I1619j069p93n72n53o17m26J60Q21J181J163Q42K75k52k21M70J161J194
54822I4383P24L23R4j97l82j15L32K85k35m34R4P82R56O53L11J86L31O55P65K48
54802I9759o33j018n18K53N09K08j20o4M83J341J940J683P40L1K9J56k35q00q26
54783A02918m50l84n91k21J047K349K682K062J292R23Q74Q51P64P16Q77J329K012
54766A19050K748L461M258N187N904N857M882L453K163J104K4j070j890k456l161
54751A49514m054m524m100l181k513k222j891j415j146j226j317j151q97q13q87
54736A18177r47q54n13J2L91L01q7j82L94J457K526L182L260K946K708K870L275
$$ plain form
54853 115192 114050 113188 111824 109788 107335 104728 102166 99905 98145 96799 95568 94254 92893 91619
54839 91619 90550 89757 89185 88632 88015 87589 87749 88570 89751 90914 91756 92031 91779 91558 92028 93189 94383
54822 94383 95107 95430 95524 95327 94945 94830 95162 95447 95212 94778 94872 95654 96610 97263 97574 97760 98091 98746 99511 99759
54802 99759 99126 98108 97590 97843 98352 98560 98440 98376 98859 100200 102140 103823 104563 104594 104623 104779 104544 103744 102918
54783 102918 102468 102084 101493 101272 102319 104668 107350 109412 110704 111627 112501 113352 114116 114832 115709 117038 119050
54766 119050 121798 125259 129517 134704 140608 146465 151347 154800 156963 158067 158091 157021 155131 152675 149514
54751 149514 145460 140936 136836 133655 131142 128920 127029 125614 124468 123242 121925 120774 119877 119064 118177
54736 118177 117230 116376 115863 115875 116266 116567 116480 116298 116692 118149 120675 123857 127117 130063 132771 135641 138916
54719A38916L598L802L954L775K919J590L71n86j610k749l513l566l226l051l294
54704A37330l853m421m566m010l014k141j614j198p39l89k15p4L1j19n29q29p66
54687A08884m75k07o4j54n54j072j301j036m37J69M07l7r34j396q47M1R0p56j371
54668I8950j109o47p88j272j284n96L22R55J048O36J43J58Q00J541J820J550R60
54651A03187L82K09N86J011Q04J12k29L1J30m69j187j170m57K87O70O93L84j26
54633A04848m58l67j00K3Q4K67M80N62O36P61O59J60l65m24o8K02Jo74j441j630
54613A03156q27M64J075M67o39j200r74m15J21N60P98P14L75m2l75m31j01L21
54595A03047L83Q2j30r1q7j88k6M61Q25Q53Q67R03M12p18j637j617j035n98k56
$$ plain form
54719 138916 142514 146316 150270 154045 156964 158554 158925 158339 156729 153980 150467 146901 143675 140624 137330
54704 137330 133477 129056 124490 120480 117466 115325 113711 112513 111774 111385 111170 111096 111127 111008 110479 109650 108884
54687 108884 108409 108202 108138 107984 107430 106358 105057 104021 103584 103753 104160 104123 103189 101793 100946 100987 101077 100321 98950
54668 98950 97841 97194 96406 95134 93850 93254 93576 94531 95579 96215 96358 96516 97316 98857 100677 102227 103187
54651 103187 103569 103778 104364 105375 106179 106291 106062 106093 106223 105754 104567 103397 102940 103227 103897 104590 104974 104848
54633 104848 104390 104023 103923 103946 104030 104297 104777 105339 105975 106736 107395 107555 107190 106766 106698 106900 106901 106227 104786 103156
54613 103156 102329 102793 103868 104335 103696 102496 101522 101107 101228 101788 102586 103300 103675 103633 103258 102827 102726 103047
54595 103047 103430 103512 103382 103291 103204 103016 102990 103451 104276 105129 105996 106899 107311 106593 104956 103339 102304 101706 101450
54576A01450L53R82J112Q40N56K43k13l43L15J261J529R51J75l86q14j027p25
54559A06259q6K59R6j38r3Rj31l91m07n8L83N55M69N58J021J281O81l22m76M80
54539A09949J249P39m36r80p20l82k30J7K14j16p73r48l71L84P77Q17O63L86J47
54520A10386J02M9k74o15m36K79R82J229R82L99k69o31n69m91p71j143j130q18
54502A07261o23n36k23K78O20P42Q73J026J014Q17N23J45j03K65J212J813J358
54485A16462M41J45N39Q66Q52Q26P68K70n15q71n13J34O70R49P27j12r91j186
54467A19461q45o66p06l74L66Q62Q38O79N29P8n78p84k71N10J063J156M60j056
54449A20722k406k322r03M74J042J270J463J058r9j009q49j00L58M60N53N82M54
$$ plain form
54576 101450 101803 102785 103897 104737 105293 105536 105323 104980 105295 106556 108085 109036 109211 108825 108011 106984 106259
54559 106259 106173 106432 106528 106390 106297 106306 106175 105784 105377 105319 105702 106257 106726 107284 108305 109586 110267 109945 109469 109949
54539 109949 111198 111937 111501 110521 109801 109419 109189 109206 109420 109304 108531 107583 107212 107596 108373 109190 109853 110239 110386
54520 110386 110488 110537 110263 109648 109212 109491 110473 111702 112684 113083 112814 112183 111614 111123 110352 109209 108079 107261
54502 107261 106638 106102 105879 106157 106777 107519 108392 109418 110432 111249 111772 111917 111814 112079 113291 115104 116462
54485 116462 116903 117048 117587 118453 119305 120131 120899 121169 120654 119783 119270 119404 120074 121023 121750 121638 120647 119461
54467 119461 118616 117950 117244 116870 117236 118098 118936 119615 120144 120222 119644 118860 118589 119099 120162 121318 121778 120722
54449 120722 118316 115994 115091 115565 116607 117877 119340 120398 120299 119290 118441 118341 118699 119159 119712 120294 120748
54432A20748M91P97Q01J02p54j039q22n43j21O72J429J466Q02J12j45p2L5j7j99
54413A23743k06K30P91P89J25m69m45j46r9k37k62k50l54l26J00P11J131J330
54395A26156J410J272R05O27N77M70K06K14O66R29M61k14k26L29O00K90q1j40
54377A34451j07j75j56N7K17J29j5N6L21N62O79Q53J388K310L096L077K289J587
54359A50619J632K002J780Q32L2J41R36J579J513P68l70j621k670l197l151k867
54343A47958k737k761k683k460k222j804q14N43J302Q41k73j056j295j399j377
54328A29763r18k09J73K52N83J180J308O58l6R7J073K170K577J842K21j299j914
54311A37521j910k057k287j828p14O0P9R2O54J225J238J043J076R66L35l66o05
$$ plain form
54432 120748 121239 122036 122837 122939 122185 121146 120324 119781 119660 120332 121761 123227 124029 124141 123996 123924 123959 123942 123743
54413 123743 123537 123767 124558 125347 125472 125003 124558 124412 124313 124076 123814 123564 123210 122884 122984 123695 124826 126156
54395 126156 127566 128838 129743 130370 130947 131417 131623 131837 132503 133432 133893 133679 133453 133782 134382 134672 134591 134451
54377 134451 134344 134169 134013 134070 134287 134416 134401 134457 134778 135340 136019 136872 138260 140570 143666 146743 149032 150619
54359 150619 152251 154253 156033 156865 156897 157038 157974 159553 161066 161834 161464 159843 157173 153976 150825 147958
54343 147958 145221 142460 139777 137317 135095 133291 132477 133020 134322 135163 134890 133834 132539 131140 129763
54328 129763 128845 128636 128809 129061 129644 130824 132132 132790 132754 132851 133924 136094 138671 140513 140734 139435 137521
54311 137521 135611 133554 131267 129439 128725 128785 128864 128956 129610 130835 132073 133116 134192 135158 135493 135127 134522
54294A34522p34j255j736j383l53M31N80N50Q57J527K247K525J924N76p44j406
54278A38128j448j050j49R86J465P82l08o99l38n5k97p64j068j103q79n18k48
54261A32437p2L06R04J232J066Q35Q50P84M70M73J055J284K25j454k202j591n47
54244A36055J86O59R06O62Q6j96MK62M29Q73J587J810R69n04j654j928j445o92
54226A38069j61%M7K47M60L71j9m48p66r61j003r79j106j319j190n89k1J32K21
54207A30985O38J019Q48L93K37K74J0m51n72l64k32j12L11O44J67q96j439r82
54189A30478j49M37P78Q89N49k8j87J98M92L88M01R06J430J406R30L64k28p33
54171A38321p40j12N91Q05O45N10L70q5q77j670k105j887r22M51J536J851J493
$$ plain form
54294 134522 133788 132533 130797 129414 129061 129492 130072 130622 131479 133006 135253 137778 139702 140278 139534 138128
54278 138128 136680 135630 135481 136467 137932 138714 138406 137707 137369 137314 137017 136253 135185 134082 133203 132685 132437
54261 132437 132365 132671 133575 134807 135873 136708 137558 138342 138812 139285 140340 141624 141849 140395 138193 136602 136055
54244 136055 136241 136900 137806 138468 138554 138358 138362 138624 139053 139926 141513 143323 144292 143788 142134 140206 138761 138069
54226 138069 137908 137908 137955 138202 138662 139033 139014 138566 137800 136839 135836 134857 133751 132432 131242 130653 130632 130764 130985
54207 130985 131623 132642 133490 133883 134120 134394 134404 133953 133381 133017 132785 132673 132984 133628 133795 132899 131460 130478
54189 130478 130329 130766 131544 132433 132982 132954 132767 132965 133457 133845 134246 135152 136582 137988 138918 139282 139054 138321
54171 138321 137581 137469 138060 138865 139510 140020 140390 140305 139428 137758 135653 133766 132844 133295 134831 136682 138175
54154A38175Q55K54q7q3R4J51J4k41o83j363j890j718q79N9P60J304J608J372
54136A37702P48L82N38P44O02L08J11j93p47j130q17J39J254K105K415K012J101
54119A47274K63r6q7QJ22K37K11N2J6K94P57J195J422J171L74m11m13K97Q25P16
54099A54227N54R20J446J484J148R93J114J200J268J633K319L057L749M464N100
54084A84676N436N382M804L382J144j101k486l069l478l702l053j537l57n94j908
54069A83539l033l249k720j718l14J069J592R42k1j89M32Q43M81m4Q3P82J355
54052A79830J486J455J538J775K250L142M324N292N632N323M637L924L464L259
54038B27331L001K512K108K196K654K971K950K811K663K328J742J073M07k61o90
$$ plain form
54154 138175 139030 139284 139197 139114 139208 139359 139373 139132 138449 137086 135196 133478 132599 132658 133418 134722 136330 137702
54136 137702 138450 138832 139370 140114 140716 141024 141135 140942 140195 139065 138248 138387 139641 141746 144161 146173 147274
54119 147274 147537 147441 147354 147362 147484 147721 147932 147984 148000 148294 149051 150246 151668 152839 153213 152802 152389 152686 153511 154227
54099 154227 154781 155701 157147 158631 159779 160772 161886 163086 164354 165987 168306 171363 175112 179576 184676
54084 184676 190112 195494 200298 203680 204824 203723 201237 198168 194690 190988 187935 186398 186041 185447 183539
54069 183539 180506 177257 174537 172819 172505 173574 175166 176108 176087 175898 176330 177173 177654 177610 177693 178475 179830
54052 179830 181316 182771 184309 186084 188334 191476 195800 201092 206724 212047 216684 220608 224072 227331
54038 227331 230332 232844 234952 237148 239802 242773 245723 248534 251197 253525 255267 256340 256747 256486 255796
54023B55796n23J30O91Q08O31K62m61j450k172k321k314k673l248l452l117k691
54007B33896k653l012l423l618l596l465l168k568j802j289j161j026o39m79j108
53992B00889k148k614k184j491j027n93k4K32j76p98r41o54n63q89j084n20O78
53975A86093J610J442L33o09n11K78P16M15q5k75k26l3N56J609K597K949K707
53958A99566K284J905J636J701K313L371M532N577O526P479Q423R090R120Q520
53944B72043P800P276O474M671J988o80k700m060m663m168k784j501j079j275
53930B77342j334p99L76J953L314L782L414K931K711K420J974K063L144M544N259
53915C13094N139M727M290L760L337L403L847L989L258J696j36j576k337k703
$$ plain form
54023 255796 255273 255403 256094 256902 257533 257795 257334 255884 253712 251391 249077 246404 243156 239704 236587 233896
54007 233896 231243 228231 224808 221190 217594 214129 210961 208393 206591 205302 204141 203115 202476 201997 200889
53992 200889 198741 196127 193943 192452 191425 190832 190808 191040 190864 190066 189125 188471 187908 187019 185935 185415 186093
53975 186093 187703 189145 189478 188869 188358 188636 189352 189767 189682 189407 189181 189148 189704 191313 193910 196859 199566
53958 199566 201850 203755 205391 207092 209405 212776 217308 222885 229411 236890 245313 254403 263523 272043
53944 272043 279843 287119 293593 298264 300252 299572 296872 292812 288149 283981 281197 279696 278617 277342
53930 277342 276008 275209 275585 277538 280852 284634 288048 290979 293690 296110 298084 300147 303291 307835 313094
53915 313094 318233 322960 327250 331010 334347 337750 341597 345586 348844 350540 350404 348828 346491 343788
53901C43788l008l053k447j576j437k313l337l789m009m582n277n524n359n128
53887B92949m796m264l956m300m896m991m529m025l623l040k304j864j890k127
53873B42344k402k789l214l382l145k672k320k411k911l190k543j219l28m03p30
53858B08685o51o50j320j982j564l65K49j73o91n45j12k8l17p00j023j091p43
53841A96979l24m82j241j863j809j240m85L92J173J361Q31J99J19N85J158J526
53825A96879J591J377J111J069J162R28J85n75o77P2J207J986J904J174O17Q52
53809B10862J601K158K392K786L508M054M023L706L590L733L831L685L248K594
53795B55771J996J838K104K261J861J136O64N92N18J20l51m18j14r4r23k344l528
$$ plain form
53901 343788 340780 337727 335280 333704 332267 329954 326617 322828 318819 314237 308960 303436 298077 292949
53887 292949 288153 283889 279933 275633 270737 265746 261217 257192 253569 250529 248225 246361 244471 242344
53873 242344 239942 237153 233939 230557 227412 224740 222420 220009 217098 213908 211365 210146 209818 209415 208685
53858 208685 208034 207384 206064 204082 202518 202153 202402 202229 201538 200993 200881 200853 200536 199836 198813 197722 196979
53841 196979 196655 196173 194932 193069 191260 190020 189535 189927 191100 192461 193292 193491 193610 194195 195353 196879
53825 196879 198470 199847 200958 202027 203189 204117 204302 203727 203050 203122 204329 206315 208219 209393 210010 210862
53809 210862 212463 214621 217013 219799 223307 227361 231384 235090 238680 242413 246244 249929 253177 255771
53795 255771 257767 259605 261709 263970 265831 266967 267631 268223 268741 268861 268510 268092 267978 267884 266961 264617 261089
53778B61089l984l944l818l696l583l677l993m047l386k326j686j829k303k408
53764B16409j881j029m58o10j333j958j992j616j315j255j296j335j336j167p61
53749A97067l30j41k06l89n92o63m13J09O11J033J509J739J121j24p68k18N05
53732A99850L12k03K44J424J929J454J240J964K641K234J195O00N96N16O7l30
53716B15733k11L84R92J143Q46O57J021J732K337K834L390L617L004J950J515
53701B40944K017K680K813K525K084J481R25R62J675K377K462J997J232K61n82
53686B65853q07n42n00p85o54J79R02Q58M80L69K56j98m78q2L82R1n53n26R3L01
53666B64639j40m24j97m5k43j73M88R48M41m61n48L38J151J119O35M31M70J93
$$ plain form
53778 261089 257105 253161 249343 245647 242064 238387 234394 230347 226961 224635 222949 221120 218817 216409
53764 216409 214528 213499 213041 212431 211098 209140 207148 205532 204217 202962 201666 200331 198995 197828 197067
53749 197067 196737 196596 196390 196001 195409 194746 194333 194442 195053 196086 197595 199334 200455 200331 199563 199345 199850
53732 199850 200162 199959 200203 201627 203556 205010 206250 208214 210855 213089 214284 214884 215480 215996 216063 215733
53716 215733 215522 215906 216898 218041 218887 219544 220565 222297 224634 227468 230858 234475 237479 239429 240944
53701 240944 242961 245641 248454 250979 253063 254544 255469 256431 258106 260483 262945 264942 266174 266435 265853
53686 265853 265046 264504 264004 263219 262565 262744 263646 264504 264984 265353 265609 265411 264933 264851 265233 265324 264771 264245 264338 264639
53666 264639 264499 264075 263878 263833 263590 263417 263905 264853 265294 264833 264285 264623 265774 266893 267528 267959 268429 268622
53648B68622m04n86J10J159J699J582J279J074Q76P63R63J254J075M86K85Q51
53632B81088J550J778J933K614L384L303K438J922K423L376L937M026M054M159
53618C21985M217M285M489M579M061K888J721J267J520J897K032K060K087J868
53604C60956J310R38J278J981K076J211O6m39K1J172K386K837K036N36m20k55
53588C77690K88J96o38j562k012j758p99L85Q60J65r61j383r95o84j027j591j648
53571C64526j024p4P77J215J124P02L53L04M09N17P86J422K201K519K079J375
53555C79211J243J891K678K903K592K212J959J706J502J545J744J777J737K134
53541D06834L120M170M747M890M896M873M863N066N635O465P414Q423R237R464
$$ plain form
53648 268622 268218 267632 267742 268901 270600 272182 273461 274535 275411 276174 277137 278391 279466 279952 280237 281088
53632 281088 282638 284416 286349 288963 292347 295650 298088 300010 302433 305809 309746 313772 317826 321985
53618 321985 326202 330487 334976 339555 343616 346504 348225 349492 351012 352909 354941 357001 359088 360956
53604 360956 362266 363204 364482 366463 368539 369750 369816 369377 369398 370570 372956 375793 377829 378365 377945 377690
53588 377690 377978 378174 377536 375974 373962 372204 371405 371790 372650 372815 371854 370471 369476 368792 367765 366174 364526
53571 364526 363502 363428 364205 365420 366544 367246 367599 367903 368312 368829 369615 371037 373238 375757 377836 379211
53555 379211 380454 382345 385023 387926 390518 392730 394689 396395 397897 399442 401186 402963 404700 406834
53541 406834 409954 414124 418871 423761 428657 433530 438393 443459 449094 455559 462973 471396 480633 490097
53527D90097R183R118R834J1042J1979J2279J2121J1851J1799J2224J3051J3818
53515F28396J4239J4601J5319J6266J6965J7293J7651J8342J9125J9528J9456
53504H17181J9365J9663K0087J9898J8890J7783J7304J7190J6708J5845J5214
53493A015128J4933J4509J3925J3835J4395J4785J4408J3720J3384J3336J3325
53482A169683J3596J4276J4747J4396J3498J2537J1251R183O786M985L875K815
53470A291628J598N85l16j831m199o582p962q196p984q068q607r163r311r297
53456A212295r796j0937j2006j2458j2663j3128j3460j2918j1698j0884j1158
53445A081189j2112j2745j2184j0163p354n043l978l653l113k070p57P59K331
$$ plain form
53527 490097 499280 508398 518232 529274 541253 553532 565653 577504 589303 601527 614578 628396
53515 628396 642635 657236 672555 688821 705786 723079 740730 759072 778197 797725 817181
53504 817181 836546 856209 876296 896194 915084 932867 950171 967361 984069 999914 1015128
53493 1015128 1030061 1044570 1058495 1072330 1086725 1101510 1115918 1129638 1143022 1156358 1169683
53482 1169683 1183279 1197555 1212302 1226698 1240196 1252733 1263984 1273167 1279953 1284938 1288813 1291628
53470 1291628 1293226 1293811 1293495 1291664 1287465 1280883 1272921 1264725 1256741 1248673 1240066 1230903 1221592 1212295
53456 1212295 1202499 1191562 1179556 1167098 1154435 1141307 1127847 1114929 1103231 1092347 1081189
53445 1081189 1069077 1056332 1044148 1033985 1026631 1021588 1017610 1013957 1010844 1008774 1008017 1008776 1011107
53432A011107L240L038K619L372N271O826P060O601O608P484R007J0971J3158
53419A096362J5094J6331J6820J6915J7151J7896J8996J9932K0610K1589K3141
53408A300837K4660K5637K6605K8199K9832L0540L0770L1909L4144L6159L7169
53397A636461L7780L8541L9082L9220L9636M0653M1447M1261M0481L9762L8981
53386B073305L7870L6758L5839L4474L2176K9592K7529K5698K3360K0621J7991
53375B395213J5184J1600P690M571K277m52m459r236j3940j8410k2840k7090l0787
53362B309321l3666l5547l6358l6409l6379l6750l7450l8025l7991l7037l5258
53351A908451l3249l1652l0601k9871k9440k9522k9994l0236k9752k8646k7341
$$ plain form
53432 1011107 1014347 1017385 1020004 1023376 1028647 1035473 1042533 1049134 1055742 1063226 1072233 1083204 1096362
53419 1096362 1111456 1127787 1144607 1161522 1178673 1196569 1215565 1235497 1256107 1277696 1300837
53408 1300837 1325497 1351134 1377739 1405938 1435770 1466310 1497080 1528989 1563133 1599292 1636461
53397 1636461 1674241 1712782 1751864 1791084 1830720 1871373 1912820 1954081 1994562 2034324 2073305
53386 2073305 2111175 2147933 2183772 2218246 2250422 2280014 2307543 2333241 2356601 2377222 2395213
53375 2395213 2410397 2421997 2429687 2434258 2436535 2436083 2431624 2422388 2408448 2390038 2367198 2340108 2309321
53362 2309321 2275655 2240108 2203750 2167341 2130962 2094212 2056762 2018737 1980746 1943709 1908451
53351 1908451 1875202 1843550 1812949 1783078 1753638 1724116 1694122 1663886 1634134 1605488 1578147
53340A578147k6059k4823k3692k2741k1752k0286j8165j5843j4072j3152j2690
53329A364872j2195j1666j1333j1162j1046j1281j2186j3197j3174j1873j0457
53318A235302j0004j0130r678q374o978n995n092l852k433j258m46J84Q59J724
53304A173829K827M036N127O016O876P969R387J0850J1800J2030J2154J3102J4911
53291A290914J6508J7004J6741J6549J6442J5718J4169J2410J0941R622Q220O871
53279A452109N725M586L138J245j113l834o545q844j0740j2488j3939j4660j4864
53266A379776j5522j7193j9295k0942k1951k2536k2577k2017k1554k1946k2772
53255A151471k2796k1672k0423j9931j9880j9609j9239j9259j9572j9739j9830
$$ plain form
53340 1578147 1552088 1527265 1503573 1480832 1459080 1438794 1420629 1404786 1390714 1377562 1364872
53329 1364872 1352677 1341011 1329678 1318516 1307470 1296189 1284003 1270806 1257632 1245759 1235302
53318 1235302 1225298 1215168 1205490 1197116 1190138 1184143 1179051 1175199 1172766 1171508 1171062 1171246 1172105 1173829
53304 1173829 1176656 1180692 1185819 1191835 1198711 1206680 1216067 1226917 1238717 1250747 1262901 1276003 1290914
53291 1290914 1307422 1324426 1341167 1357716 1374158 1389876 1404045 1416455 1427396 1437018 1445238 1452109
53279 1452109 1457834 1462420 1465558 1466803 1465690 1461856 1455311 1446467 1435727 1423239 1409300 1394640 1379776
53266 1379776 1364254 1347061 1327766 1306824 1284873 1262337 1239760 1217743 1196189 1174243 1151471
53255 1151471 1128675 1107003 1086580 1066649 1046769 1027160 1007921 988662 969090 949351 929521
53244I29521k0202k0568k0126j8698j7066j5938j5217j4513j3817j3308j2933
53233G47135j2526j2115j1717j1124j0170r082q252p882q054q872j0148j1275
53221F25918j1808j2077j2676j3509j3808j3125j1860j0746j0152r991r911r472
53209D86783q541p590p309p767q258q162p661p354p464p706p781p659p395o952
53195C79184o329n741n543n882o405o432n583m217l143k852l235l901m575n075
53181C10271n182m741l820k675j662j154j361k076k682k599j778p55k07m57j256
53166B77866k030k320k094j662j380j386j542j596j432j189j068j059j025r85
53152B57098j113j363j429j151p19l79j83j93n22j036j246q65j61M21P22P69N50
$$ plain form
53244 929521 909319 888751 868625 849927 832861 816923 801706 787193 773376 760068 747135
53233 747135 734609 722494 710777 699653 689483 680401 672149 664267 656213 647341 637193 625918
53221 625918 614110 602033 589357 575848 562040 548915 537055 526309 516157 506166 496255 486783
53209 486783 478242 470652 463343 455576 447318 439156 431495 424141 416677 408971 401190 393531 386136 379184
53195 379184 372855 367114 361571 355689 349284 342852 337269 333052 329909 327057 323822 319921 315346 310271
53181 310271 305089 300348 296528 293853 292191 291037 289676 287600 284918 282319 280541 279786 279579 279122 277866
53166 277866 275836 273516 271422 269760 268380 266994 265452 263856 262424 261235 260167 259108 258083 257098
53152 257098 255985 254622 253193 252042 251323 250944 250761 250568 250046 249010 247764 246899 246738 247159 247881 248650 249200
53135B49200K18J35L52M14K6m22m90l88n04o51m52j24j06j53L87J461K286K395
53117B53584J943J065k18j380j652j070n23n34p28o94n93o07n43l30k92n67q58
53100B46003j050j381j799j836j432j116j029o29J68M63l08j320j468q85m78m50
53084B31453k57K38N05K25l12o87p05l04L43P56N72j8n39p74p58n33l02m20q13
53065B27670q44k84P2n24j475j496m02O34O67Mo08j023j487j838j510l09J110
53048B18357J750J305N08K42M12K31m27p10j78L73R2n82o43j04K18J76L91R04
53030B22315Q95R1n96l59L46O03L51K44M70N80L34J18L20P47R51Q36O67N74M22
53011B29909J80N7O0k07r39j553j307m02K27J87P1M13R41J200J156Q10o9j189
$$ plain form
53135 249200 249418 249553 249905 250319 250345 249923 249433 249045 248541 247890 247438 247314 247208 247055 247442 248903 251189 253584
53117 253584 255527 256592 256374 254994 253342 252272 251749 251215 250487 249793 249200 248593 248050 247720 247428 246861 246003
53100 246003 244953 243572 241773 239937 238505 237389 236360 235731 235899 236362 236054 234734 233266 232381 231903 231453
53084 231453 231196 231434 231939 232164 231852 231165 230460 230156 230499 231255 231827 231809 231270 230496 229738 229205 228903 228483 227670
53065 227670 226826 226542 226614 226090 224615 223119 222717 223351 224018 224022 223414 222391 220904 219066 217556 217247 218357
53048 218357 220107 221412 221920 222162 222574 222805 222378 221668 221490 221863 221955 221373 220730 220626 220844 221020 221411 222315
53030 222315 223210 223301 222705 222346 222692 223295 223646 223890 224360 224940 225274 225392 225712 226459 227410 228246 228913 229487 229909
53011 229909 230089 230146 230206 229999 229060 227507 226200 225798 226025 226212 226283 226696 227637 228837 229993 230803 230734 229545
52993B29545j514n66O27Q33L45M02J221J758J375O06J00j48k82j58J84L64L82
52976B35074Q08J840K702K556J566O15K38K58L18L77O31J092J364R71P9m81j99
52959B49809L12O9q80j532j390j104j389j976k097j622j147j126j356j346r42
52944B32283m61k91m14n15n28p18j102j136m69M11P51N63M64O66P69N15R0l44
52926B30534p77r58n85L5J95j66l19O0L49mn34m91K5K81L8j79R6O39Q39M05l37
52905B29146p54n23P6M99M78J13l57o11k96M99J002N73l26o42j71K33K6l06j82
52886B28477J40J65J02M39J037J262R19M08O5k22n98q91p58o2R78J933K478K570
52868B38442K282J590N58l59o35l04Q4J98K42M09M85K49j42m03n27p03j015j425
$$ plain form
52993 229545 228031 227465 228092 228925 229270 229672 230893 232651 234026 234632 234732 234584 234302 234144 234328 234692 235074
52976 235074 235882 237722 240424 242980 244546 245161 245399 245657 245975 246352 246983 248075 249439 250410 250489 250008 249809
52959 249809 250121 250190 249310 247778 246388 245284 243895 241919 239822 238200 237053 235927 234571 233225 232283
52944 232283 231822 231531 231117 230602 230074 229356 228254 227118 226649 227060 227811 228374 228838 229504 230273 230788 230878 230534
52926 230534 229757 228799 228214 228249 228444 228278 227959 228019 228368 228364 227830 227339 227364 227645 227683 227504 227600 228239 229078 229483 229146
52905 229146 228392 227869 227945 228444 228922 229035 228678 228067 227771 228270 229272 229845 229519 228877 228706 228939 228965 228659 228477
52886 228477 228617 228782 228884 229323 230360 231622 232541 232949 233014 232792 232194 231303 230545 230483 231461 233394 235872 238442
52868 238442 240724 242314 242872 242513 241878 241574 241658 241856 242098 242507 242992 243241 243099 242696 242169 241466 240451 239026
52850B39026j827k056k054k050k296k593k536k179j983k012j810j198o22l84j95
52835B13231J63L18k1l44K4Q73J284Q12m3m89k28L68O34K64k79k58L68P93M00
52816B17870m50r83r35n63r9L61O77Q35J055J353J292O24j69m78m56p65j534k166
52798B15469k147j529o58J53N89M63Lk90j61K09M78M45J35k10k94r8ql04p28p61
52778B10756k71M23R61J188J084P33K81k08p44j101q23J20J062J318R47M50J3
52761B16189m30o94m96j07j39o98j208j210q10k33M53J061J214R04P40J208J913
52744B17657K026J376P18Q28J578K141K041J709J748J923J355r7j272r96L72J358
52728B34465J157M04ln1k20m77l33K93Q51Q92N13o3r33k165l301l603k834j455
$$ plain form
52850 239026 237199 235143 233089 231039 228743 226150 223614 221435 219452 217440 215630 214432 213810 213426 213231
52835 213231 213394 213712 213691 213347 213371 214244 215528 216340 216297 215808 215580 215948 216582 216846 216567 216309 216677 217470 217870
52816 217870 217420 216437 215502 214939 214840 215201 215878 216713 217768 219121 220413 221037 220868 220390 219934 219169 217635 215469
52798 215469 213322 211793 211135 211288 211877 212340 212343 212053 211892 212101 212579 213024 213159 212949 212655 212557 212549 212245 211517 210756
52778 210756 210485 210908 211869 213057 214141 214874 215155 214947 214203 213102 212279 212399 213461 214779 215726 216176 216189
52761 216189 215759 215065 214569 214462 214323 213625 212417 211207 210397 210164 210617 211678 212892 213796 214536 215744 217657
52744 217657 219683 221059 221777 222605 224183 226324 228365 230074 231822 233745 235100 235003 233731 232735 233107 234465
52728 234465 235622 236026 236023 235972 235752 235275 234942 235235 236086 236978 237491 237428 236495 234330 231029 227426 224592 223137
52710B23137k1J191J925J811Q64k03o36l80J48P34J277J309M51p34j106m10M03
52693B29760M91Q7j99l23n17o92o93o66o44k31P57J737K073J842J350M50q60j708
52675B32014j252k4O49N05M65R39J175O06j40k15L15Q01R25P15K38k49k84J76
52657B37359N55N41O93J588K773L274K881K168J385J87j385k425k163j027j88
52642B46216j92n37n77l82m30p71q85m24K92P28Q47J066J576K033K028J625J258
52625B53471J166J111O70k09j078j437j287j016q24n30j00K8m86j252j493j016
52609B45718l71j05j91k91j79K16Q00J199R71J83m82m66qK19J7j91n9J64N4l75
52589B46823o63n37j86R8L39P35J211J400J087M95P3J05N06Q66P34J32l10JP66
$$ plain form
52710 223137 223116 224307 226232 228043 228907 228704 228068 227688 227836 228570 229847 231156 231607 230873 229767 229357 229760
52693 229760 230251 230338 230139 229816 229299 228607 227914 227248 226604 226373 227130 228867 230940 232782 234132 234582 233722 232014
52675 232014 230762 230738 231387 231892 232357 233296 234471 235077 234937 234722 235037 235838 236763 237478 237716 237467 237183 237359
52657 237359 237914 238455 239148 240736 243509 246783 249664 251832 253217 253404 252019 249594 247431 246404 246216
52642 246216 246024 245487 244910 244528 244098 243327 242442 242018 242310 243038 243885 244951 246527 248560 250588 252213 253471
52625 253471 254637 255748 256418 256209 255131 253694 252407 251391 250567 250037 249937 249965 249479 248227 246734 245718
52609 245718 245347 245242 245051 244760 244581 244797 245597 246796 247767 247950 247468 247002 246994 247213 247230 247039 246980 247144 247198 246823
52589 246823 246160 245623 245437 245535 245874 246609 247820 249220 250307 250802 250875 250980 251486 252352 253086 253218 252908 252909 253675
52570B53675J021K97q37j609j972k314k640k586k067j392p32K3Q31J343J316R44
52554B43301O16M62K90j42p51j087p12K57J213J706J762J456N96p50j803j737
52538B44677p04M00J098J646K107J879N78j033j668r26K98R03P40N13P14R81O34
52521B52837m28j583k133j819p77N93J617J741J176P65R12J106Q59O10J074K023
52505B58573K489K017J071K06m80j006j292j437j698k078k277k183j954j561q13
52490B47577M5L54o0n32m56q8m7l61n33l09O2L14M97P54J069J306J429J534J647
52471B54202J562J036J89m35m16N8M68O12O99R04J121J205J111Q36M23O9m4ko7
52452B63531l54p45j125j412j480j257q64m75j49mk47p19p92j80M24J47p70j228
$$ plain form
52570 253675 254696 254993 254156 252547 250575 248261 245621 243035 240968 239576 238844 238867 239698 241041 242357 243301
52554 243301 243917 244379 244669 244527 243776 242689 241977 242234 243447 245153 246915 248371 248967 248217 246414 244677
52538 244677 243973 244373 245471 247117 249224 251103 251681 250648 248980 248054 248352 249255 249995 250508 251222 252203 252837
52521 252837 252409 250826 248693 246874 246097 246690 248307 250048 251224 251989 252901 254007 254866 255476 256550 258573
52505 258573 261062 263079 264150 264356 263876 262870 261578 260141 258443 256365 254088 251905 249951 248390 247577
52490 247577 247622 247976 247916 247384 246928 246840 246793 246432 245899 245590 245652 245966 246463 247217 248286 249592 251021 252555 254202
52471 254202 255764 256800 256989 256554 256138 256196 256664 257276 257975 258879 260000 261205 262316 263152 263575 263644 263600 263598 263531
52452 263531 263177 262432 261307 259895 258415 257158 256294 255819 255670 255666 255419 254700 253908 253728 254152 254299 253529 252301
52434B52301p29J42P07R33R97Q45N45M84Q40J264J352J131Q46O15N46P90J282
52417B64891J694J766J534J222J241K099L767N266N634N285N577O893P997P625
52403C22491N925L837J879P6j519k896m225n382n763n041l736k597j870j477j379
52388B98323j299p16L10Q71M06l84m63K33J095J888K644K968K456J595J368J999
52372C13294K855L442L758L813L603L465L697L908L487K623J982J542P00l77o40
52357C51152L11J500J882J549J205J162J434K167L284M165M259L782L374L367
52343C84593L810M750N994O914P094P019P503Q539R305R347R152R448J0299J1244
52329D95011J1925J2346J2654J3019J3707J5006J6919J8955K0350K0625J9933
$$ plain form
52434 252301 251572 251714 252421 253354 254351 255196 255741 256225 257065 258329 259681 260812 261658 262273 262819 263609 264891
52417 264891 266585 268351 269885 271107 272348 274447 278214 283480 289114 294399 299976 306869 314866 322491
52403 322491 328416 332253 334132 334208 332689 329793 325568 320186 314423 309382 305646 303049 301179 299702 298323
52388 298323 297024 296308 296618 297489 297895 297511 297048 297281 298376 300264 302908 305876 308332 309927 311295 313294
52372 313294 316149 319591 323349 327162 330765 334230 337927 341835 345322 347945 349927 351469 352169 351792 351152
52357 351152 351463 352963 354845 356394 357599 358761 360195 362362 365646 369811 374070 377852 381226 384593
52343 384593 388403 393153 399147 406061 413155 420174 427677 436216 445521 454868 464020 473468 483767 495011
52329 495011 506936 519282 531936 544955 558662 573668 590587 609542 629892 650517 670450
52318F70450J8887J8015J7391J6791J6111J5530J5250J5213J5129J4778J4143
52307H47688J3266J2192J1118J0397J0165J0073R575Q462O893N110L431K292J756
52294I52418J140k82k128l299l621m169n498o568o235n067m427m323l498j549
52280I02894M58J705K708M096N448O143O504P264Q354R185R712J0378J1187J1680
52266I97716J1770J1848J2010J1881J1359J0891J0788J0727J0243R306Q149O896
52254A123584N661M667L946L194K233J286N12m75k085m002n539o622p774r077
52240A109509r931j0029r911j0046j0047r426q643q492q726q250o723n071m158
52227A000056l690k940j864r80m88j67Q7K20L48O94J170J478J625J949K641L490
$$ plain form
52318 670450 689337 707352 724743 741534 757645 773175 788425 803638 818767 833545 847688
52307 847688 860954 873146 884264 894661 904826 914899 924474 932936 939829 944939 948370 950662 952418
52294 952418 953558 953276 951148 947849 944228 940059 934561 927993 921758 916691 912264 907941 904443 902894
52280 902894 903352 905057 907765 911861 917309 923452 929956 937220 945574 954759 964471 974849 986036 997716
52266 997716 1009486 1021334 1033344 1045225 1056584 1067475 1078263 1088990 1099233 1108539 1116688 1123584
52254 1123584 1129245 1133912 1137858 1141052 1143285 1144571 1145083 1144608 1142523 1138521 1132982 1126360 1118586 1109509
52240 1109509 1099578 1089549 1079638 1069592 1059545 1050119 1041476 1032984 1024258 1016008 1009285 1004214 1000056
52227 1000056 996366 993426 991562 990582 990094 989927 990014 990234 990582 991276 992446 993924 995549 997498 1000139 1003629
52211A003629M259M878N229M981L986K720K065K461L341L709L278K813L063L655
52197A054067L607K816K273K637L260L239K765K714L127L039J906M41l50m67q01
52182A084273j930l448m477m614m251m107m509n162n510n255m559l841l443l348
52168A025819l198k641j646m79N75J271J438J258J331K094L182L847L944L918
52154A040713L889L417K501J897K050K336J987J202O82O61R83J705K779L551L517
52139A073870L260L684M543M784M340M408N695P404Q525R261J0531J2590J4787
$$ plain form
52211 1003629 1007888 1012766 1017995 1022976 1026962 1029682 1031747 1034208 1037549 1041258 1044536 1047349 1050412 1054067
52197 1054067 1057674 1060490 1062763 1065400 1068660 1071899 1074664 1077378 1080505 1083544 1085450 1085891 1085541 1085074 1084273
52182 1084273 1082343 1078895 1074418 1069804 1065553 1061446 1056937 1051775 1046265 1041010 1036451 1032610 1029167 1025819
52168 1025819 1022621 1019980 1018334 1017855 1018430 1019701 1021139 1022397 1023728 1025822 1029004 1032851 1036795 1040713
52154 1040713 1044602 1048019 1050520 1052417 1054467 1056803 1058790 1059992 1060674 1061335 1062318 1064023 1066802 1070353 1073870
52139 1073870 1077130 1080814 1085357 1090141 1094481 1098889 1104584 1111988 1120513 1129774 1140305 1152895 1167682
$$ [...]
##END NTUPLES=NMR SPECTRUM
##END=
