
##TITLE=AC1244__6673806_yxZqgxz7Om
##JCAMPDX= 6.0         $$ Bruker NMR JCAMP-DX V2.0
##DATA TYPE= NMR SPECTRUM
##DATA CLASS= NTUPLES
##ORIGIN= BRUKER
##OWNER= Administrator
$$ 1.72 TOPSPIN		Version 2.1
$$ 2012-08-14 21:20:24.468 -0500  Administrator@TOPSPIN
$$ Compression mode = diff/dup
##.OBSERVE FREQUENCY= 400.02188249412
##.OBSERVE NUCLEUS= ^1H
##.ACQUISITION MODE= SIMULTANEOUS (DQD)
##.ACQUISITION SCHEME= undefined
##.AVERAGES= 64
##.DIGITISER RES= 22
##SPECTROMETER/DATA SYSTEM= spect
##.PULSE SEQUENCE= noesygpps1d.comp
##.SOLVENT NAME= COFFEE_meoh
##.SHIFT REFERENCE= INTERNAL, COFFEE_meoh, 1, 14.96055
##AUDIT TRAIL= $$ (NUMBER, WHEN, WHO, WHERE, PROCESS, VERSION, WHAT)
$$ ##TITLE= Audit trail, TOPSPIN		Version 2.1
$$ ##JCAMPDX= 5.01
$$ ##ORIGIN= Bruker BioSpin GmbH
$$ ##OWNER= Administrator
$$ $$ C:\Bruker\TOPSPIN/data/COFFEE/nmr/AC1244__6673806_yxZqgxz7Om/12/pdata/1/auditp.txt
$$ ##AUDIT TRAIL=  $$ (NUMBER, WHEN, WHO, WHERE, PROCESS, VERSION, WHAT)
(   1,<2012-08-14 21:20:19.531 -0500>,<Administrator>,<TOPSPIN>,<go>,<TOPSPIN 2.1>,
      <created by zg
	started at 2012-08-14 21:08:49.187 -0500,
	POWCHK enabled, PULCHK disabled,
       configuration hash MD5:
       6B 1B 68 BB D9 2E 58 E2 7F 35 AD 54 07 DF 0E 41
       data hash MD5: 64K
       9C D3 40 8F AB 16 4F 4C 3A 3D 81 85 70 9D 57 48>)
(   2,<2012-08-14 21:20:22.453 -0500>,<Administrator>,<TOPSPIN>,<proc1d>,<TOPSPIN 2.1>,
      <Start of raw data processing
       efp LB = 0.3 FT_mod = 6 PKNL = 1 PHC0 = 0 PHC1 = 0 SI = 128K 
       data hash MD5: 128K
       57 C0 CA 4A 69 69 0A 49 A6 52 C6 24 6F 51 1D 0B>)
(   3,<2012-08-14 21:20:23.625 -0500>,<Administrator>,<TOPSPIN>,<proc1d>,<TOPSPIN 2.1>,
      <pk PHC0 = -1.120605 PHC1 = 0 
       data hash MD5: 128K
       CF 26 3D B0 1E FA 44 C0 62 98 79 B2 1E 5B 4F AD>)
(   4,<2012-08-14 21:20:23.859 -0500>,<Administrator>,<TOPSPIN>,<proc1d>,<TOPSPIN 2.1>,
      <abs ABSG = 1 
       data hash MD5: 128K
       7F 16 DA B1 C0 58 D8 2E E9 EF FE 1D B3 56 29 3D>)
(   5,<2012-08-14 21:20:23.937 -0500>,<Administrator>,<TOPSPIN>,<proc1d>,<TOPSPIN 2.1>,
      <abs ABSG = 2 
       data hash MD5: 128K
       F8 D6 93 A3 22 73 B4 8A 65 F4 25 CC 2B 5B FE 8A>)
(   6,<2012-08-14 21:20:24.109 -0500>,<Administrator>,<TOPSPIN>,<proc1d>,<TOPSPIN 2.1>,
      <abs ABSG = 3 
       data hash MD5: 128K
       87 09 D1 C7 28 18 FC 77 85 F6 72 E4 4F 9E 97 54>)
(   7,<2012-08-14 21:20:24.250 -0500>,<Administrator>,<TOPSPIN>,<proc1d>,<TOPSPIN 2.1>,
      <abs ABSG = 4 
       data hash MD5: 128K
       EA 20 E2 C4 96 85 CE E7 35 B8 C9 CB F5 9C B5 F7>)
(   8,<2012-08-14 21:20:24.328 -0500>,<Administrator>,<TOPSPIN>,<proc1d>,<TOPSPIN 2.1>,
      <abs ABSG = 5 
       data hash MD5: 128K
       3B CC F1 72 12 3F 11 82 E2 B3 4C 30 D2 41 55 73>)
$$ ##END=
$$ 
$$ $$ hash MD5
$$ $$ C1 C3 D1 74 63 0B 94 3F 85 81 90 13 1D 7C 92 2F
##$RELAX= 
##$RELAX= 
##$RELAX= 
##$RELAX= 
##$RELAX= 
##$RELAX= 
##$RELAX= 
##$RELAX= 
$$ Bruker specific parameters
$$ [...]
##$TP07= 0
##$TPNAME0= <>
##$TPNAME1= <>
##$TPNAME2= <>
##$TPNAME3= <>
##$TPNAME4= <>
##$TPNAME5= <>
##$TPNAME6= <>
##$TPNAME7= <>
##$TPOAL= (0..7)
0.5 0.5 0.5 0.5 0.5 0.5 0.5 0.5
##$TPOFFS= (0..7)
0 0 0 0 0 0 0 0
##$TUNHIN= 0
##$TUNHOUT= 0
##$TUNXOUT= 0
##$USERA1= <user>
##$USERA2= <user>
##$USERA3= <user>
##$USERA4= <user>
##$USERA5= <user>
##$V9= 5
##$VALIST= <valist>
##$VCLIST= <CCCCCCCCCCCCCCC>
##$VD= 0
##$VDLIST= <DDDDDDDDDDDDDDD>
##$VPLIST= <PPPPPPPPPPPPPPP>
##$VTLIST= <TTTTTTTTTTTTTTT>
##$WBST= 1024
##$WBSW= 4
##$XGAIN= (0..3)
0 0 0 0
##$XL= 0
##$YL= 0
##$YMAX_a= 11056197
##$YMIN_a= -8864340
##$ZGOPTNS= <>
##$ZL1= 120
##$ZL2= 120
##$ZL3= 120
##$ZL4= 120
##$ABSF1= 14.96055
##$ABSF2= -5.597631
##$ABSG= 5
##$ABSL= 3
##$ALPHA= 0
##$AQORDER= 0
##$ASSFAC= 0
##$ASSFACI= 0
##$ASSFACX= 0
##$ASSWID= 0
##$AUNMP= <proc_prof1d_extract.lims>
##$AXLEFT= 0
##$AXNAME= <>
##$AXNUC= <1H>
##$AXRIGHT= 0
##$AXTYPE= 0
##$AXUNIT= <>
##$AZFE= 0.1
##$AZFW= 0.1
##$BCFW= 0
##$BC_mod= 0
##$BYTORDP= 0
##$COROFFS= 0
##$CY= 15
##$DATMOD= 1
##$DC= 0
##$DFILT= <>
##$DTYPP= 0
##$F1P= 0
##$F2P= 0
##$FCOR= 0.5
##$FTSIZE= 131072
##$FT_mod= 6
##$GAMMA= 0
##$GB= 0
##$INTBC= 1
##$INTSCL= 1
##$ISEN= 128
##$LB= 0.3
##$LEV0= 0
##$LPBIN= 0
##$MAXI= 10000
##$MC2= 0
##$MEAN= 0
##$ME_mod= 0
##$MI= 0
##$NCOEF= 0
##$NC_proc= -2
##$NLEV= 6
##$NOISF1= 0
##$NOISF2= 0
##$NSP= 0
##$NTH_PI= 0
##$NZP= 0
##$OFFSET= 14.96055
##$PC= 1
##$PHC0= -1.120605
##$PHC1= 0
##$PH_mod= 1
##$PKNL= yes
##$PPARMOD= 0
##$PPDIAG= 0
##$PPIPTYP= 0
##$PPMPNUM= 2147483647
##$PPRESOL= 1
##$PSCAL= 4
##$PSIGN= 0
##$PYNMP= <proc.py>
##$REVERSE= no
##$SF= 400.020009817116
##$SI= 131072
##$SIGF1= 0
##$SIGF2= 0
##$SINO= 400
##$SIOLD= 131072
##$SPECTYP= <>
##$SREGLST= <1H.CDCl3>
##$SSB= 0
##$STSI= 131072
##$STSR= 0
##$SW_p= 8223.68421052631
##$SYMM= 0
##$S_DEV= 0
##$TDeff= 65536
##$TDoff= 0
##$TI= <>
##$TILT= no
##$TM1= 0
##$TM2= 0
##$TOPLEV= 0
##$USERP1= <user>
##$USERP2= <user>
##$USERP3= <user>
##$USERP4= <user>
##$USERP5= <user>
##$WDW= 1
##$XDIM= 131072
##$YMAX_p= 391208192
##$YMIN_p= -13156
##$CURPLOT= <Network HP LaserJet P1505>
##$CURPRIN= <$Network HP LaserJet P1505>
##$DFORMAT= <normdp>
##$LAYOUT= <+/1D_H.xwp>
##$LFORMAT= <normlp>
##$PFORMAT= <normpl>
##$SURQMSG= 1
$$ End of Bruker specific parameters
$$ ---------------------------------
##NTUPLES= NMR SPECTRUM
##VAR_NAME=  FREQUENCY,     SPECTRUM/REAL,   SPECTRUM/IMAG
##SYMBOL=    X,             R,               I
##VAR_TYPE=  INDEPENDENT,   DEPENDENT,       DEPENDENT
##VAR_FORM=  AFFN,          ASDF,            ASDF
##VAR_DIM=   131072,        131072,          131072
##UNITS=     HZ,            ARBITRARY UNITS, ARBITRARY UNITS
##FACTOR=    0.0627417313425164, 1,          1
##FIRST=     8223.62146879497, 1622,         -60390
##LAST=      0,             3874,            -60109
##MIN=       0,             -13156,          0
##MAX=       8223.62146879497, 391208192,    0
$$ Real data points
##PAGE= N=1
##DATA TABLE= (X++(R..R)), XYDATA
$$ [...]
61716D63174K355K853L517L782L223K230J458Q07k77j753k990l641l739l244k396
61701D65359k186l341m959n363m294l150k917l109k996k672k463k320k250k496
61687D20843k922l063l012l316l800l613k789k471l066l416k595j393j027j406
61673C82954j678j694j828j952j727j376j232r36j04O12K21j041j853j469m01
61658C66496N59J199J571J595J291J045J313K135L003L177K359J100L09L55R31
61643C88438J754K766L545L329K124J064J075J674J722R22j41j112k156l281m096
61628C97627m336m150l757l246k697k234j878j596j485j661j996k121j766j060
61614C63644m74l96o84q81r86j682l295m931n361m612l932m062m471m359l684
$$ plain form
61716 463174 465529 468382 471899 475681 478904 481134 482592 483399 483122 481369 478379 474738 470999 467755 465359
61701 465359 463173 459832 454873 449510 445216 442066 439149 436040 433044 430372 427909 425589 423339 420843
61687 420843 417921 414858 411846 408530 404730 401117 398328 395857 392791 389375 386780 385387 384360 382954
61673 382954 381276 379582 377754 375802 374075 372699 371467 370531 370427 371039 371260 370219 368366 366897 366496
61658 366496 367055 368254 369825 371420 372711 373756 375069 377204 380207 383384 385743 386843 387152 387507 388438
61643 388438 390192 392958 396503 399832 401956 403020 404095 405769 407491 408413 408272 407160 405004 401723 397627
61628 397627 393291 389141 385384 382138 379441 377207 375329 373733 372248 370587 368591 366470 364704 363644
61614 363644 363170 362774 362090 361209 360223 358541 355246 350315 344954 340342 336410 332348 327877 323518 319834
61599C19834k792j856j096q99j326j978k619l336l855l475k157q91m81o55q10
61584B91608r66j342j664j613j427j428j398j034o20n62p12o85n20m45m00l22
61568B76470n08j072j417q90L16J402J898J882J592J285J219J369J398J176R79
61553B87099R40Q23N50L91L56R2k91j29O49J141Q20M24P06J236J262J022J144
61536B98235J472J525J604K214K851K535J351L18j03l30o05o52m63m95r22j413
61520C07122j684j721j499j068p57p83q19n05j38j81m02k38K50N04L73J06k80
61503B98280q87j369j259p32l38j69O1K85K36Kk06n89j198j292j88J426K147J719
61485B95929J151J027Q21J17n67n78m3M22M45J53Q9Q17K149L020K620J449N31
$$ plain form
61599 319834 317042 315186 314090 313191 311865 309887 307268 303932 300077 296602 294445 293554 293073 292418 291608
61584 291608 290642 289300 287636 286023 284596 283168 281770 280736 280116 279554 278842 278157 277637 277192 276792 276470
61568 276470 275962 274890 273473 272583 272899 274301 276199 278081 279673 280958 282177 283546 284944 286120 287099
61553 287099 288039 288862 289412 289803 290159 290251 289960 289831 290480 291621 292441 292865 293571 294807 296069 297091 298235
61536 298235 299707 301232 302836 305050 307901 310436 311787 312105 312002 311672 311067 310415 309952 309457 308535 307122
61520 307122 305438 303717 302218 301150 300393 299610 298791 298286 298148 297967 297565 297327 297577 298081 298454 298560 298280
61503 298280 297393 296024 294765 294033 293695 293526 293587 293872 294108 294110 293904 293315 292117 290825 290637 292063 294210 295929
61485 295929 297080 298107 298928 299045 298478 297900 297857 298279 298724 298877 298966 299783 301932 304952 307572 309021 309552
61468C09552j1p08j418j392n89J86N40Q52J230J162N20m6p3J55K84L47L48J30
61450C11069q3K15R00J201Q89O61J025J575J711J410R20M08K94J180K905M272
61434C30552M270L194K113J597J441J261R28N33K26J08K26P19J697K734K930K029
61418C56558J052J171K096K533K046J479J458J539J190O48L57J71l11j132k039
61403C68816k775l066k788k302k194k512k724k491k024j627j390j348j398j107
61389C39070k24O84Q10K84r5j69n25j200j400p98q7K37O36J527K348K388J856
61372C45342J449J386J420J452J531J583J539J490J459J387J452J883K399K365
61358C68137J752J269J390J893K581L713N267O546O946O678O326O211O433O985
$$ plain form
61468 309552 309541 308833 307415 306023 305434 305620 306160 307012 308242 309404 309924 309878 309805 309960 310244 310591 310939 311069
61450 311069 310986 311201 312101 313302 314191 314852 315877 317452 319163 320573 321493 321901 322195 323375 326280 330552
61434 330552 334822 338016 340129 341726 343167 344428 345356 345889 346115 346223 346449 347168 348865 351599 354529 356558
61418 356558 357610 358781 360877 363410 365456 366935 368393 369932 371122 371770 372127 372298 371987 370855 368816
61403 368816 366041 362975 360187 357885 355691 353179 350455 347964 345940 344313 342923 341575 340177 339070
61389 339070 338846 339530 340340 340624 340529 340360 339835 338635 337235 336437 336350 336587 337223 338750 341098 343486 345342
61372 345342 346791 348177 349597 351049 352580 354163 355702 357192 358651 360038 361490 363373 365772 368137
61358 368137 369889 371158 372548 374441 377022 380735 386002 392548 399494 406172 412498 418709 425142 432127
61344D32127P466P289O459N605N046M499L888L602L680L509K844K239K044J813
61330D92110J196N65J14p55k342l763m024l356k598j904r93j58P6rM16J520K713
61313D78808L667M585N543O331P010P893Q899R503R503R416R859J0818J1627J1600
61299E95062J0609R029P095M450P69l324o561q395r459j0463j1263j1427j1017
61286E55105j0349r463q391p481o926o387n526m524l609k552j129L04J317K075
61272D92464K947L792M229M322M386M404M197L936L929M105M302M755N748O914
61258E54430P568P654P788Q332Q817Q438O903M818L274K861L004K626J509M37
61244F28459j12o33j581k485k763k720k952l282l174k806k741k816k410j645j356
$$ plain form
61344 432127 439593 446882 453341 458946 463992 468491 472379 475981 479661 483170 486014 488253 490297 492110
61330 492110 493306 493871 493985 493230 490888 487125 483101 479745 477147 475243 474250 474092 474168 474159 474575 476095 478808
61313 478808 482475 487060 492603 498934 505944 513837 522736 532239 541742 551158 561017 571835 583462 595062
61299 595062 605671 614700 621795 626245 627014 623690 617129 608734 599275 588812 577549 566122 555105
61286 555105 544756 535293 526902 519421 512495 506108 500582 496058 492449 489897 488768 489072 490389 492464
61272 492464 495411 499203 503432 507754 512140 516544 520741 524677 528606 532711 537013 541768 547516 554430
61258 554430 561998 569652 577440 585772 594589 603027 609930 614748 618022 620883 623887 626513 628022 628459
61244 628459 628347 627714 626133 623648 620885 618165 615213 611931 608757 605951 603210 600394 597984 596339 594983
61229E94983j698j752p50J023K810M181M973N077M686M380M559N091N726O501
61215F39790P421Q023P676O303M533L158K529K421K307J769Q50M8p4N98J666K731
61199F91749L860N277O732P737Q541J0238J3284J6400J7721J6892J5260J4000
61187H27691J2929J1295R001O593M543K976J788Q12K6m06o05j244k712m279m915
61172H63493m891n552p277q791q991q478q588r571j0607j1068j1103j1211j1752
61159G45613j2713j3593j3770j3168j2245j1273j0138q898p748o418m414k144
61147F29091p69o26p52m98n26j560l156m525n699o917p650p261o100n020m221
61132E73811l384k440j431r6J621L180M307N689P947J0511J2446J3824J5323J6965
$$ plain form
61229 594983 593285 591533 590783 591806 594616 598797 603770 608847 613533 617913 622472 627563 633289 639790
61215 639790 647211 655234 662910 669213 673746 676904 679433 681854 684161 685930 686780 686828 686754 687352 689018 691749
61199 691749 695609 700886 707618 715355 723896 734134 747418 763818 781539 798431 813691 827691
61187 827691 840620 851915 860916 867509 872052 875028 876816 877628 877654 877248 876643 875399 872687 868408 863493
61172 863493 858602 853050 845773 836982 827991 819513 810925 801354 790747 779679 768576 757365 745613
61159 745613 732900 719307 705537 692369 680124 668851 658713 649815 642067 635649 631235 629091
61147 629091 628322 627696 626944 626446 625920 624360 621204 616679 610980 604063 596413 589152 583052 578032 573811
61132 573811 570427 567987 566556 566460 568081 571261 575568 581257 589204 599715 612161 625985 641308 658273
61118F58273J8308J9524K1123K2840K3897K4293K4885K6092K7362K7953K7650
61107I22200K6661K5406K4261K3134K1463J9047J6453J4169J1818Q722M743R8
61095A118175m984r852j3491j5780j7945k0822k3532k4874k5202k5638k6082k5592
61083H84381k4285k3296k2909k2221k0796j9351j8550j8093j7310j5846j3729
61072F67995j1399r618q644p757o300m780l992l560k462p29O58J431K315L613
61058F16771M764N447O076O990P976Q756R255R410R395R843J1153J2848J4441
61045G33125J6348J9013K1677K3226K3891K4808K6291K7799K9259L0970L2511
61034A008918L3264L3850L5526L8257M0850M2781M4397M5497M5576M5384M6388
$$ plain form
61118 658273 676581 696105 717228 740068 763965 788258 813143 839235 866597 894550 922200
61107 922200 948861 974267 998528 1021662 1043125 1062172 1078625 1092794 1104612 1113334 1118077 1118175
61095 1118175 1113191 1103339 1089848 1074068 1056123 1035301 1011769 986895 961693 936055 909973 884381
61083 884381 860096 836800 813891 791670 770874 751523 732973 714880 697570 681724 667995
61072 667995 656596 646978 638334 630577 624277 619497 615505 611945 609483 608754 609412 610843 613158 616771
61058 616771 621535 626982 633058 640048 648024 656780 666035 675445 684840 694683 705836 718684 733125
61045 733125 749473 768486 790163 813389 837280 862088 888379 916178 945437 976407 1008918
61034 1008918 1042182 1076032 1111558 1149815 1190665 1233446 1277843 1323340 1368916 1414300 1460688
61023A460688M8570N0501N1876N4183N8604O4993P3123Q3075R4230J05851J18930
61012B264624J35510J56153J80485K10293K49214K98939L59185M32290N24043
61003D810736O38179P73619R28332J099488J275058J430872J543264J599318J583227
60994A5682093J457376J181732P71789L29530p349j60749j55752p4027J6400P3526
60984A9114569M5932j31325m79901r27710j338393j600133j685229j634172j503040
60975I860598j332760j150103r74222q15792o77248n58256m58868l77681l11196
60966C204472k56604k12902j78845j52045j30517j13144r8417q4758p2173o1676
60956A843391n2880m4134l5138k7414k1803j7367j3349j0409r226r316r905j0759
$$ plain form
61023 1460688 1509258 1559759 1611635 1665818 1724422 1789415 1862538 1945613 2039843 2145694 2264624
61012 2264624 2400134 2556287 2736772 2947065 3196279 3495218 3854403 4286693 4810736
61003 4810736 5448915 6222534 7150866 8250354 9525412 10956284 12499548 14098866 15682093
60994 15682093 17139469 18321201 19092990 19422520 19415171 19254422 19098670 19024643 19041043 19114569
60984 19114569 19160501 19029176 18549275 17621565 16283172 14683039 12997810 11363638 9860598
60975 9860598 8527838 7377735 6403513 5587721 4910473 4352217 3893349 3515668 3204472
60966 3204472 2947868 2734966 2556121 2404076 2273559 2160415 2061998 1977240 1905067 1843391
60956 1843391 1790511 1746377 1711239 1683825 1662022 1644655 1631306 1620897 1611671 1602355 1592450 1581691
60944A581691j1638j2082j2233j2805j3941j5159j6602j9037k2339k5247k7117
60933A393491k8713l0722l2731l4119l4907l5131l4517l3280l2286l1799l1034
60922A034252k9536k7968k6917k5870k4162k2083k0323j8996j7953j7258j6730
60911G86456j5702j3957j2236j1138j0168q690p081o071n442m437l071k061j714
60898F84688j705j847k182k471k395k272k717l558l942l687l689m558n642o005
60884F38018n834o082p018p905q173q117q153p999p163o010n572o263p282p533
60870E38914o777n610m635m022l679l410k995k376j793j491j348j092q11r24j630
60855D96321k598l297l407k939k163j475j192j312j604j885k118k249k123j654
$$ plain form
60944 1581691 1570053 1557971 1545738 1532933 1518992 1503833 1487231 1468194 1445855 1420608 1393491
60933 1393491 1364778 1334056 1301325 1267206 1232299 1197168 1162651 1129371 1097085 1065286 1034252
60922 1034252 1004716 976748 949831 923961 899799 877716 857393 838397 820444 803186 786456
60911 786456 770754 756797 744561 733423 723255 714565 707484 701413 695971 691534 688463 686402 684688
60898 684688 682983 681136 678954 676483 674088 671816 669099 665541 661599 657912 654223 649665 644023 638018
60884 638018 632184 626102 619084 611179 603006 594889 586736 578737 571574 565564 559992 553729 546447 538914
60870 538914 532137 526527 521892 517870 514191 510781 507786 505410 503617 502126 500778 499686 498875 497951 496321
60855 496321 493723 490426 487019 484080 481917 480442 479250 477938 476334 474449 472331 470082 467959 466305
60841D66305j041p25j029j866k829l624m268m804m997m633l894l103k222j086
60827D26184l1L46J46J77P76J313J247J000J155J421J125L79q7l5N3j77n27p27
60809D33738p74p08n47n09q01j135r23j56L81k9j196k298k772k710k461k172j901
60792D13027k006k955m456n258m407k610j537j741k111j722j203j572k539k957
60778C75953k511j940j744j671j392q82q9R68J795J827J367J307J811K008J330
60763C78137M21K97J082K053K613K753K751K760K736K543K065J267K39o64q27
60748D00226Q2J488K288K076J537J296R73m4j495k687l594m561n314n327n048
60733C81896n534o727p256o304m628l301k421j718j459j927k613k793k526k311
$$ plain form
60841 466305 465264 464539 463510 461644 458815 455191 450923 446119 441122 436489 432595 429492 427270 426184
60827 426184 426153 426499 426645 426822 427598 428911 430158 431158 432313 433734 434859 435238 435151 435116 435169 434992 434465 433738
60809 433738 432964 432256 431709 431200 430399 429264 428341 428185 428566 428537 427341 425043 422271 419561 417100 414928 413027
60792 413027 411021 408066 403610 398352 393945 391335 389798 388057 385946 384224 383021 381449 378910 375953
60778 375953 373442 371502 369758 368087 366695 365813 365724 366692 368487 370314 371681 372988 374799 376807 378137
60763 378137 378558 378855 379937 381990 384603 387356 390107 392867 395603 398146 400211 401478 401717 401053 400226
60748 400226 400308 401796 404084 406160 407697 408993 409966 409922 408427 405740 402146 397585 392271 386944 381896
60733 381896 376362 369635 362379 356075 351447 348146 345725 344007 342548 340621 338008 335215 332689 330378
60719C30378k114j527p08l58p42j315j384p66K30J123J522J354Q99M53O0l16n64
60702C26225n65l58J5O39J475K194K516K527K412K155J768J537J662J884J868
60687C47954J755J920K363K829L357M142M972N389N427N471N388M573L150K256
60673D00946K607L391L325K265J066K39l67q05j010j469k817m523n035l757k039
60658C92017j487k083k687k754k544k103j177p8L78L8l39j45M09Q92J263J551
60642C81151J481P73m84j901k976l288k961k774l223l613k895j368m94q59j427
60627C55142j263q52r42j087m17P85J467J388J213J219R68L57k0K21O61P30M12
60610C59982L6j98k43m3L72P74R60R32Q55P75N28J0m30j25J117K526L183L103
$$ plain form
60719 330378 328264 326737 326029 325671 324929 323614 322230 321464 321694 322817 324339 325693 326592 327045 327105 326789 326225
60702 326225 325660 325302 325317 325956 327431 329625 332141 334668 337080 339235 341003 342540 344202 346086 347954
60687 347954 349709 351629 353992 356821 360178 364320 369292 374681 380108 385579 390967 395540 398690 400946
60673 400946 403553 406944 410269 412534 413600 413839 413472 412667 411657 410188 407371 402848 397813 394056 392017
60658 392017 390530 388447 385760 383006 380462 378359 377182 377104 377482 377520 377181 377036 377445 378337 379600 381151
60642 381151 382632 383405 382921 381020 378044 374756 371795 369021 365798 362185 359290 357922 357428 356569 355142
60627 355142 353879 353027 352085 350998 350581 351366 352833 354221 355434 356653 357621 357978 357958 358179 358840 359570 359982
60610 359982 360018 359820 359577 359534 359906 360680 361640 362572 363427 364202 364730 364740 364310 364185 365302 367828 371011 374114
60592C74114K929K679J683m2j318j236k60O47J224J600J457N25n88r30l39O20
60576C82765J560K442L188L842M846O448Q162R406J0313J1265J2109J2604J3112
60563D82062J3852J3924J2204Q957N417K017j753n751q837j0337j0637j0080q427
60550D82611n846l332j564j55J430L056M525O217Q379J0453J1733J2344J2937
60537E42788J3763J4573J5119J5254J4715J3179J0563P133L429J04k426m240n624
60524F38330o646p237p473p358o622n313m281m268m727m414l120j788r03Q9J488
60509E75757K633L101L644N159P482R947J2543J5700J9426K3353K7395L1702L6190
60496G74032M0509M4357M7362M9062M9228M7937M5029L9970L2610K3608J3711
$$ plain form
60592 374114 377043 379722 381405 381363 380045 378809 378549 379196 380420 382020 383477 384002 383414 382484 382145 382765
60576 382765 384325 386767 389955 393797 398643 405091 413253 422659 432972 444237 456346 468950 482062
60563 482062 495914 509838 522042 530999 536416 538433 536680 530929 522092 511755 501118 491038 482611
60550 482611 476765 473433 471869 471714 473144 476200 480725 486942 495321 505774 517507 529851 542788
60537 542788 556551 571124 586243 601497 616212 629391 639954 647087 650516 650620 648194 643954 638330
60524 638330 631684 624447 616974 609616 602994 597681 593400 589132 584405 579991 576871 575083 574180 574269 575757
60509 575757 578390 581491 585135 590294 597776 607723 620266 635966 655392 678745 706140 737842 774032
60496 774032 814541 858898 906260 955322 1004550 1052487 1097516 1137486 1170096 1193704 1207415
60485A207415L132p907j8569k7987l6092m3191m9015n2791n4100n3117n0255m6105
60473G71418m1521l7177l3145k9310k5943k3278k0827j7927j4936j3007j2482
60462E01865j2262j1182r405p960p291o876o099m923l695k740k364k798l758m285
60448D16227l591k083j076j243j786j547n61R2j64p34r14r23j354k047k159j380
60432C94757n04n03j294j854j542q66o73q93p09J98J146J441J234J006P87M25
60416C92156K27N75J150J201O05Q3K61R93J666J868J690J614J948K261J698K66
60400D10262p66l49R64J837J936J941K113K040J765J940K582K766K066J339J479
60385D33915K209K679K638K407K145J769J264P05K35K03R57K201L088L151K732
$$ plain form
60485 1207415 1210547 1202640 1184071 1156084 1119992 1076801 1027786 974995 920895 867778 817523 771418
60473 771418 729897 692720 659575 630265 604322 581044 560217 542290 527354 514347 501865
60462 501865 489603 478421 469016 461056 453765 446889 440790 435867 432172 429432 427068 424270 420512 416227
60448 416227 412636 410553 409477 408234 406448 404901 404340 404432 404268 403534 402620 401697 400343 398296 396137 394757
60432 394757 394253 393750 392456 390602 389060 388194 387521 386628 385919 386117 387263 388704 389938 390944 391731 392156
60416 392156 392383 392958 394108 395309 395914 395997 396258 397251 398917 400785 402475 404089 406037 408298 409996 410262
60400 410262 409496 409147 410111 411948 413884 415825 417938 419978 421743 423683 426265 429031 431097 432436 433915
60385 433915 436124 438803 441441 443848 445993 447762 449026 449731 449966 450169 451126 453327 456415 459566 462298
60370D62298K278J827J457J531K008K097J288K40J21J191K596L478L823M229N039
60355D95501N838N923N326N044N856P191P876P751P615P659O968M995K447K51
60341E76241j580l404n040o112o754p287p611p451o857n972m751l383k464k274
60327E05301k320k162k162k755l503l561k841j981j416j090q68o11M9J420L346
60312D84846N452P617R773J1615J3045J4620J6854J9239K0762K1315K1780K2366
60300F69284K1662J7946J1222L384l676r618j5151k0351k4111k5343k4191k1673
60288E79384j8585j5229j1880q837o187m086l015l071l284k593j375r89j711k360
60274D96182k204j999k519l272l497l479l831m185l736k622j778j646j840j946
$$ plain form
60370 462298 464576 466403 467860 469391 471399 473496 474784 475024 475145 476336 478932 482410 486233 490462 495501
60355 495501 501339 507262 512588 517632 523488 530679 538555 546306 553921 561580 568548 573543 575990 576241
60341 576241 574661 571257 566217 560105 553351 546064 538453 531002 524145 518173 513422 510039 507575 505301
60327 505301 502981 500819 498657 495902 492399 488838 485997 484016 482600 481510 480642 480031 480080 481500 484846
60312 484846 490298 497915 507688 519303 532348 546968 563822 583061 603823 625138 646918 669284
60300 669284 690946 708892 720114 723498 719822 710204 695053 674702 650591 625248 601057 579384
60288 579384 560799 545570 533690 524853 518666 514580 511565 508494 505210 502617 501242 500253 498542 496182
60274 496182 493978 491979 489460 486188 482691 479212 475381 471196 467460 464838 463060 461414 459574 457628
60260D57628j879j608j168q78r38j052q37m18q0L27J033J698J733J185P05O99
60244D56150R45J052Q91O04M62O37R36R46N26o7n65q13m96O27K036K732K499K240
60226D71342K615L141L050K409J738J181P75Q96J675K409K406K048K323L509N062
60211E06579O458P497P929P598O823O181N945O103O617P273P592P290O565N716
60197F02166M915M586N189O198O146M421K268J178R74M44p15j808k546l325m221
60182F25870m765m854m943n307n757o149o582p024p262p130o493n299l994l419
60168E46892l739l975l246j945j007n55j97r8o28j319j246l53N68J064J285J263
60152E32764R11O69J163K228L048L280L239L121K859K614K573K475K167K374L838
$$ plain form
60260 457628 455749 454141 452973 452095 451157 450105 449268 448850 448770 449097 450130 451828 453561 454746 455451 456150
60244 456150 457095 458147 459038 459642 460104 460741 461677 462623 463149 463082 462517 461704 461208 461835 463871 466603 469102 471342
60226 471342 473957 477098 480148 482557 484295 485476 486251 487147 488822 491231 493637 495685 498008 501517 506579
60211 506579 513037 520534 528463 536061 542884 549065 555010 561113 567730 575003 582595 589885 596450 602166
60197 602166 607081 611667 616856 623054 629200 633621 635889 637067 638041 638485 637770 635962 633416 630091 625870
60182 625870 621105 616251 611308 606001 600244 594095 587513 580489 573227 566097 559604 554305 550311 546892
60168 546892 543153 539178 535932 533987 532980 532425 532228 532130 531502 530183 528937 528584 529152 530216 531501 532764
60152 532764 533675 534344 535507 537735 540783 544063 547302 550423 553282 555896 558469 560944 563111 565485 569323
60137E69323N881P018O970O933P653Q455Q492P897P184O399N441M501L801L248
60123F59196K686K042J181J08o67n62J96P50P20N94Q88J553K206K484K173J431
60107F76979P60L27m20j815l139l544l487m130n521o477o286n466m748m304m104
60092F24625m025l483j965o9R67R79J055J758K293J906J068O92R64J520K067K300
60076F32652J907J065M19J88j62j106k551m342o460q484r621r726r513r426r041
60061E65799p979o692n823n465n454n754o099n869m856l594k542j514l56N52R79
60046E05333J443K451L612M197M173M151M502N107N760O347O740O822O586O020
60032E73244M999L460J481p41k779l986m119l877m284n424o412o636o436o345
$$ plain form
60137 569323 575204 582222 589192 596125 603778 612233 620725 628622 635806 642205 647646 652147 655948 659196
60123 659196 661882 663924 665105 665213 664546 663984 664180 664930 665650 666244 667132 668685 670891 673375 675548 676979
60107 676979 677739 678066 677646 675831 672692 669148 665661 661531 656010 649533 643247 637781 633033 628729 624625
60092 624625 620600 617117 615152 615083 616050 617029 618084 619842 622135 624041 625109 625801 626765 628285 630352 632652
60076 632652 634559 635624 636043 636231 636069 634963 632412 628070 621610 613126 603505 593779 584266 574840 565799
60061 565799 557820 551128 545305 539840 534386 528632 522533 516664 511808 508214 505672 504158 503802 504354 505333
60046 505333 506776 509227 512839 517036 521209 525360 529862 534969 540729 547076 553816 560638 567224 573244
60032 573244 578243 581703 583184 582443 579664 575678 571559 567682 563398 557974 551562 544926 538490 532145
60018E32145o394o414o473o640o752o675o456o048n372m726m611m938m984m288
60004D51374l159k154j487j155j073j009p64n16m43j47Q70K157K615K085J703
59989D48897K335L413L816L268K415J995K379L434M443M517L429J775K35r45j646
59974D83760j754j523j572k130k754k961k739k306j814j361q93q8J216K513L151
59959D68745L221L289L423L297L061L126L085K003n1j771k257j899j386q66m55
59944D84565n31j013j175o95p7K75N00M49m98k184l314l043k081j484j191n42
59928D67961N03J534K454L321L919M117M207M398M523M668N364O612P469P282
59914E28332O550N934N206L972K705K108K002J734J280J043R31N33n8l72l46l45
$$ plain form
60018 532145 525751 519337 512864 506224 499472 492797 486341 480293 474921 470195 465584 460646 455662 451374
60004 451374 448215 446061 444574 443419 442346 441337 440573 440057 439614 439467 440337 442494 445109 447194 448897
59989 448897 451232 454645 458461 461729 464144 466139 468518 471952 476395 480912 484341 486116 486351 485406 483760
59974 483760 482006 480483 478911 476781 474027 471066 468327 466021 464207 462846 461953 461865 463081 465594 468745
59959 468745 471966 475255 478678 481975 485036 488162 491247 493250 493199 491428 489171 487272 485886 485020 484565
59944 484565 484034 483021 481846 481151 481074 481349 481849 482298 481800 479616 476302 473259 471178 469694 468503 467961
59928 467961 468464 469998 472452 475773 479692 483809 488016 492414 496937 501605 506969 513581 521050 528332
59914 528332 534882 540816 546022 549994 552699 554807 556809 558543 559823 560866 561797 562330 562272 561900 561554 561209
59898E61209n50q53j171j371j160m60L27Q38J197J602J922K092K468L280M116
59883E73486M471M452M493M730N056N470N974O362O437O163N469M266K784J444
59869F41057K45j125k532l364l450l299l274l305l483m105m867m973m339l751
59855E95435l516l030k050j210o79M75K792N302O769P136O872N808L594O57k188
59840F22167m468n746n422l661j786r54j090j642k519l512l825l152k337k156
59826E79897k247k115k119k520k593j915j475k190l235l262k479j998j863j321
59812E48565n89o50j548k365k759l151l538l425k890k523k420k235k071k274k583
59797E13544k537k395k636k904k599k121k250k642k275j154k30J29K95K35l31
$$ plain form
59898 561209 560659 559806 558635 557264 556104 555644 555971 556809 558006 559608 561530 563622 566090 569370 573486
59883 573486 577957 582409 586902 591632 596688 602158 608132 614494 620931 627094 632563 636829 639613 641057
59869 641057 641302 640177 637645 634281 630831 627532 624258 620953 617470 613365 608498 603525 599186 595435
59855 595435 591919 588889 586839 585629 584950 585425 588217 593519 600288 607424 614296 620104 623698 624355 622167
59840 622167 617699 611953 606531 602870 601084 600130 599040 597398 594879 591367 587542 584390 582053 579897
59826 579897 577650 575535 573416 570896 568303 566388 564913 562723 559488 556226 553747 551749 549886 548565
59812 548565 547976 547326 545778 543413 540654 537503 533965 530540 527650 525127 522707 520472 518401 516127 513544
59797 513544 511007 508612 505976 503072 500473 498352 496102 493460 491185 490031 489801 489930 490225 490460 490129
59782D90129q05l15N45K10j382k448j860n22L48Q45J540K211K383K304K476K740
59766D98399K578J981J442J348J664K014J963J489J217J817L224M750N867O485
59752E36238O703O779P124P774Q124P718O996O689O827O997P123P185O617N031
59738F33925L292K675L081L032J622m98k117k712k549k284k525l289l872l734
59724F24047l175k760k453k044j849k162k492k310k065k412k923k752k179k117
59710E90354k389j965q43k20n62q91m12L64O11L23Mn9J88O56J034J121J196J535
59692E90045J742J336O72M38M54j2r45j609j781j845j826j378p15m64o37p56r23
59675E81796j676k894l965m878o013o979o962o147n423m807l616k197j779k413
$$ plain form
59782 490129 489324 489009 489554 489764 488382 485934 484074 483552 483900 484745 486285 488496 490879 493183 495659 498399
59766 498399 500977 502958 504400 505748 507412 509426 511389 512878 514095 515912 519136 523886 529753 536238
59752 536238 542941 549720 556844 564618 572742 580460 587456 594145 600972 607969 615092 622277 628894 633925
59738 633925 637217 639892 642973 646005 647627 647129 645012 642300 639751 637467 634942 631653 627781 624047
59724 624047 620872 618112 615659 613615 611766 609604 607112 604802 602737 600325 597402 594650 592471 590354
59710 590354 587965 586000 585157 584937 584375 583484 583072 583436 584047 584370 584374 584315 584503 585159 586193 587314 588510 590045
59692 590045 591787 593123 593795 594233 594687 594675 593730 592121 590340 588495 586669 585291 584576 584112 583475 582719 581796
59675 581796 580120 577226 573261 568383 562370 555391 548429 542282 536859 532052 528436 526239 524460 522047
59661E22047k666j774n89R7N58R78Q23J47R5J256K648L270L476L955M344L842
59645E42507K462Q53m94j291j409j331j890l085l906l726l095k692k389j832j167
59630E17515o02l9M97P25O17L26n15k313m164m429l026j852k218l197l350k801
59614D91174k537k662k502j816q71J44J057J574J821K349L127L313K571J693J297
59599D99732R00L7p18p77o59r79j142l09R77J388P44J41K86O83N68j36r03j152
59581D98681p59l01n95j776l100l841l935l557k765j832j239r13k27Q26J317P86
59565D76770Q6P7L25J2o04o88k47R9L40R68J789J983J358O70M59M45L00L67J157
59546D85666K544L916M883N568O223O897P622Q731J0575J2914J4917J5991J6063
$$ plain form
59661 522047 519381 517607 517018 517115 517673 518651 519474 519621 519716 520972 523620 526890 530366 534321 538665 542507
59645 542507 544969 545822 545328 544037 542628 541297 539407 536322 532416 528690 525595 522903 520514 518682 517515
59630 517515 516913 516874 517371 518096 518713 519039 518524 516211 512047 507618 504592 502740 500522 497325 493975 491174
59614 491174 488637 485975 483473 481657 480786 480930 481987 483561 485382 487731 490858 494171 496742 498435 499732
59599 499732 500632 500669 499951 499174 498515 497536 496394 496085 497062 498450 499194 499335 499621 500304 500872 500736 499833 498681
59581 498681 497922 497621 497026 495250 492150 488309 484374 480817 478052 476220 474981 474068 473841 474667 475984 476770
59565 476770 476856 476933 477258 477270 476666 475978 475731 475830 476170 477138 478927 480910 482268 482938 483397 483842 484142 484509 485666
59546 485666 488210 492126 497009 502577 508800 515697 523319 532050 542625 555539 570456 586447 602510
59533F02510J4763J1058M634k693q027r923r157p127m532j757N67K015K758L159
59519E98248L435L740M007L634K057k90k346l797n248o939q279q881r171r541
59505E60629r723r344q452p232n877m853m519m387l628k401j703j830k062k011
59491D92607k043k126j509o6J211J608J550J570J582J616K178L284M175M547N030
59476E15214N891O402O092N489M993M210L113K626L167L754L421K524J745R70
59462E69611R7q7R42K295K830K765L164M388O000P606Q925R573R571R447R329
59447F46456Q666P333O069N142L685J064k027m758p279r766j1401j1428j0289
59434F21467q759o886m816l580l803m461m134k763j123O12K591M442N942P794
$$ plain form
59533 602510 617273 628331 632965 630272 622245 612322 603165 596038 591506 589749 590316 592331 595089 598248
59519 598248 601683 605423 609430 613064 615121 614831 612485 608688 603440 596501 588222 579341 570170 560629
59505 560629 550906 541562 533110 525878 520001 515148 510629 506242 502614 500213 498510 496680 494618 492607
59491 492607 490564 488438 486929 486863 488074 489682 491232 492802 494384 496000 498178 501462 505637 510184 515214
59476 515214 521105 527507 533599 539088 544081 548291 551404 554030 557197 560951 564372 566896 568641 569611
59462 569611 569708 569621 570563 572858 575688 578453 581617 586005 592005 599611 608536 618109 627680 637127 646456
59447 646456 655122 662455 668524 673666 677351 678415 676388 671630 664351 654585 643184 631756 621467
59434 621467 612708 605822 601006 597426 593623 589162 585028 582265 581142 581754 584345 588787 594729 602523
59420F02523J0536J3411J5459J7008J8900K1013K2711K3968K4886K4900K3674
59409H18989K1755J8954J3325L716p361j5484j8611j8030j5554j1868p471l161
59397G79199Q13M453O416M301k682j2227k0625k5346k6026k3888k0613j7155j3463
59384F33157r549o274m448l614k680j444n66l40l29p5O18J762K955L423L054K769
59368F18419L234L830L790L540L848M386M390M065M106M311M070L735M150N206
59354F75080O179P110Q477R842J0339J0321J1077J2859J4549J5306J5340J5102
59342H11581J4783J4672J4827J4436J2584R561O437L536M23k812n524p720j0076
59329H76708j2661j4697j5714j6036j6117j6126j6054j5559j4046j1726r974r629
$$ plain form
59420 602523 613059 626470 641929 658937 677837 698850 721561 745529 770415 795315 818989
59409 818989 840744 859698 873023 876739 869378 853894 835283 817253 801699 789831 782360 779199
59397 779199 780012 784465 790881 795182 792500 780273 759648 734302 708276 684388 663775 646620 633157
59384 633157 623608 617334 612886 609272 606592 605148 604582 604242 603913 603838 604456 606218 609173 612596 615650 618419
59368 618419 621653 625483 629273 632813 636661 641047 645437 649502 653608 657919 661989 665724 669874 675080
59354 675080 681259 688369 696846 706688 717027 727348 738425 751284 765833 781139 796479 811581
59342 811581 826364 841036 855863 870299 882883 892444 898881 902417 902840 900028 894504 886784 876708
59329 876708 864047 849350 833636 817600 801483 785357 769303 753744 739698 727972 717998 708369
59317G08369r543q153n870m459m439m671m333l687k856j502J30J226J757K584
59303F64553M014N455O601P772Q895R200Q118N488J006n276j1812j6260j7619
59290F70135j6800j5049j2967j1021r709q755p191m667j938J38J386K077K614
59277E88253L443M647N762O594P723R546J1403J2648J3784J5356J6441J5836J4045
59264G25481J2381J0610P467L290Qj645k929m770o487p382p886q446q674q343
59250G02675p923p602o911n800m897m313l383j988q96l59M19J894L428M435N198
59235F73977O026O549O410N821N097M341L793L612L256J989J8j805l360n093o657
59220G03974p076o404n854n974o080n774n644o070o611o926p144p069o245n110
$$ plain form
59317 708369 698826 690673 684803 680344 675905 671234 666901 663214 660358 658856 658986 660212 661969 664553
59303 664553 668567 674022 680623 688395 697290 706490 714608 720096 721102 715826 704014 687754 670135
59290 670135 653335 638286 625319 614298 604589 595834 588643 583976 582038 582176 583562 585639 588253
59277 588253 591696 596343 602105 608699 616422 625968 637371 650019 663803 679159 695600 711436 725481
59264 725481 737862 748472 755939 759229 759237 757592 754663 749893 743406 736024 728138 719692 711018 702675
59250 702675 694752 687150 680239 674439 669542 665229 661846 659858 658962 658603 659022 660916 664344 668779 673977
59235 673977 680003 686552 692962 698783 703880 708221 712014 715626 718882 720871 720889 719084 715724 710631 703974
59220 703974 696898 690494 684640 678666 672586 666812 661168 655098 648487 641561 634417 627348 621103 615993
59206F15993m737n098m977l939l028k944l014k538j912j691j695j667j804k013
59192E74936j695p58P8M33P66J351J867K321L209M322M604L747K863K956L700
59177F04700M269M459M498M595N062O050O930O835O017N687O400P573Q560R115
59163F90750Q897P866P016P273P708O503L652R04j062l291o086q168q980r719
59149G03263j1048j1786j1118j0185j0148j0317r625q626q423q792q743q136p427
59136E78889o657n804n329n406n353m649l701k938k011o48O62J568K401L286L778
59121E48088L955M665O074P273P954Q986J0533J1267J0542R698R938J0372R660
59108F59005Q243P272O484M960L159K379K665K892K576K192J894J227P7j115k023
$$ plain form
59206 615993 611256 606158 601181 597242 594214 591270 588256 585718 583806 582115 580420 578753 576949 574936
59192 574936 573241 572483 572561 572994 573760 575111 576978 579299 582508 586830 591434 595181 598044 601000 604700
59177 604700 608969 613428 617926 622521 627583 633633 640563 647398 653415 659102 665502 673075 681635 690750
59163 690750 699647 707513 714529 721802 729510 736013 739665 740569 739507 736216 730130 721962 712982 703263
59149 703263 692215 680429 669311 659126 648978 638661 629036 620410 611987 603195 594452 586316 578889
59136 578889 572232 566428 561099 555693 550340 545691 541990 539052 537041 536393 537055 538623 541024 544310 548088
59121 548088 552043 556708 562782 570055 578009 586995 597528 608795 619337 629035 638973 649345 659005
59108 659005 667248 674520 681004 685964 689123 691502 694167 697059 699635 701827 703721 704948 705025 703910 701887
59093G01887k582k684k358k030j992j940j549j074r51j237j863k869m113n239
59079F69406o202p158p778p570o902o639o630n889m453l625l918m245l846l448
59065E91103l783m318m377m189m009l435k490k057k385k433j619q41q37r80o75
59050E52675n49j064j367p78j06j62k92K61Q26N49J6Q7K86j55o05j22P88J048
59032E51336R36J490K624L451L944M758N899O876P893R527J1572J3282J4471J5333
59018F53392J5656J5129J4033J2718J0909Q318N372K595p4k625m451n315n905
59005G19752o624o755n667l947k362p47J148K740L640M505N772O476N690M203
58991G27824L466L563L465K649J435K56m91n08k25o11j744k568k541k288j975
$$ plain form
59093 701887 699305 696621 694263 692233 690241 688301 686752 685678 684727 683490 681627 678758 674645 669406
59079 669406 663204 656046 648268 640698 633796 627157 620527 614638 610185 606560 602642 598397 594551 591103
59065 591103 587320 583002 578625 574436 570427 566992 564502 562445 560060 557627 556008 555167 554330 553350 552675
59050 552675 552126 551062 549695 548917 548811 548649 548357 548618 549444 549993 550009 550096 550382 550227 549622 549500 550288 551336
59032 551336 552272 553762 556386 559837 563781 568539 574438 581314 589207 598734 610306 623588 638059 653392
59018 653392 669048 684177 698210 710928 721837 730155 735527 738122 738048 735423 730972 725657 719752
59005 719752 713128 706373 700706 696759 694397 693650 694798 697538 701178 705683 711455 717931 723621 727824
58991 727824 731290 734853 738318 740967 742402 742658 742167 741659 741434 740823 739079 736511 733970 731682 729707
58976G29707p13J521L121L277L489N259P819R730J1112J2530J3169J2209J0835
58963H23065J0741J1523J1551J0586R657Q938P663N691L476R29k250n666q830
58950H87074j1932j4825j6369j6130j5574j5991j6387j5223j3015j1341j0265
58939G30022q853p324o621o445n772m726m028l273j656J16O70J95L4M18M89O9
58923F83315k94o62j417k101k169k279l178m067l743k687k092j637k55J550K296
58908F60580K035K156L028L820M405N607P638R932J2213J4224J5044J4278J3273
58895G68233J3351J3739J3081J2094J2437J3800J4561J4797J6034J8370K0255
58884I30752K1026K1256K0778J8740J5597J2739J0136O607K361j130l860p398
$$ plain form
58976 729707 728994 730515 733636 736913 740402 745661 753480 763210 774322 786852 800021 812230 823065
58963 823065 833806 845329 856880 867466 877123 886061 893724 899415 902891 903820 901570 895904 887074
58950 887074 875142 860317 843948 827818 812244 796253 779866 764643 751628 740287 730022
58939 730022 721169 713845 707224 700779 695007 690281 686253 682980 681324 681440 682110 682305 682339 682757 683246 683315
58923 683315 683021 682359 680942 678841 676672 674393 671215 667148 663405 660718 658626 656989 656734 658284 660580
58908 660580 662615 664771 667799 671619 676024 681631 689269 699201 711414 725638 740682 754960 768233
58895 768233 781584 795323 808404 820498 832935 846735 861296 876093 892127 910497 930752
58884 930752 951778 973034 993812 1012552 1028149 1040888 1051024 1057631 1059992 1058862 1055002 1047604
58872A047604j2019j6022j8370j9774k0667k0242j8234j5805j3950j2506j1171
58861H68844j0086r149q111p518q171r615j0673j1215j1841j2103j0926q729p232
58848G43475p032p077o583n770m823l782l385m366o008p011p474q302r125q886
58834F53851q080q211r129r128p703o081m925l674k229j306r24l86K19K89L45
58819E92928J451L224M338M724N222N497M594L249L081L762L489K116J182R57
58805F39814K69p97r24m74j328l432m458l620k855l426m221m325m568n381n705
58790E94569n159m927n339m921k987j017k76j24K81P06J148K406M219M880L717
58775E87176K144J391J059O88O16N01r05l485n328n499n219n418n222l964k591
$$ plain form
58872 1047604 1035585 1019563 1001193 981419 960752 940510 922276 906471 892521 880015 868844
58861 868844 858758 849609 841498 833980 825809 816194 805521 794306 782465 770362 759436 750707 743475
58848 743475 736443 729366 722783 717013 712190 708408 705023 700657 694649 687638 680164 671862 662737 653851
58834 653851 645771 637560 628431 619303 611600 605519 600594 596920 594691 593385 592461 592075 592294 592583 592928
58819 592928 594379 597603 601941 606665 611887 617384 621978 625227 628308 632070 635559 637675 638857 639814
58805 639814 640083 639286 638362 637888 636560 633128 628670 625050 622195 618769 614548 610223 605655 600274 594569
58790 594569 589410 584483 579144 574223 571236 570219 569943 569819 570100 570806 571954 574360 578579 583459 587176
58775 587176 589320 590711 591770 592458 593074 593575 592670 589185 583857 578358 573139 567721 562499 558535 555944
58760E55944j952j473o37J3L30J149K504L155K807K889M104N122M791L814L162
58745E85722K628J984J891K611L382L949N052O695P651P462P117P065O442N048
58731F54699M145M381M775M618M561M945M947M182L386K803J753M78M17J964L843
58716G05897N295O827Q286Q507P597P156P449O765M481K258J103k37k723n281
58702G63380o964q600j0911j3083j4522j5982j7712j8515j7847j6857j6286j5347
58690E90754j3676j2187j1048r110o430m884n147n546n088m985n797n821m017
58677D97018k083j696k019j687j158j175j010L2J194J952L179N245O920P576Q379
58662E20667R911J0776R998Q561P185M943J599j115k203l007m544n676n616n667
$$ plain form
58760 555944 553992 552519 551882 551895 552225 553374 555878 559033 561840 564729 568833 573955 578746 582560 585722
58745 585722 588350 590334 592225 594836 598218 602167 607219 613914 621565 629027 636144 643209 649651 654699
58731 654699 658844 663225 668000 672618 677179 682124 687071 691253 694639 697442 699195 699673 700090 702054 705897
58716 705897 711192 718019 726305 734812 742409 749565 757014 763779 768260 770518 771621 771384 768661 763380
58702 763380 756416 747816 736905 723822 709300 693318 675606 657091 639244 622387 606101 590754
58690 590754 577078 564891 553843 544733 538303 533419 528272 522726 517638 512653 506856 501035 497018
58677 497018 494935 493239 491220 489533 488375 487200 486190 486222 487416 489368 492547 497792 504712 512288 520667
58662 520667 530578 541354 551352 559913 567098 572041 573640 572525 570322 567315 562771 557095 551479 545812
58648E45812o619o931n524l968l759l857l006k194k509k818j843n46k08o2J001
58633E02969K328L103M000N272N319L353J369J264K006J777R00M58N2p59p64Q96
58617E33543K886L876M634N935O582N774N133O011O920O081M504L918L668K286
58603F01751L62p46j379k303k644j577m38p65j770j973j732j970k114j396n01
58588E80805P4J427M072O461P631R055J1698J3753J3694J3094J3688J4060J2168
58575G01680R053P003O013M937M315N187O680P565Q601J0862J3496J5522J7845
58562H18759K1162K3944K4946K5466K6566K6553K3963K0528J8144J5413J0381
58551A055825M490K73k664o021r106j0213r905r715r308q060p567r412j2253j4154
$$ plain form
58648 545812 539193 532262 526738 522770 519011 515154 512148 509954 507445 504627 502784 502238 502030 501968 502969
58633 502969 505297 508400 512400 517672 522991 526344 527713 528977 530983 532760 533660 534118 534170 533411 532647 533543
58617 533543 536429 540305 544939 550874 557456 563230 568363 574374 581294 587375 591879 595797 599465 601751
58603 601751 602113 601367 599988 597685 595041 593464 593026 592261 590491 588518 586786 584816 582702 581306 580805
58588 580805 580879 582306 586378 592839 600470 609525 621223 634976 648670 661764 675452 689512 701680
58575 701680 710733 717736 723749 728686 733001 738188 744868 752433 761034 771896 785392 800914 818759
58562 818759 839921 863865 888811 914277 940843 967396 991359 1011887 1030031 1045444 1055825
58551 1055825 1060315 1060588 1057924 1051903 1042797 1032584 1022679 1012964 1003656 995596 988029 978617 966364 952210
58537I52210j5835j8601k1233k2134k2422k3546k4036k1961j8463j5464j2211
58526G36304p659l827k901l224k107m81o89j816j504n38j266l087l662l201l439
58511F96903l897l087j949k182k766j947r17j597k646j819m14j078k867k963j690
58496F65084j451k088j685o25n70p68N07K253K531K321L566N194N254N105P039
58481F91667R774J0809J1244J3427J5966J6109J5044J5574J6446J4428J0354P438
58469H48280N246J007m425p708q902j0546j2027j0723p659o178n802l311R08L444
58455G81604M106N746Q422R588R483J0555J2001J0731P256M757K919j251o939
58442H58978j0058j0112j0416j1628j1173r012p891p695n653k212p07j045K06
$$ plain form
58537 952210 936375 917774 896541 874407 851985 828439 804403 782442 763979 748515 736304
58526 736304 728645 724818 721917 718693 716586 716105 715416 713600 712096 711558 710292 707205 703543 700342 696903
58511 696903 693006 689919 687970 685788 683022 681075 680158 678561 675915 674096 673682 672604 669737 666774 665084
58496 665084 663633 661545 659860 659235 658665 657897 658404 660657 663188 665509 669075 674269 679523 684628 691667
58481 691667 701441 712250 723494 736921 752887 768996 784040 799614 816060 830488 840842 848280
58469 848280 853526 854533 850108 842400 833498 822952 810925 800202 792543 786365 780563 777252 778160 781604
58455 781604 785710 791456 799878 809466 818949 829504 841505 852236 859492 864249 867168 865917 858978
58442 858978 848920 838808 828392 816764 805591 796579 788688 780993 775340 773128 772421 771376 771582
58429G71582L315N074N119O432R228J0458R783R988J1188J0560Q082O529N649
58416H72987K540k055m246l962m963p707q811p956q503j0685j0945q865p963q852
58402G80014q318o000n137n811m360n83J440P83J070L368M616M320N628Q466Q686
58387G88182N613L460L754L381J568J592L820M330K264J475L085L532J784J328
58373H29168L019L237J147O09K875M542M645O370R855J0839Q665Q051J0647J2419
58359I16088J1702J2058J4672J5588J3277J1352J1240R623N672L164L014J441
58347A028891k041k923l42Q56p43m23L459O275O122P223J1115J3240J1855J1640
58333A094204J4714J6717J5563J5344J7771J8448J5617J3793J4770J3842R103
$$ plain form
58429 771582 774897 779971 785090 791522 800750 811208 820991 830979 842167 852727 860809 867338 872987
58416 872987 875527 873472 869226 865264 860301 852594 843783 835827 827324 816639 805694 796829 788866 780014
58402 780014 771696 765696 760559 754748 750388 749805 751245 752028 753098 756466 761082 765402 771030 779496 788182
58387 788182 793795 797255 801009 804390 805958 807550 811370 815700 817964 819439 822524 826056 827840 829168
58373 829168 832187 835424 836571 837180 840055 844597 849242 855612 865467 876306 884971 893022 903669 916088
58359 916088 927790 939848 954520 970108 983385 994737 1005977 1015600 1021272 1024436 1027450 1028891
58347 1028891 1026850 1023927 1023585 1024441 1023698 1023275 1026734 1033009 1039131 1046354 1057469 1070709 1082564 1094204
58333 1094204 1108918 1125635 1141198 1156542 1174313 1192761 1208378 1222171 1236941 1250783 1259886
58322A259886N521N622N042J638q1J995L265J578J550N218P652O432O224R393
58308A320935J1430J0269J0511J3835J5208J3082J3191J7413J9533J6970J5788
58297A478165J8811K0121J6964J5570J9007K0926J7987J6689K0924K4361K2527
58286A692052K0921K3683K5681K3458K2483K5918K7784K4964K4126K8943L2572
58275A972585L0753K9956L4364L7536L5513L5111M0385M4228M2477M2663M9256
58264B394827N4312N2712N2408N9013O4773O3704O3075O8490P2446O9385O7130
58253C082275P1455P4609P1354P0380P7248Q2593Q0552Q1622R3033J03920J05140
58242C994181J06121J16182J27059J30453J34821J47587J59093J61813J66721
$$ plain form
58322 1259886 1265407 1271029 1276071 1277709 1277628 1279623 1282888 1284466 1286016 1291234 1298886 1305318 1311542 1320935
58308 1320935 1332365 1342634 1353145 1366980 1382188 1395270 1408461 1425874 1445407 1462377 1478165
58297 1478165 1496976 1517097 1534061 1549631 1568638 1589564 1607551 1624240 1645164 1669525 1692052
58286 1692052 1712973 1736656 1762337 1785795 1808278 1834196 1861980 1886944 1911070 1940013 1972585
58275 1972585 2003338 2033294 2067658 2105194 2140707 2175818 2216203 2260431 2302908 2345571 2394827
58264 2394827 2449139 2501851 2554259 2613272 2678045 2741749 2804824 2873314 2945760 3015145 3082275
58253 3082275 3153730 3228339 3299693 3370073 3447321 3529914 3610466 3692088 3785121 3889041 3994181
58242 3994181 4100302 4216484 4343543 4473996 4608817 4756404 4915497 5077310 5244031
58233E244031J82545J98300K04949K13953K34848K55844K67247K81792L09996
58224G393505L38622L56710L78757M17561M59278M91384N29008N85958O47370
58215A1598153P00700P64676Q55956R57877J056467J174858J335198J521507J720885
58206B1686277J964398K282152K656639L069749L555005M150663M847698N645921
58198D9858502O613994P828415R309271J1092315J3296034J6013808J9192116
58191A33204455K2699368K6399062K9987625L2858066L4345043L4021770L1471634
58184C44987023K5886632J6503735L830802r838479k1587735k9631856l3880767
58177B96269355l5121818l4136039l1573658k8129012k4434650k0858890j7560903
$$ plain form
58233 5244031 5426576 5624876 5829825 6043778 6278626 6534470 6801717 7083509 7393505
58224 7393505 7732127 8088837 8467594 8885155 9344433 9835817 10364825 10950783 11598153
58215 11598153 12298853 13063529 13919485 14877362 15933829 17108687 18443885 19965392 21686277
58206 21686277 23650675 25932827 28589466 31659215 35214220 39364883 44212581 49858502
58198 49858502 56472496 64300911 73610182 84702497 97998531 114012339 133204455
58191 133204455 155903823 182302885 212290510 245148576 279493619 313515389 344987023
58184 344987023 370873655 387377390 391208192 381369713 359781978 330150122 296269355
58177 296269355 261147537 227011498 195437840 167308828 142874178 122015288 104454385
58170A04454385j4656129j2214950j0194584q505019p110180n995677n096575
58163D0681271m336834l698817l188661k772272k405023k088352j840632j642529
58155A8708151j461246j299855j175381j073850r70769q72329p95633p30172o56989
58146I671927n85122n32685m91157m42712l94593l63335l42028l14800k87698
58137E917797k74690k67998k51556k30261k18028k09969j93311j73596j63948
58128C934440j59615j47986j33206j26867j24652j15307j03046r8718r7987r0032
58118B737024p8957p5553p6287p0936o2928o2024o4539o0442n2861n1535n3759
58107B027203n0424m4398m4717m8579m6794m1460m1109m3791m1595l6758l7013
$$ plain form
58170 104454385 89798256 77583306 67388722 58883703 51773523 45777846 40681271
58163 40681271 36344437 32645620 29456959 26684687 24279664 22191312 20350680 18708151
58155 18708151 17246905 15947050 14771669 13697819 12727050 11854721 11059088 10328916 9671927
58146 9671927 9086805 8554120 8062963 7620251 7225658 6862323 6520295 6205495 5917797
58137 5917797 5643107 5375109 5123553 4893292 4675264 4465295 4271984 4098388 3934440
58128 3934440 3774825 3626839 3493633 3366766 3242114 3126807 3023761 2925043 2827056 2737024
58118 2737024 2658067 2582514 2506227 2435291 2372363 2310339 2245800 2185358 2132497 2080962 2027203
58107 2027203 1976779 1932381 1887664 1839085 1792291 1750831 1709722 1665931 1624336 1587578 1550565
58096A550565l9953l7785l2784l2617l5071l2556k7173k6481k8597k6137k0780
58085A210631j9688k1482j9719j6356j7951k2127k1472j7404j6966j9279j8220
58074I99967j5178j6183j9454j8506j4737j4527j6778j5497j1899j1873j4108
58063H31227j2701q961q867j1244j0172o698o644r085q433n785o807j0304j0195
58050G15331p035o560q426p368l983l560n564m854k119k577n605n900l803m318
58036F43659o959o771m423n121q341q604n900n517p989q776p527q224j0451r838
58022E39218o866o269p987p575n187n159p132o523l571k974m775m474k035j925
58008D66766m211m439k434k442m350l603k69N44j877k600j28J517P66N85J585
$$ plain form
58096 1550565 1510612 1472827 1440043 1407426 1372355 1339799 1312626 1286145 1257548 1231411 1210631
58085 1210631 1190943 1169461 1149742 1133386 1115435 1093308 1071836 1054432 1037466 1018187 999967
58074 999967 984789 968606 949152 930646 915909 901382 884604 869107 857208 845335 831227
58063 831227 818526 809565 800698 789454 779282 772584 765940 756855 748422 742637 735830 725526 715331
58050 715331 708296 701736 693310 685942 681959 678399 672835 667981 665862 663285 657680 651780 647977 643659
58036 643659 636700 629929 625506 620385 612044 603440 597540 592023 584034 575258 567731 559507 549056 539218
58022 539218 532352 526083 518096 510521 505334 500175 493043 486520 482949 479975 475200 470726 468691 466766
58008 466766 462555 458116 455682 453240 448890 445287 445018 445562 443685 441085 440957 442474 443240 443825 445410
57993D45410Q27j479j590M97P44j166j240R61J326j026k339j569j872l744l886
57978D29854k033j766l492l572j514j018k782l203j456r17k281k152J35J024m77
57963D04350j097K53P79j40L20K244K066p05k253j407j445l417m141k557j824
57948C91026l114l460j660m36q06j60K237L549L023L687O485Q346P940P953R727
57933D34337J0939J0384R883R768P800M126K003K041J082j743l381k856l243n784
57919D75356p555o960o208o508o050m613m710o285n729k217M41L11K14J864K686
57904D24037J065n43m96r08l026m467l792l102l586l145j017j05j937l799l448
57889C91731k402k101j200Q04J622L89m35L53N35q46j258M01J282l36j953j578
$$ plain form
57993 445410 446237 444758 443168 443665 444409 443243 442003 442964 444290 443264 440925 439356 437484 433740 429854
57978 429854 427821 426055 422563 418991 417477 416459 413677 410474 409018 408101 405820 403668 403803 404827 404350
57963 404350 403253 403506 404285 404145 404465 406709 408775 408070 405817 404410 402965 399548 395407 392850 391026
57948 391026 387912 384452 382792 382356 381550 381390 383627 387176 390199 393886 400371 408717 416657 424610 434337
57933 434337 445276 455660 465543 475311 483111 487237 489240 491281 492363 490620 487239 484383 481140 475356
57919 475356 467801 460841 454633 448125 442075 437462 432752 426467 420738 418521 418962 419273 419487 421351 424037
57904 424037 425102 424559 424063 423155 420129 415662 411870 408768 405182 402037 401020 400915 398978 395179 391731
57889 391731 389329 387228 386028 386832 388454 388843 388408 388761 389296 388450 387192 387593 388875 388539 386586 385008
57873C85008j142k268l021j918r78j732k185q47K30m79p91J105L069K873K158
57858C79082L223N033N620N502N868O078N556N340N504M162J136p35j12M81r19
57843D30819k608k899l149m539n526n169n376p033p698n981m556n610o932n858
57829C57885l755l127l275k314p53J57J024K293K347N30o92M93K084J729N58O14
57813C55798J181O40o04j815l893o946q653p897p149q375r463p851m874l256k917
57798B83926k447k232k828k599k83K289L055L054M004M982M533L799M414N474
57784C09141N575N604O596P156O063N088O080P506P075N542M794M353L039J860
57770C85472J913J569r06l849m753m332m722n575n357m770n340o193n639m445
$$ plain form
57873 385008 383866 381598 378577 376659 375681 373949 371764 370917 371147 370668 369877 370982 374051 376924 379082
57858 379082 382305 387338 392958 398460 404328 410406 415962 421302 426806 430968 432104 431369 431257 431738 430819
57843 430819 428211 425312 422163 417624 412098 406929 401553 394520 386822 380841 376285 370675 363743 357885
57829 357885 354130 351003 347728 345414 344661 344818 345842 348135 350482 351012 350320 350813 352897 354626 355184 355798
57813 355798 356979 357619 357015 355200 351307 344361 335708 327811 320662 312287 302824 294973 290099 286843 283926
57798 283926 281479 279247 276419 273820 273537 275826 278881 281935 285939 290921 295454 299253 303667 309141
57784 309141 314716 320320 326916 334072 340135 345223 351303 358809 365884 371426 376220 380573 383612 385472
57770 385472 387385 388954 388048 384199 379446 375114 370392 364817 359460 354690 349350 343157 337518 333073
57756C33073m239m264k939j123m89k65J137K783K924K438L099L868K616L42n0
57741C38911J633K980L059L015L201K832K105J825J509L61o42j81Q14N68o28j391
57725C59971j911k885l162j456O95P30j034k272k489k982l851l991l536l487l581
57710C24759l089k904m153n621n345l905l338l602l102j928j578j969j654o81
57696B81890m04q30p85l58o33j378j445j010j031j010J66J778K185J715K099L550
57680B84499M873N994P902J0431J2652J5026J8834K3886K9105L4785M1752M8787
57668E38526N3448N5061N4374N0573M1227K5380M807j7401l7572n1697n7677n7322
57656F01727n4149m9590m3237l5811k9263k4254j9909j5894j2638r926p301n355
$$ plain form
57756 333073 328834 324570 321631 320508 320019 319754 320891 323674 326598 329036 332135 336003 338619 338961 338911
57741 338911 340544 343524 346583 349598 352799 355631 357736 359561 361070 361431 360789 360608 361422 361990 361362 359971
57725 359971 358060 355175 352013 350557 351252 351982 350948 348676 346187 343205 339354 335363 331827 328340 324759
57710 324759 321670 318766 314613 308992 303647 299742 296404 292802 289700 287772 286194 284225 282571 281890
57696 281890 281486 280656 279871 279513 278880 277502 276057 275047 274016 273006 273172 274950 277135 278850 280949 284499
57680 284499 289372 295366 303268 313699 326351 341377 360211 384097 413202 447987 489739 538526
57668 538526 591974 647035 701409 751982 793209 818589 823396 805995 768423 716726 659049 601727
57656 601727 547578 497988 454751 418940 389677 365423 345514 329620 316982 307056 299755 294400
57644B94400m729m497l500k352k141k170j342n41j046j711o01J443J900N81m57
57629B73237m89o43j160j132p78j186j946j790j307k196l942m177k433p70m72
57614B48816p16p83j022j376j272j128j815k664k244r44m37q08o25L29Q78Q78
57598B35067J209J537O37j099k055k196k835l724l270j715j182k180k872k332
57584B12990j797k051k159j600j301j711j936j493j082j087j128j360k308l272
57570A88705k842j230o9J65M57R93P58l67j211j302j285j253o42K19M63M92J409
57553A83460K756L033K284J951K215J883P36k82j085k231k947j959j06N17o9p
57537A90149R21J098L04L4L46l62k005k450j194l00q29j297o62P0K75R20K215
$$ plain form
57644 294400 289671 285174 281674 279322 277181 275011 273669 273128 272082 270371 269770 271213 273113 273694 273237
57629 273237 272748 272105 270945 269813 269035 267849 265903 264113 262806 260610 256668 252491 250058 249288 248816
57614 248816 248100 247317 246295 244919 243647 242519 240704 238040 235796 234852 234415 233607 232982 233311 234189 235067
57598 235067 236276 237813 238450 237351 235296 233100 230265 226541 223271 221556 220374 218194 215322 212990
57584 212990 211193 209142 206983 205383 204082 202371 200435 198942 197860 196773 195645 194285 191977 188705
57570 188705 185863 184633 184564 184729 185186 186179 186937 186570 185359 184057 182772 181519 180877 181096 181559 182051 183460
57553 183460 186216 189249 191533 193484 195699 197582 198318 198036 196951 194720 191773 189814 189708 190225 190156 190149
57537 190149 191070 192168 192472 192506 192852 192490 190485 188035 186841 186541 185712 184415 183753 183823 184098 185018 187233
57520A87233K711J866J083J122R20k9o27m49o12j336j252q8M94j05k46Q90J625
57503A93200P04n79p78n75j105j954k385k746l318l451l008k870l078k397p25
57488A64935J95m29j046l61P72J281J619K259K387J578Q69R34Q93K17o2P56J604
57471A78401J434P76M24J55k25j80K58J84m10l39N81J007M53N8K06k76j619k194
57453A78694j226j31K3N8N67O58J12K19J105Q38j162k468j350M12N54j88RP83
57435A77507P11Kl07m13q26p77M08J616J522O13m0n94j324j344j92Q25O88N07
57417A78582J408K294J733O49P72J744J964J312R13J049J207J435J936K100J498
57402B00596R15J017J017J27r43j273j257j364q77N85J703J426Q43J324K217K250
$$ plain form
57520 187233 189944 191810 192893 194015 194935 194906 194279 193830 193218 191882 190630 190542 191036 190931 190685 191575 193200
57503 193200 193904 193325 192547 191972 190867 188913 186528 183782 180464 177013 174005 171135 168057 165660 164935
57488 164935 165130 164701 163655 163294 164066 165347 166966 169225 171612 173190 174059 174993 175886 176103 176041 176797 178401
57471 178401 179835 180611 181035 181190 180965 180785 181043 181227 180817 180478 181059 182066 182519 182577 182783 182507 180888 178694
57453 178694 177468 177337 177360 177418 177985 178643 178755 178974 180079 180917 179755 177287 175937 176349 176903 176715 176724 177507
57435 177507 178218 178220 177913 177500 176674 175897 176305 177921 179443 180056 180016 179422 178098 176754 176562 177387 178075 178582
57417 178582 179990 182284 184017 184666 185438 187182 189146 190458 191371 192420 193627 195062 196998 199098 200596
57402 200596 201511 202528 203545 203672 202729 201456 200199 198835 197958 198543 200246 201672 202515 203839 206056 208306
57386B08306J866K157K687K393J598J192Q94J56k79L72J225J089M93N34Q06K88
57370B25777p08j306j707k307k364j341l07k11j20Q53J467M93o35J09J862K284
57354B21839J428J210J809J624N50K81J226J824J329Q21J042J268R02M22K47J70
57338B37992K04O84J325J408R37N31L58J85J72M90O40K21j61O5K64l16j038r61
57320B43000n64p93j188o09O99J478J420J251J268J231J259J550J788J855K311
57305B55956L080K884J367K69R09J943J708J199K276M280N149M920N201N873N425
57290C02439M187M230N869P162P217P338Q316R017Q492P371O412N391M110K930
57276C90481J822K40j646k935l326l272k870k044j662k750m614n393m633l747
$$ plain form
57386 208306 210172 212329 215016 217409 219007 220199 221093 221249 220970 221342 222567 223656 224149 224683 225489 225777
57370 225777 225069 223763 222056 219749 217385 216044 215737 215526 215406 216259 217726 218219 217584 217693 219555 221839
57354 221839 223267 224477 226286 227910 228460 228741 229967 231791 233120 233941 234983 236251 237153 237575 237822 237992
57338 237992 238196 238880 240205 241613 242550 243081 243439 243624 243796 244286 244926 245147 244986 245051 245315 244999 243961 243000
57320 243000 242436 241643 240455 239846 240545 242023 243443 244694 245962 247193 248452 250002 251790 253645 255956
57305 255956 259036 261920 263287 263556 264465 266408 268116 269315 271591 275871 281020 285940 291141 297014 302439
57290 302439 306626 310856 316725 323887 331104 338442 346758 355775 364267 371638 378050 383441 387551 390481
57276 390481 392303 392543 390897 387962 384636 381364 378494 376450 374788 372038 367424 362031 357398 353651
57262C53651l789m228m147l317j993p19k48o31o69N06J988K455K196K233K325
57247C45613J731J122J564K345K057J280J666K776K616J223Q74K350L731L524
57233C74472K590K177K214K425L076L837L677K714K472L603M970N526N544N434
57219D24731N053M661M926N432M897L364K508L218M486N309N899O494O623O311
57205D93912O463P268P663P058O235N963O099O552P712R322J0349J0451J0370
57192E95417J0480J0411J0330J0996J2132J2482J1943J1959J3200J4581J5265
57181G29196J5866J6875J7594J7567J7569J8198J8899J9270K0000K1490K2872
57170I35396K3374K3619K4596K6284K8092K9761L1224L2371L3435L4717L5794
$$ plain form
57262 353651 349862 345634 341487 338170 336177 335458 335210 334579 333910 334416 336404 338859 341055 343288 345613
57247 345613 347344 348466 350030 352375 354432 355712 357378 360154 362770 363993 364867 367217 370948 374472
57233 374472 377062 379239 381453 383878 386954 390791 394468 397182 399654 403257 408227 413753 419297 424731
57219 424731 429784 434445 439371 444803 449700 453064 455572 458790 463276 468585 474484 480978 487601 493912
57205 493912 500375 507643 515306 522364 528599 534562 540661 547213 554925 564247 574596 585047 595417
57192 595417 605897 616308 626638 637634 649766 662248 674191 686150 699350 713931 729196
57181 729196 745062 761937 779531 797098 814667 832865 851764 871034 891034 912524 935396
57170 935396 958770 982389 1006985 1033269 1061361 1091122 1122346 1154717 1188152 1222869 1258663
57159A258663L6028L5881L6440L7496L7701L6845L6274L6721L7422L7814L8352
57148A665637L9035L9030L8518L9006M0928M2695M3117M3060M3585M4169M4043
57137B122823M3709M3813M3986M3990M4619M6169M7437M7618M7834M9238N1033
57126B632269N1938N2468N4000N6495N8968O1358O4263O7424P0206P3174P7562
57115C320125Q3467R0070R7468J06776J18450J31874J46725J63603J83114K05458
57105D647130K31186K61653K98589L43887L99897M69164N53742O55328P76070
57096H636646R18610J085160J276994J494362J735348J993872K259523K520293
57088B1920808K764933K982367L160675L289345L361112L366293L282574L075350
$$ plain form
57159 1258663 1294691 1330572 1367012 1404508 1442209 1479054 1515328 1552049 1589471 1627285 1665637
57148 1665637 1704672 1743702 1782220 1821226 1862154 1904849 1947966 1991026 2034611 2078780 2122823
57137 2122823 2166532 2210345 2254331 2298321 2342940 2389109 2436546 2484164 2531998 2581236 2632269
57126 2632269 2684207 2736675 2790675 2847170 2906138 2967496 3031759 3099183 3169389 3242563 3320125
57115 3320125 3403592 3493662 3591130 3697906 3816356 3948230 4094955 4258558 4441672 4647130
57105 4647130 4878316 5139969 5438558 5782445 6182342 6651506 7205248 7860576 8636646
57096 8636646 9555256 10640416 11917410 13411772 15147120 17140992 19400515 21920808
57088 21920808 24685741 27668108 30828783 34118128 37479240 40845533 44128107 47203457
57080D7203457K715798K201404J558183Q26273M9728p21693j434384k046679k543081
57071D7809006k927979l206750l377708l440125l402250l279355l089149k851387
57063B2234303k587298k315287k048105j794816j562601j355066j171629j010737
57055H388764q72096p54752o55602n71701n02130m45929m00079l61214l27748
57046C497513k98777k72449k47009k22319j98990j77139j56941j39036j23358
57037A661495j08771r4631q1392o9074n6714m3957l1448j9315p295L185R638J1861
57025A173582J1791Q920o85j8542l9658n6885o7383p2449p3270p0061o4141n7635
57013F73584n1358m5016l8946l3802k9269k4765k0785j7957j5621j2933j0473
$$ plain form
57080 47203457 49919255 52120659 53678842 54505115 54554843 53833150 52398766 50352087 47809006
57071 47809006 44881027 41674277 38296569 34856444 31454194 28174839 25085690 22234303
57063 22234303 19647005 17331718 15283613 13488797 11926196 10571130 9399501 8388764
57055 8388764 7516668 6761916 6106314 5534613 5032483 4586554 4186475 3825261 3497513
57046 3497513 3198736 2926287 2679278 2456959 2257969 2080830 1923889 1784853 1661495
57037 1661495 1552724 1458093 1376701 1307627 1250913 1206956 1175508 1156193 1148898 1152083 1161721 1173582
57025 1173582 1185373 1194293 1193608 1175066 1135408 1078523 1011140 938691 865421 795360 731219 673584
57013 673584 622226 577210 538264 504462 475193 450428 429643 411686 396065 383132 372659
57002C72659r255q895q310p345o413n370m076l160k949k661j781j015p12J82K268
56987C13167M327N391O532Q841J1007J0881Q210M048j236p385j2926j6493j8473
56974C15891j9597j9173j6683j3742j2068j0661p510l140O1J497K820N128P969
56961B30792J0907J3964J6618J8171J8877J9060J7633J3262O543o62p401j3423
56949C44341j7709j9361j9362j9281j8655j5857j1164o715l592r97J696M165O555
56936B24064R769J4032J8575K2726K6060K7802K7357K5006K0687J3021J444j1383
56924D19160k1435k7261l0204l1306l0313k7510k4150k0849j7401j4270j2360
56913A62101j1329r937q129o944o408n416l747k341j486n64L01K35n91q88k85
$$ plain form
57002 372659 363404 354509 346199 338854 332441 327071 322995 319835 316886 314225 312444 311429 310717 310899 313167
56987 313167 317494 322885 329417 338258 349265 360146 368356 372404 371168 363783 350857 334364 315891
56974 315891 296294 277121 260438 246696 234628 223967 216457 213317 213378 214875 217695 222823 230792
56961 230792 241699 255663 272281 290452 309329 328389 346022 359284 365827 365165 357764 344341
56949 344341 326632 307271 287909 268628 249973 234116 222952 216237 212645 211648 213344 217509 224064
56936 224064 233833 247865 266440 289166 315226 343028 370385 395391 416078 429099 430543 419160
56924 419160 397725 370464 340260 308954 278641 251131 226981 206132 188731 174461 162101
56913 162101 150772 140835 132706 125762 119354 113938 110191 107850 106364 105800 106101 106336 105745 104857 104572
56898A04572K95M63R29J994L092M121N744Q100J0577J2969J5565J8050J9656K0333
56884B26460K0289J8672J4278P619O60n281r917j2530j2192r539o547m102j393
56871B26477K169O031R732J3660J8206K3400K9426L6270M2922M8128N1779N4325
56859E62525N5144N2769M6233L5017J8731j217k0340l3828m0508m2395m1078l6816
56847E54237l0528k3814j6871q768J35Q470J6519K5987L6958M7692N7733O8334
56835G36084P9083Q6848Q9030Q5325P5211N6522K8625m532l6247o1128p6805q3484
56823I74532q3194p8471p0789o0713m9406l8542k8572j8621q288K002J2356K3308
56811E75602L4200M3583N1281N7956O2487O1929N4533M0758K1410k492k7488m8187
$$ plain form
56898 104572 104867 105330 106259 108253 111345 115466 121210 129310 139887 152856 168421 186471 206127 226460
56884 226460 246749 265421 279699 287318 287978 282697 272780 260250 248058 238519 231972 227870 226477
56871 226477 228646 234677 244409 258069 276275 299675 329101 365371 408293 456421 508200 562525
56859 562525 617669 670438 716671 751688 770419 769202 748862 715034 674526 632131 591053 554237
56847 554237 523709 499895 483024 474256 474391 482861 499380 525367 562325 610017 667750 736084
56835 736084 815167 902015 991045 1076370 1151581 1208103 1236728 1232196 1195949 1134821 1058016 974532
56823 974532 891338 812867 742078 681365 631959 593417 564845 546224 537936 539938 552294 575602
56811 575602 609802 653385 704666 762622 825109 887038 941571 982329 1003739 1001247 973759 925572
56799I25572o1414o7872o9140o5613n8359n0210m3157l6556k9247k1644j4482
56788D07878p429l15O097J1743J7782K4265K9103L0765L0011K7593K2143J2249
56776F11885r05j4535k6674l6213m2083m4019m3139m0536l6361l1166k6575k3487
56764B46192k0999j8157j5346j2966j0385p396n161m469m479m291m162m191l511
56751A30679k048j307k052k927k663j914j525q96L26Q28l26j830k137j767j773
56736A08668j628n82L74L8p60m86N71J121J109J206J106L06l42J99J214J364Q87
56719A14365Q93J260J106O57P98J294J191M65k05p04j129r02K14J063N86m11n37
56702A20004j8L8j98K75J262J572R77L74K31L02N36J029J380J213R47J012R72
$$ plain form
56799 925572 864158 796286 727146 661533 603174 552964 509807 473251 444004 422360 407878
56788 407878 400449 400134 406231 417974 435756 460021 489124 519889 549900 577493 599636 611885
56776 611885 610980 596445 569771 533558 491475 447456 404317 363781 327420 296254 269679 246192
56764 246192 225193 207036 191690 178724 168339 160943 155782 151313 146834 142543 138381 134190 130679
56751 130679 128631 127324 125272 122345 119682 117768 116243 115347 115673 116501 116175 114345 112208 110441 108668
56736 108668 107040 106458 106832 106870 106110 105624 106195 107316 108425 109631 110737 111043 110701 110900 112114 113478 114365
56719 114365 115258 116518 117624 118281 119079 120373 121564 122029 121824 121120 119991 119089 119303 120366 120952 120541 120004
56702 120004 119986 120024 119826 120101 121363 122935 123912 124286 124517 124819 125355 126384 127764 128977 129924 130936 131908
56685A31908L80k35l24k99m81o8J462K941K983K034J471J488J374J125J179J222
56669A48160P11J0k66m02p90q38k7Q42Q29M39N64P87L52p0O66K068K613J974J138
56650A58760P04N41O50J067J329J102Q12O70P0j100j686j133p62j646k578j930
56634A54870l63K91j37n05o54j233j930j895j460j520j754j253l74k23p53j082
56618A40025j124j302j341r25q04j509j946j053P9k14j443j979j810j959j973
56603A20722o57J190J481J39q04l87L35N55P24J064J179J222J709K105J436K56
56587A32269Q7J020J688J480R53K98o82j281o19N26N58l28m66N10J334J520J955
56570A40822K903L451L262L050L145L277L850N637Q110R759J0146J0076R892R254
$$ plain form
56685 131908 132288 132053 131729 131430 130949 130881 132343 135284 138267 140301 141772 143260 144634 145759 146938 148160
56669 148160 148871 148881 148615 148213 147423 146585 146558 147400 148229 148668 149232 150019 150371 150301 150967 153035 155648 157622 158760
56650 158760 159464 160005 160655 161722 163051 164153 164965 165635 165705 164605 162919 161786 161024 159378 156800 154870
56634 154870 154507 154798 154661 154156 153502 152269 150339 148444 146984 145464 143710 142457 142083 141860 141107 140025
56618 140025 138901 137599 136258 135333 134529 133020 131074 130021 130100 129886 128443 126464 124654 122695 120722
56603 120722 120065 121255 122736 122875 122071 121684 122019 122574 123298 124362 125541 126763 128472 130577 132013 132269
56587 132269 132356 133376 135064 136544 137497 137795 137113 135832 135213 135739 136297 135969 135503 136013 137347 138867 140822
56570 140822 143725 147176 150438 153488 156633 159910 163760 169397 177507 187266 197412 207488 217380 226634
56556B26634Q306P344N640K469j028k924l124k975k761j826p58r87k277l038k976
56541B25719l197l789l710l041k874k977k114p22n93j684k003r53j60m85q72p62
56525A95783r68j474r40P47J817J380N80K65k00j064j503j494k117l242l324k224
56509A82022j758k603l216k773k534l093k871r84Q58R88K57J86M79J79l97n00
56493A64240l87m79l46K33N10J57M4O37J052O65K47M63O86K85k32l24l03l31J42
56474A66959J172J984K372K941L402K464J39j648j662q53m48k44J97M33K26K10
56458A77644N55M48l10p50m97m38r17r86k03N81R45J565K432K388J244M38O65
56441A84804P94Q1m95j88J92Pm1M19N05q8k31N58J038M41j75N2K95j55m40J81
$$ plain form
56556 226634 234940 242284 247924 250393 249365 246441 243317 240342 237581 235755 234997 234010 231733 228695 225719
56541 225719 222522 218733 215023 211982 209108 206131 204017 203295 202702 201018 199015 198062 197902 197417 196545 195783
56525 195783 194815 193341 192401 193148 194965 196345 196925 197190 196990 195926 194423 192929 190812 187570 184246 182022
56509 182022 180264 177661 174445 171672 169138 166045 163174 162190 163048 164036 164293 164479 164958 165137 164740 164240
56493 164240 163853 163374 163028 163261 163771 163928 163972 164609 165661 166326 166573 167036 167722 168007 167775 167451 167148 166817 166959
56474 166959 168131 170115 172487 175428 178830 181294 181433 179785 178123 177270 176822 176578 176775 177208 177434 177644
56458 177644 178199 178647 178337 177587 177090 176652 175735 174749 174546 175127 176072 177637 180069 182457 183701 184139 184804
56441 184804 185598 185679 185184 184996 185188 185195 185154 185573 186078 185990 185759 186317 187355 187796 187621 187673 187968 187813 187373 187554
56421A87554Q15N22j96n82q29j015m92O55J174O12R3K94M48J61J95O58M60n19
56403A90008q71k00Q3n69p51J91R12P35R77K178K691J644P46J264J768Q61k20
56386B01447R8J032J155P90O59J91q07q16Q66K294J695K86M9O16O40M74J141K072
56368B13882K231K054K320K383J496M75K70K94j71m16K25R61J131J410K005J690
56352B32240K29m38P91K202K166J697K197K933K935L087M113M751M125L667M392
56337B71087M775L662K709L252L462J597n04m26O93N08k20O51K442K860J970J497
56321C00015J454P54o2J07L41p13k027j916j126j206j300R4J715J394L1K31J953
56304B99739L009K923L019L471L447L416M250M931M097K880L272M670N032M352
$$ plain form
56421 187554 188369 188891 188695 188113 187284 186269 185777 186432 187606 188218 188311 188605 189053 189214 189409 190067 190527 190008
56403 190008 189137 188937 189020 188451 187700 187891 188803 189538 190515 192693 195384 197028 197774 199038 200806 201667 201447
56386 201447 201545 202577 203732 204522 205181 205372 204565 203749 204615 206909 208604 208890 208939 209555 210195 210669 211810 213882
56368 213882 216113 218167 220487 222870 224366 224841 225111 225405 225234 224818 225043 226004 227135 228545 230550 232240
56352 232240 232469 232031 232822 235024 237190 238887 241084 244017 246952 250039 254152 258903 263028 266695 271087
56337 271087 275862 279524 282233 285485 288947 290544 290040 289614 290307 290815 290595 291246 293688 296548 298518 300015
56321 300015 301469 302223 302161 302268 302609 301896 299869 297953 296827 295621 294321 294415 296130 297524 297555 297786 299739
56304 299739 302748 305671 308690 312161 315608 319024 323274 328205 332302 335182 338454 343124 348156 352508
56290C52508M005L883L253L142M643O191N761M547N044O818P669P685Q390R161
56276D32700Q396P230Q073J0257J1147J0895J2043J4829J6824J7138J7304J8145
56264E84981J9133K0599K3319K6336K8286L0226L4027L8907M3007M7226N3706
56253I49753O1569O8234P4103Q1722R0971R9365J06686J14874J23582J30139J33874
56242B034872J36336J37292J34622J28251J20098J10068R6133P8427N9227L8848
56232C074174J5767r044l2017n1637o9240q5055r7472j06530j14129j20350j23338
56221B281129j23039j21246j17947j11726j03807r7417r2790q7124p9825p3472
56211A272736o9004o4307n8462n3220m9377m5550m1325l7935l5113l1049k6019
$$ plain form
56290 352508 356513 360396 363649 366791 371434 377625 383386 387933 392977 399795 407464 415149 423539 432700
56276 432700 441096 448326 456399 466656 477803 488698 500741 515570 532394 549532 566836 584981
56264 584981 604114 624713 648032 674368 702654 732880 766907 805814 848821 896047 949753
56253 949753 1011322 1079556 1153659 1235381 1326352 1425717 1532403 1647277 1770859 1900998 2034872
56242 2034872 2171208 2308500 2443122 2571373 2691471 2801539 2897672 2976099 3035326 3074174
56232 3074174 3089941 3080897 3048880 2997243 2928003 2842948 2745476 2638946 2524817 2404467 2281129
56221 2281129 2158090 2036844 1918897 1807171 1703364 1605947 1513157 1426033 1346208 1272736
56211 1272736 1203732 1139425 1080963 1027743 978366 932816 891491 853556 818443 787394 761375
56200G61375k2433k0807j9339j7595j6786j6326j4251j1168r673r718q849p034
56188E87396o610p350o455l892k783l827m211k823j736j661q40O58M59j292j450
56173E43583O66K153J849J921L099L335K436K996N355O556N752N667P289Q116
56159F00773P210P070Q754J0064J0235J1527J4610J7171J8628K1321K5590K8802
56147G81755L0753L4722M1563M8227N3871O1704P2678Q3036R0516R7371J04677
56136A500873J09118J08251J03843R7302Q7060P3341O0530N1788M5716M0637L7274
56125B315733L4896K9919K0954J0618M08j1016k2702l0557l4214l8957m8103n9056
56113B167923o9394q0661r3006j02112j05097j04058j00679r3065q1139o9386
$$ plain form
56200 761375 738942 718135 698796 681201 664415 648089 633838 622670 612997 603279 594430 587396
56188 587396 580786 573436 566981 563089 560306 556479 552268 549445 547709 546048 545208 545866 546325 545033 543583
56173 543583 544249 546402 548251 550172 553271 556606 559042 562038 567393 573949 579701 585368 592657 600773
56159 600773 607983 615053 623807 633871 644106 655633 670243 687414 706042 727363 752953 781755
56147 781755 812508 847230 888793 937020 990891 1052595 1125273 1208309 1298825 1396196 1500873
56136 1500873 1609991 1718242 1822085 1919387 2006447 2079788 2140318 2192106 2237822 2278459 2315733
56125 2315733 2350629 2380548 2401502 2412120 2412528 2401512 2378810 2348253 2314039 2275082 2226979 2167923
56113 2167923 2098529 2017868 1924862 1822750 1717653 1613595 1512916 1419851 1338712 1269326
56103A269326o0640n2501m3144l4995k9523k4183j7907j3745j2737j1066o751
56092I62134l122k301j427J176K519J298J145L756N384M110L810O760R197Q573
56078A003012Q273J0534J1736R597Q050R895J1571J0347R790J2617J5068J3927
56066A134417J2416J3603J4689J3354J2933J5724J8030J7373J7540K0953K3311
56055A314343K1583J9793K1074K1684J8930J7031J8820J9792J6899J4871J7056
56044A521876J8676J6296J5075J8973K2730K1678K0484K3755K6972K5690K4720
56033A756925K8887L3486L3426L3042L7079M0930L9767L8503M2353M6477M5461
56022B176336M4086M7852N2059N1311N0587N5542O1198O1931O2909O9673P6340
$$ plain form
56103 1269326 1208686 1156185 1113041 1078046 1048523 1024340 1006433 992688 979951 968885 962134
56092 962134 959012 956711 955284 956460 958979 960277 961422 965178 970562 974672 978482 985242 994439 1003012
56078 1003012 1011285 1021819 1033555 1043152 1051202 1061097 1072668 1083015 1092805 1105422 1120490 1134417
56066 1134417 1146833 1160436 1175125 1188479 1201412 1217136 1235166 1252539 1270079 1291032 1314343
56055 1314343 1335926 1355719 1376793 1398477 1417407 1434438 1453258 1473050 1489949 1504820 1521876
56044 1521876 1540552 1556848 1571923 1590896 1613626 1635304 1655788 1679543 1706515 1732205 1756925
56033 1756925 1785812 1819298 1852724 1885766 1922845 1963775 2003542 2042045 2084398 2130875 2176336
56022 2176336 2220422 2268274 2320333 2371644 2422231 2477773 2538971 2600902 2663811 2733484 2809824
56011B809824P6692P6812Q3622R1269R2415R2551R8969J06267J07468J08627J17184
56000C861700J26802J29615J32226J43134J55731J60964J65122J77250J91017
55991E243561J97625K04405K21193K40958K54056K68354K94064L22573L42793
55982G589582L64106L99248M39515M72223N07179N58788O18079O71254P29387
55973A2349361Q09168R01805R93958J101135J245027J417341J604776J829311
55965B2251882K121424K474637K872517L338250L907641M579071N348445O268971
55957E3162838P414739Q816197J0504256J2580308J5145337J8178440K1563265
55950A47365380K5159215K8684707L1570609L3134594L2894067L0461777K5152187
$$ plain form
56011 2809824 2886516 2963328 3046950 3138219 3230634 3323185 3422154 3528421 3635889 3744516 3861700
56000 3861700 3988502 4118117 4250343 4393477 4549208 4710172 4875294 5052544 5243561
55991 5243561 5441186 5645591 5866784 6107742 6361798 6630152 6924216 7246789 7589582
55982 7589582 7953688 8352936 8792451 9264674 9771853 10330641 10948720 11619974 12349361
55973 12349361 13158529 14060334 15054292 16155427 17400454 18817795 20422571 22251882
55965 22251882 24373306 26847943 29720460 33058710 36966351 41545422 46893867 53162838
55957 53162838 60577577 69393774 79898030 92478338 107623675 125802115 147365380
55950 147365380 172524595 201209302 232779911 265914505 298808572 329270349 354422536
55943C54422536J6205580L876308r816084k1874018l0084425l4026456l4590563
55936B44112878l2934950k9970727k6393558k2730285j9281860j6170273j3466079
55929H3165146j1209548r359126p826375o560546n542298m722537m035189l454627
55921C0454900k983906k601140k268136j977344j742148j552113j380581j225161
55913A4724371j100182r98757q99770q03533p25502o62672n98952n36217m88879
55904G909907m54280m17617l79824l52917l33830l09367k81458k62216k49369
55895D869029k30844k08623j94387j86214j72394j54163j42630j36984j26901
55886C315889j13153j05320j02345r5089q5248q2532q5725q5023q0516q0313q2927
$$ plain form
55943 354422536 370628116 374504424 364688340 342814322 312729897 278703441 244112878
55936 244112878 211177928 181207201 154813643 132083358 112801498 96631225 83165146
55929 83165146 71955598 62596472 54770097 48209551 42667253 37944716 33909527 30454900
55921 30454900 27470994 24869854 22601718 20624374 18882226 17330113 15949532 14724371
55913 14724371 13624189 12625432 11725662 10922129 10196627 9533955 8935003 8398786 7909907
55904 7909907 7455627 7038010 6658186 6305269 5971439 5662072 5380614 5118398 4869029
55895 4869029 4638185 4429562 4235175 4048961 3876567 3722404 3579774 3442790 3315889
55886 3315889 3202736 3097416 2995071 2899982 2814734 2732202 2646477 2561454 2480938 2400625 2317698
55875B317698p9437p1139o7667o9245o7472o2084o0422o1754n8263n0697m7347
55864A622171m8263m5679l9438l7136l9256l8674l4777l3997l6293l4837k9387
55853A204434k6771k7698k5985k1285k0038k3045k4184k2198k2166k4633k4567
55842I41864k1727k1158k2847k1647j7805j6884j8877j8003j3718j1527j2349
55831G45322j1427q314p745r861r651o917o881j0087j1355r718r775j2225j2492
55818F18874r888q968j0532j0329p817p331r318r154n897l816l977k793K4M75
55804E29553j511j272J961L790L159L923O667P262N013M072N159M025p1k378j163
55789E68189n57k684m450m254m720o624p024n629o259r967j3122j4020j4923j6091
$$ plain form
55875 2317698 2238261 2167122 2099455 2030210 1962738 1900654 1840232 1778478 1720215 1669518 1622171
55864 1622171 1573908 1528229 1488791 1451655 1412399 1373725 1338948 1304951 1268658 1233821 1204434
55853 1204434 1177663 1149965 1123980 1102695 1082657 1059612 1035428 1013230 991064 966431 941864
55842 941864 920137 898979 876132 854485 836680 819796 800919 782916 769198 757671 745322
55831 745322 733895 725581 717836 707975 698324 691407 684526 674439 663084 653366 643591 631366 618874
55818 618874 608986 600018 589486 579157 571340 564009 554691 545537 539640 535824 531847 529054 529078 529553
55804 529553 528042 526770 528731 532521 535680 539603 546270 553532 558545 562617 567776 571801 571730 569352 568189
55789 568189 567632 564948 560498 556244 551524 544900 537876 532247 525988 516021 502899 488879 473956 457865
55775D57865j4493j0105o818n524k875J623M153L651L346L707J036m941r201r438
55761D11986r058r953r236n833l518m443n809n767o486q685r243p185o104p753
55747C12913q949p654o470p152p226n045k964k583j927m7O85n92j167m1m3k211
55731B59527l412k159j472l124m374l404k793m436n957n364m530m943m638k443
55717B06478o94p49k77K001L481K601K040L827N645N231M182M170L597J240p58
55702B42015q36j054l100n060n195n110o115o360m607l081l440l638j933l27q01
55687A91358j658q09O18R66J045J664J519L07M51K987N154M758L350K513R82j760
55671B13445l104j787p05j920k945j546j79j535l395k406K45J330R69J163J520
$$ plain form
55775 457865 443372 433267 426449 420925 418050 419673 423826 427477 430823 434530 435566 430625 421424 411986
55761 411986 402928 392975 383739 377906 374388 369945 364136 358369 351883 343198 333955 326770 320666 312913
55747 312913 303964 296310 289840 282688 275462 270417 267453 264870 262943 262896 263581 262989 261822 261781 261738 259527
55731 259527 256115 253956 252484 249360 244986 241582 238789 234353 228396 223032 218502 213559 208921 206478
55717 206478 205784 205035 204758 206759 210240 212841 214881 218708 224353 229584 233766 237936 241533 242773 242015
55702 242015 241179 240125 237025 231965 226770 221660 215545 209185 204578 201497 198057 194419 192486 192159 191358
55687 191358 189700 188891 189509 190475 191520 193184 194703 195010 195461 198448 203602 208360 211710 214223 215205 213445
55671 213445 210341 208554 207849 205929 202984 201438 201259 199724 196329 193923 194168 195498 196467 197630 199150
55656A99150O69j45R64K887L406K957L007K820J184n68o86k66j116k277j967j092
55640B08927j575k866l335l441m463n672n711n295n707o212n560m454l973l328
55626A47335j690l88p71j719j762j523j751j180Q82K168O75j876k723k124j772
55611A31781j350O5J137K33j354j387m00l70j154j393j510k657l915l606k297
55596A11823j631j366l72O80M62k54J74J293J466P45K85o2r82j608p64O19Q29
55579A11337K41N09J722K642K896K964K787K307K359L324M022L490K439J517%
55564A44556k239l524l074k677l637m402l550k637l359m297l556k372k731l423
55550I9078k022P45K225K115K138K460J854N75j4nl21m09O05J555Q05o86q11J83
$$ plain form
55656 199150 199819 199674 200638 203525 206931 209888 212895 215715 216899 216331 215645 215379 214263 211986 210019 208927
55640 208927 207352 204486 201151 197710 193247 187575 181864 176569 170862 164650 159090 154636 150663 147335
55626 147335 145645 145257 144486 142767 141005 139482 137731 136551 137433 139601 140276 138400 135677 133553 131781
55611 131781 130431 130496 131633 131866 130512 129125 128725 128355 127201 125808 124298 121641 117726 114120 111823
55596 111823 110192 108826 108454 109134 109596 109342 109516 110809 112275 113020 113305 113243 112261 110653 109889 110508 111337
55579 111337 111578 112087 113809 116451 119347 122311 125098 127405 129764 133088 137110 140600 143039 144556 144556
55564 144556 142317 138793 135719 133042 129405 125003 121453 118816 115457 111160 107604 105232 102501 99078
55550 99078 97056 97801 100026 102141 104279 106739 108593 109168 109154 109149 108828 108419 109024 110579 111384 110698 109887 110070
55532A10070M22j40pQ33J031M97K69L68J07j84Lj94j427k266j374j91p10j936
55514A05171j562Q8Q88O13O47Q52oj417j876j798k649l798l381j681n28P0J464
55497I1097L018K625M77r42o99k13k54j31P9n42j377p27J124J976J166L20L47
55480I7344L16k82o05l60l99r43j120o48k02k7J77Q6p66j599j287k87R5j58k41
55461H9094l67j068j386j26J692K041R74J29k24j065k067j857n97K71N94J311
55445H7349J982J230n08j275p15l20o42p19l36l76p96n42L38O82L14R9O8m13q45
55426H4575k64P00O58l4K5N71K02q11r37k38r9l71L40J702J852O14k98k85l81
55407H7521o86j96O75L25j083j612p70m8p1M2L13k25j066n85Q07Q80o68j654j181
$$ plain form
55532 110070 110492 110352 110345 111178 112209 112706 112975 113343 113450 113266 113269 113075 111648 109382 108008 107817 107107 105171
55514 105171 103609 103697 104585 105198 105845 106697 106691 105274 103398 101600 98951 95153 91772 90091 89563 89633 91097
55497 91097 94115 96740 97217 96275 95576 95363 95109 94978 95057 94515 93138 92411 93535 95511 96677 96997 97344
55480 97344 97660 97378 96773 96413 96014 95071 93951 93303 93101 93074 93251 93337 92571 90972 89685 89398 89493 89335 89094
55461 89094 88727 87659 86273 86147 87839 89880 90854 90983 90759 89694 87627 85770 85173 85444 86038 87349
55445 87349 89331 90561 90053 88778 88063 87743 87101 86382 86046 85670 84874 84332 84670 85352 85666 85765 85833 85420 84575
55426 84575 84311 85011 85669 85635 85660 86231 86433 85622 84685 84447 84348 83977 84317 86019 87871 88485 88187 87902 87521
55407 87521 86835 86639 87314 87639 86556 84944 84174 84126 84055 84097 84410 84185 83119 82534 83341 84221 83553 81899 80718
55388H0718q35j376j315Q7J258J002K84J84K63Oj74k08o23r70j60J256J385K6
55370H0808j042j123j312j736j037P05J375J96r40n84L62Q36J242J790J612O24
55354H1776R6M28N36Q7L1K77m91j999k181o54M26P4j8J079J608L87r24o94N3j03
55334G9794m38J07O57L8r80j073n06k47l19m53r14j449r55O03J621J255P08R98
55316G8447J356R66M48L69J13n98q54l76k68q65q65K34R64M34q4M56R74L71n04
55297H0718n52k74l64k90K28K14o78j072k03O23L52m9L36N80o1l98N37J574J533
55278H2754J310J840J975O04r33r14j32l15j070q80J4J85l92o16l96m97q00o26
55260H1111j68J2K73J138J970J838J032L81j15p92j263j044m57P8O24Q81R0j286
$$ plain form
55388 80718 79883 78507 77192 77279 78537 79539 79823 80007 80270 80276 80102 79894 79271 78301 78141 79397 80782 80808
55370 80808 79766 78643 77331 75595 74558 75263 76638 76834 75894 75310 75672 76508 77750 79540 81152 81776
55354 81776 81872 82300 82836 82923 82954 83231 82740 80741 78560 77906 78332 78406 78388 79467 81075 81462 80538 79844 79897 79794
55334 79794 79356 79463 80120 80158 79178 78105 77599 77352 77033 76580 75666 74217 73262 73865 75486 76741 77449 78447
55316 78447 79803 80769 81217 81586 81699 81101 80247 79871 79603 78738 77873 78107 79071 79505 79421 79877 80851 81222 80718
55297 80718 80166 79892 79528 79238 79466 79680 79002 77930 77727 78350 78702 78653 78989 79569 79508 79110 79647 81221 82754
55278 82754 84064 85904 87879 88483 87550 86636 86504 86189 85119 84239 84253 84438 84046 83430 83034 82537 81737 81111
55260 81111 80943 80955 81228 82366 84336 86174 87206 87587 87472 86680 85417 84373 83916 83994 84618 85499 85589 84303
55242H4303j458P6J450J195K50o7j96q35j214o70k09o23p58L16J179K74j328j626
55224H0059p89l06k49K44Q55P68M59P60R95J88r02r75m60m92p21j98N15L54j31
55205G9974J15M44k95j310j046j5J30l88j1J065J084j06o97J47J213J417J066
55188H2787P19N13O74J216J279J56j211j382n61kJ34N15Q00J33q59o92M62J010
55170H5691N61L54Q58J078M97J0K87P94Q53N57K02j49l93m97p62j196j104j97
55152H7444N30J41p58j062r52j109j110k31Q50R79N44P12J186P79k25l96L37N64
55134H8223j50p17n86m52o26m57K62P69O28K63K7j27l3N35J117J138R50J145J249
55115I3158N35l64k31O09P23o8m90KM94K70l39q76j244j166m39L22L92J58L82
$$ plain form
55242 84303 82845 82921 84371 85566 85816 85749 85553 84718 83504 82834 82625 82002 81244 81560 82739 83013 81685 80059
55224 80059 79270 78964 78715 78959 79814 80582 81041 81801 82796 82984 82082 81107 80647 80155 79434 79236 79751 80105 79974
55205 79974 80089 80533 80238 78928 77882 77867 77997 77609 77598 78663 79747 79641 78944 79091 80304 81721 82787
55188 82787 83506 84019 84693 85909 87188 87344 86133 84751 84190 84188 84322 84837 85637 85770 84911 84219 84681 85691
55170 85691 86252 86606 87464 88542 89039 89049 89336 90130 90983 91540 91742 91593 91200 90703 89941 88745 87641 87444
55152 87444 87974 88115 87357 86295 85343 84234 83124 82893 83743 84722 85266 85978 87164 87943 87718 87322 87659 88223
55134 88223 88073 87356 86770 86318 85692 85235 85497 86266 86894 87157 87184 87057 87024 87559 88676 89814 90764 91909 93158
55115 93158 93693 93329 93098 93707 94430 94362 93872 93874 94368 94638 94299 93423 92179 91013 90574 90896 91288 91446 91828
55096I1828O79K36m31j12R25J267O92L32M88K58m95o44K74J318J739J884K071
55079A02309J931J291N68m6o96j101q27k46q2j55J58M46k25j532k124j596p05
55062I7368J80J213J838J254O1l32L8r0p40n73N36R96J46o87n57l56q98j360q01
55043I7236J66M82K69K02K33m6m83o30l91O1N09N55m6q14j074r98j207j468j036
55024I1520j70J12j10L69J729K539J842M57m14o03l73L32J267J545P54l22p23
55007I9751l89J73N67N90K50qJ94M80K48j71Q9R70J430J015M37M43R84J641K011
54988A10705J728Q93K56K05K0q94j679j261k60l6l99r3P77Q88O4n46o65j177j967
54969A06559j700k40Q07O08K08M85Q09N75K81K83N1m97n20J51M94R0j63K07M54
$$ plain form
55096 91828 92507 92743 92312 92200 93125 94392 95084 95416 95904 96162 95667 95023 95297 96615 98354 100238 102309
55079 102309 104240 105531 106099 106053 105357 104256 103429 103183 103101 102946 103104 103550 103325 101793 99669 98073 97368
55062 97368 97548 98761 100599 101853 101914 101582 101620 101530 100790 100217 100753 101749 101895 101208 100651 100295 99397 98037 97236
55043 97236 97402 97884 98153 98355 98588 98542 98059 97429 97038 97099 97608 98163 98117 97303 96229 95231 94024 92556 91520
55024 91520 91350 91462 91352 91721 93450 95989 97831 98288 97874 97271 96898 97230 98497 100042 100796 100474 99751
55007 99751 99362 99535 100102 100692 100942 100934 101128 101608 101856 101685 101774 102744 104174 105189 105626 106069 107053 108694 110705
54988 110705 112433 113326 113582 113787 113807 112913 111234 109973 109713 109677 109278 109185 109962 110850 110914 110368 109703 108526 106559
54969 106559 104859 104619 105426 106034 106242 106727 107536 108111 108392 108675 108726 108229 107709 107860 108354 108444 108281 108488 108942
54950A08942K52M65J303J496L48r27j049m45n4J97N62N01k41p48l30K38M2m56
54932A10096l27L57R62J320J436J144Q30J446L004M167M166L905M263M652M283
54917A45704L732L976M867N671O182O241N185K959P77m25j371l122n285o707p066
54902A61318o666n553m054l305l899m658m147k739j843j624j057L4N81M2o88n11
54886A21231N28J536J854J565J162R23P42O42J106K404L903M820N405O365P281
54871A61467O958N465M297M083L621J795q23l128m860o017o122n261m737n471
54857A51267o497o197m449k534j515j531k208k898k881k080j201q48q94j066j327
54842A13141j418q74R0N99M15K08K31j77j265k199k285j804j169l97J81j5m99
$$ plain form
54950 108942 109194 109659 110962 112458 112806 111879 110830 110385 110331 110528 111090 111591 111350 110602 110272 110510 110552 110096
54932 110096 109769 110126 111088 112408 113844 114988 115818 117264 120268 124435 128601 132506 136769 141421 145704
54917 145704 149436 153412 158279 163950 170132 176373 181558 184517 185294 184869 183498 180376 175091 168384 161318
54902 161318 154652 149099 145045 141740 137841 133183 129036 126297 124454 122830 121773 121807 122388 122430 121742 121231
54886 121231 121759 123295 125149 126714 127876 128799 129541 130183 131289 133693 137596 142416 147821 154186 161467
54871 161467 168425 173890 178187 182270 185891 187686 186863 183735 178875 172858 166736 161475 156738 151267
54857 151267 144770 138573 134124 131590 130075 128544 126336 123438 120557 118477 117276 116428 115534 114468 113141
54842 113141 111723 110849 110939 111538 111953 112161 112392 112215 110950 108751 106466 104662 103493 103096 103277 103262 102763
54825A02763L1J555K405J810J040J072R39k57j402j140j43J28k22j51L06M34L90
54808A09558P58J163R02L45J90N4o70j275o92N33R60N13L98R12J062L13o33j082
54790A13309j065p62j80M61Q28J012J274J497J474J462J705J849J502R29N32J58
54774A25985l30l98M01J575K353K721L026L242L397L969N044N870O028O228O909
54759A76020P135O020M304L122K069L6k670m678n616o263o863o821o025n138m477
54744A50155l738k883k302k060j807j418j091r84j221j855k336j738j41J066J026
54729A28673O35R84J647J739J616K115K898L161L260M064N160N452N065M990N161
54714A76620M574L158J831P18j071l635n759o500o193n635n240n059m795l862
$$ plain form
54825 102763 102794 104349 106754 108564 109604 110676 111615 111358 109956 108816 108673 108801 108579 108428 108734 109168 109558
54808 109558 110316 111479 112381 112726 112916 112970 112300 111025 110333 110866 111826 112339 112737 113649 114711 115024 114391 113309
54790 113309 112244 111482 111302 111763 112591 113603 114877 116374 117848 119310 121015 122864 124366 125295 125827 125985
54774 125985 125655 125257 125658 127233 129586 132307 135333 138575 141972 145941 150985 156855 162883 169111 176020
54759 176020 183155 189175 193479 196601 198670 198706 196036 191358 185742 179479 172616 165795 159770 154632 150155
54744 150155 146417 143534 141232 139172 137365 135947 134856 133872 132651 130796 128460 126722 126581 127647 128673
54729 128673 129308 130292 131939 133678 135294 137409 140307 143468 146728 150792 155952 161404 166469 171459 176620
54714 176620 181194 184352 186183 186901 185830 182195 176436 169936 163743 158108 152868 147809 143014 139152
54700A39152k310j345j912l115l291k318j546j563j541q49j8K35j03o33j023j064
54684A16756r53j239j868j776l72J195J416N35J9L35O53M17j88j036j967k154
54668A09773j050L56O73K43M82J324J247q0j098p39K15P13P91P14K35n80r61n87
54650A11671p3J85N99J316J603R83K4n50p73r04q28n03l78p22j080q40N3J158
54632A10941J926J970J404Q53P64Q58P37N70N45J73q54j653j164J39Q27M83j01
54615A18418n24j057j483j141l26j52p85j141o28P9L94N94Q45P36K85J92N88O20
54597A15514j17p68n17K37O62O21M25J93K2K49R18J447J168n0j725k927k721j149
54579A11482M12O22k22p92o68n18n89l26L56P37N48M01O64R17Q58P43O53L34O2
$$ plain form
54700 139152 136842 135497 133585 130470 127179 124861 123315 121752 120211 119362 119344 119579 119476 118843 117820 116756
54684 116756 115803 114564 112696 110920 110548 111743 113159 113694 113713 114048 114701 115118 114930 113894 111927 109773
54668 109773 108723 109079 109752 109995 110477 111801 113048 112968 111870 111131 111346 112059 112850 113564 113799 113219 112258 111671
54650 111671 111598 111783 112382 113698 115301 116284 116308 115758 114985 114081 113253 112750 112372 111650 110570 109730 109783 110941
54632 110941 112867 114837 116241 117094 117858 118716 119453 120023 120568 120741 119887 118234 117070 117209 118036 118519 118418
54615 118418 117894 116837 115354 114213 113887 113735 112950 111809 111181 111260 111654 112248 113093 113829 114114 114306 114894 115514
54597 115514 115397 114629 114112 114349 115011 115632 116057 116250 116272 116521 117439 118886 120054 120004 118279 115352 112631 111482
54579 111482 111894 112516 112294 111502 110834 110316 109727 109401 109757 110494 111042 111443 112107 113024 113882 114625 115278 115612 115674
54560A15674N39J617K139J525N02r3k68k59RL96L47k44p63q00n89k43N38J604
54542A21631K122J667P76R9k08p6O49J526J592N68p16j400j454j228r33q20j077
54525A22718j295q45K8L77m8l88J3P99J359J553J404Q72J84k79o01j062j350q63
54507A22576J70Q71R70Q83O22j63j039j032j97L52K09J42N44Q14O80P57J204J196
54489A29559L43n20o20j68M80J354J989J408k88j534j387q11j009j539j218jJ122
54472A27160J522J358J018Q28R06R09M14l01n27k89l04n86l15O77J453J490J356
54455A36769J397J049J30m91l18r2m16o77l01P3l09r96j216j200j562k063k038
54438A27739j464p11J73J126J641J410R16P33P74P21N78L32j62n75k25O96J062
$$ plain form
54560 115674 116213 117830 119969 121494 121996 121903 121635 121376 121385 121781 122128 121884 121121 120321 119732 119489 120027 121631
54542 121631 123753 125420 126196 126295 126087 126011 126660 128186 129778 130346 129630 128230 126776 125548 124615 123795 122718
54525 122718 121423 120578 120606 120983 120935 120547 120560 121359 122718 124271 125675 126547 126731 126452 125851 124789 123439 122576
54507 122576 122746 123617 124587 125470 126092 125929 124890 123858 123661 124013 124222 124364 124908 125722 126402 127159 128363 129559
54489 129559 129902 129382 128762 128594 129074 130428 132417 133825 133537 132003 130616 129805 128796 127257 126039 126038 127160
54472 127160 128682 130040 131058 131886 132792 133701 134115 133814 133287 132998 132694 132108 131793 132470 133923 135413 136769
54455 136769 138166 139215 139345 138854 138536 138444 138028 137351 137050 137123 136814 135818 134602 133402 131840 129777 127739
54438 127739 126275 125564 125737 126863 128504 129914 130830 131563 132337 133058 133636 133968 133806 133231 133006 133702 134764
54421A34764M58j16J69P58Q37O38P25R30Q33N53K88j30o48p81n46o26j074r94
54403A36038r9O65P54Q80J453J582P91K17Q35J767J768J221J085J036L35l93j13
54386A49822N93L36o87r58q9O80N04k9j32J07K07J9k93m31r5O27J226J458J586
54367A54451J711J466R02P42J229J635J539J599K181K433J733J003J342K254K583
54352A78803K323K174K022J270J36p45j486k472l248l252l014l352l826l494k619
54337A59220k219k252j790p87j85l67p97j110j357j289o24J06Q9n25r94j245j576
54320A42298j512l44J306J941J277N28N39Q04N98k7o75j146j335j269j254j373
54304A40356j120k32N37M07q5J00P72Q38J61k94j38n7m71q10m92K99J096J616
$$ plain form
54421 134764 135222 135106 135275 136033 136870 137508 138233 139163 139996 140549 140837 140707 140059 139278 138732 138106 137032 136038
54403 136038 135939 136604 137358 138238 139691 141273 142064 142281 143116 144883 146651 147872 148957 149993 150328 149935 149822
54386 149822 150415 150751 150064 149106 149017 149697 150201 150172 150040 150147 150354 150373 150080 149649 149554 150181 151407 152865 154451
54367 154451 156162 157628 158530 159272 160501 162136 163675 165274 167455 169888 171621 172624 173966 176220 178803
54352 178803 181126 183300 185322 186592 186728 185983 184497 182025 178777 175525 172511 169159 165333 161839 159220
54337 159220 157001 154749 152959 152172 151987 151620 150823 149713 148356 147067 146443 146549 146638 146113 145119 143874 142298
54320 142298 140786 140442 141748 143689 144966 145494 146033 146837 147435 147408 146733 145587 144252 142983 141729 140356
54304 140356 139236 139004 139541 139948 139863 139963 140735 141573 141734 141440 141302 141245 140774 139964 139472 139771 140867 142483
54286A42483J618J022J91m35q71j196r89K8J169J554J341J274J280O92m15j207
54270A47539j345j195q67j17Q43J405J442J275Q95J38n80o30j57K16M41Q65J252
54253A51420J055M58Q3r1m42n57L09J755K406J714N24j73j19M44R12M56j000k143
54235A57011j784o38l40j023j354q52m42o15o09J15R84J378J367J056K67o63q88
54218A52970k01O87J268J615J547N47j059j975j459j79P59Q59K17p01j115o61
54202A53119p7l29j159j503j151p74m53L32J207J007k55j091o70J17K75J17K67
54185A48979M89L10q2l20m80o25m71J9M05N19P40J165J336J022N18n7q95j771
54167A50801k075j747j248o19M02J289J123K48Q3R05J314M22p81j040m77J27N15
$$ plain form
54286 142483 144101 145123 145314 144879 144008 142812 141823 141851 143020 144574 145915 147189 148469 149161 148746 147539
54270 147539 146194 144999 144132 144015 144858 146263 147705 148980 149875 150013 149433 148803 148646 148862 149303 150168 151420
54253 151420 152475 152933 153016 152925 152483 151926 152235 153990 156396 158110 158634 158461 158342 158786 159698 160154 159154 157011
54235 157011 155227 154589 154249 153226 151872 151020 150578 149963 149354 149469 150453 151831 153198 154254 154521 153858 152970
54218 152970 152769 153456 154724 156339 157886 158433 157374 155399 153940 153761 154520 155379 155596 154895 153780 153119
54202 153119 153042 152713 151554 150051 148900 148126 147673 148005 149212 150219 149964 148873 148203 148320 148595 148712 148979
54185 148979 149468 149778 149696 149376 148896 148271 147800 147819 148224 148743 149483 150648 151984 153006 153524 153467 152572 150801
54167 150801 148726 146979 145731 145112 145514 146803 147926 148174 148257 149162 150476 150898 150117 149077 148600 148727 149242
54150A49242O22J59o01o25M10J384J258M32j84n04q11q46l21L29N73N31M07l9
54132A51416p92j076m31M06M95k8l82k83R8O67J251J422J157J123J626J983J585
54115A60237R11P40R77J063R94J040R42K81o23j012o69j6N17O87L17m94j218j383
54097A63291j014l32N26J270J449R92L63j09m59n05J59J274J837J453R81J281
54081A72457K044K526K746L189L896M528M956N196N196N156N529O154N990M306
54067B33869J706o78k430l763m734n258n495n537n103m064k875j991j264n27j99
54052A91657o51j303j141M4J453K236K199J791J729K410L517M343M699N008N453
54037B23444N712N736O029O736P182O801N913N030M111L062K354K393K731K633
$$ plain form
54150 149242 149864 150023 149422 148797 149207 150591 151849 152281 152097 151593 150782 149936 149615 149944 150517 151048 151455 151416
54132 151416 150624 149548 149117 149523 150018 149990 149608 149325 149423 150090 151341 152763 153920 155043 156669 158652 160237
54115 160237 161148 161888 162865 163928 164922 165962 166904 167185 166562 165550 164881 164865 165382 166069 166386 165892 164674 163291
54097 163291 162277 161945 162471 163741 165190 166182 166545 166436 165977 165472 165631 166905 168742 170195 171176 172457
54081 172457 174501 177027 179773 182962 186858 191386 196342 201538 206734 211890 217419 223573 229563 233869
54067 233869 235575 234897 232467 228704 223970 218712 213217 207680 202577 198513 195638 193647 192383 191856 191657
54052 191657 191006 189703 188562 188606 190059 192295 194494 196285 198014 200424 203941 208284 212983 217991 223444
54037 223444 229156 234892 240921 247657 254839 261640 267553 272583 276694 279756 282110 284503 287234 289867
54023B89867K099J673J575J557J387R15mj244k271k667k578k450k540k886l292
54008B79141l268k491j486j163j557j757j312q45q82j075j113j515k644l748l862
53993B50423l156k568k564k993l752m701n202m551k870j098p5L8l03m59j81O8
53977B16056l61j370k196k445k351k044j373o53n66j008r78j84K66n48j909k411
53961A95925j656k33J291K535L005K495J563J014J151J830K724L258K982K315
53947B20199K242K852L110K524K079K818M366N607O072N983N614N366N754O669
53933B81255P308P385P566Q236Q897R336J0273J1934J3246J3326J2632J1571R372
53920D12337N620J725p59k168l435l835k101Q87K715K569J832J527J087o8j405
$$ plain form
54023 289867 291966 293639 295214 296771 298158 299073 299069 297825 295554 292887 290309 287859 285319 282433 279141
54008 279141 275873 273382 271896 270733 269176 267419 266107 265262 264380 263305 262192 260677 258033 254285 250423
53993 250423 247267 244699 242135 239142 235390 230689 225487 220936 218066 216968 216893 216931 216628 216169 215988 216056
53977 216056 215695 214325 212129 209684 207333 205289 203916 203263 202697 201689 200711 200527 200793 200245 198336 195925
53961 195925 194269 194036 195327 197862 200867 203362 204925 205939 207090 208920 211644 214902 217884 220199
53947 220199 222441 225293 228403 230927 233006 235824 240190 245797 251869 257852 263466 268832 274586 281255
53933 281255 288563 295948 303514 311750 320647 329983 340256 352190 365436 378762 391394 402965 412337
53920 412337 417957 419682 418923 416755 413320 409485 407384 408271 410986 413555 415387 416914 418001 417933 416528
53905D16528k259k695k918k903k828l024l292l198l035l551m735n898o817p769
53891C61606q480q256p297o693o940p478p830q093q078p175n474l992l355l052
53877B69413k487j901j757j941k096k229k473k735k971l401m070m503m102k854
53863B29893j457q22j321k364k918k645k182k171k432k517k448k307j743o33K37
53848B02170J52l15p1P86J126N59j35l51l47l41mP23J156P13k25q24p40l05pj7
53828B03703n1K87R20J170N50n80j394j429p17N44J954K860K893K385J850J370
53812B16315Q91P55J353K538L847M981N702N767N425N425N946O201N629M789M336
53797B79900L905K964K005J735J758J244M41K66P49J194J496J985K226J381k78
$$ plain form
53905 416528 414269 411574 408656 405753 402925 399901 396609 393411 390376 386825 382090 376192 369375 361606
53891 361606 353126 344870 337573 330880 323940 316462 308632 300539 292461 285286 279812 275820 272465 269413
53877 269413 266926 265025 263268 261327 259231 257002 254529 251794 248823 245422 241352 236849 232747 229893
53863 229893 228436 227614 226293 223929 221011 218366 216184 214013 211581 209064 206616 204309 202566 201933 202170
53848 202170 202322 202007 201936 202722 203848 204407 204272 203921 203574 203233 203229 203952 205108 205821 205596 204772 204032 203727 203720 203703
53828 203703 203652 203939 204859 206029 206579 205999 204605 203176 202459 203003 204957 207817 210710 213095 214945 216315
53812 216315 217206 217961 219314 221852 225699 230680 236382 242149 247574 252999 258945 265146 270775 275564 279900
53797 279900 283805 286769 288774 290509 292267 293511 293952 294218 294967 296161 297657 299642 301868 303249 302971
53782C02971j556k079k619l604m560n090n300n113m295l342l209l900m419m293
53768B49592m110m267m215l397k063q45j57k62j190k412l232l552l650l379k395
53753B10466j042r6K96N26N48j2q10j049p30n37m73O5Q18O88l91j030l93O02Q04
53734B08250M72N33J051J342J128Q07Q21J209J686J890J791J754J959K033J702
53719B28428J374J391J177J78p85m05J118K307K595K795L210K966J745P41J010
53704B49845J978K457K293K183K512L086L566L640L235K787K825L140L023K376
53690B88946J826J612J242M94k06n85q53j006p29k20j64o22r15q25r47j500j888
53673B83660j734j401j097n28K21N40L78M18P39M79o24j528j367n50J51O14Q15
$$ plain form
53782 302971 301415 299336 296717 293113 288553 283463 278163 273050 268755 265413 262204 258304 253885 249592
53768 249592 245482 241215 237000 233603 231540 230695 230538 230276 229086 226674 223442 219890 216240 212861 210466
53753 210466 209424 209328 209624 210150 210698 210686 209876 208827 208097 207560 207087 207152 207970 208658 208267 207237 206844 207446 208250
53734 208250 208722 209255 210306 211648 212776 213583 214404 215613 217299 219189 220980 222734 224693 226726 228428
53719 228428 229802 231193 232370 232548 231763 231358 232476 234783 237378 240173 243383 246349 248094 248835 249845
53704 249845 251823 254280 256573 258756 261268 264354 267920 271560 274795 277582 280407 283547 286570 288946
53690 288946 290772 292384 293626 294120 293914 293329 292476 291470 290741 290521 290357 289735 288820 287995 287048 285548 283660
53673 283660 281926 280525 279428 278900 279121 279661 280039 280457 281196 281675 281051 279523 278156 277606 277757 278371 279186
53656B79186M62k11l19K38L73l92r93n67N7j91p52l41R65J959K113J937J866J872
53638B87262J973K188K130J481O62M62J061J970K641K788K484K228K483K869K498
53623C17180J461J075K123L669M364M162M000M370N052N656N798N243M487M556
53609C73196N608O481O283N653N528N624N164M372L981L680K470L59j463k214
53595D24722k296k386k643k922l136l200l061k907k940l017k849k463k148k096
53581C86658k277k500k409j789j024q18j281j738j690j331r67n80l34o17j222
53566C66081j245l73N15O60N05Q12J446J817J896J950J892J687J803K361K502
53551C84309J569M01L08J191J797J624J447J914K701L216L391L509L838M520N457
$$ plain form
53656 279186 279648 279437 279118 279356 279729 279337 278344 277777 277834 277643 276891 276550 277515 279474 281587 283524 285390 287262
53638 287262 289235 291423 293553 295034 295696 296158 297219 299189 301830 304618 307102 309330 311813 314682 317180
53623 317180 318641 319716 321839 325508 329872 334034 338034 342404 347456 353112 358910 364153 368640 373196
53609 373196 378804 385285 391568 397221 402749 408373 413537 417909 421890 425570 428040 428399 426936 424722
53595 424722 422426 420040 417397 414475 411339 408139 405078 402171 399231 396214 393365 390902 388754 386658
53581 386658 384381 381881 379472 377683 376659 375841 374560 372822 371132 369801 368834 368254 367920 367303 366081
53566 366081 364836 364463 364978 365638 366143 366955 368401 370218 372114 374064 375956 377643 379446 381807 384309
53551 384309 385878 386279 386587 387778 389575 391199 392646 394560 397261 400477 403868 407377 411215 415735 421192
53536D21192O232O549O655P026P723Q431Q931R275R604J0102J0865J1644J2029
53523E36258J2031J2102J2461J2924J3590J4862J6591J7907J8382J8595J9177
53512G04880K0084K1224K2824K4525K5110K4102K2751K2444K2842K2721K1971
53501I55478K1506K1529K1229K0185J9022J8510J8674J8931J8625J7582J6418
53490A167689J6022J6376J6503J5893J5286J5427J5847J5739J5269J5021J4754
53479A339826J3830J2429J1193R926P804M719J481j319l680n609o977q019r232
53466A366372j0762j2385j3927j5180j5707j5348j4688j4456j4826j5713j7151
53455A206229j8789j9677j9367j8690j8587j8788j8572j8140j8061j7922j6812
$$ plain form
53536 421192 427424 433973 440628 447654 455377 463808 472739 482014 491618 501720 512585 524229 536258
53523 536258 548289 560391 572852 585776 599366 614228 630819 648726 667108 685703 704880
53512 704880 724964 746188 769012 793537 818647 842749 865500 887944 910786 933507 955478
53501 955478 976984 998513 1019742 1039927 1058949 1077459 1096133 1115064 1133689 1151271 1167689
53490 1167689 1183711 1200087 1216590 1232483 1247769 1263196 1279043 1294782 1310051 1325072 1339826
53479 1339826 1353656 1366085 1377278 1387204 1395008 1399727 1401208 1399889 1396209 1390600 1383623 1375604 1366372
53466 1366372 1355610 1343225 1329298 1314118 1298411 1283063 1268375 1253919 1239093 1223380 1206229
53455 1206229 1187440 1167763 1148396 1129706 1111119 1092331 1073759 1055619 1037558 1019636 1002824
53444A002824j4858j2990j1372r325o750m445k913j920j307j189j223o10R50K976
53430I37848M866O249O883O950P311Q636J0463J1868J2795J3855J5141J6232J7180
53417A076277J8466K0085K1668K3232K4877K6059K6351K6746K8724L2070L4958
53406A359513L6441L7522L9353M1635M3450M4699M5939M7470M9103N0449N1165
53395A846739N1314N1477N2011N2387N1937N1046N0571N0337M9233M6932M4282
53384B398266M1855L9209L5985L2620K9518K6433K3132J9769J6143J1489N643
53373B680062l52n431r749j4214j9338k5069l1188l7261m2563m6638m9665n1926
53361B346668n3167n2975n1582m9931m8900m8547m8097m6700m4305m1685l9548
$$ plain form
53444 1002824 987966 974976 963604 954279 947529 943084 940171 938251 936944 935755 934532 933922 934872 937848
53430 937848 942714 948963 955846 962796 970107 978743 989206 1001074 1013869 1027724 1042865 1059097 1076277
53417 1076277 1094743 1114828 1136496 1159728 1184605 1210664 1237015 1263761 1292485 1324555 1359513
53406 1359513 1395954 1433476 1472829 1514464 1557914 1602613 1648552 1696022 1745125 1795574 1846739
53395 1846739 1898053 1949530 2001541 2053928 2105865 2156911 2207482 2257819 2307052 2353984 2398266
53384 2398266 2440121 2479330 2515315 2547935 2577453 2603886 2627018 2646787 2662930 2674419 2680062
53373 2680062 2679710 2674279 2664530 2650316 2630978 2605909 2574721 2537460 2494897 2448259 2398594 2346668
53361 2346668 2293501 2240526 2188944 2139013 2090113 2041566 1993469 1946769 1902464 1860779 1821231
53350A821231l7930l6666l5959l6022l6513l6930l7162l7096l6006l3255k9412
53339A428280k5828k3206k1279j9728j8492j7208j5303j2915j0992j0288j0713
53328A242328j1677j2536j2811j2588j2613j3337j4029j3558j1878r943q318o783
53316A102257n224l964l041k040p70N72J905L309M525N180N465N971O956Q395
53302A129496J0494J3232J5769J7265J8099J9280K0895K2265K3349K4704K6102
53291A340950K6646K6243K5652K4972K3477K1154J8863J6746J3973J0534P684
53280A556894N911M034J142j983m336o317q778j1459j3627j5411j7366j9382k1054
53267A448268k2599k4374k5925k6537k6350k6127k6169k6319k6654k7384k8179
$$ plain form
53350 1821231 1783301 1746635 1710676 1674654 1638141 1601211 1564049 1526953 1490947 1457692 1428280
53339 1428280 1402452 1379246 1357967 1338239 1319747 1302539 1287236 1274321 1263329 1253041 1242328
53328 1242328 1230651 1218115 1205304 1192716 1180103 1166766 1152737 1139179 1127301 1117358 1109040 1102257
53316 1102257 1097033 1093069 1090028 1087988 1087218 1087790 1089695 1093004 1097529 1102709 1108174 1114145 1121101 1129496
53302 1129496 1139990 1153222 1168991 1186256 1204355 1223635 1244530 1266795 1290144 1314848 1340950
53291 1340950 1367596 1393839 1419491 1444463 1467940 1489094 1507957 1524703 1538676 1549210 1556894
53280 1556894 1562805 1566839 1567981 1565998 1561662 1555345 1546567 1535108 1521481 1506070 1488704 1469322 1448268
53267 1448268 1425669 1401295 1375370 1348833 1322483 1296356 1270187 1243868 1217214 1189830 1161651
53256A161651k8313k7557k6447k5699k5574k5695k5331k4147k2725k1973k1958
53245H86232k1818k1005j9941j9274j9097j9159j9206j8795j7415j5229j3137
53234F82156j1728j0665r396p951o705n865n536n836o640p598q587r739j0978
53221E74932j2004j2806j3541j4022j3910j3363j2722j1736j0117q613q334q921
53209D34843q832p662o706o724o715n782m818n112o342p169p121o712o280n745
53195C43123n198m822m558m389m551m905m788m034l475l684l979l429k307j606
53181B87398j615j859k054k272k388k119j523r23m91k75l28n08m81k84l56p81
53165B69141j074j024j039j320j447j223j137j462j735j689j832k443k856k464
$$ plain form
53256 1161651 1133338 1105781 1079334 1053635 1028061 1002366 977035 952888 930163 908190 886232
53245 886232 864414 843409 823468 804194 785097 765938 746732 727937 710522 695293 682156
53234 682156 670428 659763 650367 642416 635711 629846 624310 618474 611834 604236 595649 585910 574932
53221 574932 562928 550122 536581 522559 508649 495286 482564 470828 460711 452098 443764 434843
53209 434843 426011 418349 411643 404919 398204 392422 387604 382492 376150 368981 361860 355148 348868 343123
53195 343123 337925 333103 328545 324156 319605 314700 309912 305878 302403 298719 294740 291311 289004 287398
53181 287398 285783 283924 281870 279598 277210 275091 273568 272645 272154 271879 271551 271043 270562 270278 269922 269141
53165 269141 268067 267043 266004 264684 263237 262014 260877 259415 257680 255991 254159 251716 248860 246396
53151B46396j650r27m7J148J842J300J64m11l31k30j67K04N44J90o95j305j415
53134B44610j380j202n51L87J054J429J885K275K023J162L84Q7J14M02J067J762
53118B55508J783J024K48J84P92J521J867J607Q65Rp16j416k233k989l353l214
53102B51487k687k002j501j377j337r61m83m89p48k65J112K164J980J265J023
53087B47181Q77j93j984l143k888j622m6J359K113J903J050J32o99j529j989j556
53071B38966l91P70J434J508R09l26j651k425k610k586k464k136j687j172k96
53056B25843J070K315K700K267J572Q32k1p07q05l95J04N12P91P11K01k42j93
53039B36555K0o9j93R6M53K02m87q06n82l58l12L3Q40J555J608J014J89l98l94
$$ plain form
53151 246396 244746 243819 243772 244920 246762 248062 248226 247815 247484 247254 247087 247291 247835 248025 247330 246025 244610
53134 244610 243230 242028 241477 241864 242918 244347 246232 248507 250530 251692 252076 252163 252277 252679 253746 255508
53118 255508 257291 258315 258563 258747 259539 261060 262927 264534 265399 265408 264692 263276 261043 258054 254701 251487
53102 251487 248800 246798 245297 243920 242583 241622 241139 240650 239902 239637 240749 242913 244893 246158 247181
53087 247181 248058 247865 245881 242738 239850 238228 238182 239541 241654 243557 244607 244739 244040 242511 240522 238966
53071 238966 238575 239345 240779 242287 243196 242870 241219 238794 236184 233598 231134 228998 227311 226139 225843
53056 225843 226913 229228 231928 234195 235767 236599 236578 235871 235066 234671 234775 235287 236078 236789 236990 236748 236555
53039 236555 236575 236506 236313 236409 236862 237064 236577 235771 235189 234831 234519 234552 235392 236947 238555 239569 239758 239360 238966
53020B38966J25O17O99N85N53L90p0l48N7P52R77P12N22N03K19m31j021j175p86
53001B41846J26J191J662J234O00M77N12J0p11p25o6K77o6l30J30R39J340J067
52983B49513M09j31j01N51J410K137K807L327L107J961Q36P50J368J567J133Q27
52967B71471R21Q42L20j03J8M18O23M68Nn52p76m99k05m54j071j489j616j709
52949B66612j689j371j160j632k569l164l020k304j190RN97K62k38j12J50m04
52933B48777j419j648r13k70k06j61J01L9m13n01j3J82m40j178j204o28J9N79
52915B40703R52Q13J64l82l20K35Q98J347J257N62j18q4L85L95j59n17m53o09
52897B45069j208j506r98k06J84J94J35J38M37J280K183K178J184K72J06J9p50
$$ plain form
53020 238966 239091 239708 240407 240992 241545 241935 241865 241517 241574 242326 243303 244015 244537 245040 245259 244828 243807 242632 241846
53001 241846 241972 243163 244825 246059 246659 247136 247648 247658 246947 246222 246156 246433 246367 246037 246167 247106 248446 249513
52983 249513 249922 249791 249690 250241 251651 253788 256595 259922 263029 264990 265826 266576 267944 269511 270644 271471
52967 271471 272392 273234 273554 273451 273469 273887 274510 274978 274983 274431 273655 273156 272951 272497 271426 269937 268321 266612
52949 266612 264923 263552 262392 260760 258191 255027 252007 249703 248513 248522 249119 249381 249143 249031 249181 248777
52933 248777 247358 245710 244797 244527 244321 244160 244261 244300 243887 243386 243373 243555 243115 241937 240733 240105 240124 240703
52915 240703 241655 242468 242632 242250 241930 242165 243063 244410 245667 246229 246111 246027 246412 246807 246648 246131 245678 245069
52897 245069 243861 242355 241357 241151 241335 241529 241664 241802 242239 243519 245702 247880 249064 249336 249442 249461 248711
52880B48711j805k209j701o91L67J040R72M15J82O46J268J554J759K229K670K644
52864B58051K245J758J170N44L33P44J205J025K73m53q44j078j421j988k726l388
52848B55450l704l676l473l077k403j777j655j915j938j459q12k82J37L14m4p97
52832B28889j386j512j267o24M79J519J707J019J90m52j230k098k361j728p90
52817B20355j19L07N11K64j68N0J162K282K567K219J882J730J678J822K132K217
52801B40891J796R72j54j569k841l283k891k445k366k210j560p26j76j7j64m06
52785B22851j97P57J640J360L27J53J239K108J726R80R45J050K59j018j595j390
52769B31195j236j332j124m94M5K81M98P95R02O77K38k73o94q37p19n32k04M98
$$ plain form
52880 248711 246906 244697 242996 242305 242672 243712 244684 245099 245281 245927 247195 248749 250508 252737 255407 258051
52864 258051 260296 262054 263224 263768 264101 264845 266050 267075 267348 266895 266051 264973 263552 261564 258838 255450
52848 255450 251746 248070 244597 241520 239117 237340 235685 233770 231832 230373 229561 229279 229416 229730 229686 228889
52832 228889 227503 225991 224724 224100 224579 226098 227805 228824 229014 228562 227332 225234 222873 221145 220355
52817 220355 220236 220543 221054 221318 221150 221200 222362 224644 227211 229430 231312 233042 234720 236542 238674 240891
52801 240891 242687 243659 243505 241936 239095 235812 232921 230476 228110 225900 224340 223614 223438 223421 223257 222851
52785 222851 222654 223411 225051 226411 226738 226891 228130 230238 231964 232944 233889 234939 235198 234180 232585 231195
52769 231195 229959 228627 227503 227009 227054 227335 227833 228628 229530 230207 230445 230172 229478 228641 227922 227390 227186 227684
52751B27684J262J375Q15M32O77J010J015J121J594J793J209M09J05J14P2L60
52735B41047J272K019J688O91J57M01R52J605K311K456J449j36j064j030q13r40
52719B52065j145j113r89j026j308j791k166j956j196o40p15p37O9J246J694J206
52703B41498N36J27k36o53q63p89o09k84K94Q36R77R04J024J127O92j23n24j39
52685B43795O64J409J813J515L55j039j649j196l55K40N86Q50R31O58O4p02j361
52668B46578j471q35O8N51O30R20J596J995J592Q27N57R00J143Q03L02L20P75
52651B57251J007Q83R49J303J117p1j360j722j541j751j950r35R68J929J193K8
52635B57298l88l36j29Q60K644L729L276K755L779N464N739M433L035J974K67
$$ plain form
52751 227684 228946 230321 231136 231568 232245 233255 234270 235391 236985 238778 239987 240396 240501 240615 240687 241047
52735 241047 242319 244338 246026 246717 246874 247275 248227 249832 252143 254599 256048 255912 254848 253818 253005 252065
52719 252065 250920 249807 248818 247792 246484 244693 242527 240571 239375 238735 238020 237283 237352 238598 240292 241498
52703 241498 242034 242161 241925 241272 240409 239620 239011 238727 239021 239857 240834 241738 242762 243889 244581 244458 243934 243795
52685 243795 244459 245868 247681 249196 249551 248512 246863 245667 245312 245552 246138 246988 247919 248577 248641 247939 246578
52668 246578 245107 244272 244340 244891 245521 246441 248037 250032 251624 252451 253008 253908 255051 255854 256156 256476 257251
52651 257251 258258 259141 260090 261393 262510 262439 261079 259357 257816 256065 254115 253180 254148 256077 257270 257298
52635 257298 256910 256574 256445 257305 259949 263678 266954 269709 273488 278952 284691 289124 292159 294133 294400
52620B94400k186m027m485m379m523m523l789k680j938j653j389q78k52J38J8
52605B57854l83l69L96J315J626J411J241J173Q64L64pm22j229k065k105j187
52589B58477j5P32Q92N63J18K06J007J693J395M88J16N65J110J255J200J028M66
52572B71296l80q73o69p4M81P88P19L68J87L67K51p80k144k715k466k354k548
52555B59454k094o14P70R30K13k15N2M46M30J20k8J78M18K21m21r85j142j131
52537B56602j149q46pP59P80M06M96J051J313J019O19L12j58o15m21M14J039R78
52519B62592Q16J209J922K319K212J896J664J662J904K186K248K171K288K651
52505B89740K874K618J887Q76k72j408k382l122l560l619l398l160l013k806k536
$$ plain form
52620 294400 292214 288187 283702 279323 274800 270277 266488 263808 261870 260217 258828 257950 257698 257836 257854
52605 257854 257471 257102 257498 258813 260439 261850 263091 264264 265128 265492 265485 265063 263834 261769 259664 258477
52589 258477 258462 259194 260086 260649 260767 260973 261980 263673 265068 265556 265672 266237 267347 268602 269802 270830 271296
52572 271296 270916 270043 269374 269300 269781 270569 271288 271656 271843 272210 272461 271681 269537 266822 264356 262002 259454
52555 259454 257360 256746 257516 258446 258659 258444 258496 258942 259372 259492 259464 259642 260060 260281 259860 258875 257733 256602
52537 256602 255453 254607 254600 255359 256139 256545 257041 258092 259405 260424 261043 261355 261197 260582 260161 260575 261614 262592
52519 262592 263408 264617 266539 268858 271070 272966 274630 276292 278196 280382 282630 284801 287089 289740
52505 289740 292614 295232 297119 297995 297723 296315 293933 290811 287251 283632 280234 277074 274061 271255 268719
52490B68719k436k401j898p44M82J232J663K043K078J453N28p2j44K52J028J688
52474B73471J482N65J17O26J042N56J25R34K330K842K508K503K979L013K433K017
52458B99543J875J275J16r14j656k558l373l263k367j855k217k745k912k908k753
52443B73288k245j885k424l238k732p02J107J334N36o9j66j9K48M88N30O05J007
52426B65663J251P17k5J32R12R83K70J07Q22J157O72P17K106L627M029L847M118
52409B91105M790N524O655Q082Q650Q034P760Q881R773Q087L896p51m603p741
52395C58142r925j0366r133p341n715m115k512j436j227j596j967j822q95M92
52381C00584J501J674J453J487J833K244K631K897K868K804L247M088M545M452
$$ plain form
52490 268719 266283 263882 261984 261240 261722 262954 264617 266660 268738 270191 270719 270647 270503 270755 271783 273471
52474 273471 274953 275518 275635 276261 277303 277859 277984 278918 281248 284090 286598 289101 292080 295093 297526 299543
52458 299543 301418 302693 302809 301895 300239 297681 294308 291045 288678 286823 284606 281861 278949 276041 273288
52443 273288 271043 269158 266734 263496 260764 260062 261169 262503 263039 262970 262804 262785 263033 263521 264051 264656 265663
52426 265663 266914 267631 267606 267738 268650 269633 269903 270010 270832 271989 272661 273378 275484 279111 283140 286987 291105
52409 291105 295895 301419 308074 316156 324806 332840 340600 349481 359254 367341 371237 370486 365883 358142
52395 358142 348217 337851 328718 321377 315662 311547 309035 307599 306372 304776 302809 300987 300092 300584
52381 300584 302085 303759 305212 306699 308532 310776 313407 316304 319172 321976 325223 329311 333856 338308
52367C38308M510M798M252K404M78k84l15o52j194j313j282j633j721n75J243
52352C47024K053J331K78J07Q52J896K776L310L592L941M414M672M670N014N995
52337C91925O919P179P355Q335R851J0967J1602J2509J3986J5602J7054J8332
52325E31616J9225J9554J9774K0521K1633K2355K2312K1570K0127J8157J6513
52314G53357J6024J6449J6849J6838J6608J6104J5160J4248J4052J4254J3756
52303I23699J2156J0191Q637P571O790O177N481M341K698P33j476l810n811p146
52289I70231q161r333j0421j0859j0717j0440r831q244n772l310j340N30K642
52276H84975M701O370P802R252J0621J1714J2621J3633J4891J6154J6799J6297
$$ plain form
52367 338308 342818 347616 351868 354272 354750 354466 354151 353499 352305 350992 349710 348077 346356 345781 347024
52352 347024 349077 350408 350686 350793 351645 353541 356317 359627 363219 367160 371574 376246 380916 385930 391925
52337 391925 398844 406023 413378 421713 431564 442531 454133 466642 480628 496230 513284 531616
52325 531616 550841 570395 590169 610690 632323 654678 676990 698560 718687 736844 753357
52314 753357 769381 785830 802679 819517 836125 852229 867389 881637 895689 909943 923699
52303 923699 935855 946046 954683 962254 969044 975221 980702 985043 987741 988474 986998 983188 977377 970231
52289 970231 962070 952737 942316 931457 920740 910300 900469 892225 886453 883143 881803 882333 884975
52276 884975 889676 896046 903848 913100 923721 935435 948056 961689 976580 992734 1009533 1025830
52264A025830J4835J3205J1926J0910J0195J0244J1030J1553J1062J0091R468
52253A150349Q882P512N533L811K432P41j380l485n732q665j1786j3686j3974
52240A120552j3859j4376j5133j5379j5183j4863j4165j2865j1513j0693j0094
52229I72429r123q015p434p239o564n185l901l310k884j770j27J032J270J339
52215I20518K138L517M635N137N357N509N437N277N547O282O664O071M942M133
52201I91164L828L627L303K965K706K577K696L009L217L252L427L840M048L728
52187A037387L138K571J876R97L28r5j075l247n992q117r170r481r378r002q515
52172I82225p753o322m532l512l576l382j809K17J111J107J716L175M262M569
$$ plain form
52264 1025830 1040665 1053870 1065796 1076706 1086901 1097145 1108175 1119728 1130790 1140881 1150349
52253 1150349 1159231 1166743 1172276 1176087 1178519 1179260 1177880 1174395 1168663 1159998 1148212 1134526 1120552
52240 1120552 1106693 1092317 1077184 1061805 1046622 1031759 1017594 1004729 993216 982523 972429
52229 972429 963306 955291 947857 940618 934054 928869 924968 921658 918774 917004 916877 917909 919179 920518
52215 920518 922656 926173 930808 935945 941302 946811 952248 957525 963072 969354 976018 982089 987031 991164
52201 991164 994992 998619 1001922 1004887 1007593 1010170 1012866 1015875 1019092 1022344 1025771 1029611 1033659 1037387
52187 1037387 1040525 1043096 1044972 1045969 1046297 1046202 1045127 1041880 1035888 1027771 1018601 1009120 999742 990740 982225
52172 982225 974472 968150 963618 960106 956530 953148 951339 951556 952667 953774 955490 958665 962927 967496
52158I67496M987N687N447L667J583O37P95J210J462J406P15l96q30J17J643K476
52142I98102K602L038M132M936M487L099K130K652M501O613Q200R374J0614J1994
52128A076474J3341J4891J7168K0214K3418K6171K8328L0041L1432L2487L2998
52117A346963L2704L1626L0133K8361K5942K2663J9046J5799J2923R944O712L552
52105A586368Q01j323k689l573m560n670o135n640n148n645o738p485q083r433
52091A515047j1465j3197j4318j5384j6478j6961j6639j5950j4854j2737r683
52080A357381o652m123j639R98L204M711O095P821R616J1209J2791J4343J5405
52067A431160J5867J6129J6195J5531J4254J3338J3195J2968J1796R906P865N711
$$ plain form
52158 967496 972483 978170 983617 987284 988867 989504 990299 991509 992971 994377 995092 994696 993866 993983 995626 998102
52142 998102 1000704 1003742 1007874 1012810 1017297 1020396 1022526 1025178 1029679 1036292 1044492 1053866 1064480 1076474
52128 1076474 1089815 1104706 1121874 1142088 1165506 1191677 1220005 1250046 1281478 1313965 1346963
52117 1346963 1379667 1411293 1441426 1469787 1495729 1518392 1537438 1553237 1566160 1576104 1582816 1586368
52105 1586368 1587169 1585846 1583157 1579584 1575024 1569354 1563219 1557579 1552431 1546786 1540048 1532563 1524480 1515047
52091 1515047 1503582 1490385 1476067 1460683 1444205 1427244 1410605 1394655 1379801 1367064 1357381
52080 1357381 1350729 1346606 1344967 1345965 1349169 1353880 1359975 1367796 1377412 1388621 1401412 1415755 1431160
52067 1431160 1447027 1463156 1479351 1494882 1509136 1522474 1535669 1548637 1560433 1570339 1578204 1583915
52055A583915L488J747P01l77k185m368o190p639r263j1352j3848j6577j9140
52042A498912k1050k2399k3771k5159k5683k4845k3235k1527j9595j7333j5420
52031A258895j4419j3739j2531j0951r692q772p832p166p326p999q387q514r111
52018A132456j0138j0620j0130r422r210r168q748q300q645r854j1127j1780j1952
52005A003362j2296j3288j4872j6499j7508j7682j7420j7243j7094j6455j5203
51994H27802j3862j2767j1461r538p668o892p060p046o542o495p356q204q364
51981G14547q694j0089j1672j2022j1434j1402j2190j2600j2097j1458j1098j0269
51969E79522q421o021l530p69K088M153N158O086P663R116R280Q217O880N672
$$ plain form
52055 1583915 1587403 1589150 1589851 1589474 1587289 1582921 1576731 1569092 1559829 1548477 1534629 1518052 1498912
52042 1498912 1477862 1455463 1431692 1406533 1380850 1356005 1332770 1311243 1291648 1274315 1258895
52031 1258895 1244476 1230737 1218206 1207255 1197563 1188791 1180959 1173793 1166467 1158468 1150081 1141567 1132456
52018 1132456 1122318 1111698 1101568 1092146 1082936 1073768 1065020 1056720 1048075 1038221 1027094 1015314 1003362
52005 1003362 991066 977778 962906 946407 928899 911217 893797 876554 859460 843005 827802
51994 827802 813940 801173 789712 780174 772506 765614 758554 751508 744966 738471 731115 722911 714547
51981 714547 705853 695764 684092 672070 660636 649234 637044 624444 612347 600889 589791 579522
51969 579522 571101 565080 561550 560781 562869 567022 572180 578266 585929 595045 604325 612542 619422 625094
51955F25094M276K472M12j683l623n243o577p744q449q080o490m204j723P86L020
51940E82244M563N670P237R518J1558J2348J1932J0992R936Q825P529N550K307
51927F90209j932n919q654j0270j1406j2345j3085j3527j3204j1456q352m858
51915E75201j759R23L145M352M297L593K797J578o20l623o667q965r753q511n734
51900E50254k878r78J61J117J851K011J460Ok674o227r397j1203j1802j1862j1708
51885D88131j1418j0925r655o955l387n19J021K207L806N188N798O418P797R153
51871D86660R445R091Q961Q517O629L675J180m29k129m453o712q152q631q090
51857D95562o398l923j388Q70K823M077M187L523K936K545J707J76j496k766l648
$$ plain form
51955 625094 629370 631842 632254 630571 626948 621705 615128 607384 598935 590855 584365 580161 578438 579224 582244
51940 582244 586807 592477 599714 609232 620790 633138 645070 656062 665998 674823 682352 687902 690209
51927 690209 688277 682358 673704 663434 652028 639683 626598 613071 599867 588411 580059 575201
51915 575201 573442 574365 577510 581862 586159 589752 592549 594127 593507 589884 583217 574252 564499 555988 550254
51900 550254 547376 546398 546559 547676 549527 551538 552998 553004 550330 544103 534706 523503 511701 499839 488131
51885 488131 476713 465788 456133 449178 445791 445272 446293 448500 452306 457494 463292 469710 477507 486660
51871 486660 496105 505196 514157 522674 529303 532978 534158 533729 531600 527147 520435 512283 503652 495562
51857 495562 489164 485241 483853 484723 487546 491623 495810 499333 502269 504814 506521 506697 505201 502435 498787
51842D98787m362n034n757o484o993p200p239o939n847m185k997k698k235o80
51828D30137J150J762J116M09K07P6k20n06j001k082l264l578k936k090j309k45
51812D17626R34J560J691K125K975L344K730J673P15k58j301j964k036j992k231
51797D25591k467k216j462o22k97r80k472l717l826l149k632k403j905j165p83
51782C95495p02j81Q61J588J586J383J324J024L33j27J18Q26J818L451N803Q134
51766D22734R711J0526J0797J0513R913R628R780R508P948N202J916j485m714
51753E11977p318r046j0156j0943j1297j1047j0279r096p521n821m437l317j973
51740D09726m49N28Q01J437L429O335Q814J0159J0480R819P966N191K517R51P08
$$ plain form
51842 498787 494425 489391 483634 477150 470157 462957 455718 448779 442932 438747 435750 433052 430817 430137
51828 430137 431287 433049 434165 434574 434781 434857 434637 434131 433130 431048 427784 424206 421270 419180 417871 417626
51812 417626 418560 420120 421811 423936 426911 430255 432985 434658 435373 435115 433814 431850 429814 427822 425591
51797 425591 423124 420908 419446 418824 418527 417547 415075 411358 407532 404383 401751 399348 397443 396278 395495
51782 395495 394793 394612 395473 397061 398647 400030 401354 402378 402711 402584 402702 403528 405346 408797 414600 422734
51766 422734 432445 442971 453768 464281 474194 483822 493602 503110 511058 516260 518176 516691 511977
51753 511977 504659 495613 485457 474514 463217 452170 441891 432795 425274 419453 415016 411699 409726
51740 409726 409277 409805 410606 412043 415472 421807 430621 440780 451260 461079 469045 474236 476753 477704 478412
51725D78412J207J708J854J695J207M3k030m482o313p002o824o170n113l788k691
51710D41713k211k173k157k031j922j845j591r22K71J873L529M754N121M358K584
51695D49351N82n88n43O8N21R24J634K241J912M80j450l365m945n603m908l519
51679D32792k677k650k501j599l21Q79K127L350L919L635L343L870N014O172P297
51664D62650Q524R330Q911P125M548J783q14k979m586n594n762m714k569l1K427
51649D78249M955P396Q619P432L960m70m592p803r883j0859j1159j1310j1314
51636D43221j0753r561q298p464o825n698l839j834n09oL00R77J829K218J884
51621C95642J072J19p28j167j039o45m53m89m33k53k37m18m88l99m74q48j206
$$ plain form
51725 478412 479619 481327 483181 484876 486083 486126 484096 479614 473301 466299 459475 453305 448192 444404 441713
51710 441713 439502 437329 435172 433141 431219 429374 427783 426861 427132 429005 432534 437288 442409 446767 449351
51695 449351 449933 449345 448802 448870 449391 450315 451949 454190 456102 456582 455132 451767 446822 441219 436311 432792
51679 432792 430115 427465 424964 423365 423044 423923 426050 429400 433319 436954 440297 444167 449181 455353 462650
51664 462650 471174 480504 489415 496540 501088 502871 502057 499078 494492 488898 483136 478422 475853 475822 478249
51649 478249 483204 490600 499219 506651 510611 510141 505549 497746 487863 477004 465845 454535 443221
51636 443221 432468 422907 414609 407145 400320 394622 390783 388949 388440 388434 388734 389711 391540 393758 395642
51621 395642 396714 396833 396105 394938 393899 393254 392801 392312 391879 391626 391389 390971 390483 390084 389610 388762 387556
51604C87556j206p45K08J537K746L377L677M303N422O692Q027R496J0426R676
51590D51192P141M026J232j581m697p162p758o574m733l052j649m22R36K979N781
51575D35659Q497J0347J1819J4037J7149K0088K1896K2588K2730K2862K3378K4318
51563F55368K5171K5427K5475K6432K8932L2386L5664L8161L9928M0915M0316
51552A014175L6793K9458J8830O704n032j5478k4583l2324l8338m2320m4407m5077
51540H58401m4734m3467m1171l7879l3952k9843k5784k1893j8486j5911j4100
51529E31181j2630j1308j0261r346q040o185m461l652l632l511k658j330l03j01
51515D53763m96o75l1J132J835J449J77j456l147m640n464n333m630m072l898
$$ plain form
51604 387556 386350 385605 385813 387350 390096 393473 397150 401453 406875 413567 421594 431090 441516 451192
51590 451192 458333 462359 463591 462010 457313 450151 442393 435819 431086 428034 426385 425963 426899 429878 435659
51575 435659 444156 454503 466322 480359 497508 517596 539492 562080 584810 607672 631050 655368
51563 655368 680539 705966 731441 757873 786805 819191 854855 893016 932944 973859 1014175
51552 1014175 1050968 1080426 1099256 1105960 1100928 1085450 1060867 1028543 990205 947885 903478 858401
51540 858401 813667 770200 729029 691150 657198 627355 601571 579678 561192 545281 531181
51529 531181 518551 507243 496982 487636 479596 473411 468950 465298 461666 458155 455497 454167 453864 453763
51515 453763 453267 452592 452561 453693 455528 456977 457154 455698 452551 447911 442447 437114 432484 428412 424514
51500D24514l685k996j939j057p36p94p70o17q26j657k459k314j278l87l04n30
51484D02165l30J03l6r35j883k220k131k265k854l499l809l902m055m077l537
51469C66735k611k124k409k723k281j370p66m95k9N84P79N76N77Q26P00K09L11
51452C56489J475K882L650M032M703N609O330P022Q131R483J0466J0913J1208
51439D42393J1536J1519J0553Q194M468K06l208m878n057m571l915l281l074l739
51425D57146n154o670p708p980p299n685l682k170j615j617j350l25J215K620
51411D09726L469L803L789L443K884K524K612K771K488J895J559J591J573J320
51397D45447J085J033J086J344J997K745L133L496M861P609J0988J4218J7320
$$ plain form
51500 424514 420829 417833 415894 414837 414101 413307 412537 411920 411094 409437 406978 404664 403386 402999 402695 402165
51484 402165 401835 401938 401902 400967 399084 396864 394733 392468 389614 386115 382306 378404 374349 370272 366735
51469 366735 364124 362000 359591 356868 354587 353217 352451 351956 351927 352511 353290 353866 354443 355269 355969 356178 356489
51452 356489 357964 360846 364496 368528 373231 378840 385170 392192 400323 409806 420272 431185 442393
51439 442393 453929 465448 476001 484195 488663 488869 485661 480783 475726 471155 467240 463959 460885 457146
51425 457146 451992 445322 437614 429634 422335 416650 412968 410798 409183 407566 406216 405891 407106 409726
51411 409726 413195 416998 420787 424230 427114 429638 432250 435021 437509 439404 440963 442554 444127 445447
51397 445447 446532 447565 448651 449995 451992 454737 457870 461366 466227 473836 484824 499042 516362
51384E16362K0645K4313K8406L3097L8145M3029M7696N2494N7105O0495O2188
51373I83975O2449O0685N4946M4109K9736J4852J340j0636k1465l1395m0503m8323
51361A099770n3799n6401n6948n6606n5474n3018m9376m5283m0959l6038l0539
51350E65329k5100k0359j6637j4078j2412j0867q989p329o727p070p445p257o594
51337D14465n753n042m779m850m562l564k560k421k911l100k720k233j835j326
51323C66809q55q78j276j357q33j62K23M26P56J319J992K510K656K714L323M516
51307C81883N338M977L854K898K154R89o73k191l153l635l689l391l222l620m214
51292C74305m300l885l449k922j857n24K74M25O76J372K112K754L798N390O735
$$ plain form
51384 516362 537007 561320 589726 622823 660968 703997 751693 804187 861292 921787 983975
51373 983975 1046424 1107109 1162055 1206164 1235900 1250752 1252092 1241456 1219991 1188596 1148093 1099770
51361 1099770 1045971 989570 932622 876016 820542 767524 718148 672865 631906 595868 565329
51350 565329 540229 519870 503233 489155 476743 465876 456887 449558 442831 435761 428316 421059 414465
51337 414465 408712 403670 398891 394041 389479 385915 383355 380934 378023 374923 372203 369970 368135 366809
51323 366809 365954 365076 363800 362443 361610 361448 361671 362097 362853 364172 366164 368674 371330 374044 377367 381883
51307 381883 387221 392198 396052 398950 401104 402093 401420 399229 396076 392441 388752 385361 382139 378519 374305
51292 374305 370005 366120 362671 359749 357892 357368 357642 358067 358743 360115 362227 364981 368779 374169 380904
51277C80904O947N949M289K601J404P87K20p77j692j469M3J791K867L383L800
51262D11047M071L803K801J168p19k206k796k728k664k877l170l494l925m120
51248C94191l565k474j641j363j222j074j333k052k537k304j709j254q92m46j60
51233C70165l77j029j795k386k536k103j386q88o84m44j13K1l5J08N71J078J561
51216C59728K214K826K846K341K141K744L676M228M185L621K733K091K327L147
51202D00848L379K489J272O83O53N41N8q18k132l530m145l589k592k023j761j175
51186C88158k29O01J044J048M53n78j221q52k8J75l57p10l34L34P38R74J408J999
51168C92623K322K096J489R93J005J439J799J716J301Q93P09Q23J238J651J509
$$ plain form
51277 380904 387851 393800 398089 400690 402094 402881 403101 402324 400632 399163 399206 400997 403864 407247 411047
51262 411047 415118 418921 421722 422890 422171 419965 417169 414441 411777 408900 405730 402236 398311 394191
51248 394191 390626 388152 386511 385148 383926 382852 381519 379467 376930 374626 372917 371663 370771 370325 370165
51233 370165 369788 368759 366964 364578 362042 359939 358553 357665 356981 356537 356424 356445 356410 356518 357089 358167 359728
51216 359728 361942 364768 367614 369955 372096 374840 378516 382744 386929 390550 393283 395374 397701 400848
51202 400848 404227 406716 407988 408671 409324 409865 409923 409105 406973 403443 399298 395709 393117 391094 389333 388158
51186 388158 387929 388530 389574 390622 391075 390497 389276 388424 388396 388571 388214 387504 387170 387504 388242 389216 390624 392623
51168 392623 394945 397041 398530 399523 400528 401967 403766 405482 406783 407676 408385 409208 410446 412097 413606
51153D13606O30m14q89p52m99l34PN64P81J7j642l347m178l860k945k291k301
51136C92153k637k637k050j302j063j542k225k365j737p96n2N08J214K207L310
51121C80986M202M561M164L201K312K009K202K568L075L750M218M065L495L076
51107D27884K901K639K319K303K449K037Q06m95r19k93P94J551J430M85n66r75
51091D44350p76m90k36K31O36K72q02j492j101k08L12M08M20K16l99r42p08K34
51073D39925J175J765K210K689L074L277L421L703M358N618P402R259J0936J2727
51059E11539J4869J6894J7988J7828J6620J4687J2558J1173J1243J2456J3901
51048F71756J5248J6611J7287J5708J1329N834J537j111l650p312j1483j4608
$$ plain form
51153 413606 414236 413822 412933 412181 411682 411348 411355 411919 412700 412717 411075 407728 403550 399690 396745 394454 392153
51136 392153 389516 386879 384829 383527 382464 380922 378697 376332 374595 373799 373747 374255 375469 377676 380986
51121 380986 385188 389749 393913 397114 399426 401435 403637 406205 409280 413030 417248 421313 424808 427884
51107 427884 430785 433424 435743 438046 440495 442532 443338 442843 441924 441631 442425 443976 445406 445891 445325 444350
51091 444350 443574 443084 442848 443079 443715 443987 443185 441693 440592 440384 440696 441104 441524 441740 441341 440399 439691 439925
51073 439925 441100 442865 445075 447764 450838 454115 457536 461239 465597 471215 478617 487876 498812 511539
51059 511539 526408 543302 561290 579118 595738 610425 622983 634156 645399 657855 671756
51048 671756 687004 703615 720902 736610 747939 753773 755310 754199 750549 743237 731754 717146
51036G17146j5826j5292j3575j1506j0275j0801j2866j5293j7046j7679j6960
51025E60027j4846j1935r202o866m242j039J897L679M584N456O497P386Q132Q977
51011E58505R739J0036R972R842R519Q885Q508R026J0077J0799J1130J1561J1839
50998F89438J1187R871R152R340R149P548N196L349K273J457O95K30K18O85J657
50983G61445K918L999M735N506O682Q281J0246J2518J4670J6171J7212J8628K0830
50970I03841K3555K6820L1153L6478M1667M5878M9558N3518N7699O1532O4860
50959A396559O7762O9888P0638O9714O7099O2961N7858N2495M6873M0283L2571
50948B034701K4720J7672J1436N890J595j038k732m507o433q057r631j1904j4975
$$ plain form
51036 717146 701320 686028 672453 660947 650672 639871 627005 611712 594666 576987 560027
51025 560027 545181 533246 524044 517178 512936 511897 513794 517473 522057 527513 534010 541396 549528 558505
51011 558505 568244 578280 588252 598094 607613 616498 625006 634032 644109 654908 666038 677599 689438
50998 689438 700625 710496 719648 728988 738137 745685 750881 754230 756503 757960 758655 758885 759103 759788 761445
50983 761445 764363 768362 773097 778603 785285 793566 803812 816330 831000 847171 864383 883011 903841
50970 903841 927396 954216 985369 1021847 1063514 1109392 1158950 1212468 1270167 1331699 1396559
50959 1396559 1464321 1534209 1604847 1674561 1741660 1804621 1862479 1914974 1961847 2002130 2034701
50948 2034701 2059421 2077093 2088529 2094419 2096014 2094976 2092244 2087737 2081304 2073247 2063616 2051712 2036737
50935B036737j8097k0464k1566k1339k0700k1376k4297k8389l1859l4337l6834
50924A757479l9918m3062m5706m7883m9596n0501n0537n0169m9705m8804m6916
50913A234682m3827l9769l5319l1210k7854k5052k2418j9979j8004j6514j5314
50902I39422j4351j3648j3024j2298j1550j0840r962q878p985p505o943n743m155
50889H12540k789j661l93Q73J592J795K081K634L000L029L347M508O172P443P867
50874H52038P872Q360R814J1747J3207J3938J4727J6313J8401K0220K1708K3524
50862A031869K6048K8996L2046L5285L9012M3438M8589N4200N9911O5792P2455
50851A537641Q0303Q8923R7656J06451J15574J24730J33085J40092J45786J50292
$$ plain form
50935 2036737 2018640 1998176 1976610 1955271 1934571 1913195 1888898 1860509 1828650 1794313 1757479
50924 1757479 1717561 1674499 1628793 1580910 1531314 1480813 1430276 1380107 1330402 1281598 1234682
50913 1234682 1190855 1151086 1115767 1084557 1056703 1031651 1009233 989254 971250 954736 939422
50902 939422 925071 911423 898399 886101 874551 863711 853749 844871 836886 829381 822438 816695 812540
50889 812540 809751 808090 807697 808570 810162 811957 814038 816672 819672 822701 826048 830556 836728 844171 852038
50874 852038 859910 868270 878084 889831 903038 916976 931703 948016 966417 986637 1008345 1031869
50862 1031869 1057917 1086913 1118959 1154244 1193256 1236694 1285283 1339483 1399394 1465186 1537641
50851 1537641 1617944 1706867 1804523 1910974 2026548 2151278 2284363 2424455 2570241 2720533
50841B720533J53443J54847J53932J50034J42803J32295J18454J00884P9701N6433
50831C963359L3425J2453n841k1453l4501m4990n2518n6386n6328n2968m7166
50820C637086l9450l0581k2160j5881j2455j2008j5093k2280l2879m5117n7726
50809C331456p0573q3676r6363j07672j16908j23594j27423j28462j27051j23442
50799B226292j17854j10701j02310r2605q1720p0691o0797n2269m4379l6737k9663
50788A426566k3349j7557j2354q246n335l131j508r80j626k517k879l208m461
50775A339415o546q328r107r406j0192j1719j3437j4820j5997j7390j8943k0072
50763A183458k0384k0116j9656j9028j8041j6661j4875j2608j0132q106o742n284
$$ plain form
50841 2720533 2873976 3028823 3182755 3332789 3475592 3607887 3726341 3827225 3906926 3963359
50831 3963359 3996784 4009237 4003396 3981943 3947442 3902452 3849934 3793548 3737220 3684252 3637086
50820 3637086 3597636 3567055 3544895 3529014 3516559 3504551 3489458 3467178 3434299 3389182 3331456
50809 3331456 3260883 3177207 3080844 2973172 2856264 2732670 2605247 2476785 2349734 2226292
50799 2226292 2108438 1997737 1895427 1802822 1721102 1650411 1589614 1537345 1492966 1456229 1426566
50788 1426566 1403217 1385660 1373306 1365060 1359725 1356594 1355086 1354106 1352480 1349963 1347084 1343876 1339415
50775 1339415 1332869 1324541 1315434 1306028 1295836 1284117 1270680 1255860 1239863 1222473 1203530 1183458
50763 1183458 1163074 1142958 1123302 1104274 1086233 1069572 1054697 1042089 1031957 1023851 1017109 1011825
50751A011825k955m8K566M682O769R008J1217J3678J7011K1213K5564K9719L4116
50738A184365L9107M4409M9636N4729N9588O3907O7663P1197P4526P7123P8665
50727A864915P9506Q0009P9913P8750P6535P3496O9485O4055N7041M8606L8762
50716B611073K7208J3884m46j4359k6658l6936m5076n0406n1925m9546m4554l8465
50704B293794l1864k4800j7775j1651o855l363j436j805n073j1262j9725k9198
50692B128987l8359m6750n4799o2402o8106p0507o9914o7646o4112n8736n1714
50681A475942m4423l7855l1637k4958j7665j0126k802L793R369J4334J9291K3992
50669A377255K7508K9512L0527L0723K9554K7003K4177K2003K0176J8032J5809
$$ plain form
50751 1011825 1008870 1008822 1011388 1016070 1022839 1031847 1043064 1056742 1073753 1094966 1120530 1150249 1184365
50738 1184365 1223472 1267881 1317517 1372246 1431834 1495741 1563404 1634601 1709127 1786250 1864915
50727 1864915 1944421 2024430 2104343 2183093 2259628 2333124 2402609 2466664 2523705 2572311 2611073
50716 2611073 2638281 2652165 2651719 2637360 2610702 2573766 2528690 2478284 2426359 2376813 2332259 2293794
50704 2293794 2261930 2237130 2219355 2207704 2200849 2197486 2196050 2194245 2189172 2177910 2158185 2128987
50692 2128987 2090628 2043878 1989079 1926677 1858571 1788064 1718150 1650504 1586392 1527656 1475942
50681 1475942 1431519 1393664 1362027 1337069 1319404 1309278 1306476 1310269 1319638 1333972 1353263 1377255
50669 1377255 1404763 1434275 1464802 1495525 1525079 1552082 1576259 1598262 1618438 1636470 1652279
50658A652279J4285J3676J3622J3873J4312J4585J4444J4255J4610J5560J6814
50647A812315J8491K1069K4527K8171L1541L4995L8981M3030M6029M7527M8244
50636B194920M9055M9862M9955M9039M7301M4746M1427L8198L6090L4664L2107
50625B667364K7355K0817J2232m73j8409l8507n4864o3317o3695n8179m9271l9241
50613B341812k9689k0894j2435m789P35L595M425L567M55n218j2733k1188l0171
50600B217472l9243m7735n5410o2397o8087p1159p1184o9277o6651o3419n9350
50589A543560n4848n0491m6244m1840l7412l3298k9671k6668k4382k2515k0637
50578A155554j8877j7563j6142j3465r445n427k527n59J041K344L533N338Q035
$$ plain form
50658 1652279 1666564 1680240 1693862 1707735 1722047 1736632 1751076 1765331 1779941 1795501 1812315
50647 1812315 1830806 1851875 1876402 1904573 1936114 1971109 2010090 2053120 2099149 2146676 2194920
50636 2194920 2243975 2293837 2343792 2392831 2440132 2484878 2526305 2564503 2600593 2635257 2667364
50625 2667364 2694719 2715536 2727768 2727295 2708886 2670379 2615515 2552198 2488503 2430324 2381053 2341812
50613 2341812 2312123 2291229 2278794 2274005 2274740 2278335 2282760 2286327 2286782 2281564 2268831 2247643 2217472
50600 2217472 2178229 2130494 2075084 2012687 1944600 1873441 1802257 1732980 1666329 1602910 1543560
50589 1543560 1488712 1438221 1391977 1350137 1312725 1279427 1249756 1223088 1198706 1176191 1155554
50578 1155554 1136677 1119114 1102972 1089507 1080062 1074635 1072108 1071549 1072590 1074934 1078467 1083805 1091840
50565A091840J0823J2918J4531J6257J8183K0209K2439K4684K6351K7409K8694
50554A314338L0675L2696L3978L4497L4280L2874L0398K8129K7046K6599K5886
50543A651396K5399K6479K9524L3691L7953M1672M4697M7800N2547N9736O8242
50532B119136P6185Q2864Q8833R4619J00299J06009J11840J17324J21727J24667
50522C143503J25980J25381J22782J18488J12415J03595R1220P5718N8089L8748
50512D115919J7861l714k4835m5043o4189q1401r5358j05487j11984j14860j13696
50501C373213j08283r8836q5782o9953n2653l4819j6483K216J9769L3952M3495
50490C005836M8216M7881M1968L0611J4778m553k6563m9841p2242r1837j07592
$$ plain form
50565 1091840 1102663 1115581 1130112 1146369 1164552 1184761 1207200 1231884 1258235 1285644 1314338
50554 1314338 1345013 1377709 1411687 1446184 1480464 1513338 1543736 1571865 1598911 1625510 1651396
50543 1651396 1676795 1703274 1732798 1766489 1804442 1846114 1890811 1938611 1991158 2050894 2119136
50532 2119136 2195321 2278185 2367018 2461637 2561936 2667945 2779785 2897109 3018836 3143503
50522 3143503 3269483 3394864 3517646 3636134 3748549 3852144 3943364 4019082 4077171 4115919
50512 4115919 4133780 4130066 4105231 4060188 3995999 3914598 3819240 3713753 3601769 3486909 3373213
50501 3373213 3264930 3166094 3080312 3010359 2957706 2922887 2906404 2908620 2928389 2962341 3005836
50490 3005836 3054052 3101933 3143901 3174512 3189290 3184737 3158174 3108333 3036091 2944254 2836662
50479B836662j19161j26557j30068j30024j26664j20529j12814j04682r6418q7693
50469A682052p8571o9664o1470n4061m7308m1090l5319l0182k5921k2149j7952
50458A198365j3275r466p610o852n462l219j452q42m58P12K491M262O104Q377
50444A171675J0704J2157J2425J2273J2629J3387J3426J1880R198O650N011M199
50432A295614M052M676N932P344Q824J0668J2585J3705J4034J4841J6818J8926
50420A428019K0063K0963K3133K6637L0310L3769L7749M2554M7456N1736N5292
50409A817681N8187O0415O2112O3196O3017O1118N8033N4487N0188M4486L7731
50398B430651L0724K3064J3471J696j1164k4220l7226m9382n9304o6591p2036
$$ plain form
50479 2836662 2717501 2590944 2460876 2330852 2204188 2083659 1970845 1866163 1769745 1682052
50469 1682052 1603481 1533817 1472347 1418286 1370978 1329888 1294569 1264387 1238466 1216317 1198365
50458 1198365 1185090 1175624 1168014 1161162 1155700 1152481 1151029 1150187 1149729 1150441 1152932 1157194 1163298 1171675
50444 1171675 1182379 1194536 1206961 1219234 1231863 1245250 1258676 1270556 1279754 1286404 1291415 1295614
50432 1295614 1299666 1304342 1310274 1317618 1326442 1337110 1349695 1363400 1377434 1392275 1409093 1428019
50420 1428019 1448082 1469045 1492178 1518815 1549125 1582894 1620643 1663197 1710653 1762389 1817681
50409 1817681 1875868 1936283 1998395 2061591 2124608 2185726 2243759 2298246 2348434 2392920 2430651
50398 2430651 2461375 2484439 2497910 2499606 2488442 2464222 2426996 2377614 2318310 2251719 2179683
50387B179683p5785p6619p3719o7923o0428n1423m0948l0067k0060j0960j971
50376A669780O972J4826K0386K2988K2503J9217J3575N776m051j5075k5745l4967
50364A716185m2836m9714n5121n8254n9176n8771n7529n5130n1342m6865m2880
50353A138567l9994l7759l5275l2069k8431k4903k1637j8266j4266r417m133O66
50341H73083M250O866R420J2216J4454J5323J5019J4086J2146Q273K545l504q150
50328I76027j0656j1219j0408q881p190n479l581j474N59K140L012L133K816K587
50314I31386K570K284J308k6j039j448j333o60N96K046L170L873M404M882N280
50299I57293N646N967O156O482P595R677J2103J4353J6608J8953K0833K2060K3499
$$ plain form
50387 2179683 2103898 2027279 1953560 1885637 1825209 1773786 1732838 1702771 1682711 1671751 1669780
50376 1669780 1676752 1691578 1711964 1734952 1757455 1776672 1790247 1796023 1791972 1776897 1751152 1716185
50364 1716185 1673349 1623635 1568514 1510260 1451084 1392313 1334784 1279654 1228312 1181447 1138567
50353 1138567 1098573 1060814 1025539 993470 965039 940136 918499 900233 885967 876550 872417 873083
50341 873083 877333 884199 893619 905835 920289 935612 950631 964717 976863 985136 987681 984177 976027
50328 976027 965371 954152 943744 934863 927673 922194 918613 917139 917698 919838 922850 925983 928799 931386
50314 931386 933956 936240 937548 937522 936483 935035 933702 933042 933638 935684 938854 942727 947131 952013 957293
50299 957293 962939 968906 975062 981544 989139 998816 1010919 1025272 1041880 1060833 1081666 1103726 1127225
50286A127225K5695K7622K7881K6254K2656J5512L440j1475k4196l1098l2472
50275A177044l0571k6917k2237j7403j3213r886p487o183n708n364m931m794m942
50262A017408m816m297l812l181j626O67K356L014M026O520R575J1669J2963J4786
50248A065252J7528K0345K2676K4749K6691K8013K8239K7356K5702K3874K2591
50237A333016K2076K1608K0146J7389J3918J0345O670K404k951r465j6695k3905
50225A394556l0363l5300l7940l8007l6174l3503l0425k6747k2576j8624j5544
50214A069353j3633j3305j5083j8789k3178k6705k8368k7917k5752k2726j9540
50203H34357j6338j3281j1133j0395j0143q925o798n333n359n964o126o016o097
$$ plain form
50286 1127225 1152920 1180542 1208423 1234677 1257333 1272845 1276285 1264810 1240614 1209516 1177044
50275 1177044 1146473 1119556 1097319 1079916 1066703 1056817 1049330 1043147 1037439 1032075 1027144 1022350 1017408
50262 1017408 1012592 1008295 1004483 1001302 999676 1000343 1002699 1005713 1009739 1016259 1025834 1037503 1050466 1065252
50248 1065252 1082780 1103125 1125801 1150550 1177241 1205254 1233493 1260849 1286551 1310425 1333016
50237 1333016 1355092 1376700 1396846 1414235 1428153 1438498 1445168 1447572 1444621 1435156 1418461 1394556
50225 1394556 1364193 1328893 1290953 1252946 1216772 1183269 1152844 1126097 1103521 1084897 1069353
50214 1069353 1055720 1042415 1027332 1008543 985365 958660 930292 902375 876623 853897 834357
50203 834357 818019 804738 793605 783210 773067 764142 757344 752011 746652 740688 734562 728546 722449
50190G22449o026n392m592m180m047l954m205n021n904o355o555o663o139m651
50176F48765k984k139k008j815j416j226j187q21j44L80P20J392K564L772M589
50161F48442N108N680O509P542Q492R048R280R618J0263J0930J1296J1434J1468
50148G65110J1212J0511R550Q545P422O140N015M336M025M058M890P049J0529
50135H58392J4834J9498K4247K8944L3639L8439M3131M7109M9875N1353N1673
50124A261134N1002M9672M8113M6602M5317M4513M4138M3322M0944L6709L1006
50113A742472K3740J4205K379j0490k2876l3850m2836m9414n3765n6546n7917
50102A455102n7408n5061n1724m7830m2928l7006l1331k7119k4188k1719j9612
$$ plain form
50190 722449 716423 711031 706439 702259 698212 694258 690053 685032 679128 672773 666218 659555 653416 648765
50176 648765 645781 643642 641634 639819 638403 637177 635990 635169 635025 635405 636125 637517 640081 643853 648442
50161 648442 653550 659230 665739 673281 681773 690821 700101 709719 719982 730912 742208 753642 765110
50148 765110 776322 786833 796383 804928 812350 818490 823505 827841 831866 835924 840814 847863 858392
50135 858392 873226 892724 916971 945915 979554 1017993 1061124 1108233 1158108 1209461 1261134
50124 1261134 1312136 1361808 1409921 1456523 1501840 1546353 1590491 1633813 1674757 1711466 1742472
50113 1742472 1766212 1780417 1782796 1772306 1749430 1715580 1672744 1623330 1569565 1513019 1455102
50102 1455102 1397694 1342633 1290909 1243079 1200151 1163145 1131814 1104695 1080507 1058788 1039176
50091A039176j8170j7049j5554j3622j1703r879p832n448k993r00L12L25l75p36
50077I35552l84o8n11j510k559l617m665n331n589o123p216q045p857p189p053
50062H67835p432p515o970o143n317m543l922l434k824k138j840j900j400K47
50048H12704K396M161N612P153Q447Q974R117R673J0661J1478J1830J1668J0729
50035I24603R025P398O659O575O486O418O653O742N996M593L309K404J736J429
50021A000026J534J526J161J329K892N123O581P169P986R389J0650J1612J3236
50008A080214J6105J9393K1722K2371K1551K0163J9339J9604K0552K1765K3552
49997A306331K6019K7925K7616K4687J9715J2761L495p378j8219k7979l6412m2845
$$ plain form
50091 1039176 1021006 1003957 988403 974781 963078 953199 945367 939919 936926 936026 936338 936663 936288 935552
50077 935552 935168 935100 934589 933079 930520 926903 922238 916907 911318 905195 897979 889934 882077 874888 867835
50062 867835 860403 852888 845918 839775 834458 829915 825993 822559 819735 817597 815757 813857 812457 812704
50048 812704 815100 819261 824873 832026 840473 849447 858564 868237 878898 890376 902206 913874 924603
50035 924603 933628 941026 947685 954260 960746 967164 973817 980559 986555 991148 994457 996861 998597 1000026
50021 1000026 1001560 1003086 1004247 1005576 1008468 1013591 1020172 1027341 1035327 1044716 1055366 1066978 1080214
50008 1080214 1096319 1115712 1137434 1159805 1181356 1201519 1220858 1240462 1261014 1282779 1306331
49997 1306331 1332350 1360275 1387891 1412578 1432293 1445054 1448549 1441171 1422952 1394973 1358561 1315716
49985A315716m6220m6706m5984m5424m4882m3623m1493l8774l5703l2526k9426
49974H64955k6290k3069k0248j8233j6469j4159j1686j0174r673r049p756o484
49962F91665n779n222m370l403k400r91Q23K356L322M312N814P578R324J1206
49948G14235J3119J4365J4511J3922J3020J1694R817P661N465L264J318o7j347
49935H20977l524o735j0003j2690j5237j7900j9800k0020j8896j7384j5731j3601
49923F49456j1051q594o525m761l210j882p80P5O83J248J961K584K759K722L141
49908F27826M140N194O113P359R085J0666J1552J1925J2200J2514J3040J4051
49896G45665J5174J5258J3542J0507P172M144J656j52j533l198n499q016j0257
$$ plain form
49985 1315716 1269496 1222790 1176806 1131382 1086500 1042877 1001384 962610 926907 894381 864955
49974 864955 838665 815596 795348 777115 760646 746487 734801 724627 714954 705905 698149 691665
49962 691665 685886 680664 676294 672891 670491 669500 670323 672679 676001 680313 686127 693705 703029 714235
49948 714235 727354 741719 756230 770152 783172 794866 804683 812344 817809 821073 822391 822324 820977
49935 820977 817453 810718 800715 788025 772788 754888 735088 715068 696172 678788 663057 649456
49923 649456 638405 629811 623286 618525 615315 613433 612653 612728 613411 614659 616620 619204 621963 624685 627826
49908 627826 631966 637160 643273 650632 659717 670383 681935 693860 706060 718574 731614 745665
49896 745665 760839 776097 789639 800146 807318 811462 813118 812966 811433 808235 802736 794720 784463
49883G84463j2263j4085j5312j5666j5549j5514j5580j5507j5213j4537j3084
$$ plain form
49883 784463 772200 758115 742803 727137 711588 696074 680494 664987 649774 635237 622153
$$ [...]
##END NTUPLES=NMR SPECTRUM
##END=
