
##TITLE=AC1244__6673806_yxZqgxz7Om
##JCAMPDX= 6.0         $$ Bruker NMR JCAMP-DX V2.0
##DATA TYPE= NMR SPECTRUM
##DATA CLASS= NTUPLES
##ORIGIN= BRUKER
##OWNER= Administrator
$$ 1.72 TOPSPIN		Version 2.1
$$ 2012-08-14 21:07:19.671 -0500  Administrator@TOPSPIN
$$ Compression mode = diff/dup
##.OBSERVE FREQUENCY= 400.02188249412
##.OBSERVE NUCLEUS= ^1H
##.ACQUISITION MODE= SIMULTANEOUS (DQD)
##.ACQUISITION SCHEME= undefined
##.AVERAGES= 8
##.DIGITISER RES= 22
##SPECTROMETER/DATA SYSTEM= spect
##.PULSE SEQUENCE= zg30
##.SOLVENT NAME= COFFEE_meoh
##.SHIFT REFERENCE= INTERNAL, COFFEE_meoh, 1, 14.98509
##AUDIT TRAIL= $$ (NUMBER, WHEN, WHO, WHERE, PROCESS, VERSION, WHAT)
$$ ##TITLE= Audit trail, TOPSPIN		Version 2.1
$$ ##JCAMPDX= 5.01
$$ ##ORIGIN= Bruker BioSpin GmbH
$$ ##OWNER= Administrator
$$ $$ C:\Bruker\TOPSPIN/data/COFFEE/nmr/AC1244__6673806_yxZqgxz7Om/10/pdata/1/auditp.txt
$$ ##AUDIT TRAIL=  $$ (NUMBER, WHEN, WHO, WHERE, PROCESS, VERSION, WHAT)
(   1,<2012-08-14 21:07:12.703 -0500>,<Administrator>,<TOPSPIN>,<go>,<TOPSPIN 2.1>,
      <created by zg
	started at 2012-08-14 21:06:05.968 -0500,
	POWCHK enabled, PULCHK disabled,
       configuration hash MD5:
       6B 1B 68 BB D9 2E 58 E2 7F 35 AD 54 07 DF 0E 41
       data hash MD5: 64K
       7F E3 60 65 97 F0 56 24 97 7C 02 29 9D 79 82 F0>)
(   2,<2012-08-14 21:07:15.437 -0500>,<Administrator>,<TOPSPIN>,<proc1d>,<TOPSPIN 2.1>,
      <Start of raw data processing
       efp LB = 0 FT_mod = 6 PKNL = 1 PHC0 = 0 PHC1 = 0 SI = 32K 
       data hash MD5: 32K
       74 50 19 81 F6 31 C3 78 F0 9B 2A D2 4C 42 92 DA>)
(   3,<2012-08-14 21:07:15.859 -0500>,<Administrator>,<TOPSPIN>,<proc1d>,<TOPSPIN 2.1>,
      <pk PHC0 = 176.4954 PHC1 = 0 
       data hash MD5: 32K
       15 E0 C3 AF 0D 2E 4B 89 07 BE 87 53 5C 65 5C 37>)
(   4,<2012-08-14 21:07:15.953 -0500>,<Administrator>,<TOPSPIN>,<proc1d>,<TOPSPIN 2.1>,
      <abs ABSG = 1 
       data hash MD5: 32K
       2E C5 0B 84 C0 3A 4D DB E1 22 F3 88 14 5D BF C8>)
(   5,<2012-08-14 21:07:16.000 -0500>,<Administrator>,<TOPSPIN>,<proc1d>,<TOPSPIN 2.1>,
      <abs ABSG = 2 
       data hash MD5: 32K
       55 5C FB 19 C2 11 FB 04 E4 E8 19 9F 52 10 28 D9>)
(   6,<2012-08-14 21:07:16.062 -0500>,<Administrator>,<TOPSPIN>,<proc1d>,<TOPSPIN 2.1>,
      <abs ABSG = 3 
       data hash MD5: 32K
       8E BE DC 68 A3 27 D3 E9 67 C2 A5 87 A9 28 10 10>)
(   7,<2012-08-14 21:07:16.093 -0500>,<Administrator>,<TOPSPIN>,<proc1d>,<TOPSPIN 2.1>,
      <abs ABSG = 4 
       data hash MD5: 32K
       81 C6 74 DB C2 02 8A 8A 2E 7E 4A F1 C0 85 C6 3C>)
(   8,<2012-08-14 21:07:16.125 -0500>,<Administrator>,<TOPSPIN>,<proc1d>,<TOPSPIN 2.1>,
      <abs ABSG = 5 
       data hash MD5: 32K
       BC F9 94 7A 3B 7A 0D 71 32 AE 4E 01 23 03 10 6F>)
$$ ##END=
$$ 
$$ $$ hash MD5
$$ $$ B1 CD 1B D9 1C 20 D7 3F C0 33 C6 B9 DC 68 94 4A
##$RELAX= 
##$RELAX= 
##$RELAX= 
##$RELAX= 
##$RELAX= 
##$RELAX= 
##$RELAX= 
$$ Bruker specific parameters
$$ --------------------------
##$DU= <C:\Bruker\TOPSPIN>
$$ [...]
150 150 150 150 150 150 150 150
##$TP07= 0
##$TPNAME0= <>
##$TPNAME1= <>
##$TPNAME2= <>
##$TPNAME3= <>
##$TPNAME4= <>
##$TPNAME5= <>
##$TPNAME6= <>
##$TPNAME7= <>
##$TPOAL= (0..7)
0.5 0.5 0.5 0.5 0.5 0.5 0.5 0.5
##$TPOFFS= (0..7)
0 0 0 0 0 0 0 0
##$TUNHIN= 0
##$TUNHOUT= 0
##$TUNXOUT= 0
##$USERA1= <user>
##$USERA2= <user>
##$USERA3= <user>
##$USERA4= <user>
##$USERA5= <user>
##$V9= 5
##$VALIST= <valist>
##$VCLIST= <CCCCCCCCCCCCCCC>
##$VD= 0
##$VDLIST= <DDDDDDDDDDDDDDD>
##$VPLIST= <PPPPPPPPPPPPPPP>
##$VTLIST= <TTTTTTTTTTTTTTT>
##$WBST= 1024
##$WBSW= 4
##$XGAIN= (0..3)
0 0 0 0
##$XL= 0
##$YL= 0
##$YMAX_a= 479004
##$YMIN_a= -601376
##$ZGOPTNS= <>
##$ZL1= 120
##$ZL2= 120
##$ZL3= 120
##$ZL4= 120
##$ABSF1= 14.98509
##$ABSF2= -5.573092
##$ABSG= 5
##$ABSL= 3
##$ALPHA= 0
##$AQORDER= 0
##$ASSFAC= 0
##$ASSFACI= 0
##$ASSFACX= 0
##$ASSWID= 0
##$AUNMP= <proc_prof1d_extract_pilot.lims>
##$AXLEFT= 0
##$AXNAME= <>
##$AXNUC= <1H>
##$AXRIGHT= 0
##$AXTYPE= 0
##$AXUNIT= <>
##$AZFE= 0.1
##$AZFW= 0.1
##$BCFW= 0
##$BC_mod= 0
##$BYTORDP= 0
##$COROFFS= 0
##$CY= 15
##$DATMOD= 1
##$DC= 0
##$DFILT= <>
##$DTYPP= 0
##$F1P= 0
##$F2P= 0
##$FCOR= 0.5
##$FTSIZE= 32768
##$FT_mod= 6
##$GAMMA= 0
##$GB= 0
##$INTBC= 1
##$INTSCL= 1
##$ISEN= 128
##$LB= 0
##$LEV0= 0
##$LPBIN= 0
##$MAXI= 10000
##$MC2= 0
##$MEAN= 0
##$ME_mod= 0
##$MI= 0
##$NCOEF= 0
##$NC_proc= -8
##$NLEV= 6
##$NOISF1= 0
##$NOISF2= 0
##$NSP= 0
##$NTH_PI= 0
##$NZP= 0
##$OFFSET= 14.98509
##$PC= 1
##$PHC0= 176.4954
##$PHC1= 0
##$PH_mod= 1
##$PKNL= yes
##$PPARMOD= 0
##$PPDIAG= 0
##$PPIPTYP= 0
##$PPMPNUM= 2147483647
##$PPRESOL= 1
##$PSCAL= 4
##$PSIGN= 0
##$PYNMP= <proc.py>
##$REVERSE= no
##$SF= 400.02
##$SI= 32768
##$SIGF1= 0
##$SIGF2= 0
##$SINO= 400
##$SIOLD= 32768
##$SPECTYP= <>
##$SREGLST= <1H.CDCl3>
##$SSB= 0
##$STSI= 32768
##$STSR= 0
##$SW_p= 8223.68421052631
##$SYMM= 0
##$S_DEV= 0
##$TDeff= 65536
##$TDoff= 0
##$TI= <>
##$TILT= no
##$TM1= 0
##$TM2= 0
##$TOPLEV= 0
##$USERP1= <user>
##$USERP2= <user>
##$USERP3= <user>
##$USERP4= <user>
##$USERP5= <user>
##$WDW= 1
##$XDIM= 32768
##$YMAX_p= 481033163
##$YMIN_p= -735195
##$CURPLOT= <Network HP LaserJet P1505>
##$CURPRIN= <$Network HP LaserJet P1505>
##$DFORMAT= <normdp>
##$LAYOUT= <+/1D_H.xwp>
##$LFORMAT= <normlp>
##$PFORMAT= <normpl>
##$SURQMSG= 1
$$ End of Bruker specific parameters
$$ ---------------------------------
##NTUPLES= NMR SPECTRUM
##VAR_NAME=  FREQUENCY,     SPECTRUM/REAL,   SPECTRUM/IMAG
##SYMBOL=    X,             R,               I
##VAR_TYPE=  INDEPENDENT,   DEPENDENT,       DEPENDENT
##VAR_FORM=  AFFN,          ASDF,            ASDF
##VAR_DIM=   32768,         32768,           32768
##UNITS=     HZ,            ARBITRARY UNITS, ARBITRARY UNITS
##FACTOR=    0.250966925370066, 1,           1
##FIRST=     8223.43324360094, 13298,        -185120
##LAST=      0,             16757,           -222498
##MIN=       0,             -735195,         0
##MAX=       8223.43324360094, 481033163,    0
$$ Real data points
##PAGE= N=1
##DATA TABLE= (X++(R..R)), XYDATA
$$ [...]
19552A78125H2521c08833h0018k14351a42299A14572b44757A21314i9329H9842
19541a34844B8893a29561p9402g6528C88137A29360b35374B88154C1771a56716
19530I9300a32638A18350l2349J43208a85363H0740J42686L8071a72170J8881
19520a53289B91420D4642d57479D6067R0871a97672c7545j440l06669a4430A98487
19508B0671h6490a8293D66455E9175b782m06782J92844a08181g86j34982B16154
19496C1864J93636A7275N5637a98781R0505d9000A52112J29541E2112a06449j1479
19485a17928r2258j04132A9184K77734b71057a26902C34894d1185k6233l18559
19475c85977J88806i7717n8050j55236E4837R6105d1994j54078B12148a76201
$$ plain form
19552 178125 82521 -308833 -80018 -294369 -142299 114572 -244757 121314 -99329 89842
19541 -134844 28893 -129561 -208963 -76528 388137 129360 -235374 288154 31771 -156716
19530 99300 -132638 118350 86001 229209 -185363 80740 223426 261497 -172170 -153289
19520 -153289 291420 44642 -457479 46067 136938 -197672 -37545 -38985 -345654 -14430 198487
19508 20671 -86490 -18293 466455 59175 -2782 -409564 -216720 -108181 -786 -135768 216154
19496 31864 225500 17275 72912 -198781 -108276 -49000 152112 281653 52112 -106449 -117928
19485 -117928 -210186 -314318 19184 296918 -271057 -126902 334894 -41185 -67418 -385977
19475 -385977 -197171 -97717 -155767 -311003 54837 150942 -41994 -196072 212148 -176201
19464b1500e941A5663b84557A12029h6894k7451K7851m1829K4017A5277h0562
19452a41846j3375O0707B31731R6048d2149j64119A96179d3644j0065j57863Q8555
19441a23017B84443N7773a13840j25468P4857N993F3092K27293C4697F283c11071
19429e0149a2240p5322l5427B3600q250h3266C01390b21580b4114k4889f677B9052
19416D3008d1149k13021a02707L9108p9127m168b882j0497j24000N6549A6325
19404B4114i8013A06692a89814H2857b55086J13364j4512B1840a8587F6712k3209
19393D3503b60027r7716N0539C4181f8383o7405f59D6849a72601n3669G7729l1625
19381D6104J78365a25222A08653a00960r4063A27977g6541r1361r2209C26807
$$ plain form
19464 -21500 -5941 15663 -284557 112029 -86894 -114345 -86494 -128323 -104306 15277 -80562
19452 -141846 -155221 -94514 231731 327779 -42149 -206268 196179 -43644 -53709 -211572 -123017
19441 -123017 284443 342216 -113840 -239308 -164451 -158458 63092 290385 34697 6283 -311071
19429 -50149 -12240 -87562 -122989 23600 15350 -83266 301390 -221580 -24114 -49003 -6677 29052
19416 43008 -41149 -254170 -102707 -63599 -142726 -146894 -2882 -13379 -137379 -80830 16325
19404 24114 -98013 106692 -189814 82857 -255086 -141722 -156234 21840 -18587 66712 43503
19393 43503 -260027 -357743 -307204 34181 -68383 -135788 -659 46849 -172601 -226270 77729 46104
19381 46104 224469 -125222 108653 -100960 -195023 127977 -76541 -167902 -260111 326807
19370b16662G4078a41179q9929g2445A03844a90132d4548o6018B14503a65123
19359c12083A38363D9650e9863q3478H4964i9206G2354B960K19070c66368i4946
19347A9165R6472d06406a39775B50544E3657b43931a4F1060b08392k0612R3680
19336a35324D6179f8210a693k88091a32884a0194A03860l7982e0677A73018b99431
19324a48432A01364A1883a48470j7656e3306p4274j19376b7484j51725O7019D8370
19312a66152C7510i009l95893a03972j06528f842C04274h0203F0231a37332n0728
19301a88060C9867c96427A04618a5058m14901a72902j15897A10414D6557C405
19290g8826G0304M7320C1956J9202J31763b57445M6404d808k90700A69665m3433
$$ plain form
19370 -216662 74078 -141179 -231108 -72445 103844 -190132 -44548 -110566 214503 -165123
19359 -312083 138363 49650 -59863 -143341 84964 -99206 72354 2960 222030 -366368 -94946
19347 19165 115637 -406406 -139775 250544 53657 -243931 -14 61060 -208392 -229004 -135324
19336 -135324 46179 -68210 -1693 -289784 -132884 -10194 103860 65878 -50677 173018 -299431
19324 -148432 101364 11883 -148470 -166126 -53306 -127580 -246956 -27484 -179209 -112190 48370
19312 -166152 37510 -9009 -404902 -103972 -210500 -6842 304274 -80203 60231 -137332 -188060
19301 -188060 39867 -396427 104618 -15058 -429959 -172902 -288799 110414 46557 3405
19290 -78826 70304 117624 31956 51158 182921 -257445 -211041 -4808 -295508 169665 126232
19279A26232B0153c6934D6009J06595c64203f7651O288j67131h8707A59371g4037
19267a48845C10910j31474b66771G4783L3275f8355A20925E208L29490A40680
19256A47888o1548Q4369p8033a3729j4300A0093f3022A71332F4898L57533a24807
19244a16833b0662O085C6753c04792d7817i315C7958Q0871j0163P260a5398k62574
19232b77972A80223L7967o376b03999d9386B31038a69468F2679d4444j58933B54520
19220b19122J07844n2427j9974E2930e2839D5506b45289i3510c2989q9616G0798
19208C4130a07547N1755k6273j48625I5344l4115f608m16791C62458G5643d8330
19196A8743g3912j25607H2883a01064N955h278A09292C1023j5130J82998c18711
$$ plain form
19279 126232 20153 -36934 46009 152604 -364203 -67651 -61363 -228494 -88707 159371 -74037
19267 -148845 310910 179436 -266771 74783 108058 -68355 120925 5208 334698 140680
19256 147888 86340 170709 92676 -13729 -28029 10093 -63022 171332 64898 422431 -124807
19244 -116833 -20662 -14577 36753 -304792 -47817 -9315 37958 118829 108666 115926 -15398 -277972
19232 -277972 180223 218190 211814 -203999 -49386 231038 -169468 62679 -44444 -203377 254520
19220 -219122 -111278 -163705 -183679 52930 -52839 45506 -245289 -93510 -32989 -122605 70798
19208 34130 -107547 -55792 -82065 -230690 95344 61229 -6608 -423399 362458 75643 -48330
19196 18743 -73912 -199519 82883 -101064 -95109 -8278 109292 31023 15893 198891 -318711
19184a17841l2612m1882J9729I6464d11626C43281a32999k05461J04588a15671
19173a21806A21931a18820E1014J55290D2781b1885j77086r099e8477m7969H0361
19161B94367a58759o1943a03654B99390B1725a08515B8267a87453Q9714a8436
19150c44303D36132D466b90315b4833k2401H2029a55975G6134N5158F3209c39473
19138b02232L1345N7539r6050D4830d93023B1589c5422G0349g4101A07482N7041
19127A64523M4264c58903G9792b1849G573c40500J59350K6135A82840F7118a05190
19115b80551A72518M6757b29834q848A43711c8084n1926A13865k7632b24256h5425
19103h1342D2366O5673a22660B05872G6054K20646A46390b23570f9026A16999
$$ plain form
19184 -117841 -150453 -192335 -172606 96464 -411626 343281 -132999 -338460 -233872 -115671
19173 -121806 121931 -118820 51014 206304 42781 -21885 -198971 -208070 -58477 -106446 80361
19161 294367 -158759 -220702 -103654 299390 21725 -108515 28267 -187453 -97739 -18436
19150 -344303 436132 4466 -290315 -24833 -47234 82029 -155975 76134 131292 63209 -339473
19138 -202232 -170887 -113348 -209398 44830 -493023 21589 -35422 70349 -74101 107482 164523
19127 164523 208787 -358903 79792 -21849 7573 -340500 -181150 -155015 182840 67118 -105190
19115 -280551 172518 219275 -229834 -238682 143711 -38084 -90010 113865 86233 -224256 -85425
19103 -81342 42366 108039 -122660 205872 76054 296700 146390 -223570 -69026 116999
19092a06986j56934M5710j10836B8039a5597n21502b12960i276A52513d7715A22918
19080b52886E04450c5107j81106E2250a87470H5369b18811j1779k5161J3054C7326
19068c26443i1302l33395a12069l77570G8544M7975a14253n53B54184A9842J76454
19057A96296c7711p8715B34829c0088q1374A35547J18210a32925A45980e6508
19046C38204I6241b56626P8630A77272b52790A43357L5925f5309j12006d5744
19035f6416r9096k00621B9396a8079G0069a13981N5224A8653K75618r2213G3693
19023a60905b2557F3045J74249c14702A34045J726a76717q8370a3268F8253b86634
19011g0709l5329q2882A23720a72799B49213a85851a6818G1754M6420h6259J798
$$ plain form
19092 -106986 -263920 -218210 -329046 28039 -15597 -537099 -212960 -9276 152513 -47715 122918
19080 -252886 504450 -35107 -216213 52250 -187470 85369 -218811 -230590 -255751 -242697 37326
19068 -326443 -91302 -424697 -112069 -489639 78544 126519 -114253 -114806 254184 19842 196296
19057 196296 -37711 -116426 234829 -30088 -111462 135547 253757 -132925 145980 -56508
19046 338204 96241 -256626 -177996 177272 -252790 143357 179282 -65309 -177315 -45744
19035 -66416 -165512 -366133 29396 -18079 70069 -113981 -58757 18653 294271 202058 73693
19023 -160905 -22557 63045 237294 -314702 134045 135771 -176717 -265087 -13268 68253 -286634
19011 -70709 -106038 -188920 123720 -172799 249213 -185851 -16818 71754 118174 -86259 -84461
19000h4461l89121D05365A78585d008A47898K16591j33802h8924L1129m8944e1682
18988A78524a04352A24141M2031J12652e0960k29762d0574r9589p0859h5476j30951
18977b16427h1273A36842d01357a19783N0251j02419A9365h9305j15995k77849
18967d83149B9274a31707J2446p0940B09793f5745B1858a48182G2771e6656l8916
18956i5572j11937G0399a41504j35810m3001A63022k3907a26223D7588Q6255J1987
18945A45830a18289A96820d2867m11206a64211c4110C03082A00548a70095e9041
18934b67678f6430C11339a25805B8493O7111b7651C6747c3920J2644k33283j47950
18923d02509g789j05774D9871a25928I1044a39748k17284Q4382b912j92047A51217
$$ plain form
19000 -84461 -473582 405365 178585 -4008 147898 364489 230687 -88924 -57795 -106739 -51682
18988 178524 -104352 124141 166172 278824 -50960 -280722 -40574 -140163 -211022 -85476 -216427
18977 -216427 -81273 136842 -401357 -119783 -69532 -171951 19365 -89305 -205300 -483149
18967 -483149 29274 -131707 -119261 -190201 209793 -65745 21858 -148182 72771 -56656 -95572
18956 -95572 -207509 70399 -141504 -277314 -320315 163022 139115 -126223 47588 133843 145830
18945 145830 -118289 196820 -42867 -454073 -164211 -34110 303082 100548 -170095 -59041
18934 -267678 -66430 311339 -125805 28493 95604 -27651 36747 -33920 -21276 -254559 -402509
18923 -402509 -7789 -113563 49871 -125928 91044 -139748 -357032 -272650 -2912 -194959 151217
18911a39315K9388F6062b3628k23354e5737k34729g6137A88401b31360j3362J11590
18900a33132B86355r8988d71010a9930B25437j095a50281j08905A27668a42701
18889I056b98809R1916C27K19495b13926B85625e1342r1293I5066a20528b3118
18877g2413l36876J35804a01586d3119C20231b5986H9798b25432j8714d195j28288
18866a32483G5987J25619F1321c1314k33933k890A19916m5376a24677j60730B9543
18854a85455L0603K5583j23100a19030K1418C9162a8117A80024C5920a32071A94043
18842a9673k30724B73892A28543a49752P0105B3899J53327e55903K20313B22114
18831A6224b90359f8518F0002N56J69706i7121C5791a1979p3791a6538j73436
$$ plain form
18911 -139315 -109927 66062 -23628 -246982 -55737 -290466 -76137 188401 -231360 -244722 -133132
18900 -133132 286355 187367 -471010 -19930 225437 224342 -150281 -259186 127668 -142701
18889 9056 -298809 -206893 327 219822 -213926 285625 -51342 -142635 95066 -120528 -23118
18877 -72413 -409289 -273485 -101586 -43119 320231 -25986 89798 -225432 -244146 -4195 -132483
18866 -132483 75987 201606 61321 -31314 -265247 -268137 119916 74540 -124677 -285407 29543
18854 -185455 -154852 -129269 -252369 -119030 -97612 39162 -18117 180024 35920 -132071 194043
18842 -19673 -250397 273892 128543 -149752 -79647 23899 177226 -555903 -335590 222114
18831 16224 -290359 -68518 60002 60558 230264 -97121 35791 -11979 -85770 -16538 -189974
18820a89974A36440K1205J05033g8202o2981G3758a28144f916H7553J22653d21569
18808I6117Q6627b36165A37316b00144i8011c9017q8399C1490a05828A77416a13260
18796h5023A02345c05724a19833A74594B3101J3294J36815m8169i7513A91969
18785B09155b21133j1347j44697H7195J04986a40272G003f3949o9903B23665l0058
18774A93607h4924r3103B54655a15644o2078K6028E0337d62253J97432A0359g548
18762a07789C17300a32376m8296b6863k86813A77599a00417C5612J393K43334
18752B80339b87546e4539B936K34538q0671k4639a87359b563l98658a35301A30778
18740a02254j1972A11531b54386L2951B02096L7924d35112D79616e7575p533A34786
$$ plain form
18820 -189974 136440 157645 262678 -78202 -141183 73758 -128144 -6916 87553 210206 -421569
18808 96117 182744 -236165 137316 -200144 -98011 -39017 -127416 31490 -105828 177416 -113260
18796 -85023 102345 -305724 -119833 174594 23101 36395 173210 125041 -97513 191969
18785 209155 -221133 -232480 -377177 87195 192181 -140272 7003 -63949 -133852 223665 193607
18774 193607 -84924 -178027 254655 -115644 -177722 -151694 50337 -462253 -264821 10359 -7548
18762 -107789 317300 -132376 -180672 -26863 -313676 177599 -100417 35612 37005 280339
18752 280339 -287546 -54539 2936 237474 156803 132164 -187359 -2563 -401221 -135301 130778
18740 -102254 -114226 111531 -254386 -221435 202096 240020 -435112 479616 -57575 -65108 134786
18728b7200j3866p2150o8770h2869j3886c4311L284q8479q882A87062h4730K0149
18716f4581l17129I9916L9299h6730a1905j02060E8441C669g3079L0040a0494
18704I3904a84135L6166d6245E6822a29172k2585L4642d0293C38900A24648b68414
18692G4892d30644a08816j323j55720A32500b3002A37533F7872a33001b7566j67756
18681a95322a3556m8960j61463B96539j00274n5888a94709A78951b7745n38471
18671e66216A5255L8476b58073a27082F8930l885a06818B77445A30152a80153
18660I3199i7609B91114a69204E9875O17a62932K6000n4219o1291B4611J0735
18649C5346L2640R0256D3193a30446A14415I270h2363j16240J183A37403b19080
$$ plain form
18728 -27200 -41066 -113216 -181986 -82869 -96755 -34311 -31027 -119506 -128388 187062 -84730 -64581
18716 -64581 -381710 99916 139215 -86730 -11905 -113965 58441 3669 -73079 -43039 -10494
18704 93904 -184135 -147969 -46245 56822 -129172 -151757 -117115 -40293 338900 124648 -268414
18692 74892 -430644 -108816 -110139 -265859 132500 -23002 137533 67872 -133001 -27566 -195322
18681 -195322 -13556 -62516 -223979 296539 196265 140377 -194709 178951 -27745 -566216
18671 -566216 15255 53731 -258073 -127082 68930 65045 -106818 277445 130152 -180153
18660 93199 -97609 291114 -169204 59875 60492 -162932 -136932 -191151 -252442 24611 35346
18649 35346 67986 158242 43193 -130446 114415 9270 -82363 -198603 -197420 137403 -219080
18637b04353E7934d4582k75042a50474A59657c6295k02596A13669E2192b19596
18626D6038a91404A73372h2355j16940A41887F7717l724a8581l9357o2469J9204
18615a01203J7794j35182B3343J31067k0809b66212B45694d78658J26064H0050
18604I2632b97893B47026a84373A4140d0924j8033E9320b70944a0038k2470q0381
18593a12889A20774a24645E365Q0298g5046m14840K03829a8462j94417O5180F6813
18581b36894n809a09386o4302g178C8919a46242n9605K9868j46805B2652K82830
18570C05482f1967K003G9414C0416D633g0989K4348q3195C2055c33603H765c8592
18557a01619C2825a26966L4855A32163g8759A18542K5996h8900A78116b23511
$$ plain form
18637 -204353 57934 -44582 -319624 -150474 159657 -36295 -238891 113669 52192 -219596
18626 46038 -191404 173372 -82355 -199295 141887 67717 63993 -18581 -57938 -120407 -101203
18615 -101203 -83409 -218591 23343 154410 133601 -266212 245694 -478658 -352594 80050
18604 92632 -297893 247026 -184373 14140 -40924 -58957 59320 -270944 -10038 -32508 -112889
18593 -112889 120774 -124645 5365 85663 -75046 -489886 -286057 -18462 -212879 -147699 66813
18581 -236894 -242703 -109386 -173688 -7178 38919 -146242 -205847 -175979 -322784 22652 305482
18570 305482 -61967 -59964 79414 30416 4633 -70989 -46641 -129836 32055 -333603 8765 -38592
18557 -101619 32825 -126966 -92111 132163 -78759 118542 144538 -88900 178116 -223511
18546d3280A6143e8042k95727A24869a48827B0214b40669a7197D4426a61995n6732
18535b18727n6480a28072A20142a42633H3381J99547a42583E559Q0113l1947c64154
18523a31523m4445k01679E271b54961H9787c7453j54365L0509A30619a24979B9751
18511d01709c2086j5943E0549A9550b09899m6066C69995b8340B73973F8951j1680
18500E7271O1761h2896j07662Q3267j15167j03765A11585e5710F8117P5256a89304
18488d8985j52269j08766B00128a47910p0602A23260a66241o7228l1599C24472
18477F2776K54088f5354G7454K8940L0796i187A8501J83234b68738C3105b57858
18465g0070A13344c7038r4640A49047b79766j26231J26332a13488G302M6973b33509
$$ plain form
18546 -43280 16143 -58042 -353769 124869 -148827 20214 -240669 -17197 44426 -161995 -218727
18535 -218727 -275207 -128072 120142 -142633 83381 282928 -142583 5559 85672 53725 -364154
18523 -131523 -175968 -377647 5271 -254961 89787 -37453 -191818 -161309 130619 -124979 29751
18511 -401709 -32086 -48029 50549 19550 -209899 -255965 369995 -28340 273973 68951 57271
18500 57271 119032 -82896 -190558 -107291 -222458 -326223 111585 -55710 68117 143373 -189304
18488 -48985 -201254 -310020 200128 -147910 -218512 123260 -166241 -233469 -265068 324472
18477 62776 316864 -65354 77454 106394 137190 -9187 18501 201735 -268738 33105 -257858
18465 -70070 113344 -37038 -131678 149047 -279766 -405997 -279665 -113488 7302 54275 -233509
18453d1955p5110A32983L5756N0112I4099J60498e4664l30999a74546e1613q0900
18442a32513B04966H5991M6263a76640B69467b57669p0952H8502l3151c11060
18431g8816N850b2756l21473J66545A28182a25543l1186E1536a88730A67868i7982
18419g6087j05688h9280D0281G238L40095j6100c45898g7804F7913B7848N7795
18408H5643l7323O0437J55729a48335b0051A54757K14810F821c1657C2086c28315
18396a34208N212A70183a30382e5880j0373j41871Q3386B191a72752C9455d8557
18384A9554b4124k52693B10485o9514a95147C2073L54344C8941c29326O5537J02816
18373a60973o7665g3893N3k9288M5461j9014B41424o4744p4125E051b29104J783
$$ plain form
18453 -41955 -117065 132983 168739 218851 94099 254597 -54664 -385663 -174546 -51613 -132513
18442 -132513 204966 85991 132254 -176640 269467 -257669 -328621 88502 55351 -311060
18431 -78816 -72966 -22756 -344229 -177684 128182 -125543 -156729 51536 -188730 167868 -97982
18419 -76087 -181775 -89280 40281 7238 347333 331233 -345898 -77804 67913 27848 85643
18408 85643 48320 108757 264486 -148335 -20051 154757 369567 6821 -31657 32086 -328315
18396 -134208 -128996 170183 -130382 -55880 -66253 -208124 -124738 2191 -172752 39455 -48557
18384 19554 -24124 -276817 210485 140971 -195147 32073 386417 38941 -329326 -263789 -160973
18373 -160973 -228638 -73893 -73840 -103128 -57667 -76681 241424 176680 102555 5051 -229104 -227321
18361b27321e2523j65639e1078l22709g0880A36721a04415d5666j8254j81330
18351b45250J1224B8349h0114k49348C52037d04631b4591r4118j1444E360a12713
18339a03370A49327J35308A04907a650k26699D7598b3897j67459c9969a9614k87563
18328c07177a3588I4678g8023M411j03655Q5879j54647F4677c9033o5507o6276
18317a70816e4313C8523J29518a41607p8519j52041a49478k65059K01128L6168
18307a77241j06077F0207B3416c7229j85589B20812l5665a1768j00199A44616
18296b0555e576q9660A23312i7823A58391m4765i0849B45924o3742D2922c69477
18284D09884j46892m0279m0793a0983j51027P0609q6731N7723k97681a08837A81389
$$ plain form
18361 -227321 -52523 -218162 -51078 -373787 -70880 136721 -104415 -45666 -63920 -245250
18351 -245250 -234026 28349 -80114 -329462 352037 -404631 -24591 -118709 -130153 5360 -112713
18339 -103370 149327 284635 104907 -1650 -228349 47598 -23897 -191356 -39969 -19614 -307177
18328 -307177 -13588 94678 -78023 -73612 -177267 -91388 -246035 64677 -39033 -104540 -170816
18317 -170816 -54313 38523 168041 -141607 -220126 -372167 -149478 -414537 -213409 -177241
18307 -177241 -283318 60207 23416 -37229 -222818 220812 185147 -11768 -111967 144616
18296 -20555 -5576 -95236 123312 -97823 158391 113626 -90849 245924 182182 42922 -369477
18284 409884 262992 222713 181920 -10983 -162010 -91401 -178132 -120409 -418090 -108837 181389
18272a24555l5616H6167a90755c1260l25858F6546c5871j09720k1124A42222g3711
18260A25438a38585D0267a22471H6837c9368H38J1319J31753a58846j8595j08703
18249b86144c5646F4890a36229B7971a75508a1521F9905c05528A51838K03234
18239C55072a08279M7793j475n5408j32923A06852D1143f737k78234a15550k5765
18228a41315L4024k13247h4009A60250b63909a9509A7798K01350a91260j11066
18218c02326E492J13806A292h0616H1504L6239D4354g0689c0636l07906c9441
18206I3801b29792O145A8669O4539l6706J99338n7996c7223o9743j843B1604b28872
18193H5863d14909J46394A24358b17843j40079A11902E5029b17497R2088A18386
$$ plain form
18272 -124555 -160171 86167 -190755 -31260 -357118 66546 -35871 -145591 -166715 142222 -73711
18260 125438 -138585 40267 -122471 86837 -39368 838 12157 143910 -158846 -177441 -286144
18249 -286144 -35646 64890 -136229 27971 -175508 -11521 69905 -305528 151838 355072
18239 355072 -108279 -60486 -61961 -117369 -250292 106852 41143 -6737 -284971 -115550 -141315
18228 -141315 -107291 -320538 -84009 160250 -263909 -19509 17798 219148 -191260 -302326
18218 -302326 5492 119298 1292 -80616 81504 117743 44354 -70689 -30636 -338542 -39441
18206 93801 -229792 -223647 18669 83208 46502 245840 187844 -37223 -106966 -108809 21604 -228872
18193 85863 -414909 -268515 124358 -217843 -357922 111902 55029 -217497 -125409 118386
18182H4344f6450j58759A05775g8635p8566a7844r7868B42685C1986a05622m16981
18171e22603b51892g5460r9935a7258B1783b1389j36603G9896g9855L5717B33690
18159B56465a45972d141r0838j7931C0455c08199g2384A20631k2270a99923L7156
18148a62767d5842C58548G9787b21495a07642c2447i583A32731b60295j75934
18138d36229J80435a00960B00739K2195c27052A74457a97002D5473J5739a58825
18127G3185J22695I331K3185c8740j30949B11747a25185l0122I2571A0262a78790
18115B5694a44211l58561H1389a55298q245o5398c0631E8881a20703B09477e9182
18103B05452g5565r5919B05509a14250j9858r8421B56762b32382J08577r5495
$$ plain form
18182 84344 -66450 -225209 105775 -78635 -157201 -17844 -115712 242685 31986 -105622 -522603
18171 -522603 -251892 -75460 -175395 -17258 21783 -21389 -157992 79896 -79855 -44138 233690
18159 256465 -145972 -4141 -94979 -112910 30455 -308199 -72384 120631 98361 -199923 -162767
18148 -162767 -45842 358548 79787 -221495 -107642 -32447 -9583 132731 -260295 -436229
18138 -436229 -255794 -100960 200739 222934 -327052 174457 -197002 45473 61212 -158825
18127 73185 195880 9331 32516 -38740 -169689 211747 -125185 -155307 92571 10262 -178790
18115 25694 -144211 -502772 81389 -155298 -163543 -228941 -30631 58881 -120703 209477 -59182
18103 205452 -75565 -171484 205509 -114250 -134108 -232529 256762 -232382 -123805 -219300
18093b19300B8674a51806F3293b95590e9898a8022j70383A61730a15324F1693
18082a29395e4178p6934O5368l21260J77141C618d1712k2061A57130F4000a56828
18070a49942e3753E5515O2058a37518C04297A29152a42500O9968L4377J0939C3282
18058a57418n7962A2247g2346C01969b74719A67779D1326b29033K7045j7676j58792
18047c78456O1448A91783c2426j69059R6509A53669a49142J5331A15410Q166b34347
18035b1021l57877a32592B04i1593B5258O0840a70021A67927b49135M5653R0650
18024a12832b950p8540A19650g3971K7427A09021a51359a695j07656m779H5377
18012I1061J3117b4950r6225F1409e8738C89055C5836J69031K6063a33754j2211
$$ plain form
18093 -219300 28674 -151806 63293 -295590 -59898 -18022 -188405 161730 -115324 61693
18082 -129395 -54178 -131112 -65744 -387004 -209863 3618 -41712 -63773 157130 64000 -156828
18070 -149942 -53753 55515 117573 -137518 304297 129152 -142500 -72532 -38155 -27216 33282
18058 -157418 -215380 12247 -72346 301969 -274719 167779 41326 -229033 -201988 -219664 -378456
18047 -378456 -317008 191783 -32426 -201485 -104976 153669 -149142 -133811 115410 123576 -234347
18035 -21021 -378898 -132592 204 -91593 25258 86098 -170021 167927 -249135 -203482 -112832
18024 -112832 -2950 -81490 119650 -73971 -46544 109021 -151359 -1695 -109351 -114130 85377
18012 91061 104178 -24950 -121175 61409 -58738 389055 35836 204867 230930 -133754 -145965
18001a45965j93399R5133A49058h9869n1402j21061a24996c2769j69283M436g8282
17989G9343J62575O0686b12748A92403c08731E9558i9802l34109J57708I7479
17978B89232H0559L6076a94656e5832k47480A44650L550a43919A01003a34054
17967B67509c06346g1745D50579A10968R9125a06660F9760f8040A84756F9719
17956c68833B44926f28902A94960b09793f1529C03515a50472n9362A05265B7648
17945b6396A81948d0044l5630A7884J21792a72330E2826R6226d0680L19k21011
17934b61372c8542E7659J20758j2139d1150B60320G1471d43742a88254L4618H7256
17922A36287l5945a16444j84526a42108L8160A2715J29781e4773o312l30335A5542
$$ plain form
18001 -145965 -339364 -244231 149058 -89869 -141271 -262332 -124996 -32769 -202052 -197616 -78282
17989 79343 241918 302604 -212748 192403 -308731 59558 -99802 -433911 -276203 97479
17978 289232 80559 116635 -194656 -55832 -303312 144650 148200 -143919 101003 -134054
17967 267509 -306346 -71745 450579 110968 210093 -106660 69760 -68040 184756 69719
17956 -368833 244926 -628902 194960 -209793 -61529 303515 -150472 -209834 105265 27648
17945 -26396 181948 -40044 -75674 17884 139676 -172330 52826 149052 -40680 -40361 -261372
17934 -261372 -38542 57659 178417 166278 -41150 260320 71471 -443742 -188254 -153636 87256
17922 136287 100342 -116444 -300970 -142108 -103948 12715 142496 -54773 -61085 -391420 15542
17910b66921A5994K01835c21082D54776a05559j99432I7519a18429A68323J5133
17900A83456b60408f0993E5891J14551J92325c07950A07871c91257D6024e0261
17889a00641A58187a92834P6226A69167A872a64832l3666d3152j84886C31177
17878A15483B370K05699C2915a91615R5471j2059C90722a57281j47586d9701C500
17866b64032A48718a10115r7799c0372D05277f6251H8545b4496j99975l3044C6875
17854A48939m7376m0422J31759c5759C99444A08969a7816k71202h9597B56061
17843A49335G0088i1701C20955j25999N152i6326j07236K5281B42068c18394B36393
17831e7408B21522n7041B1742K930a00970D1044b83793h8290C70805E655J08573
$$ plain form
17910 -266921 15994 217829 -321082 454776 -105559 -304991 97519 -118429 168323 183456
17900 183456 -260408 -60993 55891 170442 362767 -307950 107871 -391257 46024 -50261
17889 -100641 158187 -192834 -116608 169167 1872 -164832 -198498 -43152 -228038 331177
17878 115483 2370 208069 32915 -191615 -96144 -108203 390722 -157281 -304867 -49701 3500
17866 -264032 148718 -110115 -207914 -30372 405277 -66251 88545 -24496 -224471 -257515 36875
17854 148939 101563 61141 192900 -35759 399444 108969 -17816 -289018 -89597 256061
17843 149335 70088 -91701 320955 194956 200108 -96326 -203562 -178281 242068 -318394 236393
17831 -57408 221522 164481 21742 24672 -100970 41044 -283793 -88290 370805 5655 114228
17820A14228a96911c0486C64419a64899G7398b1108j86982l1759D0849L9896J74684
17809B55429b08519B28263o0069J8634h1749j44854J0528K1532D2535L58J12797
17798A55690Q3094I6283D5192a6195I3198M1384J33015a70583A39460b71538e6052
17786g4358A69394n9256K39354c27199E1442L58114A48511M8491B4775J74611
17776A99386D3102a7994C4464J97156D1582r240e5386f553A27265B7093a6093
17764e964A4388a73346K0772j74614b6969H5880b1866p9570k68690B1625a52174
17752B67080C8038K8084M0206b26502D1088H236a62328a393q669D2293L1917K64663
17740C38873c0737A93391o3527D8409c75455B63533i7485H6041d09968D314L3583
$$ plain form
17820 114228 -196911 -30486 364419 -164899 77398 -21108 -208090 -239849 40849 80745 255429
17809 255429 -208519 228263 168194 186828 -81749 -226603 -216075 -194543 42535 42893 155690
17798 155690 238784 96283 45192 -16195 93198 134582 267597 -170583 139460 -271538 -56052
17786 -74358 169394 110138 349492 -327199 51442 409556 148511 197002 24775 199386
17776 199386 43102 -17994 34464 231620 41582 32342 -55386 -6553 127265 27093 -16093
17764 -5964 14388 -173346 -152574 -327188 -26969 85880 -21866 -101436 -370126 21625 -152174
17752 267080 38038 66122 106328 -226502 41088 8236 -162328 -1393 -10062 42293 74210 338873
17740 338873 -30737 193391 129864 48409 -375455 263533 -97485 86041 -409968 4314 37897
17729C7897b68888A38068m4035Q4515o7823a59043d0632j09907r6381a15854A35986
17717H041a72238A35865B4205L2191J37794a90813P0112b576k29105R6728c1557
17705b19886E0608p543b19067p217A99944c52943A0664b17392f2957G2221b55434
17693a73821A70687K0547q6723f1661j25608D2845c02500P7697O7609K0491e2414
17681H3121K34152a08733D3877c574j69220G5826j6429J93654p8637G2208e4817
17669B31100c6382A25566a29969B8623Q4532j5596J69355J32905F1005g8508B13523
17657f6782I1842c00280c0104k73003A6506K89254d0002m9795l76152j6262a46339
17645B502N7981b07247c9879k2063c0382m12884C26991C4846b08087F3301M6478
$$ plain form
17729 37897 -268888 138068 94033 178548 110725 -159043 -40632 -150539 -246920 -115854 135986
17717 8041 -172238 135865 24205 56396 194190 -190813 -120701 -2576 -231681 -134953 -31557
17705 -219886 50608 43065 -219067 -226284 199944 -352943 10664 -217392 -62957 72221 -255434
17693 -173821 170687 191234 104511 -61661 -187269 42845 -302500 -224803 -157194 -136703 -52414
17681 83121 317273 -108733 43877 -3574 -172794 75826 59397 253051 174414 72208 -54817
17669 231100 -36382 125566 -129969 28623 113155 97559 266914 399819 61005 -78508 213523
17657 -66782 91842 -300280 -30104 -303107 16506 305760 -40002 -89797 -465949 -482211 -146339
17645 2502 60483 -207247 -39879 -61942 -30382 -443266 326991 34846 -208087 63301 109779
17634A09779j5285D2597b68920B23408e527C6225h5516k37736B24461j08353a98973
17622A33983h9557G9865f2086C8611Q1349c8571k87532a22903A087b23643D6947
17610e38427D4868J71517J63777a24730B21267N1931A1936L4041a67802A11657
17599h1242c3688A98849a15468k85784g1556j62672E3163a06182I2391c1817j01361
17588a33178P187B63732I3895e1131E9243Q2995P317J4297H788Q0312M8964b31966
17575D4530a07775r9231F7966K17516b02029H4376f4705j79792R5042B6104J31443
17564A57547A1670R07J04083O9295c11169J25958a7632B38111H7018K22224a3955
17552A89880C7286f233A97586a37665d8068A84485J55983j18904F809M41485C7623
$$ plain form
17634 109779 94494 42597 -268920 223408 -5527 36225 -85516 -323252 224461 116108 -198973
17622 133983 -89557 79865 -62086 38611 119960 -38571 -326103 -122903 1087 -223643 46947
17610 -538427 44868 216385 380162 -124730 221267 273198 11936 45977 -167802 111657
17599 -81242 -33688 198849 -115468 -401252 -71556 -234228 53163 -106182 92391 -31817 -133178
17588 -133178 -125991 263732 93895 -51131 59243 142238 149555 163852 8788 89100 138064 -231966
17575 44530 -107775 -207006 67966 285482 -202029 84376 -64705 -244497 -149455 26104 157547
17564 157547 11670 12577 116660 185955 -311169 -185211 -17632 238111 87018 309242 -13955
17552 189880 37286 -6233 197586 -137665 -48068 184485 340468 221564 6809 448294 37623
17540a14538j94769a06206d3223l83653a40905C90255j70275M1469B524a20825
17529C38219h1083e43F08189B47163g5806i032A66976A7794J20223b82175A26235
17517G0447E953i5376C57087j20627A06138J45118H9206a3064k13820f7177A05651
17505a31964B07544p3118e8130B22050c4750B41206q401q8859Q5099j11201J42747
17494B60591H5015a13389G1546d39786C55254A7361K04073d1608C81299E4251
17483C37847J15158A27117J59717J6150b6981n7518D8008J60282b6339B93805
17472a68522f4681C55075P424j6343q1398f3179C21175A44509K63294a05490B06531
17460i0466D8663a97092I5101J95568b26319A40820a19405B43771R2802p5047
$$ plain form
17540 -114538 -309307 -106206 -43223 -426876 -140905 390255 219980 261449 2524 -120825
17529 338219 -81083 -543 608189 247163 -75806 -9032 166976 17794 138017 -282175 126235
17517 70447 5953 -95376 357087 236460 106138 251256 89206 -13064 -226884 -67177 105651
17505 -131964 207544 134426 -58130 222050 -34750 241206 232805 143946 229045 117844 260591
17494 260591 85015 -113389 71546 -439786 355254 17361 221434 -41608 381299 54251
17483 337847 453005 127117 286834 302984 -26981 -84499 48008 208290 -26339 293805
17472 -168522 -64681 355075 362499 346156 264758 -63179 321175 144509 407803 -105490 206531
17460 -90466 48663 -197092 95101 290669 -226319 140820 -119405 243771 336573 261526
17450B61526G3133K05380k2581H1011K49382l1025D1789P7017c4272B01851l7844
17439A64007L36356k18431E8L45262A48247P6498b12491B38521r1950J24180J56681
17428D27432I8493Q7160L30042B35969R0175o5436J94217A21474L32453k10906
17418B43021o6367m055L46835D0908K80351I4686Q931O8792A9849c2072a0629
17406b41707a3702B16716N4401K7187h1257B04418q8638a56685C09429A30595
17395c8710B04260d23420A21880L73610l0292B3374J48155C9748M5028K01217
17385B85993J2602j42301b5549p3571A46402K45729M8023I5312b98974B88291
17374H9191c2484r4347B1473a17049D10980i054C20695D6228K44055A21452B9082
$$ plain form
17450 261526 73133 278513 255932 81011 330393 299368 41789 118806 -34272 201851 164007
17439 164007 500363 281932 58 345320 148247 224745 -212491 238521 146571 270751 427432
17428 427432 98493 185653 515695 235969 326144 260708 454925 121474 453927 243021
17418 243021 176654 172599 519434 40908 321259 94686 103617 172409 19849 -32072 -10629
17406 -241707 -13702 216716 271117 298304 -81257 204418 115780 -156685 309429 130595
17395 -38710 204260 -423420 121880 495490 465198 23374 171529 39748 84776 285993
17385 285993 298595 156294 -25549 -99120 146402 392131 440154 95312 -298974 288291
17374 89191 -32484 -126831 21473 -117049 410980 -9054 320695 46228 290283 121452 29082
17362b09061C04676l5210I7148L02600A89733q5631J40389a9526A04972b77A87942
17350B9009K09534C6520A3403L8619q249K5498b23697D20731G0126L10427I0131
17338H3628Q4154B7439O7652k1764J14294i6769A39088J24443j01564h0364B5010
17326B87944j648M1270j33456h6547A87577g6605B10536n7977b03399h711C337
17314A93413K61211F040b0933p8770A14786K07579K6086a39807C80977h3226A35992
17302h928A83874G04L81703j79400m9888f4956I3327L4608O7757G3672d9676B42569
17289A80365q0161K7131a384D353L74593k0693M1699j97032i1570B19974j09860
17278A10114J13690N0704J3388J36655j64571G5623K13702K69266B01298l4441
$$ plain form
17362 -209061 304676 269466 97148 399748 189733 104102 244491 -19526 104972 -277 187942
17350 29009 238543 36520 13403 52022 43773 69271 -223697 420731 70126 380553 90131
17338 83628 167782 27439 95091 73327 187621 -96769 139088 263531 161967 -80364 25010
17326 287944 286296 327566 194110 -86547 187577 -76605 210536 152559 -203399 -8711 3337
17314 193413 454624 6040 -20933 -99703 114786 322365 348451 -139807 380977 -83226 135992
17302 -8928 183874 704 382407 203007 153119 -64956 93327 127935 195692 73672 -49676 242569
17289 180365 100204 127335 -1384 4353 378946 358253 399952 202920 -91570 219974 110114
17278 110114 223804 274508 287896 424551 259980 75623 289325 558591 201298 166857
17268A66857a8696A08835K5992M42027B3930i8717C6738N9351N0385K0528o3280
17257A03722K40716j130A55098K059m5425f5276D63067j91191J79070E3421L01860
17246C55281m9393A23358f5994n6594A23609L76566A09380C9501K60784n5158
17236B45127R7746d2382D36539A47720J81238G3421K26934A26970B0167K48688
17226B68855L4022I2470a43752B36794l111m7815C4534e0378A03254R835C6282
17214C4258L10360K5494q6092N2859L1969j08467J42071A47820J1694b3337A24565
17202D62778a3569C47837J86955B55683n4378K50103F8414M3050Q5223D7319L30332
17191C77651r3529j02910m115N7453K42111K8671j81853R4595c9906C98379m9028
$$ plain form
17268 166857 -18696 108835 134827 576854 23930 -98717 36738 96089 146474 167002 103722
17257 103722 344438 343308 155098 157157 111732 -65276 463067 271876 450946 53421 355281
17246 355281 305888 123358 -65994 -122588 123609 500175 109380 39501 300285 245127
17236 245127 342873 -42382 436539 147720 328958 73421 300355 126970 20167 268855
17226 268855 302877 92470 -143752 236794 233683 185868 34534 -50378 103254 113089 36282
17214 34258 344618 370112 284020 336879 368848 260381 402452 147820 159514 -23337 124565
17202 462778 -13569 347837 534792 255683 201305 451408 68414 111464 196687 47319 377651
17191 377651 284122 181212 177097 234550 476661 505332 323479 418074 -39906 398379 349351
17180C49351A48502m1270a18614A66754C3025M79473o3709B11638n9208p77K9196
17169A80849L30581D88e283B67914k6904a5127D59220G7014K90018L4869H7065
17157A62171b18875A81432b62910A48539K37826j89459o4309J23339R5065O2673
17147D13674f3238C2286L41345d5406E65292A40915L05458J3133n6314a50467
17136A62648k0660b12097D52395J04268A56486J55904l2274D7795J73249M8467
17126B69511L16129j05159A52156N46080H7310J95840j2034L66351B9888J63680
17116A93568A1077M5885K5492L89581j61412J18053G3183J81064P5304J67795
17106D97346o7832j60433N21102H5150M56908A64555J05632K74447B62761J41221
$$ plain form
17180 349351 148502 107232 -118614 166754 33025 512498 448789 211638 152430 151653 180849
17169 180849 511430 488 -5283 267914 241010 -15127 459220 77014 367032 401901 87065
17157 162171 -218875 181432 -262910 148539 386365 196906 132597 255936 351001 413674
17147 413674 -63238 32286 373631 -45406 565292 140915 446373 459506 403192 -150467
17136 162648 141988 -212097 452395 556663 156486 312390 280116 47795 221044 269511
17126 269511 585640 480481 152156 698236 87310 283150 271116 637467 29888 193568
17116 193568 11077 56962 82454 472035 310623 428676 73183 254247 329551 497346
17106 497346 429514 269081 790183 85150 542058 164555 270187 544634 262761 403982
17096D03982A47436K24247J48524b02659D23216j96221K76873j25256O8056j91682
17086B54986J9194P0303J93527j00815J97854j54222J31883j03606j65247p8246
17076B65611J73324j03155j41740R1352L22045B42393P6231J41648A25905M81462
17066F07367B58249K58867k06173R6499j33590K83536k66296K10054O8551n8621
17056E11076j26758j29521P7299o3692L12668k56110p8435L48170r5070P6540
17046E76167B82274K41047j65647J21180m7628L01509B58975J19991J12020K31412
17036G22398j16935P4887m960k61904Q4968m5437n8062K10881k21514N2831j29677
17025C07476J38175Q9279L56791j26504p9136o5083j33138K1921j24454L78941
$$ plain form
17096 403982 147436 371683 520207 -202659 423216 226995 503868 378612 446668 254986
17086 254986 274180 344483 538010 437195 635049 480827 612710 509104 343857 265611
17076 265611 438935 335780 194040 285392 607437 242393 318624 460272 125905 607367
17066 607367 258249 517116 310943 407442 273852 557388 291092 501146 569697 511076
17056 511076 384318 254797 332096 268404 581072 324962 246527 594697 499627 576167
17046 576167 282274 523321 357674 478854 431226 732735 258975 378966 490986 722398
17036 722398 605463 680350 675390 413486 498454 453017 394955 605836 384322 437153 307476
17025 307476 445651 534930 891721 765217 686081 620998 487860 509781 385327 764268
17015G64268l52951J59211B42743L45743q6735L47886j68380j7557k07260P0945
17005E27385K57570j94482j90597L01347j52340l5411P9839j39954N67763l76656
16995F44464j74164L3001K43969j48522L64879l9066j55843P8529L0764D25283
16984D44722L51122j34823J88226L2604j01520O8522j30673J64628p8243j29311
16974F75254j195R2924Q6438l50856J74259K95437j91242p6531j38966R9630J08772
16963G73924J77674k90828K128L45665Q3480j78619j55292R8605l71200M68330
16953I53867o1718P692j74736M274J07415Q5721n7316j16909L87294l69618J55544
16942I21510N57875p23983k8746L36384J57645k25640J07969k56117M20057l65326
$$ plain form
17015 764268 411317 570528 242743 588486 501751 849637 681257 663700 456440 527385
17005 527385 784955 590473 399876 701223 548883 513472 593311 453357 1021120 644464
16995 644464 470300 503301 747270 598748 963627 924561 768718 847247 878011 425283
16984 444722 795844 661021 849247 881851 780331 848853 718180 882808 804565 675254
16974 675254 674059 766983 853421 502565 676824 972261 781019 704488 565522 665152 773924
16963 773924 951598 660770 662898 1008563 1092043 913424 758132 856737 485537 953867
16953 953867 892149 899841 725105 729379 836794 922515 865199 748290 1135584 765966 921510
16942 921510 1479385 755402 726656 1063040 1220685 995045 1103014 846897 1266954 901628
16932I01628J36183q8986M61868n99469K02666O5148J23327k16892J80546k59607
16922I06412L74945M9015m95806L57445J34535j28030M60o259J44602j32228L1831
16911A236922q7654k6650J38106r1891J53124J5202j83030M7973K25226o4891
16901A362437M7684J37633R8175j08751J24970n348j45753J48131j06032k0474
16891A532672K66053n8690N0192k32285J96397j39995J55075J06146j6443O6213
16881A925335l39041K01663L88396n52098J74931J87765j05779k8358m1815j31851
16871A679148O15093j98232J33980m41423J96240L3619K64688q7015K7555K17298
16861B440951Q6013k57635J51628Q7016n7263K2276J04702j35840Q8645j41672
$$ plain form
16932 901628 1037811 948825 1410693 811224 1013890 1079038 1202365 985473 1166019 906412
16922 906412 1281357 1330372 834566 1192011 1326546 1198516 1198976 1192717 1337319 1205091 1236922
16911 1236922 1149268 1122618 1260724 1168833 1321957 1337159 1154129 1202102 1427328 1362437
16901 1362437 1410121 1547754 1645929 1537178 1662148 1656800 1511047 1659178 1553146 1532672
16891 1532672 1798725 1740035 1790227 1557942 1754339 1614344 1769419 1875565 1859122 1925335
16881 1925335 1586294 1787957 2176353 1624255 1799186 1986951 1881172 1852814 1810999 1679148
16871 1679148 2294241 2096009 2229989 1788566 1984806 2018425 2283113 2196098 2223653 2440951
16861 2440951 2526964 2269329 2420957 2507973 2450710 2472986 2577688 2441848 2530493 2388821
16851B388821L81589k4998k35197K47060J50737J5363J23660m01055M43884P5614
16841C165478l12412M31657q1828L61107l95556L97057k58149L62697N2717l95230
16831C327538j50204P01152m9554j59617M57566l58336N15901o0747k94852L92206
16821D321053J2401L86915k6184P115J72816k55283L3426L04910J73171L54268
16811E484608j34660J29865j21631K07253M2518L39510K09795L1770j09399K14104
16801F293733J27139J33925L52727q4397Q6789M54570K29122p3438K93931K72626
16791H086727K16964K53286L09246l47628K76145K52245O11527Q4157L99167M53831
16781A0595667J90669N6015Q93247k13446L02652M53376O85556J0508N15494N97760
$$ plain form
16851 2388821 2770410 2745412 2510215 2757275 2908012 2923375 3047035 2645980 3089864 3165478
16841 3165478 2853066 3284723 3202895 3564002 3168446 3565503 3307354 3670051 3722768 3327538
16831 3327538 3177334 3878486 3828932 3669315 4126881 3768545 4284446 4223699 3928847 4321053
16821 4321053 4333454 4720369 4694185 4701300 4874116 4618833 4652259 4957169 5130340 5484608
16811 5484608 5349948 5479813 5358182 5565435 5607953 5947463 6157258 6189028 6079629 6293733
16801 6293733 6420872 6554797 6907524 6823127 6909916 7364486 7593608 7520170 7814101 8086727
16791 8086727 8303691 8556977 8866223 8518595 8794740 9046985 9658512 9742669 10141836 10595667
16781 10595667 10786336 10842351 11735598 11522152 11824804 12278180 12963736 12974244 13489738 14087498
16771A4087498M35108K63155O86950P99923L19465M19146M75194P03647N98491
16762A8788577P13807R89542R52567P56462Q60787J599020O73048Q25392J329437
16753B7488639R82548J428752J117020J611249J789765J486582J527392K187271
16745C9619218J948567K470326K200957K686289K697242L146680L346426L072733
16737F1188438M091307M150811M083764M676723N199581N643412N421737O493865
16729A00949638O642276O927013P737382P712662Q224234Q423414Q604981Q355652
16721A63577252Q542646P732575P344305O330864N088942L686412K165794Q87215
16713B05356005j350990k410933m026853n535325o319291p480522p977487q578153
$$ plain form
16771 14087498 14522606 14785761 15472711 16272634 16592099 17011245 17486439 18190086 18788577
16762 18788577 19502384 20491926 21444493 22200955 23061742 24660762 25333810 26159202 27488639
16753 27488639 28471187 29899939 31016959 32628208 34417973 35904555 37431947 39619218
16745 39619218 41567785 44038111 46239068 48925357 51622599 54769279 58115705 61188438
16737 61188438 65279745 69430556 73514320 78191043 83390624 89034036 94455773 100949638
16729 100949638 107591914 114518927 122256309 129968971 138193205 146616619 155221600 163577252
16721 163577252 172119898 179852473 187196778 193527642 198616584 202302996 204468790 205356005
16713 205356005 204005015 201594082 197567229 192031904 185712613 178232091 170254604 161676451
16705A61676451q443209r152685q293020q130342q066380p912951o847785o882055
16697I7948024o295669n952977n427350n149438m178879m748334l782594l590598
16689E8822185l419201l286821k862249k795798k737826k135030k485136j546232
16681C7553892k015247j860316j500664j602699j439754j519819j194838q95394
16673B5525161j120325j302967n99583p12010j280066p23711o34827r92377o72985
16664A7486310p05572j23605o12624q19351n30112n43315m25115o52650l86262
16655A2687704n10589j18706n41102j32370m81809p14347R8206k85124j93525
16646I808338l26228n64871p5315o50454M4396j08020j18043r3850j78862p35005
$$ plain form
16705 161676451 153233242 144080557 135787537 127657195 119590815 111677864 104830079 97948024
16697 97948024 91652355 85699378 80272028 75122590 70943711 66195377 62412783 58822185
16689 58822185 55402984 52116163 49253914 46458116 43720290 41585260 39100124 37553892
16681 37553892 35538645 33678329 32177665 30574966 29135212 27615393 26420555 25525161
16673 25525161 24404836 23101869 22502286 21790276 20510210 19786499 19151672 18159295 17486310
16664 17486310 16780738 16657133 16044509 15225158 14695046 14151731 13726616 13073966 12687704
16655 12687704 12177115 12058409 11517307 11384937 10903128 10188781 10286987 10001863 9808338
16646 9808338 9482110 8917239 8841924 8191470 8235866 8127846 8009803 7915953 7737091 7002086
16636G002086q778j34642k96201l65526R9763k32232m280K14071n04162j62778
16626E607321j59245J35554r3007j48249m52262Q7886L4930j70808j48373N1578
16616D745325n72027K4756L98689l88520l4245n0361j70658j2929R1697m17240
16606C614487k7191l14457N36383m66877L90526m16430J45513l34926j25750M2400
16596C043678J37521m11975K77655n23180M24343j42728m1946l1248L0989k43240
16586B519869M13174l76837k15002q4388J58821k70061K18872k22513R9437j14053
16576B127319R7058k12134m88573M82485J23067j59915Q8958J29863n75358L16289
16566A929059K65013n74020R6935J74207l37750Q5956J82322J79598j23762j42983
$$ plain form
16636 7002086 6993308 6858666 6562465 6196939 6296702 6064470 6060190 6274261 5770099 5607321
16626 5607321 5448076 5583630 5490623 5342374 4890112 4977998 5012928 4842120 4693747 4745325
16616 4745325 4173298 4198054 4596743 4208223 4173978 4123617 3952959 3940030 4031727 3614487
16606 3614487 3587296 3272839 3809222 3342345 3732871 3316441 3461954 3127028 3001278 3043678
16596 3043678 3181199 2769224 3046879 2523699 2948042 2805314 2763368 2732120 2763109 2519869
16586 2519869 2933043 2556206 2341204 2256816 2415637 2145576 2364448 2141935 2241372 2127319
16576 2127319 2224377 2012243 1523670 2006155 2129222 1969307 2058265 2188128 1612770 1929059
16566 1929059 2194072 1620052 1716987 1891194 1553444 1639400 1821722 2001320 1877558 1734575
16556A734575r2155Q5476j6369o5643k46974K29035k88668M68782j49599m74352
16546A184108J36131l63857N73394k88218j2344r957m3158L91615q5918m71411
16536A010385J50145j57788N7932L67002k93581J63364J13172J3270l25778M3993
16526A142116O639q3240o4367k56458N06619r2110j79815J97442l0815J41553
16516A287564m80114J63250j16754J0697m2225r5941J99010l11816M13619k26734
16506H00556P1921K99728l97123k40154M18082j5249l26270L61651D39220K16836
16496F56056j04450K63481M5141j98000j8929L42900C67929O4013J39890K14330
16486G86162J82236j68924j74153R854K6563K11989k19555R6162j09895N2966
$$ plain form
16556 1734575 1642420 1727896 1711527 1645884 1398910 1627945 1339277 1808059 1658460 1184108
16546 1184108 1320239 956382 1529776 1241558 1229214 1219257 1176099 1567714 1481796 1010385
16536 1010385 1160530 1002742 1060674 1427676 1134095 1297459 1410631 1423901 1098123 1142116
16526 1142116 1148755 1065515 1001148 744690 1251309 1159199 979384 1176826 1146011 1287564
16516 1287564 807450 970700 853946 864643 822418 726477 925487 613671 1027290 800556
16506 800556 872477 1172205 775082 534928 953010 937761 611491 973142 439220 656056
16496 656056 551606 815087 860228 662228 643299 986199 367929 431942 571832 786162
16486 786162 968398 799474 625321 635175 661738 873727 654172 750334 640439 693405
16476F93405j25937M5653L6561O668j01266j7438O4821K68206p3090B92809K33077
16465E25886j79991K6799L13219l06250J38205K67202B91046M65405j50396B50942
16454C61789J01757J53811k09165R4334N4948j71020J58330A77399L61375j93022
16444C45752L4974q712J73982r3871o1668L10451l43315a8065D24650K29553Q3193
16433G37396l31830r3131K4738L6575J06664B13882M10500j25148j04408A53959
16422F41653n7711B55491L62486N1877C32380J11902c2492D50148r1046P2545
16412D31647J83266i7998C88468o3105k4314J61491j35107q1583J12039m0964
16402C16925J43914J39431j54903j35304j29574P7689M8507J15361m8000D7789
$$ plain form
16476 693405 567468 613121 649682 656350 555084 537646 602467 870673 797583 292809 525886
16465 525886 345895 372694 685913 379663 517868 785070 291046 756451 606055 250942
16454 361789 463546 617357 408192 502526 557474 386454 544784 177399 538774 345752
16444 345752 380726 372014 545996 452125 390457 700908 357593 -18065 424650 654203 737396
16433 737396 405566 312435 337173 373748 480412 213882 624382 499234 394826 153959
16422 641653 583942 255491 617977 669854 332380 444282 -32492 450148 359102 431647
16412 431647 614913 -97998 388468 325363 301049 462540 327433 245850 357889 316925
16402 316925 460839 600270 445367 310063 180489 258178 306685 422046 374046 47789
16391A4450L71183K5904M4578A56705K36287k023A02672J45782K25482j47307
16381C26629j1205j39801Q1731o0452L6461N0159K08047a95277A14148n154L22351
16370D31345i8947B52328k0894I7819M12412j88605j2376m8010j10035p254J07388
16359B51339K34260k41679K84483h8621B70182o5259G6834A9517g0843B12784
16348B60674r348o1411n8720d3956D44045A30740K77357b9469p301C65040j22826
16337B42214K76686j32056n1658k6694k0938R241E1533c0989m4631C74937J22395
16326D97332A07148m4864K14061A10924K33920j36230N2079e463A49046A9747
16315A99221N9983F9083c5599A00589K407c1337D99949A16410b1492A09468R3253
$$ plain form
16391 14450 385633 411537 456115 156705 392992 390969 102672 248454 473936 326629
16381 326629 315424 175623 257354 196902 233363 283522 491569 -195277 114148 108994 431345
16370 431345 -98947 252328 231434 97819 510231 321626 309250 261240 151205 143951 251339
16359 251339 485599 243920 528403 -88621 270182 204923 76834 19517 -70843 212784
16348 260674 251326 189915 131195 -43956 444045 130740 408097 -29469 -36770 365040 242214
16337 242214 518900 386844 335186 308492 287554 296795 51533 -30989 -75620 374937 497332
16326 497332 107148 62284 276345 110924 344844 208614 260693 -5463 149046 19747
16315 199221 259204 69083 -35599 100589 102996 -31337 499949 116410 -21492 109468 202721
16304B02721K89133j78979I8498j6184J18544r5134J01361i2897B58326a22652
16293d71449B41914n235H3788J30634p6195i9021A40729J27703m3310L4914i1797
16281A82345E4629b12733d2177I8735B4850J06254l5918k7554P0770c354C4077
16269a90170B62666A8879a92304C31467J34562e8482k89223A49530g0180O925
16259f3255C0703L94120B09554g3599A84604b1575p7135A40824b72462N9246D7469
16247a33271j37477a20774c168A67090A6627N2873J34266D1596K19035q871c41809
16235D4555b30355R1636i690q0517A67680B3310d5610F4715J37454b2856H3769
16223b34481O3290A41756a0390j1685j14312F6005K48063b83217B69467J6332
$$ plain form
16304 202721 491854 312875 98498 82314 200858 105724 207085 -92897 258326 -122652
16293 -471449 241914 236679 83788 214422 138227 -99021 140729 268432 225122 260036 -91797
16281 182345 54629 -212733 -42177 98735 24850 131104 95186 67632 138402 -3354 34077
16269 -190170 262666 18879 -192304 331467 466029 -58482 -347705 149530 -70180 -63255
16259 -63255 30703 424823 209554 -73599 184604 -21575 -98710 140824 -272462 -213216 47469
16247 -133271 -270748 -120774 -3168 167090 16627 69500 203766 41596 260631 251760 -341809
16235 44555 -230355 -138719 -9690 -90207 167680 23310 -45610 64715 202169 -22856 83769
16223 -234481 -171191 141756 -10390 -22075 -136387 66005 314068 -283217 269467 285799
16213B85799q6765M5734B2314O4405a63174d6576A39187a9493A80472b9142A93964
16201A79299m4120K16674E1446L18935A23288f9412c0495C30738j04708n3022
16191A73008C6123R3088c04822B68068K69616A33995a89717H9643J13661r4854
16181A08450M7063b73133G6710k3446K68514c45016H1802h0096F0471J22084l7766
16170A44789A5234a21801O0494j0744k10350d3154G8814e5246D87722b45455i3956
16158b13062J8991A94715P106B5926m148J8685L4517J1235c5362G98K0208a10301
16145A37168j5263b55457f1902A14593a29697D82121a85948A01703a69899c2774
16134g2674j04301C80714G0245b38195D2411c93947R1351J07072p779A78641E8037
$$ plain form
16213 285799 199034 244768 22314 86719 -163174 -46576 139187 -19493 180472 -29142 193964
16201 179299 135179 351853 51446 370381 123288 -69412 -30495 330738 226030 173008
16191 173008 36123 129211 -304822 268068 537684 133995 -189717 89643 203304 108450
16181 108450 155513 -273133 76710 53264 321778 -345016 81802 -80096 60471 182555 144789
16170 144789 15234 -121801 -61307 -72051 -282401 -43154 78814 -55246 487722 -245455 -93956
16158 -213062 -194071 194715 201821 25926 21778 40463 74980 86215 -35362 798 21006 -110301
16145 137168 121905 -255457 -61902 114593 -129697 482121 -185948 101703 -169899 -32774
16134 -72674 -176975 380714 70245 -238195 42411 -393947 -302596 -195524 -203303 178641 58037
16122g4987B46424b40538a04433H2787g0409B82795b72329a23743A8926M17077
16112D36003f842k41494J11303l6052E144A878J36460O2193j187J17719j34764
16101A82299a4661H9309a36277j11895B26016e9222A84544A3222J10782a4076
16090a17338A30127b66527e0262E04335k34596Q0569A75115J04357Q4480c46511
16079e4313n422p7325c2497j85719i9017j00972C8225d39043Q7091A31888d33582
16067b33892C9703J72439r3857k6427d62291D9303A0856K1273Q7911a33115D6875
16055a3773k40322A41628K0079A8242b1587k51505B36947j0609q6449a59053j95435
16044c54488A4601b017A1597J51244A7896a84527d598B09016b10488A05972d99003
$$ plain form
16122 -74987 246424 -240538 -104433 82787 -70409 282795 -272329 -123743 18926 436003
16112 436003 -6842 -248336 -137033 -173085 5144 1878 138338 200531 199344 317063 182299
16101 182299 -14661 89309 -136277 -248172 226016 -59222 184544 13222 124004 -14076
16090 -117338 130127 -266527 -50262 504335 269739 350308 175115 279472 363952 -346511
16079 -54313 -59735 -137060 -32497 -218216 -99017 -199989 38225 -439043 -351952 131888 -433582
16067 -233892 39703 212142 118285 91858 -462291 49303 10856 32129 120040 -133115 46875
16055 -13773 -254095 141628 161707 18242 -21587 -273092 236947 226338 139889 -159053 -354488
16044 -354488 14601 -2017 11597 162841 17896 -184527 -4598 209016 -210488 105972 -499003
16032B28070f450k16588A68861M6525a3316l7501A50732E1031K56321a13157A54241
16020i3501J8592j45656l3721A0010a82268E9521b5392l0649A76432i962B54591
16008a29468r2064B83028e8581A22087n5237J02996b27989C52530g0382I9814
15997a2726H6516b14457A567J50649b18301h9643j39680o3540E7944b42041K9495
15986b12546j6144G674f6040C74912I2187b6497m3668A68486L489a16635A13398
15974i6307M7760A25046L9511a01344c9578l24316C0150b99148B52197a05578
15963A68696d3332k70689I3053m2431a83725F4923c7410k84783C2144J51891c29578
15951D0790a93921A2045a23085A3186P0643a02890M8102b6204k6227k5806r4471
$$ plain form
16032 228070 -6450 -223038 168861 215386 -13316 -50817 150732 51031 307352 -113157 154241
16020 -93501 -74909 -220565 -254286 10010 -182268 59521 -25392 -56041 176432 -9962 254591
16008 -129468 -221532 283028 -58581 122087 66850 169846 -227989 352530 -70382 99814
15997 -12726 86516 -214457 1567 152216 -218301 -89643 -229323 -292863 57944 -242041 -212546
15986 -212546 -228690 7674 -66040 374912 92187 -26497 -70165 168486 171975 -116635 113398
15974 -96307 -48547 125046 164557 -101344 -39578 -363894 30150 -299148 252197 -105578
15963 168696 -43332 -314021 93053 50622 -183725 64923 -37410 -322193 32144 184035 -329578
15951 40790 -193921 12045 -123085 13186 83829 -102890 -54788 -26204 -52431 -78237 -172708
15940a72708c7812I8319f4062c0037r0655k7850n6265K2648A60700h6328b2041
15928C89382h742k97674J3140j19340A90080b56506k17672H8587K38344i0665
15917c45629h5563j4129j48995A43121c12443a24255A76478b61190F3426R159
15907G2585a77829n0869Q5194d2220A55246n0739l2477J86952c4444k25028j05369
15896c64841J14685H5031a23247E2481b88470A21976D3716J1243J82136e3327
15885E3045K12204c27299A42698A990c9719B19574E4190a96939q0751C26177D927
15873a03207B02086a388n1688J124m9625M9024k9976B553a7735K56G9798a09073
15860b09125A07896m4606a13384c0737j24915m0036C51089H2192c20598J05575
$$ plain form
15940 -172708 -37812 98319 -64062 -30037 -120692 -148542 -204807 -182159 160700 -86328 -22041
15928 389382 -8742 -306416 -293276 -412616 190080 -256506 -474178 88587 326931 -90665
15917 -345629 -85563 -99692 -248687 143121 -312443 -124255 176478 -261190 63426 72585
15907 72585 -177829 -228698 -143504 -42220 155246 104507 72030 258982 -34444 -259472 -364841
15896 -364841 -250156 85031 -123247 52481 -288470 121976 43716 54959 237095 -53327
15885 53045 265249 -327299 142698 1990 -39719 219574 54190 -196939 -277690 326177 4927
15873 -103207 202086 -1388 -53076 -51952 -101577 -52553 -82529 2553 -17735 -17479 79798 -109073
15860 -209125 107896 63290 -113384 -30737 -155652 -195688 351089 82192 -320598 -215023
15850b15023A7825a20335f574j41193B45858B0579a25456A53780h5364k51842
15840c37206B4062J9404O220A7340L08214a98931m881L5221j57636g4522j25558
15829b00080E4706c31388g2167A36093a26834A0932J86709A0540b41481j47315
15819c88796j65D6320R1967C6819a69201A70072a81024L9097H3233a1553k81526
15808b93079h7383A94921f8603k30247Q6671b4939A86655c04733A37282a01152
15797G2988c8675k47762B33489K7858C2279j0362K17584I2427a01962j60456i6998
15785G2552b99386j3186a1267l42177a13621A29846b47398I684J63567A9200a97479
15773b10368r8512h5577A15408a24426a7972k06349n8436B33240a42882L8228
$$ plain form
15850 -215023 17825 -120335 -6574 -147767 245858 20579 -125456 153780 -85364 -337206
15840 -337206 24062 43466 49686 17340 325554 -198931 -203812 -168591 -326227 -74522 -200080
15829 -200080 54706 -331388 -72167 136093 -126834 10932 197641 10540 -241481 -388796
15819 -388796 -388961 46320 138287 36819 -169201 170072 -181024 -141927 83233 -11553 -293079
15808 -293079 -87383 194921 -68603 -298850 -212179 -24939 186655 -304733 137282 -101152
15797 72988 -38675 -286437 233489 261347 32279 21917 239501 92427 -101962 -262418 -96998
15785 72552 -299386 -312572 -11267 -353444 -113621 129846 -247398 9684 173251 19200 -197479
15773 -210368 -308880 -85577 115408 -124426 -17972 -224321 -282757 233240 -142882 -104654
15763a04654A71702F7614J1620K9675H407g5617a6590H3844k0442K9482H351c01482
15750a48588P1394B4965R9161b05575C26176j46372C7755J028M7775A4100a38451
15738D2609e35547a20108l9810N431D5082b7606D2094L43221D8177d7483m30461
15727d77944F374f6219l6041j44266I5233b22739L4269P1379I7405C7233M7987
15716H5220a82612D0345j6278J84494b97644A4154b85180j24435d1017A53407
15705h0063F1648h3230l8923A62029F8332c365C87591A91655a29987d8714m6011
15694i4725A41194C7600e5416H4514g5216n9210A394K75506I3369a67794E2600
15682A9291e5261C11968j02702a17462m9826A06541e6023A78062h0840A90359
$$ plain form
15763 -104654 171702 67614 79234 108909 8407 -75617 -16590 83844 63402 92884 8351 -301482
15750 -148588 -77194 24965 124126 -205575 326176 179804 37755 38783 86558 14100 -138451
15738 42609 -535547 -120108 -159918 -154487 45082 -27606 42094 385315 48177 -47483 -477944
15727 -477944 6374 -66219 -102260 -246526 95233 -222739 -188470 -117091 97405 37233 85220
15716 85220 -182612 40345 24067 208561 -297644 14154 -285180 -409615 -41017 153407
15705 -80063 61648 -83230 -122153 162029 68332 -3365 387591 191655 -129987 -48714 -94725
15694 -94725 141194 37600 -55416 84514 -75216 -134426 1394 276900 93369 -167794 52600
15682 19291 -55261 311968 209266 -117462 -167288 106541 -56023 178062 -80840 190359
15671C7555J6462M2105i3663q1738O6243B0585a7888q5769d367j66975B4259c6706
15658a40625A91935a08385J7420k8454E0318j681b34070a843B1353J35121j7943
15647A38531q757D729b1757A87699b0282j29244B41105A2434O1769J05790a82064
15635I5923K90108b00920K2235g3113C42216A0332f7344k97886g1685j44842A62677
15623a49976F9861J70593d06827A30817R4034e9682R820A13434g2945D2080b53812
15611A79326F3798J87365c85489J87827j2580d584C18131H0445a26127A31855
15600a05755G4106L34993F6774b00362I6547k5858j3202b43586A67178E282a91045
15588c49157a40212B37011A0914h8059m6344L4763m7407B78148a6773A72724P4886
$$ plain form
15671 37555 54017 96122 -93663 -175401 -109158 20585 -17888 -103657 -4367 -171342 24259 -36706
15658 -140625 191935 -108385 -90965 -119419 50318 48637 -234070 -1843 21353 156474 138531
15647 138531 129774 4729 -21757 187699 -20282 -149526 241105 12434 74203 179993 -182064
15635 95923 386031 -200920 -178685 -73113 342216 10332 -67344 -365230 -71685 -216527 162677
15623 -149976 69861 240454 -406827 130817 224851 -59682 -49862 113434 -72945 42080 -253812
15611 179326 63798 251163 -385489 -197662 -210242 -4584 318131 80445 -126127 131855
15600 -105755 74106 409099 66774 -200362 96547 70689 57487 -243586 167178 5282 -191045
15588 -349157 -140212 237011 10914 -88059 -134403 -99640 -147047 278148 -16773 172724 247610
15577B47610a42747k7384d7097J8142a335j15643d8306j59789q5568F0470J33315
15566A93785a68998j1641c2199D9782R1969a23710B89949j34796b17037B85643
15555D4969a27946j8494q6920L5803A56418p7366b37311c8139i246r8743j06757
15544b14746A9811a99430j36324h0469J4552A57676k6854g2080H431f4420A67268
15532b38697h2740A8493K00736b6460A92941b010j38303N5870j77887k40457A48361
15520G464P4877a80165e9831j07373O7115A82510b9804j05569B3003g6605A81378
15508a71432j58354a0966B10830b89658p8098L0511b0468j22558B1842b8674C02386
15496G2269a49371C4119J025g6732q4066A18189b20930H2186i2780E1477c27824
$$ plain form
15577 247610 -142747 -170131 -47097 -28955 -1335 -116978 -48306 -208095 -293663 60470 193785
15566 193785 -168998 -180639 -32199 49782 141751 -123710 289949 155153 -217037 285643
15555 44969 -127946 -146440 -233360 -197557 156418 79052 -237311 -38139 -9246 -107989 -214746
15544 -214746 19811 -199430 -335754 -80469 -65917 157676 130822 -72080 8431 -64420 167268
15532 -238697 -82740 18493 219229 -26460 192941 -2010 -140313 -84443 -262330 -502787 148361
15520 7464 82341 -180165 -59831 -167204 -100089 182510 -29804 -135373 23003 -76605 181378
15508 -171432 -329786 -10966 210830 -289658 -367756 -337245 -20468 -143026 21842 -28674 302386
15496 72269 -149371 34119 35144 -76732 -160798 118189 -220930 82186 -92780 51477 -327824
15484B69416b72636j8620a33332I1325l4773f4377A54483K06590b56703G177O501
15473A3678O9483k5090k3002J26635R4601a10853e2386h866j77143G3140c10136
15461D857K21300B8807a34127j0840B91401j33607a01158B32366b66709i8099
15450a94775A20879c09465a1209j28474M5034B10841a18786m2506f367H888a12239
15438H6614c41656J58762A01683b67875J12270H3151c43521A95836a3261A02526
15427G394a64091A6179J51206a98071j5675A14746d0729j55695e5900G9748l0653
15416D9095a99546C19564g8453A46823d5941k21406H8715a44927a4342k6187o518
15405d7047B23572B7063J01544D5918J46336m0199A7575a03492B54849D0414J73001
$$ plain form
15484 269416 -272636 -291256 -133332 91325 56552 -64377 154483 361073 -256703 7177 13678
15473 13678 83161 58071 35069 161704 256305 -110853 -52386 -8866 -186009 73140 -310136
15461 4857 226157 28807 -134127 -144967 291401 157794 -101158 232366 -266709 -98099
15450 -194775 120879 -309465 -11209 -139683 -94649 210841 -118786 -161292 -6367 8888 -112239
15438 86614 -341656 -182894 101683 -267875 -155605 83151 -343521 195836 -13261 102526
15427 7394 -164091 16179 167385 -198071 -213746 114746 -40729 -196424 -55900 79748 49095
15416 49095 -199546 319564 -78453 146823 -45941 -267347 88715 -144927 -14342 -40529 -47047
15405 -47047 223572 27063 128607 45918 192254 152055 17575 -103492 254849 40414 213415
15394B13415i0395G4854A2976J61349b42719A49053F652b7616j99814G0560J55421
15383B25981a72400j08849B28998a14079a4407j19838C61654E0411a25077j20555
15373b45632d184B41314E651a12021B40449c5660C6322i0956B8476K00397j4752
15362B14121p8560K51496c61676O2803C35882M7091A05240K05037A0049a01865
15351a4211k00270D2399K14329O4698f5632j32110D6290D300a00449j33014n2906
15340b86369D32987j71113L10657E5232d5978a7938k9268k32866E3440b10770
15329G9564Q110A6867a29708d9301k19251C6000a0633k8682F1350K09380A6354
15317i5780B10044g900k47718h418j86190N6394E1488h8657J6221B09351o7576
$$ plain form
15394 213415 -90395 74854 12976 174325 -242719 149053 6652 -27616 -227430 70560 225981
15383 225981 -172400 -281249 228998 -114079 -14407 -134245 361654 50411 -125077 -245632
15373 -245632 -4184 241314 5651 -112021 240449 -35660 36322 -90956 28476 228873 214121
15362 214121 135561 387057 -361676 -298873 335882 382973 105240 310277 10049 -101865
15351 -14211 -214481 42399 256728 321426 -65632 -197742 46290 4300 -100449 -233463 -286369
15340 -286369 432987 261874 572531 55232 -45978 -17938 -47206 -280072 53440 -210770
15329 79564 87674 16867 -129708 -49301 -268552 36000 -10633 -39315 61350 270730 16354
15317 -95780 210044 -7900 -255618 -8418 -194608 -138214 51488 -88657 -72436 209351 141775
15306A41775b9357I6921a62381A77503l6059L575b39129A83415J73632b22910
15295C27595i9553o676D1314a36773B02669b8013E1196M62373a46798P547b2862
15283B86875a77795B19379L9920c32090A66816q2939P4182J57872a30577b3060
15272c7198B14024d82515I5416P9782d7879k06560b5347H3523b48869K4567m4753
15261b69055a18010A09389a86813N5501D23320j69199B2953M9638a76268A3172
15250B66097K29751L09028M77350m86835J68680J16346C44857B1289a65825A65966
15239a00646E7674L6948P5050G9387b17719I2266J60808G8346M2309j4427P495
15228A13723a88459P2740q0704f105j30900n3918B31203I8075J59518j21953l113
$$ plain form
15306 141775 -29357 96921 -162381 177503 141444 145019 -239129 183415 357047 -222910
15295 327595 -99553 -106229 41314 -136773 202669 -28013 51196 513569 -146798 -139251 -22862
15283 286875 -177795 219379 259299 -332090 166816 83877 158059 315931 -130577 -23060
15272 -37198 214024 -482515 95416 175198 -47879 -254439 -25347 83523 -248869 -224302 -269055
15261 -269055 -118010 109389 -186813 -131312 423320 254121 22953 72591 -176268 13172
15250 266097 495848 804876 1282226 795391 964071 1080417 344857 21289 -165825 165966
15239 -100646 57674 94622 169672 79387 -217719 92266 253074 78346 120655 106228 113723
15228 113723 -188459 -115719 -196423 -6105 -137005 -190923 231203 98075 257593 135640 132527
15217A32527i3885M4976A08330L609J77530O0822A70371b95096g7464A94540k3868
15206A70672a45524a9625C76157J61573a60222E4698L47932B5147a58230B1198
15195b12179E5366Q0148n6487J14493I2584f1124B66479j9412b3770J1307A20065
15183A4118j956L05681m3428i7445M6796A35587L7247o1402E3492R1861J05229
15172B50582j09791a4278o8262K2149l7739L7470A9975a1970A5346b7146A09931
15160d4421B24338j00651a01850E4639d818C32579D4168a54346B71418G6569e1847
15148a35125e7599a970C28329e485A75394K821J0699I1137J06123G477J19387
15137A26864P00K59321A18870L4168l3425a26508e8036I9682O4842D8848M5066
$$ plain form
15217 132527 -93885 -48909 108330 111939 289469 350291 170371 -295096 -77464 194540 170672
15206 170672 -145524 -19625 376157 537730 -160222 54698 402630 25147 -158230 21198
15195 -212179 55366 135514 79027 193520 92584 -61124 266479 247067 -23770 -12463 120065
15183 14118 12162 317843 274415 -97445 -50649 135587 172834 111432 53492 145353 250582
15172 250582 140791 -14278 -82540 -60391 -98130 -60660 19975 -11970 15346 -27146 109931
15160 -44421 224338 123687 -101850 54639 -4818 332579 44168 -154346 271418 76569 -51847
15148 -135125 -57599 -1970 328329 -5485 175394 178215 188914 91137 197260 7477 126864
15137 126864 127564 386885 118870 153038 119613 -126508 -58036 99682 164524 48848 93914
15126I3914D6510k680a64981g5404B31062d654H1778N1965A0218K9968J09578
15115A49764o3051K98487G2989J06955d66683B6982L140K99014j61674n373J56048
15104C18137j46534J27162j06827R151p8710b6413J0048G7552J19489K7063e4016
15092d03721A9484O6554O677m1005M383M63121B21777g8587A45340J55198c6111
15080a16327K7096D81871g2609B25549a0657A75101a86286H6359C3454O2055k330
15069I3179J55560a43096B99500j41812k1792o947J7832D6434L22102f5431K811
15058f2620G5349A0347K79006P1441c5746C4455N26726A31105J69197l3714d1976
15046F5098J99721b84603C29492E1360B0467K59355D0105J1599J68956n3746K16165
$$ plain form
15126 93914 46510 43830 -164981 -75404 231062 -4654 81778 133743 10218 40186 149764
15115 149764 86713 385200 72989 179944 -466683 26982 30122 329136 167462 162089 318137
15104 318137 171603 298765 191938 201089 122379 -26413 -16365 77552 197041 224104 -54016
15092 -403721 19484 86038 92715 51710 56093 519214 221777 -78587 145340 300538 -36111
15080 -116327 -89231 481871 -72609 225549 -10657 175101 -186286 86359 33454 95509 93179
15069 93179 248739 -143096 299500 157688 135896 128949 146781 46434 368536 -65431 -62620
15058 -62620 75349 10347 289353 360794 -35746 34455 561181 131105 300302 266588 -41976
15046 65098 264819 -284603 329492 51360 20467 279822 40105 51704 220660 166914 383079
15035C83079n9594P84J17538j54885M6121o2805m1813l8153d4482A18075L52659
15024D70734e4096B19228j05033Q1262J42835A24623J84825d7497D79895A46701
15013C23087q3062A17292J33438K42203A77047E9613J41946l8138E8618M35002
15003D93620a50282E30803m754A39659J05224i693C73080n541p7366A37611J49734
14992B87345k4701m5847r5938Q5790A1322J08682E4450K79853K9094a28691e9699
14980A15721L77810A32761J09070a24916D03900q2993I1902K23703n4402K621
14970B63824J60806k7868a86343E04016a28448F96930r2641A66127a66349C64294
14959D71347A36758a43746C32354N0651A75203k4946L95315H2658R0756K43315
$$ plain form
15035 383079 323485 324269 441807 286922 333043 270238 228425 190272 -44482 118075 470734
15024 470734 -54096 219228 114195 195457 338292 124623 309448 -47497 479895 146701
15013 323087 240025 117292 250730 492933 177047 59613 201559 163421 58618 493620
15003 493620 -150282 530803 526049 139659 244883 -9693 373080 367539 290173 137611 287345
14992 287345 262644 216797 120859 206649 11322 120004 54450 334303 363397 -128691 -59699
14980 115721 493531 132761 241831 -124916 403900 320907 91902 315605 261203 263824
14970 263824 424630 396762 -186343 504016 -128448 696930 604289 166127 -166349 364294
14959 471347 136758 -143746 332354 383005 175203 150257 545572 82658 173414 416729
14949D16729N2518I5793M67284A71274G1659L04102A68153J8781K63163I6348
14938D6701K79869M9843j87896j6023r081L18801A5223J72097p3815L615J73308
14927B90428p8867G5816K57313A21135J18678a21696C05762J67751j53732l5374
14917B84407A15611K57569j65026K40711A53753e2124A29909N6369P4951J92051
14907D53280j14255r2929j13726R6360K1472f9353l2374e0113H780M69215j10478
14896C67517G9551M32083g7732B93463A02111K86523j85649P0527F3193L11424
14886C74617A36835J44103n6400o8186K36818b06500B44712h0647D06018K38892
14876F44910C10093R0424A72511r25L49838q2929j18458M2480M2648J95107k15527
$$ plain form
14949 416729 469247 95793 563077 171274 71659 375761 168153 186934 450097 96348
14938 46701 326570 376413 188517 172494 163413 482214 15223 187320 113505 117120 290428
14927 290428 211561 75816 333129 121135 239813 -121696 305762 473513 319781 284407
14917 284407 115611 373180 208154 448865 153753 -52124 129909 186278 261229 453280
14907 453280 339025 246096 132370 228730 250202 -69353 -101727 -50113 8780 477995 367517
14896 367517 79551 511634 -77732 293463 102111 388634 202985 273512 63193 374617
14886 374617 136835 280938 224538 156352 393170 -206500 244712 -80647 406018 644910
14876 644910 310093 400517 172511 171586 521424 438495 320037 362517 405165 600272 384745
14865C84745J13883j22299M5278B09035J419K71090J54938B76402K05240j68598
14855C13044P453p4928O5712M4397q0300K05134j32186L13460B92287K6802J9156
14844C38245Q0666K73909B66482A18791L14169j0794J41136j90801R3034d4189
14833C81017M40882G7085N41359B30340O74880C85787J58036k14974J05277R2537
14823E26663j29402K32818B24252G4412K44835q1294K33238j52428J85960L9520
14813E44243p0434A61804D0426L71752q8753R9574r8577j22163L29478L67572
14803H99309D44295O3383B20033L33653J38306k80744J6845j87236L05087k56811
14793B89133A07486J78523J34940J73440K62700l34401K28551k11189k11432O0242
$$ plain form
14865 384745 498628 376329 421607 209035 210454 481544 636482 276402 481642 313044
14855 313044 320497 245569 311281 355678 275378 480512 348326 661786 292287 319089 338245
14844 338245 418911 692820 266482 118791 432960 422166 563302 372501 465535 -44189
14833 381017 821899 77085 618444 230340 905220 385787 543823 328849 434126 526663
14823 526663 397261 630079 224252 74412 319247 237953 471191 318763 504723 544243
14813 544243 473809 161804 40426 412178 323425 422999 324422 202259 531737 899309
14803 899309 444295 507678 220033 553686 691992 411248 428093 240857 545944 289133
14793 289133 107486 286009 420949 594389 857089 522688 751239 540050 328618 388860
14783C88860J89997j15747K38638B00075M86934k86934K91299j10809j31307J29062
14773E78320M5216j49436K59603C20472Q6201n0323K44018Q9540j93689j63307
14763C32912P2253L04183R0412j60501R0252r5798j30047j99541K0255K02133
14753E26513J03052j8250j39737J9335J5813K42580j49596J45832R767J8907k16175
14742E58041R5903l11743J38278A89283P37354q951B46296L59450j18362L43389
14732H30773K87414k94078j28826k1428r5960L55212j12922j83632J19794j80034
14722E76313L67043D31941K17966J17392N95j49021L921J75985j06146l28974
14712C63659J86314M05926l36727J09252o7869K2424k3782J85747j3583M1480
$$ plain form
14783 388860 578857 463110 701748 200075 687009 400075 691374 580565 449258 578320
14773 578320 623536 474100 733703 320472 406673 356350 600368 689908 496219 332912
14763 332912 405165 709348 799760 639259 729511 633713 503666 304125 324380 526513
14753 526513 629565 611315 471578 490913 506726 749306 599710 745542 755309 774216 558041
14742 558041 653944 342201 480479 189283 926637 917686 246296 605746 487384 830773
14732 830773 1118187 824109 695283 673855 577895 933107 820185 636553 756347 576313
14722 576313 943356 431941 649907 767299 767894 618873 622794 798779 692633 363659
14712 363659 549973 955899 619172 728424 660555 682979 659197 844944 831361 872841
14702H72841k86282Q0440Q6974m7303k0394J94342j55709P103j74247j6860L6429
14691E77334J58286M41472m70730K05468J56131M8575l85606L07244j16095P676
14681I29755K68594l39805l54372P87870n08976L4416p0312j07376N48705k73030
14671I15469J00964j07110n2476K53535P0223j93402l42700M51902j58072n8299
14661H80034k19676M54280l13616L32833j37382k29096K72786p1263l8501J67767
14651A098166j1111m03177M5137N40907O7977k57848J75644l02984R3117M8235
14641A094063M0082K47732o7989l24000J56215J89360j94934j16194J9876L26322
14631A370533j15646K2404L9177l96949K89614J79831k42233L5697o112k99980
$$ plain form
14702 872841 586559 666999 753973 706670 686276 880618 724909 732012 557765 540905 577334
14691 577334 735620 1177092 706362 911830 1067961 1116536 730930 1038174 922079 929755
14681 929755 1198349 858544 504172 1292042 783066 817482 747170 639794 1188499 915469
14671 915469 1016433 909323 856847 1110382 1180605 987203 644503 1096405 938333 880034
14661 880034 660358 1114638 801022 1133855 996473 767377 1040163 968900 930399 1098166
14651 1098166 1087055 683878 729015 1269922 1337899 1080051 1255695 952711 1045828 1094063
14641 1094063 1134145 1381877 1313888 989888 1146103 1335463 1140529 1024335 1044211 1370533
14631 1370533 1254887 1277291 1316468 919519 1209133 1388964 1146731 1182428 1176316 876336
14621H76336O59684k56794n29100M02907K79134j00527k9137J35157j00933K12728
14611A549455j23270K8282l26362L06301K32924l18086L39389n12834N47142k12036
14601A510905n4106O8857l2745k94049N07659m40684K30362J34052l30216M97228
14591A797263m0651J30511k0852m21075N2522J38959J62905j34832L75311m14282
14581A625779K42905k74399K25596Q6778N8743j95968k03020M27735J16600J8672
14571B129421r9935J22317l92418J94564K25207J57901j14597J8984p0619L49509
14561B520334k12814N22582k92381r5132J90916Q1742J47536L38104K65664P05032
14551D171583K36931J122450K107177M711500J0377201K2559754m872313A7219052
$$ plain form
14621 876336 1536020 1279226 750126 1153033 1432167 1331640 1302503 1437660 1336727 1549455
14611 1549455 1426185 1454467 1128105 1434406 1667330 1349244 1688633 1175799 1722941 1510905
14601 1510905 1456799 1525656 1492911 1198862 1706521 1265837 1496199 1630251 1300035 1797263
14591 1797263 1756612 1887123 1866271 1445196 1497718 1636677 1799582 1664750 2040061 1625779
14581 1625779 1868684 1594285 1819881 1906659 1965402 1769434 1566414 1994149 2110749 2129421
14571 2129421 2029486 2151803 1759385 1953949 2179156 2337057 2222460 2241444 2170825 2520334
14561 2520334 2307520 2830102 2537721 2442589 2633505 2715247 2862783 3200887 3466551 4171583
14551 4171583 4408514 5530964 7638141 12349641 22726842 45286596 40414283 17219052
14542F782393l140267j053188l64080m80256L87158n24630K96919j54196m0121
14533A709732K50515j30811L51911K43253l45708l23967N63444l57235M66357
14524B427491m28889K10405M5182j43439K19538K25551o084m38997M07270k06109
14514B311919J08850k10207L0855L36465K29128l40953K92722m31873K93389O5515
14504B685810O3365J92771j55264J39521m1848j56795K74499j55253L33774j09289
14494C071291j93119r0111O8656M40517j97302J69429L58471k55448J31567j19166
14484C384785K8003K42361k41988J65666j71395J28262J71169M052J04190n20640
14474C294465N13381O8009J36996k61753K29294k63044O49337l11189j37487L87100
$$ plain form
14542 6782393 3642126 2588938 2224858 1744602 2131760 1607130 1904049 1749853 1709732
14533 1709732 1960247 1829436 2181347 2424600 2078892 1754925 2318369 1961134 2427491
14524 2427491 1998602 2209007 2254189 2110750 2330288 2555839 2549755 2110758 2518028 2311919
14514 2311919 2420769 2210562 2241417 2577882 2807010 2466057 2758779 2326906 2620295 2685810
14504 2685810 2749175 2941946 2786682 2926203 2884355 2727560 3002059 2846806 3180580 3071291
14494 3071291 2878172 2788061 2856717 3297234 3099932 3269361 3627832 3372384 3503951 3384785
14484 3384785 3412788 3655149 3413161 3578827 3407432 3535694 3706863 3710915 3815105 3294465
14474 3294465 3807846 3875855 4012851 3751098 3980392 3717348 4366685 4055496 3918009 4305109
14464D305109l86323K61216M35447l79421N6505Q2619l3059R5681j20235N89804
14454D907343j1152j47146k82971O20889o72627P24333j44215K36872m3524J8250
14444E206052K22031k60808L04930K06017P5717K9891j55873K028J48300K86889
14434F065174J18870k24862M858L70048M1890P3010L530j03771L35397K69530
14424F953674L1328n2670j59613J71067N10755o7093m09500M05912J42827Q3242
14414G609929o5421L68994M9006q6824L29313J92948k71420P72626J03035M40665
14404I442851m26149N84218j16826Q3697J19085J80383L78469K19915j46470J46778
14394A0465951J09011N98651l09733k89195J057081R3035J25286K32567k12964
$$ plain form
14464 4305109 3918786 4180002 4615449 4236028 4292533 4375152 4342093 4437774 4317539 4907343
14454 4907343 4896191 4749045 4466074 5086963 4414336 5138669 4994454 5231326 5187802 5206052
14444 5206052 5428083 5167275 5472205 5678222 5753939 5783830 5627957 5629985 5778285 6065174
14434 6065174 6184044 5959182 5964040 6334088 6375978 6448988 6452518 6348747 6684144 6953674
14424 6953674 6985002 6932332 6772719 6943786 7454541 7387448 6977948 7383860 7526687 7609929
14414 7609929 7544508 7913502 7962508 7875684 8204997 8397945 8126525 8899151 9002186 9442851
14404 9442851 9016702 9600920 9484094 9567791 9686876 9867259 10245728 10465643 10319173 10465951
14394 10465951 10574962 11173613 10863880 10574685 11631766 11724801 11850087 12082654 11869690
14385A1869690L54079J73438L32537j0109O88423K8471K39865L11263J40348K50197
14375A4378202N95949L21236M79866l69214O21331M27039J05347L23264L19724
14366A7202744Q27903j8833N55123K65055P37782J56982M07871N35473N69586
14357B1239686M79376N51710N32102L30435M53885J090694K77670L65739Q74044
14348B6195341J001108M3260J073497M33150J207435O62631J021086M14619Q12377
14339C2864504Q83539J432382P83743J118105J188594R53143J495018R58526J619136
14330D3296690P85868J777158J528650J377580J666884J592586J908705J924856
14322E5858977J888930K146015J919919K538971K593229K588863K514076L009387
$$ plain form
14385 11869690 12223769 12397207 12729744 12719635 13408058 13436529 13676394 13987657 14128005 14378202
14375 14378202 14974151 15295387 15775253 15406039 16027370 16454409 16559756 16883020 17202744
14366 17202744 18030647 18011814 18566937 18831992 19569774 19726756 20134627 20670100 21239686
14357 21239686 21719062 22270772 22802874 23133309 23587194 24677888 24955558 25321297 26195341
14348 26195341 27196449 27239709 28313206 28746356 29953791 30616422 31637508 32052127 32864504
14339 32864504 33748043 35180425 35964168 37082273 38270867 39224010 40719028 41677554 43296690
14330 43296690 44082558 45859716 47388366 48765946 50432830 52025416 53934121 55858977
14322 55858977 57747907 59893922 61813841 64352812 66946041 69534904 72048980 75058367
14314G5058367K616094L307114L367308L702553L632617M216941M006600M344361
14306A04251955N066231M789277N381842N984027O099798O182725P124618P559429
14298A52439902Q078393Q143327R030641R344613J0326282J0515435J1626028
14291B19504621J2012303J2790599J3035263J4170684J4840516J5077783J6276230
14284C17707999J6641016J6596132J6819515J7011501J6134747J6200908J5365699
14277D32477517J4038904J2533009J0267966P213577L439518J062672n01107k059054
14269D78473002n005206l806600q584790r715276j1990417j3928027j5084893
14262D10357793j5894823j6900173j7508338j7651279j6543682j6869636j6183213
$$ plain form
14314 75058367 77674461 80981575 84348883 88051436 91684053 95900994 99907594 104251955
14306 104251955 109318186 114107463 119489305 125473332 131573130 137755855 144880473 152439902
14298 152439902 160518295 168661622 177692263 187036876 197363158 207878593 219504621
14291 219504621 231516924 244307523 257342786 271513470 286353986 301431769 317707999
14284 317707999 334349015 350945147 367764662 384776163 400910910 417111818 432477517
14277 432477517 446516421 459049430 469317396 476530973 479970491 481033163 480532056 478473002
14269 478473002 473467796 469661196 461076406 451361130 439370713 425442686 410357793
14262 410357793 394462970 377562797 360054459 342403180 325859498 308989862 292806649
14255B92806649j4490426j4482654j4078964j3351109j2722123j1796560j0815795
14248B01069018j0547625r553741r115044q563573p893896p253578p551688o487341
14240A34102532o452357o159879n128750m947115m715068n043735m462868l983661
14232I3209099l746681l291584l477176l493300l169246l040564k121763l206533
14224F7662252k493923k081991k370614k104406j816684k102639k019786j622081
14216E1050128j429301j622346j362425j255514j727629j312286j555284r30254
14208C9855089r09140k40727j456076j434200j280287o61576r96730n31448m79903
14199C1865002j425095p37306r18146n76677p10175m13974j146173n07289n45781
$$ plain form
14255 292806649 278316223 263833569 249754605 236403496 223681373 211884813 201069018
14248 201069018 190521393 180967652 171852608 163289035 155395139 148141561 140589873 134102532
14240 134102532 127650175 121490296 116361546 111414431 106699363 101655628 97192760 93209099
14232 93209099 89462418 86170834 82693658 79200358 76031112 72990548 70868785 67662252
14224 67662252 65168329 63086338 60715724 58611318 56794634 54691995 52672209 51050128
14216 51050128 49620827 47998481 46636056 45380542 43652913 42340627 40785343 39855089
14208 39855089 38945949 38705222 37249146 35814946 34534659 33873083 32876353 32344905 31865002
14199 31865002 30439907 29702601 28784455 28207778 27497603 27083629 25937456 25430167 24884386
14190B4884386m66601n99805p77138k91736n35091m86291p66666o5104n77510
14181B0318444n99607l58178l41982n83273j10687n65581j59170n33590k65541
14172A6800835l20960l10941j40130l89045l51311j58782l78218n98210J92468
14163A4345706l85255k29270k49401l39387k05417l38716k53213j67066j54307
14154A2023674j95569l81381K93101k85988o76129J78848j71476J68673p32715
14145A0221038K34096k94879m85679J59446p6728m48294o8728k17340J74019k29960
14135H966991o7595k98616K0371k62859N8888l95841K33572r0218l21941j64952
14125G677800L68811p10403Q7339k15485j14674J90084p5068k89041j74286J68992
$$ plain form
14190 24884386 24417785 23817980 23040842 22749106 22214015 21727724 20961058 20895954 20318444
14181 20318444 19718837 19360659 19018677 18435404 18324717 17759136 17599966 17066376 16800835
14172 16800835 16479875 16168934 16028804 15639759 15288448 15129666 14751448 14153238 14345706
14163 14345706 13960451 13731181 13481780 13142393 12936976 12598260 12345047 12177981 12023674
14154 12023674 11828105 11446724 11739825 11453837 10777708 10956556 10785080 10953753 10221038
14145 10221038 10455134 10160255 9674576 9834022 9757294 9309000 9240272 9022932 9196951 8966991
14135 8966991 8899396 8600780 8621151 8358292 8417180 8021339 8254911 8164693 7842752 7677800
14125 7677800 8046611 7336208 7423547 7208062 7093388 7283472 7208404 6919363 6745077 6914069
14115F914069k04931j34132J13211m67908K55832j47696J17043k60331k78266
14106E906891k5707K20200j74524j23602j4931j16301k96479L36812l71951j71803
14096E168605J62220o5331k33063J80458j13395j05125k71467J73787J99037m72729
14086D622997J78880n22460L46019k11136J90535q6862j50490L07596n54978R66
14076D121067Q2271j00049n9550K41199k03737o7560J52133j89912j83575L03145
14066D095432q4119l18139J44684k16983J52175r0716r3019K56631r6403k4513
14056C725030o31890M73879K2363l45795J05520P409O5771j44443j84340J14140
14046C207644J38290j30973j26402L0099j36901K2014J13430l02128K31288m3592
$$ plain form
14115 6914069 6709138 6575006 6688217 6220309 6476141 6328445 6445488 6185157 5906891
14106 5906891 5881184 6101384 5926860 5803258 5788327 5672026 5375547 5712359 5340408 5168605
14096 5168605 5330825 5265494 5032431 5212889 5099494 4994369 4722902 4896689 5095726 4622997
14086 4622997 4801877 4279417 4625436 4414300 4604835 4517973 4367483 4675079 4120101 4121067
14076 4121067 4203338 4103289 4043739 4284938 4081201 4013641 4165774 3975862 3792287 4095432
14066 4095432 4011313 3693174 3837858 3620875 3773050 3682334 3589315 3845946 3749543 3725030
14056 3725030 3093140 3567019 3589382 3243587 3349107 3356516 3422287 3277844 3093504 3207644
14046 3207644 3345934 3214961 3088559 3118658 2981757 3003771 3117201 2815073 3046361 3002769
14036C002769j7807j31333Q726l26610Q15335k81580l29870K99740M6596l42201
14026B743765J03055l47322J6903J08404l41475M74308m82423N8223J57700j98980
14016B292158n0026J02942j70342P9596j42887j22885j45376K82564k64474J97022
14006B058292p1498k00326K80463J0006J5987O2732l04761J30397m2526L8356
13996A977122j92058l9820K42423k51302O49212r5880N46891J098770L092823
13987G028181Q467435K3227847L176667k0692008A0571598l497533j878387j083864
13979D111814k72251m42085k82126l60309k866k06233J66904k17536j39482Q4601
13969B440431l05782K94306r827l14239J907k57610N80363j51059l97822J31025
$$ plain form
14036 3002769 2984962 2853629 2862355 2535745 3351080 3069500 2739630 3039370 3085966 2743765
14026 2743765 2846820 2499498 2516401 2624805 2283330 2757638 2275215 2333438 2491138 2292158
14016 2292158 2242132 2345074 2174732 2254328 2111441 1988556 1843180 2125744 1861270 2058292
14006 2058292 1986794 1786468 2066931 2076937 2092924 2155656 1850895 1981292 1938766 1977122
13996 1977122 1785064 1745244 1987667 1736365 2385577 2289697 2836588 3935358 7028181
13987 7028181 15495616 38723463 41900130 21208122 10571598 7074065 5195678 4111814
13979 4111814 3839563 3397478 3115352 2755043 2752177 2545944 2712848 2495312 2355830 2440431
13969 2440431 2134649 2428955 2419128 2104889 2106796 1849186 2429549 2278490 1880668 2011693
13959B011693m4718l52825M6635L29457K44509o17566K28826J54516j96157p4797
13949A729573O862L72935r1987l01723M750o8351J39520j90579K10724l32190
13939A479534j21151j1911L62945j61671J80144j94954J87831k29245J92157k53420
13929A430259K4294M11440n05299k29236K68390L670q1517Q8161J53726k33153
13919A330735K88347m60563K77829J71600J90068k41100m83263K02647J50674
13910A426974K47824m86364j56480O77793m23267j51546L21897l0707l56378M0357
13900A110103J26592k10950K46304l55167L20843k66448L24195K86518l39512
13891A242478o8208P9035l27272M67320k84696j42148L39098n1693j23919L4432
$$ plain form
13959 2011693 1966975 1614150 1660785 1990242 2234751 1617185 1846011 2000527 1804370 1729573
13949 1729573 1736435 2109370 2017383 1715660 1720410 1652059 1791579 1601000 1811724 1479534
13939 1479534 1358383 1346472 1709417 1547746 1727890 1532936 1720767 1491522 1683679 1430259
13929 1430259 1454553 1865993 1360694 1131458 1399848 1403518 1322001 1410162 1563888 1330735
13919 1330735 1619082 1158519 1436348 1607948 1798016 1556916 1073653 1276300 1426974
13910 1426974 1674798 1188434 1031954 1709747 1286480 1134934 1456831 1426124 1069746 1110103
13900 1110103 1236695 1025745 1272049 916882 1237725 971277 1295472 1581990 1242478
13891 1242478 1174270 1253305 926033 1393353 1108657 966509 1305607 1253914 1129995 1164427
13881A164427k24302N4543J02028M66533n14227m7784M7546k23326L01124j23772
13871A002790O3335j96519J97794l25574J28973O9932q1828K03071K1324D39999
13860I81821P3966q023m818N1201r9315J19169k29625K01609M0426m85746N31762
13849A172427k19976q4809k07235K60366L06280l11133R6527k5541j06212j52822
13839G27872K61035K5973l37863L51137M5754j96700J66759k12215N32654E56278
13828H03240J09637C88105M39333Q4338l5021l43318J32457L01433J35435m64111
13818F38651K16561J09275m29550K15411L7408j4587L89282l55860N5302p1464
13808G90429J55580L9191C37548N81567k78536m9297L84158j17992o1660l2127
$$ plain form
13881 1164427 940125 994668 1096696 1563229 1049002 1001218 1048764 825438 1126562 1002790
13871 1002790 1066125 869606 1067400 741826 870799 940731 858903 1061974 1083298 439999
13860 981821 1055787 1047764 1042946 1094147 994832 1114001 884376 1085985 1126411 640665 1172427
13849 1172427 952451 867642 660407 920773 1227053 915920 1012447 986906 880694 727872
13839 727872 988907 1014880 677017 1028154 1073908 877208 1043967 831752 1364406 556278
13828 803240 912877 388105 827438 911776 876755 533437 665894 967327 1102762 638651
13818 638651 855212 964487 534937 750348 787756 773169 1162451 806591 861893 790429
13808 790429 946009 985200 337548 919115 640579 591282 975440 857448 795788 763661
13798G63661k97462M68605l67474j3754K04863q4791J89594j59475q3920p5357
13788E44490K37720k37736M46757j1678l82981r3035j5871l1715K94818j55542
13778E95227M7839J47892k68249L42126C52825N14771C72578L89360j29500J07796
13768G40234O7097k12113j29044j2137J30471A92279M45105J4934j03655Q0896
13758F29559J42548n8315J93925C85636p3241K31901k20606K06684N9964K08980
13748G99318C47990J34874J29393K12896k40973K07766j41594K6708p5297j39178
13738D62585B23480K38584K98900j349j97230P4140J32203l12086J17585r6747
13728D77480J06209k44327j44876N42818j17892k05316R2093J56556k86114L18804
$$ plain form
13798 763661 466199 934804 567330 553576 758439 673648 863242 703767 619847 544490
13788 544490 782210 544474 991231 979553 596572 503537 487666 455951 750769 595227
13778 595227 643066 790958 522709 864835 352825 867596 372578 761938 632438 740234
13768 740234 807331 595218 466174 454037 584508 192279 637384 652318 548663 629559
13758 629559 772107 713792 907717 385636 312395 544296 323690 530374 590338 799318
13748 799318 347990 482864 612257 825153 584180 791946 650352 677060 601763 462585
13738 462585 223480 462064 760964 759615 562385 636525 768728 456642 574227 477480
13728 477480 583689 339362 194486 737304 619412 414096 506189 662745 376631 695435
13718F95435l18871j5256P27585E14317o9754j37458L03921j00004k42208N4916
13708C23730L62721J12845C68656k9916K13353J77940l40472J62344k24049J14616
13698D42472p0260M68135j16314k47341L67502k73136B41198m3416K85693q0661
13688D02814L01836j88876j83178P3871J47537A63976N41146l16328L64592m4580
13678G08806j8217j15771B40742K34803L9088p3316L05608k67420o190J89696
13668F63011B26655K09401P4092j39696A55398L54903l0684j13155J25152A69027
13657C61573M34225A69208M5495K9176J53083j8716A52787J73139M920P2609J96225
13646E99680j04241j27469J05862n2471M176J73798B00534B1318M03080j44117
$$ plain form
13718 695435 376564 361308 1088893 514317 444563 307105 611026 511022 268814 323730
13708 323730 686451 799296 368656 338740 552093 730033 389561 551905 327856 442472
13698 442472 372212 840347 724033 476692 844194 571058 241198 197782 483475 402814
13688 402814 704650 515774 332596 406467 554004 163976 705122 388794 753386 708806
13678 708806 690589 574818 240742 475545 514633 441317 746925 479505 473315 663011
13668 663011 226655 436056 510148 370452 155398 510301 479617 366462 491614 169027
13657 361573 795798 169208 214703 243879 396962 378246 152787 325926 330846 403455 599680
13646 599680 495439 367970 473832 421361 425537 599335 200534 21318 424398 280281
13636B80281Q6768O3122A84706L2148K62705j49559N4577e2333D49310n5922K42506
13625F35894n4749J43297B25395K0186J62791j59939k4955K63000a4221D17345
13614A31542J27977Q0856j01550L28154j14386K2954j04247M17471C11121H5899
13603D26300I0479L34874J36112B44926K80342B02351B1714L91667N397J05845
13593E24623e6767C69042p299j29852J52868j51852K50996A61731m7090K38232
13583C52873d6005H107K50932J4028L03105A93282L68690j73953j25274O7121
13573C29866j03392K44865R3780R739j67508r2438K71164k13597n8780l3110J44021
13562D24610A13095M72929B19325l3282K04304A42188M57012m0144n1831j96258
$$ plain form
13636 280281 367049 430171 184706 216854 479559 330000 384577 -52333 449310 393388 635894
13625 635894 581145 724442 225395 245581 408372 248433 223478 486478 -14221 417345
13614 131542 259519 340375 238825 566979 452593 475547 371300 788771 311121 85899
13603 426300 90479 425353 561465 244926 525268 202351 21714 413381 418778 524623
13593 524623 -56767 369042 361743 231891 384759 232907 483903 161731 114641 352873
13583 352873 -46005 8107 259039 273067 576172 193282 561972 388019 262745 329866
13573 329866 226474 471339 565119 574858 407350 314912 586076 372479 313699 280589 424610
13562 424610 113095 586024 219325 186043 390347 142188 599200 559056 507225 310967
13552C10967k4483Q786p6187L32854k37997G4745J33017J64567j04951f8782E87787
13540F5479K50943j40334o2519M03906j01763j23761A24634L46721N3696B34737
13529F3240K38560J26418L36734A08615J05788J17785J23777H6257J75277f2347
13518B73235M631J77506n9162A54643k6462B4265L87332Q8764A42694K55608A91936
13506c9670A38886o4381L66934p5481r1741J71999j6116b2356A4243K94794A49599
13494B68766l0510J28990m1331J42768i9776E01047B02739M6705m0518K75212
13484D84138B29680a18778B54585J2067B2692g5167C04690O0309b00682I3104
13473H34727A02473M13706m6996F260M48377Q6504B65815J46965B9752J40041
$$ plain form
13552 310967 286484 295270 219083 551937 313940 74745 207762 372329 267378 -68782 587787
13540 65479 316422 176088 113569 517475 415712 291951 124634 471355 525051 234737
13529 63240 301800 428218 764952 108615 214403 332188 455965 86257 261534 -62347
13518 273235 277866 455372 396210 154643 128181 24265 411597 500361 142694 398302 191936
13506 -39670 138886 74505 441439 365958 274217 446216 430100 -22356 14243 309037 149599
13494 268766 238256 367246 325915 468683 -99776 501047 202739 249444 208926 484138
13484 484138 229680 -118778 254585 266652 22692 -75167 304690 364999 -200682 93104
13473 834727 102473 516179 469183 6260 454637 541141 265815 412780 29752 169793
13463A69793P6215H1316M33216b836C95079G7103L47862B9660K23568A2083K97107
13452C09190Q8310A78980O7119J19053E4363L36062A81952O9699j21477O74J21111
13441B51959J1379J12933o4750d4099j39127B05662j2269k0969J52205A04153
13430A09486b9436B4474J52850K85890I8155k725Q4294G3739B8319f731r4147
13419a00878I6025e2120H2239Q6175m9380R7777M87050A40081e5128C77712o1209
13408C16503L69779A31001n9786J28525J75053A56733J54427o3191M0363l6614
13398B51718a50216B82418e2983C58007A1950Q1856L13822A59743G654K08378
13388B16032N8906A05122K86189a1036k1383A64498j2490J08956k9379e5709B26620
$$ plain form
13463 169793 246008 81316 514532 -2836 395079 77103 424965 29660 253228 12083 309190
13452 309190 397500 178980 246099 365152 54363 390425 181952 251651 130174 130848 251959
13441 251959 263338 376271 311521 -44099 -183226 205662 193393 172424 324629 104153
13430 109486 -29436 24474 177324 463214 98155 95430 179724 73739 28319 -6731 -100878
13419 -100878 96025 -52120 82239 168414 119034 216811 703861 140081 -55128 377712 316503
13408 316503 686282 131001 71215 199740 374793 156733 311160 247969 288332 251718
13398 251718 -150216 282418 -52983 358007 11950 93806 407628 159743 7654 216032
13388 216032 274938 105122 391311 -11036 -32419 164498 152008 260964 231585 -55709 226620
13376C13228R2679F3173L57041r3242A28889o0329a3735E71223B58541J79137
13366D37678d0593A76298K03878j6864I4832J00272d0300A38590K88602A57082
13355A27905J68006q742p9299l3497a0438G4152M16375j37923k0819q172m99j05735
13343B17379J90979F9870P8666m8696o681J81549P3394B6403K87004J9657a33811
13331D19226a13743B93708D3007J17972O0960L330A07926f0284B44856A8711M15681
13320D34392j32802K23737A01528m598J44811K9804D5906K48564O6497c9500m4849
13309h4349B27243f1218A32022K26549A15103m1253J69877b9836K899B78052C5632
13297A46281J3004c5018D0389M0284c3979A06549h7421E2095J70584d6525C73487
$$ plain form
13376 313228 405907 63173 420214 326972 128889 68560 -13735 571223 258541 437678
13366 437678 -40593 176298 380176 363312 94832 195104 -40300 138590 427192 157082
13355 127905 295911 287169 207870 174373 -10438 74152 490527 352604 331785 323613 323114 217379
13343 217379 408358 69870 148536 99840 93159 274708 348102 26403 313407 333064 -133811
13331 419226 -113743 293708 43007 160979 221939 225269 107926 -60284 244856 18711 434392
13320 434392 301590 525327 101528 96930 241741 271545 45906 294470 360967 -39500 -84349
13309 -84349 227243 -61218 132022 358571 115103 73850 243727 -29836 -26937 278052 35632
13297 146281 159285 -35018 40389 80673 -33979 106549 -87421 52095 222679 -46525 373487
13285B31939A13422a0967n6675A12269K21965j02892a8821D55737D0114L0222
13275G0336R2279a43266A70626H2226N6950J48613k4831A02134F794b6769A85626
13263B95256A13192D3102M26193H6778K45144c8667B89251I4073a09393c2233
13252F0809a1330m1456l42646d1252A50817D2130J62372A8585K92782A43029a05670
13240a05633I9283a47068n7409A58460C0008K69780b075j41748B9233N19571a14944
13228E36808G3757a08782J3336C5749K13220A18027K38297j07476c583A08545
13217G7519L8866J2515L1947m5545m9265c8743j10769M2822B41735h4604n9951
13206a44555B00822G0690h7888B42148Q6042I0812k2958a58442A84151A927K13132
$$ plain form
13285 231939 113422 -10967 -67642 112269 334234 231342 -18821 455737 40114 70336
13275 70336 162615 -143266 170626 82226 139176 287789 262958 102134 6794 -26769 185626
13263 295256 113192 43102 469295 86778 331922 -38667 289251 94073 -109393 -32233
13252 60809 -11330 -52786 -395432 -41252 150817 42130 204502 18585 311367 143029 -105670
13240 -105633 99283 -147068 -204477 158460 30008 299788 -2075 -143823 29233 548804 -114944
13228 536808 73757 -108782 -95446 35749 248969 118027 356324 248848 -3583 108545
13217 77519 116385 128900 160847 115302 66037 -38743 -149512 -106690 241735 -84604 -144555
13206 -144555 200822 70690 -87888 242148 328190 90812 67854 -158442 184151 1927 215059
13195B15059p4344D8160J28685C1194N5803N7633f7188a9737C58661a60739O7206
13184i3533A3883Q5784b11443D27014A21247l7979b63162e2111h07A95243a82825
13172A38010A1731c0886D05384e4750I6901D1779h4303H7565a11234A4039I71
13160a39300b3286n0522A24256a16544A42487K15602a09356D2161K60993B9653
13149B62724E1836L235J32743O4984c6949j30209e2888B05893b5509B7694K00621
13138B28315j01879G298O6157J83476H4222c77645B78033o1784c4516D5459E153
13126A85964i2757C32931l031H7402a16018A86269R8368j38931a49256A49797
13115A34050a73319A79371b1122q2749A52309P9801c32854b4615A04849M21349
$$ plain form
13195 215059 140715 48160 176845 31194 86997 144630 -67188 -19737 358661 -160739 -93533
13184 -93533 13883 99667 -211443 427014 121247 83268 -263162 -52111 -807 195243 -182825
13172 138010 11731 -30886 405384 -54750 96901 41779 -84303 87565 -111234 14039 971
13160 -139300 -23286 -73808 124256 -116544 142487 358089 -109356 42161 303154 29653
13149 262724 51836 55071 187814 252798 -36949 -167158 -52888 205893 -25509 27694 228315
13138 228315 126436 7298 73455 256931 84222 -377645 278033 216249 -34516 45459 5153
13126 185964 -92757 332931 329900 87402 -116018 186269 284637 145706 -149256 149797
13115 134050 -173319 179371 -21122 -103871 152309 232110 -332854 -24615 104849 526198
13105E26198A26178J72105G5744a00545D6144c438B55952p6123a12181d5821A25936
13093E1757R3773m6759K15599a22773j3937E06281f5380D3396a15705D2233L4389
13082G6622K09999K5498j448I8583J30942o158C5060Q4986A187L17305L2670a95632
13069a63395A85345I445J98667G9990a92300E262h673B91816b21666A55205J28295
13058B83500K959I5266a5157C42509A02240J6892J41965a171H6645c2559k16047
13047b48606a6414B93934r3298K33215j3229j26519A09360h6554H3622b45866
13036a844E8241K69923j51806g519F4564J04648b11976R0822A72856g8276C63194
13024F5674c0039H6744P3902O9718I6323J99436A04335K4049K67933c5222I4031
$$ plain form
13105 526198 126178 298283 75744 -100545 46144 -3438 255952 179829 -112181 -45821 125936
13093 51757 145530 98771 314370 -122773 -136710 506281 -65380 43396 -115705 42233 76622
13082 76622 286621 312119 310671 98583 229525 223367 35060 120046 1187 318492 351162 -195632
13069 -163395 185345 9445 208112 79990 -192300 5262 -8673 291816 -221666 155205 283500
13058 283500 286459 95266 -15157 342509 102240 119132 261097 -1171 86645 -32559 -248606
13047 -248606 -16414 293934 200636 433851 420622 294103 109360 -86554 83622 -245866
13036 -1844 58241 328164 176358 -7519 64564 169212 -211976 -121154 172856 -78276 363194
13024 65674 -30039 86744 160646 230364 96323 295759 104335 128384 396317 -35222 94031
13012A32884O3546P9041j09253c99430a85468B78401n1735b09655M8654B72365
13001d6755A72298E1565c11721D6498b09563I6716E817g8736B89315q0455F3572
12989A49776N3169B8518a10487B71682A28760N1173a41884r8602B34563O1548
12979B96111a88913j5173e5624k06415e6399q6162A10577e3069A29528j2980a69428
12967a81447E22Q3217c40358A97939e058B53448A24836b22497C08614d8751A25793
12955B19910b84303H4477i6450d2974B6135L88358A15189e4539A47375b4883I8015
12943E060f6737B72111j14217K91294j69726O7754j33719a93475j30787F7940
12932h0928J8289A6138J40487F2344Q7123a36924L1803o9475g1927l3273c8422
$$ plain form
13012 132884 196430 275471 166218 -399430 -185468 278401 226666 -209655 -161001 272365
13001 -46755 172298 51565 -311721 46498 -209563 96716 5817 -78736 289315 208860 63572
12989 149776 202945 28518 -110487 271682 128760 179933 -141884 -240486 234563 296111
12979 296111 -188913 -204086 -55624 -262039 -56399 -142561 110577 -53069 129528 116548 -169428
12967 -181447 522 83739 -340358 197939 -5058 253448 124836 -222497 308614 -48751 125793
12955 219910 -284303 84477 -96450 -42974 26135 414493 115189 -54539 147375 -24883 98015
12943 5060 -66737 272111 157894 449188 279462 347216 213497 -193475 -324262 67940
12932 -80928 -62639 16138 156625 62344 149467 -136924 -105121 -174596 -71927 -105200 -38422
12920A19406a99B66415a73311A23983a46000b459q4528E9477a49647H386a01864
12908A1181b8525i720A58865K4678C2243a10763l1617A44555b06004G5485a70653
12896A29543a10003N1981j26259E9898a37209F0579a6019j36476F5820L45775
12886D11595A90239A7274J41262k6415c08946c2415k78291B33138b22099b9671
12875a30978B46689J77568c16909O6552i4272B83957J08190a0927C57999d542
12864E0958J00582A8479e0307C26287A49871A3605K61549a92356J8227g4311L3707
12853d0604H4418J30061C1353h3338L8027j16071f263G0938Q4545a19927B57572
12841A44365i908n1554j71450L0724I2126L5325L31402B10443q7069O1796i5434
$$ plain form
12920 119406 -199 266415 -173311 123983 -146000 -2459 -86987 59477 -149647 8386 -101864
12908 11181 -28525 -9720 158865 183543 32243 -110763 -142380 144555 -206004 75485 -170653
12896 129543 -110003 -58022 -184281 59898 -137209 60579 -16019 -152495 65820 411595
12886 411595 190239 17274 158536 132121 -308946 -32415 -310706 233138 -222099 -29671
12875 -130978 246689 424257 -316909 -250357 -94272 283957 392147 -10927 357999 -4542
12864 50958 151540 18479 -50307 326287 149871 13605 275154 -192356 -174129 -74311 -40604
12853 -40604 84418 214479 31353 -83338 -45311 -161382 -6263 70938 155483 -119927 257572
12841 144365 -9908 -61462 -232912 -202188 92126 127451 458853 210443 123374 185170 -95434
12829E210e3863B80503b69505A47299e38313C7469J37741L5614j2252l7008o6167
12818I5397a09435H9775A9028i3236I8664B7030P1628a0145I3255A7437J36344
12807A53781d9545k79613B10720J68492j61463m1479J22131H3413P4494b25573
12796A27497D7625b57230C98347H1655E5b27814B51647a01282L6598p9421B60223
12784C41302j65349a07810e0060I5321a00132B48366f3530A10324o616g3937a1914
12772a26204A24838h8087j09536H169K59162i7052B50156A9771O0838L6389J43861
12761B60859d2342A42331a27749A35086H177J4631a03814B12572E9146c2487J5108
12750a7379q798C1541c94586a29144D8565J06650a44509L0848D1996a96493c287
$$ plain form
12829 5210 -53863 280503 -269505 147299 -538313 37469 175210 210824 198572 161564 95397
12818 95397 -109435 89775 19028 -93236 98664 27030 98658 -10145 93255 17437 153781
12807 153781 -49545 -329158 210720 379212 217749 176270 298401 83413 157907 -225573
12796 127497 47625 -257230 398347 81655 55 -227814 251647 -101282 -64684 -144105 260223
12784 341302 175953 -107810 -50060 95321 -100132 248366 -63530 110324 103708 -73937 -11914
12772 -126204 124838 -88087 -197623 8169 267331 -97052 250156 19771 80609 116998 260859
12761 260859 -42342 142331 -127749 135086 8177 22808 -103814 212572 59146 -32487 -17379
12750 -17379 -26177 31541 -394586 -129144 48565 155215 -144509 -113661 41996 -196493 -3287
12738A49669n2102L8572a2422H886N6366O0558i5489d0004A09827a4009k80455
12727b94464g6003A61994c2189D3190N3029K1054L8220a49040l47929K03878a14885
12715C63346D2267O4618P1039a10509A17640J29600A19305b1590B79269E5347
12704b4637B6305M31527C5311J38588j4224c10859a18758B96627E4303J67113
12694B21416r5624a57455A2085a96283d3113p1463B77599B1856a54640e8496A11307
12682C64591f222A44655a55617D43773F1342P3493M44398B70746j20429a52419
12671c9175H6510J23614b2773k07497A03598a4767j9449A67923n53H1510c055
12659a28361D09975j7406H948J52294b9562H4331K33015H452J20250a93725D08130
$$ plain form
12738 149669 97567 136139 -12422 8886 65252 125810 -95489 -40004 109827 -14009 -294464
12727 -294464 -76003 161994 -32189 43190 96219 117273 155493 -149040 -496969 -293091 -114885
12715 363346 42267 106885 177924 -110509 117640 247240 119305 -21590 279269 55347
12704 -24637 26305 457832 35311 173899 159675 -310859 -118758 296627 54303 221416
12694 221416 125792 -157455 12085 -196283 -43113 -114576 277599 21856 -154640 -58496 111307
12682 364591 -6222 144655 -155617 443773 61342 134835 579233 270746 150317 -152419
12671 -39175 86510 210124 -22773 -230270 103598 -14767 -34216 167923 167370 81510 -3055
12659 -128361 409975 392569 8948 161242 -29562 84331 317346 8452 128702 -193725 408130
12647C40252A49330b15888A50948L2872j8487K23256D2029J38981n0889b0434
12636d7589o1574b411l12287J12251B67470J34334j76813J48281j75663J47591
12626C45200L1869q864D7499J06749R8736B0771J62351R7466j1518C965J74015
12615A77980d1026A92066a87453q9986A1954b38798B61824i1376C92438a33245
12604A20797b52254A43020C1867R3307O7479Q2786G5570g2237B33674k2229n7538
12593A53907b34988A87316J41593b69033B46586O167J0562a59740F3488b2634
12582a05454E572a99270N7705K4412B25673a0087I8522h9025A08744b35033A44644
12570b8053E1182J52894G2963a1497j16709N8211A1095c8608B43478e5499j40038
$$ plain form
12647 340252 149330 -215888 150948 183820 165333 388589 42029 181010 130121 -20434
12636 -47589 -109163 -2411 -314698 -202447 267470 401804 224991 373272 197609 345200
12626 345200 377069 368205 47499 154248 252984 20771 183122 280588 269070 3965 177980
12615 177980 -41026 192066 -187453 -277439 11954 -238798 261824 -91376 392438 -133245
12604 120797 -252254 143020 31867 125174 192653 275439 75570 -72237 233674 211445 153907
12593 153907 -234988 187316 328909 -269033 246586 252753 263315 -159740 63488 -22634
12582 -105454 5572 -199270 -141565 -117153 225673 -10087 98522 -89025 108744 -235033 144644
12570 -28053 51182 204076 72963 -11497 -128206 -69995 11095 -38608 243478 -55499 -195537
12559a95537j43965B31654p8059d0209A11330j5203a38145B45910a18492j25921
12549b44413G688c16952g6069m0314M8373B06763a40120n2190K1566A13584a74381
12537H3066b80786e1355j34598H4163e4755j27566L7268D36035C7817a58111A66713
12525A74127m1259P3482M0426d09047a53232j97462J74010H8704b14847B7049
12514b5958k0611b2191B27603a76154N5025B36087J3885a94588g660r2776A1659
12502a30260c849o6384p5073D50852A76284p7915a40949A23593a56922D8597k0320
12491B8277J1337b59979J05047n6271E2492a1519p4376B40866a93882D6852a05654
12479C21181a51396A66603e8936A02559c0121l81699I5193M9129E8187L42129
$$ plain form
12559 -195537 -339502 231654 153595 -40209 111330 96127 -138145 245910 -118492 -244413
12549 -244413 7688 -316952 -76069 -116383 -68010 206763 -140120 -192310 -170744 113584 -174381
12537 83066 -280786 -51355 -185953 84163 -54755 -182321 -145053 436035 37817 -158111 166713
12525 174127 132868 206350 246776 -409047 -153232 -350694 -176684 88704 -214847 27049
12514 -25958 -46569 -22191 227603 -176154 -121129 236087 249972 -194588 -7660 -100436 11659
12502 -130260 -3849 -70233 -145306 450852 176284 98369 -140949 123593 -156922 48597 28277
12491 28277 39614 -259979 -154932 -211203 52492 -11519 -85895 240866 -193882 46852 -105654
12479 321181 -151396 166603 -58936 102559 -30121 -411820 95193 144322 58187 400316
12469D00316c39452C5200g3746l567e530l91089C1142a5587j5423A90906F8647
12457c07032B73873b53935g1236A22490B5617a56587A27712m0269i0018k65555
12447c55573A04121J58043b87271C3608P5859b65572K5519f8357A47670J17863
12437B65533A21828C6663G569b80429C29012b87269A43567l5661G904K273K74500
12426B84677f8072l1635A20044a79457A67145P6773j15159f8183A74736G9632
12415f5123q9877A81543a38454P502j14830b8641l3087l8106C13732a18234E3052
12403A31795n839E7753J12368n2411M0476b6836j01231m9907j13914A8867a87962
12391H8159C3475d2963D9072c5440e471D8609J44206R4725e802B28446Q5385A08606
$$ plain form
12469 400316 -339452 35200 -73746 -77313 -5530 -396619 31142 -15587 -31010 190906 68647
12457 -307032 273873 -253935 -71236 122490 25617 -156587 127712 87443 -90018 -355573
12447 -355573 104121 262164 -287271 33608 109467 -265572 -240053 -68357 147670 265533
12437 265533 121828 36663 7569 -280429 329012 -287269 143567 107906 7904 10177 284677
12426 284677 -68072 -99707 120044 -179457 167145 243918 128759 -68183 174736 79632
12415 -65123 -155000 181543 -138454 -130952 -245782 -28641 -61728 -99834 313732 -118234 53052
12403 131795 125956 57753 170121 117710 158186 -26836 -128067 -177974 -291888 18867 -187962
12391 88159 33475 -42963 49072 -35440 -5471 48609 192815 287540 -5802 228446 313831 108606
12378c05910G9376L6656h9022B78930k7950p7397d683B72087a10736E2816a28082
12366a25948F8447a90243A94838m3473e05521g7627J0523k9432c15I437K67640
12355B77077A6837G658a29937j52313A23211k1547K2007m013a92525H5095Q2250
12344A67345f382G901J43267d5678B63894d2984B63952F247a50682a3411m77567
12333d90978H0695C6290N32112a20593B31502f2684c0983D39281A55612a36948
12322d4980F1818J45375k3242C7179O1579J82539C148a51862e8767A36889B6178
12310B31740q6098i4121j52481A86480o253c19722J06800j9452D15572C127g4533
12298B50968p6603C8287a02573A09839J94158c60289F7761L2500K11157G5530
$$ plain form
12378 -305910 79376 116032 -89022 278930 250980 173583 -4683 272087 -110736 52816 -128082
12366 -125948 68447 -190243 194838 151365 -505521 -77627 -67104 -96536 -315 9437 277077
12355 277077 16837 7658 -129937 -282250 123211 101664 123671 119658 -192525 85095 167345
12344 167345 -6382 7901 151168 -45678 263894 -42984 263952 6247 -150682 -13411 -490978
12333 -490978 80695 36290 568402 -120593 231502 -62684 -30983 439281 155612 -136948
12322 -44980 61818 207193 183951 37179 98758 281297 3148 -151862 -58767 136889 26178
12310 231740 145642 -94121 -246602 186480 180227 -319722 -212922 -232374 415572 3127 -74533
12298 250968 174365 38287 -102573 109839 303997 -360289 67761 100261 311418 75530
12287D9120a32782C5968Q5375c7310o0148j02186o6358A01126M3548C213b41340
12275C03611I2442J7458J21049P3208j05971p7760L1749a52541d1752B07712e8723
12263F399K934J72787a5140l6752A7440R2036h5440K4250A6195b0864l90036D1052
12250A21938J00449D3830h6275A6517c3728E9609J35J13573L8146d79731a28969
12238B9351e2164J0494p3878C46655A11773J28604j04082J58127E0605a11478
12227e3106A99005K76715A38518J35990J17803A42577c1268D30723F1508N61350
12217F22858b21486B85939j8877h653k0897F9512J38836l5619e9597j00664C76823
12205G6613K44541e017j06270B41683E0604L94587j52572C8783r194c0757B02558
$$ plain form
12287 49120 -132782 35968 121343 -37310 -97458 -199644 -266002 101126 144674 3213 -241340
12275 303611 92442 109900 230949 304157 198186 120426 152175 -152541 -41752 207712 -58723
12263 6399 9333 182120 -15140 -51892 17440 109476 -85440 -61190 16195 -20864 -410900 41052
12250 121938 222387 43830 -86275 16517 -33728 59609 59744 173317 211463 -479731 -128969
12238 29351 -52164 -41670 -115548 346655 111773 240377 136295 294422 50605 -111478
12227 -53106 199005 475720 138518 274508 392311 142577 -31268 430723 61508 622858
12217 622858 -221486 285939 267062 -8653 -29550 69512 208348 172729 -59597 -160261 376823
12205 76613 321154 -5017 -111287 241683 50604 445191 292619 38783 29589 -30757 202558
12193D72936I7105N9967J46924A33442b04025C2127q987J09447J2443i2746K5922
12182f6824A47737L21770A58101f3158B41238n9296J07282p556c1683A44022J84583
12171C28605j54839K30981r9433j16098a9200B56844J2947A31141L24967A48693
12160A33077f0452j07370A94791K65955a74512A12591g2740l1166n5102A07656
12149F6335c48939i1800A17908J87686D6676J41931O0975a09892j44960C9082
12138f6606p9245A38279a54630P0806D2738i5340k2822A10952b86127R0197c6706
12126A80388q8041h0707I9054k147J74490N5601E4148A4143b2388A81902a73689
12114g0854B39770d26257H8068J00330L4444G5342J8646a11044j15802A19035
$$ plain form
12193 472936 97105 157072 303996 133442 -204025 32127 23140 132587 145030 -92746 -66824
12182 -66824 147737 469507 158101 -63158 241238 181942 289224 281668 -31683 144022 328605
12171 328605 173766 404747 305314 189216 -19200 256844 269791 131141 456108 148693
12160 133077 -60452 -167822 194791 460746 -174512 112591 -72740 -103906 -159008 107656
12149 66335 -348939 -91800 117908 305594 46676 188607 249582 -109892 -254852 39082
12138 -66606 -145851 138279 -154630 -83824 42738 -95340 -118162 110952 -286127 -195930 -36706
12126 180388 92347 -80707 99054 96907 271397 326998 54148 14143 -22388 181902 -173689
12114 -70854 239770 -426257 88068 188398 222842 75342 93988 -111044 -226846 119035
12103A12028M5648J06550b41655q433Q2014b9652I312h8311r8277j52219A47679
12091a47341D6514B0367K17528d7666C9883a03663A54780d4598j48236A40766
12080C9505e5495j35541I2190O6008c0889A95136E4074N36318J044176j3522A25028
12068B36854A00766l4661r08N0319f414E6105O3651a42890A40081a03338m186
12057a07524B08724c62584a30489B12830F6543K79971B6508a13113c4510j88623
12047b23133i7649A20675a55483I8916b40234A76980c5501A287a25516j43871
12037b69387A01538e120A20252l3475b05659H8740L2755i9075B49763e4044m1691
12026i5735C02478d1088j45577I4060L6615K4851k1251a19112j32002A67490b044
$$ plain form
12103 112028 157676 264226 -241655 -250088 -168074 -29652 9312 -88311 -186588 -338807 147679
12091 -147341 46514 20367 237895 -47666 39883 -103663 154780 -44598 -192834 140766
12080 39505 -55495 -191036 92190 158198 -30889 195136 54074 590392 1634568 1621046 125028
12068 236854 100766 66105 65197 115516 -6414 56105 119756 -142890 140081 -103338 -107524
12057 -107524 208724 -362584 -130489 212830 66543 346514 26508 -113113 -34510 -223133
12047 -223133 -97649 120675 -155483 98916 -240234 176980 -35501 1287 -125516 -269387
12037 -269387 101538 -5120 120252 86777 -205659 88740 121495 -99075 249763 -54044 -95735
12026 -95735 302478 -41088 -186665 94060 130675 155526 134275 -119112 -251114 167490 -2044
12014b91141J27586D00411m7905j61660R1683b60713A83704K7774b64612C38621
12003G1989a43138a9765k1696J6468j64459B72309a4279j0049B91117A36781a01175
11991b32232f8578O436C02959a59171j95979C57707b1082j25132B20958a11928
11980B09783a72286J5299k83107J24459D1628L5473k5306b29658Q9119B30143
11969B9713K0669N0757k0269a67663o2444E4596b21253B4459R9287J43813B8737
11957c66790b111j11280m0100P1177G5603i6701m6426C1904K55770b32154D9401
11945B26234d65389e5882A9821L971i0281B30727a6269j29018a8784B7618Q8302
11934A15920B5076a8522j58189C79235a26702B381K46985h6337B40034a42783
$$ plain form
12014 -291141 -163555 400411 352506 190846 282529 -260713 183704 211478 -264612 338621
12003 71989 -143138 -19765 -41461 -24993 -189452 272309 -14279 -24328 291117 136781 -101175
11991 -232232 -68578 -62142 302959 -159171 -355150 357707 -21082 -146214 220958 -111928
11980 209783 -172286 -156987 -440094 -315635 41628 77101 51795 -229658 -140539 230143
11969 29713 50382 101139 80870 -167663 -230107 54596 -221253 24459 123746 267559 28737
11957 -366790 -2111 -113391 -153491 -82314 75603 -96701 -143127 31904 287674 -232154 49401
11945 226234 -465389 -55882 19821 23792 -90281 230727 -16269 -145287 -18784 27618 115920
11934 115920 25076 -18522 -176711 379235 -126702 2381 249366 -86337 240034 -142783
11923b10855j83953O4180C56028b41104A06264J99545F6756a21503b6182q8520
11913a14702l12473a65100a9683B12504e6422k32959a07870k6720d184k08486
11903b12670C73089H9550C2360N6011a92553A93340B5955J3389b10900A28787
11892C51458h3984A43957J575M0812c51023B9599J43922H46O9402a28902A9930
11880a87510R0195k76156a07292I7121c44269A39881c494l4567A65329i8793E8366
11868d060m00670J30883o5370a9361j30868B6424d13343H452a88809j21176E2422
11856b37666L2071A6975L1673Q1703E6589h6608j50095f4598q4982O1657A23476
11844c11303F4779d2343o7314A75883K8674B0524L68342j88626c41733f3976o6177
$$ plain form
11923 -210855 -394808 -330628 356028 -241104 106264 305809 66756 -121503 -26182 -114702
11913 -114702 -427175 -165100 -19683 212504 -56422 -289381 -107870 -134590 -4184 -212670
11903 -212670 373089 89550 32360 88371 -192553 193340 25955 39344 -210900 128787
11892 351458 -83984 143957 145532 186344 -351023 29599 173521 846 70248 -128902 19930
11880 -187510 -97315 -373471 -107292 97121 -344269 139881 -3494 -38061 165329 -98793 58366
11868 -4060 -404730 -273847 -339217 -19361 -150229 26424 -413343 8452 -188809 -309985 52422
11856 -237666 -205595 16975 48648 130351 56589 -86608 -236703 -64598 -149580 -87923 123476
11844 -311303 64779 -42343 -109657 175883 204557 20524 388866 200240 -341733 -63976 -130153
11833a30153j79117A43075a19633k25689c5537p5290L1671I7161K7393C8979J80226
11822B19205O84a93954R0539A07537L8281a20413D0874a20776B6296J65514a80044
11810F1073J00784g0974A27719c7837A51992I607a76893B33423c2436j18526A90854
11798d30398f9359a4056l38893G050L02595A02796l0562J5597a38956H304J04067
11787A12371a0318A37254J18767A15736J33373J04267C9117K63607A02295a12615
11776C61982b54904h8081l12137F1605c74299G3446b2150a0972B99K22183m3099
11765A79383a3633E3932O0693K06556e9765j45591N3945k6147B6505d02363a13886
11753A09380p129c64976D7958d9984k11943g6741l4290j40226A40171B2852f0841
$$ plain form
11833 -130153 -309270 143075 -119633 -345322 -35537 -110827 -79156 97161 124554 38979 219205
11822 219205 219889 -193954 -103415 107537 145818 -120413 40874 -120776 26296 191810 -180044
11810 61073 161857 -70974 127719 -37837 151992 9607 -176893 233423 -32436 -150962 190854
11798 -430398 -69359 -14056 -352949 7050 309645 102796 72234 87831 -138956 8304 112371
11787 112371 -10318 137254 256021 115736 249109 353376 39117 302724 102295 -112615
11776 361982 -254904 -88081 -400218 61605 -374299 73446 -22150 -10972 299 222482 179383
11765 179383 -13633 53932 114625 321181 -59765 -205356 -151411 -177558 26505 -402363 -113886
11753 109380 102251 -364976 47958 -49984 -261927 -76741 -111031 -251257 140171 22852 -60841
11741E8103N103c8388p6843d9956A15479J91212F636a20271H3198C9161K7338
11730F6499f0113g418A31711g9578r3946c6883j92117G697J88125A5383j069P5922
11718I0236a23459M4328A01117M55573B10386a78976j222B26083m1536a59940
11707b56789A76609k0087J64880C6536a3813j16899A00100m4559P6379b78372
11696B10415a25529K6539A67432P4714q8540c47141A13725a24611A06472D1594
11685b2510A4802K11487g5263l5868E29031b93277L8462B90497b61781k3994D87290
11673H0384b21414B29815G6585B0368L88110j38167H8095a19887A55554F2368
11662B93461f3793B99272D1287g9849A81039D8916b48098d1176m36017A40491
$$ plain form
11741 58103 63206 -38388 -115231 -49956 115479 306691 6636 -120271 83198 39161 66499
11730 66499 -60113 -7418 131711 -79578 -173524 -36883 -229000 7697 195822 15383 14314 90236
11718 90236 -123459 -79131 101117 556690 210386 -178976 -180198 226083 184547 -159940
11707 -256789 176609 156522 321402 36536 -13813 -130712 100100 55541 131920 -278372
11696 210415 -125529 -98990 167432 242146 153606 -347141 113725 -124611 106472 41594
11685 -22510 14802 226289 -75263 -111131 529031 -293277 -254815 290497 -261781 -285775 487290
11673 80384 -221414 229815 76585 20368 408478 270311 88095 -119887 155554 62368
11662 293461 -63793 299272 41287 -79849 181039 48916 -248098 -41176 -477193 140491
11651f2684j18422A18690J4976b04902A13437K43626n9871n4176e0398A15215
11640B0241L26130H943J43404a53149n1283i0689j21470B81286d49233d0732B23070
11628B81688i828D2107M6118J39680b72704B20988k9936O8212m2110b89926j36224
11617d26150J52070A4963a39321b0900D0815a08320I5199M0504i7271o0882H380
11605b73792P8967k0963d558p2372I270N3119d2849E8516K34091r0944I9223K04762
11593C03985r1422n0040i9175a2327n6233A82862m7119J73501J159D456K13649
11582B18105a56115E5683a20855D7933a68575e3174B7390K95045b06656A78603
11571B10827I8604K34002D0333L12466F0950d3289E03260I2867K60812G2282J39377
$$ plain form
11651 -62684 -181106 118690 133666 -204902 113437 357063 297192 243016 -50398 115215
11640 20241 346371 8943 152347 -153149 -204432 -90689 -212159 281286 -449233 -40732 223070
11628 281688 -9828 42107 88225 227905 -272704 220988 191052 259264 217154 -289926 -426150
11617 -426150 -274080 14963 -139321 -20900 40815 -108320 95199 135703 -97271 -158153 8380
11605 -273792 -194825 -215788 -4558 -76930 9270 62389 -42849 58516 292607 201663 99223 303985
11593 303985 212563 162523 -99175 -12327 -68560 182862 135743 309244 310403 4456 218105
11582 218105 -156115 55683 -120855 47933 -168575 -53174 27390 322435 -206656 178603
11571 210827 98604 332606 40333 352799 60950 -43289 503260 92867 353679 72282 211659
11560B11659F3959i9795A36478E5292k6872P7963b88237C28784f7377A46206f5345
11548D00153E1366a08014A76137K5088c3812D37385A2940K68682c19180b4764
11537B00588g6554A02351b3326A76985i7603C1130c6849H6168a02521B03925J4309
11526B18234J25909j00927G3174a04967B8777i7443C53114A21070a12428A83075
11515A08684l2169a54212N9586D37310A34378f9474B04745K8086J2269a85088
11504B94887n9119c6010E3326O750K48776A07684J00787J00095a71602G3017f7811
11492C3054J97798A11169Q1886H3622A2855K06554f906A98371q9691D9276J5155
11481F4431J58842a10315A24752j1512n5d8047E3439J0825J76656B9486Q9963
$$ plain form
11560 211659 63959 -99795 136478 55292 28420 106383 -288237 328784 -67377 146206 -65345
11548 400153 51366 -108014 176137 201225 -33812 437385 12940 281622 -319180 -24764
11537 200588 -76554 102351 -23326 176985 -97603 31130 -36849 86168 -102521 203925 218234
11526 218234 344143 243216 73174 -104967 28777 -97443 353114 121070 -112428 183075
11515 108684 76515 -154212 -94626 437310 134378 -69474 204745 232831 245100 -185088
11504 294887 235768 -36010 53326 60076 308852 107684 208471 308566 -171602 73017 -67811
11492 33054 230852 111169 193055 83622 12855 219409 -6906 198371 108680 49276 64431
11481 64431 223273 -110315 124752 113240 113185 -48047 53439 64264 240920 29486 119449
11470A19449j1096P0345L51265e7752B43839B356L5285K47295j5572H2562J43704
11459B26266J77513j68388b27563B51634a36675E7455J88396c991q6316E9634
11448A04208L61020j42815c87259A79474K9859m1118K12193A35407j0939c0178
11437b23328B09506a61808C19160j34100L2347a30847b4427j7474j7540k5951
11427h5392C1801J26549l0700E7201O0285i873F3762b17979A67442P4741J4504
11416B56687b26591K5040Q1598A27022a35756H1320f6858H4231b3476o0013E54540
11404A82455a81330e0766A34800j4741l9259i2985A36744E6601a39816K955k44089
11393c80950g1103B45905a11917L9267A07030k1181e1054a6308q5546A97197o7546
$$ plain form
11470 119449 108353 178698 529963 -57752 243839 2356 37641 284936 269364 82562 226266
11459 226266 403779 235391 -227563 251634 -136675 57455 245851 -3991 -90307 59634
11448 104208 465228 322413 -387259 179474 209333 168215 380408 135407 124468 -30178
11437 -223328 209506 -161808 319160 185060 217407 -130847 -24427 -41901 -59441 -85392
11427 -85392 31801 158350 127650 57201 117486 -9873 63762 -217979 167442 242183 256687
11416 256687 -226591 -201551 -119953 127022 -135756 81320 -66858 84231 -23476 -83489 554540
11404 182455 -181330 -50766 134800 120059 80800 -92985 136744 56601 -139816 -136861 -380950
11393 -380950 -71103 245905 -111917 -72650 107030 85849 -51054 -16308 -101854 197197 129651
11382A29651c61989C15761j52446A2106c7846j3161A63196M4151c8039A87532
11371A6864J72797e7449D31134a0652j59308j16917f4197j08702G320a82952E464
11359A8220g301k3373m52913A49428b84038a07696k61905a57443G3536d06050
11348E3413R1841c0875M664A0196d87420A284M31928b28625H8704C0686J71855
11337B02541c7129H3372a74736O232B54411g7606q549L5974E431J34702O3947
11326B04080F5758K8668e3515A81934k9869a0413k227j50876A00314b1914A29577
11314C77118j51874i986H8764c24932B8829f3544j97688C02314C3732L4665J09579
11303A77976c06980B60469D0793a4303O919l00049A17767d1515a4544I3667Q9548
$$ plain form
11382 129651 -361989 315761 163315 12106 -37846 -51007 163196 207347 -38039 187532
11371 16864 189661 -57449 431134 -10652 -169960 -286877 -64197 -172899 7320 -182952 5464
11359 18220 -7301 -30674 -483587 149428 -284038 -107696 -369601 -157443 73536 -406050
11348 53413 145254 -30875 -26211 10196 -487420 1284 433212 -228625 88704 30686 202541
11337 202541 -37129 83372 -174736 -168504 254411 -77606 -86155 -50181 5431 140133 204080
11326 204080 65758 94426 -53515 181934 152065 -10413 -12640 -163516 100314 -21914 129577
11314 377118 225244 -9986 88764 -324932 28829 -63544 -261232 302314 33732 68397 177976
11303 177976 -306980 260469 40793 -14303 -7384 -307433 117767 -41515 -14544 93667 183215
11292A83215M970G6560R257b90543G7299b19046N6057D9114M0428d7993j29091
11281a77084J4748o593B04346c6116k97162a8754j28959A40555l5908a80856k48117
11270d28973a16229L5116A72860E674N1244b90925B45199c81614R6787e7262j40015
11259a97277l3772P0463A58714b9796j88154N4184A06600O7481a16392J3560j43560
11248b46392b2966p3338j33180A53390G5749b74191g9705B794a21788B22332a29002
11236A46124c04798O0109c3284q1104B49620a15074p9178Q0450n2577F029c6831
11224H8465b20393G4259J28961A00177B7438g7891b8339k91561C45576G413a69496
11212c36692a13540p1155B0484Q5897a16248A75877J55863a30956B69816q8673
$$ plain form
11292 183215 188185 76560 85817 -290543 77299 -219046 -162989 49114 89542 -47993 -177084
11281 -177084 -162336 -168929 204346 -36116 -333278 -18754 -147713 140555 104647 -180856 -428973
11270 -428973 -116229 -81113 172860 5674 56918 -290925 245199 -381614 -284827 -57262 -197277
11259 -197277 -231049 -160586 158714 -29796 -217950 -163766 106600 174081 -116392 -102832 -246392
11248 -246392 -22966 -96304 -229484 153390 75749 -274191 -79705 2794 -121788 222332 -129002
11236 146124 -304798 -244689 -33284 -114388 249620 -115074 -194252 -113802 -166379 6029 -36831
11224 88465 -220393 74259 203220 100177 27438 -77891 -28339 -319900 345576 7413 -169496
11212 -336692 -113540 -184695 20484 106381 -116248 175877 331740 -130956 269816 181143
11202A81143c35251R6580E5958a55571K9733p5147f292l73766a57514E7016a66357
11190A20344i9856A12134R9623I3751d5240a6568H0987K53587A15231Q500M939
11179A28670d2380j2924k40921A51088b16274E0612a58958G2755a30894m5702
11169a76596e7984k26376E0554b54081M5338d8607l7194A26707O9533G7732J1634
11158H9366e5501A1436J01165J85359b7822C28408d34516b07594G5919K55108
11148C31027e3298j93987R2814k7341l7858A07631a85995B50757J0451i3756A83984
11136E9549d3812I4573m4669b3051B0459c04162A45643e2048H7243J37343a02557
11124c1098H342b25895j35925a61329b5052A56215k701a81596d8916k28387F1779
$$ plain form
11202 181143 -335251 -238671 55958 -155571 -125838 -200985 -6292 -380058 -157514 57016 -166357
11190 120344 -99856 112134 211757 93751 -45240 -16568 80987 334574 115231 123731 128670
11179 128670 -42380 -55304 -296225 151088 -216274 50612 -158958 72755 -130894 -176596
11169 -176596 -57984 -284360 50554 -254081 -208743 -48607 -85801 126707 196240 77732 89366
11158 89366 -55501 11436 112601 297960 -27822 328408 -434516 -207594 75919 331027
11148 331027 -53298 -247285 -154471 -181812 -219670 107631 -185995 250757 261208 -93756 183984
11136 59549 -43812 94573 49904 -23051 20459 -304162 145643 -52048 87243 224586 -102557
11124 -31098 8342 -225895 -361820 -161329 -25052 156215 153514 -181596 -48916 -277303 61779
11112d5933k09248J07821j60339a13290C29236a46343D29662j66244e3525C2162
11101A70694J20024A05143C6444M22243A72410J35732K8034a25180A55158K31306
11091C86464P0822p0191k8398R01l8346A12371Q7948P3026a38656A18243J42635
11080B60878j26996Q9008c1799B72449k2963p0809O5401q3164b3061E12714J78381
11069F91095B18997L14242B03509L302N7511K228J22426J01548j20661K71080
11059F40943k67516J34258l7628M45162k70429J02309O9524k85300K57860J78459
11049I67642o8644j59120N4479m9177J14257j7360j28550k32732L53589J16932
11039I51316l06450j66420K81498K0117J00884k59455J59659l10243N7810K44698
$$ plain form
11112 -45933 -255181 -147360 -307699 -113290 329236 -146343 429662 263418 -53525 32162
11101 170694 290718 105143 36444 458687 172410 308142 336176 -125180 155158 386464
11091 386464 457286 387095 358697 359598 321252 112371 200319 273345 -138656 118243 260878
11080 260878 133882 222890 -31799 272449 249486 178677 244078 160914 -23061 512714 691095
11069 691095 218997 533239 203509 206811 264322 266550 388976 490524 369863 640943
11059 640943 373427 507685 470057 915219 644790 747099 816623 531323 789183 967642
11049 967642 898998 739878 794357 745180 859437 842077 713527 480795 834384 951316
11039 951316 644866 478446 759944 780061 880945 621490 781149 470906 528716 773414
11029G73414k78056J51442J19939k32776M2251J23181o4323K3301O1411j25646
11019E94138k31682j3775J93098k9961Q0287o3567N7303L3871J05514B91915L15004
11008F06919J38647j88615P9475K13931D23537K02113J20977B44739M68606J07438
10998H20783p8839R7169k54170k46673L35701O6325k41665L25510k97772N9511
10988E85880J74411L15868l31550l3193L35875r9729J29111K38722j51557L51303
10978A515141m611L93690k05224N16847M03979j79074O33036j11001l00844k98337
10968B363602m47214n3792j01249r6747k48699N1915l7612M69223k98314J85472
10958A786585K50534l94284j59964k9926J17124m74970k06706L25638E34032Q6134
$$ plain form
11029 773414 495358 646800 766739 533963 576214 699395 635072 658373 719784 594138
11019 594138 362456 348681 541779 511818 592105 528538 585841 619712 725226 291915 606919
11008 606919 745566 556951 636426 850357 423537 625650 746627 244739 713345 820783
10998 820783 741944 839113 584943 338270 673971 740296 498631 824141 526369 585880
10988 585880 760291 1076159 744609 711416 1047291 947562 1076673 1315395 1163838 1515141
10978 1515141 1510530 1904220 1698996 2215843 2619822 2440748 3073784 2962783 2661939 2363602
10968 2363602 1916388 1862596 1761347 1664600 1415901 1467816 1430204 1899427 1601113 1786585
10958 1786585 2037119 1642835 1482871 1452945 1570069 1095099 888393 1214031 534032 620166
10948F20166k07082K41135B61628J41865j86459B7810K42861J98263H0403J81580
10938B61983r7938l517A4182J19789J30356H4331J06854a07284n7147b0326B36804
10926a72268j54211B55446O9866a75993g9001B44611a3195A43840a3818n3648
10916f7466A89434k4320a60443D0816K02776H5431d180E3753c4694A73532a66029
10904A60669J05120h7382k9659c3352D530a29379j13702c8058A6338J40251J76487
10893C33076b01895A42303i895o4085G11129B35127H8798c37219B1609h265j73060
10882a81325b5404c76k03153J1704R5335c8071c790l95633J06579R416A55141
10870I570e3769j45562j15771F50708B28092c16658f3506j3845q9549Q0543F4260
$$ plain form
10948 620166 413084 654219 261628 403493 217034 27810 270671 468934 80403 261983
10938 261983 164045 160528 14182 133971 264327 84331 191185 -107284 -164431 -20326 236804
10926 -172268 -326479 255446 325312 -175993 -79001 244611 -13195 143840 -13818 -67466
10916 -67466 189434 165114 -160443 40816 243592 85431 -4180 53753 -34694 173532 -166029
10904 160669 265789 -87382 -117041 -33352 4530 -129379 -243081 -38058 16338 156589 333076
10893 333076 -201895 142303 -9895 -73980 711129 235127 88798 -337219 21609 -8265 -181325
10882 -181325 -25404 -376 -203529 -191825 -96490 -38071 -3790 -399423 -292844 -283428 155141
10870 9570 -53769 -199331 -315102 650708 228092 -316658 -63506 -77351 -166900 -86357 64260
10858f6171j4355n4210B3705a11996J9997j39660A76422F4126f2680k1913j14564
10847a99157C8597c3548I4621e1203D436J96984a91233B9470d20815C93259A35816
10835I3267j04O8391C7648P4624a74461A07372K10224A12524a06176a0686j32898
10824a43584r720H1178g8687j55271A11940i6355A60711b5402m062D0079a19918
10812A68023m3384a98419k91009b2927q5229A67911b18751G133b30771C6797M10483
10801D47280b55852B38482N3687B3450d70545a9084B05650b28652b6699G6501
10790A80787D6213g4433m2014B78521a18375B95789A10291l5104J01551j4277
10780A62461J60668a21925O769B5790g7944p6952m4954q6141e7430A90643a75001
$$ plain form
10858 -66171 -80526 -134736 23705 -111996 -91999 -231659 176422 64126 -62680 -84593 -199157
10847 -199157 38597 -33548 94621 -51203 4436 201420 -191233 29470 -420815 393259 135816
10835 93267 93163 161554 37648 112272 -174461 107372 317596 112524 -106176 -10686 -143584
10824 -143584 -153304 81178 -78687 -233958 111940 -96355 160711 -25402 -29464 40079 -119918
10812 168023 124639 -198419 -489428 -22927 -108156 167911 -218751 7133 -230771 36797 447280
10801 447280 -255852 238482 292169 23450 -470545 -19084 205650 -228652 -26699 76501
10790 180787 46213 -74433 -116447 278521 -118375 295789 110291 75187 176738 162461
10780 162461 323129 -121925 -115156 25790 -77944 -154896 -199850 -285991 -57430 190643 -175001
10768a74401d8784k72852A45632d84822b39031p5115b1350l2374o3222B31514
10757d3984A75268m4827a26772j99209C4984N1416B281d1620A08619i625H1053
10745A76649m4430k1394M9005a12953l8851M1527I6886D0330b40238a04083e225
10733a57955n8298O7402C735J51340a79371E7191h4343j28987o1163d7919A59368
10721b55975A36358a28891j92236D1886b0193b01k27705Q2359A3559b34023P5144
10710a58879j1834E1197Q3528c16644a44752F8651b44923B5032J29706a04914
10699a153A39505b67196B17442a92090a7702B10446a94608M0229J1745c0743m5268
10688g6011F386K62959b80357J21443H702b56406A75K33526a02691r3557l5340
$$ plain form
10768 -174401 -48784 -321636 145632 -484822 -239031 -314146 -21350 -53724 -116946 231514
10757 -43984 175268 130441 -126772 -325981 34984 86400 2281 -41620 108619 -9625 81053
10745 176649 132219 110825 159830 -112953 -151804 -110277 96886 40330 -240238 -104083 -5225
10733 -157955 -216253 -148851 3735 155075 -179371 57191 -84343 -213330 -274493 -47919 159368
10721 -255975 136358 -128891 -321127 41886 -20193 -201 -227906 -145547 13559 -234023 -158879
10710 -158879 -170713 51197 134725 -316644 -144752 68651 -244923 25032 154738 -104914
10699 -1153 139505 -267196 217442 -192090 -17702 210446 -194608 -154379 -142634 -30743 -76011
10688 -76011 6386 269345 -280357 -158914 8702 -256406 175 233701 -102691 -196248 -231588
10677b31588H466b0464l6377A07479e1234B18574a74679K2025c6353k10735a22642
10665b90810a25139A10856b19097e2216m7681B53996q6616a60441g590c333A28033
10653A12979b21203M9673q1242B46767D2753A0559J25204c09535n9349B8805a94985
10641i6960A88864c97670G6221b61210g0956N290B48176e1661A41719e5424j38249
10630a93673A23495J80679a98961d3268j5890H409c94624C0230a58421A99665
10619D8684L5144b50690B84856G4546a22771M7565q2002d0657k09924F09109d5288
10607b8527k51336G4059a247m625k13081f7623l347j2940n7055A07112K08431
10596C15543F5045k6999N5938B8808J06891b19004O2624A50601g9450m2509c0883
$$ plain form
10677 -231588 8466 -20464 -56841 107479 -51234 218574 -174679 -152654 -36353 -247088 -122642
10665 -290810 -125139 110856 -219097 -52216 -99897 253996 167380 -160441 -7590 -3333 128033
10653 112979 -221203 -171530 -252772 246767 42753 10559 135763 -309535 -368884 28805 -194985
10641 -96960 188864 -397670 76221 -261210 -70956 -65666 248176 -51661 141719 -55424 -193673
10630 -193673 123495 304174 -198961 -43268 -59158 8409 -394624 30230 -158421 199665
10619 48684 83828 -250690 284856 74546 -122771 -75206 -157208 -40657 -250581 609109 -45288
10607 -28527 -279863 74059 -1247 -5872 -218953 -67623 -70970 -83910 -140965 107112 315543
10596 315543 65045 38046 93984 28808 135699 -219004 -156380 150601 -79450 -121959 -30883
10584a31433J4193I1319Q0991a3482K582p6812L0141C66650A5940e9938A7634
10572d5068H6339a6897E5418O8113c98816a39260m7502B1418J89465a48145K2291
10561a25854p9069a3627A04827E429a63467p2442H8574b00756A8057a08736j24368
10550b33104A15374g4124k75284J59389E7684d0668A12802K48838G504c5172A81238
10538b85638b5845m1287l7259A35709l2449C8343a50742l0310A5213c7516k57097
10527b94613B7709i3034J1436F5911a08917j19959A61977b44239a7338j19359
10517a36697b1134o226I6276a52782j40582A31123a61875B67406a13888A52366
10506a78090k55225a30103e6041l26114A68538d607r6551l00548O4310A19218
$$ plain form
10584 -131433 -117240 91319 172310 -13482 -10900 -87712 -57571 366650 15940 -59938 17634
10572 -45068 86339 -16897 55418 123531 -398816 -139260 -186762 21418 210883 -148145 -125854
10561 -125854 -204923 -13627 104827 5429 -163467 -235909 88574 -200756 18057 -108736 -233104
10550 -233104 115374 -74124 -349408 -190019 57684 -40668 112802 361640 7504 -35172 181238
10538 -285638 -25845 -67132 -104391 135709 103260 38343 -150742 -181052 15213 -37516 -294613
10527 -294613 27709 -93034 -81598 65911 -108917 -228876 161977 -244239 -17338 -136697
10517 -136697 -21134 -27360 96276 -152782 -293364 131123 -161875 267406 -113888 152366
10506 -178090 -433315 -130103 -56041 -382155 168538 -4607 -101158 -401706 -337396 119218
10495a45002c6089F4035a05851A98390J02526a27816A24763H721b77122B97699
10484F2794K22986b4918B16987K01316p3145A04763P3338a45572j5362d4319j99297
10473b43616A45249K33509a55660A71180E2964e4406B22979n6488e6592l7969
10463i4561A40436a18164B37931H4923a46558A09215a31049g506D31525b39382
10452c27146I9222h6739j21530c0948a0361D59877C6565a03946l6660f6895K071
10441f4824E0055L967a78979A3463M19138j17919a90042e8479A30292B8220f9477
10429a06598G9235Q1714p0296m1876a13819J5656j63205C3258J46752i0409a9696
10417e130A73630A7404J57367c14250A10473a74633O1075H4977O9551a26452j50310
$$ plain form
10495 -145002 -36089 64035 -105851 198390 300916 -127816 124763 8721 -277122 297699
10484 62794 285780 -24918 216987 418303 345158 104763 178101 -145572 -160934 -44319 -243616
10473 -243616 145249 378758 -155660 171180 52964 -54406 222979 166491 -56592 -94561
10463 -94561 140436 -118164 237931 84923 -146558 109215 -131049 -7506 431525 -239382
10452 -327146 99222 -86739 -208269 -30948 -10361 459877 36565 -103946 -140606 -66895 -64824
10441 -64824 50055 54022 -178979 13463 432601 314682 -190042 -58479 130292 28220 -69477
10429 -106598 79235 160949 90653 48777 -113819 -98163 -261368 33258 180010 -90409 -19696
10417 -5130 173630 17404 174771 -314250 110473 -174633 -113558 84977 154528 -126452 -276762
10406b76762A76679c09617F6547b62494a01533j36238j23544a14430M6869k0605
10396h8166B14226a12406N201B17866H4164J44423j09729E8990J84862A2421e0487
10384A77689a31623E8247J24127j9565N0771j2633r0046L56548j71425l5901b2024
10372a10207B11198Q4532k6057J5498k8518L16313A68061J54511j43210A3014
10361B78045l2242j4030H5800b01743B45418j285f8964c1257C18407M3069k7598
10350C33878K4275m6252A54950R7425Q4587A44992M02914j43015r9131E1189J73691
10339B24880K41978j91765l9448q9390J34406A1037M9553P6580n4781l7040M820
10328E0169f7846H7891B2957K51973b75347C02793J33907c987A49657k5235n2999
$$ plain form
10406 -276762 176679 -309617 66547 -262494 -101533 -237771 -361315 -114430 -67561 -88166
10396 -88166 214226 -112406 -107205 217866 84164 228587 118858 58990 243852 12421 -50487
10384 177689 -131623 58247 182374 162809 213580 200947 110901 467449 296024 260123 -22024
10372 -110207 211198 295730 269673 285171 256653 572966 168061 322572 179362 13014
10361 278045 245803 231773 85800 -201743 245418 244133 -68964 -31257 318407 361476 333878
10350 333878 358153 311901 154950 252375 336962 144992 547906 404891 305760 51189 224880
10339 224880 466858 275093 235645 146255 280661 11037 60590 137170 82389 45349 50169
10328 50169 -67846 87891 22957 274930 -275347 302793 436700 -3987 149657 124422 71423
10317G1423K28586j08217m792c6309D35797B3573J2546j934c802k0493k81441
10306c05736B26776F7627K70461e8853A5635b3945k01894B3548J55005q4659J270
10295I5164a74398A70885b71750F7526B9135d56715b02128A68743b23117A84274
10284B92744n5195a7828k90680B0411h092C42227c805k5213I676a89998P6115
10273a13883G8799d32471A3278N0833J29339b12927B36537b17779b4056A76398
10262F5587L10223G0475L38401P3217F8066f5276L1226C28549g7125I2370g3484
10250a51683e6353B13560a48163o7230A71539a37239A88506p2267C359h546H7281
10238a75802C0669M9544c1030H0646f8287E6363k6535L42a82767K2362J6435M9789
$$ plain form
10317 71423 300009 191792 187000 -36309 435797 23573 36119 34185 -3802 -24295 -305736
10306 -305736 226776 67627 338088 -58853 15635 -23945 -225839 23548 178553 93894 95164
10295 95164 -174398 170885 -271750 67526 29135 -456715 -202128 168743 -223117 184274
10284 292744 237549 -17828 -308508 20411 -8092 342227 -3805 -29018 9676 -189998 -113883
10273 -113883 78799 -432471 13278 64111 193450 -212927 236537 -217779 -24056 176398
10262 65587 375810 70475 408876 482093 68066 -65276 -34050 328549 -77125 92370 -73484
10250 -151683 -56353 213560 -148163 -215393 171539 -137239 188506 116239 3359 -8546 87281
10238 -175802 30669 80213 -31030 80646 -68287 56363 29828 30170 -182767 -160405 -143970 -94181
10226i4181M0803j04730j60423b3387j21500A95474a14890l27606A07751K90384
10216C98135c3877j92288a2238G6109D147K33917H6506h5486k27238A0017b17026
10204H9193a5335j55959p0124G8240a424l05989I2903e1308j17222K1313A94108
10192b33601A13598e6711o9973a7191l08639A54741a49515C26264A35566M6524
10182A82090E0410K1843l3572j2082L4802A5742c67487B01490B3170a91214r6032
10171b87246F6801C2660d8964O503j21118O4384A87536a07484j75098J06716L1157
10160a44709H0090H495C553n50a63608A16405b937j88554A94076h1293H383N8420
10148F6803J30737P5314f8107k48059Q6078m6648D16204a86970N7946n4149A72258
$$ plain form
10226 -94181 -53378 -158108 -318531 -23387 -144887 195474 -114890 -442496 107751 398135
10216 398135 -33877 -226165 -12238 76109 4147 238064 86506 -85486 -312724 10017 -217026
10204 89193 -15335 -171294 -241418 78240 -1424 -307413 92903 -51308 -168530 -147217 194108
10192 -233601 113598 -56711 -126684 -17191 -325830 154741 -149515 326264 135566 182090
10182 182090 50410 72253 38681 26599 61401 15742 -367487 201490 23170 -191214 -287246
10171 -287246 66801 32660 -48964 -42461 -163579 -99195 187536 -107484 -282582 -175866 -144709
10160 -144709 80090 8495 3553 3003 -163608 116405 -2937 -191491 194076 -81293 8383 66803
10148 66803 197540 272854 -68107 -316166 -230088 -276736 416204 -186970 -129024 -183173 172258
10136b67045K3956P6037a5435B103L953K0967a38774L286k15093A90842g7344
10124c48146b019B10430b8769B7267d16503c8798j31895j25657k44359K26278
10114c14431f2627j65607C3856c88445a90647m1078l25584F3639O9996d00561
10103B77775a13465l9754m6310O00f7606H3581R4292a27529q3614e8280l4221
10092i2501q451K916I3783a23691j02911k65040K16982B44353b72885b158l42244
10081c44402G4309c07494A01932g6309b5262B18655r1305J29350f7457j39739
10071b07196d5944d150j89238C26255j26629r1464a43036F8618a07735j80626
10061b88361B4447a2557j19959A3560b10878d7008D2760J17220i371j82302d8828
$$ plain form
10136 -267045 -243089 -167052 -15435 2103 6056 27023 -138774 -135488 -350581 190842 -77344
10124 -348146 -2019 210430 -28769 27267 -416503 -38798 -170693 -296350 -540709 -314431
10114 -314431 -62627 -228234 33856 -388445 -190647 -231725 -557309 63639 133635 -400561
10103 277775 -113465 -153219 -199529 -198929 -67606 83581 177873 -127529 -211143 -58280 -92501
10092 -92501 -100952 -98036 93783 -123691 -226602 -491642 -274660 244353 -272885 -2158 -344402
10081 -344402 74309 -307494 101932 -76309 -25262 218655 127350 256700 -67457 -207196
10071 -207196 -45944 -4150 -193388 326255 199626 108162 -143036 68618 -107735 -288361
10061 -288361 24447 -12557 -132516 13560 -210878 -47008 42760 159980 -9371 -191673 -48828
10049b57142r9528B98082q0529i3969F586a56711H410J12585C1334c8466B56316
10037A6399M3309i7130j1216R436G7636a6806k28871h0642j35505R5981a7817
10025A89656O1440b98847B00877b6670F4296b66084R1919n9783N0364b7093n71097
10014e98190K01839J04854k9298F6084a12971b6059j70178c295C14637a35839
10003g8592C80950a14445C75463a40101j35379a0049A32895M382a33248I643f6260
9991I3842a31666b4509o4395B2864a79001r371f2584o0074M2946j80917l8693
9980b99322a4064j28175q1278A24467a91652L6687b0428H9576d49645B31050f9903
9968A20297e8320F7264b37794g609B60127d1260B15923q9189h5530L0699k49428
$$ plain form
10049 -257142 -356670 298082 217553 -93969 6586 -156711 8410 120995 31334 -38466 256316
10037 16399 59708 -97130 -108346 -98910 77636 -16806 -245677 -80642 -216147 -120166 -17817
10025 189656 251096 -298847 200877 -26670 64296 -266084 -174165 -233948 -183584 -27093 -598190
10014 -598190 -396351 -291497 -320795 66084 -112971 -26059 -196237 -3295 314637 -135839
10003 -78592 380950 -114445 375463 -140101 -275480 -10049 132895 137277 -133248 9643 -66260
9991 93842 -131666 -24509 -88904 22864 -179001 -188372 -62584 -122658 -79712 -260629 -299322
9980 -299322 -14064 -142239 -223517 124467 -191652 -154965 -20428 89576 -449645 231050 -69903
9968 120297 -58320 67264 -237794 -7609 260127 -41260 215923 126734 -85530 -54831 -304259
9957c04259e1312k47707B69336b33160f4272k30829H8475b94802m1214J27111
9947b08905e2034j86345B69029b56009C19153b00567G2960a76675j6782K4217
9937a69240N7459j0480D5774B957d0655r4654j03690A6614M9972a38069N1229
9926h6840L9433C6504E066a64417h379C8906a65602F0439c43374a43988j25860
9915b69848A55962a6501A13903e5679k12168k5381D23b96610f1860K8853l5283
9904f8290A44840a27234r4156A09631c1512B10509a31460O0091A31405c4915A94537
9892a83961D0923K20251a62115B02887J36418B0340f9596n8442L0620A4065c2482
9880b04231G9908h634A60887o7957a21936H834O6758a09554a6223A96470g6010
$$ plain form
9957 -304259 -51312 -299019 269336 -233160 -64272 -295101 88475 -294802 -336016 -208905
9947 -208905 -52034 -238379 269029 -256009 319153 -200567 72960 -176675 -193457 -169240
9937 -169240 -111781 -122261 45774 2957 -40655 -135309 -238999 16614 66586 -138069 -86840
9926 -86840 -47407 36504 5066 -164417 -8379 38906 -165602 60439 -343374 -143988 -269848
9915 -269848 155962 -16501 113903 -55679 -267847 -293228 423 -296610 -61860 -33007 -68290
9904 -68290 144840 -127234 -221390 109631 -31512 210509 -131460 -71369 131405 -34915 194537
9892 -183961 40923 261174 -162115 202887 339305 20340 -69596 -128038 -97418 14065 -32482
9880 -204231 79908 -8634 160887 92930 -121936 8834 75592 -109554 -16223 196470 -76010
9868A6061K37680n391c14947B19650c69082G209a72307e3850q1560N6931l0471
9857a08950D1358a93290C5767J56512D7695a34660j26862A79270d4512G9633A3574
9845a08986B53705b16120m6335A28160k0048b9012q2858o1149P61H9435l7329
9834E2106N6736m966j8983b18781J6671L75B54247G1935a95081m7683H8948j6864
9822G2084b6840A42302f6513C4167d0827j52744c5031k5990l2869r2921d6565
9810a48133j03560O291F9845e8664n9708B30619M2847D5965M7152e9129J7579
9799d1550k26295N4844b0221n5430F7585b77375Q8302D7459f0383A7893a63006
9787B78184i5251j27735a02728F4548K97833c58134A52389F4685a30634A5850
$$ plain form
9868 16061 253741 248350 -314947 219650 -369082 7209 -172307 -53850 -135410 -78479 -108950
9857 -108950 41358 -193290 35767 192279 47695 -134660 -261522 179270 -44512 79633 13574
9845 -108986 253705 -216120 -262455 128160 108112 -29012 -111870 -173019 -172258 89435 52106
9834 52106 108842 103876 84893 -218781 -202110 -201735 254247 71935 -195081 -242764 88948 72084
9822 72084 -26840 142302 -66513 34167 -40827 -193571 -35031 -61021 -93890 -186811 -46565
9810 -148133 -251693 -245402 69845 -58664 -118372 230619 273466 45965 93117 -59129 -41550
9799 -41550 -267845 -213001 -20221 -75651 67585 -277375 -189073 47459 -60383 17893 -163006
9787 278184 -95251 -222986 -102728 64548 362381 -358134 152389 64685 -130634 15850
9776a69912j57846a54246A5222K07520a70090A9073m06g7895B204a12455l32556
9765d45011J90932A49748a64128a0984n13964b57849J27289D7915c2807A99715
9754a89721j6566o9999a37673j39908J28724M2219A73161a18832q0859K4766B27930
9742A27239l8088A261L8596L18607n8462a59386j73465H8719a66708j92337A74357
9730b09456O9088j898B62513f1213m5284A57782L03182c271A34081J14908b2989
9718c17413j52788B668J3085J25861b58551a19173K7404G4472N0407d33507g3338
9706e90769a15577A28651a36329j07262i8616L1250j85464q0294f6737e80j60012
9695a60592L3582M4566k5877c280k18277H9735c6322I5103C9007K07635q529c49657
$$ plain form
9776 -169912 -327758 -154246 15222 222742 -170090 19073 18667 -77895 2204 -112455 -445011
9765 -445011 -254079 149748 -164128 -10984 -524948 -257849 -130560 47915 -32807 199715
9754 -189721 -206287 -276286 -137673 -277581 -148857 -106638 173161 -118832 -199691 -174925 227930
9742 127239 89151 1261 39857 358464 300002 -159386 -332851 88719 -166708 -359045 174357
9730 -209456 -140368 -142266 262513 -61213 -106497 157782 460964 -3271 134081 248989 -22989
9718 -317413 -470201 2668 15753 141614 -258551 -119173 -91769 74472 124879 -433507 -73338
9706 -590769 -115577 128651 -136329 -243591 -98616 -67366 -252830 -333124 -66737 -580 -160592
9695 -160592 -127010 -82444 -108321 -3280 -221557 89735 -36322 95103 39007 246642 238113 -349657
9682A32597I253b74824O8335K0977j42513e5422H1847a66233l6935R5204M6812
9671f1152k09591L9284A64990a75613k07101P1530K0596A53994F4928d7904c285
9659c8464k0662k69949J44806D88943d15113J51138d5475D17602E3175d7566j69179
9648b16745l016p199A28457P5890j6216m2041a08630A85364d2725B8177J27313
9637A55490c17404b6666H7203d2494l3667B8850J02386a60007D7661a6664b231
9625A179a82917h1117k83976a75932Q3274J1265B54162b70423a9038F18c93613
9613C566a71458B35635o1648M8055E8465h498H3150K075P5177a92306a6862n3542
9601g0404j8238C2317a98810k6217c1011j1875k79479i7524N335o737A57850b12014
$$ plain form
9682 132597 9253 -274824 -206489 -185512 -328025 -55422 81847 -166233 -203168 -107964 -61152
9671 -61152 -270743 -231459 164990 -175613 -382714 -311184 -290588 153994 64928 -47904 -3285
9659 -38464 -59126 -329075 -184269 488943 -415113 -263975 -45475 417602 53175 -47566 -216745
9648 -216745 -219761 -226960 128457 204347 188131 146090 -108630 185364 -42725 28177 155490
9637 155490 -317404 -26666 87203 -42494 -76161 28850 131236 -160007 47661 -16664 -2231
9625 1179 -182917 -81117 -365093 -175932 -92658 -81393 254162 -270423 -19038 618 -393613
9613 3566 -171458 235635 173987 222042 58465 -8498 83150 85225 160402 -192306 -16862 -70404
9601 -70404 -88642 32317 -198810 -225027 -31011 -42886 -322365 -97524 -92189 -98926 157850 -212014
9588A13545l6176P2097a72382e0877m40922d7860G6195c47320j53431a07279a9427
9576A24059a73524r4791B1084a20701j94024d0350o0965c9504G2371g1847j22462
9565a94309k29983J81316A05718b28461d7551k2527A69643g4972k0264B31713
9554h7585C5935J73873a79110J0847P2742k21124e8097D4029a69840g2242l40190
9543d12432g3710E5262A8789b3973Q479A28944c17203j36336B33134b00073l8041
9532b38114k31448A98270a7284q3802r2855J4453H3201b42920Q5567j00064K5072
9521b32345E6457P5594b07196Q6627d7084p5904A13100c29598f3640k42792F8715
9509G5200a44683B27795F3268J02347a91472g7022r5553B2316D686a9114F069
$$ plain form
9588 113545 77369 149466 -172382 -50877 -491799 -47860 76195 -347320 -500751 -107279 -19427
9576 124059 -173524 -268315 21084 -120701 -314725 -40350 -101315 -39504 72371 -71847 -194309
9565 -194309 -424292 -242976 105718 -228461 -47551 -70078 169643 -74972 -95236 231713
9554 -87585 35935 209808 -179110 -168263 -95521 -316645 -58097 44029 -169840 -72242 -412432
9543 -412432 -73710 55262 18789 -23973 -15494 128944 -317203 -453539 233134 -200073 -238114
9532 -238114 -469562 198270 -17284 -101086 -193941 -179488 83201 -242920 -157353 -257417 -232345
9521 -232345 56457 132051 -207196 -120569 -47084 -122988 113100 -329598 -63640 -306432 68715
9509 75200 -144683 227795 63268 165615 -191472 -77022 -172575 22316 4686 -19114 6069
9497d1918A4360A215d87054R2376a6703j09968B8715a48349B01441b39340b2607
9485A43812k8033d81443G8141a8582o607A63822a24240m5805B11628A2122c59865
9473A00135b04514B3954L2922f661B62063a20973A28632a84382g4549A56886j1807
9462A45079A2863c11610i7814c145j29394B87787e7099j45259K6798A31716a45568
9450c07487G211N9932g2136j18876C00804E3512i7082d6503j5357A7986a16163
9438a85512j45596f4902j98433A19290c42912J43748F4306a12541A70743F2122
9427a8981k20789Q2048L1115F7167a19920C10647h6127E6838d6279N880K0127
9416b0272j82698A68246I831c6631B10424b2139g870H7861a72258O2654D0187
$$ plain form
9497 -41918 14360 1215 -487054 -394678 -16703 -126671 28715 -148349 201441 -239340 -22607
9485 143812 115779 -481443 78141 -18582 -25189 163822 -124240 -170045 211628 12122 -359865
9473 100135 -204514 23954 56876 -6661 262063 -120973 128632 -184382 -74549 156886 145079
9462 145079 12863 -311610 -97814 -3145 -132539 287787 -57099 -202358 -175560 131716 -145568
9450 -307487 7211 67143 -72136 -191012 300804 53512 -97082 -46503 -61860 17986 -116163
9438 -185512 -331108 -64902 -263335 119290 -342912 -199164 64306 -112541 170743 62122
9427 -18981 -239770 -157722 -126607 67167 -119920 310647 -86127 56838 -46279 -40399 -20272
9416 -20272 -202970 168246 9831 -36631 210424 -22139 -7870 87861 -172258 -109604 40187
9404G9764Q4c13350a55917J8916j47521h262j24042M9231j74092E4790k262e5722
9391A27235b27474C87779h977B879b53001B1266J06593m1737N9820b3507a026
9379E9358a3155A00572h6978j1232l63623i4703A71215a0917j4363j1317E4187
9367a17353j3112C15667p0777g8823E438g1964G7479b61508A03444b15316A80471
9355b02547q8481R66R2400A24754d90808b26429g6222J6800I3017b92777B35226
9343b23418A1620c15534a30571A79182a81752C1930a5183n5893r9331L7836f4704
9331A68162A8735J29092b82194a5740k66613J21804A48302b92594J17592j51263
9321c26265a57116B21930a14990c8663J1132F5707K92003A74078A885a9718j54620
$$ plain form
9404 79764 79848 -313350 -155917 -137001 -284522 -8262 -132304 -83073 -257165 54790 52528 -55722
9391 127235 -227474 387779 -8977 2879 -253001 21266 127859 86122 145942 -23507 -1026
9379 59358 -13155 100572 -86978 -98210 -461833 -94703 171215 -10917 -25280 -36597 54187
9367 -117353 -130465 315667 244890 -78823 5438 -71964 77479 -261508 103444 -215316 180471
9355 -202547 -291028 -290062 -197662 124754 -490808 -226429 -76222 -59422 93017 -292777 235226
9343 -223418 11620 -315534 -130571 179182 -181752 31930 -15183 -71076 -170407 -132571 -64704
9331 168162 18735 147827 -282194 -15740 -282353 -160549 148302 -292594 -175002 -326265
9321 -326265 -157116 221930 -114990 -38663 -27531 65707 357710 174078 1885 -19718 -174338
9310a74338e7202n3185j7892I5903f391j29086L5927k12736I9467J13022e05446
9298d41660K2559b08647b6060k30075c2594j38030j33106c618o2384B53968a30401
9286b13028B42353g1230j10601a786j32335F5778e7426G7305c01264a5769j70724
9275a86493B74801A06352b59369R9610B6560O3998b19928g7496k36072a49013
9264a44731j30078I0839B6191a27646c4599l26136a25703a1076I1263P1011O579
9253A68853b93l59341e4452A01084P3665D8556J50471b79528i2874j9176E0003
9241A58626a18876A04964d8591m05197a67703H7790l7450k1294b59791r1811I9362
9229A83091d206B30221a64513j68629A11418a36161G8408P3904f5052E5793J5083
$$ plain form
9310 -174338 -57202 -110387 -128279 95903 -6391 -135477 -99550 -312286 99467 212489 -505446
9298 -441660 -419101 -208647 -26060 -256135 -32594 -170624 -303730 -3618 -66002 253968 -130401
9286 -213028 242353 -71230 -181831 -1786 -134121 65778 -57426 77305 -301264 -15769 -186493
9275 -186493 274801 106352 -259369 -159759 26560 90558 -219928 -77496 -313568 -149013
9264 -144731 -274809 90839 26191 -127646 -34599 -360735 -125703 -11076 91263 162274 168853
9253 168853 -293 -359634 -54452 101084 174749 48556 199027 -279528 -92874 -112050 50003
9241 158626 -118876 104964 -48591 -453788 -167703 87790 50340 29046 -259791 -351602 99362
9229 183091 -4206 230221 -164513 -333142 111418 -136161 78408 152312 -65052 55793 70876
9218G0876a57944I835O9091a71215k2938p3600k24731f8397q4278A00228d6828
9206b84487G2771a36149p5938r6581J13164B60434L3998H8958b79664J38707A05978
9194A49752b67956A7998a55099E9728a26322A34220b6965c06A58409E7749a29171
9182A15427D8694d0479B01025G795J69853B9193b37793B7814J10813J07390a56959
9170b1523E1091a23650e1314A35358a40026B89107b76626b3965q1588e24j25436
9159a25960l6274A11735K30037b09387E3308J14252a10493p3355q8171i2613A24373
9147a01146q2120D57173b56087C50480A07977a88461A10573a05920H2356c85589
9136b08418E047d1159k70134B7979J8458L8600d1800B4524J01592b25623B42151
$$ plain form
9218 70876 -157944 9835 78926 -171215 -194153 -267753 -492484 -68397 -152675 100228 -46828
9206 -284487 72771 -136149 -212087 -308668 -195504 260434 294432 88958 -279664 -140957 105978
9194 149752 -267956 17998 -155099 59728 -126322 134220 -26965 -306 158409 57749 -129171
9182 115427 48694 -40479 201025 7795 177648 29193 -237793 27814 138627 246017 -156959
9170 -21523 51091 -123650 -51314 135358 -140026 289107 -276626 -23965 -105553 -524 -125960
9159 -125960 -162234 111735 341772 -209387 53308 167560 -110493 -183848 -272019 -92613 124373
9147 -101146 -183266 457173 -256087 350480 107977 -188461 110573 -105920 82356 -385589
9136 -208418 5047 -41159 -311293 27979 46437 85037 -41800 24524 126116 -225623 242151
9124a2838A70347a13201A6926a55599d7360C7212J66954a383j34952J3470A33139
9112B6540h3142j44547j56889B01241l6912G2508a96901A18480a72699A71594
9101b57182c7875A3445c6864j54591l372C52057d24816A32284R9292E7239c04301
9089A74270a47315F223K5899f9730l72687a30342a3173E0194J05277a69596A55073
9077a19597a2190B61482A17416b2470k1619n0500F020a00940K8525A63731a84444
9065E5850E095a6582A30600N3758E3856a10055N0775B0950J24582i41G9213a53965
9052B30834a98488I7022K38975h6056A17771B8103a52883n8996G6936a87104L7566
9041a49538L2834A25365f5021g577j05943B5711a32157L6900l3144K0963d825
$$ plain form
9124 -12838 170347 -113201 16926 -155599 -47360 37212 204166 -1383 -136335 -122865 133139
9112 26540 -83142 -227689 -384578 201241 164329 72508 -196901 118480 -172699 171594
9101 -257182 -37875 13445 -36864 -191455 -194827 352057 -424816 132284 231576 57239 -304301
9089 174270 -147315 6223 32122 -69730 -442417 -130342 -13173 50194 155471 -169596 155073
9077 -119597 -12190 261482 117416 -22470 -44089 -94589 6020 -100940 -72415 163731 -184444
9065 55850 5095 -16582 130600 184358 53856 -110055 -59280 20950 145532 -941 79213 -153965
9052 230834 -198488 97022 335997 -86056 117771 28103 -152883 -211879 76936 -187104 -149538
9041 -149538 -116704 125365 -65021 -7577 -113520 25711 -132157 -95257 -128401 -107438 -4825
9029F7317b2015j90453B8222e16398a54146Lm6780M0807j10217j10845j78484
9018e59662A56440A5079E565g8518A26193f5736C5014d2360A00220a66986B06321
9006B7322M9016q153i6813c3832A07183b10281L5913j40595a9551k76175B43828
8994B97994d7557H9099a7750E6990d9583j46101k729A89198j6486k1189e2423
8982a90682E0546j183g8154k8451K6305L9273j4239j01571l0366b2097H3376h1077
8969C4202d55145A72753k3092a47144c1063A76269a01673o0808C74226G4264a03618
8957c29412c3942k17583e980j42475O05d6512j32313b4092C9157h7058k03541
8946b90599A51209m3067i7235j6403B16634a8541k64010a01006q5550L5558C51754
$$ plain form
9029 67317 -22015 -212468 28222 -516398 -154146 -154143 -200923 -160116 -270333 -381178 -559662
9018 -559662 156440 15079 5565 -78518 126193 -65736 35014 -42360 100220 -166986 206321
9006 27322 76338 68185 -96813 -33832 107183 -210281 -174368 -314963 -19551 -295726 243828
8994 297994 -47557 89099 -17750 56990 -49583 -195684 -198413 189198 172712 151523 -52423
8982 -190682 50546 49363 -78154 -106605 -80300 -41027 -55266 -156837 -187203 -22097 83376 -81077
8969 34202 -455145 172753 149661 -147144 -31063 176269 -101673 -162481 374226 74264 -103618
8957 -329412 -33942 -251525 -5980 -148455 -147850 -46512 -178825 -24092 39157 -87058 -290599
8946 -290599 151209 108142 -97235 -113638 216634 -18541 -282551 -101006 -186556 -150998 351754
8934D27075F7728O3300P1068h1220b8774B12175Q8357j41166L29618L13575R81117
8923A783676N790036R038920D960990A264299E09258r9505J03690j60541K1007
8914C73909d4695D91202c14295A4511N770K10122L9450G7814f7483p1482q1007
8903b19972M4153I1419e033A97961B8492a47311k37507R2491C9087c31540a59878
8891A44696b32635F2239a00215o9654l9169M3765j55246D0757b6293B23169d644
8879b44491B00394d6492G2753N5538b66460a6091A17025M7464m6006h4875j03896
$$ plain form
8934 427075 67728 131028 202096 -81220 -28774 212175 300532 159366 488984 802559 1783676
8923 1783676 7573712 16612632 4960990 1264299 509258 409753 513443 352902 373909
8914 373909 -44695 491202 -314295 14511 20281 230403 269853 77814 -67483 -138965 -219972
8903 -219972 -175819 91419 -5033 197961 28492 -147311 -384818 -292327 39087 -331540 -159878
8891 144696 -232635 62239 -100215 -169869 -209038 -165273 -320519 40757 -26293 223169 -4644
8879 -244491 200394 -46492 72753 128291 -266460 -16091 117025 164489 118483 -84875 -188771
$$ [...]
##END NTUPLES=NMR SPECTRUM
##END=
