
##TITLE=AC1245_NSAAH12035_6616084_lGwsoLg014
##JCAMPDX= 6.0         $$ Bruker NMR JCAMP-DX V2.0
##DATA TYPE= NMR SPECTRUM
##DATA CLASS= NTUPLES
##ORIGIN= BRUKER
##OWNER= Administrator
$$ 1.72 TOPSPIN		Version 2.1
$$ 2012-08-03 03:04:35.468 -0500  Administrator@TOPSPIN
$$ Compression mode = diff/dup
##.OBSERVE FREQUENCY= 400.02188249412
##.OBSERVE NUCLEUS= ^1H
##.ACQUISITION MODE= SIMULTANEOUS (DQD)
##.ACQUISITION SCHEME= undefined
##.AVERAGES= 8
##.DIGITISER RES= 22
##SPECTROMETER/DATA SYSTEM= spect
##.PULSE SEQUENCE= zg30
##.SOLVENT NAME= COFFEE_meoh
##.SHIFT REFERENCE= INTERNAL, COFFEE_meoh, 1, 14.98509
##AUDIT TRAIL= $$ (NUMBER, WHEN, WHO, WHERE, PROCESS, VERSION, WHAT)
$$ ##TITLE= Audit trail, TOPSPIN		Version 2.1
$$ ##JCAMPDX= 5.01
$$ ##ORIGIN= Bruker BioSpin GmbH
$$ ##OWNER= Administrator
$$ $$ C:\Bruker\TOPSPIN/data/COFFEE/nmr/AC1245_NSAAH12035_6616084_lGwsoLg014/10/pdata/1/auditp.txt
$$ ##AUDIT TRAIL=  $$ (NUMBER, WHEN, WHO, WHERE, PROCESS, VERSION, WHAT)
(   1,<2012-08-03 03:04:28.375 -0500>,<Administrator>,<TOPSPIN>,<go>,<TOPSPIN 2.1>,
      <created by zg
	started at 2012-08-03 03:03:21.859 -0500,
	POWCHK enabled, PULCHK disabled,
       configuration hash MD5:
       6B 1B 68 BB D9 2E 58 E2 7F 35 AD 54 07 DF 0E 41
       data hash MD5: 64K
       55 96 18 5F F9 89 02 E4 A8 E1 FA 71 B2 D0 47 01>)
(   2,<2012-08-03 03:04:31.187 -0500>,<Administrator>,<TOPSPIN>,<proc1d>,<TOPSPIN 2.1>,
      <Start of raw data processing
       efp LB = 0 FT_mod = 6 PKNL = 1 PHC0 = 0 PHC1 = 0 SI = 32K 
       data hash MD5: 32K
       79 B3 2A F0 2E 15 54 12 70 D0 D0 4C 34 FA 54 1F>)
(   3,<2012-08-03 03:04:31.625 -0500>,<Administrator>,<TOPSPIN>,<proc1d>,<TOPSPIN 2.1>,
      <pk PHC0 = 181.4502 PHC1 = 0 
       data hash MD5: 32K
       D8 5E D4 4F F9 5A 87 6E A6 52 20 AB C2 0C F3 28>)
(   4,<2012-08-03 03:04:31.687 -0500>,<Administrator>,<TOPSPIN>,<proc1d>,<TOPSPIN 2.1>,
      <abs ABSG = 1 
       data hash MD5: 32K
       86 BE E3 B1 69 64 6B 4E 5E AE 2D EB 09 96 77 7D>)
(   5,<2012-08-03 03:04:31.718 -0500>,<Administrator>,<TOPSPIN>,<proc1d>,<TOPSPIN 2.1>,
      <abs ABSG = 2 
       data hash MD5: 32K
       04 40 D7 82 77 16 CA 29 9E 14 CE 5C CA A4 44 16>)
(   6,<2012-08-03 03:04:31.750 -0500>,<Administrator>,<TOPSPIN>,<proc1d>,<TOPSPIN 2.1>,
      <abs ABSG = 3 
       data hash MD5: 32K
       67 D6 04 83 A8 29 27 09 49 30 0A 7F FE BA 63 C9>)
(   7,<2012-08-03 03:04:31.781 -0500>,<Administrator>,<TOPSPIN>,<proc1d>,<TOPSPIN 2.1>,
      <abs ABSG = 4 
       data hash MD5: 32K
       1F 01 17 36 2B EC 48 C3 E0 80 C1 27 18 80 45 86>)
(   8,<2012-08-03 03:04:31.812 -0500>,<Administrator>,<TOPSPIN>,<proc1d>,<TOPSPIN 2.1>,
      <abs ABSG = 5 
       data hash MD5: 32K
       23 8A 92 F8 5D 49 66 57 CD 91 0D E3 E2 4D AB 58>)
$$ ##END=
$$ 
$$ $$ hash MD5
$$ $$ EA 55 E7 97 89 E7 BD 83 C2 AB 29 89 92 06 53 BE
##$RELAX= 
##$RELAX= 
##$RELAX= 
##$RELAX= 
##$RELAX= 
##$RELAX= 
##$RELAX= 
$$ Bruker specific parameters
$$ --------------------------
$$ [...]
150 150 150 150 150 150 150 150
##$TP07= 0
##$TPNAME0= <>
##$TPNAME1= <>
##$TPNAME2= <>
##$TPNAME3= <>
##$TPNAME4= <>
##$TPNAME5= <>
##$TPNAME6= <>
##$TPNAME7= <>
##$TPOAL= (0..7)
0.5 0.5 0.5 0.5 0.5 0.5 0.5 0.5
##$TPOFFS= (0..7)
0 0 0 0 0 0 0 0
##$TUNHIN= 0
##$TUNHOUT= 0
##$TUNXOUT= 0
##$USERA1= <user>
##$USERA2= <user>
##$USERA3= <user>
##$USERA4= <user>
##$USERA5= <user>
##$V9= 5
##$VALIST= <valist>
##$VCLIST= <CCCCCCCCCCCCCCC>
##$VD= 0
##$VDLIST= <DDDDDDDDDDDDDDD>
##$VPLIST= <PPPPPPPPPPPPPPP>
##$VTLIST= <TTTTTTTTTTTTTTT>
##$WBST= 1024
##$WBSW= 4
##$XGAIN= (0..3)
0 0 0 0
##$XL= 0
##$YL= 0
##$YMAX_a= 499615
##$YMIN_a= -659451
##$ZGOPTNS= <>
##$ZL1= 120
##$ZL2= 120
##$ZL3= 120
##$ZL4= 120
##$ABSF1= 14.98509
##$ABSF2= -5.573092
##$ABSG= 5
##$ABSL= 3
##$ALPHA= 0
##$AQORDER= 0
##$ASSFAC= 0
##$ASSFACI= 0
##$ASSFACX= 0
##$ASSWID= 0
##$AUNMP= <proc_prof1d_extract_pilot.lims>
##$AXLEFT= 0
##$AXNAME= <>
##$AXNUC= <1H>
##$AXRIGHT= 0
##$AXTYPE= 0
##$AXUNIT= <>
##$AZFE= 0.1
##$AZFW= 0.1
##$BCFW= 0
##$BC_mod= 0
##$BYTORDP= 0
##$COROFFS= 0
##$CY= 15
##$DATMOD= 1
##$DC= 0
##$DFILT= <>
##$DTYPP= 0
##$F1P= 0
##$F2P= 0
##$FCOR= 0.5
##$FTSIZE= 32768
##$FT_mod= 6
##$GAMMA= 0
##$GB= 0
##$INTBC= 1
##$INTSCL= 1
##$ISEN= 128
##$LB= 0
##$LEV0= 0
##$LPBIN= 0
##$MAXI= 10000
##$MC2= 0
##$MEAN= 0
##$ME_mod= 0
##$MI= 0
##$NCOEF= 0
##$NC_proc= -8
##$NLEV= 6
##$NOISF1= 0
##$NOISF2= 0
##$NSP= 0
##$NTH_PI= 0
##$NZP= 0
##$OFFSET= 14.98509
##$PC= 1
##$PHC0= 181.4502
##$PHC1= 0
##$PH_mod= 1
##$PKNL= yes
##$PPARMOD= 0
##$PPDIAG= 0
##$PPIPTYP= 0
##$PPMPNUM= 2147483647
##$PPRESOL= 1
##$PSCAL= 4
##$PSIGN= 0
##$PYNMP= <proc.py>
##$REVERSE= no
##$SF= 400.02
##$SI= 32768
##$SIGF1= 0
##$SIGF2= 0
##$SINO= 400
##$SIOLD= 32768
##$SPECTYP= <>
##$SREGLST= <1H.CDCl3>
##$SSB= 0
##$STSI= 32768
##$STSR= 0
##$SW_p= 8223.68421052631
##$SYMM= 0
##$S_DEV= 0
##$TDeff= 65536
##$TDoff= 0
##$TI= <>
##$TILT= no
##$TM1= 0
##$TM2= 0
##$TOPLEV= 0
##$USERP1= <user>
##$USERP2= <user>
##$USERP3= <user>
##$USERP4= <user>
##$USERP5= <user>
##$WDW= 1
##$XDIM= 32768
##$YMAX_p= 457989672
##$YMIN_p= -646376
##$CURPLOT= <Network HP LaserJet P1505>
##$CURPRIN= <$Network HP LaserJet P1505>
##$DFORMAT= <normdp>
##$LAYOUT= <+/1D_H.xwp>
##$LFORMAT= <normlp>
##$PFORMAT= <normpl>
##$SURQMSG= 1
$$ End of Bruker specific parameters
$$ ---------------------------------
##NTUPLES= NMR SPECTRUM
##VAR_NAME=  FREQUENCY,     SPECTRUM/REAL,   SPECTRUM/IMAG
##SYMBOL=    X,             R,               I
##VAR_TYPE=  INDEPENDENT,   DEPENDENT,       DEPENDENT
##VAR_FORM=  AFFN,          ASDF,            ASDF
##VAR_DIM=   32768,         32768,           32768
##UNITS=     HZ,            ARBITRARY UNITS, ARBITRARY UNITS
##FACTOR=    0.250966925370066, 1,           1
##FIRST=     8223.43324360094, -21628,       -121071
##LAST=      0,             -124547,         -246594
##MIN=       0,             -646376,         0
##MAX=       8223.43324360094, 457989672,    0
$$ Real data points
##PAGE= N=1
##DATA TABLE= (X++(R..R)), XYDATA
$$ [...]
19458D6352J63365d7332j55571j63272a81092f8347m0159j47705o4179B33096
19447B0393J76786b17301P1680H4024i438j03954j25994c2856L347A89410B364
19435d4916D525b7171k23808D0313R5382a08223M5497r6617j27230A57140c5965
19423A03249k1227c18399B5165c4233q0042q7990o7952a524o8481E7964e5952
19411A69616B7269J2667i6143p3085k13327c4615l2518k12484M9663b1378A5441
19399e2777q2176B88436A5663a83345Q692P9717A90704a77312g3144c4717C1087
19387a81174F9483e7159j01657B7948a25625e3605j01515B1296a06775L0530I7982
19375b76703J03069I2161d416j73197g463k2451p1995J6178F5075R8834a78927
$$ plain form
19458 46352 209717 -47332 -202903 -366175 -181092 -68347 -108506 -256211 -320390 233096
19447 20393 197179 -217301 -145621 84024 -9438 -113392 -239386 -32856 -29509 189410 2364
19435 -44916 4525 -27171 -250979 40313 135695 -108223 -62726 -159343 -286573 157140 -35965
19423 103249 82022 -318399 25165 -34233 -114275 -202265 -270217 -1524 -70005 57964 -55952
19411 169616 27269 39936 -96143 -169228 -382555 -34615 -67133 -279617 -229954 -21378 15441
19399 -52777 -134953 288436 15663 -183345 -174653 -94936 190704 -177312 -73144 -34717 31087
19387 -181174 69483 -57159 -158816 27948 -125625 -53605 -155120 21296 -106775 -76245 97982
19375 -276703 -173634 92161 -4416 -177613 -7463 -29914 -101909 -85731 65075 163909 -178927
19363A53728h2581N203G299a13619k67773C0721J43281h9366n2838f7227a5601
19351a43417J0286j85488f4391l7891d0889I1735a16467k1243p8457B43586a20370
19339c44082B4348N4400c21188g6731B9153b15014k11190a92730C0499J43796
19329A74295b24161a05062k8455d327A32124A3949b42656F7885l881c08265a8915
19317h9487E2835b19103A44426a68221j18925A92293g746k01679N8627A19396
19306a75234Q0037l8231j3974a6134A75699c01866A423a20574K6234B28698a47556
19294H275e5592A61839h6981A7300a18218j52850i7471A8711b304D1142J4774
19283E5916k6475J53830p9415a06419B34566b67830D9271a31734I9665d2062j51476
$$ plain form
19363 153728 -82581 -77378 7299 -113619 -381392 30721 174002 -89366 -142204 -67227 -15601
19351 -143417 -133131 -318619 -64391 -102282 -40889 91735 -116467 -137710 -216167 243586 -120370
19339 -344082 24348 78748 -321188 -76731 29153 -215014 -426204 -192730 30499 174295
19329 174295 -224161 -105062 -133517 -4327 132124 13949 -242656 67885 64004 -308265 -18915
19317 -89487 52835 -219103 144426 -168221 -287146 192293 -7746 -209425 -150798 119396
19306 -175234 -95197 -133428 -147402 -16134 175699 -301866 1423 -120574 -94340 228698 -147556
19294 8275 -55592 161839 -86981 17300 -118218 -271068 -97471 18711 -2304 41142 55916
19283 55916 29441 183271 103856 -106419 234566 -267830 49271 -131734 99665 -42062 -193538
19272a93538A18743b064n2129F5420K31486c00388o2329n7017D0504l289b17425
19260a26021f1827k0834m2692L8149B57407c19887a12858j11114G8902J26294
19250B05196F5684e1495j97363K7960f6619m3114F9998a49245O9648A5210h7427
19238d88863A75908b32958A22844i5490j09100K953m6130j39321A01895K61612
19228C63507c9415l42645d2244l40624M0277A400a86649k60715a85753A37868
19217a81003A02323a17560c1556A87945b24940A57934G0991a26171A62695b307
19206A0713a42773K9781A25529a73548M795O5285B01658a15686k53813c7841F2113
19194B46560k1206a89790A63211b6098j51988C373b34530D6184K38900a21224
$$ plain form
19272 -193538 118743 -2064 -54193 65420 296906 -300388 -362717 -419734 40504 37215 -217425
19260 -126021 -61827 -82661 -125353 -87204 257407 -319887 -112858 -223972 78902 205196
19250 205196 65684 -51495 -248858 -220898 -66619 -109733 69998 -149245 -79597 15210 -87427
19238 -488863 175908 -232958 122844 -95490 -204590 -201637 -247767 -387088 101895 363507
19228 363507 -39415 -382060 -42244 -382868 -342591 1400 -186649 -447364 -185753 137868
19217 -181003 102323 -117560 -31556 187945 -224940 157934 70991 -126171 162695 -2307
19206 10713 -142773 -112992 125529 -173548 -168753 -103468 201658 -115686 -369499 -37841 62113
19194 246560 225354 -189790 163211 -26098 -178086 3373 -234530 46184 285084 -121224
19183c64820J33534A30635a9471m3310k54425q8457D2097O85b35059A31054Q6317
19172B17371b6268k76265J34064b0279k40041a04672o6792k38846a21248M7108
19162g4140I8984a39337M074j40256j45946C0249N4712K8312K2967n677P7084
19151B07647I0086k6390P157P5501k4040b54730q3310I1713c60855b4818m02099
19140d26917c4167E4719c80666B54996c91171d1801k73002h0046k7528l10174
19130d17748a01694A65359C889a84491g1072B99836c379j89146n4771f7102C7354
19118A92589d2550k13419a16058L5463r470l44400F7190b46266F6966k0425a57216
19106h345l07176a27684e941A75965F1742b30316B44524g2951C20376a97300B05396
$$ plain form
19183 -364820 -231286 130635 -19471 -62781 -317206 -405663 42097 42782 -235059 131054 217371
19172 217371 -26268 -302533 -168469 -20279 -260320 -104672 -171464 -410310 -121248 -74140
19162 -74140 98984 -139337 -135263 -275519 -421465 30249 84961 113273 136240 130563 207647
19151 207647 90086 63696 70853 146354 122314 -254730 -338040 91713 -360855 -24818 -426917
19140 -426917 -34167 54719 -380666 254996 -391171 -41801 -314803 -80046 -107574 -417748
19130 -417748 -101694 165359 3889 -184491 -71072 299836 -3379 -192525 -247296 -67102 37354
19118 192589 -42550 -255969 -116058 -80595 -90065 -434465 67190 -246266 66966 46541 -157216
19106 -8345 -315521 -127684 -5941 175965 61742 -230316 244524 -72951 320376 -197300 205396
19094f16869b63224C28541a6341f320A60580F5945B6856a6393A1973L2246B1873
19082C1540a39302q0760F6637L36777E6583Q5715l2405h4087A17006B2563e7183
19070F4348A0982a98509b7247j25797k8691D9999i3307Q654A96142a85985g5238
19058a08131A58254k2351K2651p7054a21010h051C37154g3397r7610j61761C04692
19046g0007K6964j9281k54219r805e509h03A14668e1571B63738d7470j9629C23378
19033f4185j69507h2002q6614I452K89071a54030B1284O8542l7039K28013J59705
19022D40505F1920a93147R3773j28188f2911n3621d1349B20469a93469q5897A75416
19010g8662j40092A8805K75068C8031M4633J01300b13985i1257L8282J6544F8421
$$ plain form
19094 -616869 -263224 328541 -16341 -6320 160580 65945 26856 -16393 11973 44219 21873
19082 31540 -139302 -220062 66637 403414 56583 142298 109893 -84087 117006 22563 -57183
19070 64348 10982 -198509 -27247 -153044 -181735 49999 -93307 -84653 196142 -185985 -75238
19058 -108131 158254 135903 158554 81500 -121010 -8051 337154 -73397 -171007 -332768 304692
19046 -70007 -43043 -62324 -316543 -326348 -5509 -803 114668 -51571 263738 -47470 -67099 323378
19033 -64185 -233692 -82002 -168616 9452 298523 -154030 21284 89826 52787 280800 440505
19022 440505 61920 -193147 -99374 -227562 -62911 -116532 -41349 220469 -193469 -279366 175416
19010 -78662 -218754 18805 293873 38031 82664 183964 -213985 -91257 -52975 -36431 68421
18998B02112C9977i0157A14157G917K65699F1818b05659O9436k9704O5951F8510
18986D8468f945G26a81137k15728a23575j01173l7101f0012j55135A55685b41363
18974G1042i6501C24953D2387M07133k9417L39092G2446K18571g0475A4669N8191
18963G2860C0294b69502a00898a6659A82904b95371B93984j35375A7562a6213
18952b08057G8938a25556k55163J28621J21792e7359I0478a36203n1398F0646
18941e8944B4728i6547q5644B16928B8763a8880q5862A82451c96147h1673j22213
18930b03886R643l3752b2626k59109a06267A19250P4819R5504B4078c55642F8324
18918B25412i7681k82854c9460J1948l12181A62466b59142F7308e154j93853D07120
$$ plain form
18998 202112 39977 -90157 114157 7917 273616 61818 -205659 -136223 -165927 -99976 68510
18986 48468 -6945 726 -181137 -396865 -123575 -224748 -261849 -60012 -215147 155685 -241363
18974 71042 -96501 324953 42387 449520 420103 759195 72446 291017 -70475 14669 72860
18963 72860 30294 -269502 -100898 -16659 182904 -295371 293984 158609 17562 -16213
18952 -208057 78938 -125556 -380719 -252098 -130306 -57359 90478 -136203 -187601 60646
18941 -58944 24728 -96547 -182191 216928 28763 -18880 -104742 182451 -396147 -81673 -203886
18930 -203886 -194243 -227995 -22626 -281735 -106267 119250 194069 289573 24078 -355642 68324
18918 225412 -97681 -380535 -39460 -27512 -339693 162466 -259142 67308 -5154 -199007 407120
18906A76064M77715C22169R0254b87061j45927A38075a02334B89264a55833N8390
18896i7443J4717m571k50247d4833k53262P8931E2518b51319b7008l3085k64370
18885c24463A40507d0582A81523a37993j11062j16404f1749j09693g1643j21356
18875a92999g6546A79327J22413c17931J48716o4173d7521j49142d1531k11322
18865b52853A61075e3374a9707o0636k54034a5967A18207e7931A48974a25901
18854B09476i6987O547j42514Q0686A312b3426D1005L03425f7699C05326E1302
18842a43571l7022o202E1691M7331l753a19399B36614N0384F6101O6681b02179
18830a35713k1136j8368j62020A95729b25048A99480b3241a1294j06873n5674
$$ plain form
18906 176064 653779 322169 412423 -287061 -432988 138075 -102334 289264 -155833 -97443
18896 -97443 -82726 -87297 -337544 -44833 -298095 -219164 52518 -251319 -27008 -60093 -324463
18885 -324463 140507 -40582 181523 -137993 -249055 -365459 -61749 -171442 -71643 -192999
18875 -192999 -76546 179327 301740 -317931 -169215 -233388 -47521 -196663 -41531 -252853
18865 -252853 161075 -53374 -19707 -80343 -334377 -15967 118207 -57931 148974 -125901
18854 209476 -96987 -90440 -232954 -152268 1312 -23426 41005 344430 -67699 305326 51302
18842 -143571 -180593 -186795 51691 99022 95269 -119399 236614 286998 66101 132782 -202179
18830 -135713 -156849 -175217 -337237 195729 -225048 199480 -23241 -11294 -118167 -173841
18820a73841B0467K5119a25704J242A85286l8580c2128A26676J08900a43171A93734
18808g2505B15809a45128b3681A95349a61992G4034J73311e00994a60868e3775
18797A69808a40602E49353h5792c4803l0464E6184a24239N4201A79857a52420
18786c2k02434j10977A28766a61611a1321o8441j09605B5620g363j89431e407
18774B77789p2171a28734j30586n452a16845H4296a0932l9469G2118b62700A5480
18762D1537B815J38232P9738c46560A08385b05500M0471j04231a10577C8697h861
18750g4360A15650a14522G0699B8226b73523f9574n4590L3383A48247K96205g8755
18738b8309k19616j0846K1916a02587A22274e98639a36282A5252b3963M772k04023
$$ plain form
18820 -173841 20467 45586 -125704 -124462 185286 146706 -32128 126676 235576 -143171 193734
18808 -72505 215809 -145128 -23681 195349 -161992 74034 247345 -500994 -160868 -53775
18797 169808 -140602 549353 -85792 -34803 -65267 56184 -124239 -70038 179857 -152420
18786 -32 -202466 -313443 128766 -161611 -11321 -79762 -189367 25620 -7363 -196794 -5407
18774 277789 205618 -128734 -259320 -264772 -116845 84296 -10932 -50401 72118 -262700 15480
18762 41537 2815 141047 220785 -346560 108385 -205500 -165029 -269260 -110577 38697 -8861
18750 -74360 115650 -114522 70699 28226 -273523 -69574 -124164 -90781 148247 444452 -78755
18738 -28309 -247925 -258771 -236855 -102587 122274 -598639 -136282 15252 -23963 -19191 -223214
18727b23214G6181b42173d9144k24695k5777h4790a955D7755K24451a25950N9052
18716f6898G5713a90452m7271j11776e8929A86670g8663F3741a69021A98423b67449
18704A8130P9674a77541g7658j3588m8826b3221k39901B69894C7008a19473B47105
18692c1559A43240j1050E95a06633M9268r0814o3539j87907A38231g0373I3754
18680a09107G9525J6131C5723a97889j25837A2913a26409L9469b5993B72143o4761
18669B07382a36263N4384j67138A06567c22082g1817a3312j61639q2171h810j60034
18658a68844a9542B29527b56563f5077f016o7267B75254a32144A93538J42083
18648C35621c82744a00283a8542k48540c771l05752a2522j61463p7384f1259l4036
$$ plain form
18727 -223214 76181 -242173 -49144 -273839 -299616 -84790 -1955 47755 272206 -125950 -66898
18716 -66898 75713 -190452 -237723 -349499 -58929 186670 -78663 63741 -169021 198423 -267449
18704 18130 97804 -177541 -77658 -91246 -140072 -23221 -263122 269894 37008 -119473 247105
18692 -31559 143240 132190 595 -106633 -57365 -148179 -211718 -399625 138231 -70373 93754
18680 -109107 79525 95656 35723 -197889 -323726 12913 -126409 -86940 -25993 272143 207382
18669 207382 -136263 -81879 -249017 106567 -322082 -71817 -13312 -174951 -257122 -8810 -168844
18658 -168844 -19542 229527 -256563 -65077 -6016 -73283 275254 -132144 193538 335621
18648 335621 -382744 -100283 -18542 -267082 -3771 -309523 -12522 -173985 -251369 -61259 -95295
18637i5295l4405C4612c03469D2383b61325a13283m3807l0668f4096j85682R2252
18626a57526N2778A22674L5164K6570P0981g6253A15697d26507b2871k71418h2435
18614h6871C5236L0394n824d9440J4648D0016J19981E2N932J59124h0789j50966
18602b31755I5744a45205B8107a5781F3813c82227a5934D9158f3074a2757k88361
18591c01118a39232d0560B71495a30283K9576F4166a55915K5143H0686J85695
18581B66381c2082k21860D0722d61176a56405j462c530A36581A8756a09841j3446
18570a23287K9860G8010L4909O8819e4321a1316A3037g6604k36279C9486a61674
18558a16425A91476b2200l0370A76287a02404o2583J6876A24306h0779j94134
$$ plain form
18637 -95295 -129700 34612 -303469 42383 -261325 -113283 -157090 -187758 -64096 -249778 -157526
18626 -157526 -104748 122674 157838 184408 255389 -76253 115697 -426507 -22871 -294289 -82435
18614 -86871 35236 65630 59806 -49440 -34792 40016 159997 52 5984 165108 -80789 -231755
18602 -231755 95744 -145205 28107 -15781 63813 -382227 -15934 49158 -63074 -12757 -301118
18591 -301118 -139232 -40560 271495 -130283 -100707 64166 -155915 -130772 80686 266381
18581 266381 -32082 -253942 40722 -461176 -156405 -157867 -3530 136581 18756 -109841 -123287
18570 -123287 -93427 78010 112919 181738 -54321 -11316 13037 -76604 -312883 39486 -161674
18558 -116425 191476 -22200 -52570 176287 -102404 -164987 -148111 124306 -80779 -274913
18548b74913b2379F0605f5569B20773a9105A77464d9160p3034K5050a5786A20485
18536a55310D9672L8048J7755D2064J76786e0235A26455g5111A95721f6684j62863
18525b29547b6748C92145a16788B2860i9579b9443I0587N7944B2014a45607L0943
18514a14664a8583j63456D7836J23713a29214e5032n4862J7661c2501m9882F3161
18502d72693A72966d9702J6610C8188a83492R0855j39819N1003p4110J13052I7503
18490E9647j8679a82677I5339A1033J29690e300F917c9523L293C6520b20076h0085
18477c5392k68185b7726a3538r172B335i8818p8579O6607K260j06204A17700i6009
18464a03360D5964M3341J38887a43659O502C8960Q5693a77686L2349D2797a21071
$$ plain form
18548 -274913 -22379 60605 -65569 220773 -19105 177464 -49160 -122194 -97144 -15786 120485
18536 -155310 49672 87720 105475 42064 218850 -50235 126455 -75111 195721 -66684 -229547
18525 -229547 -26748 392145 -116788 22860 -99579 -29443 90587 148531 22014 -145607 -114664
18514 -114664 -18583 -182039 47836 171549 -129214 -55032 -109894 -92233 -32501 -82383 63161
18502 -472693 172966 -49702 -33092 38188 -183492 -92637 -232456 -181453 -255563 -142511 97503
18490 59647 40968 -182677 95339 11033 140723 -5300 6917 -39523 -36230 36520 -220076 -80085
18477 -35392 -303577 -27726 -13538 -22710 2335 -98818 -177397 -110790 -108530 -214734 117700 -96009
18464 -103360 45964 89305 228192 -143659 -137157 38960 124653 -177686 -145337 42797 -121071
18452i0380B9451A585M5746g5542J983g140l10662C3617d22481A53733a04141
18440a25848c8152q7951a7282l342j56851A36599f7199k24530Q5625N8125d9729
18428b22007o7737b5179l2400B41253r1038O1909I5676B9789d8051m3129G0150
18416g459k18652C12222c6082l0814a2632C2234N7869a74066N2327c2500B76964
18404i3011A79498b91467E8715c6163j54058C512L424J89242i3542b6542B17834
18392A20034e6485j29460O185A19223R6719c17320B84984I8455p926J69209G6283
18380A3776c55652A34284g661C7486R8007H560J44089a00045r8682g3355q7424
18369a60779C9438a10513G2222P5169a87657G1425I380K6317h2522b3025F8539
$$ plain form
18452 -90380 29451 1585 47331 -75542 -73559 -7140 -317802 33617 -422481 153733 -104141
18440 -125848 -38152 -126103 -17282 -20624 -177475 136599 -67199 -291729 -206104 -147979 -49729
18428 -222007 -289744 -25179 -57579 241253 150215 212124 95676 29789 -48051 -91180 70150
18416 -7459 -226111 312222 -36082 -66896 -12632 32234 90103 -174066 -121739 -32500 276964
18404 -93011 179498 -291467 58715 -36163 -190221 3512 6936 196178 -93542 -26542 217834
18392 120034 -56485 -185945 -179760 119223 215942 -317320 284984 98455 90529 259738 76283
18380 13776 -355652 134284 -7661 37486 135493 8560 152649 -100045 -198727 -73355 -160779
18369 -160779 39438 -110513 72222 147391 -187657 71425 9380 35697 -82522 -23025 68539
18357b12021A92330b77102F517c7054q0826m9245j0759H4194J20874b18176O5030
18346a53146n795a4656j73537A34387K84419H7767J0207f7993j4076B26511a27039
18334b78780c1422p5229C6592K799a0968B32238b60352F988R6425j1504c92665
18322H7111A574d4294K0479C14116d09213f9981J4252j70716M7253A04774e9294
18310h2703A948b40293M6971I8022a80681e8704j42452O2433A4413b21328g0903
18298h7702F4253J21881c83230a4190A6919e28420K49377B7418B044J81325F2412
18286A0654K13470a31710A01374B9828g2627A06955J20028j4316B514g9476A23375
18274a28603A84312a7395j42996j38764F0817a7322m11390a6637A14668J45516
$$ plain form
18357 -212021 192330 -277102 6517 -37054 -117880 -167125 -177884 84194 205068 -218176 -153146
18346 -153146 -158941 -14656 -188193 134387 418806 87767 97974 -67993 -82069 226511 -127039
18334 -278780 -31422 -106651 36592 39391 -10968 232238 -260352 6988 103413 91909 -392665
18322 87111 1574 -44294 -23815 314116 -409213 -69981 -55729 -226445 -179192 104774 -59294
18310 -82703 1948 -240293 -193322 98022 -180681 -58704 -201156 -138723 14413 -221328 -70903
18298 -87702 64253 186134 -383230 -14190 16919 -528420 -279043 27418 2044 183369 62412
18286 10654 224124 -131710 101374 29828 -72627 106955 226983 212667 2514 -79476 123375
18274 -128603 184312 -17395 -160391 -299155 60817 -17322 -428712 -16637 114668 260184
18264B60184A09829M1448c15964e2139B5197b7468B6356K8541a33108F6823a54469
18252b23204B08464C2217d4137A49747h3025A85270a79643K107M8038Q777B85590
18240d1482B23901f1689K1562A72181a31284A22237d3608n7080B25361a11097
18229a52455A39225b35257a15933A25833d0786m11287A36246n1440a56763d7692
18218f2926E9674a57855f6432A03423a06222A68754a98381c4914G6516c56748
18207d7326A1113g0728a6707j90452A69470b34467a11231k62150P9826G4291b6808
18195A21034n8019c60843e7258m0910E9575a70370R77A0647a10816d6225A28518
18183B78928M9398b15501F358a42485A18592a8437B65736h5342I8377k0964i1100
$$ plain form
18264 260184 109829 151277 -315964 -52139 25197 -27468 26356 54897 -133108 66823 -154469
18252 -223204 208464 32217 -44137 149747 -83025 185270 -179643 -177536 -129498 -120721 285590
18240 -41482 223901 -61689 -40127 172181 -131284 122237 -43608 -100688 225361 -111097
18229 -152455 139225 -235257 -115933 125833 -40786 -452073 136246 84806 -156763 -47692
18218 -62926 59674 -157855 -66432 103423 -106222 168754 -198381 -34914 76516 -356748
18207 -47326 11113 -70728 -16707 -207159 169470 -234467 -111231 -373381 -293555 74291 -26808
18195 121034 63015 -360843 -57258 -98168 59575 -170370 -169393 10647 -110816 -46225 128518
18183 278928 328326 -215501 6358 -142485 118592 -18437 265736 -85342 98377 77413 -91100
18171a63790J7537I8795A7865a81788d2471D15176A10465L8227a34656I3704L5777
18160A29481a75178A86412D9176Q5976q316N7695F0367a59161r7966C0896e9949
18148A69097a44846j7689l9874d0693j3201A32842l2997K39407A44802M364k6885
18137A22281n2444a59742B33819I8004b253G8521f2326j88595E9429b13339d4480
18125c3402j21426A64580L9650i4150j82082J3660L5479A12416a98009A70270
18114d8264j58144R8673H463Q2996b37258A12282M4682c92681a4000k5754A27119
18102A51975K1198K4341E196L20354j51826b01907B0534L42967a84171A04982
18091A92494c9332B71579a00663k69359A39369d69587K12884B40008a97051L331
$$ plain form
18171 -163790 -146253 98795 17865 -181788 -42471 415176 110465 148692 -134656 93704 129481
18160 129481 -175178 186412 49176 135152 126836 184531 60367 -159161 -257127 30896 -59949
18148 169097 -144846 -162535 -202409 -40693 -53894 132842 99845 339252 144802 149166 122281
18137 122281 69837 -159742 233819 98004 -2253 78521 -62326 -250921 59429 -213339 -44480
18125 -33402 -154828 164580 204230 -94150 -276232 -262572 -227093 112416 -198009 170270
18114 -48264 -206408 -107735 8463 91459 -237258 112282 156964 -392681 -14000 -39754 127119
18102 151975 173173 197514 5196 325550 173724 -201907 20534 363501 -184171 104982
18091 192494 -39332 271579 -100663 -370022 139369 -469587 -256703 240008 -197051 -193720
18081a93720Q1793j0527l5768e6162D11837k0608C4300b64589P9762B67613c9979
18069B93748A35585b97857a3241D7712h9632k9905L5107C8353f9461m3282B69278
18057g2391A67630K1692a57819f3483j86914a21374k76276J4702A6384e1354J552
18046d9802B79086e02649B46238O5320a9213E2025J62293H6978g5765n4136C77819
18034b26140a03390j34408j8836A70004J17258C5711d6475B1288a29306A37768
18023b15630r1880J16861H2663J63504a9942p3392C06782c2169A95393b1431n5026
18012g6457L1987l20043c7133f172k45926g557E9210B8804j0912K22818E5326
18000e2987a7488j25142k6656B640b99732A49451c7624A22327E6000d1291k8902
$$ plain form
18081 -193720 -111927 -122454 -158222 -56162 411837 391229 34300 -264589 -184827 267613 -39979
18069 293748 135585 -297857 -13241 47712 -89632 -119537 -84430 38353 -69461 -112743 269278
18057 -72391 167630 189322 -157819 -63483 -250397 -121374 -397650 -382948 16384 -51354 -49802
18046 -49802 279086 -502649 246238 311558 -19213 52025 214318 86978 -75765 -129901 377819
18034 -226140 -103390 -237798 -256634 170004 287262 35711 -46475 21288 -129306 137768
18023 -215630 -307510 -190649 82663 246167 -19942 -93334 306782 -32169 195393 -21431 -76457
18012 -76457 -44470 -364513 -37133 -6172 -252098 -7557 59210 28804 17892 240710 55326
18000 -52987 -17488 -142630 -169286 2640 -299732 149451 -37624 122327 56000 -41291 -70193
17989g0193E9093K19311a52785G8373d94724A24526K19725c7669b424A10603K8977
17978A39580b27288A61031d12685A99668A5444d48732B41287o2855c46813a39468
17967A22994J1816N811a02330L669A29147n4530d2071A13273R0408g3651C3818
17955A02475f3945F1620J61720b78454g5524j88886C96459j61211b34249E2928
17944A60736a15281I9031J74013J67782A25591d1506A62551F1709K85568g7565
17933c2803a4454E2160M6431a00972C38525d6533B48474b15186j4502f0257B8601
17921a18467j99816L4557C1501J80785k8506a32376a7096D10987A46361a91131
17910e2854A78905I110a01483F5702E261g17n368p9569A72909k8580n1364a30411
$$ plain form
17989 -70193 59093 278404 -152785 78373 -494724 124526 344251 -37669 -2424 110603 139580
17978 139580 -227288 161031 -412685 199668 15444 -448732 241287 178432 -346813 -139468
17967 122994 134810 140621 -102330 -98661 129147 74617 -42071 113273 203681 -73651 33818
17955 102475 -63945 61620 223340 -278454 -75524 -264410 396459 235248 -234249 52928
17944 160736 -115281 99031 273044 440826 125591 -41506 162551 61709 347277 -77565
17933 -32803 -14454 52160 98591 -100972 338525 -46533 248474 -215186 -229688 -60257 28601
17921 -118467 -318283 -283726 31501 212286 183780 -132376 -17096 410987 146361 -191131
17910 -52854 178905 9110 -101483 65702 5261 -717 -6085 -85654 172909 144329 92965 -130411
17897a54869m1857Q2061N819a3692G3100B7912i9274D28799A1788b49431a07194
17885B92410j1427r1633h6453B34974b2281E9609a11711E5140J97863R9549a08035
17873B47924b81970A77468q8551f5578L2723a2174E29184g4360B3624j846Q8619
17862A10397G119J06656a13576C4032J89701J70583b90624B01453a42834f7155
17851i3753C82560A24949K75510q4083j20266l4569K05118A17048D9429R0346
17841A39775J43619a57995O5993A86154G89N0813a22227e6041j2408j06373A03018
17829h0326G6850J46581J30527F1323p650B0955N7489l8883b5104A75395p1948
17818A03447J39592h4167K2861r0839A48664h792A69009m0455l1048b68082I0384
$$ plain form
17897 -154869 -196726 -114665 -108846 -13692 73100 27912 -99274 428799 11788 -249431 -107194
17885 292410 280983 189350 -86453 234974 -22281 59609 -111711 55140 253003 352552 -108035
17873 247924 -281970 177468 88917 -65578 -32855 -12174 529184 -74360 23624 21778 110397
17862 110397 7119 113775 -113576 34032 223733 394316 -290624 201453 -142834 -67155
17851 -93753 382560 124949 400459 316376 196110 161541 366659 117048 49429 139775
17841 139775 283394 -157995 -92002 186154 789 51602 -122227 -56041 -68449 -174822 103018
17829 -80326 76850 223431 353958 61323 53673 20955 78444 39561 -25104 175395 103447
17818 103447 243039 -84167 -61306 -152145 148664 -8792 169009 128554 97506 -268082 90384
17806A54554J06835A00055B3351N9301HK08867m8154D6613J75902d3703C75660
17794I1102a06532F3070J17792a93945C25362G1242b73238D7465L0566J5270J10814
17783B04115a262k64656B29781a94946G7008F171L01929I5117J09299i4467p5294
17772a69761c1461D80001E9256b12105D43615b28674I5265l5155J02870F4253
17761A85896C1289N5321j6362J21589J09400J15714A36813h9062a0249A90171
17750A23205N8872J79866B5928b3877g639E8262L54263f0010H354N1099K43128
17739C02581A38032M0640I194J04927c9175A24458h6983F9879d45174d4987C22201
17727I362J31484B3127J4593K19709I9815b14035N4873K9360d3542C6445b4408
$$ plain form
17806 154554 261389 100055 23351 82652 8 208875 160721 46613 222515 -43703 375660
17794 91102 -106532 63070 180862 -193945 325362 71242 -273238 47465 78031 93301 204115
17783 204115 -1262 -265918 229781 -194946 77008 6171 308100 95117 204416 -94467 -169761
17772 -169761 -31461 480001 59256 -212105 443615 -228674 95265 60110 162980 64253
17761 185896 31289 86610 70248 191837 301237 416951 136813 -89062 -10249 190171
17750 123205 182077 361943 25928 -23877 -7639 58262 412525 -60010 8354 59453 302581
17739 302581 138032 178672 9194 114121 -39175 124458 -86983 69879 -445174 -44987 322201
17727 9362 140846 23127 37720 257429 99815 -214035 -159162 -129802 -43542 36445 -24408
17715d7603F8147K45068l3919A24333d3483B84163n1498a19435a8522G1548k6777
17704D4771g4703B01740D3978a94122B94749E4615O0090K39976A30810Q1354e0390
17692F06504b17472D01375A47652a22303B18930K22782n3883a7375D6478K43143
17682B89621A341Q8517a84452j63917B02162a13995M508c2916A5064O4581J0928
17671I0573k2356J01241b8866A27296K05971I3853Q1472J35011A02056c6385D2101
17659e4242D65631a9717G7181P3813J08504H9890N9839G3655K2185K26121F0242
17647A3621J53459a5229H2153a90443d1171B03659I6133J19585F3922K0676B9350
17635A99943h6734B8151J1986J52716E1308J32292C8798n892b07345i1085a1821
$$ plain form
17715 -47603 68147 313215 279296 124333 -43483 284163 232665 -119435 -18522 71548 44771
17704 44771 -74703 201740 43978 -194122 294749 54615 114705 354681 130810 212164 -50390
17692 606504 -217472 401375 147652 -122303 218930 441712 387829 -17375 46478 289621
17682 289621 1341 89858 -184452 -348369 202162 -113995 -109487 -32916 15064 79645 90573
17671 90573 68217 169458 -28866 127296 333267 93853 175325 310336 102056 -36385 42101
17659 -54242 465631 -19717 77181 150994 259498 89890 149729 73655 95840 321961 60242
17647 13621 167080 -15229 82153 -190443 -41171 203659 96133 215718 63922 84598 29350
17635 199943 -86734 28151 40137 192853 51308 183600 38798 32906 -207345 -91085 -11821
17623A19266L1678j1532C2036h0853C39467L0273A21278J51570j00200F3942N9998
17612A23940Q7699e2131C02540h9515j51854A15445l8241J46033I1282g5085n6180
17601a31265a0078H4549K02075A29582M6155a08615j77172B19580J34195j06624
17591B47151j00990J24516C2992Q7085n2363J64221F8063L8258J62641E4868K17456
17580B72324B3709h8883C05309L3861m7631G7031J84035E1545K68215c3296r8802
17569a32098B62441J96391B01568L97859b466C04969i1645D01102m8915J00876
17559D53063c0618C26141A3517L60445j280a20764C51831a7679A88083G9226L4286
17548A13512k6815J10220R7947G3256J40186K02090j27497q2280N56441G0386
$$ plain form
17623 119266 150944 139412 32036 -80853 339467 369740 121278 272848 172648 63942 123940
17612 123940 211639 -52131 302540 -89515 -241369 115445 77204 223237 91282 -75085 -131265
17601 -131265 -10078 84549 286624 129582 175737 -108615 -285787 219580 353775 247151
17591 247151 146161 270677 32992 120077 67714 231935 68063 106321 268962 54868 272324
17580 272324 23709 -88883 305309 339170 291539 77031 261066 51545 319760 -33296 -132098
17569 -132098 262441 458832 201568 599427 -2466 304969 -91645 401102 352187 453063
17559 453063 -30618 326141 13517 373962 372682 -120764 351831 -17679 188083 79226 113512
17548 113512 86697 196917 294864 73256 213442 415532 288035 205755 762196 70386
17537A13047K7573J13237J32408j11009A15643J22249J4270K23378J71865j39041
17527E08364J49273J17293L79389J39662k3426l27352k02132r4661r661B03672
17516G9303L35297j12557K39059K26022j68849K54836N14807j61169J46963l62352
17506I91360j91402m6086l29439o7630I1830P17770r5979C25293n521K79529k92853
17495C06448N342J32699J17376K2733K4869A16257K70363K29929l02529k931K19565
17484E30654A49492m4059J52385M14115B65536J85330k22935N5641L10566C0274
17473B07552L17723j40444L0754j71893K19790A61905K33105A84251J5597K1578
17463B21426J79520j98836p8596K35474r7761J72996j51307R8077k6668p1585
$$ plain form
17537 113047 140620 253857 386265 275256 115643 237892 252162 475540 647405 508364
17527 508364 657637 774930 1154319 1293981 1270555 943203 741071 646410 636749 203672
17516 79303 414600 302043 541102 767124 598275 853111 1367918 1206749 1353712 991360
17506 991360 799958 753872 424433 356803 91830 809600 713621 325293 319772 599301 306448
17495 306448 311790 444489 561865 584598 609467 116257 386620 616549 314020 311089 530654
17484 530654 149492 105433 257818 671933 265536 450866 227931 283572 594138 30274
17473 207552 525275 384831 415585 243692 463482 161905 395010 184251 199848 221426
17463 221426 400946 202110 123514 358988 261227 434223 282916 380993 354325 282740
17453B82740J66020k1485j96771R1329l5993A29110M13466k2096R8900k59446
17443C59934A74863L56135Q4964k50368n0835J79657j39815R0442J39106B83835
17432E87470j48192R3151J30305C28638L86742k60532A71292K61971K188L01330
17422G36781r6068j24362J01229j29511j89628K36141B56181n6492E7353J21011
17412A78364R4380K80953o5148A40351E7247L57349I9516K6407L55535B33171
17401H1763a43170C41516A60884P0412M07796C00642j21884L94755A99676J65027
17391C64703j73841g4709D95295l2426K3665A92715M8169o0344J67034j14029
17381B33545b8383F04001B19905L1283m2698K11058p7944m6787K13070j22180
$$ plain form
17453 282740 448760 427275 230504 321833 285840 129110 542576 520480 619380 359934
17443 359934 174863 530998 615962 365594 314759 494416 354601 445043 584149 283835
17432 587470 439278 532429 662734 328638 715380 454848 171292 433263 435451 736781
17422 736781 640713 516351 617580 488069 298441 534582 256181 199689 57353 178364
17412 178364 272744 553697 488549 140351 57247 414596 99516 125923 481458 233171
17401 81763 -143170 341516 160884 231296 639092 300642 178758 573513 199676 364703
17391 364703 190862 -74709 495295 462869 486534 192715 240884 180540 347574 233545
17381 233545 -28383 604001 219905 251188 208490 419548 341604 294817 507887 385707
17371C85707j88021r7213J43273o3210K87439j57266m9595J40624o476P6627K515
17360D74404l7159j30226k1251E5098J09981o9260K1406K57066A84291m9189J04923
17349B40025K9732M29501j92005j20329p0692J11062k05511M6434J28849j05255
17339B91811N5684B5580N84326k73204q7011k0558K41035A50885K89929A24216
17328E86524I1575J78883r3170K04548r3669E2312a8288E38416j27279p9616M8416
17317C79937k367J5295J16551F9711L8486K55327m9889A18080Q4298N0362q4767
17306A67973J19541j30805L88977A72350M08328j39086A94125L16793j51203a80571
17295A28876K38379j22238n9354N9475K38034p6271A44635N25696j88300l4296
$$ plain form
17371 385707 197686 100473 243746 180536 467975 310709 261114 401738 395262 471889 474404
17360 474404 437245 307019 285768 55098 165079 95819 117225 374291 184291 135102 240025
17349 240025 269757 699258 507253 386924 316232 427294 221783 268217 397066 291811
17339 291811 347495 25580 609906 336702 249691 229133 470168 150885 440814 124216
17328 586524 91575 270458 177288 381836 288167 52312 -18288 538416 411137 331521 379937
17317 379937 377570 392865 509416 69711 108197 363524 313635 118080 202378 252740 167973
17306 167973 287514 156709 545686 172350 580678 441592 194125 510918 359715 -180571
17295 128876 367255 245017 185663 245138 483172 406901 144635 670331 482031 447735
17285D47735P4936j43843j18206K26017J42498j81685K5652j58712J67162j45482
17275C36072J04488h3796C28994J49147N4840J89545j93360j10568A31053K42888
17265C73941p2663j3926l6767l6482N4239K97068q2524N3384k19689m133R1821
17254D04269P2846J32470L423B65405K81878j57486r9005R6197K3575q0532J04683
17243D34715p9576J5141L4903Q4736J12179p0981o9224Q2907r5175k2257L7393
17232D64761j91172J78058L5555L68933B04979L35366j55719j47752J79113K37690
17222F53677j20225j36248P7487k4077J10183J7319K2134l5936k58636M25229
17212G30907k08936j25714J83587K1214k4766j23026R6651N1715j01631j9479
$$ plain form
17285 447735 522671 378828 260622 486639 629137 447452 473104 314392 481554 336072
17275 336072 440560 -83796 328994 478141 532981 722526 529166 418598 131053 373941
17265 373941 301278 287352 250585 214103 268342 565410 482886 536270 316581 312448 404269
17254 404269 477115 609585 613008 265405 547283 389797 290792 386989 410564 330032 434715
17243 434715 355139 370280 405183 489919 602098 531117 461893 544800 449625 427368 464761
17232 464761 273589 451647 487202 856135 204979 540345 384626 236874 415987 653677
17222 653677 533452 397204 474691 450614 560797 578116 600250 564314 305678 730907
17212 730907 521971 396257 579844 601058 576292 453266 549917 601632 500001 480522
17202D80522K52435C04214K43374p8440j90048j02167J81506K79512l15447J10873
17192D33377P1410l9900P1721n4920J9260j38266M64896k45291O2782l07483L55546
17181F93132k25371n2353K50303J1573j70364K2857B40483M49574j29021J61477
17171G22513k24156K50366C66935K03582j82108J89992P8772n5588J81674k95616
17161D87643Q0317Q957K56803l74832k7647J79716L2863k38218K32815j25945
17151E12472L38342l35970M56395C02588K04692K24580j71502K04567K61564k62766
17141G63723k26480K13986N6477l45687J17460J68550M6983j78818M5516C12337
17130A005249l94838P177j52114L99852k95823K96312k09135L50252m17480M46962
$$ plain form
17202 480522 732957 304214 547588 469148 279100 176933 358439 637951 322504 433377
17192 433377 504787 464887 536608 481688 500948 362682 827578 582287 645069 337586 693132
17181 693132 467761 415408 665711 677284 506920 529777 240483 690057 561036 722513
17171 722513 498357 748723 366935 570517 388409 578401 657173 601585 783259 487643
17161 487643 567960 576917 833720 458888 431241 610957 643820 405602 638417 512472
17151 512472 850814 514844 971239 302588 507280 731860 560358 764925 1026489 763723
17141 763723 537243 751229 807706 462019 579479 748029 795012 616194 661710 312337
17130 1005249 610411 617588 465474 865326 569503 865815 656680 1006932 589452 1036414
17120A036414l82473J70954j54517Q4333J4308L25915j44921l06649m3785J41387
17110G40966J86758k61966j97972K42136K68593m77097J78009L788J709J23131
17100H08055l74305M60830n5342j17425L43823l38430P6795m1970J2938j55059
17090F19910K22097K57348k33158L16370q3893K5459L5438k30002m0162j1095
17080H78312K13026l03135k8625J1873L55787J06229l93179R2336k7038L8053
17070I43639p8894l1578J65550l00594J93893m5707M81845L9668l75807j9180
17060I72835j38873J29110q6372N47937n90527K02411J85174k47030J02181O0589
17050A137435j71271J36622N98901p86536R4048J60673k22211L14975j78508N9473
$$ plain form
17120 1036414 653941 824895 670378 754711 769019 1094934 950013 643364 599579 740966
17110 740966 927724 665758 467786 709922 978515 501418 679427 683215 684924 808055
17100 808055 433750 894580 839238 721813 1065636 727206 804001 762031 774969 619910
17090 619910 842007 1099355 866197 1182567 1098674 1124133 1159571 929569 889407 878312
17080 878312 1091338 788203 759578 771451 1127238 1233467 840288 932624 905586 943639
17070 943639 864745 833167 998717 698123 892016 846309 1328154 1367822 992015 972835
17060 972835 833962 963072 876700 1424637 834110 1036521 1221695 974665 1076846 1137435
17050 1137435 966164 1102786 1701687 915151 1009199 1169872 947661 1262636 1084128 1143601
17040A143601k50770M0730L033P2124j19631J74235j39803L34923J77037l56579
17030A078900J43085J25396l35389J76231N66591m10963k5468L4042j24843j50906
17020A076676k19829O08171k78420L12953J01153J22052L9218p60237K78948J50541
17010A431226Q195J7918P4137o8960m6128n3643j40234M28043k20723Q4171L2736
16999A546738j50300J0202j93351L12149K71705k43643j53930Q7356K78859l30216
16989A435569L64480l81768n226M30859m589m62772K33977P7249k49340M5925
16979A484364K90329K33579Q3221l64315j75925K58210l95437N09607k24367j1916
16969A687350K11835l33572J86190j28464M82191J26348l89026o486J72987n5594
$$ plain form
17040 1143601 892831 933561 936594 1008718 889087 1063322 923519 1258442 1435479 1078900
17030 1078900 1221985 1347381 1011992 1188223 1754814 1343851 1318383 1352425 1227582 1076676
17020 1076676 856847 1465018 1186598 1499551 1600704 1722756 1761974 1001737 1280685 1431226
17010 1431226 1439421 1457339 1531476 1462516 1416388 1362745 1222511 1650554 1429831 1514002 1546738
16999 1546738 1396438 1406640 1213289 1525438 1797143 1553500 1399570 1486926 1765785 1435569
16989 1435569 1800049 1418281 1413055 1843914 1839325 1376553 1610530 1687779 1438439 1484364
16979 1484364 1774693 2008272 2091493 1727178 1551253 1809463 1414026 1923633 1699266 1687350
16969 1687350 1899185 1565613 1751803 1623339 2105530 2231878 1842852 1836366 2009353 1953759
16959A953759R9766m1833R1498q4647N2873j44005J97685j43136N3221M20048
16949B455229k07026j22194j44367k12918N05875j11704P7617o2912O8354K70525
16939B516479r4346K33598k07319j33744L26783J81385l33073M42156j71350l40729
16929B419840k9581N16100k73474N5108o319O5402L03806m28168J00834Q9697
16919B813245m2258K01769j17339J63572p4196k49565o3264Q28351m65262N2741
16909C047794K80680J42646j60590K7044j98564J48187J5840p1268L47316p9987
16899C499098o479K15094j45253J18045n6988L70977l54014J86446j13161n2417
16889C661348L94046j53260J49116q0999O38341k87034j21828L34247l49859M03772
$$ plain form
16959 1953759 2053525 2011692 2103190 2018543 2071416 1927411 2125096 1981960 2035181 2455229
16949 2455229 2248203 2126009 1981642 1768724 2274599 2162895 2240512 2177600 2245954 2516479
16939 2516479 2422133 2655731 2448412 2314668 2641451 2822836 2489763 2931919 2760569 2419840
16929 2419840 2390259 2906359 2632885 2687993 2681674 2747076 3050882 2622714 2723548 2813245
16919 2813245 2770987 2972756 2855417 3018989 2944793 2695228 2631964 3460315 2995053 3047794
16909 3047794 3328474 3471120 3310530 3337574 3139010 3287197 3303037 3231769 3579085 3499098
16899 3499098 3492619 3707713 3562460 3680505 3623517 3994494 3640480 3826926 3713765 3661348
16889 3661348 4055394 3902134 4051250 3970251 4608592 4321558 4199730 4533977 4184118 4587890
16879D587890k4071Q667N01337n73661R1835K83607r6912K5727N6373n9108N42411
16868E344095l15200l7916K74290m3241K45624R6845J06583O4974J86172k37446
16858E684780L54413k03526j56241L65109O3430L45798o9103P1553J25072j44270
16848F437015L30705n3445M41624j81163J66610K86055J28347K62654j76066J72331
16838G814667J43871n5459M67812K9249L8777R4487K71310q0814L79570J14340
16828I217810j88641N17347L24387J03486k62266L10906J78396M33849J65012
16819A0800286J97057L6019M83689J31759J84914K83492J26727J40128Q63284
16810A3247355j91199P64947j81465J80115J95023M05687o720P93834K42993N91937
$$ plain form
16879 4587890 4563819 4572486 5073823 4500162 4591997 4875604 4778692 4804419 4860792 4801684 5344095
16868 5344095 5028895 4990979 5265269 5222028 5467652 5564497 5671080 5736054 5922226 5684780
16858 5684780 6039193 5835667 5679426 6044535 6107965 6453763 6384660 6456213 6581285 6437015
16848 6437015 6767720 6714275 7155899 6974736 7141346 7427401 7555748 7818402 7642336 7814667
16838 7814667 7958538 7903079 8370891 8400140 8438917 8533404 8804714 8723900 9103470 9217810
16828 9217810 9029169 9546516 9870903 9974389 9712123 10023029 10201425 10635274 10800286
16819 10800286 10997343 11033362 11517051 11648810 11833724 12117216 12243943 12384071 13247355
16810 13247355 13056156 13821103 13639638 13819753 14014776 14420463 14413743 15207577 15450570 16042507
16800A6042507P1814L60566L17302K71236P32494O1280O13961K82082N97955K31425
16790A9582622P86851J21607O23573P29030M69757P62457L28412Q55177L90012
16781B4649498J140655L15438O73971R29543N66186R05046P60632Q87685J048557
16772C1877211O25751R85949P03433J176155Q90589J220891J547558Q83435R46013
16763D0856985J387410J406455J289633J188741J818603J233882J766697J296816
16755E2245222J678847J805026J655885K109819K021399J970092J746377J835431
16747F7068098J792111K299681K353936K105707K019430K269227K590003J918642
16739H4416835K465533K145956K162595K312015J821443J910931K122275J219246
$$ plain form
16800 16042507 16114321 16474887 16792189 17063425 17795919 17857199 18471160 18753242 19351197 19582622
16790 19582622 20369473 20491080 21114653 21843683 22313440 23075897 23404309 24259486 24649498
16781 24649498 25790153 26105591 26779562 27709105 28275291 29180337 29940969 30828654 31877211
16772 31877211 32502962 33488911 34192344 35368499 36259088 37479979 39027537 39910972 40856985
16763 40856985 42244395 43650850 44940483 46129224 47947827 49181709 50948406 52245222
16755 52245222 53924069 55729095 57384980 59494799 61516198 63486290 65232667 67068098
16747 67068098 68860209 71159890 73513826 75619533 77638963 79908190 82498193 84416835
16739 84416835 86882368 89028324 91190919 93502934 95324377 97235308 99357583 100576829
16731A00576829J905237J677476J126319J306129R21953Q33309P44775N65865
16723A09657892k90912R4801l0282n30833q50321r89227q92548j256205j577587
16714A03334778j408505j606425k325451k006815k020088k173350j903262k363100
16706H7527782j927607k390961k561123k772376k005311k026579k316634k225563
16698F9301628j846212k196682k065933k284732j557681k517049j180980k112912
16690E3539447j674663j789030j628871j426805j368611j310876j345511j706466
16682D1288614j198101j295678j105058j461005q35294j081347r82916q66247
16674C2462968p96012j224382p64704q85488r06235o89150o34241j018619r9070
$$ plain form
16731 100576829 102482066 104159542 105285861 106591990 107513943 108347252 109092027 109657892
16723 109657892 109366980 109461781 109431499 108900666 108050345 107061118 106168570 104912365 103334778
16714 103334778 101926273 100319848 97994397 95987582 93967494 91794144 89890882 87527782
16706 87527782 85600175 83209214 80648091 77875715 75870404 73843825 71527191 69301628
16698 69301628 67455416 65258734 63192801 60908069 59350388 56833339 55652359 53539447
16690 53539447 51864784 50075754 48446883 47020078 45651467 44340591 42995080 41288614
16682 41288614 40090513 38794835 37689777 36228772 35393478 34312131 33329215 32462968
16674 32462968 31666956 30442574 29677870 28792382 27886147 27196997 26562756 25544137 25445067
16665B5445067j112831p35559o27387m97752l84727j039398O9715j110984J7078
16656B0023222q31705n66419l97760n10251k57216l74967m23188l29138m95428
16647A5837150m20757m8662n49338n6218o67462n06801k32192k19770l08628j81024
16637A2646298k54692k30176k49288p8628k34674o93504J01861j29929M8939n46189
16627A0380018k02187l59219j88762k64260o2227o2646l30454l1784j79232N8113
16617H757360j73677l12667j23637l27322K02981m45721K65116l09680k08453
16608G324300j18897k95531K7292m7320k1306J40043l72432m37426M3845K80331
16598F522899k02147j98713j62529o0782J40357l40350l01979K3197K04787m71616
$$ plain form
16665 25445067 24332236 23596677 22969290 22471538 22086811 21047413 21117128 20006144 20023222
16656 20023222 19191517 18625098 18227338 17717087 17459871 17084904 16661716 16332578 15837150
16647 15837150 15416393 15367731 14818393 14762175 14094713 13587912 13355720 13135950 12827322 12646298
16637 12646298 12391606 12161430 11912142 11833514 11598840 10905336 11007197 10877268 10926207 10380018
16627 10380018 10177831 9818612 9629850 9365590 9303363 9240717 8910263 8878479 8699247 8757360
16617 8757360 8583683 8271016 8147379 7820057 8023038 7577317 7842433 7532753 7324300
16608 7324300 7205403 6909872 6937164 6889844 6868538 7008581 6636149 6198723 6242568 6522899
16598 6522899 6320752 6122039 5959510 5898728 6039085 5698735 5396756 5419953 5624740 5153124
16588E153124N06243n49228K07123m01652L73733l36024j92286L28479k85218
16579D804294j35326j07254J38194Q9282m39683R7776m9612L19865n54427k59849
16569C903260K27797o8191o6949J27150j59578J52280l55623P421r1891J46J64653
16558C840475k95616j92706P1291j61695p1587L45778m34576J73112j06063K28508
16548C396921J92163n56821P2390j785M910l45125K53144k11914L25436k56194
16538B873125K17695j65689l40320J22954J26685j81025J98649k68317P0431k73464
16528B380724J70949n36k66647L35416R182q3485J08555j99734j27901j3816k1652
16517B291055k45722M31503m79784K73387r8941K5524O7938j80053J07426j20239
$$ plain form
16588 5153124 5659367 5110139 5317262 4915610 5289343 4953319 4761033 5089512 4804294
16579 4804294 4668968 4561714 4699908 4789190 4349507 4447283 4397671 4717536 4163109 3903260
16569 3903260 4131057 4062866 3995917 4123067 3963489 4115769 3760146 3767567 3675676 3675822 3840475
16558 3840475 3544859 3352153 3423444 3261749 3190162 3535940 3101364 3274476 3168413 3396921
16548 3396921 3589084 3032263 3104653 3102868 3107778 2762653 3015797 2803883 3129319 2873125
16538 2873125 3090820 2925131 2584811 2707765 2834450 2653425 2852074 2583757 2654188 2380724
16528 2380724 2551673 2551137 2284490 2619906 2629088 2545603 2654158 2454424 2326523 2312707 2291055
16517 2291055 2045333 2476836 1997052 2270439 2171498 2197022 2264960 2084907 2192333 2072094
16507B072094j19275M29096j81455j1578J41819k85378N9347l55845K1776q3780
16497A686821P9021J13751j17046K26383J19327m89164L1875L22804l63580k20343
16487A389849K71439J93485L83059m03679k62969k79177M97393k37647j83537
16478A368216M56060l44727O5787K02978k55487L7460k5269L7932K52227l15228
16468A479949m2372L27142l47359J74139l25873J29303R3698J1043o6777k99963
16458A132930M10547j89182j38439J69174J15148l13008L76880k20925J0114p8297
16448A274942O3174m39529N24639K7599j98340J81932o88642L25577L65471j37227
16438A299596k44848N638J31399q4258k99986O80328n78627N92663j16132m26004
$$ plain form
16507 2072094 1952819 2381915 2200460 2188882 2330701 2045323 2104670 1748825 1770601 1686821
16497 1686821 1765842 1879593 1762547 1988930 2108257 1619093 1650968 1973772 1610192 1389849
16487 1389849 1661288 1854773 2237832 1834153 1571184 1292007 1789400 1551753 1368216
16478 1368216 1824276 1479549 1545336 1748314 1492827 1530287 1505018 1542950 1795177 1479949
16468 1479949 1437577 1764719 1417360 1591499 1265626 1394929 1488627 1499670 1432893 1132930
16458 1132930 1543477 1354295 1215856 1385030 1500178 1187170 1564050 1343125 1353239 1274942
16448 1274942 1338116 898587 1423226 1450825 1252485 1434417 745775 1071352 1436823 1299596
16438 1299596 1054748 1060386 1191785 1107527 807541 1487869 909242 1501905 1385773 959769
16428I59769J7585R078K11666P3236j812l19065J28288K94649n56584M05752k74347
16417I48215P9871j05016K30403P3411j41098J8829M5391n37162o125J96709N527
16406H08955J8843J58904m7283j34644k3503K73029k88909M4188J76450k68276
16396G17754L3835K88333j31531j21633K88963o0356l50642j065K48850j1273
16386I01235k34933O845L5582j30414R9374P9126L1148J76308l03275L58640j56938
16375H62698l69365M74373m09386L25711m5892k87632j84760L16713N57821C24252
16364F23618o5952L49214l10967k8563J93236l465O4902l24994K43695j66903
16354E73821j856m8472K47304K60866D84667K21422j44054J90728K34191l78020
$$ plain form
16428 959769 977354 986432 1198098 1271334 1269522 950457 1078745 1373394 816810 1222562 948215
16417 948215 1028086 923070 1153473 1226884 1085786 1104615 1150006 612844 606719 803428 808955
16406 808955 827798 986702 939419 804775 781272 1054301 765392 809580 986030 717754
16396 717754 751589 1039922 908391 786758 1075721 1015365 664723 663658 912508 901235
16386 901235 666302 673147 708729 578315 677689 756815 787963 964271 660996 1019636 862698
16375 862698 493333 967706 558320 884031 838139 550507 365747 682460 1240281 324252
16364 623618 557666 906880 595913 567350 760586 757121 822023 497029 740724 573821
16354 573821 571965 523493 770797 1031663 484667 706089 562035 752763 986954 608934
16344F08934k97122J36787J70102M17980m69256J65560j07927j12948J24808K09966
16334H46884k16841k13726p6758J85940k758J97797J55823l72102R9664L893l3282
16323E74534O8855j70797M9608k55891J60091L62743q5025l50567l2965J25477
16313D46063Q5211Q9491m5498l7562k13655J11474m551O5623m5489j53196L60084
16302F57995E4759N38642j31984q2978n8337J90073J1661k7885B21849L86036
16292F07885k88844L37227k24326J41168E0375L42998J56795B28903K00247A63228
16281H13362k91895A91163L00283j78433O7803f8644E12568O9289o9268n7567
16271D55022M73286l45085k19664m1446J20499o5664N5177q2254I2457M1761R8078
$$ plain form
16344 608934 311812 448599 618701 1036681 567425 732985 625058 512110 636918 846884
16334 846884 630043 416317 339559 525499 522741 720538 876361 504259 603923 607816 574534
16323 574534 643389 472592 522200 266309 426400 789143 704118 353551 320586 446063
16313 446063 531274 620765 575267 537705 324050 435524 430973 496596 451107 297911 657995
16302 657995 54759 593401 461417 378439 320102 510175 521836 493951 221849 607885
16292 607885 319041 656268 431942 573110 50375 393373 550168 228903 429150 163228
16281 813362 521467 191163 491446 313013 380816 -68644 512568 581857 512589 455022
16271 455022 928308 583223 363559 322113 442612 376948 432125 349871 92457 134218 232296
16260B32296L95281A79775L02546j35727M90541B76239K04457A22592J1759M33224
16250E67575j36994k10549o1375K17116j51955L02998j86123r5642J75397M6226
16240D66674j05293A46831L38712C3656M08626j75297L29449k31546J7508K1581
16230D03977n1994J12883j40382E4543K37035J31761N1470J38787k80484P5825
16220D08937p3196j15675O7067K26587k26746A11187a35396A83527r628M51412
16210F25311c2178A60697J13147P7272a95745C78285J03029k32091H4063J77192
16200B61255J30395N0635D4082J24578O4602J2914l2115i9731A88339Q1603J04701
16189C74643A81103K90719k05752N77065l24333j04933A21416P5954r3918a81056
$$ plain form
16260 232296 627577 179775 482321 346594 837135 276239 480696 122592 134351 567575
16250 567575 430581 220032 158657 375773 223818 526816 340693 245051 420448 466674
16240 466674 361381 146831 485543 33656 442282 266985 596434 364888 382396 403977
16230 403977 351983 464866 324484 54543 291578 423339 474809 613596 333112 408937
16220 408937 335741 220066 287133 513720 286974 111187 -135396 183527 173899 625311
16210 625311 -32178 160697 273844 351116 -195745 378285 481314 249223 84063 261255
16200 261255 391650 442285 44082 168660 233262 246176 214061 -99731 188339 269942 374643
16189 374643 181103 471822 266070 843135 518802 413869 121416 197370 103452 -181056
16178D50057A71577J13035K1394G1491L60038j81619K35528A46826C6117J27829
16168A63946O4530a11295k6131A98921D8922J37026q8591J3580K21079p3094E2760
16156A04906K76870D8008P952K52629i9057D95060j70406c9851G1362J14599n9523
16145A26438n4514c5601A93500m4576K45651A53546J53872I7313g1705E81910
16134B05402K29489A11443m7067A8304M66404G582J65332K4393J71636h6592q227
16123i4819F062K2107K30630j10673J40953j30388B0908f9247A89267P0539Q5131
16112C44937A67495A795K00004C2155J56673B5970K50323C3900M81111A57437
16101A25738d75439H6592K34942j01758A429a33965B18424K90776H5243L53229
$$ plain form
16178 450057 171577 284612 306006 71491 431529 249910 485438 146826 36117 163946
16168 163946 228476 -111295 -137426 198921 48922 185948 97357 110937 332016 258922 52760
16156 104906 381776 48008 55960 308589 -99057 495060 324654 -39851 71362 185961 126438
16145 126438 71924 -35601 193500 148924 394575 153546 307418 97313 -71705 581910
16134 205402 434891 111443 64376 18304 484708 7582 172914 197307 368943 -86592 -94819
16123 -94819 6062 28169 258799 148126 289079 158691 20908 -69247 189267 259806 344937
16112 344937 167495 1795 201799 32155 188828 25970 276293 33900 515011 157437
16101 125738 -475439 86592 321534 219776 1429 -133965 218424 509200 85243 438472
16091D38472A02240l489D2396J023N022K6684J17568g8058A19526O2417j962O7223
16079B47204n100D5784K7175k2684K289J71595f4712B24600E9221L022K49268
16068C11511A13432k4253J65559H165b9494A91397a44623A13326J65719b57865
16057A3538f3442n6282C36568C4602c5098C21242i7294H0680a55837k736F7178
16045a56483o8700B96981b52541D7222g5957A95635a27528C33496A33732D1250
16034A84055F9340B4950L61332j36226b59208H5461d2477B24948C932J18031e4988
16022B19698R6886G053b16699B75369b92372A37310K68313q6769C3908K21707
16012B55615b23780a10772j8397C53073d1560B27641n0917B3863J30991Q523b1408
$$ plain form
16091 438472 102240 98751 42396 43419 48441 75125 192693 -78058 119526 181943 179981 247204
16079 247204 242104 45784 72959 50275 52564 224159 -64712 224600 59221 62243 311511
16068 311511 113432 89179 254738 8165 -29494 191397 -144623 113326 279045 -257865
16057 13538 -63442 -119724 336568 34602 -35098 321242 -97294 80680 -155837 -158573 67178
16045 -156483 -225183 296981 -252541 47222 -75957 195635 -127528 333496 133732 41250
16034 184055 69340 24950 386282 250056 -259208 85461 -42477 224948 3932 121963 -54988
16022 219698 316584 7053 -216699 275369 -292372 137310 405623 318854 33908 255615
16012 255615 -223780 -110772 -129169 353073 -41560 227641 176724 23863 154854 163377 -21408
16000C3333g0236j45703A68428c7256D72298I5763m0505L2140d7901l3824J851
15989g9874B26831N7176N38472L40602J92699J35508j97167j78524k79523l23287
15979E12787j89956F4846J29894o9503J98054d7577k3142k1291A36888K76875
15969D13763a3635E646J52233c2172A1194a62629O7633L4506j5855J9299G7478
15957A16637b2722D35746A81996a22623K7021A18804A3511b18546P1338N6409
15947i0799m5799C8912b49704A76264m0440b24167L0367a7923I1296R9372B5711
15935a53748e4805J3112n0177E740c2788A47581B7459L42021A43768Q4597M6226
15924B74591k5720A19904i5543C3813L03978b55759m0146B64307m276r1734b78231
$$ plain form
16000 33333 -70236 -215939 168428 -37256 472298 95763 55258 87398 -47901 -81725 -79874
15989 -79874 226831 284007 822479 1163081 1355780 1491288 1294121 1115597 836074 512787
15979 512787 322831 64846 194740 125237 323291 -47577 -70719 -92010 136888 413763
15969 413763 -13635 5646 157879 -32172 11194 -162629 -94996 -60490 -76345 -57046 77478
15957 116637 -22722 435746 181996 -122623 -95602 118804 13511 -218546 -147208 -90799
15947 -90799 -136598 38912 -249704 176264 135824 -224167 -193800 -17923 91296 190668 25711
15935 -153748 -54805 -41693 -91870 5740 -32788 147581 27459 369480 143768 228365 274591
15924 274591 248871 119904 -95543 33813 337791 -255759 -295905 264307 260031 168297 -278231
15912b72605g3698C6713f0666J0868A92319M3481j04626a60186B11531J3456C1373
15900B48736C8206J95712b24806B8573a15847k26461J37065B13110a6706j02708
15890a19414B97920D5033K73091a59026M2618B86318c0060j24392A03580K3282
15880A26862b1859n010D60209c04093a49993k6352j5446j03780a04831p1575F875
15868G076M3846a00037n9465A5352a03341c0453B90988G2799d4784k53744a12288
15856a49684I0949c50521A64427a60370B63131b34807A81785d6213j71872r6672
15846c14757i7838n0626F3606c69846b2116j5417g838l51630C90365d9434l07476
15835c56910H946M11365D0865b97776A32532a45562C49d9340G7107g2708j1952
$$ plain form
15912 -272605 -73698 36713 -60666 -49798 192319 235800 131174 -160186 211531 224987 31373
15900 248736 38206 233918 -224806 28573 -115847 -342308 -205243 213110 -16706 -119414
15890 -119414 297920 45033 318124 -159026 -116408 286318 -30060 -154452 103580 126862
15880 126862 -21859 -26869 460209 -304093 -149993 -176345 -191791 -295571 -104831 -176406 6875
15868 7076 50922 -100037 -159502 15352 -103341 -30453 290988 72799 -44784 -298528 -112288
15856 -149684 90949 -350521 164427 -160370 263131 -234807 181785 -46213 -218085 -314757
15846 -314757 -97838 -148464 63606 -369846 -22116 -37533 -7838 -359468 390365 -49434 -356910
15835 -356910 8946 420311 40865 -297776 132532 -145562 349 -49340 77107 -72708 -84660
15824h4660D02529b17069C23652a29576C86398g5395c4567m648A6452b54647J21732
15813a32915A80890l9431p212f5618j91544C23993h9386j88191E6298L06952A37207
15801a82869b1138k6662B74252I960a69385j26064B93355a65661A52996J87307
15791C40303J3127B9814J71366p1235D8260L3182J78638r8131a16657b348m60810
15780d63158A05396a24626j1571K9552B00793d8868k29946i0155A39186B340Q8584
15769I0924J68505D1548a31689A63003a56624q6765J04489o804A7124F146J97564
15758B03710i7045L3612b6354B75006b0398C30146a33998M387M3415A50127c62175
15746E00293b0749j89097A26525a38982E27844b76390H466R4955b18579a07662
$$ plain form
15824 -84660 402529 -217069 323652 -129576 386398 -75395 -34567 -39215 16452 -254647 -132915
15813 -132915 180890 141459 134247 -65618 -257162 323993 -89386 -277577 56298 363250 137207
15801 -182869 -21138 -47800 274252 9960 -169385 -295449 293355 -165661 152996 340303
15791 340303 353430 29814 201180 129945 48260 81442 260080 161949 -116657 -2348 -463158
15780 -463158 105396 -124626 -136197 -106645 200793 -48868 -278814 -90155 139186 2340 90924
15769 90924 259429 41548 -131689 163003 -156624 -243389 -138900 -145704 17124 6146 203710
15758 203710 -97045 -63433 -26354 275006 -20398 330146 -133998 -129611 -86196 150127 -362175
15746 500293 -20749 -209846 126525 -138982 527844 -276390 8466 103421 -218579 -107662
15735a57152e8531G1189J98483a2946B4657h4404G5933L1202a21123D5688R7325
15724A43013a17785B8J8938j391K32768n7350C7470K1386a08568j86187B18837
15712B24703f3294F9606A7428J11956h6853o19B81642e3850A23259a35751J6482
15701a19269M0856B33377b96970A54048c0442A12550P236f8227D9249P4275E278
15689f7203B5021J42324O6522A14843b61188C4088K80692a45590H2446K5286b77756
15677E4201b16736k42090B55834b72111j4530B05540F4759K31476a41703A14601
15666B67892i5670j8838B13007a17401F1051J59812h3041A1448P4205R0511d8655
15654C8455a42964A6633a10920k36022Q8219A8635L6173J00704b4007q7464k77265
$$ plain form
15735 -157152 -58531 71189 269672 -12946 24657 -84404 75933 107135 -121123 45688 143013
15724 143013 -117785 28 18966 17575 250343 192993 37470 58856 -108568 -294755 218837
15712 224703 -63294 69606 17428 129384 -86853 -87472 281642 -53850 123259 -135751 -119269
15701 -119269 -78413 233377 -296970 154048 -30442 112550 119786 -68227 49249 123524 5278
15689 -67203 25021 167345 233867 114843 -261188 34088 314780 -145590 82446 107732 -277756
15677 54201 -216736 -458826 255834 -272111 -286641 205540 64759 296235 -141703 114601
15666 267892 -95670 -114508 213007 -117401 61051 220863 -83041 11448 85653 176164 -48655
15654 38455 -142964 16633 -110920 -346942 -258723 18635 54808 155512 -24007 -111471 -388736
15643c88736O9093m3344A17035b91947o9183c2137j04577G8128C224b46635j14643
15632c61278C03544a10511L9677i807j66714c8196k91543a02549K580I7796a05952
15620a02343M9833C78699j39477f8942a1680C6369L15933B8228b8068C15908b9725
15608e987B7146d9890p6775k14383a48509K4435A53506F4908a8290j60206H8074
15596A29028d4420D7967b11007M6480D36832j58527n1111F9201b7964E642a85624
15584B55308a55202B95549a6860n4531A09055C1211K39254b973n3887I6228f1824
15572a43235b2637G6060C1311O8932b5504A31625E2654b32443A68950a13415A04962
15560A05009a53556A55429K8314L7670h5856H4050g3345I7221a18267o8033B42072
$$ plain form
15643 -388736 -319643 -362987 117035 -291947 -361130 -32137 -136714 78128 3224 -246635 -361278
15632 -361278 303544 -110511 -70834 -9807 -176521 -38196 -329739 -102549 -99969 97796 -105952
15620 -102343 -52510 378699 239222 -68942 -11680 36369 352302 28228 -28068 315908 -29725
15608 -5987 27146 -49890 -126665 -341048 -148509 -124074 153506 64908 -18290 -178496 88074
15596 129028 -44420 47967 -211007 -164527 436832 278305 227194 69201 -27964 5642 -185624
15584 255308 -155202 295549 -16860 -71391 109055 31211 270465 -2973 -56860 96228 -61824
15572 -143235 -22637 76060 31311 100243 -25504 131625 52654 -232443 168950 -113415 104962
15560 105009 -153556 155429 183743 221413 -85856 84050 -73345 97221 -118267 -186300 242072
15548A14116J6719a02836L1749B8042J5357J44752h3866m5478H1379n487K18734
15537B94626A36738b40420E2162c10873I2444K8377J8210j8235J24545A15485
15526a40218A14665j9346e7691b8377A34117J3272n1713J1464K66895o3188k3456
15515B87391L3303I0196R5489n2356J24660A0592L39936A17226N5906J52174d4284
15503C80711I0581J44342n9244N1433F8541M4123J33284M9975H9766L84066j76328
15492B97504a12057A19954M8791o9110J45406e5524j51643C1014J89287q252M445
15481B16494k6647O4625q0813K6043J44647n161O17328l4482l01732j2561j13229
15470D94512A10246J31557N387n4618a68463A50638M7375q3578b05584O9442L8192
$$ plain form
15548 114116 130835 -102836 -71087 28042 43399 188151 -83866 -129344 81379 75892 294626
15537 294626 136738 -240420 52162 -310873 92444 120821 139031 120796 245341 115485
15526 -140218 114665 95319 -57691 -28377 134117 147389 95676 107140 374035 310847 287391
15515 287391 320694 90196 185685 133329 257989 10592 350528 117226 173132 325306 -44284
15503 380711 90581 234923 175679 227112 68541 112664 245948 295923 89766 473832 297504
15492 297504 -112057 119954 168745 99635 245041 -55524 -207167 31014 220301 212049 216494
15481 216494 189847 254472 173659 199702 344349 339188 956516 922034 620302 607741 494512
15470 494512 110246 241803 247190 192572 -168463 150638 198013 114435 -205584 -136142 -97950
15459i7950K6784n9176B2064K33309C652M7516J26233b7676j28792F097e1595
15447C516J67176K69206I6232M81418N0041O35877J544J8324o4711C45689L52569
15436F98258k83726B9475J70146D6218M1840O1537c910E9640f5754A45194g461
15424E3027c2553l23506B97862K0032E3506J48900b64390a6073F0935J15335Q3419
15413B59689C2400c3974C24533n7431g9623j89933B4717j1794i7029A45295d3063
15401B5319j1800L49929A37310b31177P3498B87311C0169a21404C7472a06647
15390A2195b8773m09904A67351a7965j80022P1641B7241J1316J46126J02775a16819
15378A129R0187J11593a19262D7838L00659A01070J07390M30903F7995N6032L10672
$$ plain form
15459 -97950 -71166 -130342 22064 255373 3652 51168 177401 -27676 -156468 6097 -51595
15447 3516 170692 439898 96232 577650 627691 1263568 1265112 1283436 1218725 345689 698258
15436 698258 414532 29475 199621 46218 88058 149595 -3910 59640 -65754 145194 -7461
15424 53027 -32553 -356059 297862 317894 53506 202406 -264390 -16073 60935 176270 259689
15413 259689 32400 -33974 324533 267102 -79623 -269556 24717 12923 -97029 145295 -43063
15401 25319 13519 363448 137310 -231177 -157679 287311 30169 -121404 37472 -106647
15390 12195 -28773 -438677 167351 -17965 -197987 -126346 27241 38557 184683 287458 -116819
15378 1129 91316 202909 -119262 47838 348497 101070 208460 639363 67995 124027 434699
15367D34699A8294J17468l1191k2727B8781k421J63210a3889E21607C804J79075
15356A82879j9102a08669e2622m2442B49974r734F5881K32750j37445a1335A90967
15344C65550r3103L88487k47282m6313k569K60330a4160q0605j38471B83429L9959
15333C23388r9231G9684L4589J8143N3229N8362k5298K6228L6858O9116d2095
15321B18339G0103M74240A92641j8403o6445C7398K04642c7373B43923I9230R56
15310A00186K84523G1862J75651k6837l7712J61319J38488H3342J52187J15639
15300C51168A49146l8336K04423q392A17363J5313n8751J08769C3511a66067C13799
15288b30518A41243M232J32265f0509A82406a49758B10349A7770J8429N4254b01009
$$ plain form
15367 434699 18294 135762 104571 81844 28781 26360 189570 -13889 521607 3804 182879
15356 182879 163777 -108669 -52622 -95064 249974 240240 65881 298631 161186 -11335 190967
15344 365550 272447 660934 413652 367339 364770 625100 -14160 -94765 -233236 283429 323388
15333 323388 224157 79684 114273 132416 185645 244007 218709 244937 281795 350911 -42095
15321 218339 70103 544343 192641 174238 107793 37398 242040 -37373 243923 99230 100186
15310 100186 384709 71862 247513 220676 182964 344283 482771 83342 235529 351168
15300 351168 149146 110810 315233 306841 117363 132676 73925 182694 33511 -166067 313799
15288 -230518 141243 145475 277740 -60509 182406 -149758 210349 17770 36199 90453 -201009
15276a05348k604B67976r789B1885K3107b65256G9976K41032a08220I9000O9214
15265A68214c71396B29865G0168A402b19350M7333A97768H6911e2873k3010n1136
15254a27019F5389h8642j36421A42022J0213a70252A65012J10244A05318L16164
15244D21482C704K59184J12107K66936J107637M28309m85611M5104j86828p61541
15234G89001c3097l9059E43001A74302a46935B05616i4857b9695B09014j04213
15224A04801J80623b639A0259Q5426l0108d5675A1602J09794c3129j28641D58918
15212C11665F850a1470A41117K02245b53628B9247O3460M15071a92158B24514
15201B1635N1831l2785Q0552h7390B10433F4426O1616J08019K57940A36301J39826
$$ plain form
15276 -105348 -107952 267976 258187 21885 44992 -265256 79976 321008 -108220 99000 168214
15265 168214 -371396 229865 70168 1402 -219350 -172017 197768 86911 -52873 -75883 -127019
15254 -127019 65389 -88642 -225063 142022 152235 -170252 165012 275256 105318 421482
15244 421482 3704 262888 374995 641931 1749568 2177877 1692266 1737370 1550542 789001
15234 789001 -33097 -72156 543001 174302 -146935 205616 -94857 -29695 209014 104801
15224 104801 285424 -2639 10259 95685 65577 -45675 11602 121396 -33129 -161770 458918
15212 311665 6850 -11470 141117 343362 -253628 29247 92707 507778 -192158 224514
15201 21635 73466 40681 121233 -87390 210433 64426 126042 234061 492001 136301 276127
15190B76127J79113H7440O968l3086P348a63403d2029J9577j10984A44623M9436
15179A94059J8501l9796a34759d2117D14419g4446C33564g4937E9385f5973A56880
15167C39400j65547c1912A19467k964J46105A24251J19860A7914J61990c7821
15156a8313j38427O0231c4983A06665O6791J94580a1037D4815A447J93484f3990
15144B54856N0617F578N6830a24515A39758J61797j10700O0135E4784K15943j8995
15133B51732J2118J01206l2418c0978A19606Q9929F8273J17494O4526p0486K15488
15122C95295c2437A37446h1048C48127R3921J63272j78236j49141J75865J31982
15112E85790H1312l5327J70960K1376j08853Q687K97241D1756R5851N8908J34506
$$ plain form
15190 276127 455240 87440 94408 61322 68670 -163403 -42029 -22452 -133436 144623 194059
15179 194059 212560 172764 -134759 -42117 414419 -74446 333564 -74937 59385 -65973 156880
15167 339400 173853 -31912 119467 116503 262608 124251 244111 17914 179904 -37821
15156 -18313 -156740 -96509 -34983 106665 173456 368036 -11037 44815 1447 194931 -63990
15144 254856 305473 6578 63408 -124515 139758 301555 190855 250990 54784 270727 251732
15133 251732 263850 365056 332638 -30978 119606 209535 68273 185767 250293 179807 395295
15122 395295 -32437 137446 -81048 348127 442048 605320 427084 277943 453808 585790
15112 585790 81312 45985 216945 238321 129468 138155 435396 41756 137607 196515 331021
15101C31021C9526a42332B58043a56853D12593I5725b41749A98196J37382G0911
15090a36930D07722C8536J44245Q0709I6108J82834L3370j10452K47028k13508
15080B35380a53674D15222D2267L02119j65006J43199j02507l8597q5883j05K58756
15069C54243B7385h1263B72326J4587h9861A36630a29364B49692O4388E1438J01999
15058A53437L8380L703r1194K10345J68176j97475j22471M46776j39033P8334
15048E48978j84218j56369M9077J52580K47588E0074J61136L00498n1331L3846
15038D94223j92059K91476j95517A18024M50040P1652j56932M24950j82915M18050
15028A142869k80845k70873L10232l0988C37119K66080r7483q044K0337J28089
$$ plain form
15101 331021 39526 -142332 258043 -156853 412593 95725 -241749 198196 335578 70911
15090 -136930 407722 38536 182781 263490 96108 278942 312312 201860 448888 235380
15080 235380 -153674 415222 42267 344386 179380 322579 220072 181475 95592 95487 354243
15069 354243 27385 -81263 272326 286913 -89861 136630 -129364 249692 314080 51438 153437
15058 153437 191817 195520 104326 314671 482847 285372 162901 609677 470644 548978
15048 548978 364760 208391 257468 410048 657636 50074 211210 511708 460377 494223
15038 494223 302164 593640 398123 118024 568064 639716 482784 907734 724819 1142869
15028 1142869 862024 591151 901383 870395 337119 603199 505716 497672 518009 646098
15018F46098L47590j36412k56002B77790J92563P4717L2386k51747K43866J56673
15008G26248k51187J03698B00752K915K43204m5063p8724q4512K56336E3263O65987
14997G19250J39106l32456j56726L78143C70790m7095K66074K8896j6820m3855
14987E57990B38448M2198J10790L33749j22875K27695M551L89809l02401p3481
14977H48483o3402l91461M23007l79564L49637C23578L15388K29679l70957R8309
14967E95997k44209O42197C93818P1629o7271J47086j00222P3664a13879D21443
14956D99700A20023J95092K89292B53039M13565n2294k17461A70453N38034k80011
14946D28476L7030k31653K71246P76237F37487J42785j0042j97461o858J36829
$$ plain form
15018 646098 993688 857276 601274 277790 470353 545070 577456 325709 569575 726248
15008 726248 475061 578759 200752 203667 446871 401808 323084 238572 494908 53263 719250
14997 719250 858356 525900 369174 747317 370790 323695 589769 618665 601845 557990
14987 557990 238448 280646 391436 725185 602310 830005 834556 1224365 921964 848483
14977 848483 785081 393620 816627 437063 786700 323578 638966 868645 497688 595997
14967 595997 351788 993985 393818 465447 398176 545262 445040 518704 -113879 421443
14956 499700 120023 315115 604407 253039 666604 614310 396849 170453 708487 428476
14946 428476 465506 233853 505099 1281336 637487 780272 770230 572769 565911 702740
14936G02740K21222B65898L98536L72852j72369L34143J40622J55786j3063J48416
14926A630821L96519k8327L4085p0838k71709J57650l3881J41233O13912J20910
14916B690375j40362l26011m15392n84800J68934j24148m87877J18791j31768
14907G67742j57204C00314J1236K43434J48946j67684j26155K59839B24059L68921
14897E92980m5899l540J68262k11027J22684k30941J74114O679q4636j58756N60301
14886H90221o6042M97549k08602k41887K3272L25917k17162k45900J53181l88902
14876E21645J67768P0461C28519K66306j86710N88394m63792L12681j42860K79482
14866I82020P5922M5907n03474p0531J32877J3105o077C15792L36487L6771k41877
$$ plain form
14936 702740 923962 265898 664434 1037286 864917 1199060 1339682 1495468 1482405 1630821
14926 1630821 2027340 1999013 2033098 1962260 1690551 1848201 1814320 1955553 2569465 2690375
14916 2690375 2550013 2224002 1808610 1223810 1392744 1268596 780719 899510 767742
14907 767742 610538 300314 311550 554984 703930 536246 410091 669930 224059 592980
14897 592980 547081 543541 711803 500776 623460 392519 566633 573312 488676 329920 890221
14886 890221 824179 1321728 1113126 871239 894511 1220428 1003266 757366 910547 521645
14876 521645 689413 759874 328519 594825 408115 996509 532717 845398 702538 982020
14866 982020 1057942 1103849 600375 529844 662721 675826 669749 315792 652279 689050 447173
14855D47173L13123r0780l30918K74513J32589j20944J36833m1719L07028m459
14845A022439M8162K13722k67229M86662j96686l96085K61869J10496m60257J24624
14835I47717k42433K21894j41081j26382p9318K01683k43661K7228K81512j15391
14825G31768n5032P6572J69062k15794J00446l72255N22754k3797j22569J4234
14815H25389k00184J07672L58723m03510J97197o5532C50810J95338K79368J88853
14805A014369K63809k12309l74135j242P821J22105l01559K73480B60864O98208
14795I59072k14822k77777N5941J6057J65295m302j17644J13298J61117J3291
14785H69526R6527j81907J03180j05640R8316l96902K01354N05280q8536k20110
$$ plain form
14855 447173 760296 669516 338598 613111 745700 624756 761589 719870 1026898 1022439
14845 1022439 1070601 1284323 1017094 1503756 1307070 910985 1172854 1283350 823093 947717
14835 947717 705284 927178 786097 659715 580397 782080 538419 565647 847159 731768
14825 731768 676736 753308 922370 706576 807022 434767 957521 933724 811155 825389
14815 825389 625205 732877 1091600 688090 885287 819755 350810 546148 825516 1014369
14805 1014369 1278178 1065869 691734 690492 698313 820418 518859 792339 260864 959072
14795 959072 744250 466473 522414 538471 703766 699464 581820 695118 856235 869526
14785 869526 966053 784146 887326 781686 880002 483100 684454 1189734 1101198 881088
14775H81088L14807j19907j20335l87663J73040L07509l96519J20009j57980J49738
14765G63787J86737m04104P0522j04773j95250L54885K04804l27864R9283j93309
14755D54718L83921k51084M70844m80413N6450J39004j23117p5070L73456l23784
14745F24925m1497L36159l69565K95183N603j06534L38219j67876k3049j69795
14735G21773P7089Q6809K13255K04934K39909R8557J50121o286L75548m8022l36983
14724A776704k58871n16178J6425K5167j38968K00248m5969j72088L2881P5251
14714I94602K51786k50807J0396j06662J70982O9730j46529Q1496j24262M54445
14704A405177J8075M26589L36621n1656o8606j45531m65948k23855j6306N802
$$ plain form
14775 881088 1195895 1075988 955653 567990 741030 1048539 652020 772029 614049 763787
14765 763787 950524 546420 616942 512169 316919 671804 876608 548744 648027 454718
14755 454718 838639 587555 1058399 577986 634436 773440 650323 575253 948709 624925
14745 624925 583428 919587 550022 845205 850808 744274 1082493 914617 891568 721773
14735 721773 798862 885671 1098926 1303860 1543769 1642326 1792447 1786161 2161709 2113687 1776704
14724 1776704 1517833 1001655 1018080 1043247 904279 1104527 1058558 886470 919351 994602
14714 994602 1246388 995581 1005977 899315 1070297 1140027 993498 1074994 950732 1405177
14704 1405177 1423252 1849841 2186462 2134806 2066200 1920669 1454721 1230866 1214560 1220362
14694A220362j96579m1538Q1343L6838m68467K30848m1892K40841l85035K66893
14684I43614l454P7722m0527J50305l1499l9205K2045K3381K1996k12541J02830
14673A014667j48038K72456J1397j25948J88044l03398K36062n9209M45493l20494
14663A211032o5367Q3952l08640K61590r570j96051J66785O3095K50809j65527
14653A292108N20866m63798L21532n08664o0996K61972n2205m4446k7587L46294
14643A585076l32543k12419L42753r2220O9949j41318K14049j12340l3658J88561
14633A475890P6179p1043O744l95595R1199J22906R9593o4146j57116N60175m21261
14622A323525j0376J60437K7400K85054l03966j55259K74217r3432j8424K77060
$$ plain form
14694 1220362 1023783 982245 1063588 1100426 631959 862807 820915 1061756 676721 943614
14684 943614 940160 1017882 977355 1127660 1096161 1056956 1079001 1102382 1124378 911837 1014667
14673 1014667 866629 1139085 1150482 1024534 1212578 909180 1145242 1086033 1531526 1211032
14663 1211032 1145665 1229617 920977 1182567 1172997 976946 1143731 1206826 1457635 1292108
14653 1292108 1812974 1349176 1670708 1162044 1101048 1363020 1310815 1266369 1238782 1585076
14643 1585076 1252533 1040114 1382867 1290647 1360596 1219278 1433327 1320987 1287329 1475890
14633 1475890 1552069 1481026 1487770 1092175 1183374 1306280 1405873 1341727 1184611 1744786 1323525
14622 1323525 1313149 1473586 1500986 1786040 1482074 1326815 1601032 1507600 1489176 1766236
14612A766236J1662k54671Q5580n2494M21095j95260j46948O7740j44604o1839
14602A496497L53170K55897m88058J43833l9265j35703L81621m48876P58446j57685
14592B119877k45773j35481M58553k00314k01411K31512K7630n6900J79576m4070
14582B133199J3433j37341j30317K57657j32644O2369p8493K30146J12465n69489
14572A760985N58701J85708k40716L51092k60637j82918L21034K73599n06744
14563B260104L77248M8723K65193p6632K05375k8794K08790j74187J64674M42533
14553C693027L26620j9744J286926J105012J749689L893431P631673J6081219
14545C5747853O530971j6683487I061668D115935j796444n712n1587N68892L7537
$$ plain form
14612 1766236 1777898 1523227 1608807 1556313 1977408 1782148 1635200 1702940 1558336 1496497
14602 1496497 1849667 2105564 1617506 1761339 1722074 1586371 1967992 1519116 2277562 2119877
14592 2119877 1874104 1738623 2197176 1996862 1795451 2026963 2054593 1997693 2177269 2133199
14582 2133199 2146632 2009291 1878974 2136631 2003987 2066356 1987863 2218009 2330474 1760985
14572 1760985 2319686 2505394 2264678 2615770 2355133 2172215 2493249 2766848 2260104
14563 2260104 2637352 2686075 2951268 2874636 3080011 3051217 3260007 3085820 3250494 3693027
14553 3693027 4019647 3999903 5286829 6391841 8141530 12034961 19666634 35747853
14545 35747853 42278824 25595337 9061668 4115935 2319491 2313779 2262192 2831084 2868621
14536B868621Q72414J105844k21360j850643j72469j63107q7397j02423j44105
14527B105375M58951m01385L62865L8344k72841J62358M9474M4047K62966m45450
14517B364704L86079L12150l67667j68476J10320p4006M31527n2744r413Q5852
14507C018326j6720J81526j53823J04646k7344m5907K88553L1099m22112N32007
14497C490251j42605p4861J82505Q4607J20356j14256L74794k62002N0383j09614
14487C599558r7084L35568j99677M68674l03306O9988J00212k31677L59696K55031
14477D356983j50297j14094J74412K27033n0939J85572j50943N3968k84266M91910
14467D739339J76386k89501J18295r0231J15951K57020k17172M63671k53975L56461
$$ plain form
14536 2868621 3741035 4846879 4625519 2774876 2602407 2439300 2351903 2249480 2105375
14527 2105375 2564326 2162941 2525806 2564150 2291309 2453667 2503141 2547188 2810154 2364704
14517 2364704 2750783 3062933 2695266 2526790 2637110 2563104 2994631 2941887 2932474 3018326
14507 3018326 3001606 3183132 3029309 3133955 3106611 3060704 3349257 3380356 2958244 3490251
14497 3490251 3347646 3272785 3455290 3539897 3660253 3545997 3920791 3658789 3709172 3599558
14487 3599558 3502474 3838042 3638365 4107039 3803733 3873721 3973933 3742256 4101952 4356983
14477 4356983 4206686 4092592 4267004 4494037 4443098 4628670 4477727 4531695 4247429 4739339
14467 4739339 4915725 4626224 4744519 4654288 4770239 5027259 4810087 5273758 5019783 5376244
14457E376244q7182j4482J95867J21729k68177K40123j6865L22061N7477r1537
14447E835258K95609l299j87802Q3390M55309q7117K65475j73219R6064n9204
14437F520464L29528K15934j04751N0620K01078J39310J10798j61939K09259J08963
14427G619264M26092J50125k14913L02197Q1649O81365m2654Q2840n6449l64268
14417H665248K87022K06015N20351n12092K78032M22237j21350N9731K22818L50149
14407A0378161M35602r606K64302J65771l4579l9154K2976k08517N59754K16960
14397A1751670K63027K04813j85823L57054J64943L81667L37144P8762K07265
14388A3560522J83233M46593J12462J50820O31760L90419P55252o39690L66183
$$ plain form
14457 5376244 5289062 5274580 5470447 5592176 5323999 5564122 5547257 5869318 5926795 5835258
14447 5835258 6130867 6127568 5939766 6023156 6478465 6391348 6656823 6483604 6579668 6520464
14437 6520464 6849992 7065926 6961175 7011795 7212873 7352183 7462981 7301042 7510301 7619264
14427 7619264 8045356 8195481 7980568 8282765 8364414 9045779 9003125 9085965 9029516 8665248
14417 8665248 8952270 9158285 9678636 9166544 9444576 9866813 9745463 9805194 10028012 10378161
14407 10378161 10813763 10804157 11068459 11234230 11199651 11160497 11183473 10974956 11534710 11751670
14397 11751670 12014697 12219510 12033687 12390741 12555684 12937351 13274495 13353257 13560522
14388 13560522 13743755 14190348 14302810 14453630 15085390 15475809 16231061 15591371 15957554
14379A5957554K59749J23213L66267M35420K99095L96900K45599O69425l8298
14370A8714924R26911M55621J85860J90656N57175n6692P06606L18571M44820
14361B2444452J98744P43760P39610N15744L33291N78890O81238K57899Q13349
14352B7306977O48032P22430Q11895P03529N43429Q87572Q53189M77697J115754
14343C4070504Q44821J085517J167464P13234R91500R11822J184912J344012R72397
14334D3286183J278013J434826J361825J585474J361904J365309J903811J791230
14326E5368575K020645J623206J697891K496607J771264K384907K495552K213524
14318G2072171K513167K592063K645727L395731K688936L479031L301331L575888
$$ plain form
14379 15957554 16217303 16340516 16706783 17142203 17441298 17838198 18083797 18753222 18714924
14370 18714924 19641835 20097456 20283316 20473972 21031147 20974455 21681061 21999632 22444452
14361 22444452 22643196 23386956 24126566 24642310 24975601 25554491 26235729 26493628 27306977
14352 27306977 27955009 28677439 29489334 30192863 30736292 31623864 32477053 32954750 34070504
14343 34070504 34915325 36000842 37168306 37881540 38873040 39784862 40969774 42313786 43286183
14334 43286183 44564196 45999022 47360847 48946321 50308225 51673534 53577345 55368575
14326 55368575 57389220 59012426 60710317 63206924 64978188 67363095 69858647 72072171
14318 72072171 74585338 77177401 79823128 83218859 85907795 89386826 92688157 96264045
14310I6264045M135599M106407L985999M447593M798906M945433N244931N500837
14302A33429750O059540O292508O510346P021509P042427P836775Q152103Q578153
14294A90923111R141044R593189J0177076J0029496J1298580J1688971J2092918
14287B64944385J2412301J2742090J3681168J3701944J3987235J4072737J4249721
14280C59791581J4186303J3961321J3793712J2883814J2180009J0660142Q288423
14273D45745305M779616L377821J713526M5696O86145J641563j436202m310315
14265D52243155q256356j0720301j2178449j3586040j4416658j4869274j5448946
14258C62767131j5604490j5071895j5300356j4826178j4241446j3925494j3185971
$$ plain form
14310 96264045 100399644 104506051 108492050 112939643 117738549 122683982 127928913 133429750
14302 133429750 139489290 145781798 152292144 159313653 166356080 174192855 182344958 190923111
14294 190923111 200064155 209657344 219834420 229863916 241162496 252851467 264944385
14287 264944385 277356686 290098776 303779944 317481888 331469123 345541860 359791581
14280 359791581 373977884 387939205 401732917 414616731 426796740 437456882 445745305
14273 445745305 450524921 453902742 455616268 455661964 456348109 457989672 456553470 452243155
14265 452243155 443986799 433266498 421088049 407502009 393085351 378216077 362767131
14258 362767131 347162641 332090746 316790390 301964212 287722766 273797272 260611301
14251B60611301j3020974j2167868j1839270j0941459j0710283q635067q320919
14244A84975461q490657q302843q130597p389252p051502o708873n924490n347891
14236A27629356n945948n233227n076642m422206m044765l875970l854828l604316
14228I1571454l959016l191936l146471l318197k557156k815295k594367k531319
14220F7457697k163305j807619k318892k307054k009375j566852j723936j161612
14212E2399052k085135j136501j804460j157208j752391l72757j424222j307060
14204D1359318j199020j330848r35132p98868r03891j161199p45758q30874j223492
14195C2230236o22649p43690m56337r17555j082680p0059q22193o47850n46080
$$ plain form
14251 260611301 247590327 235422459 223583189 212641730 201931447 193296380 184975461
14244 184975461 176484804 168181961 160051364 152662112 145610610 138901737 132977247 127629356
14236 127629356 121683408 116450181 111373539 106951333 102906568 99030598 95175770 91571454
14228 91571454 87612438 84420502 81274031 77955834 75398678 72583383 69989016 67457697
14220 67457697 65294392 63486773 61167881 58860827 56851452 55284600 53560664 52399052
14212 52399052 50313917 49177416 47372956 46215748 44463357 44090600 42666378 41359318
14204 41359318 40160298 38829450 37894318 37095450 36191559 35030360 34284602 33453728 32230236
14195 32230236 31607587 30863897 30407560 29490005 28407325 28337266 27515073 26867223 26321143
14186B6321143o79196q14470o17446m55089n86372J15583r81092o09837n2867
14177B1640357m42201p27663k68342l30999o38217n32766k16569o9298n20269
14168A7894033l63385k66749l31426m50351j37120l02014m98332R0705p08429
14159A4926932K16611m19406l44654l14411l85113P2792q4648n02371j77694k86270
14149A2701768j67538l06101o4505l44077O3255l13690j54450k86283j5641j25997
14139A0986741l49394j18106k26628L13590l88426L7167m40334l29356N7798j31193
14129I411859q3494r2022N0321k21707k39334L0341l50273L04883m66846k01305
14119H142423k4583k35604l52511M61676r2051j62850j17558j50408l26263N6183
$$ plain form
14186 26321143 25641947 24827477 24210031 23754942 23168570 23284153 22303061 21693224 21640357
14177 21640357 21198156 20470493 20202151 19871152 19232935 18700169 18483600 18414302 17894033
14168 17894033 17530648 17263899 16932473 16482122 16345002 16042988 15544656 15635361 14926932
14159 14926932 15143543 14724137 14379483 14065072 13679959 13752751 13668103 13165732 12988038 12701768
14149 12701768 12534230 12228129 12163624 11819547 11882802 11569112 11414662 11128379 11112738 10986741
14139 10986741 10637347 10519241 10292613 10606203 10217777 10254944 9814610 9485254 9543052 9411859
14129 9411859 9328365 9236343 9286664 9064957 8825623 8855964 8505691 8810574 8343728 8142423
14119 8142423 8117840 7882236 7529725 7991401 7899350 7736500 7618942 7468534 7142271 7198454
14109G198454q5219j85135j38424K79700l73755K07337m30667J56820j23799k28032
14099F277280K88425j34831j09922k23732M2275l7268j39402m62433K55525R4011
14089E849928l9528m29142k6478j42190L86817j14412j13867M583j57873l0038
14079E187800j11439n40120M85653j33071L83548k30107m75912n8231K67880K08766
14069D984767k54735j11607q4576k2332q8180J8797J70995J67113k1471l6241
14059D722530k74507r1292k19039K73729R879j92579j46081J23948j73182J6120
14049D049526j79679j98246J8062j11251O2516k44436L23069j06255n0859k14354
14039C348093j42247j14752L36733J18164j49321Q4290j24624k19349J29571o5516
$$ plain form
14109 7198454 7113235 6928100 6789676 7069376 6695621 6902958 6472291 6629111 6505312 6277280
14099 6277280 6565705 6430874 6320952 6097220 6139495 6102227 5962825 5500392 5755917 5849928
14089 5849928 5810400 5381258 5354780 5212590 5599407 5484995 5371128 5375711 5217838 5187800
14079 5187800 5076361 4536241 5021894 4888823 5272371 5042264 4566352 4508121 4776001 4984767
14069 4984767 4730032 4618425 4533849 4511517 4423337 4442134 4613129 4780242 4758771 4722530
14059 4722530 4448023 4356731 4137692 4411421 4421300 4228721 4082640 4206588 4033406 4049526
14049 4049526 3869847 3671601 3689663 3578412 3640928 3396492 3719561 3613306 3562447 3348093
14039 3348093 3205846 3091094 3427827 3545991 3396670 3480960 3356336 3136987 3266558 3201042
14029C201042N1551j39868Q0441k20046k08475P5866J45479J69466k12638r2150
14019B850668N5484l83410K55274k97357P7239K40292j4504j03319P1460K1823
14009B773650k81424j10844P8574J64956k27966j38824N39854l74607j0652j8601
13999B394116J79100l22429K83747l22272L46244j34064m9585L71917m3145O75169
13989C378798J060197K502749N994563J4697138J4286087p933577A6302146p460892
13981H841254k672500j335578m95081m18659N8755p32026k5549m45667K82649
13972C057598k76542j2990K5814j16881k32912O07230q20039M4620J94074J39038
13962B609010j47589l88350K53964k23411r695k3766J50885j91846K55165k14051
$$ plain form
14029 3201042 3252593 3112725 3193166 2973120 2764645 2840511 2985990 3155456 2942818 2850668
14019 2850668 2906152 2522742 2778016 2480659 2557898 2798190 2783686 2680367 2751827 2773650
14009 2773650 2492226 2381382 2459956 2624912 2396946 2258122 2797976 2423369 2412717 2394116
13999 2394116 2573216 2250787 2534534 2212262 2558506 2424442 2374857 2746774 2703629 3378798
13989 3378798 4438995 6941744 12936307 27633445 41919532 33985955 16302146 8841254
13981 8841254 6168754 4833176 4338095 3919436 3978191 3246165 3220616 2774949 3057598
13972 3057598 2781056 2768066 2793880 2676999 2444087 3051317 2231278 2275898 2469972 2609010
13962 2609010 2461421 2073071 2327035 2103624 2093929 2070163 2221048 2029202 2284367 2070316
13952B070316L63987n48513l8309L13149q5970o0914R509o1596K0595N7360r6257
13941A943357K71044n34734L48105o0244k74630K47631l64970J66330J67427l63946
13931A545370K81336R921n1317J46125l43262j78224L28909q094l16508K13807
13921A628063k5160J34573q5272Q1378j18052K40863l22432l8657J51608N4038
13911A700950k57244K22312j34150J5638l43101M71687k19884M08838n94317Q381
13901A279110J36289J43648n2474J57769l42391Q6429j24238n9274r5944J30040
13891A258964M43534o17195J14374J2823k1879J99495j28749j0877L7508J41051
13881A429049k16404m2405J02559P8896O6836J3996o6439J16376k50918J05665
$$ plain form
13952 2070316 2434303 1885790 1847481 2160630 2074660 2013746 2023255 1961659 1982254 2039614 1943357
13941 1943357 2214401 1679667 2027772 1967528 1692898 1940529 1575559 1741889 1909316 1545370
13931 1545370 1826706 1836627 1785310 1931435 1588173 1409949 1738858 1730764 1414256 1628063
13921 1628063 1602903 1737476 1652204 1733582 1615530 1856393 1533961 1495304 1646912 1700950
13911 1700950 1443706 1666018 1531868 1547506 1204405 1676092 1456208 1865046 1270729 1279110
13901 1279110 1415399 1559047 1506573 1664342 1321951 1408380 1284142 1224868 1128924 1258964
13891 1258964 1702498 1085303 1199677 1212500 1190621 1390116 1261367 1250490 1287998 1429049
13881 1429049 1212645 1170240 1272799 1351695 1418531 1432527 1366088 1482464 1231546 1337211
13871A337211k05037M08171j75555l19568P7793L03278k18567N5130J11277k03686
13861A170447k14760O4489K08507r5769k65612K6822M73260o16841L36969K94541
13851A382053l87996J84117q8770J42430m8396k06412M7798Q6460J40064j128
13841A250220j00697K93051l48081l15977L51621J50246n58m67088J88770k1186
13831I80321L1931r094l6179k16490j1437J52457m2198K3864K94322l81255P2590
13820H58832Q2482j77586N3639o3731O1014J62841j53586k42014K79214j85386
13810F75719K73689k79967K95449M8079J29599k20457p3407l18301K76748n6026
13800G51125K28326j20115M5110J24232j5759l13697o3087M34518m97576p6389
$$ plain form
13871 1337211 1132174 1540345 1364790 1045222 1123015 1426293 1207726 1262856 1374133 1170447
13861 1170447 955687 1020176 1228683 1132914 867302 894124 1367384 750543 1087512 1382053
13851 1382053 994057 1178174 1089404 1231834 1183438 977026 1024824 1111284 1251348 1250220
13841 1250220 1149523 1442574 1094493 778516 1130137 1280383 1279825 812737 1001507 980321
13831 980321 1012252 1003158 966979 750489 739052 891509 849311 873175 1167497 786242 858832
13820 858832 941314 763728 817367 753636 814650 977491 823905 581891 861105 675719
13810 675719 949408 669441 964890 1012969 1142568 922111 848704 530403 807151 751125
13800 751125 979451 859336 904446 1028678 1012919 699222 636135 1070653 573077 496688
13790D96688K92731J12719r0798j15122J43649k1588m575N6532K49770l09419
13780H10587j243n1699q0516K6851K7683J02308r2800q5259j78439K18825J48889
13769H45187K80652k18820k85475J92643J84229l23714J29636q0304l4208l3925
13759F55901j64732k5992j03055L89521J8818l10722M00572B85127O63226D71328
13748D62215J17484K43041j77828j92310P7442L11159m8912k82986j43717K44309
13738F09897K21340j15711k82014K37500j35813j49534K90856P9721l4270j79700
13728E42272K96499J53318m54642J22046J4710k64684J32405J67942J5795o2044
13718F63617j23322O5737m1898R6891J04787J05639C60995q4579K98289M07973
$$ plain form
13790 496688 789419 902138 811340 696218 839867 818279 813704 870236 1120006 810587
13780 810587 809344 757645 677129 703980 731663 833971 741171 655912 477473 696298 845187
13769 845187 1125839 907019 621544 814187 998416 674702 804338 724034 689826 655901
13759 655901 491169 465177 362122 751643 770461 459739 860311 285127 948353 471328
13748 462215 579699 822740 644912 452602 530044 841203 792291 509305 365588 609897
13738 609897 831237 715526 433512 671012 535199 385665 676521 756242 721972 542272
13728 542272 838771 992089 537447 659493 674203 409519 541924 709866 725661 663617
13718 663617 540295 606032 564134 661025 765812 871451 360995 276416 574705 982678
13708I82678l85015J65797j67156P3751l0155J7727N5967k82661K49418n6588
13698F23763m6842O0556m9737j31575K78965C10153K5845M7109L65099l18510
13688D29696J62184n0260q3810O1871n6049P0446j38760r1427Q4553J89955j29557
13677D48842J82188J5165P5827n8270n294j56907J81819J19663B27966K27747
13667D55713M32850k12429o2350k11837J80608A57176K72811J50029j33451j27970
13657C18595J09731J92567j38999q6170L62727k45803J13588A73664P6517K99725
13647E49906J9392k13848L28545b1134C70157J36431A81193M45284j72518j85089
13637B68870J48070j20625o3064P1656M78965E6371L41615j20576R2053A02730
$$ plain form
13708 982678 597663 763460 596304 670055 639900 657627 713594 430933 680351 623763
13698 623763 576921 637477 587740 456165 735130 310153 335998 383107 748206 429696
13688 429696 591880 541620 457810 519681 463632 534078 395318 303891 388444 578399 448842
13677 448842 631030 646195 722022 663752 658458 501551 683370 803033 227966 455713
13667 455713 888563 676134 613784 401947 582555 157176 429987 580016 446565 318595
13657 318595 428326 620893 481894 395724 758451 512648 626236 173664 250181 549906
13647 549906 569298 355450 683995 -21134 370157 506588 181193 626477 453959 268870
13637 268870 416940 296315 233251 304907 783872 56371 397986 277410 369463 102730
13626C18248K20446B41422J99543B01295J12802J52123B01108M04645j60112j36277
13616C09364L48044l09421K34759A16712M61483j97199k7663J0412J533L26548
13606F91826B22755M09423j84535B4620L25454j18083J91236j79603J71672J86913
13596F02209B26752J38558p260j25611J15315A36631K37550j4039P4407Q2443
13586E16992A24037K35627J21171A88789K54940j47985J40025n3120m9044K9546
13576C63151M87387F1072J06575D610M69316j73020q230j30765Q921P9933M3780
13565B94545k8946K18807B21530L31404Q2172j68871j0348k27683k0101L58275
13555E66378F6282J43171H7059M93594B08825J44447K06790a09085A94391D8874
$$ plain form
13626 318248 538694 241422 440965 201295 314097 466220 201108 605753 445641 309364
13616 309364 657408 347987 582746 116712 578195 380996 353333 363745 365278 691826
13606 691826 222755 632178 447643 24620 350074 231991 423227 243624 415296 602209
13596 602209 226752 365310 358050 232439 347754 136631 374181 360142 434549 516992
13586 516992 124037 359664 480835 188789 443729 295744 435769 382649 333605 363151
13576 363151 850538 61072 167647 4610 473926 300906 292676 161911 170832 250765 294545
13565 294545 265599 484406 221530 552934 635106 466235 455887 228204 208103 566378
13555 566378 66282 209453 87059 580653 208825 353272 560062 -109085 194391 48874
13544D68162k05077J2423J01196L5477K40173k21346n8831J49450A67757J83514
13534C51271q4964L10620I368M37450j79081J44401j7290j1170p5953j25282k6069
13523A56374K0940K60216O8701k50276r7359K47756g354A27705L05826j35614
13513B97917J91674n3256A23440N09413j43687j65880j20453D6123L20301A10060
13502A62757e4461B71489K2509D3962N9350J53614H5129L2690L40694A52422D4267
13490B4980J85593Q8121A20649J49916q8099n6431P035D2338K38252A04163L12332
13479D16495I9682O5772P2594F2909K42441g0335C13663J95946B54007L93638
13469F47645i1731A46402g9310C65281L0682j36665J0066J71398B07722K69541
$$ plain form
13544 468162 263085 275508 376704 412181 652354 431008 372177 521627 167757 351271
13534 351271 266307 576927 9368 446818 267737 412138 394848 383678 307725 182443 156374
13523 156374 177314 437530 506231 255955 158596 406352 -7354 127705 433531 297917
13513 297917 489591 436335 123440 632853 489166 323286 202833 46123 366424 110060
13502 162757 -54461 271489 293998 43962 103312 256926 85129 117819 458513 152422 44267
13490 24980 210573 298694 120649 270565 182466 126035 133070 42338 280590 104163 416495
13479 416495 99682 165454 238048 62909 305350 -70335 313663 509609 254007 647645
13469 647645 -91731 146402 -79310 365281 395963 259298 269364 440762 207722 477263
13459D77263k26367e8801A45998m4332J13119L5599A3484O9643J65023N4932d5534
13447A57020N4820L28718j99578A58028M45828k94849N2536j76313D3177K19128
13437B62305C4382L71228H1413K26431M3847j14768K08O8516J73439j32809p9898
13426B66379N4747j39419M6406I3849J99078G3945K16152o1392J24517o2959O7935
13415C58198n731j45618a02440B86850n6304J03968o96A29924C9657J33164l1134
13404A41687e9353j00678A52103K55222j69873O4480I4846R813o268K51007A13357
13392a0504I4057K26233j46317L00743j92310a42222B62534J69442b2179H2165
13381A33421L43596k33220K43653A47913m3396B6619J54316J44505j58699K93544
$$ plain form
13459 477263 250896 -58801 145998 101666 214785 250384 13484 83127 248150 303082 -45534
13447 157020 211840 540558 340980 158028 603856 309007 361543 185230 43177 262305
13437 262305 34382 405610 81413 307844 351691 236923 237131 305647 479086 346277 266379
13426 266379 321126 181707 228113 93849 292927 73945 290097 228705 353222 290263 358198
13415 358198 352467 206849 -102440 286850 230546 334514 333818 129924 39657 172821 141687
13404 141687 -59353 -160031 152103 407325 237452 301932 94846 104659 98391 349398 113357
13392 -10504 94057 320290 173973 474716 282406 -142222 262534 431976 -22179 82165
13381 133421 477017 243797 487450 147913 104517 26619 180935 325440 166741 460285
13371D60285A51076K25731J1164j83144L2990F9123P4166a1557B56019K63302
13361E19321j73753j66351M0353K50633G7358J47578r9905E5908K63888j37530
13351A82266b307k5551D9478K33339a08942B45414A15915K372j6422L1406J89347
13340C22618P9288l4798L69286B80297j25235b1922B70372k1616J58408A02757
13329C62095A6074K71647A18105J49185r1651o7117K15365J66181j74810A09156
13318E7179O5295j430K10249A17597k3132N7354l5485f6911C64957J04856k09867
13307B59946r6191J3946P8992m4197a87175B73161L5520O2662j37136j9092E6334
13295c32738H3223K5703J88013l3170G6471K17937p1586f3831B11594e8120d617
$$ plain form
13371 460285 151076 376807 387971 204827 237817 69123 143289 -11557 256019 519321
13361 519321 345568 179217 219570 470203 77358 224936 125031 55908 319796 182266
13351 182266 -2307 -27858 49478 282817 -108942 245414 115915 118287 101865 133271 322618
13340 322618 401906 367108 736394 280297 155062 -21922 270372 248756 407164 102757
13329 362095 16074 287721 118105 267290 175639 108522 323887 490068 315258 109156
13318 57179 122474 121044 331293 117597 94465 151819 116334 -66911 364957 469813 259946
13307 259946 163755 177701 256693 212496 -187175 273161 308681 371343 234207 215115 56334
13295 -332738 83223 108926 296939 263769 76471 294408 222822 -63831 211594 -58120 -4617
13283A74727q9h266n5882A93549I6403K04364c5534G7202g9751F1525L9243f1730
13270g8258B02219l0274M0554d0460C9394O3077M433p780R5981a24542D79522
13258B06344j5943K11412j21183I3477J36270m902o3391J23011j14666E3295R5266
13247A48561N0467J21175A06184b12355A40182c28076d4760j87492b3948G8055
13236B55606c55922a58068c5185A81374a02102A74760D3808h0045B24715n1791
13226A72924L1486a0145B77956a23239A76338D8364J31426H1576K05702k1659
13216B65619a6323B4227c3708B89083A28120J52381D5148q083K64171j3936p3413
13205B13887o8593M52683k80248E799d4707F7783J23559Q1182q8184c11100f1062
$$ plain form
13283 174727 174638 -8266 -64148 193549 96403 300767 -35534 77202 -79751 61525 100768 -61730
13270 -78258 202219 171945 212499 -40460 39394 102471 106904 99124 195105 -124542 479522
13258 206344 190401 401813 280630 93477 229747 224845 161454 284465 169799 53295 148561
13247 148561 199028 320203 106184 -212355 140182 -328076 -44760 -232252 -23948 78055
13236 255606 -355922 -158068 -35185 181374 -102102 174760 43808 -80045 224715 172924
13226 172924 204410 -10145 277956 -123239 176338 48364 179790 81576 287278 265619
13216 265619 -16323 24227 -33708 289083 128120 280501 45148 37065 301236 287300 213887
13205 213887 145294 597977 317729 5799 -44707 67783 191342 272524 184340 -311100 -61062
13193B95457P9562f8945C1712h5954A13139e4016j26725Q6152D7284a83467D7856
13181B35117J7142F8193K02537G3423f9836B75304E8546K723K82603C301a72990
13169h1753G3339a224A51861o3331h1515A26255B8316Q1732a3719C03619r5842
13158B07777J16n8682F5654H438i5926j36170R3846G3139M9532C027M3564J44621
13146A91212i4440B1162N916h7383D0236K12354q2980C1810J8932c14052A8872
13134I7186J32396o903I6604Q2398b79430A69532o7960i7696B62451C7131a47190
13122F21739A85715g3027A8034L78605i2575C8765F455J34532b2472A38612b03372
13110C19508b48279A36285i5404B99238q0975R9181D8045f4138p4730D31934b20483
$$ plain form
13193 295457 375019 -68945 31712 -85954 113139 -54016 -180741 -94589 47284 -183467 47856
13181 235117 252259 68193 270730 73423 -69836 275304 58546 61269 343872 3301 -172990
13169 -81753 73339 -1224 151861 88530 -81515 126255 28316 110048 -13719 303619 207777
13158 207777 207893 149211 65654 8438 -95926 -232096 -138250 73139 122671 3027 46591 191212
13146 191212 -94440 21162 27078 -87383 40236 252590 169610 31810 50742 -314052 18872
13134 97186 229582 222679 96604 179002 -279430 169532 101572 -97696 262451 37131 -147190
13122 621739 185715 -73027 18034 396639 -92575 38765 6455 140987 -22472 138612 -203372
13110 319508 -248279 136285 -95404 299238 218263 317444 48045 -64138 -138868 431934 -220483
13098B15544J88731h0168B17364p2422c2234j70776F1630R5111J87863K6328A22878
13086c06465i1935B26028b27281d7305A40177K5172J35507H9484l2964g4355Q648
13075f5707A02959l0521l4095e2042A52183Q7526H6185f0337a0274j06412B72136
13063b7110j00124D6011K8347K7793L55514A51335c07901b378F5986R4116a69866
13051A66087o9384a00487M9452C34126h257B87917j29243G6143Q3810P8173A0156
13039E5094f1442j15516I6346J09395J34736j44886K43220A90910L8121B5103
13028F7512O0907a65495B27061a19115c3922A10552b4750A07924J34147J54658
13018C96729h4417H60b15239A34176c5773I3962a57605D6025a81791A40339N3705
$$ plain form
13098 215544 404275 -80168 217364 144942 -32234 -203010 61630 156741 344604 370932 122878
13086 -306465 -91935 226028 -227281 -47305 140177 165349 300856 89484 56520 -74355 -65707
13075 -65707 102959 72438 38343 -52042 152183 239709 86185 -60337 -10274 -116686 272136
13063 -27110 -127234 46011 74358 102151 457665 151335 -307901 -2378 65986 160102 -169866
13051 166087 96703 -100487 -51035 334126 -8257 287917 158674 76143 159953 238126 10156
13039 55094 -61442 -176958 96346 205741 340477 195591 438811 190910 229031 25103
13028 67512 128419 -165495 227061 -119115 -33922 110552 -24750 107924 242071 396729
13018 396729 -84417 860 -215239 134176 -35773 93962 -157605 46025 -181791 140339 194044
13007A94044j6142p7897K75017A10213J85723A36649J22288h6859A93835M8652
12997B42487J47950c7877A14814b31761C98334a93787B62823G182K6729b12731
12986B95180b2079A91960a37458F886a3211E7048o605J16472h4199p9570h1521
12974a90738g2387F6121J12725b35416J7944c1704j72150f2354C08575a61777
12963i0608a9437E4490c34788g295l2779B27562E3804d2332A34451p539J08150
12952B35062C3998d8297b0062M491A29322J03362c0643D38738A5006a00286K8268
12941g2018R731B40581i0267H8462O8775N4860B9778K29302K29541a46564d5135
12929d9135B09305C5945a3185A28142O7697c5062B9871a7658k20127J17067A94693
$$ plain form
13007 194044 177902 100005 375022 110213 295936 136649 258937 -86859 193835 242487
12997 242487 390437 -37877 114814 -231761 398334 -193787 262823 7182 33911 -212731
12986 295180 -22079 191960 -137458 6886 -13211 57048 50443 166915 -84199 -163769 -81521
12974 -190738 -72387 66121 178846 -235416 -217472 -31704 -203854 -62354 308575 -161777
12963 -90608 -19437 54490 -334788 -7295 -40074 227562 53804 -42332 134451 126912 235062
12952 235062 33998 -48297 -20062 -15571 129322 232684 -30643 438738 15006 -100286 -72018
12941 -72018 -62287 240581 -90267 88462 157237 212097 29778 259080 488621 -146564 -45135
12929 -49135 209305 35945 -13185 128142 195839 -35062 29871 -17658 -237785 -120718 194693
12917c0120k51247c3787m8740A13318J79906a04533F6583a6892a144n7122j93392
12906b51658A52652e5336B57881a47727B21664j1313d6211D95349k41928b06866
12895A87290P5177b12315g4816D22135a48070N0409C90791a46827A40477g147
12884H5286J24880a23968C16350a77365j00727A74214n9963a14877m2640B67565
12873d2396A80320a15807A46997L1486b2599H3720c6067A06635l0992a86854j606
12862a88460j02401h494k54616j57773A78084c0226p2631A9296b69030A4533O9471
12851H4004k066Q5779K0393E1430c841j36879f8399A75233a94377g3900b3125
12839E1911g747j0320q1006k56883F3227J10144l5713f3711j19574h7637K6482
$$ plain form
12917 -30120 -281367 -33787 -82527 113318 293224 -104533 66583 -16892 -1144 -58266 -251658
12906 -251658 152652 -55336 257881 -147727 221664 210351 -46211 495349 253421 -206866
12895 187290 262467 -212315 -74816 422135 -148070 -97661 390791 -146827 140477 -7147
12884 85286 210166 -123968 316350 -177365 -278092 174214 114251 -114877 -157517 267565
12873 -42396 180320 -115807 146997 178483 -22599 83720 -36067 106635 75643 -186854 -188460
12862 -188460 -290861 -8494 -263110 -420883 178084 -30226 -102857 19296 -269030 14533 84004
12851 84004 81938 167717 188110 51430 -3841 -140720 -68399 175233 -194377 -73900 -23125
12839 51911 -7747 -18067 -99073 -355956 63227 173371 137658 -63711 -183285 -87637 -61155
12828f1155j8987G8156J39514a14729D6546Q6003b24085r8121i1325D3396M4137
12817H7533J06313c10216b802k90580B5536a9606p9461A64320a19604b7447r481
12806c6928A43618b26999a05067M3811b2165A05471a3174m1326m7889B2690a5718
12794C16772b06807B39121H9740a40086F8134M7339c77958i7113B63144a37290
12783b14599e6714B607a26380g345C1695M5363K54427h9288j0789B55433a46988
12771A8931J13g6346j05371A84878a94387n8668H1458B2955a94986f3709j21304
12760a85013j14690E0667a23699e8272A01867b8689A48012g5037J5937I8329b43817
12748B2328a7527C20289a32647B7263g7181K2766j73678c5498C75566D5291N3262
$$ plain form
12828 -61155 -80142 78156 217670 -114729 46546 132549 -224085 -322206 -91325 43396 87533
12817 87533 193846 -310216 -2802 -293382 25536 -19606 -99067 164320 -119604 -27447 -36928
12806 -36928 143618 -226999 -105067 -61256 -22165 105471 -13174 -54500 -102389 22690 -15718
12794 316772 -206807 239121 89740 -140086 68134 115473 -377958 -97113 263144 -137290
12783 -214599 -56714 2607 -126380 -7345 31695 77058 331485 -89288 -100077 255433 -146988
12771 18931 19044 -76346 -181717 184878 -194387 -253055 81458 22955 -194986 -63709 -185013
12760 -185013 -299703 50667 -123699 -58272 101867 -28689 148012 -75037 -59100 98329 -243817
12748 22328 -17527 320289 -132647 27263 -77181 -54415 -228093 -35498 375566 45291 98553
12737I8553p817K6926E0671K33032a35796B69662G0456B5874a42104H5644Q5495
12726A71139a60633j70426q755A50036l0680n7169b41757e3675A15371a27583
12715c8375A2960J917M42028A62487K54291n2135c3459D03648j89395N0014L0820
12704B95087j01244J16139Q0856A86423A1850J26818C4685O8467k1184e406j01276
12693a06682K911j26709e9858o6834E8131J09314m5979c08707c7974j44435d0394
12681A25337H591L0320L44460E5749i0777B92028k1201H5L41718j64446m5686
12670A31671J79542C2426N5010k6447b22512c3491A92815a95469G2932B9977f7481
12658B05552H8819J54983B3794K84032A26914B3241L26742b594A10858c56502
$$ plain form
12737 98553 90736 117662 50671 283703 -135796 269662 70456 25874 -142104 85644 171139
12726 171139 -160633 -331059 -339814 150036 119356 62187 -241757 -53675 115371 -127583
12715 -38375 12960 14877 456905 162487 416778 364643 -33459 403648 214253 264267 295087
12704 295087 193843 309982 390838 186423 11850 138668 34685 103152 81968 -5406 -106682
12693 -106682 -103771 -230480 -59858 -126692 58131 167445 121466 -308707 -37974 -182409 -40394
12681 125337 8591 38911 383371 55749 -90777 292028 270827 85 341803 177357 131671
12670 131671 311213 32426 87436 60989 -222512 -33491 192815 -195469 72932 29977 -67481
12658 205552 88819 243802 23794 307826 126914 23241 349983 -2594 110858 -356502
12647B04637L52696A12414a4449m6402A66855n0577J91861H0482a77156H0194
12636G5404N9342b06539P225d576D3718K13829a63722b645A35829N0502J02359
12625B88690A00025a11885A39866a39183A72277k5373j3775D6921a26885A37597
12614c1525j79495Q8849A17987c20568a57293h607j07924B06835l3057D926J45381
12603A50307a28606A99496a45797e936q8571D73012b54122K5193G3930b66103
12592H2054K24129j35958L3821K2653e2394k87382B5994J38740H365P5476j7630
12581F6211J92366g8108r3510C91769a69564A01422b09663e5425l4634A3871a18640
12569A03770l6861N8597k0944c81308j036A17291n3895p894i9469M0046j35784
$$ plain form
12647 204637 557333 112414 -14449 -60851 166855 116278 308139 80482 -177156 80194
12636 75404 134746 -206539 -199314 -4576 43718 257547 -163722 -2645 135829 186331 288690
12625 288690 100025 -111885 139866 -139183 172277 146904 133129 46921 -126885 137597
12614 -31525 -211020 -122171 117987 -320568 -157293 -8607 -116531 206835 173778 4926 150307
12603 150307 -128606 199496 -145797 -5936 -94507 473012 -254122 -228929 73930 -266103
12592 82054 306183 170225 204046 226699 -52394 -339776 25994 164734 8365 83841 66211
12581 66211 258577 -78108 -171618 391769 -169564 101422 -209663 -55425 -90059 13871 -118640
12569 103770 66909 125506 104562 -381308 -382344 117291 63396 55502 -99469 -59423 -195207
12558a95207C64360A45699N9786b9751A35431g4464l16752G7822M6667a40558
12547a50603B12311m9425a77995A72481l7863C5112J41811a21107A12539P1094
12537A83633d55792B47283c24077j4435A34573b83094i7143E2499O9365K47346
12527C69210F7316A0584Q145Q3774K68396D4192p642a52241B4944K30665r9076
12516A56533g4436B3482J68431a38029B4558K07218d5673k29502a13411L9399
12506g4012o1466B89499G5509J71051a24750B07327a6022C2533m20c78336c4931
12494A59973M0328B3234K45014r4680g2701G3554J48691F4204c38224c1335C5225
12482e1917j11733j62644e0847j19314G4267J14771f5724k7976d2211B28742G5886
$$ plain form
12558 -195207 364360 145699 205485 -29751 135431 -74464 -391216 77822 124489 -140558
12547 -150603 212311 162886 -177995 172481 134618 35112 176923 -121107 112539 183633
12537 183633 -455792 247283 -324077 -338512 134573 -283094 -97143 52499 121864 369210
12527 369210 67316 10584 18729 102503 370899 44192 36550 -152241 24944 255609 156533
12516 156533 -74436 23482 191913 -138029 24558 231776 -45673 -275175 -113411 -74012
12506 -74012 -135478 289499 75509 246560 -124750 207327 -16022 32533 32113 -378336 -34931
12494 159973 200301 23234 268248 173568 -72701 73554 222245 64204 -338224 -31335 35225
12482 -51917 -163650 -326294 -50847 -170161 74267 189038 -65724 -93700 -42211 228742 75886
12470g756l80780B36441A7160K76534h4312D08130F9662C4618J41755a10217r0598
12459b00815G8082a29422L5161j3611l15416G370h008j28621A91176P5602a74282
12447a16454j22446C65190q0011a324r9564B32580A2986c50575a14398B29961
12436A45735B8778R664J17919l5582n8904P1067a08891A73149M1707K7003a24384
12424D2367b73829d2019A35422m1021J7193m2815a86840B23510A0542a40895A15179
12412a18248d2854p2804j7922l50756a25188d4367l6245B3017J80761f547r6890
12401a03437B92733a94833a2207m36194a77855K8539m914A25439b16264A60876
12390A16473J05292E7797K08701m952a38232d5378A18685J17297b19853B9842
$$ plain form
12470 -7756 -388536 236441 17160 293694 -84312 408130 69662 34618 176373 -110217 -200815
12459 -200815 78082 -129422 -94261 -107872 -423288 7370 -8008 -136629 191176 266778 -174282
12447 -116454 -238900 365190 285179 -1324 -100888 232580 12986 -350575 -114398 229961
12436 145735 28778 38442 156361 120779 61875 132942 -108891 173149 214856 241859 -124384
12424 42367 -273829 -42019 135422 94401 111594 68779 -186840 223510 10542 -140895 115179
12412 -118248 -42854 -115658 -133580 -484336 -125188 -44367 -80612 23017 203778 -6547 -103437
12401 -103437 292733 -194833 -12207 -448401 -177855 -149316 -154230 125439 -216264 160876
12390 116473 221765 57797 266498 261546 -138232 -45378 118685 235982 -219853 29842
12379g0404B19306D0469h5509A50346o780A5105K09122B0744K09636f7344o9044
12368a36388e7021A51646c38617A53282c8574f891j21939C17286j27005p5181
12358A15100a03491M1323k3p5455K6469B3477a30332C45578c31934J40185A16746
12346f9877B69822M5200a91195Q8808B8432J27695L1028A7431L22894j54880O3707
12335B49152Q7237b362C67094A4718b46663I0090L20498A11994q440L92056A32316
12323I0485i6095A20772L1545K19825j24786A07360d8760B59126b36655A30557
12312E9816K64181B2334b6504C51130a9899r316k91j72976R1168B49438J33025
12301C82463A69072M8158C5796J61811f0259E3487c6378D6910R7182J0759b21433
$$ plain form
12379 -70404 219306 40469 -85509 150346 143566 15105 224227 20744 230380 -67344 -136388
12368 -136388 -57021 151646 -338617 153282 -38574 -6891 -128830 317286 190281 115100
12358 115100 -103491 -62168 -62191 -137646 -111177 23477 -130332 345578 -331934 -191749 116746
12346 -69877 269822 315022 -191195 -102387 28432 156127 187155 17431 340325 185445 249152
12335 249152 336389 -2362 367094 14718 -246663 90090 410588 111994 103554 495610 132316
12323 90485 -96095 120772 152317 372142 247356 107360 -48760 259126 -236655 130557
12312 59816 323997 22334 -26504 351130 -19899 -29215 -29506 -202482 -111314 249438 382463
12301 382463 169072 217230 35796 197607 -60259 53487 -36378 46910 144092 154851 -221433
12289A96562g6801A28854c4344j9095B1881a92398a6308B70667k8802a04786E59102
12277D4245M77815B3857M39789e5946b3913I6917L5158Q5182G5903l0481g5605
12265D9599L0635J32719a80272j09862B83366J84893A63179a06311B06095a9948
12254B29033J87792D2222a1253q2556B54500K08228n9242A86894E8005e2068I3828
12242B79105A6861K21644K6976K1887h9436r9977J8662B1072g0806B48170A3615
12230a40664A56688D6309a03254k8318E1338L08775C3081L73222A7905M9697K35791
12219C03393j09235p7595A9733a88037D93608A59838K74709a3936D3748a65606
12208A29301b18230p5086B29714J83871f6932A07033g4337A81206M8793j12668
$$ plain form
12289 196562 -76801 128854 -34344 -53439 21881 -192398 -16308 270667 241865 -104786 559102
12277 44245 522060 23857 463646 -55946 -23913 96917 132075 217257 75903 45422 -75605
12265 49599 80234 212953 -180272 -290134 283366 468259 163179 -106311 206095 -19948
12254 229033 416825 42222 -11253 -93809 254500 462728 403486 186894 58005 -52068 93828
12242 279105 16861 238505 265481 287368 -89436 -189413 -170751 21072 -70806 248170 13615
12230 -140664 156688 46309 -103254 -131572 51338 360113 33081 406303 17905 67602 303393
12219 303393 194158 116563 19733 -188037 493608 159838 434547 -13936 43748 -165606
12208 129301 -218230 -293316 229714 413585 -66932 107033 -74337 181206 229999 117331
12198A17331J12900q1022J27804p7037j5208R22O9658j15884M3479k1859K23900
12187C84984a8282B01831N3143L6688c7481A48729e2598B55506J8037b0178A73422
12175A46451L79623A54705J52246D2899Q7337n1153M12310d0077B80109l8675
12165B41434E4588J58045H9798L88543j4716A46188J62468H6572k8146K61901
12155C20327J38652a57102O5121F2310a05689M0679E5664K50810A24343a81843
12144a39218D7647K76623c7023j20073E6135K0963j4883M67705b5487A04651J0896
12133A15547K71055H3357L91277j58991B8830b1519E3934J57800a0325A36064
12122B86796H4475j2582K75998j2650l2262l9147j13907a7447D76100j64393A3242
$$ plain form
12198 117331 230231 149209 277013 199976 184768 185690 255348 139464 182943 161084 384984
12187 384984 -18282 201831 254974 291662 -37481 148729 -52598 255506 273543 -20178 173422
12175 146451 526074 154705 306951 42899 130236 79083 491393 -40077 280109 241434
12165 241434 54588 212633 89798 478341 463625 146188 308656 86572 58426 320327
12155 320327 458979 -157102 -91981 62310 -105689 -65010 55664 306474 124343 -181843
12144 -139218 47647 324270 -37023 -157096 56135 77098 62215 529920 -25487 104651 115547
12133 115547 386602 83357 474634 315643 28830 -21519 53934 211734 -10325 136064
12122 286796 84475 71893 347891 335241 302979 263832 149925 -17447 476100 311707 13242
12110C26910H3686R2917n0247m5707a42800A80180H1934a54993B70085J4759K06517
12099D91361b4979A7914L44347q3598j00548p5257K16006G1209E160L57219j41628
12088B20751b6375B40403a29369D40168A97795r0197K06058H206O4664C3653K3441
12077E7094P0821a47067e3362A71035J75393A62202e4040C73428A71450i3848
12066i4991F8794a05973A15656D9366G355J51534F6730K37531h2776c9946A57078
12054H2422M676K72668G3143e398A00563b25906A87091J50769F3700a8076D1373
12042I5150l346e2935b329B96504C9219J52821D7915a26326G4001N009O108k4066
12030F1052h5970j32878A19159L5604J08118a31313B68051K2305a68336C0235
$$ plain form
12110 326910 83686 176603 126356 80649 -142800 180180 81934 -154993 270085 284844 491361
12099 491361 -24979 17914 362261 278663 178115 102858 318864 71209 5160 362379 220751
12088 220751 -26375 240403 -129369 440168 197795 107598 313656 8206 72870 33653 57094
12077 57094 127915 -147067 -53362 171035 346428 162202 -54040 373428 171450 -93848
12066 -94991 68794 -105973 115656 49366 7355 158889 66730 304261 -82776 -39946 157078
12054 82422 87098 359766 73143 -5398 100563 -225906 187091 337860 63700 -18076 41373
12042 95150 91804 -52935 -2329 296504 39219 192040 47915 -126326 74001 79010 85118 61052
12030 61052 -85970 -218848 119159 154763 262881 -131313 268051 290356 -168336 30235
12019b6163A30884e4424j43558B03582I5467J0302M9238a49011A18023n2294M0531
12008A06260A4174Q0946a77729Q6846B21018f6340k36227J28423A45483a62648
11997C0888d1024o6256o8985A69540R9901a46135j5251B8945M2855a66659A21254
11985a21294A53063A1974g1779k11951h0919j20780O4914K1817A5610J93204B5840
11973G838A015a87331b862p0922A24120a43084O903a0818o7404A77271p4600a96215
11960A7990M66301a17074m9358b5281I3084g5965j4313j02843I2096J89384A11657
11948a14115J4842B490d8450a0284G1969o624B1085g9940A41701a95912E92152
11936D1777j092O2461g3547k4408A89177a85243E8549b28390R1396j09759I0126
$$ plain form
12019 -26163 130884 -54424 -197982 203582 95467 105769 155007 -149011 118023 65729 106260
12008 106260 14174 95120 -177729 -90883 221018 -66340 -302567 -174144 145483 -162648
11997 30888 -41024 -107280 -176265 169540 269441 -146135 -161386 28945 71800 -166659 121254
11985 -121294 153063 11974 -71779 -283730 -80919 -201699 -136785 -114968 15610 208814 25840
11973 7838 1015 -187331 -2862 -73784 124120 -143084 -136181 -10818 -78222 177271 102671 -196215
11960 17990 484291 -117074 -166432 -25281 93084 -75965 -90278 -193121 92096 281480 111657
11948 -114115 -99273 2490 -48450 -10284 71969 65345 21085 -79940 141701 -195912 592152
11936 41777 40685 103146 -73547 -97955 189177 -185243 58549 -228390 -136994 -246753 90126
11924b7824k17336A60980F3281c07297B4950c2190j97664d3665B4784J56294b1425
11912a11354C4535a4146A22732a33135B6140a6764B08831P0848b6516o6076a4877
11900b67558e9140I2008D3049a31237H8914P32b32937J16076E5255B7361g8820
11888b50837A50325Q1510b91152a24470B43409H9872c27948k07993b49339i5262
11877C9760b58757G0579a88763a28l3949j04184n2079A740a06254l6898H7830
11865d1470j7671H0846a20917F7526a22206D7435Q7957a88498q3765A03341a58848
11853B89883H6203J37285I9506e2723j00741B2901b15489j02734a01169B00641
11842a74917N9679C6755J68352b44106b5198A55714e2282F1039d80946a69564
$$ plain form
11924 -27824 -245160 160980 63281 -307297 24950 -32190 -229854 -43665 24784 181078 -21425
11912 -111354 34535 -14146 122732 -133135 26140 -16764 208831 279679 -26516 -92592 -14877
11900 -267558 -59140 92008 43049 -131237 88914 89646 -232937 -116861 55255 27361 -78820
11888 -250837 150325 231835 -291152 -124470 243409 89872 -327948 -535941 -249339 -95262
11877 39760 -258757 70579 -188763 -128 -34077 -138261 -190340 1740 -106254 -143152 87830
11865 -41470 -59141 80846 -120917 67526 -122206 47435 135392 -188498 -272263 103341 -158848
11853 289883 86203 223488 99506 -52723 -153464 22901 -215489 -318223 -101169 200641
11842 -174917 -115238 36755 205107 -244106 -25198 155714 -52282 61039 -480946 -169564
11831f9644j95378O5777O2372M656B41237a0353A14883f5254B02651b97982H3635
11819b38290F3941a72075C85985c2471r1750B22724d16691C2513b93120e7094
11808h9869D2925P8043d32225a64925A91196h4113B0900c73143c2336h799k36334
11797b45133B2432a00519r6420o1189B61179A06748b35751m0677J32334l9461
11787a83555b23A66354N0405G42O1838A7069c2426k25009f6224a2927H0573j2595
11775F7978J18557b0031A04324g6115A9965a60626D2755J51677h7453j7934c5682
11763c50307A47091b41530b928A77994C6771J61170a67962G6489Q4143A8814f6492
11751I3919e50497a46155k15358B4050K17456b20712f0822A26997b83917J988
$$ plain form
11831 -69644 -265022 -199245 -136873 -132217 241237 -10353 114883 -65254 202651 -297982 83635
11819 -238290 63941 -172075 385985 -32471 -124221 222724 -416691 32513 -293120 -57094
11808 -89869 42925 120968 -432225 -164925 191196 -84113 20900 -373143 -32336 -8799 -245133
11797 -245133 22432 -100519 -196939 -258128 261179 106748 -235751 -276428 -144094 -183555
11787 -183555 -223 166354 216759 742 62580 17069 -32426 -257435 -66224 -12927 80573 67978
11775 67978 186535 -20031 104324 -76115 19965 -160626 42755 194432 -87453 -105387 -35682
11763 -350307 147091 -241530 -2928 177994 36771 197941 -167962 76489 160632 18814 -66492
11751 93919 -550497 -146155 -361513 24050 241506 -220712 -60822 126997 -283917 -281929
11741b81929B86512H304a23055A30879K5245m5957b67612B67809m9315j03710
11731A14784O3586c18284D00914a72566N2262A89528I365a29035A15639c91912
11720a35889C52858d99238a03132A16534m9763K7522l2513h463j20791A73921
11709B17718a61868C2251i7591a6524I5144l033a6674C2092J86722a3086A78617
11697B39649r4938A5478a01730A75095c2955A38383g0201C10457A29065i7668
11686f5637A29227D5921J0311a29223B2423c07495C29076i277H7220b05522C56787
11674A79238b03176D9946c57937B0756Q0428c5511j25458O4639B599h7777B4598
11662A76961M2052a72840A59557c0733F7605N6237m8875b97120B00535C9021G919
$$ plain form
11741 -281929 286512 8304 -123055 130879 156124 110167 -267612 267809 218494 114784
11731 114784 178370 -318284 400914 -172566 -120304 189528 9365 -129035 115639 -391912
11720 -135889 352858 -499238 -103132 116534 66771 94293 61780 -8463 -129254 173921
11709 217718 -161868 32251 -97591 -16524 95144 92111 -16674 32092 218814 -13086 178617
11697 239649 144711 15478 -101730 175095 -32955 138383 -70201 310457 129065 -97668
11686 -65637 129227 45921 56232 -129223 22423 -307495 329076 -9277 87220 -205522 356787
11674 179238 -203176 49946 -357937 20756 101184 -35511 -160969 -96330 2599 -87777 24598
11662 176961 219013 -172840 159557 -30733 67605 123842 74967 -297120 200535 39021 7919
11650A14011P2335r0383c7983G966N3424J91561b10452A6526L5800Q1343J16767
11639B50436i477j17486H2165g7375a0219j4564F5184J92625b14368O6888A20606
11627A04624f4941A66766q997e8721m4635A80395K0412F5705J04533B8790j359
11616B7431R1661E7625d6877j08529A58036Q5354B0170a03348d0434k0867k33372
11605b94673E6444b3884j60101D22223F7992B5467a3709E2585J00212L8193c776
11593B16573a298A7101C626J38020e7400M74p6445e2213j0254A1652b75135B99245
11580H6052d0266C70249A4668M8352a63544A56187b0891j91347A48924L7640b87843
11568a10750B0285J76256J3339a52605G6523Q9443D5193O9825b09907D28268j33645
$$ plain form
11650 114011 186346 95963 -37983 7966 61390 252951 -210452 16526 52326 133669 250436
11639 250436 -9477 -126963 82165 -77375 -10219 -24783 65184 257809 -214368 -147480 120606
11627 104624 -64941 166766 157769 -58721 -103356 180395 200807 65705 170238 28790 27431
11616 27431 119092 57625 -46877 -155406 158036 243390 20170 -103348 -40434 -61301 -294673
11605 -294673 56444 -23884 -183985 422223 67992 25467 -13709 52585 152797 190990 -3776
11593 216573 -1298 17101 3626 141646 -57400 -56926 -133371 -52213 -62467 11652 -275135 299245
11580 86052 -40266 370249 14668 63020 -163544 156187 -20891 -212238 148924 186564 -287843
11568 -110750 20285 196541 209880 -152605 76523 165966 45193 115018 -209907 428268 294623
11557B94623p1370a1438B5175J99060K2530J66627i4780a8747k5225j71761h3852
11545A80384i403A48272K64548D6460a47153I8912l4542f4111K5509l824R891
11534c2535r962A88425j222l5293k4358n3785P9187q874a3208B29465A4138J71063
11522A85201a74890k9183b0333p7314C25289b83606B37589H540h5392C4756J54245
11511A89001f7600d494o0193G7177M007b71092F1716g7719j92762A14250n3056
11500F1194K60868I6323B7099b61287E0113M4127J06022m1466E0948a10733A95524
11488A15993O3471K29113B9939J39128J36892K8322D5697a32469o2010f3168o0253
11477a23421b5411C66333A66375J25036j44816C7792M7282J34574e0910A09484
$$ plain form
11557 294623 223253 -11438 25175 224235 246765 413392 -94780 -18747 -43972 -215733 -83852
11545 180384 -9403 148272 412820 46460 -147153 98912 64370 -64111 -38602 -42426 -32535
11534 -32535 -42497 188425 187203 151910 127552 73767 152954 144080 -13208 229465 14138 185201
11522 185201 -174890 -204073 -20333 -97647 325289 -283606 237589 8540 -85392 34756 189001
11511 189001 -67600 -4494 -64687 77177 81184 -271092 61716 -77719 -270481 114250 61194
11500 61194 322062 96323 27099 -261287 50113 94240 200262 158796 50948 -110733 195524
11488 115993 179464 408577 29939 169067 305959 334281 45697 -132469 -194479 -63168 -123421
11477 -123421 -25411 366333 166375 291411 146595 37792 85074 219648 -50910 109484
11466B45578A13695e4343m8813d3733F3287A0878h7375c8012A94750e5093C6963
11454D5507K83908a87072C3388K10395J23360g0445B2290K95976O9186c38296
11443I8730M7798k012d0208B21542d3335b0923M725C1330a16555a0962A57979
11431I9515J0943a49489A55149d2935A35595H115J79830A7221J75792g6098j1218
11420h7316A67991Q7855A1406O3483j8433J6606c90729G7639J68712a6690o0428
11409g7118A90949d8845p9102H749M181R4647f6810A51765J07392G4585K09763
11398B84348R766c20650r0364g936A68284a04226J5849j41442L4811D0709a14843
11386b86516q1174F6461h4450p4874P5071n9005L7990g79k39825A08400j1363
$$ plain form
11466 245578 113695 -54343 -103156 -43733 63287 10878 -87375 -38012 194750 -55093 36963
11454 45507 329415 -187072 33388 243783 367143 -70445 22290 318266 387452 -338296
11443 98730 146528 144516 -40208 221542 -43335 -20923 -16198 31330 -116555 -10962 157979
11431 99515 110458 -149489 155149 -42935 135595 8115 187945 17221 193013 -76098 -87316
11420 -87316 167991 255846 11406 74889 56456 73062 -390729 77639 246351 -16690 -77118
11409 -77118 190949 -48845 -127947 8749 12930 107577 -66810 151765 259157 74585 284348
11398 284348 294114 -320650 -411014 -7936 168284 -104226 -88377 -229819 -195008 40709 -114843
11386 -286516 -367690 66461 -84450 -159324 -84253 -143258 -105268 -779 -240604 108400 97037
11375I7037B1891c01766A78901a8178B46861a4334D5106J11663G6759A2226D096
11363b43865c8428B8393b07943J00877B5327a87230n5231l8384a3472k77699a14141
11351a01557k50720A66019G996a57402e1530A90841J53029A17152Q0194a33386
11340e8867B40559D4362L22380b93861h0135p3973O5086k5880L0204o2134P0281
11329g6551l7812B3061K0274f9244H4926C9723R9490J7173a3762l1249k95799
11318c40810H8133a45191k0117H1586a24241B24139D3464e9178K7228k71456J08913
11307a94493a7834k56481A32262a712j3776q8191K3471b9062B51472a64284B81209
11295a03318d875B5504B110J51347a36157N6105j23493j24377A29692J8715b10667
$$ plain form
11375 97037 21891 -301766 178901 -18178 246861 -14334 45106 156769 76759 12226 4096
11363 -243865 -38428 28393 -207943 -107066 25327 -187230 -242461 -280845 -13472 -291171 -114141
11351 -101557 -352277 166019 7996 -157402 -51530 190841 343870 117152 197346 -133386
11340 -58867 240559 44362 366742 -293861 -80135 -154108 -89022 -114902 -84698 -146832 -76551
11329 -76551 -114363 23061 43335 -69244 84926 39723 139213 156386 -13762 -45011 -340810
11318 -340810 88133 -145191 -165308 81586 -124241 224139 43464 -59178 -31950 -303406 -194493
11307 -194493 -17834 -274315 132262 -1712 -15488 -103679 -80208 -29062 251472 -164284 281209
11295 -103318 -4875 25504 2110 153457 -136157 -80052 -203545 -327922 129692 148407 -210667
11283B75512b37482Q9497D3370b25394a392l39371a68759A71938m5413J47815
11273B74340A25053a56922r1927J18539A05191c3767m1231B97791e4585p2279
11263a26864I2594b06202d0999A13959g74j0319j72019g340m2076l23920J83783
11252a89553e3576F3957h02l23739B8442j0145L61554a70822A3019f2694P54C2259
11239A91484f2676A25226E8510J69830a34877A43155J3650B7165a3911A7650c96068
11227C29862C1782a48066j0180l8639R1882j38443O1185j56852J51460k4882c5313
11215A10650J35237a05638L4793q2351j81647G8903a99000c0925k85449a28896
11204A26272J51329a28297e2911p4221A9502a84640D6716J09592c6897j62694
$$ plain form
11283 275512 -237482 -147985 43370 -225394 -1392 -340763 -168759 171938 126525 274340
11273 274340 125053 -156922 -248849 -130310 105191 -33767 -74998 297791 -54585 -126864
11263 -126864 92594 -206202 -40999 113959 -774 -11093 -183112 -7340 -49416 -373336 -189553
11252 -189553 -53576 63957 -802 -324541 28442 18297 379851 -170822 13019 -62694 -61940 32259
11239 191484 -62676 125226 58510 228340 -134877 143155 156805 27165 -13911 17650 -396068
11227 329862 31782 -148066 -158246 -196885 -105003 -243446 -182261 -339113 -187653 -212535 -35313
11215 110650 245887 -105638 -70845 -153196 -334843 78903 -199000 -30925 -316374 -128896
11204 126272 277601 -128297 -52911 -127132 19502 -184640 46716 156308 -36897 -199591
11194a99591A40340J85417b34888g9629B07351a14782A79828b25519h8544L5915
11184e2629A17849g5075j38997j19187B1220a7012k04179e889A10660a25008e5145
11172H7986a51231p195f2865k40287f8689I4998D1444d9393j20609l530k0248
11161a93780O060G468K31895a27334q8919a9808F2549d2209F4088J98574e09353
11149A12144b35659I3073b3356j33732m04444A6608d6881I7140k1016c6236p9509
11138a15745l3581P0532j47992h5222A6671h695j66555E9647B1910b7282a0735
11126B36152D9426d2894B90274I4614J00592g0848A97198p433G1572f8954A44731
11114B34655H9161D0433D898J29057a43435k8324A71227L943i5332A28502D8595
$$ plain form
11194 -199591 140340 325757 -234888 -79629 207351 -114782 179828 -225519 -88544 -52629
11184 -52629 117849 -75075 -214072 -333259 21220 -17012 -221191 -5889 110660 -125008 -55145
11172 87986 -151231 -158426 -62865 -303152 -68689 94998 41444 -49393 -170002 -173532 -193780
11161 -193780 -187720 7468 239363 -127334 -216253 -19808 62549 -42209 64088 262662 -509353
11149 112144 -235659 93073 -23356 -157088 -561532 16608 -46881 97140 76124 -36236 -115745
11138 -115745 -149326 -78794 -226786 -85222 16671 -8695 -175250 59647 21910 -27282 -10735
11126 236152 49426 -42894 290274 94614 195206 -70848 197198 189765 71572 -68954 144731
11114 234655 89161 40433 4898 133955 -143435 -171759 171227 175170 -95332 128502 48595
11102A67731J76269c0975k5316B47376f081k9938B62986k5622c8720L586A29397
11090a34384A70294J88072h1108C75553A41195J50635j31183J44920a49515C00582
11079G5060L88092A3082J12124J29113a30139D65654A61443J49608E9626J51901
11069B11527l5697h9935D57648o9222j47141E8117M39149J3834n7344A49771E9815
11057C11437l7384L1351K75545r894K19468l50295J76404j15073J77116M139J64705
11046H47519m5400C23842M55241k74134L68327j18598j69069J75718p9400O8231
11036G50158J95490j93869j9795j38292L45497k46242p0547q5413l3595J82666
11026F86058J36347j88695J4073J00744K74588k77399l08738N05450m08768K50314
$$ plain form
11102 167731 344000 -30975 -56291 247376 -6081 -36019 262986 237364 -38720 -35134 129397
11090 -134384 170294 358366 -81108 375553 141195 291830 160647 305567 -149515 300582
11079 75060 463152 13082 125206 254319 -130139 465654 161443 311051 59626 211527
11069 211527 175830 -89935 457648 388426 241285 58117 497266 511100 453756 149771 59815
11057 311437 274053 305404 580949 571055 790523 440228 616632 501559 678675 682814 847519
11046 847519 802119 323842 779083 504949 873276 754678 585609 761327 681927 750158
11036 750158 945648 751779 731984 593692 939189 692947 622400 536987 503392 686058
11026 686058 822405 633710 647783 748527 1023115 745716 436978 942428 533660 783974
11016G83974P669k97812J02541K00210j31913j25455J8641K26077j91096j33330
11006D59506K0150m011M07928n4066l58728N97294l50949j35145Q299o0927L87300
10995I16651C31899N66535D48014K86421C49842J20795K65057l05084M36696j4520
10985H52786k57596l4004L85432l7880k17028J49825q853R3978j16105K54792
10975A065347M61882k8069k44221L6522L43208K86782K24738J66201j9788M00102
10965B692704O4514l86767M7359j28080j0503l68336n23477L37666k34620J2283
10955A502743J97564l5563k13897j72102M18855K25179j68762o841n44329j50727
10945A052120k9546j48373C01870k9741L48869K1432k96113j70804L04516j15242
$$ plain form
11016 783974 791643 493831 596372 796582 664669 539214 557855 783932 592836 459506
11006 459506 479656 475645 883573 829507 470779 1068073 717124 581979 590278 529351 916651
10995 916651 331899 898434 448014 734435 349842 470637 735694 430610 867306 852786
10985 852786 595190 561186 946618 908738 691710 841535 832682 926660 810555 1065347
10975 1065347 1527229 1499160 1254939 1291461 1634669 1921451 2146189 2312390 2292602 2692704
10965 2692704 2757218 2370451 2417810 2289730 2279227 1910891 1387414 1725080 1490460 1502743
10955 1502743 1700307 1664744 1450847 1278745 1697600 1922779 1754017 1747176 1202847 1052120
10945 1052120 1022574 874201 301870 272129 620998 642430 346317 175513 480029 364787
10935C64787l4661A60633k226N7444M2997K5477f1768A29455m3965i1440j50647
10924b42087B6900L04395A3622b87374C91268B8368f9114l8190A62698a8878b825
10912E76628A8963a49822r6137J17210B0157a6113m7086J0229A95380a61282N144
10901a56138I0669b54816N3866K2979A9360a75549J0217A66674E6735h9110j55778
10890b44888A42762E025J45886b19416B28974a31430a5511j70403F9998Q809c45307
10878g0874j9042j23294A26007m0020R3139n4356E124i3869A93269G0661a14904
10866f7956O086D1503L1897a23998B77217a9394C8364O5665a6708I1913g2689
10854b18628B37954a66437A294J42942g759j9700k58655F1534B1398d0354o7518
$$ plain form
10935 364787 330126 160633 158407 215851 258848 284325 -61768 129455 85490 -91440 -242087
10924 -242087 26900 331295 13622 -287374 391268 28368 -69114 -107304 162698 -18878 -2825
10912 576628 18963 -149822 -245959 -128749 20157 -16113 -63199 -52970 195380 -161282 -156138
10901 -156138 90669 -254816 -200950 -177971 19360 -175549 -165332 166674 56735 -89110 -244888
10890 -244888 142762 5025 150911 -219416 228974 -131430 -15511 -185914 69998 78807 -345307
10878 -70874 -89916 -213210 126007 85987 179126 124770 5124 -93869 193269 70661 -114904
10866 -67956 -61870 41503 73400 -123998 277217 -19394 38364 104029 -16708 91913 -72689
10854 -218628 237954 -166437 1294 144236 -7759 -27459 -286114 61534 21398 -40354 -107872
10843a07872c1714l13960j7699C37071h9476b0038k26424e0561j46191R6643L09
10832i9800B19314c4051A07516m5322K2742a68983B878J22352c2692B73971c95582
10820A30934F2348J46718d6505p7017A2351d5501k0209q3623b7079A2898a42154
10808a13228A29332a14127B64049j05682a12243q4325b1562l61349A60505G758
10797A23435h9635L1644A23586a67057i573k33393C2477K9304a65844d8359j80548
10786b28907B9383b78010A34462E6356L0416d7863A50994N3047n3303a60842I1280
10774a41214o1946J6044p2889E6302K9704b11702e2416O423j859j71798i3208
10762c65253D4874h8858C50576g9262I6867a30764d7346D5331d02129C766J952
$$ plain form
10843 -107872 -31714 -345674 -363373 337071 -89476 -20038 -246462 -50561 -196752 -100109 -99800
10832 -99800 219314 -34051 107516 62194 84936 -168983 2878 125230 -32692 273971 -395582
10820 130934 62348 209066 -46505 -123522 12351 -45501 -65710 -149333 -27079 12898 -142154
10808 -113228 129332 -114127 264049 158367 -112243 -196568 -21562 -382911 160505 7758
10797 123435 -89635 -57991 123586 -167057 -9573 -242966 32477 61781 -165844 -48359 -228907
10786 -228907 29383 -278010 134462 56356 86772 -47863 150994 204041 150738 -160842 91280
10774 -141214 -203160 -187116 -260005 56302 86006 -211702 -52416 -45993 -47852 -219650 -93208
10762 -365253 44874 -88858 350576 -79262 96867 -130764 -47346 45331 -402129 3766 5718
10751E718b45854B5769N4243f2186j37284C10986a23681D1602a18217I5496a14982
10739b22595k9791C7345j7708R6808a17678H431c7713A1274K7566K596O7091b76650
10726A30190g0984j42426l1908C23715j09706c63828A18072b7189F4600b48183
10715a86972C6705J25830a07102A35916l5087M9110a04323f427A06758K66363
10705C73121j33315K8444n8815c03629h4859L5529a7739j96147P4747A86145a8476
10693B54950c6954j13138O460k52582a79717F1523b26737F1776b53056Q6028D2127
10681b6221G6662d4474j9640A176a39531l6125A62214a84396K3826N3343E7055
10669D1588n175c09059C12078d2971D79K16263L6364r2682A7207b59610j2211
$$ plain form
10751 5718 -245854 25769 80012 -62186 -199470 310986 -123681 41602 -118217 95496 -114982
10739 -222595 -252386 37345 19637 116445 -117678 8431 -37713 11274 38840 41436 108527 -276650
10726 130190 -70984 -213410 -245318 323715 214009 -363828 118072 -27189 64600 -248183
10715 -186972 36705 162535 -107102 135916 100829 149939 -104323 -6427 106758 373121
10705 373121 239806 268250 209435 -303629 -84859 -49330 -17739 -213886 -139139 186145 -18476
10693 254950 -36954 -150092 -143632 -396214 -179717 61523 -226737 61776 -253056 -167028 42127
10681 -26221 76662 -44474 -64114 1176 -139531 -175656 162214 -184396 -160570 -107227 57055
10669 41588 36413 -309059 312078 -42971 479 216742 253106 160424 17207 -259610 -271821
10658b71821a21710D5546a71509C47585g534G1499m63M6037b03695g6023H0570
10646c94234A77639d8123k33860a11977J6612c5087l08839J69620O1784A65198
10635C40746a54416B8618i494j24131j53833J08481j73140M907A10706b9890B1296
10623C26535j25640f7067C4967g2329j7765l96174b28038h5240e545o7936j97128
10612b70609N754A6379c71040c7994j36478A88371b16240h6031M2594D56716b8622
10600c24797R0920L1544A31480a32777L4290E2633a54918k0100K2872i996l44042
10589c54038G0646L5834c71349g403m37128J21466G6450d8077j43359I0290b48173
10577a55597A71114a41858f979F0830C0072a41433K6577k04790J11408p197f7485
$$ plain form
10658 -271821 -121710 45546 -171509 347585 -7534 71499 71036 117073 -203695 -76023 80570
10646 -394234 177639 -48123 -281983 -111977 -95365 -35087 -343926 -174306 -112522 165198
10635 340746 -154416 28618 -9494 -133625 -287458 -178977 -352117 -347210 110706 -29890 21296
10623 326535 200895 -67067 34967 -72329 -90094 -486268 -228038 -85240 -5545 -73481 -270609
10612 -270609 -264855 16379 -371040 -37994 -174472 188371 -216240 -86031 -43437 456716 -28622
10600 -324797 -233877 -202333 131480 -132777 -98487 52633 -154918 -175018 -152146 -9996 -354038
10589 -354038 70646 106480 -371349 -7403 -444531 -323065 76450 -48077 -191436 90290 -248173
10577 -155597 171114 -141858 -6979 60830 30072 -141433 -114856 -319646 -208238 -215435 -67485
10565D3434a85216c7218A46479Q1667i3361k41352J50446A63316a56693B1190
10554a16273A55459h0616q2635e4495k2952A82492a19066b5703H5959M134a88276
10542a81614q6974D5744b6731j68822N9369e823o5894D7599L2597l6349e0525
10530C734a34678A98213D9940b33250h9864K6978A2865g7313E9976a22722B0292
10518g6084o1392b5145k5390B37833D8018b75716b4322A66501d96886I7273B2041
10506E6082j9072a8420A37124F2063a05943f024o042A9834b00500m5437l04612
10495e50549K73500B1536K41251C9435c67470a49242a3218I6261A78J35393b47034
10483A59634F8224b38193N3826A17693n0640k9072c9551F9739B9066J58173J49978
$$ plain form
10565 43434 -185216 -37218 146479 228146 -93361 -334713 -184267 163316 -156693 21190
10554 -116273 155459 -80616 -163251 -54495 -77447 182492 -119066 -25703 85959 90093 -188276
10542 -181614 -268588 45744 -26731 -195553 -136184 -5823 -71717 47599 80196 43847 -50525
10530 3734 -134678 198213 49940 -233250 -89864 -62886 12865 -77313 59976 -122722 20292
10518 -76084 -137476 -25145 -50535 237833 48018 -275716 -24322 166501 -496886 97273 22041
10506 56082 37010 -18420 137124 62063 -105943 -6024 -12066 19834 -200500 -245937 -550549
10495 -550549 -277049 21536 262787 39435 -367470 -149242 -13218 96261 178 135571 -247034
10483 159634 68224 -238193 -184367 117693 67053 37981 -39551 69739 29066 187239 337217
10472C37217M42399l70872j1114A4804b76952A46089M2358A9564R445a87611A7699
10460I8667c4229J6556k63104N4359e3454n713D928a34011d1478a5425b709D107
10447b7026G3399d43136K18207J08389j4914c6722A48469p4152K54963C3741f8904
10435A4425e9979o861A78562m5771f0676k74034L471E2659a76002J1421B4147
10423a4680j47599e4500p3211c9301A65280k6158a953B05282a35619A9297K4988
10412D4285K22728g7951B35466j17674a13392m58912c7871A01685j4154J43457
10402B30988A13448d3379E6745P1859k9832m0762b28091i0634J7210k3480A67442
10390c0649j91438B09887R4934c7005l35903B22231C0227M8730J21515b34243
$$ plain form
10472 337217 779616 408744 397630 14804 -276952 146089 188447 19564 29009 -187611 17699
10460 98667 -34229 -17673 -280777 -226418 -53454 -59167 4928 -134011 -41478 -15425 -2709 4107
10447 -27026 73399 -443136 -224929 -116540 -131454 -36722 148469 74317 329280 33741 -68904
10435 14425 -59979 -66840 178562 132791 -60676 -334710 -331239 52659 -176002 -164581 24147
10423 -14680 -162279 -54500 -127711 -39301 165280 139122 -1953 205282 -135619 19297 44285
10412 44285 267013 -77951 235466 117792 -113392 -572304 -37871 101685 87531 230988
10402 230988 113448 -43379 56745 128604 98772 58010 -228091 -90634 -73424 -96904 167442
10390 -30649 -222087 209887 304821 -37005 -372908 222231 30227 78957 200472 -234243
10379C53730F5726a97354D00994b15395O4328D94195D8356J81673A14845j3062
10369A01783J82134c39945B17611Q9198p3291K57650J50237B55056G9312N80976
10359F60288l26793J7615P7726q9663J72683A03993J28006O4141j23315k5931
10349A46894J39357j07894J96810j56290L18250L1335j20030o8463k139j13335
10339B64495K31836B22572L311N7199e9727B99732B8999d0026B09977D5516P4869
10328A20385J8875R816J32971j23941D2012J82958J01788A59742j1616b56345
10317C59446a23495e9873C69088h623j26915B47404K8975a93171d4848G3658b23824
10305a91896O4703L1518B84843l0248a70866H2776e1084A80039a51985a4290k57008
$$ plain form
10379 353730 65726 -197354 400994 -215395 -151067 494195 48356 230029 114845 101783
10369 101783 283917 -339945 217611 306809 233518 491168 641405 255056 79312 660288
10359 660288 333495 351110 428836 339173 511856 103993 231999 296140 172825 146894
10349 146894 286251 178357 375167 218877 537127 568462 448432 379969 377830 264495
10339 264495 496331 222572 225883 283082 -59727 299732 28999 -40026 209977 45516 120385
10328 120385 139260 149076 282047 158106 42012 224970 326758 159742 148126 -256345
10317 359446 -123495 -59873 369088 -8623 -135538 247404 276379 -193171 -44848 73658 -223824
10305 -191896 -127193 -95675 284843 254595 -170866 82776 -51084 180039 -151985 -14290 -271298
10294b71298A35446J92225A21874l5138g9372A77950a1188E8975c50935D0479
10283e6403A96130b78738A37727E5726c19065a57987A11620b13236b5906q7491
10273a13397N0605A22434b40096Q6206j63520g4664G5871B0805a5617j70888j431
10262a87936f8972a7145A45972a3682l05691A07488c0327B465K29659P1488J34315
10251D37927A96101K89051c3834A59537K5081o1068P8705I1183R9241b15124h711
10239A08862a53019e0290m499a0412j73895G3937N5266c04382O0391h8553m6760
10228a35313A62692D715P8043g2978r3944l4406r3039J45147e1339F650a13318
10216a6194c387m5586D8911a87261b0694j51173f6773B19226a86938a9770A68959
$$ plain form
10294 -271298 135446 327671 121874 86736 -79372 177950 -11188 58975 -350935 40479
10283 -56403 196130 -278738 137727 55726 -319065 -157987 111620 -213236 -25906 -113397
10273 -113397 -62792 122434 -240096 -153890 -317410 -74664 75871 20805 -15617 -186505 -187936
10262 -187936 -68972 -17145 145972 -13682 -319373 107488 -30327 2465 232124 303612 437927
10251 437927 196101 485152 -33834 159537 184618 123550 202255 91183 190424 -215124 -8711
10239 108862 -153019 -50290 -54789 -10412 -184307 73937 129203 -304382 -243991 -88553 -135313
10228 -135313 162692 4715 82758 -72978 -166922 -201328 -294367 -149220 -51339 6650 -113318
10216 -16194 -3387 -48973 48911 -187261 -20694 -171867 -66773 219226 -186938 -19770 168959
10204a09345j8640G621J36337a61741d3944l7831B13317A5166G10f2161m8418
10193a10579M150l38500E9072g9751E9380i8686A15681b21564a6802D6440a18623
10181C7037J42837b65304N2541n7484D5760a28277o5867g951F9130a26914k29608
10170c56522d7917k50421A09540j5518A6638a00096j74864a16918B69680c60090
10159b58025i0262E0703b30181C9454c81120K3305b9389o1035C1454J4374c80080
10147D3710a89521r0701R8650h5617A33556a59052D6679i3483A06257B7674i5118
10135a78517n5337A2627e4061b3938A14467R3002c30197D7405J20849b30667H5590
10123b02313m1194A33418l6274m6844c2003q0914A43546i5187j09336q422G088
$$ plain form
10204 -109345 -127985 7621 143958 -161741 -43944 -81775 213317 15166 710 -62161 -110579
10193 -110579 -106429 -444929 59072 -79751 59380 -98686 115681 -221564 -16802 46440 -118623
10181 37037 179874 -265304 -212763 -270247 45760 -128277 -194144 -7951 69130 -126914 -356522
10170 -356522 -47917 -298338 109540 94022 16638 -100096 -274960 -116918 269680 -360090
10159 -258025 -90262 50703 -230181 39454 -381120 -357815 -29389 -90424 31454 45828 -380080
10147 43710 -189521 -280222 -181572 -85617 133556 -159052 46679 -93483 106257 27674 -95118
10135 -178517 -233854 12627 -54061 -23938 114467 207469 -330197 47405 168254 -230667 85590
10123 -202313 -243507 133418 97144 50300 -32003 -112917 143546 -95187 -204523 -212945 7088
10111a8057j10822H9122q422b280A28103b5915k16252K4010a08774K8460B98134
10099g317l06824f6872j73482d4524E8788a69419B93099g7215B1965J62679a34612
10087f7056B1192c06693I6535L15217b41095D971B106a44811N7091q6403P3348
10076a00775d3444A78194d03256A20421b04001J2632A10341a86532P1495J6288
10066i8749a1202j0069f620j27284a4032l1618F6446J84138g0815E4710A6314
10054c04156A32315j9120k9282a93655c3147L064j39862P5520B34179K39758d7898
10042D7067b13103A94545r5337a01430B19933a23281N4437o1865A72519P7385
10032B49904J5443G1395a0440l32325B23899b76494C6627j0112O4385f056E612
$$ plain form
10111 -18057 -128879 89122 80700 -2280 128103 -25915 -242167 -218157 -108774 -80314 298134
10099 -7317 -314141 -66872 -240354 -44524 58788 -169419 293099 -77215 21965 184644 -134612
10087 -67056 21192 -306693 96535 411752 -241095 4971 2106 -144811 -87720 -174123 -100775
10076 -100775 -43444 178194 -403256 120421 -204001 -191369 110341 -186532 -115037 -98749
10066 -98749 -11202 -21271 -6620 -133904 -14032 -45650 66446 250584 -70815 54710 16314
10054 -304156 132315 113195 83913 -193655 -33147 -30083 -169945 -94425 234179 473937 -47898
10042 47067 -213103 194545 99208 -101430 219933 -123281 -68844 -130709 172519 249904
10032 249904 265347 71395 -10440 -342765 223899 -276494 36627 26515 90900 -6056 5612
10020I9P355a13929A06146a35321L6251C05029b39018p356C5939i0954c3065j91896
10008b24961h3631L0002n5463I2082K70b9651q7297q6226A03267N0156h3703k3097
9996a06800A70603b64270j901B07190D2272b79348J05565j07756G6572b30420
9985G8792P1003J3731g6689k85235J26396f3432j7950A88943a49500G2942L00843
9974C73785a01488c8192m31555A9187c21768a51831L5144p9652R527e7935A40767
9962A7429a39174n4729Q7650j10672A88098n8148C554a53032B54425b64268J32133
9951a32135f1899j28443Q0370m5443N3813k3289a8345j29815a2122j35731B11139
9939A22163b16985l63958C93575c3559j07485A0081f8493r4590k55106i355A27199
$$ plain form
10020 99 7454 -113929 106146 -135321 -99070 305029 -239018 -246374 35939 -90954 -33065 -224961
10008 -224961 -83631 -53629 -109092 92082 92352 -29651 -116948 -203174 103267 153423 -83703 -106800
9996 -106800 170603 -264270 -266171 207190 42272 -279348 -173783 -281539 76572 -230420
9985 78792 149795 163526 -76689 -361924 -235528 -63432 -81382 188943 -149500 72942 373785
9974 373785 -101488 -38192 -469747 19187 -321768 -151831 -116687 -196339 -186812 -57935 140767
9962 17429 -139174 -193903 -106253 -216925 188098 129950 3554 -153032 254425 -264268 -132135
9951 -132135 -61899 -190342 -109972 -155415 -101602 -124891 -18345 -148160 -12122 -147853 211139
9939 122163 -216985 -580943 393575 -33559 -141044 10081 -68493 -163083 -418189 -9355 127199
9927B11011e4774A44404b03051e8037o3694r3815j09984J51915A11850m4209a50346
9915b44314c0612j8710l2577K7546J3749B86948a1555q5354F9466Q7773a60221
9903a86918B16741c10899R8900R6807j428l76728a85753a3877F0906a05251B53753
9891a31204d5570A61715c54231J30799B58437a16499C8780b35835J06937f0796
9880B44977H8907a9920B50420F3856J1265f1085j5552r861r629l68642J95104
9869b69665h7648k581C6860J06123b01533D8953a7984n0385K9196F8801b3692
9857F0560a57592q6383l2271G3787i2930p0640f173A28115k7370a53790J3604
9846a40186j60802b8284G1933b46790B0350b51797j44127J90157M7041q3023a3496
$$ plain form
9927 211011 -54774 144404 -203051 -58037 -121731 -215546 -325530 -173615 111850 67641 -150346
9915 -244314 -30612 -49322 -81899 -54353 -40604 286948 -11555 -96909 69466 157239 -160221
9903 -186918 216741 -310899 -211999 -115192 -116620 -493348 -185753 -13877 60906 -105251 253753
9891 -131204 -45570 161715 -354231 -223432 258437 -116499 38780 -235835 -128898 -60796
9880 244977 88907 -19920 250420 63856 75121 -61085 -76637 -86498 -96127 -464769 -269665
9869 -269665 -87648 -90229 36860 142983 -201533 48953 -17984 -68369 -39173 68801 -23692
9857 60560 -157592 -243975 -276246 73787 -92930 -163570 -6173 128115 100745 -153790 -140186
9846 -140186 -300988 -28284 71933 -246790 20350 -251797 -395924 -205767 -158726 -241749 -13496
9834a33473A33570a30359A33952C7308b39340e9465l77956a8502r681r6843B6169
9822A94609i5082A24590k9418a93068Q6977l75465B34852b09949J9652O4458A65461
9810A27282J12842c21382a10481B85504h0863l25453O0450A99936J04052K6210
9800C30198b37710a02014l05493J84794D11933A5921c08000a7558k2350A14002
9789a01284j20061C4074R5816N8706m5927d65002a86620A94164c21180e2968G2087
9777a5138j15255j54851J06981A2132i0844p2100K3584q244j10070F9799a65382
9765a35446A70c9186j52246C5269K96263a59811c2656k1507C37420A8075a87498
9753E3337f5188I8594b7209j51470f8457j71565F263a35241k9623j687A42401
$$ plain form
9834 -133473 133570 -130359 133952 37308 -239340 -59465 -437421 -18502 -28183 -125026 26169
9822 194609 -95082 124590 95172 -193068 -106091 -481556 234852 -209949 -190297 -125839 165461
9810 127282 240124 -321382 -110481 285504 -80863 -406316 -345866 199936 303988 330198
9800 330198 -237710 -102014 -407507 -222713 411933 15921 -308000 -17558 -39908 114002
9789 -101284 -221345 34074 129890 188596 142669 -465002 -186620 194164 -321180 -52968 72087
9777 -15138 -130393 -285244 -178263 12132 -90844 -162944 -139360 -147604 -257674 69799 -165382
9765 -135446 170 -39186 -191432 35269 331532 -159811 -32656 -54163 337420 18075 -187498
9753 53337 -65188 98594 -27209 -178679 -68457 -240022 6263 -135241 -164864 -166551 142401
9741A19065g4931C787M5371J34246j2261j0851a61166m0443K0243A22665b22069
9729c24720A70568b88455g5363F2751c47011F1400b79903g8025B88182c399A02310
9717b57543J17197A47903a28758A00081m4375b63235A11650c30960a25071a9704
9706A5978a99265C98995A20939i4468G6371f3469G7786b39230B11888l3314a83400
9694D3085e6352D8729b36758A73204c5106C4723J278a45552F0496b28711a2646
9682a19694F0205c00539R4510g6005B94479a09868p9795n3128a11512A12048b76745
9670C00469a11578I757c3567j14582j4668M9563j07401Q05q8921h2217j31149
9659b13366q2331R0595L6579D53471e6392j9771m5486A18196a10098K9375k4550
$$ plain form
9741 119065 -74931 3787 49158 183404 171143 160292 -161166 -201609 -181366 122665 -222069
9729 -324720 170568 -288455 -75363 62751 -347011 61400 -279903 -78025 288182 -3399 102310
9717 -257543 -140346 147903 -128758 100081 55706 -263235 111650 -330960 -125071 -19704
9706 15978 -199265 398995 120939 -94468 76371 -63469 77786 -239230 211888 178574 -183400
9694 43085 -56352 48729 -236758 173204 -35106 34723 36001 -145552 60496 -228711 -12646
9682 -119694 60205 -300539 -206029 -76005 294479 -109868 -189663 -242791 -111512 112048 -276745
9670 300469 -111578 9757 -33567 -148149 -162817 -113254 -220655 -219850 -308771 -82217 -213366
9659 -213366 -295697 -205102 -168523 453471 -56392 -76163 -121649 118196 -110098 -80723 -105273
9648a05273A25096J22109a04632b681B61444b13730G3428c26937f7301A14420
9637g5255k15587a42201n8773C9569p930b60202n2040B48460a28955A2349b85176
9625A93898C1995a15025A79154I559d75736H6126K0487b42706o5455g1448k41418
9614c12866h186k11020A14276d56970M3139b00014k14523a57007j0337e1180A33998
9602A67463k8446e9726a7324k3846j88389f2781G7651a37835H4215B231J30912
9591A33143o5010c2061l31137J18491A75189i0153L3062l0136J8150l24060H7290
9579A29750a36988A45925b02793A32281i3726k37213a9022B39494a01357j80590
9569b81947P6831A21847b68388A5087K09497B678a75388O6700b7716p1149j28515
$$ plain form
9648 -105273 125096 247205 -104632 -2681 261444 -213730 73428 -326937 -67301 114420
9637 -75255 -290842 -142201 -200974 39569 31639 -260202 -312242 248460 -128955 12349 -285176
9625 193898 31995 -115025 179154 9559 -475736 86126 106613 -242706 -308161 -71448 -312866
9614 -312866 -8186 -219206 114276 -456970 -413831 -200014 -414537 -157007 -167344 -51180 133998
9602 167463 139017 -59726 -17324 -41170 -229559 -62781 77651 -137835 84215 2231 133143
9591 133143 68133 -32061 -363198 -244707 175189 -90153 -57091 -87227 -69077 -393137 87290
9579 129750 -136988 145925 -202793 132281 -93726 -330939 -19022 239494 -101357 -281947
9569 -281947 -205116 121847 -268388 15087 224584 2678 -175388 -108688 -27716 -98865 -227380
9558b27380j20450q9279h0288H0212f0420D9929i788j30952H6142g44p9809A88085
9545c0906A13454P6016A7087Q5640a95971R961C8889K81199a57696E8215a07759
9533a03921D8951k0300J98723a29358j4291q5088l8468G1558a74459E3478q665
9522D4813c45046G0219d34373a74252B43455b9486i656r2846D0828J61926q0845
9511A21909b69566i7907N310j29986A22143K7031c0480A08740c01944j6609a26662
9499a7650n8866J0427B66616l8681A01303J17554b16326a6296A4650b65161B43309
9487d5775k59248J42466C6536L9923c42106F7436B7146d1196j55292C129b20430
9475g6121C3998c85341b6015l17287J05438J00713A82106a06675B3391J00843
$$ plain form
9558 -227380 -347830 -437109 -80288 80212 -60420 49929 -9788 -140740 86142 -744 -80553 188085
9545 -30906 113454 189470 17087 102727 -195971 -186010 38889 320088 -157696 58215 -107759
9533 -103921 48951 28651 227374 -129358 -143649 -228737 -267205 71558 -174459 53478 44813
9522 44813 -345046 70219 -434373 -174252 243455 -29486 -9656 -102502 40828 202754 121909
9511 121909 -269566 -97907 -92597 -222583 122143 149174 -30480 108740 -301944 -318553 -126662
9499 -17650 -76516 -66089 266616 227935 101303 218857 -216326 -16296 14650 -265161 243309
9487 -45775 -305023 -162557 36536 76459 -342106 67436 27146 -41196 -196488 3129 -220430
9475 -76121 33998 -385341 -26015 -343302 -237864 -137151 182106 -106675 23391 124234
9465A24234r953O0546J16794b78647a14467q4339Q7295K5096l06687J48243B07568
9453a13122j15254i7901F3278b34189A79911O3996G1517b06862j26944J37121
9443a96685A9095h5678j90100C05289B0616G591J6896a81415h8907L9111j11375
9432a61171A75545a64944F6546k9047b41227C57713f2322p848m7906o8901q4384
9421b71361A9043L65204a74544m9165h7446q9186O8613r8958F3642d0240q3316
9410a23556K0811B56421A01359a7133r910j41546I3772C7033H254f4799a5460
9398a84225P2438K2084j9863j08422g1250m804b7761F5162c22004E3944b65492
9386A42445a64791D29868g2578C90996b60704C8523c71474J37079f6946B40701
$$ plain form
9465 124234 114281 174827 291621 -278647 -114467 -198806 -111511 -86415 -393102 -244859 207568
9453 -113122 -228376 -97901 63278 -234189 179911 243907 71517 -206862 -333806 -196685
9443 -196685 19095 -85678 -275778 305289 20616 7591 24487 -181415 -88907 -49796 -161171
9432 -161171 175545 -164944 66546 37499 -241227 357713 -62322 -70170 -118076 -186977 -271361
9421 -271361 19043 384247 -174544 -223709 -87446 -176632 -108019 -206977 63642 -40240 -123556
9410 -123556 -102745 256421 101359 -17133 -27043 -168589 93772 37033 8254 -64799 -15460
9398 -184225 -111787 -89703 -109566 -217988 -71250 -76054 -27761 65162 -322004 53944 -265492
9386 142445 -164791 429868 -72578 390996 -260704 38523 -371474 -234395 -66946 240701
9375a33647d5009E8718Q4558M6339c14488J42965a1038G2055a38959B54959j09525
9364A45434i6484k7604C10756d6228J0454A46622a66476B73065a40766A47609
9353b31970A17176c5094M789c879D0445J1483a90123L7537B30484g6441K9587
9342d6854J9809G2315k362b14899g2476k58473i7292G7165a61524l0507I1010
9330G7934a98679G9918O0949B3754a31975o6450k0911f257m49286b03350A65599
9318E3403c07105h1412j80462c9657j56608f0675A9614g4665n1034C7144j4719
9307B2425a44401e7645o7701i685n8085p4536o4294H9473g2391l08090c6442a7648
9294e66675b19626d4310N072J4389j21765A41353n5229L7126b3634r8973B78414
$$ plain form
9375 -133647 -45009 58718 143276 189615 -314488 -171523 -11038 72055 -138959 254959 145434
9364 145434 -96484 -124088 310756 -46228 -35774 146622 -166476 273065 -140766 147609
9353 -231970 117176 -35094 -30305 -3879 40445 51928 -190123 -152586 230484 -76441 -46854
9342 -46854 -27045 72315 69953 -214899 -72476 -330949 -97292 77165 -161524 -192031 91010
9330 77934 -198679 79918 140867 23754 -131975 -198425 -219336 -6257 -455543 -203350 165599
9318 53403 -307105 -81412 -261874 -39657 -196265 -60675 19614 -74665 -125699 37144 22425
9307 22425 -144401 -57645 -125346 -9685 -67770 -142306 -206600 89473 -72391 -380481 -36442 -17648
9294 -566675 -219626 -44310 -39238 -24849 -146614 141353 86124 123250 -23634 -122607 278414
9282I5818a30441m5496j0095q6606B71754b42487h3590J1544a6724k7239A86641
9270b25097A216Q5571K59461K216A37236a98868f3624A39868b73937N9244H4600
9258c79650A35492A2237e3556k50437N6108B5303J61496a28840B97283f4972B7813
9246g3677D9718e6512j63290j25268Q2875J27072a7802g519k3701q4783e09k02769
9234b03278d3768k19757B2246b72590l5097J34038E5920J82040n8973h8122A1626
9222b4554r2427K6445J9143a4276j80805J3500Q0829G231a60933A02011i30C45958
9209d84270B12820f6447A02449f9687E3934g2457g142r1487A29810E9271a50868
9197d01643K00306a158k46108j51784a23633o6332e176A37359k5391k4241c788
$$ plain form
9282 95818 -130441 -175937 -186032 -272638 271754 -242487 -83590 -72046 -16724 -43963 186641
9270 -225097 1216 86787 346248 348464 137236 -198868 -63624 139868 -273937 -214693 84600
9258 -379650 135492 12237 -53556 -303993 -247885 25303 186799 -128840 297283 -64972 27813
9246 -73677 49718 -56512 -219802 -345070 -262195 -135123 -17802 -7519 -31220 -116003 -509 -203278
9234 -203278 -43768 -263525 22246 -272590 -307687 -173649 55920 237960 178987 -88122 11626
9222 -24554 -116981 -90536 -71393 -14276 -195081 -181581 -100752 7231 -160933 102011 -930 345958
9209 -484270 212820 -66447 102449 -69687 53934 -72457 -7142 -98629 129810 59271 -150868
9197 -401643 -201337 -1158 -247266 -399050 -123633 -189965 -5176 137359 111968 87727 -3788
9185B6210b64926A64159c894q6657r0636j20502b4864C8950J51169D2189a26133
9173A89014a18512A84557b7552J1095j86871B39060C8595a96827C18909j7469
9163C01440B2379O6803C2559c58617a17369B6465b21705P8746a7237r0366A94394
9151A05227a9933D3741k1586J01567c40229C718a39230e0892P197A15210b11403
9139a85957G2939a31895A83456e3241j8959j5673J9151j53891c7967j36514L4585
9128a39896m8633d0622l44395A30943n4993c08795B4329J44726b13253G4193g8830
9116A10945N0984a40462B05133a22085B37268a40209l43994a1242k10983A2379
9105h5698A33174b64949N3753b3975A09760b54564a13228A76328d10321F5328
$$ plain form
9185 26210 -264926 164159 -3894 -90551 -181187 -301689 -24864 38950 190119 42189 -126133
9173 189014 -118512 184557 -27552 -16457 -203328 239060 38595 -196827 318909 301440
9163 301440 22379 89182 32559 -358617 -117369 26465 -221705 -142959 -17237 -107603 194394
9151 105227 -19933 43741 22155 123722 -340229 3718 -139230 -50892 -43695 115210 -211403
9139 -185957 72939 -131895 183456 -53241 -72200 -87873 -68722 -222613 -37967 -174481 -139896
9128 -139896 -188529 -40622 -385017 130943 75950 -308795 24329 169055 -213253 74193 -78830
9116 110945 161929 -140462 205133 -122085 237268 -140209 -484203 -11242 -222225 12379
9105 -85698 133174 -264949 -211196 -23975 109760 -254564 -113228 176328 -410321 65328
9094G5183L0701a93253C0835a27448B26705g3459J2126p3362b7757k02009A26714
9082E0676b93257A11526D8582b21272a0508o2995j98308f7727B852b63555a07678
9070g3151o4213J5143K1756c1549m24031a45154j67280g304C27639a45430C78174
9058A0253b39666A58701c25901f0565k4894k5401j18387P0089o3477H5294a04587
9046d09636I8144Q0139A852K70133i0883j88996i3857l45301F828c20826i0420
9034f8208B6188a35954k5330b0487o3556Q707A57842A7904d30666i4276c2905
9022a76218e1399j64223K1005C7034K11081e2140B74178d60458i517o3687n6854
9011a30058I8347L9770a01551A49168a28285M8989r6912A03758i0791A38309c5236
$$ plain form
9094 75183 105884 -193253 30835 -127448 226705 -73459 -61333 -134695 -27757 -229766 126714
9082 50676 -293257 111526 48582 -221272 -10508 -73503 -271811 -67727 2852 -263555 -107678
9070 -73151 -137364 -122221 -100465 -31549 -455580 -145154 -312434 -7304 327639 -145430 378174
9058 10253 -239666 158701 -325901 -60565 -85459 -110860 -229247 -159158 -222635 85294 -104587
9046 -409636 98144 178283 1852 271985 -90883 -279879 -93857 -439158 6828 -320826 -90420
9034 -68208 26188 -135954 -161284 -20487 -84043 -75336 157842 17904 -430666 -94276 -32905
9022 -176218 -51399 -215622 -194617 37034 248115 -52140 274178 -460458 -9517 -73204 -130058
9011 -130058 98347 138117 -101551 149168 -128285 -79296 -176208 103758 -90791 138309 -35236
8999G6442J71406g5779J0010k81282A98202I1110b64119a02114N0886o2893A26039
8987G842P5855O859b29248o8154Q4546b3473G5545a30231A63641a64618j80315
8976c44933B01451n7431a97574R3487E4979L9917J10668e8013j21994A33014a40142
8964a13473A44151a4288j59565B46040a01798k84916J90156p8708h576a728G4731
8952B5210f9020j55909k9068J10726q0088B1513K3577J8165J531a58903p1857
8941b30760e9405p9389O4671j91688j353m0106h1645A13621a07232j7817M210
8930a20839n5308A81790c7948E2310a07630j49276A35254m6082e3415C13363K72724
8919E86087J812205J765332p27516A166493D59921j97894C9742c00214A55123
$$ plain form
8999 76442 247848 -75779 -65769 -347051 198202 91110 -264119 -102114 -51228 -114121 126039
8987 7842 83697 90556 -229248 -297402 -212856 -23473 75545 -130231 163641 -164618 -344933
8976 -344933 201451 144020 -197574 -104087 54979 94896 205564 -58013 -180007 133014 -140142
8964 -113473 144151 -14288 -173853 246040 -101798 -386714 -196558 -275266 -8576 -1728 74731
8952 25210 -69020 -224929 -253997 -143271 -223359 21513 45090 63255 64786 -158903 -230760
8941 -230760 -59405 -138794 -74123 -265811 -267164 -307270 -81645 113621 -107232 -125049 -120839
8930 -120839 -176147 181790 -37948 52310 -107630 -256906 135254 89172 -53415 313363 586087
8919 586087 2398292 4163624 3436108 1166493 459921 262027 39742 -300214 155123
8909D36697a27423a1019a786B19691d2702B05744F5928e9266a8075C7718c1448
8897h2722A78933K5688f4348A18396g5550A52712M0946B1344R179J93128b44918
8885c64295K2211A76308b45568g0928d5j30479q7169O4746a6478F3683d6516I0577
8872g9922k3212A71600b48500L9289A11367g8634a9199B88093a96143F1989c74634
8860a71891m74485f8604j34398g0665H4466a69089A18317a09154j15257a00244
$$ plain form
8909 436697 -127423 -11019 -1786 219691 -42702 205744 65928 -59266 -18075 37718 -31448
8897 -82722 178933 204621 -64348 118396 -75550 152712 193658 21344 30523 223651 -244918
8885 -364295 -342084 176308 -245568 -70928 -45 -130524 -217693 -152947 -16478 63683 -46516 90577
8872 -79922 -103134 171600 -248500 -209211 111367 -78634 -19199 288093 -196143 61989 -374634
8860 -171891 -646376 -68604 -203002 -70665 84466 -169089 118317 -109154 -224411 -100244
$$ [...]
##END NTUPLES=NMR SPECTRUM
##END=
