
##TITLE=AC1245_NSAAH12035_6616084_lGwsoLg014
##JCAMPDX= 6.0         $$ Bruker NMR JCAMP-DX V2.0
##DATA TYPE= NMR SPECTRUM
##DATA CLASS= NTUPLES
##ORIGIN= BRUKER
##OWNER= Administrator
$$ 1.72 TOPSPIN		Version 2.1
$$ 2012-08-03 03:17:38.781 -0500  Administrator@TOPSPIN
$$ Compression mode = diff/dup
##.OBSERVE FREQUENCY= 400.02188249412
##.OBSERVE NUCLEUS= ^1H
##.ACQUISITION MODE= SIMULTANEOUS (DQD)
##.ACQUISITION SCHEME= undefined
##.AVERAGES= 64
##.DIGITISER RES= 22
##SPECTROMETER/DATA SYSTEM= spect
##.PULSE SEQUENCE= noesygpps1d.comp
##.SOLVENT NAME= COFFEE_meoh
##.SHIFT REFERENCE= INTERNAL, COFFEE_meoh, 1, 14.96326
##AUDIT TRAIL= $$ (NUMBER, WHEN, WHO, WHERE, PROCESS, VERSION, WHAT)
$$ ##TITLE= Audit trail, TOPSPIN		Version 2.1
$$ ##JCAMPDX= 5.01
$$ ##ORIGIN= Bruker BioSpin GmbH
$$ ##OWNER= Administrator
$$ $$ C:\Bruker\TOPSPIN/data/COFFEE/nmr/AC1245_NSAAH12035_6616084_lGwsoLg014/12/pdata/1/auditp.txt
$$ ##AUDIT TRAIL=  $$ (NUMBER, WHEN, WHO, WHERE, PROCESS, VERSION, WHAT)
(   1,<2012-08-03 03:17:34.109 -0500>,<Administrator>,<TOPSPIN>,<go>,<TOPSPIN 2.1>,
      <created by zg
	started at 2012-08-03 03:06:03.875 -0500,
	POWCHK enabled, PULCHK disabled,
       configuration hash MD5:
       6B 1B 68 BB D9 2E 58 E2 7F 35 AD 54 07 DF 0E 41
       data hash MD5: 64K
       B8 26 4A C5 60 93 D8 8F 18 3C 99 64 69 09 8F F1>)
(   2,<2012-08-03 03:17:36.937 -0500>,<Administrator>,<TOPSPIN>,<proc1d>,<TOPSPIN 2.1>,
      <Start of raw data processing
       efp LB = 0.3 FT_mod = 6 PKNL = 1 PHC0 = 0 PHC1 = 0 SI = 128K 
       data hash MD5: 128K
       7A DF 26 C9 3E DC 54 1B E2 52 A1 29 4A 32 E4 A9>)
(   3,<2012-08-03 03:17:38.031 -0500>,<Administrator>,<TOPSPIN>,<proc1d>,<TOPSPIN 2.1>,
      <pk PHC0 = 3.554077 PHC1 = 0 
       data hash MD5: 128K
       C0 31 2A 05 9E B9 0C 72 62 BF B5 24 12 F6 B2 78>)
(   4,<2012-08-03 03:17:38.265 -0500>,<Administrator>,<TOPSPIN>,<proc1d>,<TOPSPIN 2.1>,
      <abs ABSG = 1 
       data hash MD5: 128K
       FA 16 51 CE 45 15 48 AD CF E6 62 F8 37 A3 50 8D>)
(   5,<2012-08-03 03:17:38.390 -0500>,<Administrator>,<TOPSPIN>,<proc1d>,<TOPSPIN 2.1>,
      <abs ABSG = 2 
       data hash MD5: 128K
       65 86 0C 65 EA 9A BC B4 F1 E1 3E 88 0C DD 14 89>)
(   6,<2012-08-03 03:17:38.578 -0500>,<Administrator>,<TOPSPIN>,<proc1d>,<TOPSPIN 2.1>,
      <abs ABSG = 3 
       data hash MD5: 128K
       53 9C 86 EB 50 8F E8 B6 C1 DB 85 29 64 D4 67 6B>)
(   7,<2012-08-03 03:17:38.640 -0500>,<Administrator>,<TOPSPIN>,<proc1d>,<TOPSPIN 2.1>,
      <abs ABSG = 4 
       data hash MD5: 128K
       A7 A1 7E 87 8F 91 A6 6D 05 8E 8F 1F 0F FA AD EC>)
(   8,<2012-08-03 03:17:38.703 -0500>,<Administrator>,<TOPSPIN>,<proc1d>,<TOPSPIN 2.1>,
      <abs ABSG = 5 
       data hash MD5: 128K
       9D F6 73 D9 4C 5C 96 3B BC 3C 80 40 A7 69 D1 BE>)
$$ ##END=
$$ 
$$ $$ hash MD5
$$ $$ 37 1C 23 D6 14 B2 31 80 AF 95 6A B7 0F 0E 7B 24
##$RELAX= 
##$RELAX= 
##$RELAX= 
##$RELAX= 
##$RELAX= 
##$RELAX= 
##$RELAX= 
##$RELAX= 
$$ Bruker specific parameters
$$ [...]
150 150 150 150 150 150 150 150
##$TP07= 0
##$TPNAME0= <>
##$TPNAME1= <>
##$TPNAME2= <>
##$TPNAME3= <>
##$TPNAME4= <>
##$TPNAME5= <>
##$TPNAME6= <>
##$TPNAME7= <>
##$TPOAL= (0..7)
0.5 0.5 0.5 0.5 0.5 0.5 0.5 0.5
##$TPOFFS= (0..7)
0 0 0 0 0 0 0 0
##$TUNHIN= 0
##$TUNHOUT= 0
##$TUNXOUT= 0
##$USERA1= <user>
##$USERA2= <user>
##$USERA3= <user>
##$USERA4= <user>
##$USERA5= <user>
##$V9= 5
##$VALIST= <valist>
##$VCLIST= <CCCCCCCCCCCCCCC>
##$VD= 0
##$VDLIST= <DDDDDDDDDDDDDDD>
##$VPLIST= <PPPPPPPPPPPPPPP>
##$VTLIST= <TTTTTTTTTTTTTTT>
##$WBST= 1024
##$WBSW= 4
##$XGAIN= (0..3)
0 0 0 0
##$XL= 0
##$YL= 0
##$YMAX_a= 18695227
##$YMIN_a= -10186585
##$ZGOPTNS= <>
##$ZL1= 120
##$ZL2= 120
##$ZL3= 120
##$ZL4= 120
##$ABSF1= 14.96326
##$ABSF2= -5.594922
##$ABSG= 5
##$ABSL= 3
##$ALPHA= 0
##$AQORDER= 0
##$ASSFAC= 0
##$ASSFACI= 0
##$ASSFACX= 0
##$ASSWID= 0
##$AUNMP= <proc_prof1d_extract.lims>
##$AXLEFT= 0
##$AXNAME= <>
##$AXNUC= <1H>
##$AXRIGHT= 0
##$AXTYPE= 0
##$AXUNIT= <>
##$AZFE= 0.1
##$AZFW= 0.1
##$BCFW= 0
##$BC_mod= 0
##$BYTORDP= 0
##$COROFFS= 0
##$CY= 15
##$DATMOD= 1
##$DC= 0
##$DFILT= <>
##$DTYPP= 0
##$F1P= 0
##$F2P= 0
##$FCOR= 0.5
##$FTSIZE= 131072
##$FT_mod= 6
##$GAMMA= 0
##$GB= 0
##$INTBC= 1
##$INTSCL= 1
##$ISEN= 128
##$LB= 0.3
##$LEV0= 0
##$LPBIN= 0
##$MAXI= 10000
##$MC2= 0
##$MEAN= 0
##$ME_mod= 0
##$MI= 0
##$NCOEF= 0
##$NC_proc= -2
##$NLEV= 6
##$NOISF1= 0
##$NOISF2= 0
##$NSP= 0
##$NTH_PI= 0
##$NZP= 0
##$OFFSET= 14.96326
##$PC= 1
##$PHC0= 3.554077
##$PHC1= 0
##$PH_mod= 1
##$PKNL= yes
##$PPARMOD= 0
##$PPDIAG= 0
##$PPIPTYP= 0
##$PPMPNUM= 2147483647
##$PPRESOL= 1
##$PSCAL= 4
##$PSIGN= 0
##$PYNMP= <proc.py>
##$REVERSE= no
##$SF= 400.0200087309
##$SI= 131072
##$SIGF1= 0
##$SIGF2= 0
##$SINO= 400
##$SIOLD= 131072
##$SPECTYP= <>
##$SREGLST= <1H.CDCl3>
##$SSB= 0
##$STSI= 131072
##$STSR= 0
##$SW_p= 8223.68421052631
##$SYMM= 0
##$S_DEV= 0
##$TDeff= 65536
##$TDoff= 0
##$TI= <>
##$TILT= no
##$TM1= 0
##$TM2= 0
##$TOPLEV= 0
##$USERP1= <user>
##$USERP2= <user>
##$USERP3= <user>
##$USERP4= <user>
##$USERP5= <user>
##$WDW= 1
##$XDIM= 131072
##$YMAX_p= 398649617
##$YMIN_p= -12257
##$CURPLOT= <Network HP LaserJet P1505>
##$CURPRIN= <$Network HP LaserJet P1505>
##$DFORMAT= <normdp>
##$LAYOUT= <+/1D_H.xwp>
##$LFORMAT= <normlp>
##$PFORMAT= <normpl>
##$SURQMSG= 1
$$ End of Bruker specific parameters
$$ ---------------------------------
##NTUPLES= NMR SPECTRUM
##VAR_NAME=  FREQUENCY,     SPECTRUM/REAL,   SPECTRUM/IMAG
##SYMBOL=    X,             R,               I
##VAR_TYPE=  INDEPENDENT,   DEPENDENT,       DEPENDENT
##VAR_FORM=  AFFN,          ASDF,            ASDF
##VAR_DIM=   131072,        131072,          131072
##UNITS=     HZ,            ARBITRARY UNITS, ARBITRARY UNITS
##FACTOR=    0.0627417313425164, 1,          1
##FIRST=     8223.62146879497, 2441,         -56897
##LAST=      0,             3512,            -57061
##MIN=       0,             -12257,          0
##MAX=       8223.62146879497, 398649617,    0
$$ Real data points
##PAGE= N=1
##DATA TABLE= (X++(R..R)), XYDATA
$$ [...]
60875H64593j1002j2251j2544j2568j2489j2074j1509j0973r959q113o296n597
60863G39218n615m927l138j254n8P05J453K141K848M010N815P967J0132J2004
60849G71301J3107J3323J3536J4752J6676J8113J8723J9255K0039K0468K0151
60838I59444J9450J8508J6924J4782J2884J1512J0017Q102O438N378M159K132
60826A089730n8j373j771j931k250k824l825n242o721q177j0001j2191j4021j5078
60812A004267j5935j7042j7795j7470j6461j5659j5095j4078j2344j0254q211
60801H43923o514n436m796l831k123k28J231K564M371O379P864Q796R709J0701
60787H72610J1444J2008J2845J4030J5225J6230J6911J6790J5483J3425J1499
$$ y = [864593, 853591, 841340, 828796, 816228, 803739, 791665, 780156, 769183, 759224, 751111, 744815, 739218, 733603, 728676, 725538, 724284, 724226, 724931, 726384, 728525, 731373, 735383, 741198, 749165, 759297, 771301, 784408, 797731, 811267, 826019, 842695, 860808, 879531, 898786, 918825, 939293, 959444, 978894, 997402, 1014326, 1029108, 1041992, 1053504, 1063521, 1071623, 1078061, 1083439, 1087598, 1089730, 1089672, 1088299, 1086528, 1084597, 1082347, 1079523, 1075698, 1070456, 1063735, 1055558, 1045557, 1033366, 1019345, 1004267, 988332, 971290, 953495, 936025, 919564, 903905, 888810, 874732, 862388, 852134, 843923, 837409, 831973, 827177, 823346, 821223, 820995, 822226, 824790, 829161, 835540, 843404, 852200, 861909, 872610, 884054, 896062, 908907, 922937, 938162, 954392, 971303, 988093, 1003576, 1017001, 1028500]
60776A028500J0060Q956Q259Q172Q347Q152P654P577Q125Q564Q139O905N494M524
60762A137428M248M328L938K530M86j346k629l580m228m323l995l816m103m526
60748A120412m572m038l073k054j440j440j854k424l189m196n208o016o711p238
60734A066959p159o382n662n639n766n051l608k456j984j652j288j481k409l276
60720A013146l460l377l631m009m020l971m649o088p292p340o399n450n141n102
60706I43217m491l155j887j365j264r13n07q70k054l028l086k916l754n823q162
60691H99942r856j0937j2012j3297j4309j4452j3762j2859j2198j1613j0724r567
60679G54356q518p759p048n999m443k585r40Q7O99J567K987M459N334N634N829
$$ y = [1028500, 1038560, 1047516, 1055775, 1063947, 1072294, 1080446, 1088100, 1095677, 1103802, 1112366, 1120505, 1127410, 1132904, 1137428, 1141676, 1146004, 1149942, 1152472, 1152958, 1151612, 1148983, 1145403, 1141175, 1136852, 1132857, 1129041, 1124938, 1120412, 1115840, 1111802, 1108729, 1106675, 1105235, 1103795, 1101941, 1099517, 1096328, 1092132, 1086924, 1080908, 1074197, 1066959, 1059800, 1053418, 1047756, 1042117, 1036351, 1031300, 1027692, 1025236, 1023252, 1021600, 1020312, 1018831, 1016422, 1013146, 1009686, 1006309, 1002678, 998669, 994649, 990678, 986029, 979941, 972649, 965309, 958910, 953460, 948319, 943217, 938726, 935571, 933684, 932319, 931055, 930142, 929635, 928765, 926711, 923683, 920597, 917681, 913927, 908104, 899942, 890086, 879149, 867137, 853840, 839531, 825079, 811317, 798458, 786260, 774647, 763923, 754356, 745838, 738079, 731031, 725032, 720589, 718004, 717064, 717151, 717850, 719417, 722404, 726863, 732197, 737831, 743660]
60664G43660O079O093N629M752L658K589J833J533J517J554J669K001K528L135
60650G88230L828M633N541O636Q041R503J0444J0579J0145R312Q041O775O569
60637H88277P900R832J1166J1870J2667J3649J4302J4586J5011J5582J5636J4817
60625A045295J3515J2128J0516Q361N632K534n91l419n972q653j1516j3821j4876
60612A039133j5023j5090j5107j4388j2818j1105r629p896n442k630j75J719L456
60599I35005N515P919J0044J0995J0490R214P987O819N219L108R28r57k400l252
60585A006634l525l597l754l801l627l629l949l831k652j145n03o76o41j94j14
60570I70996o29j037j072j428k603m209n723p006p869q101q093q525r216r246
$$ y = [743660, 749739, 755832, 761461, 766213, 769871, 772460, 774293, 775826, 777343, 778897, 780566, 782567, 785095, 788230, 792058, 796691, 802232, 808868, 816909, 826412, 836856, 847435, 857580, 866892, 874933, 881708, 888277, 896177, 906009, 917175, 929045, 941712, 955361, 969663, 984249, 999260, 1014842, 1030478, 1045295, 1058810, 1070938, 1081454, 1089815, 1095447, 1097981, 1097390, 1093971, 1087999, 1079346, 1067830, 1054009, 1039133, 1024110, 1009020, 993913, 979525, 966707, 955602, 945973, 938077, 932635, 930005, 929830, 931549, 935005, 940520, 948439, 958483, 969478, 979968, 989182, 997169, 1003988, 1009207, 1012315, 1013243, 1012286, 1009886, 1006634, 1003109, 999512, 995758, 991957, 988330, 984701, 980752, 976921, 974269, 973124, 972621, 971945, 971304, 971110, 970996, 970367, 969330, 968258, 966830, 964227, 960018, 954295, 947289, 939420, 931319, 923226, 914701, 905485, 896239]
60556H96239q363p215o051m503k878k275k854l227k370r63n2N49J551K914M241
60541H64743N685P516R434J1272J3784J7741K2722K7678L2297L6928M1609M5995
60529A137404M9930N3184N4766N3392M8618M1003L1291K0060Q034l885j4884k4233
60517A454680l1088l4758l5080l2391k7384k1168j4961r311l951J177N254P450
60505A258469Q068Q231Q651R259R872J0599J1663J3251J5678J9334K4484L1196
60493A428755L9343M8555N8368O8611P9525R1425J04379J18186J32470J46877
60483B316494J61634J77802J96492K17858K41480K67646K97174L29321L60339
60474D566240L84523L96307L91156L65304L15979K42608J48153L9394p4402j83813
$$ y = [896239, 887876, 880661, 874610, 870107, 867229, 864954, 862100, 858873, 856503, 855540, 855488, 856037, 857588, 860502, 864743, 870428, 877944, 887378, 898650, 912434, 930175, 952897, 980575, 1012872, 1049800, 1091409, 1137404, 1187334, 1240518, 1295284, 1348676, 1397294, 1438297, 1469588, 1489648, 1497682, 1493797, 1478913, 1454680, 1423592, 1388834, 1353754, 1321363, 1293979, 1272811, 1257850, 1248539, 1244588, 1245765, 1251019, 1258469, 1266537, 1274768, 1283419, 1292678, 1302550, 1313149, 1324812, 1338063, 1353741, 1373075, 1397559, 1428755, 1468098, 1516653, 1575021, 1643632, 1723157, 1814582, 1918961, 2037147, 2169617, 2316494, 2478128, 2655930, 2852422, 3070280, 3311760, 3579406, 3876580, 4205901, 4566240, 4950763, 5347070, 5738226, 6103530, 6419509, 6662117, 6810270, 6849664, 6775262, 6591449]
60464F591449k80983l59677m15109m45119m51585m39520m14398l80614l41961
60455C062483l01982k63308k27479j95676j68638j45807j25729j07847r2809q0769
60445A352439p0674o1780n4482m8830m3604l7952l2732k9052k6451k3820k1181
60434I01881j9207j7689j5943j4194j3085j2195j0528q300o812o541o515n753
60422G65119m323k777j542q97q55q85m47J97L61O4L7N83J145J169Q38P71J305
60405G59863K188K772K664K246K204K498K372J689J394K143L277L889M115M583
60391G97897N267N807O293O783O702N771M852M650M303K669M35o98o14p88j788
60376H47541k588k591k603l103l214k253j047p34j127j273r16n33m06l61k12J48
$$ y = [6591449, 6310466, 5950789, 5535680, 5090561, 4638976, 4199456, 3785058, 3404444, 3062483, 2760501, 2497193, 2269714, 2074038, 1905400, 1759593, 1633864, 1526017, 1433208, 1352439, 1281765, 1219985, 1165503, 1116673, 1073069, 1035117, 1002385, 973333, 946882, 923062, 901881, 882674, 864985, 849042, 834848, 821763, 809568, 799040, 790740, 783928, 777387, 770872, 765119, 760796, 758019, 756477, 755580, 754725, 753840, 753393, 753590, 753951, 754015, 754052, 754635, 755780, 756949, 757787, 758558, 759863, 762051, 764823, 767487, 769733, 771937, 774435, 776807, 778496, 779890, 782033, 785310, 789199, 793314, 797897, 803164, 808971, 815264, 822047, 828749, 834520, 839372, 844022, 848325, 850994, 851429, 850731, 850117, 849329, 847541, 844953, 842362, 839759, 836656, 833442, 831189, 830142, 829408, 828281, 827008, 826092, 825559, 825153, 824792, 824580, 824728]
60360H24728P66J406J658J527J535J955K457K772L153L800M331M383M362N054
60346H63887O598Q294R377R724R775R896R921R406Q356P454P215P196O496M941
60332I78536L290K174J456P48J42N3O26J582K638L874N522P367Q585Q510P518
60317A032621O614O051M991K838K30j832l207m273m883m629l816l269l200l077
60303A021159k597k098j854j612r79J77J704L208M185M509M663N054N458N459
60289A046436N143M726L980K718J470Q52N36k16j250j683j231l95O60K331M557
60274A068634O556P800Q557R285J0205J1505J3261J5045J6391J7656J9631K2299
60262A226825K4854K7048K9498L2467L5428L8180M1451M5807N0808N5783O0849
$$ y = [824728, 825494, 826900, 828558, 830085, 831620, 833575, 836032, 838804, 841957, 845757, 850088, 854471, 858833, 863887, 870485, 878779, 888156, 897880, 907655, 917551, 927472, 936878, 945234, 952688, 959903, 967099, 973595, 978536, 981826, 984000, 985456, 986204, 986346, 986399, 987025, 988607, 991245, 995119, 1000641, 1008008, 1016593, 1025103, 1032621, 1039235, 1045286, 1050277, 1053115, 1053345, 1051513, 1048306, 1044033, 1039150, 1034521, 1030705, 1027436, 1024236, 1021159, 1018562, 1016464, 1014610, 1012998, 1012019, 1012196, 1013900, 1017108, 1021293, 1025802, 1030465, 1035519, 1040977, 1046436, 1051579, 1056305, 1060285, 1063003, 1064473, 1065325, 1065861, 1065645, 1064395, 1062712, 1061481, 1061086, 1061746, 1064077, 1068634, 1075190, 1082990, 1091547, 1100832, 1111037, 1122542, 1135803, 1150848, 1167239, 1184895, 1204526, 1226825, 1251679, 1278727, 1308225, 1340692, 1376120, 1414300, 1455751, 1501558, 1552366, 1608149, 1668998]
60251A668998O6584P3164Q0290Q7603R4884J02234J10152J18915J27737J35265
60241B665826J40980J45430J48817J50185J48497J43812J36938J28464J18515
60232C927464J06929R3263P7192N9266M0874K3070O081r872k4059l6045m6203
60221D217960n4665o0388o2141o0098n5559m9229m0620k9266j5766j304J3470
60210C802394K8619M4204N9839P5117R0134J05178J19836J32902J43353J51068
60200D752644J56216J58319J56414J49893J38817J23632J05147Q4474O2375L8852
60190E926783J3955j1325l5616n8323p9369r8013j12993j23773j30609j33340
60180E157377j31250j24433j14267j02044q7902p1572n3326l3690j2957Q381K9286
$$ y = [1668998, 1735582, 1808746, 1889036, 1976639, 2071523, 2173757, 2283909, 2402824, 2530561, 2665826, 2806806, 2952236, 3101053, 3251238, 3399735, 3543547, 3680485, 3808949, 3927464, 4034393, 4127656, 4204848, 4264114, 4304988, 4328058, 4334139, 4324267, 4300208, 4264163, 4217960, 4163295, 4102907, 4040766, 3980668, 3925109, 3875880, 3835260, 3805994, 3790228, 3788924, 3802394, 3831013, 3875217, 3935056, 4010173, 4100307, 4205485, 4325321, 4458223, 4601576, 4752644, 4908860, 5067179, 5223593, 5373486, 5512303, 5635935, 5741082, 5825556, 5887931, 5926783, 5940738, 5929413, 5893797, 5835474, 5756105, 5658092, 5545099, 5421326, 5290717, 5157377, 5026127, 4901694, 4787427, 4685383, 4597481, 4525909, 4472583, 4438893, 4425936, 4434317, 4463603]
60169D463603M8776O6519Q2428R6076J06793J13847J16363J13722J06440R6008
60159E410575Q3426O8439N0718L1273J2101n264k0282l2694m1828m6736m6921
60148E462807m2827l5391k4946j0926O923K7547M9438P2228R6531J22468J49418
60137E873270J77188K06180K36263K66594K96939L27926L59447L89861M17408
60128H551076M41471M61723M76950M85578M86710M79859M64324M39604M05940
60119A2693235L63840L13628K56083J92929J25953N6206j5361q7046j56965k23704
60109A3518798k85534l39604l83128m15142m36102m45972m43881m29772m05444
60100I934219l73511l35999k94241k49535k03276j56589j10210o4890k1770J7810
$$ y = [4463603, 4512379, 4578898, 4661326, 4757402, 4864195, 4978042, 5094405, 5208127, 5314567, 5410575, 5494001, 5562440, 5613158, 5644431, 5656532, 5651268, 5630986, 5598292, 5556464, 5509728, 5462807, 5419980, 5384589, 5359643, 5348717, 5355640, 5383187, 5432625, 5504853, 5601384, 5723852, 5873270, 6050458, 6256638, 6492901, 6759495, 7056434, 7384360, 7743807, 8133668, 8551076, 8992547, 9454270, 9931220, 10416798, 10903508, 11383367, 11847691, 12287295, 12693235, 13057075, 13370703, 13626786, 13819715, 13945668, 14001874, 13986513, 13899467, 13742502, 13518798, 13233264, 12893660, 12510532, 12095390, 11659288, 11213316, 10769435, 10339663, 9934219, 9560708, 9224709, 8930468, 8680933, 8477657, 8321068, 8210858, 8145968, 8124198, 8142008]
60090H142008N2971Q3500J09180J29119J42149J47770J46157J37399J21484R9213
60080I310950P2300M2292R945k3964n7964r0472j20615j48084j72546j93604k10935
60069H417303k24163k33001k37694k38792k36287k29579k18590k04262j87595
60060F407340j68938j48633j27621j06570q4985o1980l7684j3267J0305L2950
60050E700917N5052P6772R7805J17458J34946J49541J60368J66275J66397J60732
60040F986263J49650J33091J10994Q4433N5303K4804o875l9277p1167j01486j29642
60029G196091j54409j73818j86836j94180j96756j94383j86818j75024j60380
60020E573487j43383j24105j03174q1374n8840l5556j2104J0899L3586N6336P9059
$$ y = [8142008, 8194979, 8278479, 8387659, 8516778, 8658927, 8806697, 8952854, 9090253, 9211737, 9310950, 9383250, 9425542, 9435487, 9411523, 9353559, 9263087, 9142472, 8994388, 8821842, 8628238, 8417303, 8193140, 7960139, 7722445, 7483653, 7247366, 7017787, 6799197, 6594935, 6407340, 6238402, 6089769, 5962148, 5855578, 5770593, 5708613, 5670929, 5657662, 5667967, 5700917, 5755969, 5832741, 5930546, 6048004, 6182950, 6332491, 6492859, 6659134, 6825531, 6986263, 7135913, 7269004, 7379998, 7464431, 7519734, 7544538, 7537663, 7498386, 7427219, 7325733, 7196091, 7041682, 6867864, 6681028, 6486848, 6290092, 6095709, 5908891, 5733867, 5573487, 5430104, 5305999, 5202825, 5121451, 5062611, 5027055, 5014951, 5025850, 5059436, 5115772, 5194831]
60009E194831J01647J24409J47263J69223J89408K07629K23055K33387K36673
60000F827525K33177K24043K08953J86768J58004J24964Q9427N1889J3077k5327
59990H092500o1879r6011j27061j53725j74842j89857j98152j98957j92461j80315
59980F519240j64476j45909j24720j01175p6270n1453k7793n275J6869L8841N9576
59969E937455P7863R3623J07464J19300J28334J34296J37676J38649J36538J30721
59959G141919J21567J10133R7245Q3046O7502N1238L5832K2895J2968N867K056
59948G752268K787Q678J9232L4355N5080Q1850J13156J47181J84063K25013K69674
59937H893337L15987L62379M08381M52919M93471N27260N51962N64737N61769
$$ y = [5194831, 5296478, 5420887, 5568150, 5737373, 5926781, 6134410, 6357465, 6590852, 6827525, 7060702, 7284745, 7493698, 7680466, 7838470, 7963434, 8052861, 8104750, 8117827, 8092500, 8030621, 7934610, 7807549, 7653824, 7478982, 7289125, 7090973, 6892016, 6699555, 6519240, 6354764, 6208855, 6084135, 5982960, 5906690, 5855237, 5827444, 5822169, 5839038, 5877879, 5937455, 6015318, 6108941, 6216405, 6335705, 6464039, 6598335, 6736011, 6874660, 7011198, 7141919, 7263486, 7373619, 7470864, 7553910, 7621412, 7672650, 7708482, 7731377, 7744345, 7750212, 7752268, 7755055, 7763733, 7782965, 7817320, 7872400, 7954250, 8067406, 8214587, 8398650, 8623663, 8893337, 9209324, 9571703, 9980084, 10433003, 10926474, 11453734, 12005696, 12570433, 13132202]
59928A3132202N39750M97438M35433L55259K59169J50526L3859q5266k00537l05727
59918A4812106l95750m67232n18535n49737n62349n58428n40006n09539m70276
59909A0240254m25335l76634l25402k73288k22026j72205j23370p5430k9087J5115
59899H232592N7255R7341J34753J68567J97818K21335K37814K46076K44875K32730
59889A0071156K08588J72610J25847O9545N506o3122j32330j98527k58790l10322
59879I690161l50817l79428l96520m02618l98414l85635l66733l43430l16480
59870F350086k86927k56616k27178j99303j73352j49920j29575j12693r9765r1063
59860D623694q5811q2353p9515p7284p5881p4788p2939o9450o3899n6380m7526
$$ y = [13132202, 13671952, 14169390, 14604823, 14960082, 15219251, 15369777, 15403636, 15318370, 15117833, 14812106, 14416356, 13949124, 13430589, 12880852, 12318503, 11760075, 11220069, 10710530, 10240254, 9814919, 9438285, 9112883, 8839595, 8617569, 8445364, 8321994, 8246564, 8217477, 8232592, 8289847, 8387188, 8521941, 8690508, 8888326, 9109661, 9347475, 9593551, 9838426, 10071156, 10279744, 10452354, 10578201, 10647746, 10653252, 10590130, 10457800, 10259273, 10000483, 9690161, 9339344, 8959916, 8563396, 8160778, 7762364, 7376729, 7009996, 6666566, 6350086, 6063159, 5806543, 5579365, 5380062, 5206710, 5056790, 4927215, 4814522, 4714757, 4623694, 4537883, 4455530, 4376015, 4298731, 4222850, 4148062, 4075123, 4005673, 3941774, 3885394, 3837868]
59849C837868l8174k8965k0453j3400q514o061o169r213j5245k3248l1666l9569
59837C597191m6715n2685n6735n8367n7471n4097m8686m2213l5312k7570j8511
59826C098829q881M7Q150J6377K5157L4036M2804N1743O0727O9192P7079Q4697
59814C559957R1432R5736R6618R4271Q9071Q1057P0608N8634M5826L2668K0360
59803D336238J0552L765r50m297n667m139L20P268J6642K8619M3207O0255P9533
59790D571346J00628J23478J48953J78149K11036K46632K84464L24814L67169
59781F556669M09349M48049M79107M96879M94817M67808M13866L33916K31398
59772A0331858J12895j1876j31898k37224l20421l77386m07825m14520m01748
$$ y = [3837868, 3799694, 3770729, 3750276, 3736876, 3728362, 3722301, 3716132, 3706919, 3691674, 3668426, 3636760, 3597191, 3550476, 3497791, 3441056, 3382689, 3325218, 3271121, 3222435, 3180222, 3144910, 3117340, 3098829, 3089948, 3089995, 3098145, 3114522, 3139679, 3173715, 3216519, 3268262, 3328989, 3398181, 3475260, 3559957, 3651389, 3747125, 3843743, 3938014, 4027085, 4108142, 4178750, 4237384, 4283210, 4315878, 4336238, 4346790, 4350555, 4349605, 4345308, 4339641, 4335502, 4335822, 4343090, 4359732, 4388351, 4431558, 4491813, 4571346, 4671974, 4795452, 4944405, 5122554, 5333590, 5580222, 5864686, 6189500, 6556669, 6966018, 7414067, 7893174, 8390053, 8884870, 9352678, 9766544, 10100460, 10331858, 10444753, 10432877, 10300979, 10063755, 9743334, 9365948, 8958123, 8543603, 8141855]
59763H141855l74388l37828k97125k55603k14783j75688j39286j05788p4729m6099
59753F120538k0360K867K4943M6720O7956Q8506J08924J29587J50407J71815J94813
59742G086716K19544K45100K71296K99343L30184L63310L98060M34837M74266
59733A0122656N16170N60159O06006O52488O96855P36416P69792P95732Q11821
59724A6268095Q15506Q05723P82788P47756P03221O53974O05674N63009N29698
59715B2475444N09218N04246N15570N42242N82159O31669O85318P37012P81235
59706B7964113Q12704Q25852Q15752P79374P15676O25492N12366L82777K44508
59697C3678614J05064k8046j46920k44770l17533l63263l80678l69541l31900
$$ y = [8141855, 7767467, 7429639, 7132514, 6876911, 6662128, 6486440, 6347154, 6241366, 6166637, 6120538, 6100178, 6103045, 6127988, 6174708, 6242664, 6331170, 6440094, 6569681, 6720088, 6891903, 7086716, 7306260, 7551360, 7822656, 8121999, 8452183, 8815493, 9213553, 9648390, 10122656, 10638826, 11198985, 11804991, 12457479, 13154334, 13890750, 14660542, 15456274, 16268095, 17083601, 17889324, 18672112, 19419868, 20123089, 20777063, 21382737, 21945746, 22475444, 22984662, 23488908, 24004478, 24546720, 25128879, 25760548, 26445866, 27182878, 27964113, 28776817, 29602669, 30418421, 31197795, 31913471, 32538963, 33051329, 33434106, 33678614, 33783678, 33755632, 33608712, 33363942, 33046409, 32683146, 32302468, 31932927, 31601027]
59688C1601027k71669j92911r9063O906J22764K47174L78764N15280O54240P93546
59678C3756058R30268J059112J172918J264117J324568J344564J313740J223824
59670D3389169J070737Q55304N83910K68984p2194m19953p54196j055483j306660
59661D2559618j495297j615681j669281j663582j609853j521137j411769j297502
59653C0275516j193737j111990j057939j032713j034505j058080j094167j131460
59645B1560925j159864j172112j163939j134525j086613j024936r54228q78776
59637A2985932q02629p28848o58825n93121n32560m77694m27998l82663l41628
59628H039966l04869k71405k40185k11414j85776j62852j41607j21941j04474
$$ y = [31601027, 31329358, 31136447, 31037384, 31044290, 31167054, 31414228, 31792992, 32308272, 32962512, 33756058, 34686326, 35745438, 36918356, 38182473, 39507041, 40851605, 42165345, 43389169, 44459906, 45315210, 45899120, 46168104, 46095910, 45675957, 44921761, 43866278, 42559618, 41064321, 39448640, 37779359, 36115777, 34505924, 32984787, 31573018, 30275516, 29081779, 27969789, 26911850, 25879137, 24844632, 23786552, 22692385, 21560925, 20401061, 19228949, 18065010, 16930485, 15843872, 14818936, 13864708, 12985932, 12183303, 11454455, 10795630, 10202509, 9669949, 9192255, 8764257, 8381594, 8039966, 7735097, 7463692, 7223507, 7012093, 6826317, 6663465, 6521858, 6399917, 6295443]
59619F295443q9209p5809o4872n7494n3746n2849n4610n9325o6412p4619q3486
59608E563012r3159j02778j10624j16039j19715j21852j21462j18029j12487j05902
59598D440965r8333q9596q0092p0200n9761m8832l8160k8342j9121j0132j685
59587C896711N671J1900J7268K1915K5974K9660L2870L5137L6256L6644L6813
59576D186819L7058L7843L9952M3885M9397N5944O3306P1630Q1182R2232J04828
59565D864076J18511J32561J46714J61444J77511J95311K14676K35036K55878
59556F501718K77117K98950L21128L42713L62743L80753L96368M08741M16908
59547I707139M20343M18770M11890L99966L84332L66596L47480L27072L06040
$$ y = [6295443, 6206234, 6130425, 6065553, 6008059, 5954313, 5901464, 5846854, 5787529, 5721117, 5646498, 5563012, 5469853, 5367075, 5256451, 5140412, 5020697, 4898845, 4777383, 4659354, 4546867, 4440965, 4342632, 4253036, 4172944, 4102744, 4042983, 3994151, 3955991, 3927649, 3908528, 3898396, 3896711, 3902382, 3914282, 3931550, 3953465, 3979439, 4009099, 4041969, 4077106, 4113362, 4150006, 4186819, 4223877, 4261720, 4301672, 4345557, 4394954, 4450898, 4514204, 4585834, 4667016, 4759248, 4864076, 4982587, 5115148, 5261862, 5423306, 5600817, 5796128, 6010804, 6245840, 6501718, 6778835, 7077785, 7398913, 7741626, 8104369, 8485122, 8881490, 9290231, 9707139, 10127482, 10546252, 10958142, 11358108, 11742440, 12109036, 12456516, 12783588, 13089628]
59538A3089628K85943K68346K53967K42432K32459K22663K12617K02676J92295
59529A5203026J79229J61118J37312J08027P2330K8267k5121q6919j55300k28025
59519A5393944l01876l72849m37464m93342n38524n71221n90651n97418n92847
59510A0897752n78493n56423n29116m98537m65785m31749l97575l64159l31701
59501F744214l00058k69249k39431k10767j83528j58060j34502j12631r2013p2202
59491D971773n2971l4512j7105m41J6307L3546N0902O8168Q5983J04982J24894
59480E351526J45153J65912J87552K09727K31744K53520K75178K95884L14014
59471G430210L28329L38011L41632L37077L22657K97719K62185K16307J61031
$$ y = [13089628, 13375571, 13643917, 13897884, 14140316, 14372775, 14595438, 14808055, 15010731, 15203026, 15382255, 15543373, 15680685, 15788712, 15861042, 15889309, 15864188, 15777269, 15621969, 15393944, 15092068, 14719219, 14281755, 13788413, 13249889, 12678668, 12088017, 11490599, 10897752, 10319259, 9762836, 9233720, 8735183, 8269398, 7837649, 7440074, 7075915, 6744214, 6444156, 6174907, 5935476, 5724709, 5541181, 5383121, 5248619, 5135988, 5043975, 4971773, 4918802, 4884290, 4867185, 4866744, 4883051, 4916597, 4967499, 5035667, 5121650, 5226632, 5351526, 5496679, 5662591, 5850143, 6059870, 6291614, 6545134, 6820312, 7116196, 7430210, 7758539, 8096550, 8438182, 8775259, 9097916, 9395635, 9657820, 9874127, 10035158]
59462A0035158R8097K9692m1530j12312j79273k39657k91357l32747l63034l82587
59452H220450l92284l92874l85457l72007l54645l34567l12357k88848k65030
59443E122381k41404k18240j96117j75546j56479j38750j22541j07809r3891q0406
59433C591198o7868n6656m6222l6127k6900j8814j0924k625M904J0407J4729J9505
59421C374607K4497K8253L0813L3580L6868L9786M2506M6435N1940N8009O4339
59410C831633P1758Q0088Q7739R4062J00314J07657J15918J25129J36689J52096
59400D903083J71814J95898K24308K55960K88988L22749L58304L96398M36305
59391G553807M77267N19508N63018O06495O48136O86055P17322P38034P45252
$$ y = [10035158, 10133255, 10162947, 10121417, 10009105, 9829832, 9590175, 9298818, 8966071, 8603037, 8220450, 7828166, 7435292, 7049835, 6677828, 6323183, 5988616, 5676259, 5387411, 5122381, 4880977, 4662737, 4466620, 4291074, 4134595, 3995845, 3873304, 3765495, 3671604, 3591198, 3523330, 3466674, 3420452, 3384325, 3357425, 3338611, 3327687, 3325062, 3329966, 3340373, 3355102, 3374607, 3399104, 3427357, 3458170, 3491750, 3528618, 3568404, 3610910, 3657345, 3709285, 3767294, 3831633, 3903391, 3983479, 4071218, 4165280, 4265594, 4373251, 4489169, 4614298, 4750987, 4903083, 5074897, 5270795, 5495103, 5751063, 6040051, 6362800, 6721104, 7117502, 7553807, 8031074, 8550582, 9113600, 9720095, 10368231, 11054286, 11771608, 12509642, 13254894]
59382A3254894P37941P15796O78953O29594N71986N09787M44635L78176L13553
59373A8235315K53315J97192J43359R0741L8673j4472p0546j29956j91826k54984
59363A8296811l17516l76069m26825m66797m93583n05107n00969m83428m55890
59354A4270627m21110l81857l42417l07758k81408k64938k58834k62631k74599
59345A1475075k92409l13957l36955l58352l75230l85907l89699l86339l76367
59336H259860l61199l41887l18624k92315k65446k40022k15539j90488j65133
59327E869207j41149j19097r8101p7866n9288m2748k7332j2238K129J4879K5660
59316E334056L4556M1664M6964N0281N1182M9355M4959L8328K9627J9231Q022
$$ y = [13254894, 13992835, 14708631, 15387584, 16017178, 16589164, 17098951, 17543586, 17921762, 18235315, 18488630, 18685822, 18829181, 18919922, 18958595, 18944123, 18873577, 18743621, 18551795, 18296811, 17979295, 17603226, 17176401, 16709604, 16216021, 15710914, 15209945, 14726517, 14270627, 13849517, 13467660, 13125243, 12817485, 12536077, 12271139, 12012305, 11749674, 11475075, 11182666, 10868709, 10531754, 10173402, 9798172, 9412265, 9022566, 8636227, 8259860, 7898661, 7556774, 7238150, 6945835, 6680389, 6440367, 6224828, 6034340, 5869207, 5728058, 5608961, 5510860, 5432994, 5373706, 5330958, 5303626, 5291388, 5293517, 5308396, 5334056, 5368612, 5410276, 5457240, 5507521, 5558703, 5608058, 5653017, 5691345, 5720972, 5740203, 5748225]
59305E748225l283j4676k6059l6318m4020m8774n1104n1281m9061m4311l7125
59294E342213k7472j5530k141J1893K6866M3658O2204Q1263R9865J18199J36869
59283E877887J55769J73889J89920K02987K13045K20418K24719K24459K18131
59274G701224K05395J86943J63567J36002J05411P3325M1147J0077j8674m4027
59264H560390o5333q2232r4609j03127j09418j15019j20242j24598j28078j31303
59254G486431j34405j36414j35938j32031j24284j12588r7196p8865n8495l6366
59244F439849j1840J5925M6914Q0275J15464J52866J92825K34699K77534L21122
59234G865633L65244M07980M45892M75953M96247N04684M98356M74773M32948
$$ y = [5748225, 5744942, 5730266, 5704207, 5667889, 5623869, 5575095, 5523991, 5472710, 5423649, 5379338, 5342213, 5314741, 5299211, 5297070, 5308963, 5335829, 5379487, 5441691, 5522954, 5622819, 5741018, 5877887, 6033656, 6207545, 6397465, 6600452, 6813497, 7033915, 7258634, 7483093, 7701224, 7906619, 8093562, 8257129, 8393131, 8498542, 8571867, 8613014, 8623091, 8604417, 8560390, 8495057, 8412825, 8318216, 8215089, 8105671, 7990652, 7870410, 7745812, 7617734, 7486431, 7352026, 7215612, 7079674, 6947643, 6823359, 6710771, 6613575, 6534710, 6476215, 6439849, 6428009, 6443934, 6490848, 6571123, 6686587, 6839453, 7032278, 7266977, 7544511, 7865633, 8230877, 8638857, 9084749, 9560702, 10056949, 10561633, 11059989, 11534762, 11967710]
59225A1967710L72986K95644K02907R8281j3864j28658k40396l43146m32403n05579
59215A1273482n60834n96759o13707o14167o01006n76284n42365n02804m60997
59206F204559m18724l76890l36774k99577k65533k34531k06857j82526j60655
59197C722492j40492j22380j06825r3380q1415p1171o2887n5720m8713m2226l7130
59186B860153l3037k8655k3552j8404j3712r265m768j23M763R650J3879J7291
59174B774220K0836K5398L0569L5361L9703M4242M9220N4484O0155O6256P2105
59163C272549P7047Q1406Q5730Q9625R2319R3887R4673R3909R0261Q3647P5323
59152D230376O6148N5855M4094L1218J7867M539q312k0267l1010m0007m6459n0085
$$ y = [11967710, 12340696, 12636340, 12839247, 12937528, 12923664, 12795006, 12554610, 12211464, 11779061, 11273482, 10712648, 10115889, 9502182, 8888015, 8287009, 7710725, 7168360, 6665556, 6204559, 5785835, 5408945, 5072171, 4772594, 4507061, 4272530, 4065673, 3883147, 3722492, 3582000, 3459620, 3352795, 3259415, 3178000, 3106829, 3043942, 2988222, 2939509, 2897283, 2860153, 2827116, 2798461, 2774909, 2756505, 2742793, 2733528, 2728760, 2728637, 2733400, 2743050, 2756929, 2774220, 2795056, 2820454, 2851023, 2886384, 2926087, 2970329, 3019549, 3074033, 3134188, 3200444, 3272549, 3349596, 3431002, 3516732, 3606357, 3698676, 3792563, 3887236, 3981145, 4071406, 4155053, 4230376, 4296524, 4352379, 4396473, 4427691, 4445558, 4450097, 4441785, 4421518, 4390508, 4350501, 4304042, 4253957]
59140D253957n1477n1093m8484m3298l6273k8274j8983p736M898J7751L0895M5421
59128D067304O1468P7855R3854J10112J27527J46220J65881J86345K07527K29354
59118E473447K51872K74894K97594L18915L38198L54692L66673L71727L67765
59109H415777L53264L26822K87373K34957J70924R7825J9532n9069j33482k00744
59099I513179k58935l06342l41862l65720l78977l82823l79064l70492l59598
59090F369366l47148l32819l16802k99969k83001k66287k50190k34420k17865
59081C820865k00106j82564j66990j53364j40462j27912j16299j05743r5884q6968
59071B444573p9506p2917o5975n8585n1931m6732m2540l8637l4615l0188k5533
$$ y = [4253957, 4202480, 4151387, 4102903, 4059605, 4023332, 3995058, 3976075, 3968339, 3973237, 3990988, 4021883, 4067304, 4128772, 4206627, 4300481, 4410593, 4538120, 4684340, 4850221, 5036566, 5244093, 5473447, 5725319, 6000213, 6297807, 6616722, 6954920, 7309612, 7676285, 8048012, 8415777, 8769041, 9095863, 9383236, 9618193, 9789117, 9886942, 9906474, 9847405, 9713923, 9513179, 9254244, 8947902, 8606040, 8240320, 7861343, 7478520, 7099456, 6728964, 6369366, 6022218, 5689399, 5372597, 5072628, 4789627, 4523340, 4273150, 4038730, 3820865, 3620759, 3438195, 3271205, 3117841, 2977379, 2849467, 2733168, 2627425, 2531541, 2444573, 2365067, 2292150, 2226175, 2167590, 2115659, 2068927, 2026387, 1987750, 1953135, 1922947, 1897414]
59060A897414k1727j9742j9156j8837j8626j9220k0746k2668k4807k7181k9113
59049A655591k9866k9872k9929k9479k7324k3773k0397j7665j4629j1132q390
59038A413135o910n503l063P0L261O716J0660J4444J7295J9179K0385K0993K1184
59025A531846K1221K0811J9215J6348J3041J0003P318N049L479K553J961J872
59013A654717K796M621O675Q721J1024J3436J5396J6895J8313J9312J9108J7899
59001A808913J6831J6175J4838J2061Q589N643L738K849K911L623M422N067N767
58988A911427O685P825R304J1025J2356J2915J3433J4799J6627J7938J8988K0924
58976B074246K3751K6166K7656K9297L2041L5498L8909M2170M5399M8504N1514
$$ y = [1897414, 1875687, 1855945, 1836789, 1817952, 1799326, 1780106, 1759360, 1736692, 1711885, 1684704, 1655591, 1625725, 1595853, 1565924, 1536445, 1509121, 1485348, 1464951, 1447286, 1432657, 1421525, 1413135, 1406225, 1400722, 1397659, 1397729, 1400990, 1407706, 1418366, 1432810, 1450105, 1469284, 1489669, 1510662, 1531846, 1553067, 1573878, 1593093, 1609441, 1622482, 1632485, 1639803, 1644852, 1648331, 1650884, 1652845, 1654717, 1657513, 1662134, 1668809, 1677530, 1688554, 1701990, 1717386, 1734281, 1752594, 1771906, 1791014, 1808913, 1825744, 1841919, 1856757, 1868818, 1877407, 1883050, 1886788, 1889637, 1892548, 1896171, 1900593, 1905660, 1911427, 1918112, 1925937, 1935241, 1946266, 1958622, 1971537, 1984970, 1999769, 2016396, 2034334, 2053322, 2074246, 2097997, 2124163, 2151819, 2181116, 2213157, 2248655, 2287564, 2329734, 2375133, 2423637, 2475151]
58965B475151N4570N7279N9022O0010O1013O1990O2100O1213O0388O0632O2150
58954C135518O4891O8763P3272P8044Q3704R1070R9693J08513J17814J28796J41251
58943D191329J53491J65087J77830J93239K10717K29020K48182K69021K91918
58934F129834L17011L44669L74997M07650M42622M80433N21188N64486O10476
58925A0193366O59867P12393P66409Q20328Q73181R23073R66290R98583J016441
58916A7929931J016508R94806R47363Q71132P64387O27567M64470K81858Q7442
58907B3985464j11061l05243m86125o46013p79717q84084r57792j002117j020595
58898A7792717j017180r95290r58611r11354q57140p98633p38516o79527o23120
$$ y = [2475151, 2529721, 2587000, 2646022, 2706032, 2767045, 2829035, 2891135, 2952348, 3012736, 3073368, 3135518, 3200409, 3269172, 3342444, 3420488, 3504192, 3595262, 3694955, 3803468, 3921282, 4050078, 4191329, 4344820, 4509907, 4687737, 4880976, 5091693, 5320713, 5568895, 5837916, 6129834, 6446845, 6791514, 7166511, 7574161, 8016783, 8497216, 9018404, 9582890, 10193366, 10853233, 11565626, 12332035, 13152363, 14025544, 14948617, 15914907, 16913490, 17929931, 18946439, 19941245, 20888608, 21759740, 22524127, 23151694, 23616164, 23898022, 23985464, 23874403, 23569160, 23083035, 22437022, 21657305, 20773221, 19815429, 18813312, 17792717, 16775537, 15780247, 14821636, 13910282, 13053142, 12254509, 11515993, 10836466, 10213346]
58889A0213346n69274n18117m70625m27450l88381l53457l23331k98009k76338
58880F588364k57200k40170k24741k10092j95991j82752j70060j57109j44005
58871D806244j31646j20075j08571r7454q8007q0217p2447o3900n5616m8383m1521
58860C898407l4466k7792k1744j5485q675k201L552R636J6809K4443L1941L9738
58848C914163M8090N6480O5007P4623Q5223R5308J04489J14463J26409J39328
58838D823583J52159J65669J80821J97001K13418K30742K49893K70682K93029
58829F776997L18043L46477L77548M10558M46215M85133N26709N70854O19023
58820A0877557O71705P26482P80236Q31721Q80050R22166R53814R71665R72520
$$ y = [10213346, 9644072, 9125955, 8655330, 8227880, 7839499, 7486042, 7162711, 6864702, 6588364, 6331164, 6090994, 5866253, 5656161, 5460170, 5277418, 5107358, 4950249, 4806244, 4674598, 4554523, 4445952, 4348498, 4260491, 4180274, 4107827, 4043927, 3988311, 3939928, 3898407, 3863941, 3836149, 3814405, 3798920, 3790245, 3788044, 3791596, 3801232, 3818041, 3842484, 3874425, 3914163, 3962253, 4018733, 4083740, 4158363, 4243586, 4338894, 4443383, 4557846, 4684255, 4823583, 4975742, 5141411, 5322232, 5519233, 5732651, 5963393, 6213286, 6483968, 6776997, 7095040, 7441517, 7819065, 8229623, 8675838, 9160971, 9687680, 10258534, 10877557, 11549262, 12275744, 13055980, 13887701, 14767751, 15689917, 16643731, 17615396, 18587916]
58811A8587916R51705R04598Q29057P24834N92051M32593K52341N9985j35911
58802B3199169l27385n06016o63952p96006q99527r73122j017180j034771j030284
58793A5950926j007545r70323r23360q70961q15360p58000p01321o47461n96272
58784H660323n46785m99814m57106m18606l82806l49342l19132k92201k67470
58775E127061k44658k24592k07587j93023j80417j69512j59506j49659j40382
58766C457725j32375j25011j16915j07827r8598q9716q1154p3151o5869n8746
58756B508363n1468m4943m0012l5944l1659k7671k5103k3497k1443j8917j7190
58745B170516j6594j6155j5299j4437j3995j4246j5816j8922k2294k4237k4588
$$ y = [18587916, 19539621, 20444219, 21273276, 21998110, 22590161, 23022754, 23275095, 23335080, 23199169, 22871784, 22365768, 21701816, 20905810, 20006283, 19033161, 18015981, 16981210, 15950926, 14943381, 13973058, 13049698, 12178737, 11363377, 10605377, 9904056, 9256595, 8660323, 8113538, 7613724, 7156618, 6738012, 6355206, 6005864, 5686732, 5394531, 5127061, 4882403, 4657811, 4450224, 4257201, 4076784, 3907272, 3747766, 3598107, 3457725, 3325350, 3200339, 3083424, 2975597, 2876999, 2787283, 2706129, 2632978, 2567109, 2508363, 2456895, 2411952, 2371940, 2335996, 2304337, 2276666, 2251563, 2228066, 2206623, 2187706, 2170516, 2153922, 2137767, 2122468, 2108031, 2094036, 2079790, 2063974, 2045052, 2022758, 1998521, 1973933]
58734A973933k4476k4536k4676k5087k6117k7385k8301k9155l0463l1759l2288
58723A669690l2391l2892l3587l3667l3110l2353l1099k8856k6131k3766k1521
58712A340317j8647j5381j2621j0643r254q491q009o643l997j581j002j984l564
58699A238500o022r798j3619j5909j7254j9347k2040k3635k3624k2967k1999k0173
58687A022113j7759j5806j4350j2430r848p409n457l694k187j142KJ831L715M676
58673I42255M926N169N127M318L451L354L382K726K413L871O370Q007Q609R335
58659A013313J0090R736Q514P808P791P603P557Q814J1000J2556J3442J5133J7888
58646A151245K0308K1808K3341K5485K7846L0576L4478L9383M4254M8968N4236
$$ y = [1973933, 1949457, 1924921, 1900245, 1875158, 1849041, 1821656, 1793355, 1764200, 1733737, 1701978, 1669690, 1637299, 1604407, 1570820, 1537153, 1504043, 1471690, 1440591, 1411735, 1385604, 1361838, 1340317, 1321670, 1306289, 1293668, 1283025, 1273771, 1265280, 1257271, 1250628, 1246631, 1245050, 1244048, 1242064, 1238500, 1232478, 1222680, 1209061, 1193152, 1175898, 1156551, 1134511, 1110876, 1087252, 1064285, 1042286, 1022113, 1004354, 988548, 974198, 961768, 951920, 944511, 939054, 935360, 933173, 932031, 932033, 933864, 937579, 942255, 947181, 952350, 957477, 961795, 965246, 968600, 971982, 974708, 977121, 980992, 987362, 995369, 1003978, 1013313, 1023403, 1033139, 1041653, 1049461, 1057252, 1064855, 1072412, 1081226, 1092226, 1104782, 1118224, 1133357, 1151245, 1171553, 1193361, 1216702, 1242187, 1270033, 1300609, 1335087, 1374470, 1418724, 1467692, 1521928]
58635A521928N9951O5537P1712P9830Q9568R9441J09424J20918J34231J48441
58625B500981J63789J81681K02081K23162K43909K64730K85091L02675L15385
58616D683484L22088L20966L09230K85178K48890K00766J41419P3492J747o9182
58606F518078j35717j94221k41230k75363k97352l07990l07760k98501k83376
58597D176568k64779k43836k21929k00730j80654j61161j42700j26504j12527
58588B521748r9618q7723p7891p0105o3234n7158n2779m9940m7453m5220m4053
58577A826574m3456m1863l9206l6895l5226l3196l0901k9487k8542k6155k2014
58566A459633j7975j5168j2976j1210j0725j1323j1595j1348j1851j3141j3630
$$ y = [1521928, 1581879, 1647416, 1719128, 1798958, 1888526, 1987967, 2097391, 2218309, 2352540, 2500981, 2664770, 2846451, 3048532, 3271694, 3515603, 3780333, 4065424, 4368099, 4683484, 5005572, 5326538, 5635768, 5920946, 6169836, 6370602, 6512021, 6585513, 6587260, 6518078, 6382361, 6188140, 5946910, 5671547, 5374195, 5066205, 4758445, 4459944, 4176568, 3911789, 3667953, 3446024, 3245294, 3064640, 2903479, 2760779, 2634275, 2521748, 2422130, 2334407, 2256516, 2186411, 2123177, 2066019, 2013240, 1963300, 1915847, 1870627, 1826574, 1783118, 1741255, 1702049, 1665154, 1629928, 1596732, 1565831, 1536344, 1507802, 1481647, 1459633, 1441658, 1426490, 1413514, 1402304, 1391579, 1380256, 1368661, 1357313, 1345462, 1332321, 1318691]
58555A318691j2910j2470j3056j3680j3830j4281j5081j5143j4395j4140j4732
58544A164973j5223j5625j6990j8876j9324j7944j6471j5799j5040j3948j3500
58533I86233j3473j2289r985q627q977r482r266r341j0075j0312r878j0118j1078
58520H53332j0980r424q158p757o571m111k360k358k418j253l5K27O64K203L705
58505H04706M094M172M901N895O813Q090R434R746R379R997J1646J2502J2112
58492I13487J1964J2250J1304R041P476O859M815O82k905m337n402p599r535r945
58478I38155j0033j0754j0865r711q890r261r246q150p928r660j1344j1366j1046
58465H09901j1544j1387r518p725p519p429o004m626m740m933l490j450n09j93
$$ y = [1318691, 1305781, 1293311, 1280255, 1266575, 1252745, 1238464, 1223383, 1208240, 1193845, 1179705, 1164973, 1149750, 1134125, 1117135, 1098259, 1078935, 1060991, 1044520, 1028721, 1013681, 999733, 986233, 972760, 960471, 950486, 941859, 932882, 923400, 914134, 904793, 894718, 884406, 874528, 864410, 853332, 842352, 832928, 824770, 817013, 810442, 806331, 803971, 801613, 799195, 797942, 797907, 798134, 798798, 801001, 804706, 808800, 812972, 817873, 823768, 830581, 838671, 848105, 857851, 867230, 877227, 888873, 901375, 913487, 925451, 937701, 949005, 958046, 965522, 972381, 977196, 977878, 974973, 970636, 965234, 957635, 948100, 938155, 928122, 917368, 906503, 896792, 887902, 878641, 869395, 861245, 853317, 843657, 832313, 820947, 809901, 798357, 786970, 777452, 769727, 762208, 754779, 748775, 744149, 739409, 734476, 730986, 729536, 729027, 728834]
58451G28834N44J146J157J755L497M844M906N197O819Q558R594J1210J3788J5208
58437H17057J4350J3093J2787J1848R205O713N637M148R81j775k430k861m898
58424H83855o791o515n535n937o671n952m691m314l862k344j215j467j089J403
58410H28875L837M026L607M851O551O600N821N706N150K951R09P82R42m22j641
58395H78545p50N82K05l10J327L582L720K556K468L030K714K597M237O022N666
58380I16191M244L944M026K975K251L847O217O743O132O496P222O716O055O929
58366I89988Q056P492O284O180O153M906M190N731P592P536P119Q404R641Q575
58352A087847O981P327P952O360M275M464N430M341K520K855M437M902N418Q056
$$ y = [728834, 729378, 730524, 731681, 733436, 736933, 741777, 746683, 751880, 758699, 767257, 776851, 788061, 801849, 817057, 831407, 844500, 857287, 869135, 878340, 885053, 890690, 894838, 895819, 894044, 891614, 888753, 883855, 877064, 870549, 865014, 859077, 852406, 846454, 841763, 837449, 833587, 831243, 830028, 828561, 827472, 828875, 832712, 836738, 840345, 845196, 851747, 858347, 864168, 869874, 875024, 877975, 878884, 879666, 880608, 880186, 878545, 877795, 878377, 878582, 878272, 879599, 883181, 886901, 889457, 891925, 894955, 897669, 900266, 904503, 910525, 916191, 920435, 924379, 928405, 931380, 933631, 937478, 943695, 950438, 956570, 963066, 970288, 977004, 983059, 989988, 998044, 1005536, 1011820, 1018000, 1024153, 1029059, 1033249, 1038980, 1046572, 1054108, 1061227, 1069631, 1079272, 1087847, 1094828, 1102155, 1110107, 1116467, 1120742, 1125206, 1130636, 1134977, 1137497, 1140352, 1144789, 1149691, 1155109, 1163165]
58338A163165J0878J0966R847J0587J2178J2055J1489J2904J4558J3639J1948
58327A294214J2775J4666J4159J2239J2146J3276J3112J2710J4308J6129J5562
58316A445296J4726J6756J9414J8743J6201J5622J6082J4559J2664J3579J5227
58305A618869J3858J1595J2828J5843J5904J4135J5209J8495J9726J9411K1379
58294A797252K4656K5097K3479K4002K6282K6648K5687K6699K8582K8113K7207
58283B083704K9846L4175L5745L6004L9119M3204M3778M2939M5663M9814M9789
58272B533780M7380M8601N2300N2606N0445N1590N5302N6041N4717N6980O1956
58261C121698O3957O3706O6507P1116P2067P1147P4563Q0754Q3257Q3500Q7984
$$ y = [1163165, 1174043, 1185009, 1194856, 1205443, 1217621, 1229676, 1241165, 1254069, 1268627, 1282266, 1294214, 1306989, 1321655, 1335814, 1348053, 1360199, 1373475, 1386587, 1399297, 1413605, 1429734, 1445296, 1460022, 1476778, 1496192, 1514935, 1531136, 1546758, 1562840, 1577399, 1590063, 1603642, 1618869, 1632727, 1644322, 1657150, 1672993, 1688897, 1703032, 1718241, 1736736, 1756462, 1775873, 1797252, 1821908, 1847005, 1870484, 1894486, 1920768, 1947416, 1973103, 1999802, 2028384, 2056497, 2083704, 2113550, 2147725, 2183470, 2219474, 2258593, 2301797, 2345575, 2388514, 2434177, 2483991, 2533780, 2581160, 2629761, 2682061, 2734667, 2785112, 2836702, 2892004, 2948045, 3002762, 3059742, 3121698, 3185655, 3249361, 3315868, 3386984, 3459051, 3530198, 3604761, 3685515, 3768772, 3852272, 3940256]
58250C940256R5044R7896R8555J04687J14650J20220J22280J28798J38983J45019
58240E106388J47988J55955J67696J74903J79137J89471K04570K14944K21770
58231F762822K35032K53926K68451K79554K97768L22478L43211L60930L86570
58222I510742M18992M46879M71987N07173N51885N94293O36943O94088P64358
58213A4597340Q34038R06857J000776J115959J238086J373176J544849J757430
58205B4368511J999132K281624K635346L063546L543678M075898M686232N386104
58197E2040071O184842P143770Q360763R904266J1826186J4224122J7199179K0755500
58189A47638699K4819332K9259529L3620075L6789325L7287819L4209943K7802945
$$ y = [3940256, 4035300, 4133196, 4231751, 4336438, 4451088, 4571308, 4693588, 4822386, 4961369, 5106388, 5254376, 5410331, 5578027, 5752930, 5932067, 6121538, 6326108, 6541052, 6762822, 6997854, 7251780, 7520231, 7799785, 8097553, 8420031, 8763242, 9124172, 9510742, 9929734, 10376613, 10848600, 11355773, 11907658, 12501951, 13138894, 13832982, 14597340, 15431378, 16338235, 17339011, 18454970, 19693056, 21066232, 22611081, 24368511, 26367643, 28649267, 31284613, 34348159, 37891837, 41967735, 46653967, 52040071, 58224913, 65368683, 73729446, 83633712, 95459898, 109684020, 126883199, 147638699, 172458031, 201717560, 235337635, 272126960, 309414779, 343624722, 371427667]
58182C71427667J8945286Q276664l762338j6107909k6848582l4189105l7537698
58175B80203985l7539039l5281048l1694905k7500241k3272019j9372561j5937178
58168H9606994j3002675j0587671q651444p089275n816202m798223l992278l326631
58160C2342595k757827k285909j898350j553680j230911r40787o76518m03508
58152B0595105j06518K02918N33370R17664J363948J852410K376646K914569L341726
58143C3991838L456150L142845K465690J556562M73356p64868k041139l127887
58135C9152547l829402m099954m023298l722443l302734k841250k389679j978854
58127A2964933j624728j330949j090906q95511p39191o16229n17373m35677l70560
$$ y = [371427667, 390372953, 398649617, 394887279, 378779370, 351930788, 317741683, 280203985, 242664946, 207383898, 175688993, 148188752, 124916733, 105544172, 89606994, 76604319, 66016648, 57365204, 50275929, 44459727, 39661504, 35669226, 32342595, 29584768, 27298859, 25400509, 23846829, 22615918, 21675131, 20998613, 20595105, 20488587, 20691505, 21224875, 22142539, 23506487, 25358897, 27735543, 30650112, 33991838, 37447988, 40590833, 43056523, 44613085, 45086441, 44321573, 42280434, 39152547, 35323145, 31223191, 27199893, 23477450, 20174716, 17333466, 14943787, 12964933, 11340205, 10009256, 8918350, 8022839, 7283648, 6667419, 6150046, 5714369, 5343809]
58118E343809l21411k83092k52099k30154k16853k05886j93337j82429j75147
58109C283401j66752j53563j38845j25804j12138r6464q3014p4785o8777o2672
58099B200587n9374o0460o2057o1571o1689o3602o3396n9310n5433n4033n1435
58088A548227m5686m0918l9620l7962l3498l0276l1231l2549l0784k8857k9686
58077A167160l0281k7688k4696k4267k3959k1188j8630j9074j9987j8331j5909
58066I23150j5204j4609j2401j0772j1357j1435q997o970q019r689r071p796q091
58053G88739q392p191o818q868j0181p962m863m468n459m780l038k329j921l37
58039G12132J135R81O25J684K910L048L554N419O576N530M228M325M104K170N28
$$ y = [5343809, 5022398, 4739306, 4487207, 4257053, 4040200, 3834314, 3640977, 3458548, 3283401, 3116649, 2963086, 2824241, 2698437, 2586299, 2489835, 2406821, 2332036, 2263259, 2200587, 2141213, 2080753, 2018696, 1957125, 1895436, 1831834, 1768438, 1709128, 1653695, 1599662, 1548227, 1502541, 1461623, 1422003, 1384041, 1350543, 1320267, 1289036, 1256487, 1225703, 1196846, 1167160, 1136879, 1109191, 1084495, 1060228, 1036269, 1015081, 996451, 977377, 957390, 939059, 923150, 907946, 893337, 880936, 870164, 858807, 847372, 838375, 831405, 823386, 813697, 804626, 796830, 788739, 780347, 773156, 766338, 757470, 747289, 739327, 734464, 729996, 724537, 719757, 716719, 714390, 712469, 712132, 713267, 714248, 714873, 716557, 719467, 722515, 726069, 731488, 738064, 743594, 747822, 752147, 756251, 758421, 758949]
58024G58949P88R30q85k718k491j773k665m120m515m723n595n681m340l757m961
58009G12443n488l902k784m113n606n055m323n372o212m774l164l884n214m606
57995F47946l399l891m658l247r02k36n50L43J785J760Q91J098K123K748L558
57980F45369N193O003M676L070L204L713K527P10K30L01o43j708j725k272m850
57965F63798p329p011n166m734n521n443m607m337l956k377j143k111l639k971
57951F03453q74j33p95p94l3Nk99O50K316K785K134J860J846R35l95r75j508l224
57933F06954n079n312m693n222o658p336p290p484p270n718m275m799o016n299
57919E24503k970j459j110k74J201K009K336L474M952N277N040O192Q526R958
$$ y = [758949, 759737, 760667, 759782, 757064, 754573, 752800, 750135, 746015, 741500, 736777, 731182, 725501, 721161, 717404, 712443, 706955, 703053, 700269, 696156, 690550, 685495, 681172, 675800, 669588, 664814, 661650, 657766, 652552, 647946, 644547, 640656, 635998, 632751, 631849, 631613, 631063, 631406, 633191, 634951, 635842, 636940, 639063, 641811, 645369, 650562, 656565, 661241, 664311, 667515, 671228, 673755, 674465, 674695, 674996, 674353, 672645, 670920, 668648, 663798, 656469, 649458, 644292, 639558, 634037, 628594, 623987, 619650, 615694, 613317, 612174, 610063, 606424, 603453, 602579, 602446, 601651, 600857, 600824, 600829, 600530, 601180, 603496, 606281, 608415, 610275, 612121, 613056, 612661, 611686, 610178, 606954, 601875, 596563, 591870, 586648, 579990, 572654, 565364, 557880, 550610, 544892, 540617, 535818, 529802, 524503, 521533, 520074, 518964, 518690, 519891, 521900, 524236, 527710, 532662, 537939, 542979, 549171, 557697, 567655]
57905E67655R996R984J0259R865Q900Q363P970O704N077M261L552J440j335k688
57891F50003k645l163m764o150o831p489p993p631p018p260p656o724n028m325
57877E65326m444l705k028p52J77J998M305N373N256N806P469Q669Q539P866P225
57862F17080O439N891O194O663O118M873L940K984J303l1K70P94q97m139n847
57847F51635n175m335m696n131m681m032l774l585l532m029m357l494k306k497
57833E96011l608l643k583k382l452m115l913m424o186p584p668p567q205q850
57819E21831q829q605q444p875o998o565o399n595m326l570l061j713P0Q12O08
57804D51341Q78J593J468Q99J762L917N034M474M349N834P425Q042Q935J1131
$$ y = [567655, 577651, 587635, 597894, 607759, 616659, 625022, 632992, 639696, 644773, 649034, 652586, 654026, 652691, 650003, 647358, 644195, 639431, 633281, 626450, 618961, 610968, 603337, 596319, 589059, 581403, 574679, 569651, 565326, 560882, 557177, 555149, 554397, 554574, 556572, 560877, 566250, 571506, 577312, 584781, 593450, 601989, 609855, 617080, 623519, 629410, 635604, 642267, 648385, 653258, 657198, 660182, 661485, 661454, 661724, 662518, 661621, 657482, 651635, 646460, 642125, 637429, 632298, 627617, 623585, 619811, 616226, 612694, 608665, 604308, 600814, 598508, 596011, 592403, 588760, 586177, 583795, 580343, 576228, 572315, 567891, 561705, 554121, 546453, 538886, 530681, 521831, 513002, 504397, 495953, 488078, 481080, 474515, 468116, 462521, 458195, 454625, 451564, 449851, 449921, 450733, 451341, 452219, 453812, 455280, 456179, 457941, 461858, 466892, 471366, 475715, 481549, 488974, 497016, 505951, 517082]
57790E17082J3458J4648J5183J5653J5325J3761J1893J0319Q328N698L474J958
57778F46780j27l223n696o303o013o122o321n981n620n669n267l779k064j045
57764E83550k19J126K447K898K701K604K841L399M224M679M006K781K560L577
57750F23174M334M010L646M183N042N486N859O605P382P991Q832R729R714Q699
57736G14686P955Q253Q984R693J0923J2820J4463J5353J6119J7095J7750J8142
57724H72236J9330K1608K3944K5803K7910L0486L2539L3654L4804L6593L8481
57713A197388M0463M3582M7897N1949N5216N9208O5018P1917P9416Q8606R9929
57702A900589J11710J22648J33995J47571J63314J80467J99440K20528K42168
$$ y = [517082, 530540, 545188, 560371, 576024, 591349, 605110, 617003, 627322, 635650, 641348, 644822, 646780, 646653, 643430, 637734, 631431, 625418, 619296, 612975, 606994, 601374, 595705, 590438, 586659, 584595, 583550, 583331, 584457, 586904, 589802, 592503, 595107, 597948, 601347, 605571, 610250, 614256, 617037, 619597, 623174, 627508, 631518, 635164, 639347, 644389, 649875, 655734, 662339, 669721, 677712, 686544, 696273, 705987, 714686, 722641, 730894, 739878, 749571, 760494, 773314, 787777, 803130, 819249, 836344, 854094, 872236, 891566, 913174, 937118, 962921, 990831, 1021317, 1053856, 1087510, 1122314, 1158907, 1197388, 1237851, 1281433, 1329330, 1381279, 1436495, 1495703, 1560721, 1632638, 1712054, 1800660, 1900589, 2012299, 2134947, 2268942, 2416513, 2579827, 2760294, 2959734, 3180262, 3422430]
57693C422430K62358K80574K96462L07809L11522L05621K88761K59239K16566
57684E951342J63146J02830L8622k6674q8774j42953j86316k17670k36062k41209
57674E116282k34618k18686j95088j65176j30939r4091n5330j6474J7267L9151
57664D062298M5164L5497J2563k0785o1079j03679j42745j71913j86413j85847
57654C283061j74181j56060j33875j08997q3850o0841m0194k0776k435J4122K9123
57643B545097M3577N7873P2047Q6943J03420J20773J37687J54483J72728J92666
57633C687294K12577K30731K46397K58667K65611K65037K55169K34554K02293
57624E858330J58833J06113M6967j5275p6962j34687j85599k27102k57101k75223
$$ y = [3422430, 3684788, 3965362, 4261824, 4569633, 4881155, 5186776, 5475537, 5734776, 5951342, 6114488, 6217318, 6255940, 6229266, 6140492, 5997539, 5811223, 5593553, 5357491, 5116282, 4881664, 4662978, 4467890, 4302714, 4171775, 4077684, 4022354, 4005880, 4023147, 4062298, 4107462, 4142959, 4155522, 4134737, 4073658, 3969979, 3827234, 3655321, 3468908, 3283061, 3108880, 2952820, 2818945, 2709948, 2626098, 2565257, 2525063, 2504287, 2501852, 2515974, 2545097, 2588674, 2646547, 2718594, 2805537, 2908957, 3029730, 3167417, 3321900, 3494628, 3687294, 3899871, 4130602, 4376999, 4635666, 4901277, 5166314, 5421483, 5656037, 5858330, 6017163, 6123276, 6170243, 6154968, 6078006, 5943319, 5757720, 5530618, 5273517, 4998294]
57614D998294k83126k82899k75823k63182k47077k29325k10339j90331j70762
57605B845430j53373j38409j24986j12685j01565r1190q1012p1369o3015n5938
57595A851888m9657m4124l9402l4976l0519k6756k4410k2814k0725j8036j5506
57584A524963j3407j1567j0260r607q623o239l025n66O31J407K372L387M472O028
57570A479966Q099J0322J2468J4309J5330J5499J5814J7070J8639J9615K0625
57559A647756K3130K7268L1649L5208L8103M1044M4791N0009N6584O3312O9336
57548B128190P5442Q2974R2003J01717J12031J23380J35484J47775J60738J75099
57538C334833J89949K03105K13293K20371K23414K20157K08623J88068J58310
$$ y = [4998294, 4715168, 4432269, 4156446, 3893264, 3646187, 3416862, 3206523, 3016192, 2845430, 2692057, 2553648, 2428662, 2315977, 2214412, 2123222, 2042210, 1970841, 1907826, 1851888, 1802231, 1758107, 1718705, 1683729, 1653210, 1626454, 1602044, 1579230, 1558505, 1540469, 1524963, 1511556, 1499989, 1489729, 1480122, 1471499, 1465260, 1462235, 1461669, 1462300, 1463707, 1466079, 1469466, 1473938, 1479966, 1488065, 1498387, 1510855, 1525164, 1540494, 1555993, 1571807, 1588877, 1607516, 1627131, 1647756, 1670886, 1698154, 1729803, 1765011, 1803114, 1844158, 1888949, 1938958, 1995542, 2058854, 2128190, 2203632, 2286606, 2378609, 2480326, 2592357, 2715737, 2851221, 2998996, 3159734, 3334833, 3524782, 3727887, 3941180, 4161551, 4384965, 4605122, 4813745, 5001813, 5160123]
57529E160123J19615P3725K3896k6562p5098j19334j56835j85809k05442k15725
57519D392554k17658k13295k04613j92465j77305j60427j43460j27109j11464
57510B844758r7028q4183p2244o0458m9467m0379l2843k5689j8932j3443q876
57499B341216l873J771O977J1491J6241K1555K6824L2127L8323M5250N1727N7810
57487B647439O5065P4089Q3642R3045J03533J16163J30004J43597J56898J70581
57477C784056J84455J97506K08580K16057K17783K12095J98325J75813J43663
57468E538333J02248N4130K824m8564r7171j40200j75784k03179k21674k30351
57458D580612k29698k22235k10720j96600j80785j64616j48954j33341j17350
$$ y = [5160123, 5279738, 5353463, 5377359, 5350797, 5275699, 5156365, 4999530, 4813721, 4608279, 4392554, 4174896, 3961601, 3756988, 3564523, 3387218, 3226791, 3083331, 2956222, 2844758, 2747730, 2663547, 2591303, 2530845, 2481378, 2440999, 2408156, 2382467, 2363535, 2350092, 2341216, 2337343, 2339114, 2346091, 2357582, 2373823, 2395378, 2422202, 2454329, 2492652, 2537902, 2589629, 2647439, 2712504, 2786593, 2870235, 2963280, 3066813, 3182976, 3312980, 3456577, 3613475, 3784056, 3968511, 4166017, 4374597, 4590654, 4808437, 5020532, 5218857, 5394670, 5538333, 5640581, 5694711, 5697535, 5648971, 5551800, 5411600, 5235816, 5032637, 4810963, 4580612, 4350914, 4128679, 3917959, 3721359, 3540574, 3375958, 3227004, 3093663, 2976313]
57449B976313j02036q8941p8255o8994o0497n2710m5436l8442l2143k7282k3869
57438B357708k1064j8099j4878j1790r238p279n547l706j966p56L5R21J895K456
57424B268692K610L082M181N348O153O932Q026R113R840J0452J1240J1942J2215
57411B369826J2218J2246J2293J2322J2586J3304J4303J5283J6093J6653J6889
57400B524016J6908J6910J7040J7561J8789K0314K0872J9852J8419J8033J8342
57389B727056J7980J7072J7167J8616J9907K0042J9872K0348K1077K1492K1941
57378B942570K2621K2695K1686K0667K0891K2055K2960K3123K2856K2406K2002
57367C186532K2165K3074K4165K4947K5601K6263K6501K6228K6240K7069K8061
$$ y = [2976313, 2874277, 2785336, 2707081, 2638087, 2577590, 2524880, 2479444, 2441002, 2408859, 2381577, 2357708, 2336644, 2318545, 2303667, 2291877, 2282639, 2275360, 2269813, 2266107, 2264141, 2263385, 2263420, 2264341, 2266236, 2268692, 2271302, 2274384, 2278565, 2283913, 2290066, 2296998, 2305024, 2314137, 2323977, 2334429, 2345669, 2357611, 2369826, 2382044, 2394290, 2406583, 2418905, 2431491, 2444795, 2459098, 2474381, 2490474, 2507127, 2524016, 2540924, 2557834, 2574874, 2592435, 2611224, 2631538, 2652410, 2672262, 2690681, 2708714, 2727056, 2745036, 2762108, 2779275, 2797891, 2817798, 2837840, 2857712, 2878060, 2899137, 2920629, 2942570, 2965191, 2987886, 3009572, 3030239, 3051130, 3073185, 3096145, 3119268, 3142124, 3164530, 3186532, 3208697, 3231771, 3255936, 3280883, 3306484, 3332747, 3359248, 3385476, 3411716, 3438785, 3466846]
57356C466846K8369K8132K7947K7910K7943K8341K9132K9616K9388K9083K9376
57345C782083K9943L0242L0501L1045L1425L1239L1092L1690L2569L2842L2702
57334D127373L3027L3885L4501L4589L4676L5189L6009L6831L7387L7455L7194
57323D518116L7184L7690L8202L8243L8167L8694M0034M1922M3944M5471M5894
57312D963561M5530M5597M6736M8149M8761M8544M8120M7860M8092M9344N1553
57301E491847N3717N5155N6378N7999N9650O0843O2050O3773O5419O6304O7091
57290F160226O8831P1155P2756P3383P3858P4315P3772P1633O8439O4882O0865
57279F934115N5895M9754M2619L4955K7305K0013J3290P669L825J707N55J62J241
$$ y = [3466846, 3495215, 3523347, 3551294, 3579204, 3607147, 3635488, 3664620, 3694236, 3723624, 3752707, 3782083, 3812026, 3842268, 3872769, 3903814, 3935239, 3966478, 3997570, 4029260, 4061829, 4094671, 4127373, 4160400, 4194285, 4228786, 4263375, 4298051, 4333240, 4369249, 4406080, 4443467, 4480922, 4518116, 4555300, 4592990, 4631192, 4669435, 4707602, 4746296, 4786330, 4828252, 4872196, 4917667, 4963561, 5009091, 5054688, 5101424, 5149573, 5198334, 5246878, 5294998, 5342858, 5390950, 5440294, 5491847, 5545564, 5600719, 5657097, 5715096, 5774746, 5835589, 5897639, 5961412, 6026831, 6093135, 6160226, 6229057, 6300212, 6372968, 6446351, 6520209, 6594524, 6668296, 6739929, 6808368, 6873250, 6934115, 6990010, 7039764, 7082383, 7117338, 7144643, 7164656, 7177946, 7185615, 7189440, 7191147, 7191702, 7191864, 7193105]
57266G193105M018P362J0115J2393J4762J7089J9187K1735K5292K9142L2247L4734
57254G421181L7210L9264M0123M0258M0875M2014M2551M2015M1101M0384L9649
57243G866625L8572L7113L5183L2745L0275K8436K7434K7222K7911K9352L0865
57232H211733L2093L3547L5550L7369L8373L9220M0800M2634M3603M3587M3191
57221H641700M2455M1170L9850L9005L7992L6019L3723L2259L1410L0178K8696
57210I034457K7856K7455K6584K5520K5313K5666K5219K3775K2299K0653J7577
57199I302374J3263R798Q397Q083P772P826Q572R101Q733Q387R312J1326J3267
57186I426211J4378J4462J3554J2194J1358J1453J1813J1586J0570R014P235N634
$$ y = [7193105, 7197123, 7204485, 7214600, 7226993, 7241755, 7258844, 7278031, 7299766, 7325058, 7354200, 7386447, 7421181, 7458391, 7497655, 7537778, 7578036, 7618911, 7660925, 7703476, 7745491, 7786592, 7826976, 7866625, 7905197, 7942310, 7977493, 8010238, 8040513, 8068949, 8096383, 8123605, 8151516, 8180868, 8211733, 8243826, 8277373, 8312923, 8350292, 8388665, 8427885, 8468685, 8511319, 8554922, 8598509, 8641700, 8684155, 8725325, 8765175, 8804180, 8842172, 8878191, 8911914, 8944173, 8975583, 9005761, 9034457, 9062313, 9089768, 9116352, 9141872, 9167185, 9192851, 9218070, 9241845, 9264144, 9284797, 9302374, 9315637, 9325435, 9333832, 9341915, 9349687, 9357513, 9366085, 9375186, 9383919, 9392306, 9401618, 9412944, 9426211, 9440589, 9455051, 9468605, 9480799, 9492157, 9503610, 9515423, 9527009, 9537579, 9546593, 9553828, 9559462]
57174I559462M430L316J920M40q75k486m734o771p615p975r544j2570j5653j8009
57160I483336k0291k3091k6239k9918l4774m0499m5809n0283n4757n9377o2760
57149I035538o3763o2770o0624n7572n3787m9706m5203l9641l3259k7453k3326
57138H518434k1120k1321k4809l1397l9611m8460n8160o8549p8174q5519q9942
57127G951372r0955q7926q1123p1979o2009n2563m5684m3499m6307n2547o0833
57116G255947p0430p9688q5994q7897q5695p9629o9415n5875m1036k5924r896
57105F564468P737K7523N1548Q2852J22744J70667K26777K91985L65550M46114
57095H357965N35587O38524P56856Q88706J032599J188262J351956J515990J675094
$$ y = [9559462, 9563892, 9567208, 9569128, 9569568, 9568693, 9566207, 9561473, 9554702, 9547087, 9539112, 9529568, 9516998, 9501345, 9483336, 9463045, 9439954, 9413715, 9383797, 9349023, 9308524, 9262715, 9212432, 9157675, 9098298, 9035538, 8971775, 8909005, 8848381, 8790809, 8737022, 8687316, 8642113, 8602472, 8569213, 8541760, 8518434, 8497314, 8475993, 8451184, 8419787, 8380176, 8331716, 8273556, 8205007, 8126833, 8041314, 7951372, 7860417, 7772491, 7691368, 7619389, 7557380, 7504817, 7459133, 7415634, 7369327, 7316780, 7255947, 7185517, 7105829, 7019835, 6931938, 6846243, 6766614, 6697199, 6641324, 6600288, 6574364, 6564468, 6572205, 6599728, 6651276, 6734128, 6856872, 7027539, 7254316, 7546301, 7911851, 8357965, 8893552, 9532076, 10288932, 11177638, 12210237, 13398499, 14750455, 16266445, 17941539]
57086A7941539J829538J981139K130943K280284K426599K560637K684217K833986
57078C6668882L057853L332404L505740L360356K766641J784350O18088n16350
57070E4577964j488653k259752k838806l247611l506384l630579l633198l530280
57062C0442701l343379l096463k812320k511761k212983j929541j669489j436911
57054A1429854j233236j057465r07060p79513o72584n83390n08695m46120l94054
57045D847737l50466l12994k80227k51874k27544k06194j86931j69528j54020
57036B707959j40300j28185j17413j07570r8436r0208q3042p6623p0524o4773
57026A730885n9646n5195n1409m8461m6408m4856m3291m1474l9247l6363l2902
$$ y = [17941539, 19771077, 21752216, 23883159, 26163443, 28590042, 31150679, 33834896, 36668882, 39726735, 43059139, 46564879, 49925235, 52691876, 54476226, 55094314, 54577964, 53089311, 50829559, 47990753, 44743142, 41236758, 37606179, 33972981, 30442701, 27099322, 24002859, 21190539, 18678778, 16465795, 14536254, 12866765, 11429854, 10196618, 9139153, 8232093, 7452580, 6779996, 6196606, 5687911, 5241791, 4847737, 4497271, 4184277, 3904050, 3652176, 3424632, 3218438, 3031507, 2861979, 2707959, 2567659, 2439474, 2322061, 2214491, 2116055, 2025847, 1942805, 1866182, 1795658, 1730885, 1671239, 1616044, 1564635, 1516174, 1469766, 1424910, 1381619, 1340145, 1300898, 1264535, 1231633]
57015A231633k9533k6969k5283k4011k2678k1039j9118j7220j5594j4005j1905
57004A004278r089n823k337J375N301R515J4484K0808K8770L8711N1530O8042
56992A225565Q8138J11430J37822J65348J87410J94828J82260J51299J06315M9519
56982B599934j7145q6384j45569j84112k00020j98835j87648j71066j51370j30148
56972A127637j08944q9050p1332n6171m3408l2570k3369j5820r790m740k15L639
56960F75867O565R056J1971J5172J7250J7055J4779J1087N878j215r493j7282
56948G56690k3220k6856k8210k7577k5645k3096j9994j6131j1835p809m247p16
56936E41354L117P257J1753J6750K2083K7185L1212L2930L0994K5046J6147N582
$$ y = [1231633, 1202100, 1175131, 1149848, 1125837, 1103159, 1082120, 1063002, 1045782, 1030188, 1016183, 1004278, 995189, 989366, 987029, 988404, 993705, 1003220, 1017704, 1038512, 1067282, 1105993, 1157523, 1225565, 1313703, 1425133, 1562955, 1728303, 1915713, 2110541, 2292801, 2444100, 2550415, 2599934, 2582789, 2496405, 2350836, 2166724, 1966704, 1767869, 1580221, 1409155, 1257785, 1127637, 1018693, 929643, 858311, 802140, 758732, 726162, 702793, 686973, 677183, 672443, 672228, 675867, 682432, 691488, 703459, 718631, 735881, 752936, 767715, 778802, 784680, 783465, 773972, 756690, 733470, 706614, 678404, 650827, 625182, 602086, 582092, 565961, 554126, 546317, 542070, 541354, 544471, 551728, 563481, 580231, 602314, 629499, 660711, 693641, 724635, 749681, 765828, 771410]
56924G71410o190j8597k9732l7340m0778m0951l8662l4388k9304k4932k1562j8309
56912D30665j4966j2442j1170j0313q989p212n320l573k477k354k340j089J200
56899C49620K751K705K381L464O014R014J1816J4294J6492J8836K1895K5387K8173
56886E12842K9683L0373L0306K8430K4016J7824J1011L827l763j0915j6349j9440
56874F37845k0256j9121j6736j3997j1084p378k762J811N733R808J5162K1872
56862F00897K9404L7501M5596N1961N4547N2412M5639L4495J9610K608j4333k9329
56850I31008m0790m7270m8230m4786l8844l1689k3744j5274o570K283J1322K0550
56838F67966L0244M0924N2680O4856P6553Q6578R2589R1374Q1007O2286L7521
$$ y = [771410, 765220, 746623, 716891, 679551, 638773, 597822, 559160, 524772, 495468, 470536, 448974, 430665, 415699, 403257, 392087, 381774, 372785, 365573, 360253, 356680, 354203, 351849, 349509, 348420, 349620, 352371, 355076, 357457, 360921, 366935, 375949, 387765, 402059, 418551, 437387, 459282, 484669, 512842, 542525, 572898, 603204, 631634, 655650, 673474, 684485, 688312, 684549, 673634, 657285, 637845, 617589, 598468, 581732, 567735, 556651, 549273, 546511, 548322, 554055, 563863, 579025, 600897, 630301, 667802, 713398, 765359, 819906, 872318, 917957, 952452, 972062, 974670, 960337, 931008, 890218, 842948, 794718, 749932, 711088, 679399, 655655, 640381, 633811, 636094, 647416, 667966, 698210, 739134, 791814, 856670, 933223, 1019801, 1112390, 1203764, 1284771, 1347057, 1384578]
56827A384578Q815k1548m9889p1999q5505r0663q9011q2079p1396n8783m5953
56816G26567l3873k2626j1860j496Q135J6989K5989L6294M7717N8211O5008O5877
56804I80932N9664M6577K8255O887j5733l7650n5774o7011p0766o9132o4333n7266
56792F84650m8695m0025l1954k3801j5276p519j310M430J1066J8185K4443K9388
56780F03582L2949L4035L1339K5075J6438N827o841k0342l2126m0179m3993m3995
56768E61769m1184l7155l3220k9418k5177k0729j6993j4291j2189j0416q979p542
56756C04476n699l826k739k498k360j946j618j694j969k120k091k032k167k613
56742B69104l093l113k721k532k720k579j610l61L28L51O9l22o39o09m76r07j753
$$ y = [1384578, 1393393, 1371845, 1321956, 1249957, 1164452, 1073789, 984778, 902699, 831303, 772520, 726567, 692694, 670068, 658208, 656712, 664847, 681836, 707825, 744119, 791836, 850047, 915055, 980932, 1040596, 1087173, 1115428, 1122315, 1106582, 1068932, 1013158, 946147, 875381, 806249, 741916, 684650, 635955, 595930, 563976, 540175, 524899, 517380, 516070, 520500, 531566, 549751, 574194, 603582, 636531, 670566, 701905, 726980, 743418, 749245, 742404, 722062, 689936, 649757, 605764, 561769, 520585, 483430, 450210, 420792, 395615, 374886, 357893, 343602, 331413, 320997, 312018, 304476, 298777, 294951, 292212, 289714, 287354, 285408, 283790, 282096, 280127, 278007, 275916, 273884, 271717, 269104, 266011, 262898, 260177, 257645, 254925, 252346, 250736, 250375, 250703, 251054, 251123, 250801, 250162, 249553, 249077, 248170, 246417]
56725B46417j937j200q34j684k607k197r97n48j055j513j526j445j160l19N64
56710B27959O56K66L74R08Q78O2p38j117j404j632j385p12j61J17L37K82l67j056
56692B23267q16L41J456J946J960J593Q43K46M53J199J585J312P66J75m26o66
56676B35234l49j85r00j890j970j164o19q49j328j646j855j727r56o7O2m34o74
56659B18683o09j072k171k926k734k148j895k023k215k189j755j127j003j592
56645A93224j906r90N54J346J144Q44R22J163J613K504L270L067K150J553J571
56630B12029J744K080K880L608L388K525K018J793R38l75r33n34k70o11q57p40
56614B28683r09j512j804j585j514j664j258k02N13M19J79K34K36J02K62N19J94
$$ y = [246417, 244480, 243280, 242446, 240762, 238155, 235958, 234961, 234413, 233358, 231845, 230319, 228874, 227714, 227395, 227959, 228615, 228881, 229255, 230163, 231041, 231103, 230365, 229248, 227844, 226212, 224827, 224115, 223954, 224071, 224408, 224690, 224323, 223267, 222451, 222792, 224248, 226194, 228154, 229747, 230590, 230836, 231289, 232488, 234073, 235385, 236151, 236326, 235900, 235234, 234885, 234700, 233800, 231910, 229940, 228776, 228157, 227308, 225980, 224334, 222479, 220752, 219796, 219729, 219791, 219357, 218683, 218074, 217002, 214831, 211905, 209171, 207023, 205128, 203105, 200890, 198701, 196946, 195819, 194816, 193224, 191318, 190328, 190882, 192228, 193372, 194216, 195138, 196301, 197914, 200418, 203688, 206755, 208905, 210458, 212029, 213773, 215853, 218733, 222341, 225729, 228254, 230272, 232065, 233003, 232628, 231695, 231161, 230891, 230280, 229423, 228683, 227774, 226262, 224458, 222873, 221359, 219695, 218437, 218235, 218748, 219167, 219346, 219580, 219816, 219918, 220180, 220699, 220893]
56597B20893l59L2J312K077J897J995K955L561K787J357L88o2j99L28J402J961
56581B42325J519J064J490K357K991L613M407M636L806K652K009J638J161J091
56567B76759J913L002L487L499L684M116M527M910N190M995M384M034M126L896
56553C32522K968K198K351K856K718J955J259P73J23p82j682k378k762k806k825
56538C36488l260m003m450m399m221m146m098m274m913n467n029l719k638k338
56524B79533k464k882l858m934n104m403l964m158m116l472l011l059k798j832
56510B29478r80p45m24M41J151J176J068J191R26K6n54j37N47O93O32Q64J051
56493B36404R35J024J448J373N17j0N84J420J462J212J694K704L311L310L121
$$ y = [220893, 220534, 220566, 221878, 223955, 225852, 227847, 230802, 234363, 237150, 238507, 238895, 238833, 238634, 238962, 240364, 242325, 243844, 244908, 246398, 248755, 251746, 255359, 259766, 264402, 268208, 270860, 272869, 274507, 275668, 276759, 278672, 281674, 285161, 288660, 292344, 296460, 300987, 305897, 311087, 316082, 320466, 324500, 328626, 332522, 335490, 337688, 340039, 342895, 345613, 347568, 348827, 349600, 349723, 348941, 347259, 344881, 342119, 339313, 336488, 333228, 329225, 324775, 320376, 316155, 312009, 307911, 303637, 298724, 293257, 288228, 284509, 281871, 279533, 277069, 274187, 270329, 265395, 260291, 255888, 251924, 247766, 243650, 240178, 237167, 234108, 231310, 229478, 228498, 227753, 227329, 227770, 228921, 230097, 231165, 232356, 233282, 233308, 232754, 232617, 233164, 233857, 234489, 235353, 236404, 237339, 238363, 239811, 241184, 241701, 241691, 242275, 243695, 245157, 246369, 248063, 250767, 254078, 257388, 260509]
56478B60509K959K937L231L480K903J707J208J868K418J840Q86P19J192J625K081
56463B91563K756L093K700K178K123K209K127K334K950L117K442J815J789J476
56449C24672K78o57j06J323K302K757L187L159K142R79Q48J288Q09r52k955m297
56433C34777m877m874m555m313m229l997l717l927m455m320l391k801l043k979
56419B79299j822o13n35j015q47j28L06L82M47K79l38q21o07qN38J083J353O91
56401B77644m99p07L41R95M17Q3J157K373K330K073L154M650M568L128K265K580
56385C06552L015L127L523M337N031N498N936N900M860L253J888Q77J01j24L0
56370C53804n25k122l321k970j967j568j259o1J294J476Q92R67J825K482K646
$$ y = [260509, 263468, 266405, 269636, 273116, 276019, 277726, 278934, 280802, 283220, 285060, 285946, 286665, 287857, 289482, 291563, 294319, 297412, 300112, 302290, 304413, 306622, 308749, 311083, 314033, 317150, 319592, 321407, 323196, 324672, 324950, 324293, 324187, 325510, 327812, 330569, 333756, 336915, 339057, 340036, 340884, 342172, 342981, 342029, 339074, 334777, 329900, 325026, 320471, 316158, 311929, 307932, 304215, 300288, 295833, 291513, 288122, 285321, 282278, 279299, 277477, 276864, 276329, 275314, 274467, 274339, 274645, 275027, 275474, 275753, 275415, 274594, 273987, 273979, 274517, 275600, 276953, 277644, 277145, 276438, 276779, 277774, 278191, 278274, 279431, 281804, 284134, 286207, 289361, 294011, 298579, 301707, 303972, 306552, 309567, 312694, 316217, 320554, 325585, 331083, 337019, 342919, 347779, 351032, 352920, 353797, 353898, 353774, 353804, 353279, 351157, 347836, 344866, 342899, 341331, 340072, 340011, 341305, 342781, 343673, 344640, 346465, 348947, 351593]
56355C51593K662K384J669J308J882K574K484K266K855L714L929M018M864N869
56341C94071N969N577N791O539P182P983R315J0350J0269R791R883J0023R405
56328E02148Q603Q316P800O374N053M805M594L217J582R48M46j175k863k943k104
56313E44801k051k448k011j330j675k109r32R74J439Q48J378L021L716L142L140
56298E49903M335N380N737O358P451Q115Q309Q874R675J0039J0644J2559J4859
56285F62238J5793J5906J7227J9728K1431K1946K3003K5450K8406L1463L5068
56274I17659L8707M1372M3832M7915N3492N8716O3268O8782P6045Q4281R3247
56263A587316J03550J14847J26064J37387J49778J62757J74928J86289J97635
$$ y = [351593, 354255, 356639, 358308, 359616, 361498, 364072, 366556, 368822, 371677, 375391, 379320, 383338, 388202, 394071, 400040, 405617, 411408, 417947, 425129, 433112, 442427, 452777, 463046, 472837, 482720, 492743, 502148, 510751, 519067, 526867, 533241, 538294, 543099, 547693, 550910, 552492, 553440, 553886, 552711, 549848, 546905, 544801, 542750, 540302, 538291, 536961, 535286, 533177, 532245, 533219, 534658, 535506, 536884, 539905, 543621, 546763, 549903, 554238, 559618, 565355, 571713, 579164, 587279, 595588, 604462, 614137, 624176, 634820, 647379, 662238, 678031, 693937, 711164, 730892, 752323, 774269, 797272, 822722, 851128, 882591, 917659, 956366, 997738, 1041570, 1089485, 1142977, 1201693, 1264961, 1333743, 1409788, 1494069, 1587316, 1690866, 1805713, 1931777, 2069164, 2218942, 2381699, 2556627, 2742916, 2940551]
56254B940551K08143K16094K21380K24577K24181K17780K05488J89215J69075
56245D816484J43789J14237Q3277N2126K0250j1269l9636o3675q4139j00740j12233
56234D818471j19378j24511j28060j28848j27737j27379j28201j28304j27568
56225C678485j28188j30675j33036j34428j36077j37970j38277j36747j35072
56216B468015j33244j29139j22565j16077j10793j04939r7529r0054q3426p6532
56206A403717o8952o1964n5868m9463m2928l8036l4748l0985k6437k3139k1423
56195I49774j8996j5056j1644r740p654m608k361j803j197O52K552L557M419N368
56181H93263N406M761M997N886N395L425K149J961Q57j473k837k758l468n546
$$ y = [2940551, 3148694, 3364788, 3586168, 3810745, 4034926, 4252706, 4458194, 4647409, 4816484, 4960273, 5074510, 5157787, 5209913, 5230163, 5218894, 5179258, 5115583, 5031444, 4930704, 4818471, 4699093, 4574582, 4446522, 4317674, 4189937, 4062558, 3934357, 3806053, 3678485, 3550297, 3419622, 3286586, 3152158, 3016081, 2878111, 2739834, 2603087, 2468015, 2334771, 2205632, 2083067, 1966990, 1856197, 1751258, 1653729, 1563675, 1480249, 1403717, 1334765, 1272801, 1216933, 1167470, 1124542, 1086506, 1051758, 1020773, 994336, 971197, 949774, 930778, 915722, 904078, 894338, 886684, 882076, 879715, 877912, 876715, 877367, 879919, 883476, 887895, 893263, 898669, 903430, 908427, 914313, 919708, 923133, 925282, 927243, 928100, 926627, 923790, 921032, 917564, 912018]
56167I12018o586n481m116l483k132J58J249P10R64K848M079L693L916N873P571
56152I21281Q091R566J2910J5602J6016J6236J8376K1573K4693K8588L3694L8854
56140A165480M4193N1711O1591P1616Q1530R3852J08946J23438J35076J44760
56130B082193J52211J54404J50287J42519J32676J19448J03560Q9330P8803O9085
56120C274516N7936M7142L7757K7126J3758M55j0466k0642l1593m1844n0968o1873
56108C241304p5991r0762j04520j18967j33789j44053j46419j43238j37325j27737
56098B018503j14179j00378q9038p8099o5674n4123m5562l8144l0349k4205k0654
56087A358098j6749j1149p243o982o798l724k66R03J834M449O180N060M151O262
$$ y = [912018, 905432, 899951, 895835, 892352, 890220, 890378, 891627, 892337, 893301, 896149, 900228, 903921, 907837, 913710, 921281, 929372, 938938, 951848, 967450, 983466, 999702, 1018078, 1039651, 1064344, 1092932, 1126626, 1165480, 1209673, 1261384, 1322975, 1394591, 1476121, 1569973, 1678919, 1802357, 1937433, 2082193, 2234404, 2388808, 2539095, 2681614, 2814290, 2933738, 3037298, 3126628, 3205431, 3274516, 3332452, 3379594, 3417351, 3444477, 3458235, 3458690, 3448224, 3427582, 3395989, 3354145, 3303177, 3241304, 3165313, 3074551, 2970031, 2851064, 2717275, 2573222, 2426803, 2283565, 2146240, 2018503, 1904324, 1803946, 1714908, 1636809, 1571135, 1517012, 1471450, 1433306, 1402957, 1378752, 1358098, 1341349, 1330200, 1322957, 1315975, 1309177, 1305453, 1305187, 1306090, 1307924, 1312373, 1318553, 1323613, 1327764, 1334026]
56073A334026R086J0005J0684J2655J3561J2182J1796J4040J5108J2719J0912
56062A466774J2945J5415J4758J3671J5395J7475J7053J6723J9215K1730K1454
56051A652608K1141K3480K5576K4876K4688K7791L0517K9497K8248L0721L4274
56040A953417L5527L6981M1217M4751M4485M4062M6992M9911M9479M9257N2535
56029B448614N5277N3677N1725N3624N5817N4466N3445N6708O0152N9548N9034
56018C062087O3032O7506O8171O9364P5505Q1916Q3728Q5486R1984R8386R9846
56007C947011J01839J09956J18686J21837J24644J33450J43082J47106J50876
55998E098487J61082J72163J76985J81021J91689K03729K10084K16791K31515
$$ y = [1334026, 1343112, 1353117, 1363801, 1376456, 1390017, 1402199, 1413995, 1428035, 1443143, 1455862, 1466774, 1479719, 1495134, 1509892, 1523563, 1538958, 1556433, 1573486, 1590209, 1609424, 1631154, 1652608, 1673749, 1697229, 1722805, 1747681, 1772369, 1800160, 1830677, 1860174, 1888422, 1919143, 1953417, 1988944, 2025925, 2067142, 2111893, 2156378, 2200440, 2247432, 2297343, 2346822, 2396079, 2448614, 2503891, 2557568, 2609293, 2662917, 2718734, 2773200, 2826645, 2883353, 2943505, 3003053, 3062087, 3125119, 3192625, 3260796, 3330160, 3405665, 3487581, 3571309, 3656795, 3748779, 3847165, 3947011, 4048850, 4158806, 4277492, 4399329, 4523973, 4657423, 4800505, 4947611, 5098487, 5259569, 5431732, 5608717, 5789738, 5981427, 6185156, 6395240, 6612031, 6843546]
55989F843546K48082K58590K69817K90583L14219L31507L49260L77390M09600
55980I692594M36596M65869N07745N54858N97294O44406P08612P82009Q53546
55971A5243529R34117J038492J158790J284347J430927J619986J847111K103976
55963B6661275K411760K795967L247299L746105M305503M952223N693777O553853
55955F0367762P613808Q968821J0674848J2790145J5418167J8635645K2423287
55948A56892483K6704965L1267592L5397769L7705168L6730545L1956967K4065985
55941C80721474J4117928K788759r325035k0946658l0234167l5845565l7704493
55934B63572243l6690855l3850460l0003980k5791970k1706938j8020469j4815284
$$ y = [6843546, 7091628, 7350218, 7620035, 7910618, 8224837, 8556344, 8905604, 9282994, 9692594, 10129190, 10595059, 11102804, 11657662, 12254956, 12899362, 13607974, 14389983, 15243529, 16177646, 17216138, 18374928, 19659275, 21090202, 22710188, 24557299, 26661275, 29073035, 31869002, 35116301, 38862406, 43167909, 48120132, 53813909, 60367762, 67981570, 76950391, 87625239, 100415384, 115833551, 134469196, 156892483, 183597448, 214865040, 250262809, 287967977, 324698522, 356655489, 380721474, 394839402, 397628161, 388303126, 367356468, 337122301, 301276736, 263572243, 226881388, 193030928, 163026948, 137234978, 115528040, 97507571, 82692287]
55927H2692287j2113882r916941q159993o738506n585369m671288l947706l350848
55919B8207754k852177k451911k130692j853412j611231j416038j260017j119344
55911A3512932r90662q87338q05557p27631o53004n94497n49046n01540m52712
55902G350945m15357l87516l55861l21297k96044k79093k58598k35090k19294
55893D582795k10047j96387j78796j67367j61381j50863j36277j27268j23758
55884C130651j16737j06134j00182r8566r3221q4457p9993p9441p5389o8472o5987
55873B162072o6978o3738n6852n4068n5238n2742m6091m2201m1751l8740l3152
55862A610521l1045l2269l0542k5538k2882k2597j9232j3110r910r413o006QK671
$$ y = [82692287, 70578405, 60661464, 52501471, 45762965, 40177596, 35506308, 31558602, 28207754, 25355577, 22903666, 20772974, 18919562, 17308331, 15892293, 14632276, 13512932, 12522270, 11634932, 10829375, 10101744, 9448740, 8854243, 8305197, 7803657, 7350945, 6935588, 6548072, 6192211, 5870914, 5574870, 5295777, 5037179, 4802089, 4582795, 4372748, 4176361, 3997565, 3830198, 3668817, 3517954, 3381677, 3254409, 3130651, 3013914, 2907780, 2807598, 2709032, 2615811, 2531354, 2451361, 2371920, 2296531, 2228059, 2162072, 2095094, 2031356, 1974504, 1920436, 1865198, 1812456, 1766365, 1724164, 1682413, 1643673, 1610521, 1579476, 1547207, 1516665, 1491127, 1468245, 1445648, 1426416, 1413306, 1403396, 1393983, 1387977, 1387985, 1390656]
55849A390656J635K297M892M163k66l623n992j2264k2059k9689l4313m0292m7360
55836A207785n0169m8040m5814m4637m0907l4675l0247k8061k4380j9298j6697
55825H24860j6323j4102j0208q592q926p291m415m661p139o533k675o22j288p07
55811G31378J218J80l746n480m059m017o708q347p832q470j0735j1082r210q980
55797F44110j0869j1007q865q493j0799j2017j1168j1714j4288j5031j2891j1617
55785E05351j2662j2836j0766r219r211q217n844n029n980n218k240q99k519l789
55771D10922l181l348n409o881p067q525j1318j1688q440n088l757k480l31L77
55757C33786r99j756j023j458l987o021o503p630r842j0414q663p405p577o668
$$ y = [1390656, 1392291, 1394588, 1399480, 1403643, 1403377, 1399754, 1393762, 1381498, 1359439, 1329750, 1295437, 1255145, 1207785, 1157616, 1109576, 1063762, 1019125, 978218, 943543, 913296, 885235, 860855, 841557, 824860, 808537, 794435, 784227, 775635, 766709, 759418, 755003, 750342, 743203, 736670, 733995, 733373, 732085, 731378, 732596, 732776, 729030, 723550, 719491, 715474, 708766, 700419, 692587, 684117, 673382, 662300, 653090, 644110, 633241, 622234, 613369, 604876, 594077, 582060, 570892, 559178, 544890, 529859, 516968, 505351, 492689, 479853, 469087, 459868, 450657, 442440, 436596, 431567, 425587, 420369, 418129, 417230, 414711, 410922, 407741, 404393, 398984, 392103, 385036, 376511, 365193, 353505, 345065, 339977, 336220, 333740, 333409, 333786, 332787, 331031, 330008, 328550, 324563, 318542, 312039, 304409, 294567, 284153, 275490, 268085, 260508, 253840]
55743B53840m129k985m202m804l459k683l487l204q68N19n63j406k08Q94L97K30
55727B23882J481J880R0j738k067k466l828m318l206k590l201k732l97J189P86
55712B02765Q76K983M985N340N774P384Q294P604P587R467J0946J0371R429R250
55698C03055P812L879k16k414l999o339q034p860p222p266o847n468m902n611
55684B48568n137k223Q68K277L250M755N158L725K821L957N077M331L233L392
55670B84052L426J887J95j18j65j143j828j160m94r42j212m13j08j415k858l318
55654B74386m082n790o526n296m265n032n863n224m863o497q385q301p217p063
55640A89982p306o658n941o383p124o932o402o179n270l289k109k911l967l507
$$ y = [253840, 249711, 246726, 242524, 237720, 234261, 231578, 228091, 224887, 224019, 224538, 223975, 222569, 222361, 223255, 223652, 223882, 225363, 227243, 227333, 225595, 223528, 221062, 217234, 212916, 209710, 207120, 203919, 201187, 200790, 201979, 202765, 203641, 206624, 211609, 216949, 222723, 230107, 238401, 246005, 253592, 263059, 274005, 284376, 293805, 303055, 310867, 314746, 314530, 312116, 308117, 301778, 293744, 285884, 278662, 271396, 264549, 259081, 254179, 248568, 243431, 241208, 242076, 244353, 247603, 252358, 257516, 261241, 264062, 268019, 273096, 277427, 280660, 284052, 287478, 289365, 289560, 289442, 289277, 288134, 286306, 285146, 284652, 283710, 282498, 282085, 281977, 280562, 277704, 274386, 270304, 264514, 257988, 252692, 248427, 243395, 237532, 232308, 227445, 220948, 212563, 204262, 197045, 189982, 182676, 176018, 170077, 163694, 156570, 149638, 143236, 137057, 131787, 128498, 126389, 123478, 119511, 116004]
55626A16004k454k165j941j070p41j668k242j405p47j486k017r42J87k91j099
55611I5923n90J69m10j428j417j065j367j317q3P60k12j600j650j185j539j823
55595H1166r32o2m95j033l38L92k31q85J11J648J842J175R08M96o97j168J95J486
55577H3578O81q55p90K33K71k36K48J048O23k57Q1J042J059O99J357K259J872
55560I2913R74J279K209K117J472J711K146J238j96j97Q25R72L74O22J484J395
55544A11338O55J040K598L620L576L388L220K488J714J853K276J722P52Q48J666
55529A42754J534K36j027j911k969l937m191m296n130o008n712m697m229m276
55515I6141m151m314n376o321n898m825m468m411l560k507k445k775k236j337
$$ y = [116004, 113550, 111385, 109444, 108374, 107633, 105965, 103723, 102318, 101571, 100085, 98068, 97126, 97313, 97022, 95923, 95333, 95502, 95092, 93664, 92247, 91182, 89815, 88498, 88415, 89175, 88963, 87363, 85713, 84528, 82989, 81166, 80234, 80172, 79677, 78644, 78306, 78698, 78467, 77582, 77693, 79341, 81183, 82358, 83266, 83762, 83065, 81897, 82092, 83578, 84259, 83404, 82614, 82847, 83118, 82882, 83130, 84178, 84801, 84544, 84625, 85667, 86726, 87425, 88782, 91041, 92913, 93887, 95166, 97375, 99492, 100964, 102675, 104821, 106059, 105863, 105666, 106491, 107463, 107837, 108459, 109943, 111338, 111993, 113033, 115631, 119251, 122827, 126215, 129435, 131923, 133637, 135490, 137766, 139488, 140240, 141088, 142754, 144288, 144524, 143497, 141586, 138617, 134680, 130489, 126193, 121063, 115055, 109343, 104646, 100417, 96141, 91990, 87676, 82300, 75979, 70081, 65256, 60788, 56377, 52817, 50310, 47865, 45090, 42854, 41517]
55501D1517j273j443n92O56Q80N10P30Q91k61j798j885r66q06j194o38M72M16
55484C5216n82p40O3L45n9n4P3r11k288j925K24J993K350K225K020J124l6j64
55466C8874M74K95p43j030k28K56j39m79m61p27r47p3J285J251j96r55q4J030
55448C7403J236J050R61N13k57m31P5K32k42m38k5K43M9o3k3l19o76l24L54J90
55428C9508p45j181o82Q6R30K133K981K359P96rL17O30M66M21M13l43j510j853
55410D4717j374j292j771j660o55K08M08N00P07P72J100K199L129K491Q66J34
55394E0479M41J24j303k377k183j453q03o9L94j53j031n96J123K220J807R78N62
55377D8160M6p29q69j75K97Q6N6P15J380J466J135M01q03j683j338n47r31k342
$$ y = [41517, 40244, 38801, 38209, 38865, 39745, 40255, 40985, 41876, 41615, 39817, 37932, 36966, 36160, 34966, 34328, 34800, 35216, 34634, 33894, 33957, 34302, 34243, 34189, 34262, 33351, 31063, 29138, 29362, 31355, 33705, 35930, 37950, 39074, 39038, 38874, 39348, 39643, 38900, 37870, 37642, 37898, 37759, 37280, 36819, 36092, 35145, 35072, 36357, 37608, 37412, 36457, 36373, 37403, 38639, 39689, 40650, 41163, 40906, 40475, 40550, 40782, 40540, 40102, 40077, 40320, 40369, 40306, 40283, 39964, 39288, 38964, 39318, 39508, 38763, 37582, 36900, 36986, 37916, 40049, 43030, 45389, 46185, 46176, 46493, 47123, 47589, 48010, 48423, 48080, 46570, 44717, 43343, 42051, 40280, 38620, 37965, 38173, 38581, 39081, 39788, 40560, 41660, 43859, 46988, 49479, 50345, 50479, 50920, 51044, 49741, 47364, 45181, 43728, 42925, 42856, 43250, 43097, 42066, 41470, 42593, 44813, 46620, 47598, 48160, 48206, 47477, 46608, 46433, 46730, 46816, 46872, 47587, 48967, 50433, 51568, 51969, 51166, 49483, 48145, 47598, 46667, 44325]
55359D4325l042k539k066k138j878j060o14o16j1J190J578P94J87M20N49O9j76
55342C4972J34Q5o03r09m80k77o30n81Q9J82p36j460j256r42j011o23N41J313
55324B7808J011O30R74J242O38j93m09l22m84o59n38l21N5R99K076K118J037K6
55306C5688l75q61j614j723r64l55l60k26L04L57k94o09j14L92N83J202K230K354
55288C5615J184J96M90J311J690J766J665P96o84j444r95n33q84j255r95p63r53
55271C6207o82M79J374J052K04k19l86o02m60N8R6n45q89n48l84o65m22M77O47
55252C4792l90j118n43K15J80K87J297J993J200p0l74j56m61q94p02n71j297j944
55234C1444j229J87P56M81N08J055J460J694K141K396J744M98l59m33Q6R81J702
$$ y = [44325, 41283, 38744, 36678, 34540, 32662, 31602, 30988, 30372, 30361, 31551, 33129, 33923, 34110, 34530, 35079, 35148, 34972, 35106, 35191, 34588, 33679, 33199, 32922, 32292, 31711, 31800, 31982, 31246, 29786, 28530, 27588, 26577, 25954, 26495, 27808, 28819, 29449, 30423, 31665, 32303, 32110, 31701, 31379, 30895, 30236, 29698, 29377, 29432, 30431, 32507, 34625, 35662, 35688, 35313, 34452, 32838, 31115, 30151, 29796, 29436, 29210, 29514, 29871, 29577, 28968, 28854, 29246, 29829, 31031, 33261, 35615, 36799, 36995, 37485, 38796, 40486, 42252, 43917, 44713, 44029, 42585, 41590, 41057, 40173, 38918, 37923, 37160, 36207, 35525, 36004, 37378, 38430, 38634, 38415, 38029, 37427, 36967, 37025, 37121, 36576, 35687, 35139, 34755, 34090, 33668, 34145, 34792, 34402, 33284, 32741, 32956, 33136, 33423, 34720, 36713, 37913, 37843, 37469, 37313, 36852, 35958, 35256, 34685, 33388, 31444, 30215, 30402, 31158, 31639, 32147, 33202, 34662, 36356, 38497, 40893, 42637, 43135, 42776, 42343, 42429, 43410, 45112]
55217D5112J345j3r31m64N12Q04N97O17O96M47L24P56J085N70l64r31j103j073
55199D7986n73K84N60r0o63m39j52n19q56m18K12K73K13O32J001O68P5k56o64
55180D7274j184q55M63J124Q2j210j014rJ51l98m01Q6J15r7K97Q47M59m95p13
55161D4522k68m28j409k107j977j570j185n28K96P63Q90J114J306R71K31l27n06
55144C9788m12M1P25R72N09N8J51K30j47k27O03J484J363P59P38J052Q02K17J58
55125D8864M79M36J68K40K96l11j057r35j58L62O37J203J565Q38m00o53K22Q73
55107E2669N99J19R8L08M69P18J062J242J250J229J053O77O25J240J935J967J495
55090F8755J085P41L23J85M94O06J32j61L87J077J021O88R19J273Q70J01p1J30
$$ y = [45112, 46457, 46444, 45513, 45049, 45561, 46365, 46962, 47579, 48275, 48722, 49046, 49802, 50887, 51457, 51093, 50162, 49059, 47986, 47413, 47697, 48257, 48167, 47504, 47065, 46913, 46394, 45538, 45120, 45332, 45605, 45818, 46450, 47451, 48119, 48194, 47938, 47274, 46090, 45235, 45698, 46822, 46904, 45694, 44680, 44671, 44822, 44424, 44023, 44109, 44224, 44127, 44424, 45271, 45730, 45235, 44522, 44254, 43826, 42417, 40310, 38333, 36763, 35578, 35050, 35346, 36109, 36999, 38113, 39419, 40390, 40621, 40294, 39788, 39376, 39417, 40142, 41114, 41623, 41681, 41832, 42062, 41915, 41688, 42291, 43775, 45138, 45897, 46635, 47687, 48489, 48706, 48864, 49343, 49779, 49947, 50187, 50483, 50172, 49115, 48180, 48022, 48384, 49021, 50224, 51789, 52627, 52227, 51574, 51796, 52669, 53268, 53387, 53485, 53793, 54262, 54980, 56042, 57284, 58534, 59763, 60816, 61493, 62118, 63358, 65293, 67260, 68755, 69840, 70581, 70904, 71089, 71583, 72189, 72321, 72160, 72547, 73624, 74645, 75333, 76252, 77525, 78395, 78496, 78425, 78555]
55072G8555j47o48m69K12M47K12K31N06N18M92R67J466J152M87O05J361J531P89
55054H8267m1n31r69j318j279j215j626k008j572q04p39j093p36K17M79k23p83
55037G4026o43m86q45j336j543j494j147l98M11R25J434K124K242J202o2k46L77
55020G4541O91O97J074J338N12p95j020k74j94j122j565q35j30m13j008j038p21
55003F9738n09l04q7k48p55j002q19o07l81K48J141J767K247K972L466K955J917
54986H1739J440J306M68o64m91R77J753Q95j06K00J167J552J486J730K161K210
54970I7823K049K316L183M318N319N788N615N377N812O818P742Q551R770J1324
54956A81805J2550J3403J4456J5680J6297J5893J4514J1778P231J668l276p045
$$ y = [78555, 78408, 77760, 77291, 77503, 77950, 78162, 78393, 78899, 79417, 79909, 80876, 82342, 83494, 83981, 84586, 85947, 87478, 88267, 88226, 87695, 86726, 85408, 84129, 82914, 81288, 79280, 77708, 76904, 76165, 75072, 74336, 74553, 75032, 74809, 74026, 73383, 72897, 72052, 70716, 69173, 67679, 66532, 66134, 66545, 67470, 68904, 71028, 73270, 74472, 74410, 74164, 74541, 75232, 75929, 77003, 78341, 78853, 78058, 77038, 76764, 76570, 75448, 73883, 73048, 72918, 72505, 71497, 70459, 69738, 69229, 68925, 68838, 68590, 67835, 66833, 66014, 65407, 65026, 65274, 66415, 68182, 70429, 73401, 76867, 79822, 81739, 83179, 84485, 84953, 84289, 83798, 84775, 86528, 87423, 87317, 87517, 88684, 90236, 91722, 93452, 95613, 97823, 99872, 102188, 105371, 109689, 115008, 120796, 126411, 131788, 137600, 144418, 152160, 160711, 170481, 181805, 194355, 207758, 222214, 237894, 254191, 270084, 284598, 296376, 303607, 305275, 301999, 294954]
54944B94954j0364j3474j5544j6143j5873j5257j4235j3020j2151j1429j0069
54933A47395q122o456n225l764k153j328j350j111j64O46Q16R64J560K274L039
54918A27021M305N920P117Q066R818J2349J4230J4773J4863J5015J4372J2396
54906B60245R885P356M014o61n667r762j2788j4837j5511j4934j4304j4332j4278
54893A64426j3299j1652r750p408m918l516l657m020l327k047j259r66o38m43
54879I7526o98j003r82j071j644k154k084j843j916j983j755j648j783j398k80
54864G5284L88l29j610k205k173k121j733n93M30K59n64o63k8J15n54r65m19M41
54846F2960O92K54l59o73m85J34Q34J318J569J629J382Q57L79K16L39O82J231
$$ y = [294954, 284590, 271116, 255572, 239429, 223556, 208299, 194064, 181044, 168893, 157464, 147395, 139273, 132817, 127592, 123828, 121675, 120347, 118997, 117886, 117722, 118368, 119184, 120148, 121708, 123982, 127021, 131326, 137246, 144363, 152429, 162247, 174596, 188826, 203599, 218462, 233477, 247849, 260245, 270130, 277486, 281500, 280839, 275172, 265410, 252622, 237785, 222274, 207340, 193036, 178704, 164426, 151127, 139475, 129725, 122317, 117399, 113883, 110226, 106206, 102879, 100832, 99573, 98607, 97969, 97526, 96828, 95825, 94843, 93772, 92128, 89974, 87890, 86047, 84131, 82148, 80393, 78745, 76962, 75564, 75284, 75672, 75343, 73733, 71528, 69355, 67234, 65501, 64908, 65338, 65597, 65033, 64370, 64342, 64457, 63903, 62938, 62519, 62960, 63652, 63906, 63547, 62874, 62389, 62523, 63357, 64675, 66244, 67873, 69255, 70112, 70491, 70707, 71046, 71728, 72959]
54829G2959J728J802J487J121P30K17K7O88J712K010J542J395J969K436K336K398
54813I6557L128L933M328M857N955P018P497P905Q844J0021J1034J2186J3618
54800A96881J4647J4817J4726J4815J4339J2494R719O818L634k63m319p566r904
54787B80838j1833j3328j3934j3555j2386j0563q551p232o901o773o122n197m374
54774A60089l291j681k02N06R17J803L018L990M791N809O959Q022R206J0628J1904
54759B22468J3015J4704J7295J9777K0987K0896J9990J8187J5408J2276R207N522
54747D09732O12m758r414j3329j7064k0248k1904k1881k0936j9693j8434j7385
54735B25298j6335j4518j1788r280p985p335o277m987m412m605m784m617m302
$$ y = [72959, 74687, 76489, 77976, 79097, 79827, 80044, 80071, 80759, 82471, 84481, 86023, 87418, 89387, 91823, 94159, 96557, 99685, 103618, 107946, 112803, 118758, 125776, 133273, 141178, 150022, 160043, 171077, 183263, 196881, 211528, 226345, 241071, 255886, 270225, 282719, 292438, 299256, 302890, 302627, 298308, 290742, 280838, 269005, 255677, 241743, 228188, 215802, 205239, 196688, 189456, 182555, 175782, 169660, 164463, 160089, 156798, 155117, 154915, 155421, 156338, 158141, 161159, 165149, 169940, 175749, 182708, 190730, 199936, 210564, 222468, 235483, 250187, 267482, 287259, 308246, 329142, 349132, 367319, 382727, 395003, 404210, 409732, 410344, 405586, 396172, 382843, 365779, 345531, 323627, 301746, 280810, 261117, 242683, 225298, 208963, 194445, 182657, 173377, 165392, 158057, 151780, 146793, 142381, 137776, 132992, 128375, 124073]
54722A24073l746k750j728j221j021o41k26j55k14o2K0k95o09n99p88j560k063
54705A06415j343R7J022J250J391J452J028N12O47J192J312J073J225J751J863
54690A20887J351P74L99P3KN27J255J458J109P01L20o0J46J360K694K884K125
54673A38005J699K007K299K338K840M051N118N240M585L869L765M651O142P045
54659A93654O644N782N771O533O961O820O926P539P951P865P947Q640R517J0171
54645B98721J0907J2177J3890J5534J6452J6015J4083J1234Q023M223n83o005
54633D14671j1058j5134j8012j9464j9608j9302j9230j8979j7879j6221j4634
54622B25150j2897j0554q247p032o678o067n034m357m014k991j001R54K042K431
$$ y = [124073, 120327, 117577, 115849, 114628, 113607, 112966, 112740, 112585, 112371, 112309, 112329, 112034, 111425, 110826, 110038, 108478, 106415, 105072, 105169, 106191, 107441, 108832, 110284, 111312, 111824, 112471, 113663, 114975, 116048, 117273, 119024, 120887, 122238, 123012, 123411, 123484, 123486, 124013, 125268, 126726, 127835, 128536, 128856, 128796, 128942, 130302, 132996, 135880, 138005, 139704, 141711, 144010, 146348, 149188, 153239, 158357, 163597, 168182, 172051, 175816, 180467, 186609, 193654, 200298, 206080, 211851, 218384, 225345, 232165, 239091, 246630, 254581, 262446, 270393, 279033, 288550, 298721, 309628, 321805, 335695, 351229, 367681, 383696, 397779, 409013, 417036, 421259, 420676, 414671, 403613, 388479, 370467, 351003, 331395, 312093, 292863, 273884, 256005, 239784, 225150, 212253, 201699, 193452, 186420, 179742, 173675, 168641, 164284, 160270, 157279, 156278, 157232, 159274, 161705]
54608A61705K447K043J405J075J184J334J349J335J141N43j44o05j364k999m791
54593A65658n391m747m020l774l543l250l489m199m397l674k804k514k698l007
54579A14151l262l095k262j424j493k168k303j728j402j631j615j005m90m20k19
54564H9634L77P83P86R08J147O85n01j125m54N75R60J103J703K324K245J840J934
54547A04924K392K502K317K565L422M225M385L988L611L828M836O216P280P708
54533A64199P680P432P088O821O586N838M164K056K93j356l752o739q969r613
54519A81728r294q993q881q688q339p769o801n565m467l541k498j515j188j509
54505A02680j715j373q38m78k74l28q10j261r36k4M15nn05m91k94k09Q6P01J117
$$ y = [161705, 164152, 166195, 167600, 168675, 169859, 171193, 172542, 173877, 175018, 175561, 175417, 174812, 173448, 170449, 165658, 160267, 155520, 151500, 147726, 144183, 140933, 137444, 133245, 128848, 125174, 122370, 119856, 117158, 114151, 110889, 107794, 105532, 104108, 102615, 100447, 98144, 96416, 95014, 93383, 91768, 90763, 90273, 89853, 89634, 90011, 90794, 91580, 92488, 93635, 94320, 93819, 92694, 92240, 92815, 93775, 94878, 96581, 98905, 101150, 102990, 104924, 107316, 109818, 112135, 114700, 118122, 122347, 126732, 130720, 134331, 138159, 142995, 149211, 156491, 164199, 171879, 179311, 186399, 193220, 199806, 205644, 209808, 211864, 212157, 210801, 207049, 200310, 191341, 181728, 172434, 163441, 154560, 145872, 137533, 129764, 122963, 117398, 112931, 109390, 106892, 105377, 104189, 102680, 100965, 99592, 98754, 98276, 98002, 97674, 96864, 95603, 94667, 94643, 95058, 95053, 94548, 94057, 93763, 93554, 93640, 94341, 95458]
54486I5458J101J150J594K095K452K861L138K660J533P04N04K50k90l27L32N36
54470A15751l88j342j152m61o18j433j545n84L81M29k46r42j196r29m44k51n72
54453A04458j061j323j346j240r29m24OK00K02o4o73j171r60l94n29j506k162
54436I1084j762j072j026j260r35k27N0j87k39K67J007J537J633J272O87L03K53
54419I1385K30K7j26L8M79J101J837K371K340J967J829J926J713J286J490K525
54403A12418L398L337K877K888L275L356K932K396K231K759L925N032N283M829
54389A60936M466M237L357J836Q77J057J335O63m77j141j527k408l691m701n282
54374A59537n643n574m827l837l200k804k279j856j998k445k500j944j122l90
$$ y = [95458, 96559, 97709, 99303, 101398, 103850, 106711, 109849, 112509, 114042, 114746, 115250, 115500, 115210, 114883, 115215, 115751, 115363, 114021, 112869, 112408, 111790, 110357, 108812, 108228, 108609, 109038, 108792, 107850, 106654, 105725, 105281, 105030, 104458, 103397, 102074, 100728, 99488, 98559, 98135, 98141, 98341, 98543, 98479, 97806, 96635, 95675, 95281, 94752, 93246, 91084, 89322, 88250, 87224, 85964, 85029, 84802, 84852, 84665, 84426, 84693, 85700, 87237, 88870, 90142, 90829, 91132, 91385, 91615, 91642, 91516, 91554, 92033, 93134, 94971, 97342, 99682, 101649, 103478, 105404, 107117, 108403, 109893, 112418, 115816, 119153, 122030, 124918, 128193, 131549, 134481, 136877, 139108, 141867, 145792, 150824, 156107, 160936, 165402, 169639, 172996, 174832, 175709, 176766, 178101, 178764, 178287, 177146, 175619, 173211, 169520, 164819, 159537, 153894, 148320, 143493, 139656, 136456, 133652, 131373, 129517, 127519, 125074, 122574, 120630, 119508, 119118]
54360A19118j8j61m81k39O52J290R82K02k27j91P3O69J556K082J803J348J552
54343A30010K277K852L180L619M140M396M362M258M133L954L731L233K158Q92
54329A77195K70K35l44j934l519m182m454n118n833o040o159o652o776n758m373
54314A16558l855l902l337k287j980k603l054k808k527k654k771k593k424k332
54300G7431j992j528j476j674j248j6J048J119N29M6j19j39m8J80L50K33j47n30
54282G2019o27l35J28M22N62Q68J293J326Q13L67M69P30N63Q2k60l77l24J33R93
54263G8845J595J423R47R03J133R97N35L61N90O73K62m20r34r44l89L32O75O77
54245H7261Q36J101P90j38p15m34l2j05j12L39L77p13k058k433k093j987j981
$$ y = [119118, 119100, 118939, 118458, 118219, 118871, 120161, 121143, 121345, 121118, 120927, 121000, 121669, 123225, 125307, 127110, 128458, 130010, 132287, 135139, 138319, 141938, 146078, 150474, 154836, 159094, 163227, 167181, 170912, 174145, 176303, 177195, 177465, 177700, 177356, 175422, 171903, 167721, 163267, 158149, 152316, 146276, 140117, 133465, 126689, 120931, 116558, 112703, 108801, 105464, 103177, 101197, 98594, 95540, 92732, 90205, 87551, 84780, 82187, 79763, 77431, 75439, 73911, 72435, 70761, 69513, 69497, 70545, 71664, 72193, 72239, 72120, 71981, 71933, 72113, 72463, 72696, 72549, 72019, 71392, 71057, 71185, 71607, 72169, 73037, 74330, 75656, 76469, 76836, 77305, 78035, 78598, 78680, 78420, 78043, 77719, 77852, 78845, 80440, 81863, 82810, 83713, 84846, 85843, 86378, 86739, 87329, 88002, 88264, 87844, 86910, 85966, 85577, 85909, 86584, 87261, 88097, 89198, 89988, 89850, 89135, 88701, 88669, 88564, 88452, 88791, 89168, 88455, 86397, 83964, 81871, 79884, 77903]
54228G7903j367m09J60N27J180J521P62l81n81l7L4l66j67O33R66P12P58R91K74
54209H3113j321k242j878j385j491j317j92J001J244Q25M34N6m25o31m95o68j350
54192G3278j702j088j28K50Nl21l84k3P84J540J536R25N67O59M46k79n64K52J428
54173G7181J887J528R07K80l64r19j286j414j085k33N24N63M21J103K155J877
54157H3125j04j950k059j052m53n57p69r70j325j385n57Q24J805J888J228K04
54141G7893o00n50K94J026J007O21M80N60O39Q88J362J519R34l6q22j315j446
54124H2454r03J12N89L2o71n31K1p2p57j032n64p5k02q27j548k056k100j617r42
54105F9311l91J68Q76J321R94J67l45k25Q5J10j00j83O5M29M02k42r37q11J47
$$ y = [77903, 76536, 76127, 76287, 76814, 77994, 79515, 80277, 79896, 79315, 79278, 79312, 78946, 78779, 79412, 80378, 81090, 81848, 82839, 83113, 81792, 79550, 77672, 76287, 74796, 73479, 73287, 74288, 75532, 76357, 76791, 76847, 76422, 75791, 75296, 74628, 73278, 71576, 70488, 70360, 70610, 70615, 70294, 69910, 69887, 70671, 72211, 73747, 74672, 75239, 75898, 76344, 76065, 75501, 75753, 77181, 79068, 80596, 81503, 81783, 81419, 80500, 79214, 77800, 76715, 76482, 77006, 77569, 77990, 79093, 81248, 83125, 83021, 81071, 79012, 77960, 77507, 76950, 76181, 75211, 73886, 72501, 71944, 72768, 74573, 76461, 77689, 77893, 77293, 76743, 77037, 78063, 79070, 79691, 80171, 80731, 81370, 82258, 83620, 85139, 86073, 86037, 85215, 83900, 82454, 81551, 81663, 82252, 82284, 81613, 81082, 81103, 81031, 80274, 79242, 78678, 78603, 78401, 77574, 76026, 73970, 71870, 70253, 69311, 68920, 69088, 69964, 71285, 72279, 72446, 72101, 71876, 71961, 72071, 71971, 71788, 71853, 72282, 72684, 72442, 71505, 70694, 70841]
54086G0841R15P68J53j68k40n21q37o04J65Q38J089J186J330J269P73O2l88k90
54068G6341J98N58L67j97m81j11O17J192J446J399J014M13P7L11Q01R90P85N25
54050H6245L98L06K35L38O09P53N18J07P2O95J534J823J406J019J359K251L023
54033A02691L377L406L117K633K630L666N199O100O168O226O701P059O873O442
54019A72288N959N075L777K873K934L446L619L409L192K983K593K132J789J522
54005B17591J324J281J080J24j420k437k280j676j587j903k027k101k640l397
53991A99932l601l126k569k292k123j977j988k049j859j442j182j291j632j996
53977A70805k173j942j381j049j348j899j971j457r72j010j404j615j318o44o0
$$ y = [70841, 71756, 72524, 72677, 72509, 72269, 71748, 70911, 70307, 70472, 71310, 72399, 73585, 74915, 76184, 76957, 77019, 76631, 76341, 76539, 77097, 77464, 77267, 76786, 76675, 77292, 78484, 79930, 81329, 82343, 82756, 82833, 83144, 83945, 84935, 85720, 86245, 86643, 86949, 87184, 87522, 88131, 88884, 89402, 89509, 89581, 90276, 91810, 93633, 95039, 96058, 97417, 99668, 102691, 106068, 109474, 112591, 115224, 117854, 121520, 126719, 132819, 138987, 145213, 151914, 158973, 165846, 172288, 178247, 183322, 187099, 189972, 192906, 196352, 199971, 203380, 206572, 209555, 212148, 214280, 216069, 217591, 218915, 220196, 221276, 221400, 219980, 217543, 215263, 213587, 212000, 210097, 208070, 205969, 203329, 199932, 196331, 193205, 190636, 188344, 186221, 184244, 182256, 180207, 178348, 176906, 175724, 174433, 172801, 170805, 168632, 166690, 165309, 164260, 162912, 161013, 159042, 157585, 156613, 155603, 154199, 152584, 151266, 150622, 150562]
53962A50562L3l67r37j406j615j306l71P18J221J022O99N78L89R0K55J286K770
53945A53621M059M917N298N148M855N161O097O726O497O131O395O743O192M889
53931B32729L781L101K251J022j96j273k474l604m000l509k840k580k440j751
53917B18217l26J274K240K246J875K138L311M567N028M866M866N353O055O728
53903B68438P290P573P473P207O939O382N313M135L415L080K643J924R68l32j915
53888C30533l186l714l963m508m923m478l648l712m834n820o011o195p121q152
53874B60268q239p417o555o117n921n775n638n311m614l863l666m186m912n223
53860A82831m900m138l297k694k429k366k316k302k502k985l528l846l882l761
$$ y = [150562, 150595, 150228, 149291, 147885, 146270, 144964, 144593, 145311, 146532, 147554, 148253, 148831, 149220, 149310, 149565, 150851, 153621, 157680, 162597, 167895, 173043, 177898, 183059, 189156, 195882, 202379, 208510, 214905, 221648, 227840, 232729, 236510, 239611, 241862, 242884, 242688, 241415, 238941, 235337, 231337, 227828, 224988, 222408, 219968, 218217, 217891, 219165, 221405, 223651, 225526, 227664, 230975, 235542, 240570, 245436, 250302, 255655, 261710, 268438, 275728, 283301, 290774, 297981, 304920, 311302, 316615, 320750, 324165, 327245, 329888, 331812, 332780, 332448, 330533, 327347, 323633, 319670, 315162, 310239, 305761, 302113, 298401, 293567, 287747, 281736, 275541, 268420, 260268, 252029, 244612, 238057, 231940, 226019, 220244, 214606, 209295, 204681, 200818, 197152, 192966, 188054, 182831, 177931, 173793, 170496, 167802, 165373, 163007, 160691, 158389, 155887, 152902, 149374, 145528, 141646, 137885]
53846A37885l436k618j249O7M61k67j405k087k128j965k039k375k624k355j481
53831A12384n07j17m32q74q97n34j27K44O64J042J090O86M8l99l75rK58K38K08
53812A12591M17N31J72k47J00J202K086K112J697J478J467J442J535J930K500
53797A31013L140L960M824N194M897M509M503M607M492M494N015N614N553M868
53783A96683M261M074L974L565K810J935J264J013R82P82M65M90Q19O67m18j887
53767B21479l024l809m336m132k909j448q73j355k206k903l322l334k973k642
53753A82213k515k062r78n2k60j337k176k380k472k694k654k167j646j499j774
53738A55547k363k948k948k153j270j136j586j759j374q71m88m0M92Q68J112J448
$$ y = [137885, 134449, 131831, 130582, 130649, 131110, 130843, 129438, 127351, 125223, 123258, 121219, 118844, 116220, 113865, 112384, 111877, 111760, 111328, 110454, 109557, 109023, 108896, 109140, 109804, 110846, 111936, 112622, 112670, 112271, 111896, 111887, 112145, 112383, 112591, 113008, 113539, 113711, 113464, 113564, 114766, 116852, 118964, 120661, 122139, 123606, 125048, 126583, 128513, 131013, 134153, 138113, 142937, 148131, 153028, 157537, 162040, 166647, 171139, 175633, 180648, 186262, 191815, 196683, 200944, 205018, 208992, 212557, 215367, 217302, 218566, 219579, 220561, 221343, 221808, 222298, 223117, 223784, 223366, 221479, 218455, 214646, 210310, 206178, 203269, 201821, 200948, 199593, 197387, 194484, 191162, 187828, 184855, 182213, 179698, 177636, 176658, 176606, 176346, 175009, 172833, 170453, 167981, 165287, 162633, 160466, 158820, 157321, 155547, 153184, 150236, 147288, 145135, 143865, 142729, 141143, 139384, 138010, 137139, 136651, 136611, 137103, 137971, 139083, 140531]
53722A40531J783J918K062K466K703K197J234O93Q13J032R65P45M98K64L10P65
53706A60979J104Q17L76N40R66O24m43j037n92J69O12J061J844K533K691K570
53690A74814K532K449K147J839J753J824J996K232K195J613J061J452K601L190
53676B03698K588J726J746K589L510M211M704M650L671K087P83M03Q82J601J832
53661B40681J338O54M25N29L34k65o97p25p91j206j619j593j171o29k38l86j305
53644B33336k463k866k227j262o23k28R4J07l16p63q57p08n65m77n45r00j217
53627B17520q87K0O73P14P42J210J638J522J277J598K342K796K633J996J047O6
53611B36907l20L18J592K686L217L390L440L394L209K851K368K030K176K801L578
$$ y = [140531, 142314, 144232, 146294, 148760, 151463, 153660, 154894, 155587, 156400, 157432, 158397, 159142, 159640, 159904, 160214, 160979, 162083, 162900, 163276, 163816, 164782, 165406, 164963, 163926, 163334, 163503, 164115, 165176, 167020, 169553, 172244, 174814, 177346, 179795, 181942, 183781, 185534, 187358, 189354, 191586, 193781, 195394, 196455, 197907, 200508, 203698, 206286, 208012, 209758, 212347, 215857, 220068, 224772, 229422, 233093, 235180, 235963, 236366, 237248, 238849, 240681, 242019, 242673, 243098, 243627, 243961, 243696, 242999, 242274, 241483, 240277, 238658, 237065, 235894, 235265, 235027, 234641, 233336, 230873, 228007, 225780, 224518, 223895, 223667, 223761, 223868, 223552, 222789, 221932, 221224, 220659, 220182, 219637, 218737, 217520, 216633, 216653, 217326, 218040, 218782, 219992, 221630, 223152, 224429, 226027, 228369, 231165, 233798, 235794, 236841, 236907, 236587, 236905, 238497, 241183, 244400, 247790, 251230, 254624, 257833, 260684, 263052, 265082, 267258, 270059, 273637]
53596B73637M368N315O286O752O478N918N599N520N455N462N676N885N738N158
53582C53247M374L658L215L070L017K881K812L000L211L070K665K379K191J834
53568C94624J556J868K457K309J233L28N00J244J538J195P37M57K69R7q1k93k59
53551D09779M65J706K534K385J833J717J926J711R29L45P29K018L342L752L024
53536D38195J858J150J096J320J629K092K444K300J952K173K975L519L490L681
53522D69874M691N966O686O849O868O835O858P399Q528R439R447R009R017R606
53508E77072J0390J1369J2716J4022J4645J4681J4819J5362J5971J6357J6674
53497G34078J7247J8287J9738K1205K2205K2797K3520K4540K5285K5364K5245
$$ y = [273637, 278005, 283320, 289606, 296358, 302836, 308754, 314353, 319873, 325328, 330790, 336466, 342351, 348089, 353247, 357621, 361279, 364494, 367564, 370581, 373462, 376274, 379274, 382485, 385555, 388220, 390599, 392790, 394624, 396180, 398048, 400505, 402814, 404047, 404375, 404875, 406119, 407657, 408852, 409589, 410046, 410315, 410412, 410331, 410038, 409779, 410244, 411950, 414484, 416869, 418702, 420419, 422345, 424056, 424985, 425330, 426059, 428077, 431419, 435171, 438195, 440053, 441203, 442299, 443619, 445248, 447340, 449784, 452084, 454036, 456209, 459184, 462703, 466193, 469874, 474565, 480531, 487217, 494066, 500934, 507769, 514627, 522026, 530554, 539993, 549440, 558449, 567466, 577072, 587462, 598831, 611547, 625569, 640214, 654895, 669714, 685076, 701047, 717404, 734078, 751325, 769612, 789350, 810555, 832760, 855557, 879077, 903617, 928902, 954266, 979511]
53486I79511K5579K6257K6708K6726K6477K6035K5396K4718K4114K3563K3243
53475A258327K3482K4057K4142K3430K2655K2428K2290K1579K0581J9977J9683
53464A502631J9125J8315J7678J7144J6283J5194J4378J3802J2860J1224R113
53453A667747O824M592K803J649O28j031l424n898p939r659j1428j3313j4955
53440A616596j5828j5853j5786j6578j8240j9895k1114k2414k4061k5251k5203
53429A396373k4323k3493k2953k2600k2736k3423k3706k2580k0433j8466j7009
53418A154651j5449j3571j1869j0582r437q239o955n363l515k224k029j910l10
53405A063198K609N047O041O602P975R950J1588J2705J3878J5543J7607J9696
$$ y = [979511, 1005090, 1031347, 1058055, 1084781, 1111258, 1137293, 1162689, 1187407, 1211521, 1235084, 1258327, 1281809, 1305866, 1330008, 1353438, 1376093, 1398521, 1420811, 1442390, 1462971, 1482948, 1502631, 1521756, 1540071, 1557749, 1574893, 1591176, 1606370, 1620748, 1634550, 1647410, 1658634, 1667747, 1674571, 1679163, 1681966, 1683615, 1684243, 1683212, 1679788, 1673890, 1665951, 1656292, 1644864, 1631551, 1616596, 1600768, 1584915, 1569129, 1552551, 1534311, 1514416, 1493302, 1470888, 1446827, 1421576, 1396373, 1372050, 1348557, 1325604, 1303004, 1280268, 1256845, 1233139, 1210559, 1190126, 1171660, 1154651, 1139202, 1125631, 1113762, 1103180, 1093743, 1085504, 1078549, 1073186, 1069671, 1067447, 1065418, 1063508, 1063198, 1065807, 1070854, 1076895, 1083497, 1091472, 1101422, 1113010, 1125715, 1139593, 1155136, 1172743, 1192439]
53393A192439K1352K2404K3348K4979K7411K9841L1484L2367L3143L4475L6687
53382A509930L9522M2223M4192M5658M7237M8970N0290N0950N1397N2142N3248
53371B035759N4510N5634N6194N5916N5045N4029N2929N1573N0187M9085M7851
53360B618712M5572M2056L8089L4320L0562K6502K2380J8505J4593J0136N143
53349B906570J14m592r005j3302j7476k1379k4996k8569l2246l5657l8243m0170
53337B641049m2403m5496m8749n1083n2294n2884n3026n2526n1531n0504m9474
53326B091079m8053m6185m4328m2912m2023m1491m0816l9337l7137l5300l4584
53315A638913l4090l2330k9321k6483k4557k2794k0478j8065j6389j5585j5310
$$ y = [1192439, 1213791, 1236195, 1259543, 1284522, 1311933, 1341774, 1373258, 1405625, 1438768, 1473243, 1509930, 1549452, 1591675, 1635867, 1681525, 1728762, 1777732, 1828022, 1878972, 1930369, 1982511, 2035759, 2090269, 2145903, 2202097, 2258013, 2313058, 2367087, 2420016, 2471589, 2521776, 2570861, 2618712, 2664284, 2706340, 2744429, 2778749, 2809311, 2835813, 2858193, 2876698, 2891291, 2901427, 2906570, 2906684, 2902092, 2893087, 2879785, 2862309, 2840930, 2815934, 2787365, 2755119, 2719462, 2681219, 2641049, 2598646, 2553150, 2504401, 2453318, 2401024, 2348140, 2295114, 2242588, 2191057, 2140553, 2091079, 2043026, 1996841, 1952513, 1909601, 1867578, 1826087, 1785271, 1745934, 1708797, 1673497, 1638913, 1604823, 1572493, 1543172, 1516689, 1492132, 1469338, 1448860, 1430795, 1414406, 1398821, 1383511]
53304A383511j5204j4754j3461j1630j0336j0082j0085r318p761o144m843l621
53292A266272k200p14L67P89J040K085M201O379P546Q050R095J0832J2248J2966
53278A338956J3977J6012J8369K0044K1204K2574K4068K4993K5259K5436K5731
53267A576623K5696K5081K4265K3635K2933K1573J9447J7145J5260J3632J1600
53256A796890R005O536M850L698K367N60j567l909o349q516j0320j2432j5348
53243A765465j8245j9731j9801k0023k1533k3779k5544k6363k6529k6413k6306
53232A511198k6405k6522k6231k5518k4824k4399k4137k4068k4282k4324k3501
53221A236987k1931k0523j9655j8843j7918j7539j7994j8421j7952j6876j6013
$$ y = [1383511, 1368307, 1353553, 1340092, 1328462, 1318126, 1308044, 1297959, 1288641, 1280880, 1274736, 1269893, 1266272, 1264072, 1263358, 1263725, 1264514, 1265554, 1267639, 1271840, 1278219, 1285765, 1293815, 1302910, 1313742, 1325990, 1338956, 1352933, 1368945, 1387314, 1407358, 1428562, 1451136, 1475204, 1500197, 1525456, 1550892, 1576623, 1602319, 1627400, 1651665, 1675300, 1698233, 1719806, 1739253, 1756398, 1771658, 1785290, 1796890, 1805895, 1812431, 1817281, 1820979, 1823346, 1823906, 1822339, 1818430, 1812081, 1803565, 1793245, 1780813, 1765465, 1747220, 1727489, 1707688, 1687665, 1666132, 1642353, 1616809, 1590446, 1563917, 1537504, 1511198, 1484793, 1458271, 1432040, 1406522, 1381698, 1357299, 1333162, 1309094, 1284812, 1260488, 1236987, 1215056, 1194533, 1174878, 1156035, 1138117, 1120578, 1102584, 1084163, 1066211, 1049335, 1033322]
53210A033322j5512j4930j3989j2755j1455j0507j0304j0697j1162j1727j2892
53199H97392j4431j5264j4963j4458j4572j4893j4853j4933j5653j6188j5341
53188G31843j3508j2372j2692j3524j3659j3023j2429j2593j3543j4595j4932
53177E84973j4492j4059j4123j4216j3820j3344j3388j3495j2721j1236j0271
53166D39808j0349j0512r689q098o890o756p301p567o982n860m981m677m520l995
53152C41631l157k332j623j050q58j083j139m78N36J005P39M22N59Q80R79R06
53136C35937P90L32q59k553l948m451m216l873l855m166m697n383n972n934n074
53121B82078m025l668m081m513m427m018l727l737m096m726n153m803l836l098
$$ y = [1033322, 1017810, 1002880, 988891, 976136, 964681, 954174, 943870, 933173, 922011, 910284, 897392, 882961, 867697, 852734, 838276, 823704, 808811, 793958, 779025, 763372, 747184, 731843, 718335, 705963, 693271, 679747, 666088, 653065, 640636, 628043, 614500, 599905, 584973, 570481, 556422, 542299, 528083, 514263, 500919, 487531, 474036, 461315, 450079, 439808, 429459, 418947, 409258, 401160, 394270, 387514, 380213, 372646, 365664, 359804, 354823, 350146, 345626, 341631, 338474, 336142, 334519, 333469, 332611, 331528, 330389, 329911, 330447, 331452, 332191, 332613, 333172, 334052, 335031, 335937, 336727, 337059, 336200, 333647, 329699, 325248, 321032, 317159, 313304, 309138, 304441, 299058, 293086, 287152, 282078, 278053, 274385, 270304, 265791, 261364, 257346, 253619, 249882, 245786, 241060, 235907, 231104, 227268, 224170]
53107B24170l060l312l336l093k616j810j004r49j693k243j913j311j298j707
53093A94825j899j929k161k308j879j186r23j041j098j306k111k868k337o46M99
53078A71632L4j133j585j319j376k120k712k264r29K78N44P0l29l09l65q06r41
53061A56370OJ468J969J027k37o81m69m02n68m38R3M99M65L21M71P56O60k0q40
53042A60450j229j171j222j784k497k503j357L95J584J394J08j113j385q72k85
53027A48513J68P51J256R34k27j020m93O37R30K31k19L75J384J858J741J537J328
53010A59684Q36J65r6L76J221J824K021K120K334K456K308K234K769L856M814
52995A88922N140M973M613M073L356K754K486K305J798Q04o64k512m256n036m493
$$ y = [224170, 221110, 217798, 214462, 211369, 208753, 206943, 205939, 204990, 203297, 201054, 199141, 197830, 196532, 194825, 192926, 190997, 188836, 186528, 184649, 183463, 182540, 181499, 180401, 179095, 176984, 174116, 171779, 171133, 171632, 171666, 170533, 168948, 167629, 166253, 164133, 161421, 159157, 158228, 158506, 159050, 159120, 158791, 158482, 158117, 157311, 156370, 156376, 157844, 159813, 160840, 160603, 159922, 159453, 159051, 158483, 158045, 158138, 158637, 159102, 159423, 159894, 160650, 161310, 161290, 160450, 159221, 158050, 156828, 155044, 152547, 150044, 148687, 149082, 150666, 152060, 152168, 151055, 149670, 148798, 148513, 148681, 149432, 150688, 151622, 151395, 150375, 149882, 150519, 151449, 151680, 151461, 151836, 153220, 155078, 156819, 158356, 159684, 160520, 160685, 160589, 160965, 162186, 164010, 166031, 168151, 170485, 172941, 175249, 177483, 180252, 184108, 188922, 194062, 199035, 203648, 207721, 211077, 213831, 216317, 218622, 220420, 221224, 220560, 218048, 213792, 208756, 204263]
52980B04263l298k383j953j692j653k216l346m432m899m547l500k228j489j610
52966A65017j959j648p19p5k35p48r03n58l8L33M84N64P07P19K09p29j274q00
52948A58347J68N90L42L02R62J673J560O28l96r39q91l93K96Q01Q68O85P49J308
52930A66660J969K036J307L98M0K21M30N51R36J493J494O54k77m82j50L5j03l53
52912A76859p33j153r39L46J862K308J649J076J206J393J061O34P41J229J555
52897A89094J559J419J228J042J004J095J072Q87Q21J032J275J354J407J584J758
52882B07631J826J942K255K651L040L563M236M690M573M077L766L985M532M863
52868B57630M525L480K162J113N64L38J39k23p79j390j813j895j727j491j342
$$ y = [204263, 200965, 198582, 196629, 194937, 193284, 191068, 187722, 183290, 178391, 173844, 170344, 168116, 166627, 165017, 163058, 161410, 160691, 160616, 160381, 159633, 158730, 158172, 158134, 158467, 158951, 159515, 160222, 160941, 161150, 160421, 159147, 158347, 158515, 159105, 159447, 159749, 160711, 162384, 163944, 164572, 164176, 163237, 162346, 161953, 162249, 163050, 163918, 164603, 165352, 166660, 168629, 170665, 171972, 172370, 172410, 172631, 173061, 173612, 174548, 176041, 177535, 178189, 177912, 177430, 177280, 177315, 177212, 176859, 176126, 174973, 174034, 174380, 176242, 178550, 180199, 181275, 182481, 183874, 184935, 185569, 186310, 187539, 189094, 190653, 192072, 193300, 194342, 195346, 196441, 197513, 198400, 199221, 200253, 201528, 202882, 204289, 205873, 207631, 209457, 211399, 213654, 216305, 219345, 222908, 227144, 231834, 236407, 240484, 244250, 248235, 252767, 257630, 262155, 265635, 267797, 268910, 269474, 269812, 269951, 269728, 268949, 267559, 265746, 263851, 262124, 260633, 259291]
52853B59291j461j961k578k728k196j515j344j675j998k017j818j489j016m97
52839B34998j23l2k99q84j410j375q56n92r85j510j531j179q91o48m33p51j763
52822B19736k438j760m71l06j531k607k433j699j557k039k444k336j731q82l40
52807A95162o13j367j684j360j152j446j573r64j46J20n6j30j48m94j073j436
52791A81640j442j204o90L3L89j78j376k270k329j817j231p83m99m91q87j585
52775A65280k119k013j312o74o24r69j202j283j431j388o13O89J506J222K67o29
52759A54707j276j798k121k083j745j368j227j489j882j704p00K26l2j221k073
52744A34214k154k212k495k091n79R26J283Q92P05N94q3q73o12Q37K326K976L020
$$ y = [259291, 257830, 255869, 253291, 250563, 248367, 246852, 245508, 243833, 241835, 239818, 238000, 236511, 235495, 234998, 234875, 234843, 234544, 233660, 232250, 230875, 230019, 229427, 228442, 226932, 225401, 224222, 223331, 222683, 222250, 221499, 219736, 217298, 215538, 215067, 214761, 213230, 210623, 208190, 206491, 204934, 202895, 200451, 198115, 196384, 195502, 195162, 194549, 193182, 191498, 190138, 188986, 187540, 185967, 185003, 184857, 184977, 184921, 184791, 184643, 184149, 183076, 181640, 180198, 178994, 178304, 178337, 178726, 178548, 177172, 174902, 172573, 170756, 169525, 168742, 168243, 167752, 166865, 165280, 163161, 161148, 159836, 159162, 158538, 157569, 156367, 155084, 153653, 152265, 151652, 152341, 153847, 155069, 155336, 154707, 153431, 151633, 149512, 147429, 145684, 144316, 143089, 141600, 139718, 138014, 137314, 137540, 137508, 136287, 134214, 132060, 129848, 127353, 125262, 124683, 125609, 126892, 127784, 128489, 129083, 129000, 128127, 127515, 128352, 130678, 133654, 136674]
52727A36674L035L129L131K939K530J951J433J178J073Q99O33L16j73q95j629
52712A56224k195k724l285l654l731l800l956l728k854j960j869k492l026k996
52698A13954k543j921j319j039j278j811k254k461k302j498j21J044J234N47l90
52683I7842j156j506j131j77M81K46k44m7O03O53j75j160j808k221k394k085j491
52666H4230j144r68m18L74O44K82J02M37N78N3n61p11p84j195j375o09O63J373
52648H0971J282J036R95R09O93O51Q87J074R94P98N81K11l33p85r59q97n99K6
52630H7535P52R86M43m19r13r26q35q56q24o26m20k65J13Q61J556J547P32k96
52612H8145q67q03l87K8K55L56N33Q81J196J215R34N83L23J97L07O82J040J039
$$ y = [136674, 139709, 142838, 145969, 148908, 151438, 153389, 154822, 156000, 157073, 157972, 158605, 158921, 158748, 157853, 156224, 154029, 151305, 148020, 144366, 140635, 136835, 132879, 129151, 126297, 124337, 122468, 119976, 116950, 113954, 111411, 109490, 108171, 107132, 105854, 104043, 101789, 99328, 97026, 95528, 95407, 96451, 97685, 98232, 97842, 96686, 95180, 94049, 93872, 94353, 94599, 94355, 94308, 94911, 95564, 95389, 94229, 92421, 90200, 87806, 85721, 84230, 83086, 82118, 81700, 82074, 82718, 83000, 83102, 83539, 84117, 84170, 83609, 82898, 82114, 80919, 79544, 78935, 79598, 80971, 82253, 83289, 84284, 85193, 85886, 86537, 87424, 88498, 89492, 90290, 90871, 91082, 90749, 89964, 89005, 88108, 87509, 87535, 88287, 89273, 89716, 89297, 88384, 87458, 86623, 85767, 84943, 84317, 83897, 83632, 83745, 84606, 86162, 87709, 88441, 88145, 87278, 86475, 86088, 86116, 86371, 86727, 87260, 88141, 89337, 90552, 91486, 92069, 92392, 92589, 92896, 93578, 94618, 95657]
52594I5657Q14Q10R95P85l5p89o90K21J299K060K384K242J664Q18j23j043j579
52577A05490j198O1J311J772J660J624J620J173M91M81J414K383K452J820J387
52562A23941J499J661J412J074J331K233K937K703J886J494J772J879J179J88
52548A47189k10K0L41O24J104J581J568J117P45N40J70k14O2J012J683J364M46
52531A59142l25p68r23n34L75Q90J68j152j438j07J529J800N94o82p74J93J131
52514A59119J261P33J68j08k02k51j78J03N10Q72R95O50k16j131j301m83O29J189
52496A62359J147R84P42N3q35r17K22J515J610O53MK95P28N30J94N57J379J663
52478A72883J176P15R09J511K034K357K453K045J025j13o45k74P19J835K609K836
$$ y = [95657, 96471, 97281, 98276, 99061, 99026, 98237, 97547, 97768, 99067, 101127, 103511, 105753, 107417, 108235, 108112, 107069, 105490, 104292, 104353, 105664, 107436, 109096, 110720, 112340, 113513, 114004, 114485, 115899, 118282, 120734, 122554, 123941, 125440, 127101, 128513, 129587, 130918, 133151, 136088, 138791, 140677, 142171, 143943, 145822, 147001, 147189, 146979, 146999, 147340, 147964, 149068, 150649, 152217, 153334, 154079, 154619, 154789, 154575, 154637, 155649, 157332, 158696, 159142, 158817, 158049, 157126, 156592, 156967, 157857, 158025, 156873, 155435, 155328, 156857, 158657, 159251, 158569, 157795, 157988, 159119, 160380, 161113, 161281, 161173, 160971, 160720, 160542, 160645, 161155, 162027, 163022, 163672, 163456, 162325, 161024, 160541, 161170, 162359, 163506, 164490, 165232, 165285, 164450, 163533, 163755, 165270, 166880, 167533, 167537, 167832, 168560, 169090, 169284, 169841, 171220, 172883, 174059, 174774, 175683, 177194, 179228, 181585, 184038, 186083, 187108, 186995, 186350, 186076, 186795, 188630, 191239, 194075]
52462A94075K681K493K370K124J624J045O62O61J076J620J699R92K6l17J55Q09
52446B13795J106J068Q10K71m25r70j401j969k378j964r29m54j086j900j895j416
52430B00263j369j756j945j874j983k244k242k029k010k122j901j251m92J41N00
52415A77686K97l57o00J52J130J140L44l9L70O78L23j18n2K04J19k19m40m38j83
52396A79997L67R30J023O87M93O41P25O11P68J346J718J393P72N00O34Q99J203
52379A94707J407J199P50R08K057L270L352K350J315Q29O02M17O33J431K283K555
52363B20065K301K137K397K764K742K320K016K283K993L629L820L561K976K238
52349B58242J615J301J254J349J689K351K935K850K110J459J487J999K425K507
$$ y = [194075, 196756, 199249, 201619, 203743, 205367, 206412, 207074, 207735, 208811, 210431, 212130, 213122, 213148, 212831, 212986, 213795, 214901, 215969, 216779, 217050, 216625, 215655, 214254, 212285, 209907, 207943, 207014, 206560, 205474, 203574, 201679, 200263, 198894, 197138, 195193, 193319, 191336, 189092, 186850, 184821, 182811, 180689, 178788, 177537, 177045, 177186, 177686, 177983, 177626, 177026, 177178, 178308, 179448, 179792, 179753, 180123, 180801, 181124, 181006, 180954, 181158, 181277, 181058, 180618, 180180, 179997, 180364, 181294, 182317, 183004, 183497, 184138, 184863, 185474, 186242, 187588, 189306, 190699, 191471, 191971, 192605, 193504, 194707, 196114, 197313, 198063, 198971, 201028, 204298, 207650, 210000, 211315, 212144, 212746, 213163, 213796, 215227, 217510, 220065, 222366, 224503, 226900, 229664, 232406, 234726, 236742, 239025, 242018, 245647, 249467, 253028, 256004, 258242, 259857, 261158, 262412, 263761, 265450, 267801, 270736, 273586, 275696, 277155, 278642, 280641, 283066, 285573]
52335B85573K432K483K737K951K769K229J959K458L264L309K224P67j56l48p7
52320C14574N56J527K563L309L687L876M008M093M014L602K892K311K366L105
52306C56483M120N018N586N653N286N044N496O466P273P736Q214Q731Q886Q760
52292D48752R054R886J0380J0065R821J0636J2006J2574J2019J1351J1427J2038
52280E80009J2590J3006J3569J4305J4839J4810J4317J3947J4228J5018J5607
52269G36245J5489J4857J4233J3972J4200J4797J5204J4675J3069J1137R679Q785
52257H96342Q171P836P821P684O873N517M291L501K777J743N25n60j446k231k870
52242I45974l171l094k878k815k927k955k698k207j551o49M23J276J760K455M003
$$ y = [285573, 288005, 290488, 293225, 296176, 298945, 301174, 303133, 305591, 308855, 312164, 314388, 315155, 314999, 314651, 314574, 315130, 316657, 319220, 322529, 326216, 330092, 334100, 338193, 342207, 345809, 348701, 351012, 353378, 356483, 360603, 365621, 371207, 376860, 382146, 387190, 392686, 399152, 406425, 414161, 422375, 431106, 439992, 448752, 457806, 467692, 478072, 488137, 497958, 508594, 520600, 533174, 545193, 556544, 567971, 580009, 592599, 605605, 619174, 633479, 648318, 663128, 677445, 691392, 705620, 720638, 736245, 751734, 766591, 780824, 794796, 808996, 823793, 838997, 853672, 866741, 877878, 887557, 896342, 904513, 912349, 920170, 927854, 934727, 940244, 944535, 948036, 950813, 952556, 953081, 952521, 951075, 948844, 945974, 942803, 939709, 936831, 934016, 931089, 928134, 925436, 923229, 921678, 921029, 921452, 922728, 924488, 926943, 930946]
52227I30946O065P616Q287Q762R664J0829J1834J2542J2781J2324J1569J1454
52215A054673J2060J2146J0855R159Q592R088R160Q004O270M724L320J774K03
52202A150028j248k758m390n818o788p473q089q536q668q722r136j0077j1221
52189A057104j1961j1876j1182j0624j0645j0787j0239q954p779p363p410p185
52177I41099o486n806n636n860n951n661n332n403n761n888n631n383n383n329
52163H61589m971m640m719m934m765m322m196m513m767m564m047l533l228l327
52149H01063l873m404m251l366k461k149k369k779l219l519l376k813k446k791
52135G57247l490l720l293k888l063l533l646l362l245l555l819l546l021k908
$$ y = [930946, 937011, 944627, 952914, 961676, 971340, 982169, 994003, 1006545, 1019326, 1031650, 1043219, 1054673, 1066733, 1078879, 1089734, 1098893, 1107485, 1116573, 1125733, 1133737, 1140007, 1144731, 1148051, 1149825, 1150028, 1148780, 1146022, 1141632, 1135814, 1129026, 1121553, 1113464, 1104928, 1096260, 1087538, 1078402, 1068325, 1057104, 1045143, 1033267, 1022085, 1011461, 1000816, 990029, 979790, 970836, 963057, 955694, 948284, 941099, 934613, 928807, 923171, 917311, 911360, 905699, 900367, 894964, 889203, 883315, 877684, 872301, 866918, 861589, 856618, 851978, 847259, 842325, 837560, 833238, 829042, 824529, 819762, 815198, 811151, 807618, 804390, 801063, 797190, 792786, 788535, 785169, 782708, 780559, 778190, 775411, 772192, 768673, 765297, 762484, 760038, 757247, 753757, 750037, 746744, 743856, 740793, 737260, 733614, 730252, 727007, 723452, 719633, 716087, 713066, 710158]
52121G10158l169l041k216j496j762k701l200k861k379k372k541k353k013k114
52107F75940k562k537j603l20N48J050J813K950L831M027L994M473N517O575P321
52092G11017P935Q628R431J0466J1973J3812J5335J6049J6196J6494J7441J8995
52080H73772K0722K2129K2973K3337K3317K2774K1698K0637K0206K0244J9968
52069A111777J9098J8189J7641J7074J6044J4759J3510J1956R656O986M817L378
52057A264885K095M93j270k789l883m632n251n966o860p846q904j0064j1056j1342
52043A187610j0851j0260j0167j0262r846q842p768o906o078n162m262l421k560
52030A091225j695q53J08J255K315L090L945N249O517O822O106N374N471O176
$$ y = [710158, 706989, 703948, 701732, 700236, 698474, 695773, 692573, 689712, 687333, 684961, 682420, 680067, 678054, 675940, 673378, 670841, 669238, 668918, 669466, 670516, 672329, 675279, 679110, 683137, 687131, 691604, 697121, 703696, 711017, 718952, 727580, 737011, 747477, 759450, 773262, 788597, 804646, 820842, 837336, 854777, 873772, 894494, 916623, 939596, 962933, 986250, 1009024, 1030722, 1051359, 1071565, 1091809, 1111777, 1130875, 1149064, 1166705, 1183779, 1199823, 1214582, 1228092, 1240048, 1249704, 1256690, 1261507, 1264885, 1266980, 1267473, 1266203, 1263414, 1259531, 1254899, 1249648, 1243682, 1236822, 1228976, 1220072, 1210008, 1198952, 1187610, 1176759, 1166499, 1156332, 1146070, 1136224, 1127382, 1119614, 1112708, 1106630, 1101468, 1097206, 1093785, 1091225, 1089530, 1088677, 1088785, 1090040, 1092355, 1095445, 1099390, 1104639, 1111156, 1117978, 1124084, 1129458, 1134929, 1141105]
52016A141105O810P162P462P769P700O783M928K639P52k55o40j011j717k759m114
52001A182614n685p167q392r692j1534j3817j5987j7795j9482k1225k2860k4207
51989A004771k5261k5997k6392k6669k7120k7614k7694k7271k6772k6468k6099
51978G11414k5369k4483k3897k3711k3541k2900k1665k0181j9006j8362j8004
51967D70295j7599j7022j6141j4676j2681j0858r823r250q388p288o771p109p484
51954C25205p055o021n194m895m719m195l394k843k970l522l757l308k706k612
51940B68014k811k557j811j393j744k265k261j919j857k089k056j461o23J8L11
51925B43496L58K94J77j8l09n87o88o41o63q96j194j324j272j255j534k127k753
$$ y = [1141105, 1147915, 1155077, 1162539, 1170308, 1178008, 1184791, 1189719, 1192358, 1193110, 1192855, 1192215, 1191204, 1189487, 1186728, 1182614, 1176929, 1169762, 1161370, 1151678, 1140144, 1126327, 1110340, 1092545, 1073063, 1051838, 1028978, 1004771, 979510, 953513, 927121, 900452, 873332, 845718, 818024, 790753, 763981, 737513, 711414, 686045, 661562, 637665, 613954, 590413, 567513, 545848, 525667, 506661, 488299, 470295, 452696, 435674, 419533, 404857, 392176, 381318, 371495, 362245, 353857, 346569, 339798, 332689, 325205, 318150, 312129, 306935, 302040, 297321, 293126, 289732, 286889, 283919, 280397, 276640, 273332, 270626, 268014, 265203, 262646, 260835, 259442, 257698, 255433, 253172, 251253, 249396, 247307, 245251, 243790, 243167, 243185, 243496, 243854, 244148, 244325, 244307, 243998, 243411, 242723, 242082, 241419, 240523, 239329, 238005, 236733, 235478, 233944, 231817, 229064]
51908B29064l040k920k663k456k161j693j363j527k015k272k005j424r13p72j116
51893B00724j691j937j576j081j177j903k547k468j672o85j40l82j089j435r98
51878A79943l19j32l45l95l19o46j249j264l81N72P26K25k41m02m62n55o13n59
51860A73584l80p6K46M13M54O31J138J937K751L075K405Q37o63j081l39Q81K038
51843A87851K875L034K387J654J776K568K936K498J992J905J795J324R51R73Q10
51828B17329L0p68q54n40n91j004j242j199j139r60m73j29n86j601k161j759r03
51811B01450k77lJ43L20O22J096J574J743J523J198J063J071R44N62J85J82M56
51794B13852M16k48j018j149o34k3N24J225J750J287j23j228j101l09O3j15k03
$$ y = [229064, 226024, 223104, 220441, 217985, 215824, 214131, 212768, 211241, 209226, 206954, 204949, 203525, 202612, 201840, 200724, 199033, 197096, 195520, 194439, 193262, 191359, 188812, 186344, 184672, 183987, 183847, 183465, 182376, 180941, 179943, 179624, 179492, 179147, 178752, 178433, 177787, 176538, 175274, 174893, 175465, 176191, 176416, 176175, 175773, 175311, 174756, 174143, 173584, 173204, 173128, 173374, 173787, 174241, 174872, 176010, 177947, 180698, 183773, 186178, 187015, 186352, 185271, 184932, 185813, 187851, 190726, 193760, 196147, 197801, 199577, 202145, 205081, 207579, 209571, 211476, 213271, 214595, 215546, 216519, 217329, 217359, 216591, 215737, 215197, 214606, 213602, 212360, 211161, 210022, 209062, 208589, 208460, 207874, 206273, 204112, 202353, 201450, 201173, 201170, 201313, 201633, 202255, 203351, 204925, 206668, 208191, 209389, 210452, 211523, 212467, 213029, 213214, 213396, 213852, 214268, 214020, 213002, 211853, 211219, 211196, 211720, 212945, 214695, 215982, 215859, 214631, 213530, 213221, 213284, 213169, 212966]
51777B12966K0K45L13K79P7k76l14L53J317J777J541J096Q38P48O93O05M69N40
51759B23287J269K552L416L080K076J615K043K616K743K655K772L096L466L870
51745B60556M311M697N099N696O412O868O855O579O394O507O942P529P940P874
51731C50259P196N858L917J770O9q54j201j206q28j60L28M55O89J300J661J156
51715C70409L40K99J048J516J087K57l65q03j291j781k297l091m075m576m135
51700C52542l209k759l223m149m696m400l547k801k434k112j545j007q01o47r5
51685C15117O66J078J140J372J963K581L018L338L340K641J406K62n80j445k341
51670C33556k798k787k941l410l355k154m18Q83J665K404L086L426L737M659O031
$$ y = [212966, 212986, 213231, 213544, 213823, 213900, 213624, 213310, 213663, 214980, 216757, 218298, 219394, 220232, 220980, 221673, 222278, 222747, 223287, 224556, 227108, 230524, 233604, 235680, 237295, 239338, 241954, 244697, 247352, 250124, 253220, 256686, 260556, 264867, 269564, 274663, 280359, 286771, 293639, 300494, 307073, 313467, 319974, 326916, 334445, 342385, 350259, 357455, 363313, 367230, 369000, 369069, 368215, 367014, 365808, 364980, 364820, 365148, 365603, 366292, 367592, 369253, 370409, 370749, 371048, 372096, 373612, 374699, 374956, 374591, 373788, 372497, 370716, 368419, 365328, 361253, 356677, 352542, 349333, 346574, 343351, 339202, 334506, 330106, 326559, 323758, 321324, 319212, 317667, 316660, 315859, 315212, 315117, 315783, 316861, 318001, 319373, 321336, 323917, 326935, 330273, 333613, 336254, 337660, 337922, 337342, 335897, 333556, 330758, 327971, 325030, 321620, 318265, 316111, 315693, 316576, 318241, 320645, 323731, 327157, 330894, 335553, 341584]
51655C41584O873O654N851N055M161K864J415L84k09r91k471m455o280p407p696
51640C45332p365o880o729p001p235o966o333n862n730n648n504n527n639n292
51626B57621m368l631l699m047l759k898k321k323k379k176k015k047j932j517
51612B18509j161j098j108j039j063j223j251j106j053j053p29j82p3m98o49p5
51596B05148N09L75j2K02Q77J240J219J381J774J889J736J949K672L179K928K348
51580B29414K228K827L852M915N704O058O127O253O611P115P633Q086Q347Q371
51566C13541Q270P957O913M881K599J181P40L42n82j621k348l028l878m431m264
51551C26272l800l566l183j933j07J187J499J529K016K887L688M313M902N491
$$ y = [341584, 348457, 355111, 360962, 366017, 370178, 373042, 374457, 374841, 374632, 373641, 371170, 366715, 360435, 353028, 345332, 337967, 331087, 324358, 317357, 310122, 303156, 296823, 290961, 285231, 279583, 274079, 268552, 262913, 257621, 253253, 249622, 245923, 241876, 238117, 235219, 232898, 230575, 228196, 226020, 224005, 221958, 220026, 218509, 217348, 216250, 215142, 214103, 213040, 211817, 210566, 209460, 208407, 207354, 206625, 206443, 206370, 205872, 205223, 205148, 205657, 206032, 206020, 206222, 207099, 208339, 209558, 210939, 212713, 214602, 216338, 218287, 220959, 224138, 227066, 229414, 231642, 234469, 238321, 243236, 248940, 254998, 261125, 267378, 273989, 281104, 288737, 296823, 305170, 313541, 321811, 329768, 336681, 341562, 344161, 345342, 346082, 346424, 345842, 344221, 341873, 338845, 334967, 330536, 326272, 322472, 318906, 315723, 313790, 313683, 314870, 316369, 317898, 319914, 322801, 326489, 330802, 335704, 341195]
51537C41195O052O522O738O604O459O792P424P399O055L899K120J438J612J837
51523D12146J408K97p25p96L2Q17R36Q12J117J642J574O28o21j404j409r31p37
51506D14786j577l408n301o480p144p820q286p940o915o011n520n083m760n116
51492C33425n984o122m811l030k209k408k510j954j355j459k087k408j809m47
51478B94832R38J692J877K071K529K829K586K130K070K421K659K590K697L497
51464C27418M800N860O165N956N889O227O576O577O572P201Q411R391R518Q993
51450D25554Q390Q037P952Q011P984P710P322O951O308N050L538K510J950J120
51436E08387m9n68J33J252J724J506J051K80r67k146k674k957l762m900n571n713
$$ y = [341195, 347247, 353769, 360507, 367111, 373570, 380362, 387786, 395185, 401240, 405139, 407259, 408697, 410309, 412146, 413554, 413851, 413126, 412330, 412362, 413179, 414115, 414927, 416044, 417686, 419260, 419888, 419267, 417863, 416454, 415523, 414786, 413209, 409801, 404500, 398020, 390876, 383056, 374770, 366830, 359915, 353904, 348384, 343301, 338541, 333425, 327441, 321319, 316508, 313478, 311269, 308861, 306351, 304397, 303042, 301583, 299496, 297088, 295279, 294832, 295770, 297462, 299339, 301410, 303939, 306768, 309354, 311484, 313554, 315975, 318634, 321224, 323921, 327418, 332218, 338078, 344243, 350199, 356088, 362315, 368891, 375468, 382040, 389241, 397652, 407043, 416561, 425554, 433944, 441981, 449933, 457944, 465928, 473638, 480960, 487911, 494219, 499269, 502807, 505317, 507267, 508387, 508338, 507770, 507903, 509155, 510879, 512385, 513436, 513716, 512749, 510603, 507929, 504972, 501210, 496310, 490739, 485026]
51420D85026o026o765p535q179q951r692r789r107q167p350o620o037n800n638
51406C79370m989l874k856k030r08N23J482J512J167J137J360J430J352J355J385
51391C77416J293J222J374J629J676J410R10K60n04j436k742m545o607q362r436
51376C53558r861r903r865r896r784r163q196p663p912q111p267n716m797n112
51362B40312n947o395o268n718m788l678k864k597k706k948l146l057k583k063
51348A85554j753j273k57O37M22o51j290j064q40j110j185o09j44m73r36n39M79
51331A74968J104J030P94P86R16J075J202J129Q16O16Q73J534K410L398M169M208
51315B01028L605L291L930N064N832O068O156O235O208O136O122O003N656N163
$$ y = [485026, 479000, 472235, 464700, 456521, 447570, 437878, 428089, 418982, 410815, 403465, 396845, 390808, 385008, 379370, 374381, 370507, 367651, 365621, 364713, 365236, 366718, 368230, 369397, 370534, 371894, 373324, 374676, 376031, 377416, 378709, 379931, 381305, 382934, 384610, 386020, 386930, 387190, 386686, 385250, 382508, 377963, 371356, 362994, 353558, 343697, 333794, 323929, 314033, 304249, 295086, 286890, 279227, 271315, 263204, 255937, 250221, 245424, 240312, 234365, 227970, 221702, 215984, 211196, 207518, 204654, 202057, 199351, 196403, 193257, 190200, 187617, 185554, 183801, 182528, 182271, 182908, 183330, 182679, 181389, 180325, 179485, 178375, 177190, 176581, 176437, 175964, 175028, 174489, 174968, 176072, 177102, 177896, 178682, 179598, 180673, 181875, 183004, 183820, 184436, 185309, 186843, 189253, 192651, 196820, 201028, 204633, 207924, 211854, 216918, 222750, 228818, 234974, 241209, 247417, 253553, 259675, 265678, 271334, 276497]
51301B76497M419L076J298l5n19j014k560m919o898p689p295o097m791m237m635
51286B34601n074m722m019l913m358m540m297m193m251l799k668j632j347j680
51272A84108k310l219m272m958m978m553l963l144k081j110n44l37l37n36q65
51257A46901j017p80l75j54j04J64Q48J488J391N85J06Q82K384L045K159P65J96
51240A58484M14L82l48j187j490j246p88m08l39o34r89r59m78R4L43J25l53o14
51222A50009l82p6l80j148j350n37L57L34j97j50N33R15O35L31M53O59N79M23
51204A51008M77O19O15M16N6l75n48j89M48Q47Q92Q62P98M94Q4jK66M71M41M42
51184A58123N62N34K47p7k97m79n65m56l81o34r51q49n53p44j357j504q57j52
$$ y = [276497, 280916, 283992, 285290, 285255, 284736, 283722, 281162, 276243, 269345, 261656, 254361, 248264, 243473, 239236, 234601, 229527, 224805, 220786, 216873, 212515, 207975, 203678, 199485, 195234, 191435, 188767, 187135, 185788, 184108, 181798, 178579, 174307, 169349, 164371, 159818, 155855, 152711, 150630, 149520, 148976, 148639, 148302, 147766, 146901, 145884, 145104, 144729, 144575, 144471, 144635, 145483, 146971, 148362, 148947, 149053, 149935, 152319, 155364, 157523, 158288, 158484, 158898, 159280, 158932, 157745, 156255, 155009, 154221, 153813, 153474, 152840, 151851, 150892, 150414, 150508, 150851, 150976, 150623, 150009, 149627, 149551, 149171, 148023, 146673, 146136, 146493, 146827, 146630, 146480, 147013, 147928, 148563, 148894, 149347, 150006, 150585, 151008, 151485, 152104, 152719, 153135, 153191, 152816, 152268, 152079, 152527, 153374, 154266, 155128, 155926, 156420, 156504, 156503, 156769, 157240, 157681, 158123, 158685, 159219, 159466, 159389, 159092, 158613, 158048, 157592, 157211, 156577, 155626, 154777, 154224, 153480, 152123, 150619, 149762, 149610]
51166A49610Q0L65J256K251K484J937J236O75K18M3K95N12P0q48j448j484j574
51149A55678k146k756k782k331k022k036j918j329n61q9N6J89L22J53k68l19M20
51132A38261J460J849J198N9o62m33N17J339J349Q09O90J397K183K217J736J512
51116A55481J603J456J004P94J025J291J286J011L12r60k221k543k013j753k214
51101A53559k421j504j48L92Q6m6M80J050R94M01j99m33k44J82N54P72J043J510
51083A56028J856J621Q48Q8k00j00j9k49p27j112j114p76l93r8K94R33J565J731
51065A60176J286O23L00N42J012J116O10j42n66n31l62l15k05K93J127J850K072
51048A68886J931J963K423K841K587J842J539K194L253L963M291M452M085K782
$$ y = [149610, 149690, 150055, 151311, 153562, 156046, 157983, 159219, 159894, 160112, 160155, 160450, 160962, 161032, 160184, 158736, 157252, 155678, 153532, 150776, 147994, 145663, 143641, 141605, 139687, 138358, 137797, 137708, 137764, 137953, 138275, 138428, 138160, 137841, 138261, 139721, 141570, 142768, 142827, 142165, 141732, 142249, 143588, 144937, 145746, 146436, 147833, 150016, 152233, 153969, 155481, 157084, 158540, 159544, 160338, 161363, 162654, 163940, 164951, 165263, 164303, 162082, 159539, 157526, 155773, 153559, 151138, 149634, 149486, 149878, 149964, 149918, 150398, 151448, 152442, 152843, 152644, 152211, 151967, 152149, 152703, 153475, 154518, 156028, 157884, 159505, 160353, 160441, 160241, 160141, 160122, 159873, 159146, 158034, 156920, 156144, 155751, 155653, 155947, 156880, 158445, 160176, 161462, 162085, 162385, 162927, 163939, 165055, 165665, 165523, 164957, 164426, 164064, 163749, 163544, 163837, 164964, 166814, 168886, 170817, 172780, 175203, 178044, 180631, 182473, 184012, 186206, 189459, 193422, 197713, 202165, 206250, 209032]
51034B09032J200O42J387K252K106J126K02k39m16n99p74p57m34l2j76j166k269
51017B11085k232p41J052J807J344M97o0l17n47p54n96K02J406K373K725K833
51001B20077L211L776M114M320M887N800O384O244N744N364N154N032N121N483
50987B90711N995O683P728Q958R866J0350J0969J2168J3739J5248J6555J7734
50975D26704J8967K0692K3337K6608K9647L2108L4529L7339M0269M3144M6516
50964G79860N0808N5337N8965O1410O3350O5326O7065O7785O6912O4542O1289
50953A462649N7450N2528M6023L8619L1628K5264J8447J0695L103l212q523j3447
50941A721224j7483j9789k0755k1453k1955k1476k0031j8709j8256j8377j8717
$$ y = [209032, 210232, 210874, 212261, 214513, 216619, 217745, 217947, 217708, 217292, 216693, 215919, 215162, 214728, 214696, 214520, 213354, 211085, 208853, 208112, 209164, 210971, 212315, 212812, 212752, 212435, 211888, 211134, 210538, 210740, 212146, 214519, 217244, 220077, 223288, 227064, 231178, 235498, 240385, 246185, 252569, 258813, 264557, 269921, 275075, 280107, 285228, 290711, 296706, 303389, 311117, 320075, 329941, 340291, 351260, 363428, 377167, 392415, 408970, 426704, 445671, 466363, 489700, 516308, 545955, 578063, 612592, 649931, 690200, 733344, 779860, 830668, 886005, 944970, 1006380, 1069730, 1135056, 1202121, 1269906, 1336818, 1401360, 1462649, 1520099, 1572627, 1618650, 1657269, 1688897, 1714161, 1732608, 1743303, 1746406, 1743194, 1734671, 1721224, 1703741, 1683952, 1663197, 1641744, 1619789, 1598313, 1578282, 1559573, 1541317, 1522940, 1504223]
50930A504223j9480k0930k3007k5754k9413l3797l8103m1602m4172m6050m7494
50919A134421m8712m9700n0082m9480m8049m6246m4159m1487l8202l4701l1360
50908F52243k8285k5470k2771j9856j6662j3794j1911j0799r630q086o554n249
50896D73176l883k380j145l38N04J644K497K360J523J065J625K731L457L495L426
50881D89757L932M920N657N722N580N977P081Q440R567J0290J0753J1369J2566
50868E91611J4258J5850J7051J8368K0337K2654K4719K6709K9398L2972L6823
50857H50750M0605M4735M9662N5314O1477O8248P5796Q3998R2531J01101J09495
50846A633712J17705J25993J34391J42156J48140J51728J52993J51969J48361
$$ y = [1504223, 1484743, 1463813, 1440806, 1415052, 1385639, 1351842, 1313739, 1272137, 1227965, 1181915, 1134421, 1085709, 1036009, 985927, 936447, 888398, 842152, 797993, 756506, 718304, 683603, 652243, 623958, 598488, 575717, 555861, 539199, 525405, 513494, 502695, 493065, 484979, 478425, 473176, 469293, 466913, 465768, 465430, 465934, 467578, 470075, 472435, 473958, 475023, 476648, 479379, 482836, 486331, 489757, 493689, 498609, 504266, 509988, 515568, 521545, 528626, 537066, 546633, 556923, 567676, 579045, 591611, 605869, 621719, 638770, 657138, 677475, 700129, 724848, 751557, 780955, 813927, 850750, 891355, 936090, 985752, 1041066, 1102543, 1170791, 1246587, 1330585, 1423116, 1524217, 1633712, 1751417, 1877410, 2011801, 2153957, 2302097, 2453825, 2606818, 2758787, 2907148]
50837B907148J42020J33059J21284J06123Q7516O6479M4518K2819K270j6233l1910
50826C585093m4426n3764n9929o2850o2413n8601n1996m4184l7180l2161k9063
50815C048526k7544k7816l0337l5149m2048n0938o1515p2734q3221r2314j00336
50804B424574j07740j14201j18660j20162j18638j14843j09603j03234r5714q7286
50794A334493p8550p0027o1840n3968m6527l9746l3763k8417k3280j7950j2596
50783H67829q022m834k653o21J363K516K468K060K343L149L213J754n11k145k613
50768H65296k838m028o149p958q550q365q328q527q362p658o871o212n405m322
50754G71723l099j462J173M654P906J0347J2692J5741J9029K1636K3823K6776
$$ y = [2907148, 3049168, 3182227, 3303511, 3409634, 3497150, 3563629, 3608147, 3630966, 3633236, 3617003, 3585093, 3540667, 3486903, 3426974, 3364124, 3301711, 3243110, 3191114, 3146930, 3109750, 3077589, 3048526, 3020982, 2993166, 2962829, 2927680, 2885632, 2834694, 2773179, 2700445, 2617224, 2524910, 2424574, 2316834, 2202633, 2083973, 1963811, 1845173, 1730330, 1620727, 1517493, 1421779, 1334493, 1255943, 1185916, 1124076, 1070108, 1023581, 983835, 950072, 921655, 898375, 880425, 867829, 859807, 854973, 852320, 851699, 853062, 855578, 858046, 860106, 862449, 865598, 868811, 870565, 870054, 867909, 865296, 862458, 858430, 852281, 844323, 835773, 827408, 819080, 810553, 802191, 794533, 787662, 781450, 776045, 771723, 768624, 767162, 768335, 772989, 780895, 791242, 803934, 819675, 838704, 860340, 884163, 910939]
50742I10939L0829L4937L8170M0825M3684M6828M9835N2768N6311O0883O6124
50731A432133P1429P6644Q1933Q7112R1558R4854R7154R8585R8471R5677Q9786
50720B415336Q1488P1709O0635M7796L2809J5885k053j9471l4725m6884n6011
50709B566514o2497o6322o7194o5213o0952n5018m7942m0519l3812k8598k5031
50698B013416k2934k2279k3233k5930l0300l6101m2899n0046n6741o2307o6448
50687A574198o9253p0813p0860o8955o5170o0404n5676n1134m6019l9797l3046
50676I43071k6927k1928j7502j2962q320l919L26M805R438J3568J6791J9381K1741
50663I37563K3793K5295K6330K7022K7040K5929K3860K1568J9500J7490J5368
$$ y = [910939, 941768, 976705, 1014875, 1055700, 1099384, 1146212, 1196047, 1248815, 1305126, 1366009, 1432133, 1503562, 1580206, 1662139, 1749251, 1840809, 1935663, 2032817, 2131402, 2229873, 2325550, 2415336, 2496824, 2568533, 2629168, 2676964, 2709773, 2725658, 2723605, 2704134, 2669409, 2622525, 2566514, 2504017, 2437695, 2370501, 2305288, 2244336, 2189318, 2141376, 2100857, 2067045, 2038447, 2013416, 1990482, 1968203, 1944970, 1919040, 1888740, 1852639, 1809740, 1759694, 1702953, 1640646, 1574198, 1504945, 1434132, 1363272, 1294317, 1229147, 1168743, 1113067, 1061933, 1015914, 976117, 943071, 916144, 894216, 876714, 863752, 855432, 851513, 851839, 856644, 866082, 879650, 896441, 915822, 937563, 961356, 986651, 1012981, 1040003, 1067043, 1092972, 1116832, 1138400, 1157900, 1175390, 1190758]
50652A190758J3440J2141J1495J1158J0902J0874J1469J2961J5171J7580J9865
50641A337814K2326K5480K9371L3485L7255M0434M3052M5406M8005N0977N3458
50630A767063N4087N2358M9126M5535M1852L7622L2578K6946K1091J5411J0467
50619B154136O746M163K218P18J54J140L663P033J0403J3197J5157J6244J6549
50606B251521J6148J4915J2638R361N533J576k516p077j2357j8428k5281l2702
50594B213331m0089m6901n3228n9414o5104o9293p1675p3171p4613p5415p4287
50583A510141p0986o6610o2320n8411n4651n0858m6974m2974l8858l4554k9940
50572I53005k5220k0997j7586j4486j1067p505m444j993K73K532M681O942R664
$$ y = [1190758, 1204198, 1216339, 1227834, 1238992, 1249894, 1260768, 1272237, 1285198, 1300369, 1317949, 1337814, 1360140, 1385620, 1414991, 1448476, 1485731, 1526165, 1569217, 1614623, 1662628, 1713605, 1767063, 1821150, 1873508, 1922634, 1968169, 2010021, 2047643, 2080221, 2107167, 2128258, 2143669, 2154136, 2160882, 2165045, 2167263, 2167981, 2168135, 2169275, 2172938, 2179971, 2190374, 2203571, 2218728, 2234972, 2251521, 2267669, 2282584, 2295222, 2304583, 2310116, 2311692, 2309176, 2302099, 2289742, 2271314, 2246033, 2213331, 2173242, 2126341, 2073113, 2013699, 1948595, 1879302, 1807627, 1734456, 1659843, 1584428, 1510141, 1439155, 1372545, 1310225, 1251814, 1197163, 1146305, 1099331, 1056357, 1017499, 982945, 953005, 927785, 906788, 889202, 874716, 863649, 856144, 851700, 849707, 849980, 852512, 857193, 864135, 873799]
50559H73799J2566J5012J7013J9128K1385K3304K5010K7217K9850L1931L3239
50548A129454L4850L7396L9939M1485M2512M3862M4976M4611M2809M0820L9300
50537A582014L7849L6245L4900L3992L3220L2733L3406L5793L9423M3431M7349
50526A990355N1037N4449N7824O1672O6142P0666P4499P7387P9545Q1109Q1857
50515B746542Q1305P9029P4986O9474O2709N4547M4731L3370K0898P720n800j9158
50503C250353l1823m3564n4376o4048p2035p7673q0446q0078p6677p0650o2391
50492B536592n2187m0591k8582j7048o322L456J1872J8505K3422K6691K7643K5235
50480B528686J9251J0563J28j1802k5327m0185n5528p0053q2245r0997r6266r8867
$$ y = [873799, 886365, 901377, 918390, 937518, 958903, 982207, 1007217, 1034434, 1064284, 1096215, 1129454, 1164304, 1201700, 1241639, 1283124, 1325636, 1369498, 1414474, 1459085, 1501894, 1542714, 1582014, 1619863, 1656108, 1691008, 1725000, 1758220, 1790953, 1824359, 1860152, 1899575, 1943006, 1990355, 2041392, 2095841, 2153665, 2215337, 2281479, 2352145, 2426644, 2504031, 2583576, 2664685, 2746542, 2827847, 2906876, 2981862, 3051336, 3114045, 3168592, 3213323, 3246693, 3267591, 3275311, 3269511, 3250353, 3218530, 3174966, 3120590, 3056542, 2984507, 2906834, 2826388, 2746310, 2669633, 2598983, 2536592, 2484405, 2443814, 2415232, 2398184, 2391862, 2395318, 2407190, 2425695, 2449117, 2475808, 2503451, 2528686, 2547937, 2558500, 2558628, 2546826, 2521499, 2481314, 2425786, 2355733, 2273488, 2182491, 2086225, 1987358]
50468A987358r9567r8577r5951r1914q6704q0446p3474o6372n9509n2811m6219
50457A135814m0022l4457k9331k4376j9772j5900j2728r790o740l640o83K157
50445I40532N106Q313J1646J4743J7304J9337K1068K2623K4001K5321K6892K8798
50433A165684L0688L2149L3275L4522L6037L7385L8062L8094L7890L7551L6658
50422A557995L4844L2362K9834K7577K5436K3354K1642K0472J9459J8201J7051
50411A828227J6882J7945J9367K0082K0054K0311K1747K4152K6427K7645K7716
50400B070555K7070K5896K3867K0575J6035J0663M914r84p066j3550k0617k8200
50388B129158l5951m3522n0787n7681o3852o8656p1541p2464p1798o9814o6323
$$ y = [1987358, 1887791, 1789214, 1693263, 1601349, 1514645, 1434199, 1360725, 1294353, 1234844, 1182033, 1135814, 1095792, 1061335, 1032004, 1007628, 987856, 971956, 959228, 949438, 942698, 939058, 938375, 940532, 945638, 953951, 965597, 980340, 997644, 1016981, 1038049, 1060672, 1084673, 1109994, 1136886, 1165684, 1196372, 1228521, 1261796, 1296318, 1332355, 1369740, 1407802, 1445896, 1483786, 1521337, 1557995, 1592839, 1625201, 1655035, 1682612, 1708048, 1731402, 1753044, 1773516, 1792975, 1811176, 1828227, 1845109, 1863054, 1882421, 1902503, 1922557, 1942868, 1964615, 1988767, 2015194, 2042839, 2070555, 2097625, 2123521, 2147388, 2167963, 2183998, 2194661, 2199575, 2198591, 2191525, 2177975, 2157358, 2129158, 2093207, 2049685, 1998898, 1941217, 1877365, 1808709, 1737168, 1664704, 1592906, 1523092, 1456769]
50377A456769o1008n4101m6470l8784l0896k2406j3686n762Q46O557J1857J6343
50365A219259J9106J9641J8142J5081J0922N989L60o053j3071k0068k6372l1584
50353A211352l5403l7489l7906l7423l6895l6471l5667l4012l1386k7985k4368
50342H36347k1276j8959j6884j4510j2109j0338r179p945o167l986j737K57J634
50329G15148K422L492N835R191J2069J3372J3455J3348J3548J3953J4467J5175
50317H45475J6176J7562J9333K1100K2268K2716K3021K3712K4627K5275K5514
50306A086779K5453K5064K4239K3027K1400J8985J5548J1610Q164N707L815J718
50294A271509r54l927o585q543j0023j1592j3460j5260j6589j7504j8227j8716
$$ y = [1456769, 1395761, 1341660, 1295190, 1256406, 1225510, 1203104, 1189418, 1183656, 1184502, 1191059, 1202916, 1219259, 1238365, 1258006, 1276148, 1291229, 1302151, 1308140, 1308500, 1302447, 1289376, 1269308, 1242936, 1211352, 1175949, 1138460, 1100554, 1063131, 1026236, 989765, 954098, 920086, 888700, 860715, 836347, 815071, 796112, 779228, 764718, 752609, 742271, 733092, 725147, 718980, 714994, 713257, 713514, 715148, 717570, 721062, 726897, 736088, 748157, 761529, 774984, 788332, 801880, 815833, 830300, 845475, 861651, 879213, 898546, 919646, 941914, 964630, 987651, 1011363, 1035990, 1061265, 1086779, 1112232, 1137296, 1161535, 1184562, 1205962, 1224947, 1240495, 1252105, 1260269, 1265976, 1269791, 1271509, 1270555, 1266628, 1260043, 1251500, 1241477, 1229885, 1216425, 1201165, 1184576, 1167072, 1148845, 1130129]
50282A130129j8974j9427k0475k1759k2547k2823k3307k4181k4515k3440k1483
50271H87198k0059j9801k0039j9951j9521j9109j8570j7389j5514j3563j2118
50260F91564j1207j0582j0115r668q868p416n576m001l088k679k395k029j488
50247F12452p17J36O95P60O84J145K483M251N512N583M708L946M150M995N267
50232F56050M362L114K757L284L445K362N36r50j660j832j687j414j552k616m249
50217F59950n353n301m554l891l502l178k934k926l025k884k362j555n94L72J141
50202F19404J751K497L379L863L676L452L969M942N389N061M685M675M554L841
50188F75138K813J872R26j71j122j698k231l091m059m750n336o234p358q228q654
$$ y = [1130129, 1111155, 1091728, 1071253, 1049494, 1026947, 1004124, 980817, 956636, 932121, 908681, 887198, 867139, 847338, 827299, 807348, 787827, 768718, 750148, 732759, 717245, 703682, 691564, 680357, 669775, 659660, 649992, 641124, 633708, 628132, 624131, 621043, 618364, 615969, 613940, 612452, 611735, 611871, 612566, 613326, 614010, 615155, 617638, 621889, 627401, 632984, 637692, 641638, 645788, 650783, 656050, 660412, 663526, 666283, 669567, 673012, 675374, 675910, 674960, 673300, 671468, 669781, 668367, 666815, 664199, 659950, 654597, 649296, 644742, 640851, 637349, 634171, 631237, 628311, 625286, 622402, 620040, 618485, 617891, 618263, 619404, 621155, 623652, 627031, 630894, 634570, 638022, 641991, 646933, 652322, 657383, 662068, 666743, 671297, 675138, 677951, 679823, 680749, 680578, 679456, 677758, 675527, 672436, 668377, 663627, 658291, 652057, 644699, 636471, 627817]
50173F27817q882r193r620r907r528q096n974m039k618j203M08J466J404Q60O68
50158E63563M37p31k546l764m017m095m341m101l150k473k872l669l629k576j419
50143E20617r49j251k024k814l099k669j933j510j524j570j206l80O14J402J900
50128E03604K431L270M174M634M622M657M971N124M735M170M053M396M654M512
50114E64007M164L829L448K961K603K530K369J493j25j597k052j694j511j918
50100E78507k318k213k089k581l333l426k702j888j473j229q22j83Q19K292L842
50085E61203M806N211N783O870Q008Q796R425J0062J0436J0555J1029J2173J3344
50072F77701J3830J3851J4031J4341J4340J4085J3961J3829J3130J1874J0694
$$ y = [627817, 618935, 609742, 600122, 590215, 580687, 572591, 566617, 562578, 559960, 558757, 559165, 560631, 562035, 562895, 563563, 564000, 563269, 560723, 556959, 552942, 548847, 544506, 540405, 537255, 534782, 531910, 528241, 524612, 522036, 520617, 519668, 518417, 516393, 513579, 510480, 507811, 505878, 504368, 502844, 501274, 500068, 499688, 500302, 501704, 503604, 506035, 509305, 513479, 518113, 522735, 527392, 532363, 537487, 542222, 546392, 550445, 554841, 559495, 564007, 568171, 572000, 575448, 578409, 581012, 583542, 585911, 587404, 587279, 585682, 583630, 581936, 580425, 578507, 576189, 573976, 571887, 569306, 565973, 562547, 559845, 557957, 556484, 555255, 554433, 554250, 555069, 557361, 561203, 566009, 571220, 577003, 583873, 591881, 600677, 610102, 620164, 630600, 641155, 652184, 664357, 677701, 691531, 705382, 719413, 733754, 748094, 762179, 776140, 789969, 803099, 814973, 825667]
50061H25667R912R104P858O314M744L134J478J92k82j48p5l84p02o11l28l60o55
50044H64858n67J75R34R74M84K60O60J306J767J948J880J686J671J951K000J236
50028H83223J6o22l72L7K6j82l81r15j832k251j392L29J890K901L643M305M927
50011H93350N818P358R558J2297J5687J9742K3961K7742L0844L3063L3913L3261
49999A146594L1768L0010K7611K4050J9924J6442J3949J1981J0520J0113J0600
49988A353562J0849R952P828M428o63p379j4796k2162k9578l7056m3603m7979
49976A183403n0074n0790n0722m9628m7204m3750l9882l5943l1952k7985k4332
49965G31141k1237j8744j6860j5677j5056j4306j2744j0627r008q340p844o698
$$ y = [825667, 835579, 844683, 852541, 858855, 863599, 866733, 868211, 868403, 868121, 867973, 867898, 867514, 866812, 866201, 865873, 865513, 864858, 864291, 864466, 865400, 866374, 866858, 867118, 867778, 869084, 870851, 872799, 874679, 876365, 878036, 879987, 881987, 883223, 883239, 882617, 882245, 882282, 882308, 882126, 881745, 880830, 878998, 876747, 875355, 875684, 877574, 880475, 884118, 888423, 893350, 899168, 906526, 916084, 928381, 944068, 963810, 987771, 1015513, 1046357, 1079420, 1113333, 1146594, 1178362, 1208372, 1235983, 1260033, 1279957, 1296399, 1310348, 1322329, 1332849, 1342962, 1353562, 1364411, 1374363, 1382191, 1386619, 1385956, 1378577, 1363781, 1341619, 1312041, 1274985, 1231382, 1183403, 1133329, 1082539, 1031817, 982189, 934985, 891235, 851353, 815410, 783458, 755473, 731141, 709904, 691160, 674300, 658623, 643567, 629261, 616517, 605890, 596882, 588542, 580698, 574000]
49953E74000n298m587m634m765m844n313n998o009n140m346m273m254l466k344
49939E08729j971k492l046l140l156l476l785l546k769j921j318q27j46Q43J993
49924D79972L077L954M500M565M163L650L471L717M082M289M356M474M822N491
49910E38583O317O890O974O938P366Q278R089R376R305R284R681J0898J3095J5715
49896F67789J7901J9680K2072K5702K9951L3985L7895M2058M6061M9151N1342
49885A043587N3005N3688N2489M9618M6382M3465M0317L6631L3264L1045K9635
49874A513126K8354K7289K6622K5530K2887J8612J3277O728j648j1333k0624k8473
49862A620347l5329m1810m7469n1538n4000n5294n5544n4752n3265n1456m9359
$$ y = [574000, 568702, 564115, 559481, 554716, 549872, 544559, 538561, 532552, 527412, 523066, 518793, 514539, 511073, 508729, 506758, 504266, 501220, 498080, 494924, 491448, 487663, 484117, 481348, 479427, 478109, 477282, 477136, 477979, 479972, 483049, 487003, 491503, 496068, 500231, 503881, 507352, 511069, 515151, 519440, 523796, 528270, 533092, 538583, 544900, 551790, 558764, 565702, 573068, 581346, 590435, 599811, 609116, 618400, 628081, 638979, 652074, 667789, 685690, 705370, 727442, 753144, 783095, 817080, 854975, 897033, 943094, 992245, 1043587, 1096592, 1150280, 1202769, 1252387, 1298769, 1342234, 1382551, 1419182, 1452446, 1483491, 1513126, 1541480, 1568769, 1595391, 1620921, 1643808, 1662420, 1675697, 1682425, 1680777, 1669444, 1648820, 1620347, 1585018, 1543208, 1495739, 1444201, 1390201, 1334907, 1279363, 1224611, 1171346, 1119890, 1070531]
49851A070531m7105m5182m3625m1553l8290l4567l1680k9773k7866k5391k2701
49840F82798k0123j7530j5011j3111j2022j1320j0713j0379j0350j0285j0115
49829E41839j0158j0271r682q135o515n768n795n931n927n819n391m481l447k673
49815D51846j945r50qL77L27L06K65q6l88O0J129J826J580R36O85R65J461K011
49797D60397K572K897K617J657M22l10Q0J461K906L498L152K480K063K129K653
49782D90674L412L954M076M191M875O047P095P839Q905J0940J3888J7130K0177
49769F03203K3007K5948K9275L2835L6015L8236L9368L9540L8740L6909L4234
49758I77310L1021K7353K3199J8918J5302J3101J2547J3274J4427J5080J4716
$$ y = [1070531, 1023426, 978244, 934619, 893066, 854776, 820209, 788529, 758756, 730890, 705499, 682798, 662675, 645145, 630134, 617023, 605001, 593681, 582968, 572589, 562239, 551954, 541839, 531681, 521410, 511728, 503593, 497078, 491310, 485515, 479584, 473657, 467838, 462447, 457966, 454519, 451846, 449901, 448951, 448943, 449320, 449647, 449953, 450218, 450132, 449744, 449804, 450933, 452759, 454339, 455275, 455960, 456925, 458386, 460397, 462969, 465866, 468483, 470140, 470562, 470252, 470332, 471793, 474699, 478197, 481349, 483829, 485892, 488021, 490674, 494086, 498040, 502116, 506307, 511182, 517229, 524324, 532163, 541068, 552008, 565896, 583026, 603203, 626210, 652158, 681433, 714268, 750283, 788519, 827887, 867427, 906167, 943076, 977310, 1008331, 1035684, 1058883, 1077801, 1093103, 1106204, 1118751, 1132025, 1146452, 1161532, 1176248]
49747A176248J3293J0727O643Q38o268j3996k1884k9484l6096m1177m4777m7063
49735I67004m7641m5944m2163l7323l2606k8852k6311k4388k1930j8459j4873
49724F26514j2380j1023r947q717p568o661n975n763o153o448n803m511l604l313
49710E28648k978k460k332k540k238j291o37o57m53N63J558J589J010O16L76K5
49694E18799jP08J517J541J021P87Q70O99L56M56Q98Q65J47m42k48L59N75J12
$$ y = [1176248, 1189541, 1200268, 1206911, 1207749, 1201481, 1187485, 1165601, 1136117, 1100021, 1058844, 1014067, 967004, 919363, 873419, 831256, 793933, 761327, 732475, 706164, 681776, 659846, 641387, 626514, 614134, 603111, 593164, 584447, 576879, 570218, 564243, 558480, 552327, 545879, 540076, 535565, 531961, 528648, 525670, 523210, 520878, 518338, 516100, 514809, 514172, 513515, 513062, 513625, 515183, 516772, 517782, 518398, 518774, 518799, 518798, 519506, 521023, 522564, 523585, 524372, 525242, 525941, 526297, 526753, 527651, 528516, 528663, 528221, 527973, 528332, 528907, 529019]
$$ [...]
##END NTUPLES=NMR SPECTRUM
##END=
