
##TITLE=AC1248__6608987_ZayRjl4W6g
##JCAMPDX= 6.0         $$ Bruker NMR JCAMP-DX V2.0
##DATA TYPE= NMR SPECTRUM
##DATA CLASS= NTUPLES
##ORIGIN= BRUKER
##OWNER= Administrator
$$ 1.72 TOPSPIN		Version 2.1
$$ 2012-08-01 20:19:37.593 -0500  Administrator@TOPSPIN
$$ Compression mode = diff/dup
##.OBSERVE FREQUENCY= 400.02188249412
##.OBSERVE NUCLEUS= ^1H
##.ACQUISITION MODE= SIMULTANEOUS (DQD)
##.ACQUISITION SCHEME= undefined
##.AVERAGES= 8
##.DIGITISER RES= 22
##SPECTROMETER/DATA SYSTEM= spect
##.PULSE SEQUENCE= zg30
##.SOLVENT NAME= COFFEE_meoh
##.SHIFT REFERENCE= INTERNAL, COFFEE_meoh, 1, 14.98509
##AUDIT TRAIL= $$ (NUMBER, WHEN, WHO, WHERE, PROCESS, VERSION, WHAT)
$$ ##TITLE= Audit trail, TOPSPIN		Version 2.1
$$ ##JCAMPDX= 5.01
$$ ##ORIGIN= Bruker BioSpin GmbH
$$ ##OWNER= Administrator
$$ $$ C:\Bruker\TOPSPIN/data/COFFEE/nmr/AC1248__6608987_ZayRjl4W6g/10/pdata/1/auditp.txt
$$ ##AUDIT TRAIL=  $$ (NUMBER, WHEN, WHO, WHERE, PROCESS, VERSION, WHAT)
(   1,<2012-08-01 20:19:29.437 -0500>,<Administrator>,<TOPSPIN>,<go>,<TOPSPIN 2.1>,
      <created by zg
	started at 2012-08-01 20:18:22.796 -0500,
	POWCHK enabled, PULCHK disabled,
       configuration hash MD5:
       6B 1B 68 BB D9 2E 58 E2 7F 35 AD 54 07 DF 0E 41
       data hash MD5: 64K
       10 CE 0E 79 14 7B 50 6E 21 7D 70 6E 04 22 89 64>)
(   2,<2012-08-01 20:19:33.531 -0500>,<Administrator>,<TOPSPIN>,<proc1d>,<TOPSPIN 2.1>,
      <Start of raw data processing
       efp LB = 0 FT_mod = 6 PKNL = 1 PHC0 = 0 PHC1 = 0 SI = 32K 
       data hash MD5: 32K
       41 81 C9 70 E3 E1 DC 3F 11 7B 6F A9 12 94 77 EC>)
(   3,<2012-08-01 20:19:33.812 -0500>,<Administrator>,<TOPSPIN>,<proc1d>,<TOPSPIN 2.1>,
      <pk PHC0 = 175.5615 PHC1 = 0 
       data hash MD5: 32K
       D6 7F 33 35 BA 8E 1B 4C 1E CA 99 30 34 F0 E5 3D>)
(   4,<2012-08-01 20:19:33.890 -0500>,<Administrator>,<TOPSPIN>,<proc1d>,<TOPSPIN 2.1>,
      <abs ABSG = 1 
       data hash MD5: 32K
       7F 87 A6 35 B2 AA 4D D7 F6 C4 48 BC C3 86 4B A6>)
(   5,<2012-08-01 20:19:33.921 -0500>,<Administrator>,<TOPSPIN>,<proc1d>,<TOPSPIN 2.1>,
      <abs ABSG = 2 
       data hash MD5: 32K
       13 D6 E6 E5 40 F4 13 CC CD 00 73 6F 6B 20 DC AD>)
(   6,<2012-08-01 20:19:33.953 -0500>,<Administrator>,<TOPSPIN>,<proc1d>,<TOPSPIN 2.1>,
      <abs ABSG = 3 
       data hash MD5: 32K
       32 28 5F 0E 72 6E AD A6 EE 03 72 8A 6E DF 6C 9D>)
(   7,<2012-08-01 20:19:33.984 -0500>,<Administrator>,<TOPSPIN>,<proc1d>,<TOPSPIN 2.1>,
      <abs ABSG = 4 
       data hash MD5: 32K
       7F 8F 74 C0 5A E7 33 A7 F7 C3 C4 99 78 45 F4 0D>)
(   8,<2012-08-01 20:19:34.015 -0500>,<Administrator>,<TOPSPIN>,<proc1d>,<TOPSPIN 2.1>,
      <abs ABSG = 5 
       data hash MD5: 32K
       4B 6B 37 4A 3D 48 DC E2 DB 33 F2 ED AF BA AC FE>)
$$ ##END=
$$ 
$$ $$ hash MD5
$$ $$ 56 DC B5 B5 5B 76 74 DD BB 44 E7 EB 86 4E AE CF
##$RELAX= 
##$RELAX= 
##$RELAX= 
##$RELAX= 
##$RELAX= 
##$RELAX= 
##$RELAX= 
$$ Bruker specific parameters
$$ --------------------------
##$DU= <C:\Bruker\TOPSPIN>
$$ [...]
##$TP= (0..7)
150 150 150 150 150 150 150 150
##$TP07= 0
##$TPNAME0= <>
##$TPNAME1= <>
##$TPNAME2= <>
##$TPNAME3= <>
##$TPNAME4= <>
##$TPNAME5= <>
##$TPNAME6= <>
##$TPNAME7= <>
##$TPOAL= (0..7)
0.5 0.5 0.5 0.5 0.5 0.5 0.5 0.5
##$TPOFFS= (0..7)
0 0 0 0 0 0 0 0
##$TUNHIN= 0
##$TUNHOUT= 0
##$TUNXOUT= 0
##$USERA1= <user>
##$USERA2= <user>
##$USERA3= <user>
##$USERA4= <user>
##$USERA5= <user>
##$V9= 5
##$VALIST= <valist>
##$VCLIST= <CCCCCCCCCCCCCCC>
##$VD= 0
##$VDLIST= <DDDDDDDDDDDDDDD>
##$VPLIST= <PPPPPPPPPPPPPPP>
##$VTLIST= <TTTTTTTTTTTTTTT>
##$WBST= 1024
##$WBSW= 4
##$XGAIN= (0..3)
0 0 0 0
##$XL= 0
##$YL= 0
##$YMAX_a= 478243
##$YMIN_a= -623857
##$ZGOPTNS= <>
##$ZL1= 120
##$ZL2= 120
##$ZL3= 120
##$ZL4= 120
##$ABSF1= 14.98509
##$ABSF2= -5.573092
##$ABSG= 5
##$ABSL= 3
##$ALPHA= 0
##$AQORDER= 0
##$ASSFAC= 0
##$ASSFACI= 0
##$ASSFACX= 0
##$ASSWID= 0
##$AUNMP= <proc_prof1d_extract_pilot.lims>
##$AXLEFT= 0
##$AXNAME= <>
##$AXNUC= <1H>
##$AXRIGHT= 0
##$AXTYPE= 0
##$AXUNIT= <>
##$AZFE= 0.1
##$AZFW= 0.1
##$BCFW= 0
##$BC_mod= 0
##$BYTORDP= 0
##$COROFFS= 0
##$CY= 15
##$DATMOD= 1
##$DC= 0
##$DFILT= <>
##$DTYPP= 0
##$F1P= 0
##$F2P= 0
##$FCOR= 0.5
##$FTSIZE= 32768
##$FT_mod= 6
##$GAMMA= 0
##$GB= 0
##$INTBC= 1
##$INTSCL= 1
##$ISEN= 128
##$LB= 0
##$LEV0= 0
##$LPBIN= 0
##$MAXI= 10000
##$MC2= 0
##$MEAN= 0
##$ME_mod= 0
##$MI= 0
##$NCOEF= 0
##$NC_proc= -8
##$NLEV= 6
##$NOISF1= 0
##$NOISF2= 0
##$NSP= 0
##$NTH_PI= 0
##$NZP= 0
##$OFFSET= 14.98509
##$PC= 1
##$PHC0= 175.5615
##$PHC1= 0
##$PH_mod= 1
##$PKNL= yes
##$PPARMOD= 0
##$PPDIAG= 0
##$PPIPTYP= 0
##$PPMPNUM= 2147483647
##$PPRESOL= 1
##$PSCAL= 4
##$PSIGN= 0
##$PYNMP= <proc.py>
##$REVERSE= no
##$SF= 400.02
##$SI= 32768
##$SIGF1= 0
##$SIGF2= 0
##$SINO= 400
##$SIOLD= 32768
##$SPECTYP= <>
##$SREGLST= <1H.CDCl3>
##$SSB= 0
##$STSI= 32768
##$STSR= 0
##$SW_p= 8223.68421052631
##$SYMM= 0
##$S_DEV= 0
##$TDeff= 65536
##$TDoff= 0
##$TI= <>
##$TILT= no
##$TM1= 0
##$TM2= 0
##$TOPLEV= 0
##$USERP1= <user>
##$USERP2= <user>
##$USERP3= <user>
##$USERP4= <user>
##$USERP5= <user>
##$WDW= 1
##$XDIM= 32768
##$YMAX_p= 465347668
##$YMIN_p= -737739
##$CURPLOT= <Network HP LaserJet P1505>
##$CURPRIN= <$Network HP LaserJet P1505>
##$DFORMAT= <normdp>
##$LAYOUT= <+/1D_H.xwp>
##$LFORMAT= <normlp>
##$PFORMAT= <normpl>
##$SURQMSG= 1
$$ End of Bruker specific parameters
$$ ---------------------------------
##NTUPLES= NMR SPECTRUM
##VAR_NAME=  FREQUENCY,     SPECTRUM/REAL,   SPECTRUM/IMAG
##SYMBOL=    X,             R,               I
##VAR_TYPE=  INDEPENDENT,   DEPENDENT,       DEPENDENT
##VAR_FORM=  AFFN,          ASDF,            ASDF
##VAR_DIM=   32768,         32768,           32768
##UNITS=     HZ,            ARBITRARY UNITS, ARBITRARY UNITS
##FACTOR=    0.250966925370066, 1,           1
##FIRST=     8223.43324360094, 18232,        -164228
##LAST=      0,             -20045,          3824
##MIN=       0,             -737739,         0
##MAX=       8223.43324360094, 465347668,    0
$$ Real data points
##PAGE= N=1
##DATA TABLE= (X++(R..R)), XYDATA
$$ [...]
$$ plain form
19479 97263 -135873 5689 111675 89723 193030 -46272 -221668 -161896 -26818 -64860 52505
19467 -47065 -76775 261835 -70072 -279151 -51404 -276380 -54188 39808 -84630 -10489 -290099
19456 -290099 -12070 209062 -330502 -242549 -97131 111671 -158711 -93919 -47012 -272724
19446 -272724 -186062 162469 96157 81932 185646 -40914 -10527 -78508 226440 193595 -218362
19434 19780 -35948 65904 -27030 -86044 -49186 -418841 -27197 84607 174812 -24946 -71207
19423 -71207 -151217 -139588 -145044 -94518 41206 -343499 72948 334358 -227384 -153681 -4823
19411 -264594 -314901 -11149 -158681 -153943 5449 -98601 -52283 -22538 -92197 89528 78350 11382
19398 69300 -248256 146069 -162807 28139 -453457 -163793 5203 146519 -157280 -149233 -71661
$$ packed form
19479I7263a35873E689J05986k1952J03307d6272j75396N9772b6818l8042E2505
19467d7065k9710B61835g0072k09079e1404k24976e4188C9808h4630a0489k79610
19456b90099a2070B09062c30502Q7953i7131A11671a58711O4792M6907k25712
19446b72724Q6662A62469o6312j4225J03714d0914a0527o7981B26440l2845b18362
19434A9780c5948F5904b7030n9014L6858l69655b7197H4607R0205b4946m6261
19423g1207q0010J1629n456N0526D1206c43499G2948K61410b27384P3703d823
19411b64594n0307a1149j47532M738E449i8601M6318b2538o9659H9528j1178A1382
19398F9300b48256A46069a62807B8139d53457a63793E203J41316a57280Q047g1661
$$ plain form
19386 -129175 -80457 27915 -226398 42529 -34834 -84936 -22190 30174 -306437 391866 -207995
19374 -212751 272020 -328225 140280 -14480 -330254 -176722 60383 77295 -215025 1023
19363 -59540 71780 -204565 354307 -314475 224237 -56317 -23173 103208 -193868 -254945
19353 -254945 -142185 -172830 82420 21517 -232096 206025 441131 320124 -278049 48603
19342 -403080 -25302 -133757 90583 -109140 195013 -91120 138196 -103296 -128629 86592
19331 14036 -378231 -102209 -169932 320809 285990 -183249 -44803 -96598 -108044 -261399 -141960
19320 -141960 -229726 335401 -105006 -302013 -225721 -196389 -253793 176335 -312590 -12483
19309 -57988 -146225 9269 -110641 -630610 -354551 -313818 -126785 -103229 1813 28644 49796
$$ packed form
19386a29175M8718B7915b26398D2529c4834n0102b2190C0174c06437C91866b07995
19374b12751B72020c28225A40280a4480l15774J53532F0383J6912b15025A023
19363e9540G1780b04565C54307c14475B24237e6317b3173A03208a93868o1077
19353b54945J12760l0645H2420B1517b32096B06025K35106j21007b78049D8603
19342d03080b5302j08455I0583a09140A95013i1120A38196a03296k5333H6592
19331A4036c78231a02209o7723C20809l4819a83249d4803n1795j1446j53355J19439
19320a41960q7766C35401a05006j97007P6292K9332n7404A76335c12590a2483
19309e7988q8237I269a10641n19969K76059M0733a26785K3556A813K6831K1152
$$ plain form
19298 49796 -333297 29062 -532701 -151897 -98887 -236903 -64110 -59316 250912 -242594 -437269
19287 -437269 70036 -117547 -84175 54128 81499 -362095 140863 87598 267254 111008
19276 223372 -162675 -119534 15842 -62818 9253 -159226 207062 45084 -245333 -66703 190320
19264 -282554 -6599 -117228 131929 -353907 4167 21998 -39191 -23475 -321036 150205 -129562
19252 -99129 -223345 7684 -162178 551289 -161394 -123133 -66096 -239549 -54526 52118 245626
19241 245626 36981 -94314 -184778 221733 -401375 -84916 31339 300156 -7323 -126444 -89251
19230 -89251 92432 -427709 31363 -61830 -225547 107265 230760 -210891 328289 -125939
19219 -124304 -171439 -80744 -172749 198223 -210057 -116790 -90464 -54155 -143421 165961 -172016
$$ packed form
19298D9796c33297B9062e32701a51897N3010j38016f4110M794B50912b42594j94675
19287d37269G0036a17547L3372E4128K7371c62095A40863n3265J79656A11008
19276B23372a62675M3141A5842f2818I253a59226B07062D5084b45333f6703A90320
19264b82554f599j10629A31929c53907D167J7831c9191J5716k97561A50205a29562
19252i9129j24216G684a62178E51289a61394L8261N7037j73453e4526E2118J93508
19241B45626C6981i4314r0464B21733d01375h4916C1339K68817g323j19121L7193
19230h9251I2432d27709C1363f1830j63717A07265J23495b10891C28289a25939
19219a24304m7135h0744r2005A98223b10057R3267K6326L6309q9266A65961a72016
$$ plain form
19207 147492 -114996 -256747 -405501 291661 -99533 209538 -463061 49742 446 37544 -17977
19195 -266498 -61563 -297269 -30450 -380457 -249781 -150726 -135425 -97173 -38855 104724 108481
19184 108481 -211523 -2758 -250116 -359900 211695 -271377 -131388 155558 103099 -283059
19173 -17531 -291524 163777 -7170 -246394 295357 -170385 117846 112654 -261977 -19635 -50593
19162 -50593 -182610 161192 225356 -24778 84421 139520 322296 -93403 -270168 -375719 -197875
19151 -197875 89023 44995 240280 -30869 -163561 -118501 -41939 -310355 -274564 83319 192992
19140 192992 9655 43581 -172183 2189 -136977 85676 111262 322758 28575 -319673 -21522
19128 -109773 -68050 11061 -372496 -25168 -89840 -116349 94591 229228 30791 131515 -11943
$$ packed form
19207A47492a14996j41751j48754B91661i9533B09538d63061D9742D46L7098a7977
19195b66498f1563k35706c0450l50007J30676R9055J5301L8252c8855A04724L757
19184A08481b11523b758k47358j09784B11695b71377a31388A55558n2459b83059
19173a7531k73993A63777g170k39224B95357a70385A17846n192b61977a9635l0958
19162e0593j32017A61192O4164b4778H4421N5099J82776i3403j76765j05551J77844
19151a97875H9023m4028J95285c0869j32692M5060d1939k68416L5791H3319J09673
19140A92992I655L3926a72183B189a36977H5676K5586K11496B8575c19673b1522
19128a09773M1723A1061c72496b5168o4672k6509I4591J34637C0791J00724a1943
$$ plain form
19116 285225 -145259 43709 -17362 -40255 -73358 -139989 -92772 -61784 -94314 -454803 -54076
19104 43798 -106265 37782 -105375 116280 182 -350184 178308 -41178 -125769 -209273 -257173
19093 -257173 -23158 -288831 285051 -48124 60723 -95598 236808 -143562 147400 -203936
19082 -132777 -81816 -7623 38505 -54218 -193084 82073 25787 -417029 1541 5988 -205204
19070 259047 -234212 206344 -546912 123436 -17996 -105072 23931 -329224 99761 176218
19060 176218 -556389 8349 -198908 -14053 -13431 -401216 75011 -93388 -38332 -71553 -234663
19049 -234663 -142358 61097 76219 -38441 -460210 50493 -120750 -147246 -227493 -21194 -133575
19038 -133575 -117380 121432 88270 -162338 -14268 -181605 -123607 -332486 115316 -160607
$$ packed form
19116B85225a45259D3709a7362k2893l3103o6631M7217L0988l2530l60489e4076
19104D3798a06265C7782a05375A16280A82c50184A78308d1178q4591q3504m7900
19093b57173b3158k65673B85051d8124F0723i5598B36808a43562A47400b03936
19082a32777N0961g623C8505e4218j38866H2073B5787d17029A541M447b05204
19070B59047b34212B06344e46912A23436a7996q7076B3931c29224I9761P6457
19060A76218e56389H349a98908a4053O22l87785G5011i3388c8332l3221j63110
19049b34663R2305F1097J5122c8441m21769E0493a20750k6496q0247b1194j12381
19038a33575J6195A21432l3162a62338a4268j67337N7998k08879A15316a60607
$$ plain form
19027 282799 -22263 197535 -82067 -46314 -132909 39192 128166 253576 46100 203630 -126062
19015 80693 -201619 -119835 -253368 -144671 -164148 232248 195843 -246653 -89436 269939
19004 46059 -31218 32629 112064 -190227 74105 48433 -41039 251087 -31291 -50128 -128419
18993 -128419 194015 -13963 183668 158730 13009 -236925 16209 134173 -34879 291073
18982 -101839 -48151 -349444 320687 98615 23613 -151653 -96008 -30145 20845 381121 485814
18971 485814 672447 308149 206649 1823 74509 -307882 -60589 -38710 -138842 -119296 -260021
18960 -260021 -68506 -346575 -4764 26249 -313211 -220323 -124464 -332999 -180202 181846 -6916
18948 75646 -253735 -68188 -37570 53484 -270406 110983 48955 -101217 -5084 88566 -106121
$$ packed form
19027B82799b2263A97535h2067L5753q6595C9192Q8974J25410D6100J57530a26062
19015H0693b01619Q1784j33533J08697j9477B32248l6405b46653h9436B69939
19004D6059c1218C2629P9435a90227G4105k5672d1039B51087c1291j8837p8291
18993a28419A94015a3963A83668k4938A3009b36925A6209J17964c4879B91073
18982a01839d8151l01293C20687I8615B3613a51653N5645c0145B0845L60276J04693
18971D85814J86633C08149j01500A823P2686c07882f0589K1879j00132J9546j40725
18960b60021f8506k78069d764B6249c13211R2888R5859k08535J52797A81846f916
18948G5646b53735f8188L0618E3484b70406A10983D8955a01217e084H8566a06121
$$ plain form
18936 -18227 -212251 85429 -173955 43729 -14458 57189 269909 -145793 25507 -53203 -87025
18925 -87025 14917 -9236 -323451 88921 -168609 60511 -22200 131051 -55907 -19074 -13961
18914 -13961 -133688 -143032 183599 32855 382530 570140 326800 237966 74344 126004 118463
18903 118463 95283 94299 -110951 -239496 -83421 65461 207456 -131362 -137299 -385709 -287304
18892 -287304 -167927 -96374 142135 -260769 -116137 -201 -30160 -42310 -2814 -151597 107754
18880 -192747 -93531 -304708 -24753 -241348 -12957 -426140 -157338 -114839 -20264 -109967 -35345
18868 206094 -156616 -57002 144356 -81037 -265419 -386965 76578 75598 -56684 -116296 258256
18856 -90014 -66297 7748 -337882 43762 274344 29069 -10979 1988 -492000 339844 -54745
$$ packed form
18936a8227j94024H5429a73955D3729a4458E7189K12720a45793B5507e3203l3822
18925h7025A4917i236l14215H8921a68609F0511b2200A31051e5907a9074N113
18914a3961j19727r344A83599C2855L49675J87610k43340q8834G4344N1660p541
18903A18463k3180r84a10951j28545h3421F5461J41995a31362n937k48410R8405
18892b87304J19377P1553A42135b60769a16137b01k9959j2150b814j48783A07754
18880a92747i3531k11177b4753k16595a2957m13183a57338M2499b0264q9703c5345
18868B06094a56616e7002A44356h1037j84382j21546G6578r80e6684n9612B58256
18856i0014K3717G748c37882D3762K30582B9069a0979A988d92000C39844e4745
$$ plain form
18844 163304 203354 296236 206208 63199 75562 -259084 -51986 -170429 -221824 11485 90330
18833 90330 345072 17373 117890 24874 -154129 -279 371453 -252881 -90801 102316 -128286
18821 -136493 -45396 -257877 -178300 -159778 -4542 -336296 -230980 193204 47007 -92073 151561
18809 -215924 170216 96193 -51145 36079 401898 136158 -14628 -182137 -10816 -330941
18799 -330941 -39696 95637 -144160 29391 -306083 -57001 -66877 -20408 116518 -161546 262479
18787 -128507 -177034 -696 307550 54755 2914 13940 -65940 -208137 -287625 -114169 48709
18775 217139 -55217 81142 245366 -200272 -141186 7239 -163625 -331174 151070 -119449
18764 -260868 -38576 49454 -78450 -148820 -48573 -263569 -121034 -286927 -317206 -259878 -209464
$$ packed form
18844A63304M0050R2882r0028F3199J2363b59084e1986j18443n1395A1485P8845
18833I0330K54742A7373J00517B4874a54129b79C71453b52881i0801A02316a28286
18821a36493d5396k12481P9577J8522d542l31754J05316A93204D7007i2073A51561
18809b15924A70216p4023e1145C6079L65819A36158a4628j67509a0816l20125
18799c30941c9696I5637a44160B9391c06083e7001r876b0408A16518a61546B62479
18787a28507m8527f96C07550E4755B914J1026f5940j42197p9488a14169D8709
18775B17139e5217H1142J64224b00272N9086G239a63625j67549A51070a19449
18764b60868c8576D9454g8450p0370d8573k14996a21034j65893l0279N7328N0414
$$ plain form
18753 -209464 163497 -40879 -8944 -158004 -248084 -121754 108510 68547 -324368 -399778 -43777
18741 179452 2759 -123043 -72136 158535 170428 -173617 -32891 5732 306815 -231304 33374
18729 -104645 -10974 -111979 35015 91108 -479516 -30156 281539 218227 20405 66292 -347891
18717 183221 578167 -179113 194032 -140697 62552 85380 -126366 86673 -30449 -40794
18707 -40794 -38479 -206021 -348388 22871 266740 -56111 -191234 86527 -132912 106828 -211713
18695 113807 -108639 -435015 175669 -155923 -39727 -72094 135586 -90070 -30517 -69025
18685 -69025 -107556 -148126 -401636 -176744 33520 -292918 -15888 -199945 -334255 -2281 -77402
18674 -77402 17898 196373 70786 -133507 -94824 -201716 -173330 3094 92917 -229408 77286
$$ packed form
18753b09464A63497d0879h944j49060r0080a21754A08510l9963c24368p5410d3777
18741A79452B759a23043N0907A58535J1893a73617c2891E732L01083b31304C3374
18729a04645a0974j01005C5015N6093d79516c0156B81539o3312B0405M5887c47891
18717A83221L94946a79113A94032a40697F2552K2828a26366H6673c0449j0345
18707d0794K315j67542j42367B2871K43869e6111j35123H6527a32912A06828b11713
18695A13807a08639l26376A75669a55923c9727l2367A35586i0070c0517l8508
18685f9025l8531m0570k53510a76744C3520b92918a5888j84057j34310b281p5121
18674g7402A7898J78475G0786a33507L8683j06892K8386C094Q9823b29408G7286
$$ plain form
18662 -85371 -306338 -130115 -10551 26454 -181902 -541395 -206949 388149 -148614 19566
18651 89326 -201046 -338447 -419399 73834 115979 -58329 -141828 120302 78802 -75954 -211998
18640 -211998 106355 -162686 -171752 -71579 -138600 -125682 -6843 -3765 116177 -175798 -148612
18629 -148612 -117553 255948 52557 -50827 -232375 -265140 63240 -216432 -204570 193661 -172695
18617 32338 255960 -227312 -133989 -5811 -608329 -79138 -175088 86740 -124362 59333 31358
18606 31358 -89680 -122310 -27964 -14371 42493 -119044 -97520 32188 67177 66901 232953 373001
18594 373001 -224063 -231223 47202 -57002 -126041 -98769 -296558 247263 128433 4893 -51961
18582 142786 -179317 -139929 -3847 -88702 -142860 130758 201262 64678 129311 -150615 194835
$$ packed form
18662h5371k20967a30115a0551B6454a81902l59493b06949C88149a48614A9566
18651H9326b01046j37401q0952G3834M2145e8329q3499A20302m1500g5954j36044
18640b11998A06355a62686r066g1579o7021J2918f843L078A16177a75798K7186
18629a48612L1059B55948E2557e0827j81548l2765F3240b16432J1862A93661a72695
18617C2338K23622b27312R3323e811o02518g9138r5950H6740a24362E9333k7975
18606C1358h9680l2630b7964J3593D2493a19044K1524C2188L4989k76J66052J40048
18594C73001b24063p160D7202e7002o9039K7272j97789B47263j18830D893e1961
18582A42786a79317L9388c847q4855n4158A30758P0504F4678O4633a50615A94835
$$ plain form
18570 -123895 11479 -371946 -31949 43685 48035 -183625 167957 94237 -91564 -19583 77669
18558 -202291 -210494 -90438 78058 -38238 7007 9879 -286393 39424 26053 150015 -115982
18546 -136900 91783 -321252 36130 71050 -100357 495840 -125057 -76906 -259490 271162
18535 -208375 129715 389207 -124986 -376947 -30816 94309 -164107 79543 101542 -22053
18524 15825 71081 -80311 -276964 -138249 -36640 -115815 -149885 -453251 -95492 -117344 -16632
18512 193801 61258 284479 -59427 389217 -20773 231787 404647 58290 283701 34794
18501 -123064 -28207 9583 29273 206884 -27740 -222439 47820 -72172 -13690 -302804 259820
18489 -74890 -48550 -139592 -157388 469010 105003 112571 196358 -94651 85982 54734 -183492
$$ packed form
18570a23895A1479c71946c1949D3685M350a83625A67957p3720i1564a9583G7669
18558b02291q203i0438G8058c8238G007K872b86393C9424j3371J23962a15982
18546a36900I1783c21252C6130L4920a00357D95840a25057M8151j82584B71162
18535b08375A29715K59492a24986k51961c0816I4309a64107G9543K1999b2053
18524A5825N5256h0311j96653a38249c6640p9175l4070l03366i5492k1852a6632
18512A93801F1258K23221e9427C89217b0773B31787J72860E8290K25411C4794
18501a23064b8207I583J9690J77611b7740j94699D7820g2172a3690k89114B59820
18489g4890K6340r1042j7796D69010A05003P568Q3787i4651H5982l1248a83492
$$ plain form
18477 -164832 91372 -245844 -166791 238863 42197 -192372 215347 -53909 62309 -158871
18466 -198754 10127 -457140 -14379 -46058 -237697 -233735 -160261 -84979 151554 -32764 -1428
18454 -155338 5931 109768 239939 281496 83354 -42099 204736 -49467 -96752 29608 -173148
18442 -346826 73055 84257 380184 286469 -137840 -148103 218537 145230 90325 242862 71567
18430 138130 -337761 -223740 -262351 123385 58209 -300233 -247099 28186 125964 -94664 -205415
18419 -205415 93604 -46210 98226 -27498 -101212 131780 58894 70448 11895 -212727 -192693
18408 -192693 77143 -128529 -369041 109990 -235910 218888 -31093 49771 102833 -52517
18397 164314 45784 244566 -258144 -333849 -109809 -5096 -407897 138384 -214220 -320501
$$ packed form
18477a64832I1372b45844P9053B38863D2197a92372B15347e3909F2309a58871
18466a98754A0127d57140a4379l1679j91639L962P3474P5282A51554c2764a428
18454a55338E931J03837J30171M1557H3354d2099B04736d9467m7285B9608a73148
18442c46826G3055J1202K95927r3715a37840j0263B18537p3307n4905J52537G1567
18430A38130c37761J14021l8611A23385E8209c00233N3134B8186R7778i4664j10751
18419b05415I3604d6210I8226b7498p3714A31780E8894J1554A1895b12727K0034
18408a92693G7143a28529k40512A09990b35910B18888c1093D9771N3062e2517
18397A64314D5784J98782b58144p5705a09809e096m02801A38384b14220j06281
$$ plain form
18387 -320501 -36770 -387171 -158747 -306500 -15905 -91703 302922 251194 -159284 -16062
18376 68326 34481 -201885 -163624 -38099 -30094 -178292 -164216 -71346 -383541 -4309 -205077
18365 -205077 -224510 -156026 -109435 -386218 -122747 -208817 -66376 -78858 63707 238519 262729
18354 262729 -31472 -282224 -54835 184452 -169950 -263512 -255818 10564 -312981 -108529 3426
18342 116076 -100804 45380 -270211 -419733 -54060 -250395 -216503 -289103 -155458 283800
18331 55213 -33518 1770 285612 -258138 -98591 29335 65052 -174237 -319452 128205 401552
18320 401552 -13958 126503 -308734 -42452 102775 207538 267469 263617 152364 39543 24929
18309 24929 -43035 202382 -65273 108426 -233946 -151259 113732 49570 14640 -81020 -85357
$$ packed form
18387c20501c6770l50401a58747j47753a5905p5798C02922n1728a59284a6062
18376F8326l3845b01885L8261c8099Q005j48198J4076g1346l12195d309k00768
18365b05077j9433O8484M6591k76783a22747q6070f6376j2482F3707J74812K4210
18354B62729c1472k50752e4835A84452a69950r3562P694A0564c12981a08529C426
18342A16076a00804D5380b70211j49522e4060j96335L3892p2600J33645B83800
18331E5213c3518A770K83842b58138i8591B9335L5717a74237j45215A28205K73347
18320D01552a3958A26503c08734d2452A02775J04763N9931l852j11253C9543j4614
18309B4929d3035B02382f5273A08426b33946Q2687A13732D9570A4640h1020m337
$$ plain form
18298 -85357 283016 -305758 -311924 21851 98564 34282 296425 146581 -24503 282426 -160154
18286 163258 52459 261802 323106 -41505 52020 113400 -62579 299556 126313 -214419 -96057
18274 109465 -66785 -210481 13698 -231141 -150932 221539 104511 58663 -208474 164827
18263 -283249 -74958 -238468 -232902 131257 -98752 205953 -69688 -186574 -160284 29058 80462
18252 80462 91616 182919 778 25292 -15386 375217 -178576 252303 -77367 -120647 -110971 -297902
18240 -297902 -192478 -8018 -26809 119805 -37617 4005 -345689 123655 -76787 -209620 198835
18228 138737 237257 -337304 -47238 203817 -240899 -242126 87976 25687 109397 233261 141880
18217 141880 -86951 -226586 129236 108644 -111212 287412 90967 -83707 70159 -167207
$$ packed form
18298h5357B83016c05758o166B1851P6713C4282K62143A46581b4503B82426a60154
18286A63258E2459K09343O1304d1505E2020O1380f2579B99556A26313b14419i6057
18274A09465f6785j43696A3698b31141Q0209B21539A04511m5848b08474A64827
18263b83249g4958j63510N566A31257i8752B05953f9688j16886K6290B9058N1404
18252H0462J1154R1303G78K4514a5386C75217a78576B52303g7367m3280R676j86931
18240b97902J05424h018j8791A19805c7617D005c45689A23655g6787j32833A98835
18228A38737R8520c37304d7238B03817b40899j227H7976B5687Q3710J23864r1381
18217A41880h6951j39635A29236k0592a11212B87412I0967h3707G0159a67207
$$ plain form
18206 -240746 -21315 -105369 -114019 -93763 -27185 241239 -89841 103347 43816 -38937 305838
18194 293127 76155 -259775 204448 305229 -213965 46176 -54613 -122352 31720 -147640
18183 213673 169472 -116159 56466 -5041 -95565 -217565 -67255 159075 -54825 -6128 266952
18171 70683 -33375 -2213 62596 -55749 -193544 154583 -513751 232306 27585 79948 126066
18160 126066 -126716 -109296 -88140 2246 278792 127312 -66889 173067 -239944 -43505 -276697
18149 -276697 145537 -129855 58430 -1178 -151561 117448 261925 -79966 104683 -62934
18138 130123 -173891 98698 -229802 -228813 -130929 272440 1920 -285344 228402 -2606 -373426
18127 -373426 -218409 -56655 -113897 -32988 -190103 -48381 4128 -204385 -46843 -84674 -75175
$$ packed form
18206b40746b1315q4054q650K0256b7185B41239h9841A03347D3816c8937C05838
18194B93127G6155b59775B04448J00781b13965D6176e4613o7739C1720a47640
18183B13673m4201a16159E6466e041r0524j22000f7255A59075e4825f128B66952
18171G0683c3375b213F2596e5749j37795A54583e13751B32306B7585N2363M6118
18160A26066a26716J7420K1156B246K76546A27312f6889A73067b39944d3505k33192
18149b76697A45537a29855E8430a178j50383A17448J44477g9966A04683f2934
18138A30123a73891I8698b29802R89R7884B72440A920b85344B28402b606l70820
18127c73426J55017e6655n7242c2988j57115d8381D128b04385d6843l7831R499
$$ plain form
18116 -75175 93373 -191798 -3178 -96731 40051 405353 65815 261759 -279811 57572 230010
18105 230010 -325423 51018 201027 -118120 -48548 -116873 -50003 286993 154402 261521
18095 261521 -65868 51229 166177 143217 -104977 273545 -259979 -9015 -313478 -131204
18084 -220743 -163908 -143599 43567 -157914 -215472 -262711 137190 162352 -19908 -500892 -41294
18072 182753 -29434 166013 -102526 -129523 -107979 -310584 109490 132548 -256924 63322
18061 -118575 210186 8742 129571 90997 -210187 12686 -170354 -166671 131515 31317 -11831
18049 -351214 -114799 123253 -49680 112809 -223971 -8844 168767 67951 67911 251683 50358
18037 -114457 209819 -114622 108332 2495 340195 88772 329685 153757 254351 -169376
$$ packed form
18116g5175I3373a91798c178r3553D0051L65302F5815J95944b79811E7572J72438
18105B30010c25423E1018J50009a18120d8548o8325e0003B86993j32591J07119
18095B61521f5868E1229J14948k2960a04977B73545b59979i015l04463a31204
18084b20743N6835K0309D3567a57914n7558m7239A37190K5162a9908m80984d1294
18072A82753b9434A66013a02526k6997K1544k02605A09490K3058b56924F3322
18061a18575B10186H742J20829l8574b10187A2686a70354L683A31515C1317a1831
18049c51214a14799A23253d9680A12809b23971h844A68767F7951m0J83772E0358
18037a14457B09819a14622A08332B495L37700H8772K40913A53757J00594a69376
$$ plain form
18026 19227 172593 319644 -146330 156004 41945 -107469 40664 -91423 6484 56740 -36109
18014 208789 219613 -230651 95338 162631 -114418 -226562 130891 143202 227521 347255
18004 347255 -140544 -283759 -192646 -274783 12002 272341 -17527 -78733 -22730 241600 -147323
17992 228025 -183082 -98327 -12352 -10867 84527 352496 120792 191483 176561 389656 -118913
17980 147180 76930 -197060 -102590 6155 -51962 -210578 -313668 169148 39057 -229442 396883
17968 -174919 211198 112393 147666 4939 15867 -94574 -64128 -83499 169755 -43939 2637
17956 -167805 108525 -52132 52839 217650 -38126 143017 -160348 169561 190939 207388
17946 207388 -269097 101644 42690 457445 -4111 -19720 -184747 -59934 385882 -8963 72469
$$ packed form
18026A9227J53366J47051a46330A56004D1945a07469D0664i1423F484N0256c6109
18014B08789J0824b30651I5338O7293a14418j12144A30891J2311Q4319J19734
18004C47255a40544j43215R1113q2137A2002K60339a7527o1206b2730B41600a47323
17992B28025a83082Q4755a2352J485H4527K67969A20792P0691j4922K13095a18913
17980A47180p0250a97060R4470F155e1962j58616j03090A69148C9057b29442C96883
17968a74919B11198r8805L5273D939J0928i4574L0446j9371A69755d3939B637
17956a67805A08525e2132E2839J64811c8126A43017a60348A69561K1378J6449
17946B07388b69097A01644D2690M14755d111j5609j65027e9934C85882h963G2469
$$ plain form
17934 114036 -190539 -156507 -93337 5589 -105112 254209 -20903 142444 33939 -13739 20789
17922 -53577 366445 -175298 -87731 88705 -37121 30058 47184 -124699 -66699 -117931 166767
17910 29600 -16885 -268825 32132 249092 -4345 103047 -191854 421739 -162970 -250181 -30387
17898 108719 -47632 217960 109836 183440 155577 250724 141509 -224239 -12840 240856
17887 66677 -166599 197042 189176 75635 -74959 -85391 -153781 238271 -37278 -181363 228703
17875 154654 133008 -24563 -205902 -172601 226445 -60884 -72348 -187889 -121369 215147 202116
17864 202116 355239 -73852 85629 124053 -174720 116665 289542 138658 -94409 -170037
17854 -170037 -95217 -92312 95424 142504 -29614 199844 202191 -22419 13212 -210820 -98802
$$ packed form
17934A14036a90539L4032O3170E589a05112B54209b0903A42444C3939a3739B0789
17922e3577C66445a75298Q7567H8705c7121C0058J7126a24699N8000n1232A66767
17910B9600a6885k51940C2132K16960d345A03047a91854D21739a62970q7211c0387
17898A08719d7632B17960j08124P3604k7863R5147j09215b24239a2840B40856
17887F6677a66599A97042p866G5635g4959j0432o8390B38271c7278j44085B28703
17875A54654k1646b4563j81339L3301B26445f0884j1464j15541O6520B15147j3031
17864B02116J53123g3852H5629L8424a74720A16665J72877A38658i4409p5628
17854a70037P4820K905I5424M7080b9614A99844K347b2419A3212b10820i8802
$$ plain form
17842 96774 118812 78100 -119576 111094 -68813 350067 115453 -90814 -74939 -128342 74199
17830 167568 -83755 170891 -113878 -208520 -98113 -20692 -181762 297698 -150846 222477
17819 99899 287437 -276573 67073 244058 -86704 5031 -6314 -127995 -356932 -203521 -44680
17807 -95771 168796 53395 150002 224324 -111493 520461 7777 135016 29676 187934 51179
17795 -74309 333322 -92720 -118324 89207 50142 229947 228998 -117828 55428 -260679 104377
17783 -177095 87764 291025 272520 -98887 177785 241598 -466677 81482 195280 78680 -90417
17771 -223929 -60150 26155 69444 141281 73760 -98873 -192821 157012 159474 -119470 216492
17759 134562 -268268 179810 -125509 179423 15852 177981 51116 172849 -105379 -10403
$$ packed form
17842I6774K2038m0712a19576A11094f8813C50067A15453i0814J5875n3403G4199
17830A67568h3755A70891a13878r4642i8113b0692j61070B97698a50846B22477
17819I9899J87538b76573F7073J76985h6704E031f314j21681k28937J53411d4680
17807i5771A68796E3395R6607P4322a11493E20461G777J27239B9676J58258E1179
17795g4309C33322i2720k5604H9207l9065J79805r49a17828E5428b60679A04377
17783a77095H7764K03261j8505i8887A77785O3813d66677H1482J13798G8680i0417
17771b23929f0150B6155M3289P1837o7521i8873r3948A57012K462a19470B16492
17759A34562b68268A79810a25509A79423A5852J62129E1116J21733a05379a0403
$$ plain form
17748 76391 1524 -11271 197838 -201857 -31290 -217442 -112325 115608 -8429 266894 -291
17736 111378 122531 154610 -172819 -1910 68617 -70422 127548 299842 -30807 -257810 -183837
17725 -183837 110631 88963 -396 -95386 84410 87963 141378 429387 -26759 345039 457335
17714 457335 174014 196973 33033 -128158 -58819 244441 -67636 -87710 -84233 -90973 -99614
17703 -99614 -178014 404945 -72156 88435 270800 53861 131342 -214021 -8600 82752 193316
17692 193316 30518 145897 369676 -72596 213727 -94334 -60568 -119686 142133 40341 226451
17681 226451 58799 28795 104852 111331 34925 -145418 51723 141653 24253 -148450 297855
17669 41902 -37105 -223335 -305605 254285 172584 340304 133139 173080 -130684 17565 88243
$$ packed form
17748G6391A524a1271A97838b01857c1290j86152J05117A15608h429B66894b91
17736A11378J1153L2079a72819a910F8617g0422A27548J72294c0807k27003P3973
17725a83837A10631k1668c96r4990H4410L553N3415K88009b6759C45039J12296
17714D57335A74014K2959C3033a28158e8819B44441f7636k0074L477o740q641
17703i9614p8400D04945g2156H8435J82365E3861P7481b14021h600H2752J10564
17692A93316C0518J15379K23779g2596B13727i4334L3766n9118A42133D0341J86110
17681B26451E8799B8795P6057O479C4925a45418E1723Q9930B4253a48450B97855
17669D1902c7105j86230q2270B54285q1701J67720A33139L9941a30684A7565P0678
$$ plain form
17658 88243 179712 -101215 167559 -59212 -220082 123972 171581 269466 -63958 404249 95431
17646 -245603 -119720 91170 70717 294452 191292 -64837 181052 187434 227102 388885 237014
17635 237014 74337 262463 324417 126150 50538 8576 -257404 209012 -50762 -127461 125885
17623 83281 252148 -192530 -1734 127834 140181 -68214 400325 308827 288350 246634 196751
17612 196751 -60482 -252211 -117005 166198 157703 13290 270556 16631 -81447 135060 -100594
17600 264553 32786 65859 175072 157575 279046 225316 185211 452919 478723 -201209 128981
17588 -19242 483067 -13156 857 231367 149564 85738 208576 -95715 357481 234677 117525
17577 117525 172179 146769 -55451 -114556 69005 397979 427145 348727 -23136 226132 -251026
$$ packed form
17658H8243R1469a01215A67559e9212j60870A23972M7609R7885f3958D04249I5431
17646b45603a19720I1170k0453K23735j03160f4837A81052O382L9668J61783j51871
17635B37014G4337J88126O1954A26150E0538H576b57404B09012e0762p6699A25885
17623H3281J68867a92530a734A27834J2347f8214D00325r1498k0477m1716m9883
17612A96751f0482j91729a17005A66198q495A3290K57266A6631h1447A35060a00594
17600B64553C2786L3073J09213j7497J21471n3730m0105K67708K5804b01209A28981
17588a9242D83067a3156H57K30510q1803o3826J22838i5715C57481j22804j17152
17577A17525N4654k5410e5451n9105F9005L28974K9166p8418b3136B26132b51026
$$ plain form
17565 97599 300515 4076 95404 185075 240291 241561 166006 169739 177105 290755 82695 226793
17553 226793 10684 103138 361828 154695 185021 273800 107632 255913 344794 465560
17543 465560 187567 105659 331318 104253 176582 148256 151468 273654 331176 88799 214031
17532 214031 322597 355041 96977 223195 480111 687985 568428 766005 1220127 1031875
17522 1031875 1130005 749058 809144 695127 464477 171169 457791 353837 477979 278858
17512 278858 529526 909120 821791 1063428 1038916 1237954 723290 833557 345808 291181
17502 291181 410063 592702 310961 231745 502048 81089 311830 506158 395933 363245
17492 363245 98967 318788 380360 32720 89175 394156 399833 153169 290831 351312 441748
$$ packed form
17565I7599K02916D076R1328Q9671N5216J270p5555L733P366J13650H2695J44098
17553B26793A0684R2454K58690A54695L0326Q8779A07632J48281Q8881J20766
17543D65560A87567q1908K25659A04253P2329k8326L212J22186N7522H8799J25232
17532B14031J08566L2444I6977J26218K56916K07874j19557J97577M54122j88252
17522A031875R8130l80947O0086j14017k30650A71169K86622j03954J24142j99121
17512B78858K50668L79594q7329K41637k4512J99038n14664J10267C45808n4627
17502B91181J18882J82639k81741p9216K70303H1089K30741J94328j10225l2688
17492C63245I8967K19821O1572C2720N6455L04981N677A53169J37662O0481R0436
$$ plain form
17481 441748 352887 165771 46773 266767 20023 121109 286938 200202 91059 88809 50034
17470 50034 316992 440470 348040 103941 567866 296851 240090 414048 156021 70585
17459 193415 521473 282121 428634 246116 294355 307255 201484 278296 320090 10850
17448 216586 360323 482996 477647 601525 331199 163439 402235 268529 437673 57092
17437 160941 549371 136651 444897 626579 580373 387719 -14622 425753 19301 76944
17427 76944 641321 143057 426065 360439 372190 392775 540809 111016 694862 375874
17417 375874 672082 484114 538815 224334 241646 747179 146295 324410 607113 484264
17407 484264 686817 33181 176280 107747 -85140 161455 -25218 402295 226803 224602 -16625
$$ packed form
17481D41748q8861A65771D6773K19994B0023J01086J65829q6736I1059k250l8775
17470E0034K66958J23478r2430A03941M63925k71015n6761J73958A56021G0585
17459A93415L28058k39352J46513j82518M8239J2900j05771P6812M1794A0850
17448B16586J43737J22673n349J23878k70326A63439K38796j33706J69144E7092
17437A60941L88430A36651L08246J81682m6206j92654a4622D25753A9301N7643
17427G6944N64377A43057K83008o5626J1751K0585J48034A11016N83846l18988
17417C75874K96208j87968N4701B24334J7312N05533A46295J78115K82703j22849
17407D84264K02553C3181J43099o8533h5140A61455b5218D02295j75492k201a6625
$$ plain form
17395 279166 292629 374473 150059 444799 307601 208921 294489 100045 286191 235628
17385 235628 276688 225134 392220 137839 280414 -86790 465002 102734 35774 3221 249432
17374 249432 106403 16362 390351 338894 74494 -32987 -8780 476302 310126 183167 82577
17362 177112 -27143 166824 640113 307789 120838 473535 568478 278283 321046 136077
17351 472141 396754 382171 404099 311143 601493 105095 117027 -64805 322815 450375 140609
17339 92742 52511 239430 353057 203853 312724 -81657 -139956 407889 192257 39509
17328 272532 506612 129173 424801 90377 104237 395687 352474 204579 226205 -37888
17317 232406 366812 572443 418944 48335 84204 246719 130833 524089 233846 157349
$$ packed form
17395B79166J3463Q1844A50059K94740j37198r8680Q5568A00045J86146n0563
17385B35628M1060n1554J67086A37839J42575h6790D65002A02734C5774C221K46211
17374B49432A06403A6362L73989n1457G4494c2987h780D76302j66176j26959H2577
17362A77112b7143A66824M73289C07789A20838L52697R4943B78283M2763A36077
17351D72141p5387j4583K1928r2956K90350A05095J1932f4805C22815J27560A40609
17339I2742m0231J86919J13627j49204J08871h1657n8299D07889A92257C9509
17328B72532K34080A29173K95628I0377J3860K91450m3213j47895K1626c7888
17317B32406J34406K05631j53499D8335L5869J62515j15886L93256B33846p6497
$$ plain form
17307 157349 105218 334801 226684 371097 311286 214177 226512 448402 264289 454203
17297 454203 319842 317474 242393 284418 343813 123617 219803 460226 -162754 516562 326246
17286 326246 436255 422168 480602 235187 226251 159943 683751 182235 490579 166852
17275 284191 301042 142859 235869 392028 128747 390957 369414 335045 262526 451009
17265 451009 448478 251524 21818 439404 195346 254406 243106 318732 389251 518950 103972
17253 214721 167186 160778 381235 600005 520670 81352 238745 299147 201769 251677 381529
17242 381529 298550 529590 387004 319638 22780 380275 -75009 230145 124570 4053 648226
17231 648226 67635 456832 188670 570880 344648 116617 403427 509671 444058 563940
$$ packed form
17307A57349n2131K29583j08117J44413n9811r7109J2335K21890j84113J89914
17297D54203j34361k368p5081M2025N9395A23617R6186K40423a62754E16562j90316
17286C26246J10009j4087N8434B35187q936o6308N23808A82235L08344A66852
17275B84191J6851A42859R3010J56159A28747K62210k1543l4369p2519J88483
17265D51009k531j96954B1818M17586A95346N9060j1300P5626P0519J29699A03972
17253B14721m7535o408K20457K18770p9335H1352J57393O0402r7378M9908J29852
17242C81529q2979K31040j42586o7366B2780L57495g5009B30145j05575D053O44173
17231F48226F7635L89197A88670L82210k26232A16617K86810J06244o5613J19882
$$ plain form
17221 563940 528095 455194 529422 371604 439420 414235 587296 695590 331701 329217 479215
17210 479215 496080 565052 629181 682763 302893 344877 208990 528763 700185 265688
17199 556727 441703 539312 453193 611030 265207 73653 495029 433752 450739 175357
17188 524606 341231 379409 266808 181471 722286 586954 539135 356520 410013 522939
17178 522939 318588 472259 355909 416647 391908 466526 346972 312365 602410 955352
17168 955352 329064 393340 600695 227358 437182 302343 555442 430201 421732 425560
17158 425560 817504 414879 678166 465922 643623 551248 642945 257041 487265 132263
17147 340693 561153 515573 332710 217506 407137 444386 602910 677756 533148 444531
$$ packed form
17221E63940l5845p2901P4228j57818O7816k5185J73061J08294C31701k484J49998
17210D79215J6865O8972O4129N3582C02893M1984j35887L19773J71422B65688
17199E56727j15024R7609q6119J57837B65207G3653M21376o1277J6987A75357
17188E24606j83375L8178j12601q5337N40815j35332m7819j82615N3493J12926
17178E22939k04351J53671j16350O0738k4739P4618j19554l4607K90045L52942
17168I55352C29064O4276K07355B27358K09824j34839K53099j25241q469L828
17158D25560L91944m02625K63287k12244J77701r2375R1697B57041K30224A32263
17147C40693K20460m5580j82863j15204J89631L7249J58524P4846j44608q8617
$$ plain form
17137 444531 649015 431182 312853 653850 560879 620804 567925 609731 448688 580298
17127 580298 638672 490392 613161 431326 972517 444708 461506 454425 695207 580574
17117 580574 691647 709657 438106 647629 678636 868617 167316 458560 486641 535213
17107 535213 404874 427260 672671 462370 727537 675903 607729 612799 431182 591990
17097 591990 555362 665679 708978 756795 713687 645623 575232 597371 712747 635722 837910
17086 837910 716453 1016815 709202 409564 816489 886672 745293 641578 600753 1000364
17076 1000364 244284 909350 624237 561088 620548 703755 686997 888340 902253 560193
17066 560193 654841 430356 1127560 587171 690769 750639 640956 348950 840203 1088301
$$ packed form
17137D44531K04484k17833j18329L40997r2971N9925n2879M1806j61043J31610
17127E80298N8374j48280J22769j81835N41191D44708J6798p081K40782j14633
17117E80574J11073J8010k71551K09523L1007J89981A67316K91244K8081M8572
17107E35213j30339K2386K45411k10301K65167n1634o8174N070j81617J60808
17097E91990l6628J10317M3299M7817m3108o8064p0391K2139J15376p7025K02188
17086H37910j21457L00362l07613k99638M06925P0183j41379j03715m0825L99611
17076A000364B44284O65066k85113o3149N9460Q3207j6758K01343J3913l42060
17066E60193R4648k24485O97204n40389J03598N9870j09683k92006M91253K48098
$$ plain form
17056 1088301 1085501 782744 972339 1075147 789947 738069 628097 1028478 1146679 1093957
17046 1093957 743269 833207 814137 825232 928190 1073555 1068626 951653 864046 659500
17036 659500 768524 1046927 1046717 833376 1223132 874306 1227298 1108579 1183430 703310
17026 703310 966747 582587 675399 830822 738249 1185822 854851 822105 1074260 808250
17016 808250 976264 1077448 1099066 986972 998594 1340256 1126114 903335 1139523 895901
17006 895901 1016563 939746 1214911 1055793 1313526 1539187 1335456 1167893 1018472 1147398
16996 1147398 1260676 1455343 1167363 1406676 1336274 1154875 978491 1292646 1347726 1465441
16986 1465441 1418640 1425144 1388758 1561273 1413074 1115304 1434535 1491440 1305185 1306807 1575558
$$ packed form
17056A088301k800l02757J89595J02808k85200n1878j09972M00381J18201n2722
17046A093957l50688Q9938j9070J1095J02958J45365m929j16973q7607k04546
17036F59500J09024K78403k10k13341L89756l48826L52992j18719P4851m80120
17026G03310K63437l84160R2812J55423r2573M47573l30971l2746K52155k66010
17016H08250J68014J01184K1618j12094J1622L41662k14142k22779K36188k43622
17006H95901J20662p6817K75165j59118K57733K25661k03731j67563j49421J28926
16996A147398J13278J94667k87980K39313p0402j81399j76384L14155N5080J17715
16986A465441m6801O504l6386J72515j48199k97770L19231N6905j86255J622K68751
$$ plain form
16975 1575558 1466883 1685836 1514246 1469055 1615217 1216705 1511613 1685769 1494805 1554758
16965 1554758 1582162 1886263 1292351 1822276 1945598 1643557 1503715 1771259 1612239 1683627
16955 1683627 1869857 2012739 1828694 1738368 1919967 1707707 1479386 1740673 1742792 1849370
16945 1849370 2011593 2010687 1789017 1897088 1725382 1739564 1637853 2047891 2055418 1583856
16935 1583856 1823167 2015664 2135716 1894257 2140952 2325200 1952529 2242104 2240598 2220042
16925 2220042 2498444 2243374 2326074 2582418 2212000 2480005 2718025 2476280 2443558 2210328
16915 2210328 2420028 2633623 2069168 2363293 2294863 2701423 2569255 2831754 2788156 2554043
16905 2554043 2745990 2712657 2955833 2828686 2672647 3023976 2775518 2999348 3035866 3186740
$$ packed form
16975A575558j08675K18953j71590m5191J46162l98512K94908J74156j90964N9953
16965A554758K7404L04101n93912N29925J23322l02041j39842K67544j59020P1388
16955A683627J86230J42882j84045r0326J81599k12260k28321K61287K119J06578
16945A849370J62223r06k21670J08071j71706J4182j01711M10038P527m71562
16935A583856K39311J92497J20052k41459K46695J84248l72671K89575j506k0556
16925B220042K78402k55070Q2700K56344l70418K68005K38020k41745l2722k33230
16915B210328K09700K13595n64455K94125o8430M06560j32168K62499m3598k34113
16905B554043J91947l3333K43176j27147j56039L51329k48458K23830L6518J50874
$$ plain form
16895 3186740 2765630 3065125 3116283 2955888 2869382 3217642 3395375 3283535 3472539 3732255
16885 3732255 3363494 3675491 3501515 3563520 3499086 3722508 3782031 3994761 3683028 3921266
16875 3921266 3800854 3852031 3867318 4038367 3994081 4012342 4100457 4472290 4430816 4200844
16865 4200844 4151758 4204412 4540896 4794083 4648696 4802641 4611871 4688770 5214533 4774693
16855 4774693 5117409 5149752 5275426 5337364 5357801 5276734 5433694 5552104 5644077 5912435
16845 5912435 5806851 5921791 6002825 5892639 5660832 6406596 6203792 6530740 6485062 6640015
16835 6640015 6750805 6956148 7094948 7183414 7328847 7379971 7635833 7702009 7916782 7614441
16825 7614441 8077676 8481735 8728175 8436764 8625525 8907973 9161036 8900645 9532885
$$ packed form
16895C186740m21110K99495N1158j60395q6506L48260J77733j11840J89004K59716
16885C732255l68761L11997j73976O2005o4434K23422N9523K12730l11733K38238
16875C921266j20412N1177J5287J71049m4286J8261Q8115L71833m1474k29972
16865D200844m9086N2654L36484K53187j45387J53945j90770P6899N25763m39840
16855D774693L42716L2343J25674O1938K0437q1067J56960J18410R1973K68358
16845E912435j05584J14940Q1034j10186k31807P45764k02804L26948m5678J54953
16835F640015J10790K05343J38800Q8466J45433N1124K55862O6176K14773l02341
16825G614441M63235M04059K46440k91411J88761K82448K53063k60391O32240
$$ plain form
16816 9532885 9634081 9672920 10101305 10173846 10157949 10295638 10716444 10977130 11388608 11578044
16806 11578044 11453258 12281670 12224820 12451875 12956324 13316850 13539654 13652459 13969816
16797 13969816 14008100 14893020 15123073 15489292 15856697 16087109 16819828 17250914 17615551
16788 17615551 17874157 18294607 18597555 19283437 19810678 20235222 20761385 21237237 22230934
16779 22230934 22816153 23009516 24127674 24463426 25231667 26136541 26927992 27586275 28484575
16770 28484575 29491056 30282565 31497798 32377092 33534855 34477510 35783889 36914404
16762 36914404 38149407 39416622 40784982 42403514 43739035 45112991 46873152 48201931
16754 48201931 50048407 51897627 53751764 55711364 57681987 59771590 61857772 63754445
$$ packed form
16816I532885J01196L8839M28385P2541j5897J37689M20806K60686M11478J89436
16806A1578044j24786Q28412n6850K27055N04449L60526K22804J12805L17357
16797A3969816L8284Q84920K30053L66219L67405K30412P32719M31086L64637
16788A7615551K58606M20450L02948O85882N27241M24544N26163M75852R93697
16779B2230934N85219J93363J118158L35752P68241R04874P91451O58283Q98300
16770B8484575J006481P91509J215233Q79294J157763R42655J306379J130515
16762C6914404J235003J267215J368360J618532J335521J373956J760161J328779
16754D8201931J846476J849220J854137J959600J970623K089603K086182J896673
$$ plain form
16746 63754445 66711676 69177288 71236942 74021341 76402451 78924128 81764545 84307440
16738 84307440 87058658 89415607 92953589 95656258 98128559 100695036 103244332 105820319
16730 105820319 108022233 110018335 112099170 114268311 116142051 117207797 118177577 118868359
16722 118868359 119438923 119480009 119470065 119099526 118534356 117750515 116538489 114722840 112978713
16713 112978713 111069934 109230831 106771347 104541931 101759010 99492891 96673407 93754467
16705 93754467 91066277 88146502 85080482 82884943 80128049 77249328 74670288 72052425
16697 72052425 69188229 67087261 64683873 62654630 60209930 57945621 56091552 54311513
16689 54311513 51907552 50479200 48741462 46735186 45556876 43841891 41975134 40934131
$$ packed form
16746F3754445K957231K465612K059654K784399K381110K521677K840417K542895
16738H4307440K751218K356949L537982K702669K472301K566477K549296K575987
16730A05820319K201914J996102K080835K169141J873740J065746R69780O90782
16722A18868359N70564M1086r944l70539n65170p83841j212026j815649j744127
16713A12978713j908779j839103k459484k229416k782921k266119k819484k918940
16705I3754467k688190k919775l066020k195539k756894k878721k579040k617863
16697G2052425k864196k100968k403388k029243k444700k264309j854069j780039
16689E4311513k403961j428352j737738k006276j178310j714985j866757j041003
$$ plain form
16681 40934131 39098577 38186926 36888209 35514416 34535482 33052278 32153745 31202675 30546286
16672 30546286 29570681 28268659 27622954 27040546 26022068 25168849 24603002 24011307 23604311
16663 23604311 22507147 21905738 21399213 20715603 20164980 19663765 19259175 18773765 18196963
16654 18196963 17544863 17226817 16973940 16256111 16163394 15454736 15265379 15234564 14652139 14410598
16644 14410598 14197169 13680200 13274383 12887709 12530533 12233779 11884877 11721268 11242394
16635 11242394 11205639 11125256 10715499 10459377 10358423 10573588 10030240 9643426 9517441 9304411
16625 9304411 9639471 9171044 9025331 8824768 8173279 8618240 8242062 8142336 8175410 8109069
16615 8109069 7799873 7730725 7469594 7039571 7015872 6813525 6786892 6585950 6693020 6810824
$$ packed form
16681D0934131j835554r11651j298717j373793r78934j483204q98533r51070o56389
16672C0546286r75605j302022o45705n82408j018478q53219n65847n91695m06996
16663B3604311j097164o01409n06525o83610n50623n01215m04590m85410n76802
16654A8196963o52100l18046k52877p17829r2717p08658j89357l0815n82425k41541
16644A4410598k13429n16969m05817l86674l57176k96754l48902j63609m78874
16635A1242394l6755q0383m09757k56122j00954K15165n43348l86814j25985k13030
16625I304411L35060m68427j45713k00563o51489M44961l76178r9726L3074o6341
16615H109069l09196o9148k61131m30023k3699k02347k6633k00942J07070J17804
$$ plain form
16605 6810824 6570890 6490933 6483964 6354101 5953023 6115888 6070857 5832117 5812856 5446693
16595 5446693 5609557 5312482 5701203 5301983 5451962 5036861 4919754 5300368 5170624
16586 5170624 5151129 4442760 4826902 4528331 4485764 4520025 4557720 4438308 4030112 4572137
16576 4572137 4191614 4168448 4201156 4224152 4193540 4230182 3961879 3900448 3776230 3830837 3762379
16565 3762379 3412195 3624352 3646438 3655338 3486554 3462713 3501061 3357369 2877335 3281866
16555 3281866 3665136 3380838 3131180 3122115 3189064 2999402 3114305 3016158 3289379 2680644
16545 2680644 3025789 2883533 2981719 2737459 2704190 2831969 2764055 2730089 2746821 2732554
16535 2732554 2576664 2648812 2377569 2774202 2453682 2574513 2605345 2256630 2478953 2385023
$$ packed form
16605F810824k39934p9957o969j29863m01078J62865m5031k38740j9261l66163
16595E446693J62864k97075L88721l99220J49979m15101j17107L80614j29744
16586E170624j9495p08369L84142k98571m2567L4261L7695j19412m08196N42025
16576D572137l80523k3166L2708K2996l0612L6642k68303o1431j24218N4607o8458
16565C762379l50184K12157K2086Q900j68784k3841L8348j43692m80034M04531
16555C281866L83270k84298k49658r065O6949j89662J14903r8147K73221o08735
16545B680644L45145j42256R8186k44260l3269J27779o7914l3966J6732j4267
16535B732554j55890P2148k71243L96633l20520J20831L0832l48715K22323r3930
$$ plain form
16525 2385023 2468143 2112751 2208691 2382509 2225485 2212403 2586008 2120270 2077344 2084901
16515 2084901 2336831 2407975 2116352 2144912 2109363 2122420 2166882 2246152 1900493 1941163 1656633
16504 1656633 1757773 2045486 1990450 1957824 2138134 1611874 1741026 2087535 1748015 1808893
16494 1808893 1904607 1594380 1943238 1882942 1531588 1878659 1784147 1720909 1833002 1508070
16484 1508070 1526029 1684256 1993280 1846622 1674325 1645523 1809078 1615591 1591275 1502753
16474 1502753 1429645 1602294 1642259 1559401 1427230 1562199 1439738 1380292 1495306 1608751
16464 1608751 1403004 1684826 1300109 1573989 1432964 1264319 1621262 1368656 1173942
16455 1173942 1639911 1203821 1552063 1052662 1258000 1025677 1281460 1281243 1286547 1098674
$$ packed form
16525B385023Q3120l55392R5940J73818j57024j3082L73605m65738m2926P557
16515B084901K51930P1144k91623K8560l5549J3057M4462P9270l45659M0670k84530
16504A656633J01140K87713n5036l2626J80310n26260J29152L46509l39520O0878
16494A808893R5714l10227L48858o0296l51354L47071r4512o3238J12093l24932
16484A508070J7959J58227L09024j46658j72297k8802J63555j93487k4316q8522
16474A502753p3108J72649L9965q2858j32171J34969j22461n9446J15014J13445
16464A608751k05747K81822l84717K73880j41025j68645L56943k52606j94714
16455A173942M65969m36090L48242m99401K05338k32323K55783k17N304j87873
$$ plain form
16445 1098674 1215658 1253763 1049752 1227825 1301522 1249155 1441969 1232319 1022864 1447663
16435 1447663 944787 1047485 1095803 1285983 966249 960934 1034307 860630 909246 1061111
16425 1061111 1021952 1020338 1166623 1275163 1316895 1225721 912379 1084756 921701 1154138
16415 1154138 1099188 937938 906226 1279029 926328 1352256 988501 835309 667825 1193398
16405 1193398 578592 617521 841025 918956 1112223 1022680 561784 1108159 1096047 937761
16395 937761 680500 955166 811740 1145698 1030999 651002 823658 917384 1027359 792367
16385 792367 1094546 1068713 766697 687653 878366 602461 872243 857279 735337 735482 495739
16374 495739 397536 784235 1135682 908642 552756 866922 962449 691248 653204 781596
$$ packed form
16445A098674J16984L8105k04011J78073P3697n2367J92814k09650k09455M24799
16435A447663n02876J02698M8318J90180l19734n315P3373j73677M8616J51865
16425A061111l9159j614J46285J08540M1732r1174l13342J72377j63055K32437
16415A154138n4950j61250l1712L72803l52701M25928l63755j53192j67484N25573
16405A193398E78592L8929K23504P7931J93267q9543m60896N46375j2112j58286
16395I37761k57261K74666j43426L33958j14699l79997J72656R3726J09975k34992
16385G92367L02179k5833l02016p9044J90713k75905K69782j4964j21942J45k39743
16374D95739r8203L86699L51447k27040l55886L14166R5527k71201l8044J28392
$$ plain form
16364 781596 696700 606183 608060 613619 843304 774413 729392 709065 405222 640622 607033
16353 607033 353946 701454 753025 955170 738894 668498 520237 330130 715803 574582
16343 574582 846474 715301 612864 517903 532305 991432 593897 276757 848433 532960
16333 532960 753191 711381 742259 925481 427126 515580 810505 219113 640267 670820
16323 670820 392414 684358 535374 589724 404705 485275 514397 787773 886115 514284
16313 514284 627694 544745 648192 264119 347888 383907 717818 422483 643966 513108
16303 513108 395249 691009 550618 210481 415352 795419 403175 740482 407189 561515
16293 561515 681981 547073 712020 722509 810132 396335 607427 383262 512068 320306
$$ packed form
16364G81596q4896r0517J877N559K29685o8891m5021k0327l03843K35400l3589
16353F07033k53087L47508N1571K02145k16276p0396j48261j90107L85673j41221
16343E74582K71892j31173j02437r4961J4402M59127l97535B76757N71676l15473
16333E32960K20231m1810L0878J83222D27126Q8454K94925B19113M21154L0553
16323F70820k78406K91944j48984N4350j85019Q0570K9122K73376R8342l71831
16313E14284J13410q2949J03447B64119Q3769L6019L33911k95335K21483j30858
16303E13108j17859K95760j40391B10481K04871L80067l92244L37307l33293J54326
16293E61515J20466j34908J64947J0489Q7623C96335K11092k24165J28806j91762
$$ plain form
16283 320306 477419 821339 446235 615076 518216 608755 576855 768044 65908 540065
16273 540065 525128 408596 162020 295888 420878 374872 564483 93321 448570 354866
16263 354866 268132 60327 252985 429946 342555 333027 67451 314313 265961 342903 254099
16252 254099 536525 494106 475250 514991 509126 393455 254105 529951 114650 568430
16242 568430 365653 156880 328357 434335 459237 580071 431817 218588 204275 215585
16232 215585 266514 475493 390724 82878 402456 418855 497201 312485 491211 611704
16222 611704 -16842 567486 441748 153451 318994 -7890 406777 108361 232169 156425
16212 156425 795599 224186 192738 71701 431125 196990 520864 323513 173221 226858
$$ packed form
16283C20306J57113L43920l75104J68841r6860R0539l1900J91189F5908M74157
16273E40065j4937j16532A62020J33868J24990m6006J89611I3321L55249r3704
16263C54866q6734F0327J92658J76961q7391r528F7451K46862m8352P6942q8804
16252B54099K82426m2419j8856L9741n865j15671j39350K75846A14650M53780
16242E68430k02777A56880J71477J05978K4902J20834j48254k13229j4313J1310
16232B15585N0929K08979q4769H2878L19578J6399P8346j84716J78726J20493
16222F11704a6842E67486j25738A53451J65543g890D06777A08361J23808p5744
16212A56425O39174B24186l1448G1701L59424A96990L23874j97351j50292N3637
$$ plain form
16202 226858 176600 255140 339195 414051 352964 194908 204216 321120 58368 444266 388801
16191 388801 -34015 532742 95926 278199 578795 268603 326212 431790 424655 310303
16181 310303 204936 321389 269173 271105 111791 308693 65868 194589 17179 322788
16171 322788 273326 275385 -166463 265221 421442 241809 227501 318742 123817 409726
16161 409726 248352 490698 291912 447498 275165 164642 121905 279230 -10938 217133
16150 135181 174368 153013 360887 429320 390030 267971 103994 122364 126234 78211 294391
16139 294391 105991 217366 213165 77379 226192 172685 132085 286984 -49219 20314 -68318
16127 -10659 257480 52046 99393 88467 135005 277515 -194673 166233 90699 -144079 -120110
$$ packed form
16202B26858n0258P8540Q4055P4856o1087j58056R308J16904E8368L85898n5465
16191C88801c4015E32742I5926J82273L00596B68603N7609J05578p135j14352
16181C10303j05367J16453n2216J932A11791J96902F5868J28721A7179L05609
16171C22788m9462K059a66463B65221J56221j79633j4308R1241A23817K85909
16161D09726j61374K42346j98786J55586j72333j10523m2737J57325a0938B17133
16150A35181L9187k1355K07874O8433l9290j22059A03994J8370L870m8023K16180
16139B94391A05991J11375m201G7379J48813n3507m0600J54899d9219B0314f8318
16127a0659B57480E2046M7347j0926M6538J42510a94673A66233p5534a44079K3969
$$ plain form
16116 -120110 -97945 107480 67452 54301 90516 289244 469752 -74001 54629 44412 -110087
16104 -56164 110046 73209 23109 429450 520933 99253 557774 64559 127435 182694 403929
16093 403929 119172 176775 108442 406494 150463 472297 113216 -173181 67565 208772
16083 208772 57477 -34631 45764 314159 292669 163350 107317 238129 104857 69223 243680
16072 243680 119964 385480 113899 156529 19408 312311 -287630 -51461 50382 -79771
16061 244663 267323 43057 8860 107485 -97230 154169 116820 -130496 168628 135581 25828
16049 283079 -20319 236521 38343 96840 -183984 53083 166908 126918 -171021 -63928 -135126
16038 -135126 45779 1487 64551 -42584 385379 124634 -161915 121584 -3429 -124293 221319
$$ packed form
16116a20110K2165A07480m0028j3151L6215J98728J80508g4001E4629j0217a10087
16104e6164A10046l6837B3109M06341R1483I9253M58521F4559O2876N5259K21235
16093D03929A19172N7603o8333K98052A50463L21834A13216a73181F7565J41207
16083B08772E7477c4631D5764K68395k1490j29319n6033J30812A04857l5634J74457
16072B43680A19964K65516A13899M2630A9408K92903b87630e1461E0382g9771
16061B44663K2660D3057H860R8625i7230A54169l7349a30496A68628l3047B5828
16049B83079b0319B36521C8343N8497a83984E3083J13825l9990a71021f3928p1198
16038a35126D5779A487O3064d2584C85379A24634a61915A21584c429j20864B21319
$$ plain form
16026 49070 107609 14119 -2923 140955 -87211 -51033 251291 -35134 48279 141932 254646
16015 254646 -39393 -279611 -124644 141226 33490 -46889 20740 76983 -17853 -259878 67062
16003 283688 -184696 -35650 157050 -151035 215884 244456 -286419 -84528 -13294 -230802
15993 -230802 136160 198302 55239 49897 396821 579949 758845 1147277 1099714 1516883
15983 1516883 939417 794192 941997 42452 269972 50493 203850 -90552 -250156 15025
15972 110004 -88697 9412 -28743 141850 -129084 -29939 -240804 -36518 195022 85299 -79912
15960 -287067 367614 402985 -126864 112125 -53388 163547 -238490 101998 178236 165299
15950 165299 217178 -190997 153154 -83011 95739 -130395 91834 148081 -179226 480817
$$ packed form
16026D9070N8539A4119b923A40955h7211L6178B51291c5134D8279R3653J12714
16015B54646c9393k40218a24644A41226C3490d6889B0740N6243a7853k42025F7062
16003B83688a84696c5650A57050a51035B15884K8572b86419h4528a3294k17508
15993b30802A36160O2142E5239n342L46924J83128J78896L88432m7563M17169
15983A516883n77466j45225J47805D2452K27520E0493J53357i0552j59604A5025
15972A10004h8697I412b8743A41850a29084b9939k10865c6518A95022H5299g9912
15960b87067C67614L5371a26864A12125e3388A63547b38490A01998P6238j2937
15950A65299N1879a90997A53154h3011I5739a30395I1834N6247a79226D80817
$$ plain form
15939 -28816 194214 -51853 51426 -103380 163745 8753 52830 261229 -17628 41543 -79791
15927 -181127 -54285 -9238 -10232 212211 -148762 -99775 217470 -370998 120758 -250446 27813
15915 221287 84413 -262361 196529 124381 -261030 159999 -108759 -217568 162423 193256
15905 193256 68851 -169847 112770 217434 198044 31190 233231 -62111 -79468 92612 121324
15894 121324 -149347 222963 241461 -27699 52613 -25173 -221769 62895 -174731 20230 97643
15883 97643 -147207 -6742 -180603 261567 -241809 118732 -898 278837 -28965 45053 1262
15871 335593 177527 63298 -1558 -90575 245944 108296 -34887 6591 -74830 -52567 -50991
15860 -50991 196387 -191763 -162299 163267 34182 -150485 -77687 225178 -238154 -104424
$$ packed form
15939b8816A94214e1853E1426a03380A63745H753M4077K08399a7628D1543g9791
15927a81127e4285i238r94B12211a48762M8987B17470c70998A20758b50446B7813
15915B21287H4413b62361A96529p2148b61030A59999a08759j08809A62423L0833
15905A93256F8851a69847A12770J04664j9390C1190K02041f2111j7357I2612K8712
15894A21324a49347B22963J8498b7699E2613b5173j96596F2895a74731B0230P7413
15883I7643a47207f742j73861B61567b41809A18732h98B78837b8965D5053A262
15871C35593j58066F3298a558q9017B45944A08296c4887F591g4830K2263J576
15860e0991A96387a91763K9464A63267C4182a50485P2798B25178b38154a04424
$$ plain form
15849 -284133 61214 -173625 -11893 -6562 24685 -229236 -17886 -37788 -342961 -100830 270303
15837 51852 -232135 46818 258794 301710 -116579 -290735 -68565 53798 118279 -40474 598315
15825 94237 51675 -33956 -392468 -147208 -305025 217458 14554 -193625 -53508 -40655 266057
15813 206511 -174566 -154732 43003 191501 677 -5937 314358 157986 30451 -84780 900 428606
15801 428606 18503 -134703 153334 -56369 28940 -119043 185954 -145630 -180882 17247
15790 27760 133290 34590 -152556 -336589 45255 339630 -108605 142567 46109 12375
15779 444264 86964 -86341 265878 19768 22980 -150502 17120 -179468 227475 284964 -231167
15767 -89448 -84568 34363 177915 226050 -487065 417095 99753 -73246 60027 -27677 -61282
$$ packed form
15849b84133F1214a73625a1893N331B4685b29236a7886j9902l05173a00830B70303
15837E1852b32135D6818K11976M2916a16579j74156f8565E3798O4481d0474E98315
15825I4237m2562c3956l58512a47208j57817B17458A4554a93625e3508J2853B66057
15813B06511a74566J9834D3003J48498F77e937C14358j56372C0451h4780I00M27706
15801D28606A8503a34703A53334e6369B8940a19043A85954a45630l5252A7247
15790B7760J05530C4590a52556j84033D5255K94375a08605A42567D6109A2375
15779D44264H6964h6341B65878A9768L212a50502A7120a79468B27475N7489b31167
15767h9448M880C4363J43552M8135d87065D17095I9753g3246F0027b7677l3605
$$ plain form
15756 -61282 -132627 241760 72339 -34379 79811 36763 -5349 164739 -186559 103315 -185463
15744 -235841 -33852 -62018 -59796 -23053 -188705 -106952 -189191 117303 43349 109167 -83226
15732 -158864 -43151 -51688 -148072 -58267 138176 324780 -72565 -147200 120879 69028 -171645
15720 62915 1805 290926 58560 -179300 49427 -354729 270786 -133695 -83661 116133 -4081
15708 -191721 -261455 -37757 -88444 -270582 -193739 50150 -59291 52157 -303326 -117280 180790
15696 -44114 -19500 -102946 -4897 67124 155033 22995 108474 -61363 -66792 -162382 203026 -65249
15683 33449 -48008 -229024 -131532 -292152 9666 98289 -286700 52440 -151908 122476 -172408
15671 -100141 -178717 -98774 -153877 -46657 165740 -317582 -182537 -164964 -478255 247545
$$ packed form
15756f1282p1345B41760G2339c4379G9811C6763e349A64739a86559A03315a85463
15744b35841c3852k8166K222b3053j65652Q1753q2239A17303D3349O5818h3226
15732a58864d3151q537r6384e8267A38176J86604g2565p4635A20879n1851a71645
15720F2915A805K89121E8560a79300D9427c54729B70786a33695N0034A16133d081
15708a91721o9734c7757n0687j82138P6843E0150e9291E2157c03326a17280A80790
15696d4114a9500q3446d897F7124Q7909B2995Q5479f1363n429r5590B03026f5249
15683C3449d8008j81016R7492j60620I666Q8623b86700E2440a51908A22476a72408
15671a00141p8576P9943n5103d6657A65740c17582J35045J7573l13291B47545
$$ plain form
15660 83366 -176463 -73035 -341751 219745 -101686 -21782 32518 -195168 -141392 65571 -208246
15648 -166904 41269 -167437 76154 -229586 264006 -222995 -236674 229111 -71378 42983
15637 -254166 -217385 -253585 67402 205364 53243 -122163 28436 -226121 130328 98281 -96792
15625 -12820 -241945 -229302 111346 -32749 -68050 81947 223219 -3512 10378 229081 -180620
15613 -30033 52985 9105 -26056 83786 81093 -164109 -174405 -319411 259589 206514 140555
15602 140555 188659 123729 92024 -42197 -376235 -243291 -90477 32500 -296413 212317 -152560
15590 122592 106693 498923 -67222 244369 287127 44544 -9301 -189775 253610 -64026 175923
15578 -137774 -164564 164549 236534 -429900 -41963 -164965 135785 -150427 -55972 44546
$$ packed form
15660H3366a76463g3035k68716B19745a01686b1782C2518a95168N3776F5571b08246
15648a66904D1269a67437G6154b29586B64006b22995j3679B29111g1378D2983
15637b54166L6781l6200F7402J37962E3243a22163B8436b26121A30328l2047i6792
15625a2820k29125J2643A11346c2749l5301H1947J41272c512A0378K18703a80620
15613c0033E2985I105b6056H3786k693a64109j0296j45006B59589n3075o5959
15602A40555M8104o4930l1705d2197l34038J32944i0477C2500b96413B12317a52560
15590A22592j5899L92230f7222B44369M2758D4544i301j80474B53610f4026A75923
15578a37774k6790A64549P1985d29900d1963j23002A35785a50427e5972D4546
$$ plain form
15567 -112357 184393 -205638 -341488 120846 90126 -24604 57019 168411 -123930 306356
15556 -9361 -92794 99841 122465 115508 120713 264919 -13972 -136167 37000 -7132 -162833 -339720
15544 -339720 -25733 227840 30262 29078 56653 -182473 -18053 49917 -141535 -191263 -162364
15533 -162364 290230 58069 80794 -304607 -90093 -206386 -123292 -120802 132652 116828 194484
15522 194484 264550 -149685 154574 -93545 230574 -176881 413242 255616 302457 347449
15512 347449 -43704 -163496 192353 120527 -102397 -86245 -12559 385478 184584 229299
15502 229299 79072 405912 58813 -97777 142307 339693 168293 499181 -304951 42875
15491 129878 107223 -46270 193368 67927 -17427 35215 -226904 -278057 97291 -106160 318906
$$ packed form
15567a12357A84393b05638j35850A20846l0720b4604E7019J11392a23930C06356
15556i361q3433I9841K2624o957N205J44206a3972j22195C7000g132j55701j76887
15544c39720b5733B27840C0262j184K7575a82473a8053D9917a41535m9728K8899
15533a62364B90230E8069K2725c04607i0093j16293Q3094K490A32652j5824P7656
15522A94484P0066a49685A54574i3545B30574a76881D13242j57626M6841M4992
15512C47449d3704j19792A92353p1826a02397J6152a2559C85478A84584M4715
15502B29299G9072L26840E8813i7777A42307J97386A68293L30888c04951D2875
15491A29878k2655d6270A93368F7927a7427C5215b26904n1153I7291a06160C18906
$$ plain form
15479 401503 148391 21074 263633 27941 385853 592541 585299 790482 488728 50942
15468 283006 -178066 488373 -4185 -123071 133618 139313 -124308 -14153 98917 -38108 -77651
15457 -77651 127768 54216 -185306 -19006 -200520 178171 567366 -47898 -235762 188325
15446 94235 -57967 370791 482177 415857 533281 997160 1095390 1117050 268447 399176
15436 399176 245875 72359 107323 162319 -344580 86480 130654 92075 150555 -120347 6367
15424 -13650 51794 236133 94908 112748 67017 215061 65814 -27542 49029 -27178 47581
15412 -147142 239942 -91958 85751 -302918 -251671 19423 -147115 108907 81688 -121757
15401 94093 -356434 -111023 -305831 -359998 167697 24010 -80969 164752 -33554 91212 54092
$$ packed form
15479D01503A48391B1074K42559B7941L57912K06688p242K05183l01754E0942
15468B83006a78066D88373d185j18886A33618N695a24308a4153I8917c8108l9543
15457g7651A27768E4216a85306a9006j81514A78171L89195d7898j87864A88325
15446I4235e7967C70791J11386o6320J17424M63879R8230K1660B68447J30729
15436C99176j53301G2359L4964N4996c44580H6480M4174l8579N8480a20347F367
15424a3650E1794J84339I4908J7840m5731J48044F5814b7542D9029b7178D7581
15412a47142B39942i1958H5751c02918N1247A9423a47115A08907k7219a21757
15401I4093c56434a11023j94808n4167A67697B4010h0969A64752c3554I1212l7120
$$ plain form
15390 54092 -14975 -252970 -165568 -233969 338994 -92537 170874 13646 -153521 64145 -8082
15378 152083 24270 117052 169850 116403 -91835 178829 479929 -5045 60715 252998 -22495
15366 233034 -86975 147384 41136 138822 314184 301155 143752 244150 210783 258482 114929
15354 589617 236395 477500 339115 134597 439495 458514 229765 387293 191598 318844
15344 318844 121608 336038 441776 429474 639683 373902 191338 365865 98266 129630
15334 129630 87085 254545 221983 -58456 8596 302963 -107899 188624 282400 -145187 84067
15322 411832 75039 5952 179146 74346 284032 279592 115900 297313 209116 143828 54053
15310 168439 471522 167888 257038 -19457 74152 172104 43206 196418 -171080 109367
$$ packed form
15390E4092a4975k37995Q7402o8401C38994i2537A70874A3646a53521F4145h082
15378A52083B4270R2782N2798n3447i1835A78829L01100e045F0715J92283b2495
15366B33034h6975A47384D1136R7686J75362j3029A43752J00398l3367M7699A14929
15354E89617B36395K41105j38385A34597L04898J9019k28749J57528A91598J27246
15344C18844A21608K14430J05738j2302K10209k65781j82564J74527I8266L1364
15334A29630m2545J67460l2562e8456H596K94367a07899A88624R3776a45187H4067
15322D11832G5039E952J73194G4346K09686m440A15900J81413q8197o5288E4053
15310A68439L03083A67888Q9150a9457G4152R7952D3206J53212a71080A09367
$$ plain form
15299 -253168 283617 192623 174849 149052 -112623 135354 -325831 -39548 -5001 197491 224476
15288 224476 82673 267717 580167 58567 -259054 9266 -29392 152000 16083 130293 -157215
15276 42045 -160533 71606 85765 -1438 -107621 331851 -78920 194256 124741 46357 -111824
15264 -22904 147118 46274 -60146 -325397 164610 257348 163169 -41346 -148386 -70129 -12471
15252 133726 201622 -137244 -112873 119304 355279 388350 15134 491455 1010069 1957120
15242 1957120 1294750 1613696 1619660 657919 94885 71293 90087 156730 -124572 293417
15231 -144571 38105 96245 71619 -127827 -83198 117219 219245 131402 137230 357976 -15907
15219 48381 -128214 -128016 -174473 379433 119897 117346 99923 17418 -4673 -20012 196593 120191
$$ packed form
15299b53168B83617r0994j7774k5797a12623A35354c25831c9548e001A97491K6985
15288B24476H2673J85044L12450E8567b59054I266b9392A52000A6083J14210a57215
15276D2045a60533G1606J4159a438j06183C31851g8920A94256o9515D6357a11824
15264b2904A47118D6274f0146k65251A64610R2738r4179d1346j07040g0129a2471
15252A33726O7896a37244K4371A19304K35975L3071A5134M76321N18614R47051
15242A957120o62370L18946N964F57919I4885k3592J8794O6643a24572B93417
15231a44571C8105N8140k4626a27827M4629A17219J02026q7843N828K20746a5907
15219D8381a28214J98m6457C79433A19897k551j7423A7418d673j5339A96593p6402
$$ plain form
15207 120191 177810 373632 -38216 85957 -63657 150798 -119304 55427 -137771 216514
15196 -17736 -343470 331683 -46418 -6053 288939 52672 124966 -138719 216756 -272753 139756
15184 63027 -11586 -49926 -42857 -7787 -135523 114384 478569 95642 225681 87405 218190
15173 218190 105479 162524 -207761 -66681 32101 -215609 56508 -111927 345096 175503
15163 175503 120219 -162422 147236 -163749 140814 175483 46638 -28374 208564 178680
15153 178680 28022 -106084 192621 185811 158564 99919 53858 74453 144370 375466 -56903
15141 33905 179547 124376 73438 -72350 156995 28028 -97147 20113 249493 81076 121659
15130 121659 145257 26634 75167 209380 294814 -19595 17613 287054 135475 167990 104578
$$ packed form
15207A20191N7619J95822c8216H5957f3657A50798a19304E5427a37771B16514
15196a7736l25734C31683d6418f053B88939E2672P2294a38719B16756b72753A39756
15184F3027a1586l8340P069g787j27736A14384L64185I5642J30039H7405J30785
15173B18190A05479N7045b07761f6681C2101b15609E6508a11927C45096j69593
15163A75503n5284a62422A47236a63749A40814L4669D6638b8374B08564k9884
15153A78680B8022a06084A92621o810k7247n8645m6061K0595O9917K31096e6903
15141C3905J45642n5171n0938g2350A56995B8028i7147B0113K29380H1076M0583
15130A21659K3598B6634M8533J34213Q5434a9595A7613K69441A35475L2515o3412
$$ plain form
15119 104578 441276 -45774 254274 150243 145817 286060 259517 -94625 121667 135113 193052
15108 193052 -144633 188879 -94236 72458 67916 -386199 163564 15243 12724 415869 -21900
15096 -176485 441238 -143916 306317 22819 36767 81016 301212 118650 261714 54226
15085 59835 152123 328139 61341 242862 294477 310921 11569 60667 -141831 272486 63540
15073 90960 267958 19950 110924 176553 -12675 311596 420645 50292 20779 -10295 366073
15061 93642 57802 -26236 186924 85629 432655 399346 235351 253886 289815 44751 427437
15050 427437 300879 201303 358295 219411 536022 554554 -24297 400879 67001 430074
15040 430074 218859 425293 506381 550272 307909 233756 539687 258311 279346 584596
$$ packed form
15119A04578L36698d5774B54274j04031m426J40243k6543i4625A21667J3446N7939
15108A93052a44633A88879i4236G2458m542c86199A63564A5243k519M03145b1900
15096a76485D41238a43916C06317B2819J3948M4249K20196A18650J43064E4226
15085E9835R2288J76016F1341J81521N1615J6444A1569M9098a41831B72486F3540
15073I0960J76998A9950R0974O5629a2675C11596J09049E0292B0779a0295C66073
15061I3642l5840b6236A86924H5629L47026l3309j63995J8535L5929D4751L82686
15050D27437j26558r9576J56992j38884L16611J8532b4297D00879F7001L63073
15040D30074k11215K06434Q1088M3891k42363p4153L05931B58311K1035L05250
$$ plain form
15030 584596 508813 404728 610681 633106 580524 661013 485259 352077 445426 295887
15020 295887 633403 685377 158640 494959 312931 534268 195037 631281 384245 508121
15010 508121 490394 527233 493253 485730 595399 239242 469663 316395 206982 686673
15000 686673 460390 493525 511815 690102 440417 414790 412161 386586 234803 724701 643901
14989 643901 280786 428955 390714 355090 312552 407078 574597 579929 644219 779921 780822
14978 780822 619152 590722 360656 768219 338465 194110 603613 768186 522362 659201
14968 659201 686251 521641 442960 188734 693313 429913 555057 230670 373589 528994
14958 528994 467120 446512 271994 335900 106925 130559 269844 153395 498448 154166
$$ packed form
15030E84596p5783j04085K05953K2425n2582Q0489j75754j33182R3349j49539
15020B95887L37516N1974A58640L36319j82028K21337A95037M36244k47036J23876
15010E08121j7727L6839l3980p523J09669B39242K30421j53268j09413M79691
15000F86673k26283L3135J8290J78287k49685k5627k629k5575j51783M89898q0800
14989F43901B80786J48169l8241l5624m2538R4526J67519N332O4290J35702R01
14978G80822j61670k8430k30066M07563C38465j44355M09503J64573k45824J36839
14968F59201K7050j64610p8681A88734N04579k63400J25144B30670J42919J55405
14958E28994o1874k0608j74518O3906A06925K3634J39285j16449L45053A54166
$$ plain form
14947 395262 349173 390184 481457 553502 816207 657714 366079 434513 319902 575465
14937 575465 319440 231041 368599 440082 562597 710210 1084076 1002362 1175134 1254133
14927 1254133 1399188 1317159 1356123 1634049 1537576 1834551 1380739 1351955 1690356 1715907
14917 1715907 2243698 2625683 2154251 1711369 1018320 1214422 1191789 1210428 760639 380989
14907 380989 313374 708804 305062 398255 336248 753577 329543 307881 507360 431959
14897 431959 177055 282105 618629 444234 252556 168775 330152 426250 379068 356584
14887 356584 233978 406616 614495 947247 882628 917429 668381 674622 1202810 844672
14877 844672 547894 881991 544029 166823 263749 817631 659177 375298 285381 476672
$$ packed form
14947C95262m6089M1011R1273P2045K62705j58493k91635O8434j14611K55563
14937E75465k56025q8399J37558P1483J22515J47613L73866q1714J72772P8999
14927A254133J45055q2029L8964K77926r6473K96975m53812k8784L38401K5551
14917A715907N27791L81985m71432m42882o93049J96102k2633J8639m49789l79650
14907C80989o7615L95430C05062R3193o2007M17329C29543k1662J99479p5401
14897D31959A77055J05050L36524j74395j91678q3781J61377R6098m7182k2484
14887C56584j22606J72638K07879L32752o4619L4801k49048O241N28188l58138
14877H44672k96778L34097l37962A66823R6926N53882j58454k83879q9917J91291
$$ plain form
14867 476672 803384 708846 564413 830543 597670 585046 444187 396573 382920 322895
14857 322895 296231 457389 541892 64362 538901 504513 105945 691689 429493 439378 441757
14846 441757 557793 375698 682082 1282876 1022276 1374844 1028472 1137612 857551 979421
14836 979421 1191266 892814 549605 619850 621133 902732 890948 760830 453781 477875
14826 477875 560870 857543 730496 630530 292587 473296 851625 657738 954931 647514
14816 647514 1100822 374767 701949 818462 691766 561188 467627 579750 702743 497109
14806 497109 846705 1095616 1178657 1054140 960811 418461 771078 871005 715029 434116
14796 434116 169414 550302 750129 473324 628202 408867 316746 516167 668668 863748
$$ packed form
14867D76672L26712r4538j44433K66130k32873j2624j40859m7614j3653o0025
14857C22895k6664J61158Q4503F4362M74539l4388A05945N85744k62196R885K379
14846D41757J16036j82095L06384O00794k60600L52568l46372J09140k80061J21870
14836I79421K11845k98452l43209P0245J283K81599j1784j30118l07049K4094
14826D77875Q2995K96673j27047r9966B92587J80709L78329j93887K97193l07417
14816F47514M53308C74767L27182J16513j26696j30578r3561J12123J22993k05634
14806D97109L49596K48911Q3041j24517r3329D18461L52617R9927j55976k80913
14796D34116A69414L80888J99827k76805J54878k19335r2121J99421J52501J95080
$$ plain form
14786 863748 274414 675415 616443 902713 601527 607625 223496 805927 584468 784143
14776 784143 1285465 968783 940294 780157 683050 780204 476931 628513 659133 634777
14766 634777 661625 400950 534409 529604 435613 708629 513419 556710 668473 922456
14756 922456 769927 579674 554167 588396 620096 534814 648538 420737 783924 770875
14746 770875 487737 763369 759942 730203 906994 752138 673352 827550 691508 664735
14736 664735 921110 756438 719674 756364 702658 905374 903198 1135932 1225361 1615422 1967618
14725 1967618 1799283 1916302 1572611 1365585 1180598 1067239 1022860 1111401 1086917 1016107
14715 1016107 1058397 957461 781297 851676 919729 776281 983258 925196 1019615 860618
$$ packed form
14786H63748B74414M01001n8972K86270l01186O098B23496N82431k21459J99675
14776G84143N01322l16682k8489j60137r7107R7154l03273J51582L0620k4356
14766F34777K6848k60675J33459m805r3991K73016j95210M3291J11763K53983
14756I22456j52529j90253k5507L4229L1700q5282J13724k27801L63187j3049
14746G70875k83138K75632l427k9739J76791j54856p8786J54198j36042k6773
14736F64735K56375j64672l6764L6690n3706K02716k176K32734Q9429L90061L52196
14725A967618j68335J17019l43691k07026j84987j13359m4379Q8541k4484p0810
14715A016107M2290j00936j76164P0379O8053j43448K06977n8062R4419j58997
$$ plain form
14705 860618 825155 979624 1049666 1483565 1477581 2087445 1881019 1827107 1266346 1173250 1195098
14694 1195098 891961 1444716 834361 1207676 1023480 974323 825278 637370 810731 829043
14684 829043 963423 1091585 800226 1245036 839718 942387 669716 1012343 840308 938688
14674 938688 1046679 872754 1114969 1225118 1203963 1208607 1128402 900432 1159609 986954
14664 986954 900437 825456 1190636 1258265 1146968 862592 837206 1202899 1073017 748786
14654 748786 1191967 1158791 974781 1276036 1282932 822077 1177739 1395988 1081499 1067361
14644 1067361 1445565 1196569 1062743 1301653 1375432 1230417 1019097 1336540 1376750 1245287
14634 1245287 1030633 1048903 1251997 1388214 1090381 1435385 1451480 1082189 1407352 1069733
$$ packed form
14705H60618l5463J54469P0042M33899n984O09864k06426n3912n60761r3096K1848
14694A195098l03137N52755o10355L73315j84196m9157j49045j87908J73361J8312
14684H29043J34380J28162k91359M44810m05318J02669k72671L42627j72035R8380
14674I38688J07991j73925K42215J10149k1155M644q0205k27970K59177j72655
14664I86954q6517p4981L65180O7629j11297k84376k5386L65693j29882l24231
14654G48786M43181l3176j84010L01255O896m60855L55662K18249l14489j4138
14644A067361L78204k48996j33826K38910P3779j45015k11320L17443M0210j31463
14634A245287k14654J8270K03094J36217k97833L45004J6095l69291L25163l37619
$$ plain form
14624 1069733 1219863 1237854 1471027 1647411 1462494 1407690 1646189 1210678 1543805 1465998
14614 1465998 1626454 1503566 1270444 1622966 1231876 1586812 1180544 1286760 1370541 1553599
14604 1553599 1506277 1413946 1369608 1613027 1426053 1715181 1607514 1864743 1726211 1355859
14594 1355859 1710147 1531777 1666582 1735095 1872077 1819295 1318766 1673912 1599728 1869346
14584 1869346 1877176 1542474 1957407 2182636 1856211 1805239 1842377 2129418 2010984 1948043
14574 1948043 1897108 2177433 2283270 1965119 2277869 2042481 2207352 2031647 2279864 2466998
14564 2466998 2641958 2327065 2557912 2688104 2400429 2589482 2607303 2666986 3234450 3101709
14554 3101709 3493027 4270792 3970285 4672849 5835343 8328951 11822356 20571856 42062071
$$ packed form
14624A069733J50130J7991K33173J76384j84917n4804K38499m35511L33127p7807
14614A465998J60456j22888k33122L52522l91090L54936m06268J06216Q3781J83058
14604A553599m7322r2331m4338K43419j86974K89128j07667K57229j38532l70352
14594A355859L54288j78370J34805O8513J36982n2782n00529L55146p4184K69618
14584A869346P830l34702M14933K25229l26425n0972L7138K87041j18434o2941
14574A948043n0935K80325J05837l18151L12750k35388J64871j75705K48217J87134
14564B466998J74960l14893K30847J30192k87675J89053J7821N9683N67464j32741
14554C101709L91318P77765l00507P02564J162494K493608L493405Q749500K1490215
$$ plain form
14545 42062071 42753202 17778966 7452652 4364833 3309894 3979427 6052667 3499779
14537 3499779 2172393 2245063 1867401 1974057 2118045 1890330 2122181 2431638 1913962
14528 1913962 1961652 2156158 2379994 2292978 2441381 1930381 2279957 2242531 2598715 2546614
14518 2546614 2701346 2457779 2728917 2672739 2601469 2631081 2556058 3074893 3002199 2825790
14508 2825790 2803623 2870304 3138938 3160278 2921521 3080667 3104125 2975704 3227575 2810654
14498 2810654 3208449 3249231 3076057 3177549 3249771 3426206 3260511 3790117 3235643 3225649
14488 3225649 3478706 3594884 3736911 3694351 3613116 3694823 3309821 4023717 3691268 4094875
14478 4094875 3725502 3842020 4159256 4169890 3914289 4160392 4365729 4205742 4000126 4152032
$$ packed form
14545D2062071O91131A7778966G452652l087819j054939O69533K073240k552888
14537C499779j327386P2670l77662J06656J43988k27715K31851L09457n17676
14528A913962M7690J94506K23836q7016J48403n11000L49576l7426L56184n2101
14518B546614J54732k43567K71138n6178p1270K9612p5023N18835p2694j76409
14508B825790k2167O6681K68634K1340k38757J59146K3458j28421K51871m16921
14498B810654L97795M0782j73174J01492P2222J76435j65695N29606n54474r994
14488C225649K53057J16178J42027m2560q1235Q1707l85002P13896l32449M03607
14478D094875l69373J16518L17236J0634k55601K46103K05337j59987k05616J51906
$$ plain form
14468 4152032 4569906 4090731 4449963 4390951 4517956 4696759 4707994 4875557 4828264 4564293
14458 4564293 4670669 4782767 5003710 4948287 5057706 4831763 5149590 5337586 5285448 5618354
14448 5618354 5397897 5364961 5697771 5456777 5590833 6070124 6102035 5879740 5840572 6174989
14438 6174989 6320594 6119054 6143298 6381120 6724093 6814321 6817831 6756429 7026844 7070611
14428 7070611 7039547 7383149 7471603 7292519 7505495 7613192 8024903 7900697 8301785 8565698
14418 8565698 8646617 8292693 8911558 8928477 8781183 8816186 9026389 8999243 9022591 9362013
14408 9362013 9544083 9888190 9716592 10125370 10310521 10532187 10628636 10757503 10705788 11062550
14398 11062550 11065565 11096617 11511087 11081765 12035457 11564528 12103922 12189948 12363951 12565725
$$ packed form
14468D152032M17874m79175L59232n9012J27005J78803J1235J67563m7293k63971
14458D564293J06376J12098K20943n5423J09419k25943L17827J87996n2138L32906
14448E618354k20457l2936L32810k40994J34056M79291L1911k22295l9168L34417
14438F174989J45605k01540K4244K37822L42973R0228L510o1402K70415M3767
14428G070611l1064L43602Q8454j79084K12976J07697M11711j24206M01088K63913
14418H565698Q0919l53924O18865J6919j47294L5003K10203k7146K3348L39422
14408I362013J82070L44107j71598M08778J85151K21666R6449J28867n1715L56762
14398A1062550L015L1052M14470m29322R53692m70929N39394Q6026J74003K01774
$$ plain form
14388 12565725 12775439 12938325 13318776 13597576 14015392 14436636 14379228 14758570 14917890
14379 14917890 15507482 15718296 15688553 15788810 16338050 16430345 17015304 17653244 17434775 17984298
14369 17984298 18294244 18491002 19355350 19755132 20048080 20685575 21169406 21259717 21597019
14360 21597019 21856224 22599824 23188942 23576734 24194486 24724689 25276341 26267542 26431932
14351 26431932 27306090 27761339 28360574 29109262 30442595 30714611 31418845 32317423 33168086
14342 33168086 34010628 34960075 36016433 37045820 38123234 39307779 40255006 41577533
14334 41577533 42640324 43757683 45505269 46637568 48062847 50043170 51658845 53139247
14326 53139247 55015205 56936354 58682883 60946211 62922047 65229544 67915264 70095478
$$ packed form
14388A2565725K09714J62886L80451K78800M17816M21244n7408L79342J59320
14379A4917890N89592K10814k9743J00257N49240R2295N84959O37940k18469N49523
14369A7984298L09946J96758Q64348L99782K92948O37495M83831R0311L37302
14360B1597019K59205P43600N89118L87792O17752N30203N51652R91201J64390
14351B6431932Q74158M55249N99235P48688J333333K72016P04234Q98578Q50663
14342C3168086Q42542R49447J056358J029387J077414J184545R47227J322527
14334D1577533J062791J117359J747586J132299J425279J980323J615675J480402
14326E3139247J875958J921149J746529K263328J975836K307497K685720K180214
$$ plain form
14318 70095478 72997365 75004827 78022407 81068773 84696865 87769396 91242299 95150625
14310 95150625 98952577 103207585 107746247 112321372 117386904 122874965 128611387 134521254
14302 134521254 140555926 147328240 154508181 161996318 169891701 178298416 187317908 196590328
14294 196590328 206423327 217172268 228225974 239824745 252062934 264945999 278099362
14287 278099362 292365513 307227766 321589392 336649210 352011443 367137555 382599600
14280 382599600 397434329 411499786 424973298 437678611 448678231 457527826 462522632
14273 462522632 464177851 465347668 465302841 464939990 462533650 456406900 449572175 440694456
14265 440694456 430118174 418066496 404412144 389678313 374428953 358626372 342442511
$$ packed form
14318G0095478K901887K007462L017580L046366L628092L072531L472903L908326
14310I5150625L801952M255008M538662M575125N065532N488061N736422N909867
14302A34521254O034672O772314P179941P488137P895383Q406715R019492R272420
14294A96590328R832999J0748941J1053706J1598771J2238189J2883065J3153363
14287B78099362J4266151J4862253J4361626J5059818J5362233J5126112J5462045
14280C82599600J4834729J4065457J3473512J2705313J0999620Q849595M994806
14273D62522632J655219J169817m4827l62851k406340o126750o834725q877719
14265D40694456j0576282j2051678j3654352j4733831j5249360j5802581j6183861
$$ plain form
14258 342442511 326629545 310686476 295627567 280774187 266712913 253367265 240246924
14251 240246924 228020115 216892446 207048432 196560581 186682804 177243718 169075493
14244 169075493 160853733 153472367 146378041 139529371 132833854 127021137 121990519 116545889
14236 116545889 111253699 106413806 101695953 97881349 93738139 90594770 86849602 83312346
14228 83312346 80144651 77194690 74265113 71491639 68981978 66353846 64148514 61869404
14220 61869404 60122883 58099365 56045716 54137565 52486316 50973883 49466177 48230420
14212 48230420 46658759 45035079 43650877 42120055 41514883 40711674 39342228 38343314
14204 38343314 36830563 35935108 35275825 33795635 33832288 32580167 31539073 30596877 30016298
$$ packed form
14258C42442511j5812966j5943069j5058909j4853380j4061274j3345648j3120341
14251B40246924j2226809j1127669r844014j0487851r877777r439086q168225
14244A69075493q221760p381366p094326o848670o695517n812717n030618n444630
14236A16545889n292190m839893m717853l814604m143210l143369l745168l537256
14228H3312346l167695k949961k929577k773474k509661k628132k205332k279110
14220F1869404j746521k023518k053649j908151j651249j512433j507706j235757
14212D8230420j571661j623680j384202j530822o05172q03209j369446r98914
14204C8343314j512751q95455o59283j480190L6653j252121j041094r42196n80579
$$ plain form
14195 30016298 29179938 28774418 27852771 26998258 26392409 25839569 25436855 24895068 24335841
14186 24335841 23663082 22973851 22567077 21851467 21460611 21134661 20873907 20099522 20067501
14177 20067501 19288866 19302745 19250436 18321484 17911263 17362425 17495069 17047803 16582820 16499757
14167 16499757 15877774 15630175 15388822 15065924 14863485 14680064 14346660 14284608 13827533
14158 13827533 13729562 13528254 12926815 12736006 12548970 12520261 12194099 12211681 11546877 11749589
14148 11749589 11553111 11694941 11255592 11361917 10942105 10802738 10696183 10588046 10380067
14139 10380067 9970520 10036699 9859101 9574323 9312229 9541854 9375522 9073734 8911897
14130 8911897 9046235 8608232 8509019 8553877 8195047 8059436 7990170 8101399 8004302 7466497
$$ packed form
14195C0016298q36360m05520r21647q54513o05849n52840m02714n41787n59227
14186B4335841o72759o89231m06774p15610l90856l25950k60754p74385l2021
14177B0067501p78635J3879n2309r28952m10221n48838J32644m47266m64983q3063
14167A6499757o21983k47599k41353l22898k02439j83421l33404o2052m57075
14158A3827533r7971k01308o01439j90809j87036k8709l26162J7582o64804K02712
14148A1749589j96478J41830m39349J06325m19812j39367j06555j08137k07979
14139A0380067m09547O6179j77598k84778k62094K29625j66332l01788j61837
14130H911897J34338m38003r9213M4858l58830j35611o9266J11229r7097n37805
$$ plain form
14120 7466497 7338393 7688927 7508089 7306787 6931697 7142281 6900909 6879673 6890339 6839711
14110 6839711 6838204 6720465 6359731 6550362 6524592 6343423 6457835 6382355 6039022 5937363
14100 5937363 6004764 5891558 5620619 6095121 5722655 5687899 5886203 5445352 5528549 5462522
14090 5462522 5309595 5277560 5220630 4859835 5389899 5353443 5204596 5186626 5049256 4867507
14080 4867507 4833429 4561684 4713192 4796446 4667791 4758355 4129329 4920181 4252256 4221465
14070 4221465 4389081 4263667 4337004 4272862 4365351 4296878 4295796 4155413 3972571 4178818
14060 4178818 3982838 3933320 3775321 4217999 3936678 3654618 3789642 3699539 3646968 3666802
14050 3666802 3353640 3457710 3618143 3496879 3603291 3203483 3097329 3335117 3293511 3293536
$$ packed form
14120G466497j28104L50534j80838k01302l75090K10584k41372k1236J0666n0628
14110F839711j507j17739l60734J90631k5770j81169J14412p5480l43333j01659
14100E937363O7401j13206k70939M74502l72466l4756J98304m40851Q3197o6027
14090E462522j52927l2035n6930l60795N30064l6456j48847j7970j37370j81749
14080D867507l4078k71745J51508Q3254j28655R0564o29026P90852o67925l0791
14070D221465J67616j25414P3337o4142R2489o8473j082j40383j82842K06247
14060D178818j95980m9518j57999M42678k81321k82060J35024r0103n2571J9834
14050C666802l13162J04070J60433j21264J06412l99808j06154K37788m1606K5
$$ plain form
14040 3293536 3251968 3345796 3105974 3246459 3019291 3142416 3011174 3028175 2903229 2757429
14030 2757429 3390570 3131475 3286012 3017578 2639607 2642402 2844848 2694818 2840118 2519422
14020 2519422 2763066 2510788 2437987 2521129 2365637 2545259 2875771 2532670 2419916 2596924
14010 2596924 2748815 2040067 2732480 2214715 2078267 2570604 2298710 2258788 1832167 2463473
14000 2463473 2085739 2068053 1972406 1969453 1882523 1725868 2380422 2401771 2042383 2204446
13990 2204446 2947403 4055719 6615298 12927546 31545437 48130743 25638923 12467289
13981 8023871 5642696 4675089 4214264 3423659 3209159 3162143 2938735 2438522 2751007
13972 2751007 2399947 2616726 2430824 2738039 2193228 2195778 2358983 1983309 2380879 2164371
$$ packed form
14040C293536m1568R3828k39822J40485k27168J23125j31242J7001j24946j45800
14030B757429O33141k59095J54537k68434l77971K795K02446j50030J45300l20696
14020B519422K43644k52278p2801Q3142j55492J79622L30512l43101j12754J77008
14010B596924J51891p08748O92413n17765j36448M92337k71894l9922m26621O31306
14000B463473l77734j7686r5647k953q6930j56655O54554K1349l59388J62063
13990B204446P42957J108316K559579O312248J8617891J6585306k2491820A2467289
13981H023871k381175r67607m60825p90605k14500m7016k23408n00213L12485
13972B751007l51060K16779j85902L07215n44811K550J63205l75674L97570k16508
$$ plain form
13962 2164371 2231989 1876205 1841093 2377685 2312365 2070654 1816957 1825107 1948192 1656835
13952 1656835 2015496 1989387 1983509 1871578 2262373 1745273 1652967 2460824 2008542 1754516
13942 1754516 2011795 1729160 1807079 1659119 1939494 1634404 1862660 1703126 1833847 1608338
13932 1608338 1378371 1752407 1436503 1916783 1690010 1647512 1634351 1635738 1431664 1461276
13922 1461276 1437140 1602457 1666687 1480138 1514292 1313442 1549330 1636966 1418952 1271190
13912 1271190 1614791 1460045 1601288 1737664 1232288 1299210 1553156 1152167 1814895 1290344
13902 1290344 1627921 1375779 1495254 1258699 1375645 1385550 1622340 1447358 1324519 970029
13892 970029 1310452 1146617 1213856 1249206 1321602 1113641 1263165 1274121 1282867 1281473 1181774
$$ packed form
13962B164371O7618l55784l5112N36592o5320k41711k53697Q150J23085k91357
13952A656835L58661k6109n878j11931L90795n17100r2306Q07857m52282k54026
13942A754516K57279k82635P7919j47960K80375l05090K28256j59534J30721k25509
13932A608338k29967L74036l15904M80280k26773m2498j3161J387k04074K9612
13922A461276k4136J65317O4230j86549L4154k00850K35888Q7636k18014j47762
13912A271190L43601j54746J41243J36376n05376O6922K53946m00989O62728n24551
13902A290344L37577k52142J19475k36555J16946R905K36790j74982j22839l54490
13892I70029L40423j63835O7239L5350P2396k07961J49524J0956Q746j394r9699
$$ plain form
13881 1181774 1456389 1245593 1197525 856589 986767 1412246 1334448 1174662 1068378 1343866
13871 1343866 1110718 1206550 1251201 1245538 969712 997375 1035499 1285993 1355261 1004573 1051839
13860 1051839 1367135 1211935 1175448 1318755 1113686 852237 805963 846472 1218688 1035750
13850 1035750 925939 1038643 1158602 478968 1159037 916771 1098866 821896 788789 851007
13840 851007 895660 907202 793553 891579 560550 1080648 897188 1075436 839217 788276
13830 788276 914430 607780 779141 748476 951047 978511 1099006 914452 1051694 1010521
13820 1010521 1058111 705061 708673 985758 1037993 899297 950957 702634 693896 658054 1018261
13809 1018261 539157 864990 889138 762013 1161632 978691 773510 717257 659313 713675
$$ packed form
13881A181774K74615k10796m8068l40936J30178M25479p7798j59786j06284K75488
13871A343866k33148R5832M4651n663k75826K7663L8124K50494O9268l50688M7266
13860A051839L15296j55200l6487J43307k05069k61449m6274M0509L72216j82938
13850A035750j09811J12704J19959D78968O80069k42266J82095k76970l3107O2218
13840H51007M4653J1542j13649R8026l31029N20098j83460J78248k36219n0941
13830G88276J26154l06650J71361l0665K02571K7464J20495j84554J37242m1173
13820A010521M7590l53050L612K77085N2235j38696N1660k48323q738l5842L60207
13809A018261m79104L25833K4148j27125L99619j82941k05181n6253n7944N4362
$$ plain form
13799 713675 1101110 781823 599656 923919 718663 571664 1062523 769898 750275 1032728
13789 1032728 932805 601794 732459 461795 763049 599480 614069 662292 552202 747503
13779 747503 744520 576965 370292 753644 828439 629124 627714 820992 1008556 762108
13769 762108 730986 639193 648171 873498 379438 656835 438189 931105 1257844 807062
13759 807062 711672 587208 696843 628009 850726 695058 781466 600129 834829 512144
13749 512144 500001 439085 800080 743863 608470 696286 726932 787443 715665 514239 812526
13738 812526 323721 803094 150637 368402 795244 490702 789096 804346 815815 478672
13728 478672 283077 802443 708260 611257 777805 636086 635178 791127 786869 241030 428896
$$ packed form
13799G13675L87435l19287j82167L24263k05256j46999M90859k92625j9623K82453
13789A032728r9923l31011J30665k70664L01254j63569J4589M8223j10090J95301
13779G47503k983j67555k06673L83352P4795j99315j410J93278J87564k46448
13769G62108l1122r1793Q978K25327C79438K77397k18646M92916L26739m50782
13759H07062r5390j24464J09635o8834K22717j55668Q6408j81337K34700l22685
13749E12144j2143o0916L60995n6217j35393Q7816L0646O0511p1778k01426K98287
13738H12526C23721M79373A50637K17765M26842l04542K98394J5250J1469l37143
13728D78672j95595N19366r4183r7003J66548j41719r08J55949m258B41030J87866
$$ plain form
13717 428896 134316 845919 186529 595438 591158 536384 676867 451346 367247 827842
13707 827842 540710 635030 411674 688985 336751 341502 362626 656820 542289 711928
13697 711928 644256 499060 357900 628064 507002 456949 588676 586691 438540 153070
13686 677911 668349 597456 256975 460133 290204 307682 699822 343239 333738 331491 337846
13675 337846 560673 431342 227315 615344 499063 612016 526206 406822 533136 569335
13665 569335 489695 539729 369183 472120 563455 478893 440414 670634 863760 392798
13654 477703 627726 92654 512234 687224 437611 268639 202035 240801 -17893 513513
13643 430229 127786 505693 224491 370229 705475 539599 89129 716917 12411 321077
$$ packed form
13717D28896A34316P11603A86529M08909m280n4774J40483k25521q4099M60595
13707H27842k87132R4320k23356K77311C36751M751K1124K94194j14531J69639
13697G11928o7672j45196j41160K70164j21062n0053J31727j985j48151A53070
13686F77911r562p0893B56975K03158j69929J7478L92140C43239r501k247O355
13675C37846K22827j29331k04027L88029j16281J12953q5810j19384J26314L6199
13665E69335p9640N0034j70546J02937R1335q4562l8479K30220J93126C92798
13654D77703J50023I2654M19580J74990k49613j68972o6604L8766a7893E13513
13643D30229A27786L77907B24491J45738L35246j65876H9129O27788A2411L08666
$$ plain form
13633 321077 183774 223055 755700 415689 584927 520393 351235 465969 215091 207893
13623 207893 482586 199457 446406 195303 693524 261975 291003 163444 358256 368515
13613 368515 242714 473801 319441 619575 445041 328148 276381 371915 621877 376729
13603 376729 56645 489463 186061 346838 416394 417868 364132 216859 219299 369838 230763
13592 230763 171671 261906 395944 304551 405011 395498 276052 266028 241201 195557 305504
13581 305504 342880 414779 192219 22849 498689 496596 538181 244780 425391 349780 382561
13570 382561 509147 286410 326886 291038 279956 519429 290374 322559 164341 277723
13560 277723 491050 253610 187242 150071 72749 189418 112687 351740 620682 159463
$$ packed form
13633C21077j37303L9281N32645l40011J69238o4534j69158J14734B15091p198
13623B07893K74693A99457K46949A95303M98221B61975K9028j27559J94812J0259
13613C68515j25801K31087j54360L00134j74534j16893n1767R5534K49962k45148
13603C76729E6645M32818A86061J60777O9556J474n3736j47273K440J50539j39075
13592B30763n9092R0235J34038r1393J00460r513j19446j0024k4827m5644J09947
13581C05504L7376P1899A92219B2849M75840k093M1585B44780J80611p5611L2781
13570C82561J26586k22737M0476l5848j1082K39473k29055L2185j58218J13382
13560B77723K13327k37440o6368l7171G2749J16669p6731K39053K68942A59463
$$ plain form
13549 61878 424659 446962 214021 402295 334600 206363 172140 -30921 355285 173888
13538 297217 22491 183391 151307 33349 314587 868540 198818 465030 111171 212373
13528 212373 468053 173095 214824 396948 550315 14660 365054 455845 193670 255237
13518 255237 -120491 342980 484370 124732 175499 158544 150304 363825 377169 188091
13507 252223 115480 189481 550693 368559 -11565 -126064 245557 313814 166021 427205
13497 427205 204492 319525 293088 413724 501266 168688 327311 -38012 366705 249965
13487 249965 71241 168276 405909 528650 434599 206028 372934 210368 287996 15950
13476 326667 68019 23630 217841 109461 325480 31454 130587 194561 426655 198829
$$ packed form
13549F1878L62781K2303B14021J88274o7695j28237l4223c0921C55285A73888
13538B97217B2491J60900l2084C3349K81238N53953A98818K66212A11171J01202
13528B12373K55680A73095M1729J82124J53367A4660L50394R0791A93670O1567
13518B55237a20491C42980J41390A24732N0767j6955q240K13521J3344A88091
13507B52223A15480P4001L61212j82134a1565j14499B45557O8257j47793K61184
13497D27205B04492J15033k6437J20636Q7542A68688J58623c8012C66705j16740
13487B49965G1241R7035K37633J22741r4051B06028J66906j62566P7628A5950
13476C26667F8019B3630J94211j08380K16019C1454R9133O3974K32094A98829
$$ plain form
13465 153482 5450 117701 -42237 96409 235188 184706 539099 -51282 211606 411672 218061
13454 218061 41940 282701 383839 598562 253714 -41790 548158 382121 93101 270057
13444 270057 190174 125353 397417 186111 -127240 369115 203418 45896 210380 350928
13434 350928 301910 192690 290434 37587 12357 361612 -94316 258278 22739 390091 209019
13423 209019 208685 239517 13472 318690 -145938 212000 -5813 -116866 206335 231033 43925
13411 444250 320956 319462 540322 -30648 248709 475722 144639 347901 501014 45083
13400 150104 205942 235219 211538 114585 117367 260558 131170 289152 205529 14736 -40880
13388 77120 292667 -23055 449197 214135 458730 -152005 -110909 204482 -4857 -118209
$$ packed form
13465A53482E450J12251d2237I6409J38779n0482L54393e1282B11606K00066j93611
13454B18061D1940K40761J01138K14723B53714d1790E48158j66037I3101J76956
13444B70057p9883o4821K72064A86111a27240C69115j65697D5896J64484J40548
13434C50928m9018j09220R7744C7587A2357L49255i4316B58278B2739L67352j81072
13423B09019l34L0832A3472L05218a45938B12000e813j11053B06335K4698D3925
13411D44250j23294j494K20860c0648B48709K27013A44639K03262J53113D5083
13400A50104N5838K9277k3681r6953K782J43191j29388J57982q3623A4736d0880
13388G7120K15547b3055D49197B14135K44595a52005M1096B04482d857j13352
$$ plain form
13378 -118209 -28828 124342 325326 91881 277087 158853 297449 293770 157053 367251
13368 367251 41638 139684 515942 16246 226293 482857 314205 -19200 334474 89830
13357 302078 137825 240549 150806 196583 224496 -59812 116255 76491 317283 432703
13347 432703 47834 -13269 155080 221009 313251 607606 269312 307972 239233 493841 389602
13336 389602 262272 -7796 295638 50866 380823 291689 208189 223012 74111 206378 265286
13325 265286 411949 69955 137222 54860 -43977 109062 45577 207535 28906 229105 363084
13314 363084 165166 406263 308870 140012 127882 164357 244300 34310 -60608 -108252 -165739
13303 -165739 153819 -139231 -52461 202654 65601 553402 263901 230991 393479 230551
$$ packed form
13378a18209b8828A24342K00984I1881J85206j18234J38596l679j36717K10198
13368C67251D1638R8046L76258A6246K10047K56564j68652a9200C34474H9830
13357C02078A37825J02724q9743M5777K7913e9812A16255l9764K40792J15420
13347D32703D7834a3269A55080O5929R2242K94355B69312L8660o8739K54608j04239
13336C89602j27330g796B95638E0866L29957q9134q3500J4823G4111J32267N8908
13325B65286J46663F9955O7267E4860d3977A09062D5577J61958B8906K00199J33979
13314C63084A65166K41097r7393A40012j2130L6475P9943C4310f0608m7644n7487
13303a65739A53819a39231e2461B02654F5601M87801B63901l2910J62488j62928
$$ plain form
13293 230551 98756 136526 61967 -35841 354364 258204 109240 177972 363092 27549 -4297
13281 184355 115779 -329581 121960 145760 458667 220131 59450 414229 226102 180051
13271 180051 -136810 163600 132779 128161 18058 237170 266498 187439 -90679 55666 122170
13260 122170 -15630 -515307 -8541 213904 248426 177936 -199114 -179695 -42756 524778 252997
13248 135477 33202 -21240 292286 -13496 138543 -117701 64409 -329910 98564 71358 169068
13237 169068 175497 369013 45504 175806 218154 16955 -28930 157333 345019 281726 103428
13225 156758 351589 131238 105528 -162392 222855 70942 104014 59836 -20972 192656
13214 -318159 233879 212416 316779 109737 46678 -138988 40240 252023 -91887 -44556
$$ packed form
13293B30551I8756L7770F1967c5841C54364r6160A09240O8732J85120B7549d297
13281A84355o8576c29581A21960K3800L12907B20131E9450L54779j88127m6051
13271A80051a36810A63600l0821m618A8058K19112K9328p9059i0679E5666O6504
13260A22170a5630m99677h541B13904L4522p0490a99114J9419d2756E24778B52997
13248A35477C3202b1240B92286a3496A38543a17701F4409c29910I8564k7206R7710
13237A69068O429J93516D5504J30302M2348A6955b8930A57333J87686o3293A03428
13225A56758J94831A31238k5710a62392B22855G0942L3072m4178b0972A92656
13214c18159B33879k1463J04363A09737D6678a38988D0240K11783i1887d4556
$$ plain form
13203 -139385 187852 -1413 11223 154907 20920 -207261 265822 32087 -57278 48737 -33215
13191 -19458 80769 262905 430973 233960 290229 -243433 208349 3088 241739 96181 108867
13180 108867 72408 132683 -38245 12525 -89575 -3867 91300 281948 -8571 56114 141926 181641
13168 181641 478401 213315 461016 442438 -144054 690 -202220 91772 -100622 -16527 -12450
13157 -12450 41965 329160 93483 392475 -154033 -37759 -387164 40131 11650 -17594 214753
13145 -140929 -376959 -208591 -22253 314635 32537 238499 699927 -98564 13939 133181
13135 133181 -223593 11632 35115 165723 59593 73997 81283 311918 -162578 73176 -139509
13123 362833 243274 432716 -162385 417711 88813 -362356 390464 406959 98554 80706
$$ packed form
13203a39385A87852a413A1223J43684B0920b07261B65822C2087e7278D8737c3215
13191a9458H0769J82136J68068j97013N6269b43433B08349C088K38651I6181J2686
13180A08867l6459O0275c8245A2525h9575c867I1300J90648h571E6114Q5812L9715
13168A81641K96760B13315K47701j8578a44054F90b02220I1772a00622a6527M077
13157a2450D1965K87195I3483K98992a54033c7759l49405D0131A1650a7594B14753
13145a40929k36030J68368b2253C14635C2537K05962M61428i8564A3939J19242
13135A33181b23593A1632K3483J30608E9593J4404P286K30635a62578G3176a39509
13123C62833j19559J89442a62385D17711H8813c62356C90464J6495I8554j7848
$$ plain form
13113 80706 161477 -101407 223056 86255 28055 197358 234395 -65020 -168107 28054 -252126
13101 5117 160959 119744 50119 251660 -2314 18000 135366 126285 -112475 -205864 -91538
13089 199043 498712 20219 -229102 276796 164 72193 195251 224841 -223795 3538 163962
13078 163962 -85935 -87723 42587 368043 -98280 15109 4385 38355 187108 205597 -68683
13066 286193 384887 76525 234130 -55761 280008 44672 195552 -30282 -6497 -225153 247792
13054 259386 -27212 -35984 -250578 58901 393628 388644 210120 162071 -197378 27267 18925
13043 18925 21461 -58915 -84915 -111636 -50749 73272 -83490 165893 205772 247562 225767 29644
13030 83351 5374 -272243 -65464 -107530 66757 -89635 186660 315922 -34707 70685 -67984
$$ packed form
13113H0706Q0771a01407B23056H6255B8055J69303L7037f5020j03087B8054b52126
13101E117J55842m1215E0119K01541b314A8000J17366r081a12475r3389i1538
13089A99043K99669B0219b29102B76796A64P2029J23058K9590b23795C538J60424
13078A63962h5935j788D2587L25456i8280A5109D385L3970J48753J8489f8683
13066B86193R8694G6525J57605e5761B80008D4672J50880c0282f497k18656B47792
13054B59386b7212q772k14594E8901L34727m984j78524m8049a97378B7267q342
13043A8925K536e8915k6000k6721e0749G3272h3490A65893L9879M1790k1795B9644
13030H3351E374b72243f5464m2066F6757h9635A86660J29262c4707G0685f7984
$$ plain form
13018 -167269 277202 176427 205601 27542 33839 238471 -96672 214693 -118706 -23572 22281
13006 -198961 -211276 293693 341846 10186 59364 -86963 -25007 121302 263106 139643 26415
12994 209752 -22005 8747 -45148 -59491 -144926 255134 -56336 -159395 -130447 -46660 77857
12982 72041 -150838 -206616 64060 -97365 225843 112035 -116573 241938 -56859 -40588 57585
12970 160026 39408 -191331 33822 224186 165338 130121 127919 127334 147389 29302 -97089 169187
12957 -324579 -73076 -34357 -50051 3589 -243888 -168404 -56180 11061 27126 -8422 312425
12945 38836 -61927 136395 -9258 150194 130466 -78711 26488 169197 -306064 -51226 -197229
12934 -197229 84846 203701 115492 128454 166933 -29816 92161 44051 7071 298595 275469
$$ packed form
13018a67269B77202j00775K9174B7542O297K04632i6672B14693a18706b3572B2281
13006a98961j2315B93693M8153A0186M9178h6963b5007A21302J41804j23463B6415
12994B09752b2005H747d5148j4343q5435B55134e6336j03059K8948d6660G7857
12982G2041a50838n5778F4060i7365B25843A12035a16573B41938e6859J6271E7585
12970A60026C9408a91331C3822J90364n8848l5217k202n85K0055B9302i7089A69187
12957c24579g3076c4357j5694C589b43888P5484e6180A1061J6065h422C12425
12945C8836f1927A36395i258A50194j9728g8711B6488J42709c06064e1226j46003
12934a97229H4846J18855q8209J2962L8479b9816I2161D4051G071K91524k3126
$$ plain form
12923 275469 116025 64816 40503 -27630 -69546 40286 149357 209178 -1756 -245540 231581
12911 105472 -144351 32588 54500 78269 -196544 31502 282791 51083 22759 -190492 50165
12899 -381796 260770 57624 228938 143720 -17939 121139 -6085 138468 -149160 -55802 18683
12887 -150417 -14277 195070 45331 -50209 -281455 17687 30480 -295664 361736 -80927 52049
12875 88859 113019 59492 -84298 -224269 210221 123088 286049 243729 200355 -185095 -53280
12863 139048 -279008 -135308 -163019 164470 72404 -228856 -247260 -220501 320407 -128580
12852 71153 59588 182161 -67194 138739 97859 136092 167182 -64345 232627 -234991 251152
12840 -4390 327341 -46736 169237 -83925 111261 115673 -304082 -37756 -83278 104438 93123
$$ packed form
12923B75469A16025n1209k4313b7630m1916D0286J09071N9821a756k43784B31581
12911A05472a44351C2588K1912K3769a96544C1502K51289E1083B2759a90492E0165
12899c81796B60770E7624J71314q5218a7939A21139f085A38468a49160e5802A8683
12887a50417a4277A95070D5331e0209k31246A7687J2793b95664C61736h0927E2049
12875H8859K4160n3527h4298j39971B10221q7133J62961m2320m3374a85095e3280
12863A39048b79008a35308k7711A64470G2404b28856j8404K6759C20407a28580
12852G1153j1565J22573f7194A38739m0880L8233L1090f4345B32627b34991B51152
12840d390C27341d6736A69237h3925A11261M412c04082c7756m5522A04438j1315
$$ plain form
12829 93123 80867 -231890 -22209 82022 97159 47579 49443 307567 231766 -211002 -25660
12817 177907 127453 7375 -184035 33281 261970 -185994 150384 113968 172902 205799 -193604
12805 -141560 -324668 48584 88988 269449 -177418 217374 6148 -78914 206860 -53528 94379
12793 -64643 91520 -115859 -103091 -218562 166893 -68949 -331085 -246041 -54992 -76311 -55505
12782 -55505 96150 -52622 336331 124734 297157 -52497 107535 274504 96969 157521 -106451
12770 108631 40699 29032 92615 -236426 -215363 -51291 -35259 -129698 -27332 -392547 -146472
12758 -37735 161487 -274688 -218384 4331 -207914 144846 -9830 -151194 -112962 -377131 24343
12746 23375 -108828 -41509 99149 34923 159614 280855 -259605 154484 189402 -57381 -135594
$$ packed form
12829I3123j2256b31890b2209H2022J5137D7579J864K58124p5801b11002b5660
12817A77907n0454G375a84035C3281K28689a85994A50384l6416N8934L2897a93604
12805a41560j83108D8584M0404J80461a77418B17374F148g8914B06860e3528I4379
12793f4643I1520a15859J2768j15471A66893f8949k62136Q5044e4992k1319K0806
12782e5505I6150e2622C36331A24734J72423e2497A07535J66969I6969O0552a06451
12770A08631D0699j1667O3583b36426K1063e1291J6032r4439b7332l65215a46472
12758c7735A61487b74688N6304D331b07914A44846i830j41364L8232k64169B4343
12746B3375a08828d1509I9149C4923J24691J21241b59605A54484L4918e7381p8213
$$ plain form
12735 -135594 96533 224436 342283 348259 91858 211797 -17996 -334852 132512 -33832 70381
12723 75398 21029 124200 -54086 -190526 50297 24532 282550 33552 58016 58193 -59005
12711 225029 -105686 182228 375719 251446 -163128 46603 72678 54347 125658 -124595
12700 49243 -71063 -337066 -31767 14304 -252871 38474 121527 213627 -273239 128844 80725
12689 80725 174901 -269802 -302323 166828 -79483 -255208 277707 233015 391759 78537 54226
12678 54226 114748 4144 227144 117255 109706 -232039 113184 346353 -8256 58855 93694
12667 93694 -159740 143586 -81103 -6793 -147531 -288998 181205 28869 -90761 68780 240188
12656 240188 89834 181212 59615 274368 347123 272249 67314 36342 547143 156447 70837
$$ packed form
12735a35594I6533J27903J17847N976I1858J19939a7996l16856A32512c3832G0381
12723G5398B1029J03171e4086j36440E0297B4532K58018C3552K4464J77e9005
12711B25029a05686A82228J93491j24273a63128D6603K6075j8331P1311a24595
12700D9243g1063k66003c1767A4304b52871C8474Q3053R2100b73239A28844m8119
12689H0725R4176b69802l2521A66828g9483j75725B77707m4692J58744G8537k4311
12678E4226O0522D144K23000j09889p549b32039A13184K33169h256E8855L4839
12667I3694a59740A43586h1103f793j40738j41467A81205B8869i0761F8780J71408
12656B40188H9834R1378E9615K14753P2755p4874F7314l0972N10801A56447G0837
$$ plain form
12644 -175999 134853 12631 -320801 207606 -114973 179184 -149141 27613 276313 295114
12634 295114 9808 -258532 288991 213169 -238865 80813 78307 312628 -217750 175185 -355805
12622 294951 123187 302231 389884 -107062 36130 254885 -176350 -146700 -84356 -39172
12611 114062 -339312 -149426 77346 -8423 223027 77399 2736 70014 81916 3532 180068
12600 180068 321937 257887 125834 116517 103522 -24417 -79017 -114977 -176494 160680 135963
12589 135963 223145 -120939 38277 13864 -246870 176716 -116489 -123307 -34790 -83949 106514
12577 84673 -37704 96197 -50515 -98168 342129 -49605 59578 -302014 -443460 -10682 85093
12565 -117996 -113110 11323 -204477 183250 20031 -93257 7777 37817 8125 78802 136463 -89221
$$ packed form
12644a75999A34853A2631c20801B07606a14973A79184a49141B7613K48700J8801
12634B95114I808b58532B88991p5822b38865H0813k506K34321b17750A75185c55805
12622B94951A23187J79044Q7653a07062C6130K18755a76350K9650O2344c9172
12611A14062c39312a49426G7346h423B23027G7399B736O7278J1902C532J76536
12600A80068J41869o4050A25834r317j2995b4417n4600l5960o1517A60680k4717
12589A35963Q7182a20939C8277A3864b46870A76716a16489o818c4790m9159A06514
12577H4673c7704I6197e0515m7653C42129d9605E9578c02014j41446a0682H5093
12565a17996M886A1323b04477A83250B0031i3257G777L0040H125P0677N7661h9221
$$ plain form
12552 253937 154786 178503 121787 101523 -255920 37546 -139420 -37571 -29347 117785 -6199
12540 -84977 227174 -36220 -22732 222167 -166069 -93507 121853 122681 -90827 226065 -186994
12528 -123272 70141 278585 -79714 222620 -267922 12423 -9672 398232 -141532 -141126 22468
12516 -210189 239220 64518 -293215 164678 -38921 157688 -17973 -208254 359269 8344
12505 -191190 206563 -174991 103968 41166 -29530 -186580 165198 101796 -348062 -97213
12494 -2912 34683 99395 226958 -103568 -21314 28128 79449 331917 -164198 178001 4938
12482 83696 13039 45768 125019 47783 -1252 -9257 -54080 387565 -37262 -213873 68642 138290
12470 138290 -1477 91793 -114262 -71993 -103683 -97231 194868 -175426 -116221 -78679 -132998
$$ packed form
12552B53937r9151K3717n6716k0264b55920C7546a39420c7571Q224A17785f199
12540h4977B27174c6220J3488B22167a66069P2562A21853Q28i0827B26065a86994
12528a23272G0141K08444g9714B22620b67922A2423i672C98232a41532M06B2468
12516b10189B39220F4518b93215A64678c8921A57688a7973j90281C59269H344
12505a91190B06563a74991A03968D1166b9530j57050A65198o3402c48062i7213
12494b912C4683O4712J27563a03568b1314B8128N1321K52468a64198A78001D938
12482H3696A3039L2729P9251D7783a252q005m4823C87565c7262j76611F8642O9648
12470A38290a477I1793a14262M2269l1690O452A94868a75426N9205L7542n4319
$$ plain form
12459 -132998 -95380 -23888 218707 -291646 -181880 381538 258506 276174 -34812 -248025
12449 -248025 -14023 -99687 -73014 1045 -81376 -43997 -4034 115303 -234255 -34706 262198
12437 21363 11854 42439 12700 -48589 92721 -282096 29166 29043 -44100 324489 64375 -135677
12424 54632 -107537 -253179 4373 108720 -266984 -126372 140358 42831 241272 -34979
12413 133705 182957 217527 46584 -218574 -115768 131296 92175 205946 -144843 -252251
12403 -252251 -15933 -163728 105244 17954 -47826 260379 -191418 29748 -168925 120244
12392 -144385 -137891 153253 -6904 146180 69165 120709 251812 457 321330 149745 -70190
12380 -323578 -113881 3489 55927 -87321 89798 181279 162276 -6389 -45293 287384 135258
$$ packed form
12459a32998L7618b3888B18707b91646J09766C81538j23032J7668c4812k13213
12449b48025a4023q5664K6673A045h1376L7379d034A15303b34255c4706B62198
12437B1363r509L0585A2700d8589I2721b82096B9166j23d4100C24489F4375a35677
12424E4632a07537j45642D373J04347b66984a26372A40358D2831J98441c4979
12413A33705M9252L4570D6584b18574J02806A31296l9121J13771a44843j07408
12403b52251a5933j47795A05244A7954d7826B60379a91418B9748a68925A20244
12392a44385O494A53253f904A46180F9165N1544J31103D57L20873A49745g0190
12380c23578a13881C489N2438h7321H9798R1481j9003f389l8904B87384A35258
$$ plain form
12368 41947 77525 21081 132528 192047 -108622 -57344 6043 -100882 -320644 100506 -152304
12356 -150687 363239 25368 143330 248445 115528 38454 139853 -179046 172887 109475
12346 109475 -232604 75392 -280444 -136309 -240082 -66410 165431 -553044 -141019 -198030
12336 -198030 -264063 -201560 -103441 174765 -79230 -68231 234785 212343 169635 32812 415205
12325 415205 285891 269638 285886 -146666 62501 208996 217720 56245 -104553 72626 145450
12314 145450 240644 81988 -83077 -77724 15903 107651 -38372 76253 68627 -125651 107028
12302 -16415 -145811 -9239 64569 172055 89105 339311 295991 28380 -254263 -19059 302309
12290 165414 -63586 -75366 39570 1013 120193 -204766 138891 479137 177335 -153396
$$ packed form
12368D1947L5578B1081J11447N9519a08622N1278F043a00882k19762A00506a52304
12356a50687C63239B5368J17962J05115A15528C8454J01399a79046A72887o3412
12346A09475b32604G5392b80444a36309j03773f6410A65431e53044a41019n7011
12336a98030o6033O2503R8119A74765g9230J0999B34785k2442m2708C2812L82393
12325D15205j29314j6253J6248a46666F2501J46495Q724E6245a04553G2626P2824
12314A45450R5194H1988h3077N353A5903R1748c8372G6253p626a25651A07028
12302a6415j29396i239F4569J07486q2950K50206m3320B8380b54263a9059C02309
12290A65414f3586j1780C9570A013J19180b04766A38891L40246A77335a53396
$$ plain form
12279 22304 645127 294386 254285 3088 157339 486056 -128711 415683 674805 407000
12269 407000 153453 -137978 -153976 -6749 -88920 300529 -56517 312595 228308 33381 232775
12258 232775 90874 68991 14138 62858 -175653 494136 -46315 -174396 164961 -151223
12247 301504 218858 265218 159645 278835 418109 -90705 93195 78168 66342 -93028 203662
12235 -158827 264563 228932 -112011 6897 130388 192400 242379 159426 -24841 338553 281091
12224 281091 263681 357667 8338 241655 296565 219602 392331 83511 396726 -23244 108798
12212 68990 429090 139982 50190 -224426 -187488 -287638 362847 36243 138426 101108
12202 101108 152991 38982 200829 258605 410221 -96460 -21465 -79551 285187 225844 -110433
$$ packed form
12279B2304O22823B94386m0101C088J54251L28717a28711D15683K59122k67805
12269D07000A53453a37978j5998f749q2171C00529e6517C12595q4287C3381J99394
12258B32775I0874k1883A4138M8720a75653D94136d6315j28081A64961a51223
12247C01504q2646M6360j05573J19190J39274i0705I3195j5027j1826i3028B03662
12235a58827B64563l5631a12011F897J23491O2012M9979q2953b4841C38553n7462
12224B81091j7410R3986H338K33317N4910p6963J72729H3511L13215b3244A08798
12212F8990L60100A39982E0190b24426L6938j00150C62847C6243J02183l7318
12202A01108N1883C8982J61847N7776J51616i6460b1465n8086B85187n9343a10433
$$ plain form
12190 -123079 -162584 559780 345578 119535 126760 56603 -150618 -42663 164826 92953 181628
12179 181628 343524 232835 109352 207115 16507 132102 -234207 184730 367418 149967
12168 185280 467011 118668 410137 290427 19661 93451 149498 148022 175119 171811 202351
12157 202351 167344 215523 285372 388269 -71269 222705 389703 161906 -20524 109654
12146 59632 172567 7626 10867 213687 145334 132391 -34697 120481 -189325 190548 233951
12135 233951 108123 29790 -80219 -49578 22091 104228 126010 112312 -69164 -216591 230917
12123 270298 -37661 -89297 96883 -20034 161255 -73581 232704 4841 269523 -78682 -84001
12112 -84001 88132 200002 -231392 53247 165426 192747 94950 -41164 80135 -144605 -134514
$$ packed form
12190a23079l9505E59780k14202A19535P225E6603a50618d2663A64826p1873Q8675
12179A81628J61896j10689A09352R7763A6507J15595b34207A84730J82688A49967
12168A85280K81731A18668K91469j19710A9661P3790N6047j476K7097l308L0540
12157B02351l5007M8179O9849J02897g1269B22705J66998A61906b0524A09654
12146E9632J12935G626L241K02820o8353j2943c4697A20481a89325A90548M3403
12135B33951A08123B9790h0219L0641B2091Q2137K1782j3698f9164j47427B30917
12123B70298c7661n1636I6883b0034A61255g3581B32704D841K64682g8682n319
12112h4001H8132J11870b31392E3247J12179K7321I4950d1164H0135a44605J0091
$$ plain form
12101 -134514 174966 275100 -110286 94757 24437 -34551 -153665 235399 128925 -247449
12090 -43319 348783 6739 132417 18853 -94420 157048 136621 52202 182647 493266 -53947
12078 -4508 51210 317703 -199893 -141421 -15696 -108092 271312 78726 23462 -18456 -112970
12067 -112970 -11996 253943 -99848 244024 -23582 377331 163691 181836 -155511 15332
12056 -145586 -33021 -10970 -15251 137724 -52346 -69782 36582 -133841 -21792 -395282 -163094
12044 134235 88658 154683 163264 199918 52169 102303 155082 297502 185969 -38814 -33791
12033 -33791 327337 226963 335749 -42034 150014 -320793 240653 -45257 -61108 -55909 151864
12021 -25594 -363087 20295 147610 109610 176041 19277 191636 -239973 246452 6838 -85406
$$ packed form
12101a34514A74966J00134a10286I4757B4437c4551j19114B35399j06474b47449
12090d3319C48783F739J25678A8853i4420A57048k0427E2202J30445L10619e3947
12078d508E1210K66493a99893N8472a5696r2396B71312G8726B3462a8456r4514
12067a12970a1996B53943i9848B44024b3582C77331A63691J8145a55511A5332
12056a45586c3021a0970m281A37724e2346j7436C6582a33841b1792l73490a63094
12044A34235m5577O6025Q581L6654E2169N0134N2779J42420j11533c8814N023
12033c3791C27337j00374J08786d2034A50014c20793B40653d5257j5851N199A51864
12021b5594l37493B0295J27315l8000O6431A9277J72359b39973B46452F838h5406
$$ plain form
12009 -79018 109673 -106563 1653 -249738 453032 -252660 395904 -58896 64566 -108686
11998 561009 174490 -97030 -15302 71523 -144252 -140518 -7253 31927 121812 -239554 41850
11986 124007 51909 -102183 21745 -170311 -93460 16455 135288 -25069 45254 -326495 -231259
11975 -231259 -234310 -3463 89723 111985 -75114 175164 -94676 258666 398939 22753 -278823
11963 21729 283393 -498662 -141805 118687 -24172 21896 50479 -193558 -166514 -192111 -101713
11952 -101713 366295 -274793 -99862 306956 28324 -8812 171771 40448 9794 -12726 -192666
11941 -192666 27858 -7639 -274601 -150042 -102647 85888 289147 95236 -85478 -353056 7727
11929 -231545 12991 148659 59709 -230114 152695 168359 78271 24991 -129799 -50913 -95556
$$ packed form
12009g9018A09673a06563A653b49738D53032b52660C95904e8896F4566a08686
11998E61009A74490i7030a5302G1523a44252L734g253C1927Q9885b39554D1850
11986A24007E1909a02183B1745a70311P6851A6455J18833b5069D5254c26495R5236
11975b31259l051c463H9723K2262g5114A75164i4676B58666J40273B2753b78823
11963B1729K61664d98662a41805A18687b4172B1896K8583a93558K7044k5597R0398
11952a01713C66295b74793i9862C06956B8324h812A71771D0448I794a2726j79940
11941a92666B7858g639k66962J24559M7395H5888K03259I5236h5478k67578G727
11929b31545A2991J35668E9709b30114A52695J5664G8271B4991a29799e0913m4643
$$ plain form
11918 -95556 -210665 249819 104018 22567 -362051 -198740 -128709 -110860 -318541 78441
11907 -120363 104328 -369002 -299332 55587 -36094 -258054 -96040 137103 14948 60114 -39800
11895 -207215 -36741 -117898 -74182 62167 132264 -47298 161128 -304024 -217209 -40048 204063
11883 69430 129299 116976 199193 -3975 -334389 -258248 -17156 161235 112820 -218979 24539
11871 193594 -56733 -99314 -308896 -142050 67600 -62921 -83892 -216970 -191010 150887 166856
11860 166856 -292247 125303 137090 -41387 21852 -264045 98869 -55048 51699 28579 -290806
11848 153883 35408 43333 132255 -15683 249204 -90009 -352719 -178008 279367 -148032 -133871
11837 -133871 -29697 -167150 44814 246181 -223273 206704 -369345 -251122 -30094 -35946
$$ packed form
11918i5556j15109B49819A04018B2567c62051J63311P0031J7849k07681G8441
11907a20363A04328c69002O9670E5587c6094k21960i6040A37103A4948M5166c9800
11895b07215c6741q1157M3716F2167P0097d7298A61128c04024Q6815d0048B04063
11883F9430N9869j2323Q2217c975l30414P6141a7156A61235m8415b18979B4539
11871A93594e6733m2581k09582a42050F7600f2921k0971j33078K5960A50887J5969
11860A66856b92247A25303J1787d1387B1852b64045I8869e5048E1699k3120b90806
11848A53883C5408P925Q8922a5683B49204i0009k62710J74711B79367a48032J4161
11837a33871b9697j37453D4814K01367b23273B06704c69345J18223c0094n852
$$ plain form
11827 -35946 198653 -195258 238497 -194919 878 -47157 -197799 25270 -314159 -127914 -82075
11816 -82075 -116839 -32517 196347 78774 -79450 -285988 33302 -12368 -106522 108060 223556
11805 223556 -386168 236945 -198932 111134 -271438 -45056 -13795 -294069 -142274 -40844
11794 83617 154526 -180844 -186918 42037 170193 37522 -89476 -99414 58793 227617 -291749
11782 -233471 61032 47447 29307 115042 -150640 -112691 51382 -6727 255758 122382 127
11770 78303 -15855 -306438 -264487 -254344 7065 -162249 -76972 -102444 -57239 -3629 -119596
11759 -119596 -69597 26575 -67582 -266816 58207 24362 -181001 59510 79903 255160 99176
11747 -182935 -331255 -19016 171668 115413 102959 318207 19418 -26486 -26164 -148853 24876
$$ packed form
11827c5946A98653a95258B38497a94919H78d7157j50642B5270c14159a27914M5839
11816h2075l4764c2517A96347G8774g9450k06538C3302a2368r4154A08060J15496
11805B23556c86168B36945a98932A11134b71438d5056a3795k80274a42274d0844
11794H3617P0909a80844o074D2037J28156C7522h9476r938E8793J68824b91749
11782b33471F1032j3585j8140Q5735a50640L7949E1382f727B55758A22382A27
11770G8303a5855k90583M1951J0143G065a62249g6972k5472M5205c629j15967
11759a19596M9999B6575f7582j99234E8207B4362a81001E9510K0393J75257I9176
11747a82935j48320a9016A71668n6255j2454K15248A9418b6486L22j22689B4876
$$ plain form
11735 46776 154159 -1433 -276926 -255557 341206 -34433 34984 -10347 -83528 34313 126780
11724 126780 240766 -92868 -244339 -64079 -27530 217141 325520 -35616 -87223 82917 -47059
11712 64295 -23158 -135313 25277 -106410 -42311 191132 -291254 229085 -334327 -30839
11701 145109 -196046 -119478 -90174 70340 308454 172985 -32416 140864 -43208 355511
11690 -88091 -66088 13934 -235384 -8271 329933 -339086 94836 238827 -12487 158851 -193388
11678 -68051 -70821 -65150 -94931 176369 -14902 -88873 -7198 -155223 62277 -82794 -786 110416
11665 -177860 -226662 -100474 162402 67693 87185 -54411 -302906 -12297 -367051 -138254
11654 156550 -79902 130458 -169417 -364869 -80087 236708 40143 -212419 -85422 228773
$$ packed form
11735D6776J07383a433k75493K1369C41206c4433C4984a0347p3181C4313R2467
11724A26780J13986i2868j51471f4079b7530B17141J08379c5616n1607H2917d7059
11712F4295b3158j12155B5277a06410d2311A91132b91254B29085c34327c0839
11701A45109a96046P6568K9304G0340K38114j35469c2416A40864d3208C55511
11690h8091K2003A3934b35384h271C29933c39086I4836J43991a2487A58851a93388
11678f8051k770N671k9781A76369a4902p3971g198j48025F2277h2794g86A10416
11665a77860m8802a00474A62402F7693J9492e4411k48495a2297l54754a38254
11654A56550g9902A30458a69417j95452h0087B36708D0143b12419h5422B28773
$$ plain form
11643 303103 104373 9969 184425 16919 -119995 100908 232914 -145109 122723 -76 402051
11631 -306440 -54642 26980 70904 36024 183516 27287 -110055 126602 151380 -391413 216345
11619 -53736 -3347 25221 348827 77641 370927 -158434 106880 -57700 488774 -81695 -335347
11608 -335347 25491 -7700 -290250 -224612 -231446 -50829 -160773 97404 223321 86931 65339
11597 65339 32125 217624 91485 350688 99683 86780 77447 111802 3595 -60572 153451
11585 260724 39425 68207 -69037 64347 -53357 45510 -16591 193209 150462 -430207 99902
11573 141238 60902 46847 54070 68798 -38113 -256954 163022 56591 139705 224924 18377
11561 -71591 69217 -226554 267432 208560 -45337 46184 99126 111178 134461 152994 -97594
$$ packed form
11643C03103A04373I969J74456A6919a19995A00908J32006a45109A22723g6D02051
11631c06440e4642B6980M3924l4880J47492B7287a10055A26602K4778c91413B16345
11619e3736c347B5221L23606G7641K93286a58434A06880e7700D88774h1695k53652
11608c35347B5491g700k82550O5638o834e0829j09944I7404J25917H6931k1592
11597F5339C2125J85499I1485K59203I9683j2903r333L4355C595f0572A53451
11585B60724C9425K8782f9037F4347e3357D5510a6591A93209m2747d30207I9902
11573A41238F0902j4055P223J4728c8113k18841A63022E6591Q3114Q5219A8377
11561g1591F9217b26554B67432n8872d5337D6184N2942J2052K3283J8533i7594
$$ plain form
11549 164528 -264103 -228792 238000 139324 224312 10421 27673 -136182 253769 -231110
11538 80101 88733 -58126 189362 117110 -191537 90010 49752 172065 253948 -117315 -200273
11527 -200273 429332 202315 147331 135780 232017 -190824 238697 148526 84058 28443 327726
11516 327726 54140 -218126 242277 187943 -138517 130719 39215 -80687 -52465 -242119
11506 -242119 393119 159957 -70484 -9516 17932 98025 132049 484622 -10795 -251639 -74725
11494 145283 86364 -282662 -156457 -6394 -101312 286128 34019 -56021 243662 39409 38906
11483 38906 71817 157626 447386 212197 215120 75027 17135 -78345 19496 355281 -34335
11471 123783 154461 185217 429770 161837 -85999 35715 168881 186700 50957 -141050 -73562
$$ packed form
11549A64528b64103L5311B38000r8676Q4988A0421J7252a36182B53769b31110
11538H0101Q632e8126A89362p2252a91537I0010m0258J22313Q1883a17315q2958
11527b00273D29332B02315n4984j1551R6237a90824B38697r0171o4468B8443K99283
11516C27726E4140b18126B42277n4334a38517A30719C9215h0687K8222j89654
11506b42119C93119A59957g0484i516A7932Q0093L4024L52573a0795k40844g4725
11494A45283n8919b82662J26205f394r4918B86128C4019e6021B43662C9409n03
11483C8906L2911Q5809K89760B12197K923G5027A7135g8345A9496L35785c4335
11471A23783L0678L0756K44553A61837h5999C5715J33166J7819E0957a41050O7488
$$ plain form
11460 -73562 111989 -30373 -73215 21231 -182161 378365 -40849 3154 203228 167800 -14541
11448 43503 -41281 -149640 107335 -64963 136696 -706 53546 -32992 354180 187879 32662
11436 9082 277131 -386035 99155 -198835 -138245 190353 324631 28748 14478 238222 17142
11424 34289 -11157 -144410 159219 -106021 -64197 24822 -49045 177086 75996 -131158 -64782
11412 -7244 268766 124281 343911 -331382 -392127 248242 -184704 -113818 -172449 -50597 121574
11400 -3793 227524 -98295 -192752 -157132 153296 -199003 -92044 -53668 192869 -9915 -8273
11389 -8273 -44121 -38149 35422 -328106 -399637 -106734 -97726 67317 37773 -132694 311450
11377 -196822 32078 325087 -230737 46383 -270158 -67898 -296823 30021 238607 -223024
$$ packed form
11460g3562A11989c0373m2842B1231a82161C78365d0849C154K00074l5428a4541
11448D3503d1281j08359A07335f4963A36696g06E3546c2992C54180j66301C2662
11436I082K68049c86035I9155a98835O0590A90353J34278B8748j4270K23744A7142
11424C4289a1157j33253A59219a06021M1824B4822d9045A77086G5996a31158f4782
11412g244B68766A24281K19630c31382o0745B48242a84704P0886n8631e0597A21574
11400c793B27524i8295r4457L5620A53296a99003i2044L8376A92869i915J642
11389h273l5848N972C5422c28106p1531a06734R008F7317k9544a32694C11450
11377a96822C2078K93009b30737D6383b70158f7898k28925C0021K08586b23024
$$ plain form
11366 139491 168316 -33466 -141630 -86274 212934 26454 -45997 242918 25555 81008 189814
11355 189814 -86697 -34459 95033 -388223 -157631 -46145 -68732 43994 -53939 -6964 -270904
11344 -270904 -86204 -240921 26773 -75466 103671 391167 39274 -153076 -120574 136907
11333 -135227 -110713 372370 -96112 -289912 133242 -249563 -219592 435447 59166 -147992
11322 -338532 -73669 -85799 189882 179624 22925 -36947 22616 -566554 180679 169924 -189238
11310 -277862 84189 -18332 75256 78148 -3078 -126033 -118685 -140161 168046 10948 -180750
11298 189629 -198177 -210158 63553 -428588 -120360 200842 -34618 -157150 28128 -285473
11287 -106470 -121943 -143091 -168224 -168792 1421 -239738 -357696 -122590 294618 -307431 -269953
$$ packed form
11366A39491K8825c3466j08164N5356B12934B6454d5997B42918B5555N5453J08806
11355A89814h6697c4459I5033c88223a57631d6145k2587D3994e3939f964k63940
11344b70904h6204j54717B6773g5466A03671K87496C9274a53076L2502A36907
11333a35227K4514C72370i6112j93800A33242b49563K9971D35447E9166a47992
11322c38532g3669j2130A89882j0258B2925c6947B2616e66554A80679j0755a89238
11310b77862H4189a8332G5256K892c078j22955P348k1476A68046A0948a80750
11298A89629a98177j1981F3553d28588a20360B00842c4618j22532B8128b85473
11287a06470j5473k1148k5133n68A421b39738j17958a22590B94618c07431L7478
$$ plain form
11276 -269953 -65351 145706 246176 50112 -113111 -99584 -356238 -187867 -1873 -246586
11266 -246586 43452 -222836 -219447 151272 -10269 -108861 15802 -180690 37784 -407942 -23129
11254 -161407 -67793 72194 52043 183100 -18194 -20433 -150308 102397 229907 -278007 -135447
11242 144057 -136563 -210648 20620 -280482 63980 6918 -218365 241826 166622 -58668 -84936
11231 -84936 90247 -64810 33192 -133594 -86427 -83186 42711 -328345 -163495 105391 26148
11219 130324 78593 107997 -176377 269654 101649 30995 -184026 179336 64492 -18382
11208 -14856 39963 -140888 -206552 52472 -177244 -117128 -38054 13230 -91699 53261 -243988
11196 -25611 -159028 -127487 -60395 -84895 -86358 -106921 -200222 25818 -59883 -42555 124422
$$ packed form
11276b69953f5351A45706J00470E0112a13111J3527k56654J68371a873k44713
11266b46586D3452b22836L389A51272a0269r8592A5802a80690C7784d07942b3129
11254a61407f7793G2194k0151J31057a8194k239j29875A02397J27510b78007a35447
11242A44057a36563p4085B0620b80482F3980F918b18365B41826p5204e8668k6268
11231h4936I0247f4810C3192a33594M7167L241D2711c28345a63495A05391B6148
11219A30324n1731K9404a76377B69654A01649C0995a84026A79336F4492a8382
11208a4856C9963a40888o5664E2472a77244O0116c8054A3230i1699E3261b43988
11196b5611j33417L1541f0395k4500j463k0563r3301B5818e9883J7328A24422
$$ plain form
11184 44546 -179472 194539 -103500 -91157 -106420 -54709 47897 -211795 53708 -27921 102468
11172 45602 -157255 -222420 75493 -198744 -183966 -35255 86950 -210680 -192110 16040 -30413
11160 11311 325256 -158749 254774 142334 112361 -273841 -159290 -155036 -70836 -10323 -2802
11148 142188 -271522 -250126 33909 -189775 4947 240290 -178010 -68637 139096 50486 -103303
11136 -96031 83555 -42814 51167 203835 189287 -86642 -63847 78695 -29143 -23805 200566
11124 61307 309085 -142514 65352 -165788 146263 2575 -25504 292338 -46832 95525 322925
11113 322925 -64104 172952 150354 92974 87728 87392 279641 48308 -8226 97061 14328 136061
11101 136061 130573 -103963 427512 144625 458431 41216 -86266 240088 191255 357928
$$ packed form
11184D4546a79472A94539a03500J2343j5263N1711D7897b11795E3708b7921A02468
11172D5602a57255o5165G5493a98744J4778c5255H6950b10680J8570A6040c0413
11160A1311L13945a58749B54774j12440k9973b73841J14551M254g0836a0323b802
11148A42188b71522K1396C3909a89775D947K35343a78010f8637A39096E0486a03303
11136i6031H3555d2814E1167J52668j4548h6642K2795G8695b9143N338B00566
11124F1307K47778a42514F5352a65788A46263B575b5504B92338d6832I5525K27400
11113C22925f4104A72952k2598n7380n246l36J92249D8308h226I7061A4328J21733
11101A36061n488a03963D27512A44625L13806D1216h6266B40088m8833J66673
$$ plain form
11091 357928 421227 160009 123621 163786 362760 68253 387648 298236 -1169 100717 185747
11080 185747 -62172 92623 330540 79439 162985 196086 215119 509151 145959 272978 182014
11069 182014 159897 179673 320916 69497 222150 254557 63201 525825 77221 561283 508235
11058 508235 597810 170671 524108 552169 432178 518035 460807 365608 352107 726386 775161
11047 775161 481803 822702 1026027 404596 623174 445661 353236 536043 816793 811976
11037 811976 926729 583643 134661 638549 550313 795098 685507 634101 477261 510334
11027 510334 753362 467058 718837 460418 608863 269547 939037 359097 698390 555536
11017 555536 865783 518247 682221 372024 662940 130942 432054 317027 450317 635877
$$ packed form
11091C57928O3299A60009l6388M0165J98974F8253L19395q9412a169A00717Q5030
11080A85747f2172I2623K37917G9439Q3546L3101J9033K94032A45959J27019r0964
11069A82014k2117J9776J41243F9497J52653L2407F3201M62624G7221M84062n3048
11058E08235Q9575A70671L53437K8061j19991Q5857n7228r5199j3501L74279M8775
11047G75161k93358L40899K03325D04596K18578j77513r2425J82807K80750m817
11037H11976J14753l43086A34661N03888q8236K44785j09591n1406j56840L3073
11027E10334K43028k86304K51779k58419J48445B69547O69490C59097L39293j42854
11017E55536L10247l47536J63974l10197K90916A30942L01112j15027J33290J85560
$$ plain form
11007 635877 421477 508797 308266 663258 824908 478325 639206 632778 657464 547619
10997 547619 721818 654353 683618 642853 880962 646337 856407 995779 691055 589691
10987 589691 692985 892964 516754 851113 784176 567602 772715 715783 897362 1169116
10977 1169116 1022292 1044086 1230912 1414629 1445526 1750270 1790737 2226367 2622495 1964201
10967 1964201 2675079 2375938 2284815 2164075 2180969 1784973 1935200 1629021 1842965 1509791
10957 1509791 1697104 1640347 1734962 1300200 1705349 1386372 1832864 1334644 959542 964094
10947 964094 738480 822560 401184 599637 505901 672930 187910 314863 16966 160485
10937 160485 332613 296504 -102335 -64031 -70001 -56493 78627 255673 300979 68575 -169019
$$ packed form
11007F35877k14400Q7320k00531L54992J61650l46583J60881o428K4686j09845
10997E47619J74199o7465K9265m0765K38109k34625K10070J39372l04724j01364
10987E89691J03294J99979l76210L34359o6937k16574K05113n6932J81579K71754
10977A169116j46824K1794J86826J83717L0897L04744M0467M35630L96128o58294
10967A964201P10878k99141r1123j20740J6894l95996J50227l06179K13944l33174
10957A509791J87313n6757R4615m34762M05149l18977M46492m98220l75102M552
10947I64094k25614Q4080D01184J98453r3736J67029A87910J26953A6966J43519
10937A60485J72128l6109a02335L8304n970J3508G8627J77046M5306F8575a69019
$$ plain form
10925 -407197 28333 -82969 -100719 -94228 -57853 -122387 -17518 76213 167476 116831 -183225
10913 -145240 7743 -80519 48936 -89273 49086 -68248 43138 72318 30468 181936 97128
10902 97128 -121321 -216933 227537 -313758 -73986 -159910 -156143 56622 65572 5743 30031 -275940
10889 -228824 -75444 21633 282199 228764 -172864 -15275 53780 112466 -94430 150325 801
10877 270897 -26682 -77835 -55550 -269878 -141916 -166113 -154209 -140877 -131687 -20338 43450
10865 -117772 324489 595 -57388 -146492 -46109 -138656 -300761 96995 66728 -81423 -142961
10854 -142961 256578 -244766 -394465 126795 103359 62817 -171420 290928 -16984 -235940
10844 -235940 -247686 -163321 -135019 -178590 -224119 2197 9848 -273600 -195109 -245739 95809 -62592
$$ packed form
10925d07197B8333h2969j7750O491L6375o4534a7518G6213R1263n0645a83225
10913a45240G743h0519D8936h9273D9086f8248D3138K9180C0468J51468q4808
10902I7128a21321r5612B27537c13758g3986q5924L767E6622Q950E743K4288b75940
10889b28824g5444B1633K60566n3435a72864a5275E3780N8686i4430A50325H01
10877B70897b6682n1153K2285k14328J27962k4197J1904J3332R190b0338D3450
10865a17772C24489E95e7388q9104d6109r2547j62105I6995l0267h1423o1538
10854a42961B56578b44766j49699A26795k3436m0542a71420B90928a6984k18956
10844b35940j1746Q4365K8302m3571m5529B197P651b73600P8491n0630I5809f2592
$$ plain form
10831 78129 220235 -193260 -109020 -242168 -144607 15811 -157166 -8746 -113606 -106815 -208132
10820 -208132 -55303 -123334 81260 -202150 265067 -29803 187994 252621 -64946 -7385 -136065
10809 -136065 -25412 -410686 143319 -190921 125053 -130615 -129706 -376899 -186509 -28382
10798 -24326 -24028 -110729 -69213 74542 -196530 -271955 -342628 -277985 -125020 26988 -259489
10786 -23206 -172420 153571 -184108 -201173 18626 -283571 -212323 163809 -94878 46531 6686
10774 134205 -38390 -273890 228212 -278370 -89066 177166 -107354 169722 -413933 197381
10763 -70039 132943 -310278 -169703 92551 135697 23218 -107692 -29419 -96007 168148 -7082
10751 6112 109683 -293293 36523 -84512 -292367 -79475 52373 -76247 -27655 -148738 -366336
$$ packed form
10831G8129J42106a93260Q4240j33148R7561A5811a57166h746j04860O791j01317
10820b08132e5303o8031H1260b02150B65067b9803A87994O4627f4946g385j28680
10809a36065b5412l85274A43319a90921A25053a30615R09k47193a86509b8382
10798b4326K98q6701M1516G4542a96530p5425p0673O4643a25020B6988b59489
10786b3206j49214A53571a84108j7065A8626b83571P1248A63809i4878D6531F686
10774A34205c8390k35500B28212b78370h9066A77166a07354A69722d13933A97381
10763g0039A32943c10278J40575I2551M3146B3218a07692b9419o6588A68148g082
10751F112J03571b93293C6523h4512k07855g9475E2373g6247b7655j21083k17598
$$ plain form
10740 -366336 -98546 -294981 -185439 -119749 -25257 13992 -162501 -403805 100839 73613
10730 73613 -265435 -84931 42825 -281222 171559 -127416 -195737 27395 104826 82532 -360345
10718 -180621 28871 197024 -245974 15996 -115393 -382120 -161293 -44299 134931 58367
10707 -191100 121651 -221921 295764 121284 42443 -101268 -344608 -51798 46629 -232993
10696 36251 -61206 -185901 -53977 -63909 424745 -67267 63532 -280293 211762 -191861 -44099
10684 207706 269790 -125598 -41710 -70800 -188223 208590 -11900 356493 317814 -102389
10673 -260291 -384065 -195136 208984 -184150 -51649 -67660 -193909 -167261 57478 -64484
10662 65087 37878 -370125 114618 503386 -34281 -115802 -79965 -193878 32731 -10602 -147001
$$ packed form
10740c66336i8546j96435J09542O5690b5257A3992a62501k41304A00839k7226
10730G3613b65435h4931D2825b81222A71559a27416o8321B7395P7431k2294c60345
10718a80621B8871J68153b45974A5996a15393k66727a61293d4299A34931E8367
10707a91100A21651b21921B95764A21284D2443a01268k43340e1798D6629b32993
10696C6251f1206j24695e3977r932D24745f7267F3532b80293B11762a91861d4099
10684B07706O2084a25598d1710k9090j17423B08590a1900C56493l8679a02389
10673b60291j23774J88929B08984a84150e1649j6011j26249K6648E7478f4484
10662F5087k7209c70125A14618L88768c4281q1521L5837j13913C2731a0602j36399
$$ plain form
10651 -147001 -258985 -244607 -148062 75566 78823 140089 -145682 -19901 104673 -83650 -221261
10640 -221261 35677 -369280 147252 71111 54858 -159716 -246982 28933 149168 -137849
10629 145681 34481 -73186 138897 -252184 93174 -72943 -275747 -267728 -320452 -226970 219305
10617 -115115 -292545 314383 -91657 31161 29400 77111 -141332 -12671 -100863 -220512 24365
10605 -176585 -35404 -111841 -286529 287627 -36381 141321 -199137 332791 -26257 364779
10594 -214086 8685 -142916 -161891 -229942 -212233 116116 149127 -32840 61876 -44295 28525
10582 124740 -255810 -220620 233899 -177573 260324 54265 -14918 -225905 -44947 -417397
10572 -417397 -318656 27359 -177653 -346257 -44374 201549 -138124 -71186 -121268 57069 36071
$$ packed form
10651a47001j11984J4378R6545G5566L257O1266a45682a9901A04673h3650j37611
10640b21261C5677c69280A47252G1111j6253a59716q7266B8933J20235a37849
10629A45681C4481g3186A38897b52184I3174g2943k02804Q019n2724R3482B19305
10617a15115j77430C14383i1657C1161j761M7711a41332a2671q8192j19649B4365
10605a76585c5404p6437j74688B87627c6381A41321a99137C32791b6257C64779
10594b14086H685a42916j8975o8051J7709A16116L3011c2840F1876d4295B8525
10582A24740b55810L5190B33899a77573B60324E4265a4918k10987d4947l72450
10572d17397R8741B7359a77653j68604d4374B01549a38124O6938n0082E7069k0998
$$ plain form
10561 36071 -117075 227038 -58781 39076 256482 389537 -125787 -415540 -236604 -197528
10551 -197528 -18817 -70377 -75738 26086 -15249 69501 213718 -348776 -267583 -6699 18701
10539 131174 -160015 -140421 -4752 -96357 319441 -9436 -213467 160353 -68323 91291 242280
10528 242280 329839 -205533 -211205 -285556 -155255 -191077 -2290 -180111 172845 -91557 -33170
10516 -372828 -68987 343633 172533 -64567 -178283 -249662 337253 -18763 -144054 -77068
10506 -77068 -106494 -201291 -81893 -58923 -223466 97128 148439 -170054 -193465 -6002 -395205
10495 -395205 -238602 69895 -20348 232744 -195010 -357811 -197092 164747 160384 -156323
10484 -142461 -143552 144898 218908 -40064 166170 82095 35858 315834 688728 410868 202574
$$ packed form
10561C6071a17075B27038e8781C9076K17406J33055a25787k89753J78936L9076
10551a97528a8817n1560n361B6086a5249F9501J44217c48776Q1193f699A8701
10539A31174a60015J9594d752r1605C19441i436k04031A60353f8323I1291J50989
10528B42280Q7559b05533n672p4351J30301l5822b290j77821A72845i1557c3170
10516c72828f8987C43633j71100f4567j13716p1379C37253a8763j25291O6986
10506g7068k9426r4797h1893K2970j64543I7128N1311a70054k3411f002l89203
10495c95205J56603F9895b0348B32744a95010j62801J60719A64747m363a56323
10484a42461j091A44898P4010d0064A66170H2095C5858K79976L72894k77860B02574
$$ plain form
10472 432410 -46322 294925 128404 105751 -103445 -113559 -262986 257669 -223692 -245734
10462 -245734 -97119 26546 -90580 -309455 -34435 -149493 252103 188502 -325437 -172127
10452 -172127 99804 241143 -250935 139120 29576 -153182 -293354 135946 32445 -81398
10441 -109849 -206831 222087 -118624 -326800 -313406 392506 -202420 -59245 -105609 135309
10430 122528 -438247 -59104 -37916 4793 -316366 -242357 19284 -118365 28936 -95646 -148567
10419 -148567 -298268 -26711 200914 30237 -222702 440166 87498 -196470 17839 -143628
10408 -163143 142161 -257470 -44962 239554 -131968 -204435 165876 -167205 51774 -131231
10397 -66915 -46603 -172395 -35061 -156130 45134 -71536 434259 -112577 -15189 96113 -227859
$$ packed form
10472D32410d6322B94925A28404k2653a03445j0114j49427B57669b23692k2042
10462b45734i7119B6546i0580k18875c4435j15058B52103o3601c25437J53310
10452a72127I9804J41339b50935A39120B9576a53182j40172A35946C2445h1398
10441a09849r6982B22087a18624k08176J3394C92506b02420e9245m6364A35309
10430A22528d38247e9104K1188D793c16366P4009A9284a18365B8936i5646n2921
10419a48567j49701b6711B00914C0237b22702D40166H7498a96470A7839a43628
10408a63143A42161b57470d4962B39554a31968p2467A65876a67205E1774a31231
10397f6915K0312j25792c5061j21069D5134g1536D34259a12577a5189I6113b27859
$$ plain form
10385 -164882 273348 -201940 -107066 25019 244314 -114656 82824 -33631 107888 -198813
10374 296707 636110 16132 173625 471054 306958 225997 186869 184803 489554 390233 468103
10363 468103 444269 577380 406600 366998 78621 340269 308361 -20589 77814 75429 -27444
10351 375107 177873 -18134 356970 388190 467298 318496 156589 105085 271055 170231
10341 170231 476914 139899 584288 293673 -50318 161608 236495 69016 -182431 496798
10330 53306 238460 -132471 39054 140692 428611 188617 -67506 240933 31270 280011
10320 280011 -19515 216616 252560 194708 66968 -51178 -14243 148509 -57552 -66364 18879
10308 -212554 8747 62348 -266832 -132418 -82789 -1276 31175 -302260 96187 64928 -103203
$$ packed form
10385a64882B73348b01940R4874B5019K19295a14656H2824c3631A07888a98813
10374B96707L39403A6132J57493K97429j64096q0961l9128k066L04751r9321P7870
10363D68103k3834J33111j70780l9602G8621K61648l1908b0589G7814k385b7444
10351C75107A77873a8134C56970L1220P9108j48802A56589n1504J65970j00824
10341A70231L06683A39899M44389k90615e0318A61608P4887F9016a82431D96798
10330E3306J85154a32471C9054J01638K87919A88617f7506B40933C1270K48741
10320B80011a9515B16616L5944n7852F6968e1178a4243A48509e7552q812A8879
10308b12554H747N3601b66832a32418M9629a276C1175c02260I6187l1259a03203
$$ plain form
10296 409031 -91972 -37584 81189 88666 59174 218205 -176456 85706 -87358 36993 -26516
10284 -303655 -234069 -99137 -160951 -323927 -334976 -462136 156087 -59117 -138773 60466 130690
10273 130690 238093 -279636 203119 148439 -85410 -368146 -137535 141389 -54460 183709
10262 204307 9813 -68046 -374446 -35004 -96305 -152130 -1440 -75298 -32357 -36182 296637 11565
10249 -3646 247084 137938 -48790 21753 -223814 -28896 -103740 -51883 -293944 -204659 -80034
10237 -222689 6108 105801 291648 -26512 -202767 2586 -326559 81544 -131851 231437 154180
10226 154180 23823 35786 -61088 141036 -477951 -241873 107663 -32316 -43620 -69919 -51171
10215 -51171 191363 206551 102850 1944 -47552 -182653 50985 -217939 224171 -84071 3678
$$ packed form
10296D09031i1972c7584H1189P477k9492J59031a76456H5706h7358C6993b6516
10284c03655O9586i9137o1814j62976j1049j27160A56087e9117p9656F0466P0224
10273A30690J07403b79636B03119n4680h5410k82736a37535A41389e4460A83709
10262B04307I813f8046l06400c5004o1301n5825a440p3858c2357l825B96637A1565
10249c646B47084j09146d8790B1753b23814b8896p4844N1857k42061Q9285h0034
10237b22689F108R9693J85847b6512j76255B586c26559H1544a31851B31437p7257
10226A54180B3823J1963f1088A41036d77951K36078A07663c2316j1304k6299J8748
10215e1171A91363J5188A02850A944d7552j35101E0985b17939B24171h4071C678
$$ plain form
10203 -36862 -90472 -132378 -18928 27244 -100873 63833 -113216 97558 13898 -205958 -165532
10192 -165532 7728 64723 263889 14174 -418610 -72546 -58504 110508 155499 -136515 -258433
10181 -258433 25380 52114 85828 -210005 -221951 -203714 -62214 -253045 172610 11986 -205341
10169 -39057 -17675 -5948 -288128 788 -186201 -101815 -1893 -175431 -97320 -92975 -88872 -285295
10157 -285295 -260055 -31216 -93264 -443871 -123456 -224875 -216468 137255 -76562 43872 198806
10146 198806 49180 166693 -218853 183209 -132986 -379503 -338138 8083 -74108 209074
10135 137888 -120550 -9398 -33688 381600 -219849 -169823 -39407 53905 97245 -75897 8728
10123 -36839 87802 -136487 3332 33523 96809 182602 -237484 -147356 -26982 -192243 -44055
$$ packed form
10203c6862n3610m1906a8928B7244a00873F3833a13216I7558A3898b05958M0426
10192a65532G728N6995J99166A4174d18610g2546J4042A10508M4991a36515j21918
10181b58433B5380K6734L3714b10005j1946J8237f2214j90831A72610A1986b05341
10169c9057a7675e948k82180G88a86201Q4386a893j73538P8111M345M103j96423
10157b85295K5240c1216o2048l50607a23456j01419Q407A37255g6562D3872J54934
10146A98806D9180J17513b18853A83209a32986k46517M1365H083g4108B09074
10135A37888a20550i398k4290C81600b19849N0026c9407E3905M3340g5897H728
10123c6839H7802a36487C332L0191O3286Q5793b37484R0128b6982j65261d4055
$$ plain form
10111 45485 -95798 -277626 -3251 -423342 131249 -42288 45438 -153421 234957 -136619 -238720
10100 -238720 170421 25127 68468 89093 32092 45593 -251445 -168707 176504 -79008 -318841
10089 -318841 -3363 -22001 269325 -121914 11500 87293 84683 -106828 -174101 -225876 -117389
10078 -117389 12267 -102061 -101249 -38197 -150131 54154 -171428 -252285 -164805 100064 259550
10067 259550 324557 -19188 -171209 -327402 98887 -155536 -311754 45985 295966 79485
10056 37626 -118125 -108831 -38274 52484 -146293 146848 -16385 -93548 6130 -376762 -34033
10044 -54679 -383208 -100315 -147071 -188913 94983 -122103 187618 114652 -131862 -2094 -185366
10033 -185366 25930 117303 -94586 47302 96572 -184884 -122628 -92786 -35754 -107955 -327699
$$ packed form
10111D5485i5798j81828c251m20091A31249d2288D5438a53421B34957a36619j02101
10100b38720A70421B5127M3341K0625C2092J3501b51445Q2738A76504g9008k39833
10089c18841c363j8638B69325a21914A1500P5793k610a06828o7273n1775J08487
10078a17389A2267a02061Q12c8197j11934E4154a71428q0857Q7480A00064J59486
10067B59550O5007a9188j52021j56193I8887a55536j56218D5985K49981G9485
10056C7626a18125R294c8274E2484a46293A46848a6385p7163F130c76762c4033
10044e4679l28529a00315m6756m1842I4983a22103A87618p2966a31862b094j83272
10033a85366B5930R1373i4586D7302M9270a84884O2256K9842c5754p2201k19744
$$ plain form
10022 -327699 149517 -229348 -305031 -189017 75358 91796 338885 -466354 -255184 -51575
10011 -312514 -198413 -107167 154770 94663 -41047 121825 -338953 16752 -102335 -192419
10001 -192419 93912 110283 -12190 34069 -157362 104630 32246 -144975 -134162 -353948 -292874
9990 -292874 -43318 -203239 214528 98964 -178372 125919 209395 -66625 79374 -5452 37740
9978 -67066 -383431 -282976 11089 -276745 -105442 55068 -187233 151985 -11951 -78591 65093
9966 -72907 288826 -186210 297769 -224019 -74797 -287665 -223940 -28551 13923 50344 -65983
9954 -209361 -17318 -212544 -193537 -118688 22943 -194982 -108564 -426030 -254822 -288789 80409
9942 135333 110443 -6152 -365592 -54077 -145513 -175213 -70479 20586 16841 -30470 79046 -112307
$$ packed form
10022c27699A49517b29348p5683J16014G5358J6438K47089d66354K11170e1575
10011c12514J14101R1246A54770o0107d1047A21825c38953A6752a02335r0084
10001a92419I3912J6371a2190C4069a57362A04630C2246a44975J0813k19786O1074
9990b92874d3318j59921B14528I8964a78372A25919Q3476f6625G9374e452C7740
9978f7066l16365J00455A1089b76745a05442E5068a87233A51985a1951o6640F5093
9966g2907B88826a86210B97769b24019g4797k12868O3725b8551A3923L6421f5983
9954b09361a7318j95226J9007P4849B2943a94982Q6418l17466J71208l3967H0409
9942A35333k4890f152l59440e4077r1436k9700g0479B0586l745c0470G9046a12307
$$ plain form
9929 8456 4943 -394721 -176283 315082 -44907 -204747 -106778 522100 -13389 -56666 -105676
9918 -105676 -10266 81183 293875 91215 -35990 -87603 200535 87887 -552733 -154111 6517
9906 26024 50078 -193715 -273034 -48476 -104600 143973 -17461 109596 -103392 -251306 -21514
9894 -411818 -129494 -59263 -101717 -218112 169031 -149143 -191962 -116984 -48930 -64873 69768
9882 -208966 120749 -162707 77168 -203799 -37940 34229 -46140 50604 -208099 -22055 -42140
9871 -42140 -200481 -155002 -72486 -260310 -382124 70884 -86921 239988 -104989 -182819 -400023
9860 -400023 66190 -71308 110831 -36527 13753 -111054 28683 87800 271921 22669 -314258
9848 -240876 -311483 -431998 106187 -200750 -6882 -105275 -182150 106832 -135182 280303 185182
$$ packed form
9929H456l513c94721a76283C15082d4907j59840R7969E22100a3389m3277m9010
9918a05676a0266H1183K12692I1215c5990n1613B00535H7887e52733a54111F517
9906B6024K4054a93715p9319d8476n6124A43973a7461A09596a03392j47914b1514
9894d11818a29494e9263m2454j16395A69031a49143m2819P4978d8930j5943F9768
9882b08966A20749a62707G7168b03799c7940C4229d6140E0604b08099b2055k0085
9871d2140j58341M5479g2486j87824j21814G0884h6921B39988a04989p7830k17204
9860d00023F6190g1308A10831c6527A3753a11054B8683N9117J84121B2669c14258
9848b40876p0607j20515A06187b00750f882r8393p6875A06832a35182B80303r5121
$$ plain form
9837 185182 39129 -279397 365170 -121522 117226 219681 -303498 208455 -198801 -237766
9827 -237766 -164123 57406 109405 182740 265102 -199005 178065 -303930 -97145 -120945 -252706
9816 -252706 -280956 105253 -487617 -328367 -19320 -235202 -211985 87017 92852 -140491 -156532
9805 -156532 -224997 192123 -308772 -20998 -248992 -92876 -123277 -136142 -199696 -176227 -127459
9794 -127459 -233703 -212341 85067 -87887 -147262 -114556 127606 -168956 20416 244860 -16517
9782 -1397 -186527 -243591 74329 26684 179608 -75719 -547574 -76306 95334 -293717 373806
9770 -29854 -139745 -52964 -50616 106527 -15915 -161503 239569 319109 -196886 -119192 -145620
9759 -145620 18595 -249048 101097 91836 -6813 -293192 -288002 296372 73023 91742 92934 34247
$$ packed form
9837A85182C9129b79397C65170a21522A17226J02455c03498B08455a98801l8965
9827b37766P3643E7406N1999P3335Q2362a99005A78065c03930i7145k3800j31761
9816b52706k8250A05253d87617J59250a9320k15882K3217H7017N835a40491j6041
9805a56532o8465A92123c08772b0998k27994i2876l0401j2865o3554K3469M8768
9794a27459j06244K1362H5067h7887n9375L2706A27606a68956B0416K24444a6517
9782a397j85130n7064G4329B6684J52924g5719m71855g6306I5334b93717C73806
9770b9854j09891e2964K348A06527a5915j45588B39569P9540a96886P7694k6428
9759a45620A8595b49048A01097r261f813k86379N190B96372G3023J8719J192C4247
$$ plain form
9746 133763 92564 -79191 275186 -36481 75542 -79069 -47002 -329284 -106500 53609 -308125
9734 -56792 -41241 -85117 -76870 -531273 -257941 -247414 112430 -222157 282824 206492 -88601
9722 -173935 -113324 -76845 215115 -19656 -70805 -332612 -2681 15677 -202215 -12520 -213739
9711 -213739 106109 -113833 127175 -112528 -340399 -105307 302440 206680 -231114 -173888
9701 -173888 -138820 178183 -239355 -37183 -88488 -137358 319429 -181328 -71472 -166069 210542
9689 212280 42146 -300463 -300528 -377061 132652 -195050 -189907 -197092 192553 -101337 -94493 32132
9676 -83486 -95943 -85105 340615 -154254 -6153 -28395 156540 -309837 -182174 83715 -143226
9664 -114438 46758 -118125 -314873 -230576 92991 71542 180783 138697 62536 152526 -227032
$$ packed form
9746A33763m1199g9191B75186c6481G5542g9069L2067k82282a06500E3609c08125
9734e6792J5551m3876Q247m54403b57941J0527A12430b22157B82824p6332h8601
9722a73935O0611L6479B15115a9656n1149k61807b681A5677b02215a2520k01219
9711b13739A06109a13833A27175a12528k27871a05307C02440r5760b31114N7226
9701a73888L5068A78183b39355c7183n1305m8870C19429a81328g1472r4597B10542
9689B12280D2146c00463o5p6533A32652a95050N143p185A92553a01337O844C2132
9676h3486j2457J0838C40615a54254f153k2242A56540c09837J27663H3715a43226
9664a14438D6758a18125j96748Q4297I2991k1449J09241m2086F2536Q9990b27032
$$ plain form
9652 48513 -86318 13859 -138611 160320 -69601 -61144 246686 -160810 -20974 -109916 -251773
9641 -251773 37549 -144332 -21128 33518 -188303 -116715 188676 1335 -114601 -165096 63767
9629 28168 142230 -237115 -230891 182771 99617 143011 32603 -50768 -149835 28539 -59072
9617 219062 220642 9713 -2449 112142 -223673 -82519 -256653 -308564 57398 56469 -280644 221022
9604 -133658 -202527 -121426 -103241 332741 -49027 142677 32011 -31261 -352574 -423008 7517
9592 -201844 -8091 -134399 132831 -208862 -143582 -84111 -197363 -2406 -218897 30494 68652
9581 68652 -46013 135720 -312729 397581 -44854 -162585 135855 -77520 -40016 -57383 -55974
9570 -55974 -366786 -98996 167519 -140886 -91887 -225006 -128758 92941 24075 -333533 -106476
$$ packed form
9652D8513h6318A3859a38611A60320f9601Q457B46686a60810b0974q8942j41857
9641b51773C7549a44332b1128C3518a88303P1588A88676A335a14601n0495F3767
9629B8168J14062b37115O224A82771q3154M3394C2603e0768r9067B8539e9072
9617B19062J580I713b449A12142b23673h2519j74134n1911E7398r29b80644B21022
9604a33658o8869Q1101J8185C32741d9027A42677C2011c1261l21313p0434G517
9592b01844h091j26308A32831b08862O5280N9471j13252b406k16491C0494L8158
9581F8652d6013A35720c12729C97581d4854j17731A35855g7520L7504j7367J409
9570e5974l10812i8996A67519a40886M8999j33119R6248I2941B4075c33533a06476
$$ plain form
9558 180534 -77124 -239169 143893 292980 -27717 -121749 -173733 144325 163616 -56467 1996
9546 129295 -138704 165075 292366 -213087 -359567 22197 -117282 21557 238514 99519
9535 -17757 -56818 257397 -122499 158646 57069 -312249 7641 -30203 -6521 -196603 -244608
9524 -244608 -212297 -173767 -23104 -179095 -88795 4813 -267577 -130441 128153 -402245 -385623
9513 -385623 69850 -211891 -86351 62810 232264 -160111 -54182 -69208 135077 -360033 -59261
9501 -224699 -99190 -120019 -187033 -226495 -367807 -113165 52526 11917 62164 146324 -152020
9489 70085 229113 -256846 100838 85276 65407 -153111 105765 -207258 -341344 -389224
9479 -389224 -166573 65137 41551 175916 180151 229120 -3558 -240272 -235590 -195378 223922
$$ packed form
9558A80534g7124j62045A43893J49087b7717r4032n1984A44325J9291e6467A996
9546A29295a38704A65075J27291b13087j46480B2197a17282B1557K16957I9519
9535a7757l9061B57397a22499A58646E7069c12249G641c0203f521j90082m8005
9524b44608L2311L8530b3104j55991h8795D813b67577a30441A28153d02245J6622
9513c85623F9850b11891h6351F2810J69454a60111e4182j5026A35077c60033e9261
9501b24699i9190k0829o7014l9462j41312a13165E2526A1917N0247Q4160a52020
9489G0085J59028b56846A00838j5562j9869a53111A05765b07258j34086m7880
9479c89224a66573F5137k3586J34365M235M8969c558k36714M682M0212B23922
$$ plain form
9467 -136669 -4187 197819 45502 -83604 -143196 -32990 -419011 -33751 -265857 35240 -353852
9455 160857 -137971 137325 -32950 64832 56394 -88672 117348 -1347 -451081 -340061 -10493
9443 -11045 -79317 -57337 64255 15838 -68312 184397 -318081 221494 346438 93006 32304
9431 266032 -42111 -207967 -190083 88462 90245 52634 70349 -115216 22833 -50866 -166871
9420 -166871 -194838 -159468 -118578 65421 269405 -254071 -129563 -84026 -125124 250087 43047
9408 -525 -99821 117589 -80951 134614 59528 73746 -189311 -210148 128391 -24295 -77412
9397 -77412 75338 100626 -353140 -358328 24972 -54540 -351444 325888 89917 -486 -315851 -117971
9384 -207304 -121320 -67185 124747 7485 97259 307122 97982 -123206 256668 -232858 -289522
$$ packed form
9467a36669d187A97819D5502h3604n9592c2990l86021c3751k32106C5240c53852
9455A60857a37971A37325c2950F4832q438h8672A17348a347m49734J11020a0493
9443a1045o8272K1980F4255A5838f8312A84397c18081B21494J24944I3006C2304
9431B66032d2111j65856J7884H8462J783l7611J7715a15216B2833e0866j16005
9420a66871k7967L5370M0890F5421K03984b54071J24508M5537m1098B50087D3047
9408e25r9296A17589h0951A34614E9528J4218a89311k0837A28391b4295n3117
9397g7412G5338K5288c53140n188B4972e4540k96904C25888H9917d86l15365a17971
9384b07304Q5984N4135A24747G485Q9774K09863I7982a23206B56668b32858n6664
$$ plain form
9373 -289522 -30444 -53435 -54074 20170 -16108 -255882 43485 -145643 -256451 49534 -291752
9361 -44787 250984 263451 -78963 -351606 -226665 -55629 194501 -109808 123474 -177000
9350 -114983 -223253 -51414 -365010 -331308 29152 -222409 -101005 -317649 242653 121080
9339 -75240 -72878 368127 -75683 -150716 43616 -22799 90534 -31969 -119987 229955 -84254 -16517
9326 -50120 -104553 63758 -30111 -179014 32343 95616 13690 -5960 66282 -175058 59453 -74780
9313 -3914 192009 -56610 -60969 264205 -201640 17291 52357 -320402 347748 99801 -130583
9301 11842 279267 98156 -56099 -144227 -84573 -128872 -234223 287074 -146917 410665 106943
9289 -179086 -89004 -165068 122176 238324 -135887 -100279 176250 195407 -63162 -124426 -235871
$$ packed form
9373b89522c0444k2991o39B0170a6108k39774D3485a45643j10808D9534b91752
9361d4787B50984J2467g8963k72643J24941e5629A94501a09808A23474a77000
9350a14983j08270e1414l13596L3702B9152b22409a01005k16644B42653A21080
9339g5240K362C68127g5683p5033D3616b2799I0534c1969q8018B29955h4254a6517
9326e0120n4433F3758c0111j48903C2343O3273A3690e960F6282a75058E9453g4780
9313c914A92009e6610m359B64205b01640A7291L5066c20402C47748I9801a30583
9301A1842K67425I8156e6099q8128N9654m4299j05351B87074a46917D10665A06943
9289a79086h9004p6064A22176J16148a35887L5608A76250J9157f3162o1264j11445
$$ plain form
9278 -235871 -106878 132015 93774 63796 -148461 -15586 50602 77130 -189329 -414882 8034
9266 -113359 -35624 -175615 -39760 -100491 -248256 239310 127832 189571 -51482 -100454 -134931
9255 -134931 279157 20004 46221 -113593 -222679 -130337 72244 -390584 -59736 191222 -1121
9243 160630 -292215 162222 -98396 -387848 84649 191484 109675 -268971 -113771 -198100
9233 -198100 -80034 -70554 221384 -56671 164838 -225330 -299793 -224495 39149 -28262 22797
9221 244955 149478 -568033 -274776 -106396 -80287 35649 -241587 -264261 14987 -35552 -69504
9210 -69504 -9811 -282375 -103049 -171111 -148098 99137 -154060 -87706 -323842 223205 86213
9198 -90163 141650 -270887 -75380 10343 -178942 -339333 118687 77192 -147463 24207 156327
$$ packed form
9278b35871a06878A32015l8241k9978a48461a5586E0602K6528a89329k25553H034
9266a13359c5624j39991c9760o0731j47765B39310j11478O1739e1482m8972l4477
9255a34931B79157B0004K6217a13593j09086R2342G2244c90584e9736A91222a121
9243A60630b92215A62222i8396k89452H4649J06835q1809b68971a13771q4329
9233a98100h0034R480B21384e6671A64838b25330p4463P5298C9149b8262B2797
9221B44955r5477e68033b74776a06396K6109C5649b41587k2674A4987c5552l3952
9210f9504i811k72564a03049o8062K3013I9137a54060O6354k36136B23205H6213
9198i0163A41650b70887g5380A0343a78942j60391A18687m1495a47463B4207J32120
$$ plain form
9187 156327 -55716 155806 36276 -218164 -87180 -33403 -189462 -179369 105456 -205263 -231636
9176 -231636 -65983 -148848 62947 -153805 -256310 146644 -49721 -176120 29332 -295588 -156500
9165 -156500 20107 -67581 -21390 -31715 -33893 -159885 -104848 44541 -3053 -79896 -34680 166138
9152 145387 -78073 -53577 20692 -32519 -291696 54068 -6169 -432848 20430 -189211 -299234
9141 -299234 -43734 -98802 -183416 -138901 108305 -129107 -298266 311949 282543 245754 84270
9129 118756 84097 30596 82783 121668 61736 -54999 -78272 20038 354467 17071 140628
9118 140628 -32064 -153741 -8876 -203551 -35175 45991 96849 -142629 -183910 -411496 -57778
9106 173870 -143006 -104180 243402 269314 -41760 -133385 -187177 -309856 -95269 -193272 -183510
$$ packed form
9187A56327e5716A55806C6276b18164h7180c3403j56059J0093A05456b05263k6373
9176b31636f5983q2865F2947a53805j02505A46644d9721j26399B9332b95588J39088
9165a56500B0107f7581b1390j0325k178j25992N5037D4541c053p6843c4680A66138
9152A45387g8073K4496B0692c2519k59177E4068f169m26679B0430a89211j10023
9141b99234d3734n5068q4614M4515A08305a29107j69159C11949k9406l6789H4270
9129A18756l4659C0596N2187L8885n9932e4999k3273B0038L34429A7071J23557
9118A40628c2064j21677h876j94675c5175D5991N0858a42629m1281k27586e7778
9106A73870a43006L8826B43402K5912d1760r1625n3792j22679i5269r8003R762
$$ plain form
9095 -183510 -20816 -64002 -5763 21981 66740 -57032 -161288 -147009 -2587 -170365 326685
9083 -129587 -57526 -117786 -67842 15855 123327 -98578 -127709 -87529 103369 76684 -414664
9071 159357 -5273 -162792 -97117 117975 -119666 12970 -15799 141787 -308591 -334768 -269517
9060 -269517 -290729 -338337 -58001 180189 -94134 -72336 -155766 876 208714 -66050 -20451 125065
9047 -164300 -2238 -84848 -528392 -144078 109469 86317 -261583 17828 -124296 44294 -29781
9035 -148028 147458 -98691 -316184 1377 -148769 -375337 -21403 -116183 156230 11961 160328
9024 160328 32218 144813 -50793 69313 -49548 197449 -319068 95476 -116237 -119538 -49848
9012 -133142 -207756 -66886 14845 -217977 -158653 65052 -38908 16274 456572 161232 -259989
$$ packed form
9095a83510b0816m3186e763B1981M4759e7032j04256J4279b587j67778C26685
9083a29587e7526o0260M9944A5855J07472i8578k9131M0180A03369k6685d14664
9071A59357e273j57519O5675A17975a19666A2970a5799A41787c08591k6177O5251
9060b69517k1212m7608e8001A80189i4134K1798q3430H76K07838f6050b0451A25065
9047a64300b238q2610m43544a44078A09469k3152b61583A7828a24296D4294b9781
9035a48028A47458i8691k17493A377a48769k26568b1403r4780A56230A1961J48367
9024A60328C2218J12595e0793F9313d9548A97449c19068I5476a16237l301d9848
9012a33142p4614f6886A4845b17977N9324F5052c8908A6274M40298A61232b59989
$$ plain form
9000 101696 -239350 209249 -10776 -11448 -246715 40701 -72294 36621 -4461 98062 4454 -219965
8987 -17831 1786 299808 49055 -33943 8650 -103554 -126340 -159139 127549 -389948 -103892
8975 162206 -20854 -7942 -9554 49597 259345 452991 -158482 -293719 77628 69633 -41093
8963 -80073 47361 -134755 -90604 -119500 -183516 -138905 -184017 -153884 -34868 -374746 1375 -266602
8950 -3575 127550 -214814 -124437 148233 -94156 -33224 -142718 -280543 153579 20162 -101869
8938 200001 -70857 -87417 83934 -322388 -78723 -89300 585266 -128649 2577 -160889 109341
8926 -52462 -86902 -49526 418585 563634 775309 1955488 6462137 15567873 4183145 1231896
8915 707153 749615 341613 87784 382413 314051 193674 144841 18106 416607 420898 241957
$$ packed form
9000A01696b39350B09249a0776o72k35267D0701g2294C6621d461I8062D454b19965
8987a7831A786K98022D9055c3943H650a03554k2786l2799A27549c89948a03892
8975A62206b0854g942j612D9597K09748J93646a58482j35237G7628p995d1093
8963h0073D7361a34755M4151k8896o4016M4611m5112L0133c4868l39878A375b66602
8950c575A27550b14814R0377A48233i4156c3224j09494j37825A53579B0162a01869
8938B00001g0857j6560H3934c22388g8723j0577E85266a28649B577a60889A09341
8926e2462l4440L7376D18585J45049K11675J180179M506649R105736D183145A231896
8915G07153M2462C41613H7784K94629o8362j20377m8833A8106L98501M291j78941
$$ plain form
8904 241957 151731 -44656 -53052 -36862 -108695 61915 -13478 151725 -387382 128620 289264
8893 289264 -21597 -173666 -24925 75137 -210219 -120786 60809 83453 -90213 145055 -154054
8881 -56728 -172445 -119153 8497 -332819 110326 11803 -130153 -546405 -84061 168277 25747
8869 269835 45091 104061 -34979 196912 -145883 -322797 86879 104871 -207924 -249856 37785
8857 10842 -155373 12782 -150892 -177725 -157904 -76453 223021 -32951 -179589 -211131 -167661
$$ packed form
8904B41957r0226d4656q396J6190p1833F1915a3478A51725c87382A28620J60644
8893B89264b1597j52069b4925G5137b10219Q9433F0809K2644i0213A45055a54054
8881e6728j15717N3292H497c32819A10326A1803a30153m16252h4061A68277B5747
8869B69835D5091N8970c4979A96912a45883j76914H6879J7992b07924m1932C7785
8857A0842a55373A2782a50892k6833J9821g6453B23021c2951j46638l1542M3470
$$ [...]
##END NTUPLES=NMR SPECTRUM
##END=
