
##TITLE=AC1248__6672293_lsV1smynyo
##JCAMPDX= 6.0         $$ Bruker NMR JCAMP-DX V2.0
##DATA TYPE= NMR SPECTRUM
##DATA CLASS= NTUPLES
##ORIGIN= BRUKER
##OWNER= Administrator
$$ 1.72 TOPSPIN		Version 2.1
$$ 2012-08-14 15:22:35.953 -0500  Administrator@TOPSPIN
$$ Compression mode = diff/dup
##.OBSERVE FREQUENCY= 400.02188249412
##.OBSERVE NUCLEUS= ^1H
##.ACQUISITION MODE= SIMULTANEOUS (DQD)
##.ACQUISITION SCHEME= undefined
##.AVERAGES= 64
##.DIGITISER RES= 22
##SPECTROMETER/DATA SYSTEM= spect
##.PULSE SEQUENCE= noesygpps1d.comp
##.SOLVENT NAME= COFFEE_meoh
##.SHIFT REFERENCE= INTERNAL, COFFEE_meoh, 1, 14.9608
##AUDIT TRAIL= $$ (NUMBER, WHEN, WHO, WHERE, PROCESS, VERSION, WHAT)
$$ ##TITLE= Audit trail, TOPSPIN		Version 2.1
$$ ##JCAMPDX= 5.01
$$ ##ORIGIN= Bruker BioSpin GmbH
$$ ##OWNER= Administrator
$$ $$ C:\Bruker\TOPSPIN/data/COFFEE/nmr/AC1248__6672293_lsV1smynyo/12/pdata/1/auditp.txt
$$ ##AUDIT TRAIL=  $$ (NUMBER, WHEN, WHO, WHERE, PROCESS, VERSION, WHAT)
(   1,<2012-08-14 15:22:25.187 -0500>,<Administrator>,<TOPSPIN>,<go>,<TOPSPIN 2.1>,
      <created by zg
	started at 2012-08-14 15:10:54.578 -0500,
	POWCHK enabled, PULCHK disabled,
       configuration hash MD5:
       6B 1B 68 BB D9 2E 58 E2 7F 35 AD 54 07 DF 0E 41
       data hash MD5: 64K
       36 9D BB 62 03 1B 68 9B 30 E7 41 20 80 C0 40 A2>)
(   2,<2012-08-14 15:22:32.562 -0500>,<Administrator>,<TOPSPIN>,<proc1d>,<TOPSPIN 2.1>,
      <Start of raw data processing
       efp LB = 0.3 FT_mod = 6 PKNL = 1 PHC0 = 0 PHC1 = 0 SI = 128K 
       data hash MD5: 128K
       5A 61 6E 5E 50 07 BB A3 42 A0 EC 9A B1 4D CD A5>)
(   3,<2012-08-14 15:22:33.906 -0500>,<Administrator>,<TOPSPIN>,<proc1d>,<TOPSPIN 2.1>,
      <pk PHC0 = -1.697388 PHC1 = 0 
       data hash MD5: 128K
       86 0C EE AE 69 DD D5 A1 A5 C9 26 64 B4 7F 7B 36>)
(   4,<2012-08-14 15:22:35.250 -0500>,<Administrator>,<TOPSPIN>,<proc1d>,<TOPSPIN 2.1>,
      <abs ABSG = 1 
       data hash MD5: 128K
       91 A6 F4 BE 3E C1 15 6D B1 8B 56 C5 0A 60 EA 72>)
(   5,<2012-08-14 15:22:35.343 -0500>,<Administrator>,<TOPSPIN>,<proc1d>,<TOPSPIN 2.1>,
      <abs ABSG = 2 
       data hash MD5: 128K
       1D BC 7D C3 E4 6C 63 72 ED 7E B6 76 A6 22 75 DC>)
(   6,<2012-08-14 15:22:35.468 -0500>,<Administrator>,<TOPSPIN>,<proc1d>,<TOPSPIN 2.1>,
      <abs ABSG = 3 
       data hash MD5: 128K
       16 5C 1A A7 5A 1B EE 00 A6 DD DD 4F 13 43 FE 9F>)
(   7,<2012-08-14 15:22:35.531 -0500>,<Administrator>,<TOPSPIN>,<proc1d>,<TOPSPIN 2.1>,
      <abs ABSG = 4 
       data hash MD5: 128K
       66 13 CB 87 FB 04 83 6F 8A C1 F2 13 D7 71 9B 92>)
(   8,<2012-08-14 15:22:35.609 -0500>,<Administrator>,<TOPSPIN>,<proc1d>,<TOPSPIN 2.1>,
      <abs ABSG = 5 
       data hash MD5: 128K
       6D FF AB BB 0F FC 90 9D 00 64 71 FA FD 02 62 FF>)
$$ ##END=
$$ 
$$ $$ hash MD5
$$ $$ 22 D6 96 F4 CA DD 96 BB 15 55 91 80 58 61 20 11
##$RELAX= 
##$RELAX= 
##$RELAX= 
##$RELAX= 
##$RELAX= 
##$RELAX= 
##$RELAX= 
##$RELAX= 
$$ Bruker specific parameters
$$ [...]
150 150 150 150 150 150 150 150
##$TP07= 0
##$TPNAME0= <>
##$TPNAME1= <>
##$TPNAME2= <>
##$TPNAME3= <>
##$TPNAME4= <>
##$TPNAME5= <>
##$TPNAME6= <>
##$TPNAME7= <>
##$TPOAL= (0..7)
0.5 0.5 0.5 0.5 0.5 0.5 0.5 0.5
##$TPOFFS= (0..7)
0 0 0 0 0 0 0 0
##$TUNHIN= 0
##$TUNHOUT= 0
##$TUNXOUT= 0
##$USERA1= <user>
##$USERA2= <user>
##$USERA3= <user>
##$USERA4= <user>
##$USERA5= <user>
##$V9= 5
##$VALIST= <valist>
##$VCLIST= <CCCCCCCCCCCCCCC>
##$VD= 0
##$VDLIST= <DDDDDDDDDDDDDDD>
##$VPLIST= <PPPPPPPPPPPPPPP>
##$VTLIST= <TTTTTTTTTTTTTTT>
##$WBST= 1024
##$WBSW= 4
##$XGAIN= (0..3)
0 0 0 0
##$XL= 0
##$YL= 0
##$YMAX_a= 12117987
##$YMIN_a= -9664320
##$ZGOPTNS= <>
##$ZL1= 120
##$ZL2= 120
##$ZL3= 120
##$ZL4= 120
##$ABSF1= 14.9608
##$ABSF2= -5.597382
##$ABSG= 5
##$ABSL= 3
##$ALPHA= 0
##$AQORDER= 0
##$ASSFAC= 0
##$ASSFACI= 0
##$ASSFACX= 0
##$ASSWID= 0
##$AUNMP= <proc_prof1d_extract.lims>
##$AXLEFT= 0
##$AXNAME= <>
##$AXNUC= <1H>
##$AXRIGHT= 0
##$AXTYPE= 0
##$AXUNIT= <>
##$AZFE= 0.1
##$AZFW= 0.1
##$BCFW= 0
##$BC_mod= 0
##$BYTORDP= 0
##$COROFFS= 0
##$CY= 15
##$DATMOD= 1
##$DC= 0
##$DFILT= <>
##$DTYPP= 0
##$F1P= 0
##$F2P= 0
##$FCOR= 0.5
##$FTSIZE= 131072
##$FT_mod= 6
##$GAMMA= 0
##$GB= 0
##$INTBC= 1
##$INTSCL= 1
##$ISEN= 128
##$LB= 0.3
##$LEV0= 0
##$LPBIN= 0
##$MAXI= 10000
##$MC2= 0
##$MEAN= 0
##$ME_mod= 0
##$MI= 0
##$NCOEF= 0
##$NC_proc= -2
##$NLEV= 6
##$NOISF1= 0
##$NOISF2= 0
##$NSP= 0
##$NTH_PI= 0
##$NZP= 0
##$OFFSET= 14.9608
##$PC= 1
##$PHC0= -1.697388
##$PHC1= 0
##$PH_mod= 1
##$PKNL= yes
##$PPARMOD= 0
##$PPDIAG= 0
##$PPIPTYP= 0
##$PPMPNUM= 2147483647
##$PPRESOL= 1
##$PSCAL= 4
##$PSIGN= 0
##$PYNMP= <proc.py>
##$REVERSE= no
##$SF= 400.020009717122
##$SI= 131072
##$SIGF1= 0
##$SIGF2= 0
##$SINO= 400
##$SIOLD= 131072
##$SPECTYP= <>
##$SREGLST= <1H.CDCl3>
##$SSB= 0
##$STSI= 131072
##$STSR= 0
##$SW_p= 8223.68421052631
##$SYMM= 0
##$S_DEV= 0
##$TDeff= 65536
##$TDoff= 0
##$TI= <>
##$TILT= no
##$TM1= 0
##$TM2= 0
##$TOPLEV= 0
##$USERP1= <user>
##$USERP2= <user>
##$USERP3= <user>
##$USERP4= <user>
##$USERP5= <user>
##$WDW= 1
##$XDIM= 131072
##$YMAX_p= 400766991
##$YMIN_p= -15079
##$CURPLOT= <Network HP LaserJet P1505>
##$CURPRIN= <$Network HP LaserJet P1505>
##$DFORMAT= <normdp>
##$LAYOUT= <+/1D_H.xwp>
##$LFORMAT= <normlp>
##$PFORMAT= <normpl>
##$SURQMSG= 1
$$ End of Bruker specific parameters
$$ ---------------------------------
##NTUPLES= NMR SPECTRUM
##VAR_NAME=  FREQUENCY,     SPECTRUM/REAL,   SPECTRUM/IMAG
##SYMBOL=    X,             R,               I
##VAR_TYPE=  INDEPENDENT,   DEPENDENT,       DEPENDENT
##VAR_FORM=  AFFN,          ASDF,            ASDF
##VAR_DIM=   131072,        131072,          131072
##UNITS=     HZ,            ARBITRARY UNITS, ARBITRARY UNITS
##FACTOR=    0.0627417313425164, 1,          1
##FIRST=     8223.62146879497, 3047,         -62839
##LAST=      0,             3940,            -62857
##MIN=       0,             -15079,          0
##MAX=       8223.62146879497, 400766991,    0
$$ Real data points
##PAGE= N=1
##DATA TABLE= (X++(R..R)), XYDATA
$$ [...]
63914D046880k54339k56009k53044k45954k35656k23062k08518j91919j73617
63905B004762j55004j37754j22533j08861r6188q4594p4384o5504n7642n0553
63895A051745m4148l8534l4087l1060k8963k6824k4248k1830k0270j9484j8910
63884G43387j8197j7209j5673j3405j0772q442o687n170l382j060J710M578P156
63871F56834R348J1431J3686J6073J8361K0398K2100K3415K4432K5336K6011K5934
63859H93359K4750K2811K0844J9197J7650J5790J3381J0387O989L519J66l238
63847A045605o963j0962j4841j8246k1087k3477k5581k7483k9127l0409l1342
63836H06087l2000l2266l1888l0870k9603k8460k7443k6407k5348k4251k2900
$$ y = [4046880, 3792541, 3536532, 3283488, 3037534, 2801878, 2578816, 2370298, 2178379, 2004762, 1849758, 1712004, 1589471, 1480610, 1384422, 1299828, 1225444, 1159940, 1102298, 1051745, 1007597, 969063, 934976, 903916, 874953, 848129, 823881, 802051, 781781, 762297, 743387, 725190, 707981, 692308, 678903, 668131, 659689, 653002, 647832, 644450, 643390, 645100, 649678, 656834, 666182, 677613, 691299, 707372, 725733, 746131, 768231, 791646, 816078, 841414, 867425, 893359, 918109, 940920, 961764, 980961, 998611, 1014401, 1027782, 1038169, 1045158, 1048677, 1048843, 1045605, 1038642, 1027680, 1012839, 994593, 973506, 950029, 924448, 896965, 867838, 837429, 806087, 774087, 741821, 709933, 679063, 649460, 621000, 593557, 567150, 541802, 517551, 494651]
63825D94651k1182j9399j7962j6813j5500j3848j2258j1237j0816j0530r904q891
63813C26311p852p082o423n448m064k748k089k210k737l108k878j935o84J04r4
63798B77063j101k238k936l066k830k503k255k091j966j898j936k063k231k463
63784B45486k667k538j929j246j055j287j341j025q53j132j415j202p13m56m21
63769B26206k58R2M45Q07J176J206O73N0n5J20j42p41p42J91J125J078K90k36
63751B31285j4N85R83Q82K91m06n52J75J228J645J106K79O0O71J632K396K798
63734B45044K958K963K804K510K224K081K134K437L062L907M566M675M335L979
63720B89679L826L641L210K719K450K262J722P50j52m93m35n58j089j650j864
$$ y = [494651, 473469, 454070, 436108, 419295, 403795, 389947, 377689, 366452, 355636, 345106, 335202, 326311, 318459, 311377, 304954, 299506, 295442, 292694, 290605, 288395, 285658, 282550, 279672, 277737, 277053, 277157, 277063, 275962, 273724, 270788, 267722, 264892, 262389, 260134, 258043, 256077, 254179, 252243, 250180, 247949, 245486, 242819, 240281, 238352, 237106, 236051, 234764, 233423, 232398, 231545, 230413, 228998, 227796, 227083, 226627, 226206, 225948, 226040, 226485, 227292, 228468, 229674, 230347, 230397, 230342, 230462, 230320, 229579, 228837, 229028, 230153, 231231, 231521, 231285, 231271, 231856, 232839, 233721, 234012, 233606, 233054, 233229, 234457, 236102, 237208, 237487, 237547, 238218, 239850, 242246, 245044, 248002, 250965, 253769, 256279, 258503, 260584, 262718, 265155, 268217, 272124, 276690, 281365, 285700, 289679, 293505, 297146, 300356, 303075, 305525, 307787, 309509, 310259, 310107, 309614, 309179, 308621, 307532, 305882, 304018]
63705C04018j960k495l527m293l904k265k71R68J071O55O40J310K102K340K016
63690B96405J679J690J879J929J825J829K118K618L032L058K631J993J437R56
63676C25079L70k29m27j7O45J023J042J144J685K436K785K417J670J068O08j96
63660C41103j532k906l779m218m551m641m148l305k831l034l507l776l716l264
63646B91895k352j248m39L8N42J011R03K39o1N55J368J432R72R93J860K963L663
63629C04334L869L799L788M215N200O397P395Q158Q743Q992R039R659J1404J3578
63615D08570J4944J5312J5708J6933J8723K0514K2246K4102K5988K7624K8909
63604F39573K9852L0411L0368K9245K6452K1886J6323J0789N672Q83l278o164
$$ y = [304018, 302058, 299563, 296036, 291743, 287839, 285574, 285303, 286271, 287342, 287997, 288637, 289947, 292049, 294389, 296405, 298084, 299774, 301653, 303582, 305407, 307236, 309354, 311972, 315004, 318062, 320693, 322686, 324123, 325079, 325449, 325220, 324793, 324776, 325421, 326444, 327486, 328630, 330315, 332751, 335536, 337953, 339623, 340691, 341299, 341103, 339571, 336665, 332886, 328668, 324117, 319476, 315328, 312023, 309192, 306158, 302651, 298875, 295159, 291895, 289543, 288295, 287856, 287894, 288436, 289447, 290350, 290589, 290528, 291083, 292451, 293883, 294855, 295848, 297708, 300671, 304334, 308203, 312002, 315790, 320005, 325205, 331602, 338997, 347155, 355898, 364890, 373929, 383588, 394992, 408570, 423514, 438826, 454534, 471467, 490190, 510704, 532950, 557052, 583040, 610664, 639573, 669425, 699836, 730204, 759449, 785901, 807787, 824110, 834899, 840571, 841454, 838176, 832012]
63592H32012p660q356q760q953r179j0024j1750j3998j6404j8950k1417k3148
63580F73413k3737k3490k2809k1643j9934j8086j6434j4682j2422r870p564n538
63568D77204l472j437J18J128K103L432M919O171P055P647P951P942P834Q115
63554E36710R218J1126J3299J5105J6408J7682J9531K2252K5819L0006L4401L8445
63542G90002M1558M3029M1728L6440K7095J5612M970k794p602j0374j1677j1635
63530I56352j0755r988r840j0047j0504j1995j5276j9720k3736k6567k8868l1301
63518G47755l3369l4113l3318l1444k8937k6242k3967k2215k0212j7424j4631
63507D61883j3032j2495j1820j0508r179q261p443o660o371o461n979m562l106
$$ y = [832012, 824352, 815996, 807236, 798283, 789104, 779080, 767330, 753332, 736928, 717978, 696561, 673413, 649676, 626186, 603377, 581734, 561800, 543714, 527280, 512598, 500176, 490306, 482742, 477204, 473732, 472295, 472413, 473541, 475644, 479076, 483995, 490166, 497221, 504868, 512819, 520761, 528595, 536710, 545928, 557054, 570353, 585458, 601866, 619548, 639079, 661331, 687150, 717156, 751557, 790002, 831560, 874589, 916317, 952757, 979852, 995464, 1000434, 997640, 990038, 979664, 967987, 956352, 945597, 935609, 925769, 915722, 905218, 893223, 877947, 858227, 834491, 807924, 779056, 747755, 714386, 680273, 646955, 615511, 586574, 560332, 536365, 514150, 493938, 476514, 461883, 448851, 436356, 424536, 414028, 404849, 396588, 389145, 382485, 376114, 369653, 363674, 359112, 356006]
63494C56006k441k211j827j541j708j777j045J29Q75J115J334J489J146M93K00
63479C50237M11Q13J525K938M621N480N164M387L646K587J008m20j076j353k065
63464C77903l289m457n176n413n053l961k463j285r14j207j607j469m17J287K736
63449C45215L157K768K578L241M421N457O232P030P832Q389Q954J0250J2426J4698
63435D42648J6492J8480K1686K5849K9493L1579L2130L1146K8029K2714J6567
63424G16813J1303P534N029L931M729P294J0882J5074J9928K5092K9563L2630
63412H89802L4381L5002L4090L1056K5871J9135J1694M458j707o279r213j0727
63400A057563j1131j0915j0812j1522j3446j6549k0329k3996k7025k9542l1903
$$ y = [356006, 353565, 351354, 349527, 347986, 346278, 344501, 343456, 343585, 344460, 345575, 346909, 348398, 349544, 350037, 350237, 350648, 351461, 352986, 355924, 360545, 366025, 371189, 375576, 379222, 381809, 382817, 382397, 381321, 379968, 377903, 374614, 370157, 364981, 359568, 354515, 350554, 348091, 346806, 345892, 344685, 343078, 341609, 341192, 342479, 345215, 348372, 351140, 353718, 356959, 361380, 366837, 373069, 380099, 387931, 396320, 405274, 415524, 427950, 442648, 459140, 477620, 499306, 525155, 554648, 586227, 618357, 649503, 677532, 700246, 716813, 728116, 735650, 740679, 744610, 749339, 756633, 767515, 782589, 802517, 827609, 857172, 889802, 924183, 959185, 993275, 1024331, 1050202, 1069337, 1081031, 1085489, 1083782, 1077503, 1068290, 1057563, 1046432, 1035517, 1024705, 1013183, 999737, 983188, 962859, 938863, 911838, 882296, 850393]
63389H50393l3887l4714l3939l1921k9332k6621k4101k2098k0621j9162j7249
63378E56748j5019j2951j1147r216o814m008j100J628L964N770P128Q352R728
63365E33063J1207J2508J3561J4779J6678J9243K1871K4072K6030K8304L1107
63354G52423L4040L6432L7740L7729L6476L4104L0439K5174J8560J1593N194n09
63342A059395n605r551j1619j2113j2316j3150j4527j6125j8004k0224k2544k4870
63330H78747k7346k9635l0879l0846l0341k9839k8487k5420k1426j8050j5336
63319E91142j1831o964k205N59P88j084m652r308j3681j6435j7495j7732j7562
63306D73540j6647j4910j3010j1480j0119q583p141o286n856n174m002k888k388
$$ y = [850393, 816506, 781792, 747853, 715932, 686600, 659979, 635878, 613780, 593159, 573997, 556748, 541729, 528778, 517631, 508415, 501601, 497593, 496493, 498121, 502085, 507855, 514983, 523335, 533063, 544270, 556778, 570339, 585118, 601796, 621039, 642910, 666982, 693012, 721316, 752423, 786463, 822895, 860635, 898364, 934840, 968944, 999383, 1024557, 1043117, 1054710, 1059904, 1059395, 1053790, 1044239, 1032620, 1020507, 1008191, 995041, 980514, 964389, 946385, 926161, 903617, 878747, 851401, 821766, 790887, 760041, 729700, 699861, 671374, 645954, 624528, 606478, 591142, 579311, 572347, 570142, 570701, 571489, 570405, 565753, 556445, 542764, 526329, 508834, 491102, 473540, 456893, 441983, 428973, 417493, 407374, 398791, 391650, 385364, 379508, 374334, 370332, 367444, 365056]
63293C65056k371k379k339k489k764k737k317k034k383l135l647l632l260k615
63279C26954j612m73K14J81j13o7L06N77O11O73Q92J078J162J461K203L036L271
63262C40354K653J689J170J434K178K922L483L901M082L841L365L286L979N088
63248C83425N967O449O801P113P249P420Q229R930J2043J3951J5533J6958J8216
63235E19284J9197K0037K1023K2341K4056K6056K7747K8286K7540K6538K6336
63224G88441K6694K6515K5426K4198K3547K3386K3426K3822K4629K5211K4789
63213A060084K3404K1742K0040J7609J3526P650Q56n678j1459j6872k2326k7384
63201A081192l1086l3065l3863l4097l3788l2729l0930k8458k5238k1465j7763
$$ y = [365056, 362685, 360306, 357967, 355478, 352714, 349977, 347660, 345626, 343243, 340108, 336461, 332829, 329569, 326954, 325342, 324869, 325083, 325264, 325151, 325084, 325390, 325967, 326578, 327251, 328143, 329221, 330383, 331844, 334047, 337083, 340354, 343007, 344696, 345866, 347300, 349478, 352400, 355883, 359784, 363866, 367707, 371072, 374358, 378337, 383425, 389392, 395841, 402642, 409755, 417004, 424424, 432653, 442583, 454626, 468577, 484110, 501068, 519284, 538481, 558518, 579541, 601882, 625938, 651994, 679741, 708027, 735567, 762105, 788441, 815135, 841650, 867076, 891274, 914821, 938207, 961633, 985455, 1010084, 1035295, 1060084, 1083488, 1105230, 1125270, 1142879, 1156405, 1164055, 1164911, 1159233, 1147774, 1130902, 1108576, 1081192, 1050106, 1017041, 983178, 949081, 915293, 882564, 851634, 823176, 797938, 776473, 758710]
63190G58710j4523j1431q100m821k091K74K914N950Q881J1340J3315J4631J4978
63177G90027J4674J4729J5747J7191J8056J7933J7159J6271J5592J5111J4335
63166I66825J2568R636O276L392R67k002o372j1860j7253k1466k4321k6329k7944
63153H62117k9146k9710k9606k8987k7911k6375k4531k2662k0881j9093j7256
63142E85959j5479j3834j2285j0838r520q156o493m696l415l077l281l233k646
63129D89006j941j493j084k68R18J916K308K370K720L534M287M414M069L984M591
63114E19331N449N702N017L941L284L272L443L336L080L084L335L348K896K395
63100E70913K282K320J980J271P45O54O22L06p6j56K1K11M05P14R54Q37N07M27
$$ y = [758710, 744187, 732756, 724656, 719835, 717744, 718018, 720932, 726882, 735763, 747103, 760418, 775049, 790027, 804701, 819430, 835177, 852368, 870424, 888357, 905516, 921787, 937379, 952490, 966825, 979393, 989029, 995305, 998697, 999664, 997662, 991290, 979430, 962177, 940711, 916390, 890061, 862117, 832971, 803261, 773655, 744668, 716757, 690382, 665851, 643189, 622308, 603215, 585959, 570480, 556646, 544361, 533523, 524003, 515847, 509354, 504658, 501243, 498166, 494885, 491652, 489006, 487065, 485572, 484488, 484220, 485138, 487054, 489362, 491732, 494452, 497986, 502273, 506687, 510756, 514740, 519331, 524780, 530482, 535499, 539440, 542724, 545996, 549439, 552775, 555855, 558939, 562274, 565622, 568518, 570913, 573195, 575515, 577495, 578766, 579511, 580165, 580787, 581093, 581017, 580861, 580882, 581093, 581498, 582212, 583166, 584003, 584510, 584937]
63082E84937P05J010J359K361M271O218O995O534N897N853O142O384O944Q260
63068F53870R920J1126J1862J2776J4107J5580J7287J9689K2495K4578K5612K6876
63056H65778K9654L3499L7072M0123M3489M7393N1000N3885N6706N9986O3038
63045A381623O4842O5314O5065O4396O3220O1774O0578N9772N9079N8517N8495
63034B062675N9010N9228N8314N6324N3794N0503M5250L7087K6463J4727K685
63023B526060r891k3321l7098n0090o1366p0453p7113q1205q2773q2043p9371
63012A871336p5264p0201o4293n7367m9605m1779l4477k7461k0281j3232p057
63001A410319j804L271Q649J3923J8409K1820K4188K5610K6360K6888K7408K7788
$$ y = [584937, 585642, 586652, 588011, 590372, 594643, 600861, 607856, 614390, 620287, 626140, 632282, 638666, 645610, 653870, 663790, 674916, 686778, 699554, 713661, 729241, 746528, 766217, 788712, 813290, 838902, 865778, 895432, 928931, 966003, 1006126, 1049615, 1097008, 1148008, 1201893, 1258599, 1318585, 1381623, 1446465, 1511779, 1576844, 1641240, 1704460, 1766234, 1826812, 1886584, 1945663, 2004180, 2062675, 2121685, 2180913, 2239227, 2295551, 2349345, 2399848, 2445098, 2482185, 2508648, 2523375, 2526060, 2516169, 2492848, 2455750, 2405660, 2344294, 2273841, 2196728, 2115523, 2032750, 1950707, 1871336, 1796072, 1725871, 1661578, 1604211, 1554606, 1512827, 1478350, 1450889, 1430608, 1417376, 1410319, 1408515, 1411786, 1420435, 1434358, 1452767, 1474587, 1498775, 1524385, 1550745, 1577633, 1605041, 1632829]
62989A632829K7896K7753K7264K6249K4833K3299K1305J7815J2233N223j989q862
62977A835848j5741k3093l0945l8827m5898n1283n4697n6647n7818n8342n7920
62966A344637n6403n3972n0860m7261m3462l9772l6341l3180l0335k7842k5629
62955H99580k3644k1939k0553j9420j8507j7927j7685j7520j7129j6436j5516
62944F93304j4437j3360j2550j2132j1904j1563j1024j0359r623q840q026p169
62932E62317o368n939o005n966m983l188j817j740k387k653k320j910j607j164
62918E14270p08p17j083j119o53m77j246k540l401l461l079k657k336k172k185
62903D86436k217k044j722j587j806k113k116j779j416j224j080q13m63p1N55
$$ y = [1632829, 1660725, 1688478, 1715742, 1741991, 1766824, 1790123, 1811428, 1829243, 1841476, 1846699, 1844710, 1835848, 1820107, 1797014, 1766069, 1727242, 1681344, 1630061, 1575364, 1518717, 1460899, 1402557, 1344637, 1288234, 1234262, 1183402, 1136141, 1092679, 1052907, 1016566, 983386, 953051, 925209, 899580, 875936, 853997, 833444, 814024, 795517, 777590, 759905, 742385, 725256, 708820, 693304, 678867, 665507, 652957, 640825, 628921, 617358, 606334, 595975, 586352, 577512, 569486, 562317, 555949, 550010, 544005, 538039, 533056, 529868, 528051, 526311, 523924, 521271, 518951, 517041, 515434, 514270, 513562, 512845, 511762, 510643, 509990, 509513, 508267, 505727, 502326, 498865, 495786, 493129, 490793, 488621, 486436, 484219, 482175, 480453, 478866, 477060, 474947, 472831, 471052, 469636, 468412, 467332, 466519, 466056, 465985, 466540]
62888D66540J436K020J648N12m58p37p02p31n41J38Q44J026R65J293J842J838
62872D76933J113L22l1p8m7N7P5k59p62r52q95j183j845k088j471n63M2O02J446
62853D70416K025J691Q62N03P07P37L94L28Q63J371J207N74J01P4M27R92J408
62836D84680J204L60m26n00l1K71M2m42p23n15K45J309K131K288J919J522J411
62819D94745J644K325L470M531M695L902L196L535M635N411N380N099N216N702
62805E53486O162O478O825P328Q008Q898R959J1008J1895J2670J3419J4127J4853
62792F85116J5821J7114J8486J9806K1561K4392K8238L2334L6204M0215M4998
62781I84285N0663N6876O3395P0204P7223Q4239R0937R6828J01308J04063J05270
$$ y = [466540, 467976, 469996, 471644, 472156, 471698, 470961, 470259, 469528, 468987, 469125, 469969, 470995, 471960, 473253, 475095, 476933, 478046, 478368, 478337, 478259, 478212, 478269, 478344, 478085, 477323, 476371, 475476, 474293, 472448, 470360, 468889, 468326, 468368, 468970, 470416, 472441, 474132, 474994, 475497, 476204, 476941, 477335, 477663, 478526, 479897, 481104, 481678, 481779, 481853, 482280, 483272, 484680, 485884, 486244, 485818, 485318, 485287, 485558, 485600, 485158, 484435, 483920, 484165, 485474, 487605, 489893, 491812, 493334, 494745, 496389, 498714, 502184, 506715, 511410, 515312, 518508, 522043, 526678, 532089, 537469, 542568, 547784, 553486, 559648, 566126, 572951, 580279, 588287, 597185, 607144, 618152, 630047, 642717, 656136, 670263, 685116, 700937, 718051, 736537, 756343, 777904, 802296, 830534, 862868, 899072, 939287, 984285, 1034948, 1091824, 1155219, 1225423, 1302646, 1386885, 1477822, 1574650, 1675958, 1780021, 1885291]
62770A885291J04974J02445R6613Q7242P5182O1361M5948K8824J0439q179k6005
62759B464135m2270n6401o8186p7924q5943r2036r5729r7073r6751r5333r2916
62748A563573q9499q5289q0456p5113o9647o4597n9932n4976m9470m4183l9929
62737H50482l6436l2780k8746k5028k2204k0162j8469j6756j4649j2018r396p634
62725F06204o971o809o486n758m498k598m06J270K017K329K937M018N341O805
62711E97395Q452J0231J2116J4238J6599J8921K0996K3052K5504K8573L2273L6512
62699H44862M0990M5325M9412N3383N7108O0222O2789O5345O7889O9425O8972
62688A485722O6472O2242N6127M7948L8261K7776J6348L444j0428k3667l4983
$$ y = [1885291, 1990265, 2092710, 2189323, 2276565, 2351747, 2413108, 2459056, 2487880, 2498319, 2490140, 2464135, 2421865, 2365464, 2297278, 2219354, 2133411, 2041375, 1945646, 1848573, 1751822, 1656489, 1563573, 1474074, 1388785, 1308329, 1233216, 1163569, 1098972, 1039040, 984064, 934594, 890411, 850482, 814046, 781266, 752520, 727492, 705288, 685126, 666657, 649901, 635252, 623234, 613838, 606204, 599233, 592424, 585938, 580180, 575682, 573084, 572678, 573948, 575965, 578294, 581231, 585249, 590590, 597395, 605847, 616078, 628194, 642432, 659031, 677952, 698948, 722000, 747504, 776077, 808350, 844862, 885852, 931177, 980589, 1033972, 1091080, 1151302, 1214091, 1279436, 1347325, 1416750, 1485722, 1552194, 1614436, 1670563, 1718511, 1756772, 1784548, 1800896, 1804340, 1793912, 1770245, 1735262]
62677A735262m4180n1584n7475o2200o6083o8956p0302o9986o8303o5338o1007
62666A049848n5906n1263m7671m4474m0827l6813l3097k9976k7292k4870k2570
62655F35089k0165j7632j5350j3692j2566j1610j0626r598q619p986p968q203
62643D91074p801o471n105m699n084n307m934m198l158j566K99J571J809J466
62629D47896J039M49l81r34p28r3L06M69Q71J483J713J397J142J476K236L101
62613D61442M079N079N569N350N227O148P868R282J0034J0897J2332J3644J4136
62600E71087J4413J5703J8284K1363K4382K7606L1331L5193L8664M1811M5126
62589H84963M8634N1507N2648N1593M8707M4556L9338L3042K5862J8042R482Q3
$$ y = [1735262, 1691082, 1639498, 1582023, 1519823, 1453740, 1384784, 1314482, 1244496, 1176193, 1110855, 1049848, 993942, 942679, 895008, 850534, 809707, 772894, 739797, 709821, 682529, 657659, 635089, 614924, 597292, 581942, 568250, 555684, 544074, 533448, 523850, 515231, 507245, 499277, 491074, 483273, 476802, 471697, 466998, 461914, 456607, 451673, 447475, 444317, 442751, 443050, 444621, 446430, 447896, 448935, 449384, 449003, 448069, 447341, 447248, 447554, 448023, 448894, 450377, 452090, 453487, 454629, 456105, 458341, 461442, 465521, 470600, 476169, 481519, 486746, 492894, 500762, 510044, 520078, 530975, 543307, 556951, 571087, 585500, 601203, 619487, 640850, 665232, 692838, 724169, 759362, 798026, 839837, 884963, 933597, 985104, 1037752, 1089345, 1138052, 1182608, 1221946, 1254988, 1280850, 1298892, 1308374, 1308457]
62577A308457r482j8006k5049l1384l7689m3324m6998m8256m7737m6283m4437
62566I09812m2576m0797l8680l5831l2575k9680k7351k5101k2610k0141j8042
62555E76428j6267j4449j2259r750p651o947p634q236p308n150l308k528k225
62542D72716j820j488j385j166o93l74l83l42p9R4J99P30J594J897J408J282K466
62525D74656M261N472O212P474R437J1376J3023J4808J6858J8780K0590K2909
62513F25856K6014K9386L2436L5039L7298L9182M0633M1483M1322L9779L6939
62502A025367L3058K8079K1951J5302R035L297k421q094j2870j6180j8398j9995
62490A058131k0664j9768j7282j3776r842n872k087J684O035J1301J6916K1852
$$ y = [1308457, 1298975, 1280969, 1255920, 1224536, 1186847, 1143523, 1096525, 1048269, 1000532, 954249, 909812, 867236, 826439, 787759, 751928, 719353, 689673, 662322, 637221, 614611, 594470, 576428, 560161, 545712, 533453, 523703, 516052, 509105, 501471, 493235, 485927, 480777, 477469, 474941, 472716, 470896, 469408, 468023, 466857, 466164, 465790, 465407, 465065, 464986, 465080, 465279, 466009, 467603, 469500, 470908, 472190, 474656, 478917, 484389, 490601, 498075, 507512, 518888, 531911, 546719, 563577, 582357, 602947, 625856, 651870, 681256, 713692, 748731, 786029, 825211, 865844, 907327, 948649, 988428, 1025367, 1058425, 1086504, 1108455, 1123757, 1132792, 1136089, 1133668, 1125574, 1112704, 1096524, 1078126, 1058131, 1037467, 1017699, 1000417, 986641, 976799, 970927, 968840, 970524, 976559, 987860, 1004776, 1026628]
62478A026628K5719K9075L2575L6019L8362L8547L6157L1421K4896J7336R619
62467A346354K375m532j1849k0057k8707l6665m2901m6958m9038m9871n0277n0519
62455I57355n0205m8971m6865m3942l9929l4856k9607k5211k1736j8517j5272
62444E82244j2304r694p110m551k531j297m65L65J227K244L674N179N795N197
62430E67973M232L576K526M4l483o491q099q659q622q021p362p736r344j0705
62416D99829j0297q531p151p012p313p020o061m902l813l007k845l252l433k833
62402D22359k010j894k417k632k142j482r98k09J227K644L098K594J942J706J795
62387D23581J958K106K202K238K350K630K954L276L958N309O904P851P819P390
$$ y = [1026628, 1052347, 1081422, 1113997, 1150016, 1188378, 1226925, 1263082, 1294503, 1319399, 1336735, 1346354, 1348729, 1344197, 1332348, 1312291, 1283584, 1246919, 1204018, 1157060, 1108022, 1058151, 1007874, 957355, 907150, 858179, 811314, 767372, 727443, 692587, 662980, 637769, 616033, 597516, 582244, 569940, 560246, 553136, 548585, 546054, 544757, 544292, 544657, 545884, 548128, 551802, 556981, 562776, 567973, 572205, 575781, 578307, 578351, 574868, 568377, 560278, 551619, 542997, 534976, 527614, 519878, 510534, 499829, 489532, 481001, 473850, 466838, 459525, 452505, 446444, 441542, 437729, 434722, 431877, 428625, 425192, 422359, 420349, 418455, 416038, 413406, 411264, 409782, 408784, 408575, 409802, 412446, 415544, 418138, 420080, 421786, 423581, 425539, 427645, 429847, 432085, 434435, 437065, 440019, 443295, 447253, 452562, 459466, 467317, 475136, 482526]
62373D82526P313P829Q755R837J0739J1175J1252J1549J2557J4166J5901J7563
62361F21162J9443K1915K4955K8130L1155L4332L8241M2903M7447N0827N2709
62350A013219N3410N3182N1833M8937M4078L7084K8381J9107J0416K680m353j0784
62338A347190j6465k1539k6412l1043l4801l7286l8701l9207l8457l6234l3157
62327I93888l0174k7598k5035k2179j9279j6911j5540j5240j5608j6053j6357
62316G73914j6828j7762j8893j9640j9683j9142j8348j7666j7315j7061j6221
62305E75355j4368j1973j0033r068q695q164p088n632m238l213k427j481k35Q43
62291D89583J126N19l51p13k19R26K232L245L810M033M046L868L602L531L825
$$ y = [482526, 489839, 497668, 506423, 516260, 526999, 538174, 549426, 560975, 573532, 587698, 603599, 621162, 640605, 662520, 687475, 715605, 746760, 781092, 819333, 862236, 909683, 960510, 1013219, 1066629, 1119811, 1171644, 1220581, 1264659, 1301743, 1330124, 1349231, 1359647, 1362327, 1357974, 1347190, 1330725, 1309186, 1282774, 1251731, 1216930, 1179644, 1140943, 1101736, 1063279, 1027045, 993888, 963714, 936116, 911081, 888902, 869623, 852712, 837172, 821932, 806324, 790271, 773914, 757086, 739324, 720431, 700791, 681108, 661966, 643618, 625952, 608637, 591576, 575355, 560987, 549014, 538981, 529913, 521218, 513054, 505966, 500334, 496096, 492883, 490456, 488975, 488740, 489583, 490709, 491228, 490877, 490164, 489945, 490871, 493103, 496348, 500158, 504191, 508237, 512105, 515707, 519238, 523063]
62276E23063M291M611M785N068N564O128O619P054P536Q227R304J0715J2083J3197
62262F28245J4494J6634J9566K2546K5214K8138L1999L6708M1773M7094N2742
62251I65153N8087O1892O3389O2773O0438N6239M9887M1762L2904K4272J6262
62240A493058Q812J612n730j3410k1190k8573l5228m1058m5900m9349n1131n1417
62228A160496n0712m9423m7627m5211m2201l8963l6014l3635l1610k9495k7071
62217G28534k4436k1750j9101j6664j4684j3219j2015j0833r742q909q239p413
62205E61529o310n221m533m184l589k219l13J157J452R08O08J259K631M079N259
62190E52513O160O771P069P180P405Q031R194J0720J2067J2643J2318J1558J0904
$$ y = [523063, 527354, 531965, 536750, 541818, 547382, 553510, 560129, 567183, 574719, 582946, 592250, 602965, 615048, 628245, 642739, 659373, 678939, 701485, 726699, 754837, 786836, 823544, 865317, 912411, 965153, 1023240, 1085132, 1148521, 1211294, 1271732, 1327971, 1377858, 1419620, 1452524, 1476796, 1493058, 1501870, 1503482, 1497752, 1484342, 1463152, 1434579, 1399351, 1358293, 1312393, 1263044, 1211913, 1160496, 1109784, 1060361, 1012734, 967523, 925322, 886359, 850345, 816710, 785100, 755605, 728534, 704098, 682348, 663247, 646583, 631899, 618680, 606665, 595832, 586090, 577181, 568942, 561529, 555219, 549998, 545465, 541281, 537692, 535473, 535160, 536317, 537769, 538677, 539285, 540544, 543175, 547254, 552513, 558673, 565444, 572513, 579693, 587098, 595129, 604323, 615043, 627110, 639753, 652071, 663629, 674533]
62177F74533J0497J0036R057P293N165L869M446O609R027J0977J3050J5978J9479
62164H00016K2978K6715L1173L5774L9207M0950M1488M1005L8867L4728K9255
62153A182156K3335J7161J0570L755k793q713j3877j8412k2712k6994l0698l2896
62141A079882l3502l3445l3291l2429l0131k6751k3201j9779j6303j2968j0240
62130H07842q044n907l884k541k017j770j368r10l94O28K417M512O226P401Q304
62115H10495Q974R082Q323O752M677K410J70j778l010l206k778k922m554p181
62101H25454r272r905r630r432r377q731p111m919k740q82M85J289J899K940M432
62086G64500N518N468M693M167M134M074L890M257N553P140Q295R282J0790J2745
$$ y = [674533, 685030, 695066, 704123, 711416, 716581, 720450, 724896, 731505, 740532, 751509, 764559, 780537, 800016, 822994, 849709, 880882, 916656, 955863, 996813, 1038301, 1079306, 1118173, 1152901, 1182156, 1205491, 1222652, 1233222, 1236977, 1234184, 1225471, 1211594, 1193182, 1170470, 1143476, 1112778, 1079882, 1046380, 1012935, 979644, 947215, 917084, 890333, 867132, 847353, 831050, 818082, 807842, 799798, 793891, 790007, 787466, 785449, 783679, 782311, 781401, 781007, 781635, 784052, 788564, 794790, 802191, 810495, 819469, 828551, 836874, 843626, 848303, 850713, 850883, 849105, 846095, 842889, 840111, 837189, 832635, 825454, 816182, 806277, 796647, 787215, 777838, 769107, 761996, 757077, 754337, 753455, 753940, 755229, 757128, 760068, 764500, 770018, 775486, 780179, 784346, 788480, 792554, 796444, 800701, 806254, 813394, 821689, 830971, 841761, 854506]
62072H54506J4448J5660J6744J7797J8508J8939J9589K0427K0745K0418K0541
62061A058322K2093K4567K6676K7834K8093K7074K4139J9574J4541R665M620o41
62049A286557n294q883j2297j6637k1641k6143k9746l3051l6270l8689l9795m0048
62037I78063m0057l9587l8072l5687l3185l0872k8406k5663k3068k0850j8564
62026F44052j5731j2641j0069q387p354o635o170o012o143o508o991p319p205
62013E36887o652n978n441n000m473l793l100k563k196j773j088l31K6j10j98
61998D94217L08J242K111K867L777M576M490L286J719O30N5n07j381k664m429
61983E10297o461q059q634q347p881p614p367o749n546l910k510k106k618k951
$$ y = [854506, 868954, 884614, 901358, 919155, 937663, 956602, 976191, 996618, 1017363, 1037781, 1058322, 1080415, 1104982, 1131658, 1159492, 1187585, 1214659, 1238798, 1258372, 1272913, 1282578, 1287198, 1286557, 1281263, 1272380, 1260083, 1243446, 1221805, 1195662, 1165916, 1132865, 1096595, 1057906, 1018111, 978063, 938006, 898419, 860347, 824660, 791475, 760603, 732197, 706534, 683466, 662616, 644052, 628321, 615680, 605611, 597224, 589870, 583235, 577065, 571053, 564910, 558402, 551411, 544092, 536887, 530235, 524257, 518816, 513816, 509343, 505550, 502450, 499887, 497691, 495918, 494830, 494499, 494525, 494415, 494217, 494525, 495767, 497878, 500745, 504522, 509098, 513588, 516874, 518593, 519223, 519278, 518771, 517390, 514726, 510297, 503836, 495777, 487143, 478796, 470915, 463301, 455934, 449185, 443639, 439729, 437219, 435113, 432495, 429544]
61969D29544k284j172p32j023j093n89k91p07j114n53P63J701J600Q57L16M66
61953D25689J098J465J010J92J37J254K593L141L207L812N050O083O633P435Q923
61938D77722J0468J1453J2215J3251J4164J4281J3871J3777J4049J3889J2975
61927F22115J1906J1119J0179Q569O575M913L809K838J430p32l465n965p289p259
61913F58743o591n885m936l348j279R35L472O581R732J1976J3030J3356J3141
61900G08927J1985R732O956M334K073J57j390k821m667p000r038r924r684r078
61886F90562q719q659q616q251p365o197n436n625o560p509p990q140q366q814
61872E84315r220r168q517p604o925o585o173n253l821k227q44J31P77J525K901
$$ y = [429544, 427260, 426088, 425356, 424333, 423240, 422651, 422360, 421653, 420539, 419986, 420749, 422450, 424050, 424907, 425223, 425689, 426787, 428252, 429262, 429454, 429591, 430845, 433438, 436579, 439786, 443598, 448648, 454731, 461364, 468799, 477722, 488190, 499643, 511858, 525109, 539273, 553554, 567425, 581202, 595251, 609140, 622115, 634021, 645140, 655319, 663888, 670463, 675376, 679185, 682023, 683453, 682721, 679256, 673291, 666002, 658743, 652152, 646267, 641331, 637983, 636704, 637639, 641111, 647692, 657424, 669400, 682430, 695786, 708927, 720912, 730644, 737600, 741934, 744007, 744164, 742774, 739953, 735286, 728286, 719248, 709324, 699640, 690562, 681843, 673184, 664568, 656317, 648952, 642755, 637319, 631694, 625134, 617625, 609635, 601495, 593129, 584315, 575095, 565927, 557410, 549806, 542881, 536296, 530123, 524870, 521049, 518822, 517978, 518109, 518886, 520411, 523312]
61857E23312M942P050Q706J0162J2110J4679J7094J8529J9097J9807K1450K3674
61845G00612K5237K5231K3914K2258K0826J9297J7072J4027J0520O857K985j161
61833H87675n182q261r870j0345j0428j0208q970o286k783N85L602O506R016J0433
61819H45484J0646J0165R144P122L942J46l798p972j2318j6241j9341k1841k3781
61806G81357k4503k3638k2048k0896k0175j8994j7127j5349j4274j3566j2579
61795E78208j1135r559q253p446p030o568n700m550l527k877k631k808l274l520
61781D99330l091k235j765k170l045l477k882j575o17r00k136k997k498j064M4
61766D68922J11n33j086r42J5J270K006J930J666J927K566K856K543K081J935
$$ y = [523312, 528254, 535304, 544010, 554172, 566282, 580961, 598055, 616584, 635681, 655488, 676938, 700612, 725849, 751080, 774994, 797252, 818078, 837375, 854447, 868474, 878994, 885851, 888836, 887675, 882493, 874232, 864362, 854017, 843589, 833381, 824411, 818125, 815342, 815927, 819529, 826035, 835051, 845484, 856130, 866295, 875439, 882561, 886503, 886649, 882851, 874879, 862561, 846320, 826979, 805138, 781357, 756854, 733216, 711168, 690272, 670097, 651103, 633976, 618627, 604353, 590787, 578208, 567073, 557514, 549261, 541815, 534785, 528217, 522517, 517967, 514440, 511563, 508932, 506124, 502850, 499330, 496239, 494004, 492239, 490069, 487024, 483547, 480665, 479090, 478473, 477573, 475437, 472440, 469942, 468878, 468922, 469033, 468500, 467414, 466472, 466487, 467757, 469763, 471693, 473359, 475286, 477852, 480708, 483251, 485332, 487267]
61751D87267K134K471K625K146Q70o63j667k038k296k720l020k982k843k819k761
61736D73704k495k179k064k128k105j729r78j70K31J27l4J50N19P87J181K038
61720D64855K978L143K369J447J066J092J111J148J489K088K509K352J587N90
61706D89824k05p71j520k636l647l954l607l168l014l194l719m381m554l859k867
61691D44728k482k746k975k926k933k982k701k325k571l278l324k392j691k227
61677D07175l312l677l251k907k949k957k759k604k500k111j321k73R21J975K222
61662C81672J323J8n73l17o3k66l85J80J141J682J417P18K72M58J009J333J177
61645C90796R19J028J455J858K135K419K613K422J840J241Q53N08k4o57j140j427
$$ y = [487267, 489401, 491872, 494497, 496643, 497513, 496850, 495183, 493145, 490849, 488129, 485109, 482127, 479284, 476465, 473704, 471209, 469030, 466966, 464838, 462733, 461004, 460026, 459856, 460087, 460214, 460180, 460330, 460849, 461636, 462817, 464855, 467833, 470976, 473345, 474792, 475858, 476950, 478061, 479209, 480698, 482786, 485295, 487647, 489234, 489824, 489619, 488848, 487328, 484692, 481045, 477091, 473484, 470316, 467302, 464108, 460389, 456008, 451454, 447595, 444728, 442246, 439500, 436525, 433599, 430666, 427684, 424983, 422658, 420087, 416809, 413485, 411093, 409402, 407175, 403863, 400186, 396935, 394028, 391079, 388122, 385363, 382759, 380259, 378148, 376827, 376554, 377475, 379450, 381672, 382995, 383013, 382440, 382123, 382060, 381794, 381409, 381589, 382730, 384412, 385829, 386547, 386819, 387277, 388286, 389619, 390796, 391715, 392743, 394198, 396056, 398191, 400610, 403223, 405645, 407485, 408726, 409579, 410087, 410063, 409406, 408266, 406839]
61629D06839j780k374k897k738j774q56j038k273l306l108j966r15n25o40r42
61614C79707j215j279j146j109j298j382j105r10j428k551l597m247m708n001
61600C48731m777m012l257k940k939k993l088l139k861k273j882j983k143j850
61586C08594j325j181j431j448r64m90o34j281j802j818j600j664k139k549k274
61571B85994j292l16Jj16J59J124K081K207J542P71K72j91q44j399j347m57J020
61554B89209K443L072K666J848J533J859K110J741R98K93l92j028j076k10Q73
61539C05939J150O57M07R66J790K135J916J532J320J372J580J647J373R11M54
61524C25149j16q30j170p53k55p49k060k792k242j276q91q67n25J5J43j41k92
$$ y = [406839, 405059, 402685, 399788, 397050, 395276, 394420, 393382, 391109, 387803, 384695, 382729, 381814, 381289, 380649, 379707, 378492, 377213, 376067, 374958, 373660, 372278, 371173, 370263, 368835, 366284, 362687, 358440, 353732, 348731, 343954, 339942, 336685, 333745, 330806, 327813, 324725, 321586, 318725, 316452, 314570, 312587, 310444, 308594, 307269, 306088, 304657, 303209, 302245, 301755, 301121, 299840, 298038, 296220, 294620, 292956, 290817, 288268, 285994, 284702, 284386, 284387, 284271, 284430, 285554, 287635, 289842, 291384, 292155, 292427, 292236, 291392, 289993, 288646, 288189, 289209, 291652, 294724, 297390, 299238, 300771, 302630, 304740, 306481, 307479, 307772, 307380, 306352, 305276, 305066, 305939, 307089, 307746, 308153, 309119, 310909, 313044, 314960, 316492, 317812, 319184, 320764, 322411, 323784, 324695, 325149, 325033, 324203, 323033, 322280, 322025, 321276, 319216, 316424, 314182, 312906, 312015, 311148, 310623, 310638, 310781, 310640, 310348]
61507C10348p9L01O97J056J165Q48K49l19o12m04L08Q22J76j534k911k875j829
61490C05407p10K83J227J559P99l31o75k59j3j70o6N23J095J440J917K532K822
61473C17380K801K950L052K160J58j677k198j614o80L48J322J649J034J54j80
61458C26659q9j14j70J40N75N34M2l31m41o20q39o39rM60M71M36P05J041J180
61439C28991J355J785K101J927J667K127L314M309M380L786L220K939K724K401
61425C67026J957J367O91K76M23Q97J161J103J087J256J302J101J062J444J819
61410C83972J670J148P00K47o00j633k078j643r79q29j197j654k073k659l403
61395C68989l865l626k745j700r27m54l7M29P92R00P56M05p7l73j06N90J051Q92
$$ y = [310348, 310269, 310570, 311267, 312323, 313488, 314336, 314585, 314266, 313654, 313250, 313558, 314380, 314556, 313022, 310111, 307236, 305407, 304697, 304980, 306207, 307766, 308565, 308234, 307559, 307300, 307287, 307117, 307051, 307574, 308669, 310109, 312026, 314558, 317380, 320181, 323131, 326183, 328343, 328501, 326824, 324626, 323012, 322332, 322680, 324002, 325651, 326685, 326839, 326659, 326570, 326456, 326286, 326426, 327001, 327535, 327577, 327246, 326805, 326185, 325346, 324707, 324698, 325158, 325629, 326065, 326770, 327811, 328991, 330346, 332131, 334232, 336159, 337826, 339953, 343267, 347576, 351956, 355742, 358962, 361901, 364625, 367026, 368983, 370350, 371041, 371317, 371740, 372637, 373798, 374901, 375988, 377244, 378546, 379647, 380709, 382153, 383972, 385642, 386790, 387490, 387737, 387137, 385504, 383426, 381783, 380804, 379975, 378778, 377124, 375051, 372392, 368989, 365124, 361498, 358753, 357053, 356126, 355672, 355635, 356064, 356856, 357756, 358512, 358917, 358840, 358467, 358361, 358951, 360002, 360894]
61377C60894N12M38N87O32P43J266J957K245K130K096K165J846J120O56Q23J182
61361C81292J249J111R74Q04P82J431K734L690L485K693K686M021O064P929R174
61346D30119R651R333Q389P079N594M307L812M222M605L954K602J929K472L178
61332E01246K947K118J780K065K046J135j86j179j714k066k314k354k194j884
61318D99446j283k77Q29J457J415J170J420K414L782M892N438N691O262P502R257
61303E49415J1103J2717J3882J4357J4051J3213J2083J0411P668L860j92l508
61291F59060n659o765p182p381p803q492r036r099q920q977r326r523r144q183
61277E43570o933n641m330k893j361K6J113K114L255M197M297L592L037L426M421
$$ y = [360894, 361406, 361844, 362431, 363063, 363806, 365072, 367029, 369274, 371404, 373500, 375665, 377511, 378631, 379287, 380110, 381292, 382541, 383652, 384626, 385430, 386212, 387643, 390377, 394067, 397552, 400245, 402931, 406952, 413016, 420945, 430119, 439770, 449103, 457492, 464571, 470165, 474472, 478284, 482506, 487111, 491065, 493667, 495596, 498068, 501246, 504193, 506311, 508091, 510156, 512202, 513337, 513151, 511972, 510258, 508192, 505878, 503524, 501330, 499446, 498163, 497886, 498715, 500172, 501587, 502757, 504177, 506591, 510373, 515265, 520703, 526394, 532656, 540158, 549415, 560518, 573235, 587117, 601474, 615525, 628738, 640821, 651232, 658900, 662760, 662568, 659060, 653401, 646636, 639454, 632073, 624270, 615778, 606742, 597643, 588723, 579746, 570420, 560897, 551753, 543570, 536637, 530996, 526666, 523773, 522412, 522438, 523551, 525665, 528920, 533117, 537414, 541006, 544043, 547469, 551890]
61262E51890N084N046M754M793N431O649Q106R104R112Q360P536O871N907M288
61248F42931K419J120P73R47Q34Lj212k115k468k673l119l629l844l771l635l404
61232F19157k943k431k136j851j038L53J727K637L376M503O011P216P479O891
61218F48951O180N939O005N744M967M270M372N272O231O468N726M359L030K141
61204G19655J523Q60L91P31J909L153L911M545N535O613P285P914R459J2288J5610
61189H01382J8065J8544J6808J3789J1026R287P903N855L181Q33n39j072j287
61176I03775j753k884m478n697o027n983o320o983p514p987q714r436r727r877
61162H10395j0397j0994j1085j1025j1584j2436j2516j1790j1241j1010j0055
$$ y = [551890, 556974, 562020, 566774, 571567, 576998, 583647, 591753, 600857, 609969, 618329, 625865, 632736, 638643, 642931, 645350, 646470, 647243, 648190, 649024, 649027, 647815, 645700, 643232, 640559, 637440, 633811, 629967, 626196, 622561, 619157, 616214, 613783, 611647, 609796, 608758, 609111, 610838, 613475, 616851, 621354, 627365, 634581, 642060, 648951, 655131, 661070, 667075, 672819, 677786, 682056, 686428, 691700, 697931, 704399, 710125, 714484, 717514, 719655, 721178, 722038, 722429, 723160, 725069, 728222, 732133, 736678, 742213, 748826, 756111, 764025, 773484, 785772, 801382, 819447, 837991, 854799, 868588, 879614, 888901, 896804, 902659, 905840, 906673, 906134, 905062, 903775, 902022, 899138, 894660, 888963, 882936, 876953, 870633, 863650, 856136, 848149, 839435, 829999, 820272, 810395, 799998, 789004, 777919, 766894, 755310, 742874, 730358, 718568, 707327, 696317, 686262]
61151F86262q045o107n015m042k429q14j80l22m02l60p83j903l526n539p583q757
61135F30455q439p183o067n349m427k939j278jQ09J563K792M675O808Q535R617
61120F29571J0344J1095J2202J4055J6766J9661K1846K3358K4952K6641K7407
61109H37898K6772K5730K5482K5937K6125K5528K4359K2945K1474J9939J7923
61098A100112J4811J0666O434K842m89m317q591j2495j5410j7366j8752j9907
61086A037538k0861k1349k1287k1132k1334k1629k1521k1166k0934k0264j8284
61075H07777j5630j4110j4160j4096j2595j0470q960p709n822l723k402j565j33
61062F96402J798L047L171K960L143L752M744O198P763Q787R168R520J0440J2009
$$ y = [686262, 678217, 672110, 667095, 663053, 660624, 659810, 659630, 659308, 658906, 658546, 657763, 655860, 652334, 646795, 639212, 630455, 622016, 614833, 608766, 603417, 598990, 596051, 594773, 594772, 595581, 597144, 599936, 604611, 611419, 619954, 629571, 639915, 651010, 663212, 677267, 694033, 713694, 735540, 758898, 783850, 810491, 837898, 864670, 890400, 915882, 941819, 967944, 993472, 1017831, 1040776, 1062250, 1082189, 1100112, 1114923, 1125589, 1132023, 1134865, 1134376, 1130059, 1121468, 1108973, 1093563, 1076197, 1057445, 1037538, 1016677, 995328, 974041, 952909, 931575, 909946, 888425, 867259, 846325, 826061, 807777, 792147, 778037, 763877, 749781, 737186, 726716, 717756, 710047, 704225, 700502, 698100, 696535, 696402, 698200, 701247, 704418, 707378, 710521, 714273, 719017, 725215, 732978, 741765, 750933, 760453, 770893, 782902]
61048G82902J3871J5481J6528J7414J8902K0981K2755K3852K5066K7043K9168
61037A013963L0614L1659L3077L4910L6803L8871M1247M3436M5094M6791M9000
61026A445465N1036N2069N2506N3245N4350N5704N8106O2322O7647P3017P8889
61015B104356Q6446R5477J04783J14349J25549J39636J57759J82009K14634K56667
61005C581665L09180L75194M58394N61011O85875Q39086J025533J240088J465141
60996A0541167J673655J825186J858310J706410J348334Q54591L71309L9127q4773
60987B0133316l5242J10723K75163L77597L28974O8060l80751q98287j337032
60978A8642521j606410j702538j673266j570134j428944j273367j118922r72809
$$ y = [782902, 796773, 812254, 828782, 846196, 865098, 886079, 908834, 932686, 957752, 984795, 1013963, 1044577, 1076236, 1109313, 1144223, 1181026, 1219897, 1261144, 1304580, 1349674, 1396465, 1445465, 1496501, 1548570, 1601076, 1654321, 1708671, 1764375, 1822481, 1884803, 1952450, 2025467, 2104356, 2190802, 2286279, 2391062, 2505411, 2630960, 2770596, 2928355, 3110364, 3324998, 3581665, 3890845, 4266039, 4724433, 5285444, 5971319, 6810405, 7835938, 9076026, 10541167, 12214822, 14040008, 15898318, 17604728, 18953062, 19807653, 20178962, 20218089, 20133316, 20098074, 20208797, 20483960, 20861557, 21190531, 21258591, 20877840, 19979553, 18642521, 17036111, 15333573, 13660307, 12090173, 10661229, 9387862, 8268940, 7296131]
60970G296131q36954p13136o03624n08764m27401l59222l04383k61324k27106
60961C054217j99433j76859j57786j41034j26741j15035j04552r3789q3231p4360
60951A781397o7184o0599n4652n0505m8264m6639m4821m3145m1709l9894l7496
60940A246489l5184l3460l2121l0886k9761k8705k7708k7082k6929k6650k5723
60929I22280k4626k3944k3180k1590j9795j8992j8904j8050j6123j4423j3616
60918G09037j2742j1088r581r297r706r489q383p237o622o255n591m419k940j679
60904F04008j130j207j208n08P67J904K231J669R00Q45J626K213J596J50p64n73
60888F12519j21m04j398k464l360m370n754p320q489q619p578o038m975m789n173
$$ y = [7296131, 6459177, 5746041, 5142417, 4633653, 4206252, 3847030, 3542647, 3281323, 3054217, 2854784, 2677925, 2520139, 2379105, 2252364, 2137329, 2032777, 1938988, 1855757, 1781397, 1714213, 1653614, 1598962, 1548457, 1500193, 1453554, 1408733, 1365588, 1323879, 1283985, 1246489, 1211305, 1177845, 1145724, 1114838, 1085077, 1056372, 1028664, 1001582, 974653, 948003, 922280, 897654, 873710, 850530, 828940, 809145, 790153, 771249, 753199, 737076, 722653, 709037, 696295, 685207, 675626, 666329, 656623, 647134, 638751, 631514, 624892, 618637, 613046, 608627, 605687, 604008, 602878, 601671, 600463, 599955, 600722, 602626, 604857, 606526, 607426, 608271, 609897, 612110, 613706, 613856, 613092, 612519, 612398, 611994, 610596, 608132, 604772, 600402, 594648, 587328, 578839, 570220, 562642, 556604, 551629, 546840, 541667]
60873E41667n701o142o243n817n169m916n159n243m650l701l078k921k748k124
60859D78055j116j41M37N36L27j3m44q83j057p11Q8R48J461J366O44l73j138j374
60841D76612j324j317j280r67m83k43n35j379k576l649l968l375k526k150k133
60826D48707j742o92N20J262J301P57l7o72r79j231j632j816j307l71J65r3q24
60809D41316j668k556l273l362k725j845j187p78n93q74j711k680l211l158k772
60794D08923k366k175k324k715l034l022k725k428k475k991l597l569k592j262
60780C71648m72l74m07k47j93m97q80r54o89k02M93J330K054K466K627K626K503
60763C80832K435K668L078L202K860K382K038J648J010L54M8J93P20J547K217
$$ y = [541667, 535966, 529824, 523581, 517764, 512595, 507679, 502520, 497277, 492627, 488926, 485848, 482927, 480179, 478055, 476939, 476798, 477235, 477771, 478098, 478085, 477641, 476758, 475701, 474990, 475078, 476026, 477487, 478853, 479497, 479124, 477986, 476612, 475288, 473971, 472691, 471724, 471241, 470998, 470463, 469084, 466508, 462859, 458891, 455516, 452990, 450840, 448707, 446965, 446273, 446793, 448055, 449356, 450113, 450076, 449404, 448425, 447194, 445562, 443746, 442439, 442068, 442233, 442140, 441316, 439648, 437092, 433819, 430457, 427732, 425887, 424700, 423922, 423329, 422455, 420744, 418064, 414853, 411695, 408923, 406557, 404382, 402058, 399343, 396309, 393287, 390562, 388134, 385659, 382668, 379071, 375502, 372910, 371648, 371176, 370802, 370395, 370148, 369955, 369458, 368578, 367624, 366935, 366733, 367226, 368556, 370610, 373076, 375703, 378329, 380832, 383267, 385935, 389013, 392215, 395075, 397457, 399495, 401143, 402153, 402507, 402555, 402748, 403468, 405015, 407232]
60748D07232J931M82j071j327o7J564K358K032R67m28j898l274m470n401n844
60733C92786n713n414n567o158o413n731m463l374k692k086j375p79m98m97p28
60718C41298j141j418j129l06N14R72J164J122N83l47r42p57l18k59k37M34J428
60701C40661J727J231R11J214J409R46M81Q17J634K043J880J661J687J921K412
60686C62635L143L655L520L056K967L452M124M570M490L631K236J326J751L043
60672D07599L891L681K863J941R16j94j069j586k017k488k826l046l464m036m180
60657C95985l524k473j704j466j523j494j084l24L78O82Q05J137J444J125L12
60642C88276m7M52R12K97j156k299k564k452k645l141l396k986k007r23j38K70
$$ y = [407232, 409163, 409645, 408574, 407247, 407180, 408744, 411102, 413134, 414101, 413673, 411775, 408501, 404031, 398630, 392786, 387073, 381659, 376092, 369934, 363521, 357790, 353327, 349953, 347261, 345175, 343800, 343021, 342523, 342026, 341298, 340157, 338739, 337610, 337304, 337818, 338790, 339954, 341076, 341659, 341312, 340370, 339613, 339295, 339036, 338799, 339233, 340661, 342388, 343619, 344530, 345744, 347153, 348099, 348580, 349397, 351031, 353074, 354954, 356615, 358302, 360223, 362635, 365778, 369433, 372953, 376009, 378976, 382428, 386552, 391122, 395612, 399243, 401479, 402805, 404556, 407599, 411490, 415171, 418034, 419975, 420891, 420697, 419628, 418042, 416025, 413537, 410711, 407665, 404201, 400165, 395985, 392461, 389988, 388284, 386818, 385295, 383801, 382717, 382393, 382771, 383453, 384258, 385395, 386839, 387964, 388276, 388229, 388681, 389593, 389890, 388734, 386435, 383871, 381419, 378774, 375633, 372237, 369251, 367244, 366321, 366183, 366453]
60626C66453L91K88J06J68O30J132J232J056J098J346J235N17l29p95q71p32l78
60609C72547N2J98L9J12P03J266J147N52K32M39P31O92L71L6r7J14O48J209J515
60590C82506J618J755J899J773J265N75Kk82k87k10k21j45M69J671K780L093K807
60573D01068K800L512M528N339O066P171Q769J0519J2033J3086J3556J3367J2578
60560E14392J1302R563P320M593J481j887n183p678q648q146p115o347n570l994
60546D94083j643N42K000L266M966O742P882Q587R804J1823J3922J5444J6536
60533E93954J7449J7825J7229J5868J4204J2026Q671M140m99m071o337p812q814
60520F73833r115q576p719p275p307p126o208m794l456k403j520p19J49J400L094
$$ y = [366453, 366844, 367132, 367238, 367406, 368036, 369168, 370400, 371456, 372554, 373900, 375135, 375652, 375323, 374528, 373657, 372925, 372547, 372599, 372797, 372836, 372948, 373651, 374917, 376064, 376616, 376848, 377287, 378018, 378710, 379081, 379117, 379020, 379134, 379782, 380991, 382506, 384124, 385879, 387778, 389551, 390816, 391391, 391393, 391111, 390824, 390614, 390393, 390248, 390717, 392388, 395168, 398261, 401068, 403868, 407380, 411908, 417247, 423313, 430484, 439253, 449772, 461805, 474891, 488447, 501814, 514392, 525694, 535257, 542577, 547170, 548651, 546764, 541581, 533903, 525255, 517109, 509994, 503647, 498077, 494083, 492440, 492982, 494982, 498248, 503214, 509956, 517838, 526425, 536229, 548052, 561974, 577418, 593954, 611403, 629228, 646457, 662325, 676529, 688555, 697226, 701366, 700867, 696796, 690459, 682647, 673833, 664718, 656142, 648423, 641148, 633841, 626715, 620507, 615713, 612257, 609854, 608334, 607615, 607764, 609164, 612258]
60505F12258M774O177P925J0774J4281J7177J9266K1971K6568L2526L8263M2926
60493H54886M6721M9879N2114N2954N1967M8696M3044L5706K7625J8954R041k294
60481A289293j4028k4775l3994m1908m8515n3144n5091n4443n2111m9141m6055
60470H16088m2764l9055l5094l1445k8505k6045k3441k0441j7579j5550j4321
60459E21848j3136j1454r575q122p245o641o164n929n839n482m683l812l301l077
60445D27388k714k052j418j238j549j954j987j549q89l19J8K7l28q19r99p44n00
60428D08374p16j192j359j063n77J9Q57J625J583N30o66r60l16M09N68L33K65
60411D07714N96J043J195J032R90J461K231K636K253J387P48P78J327J863J996
$$ y = [612258, 617032, 623209, 631134, 641908, 656189, 673366, 692632, 714603, 741171, 773697, 811960, 854886, 901607, 951486, 1003600, 1056554, 1108521, 1157217, 1200261, 1235967, 1263592, 1282546, 1291587, 1289293, 1275265, 1250490, 1216496, 1174588, 1126073, 1072929, 1017838, 963395, 911284, 862143, 816088, 773324, 734269, 699175, 667730, 639225, 613180, 589739, 569298, 551719, 536169, 521848, 508712, 497258, 487683, 479561, 472316, 465675, 459511, 453582, 447743, 442261, 437578, 433766, 430465, 427388, 424674, 422622, 421204, 419966, 418417, 416463, 414476, 412927, 412038, 411719, 411737, 411764, 411436, 410617, 409618, 408874, 408374, 407658, 406466, 405107, 404044, 403467, 403486, 404343, 405968, 407551, 408081, 407415, 406455, 406139, 406548, 407116, 407449, 407714, 408310, 409353, 410548, 411580, 412570, 414031, 416262, 418898, 421151, 422538, 423286, 424064, 425391, 427254, 429250]
60396D29250J778J537J411J261J056J063J416J852K198K761L736M475M118K920
60382D60832K130K402L052L212L035L219L803M080L617K834K559L221M454N370
60368E07820N362M729M261M211M032L289K364J857J700J343P08L69P86J756K753
60353E47340L566M336N151N882O463P145Q171R229R518Q563O684M520K345J66
60339F29079j863l496m744n627n857n288m512m328m691m809m338l702l243k909
60325E69672k964m055o072p694p736o458n007m044l468k992k381j439k94O23J331
60310E17022K623N067Q058J0542J2406J4478J7222K0110K2248K3083K2451K0398
60298F95708J7132J2885P820K185l649r408j4869j9321k1589k1181j9127j7116
$$ y = [429250, 431028, 432565, 433976, 435237, 436293, 437356, 438772, 440624, 442822, 445583, 449319, 453794, 457912, 460832, 462962, 465364, 468416, 471628, 474663, 477882, 481685, 485765, 489382, 492216, 494775, 497996, 502450, 507820, 513182, 517911, 522172, 526383, 530415, 533704, 536068, 537925, 539625, 540968, 541676, 542045, 542831, 544587, 547340, 550906, 555242, 560393, 566275, 572738, 579883, 588054, 597283, 606801, 615364, 622048, 626568, 628913, 629079, 627216, 623720, 618976, 613349, 607492, 602204, 597692, 593364, 588673, 583864, 579526, 575824, 572581, 569672, 566708, 562653, 556581, 548887, 541151, 534693, 529686, 525642, 522174, 519182, 516801, 515362, 515068, 515691, 517022, 519645, 524712, 532770, 543312, 555718, 570196, 587418, 607528, 629776, 652859, 675310, 695708, 712840, 725725, 733545, 735730, 732081, 722673, 707804, 688483, 666894, 645713, 626586, 609470]
60286F09470j5830j4646j2786j0249p641n562m242l447k735k074j916k396k775
60273E23171k324j481j440k576l969m579m310l672l062k634k464k418k205j822
60259D84215j732k258l021l280k753j800q84j57L34L70j28o56m41O08J601J725
60243D71743J254R99J020O29l03r45p55k93k65l96M4J056J994K532K802K787K341
60226D86244J730J519J863K429K945L332L388K955K402K327K751L145L281L501
60212E23812M037M619M932N046N188N463N962O737P524P899P819P673P716P776
60198F12203P612P184O534N764N225N196N287M654L079J359L28j9j67k84l73q02
60182F62780k115m209o220p367p661p703p931q168p876o778n222l858l033k732
$$ y = [609470, 593640, 578994, 566208, 555959, 548318, 542756, 538514, 535067, 532332, 530258, 528342, 525946, 523171, 520847, 519366, 517926, 515350, 511381, 506802, 502492, 498820, 495758, 493124, 490660, 488242, 486037, 484215, 482483, 480225, 477204, 473924, 471171, 469371, 468487, 468330, 468664, 469034, 468906, 468250, 467809, 468417, 470018, 471743, 472997, 473996, 475016, 475645, 475342, 474397, 473642, 473349, 473084, 472688, 472732, 473788, 475782, 478314, 481116, 483903, 486244, 487974, 489493, 491356, 493785, 496730, 500062, 503450, 506405, 508807, 511134, 513885, 517030, 520311, 523812, 527849, 532468, 537400, 542446, 547634, 553097, 559059, 565796, 573320, 581219, 589038, 596711, 604427, 612203, 619815, 626999, 633533, 639297, 644522, 649718, 655005, 659659, 662738, 664097, 664425, 664406, 664239, 663955, 663582, 662780, 660665, 656456, 650236, 642869, 635208, 627505, 619574, 611406, 603530, 596752, 591530, 587672, 584639, 581907]
60168E81907k939l662m443m412l256j852j310j516j308k03Q41Q02J20M1Q14J402
60152E61026J128O50R57K048L074L299K450P01j036j333L09K536L531L225L094
60137E85659L939M965N296N241N493O003O343O452O381N934N194M813N074N184
60123F61971M280K717J577J202J032P13N95J051J948K760L008K642K227K432L071
60108F93226L177K261J009K36j13m29o73r03j784l541n058n204m561m573n300
60093F67770n458m537l469l035k971k936l052l075k278p66J91j38q16o04L68J086
60077F36280J193J154J253J244Q84K27o34j743l159m782o252p139p424p609p993
60062E95500q097p427o488o262o761p029o565n817n122m273l336k825k646j930
$$ y = [581907, 578968, 575306, 570863, 566451, 563195, 561343, 560033, 558517, 557209, 557006, 557847, 558649, 558769, 558810, 559624, 561026, 562154, 562804, 563761, 565809, 568883, 572182, 574632, 575333, 574297, 572964, 573273, 575809, 579340, 582565, 585659, 589598, 594563, 599859, 605100, 610593, 616596, 622939, 629391, 635772, 641706, 646900, 651713, 656787, 661971, 666251, 668968, 670545, 671747, 672779, 673492, 674087, 675138, 677086, 679846, 682854, 685496, 687723, 690155, 693226, 696403, 698664, 699673, 699909, 699796, 699367, 698694, 697791, 696007, 692466, 687408, 682204, 677643, 673070, 667770, 662312, 657775, 654306, 651271, 648300, 645364, 642312, 639237, 636959, 636193, 636384, 636246, 635430, 634826, 635194, 636280, 637473, 638627, 639880, 641124, 642008, 642235, 641601, 639858, 636699, 631917, 625665, 618526, 611102, 603493, 595500, 587403, 579976, 573488, 567226, 560465, 553436, 546871, 541054, 535932, 531659, 528323, 525498, 522852, 520922]
60048E20922m77P46J166J555K612L642L732L330L512M319N061N676O451O851N996
60033E75094M289L165L166L407L099K403J511J36j624k945l509m178n711p468
60019E70835q210p681o677n986n957o739q024q822q356p185o596o819o739n656
60005D71388m340l740l512k721j490q27r72j027l88M66R67J392K134K800K727
59990D62857K006J287Q75O81P82J322K011K450K755L248L665L407K547J847J650
59975D93390J511J016K61o31j723k716k890k076j081p30r13j015q39o23m69k26
59959D80246K69J087K224L351L894L570K716J834J097M70Rk75n85j081j565j691
59943D95570j398q80l68m5q5n30j221j904k386k607k681k785k806k309j122K60
$$ y = [520922, 520445, 521191, 522357, 523912, 526524, 530166, 533898, 537228, 540740, 545059, 550120, 555796, 562247, 569098, 575094, 579383, 582548, 585714, 589121, 592220, 594623, 596134, 596270, 594646, 591701, 588192, 584014, 578303, 570835, 562625, 554944, 548267, 542281, 536324, 529585, 521561, 512739, 504383, 497198, 490602, 483783, 477044, 471388, 467048, 463308, 459796, 457075, 455585, 454758, 453786, 452759, 452371, 452837, 453804, 455196, 457330, 460130, 462857, 464863, 466150, 467025, 467706, 468488, 469810, 471821, 474271, 477026, 480274, 483939, 487346, 489893, 491740, 493390, 494901, 495917, 496178, 495547, 493824, 491108, 488218, 486142, 485061, 484331, 483418, 482403, 481564, 480941, 480472, 480246, 480515, 481602, 483826, 487177, 491071, 494641, 497357, 499191, 500288, 500758, 500767, 500492, 499907, 498826, 497261, 495570, 494172, 493292, 492924, 492879, 492794, 492264, 491043, 489139, 486753, 484146, 481465, 478680, 475874, 473565, 472443, 472703]
59927D72703J255J950K737L412L420K945K951L873N062N821O272O697O794O166
59913E32058N115M313L947L720L502L470L742M174M484M439M049L627L424L171
59899E87235K385J127k0p84j463k162k440k008j221n02J75R10J497J860K307K953
59883E89849L377L292L058L119L317L351L395L816M525N143N390N054L979K522
59869F43187J433Q57J2j548l006l324k687k074j817j505j029p58p83q95j233k078
59853F22752k993k995j771m6J486K929M684O610Q017Q158O727M124J349p61k167
59838F56103l281m143m383l952l344l033l086l455m187n155n914o123n861n391
59824E94795m710l624k221j122j006j827k699k783k238j955k392l130l554l499
$$ y = [472703, 473958, 475908, 478645, 482057, 485477, 488422, 491373, 495246, 500308, 506129, 512401, 519098, 525892, 532058, 537173, 541486, 545433, 549153, 552655, 556125, 559867, 564041, 568525, 572964, 577013, 580640, 584064, 587235, 589620, 590747, 590727, 589943, 588480, 586318, 583878, 581870, 580649, 580147, 580322, 581232, 582729, 584589, 586896, 589849, 593226, 596518, 599576, 602695, 606012, 609363, 612758, 616574, 621099, 626242, 631632, 636686, 640665, 643187, 644620, 645477, 645489, 643941, 640935, 637611, 634924, 632850, 631033, 629528, 628499, 627741, 626958, 626063, 624830, 622752, 619759, 616764, 614993, 614947, 616433, 619362, 624046, 630656, 638673, 646831, 653558, 657682, 659031, 658270, 656103, 652822, 648679, 644296, 640344, 637000, 633967, 630881, 627426, 623239, 618084, 612170, 606047, 600186, 594795, 590085, 586461, 584240, 583118, 582112, 580285, 577586, 574803, 572565, 570610, 568218, 565088, 561534, 558035]
59810E58035l078k426j798j520j543j504j410j682k294k546k021j172n08K7L86
59795E34946n7j496k905l241k885k930l415l456k773k003j513j044o56q91j746
59780E03935k363k124j365o98k98j69m72j133j629j511q32J79J409K669L568L922
59764E03088L995M094M185M111L953L924M080M290M468M744N382O400P359P768
59750E71841P781Q070Q812R237Q649P419O487O197O188O145O005N639M973M275
59736F67718L774L145K027Q11K07J13k55j162k071k598k897k953k402j349o93
59721F61415j140k322l333l718l629l410l294l384l565l588l242k419j176N2O11
59706F23858L52j2K19P58Q22L16k24o06j007j114k75J308K491K614K203J887J541
$$ y = [558035, 554957, 552531, 550733, 549213, 547670, 546166, 544756, 543074, 540780, 538234, 536213, 535041, 534533, 534560, 534946, 534889, 533393, 530488, 527247, 524362, 521432, 518017, 514561, 511788, 509785, 508272, 507228, 506572, 505681, 503935, 501572, 499448, 498083, 497385, 497087, 496918, 496446, 495313, 493684, 492173, 491341, 491520, 492929, 495598, 499166, 503088, 507083, 511177, 515362, 519473, 523426, 527350, 531430, 535720, 540188, 544932, 550314, 556714, 564073, 571841, 579622, 587692, 596504, 605741, 614390, 621809, 628296, 634493, 640681, 646826, 652831, 658470, 663443, 667718, 671492, 674637, 676664, 677475, 677682, 677795, 677540, 676378, 674307, 671709, 668812, 665859, 663457, 662108, 661415, 660275, 657953, 654620, 650902, 647273, 643863, 640569, 637185, 633620, 630032, 626790, 624371, 623195, 623247, 623858, 624210, 624198, 624417, 625175, 625997, 626313, 626089, 625483, 624476, 623362, 623087, 624395, 626886, 629500, 631703, 633590, 635131]
59689F35131R52M96M32K00p57j922k254j508l79M82Q95P63m7j302k431l154l751
59672F21846m591n576o302o533o356n941n359m660m039l656l403l035k543k113
59658E57739j716j056q9Q33J491K059K536K603K396K780M096N241M972L701K835
59643E90421K621J940L07j326k215k958m226n366n335m357l637l701l911l606
59629E54651k988k649k689k566j828q33n43j405k681l302l238l314l807m058l707
59614E15043l413l752m193l829k701j572p58K6Q29J275J266J227J474J852K119
59599E04893K252K131J424J21j039j200l84N08Q16Q51J201J673J492M73o39j173
59583E13400j288j397j450j258j071j161j186p12j42k67j024j522j371j084j050
$$ y = [635131, 636083, 636579, 637011, 637211, 636454, 634532, 632278, 630770, 630391, 630873, 631768, 632531, 632484, 631182, 628751, 625597, 621846, 617255, 611679, 605377, 598844, 592488, 586547, 581188, 576528, 572489, 568833, 565430, 562395, 559852, 557739, 556023, 554967, 554878, 555711, 557202, 559261, 561797, 564400, 566796, 569576, 573672, 578913, 583885, 587586, 590421, 593042, 594982, 595289, 593963, 591748, 588790, 584564, 579198, 573863, 569506, 565869, 562168, 558257, 554651, 551663, 549014, 546325, 543759, 541931, 541098, 540555, 539150, 536469, 533167, 529929, 526615, 522808, 518750, 515043, 511630, 507878, 503685, 499856, 497155, 495583, 494825, 494851, 495680, 496955, 498221, 499448, 500922, 502774, 504893, 507145, 509276, 510700, 510821, 509782, 508582, 508198, 508706, 509522, 510373, 511574, 513247, 514739, 515212, 514573, 513400, 512112, 510715, 509265, 508007, 506936, 505775, 504589, 503877, 503735, 503468, 502444, 500922, 499551, 498467, 497417]
59568D97417r47n74l96p27r97n52K79O70N62O89J305J620R00l66r30l02O52Q24
59550D99127J57n73r05r90q14L5J552L013L950M824O212P892R323J0600J2220
59535E55623J4344J6751J8814J8931J5035P102j550o975q416q077p583o559m682
59522F02758k910j855o75J279L107L753L606L521L178J712o21k657l797m360m753
59507F01286n239o140p422q308q168p499p306p676p841p447o910o483n768m415
59493E04664k741j390o73l95j83J30M15N94R08J534K008J638O21Q8P21J912K701
59476E12552K925K952K848K565K517L211M405N289N385M858M064L299K843K710
59462E62423K466J715P25J38J84N61J095J982L276M590N507O091O701P402P772
$$ y = [497417, 496470, 495896, 495500, 494773, 493776, 493224, 493503, 494173, 494735, 495424, 496729, 498349, 499249, 498883, 497953, 497651, 498303, 499127, 499284, 498711, 497806, 496816, 496002, 496037, 497589, 500602, 504552, 509376, 515588, 523480, 532803, 543403, 555623, 569967, 586718, 605532, 624463, 639498, 646600, 645050, 638075, 629659, 621582, 613999, 607440, 602758, 599848, 597993, 597318, 598597, 601704, 605457, 609063, 612584, 615762, 617474, 616853, 614196, 610399, 606039, 601286, 596047, 589907, 582485, 574177, 566009, 558510, 551204, 543528, 535687, 528240, 521330, 514847, 509079, 504664, 501923, 500533, 499860, 499465, 499282, 499412, 499827, 500421, 501329, 502863, 504871, 506509, 507130, 507218, 507939, 509851, 512552, 515477, 518429, 521277, 523842, 526359, 529570, 533975, 539264, 544649, 549507, 553571, 556870, 559713, 562423, 564889, 566604, 567329, 567467, 567651, 568212, 569307, 571289, 574565, 579155, 584662, 590753, 597454, 604856, 612628]
59447F12628P475O762O178N788N140M028K754J351p65l692o237p103o573o011
59433F21723n938n758n254n051n290n112l984k488j238RJ544L008M176N633P859
59418F03839J0333J2331J3973J5786J7795J9749K1651K3519K5082K6192K6589
59407H16839K4847J8796Q313l146j1182j4317j4237j2859j0566p032k344K850
59395G95962P127Q221M455l228j1498j7337k0014k0424j9504j7818j5937j4349
59383F75656j2992j1286q821n904l397j863r36K08J679K695K698K176J922K005
59369F43840K003J928K145K600K738K239J396P66O87J148J848K515L237M237N285
59354F78612N814N827O175P467R188J0363J0786J1099J1927J3287J4646J5320
$$ y = [612628, 620103, 626865, 633043, 638831, 643971, 647999, 650753, 652104, 651339, 647647, 641410, 634307, 627734, 621723, 615785, 610027, 604773, 599722, 594432, 589320, 585336, 582848, 581610, 581619, 583163, 586171, 590347, 595980, 603839, 614172, 626503, 640476, 656262, 674057, 693806, 715457, 738976, 764058, 790250, 816839, 841686, 860482, 868795, 865649, 854467, 840150, 825913, 813054, 802488, 795456, 793112, 795962, 803089, 811310, 815765, 812537, 801039, 783702, 763688, 743264, 723760, 705942, 690005, 675656, 662664, 651378, 642557, 636653, 633256, 631393, 630457, 630665, 632344, 635039, 637737, 639913, 641835, 643840, 645843, 647771, 649916, 652516, 655254, 657493, 658889, 659655, 660342, 661490, 663338, 665853, 669090, 673327, 678612, 684426, 690253, 696428, 703895, 713083, 723446, 734232, 745331, 757258, 770545, 785191, 800511]
59342H00511J5100J4627J4725J5263J5227J4058J2178J0093P790N334L071P67
59330I28744k387o313r621j1415j2482j3838j5074j5323j4879j4560j4209j3237
59318G85406j2065j1595j1611j1116j0001r080q568p886o883o035n409m596l675
59305F76886l112k662j464O50K991N188P500R781J1107J0657Q154L577k593q765
59291G17895j3079j5078j5692j5551j4363j2125r729p926o586n367m215k880r39
59278E94365J271K632K715K533L257M855O548P983R369J0836J2292J3597J4571
59265F86824J5006J4917J4450J3512J1819R545P320N403L302N57k474m955o497
59252G68729p464q388r288r630r044p953p112o514n363l422j661j004j035o96
$$ y = [800511, 815611, 830238, 844963, 860226, 875453, 889511, 901689, 911782, 919572, 924906, 927977, 928744, 926357, 920044, 910423, 899008, 886526, 872688, 857614, 842291, 827412, 812852, 798643, 785406, 773341, 761746, 750135, 739019, 729018, 719938, 711370, 703484, 696601, 690566, 685157, 680561, 676886, 673774, 671112, 669648, 670298, 673289, 678477, 685977, 695758, 706865, 717522, 725676, 729253, 726660, 717895, 704816, 689738, 674046, 658495, 644132, 632007, 622278, 614352, 607766, 602399, 598184, 595304, 594365, 595636, 598268, 600983, 603516, 606773, 611628, 618176, 626159, 635528, 646364, 658656, 672253, 686824, 701830, 716747, 731197, 744709, 756528, 766073, 773393, 778796, 782098, 782655, 780181, 775226, 768729, 761265, 752877, 743589, 733959, 724915, 716962, 709850, 703336, 697973, 694551, 692890, 691886, 690851, 690155]
59238F90155J75R92J656K669M027N030N253M962M515M022L592L297K891K151J363
59223G36750Q31J17j427l615n650p268q770j0063j0574j0174r299q242p079o269
59209F49268o352o997p249o795o128n462m423k995j874j562j805k127k270k046
59195E91183j392p07m87o05n22q4M85J160J908K219J777J356J989L443M560M970
59179F11253N326N910O236O079N755N336M709M367M850N483N118M119M059N191
59165F83791N983N644N314N914O427N528L658K215J553R53j01j596l465n447o943
59150G09428p649q030q652r459j0079j0302j0021r213q290p787p601p227o773
59137E98345o800p067o652n509m674m573m422l736l095k808k139p40N33J111J771
$$ y = [690155, 690330, 691322, 692978, 695647, 699674, 704704, 709957, 714919, 719434, 723456, 727048, 730345, 733236, 735387, 736750, 737581, 737698, 736271, 732656, 727006, 719738, 710968, 700905, 690331, 680157, 670858, 662616, 655537, 649268, 642916, 635919, 628670, 621875, 615747, 610285, 605862, 602867, 600993, 599431, 597626, 595499, 593229, 591183, 589791, 589084, 588597, 587992, 587470, 587386, 587871, 589031, 590939, 593158, 594935, 596291, 598280, 601723, 606283, 611253, 616579, 622489, 628725, 634804, 640559, 645895, 650604, 654971, 659821, 665304, 670422, 674541, 678600, 683791, 689774, 695418, 700732, 706646, 713073, 718601, 722259, 724474, 726027, 726980, 726879, 725283, 721818, 716371, 709428, 701779, 693749, 685097, 675638, 665559, 655257, 645236, 636023, 627733, 619946, 612345, 605118, 598345, 591545, 584478, 577826, 572317, 567643, 563070, 558648, 554912, 551817, 549009, 546870, 546130, 546663, 547774, 549545]
59122E49545L125M310M429M243N033O603P849Q614R539J0498J0679J0028R395
59109F43890R241R180Q775P998O978N987N528N685N658M599K764J144J96m00r31
59094G16292j359j726k179k545k454j924j415j274j398j439j182p95q43j791l373
59079F90595m668n014m668m482n063o191o883o362n155m771n751o710o171m692
59065F14014l886l865l350k159j708k658l782l854l202k643k236j882j889k167
59051E74733k004j368j197j731j917j261q17j319j767j126o5L48N20J287K049
59036E64365J627L26m62k56K63O67J098J502J643J671J846K120K702M309O987
59021E90408R524J1067J2371J4226J5645J5203J3425J2057J1349R913P179M258
$$ y = [549545, 552670, 556980, 561409, 565652, 570685, 577288, 585137, 593751, 603290, 613788, 624467, 634495, 643890, 653131, 662311, 671086, 679084, 686062, 692049, 697577, 703262, 708920, 713519, 716283, 717427, 717623, 717223, 716292, 714933, 713207, 711028, 708483, 706029, 704105, 702690, 701416, 700018, 698579, 697397, 696602, 695759, 693968, 690595, 685927, 680913, 676245, 671763, 666700, 660509, 653626, 647264, 642109, 637338, 631587, 624877, 618706, 614014, 610128, 606263, 602913, 600754, 599046, 596388, 592606, 588752, 585550, 582907, 580671, 578789, 576900, 574733, 572729, 571361, 570164, 568433, 566516, 565255, 564438, 563119, 561352, 560226, 560161, 560509, 561029, 562316, 564365, 565992, 566318, 565856, 565600, 565863, 566530, 567628, 569130, 570773, 572444, 574290, 576410, 579112, 583421, 590408, 599932, 610999, 623370, 637596, 653241, 668444, 681869, 693926, 705275, 715188, 722367, 726625]
59009G26625K115L62j658l701n063n475n170m536l859l082j905l29J229K560L778
58994G01891M581M269L069K390K901L442K821J728J571K243K429J557J35j375
58980G33652k652l021k136q07J7O22J692K865L460M041N639P847R401J0289J1485
58965G82394J2880J3319J2761J2487J2911J2969J2082J1075J0527R696P818N223
58953I16142K451n92l903o812q916j0759j2937j5186j6860j7701j7678j6748j5227
58940G75274j3834j2921j2109j1004r724q479p169n773m666m122l809l078j652
58927F76934J37J677K580K902K831K276J132r3n98m46o53j701k777l025k751k622
58911F75803k429j676p07j85J07R15K264L539M543N557O676P839R238J0862J2079
$$ y = [726625, 728740, 729102, 727444, 723743, 718680, 713205, 708035, 703499, 699640, 696558, 694653, 694324, 695553, 698113, 701891, 706472, 710741, 713810, 716200, 719101, 722543, 725364, 727092, 728663, 730906, 733335, 734892, 735027, 733652, 731000, 727979, 725843, 725036, 725053, 725675, 727367, 730232, 733692, 737733, 743372, 751219, 760620, 770909, 782394, 795274, 808593, 821354, 833841, 846752, 859721, 871803, 882878, 893405, 903101, 910919, 916142, 918593, 918001, 914098, 907286, 898370, 887611, 874674, 859488, 842628, 824927, 807249, 790501, 775274, 761440, 748519, 736410, 725406, 715682, 707203, 700034, 694261, 689595, 685473, 681664, 678586, 676934, 677071, 678748, 681328, 684230, 687061, 689337, 690469, 690376, 689778, 689332, 688679, 686978, 684201, 681176, 678425, 675803, 673374, 671698, 670991, 670806, 670913, 671828, 674092, 677631, 682174, 687731, 694407, 702246, 711484, 722346, 734425]
58896G34425J2451J2463J2665J2667J2021J1410J1819J2983J3921J4551J5593
58885H76969J7186J8811K0254K1443K1673K0256J7767J5417J3367J0845P606M154
58873A065748O24l244p221j0663j3304j5087j5654j5066j4409j4363j3864j1686
58861I31811q810p421p915q709q832q864r335r937j0578j1500j2147j1590j0184
58848H05989r289r149q669p523o677o535o284n623n447o135o725o568o413p043
58834G07909q022q575q678q601q264p668p139o713o018n056m237l493k270n77
58820F22598R19J936K724L238L258L231L769M352L927K773K313K954L601L502
58806F65095L114K847K378J562O53m67j949k914k372j280j701l748n336n449n478
$$ y = [734425, 746876, 759339, 772004, 784671, 796692, 808102, 819921, 832904, 846825, 861376, 876969, 894155, 912966, 933220, 954663, 976336, 996592, 1014359, 1029776, 1043143, 1053988, 1061594, 1065748, 1066372, 1063128, 1055907, 1045244, 1031940, 1016853, 1001199, 986133, 971724, 957361, 943497, 931811, 923001, 915580, 907665, 898956, 890124, 881260, 871925, 861988, 851410, 839910, 827763, 816173, 805989, 796700, 787551, 778882, 771359, 764682, 758147, 751863, 746240, 740793, 734658, 727933, 721365, 714952, 707909, 699887, 691312, 682634, 674033, 665769, 658101, 650962, 644249, 638231, 633175, 628938, 625445, 623175, 622598, 623517, 625453, 628177, 631415, 634673, 637904, 641673, 646025, 649952, 652725, 655038, 657992, 661593, 665095, 668209, 671056, 673434, 674996, 675649, 675182, 673233, 670319, 667947, 666667, 664966, 661218, 655882, 650433, 644955]
58791F44955o507p483p146n992n001m073k976k358k467k150n14J579K870L558
58777F06295M503N513N674M792L467K220J271N48m83k271m132m804m351m210m879
58762F09153n080m024k908l027l772l806l135k661k404j600o6J606K874L538L608
58747E88296L411L381L369K854K059J990K968M087M543M544M533M517M622N244
58733F40418O228O825O846O778O655O035N279N350O032N976M936M213M357M270
58719G20198L397K881L528M385M546M691N524O286O193N907O214O511N998N074
58705G91333M205K726K08k311l955n658q579j1971j4280j5443j6477j7527j7950
58692F84321j7666j6978j5681j3684j1887j1090j0619r341p430n940n202m789
$$ y = [644955, 638448, 630965, 623819, 617827, 612826, 608753, 605777, 603419, 600952, 598802, 598288, 599867, 602737, 606295, 610798, 616311, 621985, 626777, 630244, 632464, 633735, 634283, 633800, 631529, 627397, 622593, 618242, 614032, 609153, 604073, 600049, 597141, 594114, 590342, 586536, 583401, 580740, 578336, 576736, 576670, 578276, 581150, 584688, 588296, 591707, 595088, 598457, 601311, 603370, 605360, 608328, 612415, 616958, 621502, 626035, 630552, 635174, 640418, 646646, 653471, 660317, 667095, 673750, 679785, 685064, 690414, 696446, 702422, 707358, 711571, 715928, 720198, 723595, 726476, 730004, 734389, 738935, 743626, 749150, 755436, 761629, 767536, 773750, 780261, 786259, 791333, 795538, 798264, 798472, 796161, 792206, 786548, 777969, 765998, 751718, 736275, 719798, 702271, 684321, 666655, 649677, 633996, 620312, 608425, 597335, 586716, 577375, 569945, 564005, 558803, 554014]
58680E54014m563m623m688m519m434m584m385l434k257j373n28M83J188J418J849
58665E19564K804L779M870P122J0386J2450J1756R556P877O709M857K323j8k071
58651F01964m084n424n484n031n041n103m513l944m251m627l848k530k157k576
58637E43351k464j737j380j259k99J336K253K086J943K341K466J824J157J141
58623E52759J351R75r8j250j690j090K7P73J142K045L854N782P241Q568R730R682
58607E99801Q104O411N734N225L727J895R78P00R1n83n52l20p87j367r03K22P24
58590F29100N89P35J085R36P70J712L472M712N343O552Q639J0553J1553J1843
58576F97594J1545J0497R106Q078P377O577N933N912O175O295O916Q763J1082
$$ y = [554014, 549451, 544828, 540140, 535621, 531187, 526603, 522218, 518784, 516527, 515154, 514626, 515109, 516297, 517715, 519564, 522368, 526147, 531017, 538139, 548525, 560975, 572731, 582287, 590164, 596873, 601730, 604053, 604035, 601964, 597880, 592456, 586972, 581941, 576900, 571797, 567284, 563340, 559089, 554462, 550614, 548084, 545927, 543351, 540887, 539150, 537770, 536511, 536212, 537548, 539801, 541887, 543830, 546171, 548637, 550461, 551618, 552759, 554110, 555085, 554987, 553737, 552047, 550957, 550984, 551757, 552899, 554944, 558798, 564580, 571821, 580389, 590119, 599801, 607905, 614316, 620050, 625275, 629002, 630897, 631875, 632575, 632666, 632083, 631531, 631211, 630424, 629057, 628154, 628376, 629100, 629689, 630424, 631509, 632445, 633215, 634927, 638399, 643111, 648454, 655006, 663645, 674198, 685751, 697594, 709139, 719636, 728742, 736820, 744197, 750774, 756707, 762619, 768794, 775089, 782005, 790768, 801850]
58563H01850J2645J3838J6080J9519K2886K5419K7311K8496K8491K7309K5234
58552A049078K1922J6968J1046N319K08m103o760p279o746o510o407n830n628
58539A055278p059r603j1794j3634j6200j9214k1235k1929k2211k2222k1142j8975
58527H50060j6726j4766j2662j0520q976p872o502m928l735k885k168k204l368
58514G52748m400l912k682k518l382l699l066k526k405k019j446j519k119k263
58500G14792j885j731j702j111l52m17r67q29j56j15o21l69Q89K145L060M204
58484G14835N389N798N752O494Q151R662J0737J2104J3886J5439J6688J7970J8733
58471H61638J8044J6135J3850J0993O938K354j485m529p291r123r203q442q182
$$ y = [801850, 814495, 828333, 844413, 863932, 886818, 912237, 939548, 968044, 996535, 1023844, 1049078, 1071000, 1087968, 1099014, 1104333, 1104541, 1100438, 1093678, 1086399, 1079653, 1073143, 1066736, 1060906, 1055278, 1048219, 1038616, 1026822, 1013188, 996988, 977774, 956539, 934610, 912399, 890177, 869035, 850060, 833334, 818568, 805906, 795386, 786410, 778538, 772036, 767108, 763373, 760488, 758320, 756116, 752748, 748348, 744436, 741754, 739236, 735854, 732155, 729089, 726563, 724158, 722139, 720693, 719174, 717055, 714792, 712907, 711176, 709474, 708363, 708011, 707594, 706627, 705798, 705642, 705527, 704906, 704537, 705426, 707571, 710631, 714835, 720224, 726022, 731774, 738268, 746419, 756081, 766818, 778922, 792808, 808247, 824935, 842905, 861638, 879682, 895817, 909667, 920660, 927598, 929952, 928467, 923938, 916647, 907524, 898321, 889879, 881697]
58458H81697p756n665k488j5J837M513P793J0067J1299J2835J4382J4049J1425
58445I53973P947M267m9m354p193q794j0629j2460j2594j0967r203p661n353k753
58431H74177j549j394p5K736M963N741O468P702Q180P667P785R045R823R209Q241
58416I58719P506O037L503J044q57l033n574p351q090q653q994q204o766o282
58402I13005o697o416n237m527m362l447j923j246j123L30L005M641M569M444
58388H95016M889M657L612L258L686L235J750R19R96M70m91J33K433M261N316
58373I34140P698J1553J3982J3605J2518J2494J2672J2246J2096J2456J2168J1330
58361A078958J1631J3210J4344J4776J5909J7321J6879J4890J4077J4801J4403
$$ y = [881697, 873941, 868276, 865788, 865773, 867610, 872123, 879916, 889983, 901282, 914117, 928499, 942548, 953973, 961920, 966187, 966138, 961784, 954591, 945797, 935168, 922708, 910114, 899147, 889944, 882283, 876930, 874177, 872628, 871234, 871159, 873895, 878858, 884599, 891067, 898769, 906949, 914616, 922401, 931446, 941269, 950478, 958719, 966225, 972262, 975765, 976809, 975952, 972919, 967345, 959994, 951904, 943251, 934257, 926053, 919287, 913005, 906308, 899892, 894655, 890128, 885766, 882319, 880396, 879150, 878027, 878357, 881362, 886003, 890572, 895016, 899905, 904562, 908174, 911432, 915118, 918353, 920103, 921022, 922018, 922488, 921997, 922130, 924563, 928824, 934140, 941838, 953391, 967373, 980978, 993496, 1005990, 1018662, 1030908, 1043004, 1055460, 1067628, 1078958, 1090589, 1103799, 1118143, 1132919, 1148828, 1166149, 1183028, 1197918, 1211995, 1226796, 1241199]
58350A241199J2038R798Q313N835K681J795L509M540L671L694O000Q072Q287Q590
58336A328022J0265J1637J1973J3263J5990J7648J7454J8063K0558K2305K1805
58325A508983K1063K1069J9769J6639J4391J3842J2138Q347N765O130O737N910
58313A660783O093Q658J0911J1210J1912J4309J5848J5346J5630J8028J9671J9292
58301A827691J9943K2788K4210K2590K1807K4119K5787K4067K2386K4008K6405
58290B085801K6659K6735K8616K9874K8874K8767L1546L3916L3767L4736L9283
58279B428574M3470M4026M4412M8209N2574N4084N5093N8220O0570N9532N8430
58268C007194O0257O1753N9975N8602O1196O4407O4562O4868O9149P4576P7503
$$ y = [1241199, 1253237, 1263035, 1271348, 1277183, 1279864, 1281659, 1285168, 1289708, 1293379, 1297073, 1303073, 1311145, 1319432, 1328022, 1338287, 1349924, 1361897, 1375160, 1391150, 1408798, 1426252, 1444315, 1464873, 1487178, 1508983, 1530046, 1551115, 1570884, 1587523, 1601914, 1615756, 1627894, 1636241, 1642006, 1648136, 1654873, 1660783, 1666876, 1675534, 1686445, 1697655, 1709567, 1723876, 1739724, 1755070, 1770700, 1788728, 1808399, 1827691, 1847634, 1870422, 1894632, 1917222, 1939029, 1963148, 1988935, 2013002, 2035388, 2059396, 2085801, 2112460, 2139195, 2167811, 2197685, 2226559, 2255326, 2286872, 2320788, 2354555, 2389291, 2428574, 2472044, 2516070, 2560482, 2608691, 2661265, 2715349, 2770442, 2828662, 2889232, 2948764, 3007194, 3067451, 3129204, 3189179, 3247781, 3308977, 3373384, 3437946, 3502814, 3571963, 3646539, 3724042]
58257C724042Q0290Q5428Q9391Q9381Q9569R3359R6512R5389R4660R8850J03865
58246D740736J05445J08118J16648J26356J31661J36552J46541J57831J64988
58237E934876J71782J83609J96621K05367K13779K27423K42487K53847K66038
58228G895829K84469L04179L19505L36144L60937L88838M13293M39840M75349
58219A1218383N14040N49303N88655O41008P00063P57487Q20989R01078R92065
58210A7683071J085800J191788J322727J473276J635736J822761K050079K311673
58202C0576911K599190K930978L333872L814346M380990N078189N963097P070735
58194F5748308Q442450J0164792J2332087J4994510J8189175K1966068K6270069
$$ y = [3724042, 3804332, 3889760, 3979151, 4068532, 4158101, 4251460, 4347972, 4443361, 4538021, 4636871, 4740736, 4846181, 4954299, 5070947, 5197303, 5328964, 5465516, 5612057, 5769888, 5934876, 6106658, 6290267, 6486888, 6692255, 6906034, 7133457, 7375944, 7629791, 7895829, 8180298, 8484477, 8803982, 9140126, 9501063, 9889901, 10303194, 10743034, 11218383, 11732423, 12281726, 12870381, 13511389, 14211452, 14968939, 15789928, 16691006, 17683071, 18768871, 19960659, 21283386, 22756662, 24392398, 26215159, 28265238, 30576911, 33176101, 36107079, 39440951, 43255297, 47636287, 52714476, 58677573, 65748308, 74190758, 84355550, 96687637, 111682147, 129871322, 151837390, 178107459]
58187A78107459L0777727L4883785L7762879L8322205L5259053K7657018J5919383
58180C98689509K077482j1101531k1510650k8394442l2020819l3041363l2169843
58173B42528343l0105882k7426872k4492490k1505495j8629045j5995190j3655770
58166I0717599j1605857r844152q368257p138659o099091n221122m493979l888558
58158C4057924l368282k921864k552159k244028j972932j734523j537360j374916
58150A6351860j230285j100403r91699q98912q10383p27883o60432o04467n49291
58141H778105m96202m53852m20242l86892l55516l33466l17501k98328k76824
58132E439282k60252k46775k28961k08774j94225j84406j71918j57193j46836
$$ y = [178107459, 208885186, 243768971, 281531850, 319854055, 355113108, 382770126, 398689509, 400766991, 389665460, 368154810, 339760368, 307739549, 274698186, 242528343, 212422461, 184995589, 160503099, 138997604, 120368559, 104373369, 90717599, 79111742, 69267590, 60899333, 53760674, 47661583, 42440461, 37946482, 34057924, 30689642, 27767778, 25215619, 22971591, 20998659, 19264136, 17726776, 16351860, 15121575, 14021172, 13029473, 12130561, 11320178, 10592295, 9931863, 9327396, 8778105, 8281903, 7828051, 7407809, 7020917, 6665401, 6331935, 6014434, 5716106, 5439282, 5179030, 4932255, 4703294, 4494520, 4300295, 4115889, 3943971, 3786778, 3639942]
58123C639942j40450j32065j22190j16120j12561j05771r6832r1453q8856q3769
58113B549875p7214p4450p4373p1505o6454o4115o3568o0062n5049n3975n5726
58102A833384n4411n0216m8617m9908m9234m6176m4773m4683m1521l5671l1938
58091A336236l0656k7603k2610j9901j9844j8410j5013j3295j3918j3819j2752
58080A128415j3657j6383j7730j7523j8306j9480j8333j6174j6737j9140j9194
58069I35758j7089j6755j8116j7290j4349j3459j5022j4844j1909r962j0411j0276
58057G66276q442p622q657q853p448p137q745r596q573p775p934p090m917l763
58043F59724m306m649m368n049o290n850m293m602o683p099n068l727m506n136
$$ y = [3639942, 3499492, 3367427, 3245237, 3129117, 3016556, 2910785, 2813953, 2722500, 2633644, 2549875, 2472661, 2398211, 2323838, 2252333, 2185879, 2121764, 2058196, 1998134, 1943085, 1889110, 1833384, 1778973, 1728757, 1680140, 1630232, 1580998, 1534822, 1490049, 1445366, 1403845, 1368174, 1336236, 1305580, 1277977, 1255367, 1235466, 1215622, 1197212, 1182199, 1168904, 1154986, 1141167, 1128415, 1114758, 1098375, 1080645, 1063122, 1044816, 1025336, 1007003, 990829, 974092, 954952, 935758, 918669, 901914, 883798, 866508, 852159, 838700, 823678, 808834, 796925, 786963, 776552, 766276, 757834, 750212, 741555, 732702, 725254, 718117, 709372, 699776, 691203, 683428, 675494, 668404, 663487, 659724, 655418, 650769, 646401, 641352, 635062, 629212, 624919, 620317, 613634, 606535, 601467, 597740, 593234, 588098]
58029E88098m502m679o659q437q858r325j0302j0059q194o700o360n749m711n067
58015D88496o792p242n389l276k254j268K0Pj674k985k735k058j757j093j1L12
57999D50301j18R5J110J791K395M203O444O897N788N619O841P137N498L485K029
57984E09515L97j204j513j185k307m506n173m029l666m864n304l999l059l742
57970D65361m397l777l078l229l289k866l079l861l359j283J76p8m53K26J019
57955D34033J325K053L071K573K83j543j591j241j711k258k299k552k847j661
57941D25635J034L155L754M138M921N040M679N863Q882J1238J1591J1559J2195
57928E13684J1884R522O696M768K651n03l193m162m619n830o875o743o383o836
$$ y = [588098, 583596, 578917, 572258, 563821, 554963, 545638, 535336, 525277, 517083, 510383, 504023, 498274, 493563, 488496, 481704, 474462, 469073, 465797, 463543, 462275, 462295, 462302, 460628, 457643, 454908, 452850, 451093, 450000, 449989, 450301, 450183, 450278, 451388, 453179, 455574, 459777, 466221, 473118, 478906, 484525, 491366, 498503, 504001, 507486, 509515, 509912, 508708, 507195, 506010, 503703, 499197, 494024, 489995, 486329, 481465, 476161, 472162, 469103, 465361, 460964, 457187, 454109, 450880, 447591, 444725, 441646, 437785, 434426, 433143, 433319, 433241, 432788, 433014, 434033, 435358, 437411, 440482, 443055, 443338, 441795, 440204, 438963, 437252, 434994, 432695, 430143, 427296, 425635, 426669, 429824, 433578, 437716, 442637, 447677, 452356, 458219, 467101, 478339, 489930, 501489, 513684, 525568, 535090, 541786, 546554, 549205, 548702, 545509, 541347, 536728, 530898, 524023, 517280, 510897, 504061]
57914E04061p341p029o428n840m434k290j039j041m84J222J989O91n86kJ022N95
57898D73066l35oR48R86N42R28J854K270K360K604K285Q66m55m82N6n0m73l96
57880D86568j77k88j14O43Q78o5j064j205j387k410l231k906k468k995l503k727
57864D63549j442r68q00K28J694K499K876L630M486M925N561O931Q119Q193P880
57849E17361Q092Q136P055N541M719M131K732Q90l56j055j850k656l292m324n853
57834E39271o662o034n157n246n582n019m054l683l444k470j260o55j56R41J900
57819D92690J814J379J647K151K050J933K530K806J398j007k761l751m778n437
57805D92664m861l755l498l794l396k580k678l522l576k432j224o21k03J98K39
$$ y = [504061, 496720, 489691, 483263, 477423, 472989, 470699, 469660, 468619, 468135, 469357, 471346, 472037, 471451, 471449, 472471, 473066, 472731, 472725, 473673, 474659, 475201, 476129, 477983, 480253, 482613, 485217, 487502, 488368, 487913, 487431, 487487, 487437, 486964, 486568, 486391, 486103, 485989, 486632, 487510, 487445, 486381, 485176, 483789, 481379, 478148, 475242, 472774, 469779, 466276, 463549, 462107, 461139, 460339, 460567, 462261, 464760, 467636, 471266, 475752, 480677, 486238, 493169, 501288, 509481, 517361, 525453, 533589, 540644, 546185, 550904, 555035, 557767, 558657, 558301, 557246, 555396, 552740, 549448, 545124, 539271, 532609, 526575, 521418, 516172, 510590, 505571, 501517, 497834, 494390, 491920, 490660, 490005, 489849, 490790, 492690, 494504, 495883, 497530, 499681, 501731, 503664, 506194, 509000, 510398, 509391, 506630, 502879, 498101, 492664, 487803, 484048, 480550, 476756, 473360, 470780, 468102, 464580, 461004, 458572, 457348, 456727, 456524, 456722, 456961]
57790D56961Q8K96P86J229K027L561N011N383N324O317Q451J0471J1655J2176
57776E29736J2007J1017R915R606R821R601Q807P849O494M332J989L80p89k354
57762F18411l968m625m579n092o365p272p091o304n621n318n426n683n467m559
57748E41041l512k640j448J07R53O54O09K004L696L910L077K964L743M071L617
57733E62846L412L814M154M311M883N673N761N103M566M329L758K882K486K644
57719F20622K521J769R10L21J5J85P92Q92l26k065k804k342j670j249q92r04j688
57702F14087k477k163j186r41j399j177J31J443K095K503K725K127R19L78R98
57687F18063J862K149K055J873J537J356J990L306M465N361O761Q892J1156J3524
$$ y = [456961, 457049, 457345, 458131, 459360, 461387, 464948, 469959, 475342, 480666, 486983, 495434, 505905, 517560, 529736, 541743, 552760, 562675, 572281, 582102, 591703, 600510, 608359, 614853, 619185, 621174, 621554, 620765, 618411, 614443, 609818, 605239, 600147, 593782, 586510, 579419, 573115, 567494, 562176, 556750, 551067, 545600, 541041, 537529, 534889, 533441, 533548, 534501, 535155, 535764, 537768, 541464, 545374, 548451, 551415, 555158, 559229, 562846, 566258, 570072, 574226, 578537, 583420, 589093, 594854, 599957, 604523, 608852, 612610, 615492, 617978, 620622, 623143, 624912, 625822, 626143, 626158, 626343, 627135, 628027, 627701, 625636, 622832, 620490, 618820, 617571, 616679, 615775, 614087, 611610, 609447, 608261, 607320, 605921, 604744, 604875, 606318, 608413, 610916, 613641, 615768, 616687, 617065, 618063, 619925, 622074, 624129, 626002, 627539, 628895, 630885, 634191, 638656, 644017, 650778, 659670, 670826, 684350]
57673F84350J6806K1204K5932L0742L6642M4530N3970O3477P0962P3672O8875
57662A191162N5422L4454Q923j6789l7600n0085n4699n4657n2465m8593m3194
57651I31879l7328l1936k6998k2293j8001j4136j0457p254n235m329l595k520
57639G47797j427m77N91J669K336K832L744M616M339L122K586L363M093L544K433
57624G85161K151K705K955K285J124K10q4R8L19M03O60J209J387O62j72K00J736
57607H03009L054L365L251L357L517L541L720M087M025L176K053J366J288J607
57593H44416K122K688L310M059M579M108K615J420J722L022L987M277M388M286
57579H90999L660L145L669M817N325N003M634M257L280K159K123L113L784L627
$$ y = [684350, 701156, 722360, 748292, 779034, 815676, 860206, 914176, 977653, 1048615, 1122287, 1191162, 1246584, 1281038, 1289961, 1273172, 1235572, 1185487, 1130788, 1076131, 1023666, 975073, 931879, 894551, 862615, 835617, 813324, 795323, 781187, 770730, 763476, 758241, 753912, 750317, 747797, 746370, 745893, 746484, 748153, 750489, 753321, 757065, 761681, 766020, 769142, 771728, 775091, 779184, 782728, 785161, 787312, 790017, 792972, 795257, 796381, 796591, 796507, 796605, 796924, 797327, 797987, 799196, 800583, 801245, 801073, 801273, 803009, 806063, 809428, 812679, 816036, 819553, 823094, 826814, 830901, 834926, 838102, 840155, 841521, 842809, 844416, 846538, 849226, 852536, 856595, 861174, 865282, 867897, 869317, 871039, 874061, 878048, 882325, 886713, 890999, 894659, 897804, 901473, 906290, 911615, 916618, 921252, 925509, 928789, 930948, 933071, 936184, 939968, 943595]
57565I43595L363L211K708K335L196M808N342M623M575N962P073O666O035O696
57551A010188P981Q544Q568Q825Q929Q201P179O691O399N664M977N161N903O357
57537A109567O527O896P396P734Q089Q536Q534P871P302P341P291O445N396N110
57523A210035N489N934O542P686Q987R788J0171J0584J1001J1185J1323J1631
57511A320356J1957J2251J2799J3449J3560J3222J3466J4604J5523J5367J4755
57500A471309J4401J3882J2922J2512J3311J4051J3188J1279J0098J0061J0130
57489A607144R797R546R636R817J0130J0684J0922J0290R381R244R744R861R423
57476A735619R316R931J0573J0512R846R199R163J0028J1401J2311J2219J1648
$$ y = [943595, 946958, 950169, 952877, 955212, 958408, 963216, 968558, 973181, 977756, 983718, 990791, 997457, 1003492, 1010188, 1018169, 1026713, 1035281, 1044106, 1053035, 1061236, 1068415, 1075106, 1081505, 1087169, 1092146, 1097307, 1103210, 1109567, 1116094, 1122990, 1130386, 1138120, 1146209, 1154745, 1163279, 1171150, 1178452, 1185793, 1193084, 1199529, 1204925, 1210035, 1215524, 1221458, 1228000, 1235686, 1244673, 1254461, 1264632, 1275216, 1286217, 1297402, 1308725, 1320356, 1332313, 1344564, 1357363, 1370812, 1384372, 1397594, 1411060, 1425664, 1441187, 1456554, 1471309, 1485710, 1499592, 1512514, 1525026, 1538337, 1552388, 1565576, 1576855, 1586953, 1597014, 1607144, 1616941, 1626487, 1636123, 1645940, 1656070, 1666754, 1677676, 1687966, 1697347, 1706591, 1716335, 1726196, 1735619, 1744935, 1754866, 1765439, 1775951, 1785797, 1794996, 1804159, 1814187, 1825588, 1837899, 1850118, 1861766]
57464A861766J1316J1169J0882J0750J1205J1957J2458J2822J3377J3756J3364
57453A994822J2472J1921J2022J2456J2941J3278J3141J2594J2428J3241J4468
57442B135784J5090J4862J4293J3936J4287J5639J7321J7883J6929J5898J6081
57431B308003J6829J6932J6718J7265J8263J8436J7686J7107J7085J7003J6708
57420B498035J6714J6962J6939J7010J8022J9463J9648J8227J6923J7180J8334
57409B693457J8907J8714J8701J9370K0183K0333J9639J8742J8510J9095J9775
57398B905426K0003K0143K0715K1383K1521K1253K1149K1241K1305K1689K2757
57387C138585K3893K4186K3859K3823K4132K4196K4281K5200K6511K6681K5382
$$ y = [1861766, 1873082, 1884251, 1895133, 1905883, 1917088, 1929045, 1941503, 1954325, 1967702, 1981458, 1994822, 2007294, 2019215, 2031237, 2043693, 2056634, 2069912, 2083053, 2095647, 2108075, 2121316, 2135784, 2150874, 2165736, 2180029, 2193965, 2208252, 2223891, 2241212, 2259095, 2276024, 2291922, 2308003, 2324832, 2341764, 2358482, 2375747, 2394010, 2412446, 2430132, 2447239, 2464324, 2481327, 2498035, 2514749, 2531711, 2548650, 2565660, 2583682, 2603145, 2622793, 2641020, 2657943, 2675123, 2693457, 2712364, 2731078, 2749779, 2769149, 2789332, 2809665, 2829304, 2848046, 2866556, 2885651, 2905426, 2925429, 2945572, 2966287, 2987670, 3009191, 3030444, 3051593, 3072834, 3094139, 3115828, 3138585, 3162478, 3186664, 3210523, 3234346, 3258478, 3282674, 3306955, 3332155, 3358666, 3385347, 3410729]
57376C410729K4135K4096K4569K4400K3672K3246K3477K4112K4781K5026K4514
57365C676757K3700K3579K4428K5363K5496K4911K4246K4039K4627K5907K6972
57354C950025K6830K5791K5286K6059K7412K8473K9193K9648K9513K8856K8537
57343D255623K9016K9607K9613K9394K9628L0194L0610L0956L1465L1803L1602
57332D589511L1281L1440L1839L1846L1551L1499L1549L1003K9783K8655K8140
57321D928097K8064K8277K8962K9919L0378L0019K9613K9963L0616L0429K9274
57310E253611K8302K8387K9066K9497K9708L0200L0707L0381K9114K7804K7181
57299E573958K7128K7376K7939K8572K8671K8222K8048K8509K8824K8434K8215
$$ y = [3410729, 3434864, 3458960, 3483529, 3507929, 3531601, 3554847, 3578324, 3602436, 3627217, 3652243, 3676757, 3700457, 3724036, 3748464, 3773827, 3799323, 3824234, 3848480, 3872519, 3897146, 3923053, 3950025, 3976855, 4002646, 4027932, 4053991, 4081403, 4109876, 4139069, 4168717, 4198230, 4227086, 4255623, 4284639, 4314246, 4343859, 4373253, 4402881, 4433075, 4463685, 4494641, 4526106, 4557909, 4589511, 4620792, 4652232, 4684071, 4715917, 4747468, 4778967, 4810516, 4841519, 4871302, 4899957, 4928097, 4956161, 4984438, 5013400, 5043319, 5073697, 5103716, 5133329, 5163292, 5193908, 5224337, 5253611, 5281913, 5310300, 5339366, 5368863, 5398571, 5428771, 5459478, 5489859, 5518973, 5546777, 5573958, 5601086, 5628462, 5656401, 5684973, 5713644, 5741866, 5769914, 5798423, 5827247, 5855681, 5883896]
57288E883896K9291L1324L3084L4263L5461L6666L7117L6658L6125L6209L6854
57277F266948L7844L9034L9949M0093L9820L9971M0543M0598L9690L8442L7474
57266F700406L6641L5680L4774L4064L3327L2496L1876L1568L1243L0761L0412
57255G063248L0352L0375L0375L0410L0228K9431K8295K7609K7490K7159K6170
57244G381142K5084K4553K4438K4190K3522K2410K0993J9809J9460J9807J9988
57233G625396J9470J8522J7576J6814J6542J7162J8520J9930K1052K2097K3120
57222G836201K3921K4711K5911K7152K7509K6990K6581K6475K5575K3313K0750
57211H115089J9035J7884J6541J5214J4436J3950J3385J3312J4394J5996J6893
$$ y = [5883896, 5913187, 5944511, 5977595, 6011858, 6047319, 6083985, 6121102, 6157760, 6193885, 6230094, 6266948, 6304792, 6343826, 6383775, 6423868, 6463688, 6503659, 6544202, 6584800, 6624490, 6662932, 6700406, 6737047, 6772727, 6807501, 6841565, 6874892, 6907388, 6939264, 6970832, 7002075, 7032836, 7063248, 7093600, 7123975, 7154350, 7184760, 7214988, 7244419, 7272714, 7300323, 7327813, 7354972, 7381142, 7406226, 7430779, 7455217, 7479407, 7502929, 7525339, 7546332, 7566141, 7585601, 7605408, 7625396, 7644866, 7663388, 7680964, 7697778, 7714320, 7731482, 7750002, 7769932, 7790984, 7813081, 7836201, 7860122, 7884833, 7910744, 7937896, 7965405, 7992395, 8018976, 8045451, 8071026, 8094339, 8115089, 8134124, 8152008, 8168549, 8183763, 8198199, 8212149, 8225534, 8238846, 8253240, 8269236, 8286129]
57200H286129J6981J7171J7775J8177J7994J7500J6817J5641J3954J2319J1185
57189H461643J0438R773R035Q184P302O673O462O322N707M638L873M122N257O374
57175H555803O704O461O477O879O533M411J157j590l346n215q072j1463j4675
57162H550064j7901k1643k5802l0065l4481l9100m3644m8019n2433n6567n9458
57151H120951o0827o1589o2460o3013o2807o2388o2177o1485n9799n8115n7544
57140G448747n7473n6602n5144n4341n4227n3608n2117n0648m9712m8876m8041
57129F867958m7828m8478m9665n1682n5532o1391o7968p3673p7487p8546p6100
57118F179608p0376o2651n4272m6536m1310m0255m2945m6972n0307n2299n2052
$$ y = [8286129, 8303110, 8320281, 8338056, 8356233, 8374227, 8391727, 8408544, 8424185, 8438139, 8450458, 8461643, 8472081, 8481854, 8490889, 8499073, 8506375, 8513048, 8519510, 8525832, 8531539, 8536177, 8540050, 8544172, 8549429, 8555803, 8562507, 8568968, 8575445, 8582324, 8588857, 8593268, 8594425, 8592835, 8589489, 8584274, 8576202, 8564739, 8550064, 8532163, 8510520, 8484718, 8454653, 8420172, 8381072, 8337428, 8289409, 8236976, 8180409, 8120951, 8060124, 7998535, 7936075, 7873062, 7810255, 7747867, 7685690, 7624205, 7564406, 7506291, 7448747, 7391274, 7334672, 7279528, 7225187, 7170960, 7117352, 7065235, 7014587, 6964875, 6915999, 6867958, 6820130, 6771652, 6721987, 6670305, 6614773, 6553382, 6485414, 6411741, 6334254, 6255708, 6179608, 6109232, 6046581, 5992309, 5945773, 5904463, 5864208, 5821263, 5774291, 5723984, 5671685, 5619633]
57107E619633m7552l7435k2375l656J8759M5834P8262J16681J62316K16475K80108
57096F427050L54745M42999N47509O70276Q13652R80253J170264J379354J599831
57087A4385933J821943K032855K216815K359532K452233K491248K478427K425960
57079C2664946K354141K270164K143869J915239J540404J034780M68343q1592
57071D4310294n72812j003141j388302j740291k057992k326759k524501k633234
57063C0063262k649098k583082k454043k282207k086524j883148j683724j495369
57055A2946067j322280j166534j027904r04800p96100p01346o19272n47408m83563
57046E376860m26853l77053l33753k96365k64116k35807k10232j87039j66589
$$ y = [5619633, 5572081, 5534646, 5512271, 5508615, 5527374, 5573208, 5651470, 5768151, 5930467, 6146942, 6427050, 6781795, 7224794, 7772303, 8442579, 9256231, 10236484, 11406748, 12786102, 14385933, 16207876, 18240731, 20457546, 22817078, 25269311, 27760559, 30238986, 32664946, 35019087, 37289251, 39433120, 41348359, 42888763, 43923543, 44391886, 44310294, 43737482, 42734341, 41346039, 39605748, 37547756, 35220997, 32696496, 30063262, 27414164, 24831082, 22377039, 20094832, 18008308, 16125160, 14441436, 12946067, 11623787, 10457253, 9429349, 8524549, 7728449, 7027103, 6407831, 5860423, 5376860, 4950007, 4572954, 4239201, 3942836, 3678720, 3442913, 3232681, 3045642, 2879053]
57037B879053j48914j33441j19645j07219r5604q4084p2439o0810m8945l6374
57027A971578k3233j0274J357R160Q821k894k3942m7127o5350p5927p9771p8572
57015A583826p4126o8801o4407o0764n6668n1964m7673m4418m1840l9421l7035
57004I96709l4687l2478l0617k9031k7257k5237k3721k3226k3061k2129k0281
56993G04984j8098j5802j3265j0774q784p064m947k371O1K092M176O671R147J0500
56979F56526R609O131J046l943p905j1167j4031j5779j5691j4328j2907j1804
56967E65757j0608r188p678n699k809M18K859M478O424R354J2600J5168J6612
56954E97688J6540J4175R018J744n943j2257j6262j8264j9220j9494j8548j6160
$$ y = [2879053, 2730139, 2596698, 2477053, 2369834, 2274230, 2190146, 2117707, 2056897, 2007952, 1971578, 1948345, 1938071, 1939428, 1948588, 1957409, 1954515, 1930573, 1883446, 1818096, 1742169, 1662398, 1583826, 1509700, 1440899, 1376492, 1315728, 1259060, 1207096, 1159423, 1115005, 1073165, 1033744, 996709, 962022, 929544, 898927, 869896, 842639, 817402, 793681, 770455, 747394, 725265, 704984, 686886, 671084, 657819, 647045, 638261, 631197, 626250, 623879, 623940, 626032, 630208, 636879, 646026, 656526, 666135, 672266, 673312, 669369, 661464, 650297, 636266, 620487, 604796, 590468, 577561, 565757, 555149, 545961, 538283, 532584, 529775, 530193, 533052, 537530, 543954, 553308, 565908, 581076, 597688, 614228, 628403, 637421, 639165, 633222, 620965, 604703, 586439, 567219, 547725, 529177, 513017]
56942E13017j3394j1527j0364q601n657k219R62L747O177Q320J0836J4647J9573
56929E25517K3915K5698K3799J7975Q798j974j1820j8921k3087k5117k5792k5637
56917D93354k4935k3576k1292j8344j5554j3481j1972j0661r448q357p367o573
56905C21794o066n522m430k869j572j016q83o27o9P70J918L339M903O669Q882
56890C25221J1625J4757J8238K1965K5400K7899K9465L0454L0348K7598K1272
56879E84242J2539M020k164n582p087p681p702o937n356l462j669L73L329P140
56865E64003J1014J4491J8119K2910K9374L7089M4804N0827N3533N1585M3970
56854I41719L0488J2828n441k0728l1383l7590l9973l9091l5794l0968k4849j7453
$$ y = [513017, 499623, 488096, 477732, 469131, 463474, 461255, 462217, 465964, 472141, 480461, 491297, 505944, 525517, 549432, 575130, 598929, 616904, 625702, 623728, 611908, 592987, 569900, 544783, 518991, 493354, 468419, 444843, 423551, 405207, 389653, 376172, 364200, 353539, 344091, 335734, 328367, 321794, 315728, 310206, 305776, 302907, 301335, 300319, 299436, 298809, 298740, 299510, 301428, 304767, 309670, 316339, 325221, 336846, 351603, 369841, 391806, 417206, 445105, 474570, 505024, 535372, 562970, 584242, 596781, 600801, 598637, 593055, 585968, 578287, 570585, 563648, 558292, 554830, 553161, 553534, 556863, 564003, 575017, 589508, 607627, 630537, 659911, 697000, 741804, 792631, 846164, 897749, 941719, 972207, 985035, 979594, 958866, 927483, 889893, 849920, 810829, 775035, 744067, 719218, 701765]
56842G01765r549k318M040J0501J7995K6744L6845M8456O1153P3707Q4414R0851
56830A144604Q9444P6859N2813K1297j1279l9000n8346o8827p2513p2202o9378
56819I93472o4091n6479m7493l8119k8832j9975j1741l585N392J5270K5403L5691
56807H04913M6414N6483O2949O2934N5130L9488J7093q708l2573n0136o0410o4790
56795I28787o4739o1322n5864m9568m2798l5664k8898k3173j8024j2410o032O76
56783E30971P487J4479K1333K7331L1700L3381L0781K2803J0222m434j8291k9236
56771F78527l6201l9271l9510l8144l5868l2960k9748k6457k3017j9434j6197
56760C41720j3869j2484j1576j0622r348p887o743o202n839n075m148l763l804
$$ y = [701765, 692216, 689898, 693938, 704439, 722434, 749178, 786023, 834479, 895632, 969339, 1053753, 1144604, 1234048, 1310907, 1363720, 1385017, 1373738, 1334738, 1276392, 1207565, 1135052, 1062850, 993472, 929381, 872902, 825409, 787290, 758458, 738483, 726742, 723157, 728549, 743819, 769222, 804913, 851327, 907810, 970759, 1033693, 1088823, 1128311, 1145404, 1136696, 1104123, 1053987, 993577, 928787, 864048, 802726, 746862, 697294, 654496, 618832, 589934, 566761, 548737, 536327, 530295, 530971, 538458, 552937, 574270, 601601, 633301, 666682, 697463, 720266, 730488, 726054, 707763, 678527, 642326, 603055, 563545, 525401, 489533, 456573, 426825, 400368, 377351, 357917, 341720, 327851, 315367, 303791, 293169, 283821, 275934, 269191, 262989, 257150, 252075, 247927, 244164, 240360]
56747B40360l393k376j678j793j990j565q63m44k16p3l76j046j176m39J55k02
56731B22885p19l48M19M03l25p06m47j75j20N2L39M48O03J218J919J933J393J191
56713B29963J592J932J727J204O73K31R9N55J359J860J727J125L28l33l79L38
56697B44001J186J353P39j17p06p38j06P74J074N56m2j35j92p58j353j242o92
56680B43602l94j40P28J955K621K579K526K753K874K720K594K609K578K520K551
56665B74676K475K090J655J409J088O01N59J264J827J343L35j76l29q38j368j110
56649B85501n38q82k024k628k358k277k854l316l291l455m060m319l861l451l598
56634B42589l658k958j815q72k95j16l60n79k20K74j59j409k085j566q64q01p85
$$ y = [240360, 236967, 234591, 232913, 231120, 229130, 227565, 226702, 226258, 226042, 225969, 225593, 224547, 223371, 222932, 223087, 222885, 222166, 221818, 222237, 222640, 222315, 221609, 221162, 220987, 220867, 220919, 221258, 221706, 222309, 223527, 225446, 227379, 228772, 229963, 231555, 233487, 235214, 236418, 237091, 237322, 237421, 237976, 239335, 241195, 242922, 244047, 244375, 244042, 243663, 244001, 245187, 246540, 247279, 247162, 246456, 245718, 245612, 246386, 247460, 248016, 247974, 247839, 247647, 246889, 245536, 244294, 243602, 243208, 243068, 243796, 245751, 248372, 250951, 253477, 256230, 259104, 261824, 264418, 267027, 269605, 272125, 274676, 277151, 279241, 280896, 282305, 283393, 283994, 284553, 285817, 287644, 288987, 289322, 289146, 288817, 287979, 286611, 285501, 284963, 284081, 282057, 279429, 277071, 274794, 271940, 268624, 265333, 261878, 257818, 253499, 249638, 246187, 242589, 238931, 235973, 234158, 233286, 232991, 232875, 232515, 231936, 231716, 231990, 231831, 230422, 228337, 226771, 225907, 225106, 224321]
56617B24321j78M47M01J16J47n8j190k560k850j988j210j404k332l327l977m118
56601B00240l804l381l230l312l206k573j580q78r87j498j261J52J622J807R60
56586A79071M51P21R33O69O37J353K269K729K771K580K028J312J110J557J946
56571B02137J891J904K294K485K126J927K513L318L551L672M773O856Q740R573
56557B57760R632R498R087P784N298K242l31j930k913l647l865l415l038l461
56543B78701m098l863l052l039l981m326l060j107J21L65M7o85j574j886j325
56528B47238o00l71l33oM05N81O94P50J67j153k161j978j183q66j089j228j178
56511B37689j210j116n73K1N1k42j42L37N09K08K7L74R46J226J004L94k25l66
$$ y = [224321, 224143, 224590, 224991, 225107, 225254, 225196, 224006, 221446, 218596, 216608, 215398, 213994, 211662, 208335, 204358, 200240, 196436, 193055, 189825, 186513, 183307, 180734, 179154, 178276, 177289, 175791, 174530, 174682, 176304, 178111, 179071, 179522, 180243, 181176, 181845, 182482, 183835, 186104, 188833, 191604, 194184, 196212, 197524, 198634, 200191, 202137, 204028, 205932, 208226, 210711, 212837, 214764, 217277, 220595, 224146, 227818, 232591, 239447, 248187, 257760, 267392, 276890, 285977, 293761, 299059, 301301, 300970, 299040, 296127, 292480, 288615, 285200, 282162, 278701, 274603, 270740, 267688, 264649, 260668, 256342, 253282, 252175, 252296, 252661, 252708, 252023, 250449, 248563, 247238, 246638, 246267, 245934, 245928, 246333, 246914, 247608, 248358, 248525, 247372, 245211, 243233, 242050, 241184, 240095, 238867, 237689, 236479, 235363, 234790, 234811, 234862, 234620, 234478, 234815, 235324, 235532, 235559, 235933, 236879, 238105, 239109, 239503, 239278, 238912]
56493B38912P9N92N60po02q51q70j010j385j632j227k72M31M50M84J273K186J985
56475B39096P60j47k04k03n19l49P01J664J692J273J106Q52Q7n21j67O20O34l29
56457B46046j330j524q08M03J377J516J038P34P18K32q75j506q12N27J321J306
56441B48363P57k86j458j681m40J143J668J215Q00P00N12K78L52N02K14k72k90
56424B52077J74N64O65O48M95J58kK80N31J69n69r92r56q19p42o66o94q87j062
56405B48372j202j575j997j669l20J193J981K107J899J220J57m39qP97J181J284
56389B52981J448J321P48O09J482K290J677Q9q21m41M37J111J484J408P28r2m16
56372B66043k80m9M72J544K537K512J544N75J19m3j41j18Q9N17J150J628J535
$$ y = [238912, 238991, 239583, 240143, 240136, 239534, 238683, 237813, 236803, 235418, 233786, 232559, 232287, 232718, 233168, 233652, 234925, 237111, 239096, 239856, 239709, 239505, 239302, 238783, 238434, 239135, 240799, 242491, 243764, 244870, 245722, 245809, 245288, 245121, 245741, 246375, 246046, 244716, 243192, 242384, 242787, 244164, 245680, 246718, 247452, 248170, 248402, 247527, 246021, 245209, 245736, 247057, 248363, 249120, 248834, 247376, 245695, 245255, 246398, 248066, 249281, 250081, 250781, 251293, 251571, 251923, 252425, 252639, 252367, 252077, 252251, 252815, 253480, 254128, 254623, 254781, 254779, 255059, 255590, 255759, 255190, 254198, 253242, 252423, 251681, 251015, 250321, 249434, 248372, 247170, 245595, 243598, 241929, 241609, 242802, 244783, 246890, 248789, 250009, 250166, 249727, 249719, 250516, 251697, 252981, 254429, 255750, 256498, 257107, 258589, 260879, 262556, 262645, 261824, 261383, 261820, 262931, 264415, 265823, 266551, 266459, 266043, 265763, 265714, 266186, 267730, 270267, 272779, 274323, 274898, 275017, 274974, 274833, 274715, 274804, 275321, 276471, 278099, 279634]
56355B79634J223J502K200K152J159N53J101J779J702J673K534L396L163K499
56341C06270K578K983K684J993J760J549O19j98L41J586J874J154O99Q06Q37J090
56325C28625K388M118M814M471M256M149L090J348M63P25Q57L92L25J022J501
56310C62544J264J027J230J428J529K004K589K380J564J397K196K938L097L339
56296C90526M055M762N237N725N871M983L650L407M488N502N633N556N810N964
56282D61169N857O111O898P631Q234R272J0486J0790J0218J0246J1636J3353J4301
56269E86202J4743J5364J6135J6839J7751J9198K1138K3459K5989K8259L0083
56258H15160L2128L5033L8391M1702M5688N1221N7660O3941P0739P9484Q9698
$$ y = [279634, 280857, 282359, 284559, 286711, 287870, 288423, 289524, 291303, 293005, 294678, 297212, 300608, 303771, 306270, 308848, 311831, 314515, 316508, 318268, 319817, 320436, 320238, 320579, 322165, 324039, 325193, 325892, 326698, 327535, 328625, 331013, 335131, 339945, 344416, 348672, 352821, 355911, 357259, 357722, 358447, 359304, 359696, 360021, 361043, 362544, 363808, 364835, 366065, 367493, 369022, 371026, 373615, 375995, 377559, 378956, 381152, 384090, 387187, 390526, 394581, 399343, 404580, 410305, 416176, 421159, 424809, 428216, 432704, 438206, 443839, 449395, 455205, 461169, 467026, 473137, 480035, 487666, 495900, 505172, 515658, 526448, 536666, 546912, 558548, 571901, 586202, 600945, 616309, 632444, 649283, 667034, 686232, 707370, 730829, 756818, 785077, 815160, 847288, 882321, 920712, 962414, 1008102, 1059323, 1116983, 1180924, 1251663, 1331147, 1420845]
56247A420845R9424J08145J17013J26302J34815J41900J47816J51988J53105J51109
56237B752462J46809J39430J27024J09605Q9390O7554M3364J7194q424l1755n3371
56226C399282p3699r1422j05570j16884j25885j31653j33865j33930j32807j29634
56216B223933j23971j17473j11763j06344j00109r3411q7153q1119p4704o8255
56206A259631o2430n7225n2497m8418m4720m0641l6236l2465k9502k6461k3262
56195H05774k1016j9968j8747j6505j4100j2392j0921r147p437o099m904m090
56183F60448m293m989m701l228j914j350p34J56M59J96N59J639K088J598J506
56168F47440K344L105L520M536N936O135N099M797N893O824P030Q040J0164J1358
$$ y = [1420845, 1520269, 1628414, 1745427, 1871729, 2006544, 2148444, 2296260, 2448248, 2601353, 2752462, 2899271, 3038701, 3165725, 3275330, 3364720, 3432274, 3475638, 3492832, 3484408, 3452653, 3399282, 3325583, 3234161, 3128591, 3011707, 2885822, 2754169, 2620304, 2486374, 2353567, 2223933, 2099962, 1982489, 1870726, 1764382, 1664273, 1570862, 1483709, 1402590, 1327886, 1259631, 1197201, 1139976, 1087479, 1039061, 994341, 953700, 917464, 884999, 855497, 829036, 805774, 784758, 764790, 746043, 729538, 715438, 703046, 692125, 682978, 675541, 669442, 664538, 660448, 656155, 651166, 646465, 643237, 641323, 639973, 639239, 639395, 639854, 640050, 640609, 642248, 644336, 645934, 647440, 649784, 652889, 656409, 660945, 666881, 673016, 678115, 682912, 688805, 695629, 702659, 710699, 720863, 732221]
56154G32221J0829J0742J2530J4564J5379J6349J8996K2260K4691K7061L0698
56143I36320L5407M0934M8248N7524O7174P6581Q7314R9645J10428J16475J17606
56132A793656J14575J06828R4924Q2558P3281O7038O2036N7781N3839M7989L8415
56121B592920K6262J3878K261q053j5913k1552k7596l6048m6369n8079p2248q8121
56109B261342j01215j07739j08567j06406j01587r3500q3625p4022o4694n5103
56099A364884m6284l8964l1864k4331j8239j4804j2132q515n406m233l164k50
56087A156698K883L897L799M728O100O341O315P536R090R551R896J1414J2908
56074A251156J2994J2879J3923J4956J4955J5615J8005J9761J8986J7908J9004
$$ y = [732221, 743050, 753792, 766322, 780886, 796265, 812614, 831610, 853870, 878561, 905622, 936320, 971727, 1012661, 1060909, 1118433, 1185607, 1262188, 1349502, 1449147, 1559575, 1676050, 1793656, 1908231, 2015059, 2109983, 2192541, 2265822, 2332860, 2394896, 2452677, 2506516, 2554505, 2592920, 2619182, 2633060, 2635321, 2627268, 2611355, 2589803, 2562207, 2526159, 2479790, 2421711, 2349463, 2261342, 2160127, 2052388, 1943821, 1837415, 1735828, 1642328, 1558703, 1484681, 1419987, 1364884, 1318600, 1279636, 1247772, 1223441, 1205202, 1190398, 1178266, 1169751, 1164345, 1160112, 1156948, 1156698, 1159581, 1163478, 1167277, 1172005, 1178105, 1184446, 1190761, 1198297, 1207387, 1216938, 1226834, 1238248, 1251156, 1264150, 1277029, 1290952, 1305908, 1320863, 1336478, 1354483, 1374244, 1393230, 1411138, 1430142]
56063A430142K0613K0280J9405K0356K1953K2066K1901K3348K4881K4409K3403
56052A672757K3825K3991K1974K0079K1081K3105K3162K2762K4779K7709K8502
56041A933726K8335L0110L2923L4479L6339M0975M6257M8620M9260N1349N3684
56030B386057N3121N0932N0620N1695N1464N0729N1803N3370N3239N3514N7016
56019B963560O1449O3284O4302O7975P2642P5136P7589Q3401Q9903R2681R3839
56008C805761R8154J04383J08426J11632J17615J24350J28151J31923J40416J50854
55998E021665J57723J63107J72536J84345J93408K01650K14090K28267K38777
55989F775568K48504K63749K82194K97812L13546L36170L62849L86425M09884
$$ y = [1430142, 1450755, 1471035, 1490440, 1510796, 1532749, 1554815, 1576716, 1600064, 1624945, 1649354, 1672757, 1696582, 1720573, 1742547, 1762626, 1783707, 1806812, 1829974, 1852736, 1877515, 1905224, 1933726, 1962061, 1992171, 2025094, 2059573, 2095912, 2136887, 2183144, 2231764, 2281024, 2332373, 2386057, 2439178, 2490110, 2540730, 2592425, 2643889, 2694618, 2746421, 2799791, 2853030, 2906544, 2963560, 3025009, 3088293, 3152595, 3220570, 3293212, 3368348, 3445937, 3529338, 3619241, 3711922, 3805761, 3903915, 4008298, 4116724, 4228356, 4345971, 4470321, 4598472, 4730395, 4870811, 5021665, 5179388, 5342495, 5515031, 5699376, 5892784, 6094434, 6308524, 6536791, 6775568, 7024072, 7287821, 7570015, 7867827, 8181373, 8517543, 8880392, 9266817, 9676701]
55980I676701M41172M77967N12804N49037N95594O50178P04685P62979Q35206
55971A5206323R18969J005485J100100J216168J353184J503048J673268J880245
55963B5856790K124543K398886K715753L099718L559155M098184M751830N575928
55955E4180787O610211P891540R495127J1514807J4008511J7011155K0571361
55948A41283499K4667433K9041207L3142794L6180022L7089271L4552310K7503916
55941C63460452J6100817K254967j1083460k1461762k7955399l0988803l1503690
55934B58823122l0370754k8262313k5669861k2896445k0105454j7421696j4960133
55927I9136466j2779958j0879683r247495p876656o736416n775044m958986m277852
$$ y = [9676701, 10117873, 10595840, 11108644, 11657681, 12253275, 12903453, 13608138, 14371117, 15206323, 16125292, 17130777, 18230877, 19447045, 20800229, 22303277, 23976545, 25856790, 27981333, 30380219, 33095972, 36195690, 39754845, 43853029, 48604859, 54180787, 60790998, 68682538, 78177665, 89692472, 103700983, 120712138, 141283499, 165950932, 194992139, 228134933, 264314955, 301404226, 335956536, 363460452, 379561269, 381816236, 370732776, 349271014, 321315615, 290326812, 258823122, 228452368, 200190055, 174520194, 151623749, 131518295, 114096599, 99136466, 86356508, 75476825, 66229330, 58352674, 51616258, 45841214, 40882228, 36604376]
55919C6604376l712150l229018k810805k457981k162187j903003j672352j476845
55911A7180035j314195j170186j040138r31445q43065p62952o87683o25337n76760
55902I228274n31998m87424m49450m19037l88672l56987l31079l11841k91360
55893E660426k67314k46354k30799k14968j97063j82251j71511j59216j44147
55884C846803j31807j23689j15121j05666j00972j01971j02470r9662r7338r6693
55874B771414r3648q7541q3240q2202q0128p5617p2613p2179p0142o5138o1085
55863A927881n9590n7447n3583n1079n0489m8453m4569m2499m2615m0731l5765
55852A401061l1551k9485k6524k2106j9983k1114k1682k0132j9566k1151k1803
$$ y = [36604376, 32892226, 29663208, 26852403, 24394422, 22232235, 20329232, 18656880, 17180035, 15865840, 14695654, 13655516, 12724071, 11881006, 11118054, 10430371, 9805034, 9228274, 8696276, 8208852, 7759402, 7340365, 6951693, 6594706, 6263627, 5951786, 5660426, 5393112, 5146758, 4915959, 4700991, 4503928, 4321677, 4150166, 3990950, 3846803, 3714996, 3591307, 3476186, 3370520, 3269548, 3167577, 3065107, 2965445, 2868107, 2771414, 2677766, 2590225, 2506985, 2424783, 2344655, 2269038, 2196425, 2124246, 2054104, 1988966, 1927881, 1868291, 1810844, 1757261, 1706182, 1655693, 1607240, 1562671, 1520172, 1477557, 1436826, 1401061, 1369510, 1340025, 1313501, 1291395, 1271412, 1250298, 1228616, 1208484, 1188918, 1167767, 1145964]
55841A145964k0487k0314k2230k2843k0872j9580k0528k0749j8560j6563j6437
55830I26801j6208j4861j4417j5148j4055j0375p695q280j0000j0860j1831j3346
55818G79725j3669j2646j2571j3677j3296j0985r680j0302j0120q099o758p045
55806F50877o380l806k078k471k393k84J717K275L310N664O928N967N179N806
55792F70311N444K695N8n27r26k892m801m903m362m547m799n069p217j1420j4844
55777F12201j5965j6632j7875j7624j4886j2165j1262j0335p697m952l706k774
55765D76328j267r77k940m889m861m140m115l517j417L33M31O61K317L367K037
55750D57351J36l43q68l410o526p784p644p814p945p028o035o161o427n672m952
$$ y = [1145964, 1125477, 1105163, 1082933, 1060090, 1039218, 1019638, 999110, 978361, 959801, 943238, 926801, 910593, 895732, 881315, 866167, 852112, 841737, 834042, 825762, 815762, 804902, 793071, 779725, 766056, 753410, 740839, 727162, 713866, 702881, 693201, 682899, 672779, 664680, 657922, 650877, 644497, 640691, 638613, 636142, 633749, 633465, 635182, 637457, 640767, 646431, 653359, 659326, 664505, 670311, 675755, 678450, 678508, 677981, 677055, 674163, 669362, 664459, 660097, 655550, 650751, 645682, 638465, 627045, 612201, 596236, 579604, 561729, 544105, 529219, 517054, 505792, 495457, 487760, 482808, 479102, 476328, 475061, 474084, 471144, 466255, 461394, 457254, 453139, 449622, 448205, 448538, 448969, 449630, 451947, 455314, 457351, 457487, 457144, 456276, 452866, 446340, 438556, 430912, 423098, 415153, 408125, 402090, 395929, 389502, 383830, 378878]
55735C78878n406n785m740l403l154k923j443q2o02k036k570k752m013n659o085
55720C28225n551n307n287m937m768m999m272j929J80L92p3P17K276L054L111
55705C00832L153K653J302N69J418K204J137q72k205l404n427o952o364m890m709
55690B78445n258m463k471j189r12l48N67O80L2j23N10J185J779K643L354L366
55674B77797L289L785M015K910J115n4o64j380j743j107l62p19j630j742j104
55659B82406o69m00K64R17Q66N15N64O87N23P87J847K416J507L77O22J522J321
55642B96072R0q19j221j916k813l271l617m563n691o219o407o698o418n070l775
55627B37664l694m083l746l200l449l807l060j778j265j156k95Q95J119N76M01
$$ y = [378878, 373472, 367687, 362947, 359544, 356390, 353467, 352024, 351942, 351340, 349304, 346734, 343982, 339969, 334310, 328225, 322674, 317367, 312080, 307143, 302375, 297376, 293104, 291175, 291355, 291747, 291674, 292391, 294667, 297721, 300832, 303985, 306638, 307940, 308509, 309927, 312131, 313268, 312396, 310191, 306787, 301360, 294408, 288044, 283154, 278445, 273187, 268724, 266253, 265064, 264152, 263804, 264371, 265051, 265083, 264960, 265470, 266655, 268434, 271077, 274431, 277797, 281086, 284871, 288886, 291796, 292911, 292857, 292193, 290813, 289070, 287963, 287601, 286882, 285252, 283510, 282406, 281737, 281337, 281601, 282518, 283384, 283899, 284463, 285150, 285673, 286460, 288307, 290723, 292230, 292607, 293229, 294751, 296072, 296162, 295343, 294122, 292206, 289393, 286122, 282505, 277942, 272251, 266032, 259625, 252927, 246509, 241439, 237664, 233970, 229887, 226141, 222941, 219492, 215685, 212625, 210847, 209582, 208426, 208131, 209026, 210145, 210721, 211122]
55612B11122M45k64j407j896j881k298k989l158l096l491l813l274k557k561k408
55597A76474r28P97Q43l15n93K00K86r08k044k336k360k353j847j068p30n11M15
55580A63022J538J672J163J341K071K039J337J477K827M149M831N497O229O267
55566B05460N646N234M902L505J007j205k349k941l375l495l688m661n938o261
55552A91841n529m772m268l408k407k194k519k095q30r4m52q77n25K60J013J690
55536A64834J935J388Q04J330K603L202K897K677K577J519m29j716j712j599k255
55521A78055l020l186l064k969k628k190k351k960k908j945j196j375j893k198
55507A44172k496k690k061o94J85o6o31o93n58p31j016j126j160j011k87P76J335
$$ y = [211122, 211567, 211303, 209896, 208000, 206119, 203821, 200832, 197674, 194578, 191087, 187274, 184000, 181443, 178882, 176474, 175546, 176343, 177186, 176871, 176278, 176478, 176764, 175856, 173812, 171476, 169116, 166763, 164916, 163848, 163118, 162607, 163022, 164560, 166232, 167395, 168736, 170807, 172846, 174183, 175660, 178487, 182636, 187467, 192964, 199193, 205460, 211106, 216340, 221242, 224747, 225754, 224549, 222200, 219259, 215884, 212389, 208701, 204040, 198102, 191841, 186312, 181540, 177272, 173864, 171457, 169263, 166744, 164649, 163819, 163725, 163273, 162396, 161871, 162131, 163144, 164834, 166769, 168157, 168961, 170291, 172894, 176096, 178993, 181670, 184247, 185766, 185337, 183621, 181909, 180310, 178055, 175035, 171849, 168785, 165816, 163188, 160998, 158647, 155687, 152779, 150834, 149638, 148263, 146370, 144172, 141676, 138986, 136925, 136231, 136416, 136350, 135719, 135026, 134468, 133737, 132721, 131595, 130435, 129424, 129137, 129913, 131248]
55490A31248J138P28L32l11r19p34N1L15l07r56j067j023j038p67l77o36j472
55473A24205j765j101m17l73l93P1N40N07L35M90P29P02N50M31J90j28j63P1J47
55454A24628J0OJ01o1l12j60K26K43MJ42N11L40l13n54r9M93R47J416J549Q70
55434A29987J9M2N64L34m51l52O76R45j73j216j068m85k97l0O06O64l90j460j500
55415A26415j070r74p32K94J360J325L74n04r88j316j391j094q88j161j443j015
55399A17192J12J374K333K691K341J755J638J883J658Q33K62L27K98k74p69o65
55383A32989m94q18j222j110o72l82k74k90n81r53q63l81k70p05r09m89p3j29
55365A22374k81l58q99j880k131r27Q25J776J684J075L42j58l6L45Pj050j472
$$ y = [131248, 132386, 133114, 133446, 133135, 132216, 131482, 131533, 131848, 131541, 130585, 129518, 128495, 127457, 126690, 126313, 125677, 124205, 122440, 121339, 120922, 120549, 120156, 120227, 120767, 121274, 121609, 122099, 122828, 123530, 124080, 124511, 124701, 124573, 124410, 124481, 124628, 124638, 124644, 124745, 124684, 124372, 124212, 124438, 124681, 124685, 124827, 125338, 125678, 125365, 124811, 124712, 125205, 126152, 127568, 129117, 129987, 130006, 130048, 130612, 130946, 130495, 130143, 130819, 131764, 131591, 130375, 129307, 128822, 128525, 128495, 129101, 129765, 129375, 127915, 126415, 125345, 124371, 123639, 123933, 125293, 126618, 126992, 126488, 125500, 124184, 122793, 121699, 120811, 119650, 118207, 117192, 117304, 118678, 121011, 123702, 126043, 127798, 129436, 131319, 132977, 133810, 134072, 134399, 134697, 134423, 133654, 132989, 132495, 131677, 130455, 129345, 128673, 128291, 128017, 127727, 127146, 126193, 125330, 124949, 124679, 123974, 123065, 122576, 122503, 122374, 122093, 121735, 120836, 118956, 116825, 115898, 116723, 118499, 120183, 121258, 121600, 121442, 121406, 121751, 121758, 120708, 119236]
55348A19236m63R39J400J065P94O31R2o56r70o93j85J32j48j136k083j942r07
55331A15106l47p37q80J95J693K326K084J800J818J926J876J301qj240j083L00
55315A26130J084L02q12q54k58j00l00k86k98o50p30j21L13j86p94m92R6j89r36
55296A20919r29l32l05r17j087l87N89J412J988J817N66q74j262q18p83j407j808
55279A16382j684j562j331j31J884L156K664J190M0n18q79r91m49N97J357J213
55263A20938L86l00k98J10L10K50L70O85O63K14j6K30L05j51m36L1N55J97p23
55244A23320j188j065r74r98n91K95J000J082P28L20J38L45O95O05j5l94QN90
55226A23901M63k75r00j213j477j587j257o99k98Q6O87J080P46J21J15P39J091
$$ y = [119236, 118773, 119712, 121112, 122177, 122971, 123602, 123694, 123038, 122068, 121375, 121190, 121322, 121174, 120038, 117955, 116013, 115106, 114759, 114022, 113142, 113337, 115030, 117356, 119440, 121240, 123058, 124984, 126860, 128161, 128153, 126913, 125830, 126130, 127214, 127516, 126704, 125850, 125592, 125492, 125192, 124906, 124608, 123958, 123228, 123107, 123420, 123234, 122440, 121948, 122044, 121855, 120919, 119990, 119658, 119353, 118436, 117349, 116962, 117551, 118963, 120951, 122768, 123334, 122460, 121198, 120380, 119597, 118190, 116382, 114698, 113136, 111805, 111674, 113558, 116714, 119378, 120568, 120608, 120090, 119211, 118220, 117771, 118368, 119725, 120938, 121324, 121024, 120726, 120836, 121146, 121396, 121766, 122451, 123114, 123328, 123312, 123542, 123847, 123696, 123260, 123291, 123846, 124043, 123320, 122132, 121067, 120093, 119095, 118504, 118799, 119799, 120881, 121609, 121929, 122067, 122412, 123107, 123712, 123697, 123303, 123311, 123901, 124364, 124089, 123189, 121976, 120499, 118912, 117655, 116956, 116658, 116744, 117431, 118511, 119257, 119378, 119493, 120232, 121323]
55209A21323O80o1n12m74q3L35M17J88P3J97J41j90j86L88P21K11l60J4Q56R15
55189A24593J46l35j23km55q62n21L11Q00M10o27j419j108J24J095J043N86O29
55171A24285R78Q63L60K22N93R19R39Q82P41K67l33n60l46n1J85L87L24j03l83
55152A30169n6L47jq58j149m67N63J341J774J760J091K2p74r90q77p59q58j371
55134A28907k075k104q95Q03J591J003j70j009j223r76o35n78p60o28j7L39j22
55117A21451p33m88L94Q07M30O3L69J095J584J414O27r9J19J200J761P67r57j762
55099A28042j221j95O63J294J471R23J30j00J87L08J51J36J55k71q56p85m9N20
55081A30503O04O97R37P90J14m12k76K71P44R19P17K88J48N50Q88N25j18j23M89
$$ y = [121323, 122003, 121942, 121430, 120956, 120873, 121208, 121625, 121813, 121886, 122083, 122224, 122034, 121848, 122236, 122957, 123168, 122808, 122822, 123678, 124593, 124739, 124404, 124281, 124279, 123824, 122962, 122441, 122752, 123552, 123962, 123335, 121916, 120808, 120932, 122027, 123070, 123656, 124285, 125263, 126126, 126486, 126708, 127301, 128220, 129159, 130041, 130782, 131049, 130716, 130156, 129810, 129759, 129944, 130331, 130655, 130552, 130169, 130113, 130460, 130459, 129601, 128452, 127985, 128548, 129889, 131663, 133423, 134514, 134536, 133762, 132772, 131895, 131136, 130278, 128907, 126832, 124728, 123833, 124636, 126227, 127230, 127060, 126051, 124828, 123852, 123217, 122639, 121879, 121251, 121234, 121573, 121451, 120718, 120230, 120624, 121431, 121861, 121924, 122293, 123388, 124972, 126386, 127013, 126914, 127033, 128233, 129994, 130761, 129804, 128042, 126821, 126626, 127289, 128583, 130054, 130977, 131107, 131007, 131194, 131502, 131653, 131789, 131944, 131673, 130817, 130032, 129983, 130503, 131107, 131804, 132741, 133531, 133645, 133233, 132957, 133228, 133972, 134891, 135608, 135896, 136044, 136594, 137482, 138007, 137889, 137766, 138255]
55062A38255R01P74M11j38r83j651j542r57n85k91L47P36M1r65o53Q46J621Q13
55044A36980l03n55m36p03j035r83r13j045p54K72J197J239P49L16k02r29j190
55027A31705m82N26Q53M55j50q14j526j812j251j98O42R91R04L39n32j104r32
55010A27614k70L72P96R14N39k45r10j062q22m06J86Q59J318J483J599J722J674
54993A35361J518J540J622J372Q68N84M70J8o78q71l96k0j49j78L80J047J185
54976A43673R37P61O60M24J33j6j5J11L14L13q9m51j55N49P71L06j82l16l26k16
54956A47186K47N70j19j452j887q65M46R97J112J225Q74r3o94k91K53m3p31r66
54938A45769j016j450j748j126n8M16L35M92R20J053J027J453K132K273J925J939
$$ y = [138255, 139156, 139930, 140341, 140203, 139220, 137569, 136027, 135070, 134485, 134194, 134541, 135277, 135318, 134353, 133700, 134546, 136167, 136980, 136677, 136122, 135686, 134983, 133948, 132965, 132052, 131007, 130253, 130525, 131722, 132961, 133710, 134026, 133824, 132895, 131705, 131223, 131749, 132602, 133057, 132907, 132093, 130567, 128755, 127504, 127306, 127948, 128939, 129843, 130182, 129650, 128546, 127614, 127344, 127716, 128512, 129426, 129965, 129720, 128810, 127748, 126926, 126520, 126706, 127565, 128883, 130366, 131965, 133687, 135361, 136879, 138419, 140041, 141413, 142281, 142865, 143335, 143353, 142675, 141804, 141408, 141388, 141239, 141061, 141441, 142488, 143673, 144610, 145371, 146031, 146455, 146588, 146572, 146557, 146668, 146982, 147295, 147206, 146755, 146600, 147149, 147920, 148226, 148044, 147728, 147402, 147186, 147433, 148003, 147884, 146432, 144545, 143680, 144126, 145123, 146235, 147460, 148334, 148241, 147547, 147256, 147509, 147466, 146735, 145769, 144753, 143303, 141555, 140429, 140371, 140787, 141122, 141614, 142534, 143587, 144614, 146067, 148199, 150472, 152397, 154336]
54922A54336K493K831K657K727L682N117O179O549O507O396O276N896M938L414
54908B19998J675k6j692l181m137m579n056n790o231n914n193m596l983l077k266
54893A65952k123k403k331j708j052p58p08o20l31K13Q91J422J679J791J804J666
54877A63384J690K415L723M802N360O073P268Q015P308N579M040L069K129Q88
54863B25743o11k492m779o633o992n989m889m486m375l933l240k685k341k120
54849A70178k129k447k789k739k261j843k014k735l241k756j352K1M77l6q67j367
54833A42100j323r88p27n27k8P74J183O67j95m31l3J96N8J04L93K65l75p43n28
54814A39842m37q30r46k30O79R93R18Q82O32j5l48K11R78R05N6p22j010q22j06
$$ y = [154336, 156829, 159660, 162317, 165044, 168726, 173843, 180022, 186571, 193078, 199474, 205750, 211646, 216584, 219998, 221673, 221647, 219955, 216774, 212637, 208058, 203002, 197212, 190981, 185067, 179874, 175278, 171295, 168218, 165952, 163829, 161426, 159095, 157387, 156335, 155577, 154869, 154249, 153918, 154131, 155022, 156444, 158123, 159914, 161718, 163384, 165074, 167489, 171212, 176014, 181374, 187447, 194715, 202730, 210038, 215617, 219657, 222726, 224855, 225743, 225132, 222640, 217861, 211228, 204236, 198247, 193358, 188872, 184497, 180564, 177324, 174639, 172298, 170178, 168049, 165602, 162813, 160074, 157813, 155970, 153956, 151221, 147980, 145224, 143872, 143893, 144370, 144334, 143467, 142100, 140777, 139789, 139062, 138535, 138507, 139281, 140464, 141131, 140936, 140505, 140472, 140668, 140726, 140830, 141223, 141488, 141113, 140370, 139842, 139405, 138575, 137629, 137399, 138078, 139071, 139989, 140871, 141503, 141488, 141140, 141351, 142329, 143234, 143290, 142568, 141558, 140736, 140630]
54795A40630Q37J051J22r35r02K6Q51J324J801K101J769J073N83J67n19r26l35
54778A48718P06J002N54M20Q87J176J061J343K370L309L422L034K814K955L385
54763A77156M164N189O008O246N866N030M081L484L234K584R77j016k418l181
54749B17404l999n053n890o355o597o289m967l186k153k104k055j415p66p07r60
54734A64908j022q76o68l86k69o83j284j093J86J620K287K318K330K515K841L524
54718A76248M644N780O567P138P518P039N085K192k96j656k411l436m836n913
54704B03663o075n558n125n111n054m383l198k048j177n16k71q67k182l303l387
54689A55408k498j383o13k43j38l34q48j299j110l22J98j97q95p36K93R60N45
$$ y = [140630, 141467, 142518, 142640, 141705, 140803, 140829, 141680, 143004, 144805, 146906, 148675, 149748, 150331, 150498, 149979, 149053, 148718, 149424, 150426, 150980, 151400, 152287, 153463, 154524, 155867, 158237, 161546, 164968, 168002, 170816, 173771, 177156, 181320, 186509, 192517, 198763, 204629, 209659, 213740, 217224, 220458, 223042, 224019, 223003, 220585, 217404, 213405, 208352, 202462, 196107, 189510, 183221, 178254, 175068, 172915, 170811, 168756, 167341, 166575, 165868, 164908, 163886, 163010, 162342, 161956, 161687, 161004, 159720, 158627, 158813, 160433, 162720, 165038, 167368, 169883, 172724, 176248, 180892, 186672, 193239, 200377, 207895, 214934, 220019, 222211, 221915, 220259, 217848, 214412, 209576, 203663, 197588, 192030, 186905, 181794, 176740, 172357, 169159, 167111, 165934, 165418, 165147, 164280, 162098, 158795, 155408, 152910, 151527, 150914, 150671, 150533, 150199, 149351, 148052, 146942, 146620, 146818, 146621, 145726, 144990, 145283, 146243, 146788]
54672A46788k18m17k55l54n73m00K3J70R1K02M06K59k21n84o58n51k06M03Q19
54653A44724N84n2m56m58l01j49j69o28j255j077K79J665J712O85p9r7m4l67p67
54634A43750r26p16J21J486K338J749L55m44m80p26j330j345n35P6j11m09j90
54617A42663J28M7j51j16j01l24m73l49k76m17m17p5L28O15R13J074P23O9k35
54598A43626j83m22r87j096n15kN1K54R95J688J825J730J619J017j32q23m21J64
54580A48388k14j216j590r60o2M07L21j63o93p32j25O59J143J344J303P86j27
54563A48469q10r89j174j611j569m67J046J956K265K543K629J882M84n65o96k47
54547A53146K35M67K76k85p12m80K38Q14J045J251J496J353N78m02q58m88L72
$$ y = [146788, 146570, 146153, 145898, 145544, 144971, 144571, 144594, 144764, 144855, 145057, 145463, 145722, 145501, 144917, 144259, 143708, 143502, 143905, 144724, 145308, 145256, 144800, 144342, 144041, 143892, 143723, 143095, 141840, 140763, 141042, 142707, 144419, 145104, 145025, 144928, 144884, 144517, 143750, 142824, 142108, 142229, 143715, 146053, 147802, 148157, 147713, 147233, 146507, 145177, 143832, 143297, 143373, 143262, 142853, 142663, 142791, 142838, 142687, 142571, 142470, 142146, 141673, 141324, 141048, 140631, 140214, 140139, 140467, 141082, 141995, 143069, 143792, 143861, 143626, 143443, 143021, 142034, 140938, 140423, 140421, 140472, 140726, 141721, 143409, 145234, 146964, 148583, 149600, 149468, 148645, 148224, 148388, 148174, 146958, 145368, 144408, 144346, 144753, 145074, 144911, 144218, 143486, 143361, 144020, 145163, 146507, 147810, 148596, 148469, 147659, 146670, 145496, 143885, 142316, 141849, 142895, 144851, 147116, 149659, 152288, 154170, 154654, 154089, 153393, 153146, 153381, 153848, 154124, 153839, 153127, 152647, 152885, 153699, 154744, 155995, 157491, 158844, 159422, 159020, 158162, 157674, 158046]
54530A58046J079J196P60Q9o37j393k003k206j998j573r06J12J064J139K00q06
54514A52163q91j23O49Q65P11O61Q66R65N28k35m89J13P13K87q26j331q13j74
54496A53639j12k51o9K36L47M44P16Q98Q12O81N89K49k85m93l05l34p85j057q53
54477A54067p24r05o76L61J348J423J004Q68Q21M30K55J024K104K174J148K47
54461A64969K04N26N71L61J96J56J19j29p22j266j002J14J006P83r3o30o83o77
54443A63803n48n4L93K90R5M99R61L44j142j971j435m53N2K77O19P47K88l46n16
54424A61903k44L6J33J41J10Q8J90M40P62J141J468J347N61l19m38J61N05K4o87
54405A67322p48o3P74J302J516J608J692J653J235M44j80o5O78J325J360Q52Q8
$$ y = [158046, 159125, 160321, 161081, 161170, 160533, 159140, 157137, 154931, 152933, 151360, 150454, 150566, 151630, 152769, 152969, 152163, 151272, 151149, 151798, 152663, 153374, 154035, 154901, 155866, 156394, 156159, 155670, 155783, 156496, 156783, 155957, 154626, 153813, 153639, 153527, 153276, 153207, 153443, 153790, 154234, 154950, 155848, 156660, 157341, 157930, 158179, 157894, 157401, 157096, 156762, 155977, 154920, 154067, 153343, 152438, 151762, 152123, 153471, 154894, 155898, 156766, 157587, 158017, 158272, 159296, 161400, 163574, 164722, 164969, 165173, 165699, 166270, 166631, 166827, 166983, 167102, 166973, 166251, 164985, 163983, 164097, 165103, 165886, 165793, 165163, 164480, 163803, 163255, 163201, 163594, 163884, 163979, 164478, 165439, 165783, 164641, 162670, 161235, 160782, 160834, 161111, 161730, 162477, 162765, 162419, 161903, 161659, 161695, 161828, 161969, 162079, 162167, 162357, 162797, 163559, 164700, 166168, 167515, 168076, 167757, 167319, 167480, 167985, 168009, 167322, 166574, 166511, 167285, 168587, 170103, 171711, 173403, 175056, 176291, 176735, 176555, 176490, 177168, 178493, 179853, 180705, 180793]
54388A80793o86j179j131o88k71j2L89J112J907K347K135J155l71j689k004j310
54372A80497m73k15l59k28M68J322J727J494J001P75R45J185J285J476K007K648
54356A95555L004L135L386L675L448K391Q19p12j898k667l006l006k885k832k874
54341A95533k896k722k242j589j112j075j397j806k096k125j786j172n99k90j70
54326A72456j07j23k21k10O1M83Q45J028Q71K43n66r06n61j35l05r56j453j478
54308A68966j167p00j89J65K34J55R6o4m25o74m01L61J186J676J611R33m9p13
54290A71001p09l36o5N2J74K44J22r9k58l08p5P17J839K465K161J453R97O89J87
54271A80251k60k69o0n5j11M6P9l40o46j34O69N96l05o52K71J566K013J483O30
$$ y = [180793, 180107, 178928, 177797, 177109, 176838, 176826, 177215, 178327, 180234, 182581, 184716, 185871, 185500, 183811, 181807, 180497, 180024, 179809, 179450, 179222, 179690, 181012, 182739, 184233, 185234, 186009, 186954, 188139, 189424, 190900, 192907, 195555, 198559, 201694, 205080, 208755, 212203, 214594, 215413, 214701, 212803, 210136, 207130, 204124, 201239, 198407, 195533, 192637, 189915, 187673, 186084, 184972, 183897, 182500, 180694, 178598, 176473, 174687, 173515, 172916, 172626, 172456, 172349, 172226, 172005, 171795, 171856, 172339, 173184, 174212, 175083, 175326, 174760, 173854, 173293, 173158, 172853, 171897, 170444, 168966, 167799, 167099, 166910, 167075, 167309, 167464, 167560, 167496, 167071, 166397, 165996, 166357, 167543, 169219, 170830, 171763, 171714, 171001, 170292, 169956, 169891, 169943, 170117, 170361, 170483, 170384, 170126, 169818, 169743, 170460, 172299, 174764, 176925, 178378, 179375, 180064, 180251, 179991, 179722, 179662, 179607, 179496, 179542, 179621, 179281, 178635, 178501, 179170, 179766, 179461, 178809, 179080, 180646, 182659, 184142, 184772]
54252A84772l0k30J31P79J063O16k76j012j219q97m26l03n77p06m11k92r68j856
54234A78158j748n26N90O18j94j037j366q86L43J497J527N53n9N38J581J902J476
54217A82967J043P91L20l63p14n60m25p40j170j089m62N9n6n29p01m40k89n64
54199A77078p95m15L48P76O06J39m18j061j499j255l78M42P33P30Q64J123J185
54182A78203Q78K90l60q41j023r66q29o70m37q6L80Q33R47M97j98m65r9M41Q55
54163A77350J381K014K067J137j13q32j137j542j782j248j95M60M50K82K30J43
54147A78665J16L32L46l75j265j077L20J645J873J251M70k06o54o57l42j53j77
54130A80112j32o6k15j97N67J601J709P93R1K27L12m13j316j472j004m26L87J596
$$ y = [184772, 184742, 184512, 184643, 185422, 186485, 187101, 186825, 185813, 184594, 183697, 183271, 182968, 182391, 181685, 181274, 180982, 180014, 178158, 176410, 175884, 176474, 177092, 176898, 175861, 174495, 173609, 173952, 175449, 176976, 177529, 177470, 178008, 179589, 181491, 182967, 184010, 184801, 185121, 184758, 184044, 183484, 183059, 182319, 181149, 180060, 179598, 179657, 179601, 179072, 178371, 177931, 177642, 177078, 176283, 175868, 176216, 176992, 177598, 177737, 177319, 176258, 174759, 173504, 173126, 173568, 174301, 175031, 175895, 177018, 178203, 179081, 179371, 179011, 178170, 177147, 176181, 175352, 174682, 174245, 174159, 174539, 175372, 176319, 176816, 176618, 176153, 176054, 176495, 177350, 178731, 180745, 182812, 183949, 183836, 183004, 181867, 180325, 178543, 177295, 177100, 177560, 178010, 178292, 178522, 178665, 178781, 179113, 179459, 179084, 177819, 176742, 177062, 178707, 180580, 181831, 182301, 182095, 181441, 180784, 180442, 180289, 180112, 179980, 179914, 179699, 179502, 180069, 181670, 183379, 184172, 184263, 184490, 184802, 184389, 183073, 181601, 180597, 180171, 180558, 182154]
54112A82154K573K688K337K216K109J296j60j360j636j007R5J038J196N39j95
54097A93883l12J56Q09J408J755J535Q22J97K7J47N20J471K771L377K810K108
54081B13484K540L931N130N577N503N008L922K431R31o37k498m222m979m582l668
54066B27871k781j948j160o43n46p46j047j276j210p86l09j04n3J90O51J031J188
54049B18322J304J623K166K708K906K655K333K442L011L659M223M831N375N582
54035B63140N642O044O610O608O107O147P035P536O685N376N060N574N582M650
54021C47796L519K551J342p9j002j362k124l838n629o352o075n819o113o482o312
54006C04021n669n142n086n271n288n095m928m806m474l890l320k869k386j956
$$ y = [182154, 184727, 187415, 189752, 191968, 194077, 195373, 195213, 193853, 192217, 191210, 191305, 192343, 193539, 194078, 193883, 193571, 193727, 194536, 195944, 197699, 199234, 200056, 200253, 200280, 200427, 200947, 202418, 205189, 208566, 211376, 213484, 216024, 219955, 225085, 230662, 236165, 241173, 245095, 247526, 248457, 247820, 245322, 241100, 236121, 231539, 227871, 225090, 223142, 221982, 221339, 220793, 220047, 219000, 217724, 216514, 215728, 215419, 215315, 215262, 215452, 216103, 217134, 218322, 219626, 221249, 223415, 226123, 229029, 231684, 234017, 236459, 239470, 243129, 247352, 252183, 257558, 263140, 268782, 274826, 281436, 288044, 294151, 300298, 307333, 314869, 321554, 326930, 331990, 337564, 343146, 347796, 351315, 353866, 355208, 355129, 354127, 352765, 350641, 346803, 341174, 334822, 328747, 322928, 316815, 310333, 304021, 298352, 293210, 288124, 282853, 277565, 272470, 267542, 262736, 258262, 254372, 251052, 248183, 245797, 243841]
53992B43841j940k269k297j716j088r76j122j012p43o42n32n7N26O66K98k17p08
53975B30012j074r62k39M92O11M16N22O61J01r27j285n87K90N65N48Q48J396J764
53957B33152J863J818J578J133Q19R90J557K124K444K556K622K810L241L950M919
53942B67576O063P144P893Q465R477J1301J3429J4913J5177J4104J1630P891L585
53929C98648m07l739o376p821p389n354l117j825j306p18K57J286K117K948M047
53914C71251N351O431O833O477N813N434N510N609N111L766J970M94j99m84j147
53899D28220k380l458l716l396l229l423l669l872m320n121o037o901p719q337
53885C62642q389p787o903o147n667n463n451n353m900m268m014m384m911m891
$$ y = [243841, 241901, 239632, 237335, 235619, 234531, 233555, 232433, 231421, 230678, 230036, 229504, 229447, 229973, 230639, 230937, 230720, 230012, 228938, 227976, 227737, 228229, 228840, 229256, 229778, 230439, 230540, 229613, 228328, 227741, 228031, 228596, 229144, 229992, 231388, 233152, 235015, 236833, 238411, 239544, 240363, 241353, 242910, 245034, 247478, 250034, 252656, 255466, 258707, 262657, 267576, 273639, 280783, 288676, 297141, 306618, 317919, 331348, 346261, 361438, 375542, 387172, 395063, 398648, 398241, 394502, 388126, 380305, 372916, 367562, 364445, 362620, 361314, 360596, 360853, 362139, 364256, 367204, 371251, 376602, 383033, 389866, 396343, 402156, 407590, 413100, 418709, 423820, 427586, 429556, 430050, 429851, 429367, 428220, 425840, 422382, 418666, 415270, 412041, 408618, 404949, 401077, 396757, 391636, 385599, 378698, 370979, 362642, 354253, 346466, 339563, 333416, 327749, 322286, 316835, 311482, 306582, 302314, 298300, 293916, 289005, 284114]
53871B84114m111k960k024j676j946k535l008l088k899k841l095l310k966k086
53857B45569j333j179j289j128q45r94j507j674j202o22m43n72p85j105j375j166
53841B28350m71J19L20N70J039J096L71l32j60M00J96q62j808k010j613p84M78
53824B24899J673J969J249K98j89k08J4M37R72J377J553J674J881K225K770L404
53808B45998L679L271K527K186K553L374M263M922N127M983M992N365N552M913
53794C03705L592K259J345J031J543K642L284K674J408P14Q12Q89M98r2p67j747
53778C23790k829l467l692m094m753n098m915m628m419m037l567l537l926m007
53764B66821l417k644k207k143k409k950l203k527j377j041j838k587k321j473
$$ y = [284114, 280003, 277043, 275019, 273343, 271397, 268862, 265854, 262766, 259867, 257026, 253931, 250621, 247655, 245569, 244236, 243057, 241768, 240640, 239795, 238801, 237294, 235620, 234418, 233796, 233353, 232781, 231996, 230891, 229516, 228350, 227879, 227998, 228318, 228888, 229927, 231023, 231394, 231062, 230902, 231302, 231498, 230636, 228828, 226818, 225205, 224421, 224899, 226572, 228541, 229790, 230088, 229899, 229691, 229705, 230142, 231114, 232491, 234044, 235718, 237599, 239824, 242594, 245998, 249677, 252948, 255475, 257661, 260214, 263588, 267851, 272773, 277900, 282883, 287875, 293240, 298792, 303705, 307297, 309556, 310901, 311932, 313475, 316117, 319401, 322075, 323483, 324197, 325009, 325898, 326396, 326304, 325537, 323790, 320961, 317494, 313802, 309708, 304955, 299857, 294942, 290314, 285895, 281858, 278291, 274754, 270828, 266821, 263404, 260760, 258553, 256410, 254001, 251051, 247848, 245321, 243944, 242903, 241065, 238478, 236157, 234684]
53750B34684q23l01L58O53Qj141j814j711j297r67p42m43K03J333K456K668J739
53733B34863N16q9J4N19J329K207K487J878J080R64J505K103K419K382J806P77
53717B56760K9J60P52J000R37J280K171K848K719K069J553J418J490J629J918
53702B78733K435K943K986K435J832J861K514L183L592L953M181L737K648J832
53688C18865J848J954J180p7n47J48R92R55Q3q89j457j568j342r20m97l22n62
53671C17844j097j487j360q13k30K23N58M86k88j228j183R4J328J248J78n75n27
53654C13171l57o32j046j003m14K84N30R8n45m78O58K013K411J735R97J029J677
53637C20128K313K572K376J718Q25L29P70J936K851K671J604Q29J306K712L764
$$ y = [234684, 233861, 233560, 233918, 234571, 234579, 233438, 231624, 229913, 228616, 227649, 226907, 226464, 226667, 228000, 230456, 233124, 234863, 235379, 235290, 235304, 235823, 237152, 239359, 241846, 243724, 244804, 245768, 247273, 249376, 251795, 254177, 255983, 256760, 256789, 256949, 257701, 258701, 259638, 260918, 263089, 265937, 268656, 270725, 272278, 273696, 275186, 276815, 278733, 281168, 284111, 287097, 289532, 291364, 293225, 295739, 298922, 302514, 306467, 310648, 314385, 317033, 318865, 320713, 322667, 323847, 323770, 323223, 323371, 324363, 325318, 325401, 324512, 323055, 321487, 320145, 319225, 318728, 318406, 317844, 316747, 315260, 313900, 313087, 312857, 313080, 313638, 314124, 313836, 312608, 311425, 311519, 312847, 314095, 314273, 313698, 313171, 312814, 312182, 311136, 310133, 309719, 310003, 310533, 310631, 310086, 309608, 310266, 312279, 314690, 316425, 317422, 318451, 320128, 322441, 325013, 327389, 329107, 329932, 330261, 331031, 332967, 335818, 338489, 340093, 340922, 342228, 344940, 348704]
53622C48704L674K956K625K915L219L093K938L502M923O430P067O659O006O010
53608D10721O666P152O808N757M538L488K636J870J034O7p81j123r63p67q35r07
53592D45361o37j50J11r3o96j500k217k486k191j675j381j389j511j655j863j994
53576D24034j754j133o08p01j359j897j738j088o23n39l31K70O70K09p31j029
53560D11652j87J184K201K461K007J153M70M44R29J303J271J106J104J254J489
53545D29841J839K205K419K564K793K968K938L053L825N075O082O506O543O284
53531D84935N783N631O478P944Q972R365R979J1158J2180J2495J2411J2211J1818
53518F11360J1761J3061J5488J7325J7745J8058J9428K0828K0753J9857K0045
$$ y = [348704, 352378, 355334, 357959, 360874, 364093, 367186, 370124, 373626, 378549, 384979, 392046, 398705, 404711, 410721, 417387, 424539, 431347, 437104, 441642, 445130, 447766, 449636, 450670, 450737, 449956, 448833, 447870, 447103, 446268, 445361, 444724, 444574, 444685, 444592, 443896, 442396, 440179, 437693, 435502, 433827, 432446, 431057, 429546, 427891, 426028, 424034, 422280, 421147, 420539, 419838, 418479, 416582, 414844, 413756, 413133, 412594, 412263, 412533, 413203, 413412, 412681, 411652, 411465, 412649, 414850, 417311, 419318, 420471, 420941, 421385, 422314, 423617, 424888, 425994, 427098, 428352, 429841, 431680, 433885, 436304, 438868, 441661, 444629, 447567, 450620, 454445, 459520, 465602, 472108, 478651, 484935, 490718, 496349, 502827, 510771, 519743, 529108, 539087, 550245, 562425, 574920, 587331, 599542, 611360, 623121, 636182, 651670, 668995, 686740, 704798, 724226, 745054, 765807, 785664, 805709]
53507H05709K1551K2874K3312K3714K4607K5165K4570K3208K1970K1187K0624
53496A058491J9944J8991J8016J7575J7761J7811J7117J6243J6090J6401J6172
53485A250612J5374J5072J5725J6448J6376J5747J5246J4917J4279J3027J1241
53474A414064R230P361N727M000J900k60k009l577n675q362j0753j2061j2381
53461A387204j2290j2171j2153j2352j2909j3878j5148j6320j6980j7208j7592
53450A228203j8333j8856j8709j8367j8447j8484j7523j5660j3988j2907j1528
53439A045401r054n944l286j648r15p59q15o62p6Q35J848K840L789M754N862P111
53423A049281Q307R371J0503J1788J3022J4229J5899J8147K0086K0786K0578K0659
$$ y = [805709, 827260, 850134, 873446, 897160, 921767, 946932, 971502, 994710, 1016680, 1037867, 1058491, 1078435, 1097426, 1115442, 1133017, 1150778, 1168589, 1185706, 1201949, 1218039, 1234440, 1250612, 1265986, 1281058, 1296783, 1313231, 1329607, 1345354, 1360600, 1375517, 1389796, 1402823, 1414064, 1423294, 1430655, 1436382, 1440382, 1442282, 1442022, 1440013, 1436436, 1430761, 1422399, 1411646, 1399585, 1387204, 1374914, 1362743, 1350590, 1338238, 1325329, 1311451, 1296303, 1279983, 1263003, 1245795, 1228203, 1209870, 1191014, 1172305, 1153938, 1135491, 1117007, 1099484, 1083824, 1069836, 1056929, 1045401, 1036347, 1030403, 1027117, 1025469, 1024554, 1023795, 1022980, 1022318, 1022242, 1023077, 1024925, 1027765, 1031554, 1036308, 1042170, 1049281, 1057588, 1066959, 1077462, 1089250, 1102272, 1116501, 1132400, 1150547, 1170633, 1191419, 1211997, 1232656]
53411A232656K1585K2943K4415K6274K8651L1085L3026L4319L5132L5918L7362
53400A563366L9771M2482M4473M5561M6425M7544M8734M9769N0696N1508N2036
53389B082365N2187N1866N0745M8780M6699M5258M4119M2256L9425L6341L3476
53378B573517L0617K7643K4739K1669J7786J3085Q323L851q35o080j1527j6896
53366B685892k2442k8208l3615l8236m2187m5412m7426m8207m8539m8911m8920
53355B233789m8240m7327m6484m5125m2771m0106l8148l6925l5925l5338l5756
53344A781644l6822l7244l6262l4348l2384l0634k8776k6511k4021k1886k0500
53333A452256j9445j7796j5266j2708j1153j0704j0757j0996j1593j2615j3751
$$ y = [1232656, 1254241, 1277184, 1301599, 1327873, 1356524, 1387609, 1420635, 1454954, 1490086, 1526004, 1563366, 1603137, 1645619, 1690092, 1735653, 1782078, 1829622, 1878356, 1928125, 1978821, 2030329, 2082365, 2134552, 2186418, 2237163, 2285943, 2332642, 2377900, 2422019, 2464275, 2503700, 2540041, 2573517, 2604134, 2631777, 2656516, 2678185, 2695971, 2709056, 2717379, 2721230, 2720395, 2714315, 2702788, 2685892, 2663450, 2635242, 2601627, 2563391, 2521204, 2475792, 2428366, 2380159, 2331620, 2282709, 2233789, 2185549, 2138222, 2091738, 2046613, 2003842, 1963736, 1925588, 1888663, 1852738, 1817400, 1781644, 1744822, 1707578, 1671316, 1636968, 1604584, 1573950, 1545174, 1518663, 1494642, 1472756, 1452256, 1432811, 1415015, 1399749, 1387041, 1375888, 1365184, 1354427, 1343431, 1331838, 1319223, 1305472]
53322A305472j4697j5371j5656j5255j3994j2099j0129q571p511o639n598m267
53310A175685k746j274j96K84N11J159K330L372M016N083P319J0078J2177J3715
53296A231513J5747J8312K0211K0983K1707K3190K4572K4606K3389K1993K1072
53285A467295K0584K0234J9463J7598J4800J2274J0777R436O846K944j047m245
53273A596959o774r011j0985j2615j4004j5392j7014j8943k0889k2405k3435k4264
53261A401228k4926k5246k5551k6496k7840k8383k7670k6785k6644k6540k5481
53250A109666k4078k3709k4261k4251k3085k1849k1592k1993k2106k1519k0427
53239H60796j9170j8082j7289j6529j5509j4382j3403j2345j0861r247q088p371
$$ y = [1305472, 1290775, 1275404, 1259748, 1244493, 1230499, 1218400, 1208271, 1199700, 1192189, 1185550, 1179952, 1175685, 1172939, 1171665, 1171469, 1171753, 1172264, 1173423, 1175753, 1179125, 1183141, 1188224, 1195543, 1205621, 1217798, 1231513, 1247260, 1265572, 1285783, 1306766, 1328473, 1351663, 1376235, 1400841, 1424230, 1446223, 1467295, 1487879, 1508113, 1527576, 1545174, 1559974, 1572248, 1583025, 1592461, 1599307, 1602251, 1601204, 1596959, 1590185, 1581174, 1570189, 1557574, 1543570, 1528178, 1511164, 1492221, 1471332, 1448927, 1425492, 1401228, 1376302, 1351056, 1325505, 1299009, 1271169, 1242786, 1215116, 1188331, 1161687, 1135147, 1109666, 1085588, 1061879, 1037618, 1013367, 990282, 968433, 946841, 924848, 902742, 881223, 860796, 841626, 823544, 806255, 789726, 774217, 759835, 746432, 734087, 723226, 713979, 705891, 698520]
53227F98520o702o302o817q116r267r877j0493j1427j2154j2359j2644j3551j4545
53214E64266j4706j3958j2956j2122j1389j0628r793q794p703o915o648o546o258
53201D35850o198p087q724r917r873r143q763q852q588p442n878m702m213m192
53187C32278m397m569m311l462k548k257k493k472j904j425j585k030k134j930
53173B94761j839j881j757j446j116p25k49j60r04k084k751k585k121j804j485
53158B71854j007o74p77j099j217r65m14K31N82K81m36p86l41M06P00M39P9j02
53140B66754k07k87j98O6K88L76N19Q53J168J105N92r0n65o16k59K48M54N7p45
53121B69513j310j127k62Q72J988K911L253K595J154o3k02M54P71Q9r87j349p75
$$ y = [698520, 691818, 685516, 678699, 670583, 661316, 651439, 640946, 629519, 617365, 605006, 592362, 578811, 564266, 549560, 535602, 522646, 510524, 499135, 488507, 478714, 469920, 462217, 455302, 448654, 442108, 435850, 429652, 422565, 413841, 403924, 394051, 384908, 376145, 367293, 358705, 351263, 345385, 340683, 336470, 332278, 327881, 323312, 319001, 315539, 312991, 310734, 308241, 305769, 303865, 302440, 300855, 298825, 296691, 294761, 292922, 291041, 289284, 287838, 286722, 285997, 285748, 285588, 284684, 282600, 279849, 277264, 275143, 273339, 271854, 270847, 270173, 269396, 268297, 267080, 266115, 265701, 265932, 266514, 266795, 266359, 265573, 265232, 265638, 266338, 266777, 266856, 266754, 266547, 266260, 266062, 266128, 266416, 266792, 267311, 268164, 269332, 270437, 271029, 270939, 270374, 269758, 269499, 269747, 270201, 270258, 269513, 268203, 267076, 266814, 267686, 269674, 272585, 275838, 278433, 279587, 279524, 279322, 279776, 280547, 280636, 279649, 278300, 277525]
53104B77525j70l25q59q66l58l31j201j979j584m00K01k98j123j435j240r08o07
53087B64042m08l59k50J92P29Q31N42M36N59K76n34j056p60k44j72k10J85O16
53069B64415L61l21n61k94l29j078k024k517k380j738q40j00K27L54N02L37n02
53052B53512j494j572m33J144K226K431J739M32p04p90J72J207J438Q76M4o58
53036B59570j050j063q36o11m18j25K06L29K62L13O63J178J656J922J749J109
53020B64854M73L99Q36J138Q57J05p71j407j399o19M01R22Q34O23N07K57j14j91
53002B67705J22L81L62M07P28R30O85L48M06P48R49R53R60R18O33K52J60M26O79
52983B78752N09j16q25j021l49Q57J785J988J844J920K172K078J460P20K93J78
$$ y = [277525, 277355, 277030, 276171, 275305, 274947, 274616, 273415, 271436, 269852, 269452, 269653, 269355, 268232, 266797, 265557, 264649, 264042, 263634, 263275, 263025, 263217, 263946, 264777, 265319, 265755, 266314, 266590, 266056, 265000, 264240, 263996, 263824, 263614, 263799, 264415, 264776, 264455, 263894, 263600, 263271, 262193, 260169, 257652, 255272, 253534, 252694, 252594, 252821, 253175, 253677, 254014, 253512, 252018, 250446, 250013, 251157, 253383, 255814, 257553, 257985, 257281, 256491, 256663, 257870, 259308, 260184, 260228, 259570, 258520, 257457, 256621, 256010, 255592, 255467, 255673, 256002, 256264, 256577, 257240, 258418, 260074, 261996, 263745, 264854, 265327, 265726, 266562, 267700, 268557, 268662, 267891, 266484, 265085, 264466, 264867, 265789, 266623, 267246, 267753, 268010, 267896, 267705, 267827, 268208, 268570, 268977, 269705, 270635, 271320, 271668, 272074, 272822, 273771, 274724, 275684, 276602, 277235, 277487, 277647, 278073, 278752, 279261, 279145, 278320, 277299, 276950, 277807, 279592, 281580, 283424, 285344, 287516, 289594, 291054, 291774, 292067, 292245]
52967B92245J36J02K71P26J209J282Q22J66k59l70l32j89N4J07l99j298j884j753
52949B90636j372j471k089k527k199j294n84o95j457j993j564m44K85m8q66j042
52933B71276l14M17K97l81n95N2Q19P94l5q58j063p22k40J07J77q1m62n47k21
52914B68420J33R6k51m66k84J79O09O78K55l76p15o32n11n84n28m3M77L68l68
52895B66457j074j263j057p49l74J81Q70J392J334O09j84k12N89J331J312Q69
52879B70031O45N38Q8m98n80j81J11K33P43J658K201J975J563J556J707J579J331
52862B84700J297J311J051P28P40R27P63J77l25m23m46r04j854k795l222l146
52846B78579l078l372l751l640k887j937j286j118j402j990k522k568k014j106
$$ y = [292245, 292381, 292483, 292754, 293480, 294689, 295971, 296793, 296959, 296700, 296330, 295998, 295809, 295863, 295970, 295571, 294273, 292389, 290636, 289264, 287793, 285704, 283177, 280978, 279684, 279100, 278405, 276948, 274955, 273391, 272947, 273232, 273184, 272318, 271276, 270962, 271379, 271676, 271295, 270700, 270752, 271571, 272365, 272330, 271472, 270409, 269687, 269447, 269554, 269731, 269650, 269188, 268641, 268420, 268553, 268649, 268398, 267932, 267648, 267827, 268436, 269114, 269369, 268993, 268278, 267646, 267135, 266551, 266023, 265980, 266457, 266825, 266457, 265383, 264120, 263063, 262314, 261940, 262121, 262991, 264383, 265717, 266326, 266142, 265930, 266519, 267850, 269162, 270031, 270676, 271214, 271302, 270804, 270224, 270043, 270154, 270387, 271130, 272788, 274989, 276964, 278527, 280083, 281790, 283369, 284700, 285997, 287308, 288359, 289087, 289827, 290754, 291517, 291694, 291369, 290946, 290500, 289596, 287742, 284947, 281725, 278579, 275501, 272129, 268378, 264738, 261851, 259914, 258628, 257510, 256108, 254118, 251596, 249028, 247014, 245908]
52832B45908j06P87J226R48L33K93J214K342K538J434k48j396j391n81Pl38j161
52815B51809j265j70J231J665Q67k72p69l65N06J246J499J271P86K48k46o78j082
52798B56281j449j629j421r24n78o28p38m31K41Q26J122J229J110O03j03n63o89
52781B52259q24j011p22L77J725K294J674M76l07k79N7N4k32j85L04O01L91K49
52763B56901N80O75k24j409j495n30po30j340j059k37M1l24n36j12P18J435J664
52745B54111J436J282J676K252K199J557J269J647J772J052M09R50K224K863K484
52730B79183J887J579J267P99N88P83Q67L66n00j275j807k125k090j615j041r40
52714B75926j481k175k390k006j406q34j14Q15J487J460J032Q00P14L05k72k95
$$ y = [245908, 245802, 246589, 247815, 248763, 249096, 249389, 250603, 252945, 255483, 256917, 256669, 255273, 253882, 253301, 253308, 252970, 251809, 250544, 250374, 251605, 253270, 254137, 253865, 253096, 252731, 253237, 254483, 255982, 257253, 258039, 258287, 258041, 257363, 256281, 254832, 253203, 251782, 250858, 250280, 249652, 248914, 248483, 248724, 249550, 250672, 251901, 253011, 253614, 253511, 252948, 252259, 251435, 250424, 249702, 250079, 251804, 254098, 255772, 256248, 255941, 255662, 255719, 255773, 255541, 255356, 255660, 256261, 256652, 256901, 257481, 258156, 257932, 256523, 255028, 254498, 254491, 253861, 252521, 251462, 251225, 251266, 250942, 250406, 250294, 251012, 252447, 254111, 255547, 256829, 258505, 260757, 262956, 264513, 265782, 267429, 269201, 270253, 270662, 271612, 273836, 276699, 279183, 281070, 282649, 283916, 284715, 285303, 286086, 286953, 287319, 286819, 285544, 283737, 281612, 279522, 277907, 276866, 275926, 274445, 272270, 269880, 267874, 266468, 265634, 265520, 266335, 267822, 269282, 270314, 271114, 271828, 272133, 271861, 271566]
52698B71566K74N35J4n70m46J25M87O06P03N09j77o82k01Q67J267N40m86q76o12
52679B73443k84l55q88j599k027j937j551j191q36l12K40N33O32Q37J143J193
52663B67041P27j26r90j422j129k63O60J317J894K547K964K815K331K041K103
52648B82510K297K424K299J613K91j084j771j659j246r33p36n57l54l8M25R04
52632B84385J304J736K192K352K048J728K032K996M022M458L899K268k6k105l273
52617C10016l565l472l295l066k813k541k190j817j592j425j006l97p2q9J17O55
52601B83448P46Ko46k09Q04J153P12L79M79N37M43O26R36O41k76q57n75lK65M56
52581B89061Q95J289J241R37P47O75N74M48K60p2k95k6M28J49j054k099j973j071
$$ y = [271566, 271840, 272375, 272389, 271819, 271373, 271498, 271985, 272591, 273294, 273803, 273626, 272944, 272743, 273610, 274877, 275417, 274931, 274055, 273443, 273159, 272804, 271916, 270317, 268290, 266353, 264802, 263611, 262775, 262463, 262703, 263236, 263868, 264705, 265848, 267041, 267768, 267642, 266652, 265230, 264101, 263838, 264498, 265815, 267709, 270256, 273220, 276035, 278366, 280407, 282510, 284807, 287231, 289530, 291143, 291434, 290350, 288579, 286920, 285674, 284741, 284005, 283448, 283094, 283056, 283481, 284385, 285689, 287425, 289617, 291969, 294017, 295745, 297777, 300773, 304795, 309253, 313152, 315420, 315394, 313289, 310016, 306451, 302979, 299684, 296618, 293805, 291264, 289074, 287257, 285665, 284240, 283234, 282837, 282765, 282676, 282793, 283448, 284194, 284196, 283550, 283341, 284145, 285298, 286010, 286389, 286868, 287405, 287848, 288474, 289410, 290051, 289775, 288918, 288343, 288340, 288605, 289061, 289956, 291245, 292486, 293423, 294170, 294845, 295419, 295867, 296127, 296055, 295760, 295734, 296162, 296311, 295257, 293158, 291185, 290114]
52563B90114n80q66j198r31k71J32nm11o60o36n79p23r94j241j448j565j294m98
52545B76346L97Q61R76J111J086M07o71j131n78J26K9o80j038n16N44J457J791
52528B80517J583J217R83Q08N82M90O03M21m17j186p79O09J586J580J576K320
52512B92493K944K419J376J237K091K771K743K678K948K856J720m8j494k233k562
52497C11939k870l290l693l773l275k328j378p76n68o45p77n77J62R64R74lj091
52480B88995j245l02J054K091K453K080J262O42O88J056R73L23q3L63J150J361
52464C02861J016J038J933L090L603L328K792K334J757O88q64k345l020k670j901
52449C13640j519j635j746j662j806k405k959k920k432k008j760j473j090o90
$$ y = [290114, 289534, 288668, 287470, 286539, 286268, 286400, 286395, 285984, 285324, 284688, 284109, 283386, 282392, 281151, 279703, 278138, 276844, 276346, 276743, 277604, 278580, 279691, 280777, 281184, 280513, 279382, 278804, 278930, 278959, 278279, 277241, 276725, 277269, 278726, 280517, 282100, 283317, 284300, 285108, 285690, 286180, 286783, 287204, 286787, 285601, 284822, 285431, 287017, 288597, 290173, 292493, 295437, 297856, 299232, 300469, 302560, 305331, 308074, 310752, 313700, 316556, 318276, 318228, 316734, 314501, 311939, 309069, 305779, 302086, 298313, 295038, 292710, 291332, 290556, 289988, 289343, 288566, 287989, 288151, 289115, 290089, 290086, 288995, 287750, 287448, 288502, 290593, 293046, 295126, 296388, 297030, 297718, 298774, 299747, 300070, 299987, 300350, 301500, 302861, 303877, 304915, 306848, 309938, 313541, 316869, 319661, 321995, 323752, 324440, 323576, 321231, 318211, 315541, 313640, 312121, 310486, 308740, 307078, 305272, 302867, 299908, 296988, 294556, 292548, 290788, 289315, 288225, 287535]
52435B87535k35K45M70L79M23R11J364J204P31P24J188J351Q63K21p0p9oJ34K59
52416B97612J90Q8L99J172J928K386K763L249L691M032M592N638P057Q574R871
52401C53242J0348R369O938L777N30k578n229o842p236o919o330n354l970k788
52387C36958k354k318j877q44K54R61J283J390J343J151Q59N78N28R02J563K147
52371C42524K588L307M564N926O616O339N484M617L938L190K037N68o44j127j058
52356C88869r66j005q86m73J6M16P48Q98P64P74J652L386M949N395M788L829L099
52339D16253L019L924N618P222Q051Q340Q677R136R527J0120J1319J2798J3734
52326E27738J4019J4552J6081J8282K0231K1455K2136K2605K2990K3309K3505
$$ y = [287535, 287300, 287545, 288015, 288394, 288817, 289728, 291092, 292296, 293027, 293751, 294939, 296290, 297153, 297374, 297304, 297225, 297219, 297353, 297612, 297802, 297890, 298289, 299461, 301389, 303775, 306538, 309787, 313478, 317510, 322102, 327740, 334797, 343371, 353242, 363590, 372959, 379897, 383674, 384204, 381626, 376397, 369555, 362319, 355400, 349070, 343716, 339746, 336958, 334604, 332286, 330409, 329565, 329819, 330780, 332063, 333453, 334796, 335947, 336806, 337384, 337912, 338814, 340377, 342524, 345112, 348419, 352983, 358909, 365525, 371864, 377348, 381965, 385903, 389093, 391130, 391698, 391054, 389927, 388869, 387903, 386898, 386012, 385539, 385555, 385971, 386719, 387617, 388381, 389155, 390807, 394193, 399142, 404537, 409325, 413154, 416253, 419272, 423196, 428814, 436036, 444087, 452427, 461104, 470240, 479767, 489887, 501206, 514004, 527738, 541757, 556309, 572390, 590672, 610903, 632358, 654494, 677099, 700089, 723398, 746903]
52315G46903K3312K2385K0829J9353J8642J8577J8461J7983J7488J7147J6554
52304I57634J5524J4691J4543J4355J3007J0701Q809P943P269N970M377L072J763
52291A079658j97k738n221p297q967j0138j0783j1218j1662j1617j0253p491m310
52278I77766j949r07n37M71K879O016Q416R485J0084J1202J2675J3683J4047J4308
52264A077639J4717J4912J4555J3887J3400J3289J3316J3117J2636J2193J1934
52253A225595J1395J0042Q178O752O049N258L609J312j111l763o952j0257j2784
52240A243323j4230j5042j5644j6037j6157j6116j6010j5754j5199j4298j3234
52229A075602j2398j2080j2045j1716j0805r478p901o149m592l727l391k785j611
$$ y = [746903, 770215, 792600, 813429, 832782, 851424, 870001, 888462, 906445, 923933, 941080, 957634, 973158, 987849, 1002392, 1016747, 1029754, 1040455, 1049264, 1057207, 1064476, 1070446, 1074823, 1077895, 1079658, 1079461, 1076723, 1071502, 1064205, 1055238, 1045100, 1034317, 1023099, 1011437, 999820, 989567, 982076, 977766, 975817, 974910, 974373, 974844, 977723, 983739, 992155, 1001640, 1011724, 1022926, 1035601, 1049284, 1063331, 1077639, 1092356, 1107268, 1121823, 1135710, 1149110, 1162399, 1175715, 1188832, 1201468, 1213661, 1225595, 1236990, 1247032, 1255210, 1261962, 1268011, 1273269, 1276878, 1278190, 1277079, 1273316, 1266364, 1256107, 1243323, 1229093, 1214051, 1198407, 1182370, 1166213, 1150097, 1134087, 1118333, 1103134, 1088836, 1075602, 1063204, 1051124, 1039079, 1027363, 1016558, 1007080, 999179, 993030, 988438, 984711, 981320, 978535, 976924]
52216I76924m50K94J025K053K879L096L271M037M965N243N014M986N035M310K650
52201A025332J050N74J419K962M158M166L141K239K206K462K261K174L297N248
52187A062689O311N605M002K695J895J271O34k55j795l933n993p385q093q251
$$ y = [976924, 976474, 976768, 977793, 979846, 982725, 985821, 989092, 993129, 998094, 1003337, 1008351, 1013337, 1018372, 1022682, 1025332, 1026382, 1026956, 1028375, 1031337, 1035495, 1039661, 1042802, 1045041, 1047247, 1049709, 1051970, 1054144, 1057441, 1062689, 1069000, 1074605, 1078607, 1081302, 1083197, 1084468, 1085102, 1084847, 1083052, 1079119, 1073126, 1065741, 1057648, 1049397]
$$ [...]
##END NTUPLES=NMR SPECTRUM
##END=
