
##TITLE=AC1250_VIERS11068_6666440_olafer27UV
##JCAMPDX= 6.0         $$ Bruker NMR JCAMP-DX V2.0
##DATA TYPE= NMR SPECTRUM
##DATA CLASS= NTUPLES
##ORIGIN= BRUKER
##OWNER= Administrator
$$ 1.72 TOPSPIN		Version 2.1
$$ 2012-08-13 19:29:19.421 -0500  Administrator@TOPSPIN
$$ Compression mode = diff/dup
##.OBSERVE FREQUENCY= 400.02188249412
##.OBSERVE NUCLEUS= ^1H
##.ACQUISITION MODE= SIMULTANEOUS (DQD)
##.ACQUISITION SCHEME= undefined
##.AVERAGES= 64
##.DIGITISER RES= 22
##SPECTROMETER/DATA SYSTEM= spect
##.PULSE SEQUENCE= noesygpps1d.comp
##.SOLVENT NAME= COFFEE_meoh
##.SHIFT REFERENCE= INTERNAL, COFFEE_meoh, 1, 14.96201
##AUDIT TRAIL= $$ (NUMBER, WHEN, WHO, WHERE, PROCESS, VERSION, WHAT)
$$ ##TITLE= Audit trail, TOPSPIN		Version 2.1
$$ ##JCAMPDX= 5.01
$$ ##ORIGIN= Bruker BioSpin GmbH
$$ ##OWNER= Administrator
$$ $$ C:\Bruker\TOPSPIN/data/COFFEE/nmr/AC1250_VIERS11068_6666440_olafer27UV/12/pdata/1/auditp.txt
$$ ##AUDIT TRAIL=  $$ (NUMBER, WHEN, WHO, WHERE, PROCESS, VERSION, WHAT)
(   1,<2012-08-13 19:29:14.218 -0500>,<Administrator>,<TOPSPIN>,<go>,<TOPSPIN 2.1>,
      <created by zg
	started at 2012-08-13 19:17:43.921 -0500,
	POWCHK enabled, PULCHK disabled,
       configuration hash MD5:
       6B 1B 68 BB D9 2E 58 E2 7F 35 AD 54 07 DF 0E 41
       data hash MD5: 64K
       AF 8D 95 44 BB E2 50 C0 6C D6 24 60 39 EA 53 B0>)
(   2,<2012-08-13 19:29:17.093 -0500>,<Administrator>,<TOPSPIN>,<proc1d>,<TOPSPIN 2.1>,
      <Start of raw data processing
       efp LB = 0.3 FT_mod = 6 PKNL = 1 PHC0 = 0 PHC1 = 0 SI = 128K 
       data hash MD5: 128K
       43 5E 2E 68 73 4B 08 11 10 BA 23 8B ED 97 04 9D>)
(   3,<2012-08-13 19:29:18.328 -0500>,<Administrator>,<TOPSPIN>,<proc1d>,<TOPSPIN 2.1>,
      <pk PHC0 = 3.718872 PHC1 = 0 
       data hash MD5: 128K
       9E 48 90 67 1B 23 4F 4E 91 6D 0E 28 DF 48 9F E0>)
(   4,<2012-08-13 19:29:18.953 -0500>,<Administrator>,<TOPSPIN>,<proc1d>,<TOPSPIN 2.1>,
      <abs ABSG = 1 
       data hash MD5: 128K
       B7 E1 20 0E B8 1B BA 7A 6B 2D EF 87 19 EB 7A 3B>)
(   5,<2012-08-13 19:29:19.015 -0500>,<Administrator>,<TOPSPIN>,<proc1d>,<TOPSPIN 2.1>,
      <abs ABSG = 2 
       data hash MD5: 128K
       D2 62 E2 8E 56 DD BC 57 98 21 65 0E BD EF 05 CA>)
(   6,<2012-08-13 19:29:19.109 -0500>,<Administrator>,<TOPSPIN>,<proc1d>,<TOPSPIN 2.1>,
      <abs ABSG = 3 
       data hash MD5: 128K
       23 AC 0B 54 01 A1 91 71 5C 2F 1E 4F 24 88 B5 93>)
(   7,<2012-08-13 19:29:19.171 -0500>,<Administrator>,<TOPSPIN>,<proc1d>,<TOPSPIN 2.1>,
      <abs ABSG = 4 
       data hash MD5: 128K
       44 3C D9 88 60 39 E1 9D DA B2 3C CC 03 52 07 6E>)
(   8,<2012-08-13 19:29:19.265 -0500>,<Administrator>,<TOPSPIN>,<proc1d>,<TOPSPIN 2.1>,
      <abs ABSG = 5 
       data hash MD5: 128K
       FB 42 71 A0 E8 F5 E3 9A FF E7 73 C1 1E F3 C3 3A>)
$$ ##END=
$$ 
$$ $$ hash MD5
$$ $$ CC 7D 5C BE FA 0D EC 11 8F F6 1D 0B A6 01 D9 92
##$RELAX= 
##$RELAX= 
##$RELAX= 
##$RELAX= 
##$RELAX= 
##$RELAX= 
##$RELAX= 
##$RELAX= 
$$ Bruker specific parameters
$$ [...]
150 150 150 150 150 150 150 150
##$TP07= 0
##$TPNAME0= <>
##$TPNAME1= <>
##$TPNAME2= <>
##$TPNAME3= <>
##$TPNAME4= <>
##$TPNAME5= <>
##$TPNAME6= <>
##$TPNAME7= <>
##$TPOAL= (0..7)
0.5 0.5 0.5 0.5 0.5 0.5 0.5 0.5
##$TPOFFS= (0..7)
0 0 0 0 0 0 0 0
##$TUNHIN= 0
##$TUNHOUT= 0
##$TUNXOUT= 0
##$USERA1= <user>
##$USERA2= <user>
##$USERA3= <user>
##$USERA4= <user>
##$USERA5= <user>
##$V9= 5
##$VALIST= <valist>
##$VCLIST= <CCCCCCCCCCCCCCC>
##$VD= 0
##$VDLIST= <DDDDDDDDDDDDDDD>
##$VPLIST= <PPPPPPPPPPPPPPP>
##$VTLIST= <TTTTTTTTTTTTTTT>
##$WBST= 1024
##$WBSW= 4
##$XGAIN= (0..3)
0 0 0 0
##$XL= 0
##$YL= 0
##$YMAX_a= 13557789
##$YMIN_a= -7797616
##$ZGOPTNS= <>
##$ZL1= 120
##$ZL2= 120
##$ZL3= 120
##$ZL4= 120
##$ABSF1= 14.96201
##$ABSF2= -5.596171
##$ABSG= 5
##$ABSL= 3
##$ALPHA= 0
##$AQORDER= 0
##$ASSFAC= 0
##$ASSFACI= 0
##$ASSFACX= 0
##$ASSWID= 0
##$AUNMP= <proc_prof1d_extract.lims>
##$AXLEFT= 0
##$AXNAME= <>
##$AXNUC= <1H>
##$AXRIGHT= 0
##$AXTYPE= 0
##$AXUNIT= <>
##$AZFE= 0.1
##$AZFW= 0.1
##$BCFW= 0
##$BC_mod= 0
##$BYTORDP= 0
##$COROFFS= 0
##$CY= 15
##$DATMOD= 1
##$DC= 0
##$DFILT= <>
##$DTYPP= 0
##$F1P= 0
##$F2P= 0
##$FCOR= 0.5
##$FTSIZE= 131072
##$FT_mod= 6
##$GAMMA= 0
##$GB= 0
##$INTBC= 1
##$INTSCL= 1
##$ISEN= 128
##$LB= 0.3
##$LEV0= 0
##$LPBIN= 0
##$MAXI= 10000
##$MC2= 0
##$MEAN= 0
##$ME_mod= 0
##$MI= 0
##$NCOEF= 0
##$NC_proc= -2
##$NLEV= 6
##$NOISF1= 0
##$NOISF2= 0
##$NSP= 0
##$NTH_PI= 0
##$NZP= 0
##$OFFSET= 14.96201
##$PC= 1
##$PHC0= 3.718872
##$PHC1= 0
##$PH_mod= 1
##$PKNL= yes
##$PPARMOD= 0
##$PPDIAG= 0
##$PPIPTYP= 0
##$PPMPNUM= 2147483647
##$PPRESOL= 1
##$PSCAL= 4
##$PSIGN= 0
##$PYNMP= <proc.py>
##$REVERSE= no
##$SF= 400.020009233814
##$SI= 131072
##$SIGF1= 0
##$SIGF2= 0
##$SINO= 400
##$SIOLD= 131072
##$SPECTYP= <>
##$SREGLST= <1H.CDCl3>
##$SSB= 0
##$STSI= 131072
##$STSR= 0
##$SW_p= 8223.68421052631
##$SYMM= 0
##$S_DEV= 0
##$TDeff= 65536
##$TDoff= 0
##$TI= <>
##$TILT= no
##$TM1= 0
##$TM2= 0
##$TOPLEV= 0
##$USERP1= <user>
##$USERP2= <user>
##$USERP3= <user>
##$USERP4= <user>
##$USERP5= <user>
##$WDW= 1
##$XDIM= 131072
##$YMAX_p= 433184179
##$YMIN_p= -12779
##$CURPLOT= <Network HP LaserJet P1505>
##$CURPRIN= <$Network HP LaserJet P1505>
##$DFORMAT= <normdp>
##$LAYOUT= <+/1D_H.xwp>
##$LFORMAT= <normlp>
##$PFORMAT= <normpl>
##$SURQMSG= 1
$$ End of Bruker specific parameters
$$ ---------------------------------
##NTUPLES= NMR SPECTRUM
##VAR_NAME=  FREQUENCY,     SPECTRUM/REAL,   SPECTRUM/IMAG
##SYMBOL=    X,             R,               I
##VAR_TYPE=  INDEPENDENT,   DEPENDENT,       DEPENDENT
##VAR_FORM=  AFFN,          ASDF,            ASDF
##VAR_DIM=   131072,        131072,          131072
##UNITS=     HZ,            ARBITRARY UNITS, ARBITRARY UNITS
##FACTOR=    0.0627417313425164, 1,          1
##FIRST=     8223.62146879497, -2996,        -51902
##LAST=      0,             -1631,           -52831
##MIN=       0,             -12779,          0
##MAX=       8223.62146879497, 433184179,    0
$$ Real data points
##PAGE= N=1
##DATA TABLE= (X++(R..R)), XYDATA
$$ [...]
64647 48174 48268 47630 46971 47071 47772 48277 48330 48493 49202 50103 50663 50952 51346 51778 51847 51588 51469 51570 51375 50658
64627 50658 50047 50241 51048 51657 51682 51437 51303 51361 51666 52409 53559 54637 55053 54576 53421 52033 50799 49870
64609 49870 49163 48611 48305 48310 48460 48567 48690 48949 49224 49367 49642 50455 51626 52363 52171 51409 50699 50135 49450
64590 49450 48732 48507 49097 50201 51191 51699 51835 51905 51978 51776 51103 50358 50435 51850 54022 55610 55687 54555 53327
64571 53327 52732 52502 52006 51270 50977 51407 51829 51339 50014 48764 48131 47754 47113 46325 45937 46246 47083 48035
64553 48035 48638 48521 47692 46694 46311 47056 48848 51034 52693 53198 52682 51874 51421 51445 51734 52117 52552 53045
64535 53045 53593 54036 53983 53191 52093 51539 51862 52555 53100 53667 54576 55486 55718 55167 54310 53418 52395 51405 50938
64516 50938 51008 50919 50224 49461 49412 49949 50174 49581 48529 47513 46554 45566 44958 45378 46920 48952 50815 52470
64498 52470 54263 56243 57974 59026 59424 59465 59295 58852 58183 57501 56880 56104 55016 53884 53192 53041 53003 52615
64480 52615 51903 51241 50829 50517 50141 49831 49849 50217 50643 50827 50789 50890 51499 52559 53471 53583 52808 51619 50379
64461 50379 48982 47410 46352 46717 48456 50343 51165 50879 50370 50363 50915 51761 52696 53508 53864 53518 52546 51267
64443 51267 49933 48582 47175 45846 44965 44865 45535 46658 47975 49430 50925 52133 52772 52969 53156 53614
64427 53614 54262 54882 55390 55943 56906 58696 61459 64889 68459 71887 75224 78553 81801 84864 87722 90390
64411 90390 92931 95547 98433 101458 104260 106796 109585 113132 117270 121359 125070 128688 132606 136732
64397 136732 140503 143287 144675 144512 142831 139823 135822 131210 126242 120942 115324 109741 104812 100863
64383 100863 97598 94462 91170 87704 84070 80465 77466 75548 74403 73266 71994 71168 70927 70372 68693
64368 68693 66438 64991 64985 65827 66673 67210 67446 67322 66807 66045 65222 64487 64078 64210 64763 65309 65464 65046 64023
64349 64023 62681 61694 61525 61760 61546 60766 60154 60221 60716 61341 62228 63368 64277 64771 65437 66684 67922 68403
64331 68403 68397 68675 69175 69128 68398 67754 67773 68275 68968 69884 70951 71801 72302 72784 73520 74466 75609 77043 78532
64312 78532 79561 80090 80703 81777 83049 84332 86114 88987 92910 97402 102119 106840 111239 115115 118567
64297 118567 121555 123634 124521 124618 124509 124154 123088 121258 119225 117626 116777 116615 116652 116218 115240 114659 115583
64280 115583 118044 121065 123852 126377 128729 130556 131555 132114 133024 134566 136145 136904 136550 135525 134338
64265 134338 132863 130547 127373 124286 122345 121571 120979 119730 117939 116273 115073 114042 112722 111096 109656
64250 109656 108925 109007 109717 111011 112956 115250 117171 118220 118569 118656 118691 118846 119505 120784 122005 122284 121722
64233 121722 121486 122549 124717 127066 129010 130743 132762 135149 137289 138347 138194 137751 138186 139799 141887
64218 141887 143616 144670 145175 145408 145699 146273 147004 147557 147900 148491 149850 152118 155094 158503 162158 166002
64202 166002 170033 174112 178031 181930 186362 191497 196421 199855 201591 202618 203638 204112 203122 200643 197457
64187 197457 194202 191037 187950 184738 180824 175759 170086 165221 162149 160476 159019 157179 155413 154362
64173 154362 153833 152897 150918 148146 145158 142051 138559 134736 130976 127259 122966 117740 112211 107444 103896
64158 103896 101221 98983 97223 96370 96781 98290 100056 101067 101068 100867 101452 102908 104508 105740 106803 107973
64142 107973 108965 109266 108983 108977 110003 111830 113371 113762 113186 112535 112404 112649 112848 112792 112424 111692 110786 110274 110619
64123 110619 111641 112727 113441 113708 113551 113061 112554 112363 112376 112128 111498 111051 111467 112782 114352 115540 116302
64106 116302 117085 118170 119233 119727 119699 119978 121369 123910 127109 130645 134418 138141 141513 144849 149014
64091 149014 154459 160722 167059 173198 179204 185032 190676 196501 202907 209674 216022 221363 225701 229249
64077 229249 231933 233426 233514 232345 230393 228242 226254 224335 222027 218818 214407 208878 202801 197071 192409
64062 192409 188925 186233 183917 181731 179501 177176 175070 173789 173685 174563 176067 178181 181041 184349 187299
64047 187299 189271 190467 191743 193888 197174 201412 206194 211010 215381 219133 222554 226153 230167 234414
64033 234414 238656 242954 247534 252267 256435 259048 259419 257563 254212 250459 247159 244452 241887 239065
64019 239065 236114 233432 231093 228757 226248 224021 222830 222927 223780 224650 225298 226005 227012 228230 229559 231199
64003 231199 233370 235809 237898 239383 240721 242588 245175 248149 251062 253597 255521 256796 257770 258996
63989 258996 260722 262775 265066 267970 271970 277034 282534 287786 292561 297138 302064 307812 314505 321883
63975 321883 329624 337723 346454 356029 366429 377639 389910 403659 419092 435948 453667 471891
63963 471891 490868 511325 533818 558246 584088 611106 639670 670405 703688 739546 777859
63952 777859 818512 861510 907212 956519 1010678 1070802 1137652 1211961 1294986 1388743 1495813
63941 1495813 1619007 1761274 1925927 2116943 2338971 2596799 2894404 3234082 3616148
63932 3616148 4039218 4500723 4997257 5524859 6079284 6655801 7248086 7846580 8437599
63923 8437599 9004171 9528274 9993380 10386479 10699200 10927661 11070850 11128272 11098313 10978495
63913 10978495 10767375 10466819 10083365 9628219 9116203 8564092 7988551 7403964 6821091
63904 6821091 6247503 5689458 5153474 4646344 4174133 3741460 3351263 3004409 2699322
63895 2699322 2432507 2199913 1997844 1822763 1670914 1538666 1423069 1321735 1232369 1152779
63885 1152779 1081217 1016277 956554 900905 849109 801717 758930 719811 682845 647067 612473
63874 612473 579559 548743 520100 493343 468132 444562 423187 404286 387206 370836 354757
63863 354757 339532 325802 313531 302333 292138 283104 275173 268167 262160 257274 253109 248898 244364
63850 244364 240049 236553 233790 231206 228469 225689 223194 221398 220674 220986 221694 221986 221516 220411 218789
63835 218789 216616 213992 211217 208414 205295 201470 196918 192107 187667 183838 180123 175626 170026 164128
63821 164128 159184 155679 153072 150629 148056 145263 142032 138239 134157 130217 126669 123638 121269 119536
63807 119536 118118 116718 115385 114298 113429 112675 112079 111625 111035 110250 109896 110680 112266 113307 112835 111219
63791 111219 109531 108433 108050 108485 109768 111324 112145 111780 110809 110078 109679 108998 107662 106050 104761 103914
63775 103914 103188 102404 101727 101298 100939 100439 99951 99921 100549 101479 102052 101841 100943 99794 98736 97741 96601 95317
63757 95317 94177 93425 93020 92830 92948 93583 94702 96003 97271 98493 99582 100307 100773 101757 104103 107701
63741 107701 111355 113889 115241 116301 117835 119832 121877 123844 126163 129542 134517 141063 148498 155951
63727 155951 163109 170504 178997 189106 200872 214109 228435 243155 257406 270468 281781 290724
63715 290724 296699 299460 299125 295828 289644 280964 270651 259649 248616 238098 228773 221195 215338
63702 215338 210623 206442 202537 198899 195463 191942 188005 183642 179269 175323 171812 168476 165394 163033
63688 163033 161611 160766 160079 159622 159635 159987 160433 161283 163248 166544 170576 174711 179084 184376 191002 198829
63672 198829 207579 217215 227763 238915 250115 261090 272103 283395 294428 303971 310960 314986
63660 314986 315869 313249 306966 297586 286076 273062 258793 243811 229224 216142 205054 195807 187941
63647 187941 180999 174781 169466 165359 162444 160296 158509 157117 156528 157110 158769 160843 162554 163758 165147
63632 165147 167515 170909 174726 178507 182290 186294 190710 195836 201951 208895 216179 223807 232670 243851
63618 243851 257588 273066 289081 304853 320513 337034 355553 376552 399764 424822 451630
63607 451630 479926 508717 536367 561049 581055 595192 603333 606431 605660 601686 595059 587025 579337
63594 579337 573080 567979 562856 556559 548507 538782 527856 516083 503364 489481 474756 460124 446449
63581 446449 434038 422891 413161 405107 398648 393234 388233 383445 379216 376005 373792 371980 369997 367923
63567 367923 366367 365764 366067 367216 369566 373539 378955 385089 391495 398559 407072 417351 429006 441560
63553 441560 455092 470146 487189 506403 527919 551858 577945 605271 632689 659319 684379
63542 684379 706602 724309 736415 743326 746609 747796 747656 746635 745661 746160 749199 754760 761840 769030
63528 769030 774826 777598 775723 767994 753983 734062 709211 680701 649715 617212 584221 552088
63516 552088 522040 494530 469398 446731 427041 410363 395799 382541 370951 361912 355274 349711
63504 349711 344178 338782 333991 329690 325508 321573 318381 316106 314546 313579 313262 313549 314226 315084 315946 316712
63488 316712 317682 319620 323059 327723 333105 339453 347506 357272 367836 378651 390324 403611 418106
63475 418106 432433 445325 455926 463413 467167 467294 464274 458093 448404 435736 421762 407961 394567
63462 394567 381266 368409 356839 346841 338019 330197 323719 318692 314519 310599 307146 304906 304197 304596
63448 304596 305495 306631 307939 309215 310236 311206 312803 315589 319460 323840 328399 333417 339430 346710 355170
63433 355170 364622 375017 386522 399398 413659 428891 444743 461720 481114 503781 529213 556191
63421 556191 584197 613761 645544 679640 715805 753738 792654 830754 865448 894189 915233
63410 915233 927989 933009 931608 925379 915988 905201 894675 885358 877120 868983 859698 848288 834372
63397 834372 818106 799749 779397 757376 734663 712395 690944 670013 649777 631339 615714
63386 615714 602862 592114 583167 576200 571373 568727 568280 569640 571739 573654 575697 579117 584666 592035
63372 592035 600695 610562 621534 633066 644838 657496 672087 688818 706885 725593 745210 766528
63360 766528 789886 814934 841290 869087 898700 929955 961666 991845 1018303 1039203 1053419
63349 1053419 1060648 1061235 1055905 1045771 1032470 1017847 1003187 988845 974776 961125 947909 934296
63337 934296 918727 900053 878368 854663 829931 804767 779605 755001 731553 709587 688993
63326 688993 669420 650668 632870 616340 601333 587923 575946 565065 555128 546529 539862 535027
63314 535027 531024 526933 522782 519051 515608 511741 507052 501710 495830 489303 482370 475715 469651 463721
63300 463721 457406 450742 443977 437068 430013 423229 417098 411335 405337 399013 392834 387220 382258 377879
63286 377879 373836 369634 364990 360351 356466 353375 350312 346774 343238 340477 338471 336371 333527 330255
63272 330255 327435 325458 323721 321333 318185 315000 312263 309631 306757 304177 302644 301794 300353 297780
63258 297780 294903 292591 290654 288680 287230 287234 288412 289301 288971 287926 287023 286242 285083 283674 282730 282483
63242 282483 282322 281737 281188 281632 283330 285505 287258 288540 289980 291938 294127 296174 298144 300204 302079
63227 302079 303250 303662 303826 304147 304538 304898 305630 307322 309963 312763 314757 315504 315266 314684 314365 314639 315571
63210 315571 317078 318949 320793 322198 323018 323409 323502 323198 322411 321393 320654 320573 321181 322260 323558 325006 326764
63193 326764 328889 330957 332310 332894 333532 335011 337176 339372 341560 344373 348044 351974 355657 359533 364557
63178 364557 371172 378959 387036 394497 400774 406027 411092 416796 423310 430268 437190 443582 448985 453395
63164 453395 457479 461905 466493 470449 473380 475610 477445 478582 478482 476956 474157 470310 465731 460892
63150 460892 456107 451160 445576 439330 433094 427703 423487 420177 417331 414662 412018 409272 406387 403482
63136 403482 400681 397972 395423 393450 392536 392600 392934 392985 392933 393294 394094 394780 394868 394459 394092 394292 395222 396667
63118 396667 398306 400030 401867 403638 404992 405903 406838 408198 409903 411795 414099 417023 420149 422708 424363
63103 424363 425277 425619 425578 425700 426481 427554 428048 427909 428156 429500 431402 432935 433928 434661 434985 434629 434079 434329
63085 434329 435762 437918 440352 443004 445658 447834 449620 452037 455995 461204 466568 471423 475877 480095
63071 480095 483913 487223 490218 492958 495094 496300 496683 496427 495344 493203 490274 487040 483497 479378 475051
63056 475051 471512 469190 467367 465082 462121 458768 455195 451651 448714 446640 444801 442502 440037 438171
63042 438171 436842 435332 433634 432618 432722 433402 434134 435013 435980 436441 436289 436549 438251 441193 444461 447634
63026 447634 450769 453700 456196 458499 460874 462757 463189 462103 460515 459365 458691 457952 456591 454244 450991
63011 450991 447625 445233 444281 444344 444731 445114 445573 446454 448250 451160 454663 457840 460316 462654 465722 469870
62995 469870 474739 479631 483999 487826 491598 495722 500029 504039 507633 511122 514664 517955 520595 522537
62981 522537 524046 525405 526633 527305 526720 524471 520874 516571 511792 506178 499231 490596 480038 467566
62967 467566 453653 439014 424126 409283 395045 382124 370758 360579 351229 342752 335267 328692
62955 328692 322948 318102 314145 311009 308830 307737 307170 306104 304317 302885 302759 303285 302943 301345 299666
62940 299666 299013 299185 299392 299467 299684 299754 298820 296468 293142 289390 285250 280708 276300 272663 269661 266494
62924 266494 262721 258724 255103 252137 249948 248673 248041 247261 245824 244161 242987 242222 241117 239390 237661
62909 237661 236659 236449 236646 236991 237475 238068 238569 238726 238484 238081 237783 237483 236873 236153 236191 237600 239985 242537
62891 242537 245052 247744 250346 252223 253366 254449 255779 256985 258073 260014 263749 269052 274896 280549
62877 280549 285813 290503 294305 297219 299851 303106 307512 312650 317319 320564 322487 323680 324033 322797
62863 322797 319902 316381 313152 310094 306828 303729 301452 299883 298351 296662 295245 294404 294042 294085 294679
62848 294679 295924 297769 300126 302789 305403 307809 310271 312969 315553 317652 319614 322146 325295 328324
62834 328324 330608 332220 333649 335392 337764 340661 343442 345536 347224 349378 352356 355590 358318 360267
62820 360267 361483 361997 361929 361554 360914 359603 357219 353844 349899 345660 341159 336395 331394 326077 320298
62805 320298 314120 307965 302313 297144 291789 285635 278980 272864 267912 263713 259628 255773 252751 250669
62791 250669 249023 247398 245656 243450 240269 236215 232192 229026 226760 225017 223620 222511 221439 220154
62777 220154 218825 217955 217929 218742 220020 221232 222073 222741 223682 225011 226482 228019 229907 232269 234767 237058
62761 237058 239219 241402 243466 245342 247468 250345 253803 257204 260328 263599 267366 271360 274943 277555
62747 277555 278882 278991 278528 278428 279121 280168 280891 281122 281019 280259 277942 273497 267480 261222 255716 250975
62731 250975 246412 241579 236464 231280 226256 221652 217721 214444 211410 208256 205266 203290 202892 203658 204507
62716 204507 204567 203555 201550 198920 196509 195316 195520 196165 196311 196259 197104 199211 201879 204552 207533 211091
62700 211091 214635 217501 220165 223812 228857 234708 241062 248611 258021 268794 279732 290283 300882
62687 300882 312056 323682 335288 346708 358174 369902 381846 393784 405299 415569 423480 428329
62675 428329 430358 430342 428657 425026 419176 411316 401836 390860 378391 364645 350018 334992 320284
62662 320284 306772 294880 284212 274169 264759 256414 249214 242809 237069 232317 228862 226714 225771
62649 225771 225793 226068 225635 224163 222325 221021 220497 220452 220746 221590 223045 224638 225649 225743 225292 224988 225187 225742
62631 225742 226473 227438 228529 229134 228679 227430 226273 225723 225553 225394 225191 224968 224677 224527 225030 226329 227734
62614 227734 228336 227951 227227 226927 227277 227917 228335 228417 228617 229485 231056 232969 235112 237710 240772 243953 247205
62597 247205 251035 255685 260547 264923 269075 273828 279296 284721 289722 294995 301356 308530 315365 321058
62583 321058 325698 329700 333234 336405 339543 342850 345927 348109 349287 349996 350580 350723 350079 348955 347905
62568 347905 346895 345418 343379 341298 339505 337578 334789 330917 326504 322483 319503 317364 315117 312037
62554 312037 308536 305771 304329 303604 302537 300604 298041 295433 293165 290959 287950 283586 278424 273527
62540 273527 269100 264322 258663 252631 246957 241722 236781 232411 228902 225902 222875 219981 217879 216765
62526 216765 216075 215156 213891 212731 212380 213288 215172 217188 218805 220270 221975 223783 225398 227054 229356
62511 229356 232584 236623 241359 246656 252181 257716 263597 270335 277932 286018 294522 303606 312981 321871
62497 321871 329763 336775 343165 348893 353760 357630 360412 362091 362814 362688 361474 358846 354971 350614 346541
62482 346541 342949 339427 335380 330719 326238 323020 321221 319789 317725 315184 312801 310477 307641 304444
62468 304444 301747 299900 298392 296828 295524 294956 295308 296721 299212 302137 304519 306303 308513 311765 315339
62453 315339 318293 320816 323741 327244 330860 334522 338704 343556 348620 353594 358847 364880 371528 377897
62439 377897 383040 386614 388872 390071 390119 389031 387547 386606 386064 384543 380953 375682 369857 363981 358040
62424 358040 352581 348681 346672 345666 344654 343578 343008 343232 344146 345743 348172 351284 354542 357557 360507
62409 360507 363835 367689 371867 376249 380969 386058 391212 396139 400983 406116 411651 417578 424240 432119
62395 432119 440963 449740 457836 465932 475165 485689 496591 507095 517196 526991 535987 543484 549377
62382 549377 554171 558299 561768 564524 566878 569320 572006 574696 577315 580433 584970 591447 599697 609346
62368 609346 620382 633153 648070 665555 686248 710891 739861 772918 809612 849937 894462
62357 894462 943691 997328 1054331 1113635 1174519 1236001 1295962 1351233 1398795 1436957 1465548
62346 1465548 1485257 1496976 1501530 1499618 1491638 1477505 1456824 1429487 1396113 1357709 1315014 1268541
62334 1268541 1219401 1169627 1121286 1075432 1032236 991770 954196 919430 887343 858255 832595
62323 832595 809911 788900 768675 749470 731723 715077 698874 683284 669283 657595 648203 640906
62311 640906 635762 632681 630983 629834 629165 629820 632558 637060 642236 647528 653424 660433 667956 674758 680361
62296 680361 685319 690188 694912 699345 703623 707690 711102 713786 716443 719664 723116 726169 728987 732321
62282 732321 736459 741100 746197 752217 759432 767505 776024 785135 795402 807289 820863 835860 852028
62269 852028 869502 888726 909870 932617 956893 983569 1013842 1047929 1084954 1124360 1166948
62258 1166948 1214219 1266964 1324851 1387172 1453520 1523550 1596184 1669154 1739284 1803221 1857953
62247 1857953 1901047 1931039 1947977 1953344 1949064 1936535 1916729 1890819 1860110 1825348 1786635 1744321
62235 1744321 1699692 1654633 1610832 1569496 1531570 1497885 1468968 1444755 1424548 1407414 1392775
62224 1392775 1380583 1370798 1362929 1356439 1351517 1348936 1348971 1350823 1353383 1356302 1360036 1365093 1371677 1379939
62210 1379939 1390040 1401695 1413983 1426085 1438285 1451914 1468050 1486369 1505508 1524510 1543632
62199 1543632 1563713 1585100 1607542 1630954 1655899 1683217 1713358 1746163 1781179 1818168 1857382
62188 1857382 1899340 1944292 1991924 2041625 2092850 2145038 2197210 2247840 2295146 2337461 2373511
62177 2373511 2402681 2425207 2442127 2455101 2466223 2477674 2491122 2507405 2527018 2550890 2580339
62166 2580339 2616164 2658011 2704792 2755498 2809271 2864718 2919451 2970591 3015787 3053750 3083950
62155 3083950 3106171 3120589 3128102 3130082 3127594 3120976 3110183 3095230 3076209 3053272 3026984 2998563
62143 2998563 2969518 2941133 2914433 2890272 2869008 2850209 2833087 2817286 2803015 2790519 2779724
62132 2779724 2770332 2761908 2753858 2745675 2737333 2729234 2721704 2714667 2707752 2700541 2692822 2684902 2677569 2671454
62118 2671454 2666406 2661780 2657232 2652955 2649180 2645877 2642952 2640344 2637816 2634967 2631514 2627289 2622017 2615546
62104 2615546 2608386 2601570 2595740 2590614 2585440 2579664 2573102 2565950 2558848 2552566 2547343 2542762 2538448 2534602
62090 2534602 2531677 2529887 2529293 2530102 2532673 2537458 2545096 2556222 2570972 2589029 2610474 2636294 2667783
62077 2667783 2705547 2748928 2795463 2840470 2878149 2904520 2919623 2926507 2928404 2927524 2925952 2925926 2928144
62064 2928144 2930272 2927962 2917566 2897962 2870365 2836878 2799074 2757440 2711906 2662817 2611245 2558396
62052 2558396 2504971 2451158 2396874 2341792 2285408 2227509 2168569 2109487 2050912 1992986 1935725
62041 1935725 1879560 1825478 1774617 1727676 1684643 1645086 1608628 1575033 1544027 1515329 1488797
62030 1488797 1464242 1441100 1418775 1397401 1377730 1359854 1342474 1324012 1304129 1283604 1262901
62019 1262901 1241680 1219765 1197793 1176478 1155878 1135902 1117129 1100445 1086054 1073489 1062566
62008 1062566 1053707 1047264 1043106 1041193 1042056 1046289 1053754 1063756 1075892 1090251 1106589 1123644 1139523
61995 1139523 1152704 1162436 1168228 1169277 1164607 1153659 1136496 1113533 1085409 1053275 1018861 983896
61983 983896 949502 916281 884776 855510 828710 804349 782429 762867 745164 728715 713579
61972 713579 700498 689844 680975 672936 665459 658830 653039 647641 642439 637816 634188 631519 629555 628324
61958 628324 628079 628841 630278 632164 634864 639124 645246 652577 660111 667619 676011 686489 699567 715036
61944 715036 732605 752303 774385 799126 826675 856859 889052 922319 955725 988587 1020669
61933 1020669 1052284 1083970 1115796 1147065 1176881 1204839 1230890 1254611 1274989 1291051 1302581
61922 1302581 1310189 1314939 1318045 1320871 1324935 1331667 1342028 1356565 1376041 1401879 1435622 1477894
61910 1477894 1528254 1586080 1651250 1723847 1803761 1890793 1984679 2084683 2189728 2299557 2415536
61899 2415536 2539828 2673966 2818649 2974456 3141897 3320500 3508038 3700190 3890227
61890 3890227 4069018 4226011 4350729 4433794 4467848 4449118 4378698 4261914 4106227 3919822
61880 3919822 3711479 3490323 3264839 3042155 2827998 2626515 2439885 2268744 2113325
61871 2113325 1973798 1849594 1739269 1641467 1555372 1479946 1413542 1354916 1304101 1261644 1227364
61860 1227364 1200468 1180535 1167626 1161460 1161076 1165492 1174532 1188995 1210027 1237966 1271565 1308609
61848 1308609 1347494 1387923 1429797 1471875 1511896 1547731 1577889 1601170 1616478 1623082 1620877 1610466
61836 1610466 1593316 1571755 1548454 1525797 1505785 1490209 1480478 1477240 1480450 1489740 1504430 1523147
61824 1523147 1543695 1563554 1580551 1593087 1599800 1599168 1589769 1571173 1544372 1510972 1472090 1428492
61812 1428492 1381707 1334224 1288262 1244766 1203894 1165977 1131611 1101179 1074789 1052476 1034156
61801 1034156 1019611 1008815 1002021 999222 999875 1003459 1009997 1019670 1032260 1047496 1065630 1087098 1111721
61788 1111721 1138831 1168204 1200506 1236773 1277769 1323783 1374805 1430961 1493021 1562402 1640486
61777 1640486 1728092 1825807 1934572 2055727 2190828 2341881 2511469 2702125 2915580 3152949
61767 3152949 3415396 3704068 4019281 4359857 4722607 5101381 5486027 5862288 6212691
61758 6212691 6517766 6757667 6914909 6977699 6942217 6812870 6600909 6322196 5994698 5636360
61748 5636360 5263623 4890248 4526315 4178198 3849959 3544789 3264992 3011040 2781533
61739 2781533 2574399 2387931 2220756 2071325 1937645 1817452 1708803 1610781 1523449 1446701
61729 1446701 1379281 1319306 1265553 1217839 1176301 1140975 1111881 1088700 1070089 1053932 1038614
61718 1038614 1023593 1008526 992344 973654 951746 926824 899427 870045 839288 808125 777754
61707 777754 749161 722744 698440 676242 656406 638990 623420 608865 594951 581772 569318
61696 569318 557368 545937 535333 525523 515816 505508 494678 484165 474735 466334 458119 449294 439976
61683 439976 431101 423317 416232 409007 401479 394269 387934 382472 377675 373421 369512 365674 361947 358763
61669 358763 356415 354704 353263 352032 351190 350781 350581 350304 349819 349204 348597 348018 347409 346903 346879 347714 349662
61652 349662 353031 358138 364811 372216 379527 386632 393965 401876 410437 419515 428620 436921 443825 449374
61638 449374 453730 456675 458102 458598 458834 458672 457674 456320 455848 456903 459163 462377 466883 472909 480227
61623 480227 488833 499181 511187 523536 534500 543096 549060 552067 551412 546340 536576 522814 506686
61610 506686 489741 472306 453907 434881 416876 401339 388174 376361 365424 355707 347556 340798
61598 340798 334904 329325 323894 319169 316083 314940 315024 315375 315629 315825 315990 316426 317983 321348 326190 331517
61582 331517 336749 342002 347461 353009 358441 363633 368498 373145 378014 383495 389401 395196 400781 406710
61568 406710 413613 421720 431035 441589 453289 465775 478587 491330 503505 514411 523639 531663
61556 531663 539563 547939 556290 563764 570329 576754 583461 589921 595468 600276 605107 610409 616082 621900
61542 621900 627645 632970 637579 641527 644933 647520 648903 649157 648515 646515 642151 635018 625811 615612
61528 615612 605259 595604 587700 582235 579020 577376 576833 577387 579392 583344 589516 597758 607907 620297
61514 620297 635410 653141 673013 695122 720242 748950 781413 818140 860000 907121 958688
61503 958688 1014448 1075682 1143886 1218932 1299204 1382982 1468730 1554207 1636114 1710740 1774582
61492 1774582 1824632 1858835 1876422 1877513 1862552 1832616 1790067 1738205 1680116 1618224 1554880
61481 1554880 1492625 1433422 1377949 1326111 1278156 1234944 1197114 1164350 1135820 1111231 1091083
61470 1091083 1075729 1064610 1056744 1051729 1049746 1050701 1053894 1058619 1064735 1072569 1082607 1095244 1110405
61457 1110405 1127423 1145642 1165033 1185728 1207151 1228390 1249399 1271017 1293562 1316256 1338338
61446 1338338 1359959 1381577 1403287 1425282 1448292 1472803 1498174 1523026 1546064 1566149 1582186
61435 1582186 1593669 1601074 1605231 1606635 1605794 1603678 1601120 1598075 1594043 1588963 1583205 1576962 1570206 1563024
61421 1563024 1555465 1547302 1538370 1528805 1518553 1507066 1494107 1480509 1467481 1455348 1443632 1432133
61409 1432133 1421211 1411017 1401056 1390638 1379330 1366947 1353482 1339089 1323980 1308419 1293027
61398 1293027 1278749 1266242 1255493 1246365 1239288 1235117 1234549 1237979 1245650 1257670 1274169 1295720 1323289
61385 1323289 1357490 1398287 1445673 1500093 1561774 1630168 1704544 1784649 1870217 1960204 2052910
61374 2052910 2146284 2237486 2322651 2397837 2459978 2506646 2535813 2546924 2541767 2523191 2493034
61363 2493034 2452012 2401209 2342503 2277495 2206997 2131872 2053759 1974811 1897118 1822339 1751329
61352 1751329 1684195 1621097 1562845 1510291 1463481 1422085 1386247 1356222 1331418 1310766 1294018
61341 1294018 1281688 1273457 1267384 1261004 1252822 1242693 1231382 1219981 1209332 1199784 1191681 1185911 1183576
61328 1183576 1185158 1190325 1198487 1209176 1222008 1236573 1252202 1267669 1281617 1293644 1304522 1314894
61316 1314894 1324308 1332112 1338618 1344541 1349811 1353916 1357029 1359748 1361982 1363223 1363794 1364712 1366284 1367794
61302 1367794 1368767 1369636 1370972 1372796 1374815 1376739 1378253 1379112 1379045 1376999 1370855 1358940 1341696 1321059
61288 1321059 1298415 1274182 1249195 1225080 1202912 1182620 1164086 1147874 1134380 1123066 1113008
61277 1113008 1103689 1095006 1087126 1080491 1075361 1071220 1067286 1063712 1061558 1061573 1063810 1068530 1076446 1087703
61263 1087703 1101504 1117234 1135273 1156202 1179743 1204899 1230750 1256834 1283263 1310715 1340002
61252 1340002 1371462 1405023 1440579 1477716 1515209 1551529 1585802 1617577 1645817 1669028 1686299
61241 1686299 1697252 1700882 1695548 1680388 1655901 1622989 1582519 1536137 1486420 1435643 1385159 1336368
61229 1336368 1291187 1250768 1214471 1180951 1149779 1121452 1096299 1074093 1054459 1037058 1021438
61218 1021438 1007063 993447 980230 967309 954935 943381 932565 922278 912644 903999 896585 890863
61206 890863 887745 887794 890410 894493 899527 905116 909908 912272 912079 910657 908998 907165 905477 904849 905582
61191 905582 907012 908848 911769 916252 921883 928366 936124 945148 954029 960819 964318 964098 960022 952390
61177 952390 942141 930551 918952 908529 899572 890846 880555 868116 854285 839671 824145 807711
61165 807711 790779 773320 754889 735755 717096 699809 684141 670462 659118 649313 639585 629806
61153 629806 621439 615339 610676 606560 603409 601954 602121 603686 606978 612208 619048 627481 638103 651011
61139 651011 665241 679592 692801 702741 707062 705466 700024 692582 683271 672204 660948 651118 642840
61126 642840 635789 630463 627166 624822 622204 619539 617797 617132 616986 616859 616073 613741 610036 606541 604314
61111 604314 602455 599599 595936 592671 590314 588568 587189 585899 584162 581983 580353 580092 580935 582391 584570
61096 584570 587392 589968 591646 592736 593326 592310 588546 582163 573985 564584 554631 545138 536447 527894
61082 527894 519209 511240 504641 499032 494172 490645 488539 486772 484648 482825 481887 481369 481044 481637 483365
61067 483365 485381 487642 491497 497158 502481 505816 508390 512273 517569 523311 529470 536144 542142 546388
61053 546388 549680 553351 557303 560921 564626 568850 572724 575489 578045 581489 585335 588727 592123 596237
61039 596237 600720 605328 610838 617308 623165 627654 632267 638071 643724 648153 652955 659777 667449 674269
61025 674269 681120 689630 699144 708331 718013 729548 742178 754835 768803 785661 804329 823062
61013 823062 842504 863744 885371 905715 925984 947749 969373 988573 1006475 1025316 1044274
61002 1044274 1061716 1079462 1100351 1123489 1146539 1170924 1199974 1233762 1270717 1312464 1361754
60991 1361754 1417364 1476712 1541977 1617742 1703885 1796441 1893645 1994885 2096081 2193892 2293471
60980 2293471 2404563 2531204 2673067 2834964 3025015 3243586 3483826 3743424 4026586
60971 4026586 4336123 4676695 5066907 5534925 6100540 6775653 7583075 8556405 9719501
60962 9719501 11092016 12726676 14718331 17170619 20198130 23980274 28711923 34330039
60954 34330039 40217802 45287461 48538272 49651091 49087844 47679311 46187164 45202706
60946 45202706 45210052 46442337 48555941 50563778 51290763 50035474 46875925 42436804 37443862
60937 37443862 32452490 27814298 23719385 20220777 17273948 14804147 12747880 11046476
60929 11046476 9636015 8461638 7488493 6688444 6026890 5470371 4996764 4590031 4233182
60920 4233182 3913362 3626413 3369642 3135989 2920476 2725667 2554692 2404280 2269911
60911 2269911 2151978 2050623 1959091 1868390 1775447 1681835 1588115 1494649 1404907 1322682 1247755
60900 1247755 1178187 1114567 1058289 1008019 961614 919474 882611 849566 818491 790107 765408
60889 765408 742645 719846 698212 679786 663666 647693 632066 618208 605747 593677 582889
60878 582889 574546 567367 559372 550927 543390 536141 527731 518671 510453 502897 494935 486909 479819 473421
60864 473421 467223 462037 458410 454926 450268 445540 442339 440009 437191 434548 433403 433004 431823 430475
60850 430475 430713 432384 433824 434511 435060 435478 435637 436630 439468 443165 446074 448114 449758 450131 448449 446115
60834 446115 444840 443703 440716 436433 433341 432357 432553 433589 435552 436857 435373 431734 428887 428180 428408
60819 428408 428879 430799 434943 440111 444645 447781 449077 448214 445915 443685 442249 441408 441393 442941 446025
60804 446025 449897 454398 459871 465877 471484 476763 482512 488519 493608 497483 501085 504949 508528 511262
60790 511262 513120 514004 513738 512634 511030 508481 504487 499681 495082 490575 485439 479980 475122 470754 466082
60775 466082 461420 457915 455604 453379 450843 448546 446375 443480 440057 437548 436672 436689 436905 437454 438243 438629
60759 438629 438665 439350 441047 442794 443719 444174 445039 446825 449738 453712 458131 462404 466979 472831 479914 487168
60743 487168 494106 501134 508085 513778 517453 519568 520668 520491 518660 515344 510763 504833 497695 489909
60729 489909 481822 473464 465264 458012 451806 445772 439115 431830 424227 416504 408962 401901 395131 388224
60715 388224 381374 375316 370321 365918 361668 357543 353614 350033 347210 345245 343369 340835 338118 336171
60701 336171 334719 332531 329400 326492 324520 322814 320609 318063 315542 312990 310572 308990 308531 308588 308669
60686 308669 309119 310307 311815 313071 314319 316389 319809 324362 329140 332926 335129 336533 338588 341818
60672 341818 345463 348725 351642 354547 357451 360352 363534 367172 371056 375065 379574 385083 391703 399092
60658 399092 406749 414416 422398 431252 440899 450378 458935 466896 474998 483403 492091 501594 512261 523215
60644 523215 533197 542125 550670 558513 564283 567241 567771 566232 562627 557571 552281 547205 541705 535360
60630 535360 528513 521296 513289 504623 496440 489747 484601 480653 477638 475054 472313 469549 467439 466075
60616 466075 464902 463894 463665 464275 465148 466382 468810 472336 475673 478383 481828 487241 494080 501288 509087
60601 509087 518414 529481 542075 556538 573268 591593 610156 628092 645026 660253 672779 682042
60589 682042 688009 690755 690418 687352 681986 674749 666309 657399 648191 638471 628671 619961 612849 606352
60575 606352 599052 590470 581145 572024 564099 557801 552305 546277 539736 534245 530673 527796 524003 519446
60561 519446 515522 512935 511381 510571 510423 510532 510490 510584 511410 513030 515134 517736 520968 524528 528087 531959
60545 531959 536569 541480 545679 548707 550935 553008 555669 559829 566045 574019 583184 593542 605376 618577
60531 618577 633043 649469 668868 691454 716874 745480 778468 816722 860432 910158 967530
60520 967530 1034412 1111869 1200356 1300351 1411911 1533106 1658934 1782067 1895083 1992403
60510 1992403 2070513 2127197 2161522 2174713 2170087 2151303 2120705 2079386 2028121 1967686 1898857
60499 1898857 1823056 1742960 1661966 1583162 1509162 1442518 1385463 1339193 1303931 1279777 1267061
60488 1267061 1265978 1276396 1298209 1331575 1376656 1433113 1499450 1572249 1646003 1714104 1770431
60477 1770431 1810472 1831745 1833962 1819039 1790770 1754256 1715206 1678911 1649220 1628372 1617771
60466 1617771 1618563 1631360 1656043 1692464 1741309 1804126 1882868 1979770 2097405 2238460 2405664
60455 2405664 2602140 2831649 3098404 3407103 3763388 4173595 4643328 5176041 5772080
60446 5772080 6426349 7123568 7834262 8515954 9119994 9599859 9917153 10045269 9972514 9705093
60436 9705093 9268032 8701610 8053182 7367725 6681718 6021894 5406358 4845397 4342281
60427 4342281 3895448 3501372 3156067 2855051 2593230 2365397 2166701 1992809 1840185
60418 1840185 1706291 1589124 1486443 1395802 1315383 1244387 1182393 1128410 1080661 1037195 996685
60407 996685 958684 923130 889744 858084 828106 800275 775005 752230 731597 712674 694876
60396 694876 677590 660671 644600 629962 616992 605626 595587 586332 577426 569106 561981 555975
60384 555975 550110 543604 536678 530050 524265 519824 517179 516024 515158 513689 511963 510857 510687 511300 512536
60369 512536 513862 514205 513011 511078 509475 507977 505470 501566 496893 492012 487032 482180 477738 473329
60355 473329 468119 461953 455646 450050 445398 441540 438137 434619 430738 427242 425267 424859 424781 423996 422637
60340 422637 421308 420170 419225 418944 419929 422160 425008 427922 430818 433880 437248 440925 444815 448750 452512
60325 452512 456034 459807 465007 472738 483024 494938 507948 522599 539437 557705 575620 591628
60313 591628 604838 614609 620454 622302 620434 615374 608253 600838 594385 588662 582823 577043 572455 569551
60299 569551 567515 565158 561727 556774 550157 542385 534224 525703 516204 505697 495099 485106 475534 466129
60285 466129 457219 448955 440713 432032 423613 416613 411259 406909 403264 400805 399998 400683 402340 404506 406830
60270 406830 409171 411839 415471 420403 426312 432566 438828 445098 451273 456944 461797 466031 470086 473993
60256 473993 477361 480160 483172 487346 492809 498880 505029 511586 519481 529359 540942 553247 565594
60243 565594 578427 592913 609764 628902 650343 674712 702389 732735 764865 798827 835242
60232 835242 874049 914370 955470 996953 1038044 1077633 1115281 1151330 1185602 1216735 1243404
60221 1243404 1265619 1284155 1299053 1309371 1314346 1314183 1309624 1301231 1289330 1274416 1257312 1239029
60209 1239029 1220678 1203469 1188433 1175962 1165931 1158598 1155116 1156606 1162938 1173224 1187586 1207384
60197 1207384 1233297 1264109 1298300 1336022 1378363 1425071 1474240 1524126 1574037 1623159 1669648
60186 1669648 1711470 1747556 1777681 1801684 1819209 1829841 1833222 1829220 1818104 1800360 1776551 1747844
60174 1747844 1716453 1684776 1654066 1624642 1597433 1574415 1557290 1546585 1542451 1545609 1556999 1577136
60162 1577136 1606376 1645274 1694082 1752244 1818871 1893140 1973440 2056217 2136299 2208400 2268207
60151 2268207 2312440 2338823 2346448 2336194 2310679 2273620 2228743 2178890 2126043 2072066 2019134
60140 2019134 1969417 1924601 1885721 1853091 1826392 1805358 1790559 1783111 1783554 1791605 1807245 1831447
60128 1831447 1865383 1909409 1963344 2027392 2102209 2188275 2285697 2394432 2514149 2643812 2781720
60117 2781720 2926005 3074895 3226440 3378017 3526036 3666128 3793958 3906015 3999587 4072201
60107 4072201 4121662 4146739 4147242 4123196 4074597 4002418 3909382 3799189 3675376 3541355 3401073
60096 3401073 3258777 3118177 2982379 2854383 2736827 2631097 2537335 2455613 2386745 2331851
60086 2331851 2291475 2265312 2252433 2251576 2261505 2281291 2310123 2346761 2389398 2436060 2484807 2533376
60074 2533376 2579106 2619719 2654152 2682293 2703985 2718696 2726313 2727819 2724831 2718633 2709911 2699300
60062 2699300 2687634 2675650 2663908 2653327 2645473 2641930 2643492 2650223 2662100 2679128 2700683 2724913
60050 2724913 2748794 2768709 2781321 2784481 2777630 2761460 2737382 2707423 2674243 2640713 2609368 2582343
60038 2582343 2561405 2547462 2540053 2537815 2539538 2544460 2551593 2559237 2565323 2567954 2565664 2557485 2542853
60025 2542853 2521266 2492177 2455489 2411907 2362258 2306692 2245174 2178732 2109583 2040053 1971960
60014 1971960 1906997 1846770 1792205 1743598 1701493 1666765 1639601 1619271 1605421 1598815 1600167 1608950
60002 1608950 1624161 1645718 1674202 1709584 1751205 1798991 1853827 1916351 1985784 2059972 2136142
59991 2136142 2211498 2283505 2349925 2408687 2457854 2495882 2521855 2535405 2536593 2525959 2504278
59980 2504278 2471981 2429109 2376244 2315358 2249420 2181316 2113402 2047775 1986363 1930594 1881316
59969 1881316 1839147 1804766 1778823 1761693 1753300 1753168 1760787 1776080 1799313 1830333 1867959 1910313
59957 1910313 1955771 2003573 2053632 2105721 2158616 2209887 2256703 2297004 2329960 2355580 2374247
59946 2374247 2386588 2393255 2394672 2391314 2384244 2374936 2364507 2353728 2343981 2337542 2336479 2341824 2354336
59933 2354336 2375653 2408065 2453369 2512422 2585603 2673165 2775144 2891215 3020487 3161103
59923 3161103 3310138 3463945 3618217 3767486 3905167 4024738 4120742 4188557 4224054 4224651
59913 4224651 4190766 4125628 4033681 3919663 3788864 3647171 3500253 3352924 3209189 3072282
59903 3072282 2944416 2826932 2721001 2627869 2548270 2481965 2428133 2386088 2355495 2336210 2328171
59892 2328171 2331400 2345852 2371237 2406984 2452315 2506314 2567900 2635562 2707013 2779058 2847847
59881 2847847 2909262 2959308 2994630 3012968 3013065 2994196 2956164 2899884 2827582 2742070 2646149 2542871
59869 2542871 2435862 2328616 2223433 2121375 2023069 1929119 1839909 1755655 1676808 1604019
59859 1604019 1537612 1477438 1423443 1376035 1335704 1302422 1275645 1254767 1239419 1229270 1223642
59848 1223642 1221424 1221394 1222550 1224090 1225248 1225447 1224604 1223033 1221109 1219316 1218501 1219406 1221692 1223886 1224689 1224053
59832 1224053 1222724 1221029 1218398 1213834 1206574 1196548 1184445 1171078 1156565 1140538 1123318 1106314
59820 1106314 1090892 1077411 1065760 1056205 1049046 1043966 1040495 1038832 1039509 1042679 1048580 1058409 1073826
59807 1073826 1095584 1123246 1155674 1190573 1223779 1250801 1270056 1283990 1296721 1311380 1329892
59796 1329892 1353513 1381692 1410533 1433889 1446767 1447732 1438456 1421910 1401119 1378694 1356544 1335824
59784 1335824 1317379 1302341 1292092 1287655 1289174 1296117 1307961 1324740 1347070 1375852 1411948 1456004
59772 1456004 1508494 1570000 1641380 1723663 1817868 1925070 2046309 2181831 2330057 2486990
59762 2486990 2645797 2796061 2923828 3014391 3057133 3048993 2994317 2902519 2785664 2656046
59752 2656046 2523598 2394804 2274034 2165121 2070759 1991104 1924403 1869142 1824745 1790392
59742 1790392 1764475 1745633 1733472 1727948 1728754 1735527 1747924 1765267 1786940 1813411 1846036 1885387
59730 1885387 1930540 1980593 2036246 2099239 2170764 2251067 2340239 2438681 2547063 2666432 2798255
59719 2798255 2943877 3104024 3279171 3470089 3677516 3901314 4140248 4392269 4654501
59710 4654501 4922946 5192567 5457746 5712736 5952427 6173618 6375890 6561106 6732258
59701 6732258 6893040 7047895 7201316 7356495 7514726 7675773 7837875 7997107 8147618
59692 8147618 8283379 8399690 8492831 8559106 8595542 8601712 8580076 8534178 8467149 8382410 8285091
59681 8285091 8181753 8078724 7981242 7894038 7821892 7769244 7739584 7735396 7758401 7809848 7891108
59670 7891108 8004086 8150476 8330441 8542565 8785282 9057437 9356611 9677175 10010361
59661 10010361 10345439 10669802 10968251 11223696 11419489 11541493 11579004 11525672 11380946 11150880
59651 11150880 10847337 10486195 10085349 9662605 9233792 8811964 8407756 8029841 7684761
59642 7684761 7376579 7106713 6873624 6672151 6493151 6324058 6150492 5958827 5739423
59633 5739423 5489359 5213055 4920264 4622661 4330749 4052152 3791489 3551197 3332334
59624 3332334 3134872 2957891 2800058 2659984 2536058 2426313 2328927 2242755 2167122 2101247
59614 2101247 2044171 1995034 1953039 1917300 1887011 1861544 1840021 1821188 1804196 1789096 1775854
59603 1775854 1763186 1749198 1733012 1714888 1694794 1671928 1645903 1617423 1587295 1555585 1522324
59592 1522324 1488466 1455406 1423903 1394004 1365795 1339662 1315892 1294434 1275147 1258070 1243402
59581 1243402 1231292 1221673 1214372 1209441 1207169 1207553 1209988 1213813 1218907 1225298 1232424 1239449 1246269 1253623
59567 1253623 1262109 1271614 1281689 1291925 1301948 1311683 1321811 1333345 1346579 1360929 1375952 1391978
59555 1391978 1409691 1429646 1452383 1478464 1508247 1542055 1580576 1624458 1673600 1727526 1786449
59544 1786449 1851102 1921514 1996992 2077429 2163496 2255087 2350641 2448377 2547183 2645962 2743563
59533 2743563 2840043 2936115 3029481 3112685 3176740 3217270 3236426 3239541 3231363 3214962 3192004 3162968
59521 3162968 3127901 3087532 3043296 2996332 2947380 2897858 2850283 2807329 2771144 2743747 2727341
59510 2727341 2723685 2733653 2757831 2797225 2852967 2925392 3013479 3114906 3226348 3343617 3461426
59499 3461426 3573031 3670683 3747198 3797478 3818694 3809601 3770208 3701890 3607167 3489453 3353450
59488 3353450 3205437 3052232 2899534 2751485 2611473 2482276 2365171 2259793 2165511 2082595
59478 2082595 2011668 1952470 1903818 1864651 1834669 1813938 1802217 1798765 1802715 1813599 1831603 1857365
59466 1857365 1891501 1934256 1985401 2044279 2109992 2181592 2258057 2338063 2419919 2501729 2581287
59455 2581287 2655676 2721288 2774576 2812756 2833864 2836688 2821038 2787796 2738305 2674001 2596924
59444 2596924 2510150 2417064 2320392 2222292 2124940 2030284 1939359 1852545 1770406 1693647 1622411
59433 1622411 1556357 1495487 1440202 1390516 1345922 1306146 1271300 1241111 1214720 1191542 1171698
59422 1171698 1155292 1141845 1130835 1122295 1116522 1113553 1113275 1115723 1121069 1129526 1141243 1156054 1173731
59409 1173731 1195269 1223218 1258731 1297470 1330097 1348538 1351721 1344911 1334745 1326015 1321685 1323348
59397 1323348 1331348 1346136 1369584 1402914 1442443 1479238 1504924 1517757 1522507 1525455 1530679 1540218
59385 1540218 1555492 1577492 1606307 1641268 1681592 1726860 1777256 1833441 1895960 1964713 2039219
59374 2039219 2119335 2205403 2297755 2396589 2502441 2616550 2740680 2876837 3027065 3192968
59364 3192968 3375247 3574015 3789608 4022529 4272191 4535931 4809431 5087681 5365308
59355 5365308 5636671 5896655 6141705 6369882 6580115 6771859 6945526 7102689 7245432
59346 7245432 7375265 7492262 7594800 7680056 7744910 7786231 7800046 7780842 7722698 7621733
59336 7621733 7477563 7292770 7071787 6820631 6546928 6259137 5965362 5672784 5387676
59327 5387676 5115131 4858506 4619338 4398038 4194672 4009271 3841678 3691208 3556404
59318 3556404 3435260 3325978 3227617 3139931 3062650 2995099 2936425 2885761 2842013 2803853 2770413
59307 2770413 2741922 2719236 2702541 2690754 2682357 2676478 2672885 2671194 2670712 2671079 2672439 2674688 2676827
59294 2676827 2677410 2675408 2670385 2662128 2650511 2635645 2617828 2597382 2574680 2550138 2523988 2496364
59282 2496364 2467998 2440557 2415769 2394340 2376147 2361285 2350270 2343244 2339715 2339382 2342713 2350458
59270 2350458 2362894 2379672 2399983 2422607 2446084 2469035 2490129 2507779 2520322 2526688 2526608 2520115
59258 2520115 2507218 2488195 2463987 2436489 2408851 2384642 2364769 2344378 2314091 2266123 2199735
59247 2199735 2120805 2037027 1954289 1876438 1806092 1744570 1691868 1647588 1611664 1583844 1562963
59236 1562963 1547395 1536202 1529477 1527555 1530227 1536796 1546634 1559478 1575347 1594513 1617605 1645396
59224 1645396 1678175 1715548 1757084 1803010 1853871 1909770 1970610 2037141 2110972 2193251 2283991
59213 2283991 2383215 2492215 2612928 2746325 2892145 3050076 3220367 3402936 3596236 3797191
59203 3797191 4001808 4205422 4402425 4586156 4749504 4886029 4990801 5060437 5092793 5087189
59193 5087189 5045125 4970426 4868398 4744876 4605909 4457630 4305579 4153949 4005520 3862130
59183 3862130 3724949 3594523 3470926 3354027 3243690 3139955 3043100 2953248 2869765 2791426
59173 2791426 2717435 2648004 2583661 2524362 2469669 2419493 2374073 2333328 2296713 2263745 2234276
59162 2234276 2208210 2185267 2165106 2147428 2131945 2118447 2106925 2097524 2090323 2085237 2082056 2080544
59150 2080544 2080638 2082665 2087168 2094436 2104310 2116386 2130046 2144264 2157970 2170903 2183591 2196070 2207025
59137 2207025 2214704 2218381 2218431 2215227 2208586 2198177 2183910 2165963 2144835 2121323 2096010 2068927 2040178
59124 2040178 2010818 1982553 1956575 1933233 1912844 1896144 1883651 1875097 1869815 1867376 1867538 1869925
59112 1869925 1874099 1879862 1887191 1895977 1906024 1917203 1929353 1941919 1953842 1963939 1971449 1976267
59100 1976267 1978855 1980105 1981338 1984202 1990313 2000975 2017240 2039957 2069377 2104737 2144462 2186694
59088 2186694 2229298 2269549 2304447 2331470 2348676 2354101 2345813 2322871 2285754 2235587 2173519 2101222
59076 2101222 2021351 1936847 1850083 1763036 1677742 1595836 1517903 1443922 1374287 1309840 1251076
59065 1251076 1197804 1149487 1105425 1064810 1027190 992873 962394 935559 911416 889153 868650
59054 868650 850141 833753 819394 806773 795502 785443 776904 770208 765099 760803 756633 752357 748137
59041 748137 744365 741500 739830 739531 741024 745022 752008 761937 774647 790288 809064 830875 855421
59028 855421 882235 910311 938140 964495 988786 1010462 1028691 1043149 1054429 1062976 1068159 1069179
59016 1069179 1066361 1060715 1052770 1043017 1033185 1025719 1021761 1020615 1021380 1024200 1029648 1037748 1048042 1059943
59002 1059943 1072625 1085052 1096386 1105972 1112716 1114993 1111435 1101563 1085754 1065115 1041403 1016313
58990 1016313 990614 964381 938171 913283 890704 870408 852061 835827 822074 810691 801149
58979 801149 793003 786069 780380 776229 774009 773788 775240 778117 782525 788551 795981 804634 814741 826625
58965 826625 840085 854293 868349 881818 894650 906566 916633 923734 927564 928912 928831 927775 925774
58952 925774 923112 920499 918730 918461 920073 923519 928584 935475 944704 956045 968233 980342 992941
58939 992941 1007023 1022192 1036968 1050783 1064520 1078947 1093631 1107934 1122222 1137418 1153843
58928 1153843 1171159 1189291 1208930 1231128 1256669 1285771 1318224 1353770 1392467 1434674 1480818
58917 1480818 1531170 1585745 1644315 1706671 1773023 1844024 1920364 2002627 2091632 2188598 2294702
58906 2294702 2410733 2537234 2674633 2823187 2983226 3155559 3340963 3539052 3748327
58897 3748327 3967551 4196083 4432264 4672288 4911342 5144920 5368015 5573837 5754763
58888 5754763 5904467 6018360 6092549 6123733 6110354 6053231 5955376 5821852 5659345 5474721
58878 5474721 5273893 5062300 4845622 4628897 4415390 4207263 4006729 3815356 3632936
58869 3632936 3458643 3293053 3137619 2992476 2856427 2728976 2610648 2501216 2399382
58860 2399382 2304592 2217453 2137723 2063400 1992543 1924733 1860033 1797836 1737705 1680382 1626984
58849 1626984 1577912 1533144 1492800 1456662 1423831 1393677 1366632 1343463 1324270 1308666 1296413
58838 1296413 1287303 1280821 1276412 1273827 1273027 1274085 1277269 1282772 1290314 1299481 1310390 1323513 1338986
58825 1338986 1356766 1377229 1400741 1426847 1454894 1485285 1519020 1556097 1595626 1637618 1683396
58814 1683396 1734017 1789519 1849946 1915761 1986871 2062612 2143350 2230998 2327406 2433254 2548912
58803 2548912 2675153 2812364 2960214 3118793 3289143 3471947 3666549 3871708 4086232
58794 4086232 4308175 4534276 4760688 4983236 5196318 5392688 5565125 5707605 5814557
58785 5814557 5880545 5902015 5878727 5812718 5706732 5564518 5391831 5195850 4983744 4762062
58775 4762062 4536617 4311886 4090710 3875008 3666432 3466142 3274814 3093325 2922792
58766 2922792 2763643 2615414 2477787 2350976 2234848 2128644 2031879 1944475 1865655 1793929
58756 1793929 1728578 1669978 1617961 1571217 1528966 1491816 1460126 1432770 1408477 1387174 1369063
58745 1369063 1353572 1340321 1330036 1323325 1319481 1317566 1317773 1320599 1325535 1331628 1338452 1345347 1350434
58732 1350434 1351579 1347890 1339544 1326998 1311260 1294122 1277076 1260582 1244993 1231118 1218967 1207051
58720 1207051 1194046 1180129 1165541 1148910 1128429 1103929 1076475 1046673 1014697 981308 947422
58709 947422 913110 878274 843821 811067 780484 752087 726409 703898 683890 665355 648217
58698 648217 632907 619213 606700 595694 586711 579407 573187 568253 564906 562372 559498 556164 552844
58685 552844 549288 544846 539738 534827 530385 526045 521660 517349 513179 509585 507540 507393 508266 509536 512193
58670 512193 517712 526360 537686 551744 568373 585949 602360 616904 630036 641726 651352 658744
58658 658744 664007 666538 665374 660262 651524 639370 624365 607979 591621 575669 560339 546640
58646 546640 535210 525089 515124 505973 499204 494949 492017 489974 489520 490949 493570 496625 499782 502868
58632 502868 506016 509754 514121 518284 521854 525785 530998 537033 543217 550130 558570 568070 578043 589448
58618 589448 603530 619660 636229 653045 671034 690221 710040 731286 755697 783647 814093
58607 814093 846730 882427 921524 963398 1007925 1055902 1107906 1164016 1224615 1290143 1360008
58596 1360008 1432798 1507271 1581844 1653424 1718044 1772523 1814548 1841905 1853275 1849406 1832026
58585 1832026 1801958 1759840 1708206 1651132 1591953 1532683 1475167 1421134 1371326 1326158 1286934
58574 1286934 1254853 1229151 1207843 1190000 1175784 1164720 1155671 1148201 1142295 1137264 1132711 1130172
58562 1130172 1131780 1137545 1145758 1155552 1166793 1177615 1184421 1184628 1177525 1162482 1138594 1106617 1069404
58549 1069404 1029853 989773 950713 914173 880679 850093 822782 798999 777344 755639 733302
58538 733302 711191 689482 667723 646835 628740 613758 600358 587709 576477 566851 557870 549206
58526 549206 541816 536294 532124 528857 526412 524019 520606 516455 512821 509767 506091 501561 497428 494481
58512 494481 492366 491049 491158 492557 494219 495871 498269 501701 505712 510375 516200 522765 529027 534894
58498 534894 540920 546702 551414 555700 561147 568033 575539 583884 594115 606041 618662 632470 648856
58485 648856 667188 684939 700888 715776 729540 740482 747722 752169 754431 753796 749773 742681 732356
58472 732356 718324 701552 684022 666447 648428 630804 615376 602208 589717 577760 568066 561191
58460 561191 555559 550120 545526 542075 538850 535546 533017 531506 530410 530092 531636 534573 537236 539601
58446 539601 543269 548409 553391 557835 563303 570435 578125 586035 595294 606087 617234 628762 642264
58433 642264 658146 675166 693119 713105 734558 754832 772346 787248 798511 803597 801943 795802
58421 795802 786837 774916 761035 748056 737229 727003 716517 707380 700880 696385 693676 693933 697162
58408 697162 701502 706312 713178 722849 734042 746263 760710 777264 793686 808877 823685 837393
58396 837393 846863 850678 850884 849194 844790 837407 829191 821648 813885 805616 798826 794593 791214 787188
58382 787188 783238 779882 776087 771911 769403 769241 769561 769633 771430 775865 780785 784478 787986 792159 795701
58367 795701 798063 801127 806104 811702 817017 823121 830220 836574 841873 848379 857062 866064 874587 884671
58353 884671 897355 910771 923878 938427 955372 973129 991247 1011898 1035695 1059829 1082282
58342 1082282 1103869 1124135 1139620 1148671 1153948 1157796 1159155 1157348 1154644 1152474 1149293 1144814 1142230
58329 1142230 1143548 1146792 1150407 1156209 1165275 1175218 1184338 1194367 1206458 1218836 1231031 1245925 1264786
58316 1264786 1284830 1304485 1326375 1352144 1379168 1405464 1433006 1462973 1492631 1520098 1547289
58305 1547289 1574904 1599550 1619155 1636086 1651697 1663319 1670263 1677128 1687167 1697825 1706786 1716910
58293 1716910 1731029 1747398 1764516 1784934 1809902 1835819 1860398 1886811 1917479 1949469 1980415
58282 1980415 2013054 2049370 2086294 2121929 2159956 2203100 2248407 2293746 2342574 2397366 2454901
58271 2454901 2513194 2576334 2647042 2721096 2794405 2868710 2944832 3017487 3082671 3143198 3201368
58260 3201368 3253567 3298046 3340466 3385701 3431699 3477188 3527325 3585504 3647864 3712125 3783340
58249 3783340 3864754 3951990 4042621 4141939 4252662 4368970 4487572 4614198 4752072 4895066
58239 4895066 5039804 5192996 5358961 5532014 5709446 5899269 6106292 6323777 6548095
58230 6548095 6787945 7049479 7326809 7617224 7930571 8272917 8636906 9019437 9432203
58221 9432203 9883279 10366204 10879495 11437946 12051757 12714680 13426368 14204918 15063425
58212 15063425 15998004 17014586 18142449 19405382 20807527 22365616 24125689 26130449
58204 26130449 28405002 30996623 33993374 37484219 41545772 46294958 51908732 58567324
58196 58567324 66435894 75734795 86768991 99870534 115415443 133956720 156252499
58189 156252499 183123498 215372755 253659687 297661989 344474140 387765836 419426736
58182 419426736 433184179 427437119 405207298 371878096 332907169 292697808 254304435
58175 254304435 219441371 188746488 162241460 139674348 120622575 104565540 91027381
58168 91027381 79635784 70052488 61946154 55059381 49221113 44269774 40033113 36392747
58160 36392747 33290821 30655615 28386137 26415679 24719152 23251580 21951155 20808096
58152 20808096 19858303 19106171 18526433 18138530 17997407 18113290 18466444 19095448 20078191
58143 20078191 21440835 23201170 25493647 28530466 32480210 37572636 44249425 52763677
58135 52763677 62309431 70756258 75688455 75909290 71956730 65346998 57567042 49670162
58127 49670162 42334465 35922608 30501315 25972905 22230905 19179984 16690715 14629101
58119 14629101 12914187 11498953 10322846 9327227 8490802 7806727 7242558 6755171 6325998
58110 6325998 5951647 5616550 5301025 5001213 4718777 4445406 4176503 3924930 3703326
58101 3703326 3506650 3327094 3170931 3045570 2944191 2856741 2781870 2715409 2642147 2552779
58091 2552779 2456323 2364097 2274481 2184163 2100068 2027617 1959575 1888306 1817743 1752722 1688132
58080 1688132 1619443 1553022 1495449 1442624 1389206 1338992 1296453 1257378 1217053 1178907 1146605
58069 1146605 1116188 1083953 1053614 1028248 1003668 976935 952737 934329 916859 896692 878597
58058 878597 866470 855427 840436 824677 812108 799541 783407 767066 754221 741885 726678
58047 726678 711509 699609 688361 675203 663261 655180 647636 637672 628200 621727 615040 605683 597383
58034 597383 593412 590727 586132 582041 580506 577677 570014 560383 552436 544470 534284 524514 517558 510427
58020 510427 500228 489805 482624 476837 469588 462533 458076 454615 450324 447128 446328 444877 440559 436346
58006 436346 435149 434968 433666 433732 437445 441857 443581 444432 447571 452093 456052 460862 467963 474760 478393
57991 478393 480177 482264 483461 482275 480372 479116 476313 470269 463309 457519 450841 441285 431096 422723
57977 422723 414488 404422 394625 387623 381850 374932 368134 363498 359896 355842 353019 353059 354044 353999 354674
57962 354674 358034 362283 365223 368304 373349 378317 380342 380068 379145 376420 370542 363510 357721 352145 345191
57947 345191 338585 334479 331304 326433 320696 316542 313962 311761 310633 311500 312959 313686 315215 319295 324849
57932 324849 330556 337847 348111 359427 369373 378644 388763 398730 407165 415282 424401 432843 438467
57919 438467 441881 444041 443261 437961 429899 421328 411316 398222 383416 369101 354801 339484 324913
57906 324913 313296 303656 293927 284592 276870 269408 260316 250656 242583 235853 229355 224168 221726 220803
57892 220803 219598 218982 220506 223059 224838 226806 230895 236430 241594 246779 253262 260225 266275 272283
57878 272283 279526 286629 291517 294813 298122 300583 300315 297873 295077 291851 287266 282158 277603 272278
57864 272278 264567 255919 249044 244121 239838 236698 236022 236975 237798 238947 241918 246103 249862 253698 259355
57849 259355 266716 274380 282337 291326 300571 308807 316493 324485 331677 336556 339844 342962 345170 344816
57835 344816 342229 338766 334333 328364 321904 316134 310229 303131 295881 289713 283652 276760 270823 267779
57821 267779 266275 264011 261718 261468 262713 263570 264498 266941 269625 270082 268880 268522 268924 267721 264535 261234
57805 261234 258291 254386 249431 244645 239725 233086 224887 216965 209933 203115 197059 193232 191404 190069
57791 190069 189242 190257 193064 196370 200120 205330 211734 218154 224907 233353 243304 253090 261749 268960
57777 268960 273617 274951 274521 274711 275878 277250 279685 284781 291987 299262 306083 313314 320742 327289 332964
57762 332964 338106 341418 341350 338647 335012 330206 323142 314785 306951 299097 289527 279043 270128 262985
57748 262985 255599 247444 239975 233666 227651 222191 218530 216322 213960 211387 209898 209443 208866 208531 209850
57733 209850 212409 214392 215776 218273 222264 226501 230711 235698 241018 245308 248838 253059 257860 261982
57719 261982 265806 270878 276884 282112 286722 292591 299981 307334 314294 321934 330049 337289 344112 352530
57705 352530 362748 373032 383265 395714 411951 431761 455277 483458 516244 552968 594508
57694 594508 641894 692345 739470 777714 804156 816478 813123 796231 771330 743076 713666 685355
57682 685355 661160 642311 627990 618414 615509 619988 630634 647204 671420 704510 746406 797855
57670 797855 860744 936101 1024554 1129057 1254414 1404055 1579683 1781953 2004944 2227935
57660 2227935 2418101 2546277 2600662 2586809 2519494 2416279 2293403 2161965 2027447 1893489
57650 1893489 1764149 1641766 1525813 1415903 1313797 1220948 1136479 1059326 990144 929413
57640 929413 875772 827835 785661 748960 715993 685865 659851 638886 621650 606604 593934
57629 593934 583987 575826 568896 564243 562459 562151 561955 562383 564331 567521 571773 577989 586522 596322 607038
57614 607038 620153 636713 655821 676856 701239 730345 763368 798929 837317 879531 925525
57603 925525 974898 1027945 1084461 1142526 1199577 1253467 1301526 1340158 1366628 1380075 1380003 1365451
57591 1365451 1336731 1296431 1247585 1192245 1132628 1071748 1011647 952537 894767 839995 789436
57580 789436 742606 698957 659021 622932 589539 558171 529631 504412 481664 460945 442994
57569 442994 427721 413459 399542 387534 378444 370738 362732 355058 349032 344334 340101 336705 334657
57556 334657 333101 331100 329102 327687 326287 324609 323804 324697 326299 327599 329338 332413 336015 339010 341803
57541 341803 345226 348890 352246 355964 360712 365876 371044 377368 385814 395307 404262 412718 421446 430232
57527 430232 438699 447647 457890 468901 480088 492237 506130 520971 535835 551453 568950 588029
57515 588029 608092 630072 655315 683673 714330 747558 783974 823011 863729 906084 949649
57504 949649 991941 1029730 1061269 1085714 1101292 1105881 1098973 1081675 1055356 1021573 982510 940104
57492 940104 895279 849042 803357 759764 718178 678312 641247 608231 579011 552737 529534
57481 529534 509748 492663 477454 464488 454243 445856 438171 431359 426109 422224 419400 418419 420019
57468 420019 423405 427296 431612 436828 442645 448741 455882 464884 475317 486615 499544 515153 533238
57455 533238 553210 575537 600913 628959 659149 692029 728187 767059 808073 851710 897840
57444 897840 944083 987387 1026147 1059285 1084590 1099874 1104767 1099668 1084077 1057844 1023117 983085
57432 983085 939638 893931 848088 804232 762588 722564 684929 651014 620622 592803 567898
57421 567898 546620 527825 509529 491807 476463 464043 453288 443413 434858 427731 421380 415649
57409 415649 411038 407541 404696 402637 401734 401436 400800 399894 399395 399277 399257 399955 402031 404617 406230 406934 408086
57392 408086 410258 412879 415604 418598 421708 424709 428032 432029 436009 439255 442415 446457 450877 454422
57378 454422 457033 459594 462297 464760 467193 469978 472642 474698 476855 479870 482882 484549 485226 486354
57364 486354 488264 490210 492010 493966 495674 496628 497499 499217 501376 503124 505004 508147 512338 516629 521172
57349 521172 526574 532132 536698 540753 545614 551173 556448 561769 568246 575543 582419 589016 596344 603949
57335 603949 610553 616787 624709 634532 644260 652773 660896 669136 676729 683522 690695 698964 707775 716686
57321 716686 725850 734880 743033 750768 759352 768752 777711 786066 794992 804809 814613 824483 835885 849169
57307 849169 862564 874456 885073 895331 905614 916309 927899 939827 950701 960261 969789 980135
57295 980135 990743 1001140 1011901 1023525 1035665 1048124 1061385 1075637 1090411 1105556 1121564
57284 1121564 1138622 1156482 1175441 1196282 1219075 1243221 1268757 1296243 1325167 1353848 1381289
57273 1381289 1407997 1434760 1461746 1488809 1515420 1540220 1561911 1580689 1597664 1612981 1625883
57262 1625883 1636445 1645784 1654577 1662844 1671152 1680501 1690956 1701811 1713021 1725117 1737954 1751178
57250 1751178 1765686 1782759 1801907 1821444 1841103 1862075 1884511 1907158 1929711 1953294 1978201
57239 1978201 2003217 2027765 2052776 2078865 2105535 2132650 2160797 2189636 2217823 2245260 2273529
57228 2273529 2303397 2333739 2363631 2393626 2424150 2454482 2484301 2514515 2545604 2576677 2606992
57217 2606992 2636844 2666142 2693839 2719701 2745045 2770709 2795862 2819868 2843736 2868604 2894235
57206 2894235 2920176 2947082 2975562 3004908 3034181 3063583 3093600 3123688 3152943 3181329 3209325
57195 3209325 3236974 3264021 3290348 3315738 3339937 3363399 3387205 3411888 3437148 3462933 3489764
57184 3489764 3517766 3546476 3575844 3606261 3637385 3668196 3698487 3728999 3759817 3789928 3818637
57173 3818637 3846056 3871954 3895668 3917490 3938593 3959154 3978077 3995021 4011061 4026770 4041192
57162 4041192 4053395 4063544 4071829 4077814 4081488 4083548 4084089 4082467 4078988 4075127 4071464 4067004 4061209 4055057
57148 4055057 4049351 4043630 4037608 4032176 4028074 4024991 4022753 4021964 4022654 4023734 4024575 4025733 4027359 4028308 4027511
57133 4027511 4024760 4019583 4010990 3999094 3985375 3970616 3954238 3936341 3918575 3902138 3886800 3872791
57121 3872791 3861687 3854276 3849437 3846429 3846449 3850634 3858393 3869217 3884479 3905844 3933455 3967379 4009488
57108 4009488 4062276 4127056 4204838 4297931 4409388 4542265 4701154 4893657 5129324 5418352
57098 5418352 5772720 6207465 6739392 7385261 8161974 9086945 10176506 11444098 12900031
57089 12900031 14550846 16396927 18430494 20634524 22979843 25420461 27891669 30311320
57081 30311320 32579615 34579500 36188910 37307126 37878065 37892620 37374138 36365604 34926797
57072 34926797 33134105 31076131 28846732 26538227 24233882 22000370 19884072 17912639
57064 17912639 16099042 14445901 12949885 11605028 10403486 9335116 8388340 7551661
57056 7551661 6813834 6163441 5589754 5083818 4637799 4243805 3894365 3583465 3306022
57047 3306022 3056900 2831580 2627244 2442114 2274175 2121419 1982557 1856403 1741259
57038 1741259 1635921 1540452 1454735 1377109 1305662 1240053 1180673 1126839 1077353 1032151 991700
57027 991700 955212 921018 888500 858169 830086 803599 778533 755300 733827 713555 694451
57016 694451 676964 661037 646131 632233 619921 609500 600934 594499 590586 588851 588423 589134 591837
57003 591837 597256 605032 614171 624161 635441 648960 665665 686596 713151 746716 788258 838955
56991 838955 901195 978161 1073006 1190126 1336898 1522295 1755534 2050863 2430276 2904906
56981 2904906 3438332 3931757 4263854 4359595 4225400 3924968 3532439 3107280 2692927 2317505
56971 2317505 1991948 1715107 1483348 1293186 1138088 1009737 903264 817303 749386 695441
56961 695441 653572 624168 606052 596004 592119 594041 599402 603084 600649 590335 571895 546231
56949 546231 516272 485659 456175 428149 402664 381011 362592 346039 331997 322200 316277 312293
56937 312293 310207 311965 318227 327869 340851 358812 382335 409816 438946 466749 488125 497382
56925 497382 492386 475629 451109 422095 391622 362440 335579 310639 287773 267810 250575 235119
56913 235119 221542 210688 202171 194676 188024 182858 178563 173709 168402 163950 160298 156173 151702 148498
56899 148498 147065 146394 146145 146874 148089 148563 148791 150776 155164 160984 168369 179050 193824 211965 233367
56884 233367 258459 285213 308781 325183 333603 334779 329643 320373 310374 301877 295050 290055 288120
56871 288120 289917 294719 301896 311724 324278 339224 357113 379245 406104 437749 475888 523257
56859 523257 580076 642292 703091 754442 788099 798621 786834 758722 720639 677262 633307
56848 633307 593596 560298 532690 510539 495410 488060 487299 492542 505016 525445 553139 588693
56836 588693 635298 695967 771320 860550 961001 1064159 1154228 1214198 1234260 1214865 1164009
56825 1164009 1092918 1012226 929460 849302 775649 711811 658639 614664 578999 552490 535443
56814 535443 526432 524464 530574 546178 571545 606971 653737 712394 780615 852648 919193 968033
56802 968033 988202 976001 936443 878528 810598 739862 672669 612758 560544 515499 477890
56791 477890 447496 422708 402432 387353 378216 374503 375973 383832 399143 421571 450627 486096
56779 486096 525502 562467 589273 600696 595177 574210 541743 502734 460976 418834 378864 343631
56767 343631 313424 286377 261711 240833 224375 210511 197488 185725 176055 167864 160419 154175
56755 154175 149257 144420 138961 134033 130675 128125 125364 122697 120513 118201 115616 113903 113524 113134 111748
56740 111748 110301 109714 109196 107908 106592 106094 105887 105372 104936 104458 102676 99519 97131 96992 97880 98199 98379
56723 98379 99214 99833 99335 98715 99161 100011 100225 100254 100572 100064 97921 95577 94662 94483 93616 92594 92853 94204
56705 94204 95433 96305 97100 97274 96444 95638 95780 96070 95499 94704 94654 94875 94701 94831 95820 96525 96045 95746 97295
56686 97295 100002 102168 103721 105385 106581 106438 105798 105962 106458 106131 105434 105522 106108 106310 106578 107742 109175
56669 109175 109986 111033 113621 117132 120027 122212 124364 125969 126215 125920 126442 127554 128416 129541 131650
56654 131650 133652 134081 133540 133400 133086 131126 128048 125695 124310 122712 120693 118891 116926 114052 111093
56639 111093 109344 108135 105886 102992 101145 100246 98606 95943 93684 92371 91165 89921 89477 89774 89751
56624 89751 89243 89166 89829 90800 92297 94964 98382 101368 103481 104798 104873 103560 102193 102119 102735 102744 102536 103265
56606 103265 104478 104836 104588 104997 105883 106043 105633 105879 106816 107561 108449 110622 113767 116428 118299 120110 121661
56589 121661 122168 122183 122954 124258 125068 125951 128356 131854 134508 135872 137267 139158 140616 141479 142803 145054
56573 145054 147772 150942 154719 158034 159583 160021 161192 163458 165862 168522 172526 177697 182720 187398
56559 187398 192655 198576 204614 211368 219793 228930 236818 243395 250186 257447 264104 270164 276568 282928
56545 282928 288058 292549 298004 303804 307498 308462 308322 307688 305410 301299 296633 291566 284939 277155 270289
56530 270289 264675 258237 250005 241524 233938 226362 218172 210378 203610 197049 190423 184944 181295 178625
56516 178625 176290 174627 173361 171391 168753 166723 165337 163008 159224 155464 152748 150421 148022 146217
56502 146217 145185 144181 143257 143232 143451 141971 138642 135698 134529 134245 134169 135215 137686 140022 141029 141375
56486 141375 141800 141828 141262 141049 141537 141669 140845 139920 139633 139804 140700 143205 146876 149766 151012 151820 153277
56469 153277 155152 157386 160630 164483 167267 168426 169285 170780 172377 173868 176063 178944 181210 182484
56455 182484 184004 186445 189089 191741 195339 199986 204561 208984 214559 221288 227156 230965 233696 236321
56441 236321 238574 240678 243756 247494 249810 250019 250044 251305 252596 252271 250430 247813 244555 241081 238199
56426 238199 235357 230879 224814 219357 215618 212338 208673 205688 203934 202056 199063 195683 192262 187767
56412 187767 182104 177066 173655 170776 167838 166230 166923 169027 171979 176605 182556 187372 189814 191718
56398 191718 194765 197755 198928 198814 198887 199330 199819 200583 201140 199930 196713 193358 190931 188157 184121 180104
56382 180104 177193 174400 170911 167957 166742 166557 166627 167676 170024 172258 173446 174618 176546 178284 179418
56367 179418 181410 185026 188758 191404 193914 197050 199710 201268 203065 205776 207848 208367 208898 210597 212150
56352 212150 212633 213610 216206 218828 220143 221601 224486 227229 228347 229409 232209 235433 237233 238795 242182
56337 242182 246560 249729 251729 253953 256320 258165 260395 263920 267382 269049 269583 270530 271696 272488 274113
56322 274113 277823 282489 286407 290037 294550 299313 303285 307260 312274 317395 321468 325371 330206 335048
56308 335048 338903 342987 348518 354087 357806 360231 362658 364461 364876 365437 367778 370736 372442 373506 375374
56293 375374 377369 378225 378756 380097 381059 380196 378818 378998 380283 381248 382522 385255 388351 390377 392535 396651
56277 396651 401823 406158 410208 415596 421918 428135 435402 445262 456664 467919 479978 494621 511177
56264 511177 528332 547375 570107 595255 620637 647343 678195 713605 752562 796098 845867
56253 845867 900634 958048 1018740 1084882 1155784 1228605 1302327 1377259 1451674 1522641 1589214
56242 1589214 1651204 1705858 1749385 1780885 1801409 1810446 1807068 1793302 1772541 1745596 1711946 1673636
56230 1673636 1634019 1593663 1551342 1508038 1466062 1425279 1384176 1343739 1306330 1271581 1237202
56219 1237202 1202925 1169810 1136845 1102283 1067380 1034692 1003635 971808 939680 909701 881722
56208 881722 853663 825923 800709 777713 754835 732588 713421 697144 681238 665201 650466
56197 650466 636692 622377 608483 597240 588013 578538 569368 562676 557550 551133 543736 538110 534288
56184 534288 529873 524923 521672 519867 517108 513483 511225 510202 508440 506642 507457 510696 513932 517129
56170 517129 521907 527057 530019 532050 536582 543114 548247 552119 557887 565295 570936 574940 581191 590512
56156 590512 599624 607435 616438 627158 637018 645577 655333 666541 676692 685790 696632 709261 720760
56143 720760 731129 743596 758498 772822 786597 803701 825244 848162 871598 898740 931025
56132 931025 966466 1005219 1051172 1106611 1170997 1246511 1339209 1453087 1588146 1745009 1925077
56121 1925077 2123984 2329969 2530176 2714119 2871736 2995849 3089143 3163230 3228810 3290760
56111 3290760 3351567 3411440 3463353 3495461 3501784 3486112 3455233 3414834 3372213 3334140 3298342
56100 3298342 3252917 3186498 3094045 2973062 2822917 2650738 2470712 2294239 2126051 1970630
56090 1970630 1834497 1719698 1622280 1539835 1473871 1422992 1381434 1346783 1321741 1305891 1293480
56079 1293480 1281806 1273889 1270140 1265522 1258025 1251836 1248795 1244801 1238064 1232823 1231241 1229662 1226578 1226204
56065 1226204 1230337 1234712 1237293 1242060 1250840 1259653 1267065 1277632 1292886 1307473 1318642 1331076 1347952
56052 1347952 1365790 1382567 1402128 1425927 1449237 1470160 1493424 1520648 1546289 1568113 1592025
56041 1592025 1621307 1650814 1677294 1705492 1738282 1770788 1800260 1831727 1867726 1902739 1934154
56030 1934154 1968265 2008790 2050004 2088128 2128813 2176285 2225944 2274891 2328589 2389576 2451032
56019 2451032 2509294 2571155 2640819 2711709 2779558 2851069 2930721 3011788 3089931 3172756 3265819
56008 3265819 3362221 3456590 3556273 3667682 3784730 3902006 4025996 4161686 4301701 4440715
55998 4440715 4586756 4746244 4912260 5080062 5258902 5455417 5661137 5870332 6093747
55989 6093747 6340148 6601350 6870944 7160139 7478668 7818392 8173101 8555509 8976418
55980 8976418 9427008 9901212 10414943 10982638 11596643 12251841 12967880 13763746 14634834
55971 14634834 15580568 16629283 17808947 19121091 20573386 22209278 24074664 26188646
55963 26188646 28583760 31342102 34555599 38292249 42647822 47790091 53904745 61148130
55955 61148130 69712050 79883904 91988556 106357633 123458335 143989581 168767775
55948 168767775 198613284 234332502 276199837 322477327 368022223 404974795 425952094
55941 425952094 427507694 411166995 381726233 344760703 305068285 266166343 230230610
55934 230230610 198250964 170426360 146582108 126364513 109296428 94880970 82707276
55927 82707276 72437342 63747064 56346935 50028939 44635973 40007108 35994663 32505123
55919 32505123 29475711 26829580 24490710 22419647 20595191 18977494 17522181 16212829
55911 16212829 15046332 14000907 13048059 12181384 11404617 10703834 10057905 9464163 8928411
55902 8928411 8440758 7985107 7561766 7177943 6825870 6491936 6177758 5891491 5627520
55893 5627520 5374704 5135797 4919141 4719382 4525297 4339012 4169402 4013811 3863838
55884 3863838 3722104 3596045 3481635 3369858 3263209 3169792 3087017 3006715 2930694 2866008
55874 2866008 2810308 2756882 2709155 2675617 2655160 2641441 2636529 2645425 2660859 2667601 2658757 2635381
55862 2635381 2594588 2532082 2453467 2369753 2283745 2192494 2099928 2014564 1937193 1862783 1792330
55851 1792330 1731275 1678419 1627945 1580629 1542007 1511111 1481897 1454402 1434094 1421746 1414285
55840 1414285 1414123 1426687 1448607 1467698 1474666 1467067 1443790 1405268 1358619 1313562 1273082 1235054
55828 1235054 1201198 1176222 1159713 1147280 1138618 1136319 1137958 1137613 1134323 1131342 1128159 1121051 1110324
55815 1110324 1099149 1086307 1067902 1045267 1023361 1002325 978422 952523 929750 911125 893239
55804 893239 875918 862801 854544 848652 845843 849531 859086 870253 881740 894694 906394 911750 910874
55791 910874 908363 905400 899528 891862 887275 887187 888988 892746 901636 915397 930035 944364 960342 976594
55777 976594 988184 993213 993154 986346 968130 938500 903231 866274 827119 786545 748482 714579
55765 714579 682786 652917 628133 609338 593231 577256 561697 546017 528362 509836 494207
55754 494207 482266 471175 460166 451830 446859 442603 437930 434582 432624 429392 424134 418947 414072
55741 414072 406985 397273 387757 379635 371080 361739 354012 348696 343814 338903 336083 335736 335490 334518 334486
55726 334486 335216 333875 329628 324779 320198 314041 306145 299230 294334 289274 283012 277407 273330 269180
55712 269180 264623 261789 261348 261292 260791 261403 263416 265047 266372 269867 275722 280663 282646 282691 281038 275925
55696 275925 267679 259618 253191 246285 237991 230831 226389 222859 218918 216132 215408 214915 213665 213545 215697
55681 215697 218351 220359 223423 228735 234682 239936 245616 252387 258530 262930 266905 271161 273940 274034 272687
55666 272687 270791 267124 261111 254330 247693 240120 231463 223528 216703 209013 200141 192855 188626 185395
55652 185395 181700 179343 179585 180225 179109 177421 176881 176596 175273 173718 172608 170526 166767 163486 162523
55637 162523 162595 162008 161539 162172 162624 161698 160628 160432 159320 155476 150302 146216 143263 140422 138300 137813
55621 137813 137918 137174 136072 135646 135406 134683 134281 134762 134946 134112 133749 135035 136512 136522 136002 136555 137578 137737
55603 137737 137693 138945 141368 144076 147289 151165 154219 155128 155011 155901 158013 160202 161912 163067 163412 163527
55587 163527 165083 168557 172179 174632 177168 181541 187636 194739 203311 213762 225269 237640 252714
55574 252714 272111 295256 321314 351397 387171 429093 477645 534314 599322 669872 742118
55563 742118 812665 876397 925419 953098 958046 942474 908656 859175 798544 731754 662266 593216
55551 593216 528628 471121 419973 373650 332604 297558 267130 239755 216274 197983 183666
55540 183666 171100 159929 150523 141674 132309 123977 118656 115323 111572 107420 104469 102384 99379 95534
55526 95534 92598 90934 89472 88247 88243 89024 89152 88718 88984 89750 89434 87636 85374 83000 80024 76849 74583
55509 74583 73205 71730 69915 68125 66043 63322 60889 59743 59069 57450 55244 53760 52823 51325 49581
55494 49581 48901 49319 49875 50642 52285 54076 54645 54366 54843 56321 57741 58962 60687 62420 62769 61748
55478 61748 60689 59975 58890 57581 57038 57089 56463 54921 53471 52404 51006 49242 47966 47423 47210 47564
55462 47564 48882 50134 49694 47762 46117 45455 44802 43645 42726 42531 42712 43257 44591 46309 47337 47608
55446 47608 48128 49265 50336 50976 51568 52223 52628 52896 53343 53589 53099 52353 52140 52046 51059 49343 47937 47011
55428 47011 45953 44868 44393 44305 43905 43522 44021 45071 45611 45812 46883 49052 51345 53259 55063 56596
55412 56596 57431 58118 59694 62074 64439 66908 70186 73852 76767 78939 81220 83361 84237 83862 83247 82340
55396 82340 80049 76379 72649 69424 66106 62669 59959 58037 55972 53604 51836 50975 50361 49830 49935
55381 49935 50562 50909 50942 51307 51779 51453 50475 49848 49535 48558 47063 46341 46675 47068 47270 48070 49279 49521 48543
55362 48543 47705 47545 46835 44856 42759 41687 41104 39987 38434 37250 36976 37857 39676 41258 41320 40051
55346 40051 38720 37725 36464 35107 34676 35162 35387 35105 35423 36648 37536 37325 36757 36401 35643 34143 32737
55329 32737 32073 31778 31708 32497 34076 35089 34730 33858 33526 33619 33741 34145 34968 35639 35839 36045 36490 36653 36322
55310 36322 36111 36401 36824 37224 38054 39382 40624 41557 42481 43213 43205 42846 43191 44185 44710 44592 44841 45569 45567 44535
55290 44535 43836 44272 44933 45124 45622 46904 47791 47131 45477 43918 42517 40950 39425 37978 36060 33824
55274 33824 32550 32802 33387 33210 32869 33312 34124 34433 34470 34986 35929 36812 37642 38453 38728 38196 37534 37457 37835
55255 37835 38285 38734 38826 37818 35797 34016 33339 33337 33466 33913 34611 34766 34204 33926 34424 34697 33937 32888 32434
55236 32434 32075 31091 30094 30013 30428 30288 29643 29355 29641 29996 30201 30472 30956 31744 32911 34025 34306 33720 33215
55217 33215 33477 34348 35735 37850 40092 41074 40531 39915 40318 41103 41397 41519 41871 41811 40830 39623 38844 37965
55199 37965 36610 35759 36273 37317 37731 37903 38772 39889 40113 39569 39340 39652 39806 39560 39332 39314 39440 39907
55181 39907 40785 41552 41781 41767 41722 41081 39457 37530 36157 35334 34895 35310 36828 38653 39926 40720 41202 40847
55163 40847 39499 38193 37770 37680 37241 36983 37455 37825 37170 36161 35905 35988 35323 34176 33687 33946 34188 34357
55145 34357 34913 35507 35485 35330 36048 37408 38287 38496 38797 39299 39283 38502 37408 36230 34975 34096 33946 33861 33047
55126 33047 32068 32160 33293 34216 34347 34373 35050 36466 38362 40207 41181 41066 40821 41360 42305 42953 43789 45635
55108 45635 47968 49676 51109 53659 57418 60878 63010 64164 64784 64636 63576 61893 59727 57116 54630
55093 54630 52911 51676 50313 49299 49737 51479 53015 53385 53059 52785 52749 53026 53786 54737 55264 55322 55365 55392
55075 55392 54902 53780 52367 50705 48611 46437 44808 43717 42810 42375 42988 44228 44842 44320 43356 42739
55059 42739 42636 42902 43246 43199 42755 42811 43995 45404 45587 44561 43648 43518 43680 43828 44307 45145 45869 46505 47606
55040 47606 49102 50166 50441 50389 50331 50131 49914 50049 50308 50053 49349 48916 48952 49067 49370 50405 51920 52913 53177
55021 53177 53614 54674 55623 55802 55638 55925 56906 58422 60188 61619 62130 61896 61653 61648 61517 61228 61288 61922 62961
55002 62961 64561 67097 70106 72333 73165 73272 73583 74339 75272 76006 76130 75576 75033 75356 76566 78083 79728
54985 79728 81631 83348 84092 83849 83376 83080 82760 82327 81770 80535 78076 74986 72509 70859 69110 66808
54969 66808 64564 62960 61934 61341 61082 60620 59495 58341 58260 59163 59927 60261 61058 62722 64521 65936 67329
54952 67329 68831 69840 70159 70532 71538 72918 74360 75935 77480 78688 80155 83143 87845 92987 97595
54937 97595 102154 107616 114401 122738 132813 144078 155467 166762 178588 190629 201069 208357 212215
54924 212215 212400 207975 198941 187347 175571 164260 152934 141717 131355 122123 113797 106325 99743
54911 99743 93782 88260 83547 80091 77853 76550 75967 75708 75223 74478 74039 74203 74684 75424 76967 79723
54895 79723 83537 88283 94078 100588 107041 113364 120574 129664 140778 153674 167899 182082 194028
54882 194028 202176 206300 206478 202434 194420 183785 171983 159730 147532 136140 125956 116856 109047
54869 109047 103125 98842 94897 90652 87050 85078 84315 83854 83800 84906 87427 91110 95701 100725 105395
54854 105395 109484 113701 118644 123986 129194 134169 138474 140789 140116 137016 132849 128172 122515 115418
54840 115418 107186 98898 91871 86618 82274 77724 73265 70154 68467 66801 64390 62056 60450 58858
54826 58858 56677 54674 53545 52415 50076 46930 44383 42936 41994 41107 40428 40256 40910 42589 44726 46080
54810 46080 46122 45725 45984 47054 48589 50358 51858 52372 52139 52438 53791 55160 55747 56271 57429 58433 58405
54793 58405 58140 58996 60985 63377 66360 70489 75113 78947 81856 84751 88158 92164 97278 104028 112048
54778 112048 120873 131201 144048 158953 174231 188648 201625 212178 219132 222300 222344 219599 214123
54765 214123 206628 198238 189504 180681 172624 166215 161135 156441 152288 149967 150318 153027 157300 162264
54751 162264 166986 171159 175604 181162 187382 193235 198536 203434 206922 207396 204706 200443 196230 192835
54737 192835 190773 190417 191496 193621 197320 203380 211174 218851 225208 230086 232857 231964 226514 217276 205647
54722 205647 192465 178198 163500 149127 135802 124264 114900 107267 100591 94719 90014 86535 84001
54709 84001 82320 81334 80223 78060 74913 71689 69081 67363 66777 67107 67231 66255 64951 64955 66646 68836
54693 68836 70417 71228 71403 71072 70744 70900 71256 71359 71783 73499 76167 78353 79468 80274 81426 82863 84787
54676 84787 87786 91624 95142 97804 100228 102843 105242 107268 109548 112298 114639 115683 115490 114516 112968
54661 112968 111176 109763 108995 108589 108396 108500 108596 108292 108192 109481 112153 114874 117081 119955 124626 130663
54645 130663 137260 144862 154519 166354 179715 194397 210811 229202 249238 269930 289399 305195
54633 305195 315573 320220 319504 313611 303020 289266 274433 259984 246499 234207 223226 213441
54621 213441 204602 196581 189420 183266 178309 174505 171332 168120 164620 160930 156977 152593 148023 143735
54607 143735 139726 135572 131178 126828 122506 117978 113564 110066 107686 105775 103857 102151 100810 99381
54593 99381 97391 94896 92204 89592 87504 86380 86045 85868 85688 85916 86595 87069 86886 86345 85893 85571 85279
54576 85279 84947 84265 83021 81881 81996 83439 84900 85335 85196 85527 86544 87687 88475 88740 88447 87788 87160
54559 87160 86738 86421 86362 86974 88197 89335 89945 90351 90974 91748 92527 93530 94987 96756 98583 100343 101867
54542 101867 103067 104379 106565 109820 113587 117358 121070 124626 127825 131028 135177 140790 147576 155267
54528 155267 164079 173939 183914 192841 200013 204981 207314 207009 204602 200527 194806 187596 179496 171051
54514 171051 162483 154102 146382 139462 133174 127736 123713 121112 119156 117130 114808 112019 108726 105637
54500 105637 103743 102961 102224 101225 100894 101696 102665 102918 103089 104322 106571 108830 110446 111391 111793 112009 112768
54483 112768 114541 117052 119856 122885 125982 128496 129991 130905 131962 133331 134771 136086 137030 137325 137257
54468 137257 137713 139120 140871 142171 142877 143178 143122 142954 143205 143892 144232 143671 142675 142027 141973 142460 143547 145084
54450 145084 146597 147879 148999 149513 148597 146399 144165 142452 140309 137025 133573 131311 130198 129348 128558
54435 128558 128063 127458 126094 124218 122685 121891 121762 122316 123314 123849 123199 121728 120197 118728 117265 116369
54419 116369 116543 117314 118016 118931 120547 122243 122998 123073 123689 125247 127138 129209 132052 135683 139119 141694
54403 141694 143912 146691 150384 154757 159284 163265 166114 167669 168020 167192 165362 163012 160427 157433 154168
54388 154168 151548 150191 149313 147620 144959 142165 139581 136832 133988 131757 130347 129102 127565 126173
54374 126173 125514 125488 125595 125642 125872 126480 127190 127375 126774 126045 126151 127066 127715 127516 127304 128187 130125 132251 134015
54355 134015 135322 136112 136658 137855 140360 143701 146905 149630 152066 154214 155983 157469 158428 158053 156115
54340 156115 153655 151584 149290 145838 141878 138889 136944 134802 132046 129517 127535 125244 122162 119015
54326 119015 116521 114387 112084 109652 107166 104278 100866 97549 95014 93265 91913 90757 89774 88922 88206
54311 88206 87722 87545 87715 88159 88399 87750 86278 85068 84870 84939 84042 82197 80384 78908 77275 75558 74517
54294 74517 74123 73172 70921 68145 66100 65054 64330 63237 61559 59552 57722 56354 55225 54066 53108
54279 53108 52695 52619 52468 52349 52549 52761 52570 52469 53335 54964 56223 56692 57124 58055 59076 59791 60523 61580
54261 61580 62624 63238 63462 63474 63348 63383 63959 64820 65147 64659 64040 64002 64560 65424 66477 67531 68163 68140 67658
54242 67658 67057 66607 66462 66353 65566 63893 62357 62145 63025 63797 64151 64884 66213 67174 67122 66711 66810 67362 67827
54223 67827 67981 67794 67243 66685 66681 67065 66917 65851 64538 63579 62706 61590 60651 60364 60387 59975 58787 56839
54205 56839 54277 51648 49824 49117 48958 48850 49049 49820 50655 50894 50692 50743 51271 51792 51667 50544 48511 46118
54187 46118 44119 43009 42906 43679 44764 45127 44202 42887 42739 44046 45504 45933 45396 44353 42808 40881
54171 40881 39354 38875 39202 39781 40488 41307 41909 42168 42478 42991 43067 42155 40810 40190 40848 42504 44605 46588
54153 46588 47945 48565 48786 48722 47882 45937 43556 42007 42027 43370 45251 46970 48286 49380 50363 50906 50717
54136 50717 50242 50312 51064 51813 52050 51893 51549 51095 50940 51636 52958 53920 54056 53909 53972 54013 53862 53999 54772 55749
54116 55749 56423 56920 57493 57947 58080 58119 58221 58124 57680 57044 56061 54320 52286 51351 52057 53194 53492 53345 53921
54097 53921 55323 56695 57527 57751 57039 55249 53366 52828 53888 55442 56498 57053 57566 58257 59028 59595 59679
54080 59679 59433 59425 59880 60247 59989 59418 59246 59692 60572 61872 63521 64914 65374 64965 64313 63835 63594 63603 63691 63387
54060 63387 62565 61934 62209 63050 63526 63415 63293 63457 63543 63305 63070 63210 63613 63941 64111 64360 64941 65840 66730
54041 66730 67332 67806 68525 69480 70293 70911 71780 73167 74829 76556 78507 80766 83168 85930 89758 94801
54025 94801 100062 104409 107770 110859 114157 117635 120991 123723 125445 126558 128052 130219 132227 133480
54011 133480 134594 136310 138197 139365 139807 140054 139953 138900 137017 135043 133215 131176 128870 126615 124271
53996 124271 121243 117486 113865 111267 109743 108552 106804 104176 101288 99122 97830 96525 94607 92690
53982 92690 91695 91580 91648 91645 91781 92010 92033 91707 90876 89159 86588 83979 81955 80068 77810 76018 76141 78297
53964 78297 81032 82977 83869 84012 83708 83409 83655 84606 85991 87556 89194 90865 92795 95424 98652 101591
53948 101591 103688 105613 108278 111460 114234 116335 118123 119560 120372 121047 122582 125198 128259 131400 134796
53933 134796 138344 141534 144257 146896 149556 151958 154024 155822 156936 156793 155635 154411 153675 153290 153063
53918 153063 152901 152494 151751 151410 152336 154298 156443 158718 161683 165044 167735 169680 172178 176169 181211
53903 181211 186544 192031 197559 202521 206526 209820 212528 214199 214569 214053 213065 211582 209741 208141 207046
53888 207046 205952 204425 202748 201295 199793 197656 194640 190884 186698 182488 178412 174027 168898 163606
53874 163606 159395 156603 154277 151606 148876 146576 144394 141739 138727 135997 133802 131690 128916 125047
53860 125047 120506 116484 113870 112310 110887 109507 108756 108486 107649 105806 103821 102655 102342 102466 102741 102721
53844 102721 101898 100619 100018 100441 100794 100084 98760 97854 97563 97457 97402 97452 97390 97109 96999 97218 97160 96315 95197
53825 95197 94696 94979 95711 96748 97877 98407 98019 97582 98142 99353 99939 99578 99259 99733 100592 101149 101368 101616
53807 101616 102105 102999 104489 106331 107696 107939 107374 106985 107497 108935 110972 113344 115887 118482 121206 124383
53791 124383 128174 132098 135369 137888 140538 144104 148165 151540 153657 154934 155930 156703 157136 157308 157345 157271
53775 157271 157190 157253 157359 157217 156734 155995 154888 153212 151233 149638 148839 148645 148612 148290 147232 145403 143577
53758 143577 142808 143411 144918 146879 149001 150654 151135 150506 149313 147500 144555 140822 137488 134966 132474
53743 132474 129672 127442 126341 125531 124277 123387 123925 125234 125689 124954 124200 124291 125001 125884 126717 126932 125736
53726 125736 123220 120560 118717 117500 116221 114691 113192 111916 110896 110334 110581 111673 112979 113508 112747
53711 112747 111229 110045 109721 109834 109816 109735 110014 110693 111382 111853 112331 113244 114848 117038 119421 121654 123722
53694 123722 125749 127670 129387 131146 133222 135248 136485 136987 137868 140002 142948 145544 147173 148043 148668
53679 148668 149598 151371 154114 157165 159476 160473 160424 160052 159906 160014 160077 160022 160168 160634 160931 160679 160507 161536
53661 161536 163970 166905 169504 171535 172742 172679 171553 170296 169311 167921 165594 162974 161098 160202 159883
53646 159883 159833 159812 159468 158800 158293 158091 157616 156607 155866 156173 156996 157088 156081 154760 153960 153853 154017 153758 152657
53627 152657 151340 151284 153299 156554 159591 161835 163519 164768 165575 166288 167259 168291 169173 170407 172568 175221
53611 175221 177383 178950 180809 183585 187051 190784 194643 198527 202299 206073 210022 213852 216964 219174
53597 219174 220843 222385 224062 226164 228813 231632 234098 236257 238655 241585 244827 248072 251158 253856
53583 253856 255870 257136 257913 258492 258954 259108 258558 257067 255029 253400 252940 253657 254944 255962 255972 254902
53567 254902 253655 253186 253142 252197 249920 247410 245708 244550 243303 242089 241196 240243 238891 237632 236930 236308
53551 236308 235325 234718 235369 236710 237377 237083 236658 236603 236836 237537 238969 240634 241885 243202 245570 248688 251170
53534 251170 252669 254489 257806 262440 267652 273042 278207 282623 286423 290555 295746 301887 308663 316069
53520 316069 324131 332826 342470 353435 365319 377183 388815 401009 414466 429148 444881 461687
53508 461687 479305 497201 515415 534706 555537 577601 600542 624433 649333 675064 701694
53497 701694 729473 758069 786597 814610 842335 869735 896298 922100 948186 975344 1003292
53486 1003292 1031554 1060337 1089928 1119928 1149860 1180059 1211192 1243151 1274989 1305722 1334771
53475 1334771 1361846 1386851 1409843 1430894 1450056 1467483 1483360 1497769 1510905 1523291 1535327
53464 1535327 1546819 1557525 1567917 1578579 1588861 1597021 1601831 1603306 1601867 1597779 1591531 1583704 1574037
53451 1574037 1561536 1545923 1528055 1508490 1486621 1461828 1434595 1405873 1376223 1346182 1316495
53440 1316495 1287109 1256807 1224897 1192591 1161633 1132098 1102716 1072984 1043719 1015580 988270
53429 988270 961496 935877 912452 891692 873228 856343 840676 826717 815503 807627 802752 800297
53417 800297 800180 802445 806620 812113 819100 828458 840875 856502 875274 896957 920898 946301 972854
53404 972854 1000733 1029945 1060159 1091238 1123529 1157453 1193145 1230624 1270051 1311649 1355549
53393 1355549 1401833 1450612 1502025 1556286 1613730 1674556 1738342 1803945 1870228 1937038 2005257
53382 2005257 2075658 2147758 2220122 2291815 2363139 2434735 2506413 2577283 2646623 2713986 2778579
53371 2778579 2839282 2895367 2946746 2993450 3035399 3072797 3106241 3136272 3163125 3186969 3207888
53360 3207888 3225532 3239227 3248561 3253430 3253418 3247608 3235132 3215392 3187539 3150338 3102918 3045490
53348 3045490 2979187 2905588 2826441 2743439 2657986 2571365 2484958 2399769 2315752 2232276 2149348
53337 2149348 2067787 1988193 1910486 1834624 1760891 1689114 1618410 1548298 1479513 1413285 1350293
53326 1350293 1290718 1234684 1182115 1132596 1085893 1042296 1002179 965711 933272 905440 882015
53315 882015 861669 843253 827050 814150 804964 798909 795214 793379 793093 794256 796964 801108 806201
53302 806201 811968 818841 827509 838292 851151 865829 881573 897279 912526 928180 945522 965175
53290 965175 987225 1011720 1038388 1066361 1095084 1125181 1157637 1192263 1227790 1263372 1299197
53279 1299197 1335489 1371594 1406429 1439537 1471476 1503187 1534880 1565512 1593632 1618804 1641709
53268 1641709 1662721 1681150 1696445 1709512 1722023 1734708 1746989 1757868 1766341 1771216 1771528 1767308
53256 1767308 1759338 1748074 1733354 1715005 1692994 1666881 1635880 1599743 1559194 1515309 1468832
53245 1468832 1420207 1369877 1318391 1266467 1215058 1165141 1117379 1072049 1029150 988366 949204
53234 949204 911448 875301 840773 807244 773987 740791 707583 673860 639205 604236 570309
53223 570309 538263 508057 479607 453298 429483 408067 388811 371667 356658 343775 333022
53212 333022 324136 316248 308363 300390 293171 287294 282276 277301 272322 267981 264539 261372 257624 253123
53198 253123 248483 244368 240816 237327 233512 229478 225624 222251 219428 216991 214582 211865 208809 205616
53184 205616 202400 199207 196324 194106 192377 190462 188030 185435 182940 180155 176742 173177 170217 167913
53170 167913 165788 163722 161966 160392 158419 155821 153076 150811 149296 148501 148223 147959 147045 145181 142719
53155 142719 140332 138488 137198 136175 135242 134593 134507 134797 134863 134448 134001 134034 134402 134512 133988 132833 131189 129297
53137 129297 127504 125986 124627 123384 122546 122365 122635 122912 122973 122925 123153 124190 126165 128195 128939 128041 126430
53120 126430 124999 123801 123041 123749 126420 129707 131669 131901 131325 130311 128368 125617 123131 121495 120112
53105 120112 118326 116359 114720 113545 112873 112823 113006 112441 110576 107918 105259 102846 100669 98999 98028 97318
53089 97318 96234 94761 93497 92894 92821 92776 92346 91531 90761 90546 91001 91734 92151 91838 90834 89749 89441 90199
53071 90199 91374 92177 92672 93525 94915 96327 97486 98858 100926 103496 106049 108430 110808 113220 115546
53056 115546 117919 120818 124620 129098 133485 137085 139796 141832 143063 143039 141775 139999 138230 136019 132640
53041 132640 128256 123878 120264 117390 114838 112182 109052 105442 102000 99464 97741 95945 93445 90488
53027 90488 87707 85430 83578 81801 79633 76815 73623 70704 68546 67237 66568 66090 65254 63837 62204
53012 62204 60869 59961 59335 58912 58538 57850 56750 55726 55219 55051 55027 55614 57192 58946 59521 58783 57946 57928
52994 57928 58469 58971 59291 59426 59239 58871 58725 58722 58191 56847 55300 54307 54096 54650 55961 57633 58826 59078
52976 59078 58804 58641 58729 58875 58945 58731 57935 56648 55506 55068 55329 55948 56532 56539 55538 53845 52368 51503 50771
52957 50771 49835 49211 49432 50111 50519 50685 51211 52238 53328 54290 55455 56995 58375 58763 57928 56662 56222
52940 56222 57129 58543 59138 58630 57981 57996 58344 58363 58246 58706 59715 60419 60354 60107 60388 60920 60791 59837 59102
52921 59102 59631 61171 62598 63528 64799 67087 69739 71635 72764 74172 76505 79391 82254 84935 87301
52906 87301 89043 90285 91848 94423 97758 100964 103399 105027 106168 107120 107859 108053 107509 106528 105439 103883
52890 103883 101125 97167 93067 89874 87649 85717 83487 80821 77923 75150 72744 70645 68733 67149
52876 67149 66021 65002 63612 62000 60770 59965 58890 57174 55390 54290 53886 53661 53268 52662 51894 51086
52860 51086 50399 49786 49027 48195 47752 47943 48381 48486 48206 48147 49077 51275 54183 56787 58557 59894 61406
52843 61406 63123 64824 66748 69172 71494 72588 72141 70897 69556 68223 67014 66339 66269 66325 66131 65669
52827 65669 64835 63476 62022 61273 61331 61512 61476 61572 61892 61970 61767 61884 62327 62093 60617 58643 56993 55485
52809 55485 53908 53026 53478 54431 54591 54086 54165 55239 56401 56804 56555 56110 55653 55313 55403 56232 57925 60455
52791 60455 63542 66639 69353 71816 74408 77314 80555 84153 87952 91585 94884 98072 101254 103983
52777 103983 105588 105668 104209 101674 99090 97471 96847 96347 95377 94063 92429 90071 87068 84308 82301
52762 82301 80461 78232 76103 74669 73442 71527 68969 66487 64340 62395 60970 60588 61042 61506 61482 61013
52746 61013 60159 58960 57742 56816 56040 55162 54305 53587 52692 51452 50376 49851 49272 47871 46065 45027 45107
52729 45107 45585 45916 46266 46849 47536 48240 48960 49349 48906 47767 46784 46697 47516 48693 49521 49528 48872 48295 48418
52710 48418 49294 50803 53010 55668 57933 59116 59348 59005 58053 56569 55275 54691 54253 53162 51669 50642
52694 50642 50286 50262 50688 51877 53306 53972 53741 53350 53125 52676 51854 51030 50360 49650 48960 48529 48130 47459 47094
52675 47094 48017 50112 52111 53232 53882 54562 55034 54980 54588 54127 53564 52924 52373 51768 50751 49471 48618 48583
52657 48583 49303 50889 53552 56679 58935 59666 59512 59370 59481 59879 60878 62575 64496 66262 68110 70316
52641 70316 72591 74527 76256 78169 80292 82350 84300 86424 88981 91883 94699 97015 98890 100771
52627 100771 102784 104453 105511 106612 108602 111284 113508 114294 113255 110220 105300 99340 93552 88650
52613 88650 84763 81841 79383 76267 71936 67578 64929 63968 63078 61513 60253 60054 60101 59385 58257 57688
52597 57688 57816 58070 58132 58038 57823 57699 58086 58959 59617 59535 58948 58223 57334 56417 56148 56868 57849 58088 57534 56926
52577 56926 56769 56957 57222 57401 57387 57079 56340 55035 53414 52360 52659 53915 54848 54766 54137 53578 53163 52988
52559 52988 53491 54642 55571 55655 55355 55412 55764 55929 55961 56364 57361 58805 60433 61766 62142 61454 60517 60241 60649
52540 60649 61122 61248 61016 60514 59911 59478 59305 59266 59498 60439 62084 63678 64571 64927 65183 65366 65442 65877 67080
52521 67080 68586 69426 69176 68204 67048 66053 65508 65653 66496 67760 68914 69222 68184 66167 64225 63035
52505 63035 62322 61604 61003 60900 61237 61643 62078 62847 64083 65519 66714 67370 67541 67574 67681 67637 67259 66951 67186
52486 67186 67507 66910 65357 64103 64156 65151 66131 66703 66984 67142 67530 68638 70341 71718 72182 72225 72559 73080
52468 73080 73221 72807 71996 70957 70115 70055 70611 70703 69764 68634 68244 68156 67464 66497 66411 67360 68288 68468 68229 68055
52448 68055 67935 67764 67657 67696 67950 68736 70203 71661 72008 70941 69255 67892 67294 67617 68838 70419 71495
52431 71495 71707 71506 71439 71477 71209 70411 69260 68168 67531 67492 67900 68527 69171 69523 69216 68224 66983 65911 65059
52412 65059 64425 64199 64353 64365 63752 62683 61739 61328 61619 62687 64321 66004 67462 68905 70341 71158 70978
52395 70978 70489 70700 71592 72153 71680 70408 68955 67749 67014 66804 66935 67198 67635 68371 69320 70338 71485
52378 71485 72824 74153 75195 75834 75954 75416 74453 73695 73433 73380 73490 74355 76178 77960 78609 78453 78740 79864
52360 79864 80971 81252 80769 80008 79389 79345 80194 81723 83352 84729 85803 86414 86373 85927 85634 85777 86288 87107
52342 87107 88134 88953 89140 88809 88411 88087 87673 87232 87088 87381 88000 88773 89370 89271 88355 87287 86814 86936 87246
52323 87246 87716 88495 89251 89462 89126 88570 87868 87178 87232 88473 90054 90819 91137 92489 95191 97838 99382
52306 99382 100530 102449 105033 107226 108420 108768 108584 108138 107815 108031 108985 110597 112432 113703 113897 113504
52290 113504 113636 114744 116238 117523 118728 120098 121301 121908 122157 122666 123560 124365 124718 124885 125439 126569
52274 126569 127800 128574 129126 130400 132715 134867 135227 133660 131734 130936 131290 131925 132359 132753 133297 133858 134202
52257 134202 134269 134171 134010 133816 133790 134509 136470 139228 141465 142311 142277 142457 143202 144090 144812 145431 146048 146933 148722
52238 148722 151635 154687 156565 157269 158001 159416 160966 162136 163289 164862 166505 167595 168091 168415 168928
52223 168928 169818 171050 172170 172655 172765 173582 175844 179103 182261 184614 186121 187098 187966 189064 190470 192096
52207 192096 193946 195956 197704 198743 199240 199882 201155 203105 205633 208447 210814 212123 212770 213757 215264
52192 215264 216339 216206 215226 214270 213749 213556 213486 213437 213597 214466 216224 218104 219096 219266 219589 220398 220956 220800
52174 220800 220509 220626 220745 220268 219327 218294 217076 215648 214669 214734 215372 215543 214883 213852 212890 212015 211144 210282
52156 210282 209412 208508 207589 206622 205614 204914 204989 205660 206043 205539 204503 203644 203180 202923 202698 202291 201325 199649
52138 199649 197601 195701 194376 194037 194790 195820 195751 194136 192028 190634 189953 189284 188469 187863 187473 186913 186030
52121 186030 184936 183595 181997 180536 179636 179060 178165 176814 175528 174734 174306 173875 173244 172383 171352 170362
52105 170362 169784 169973 170952 172237 173125 173435 173807 174916 176548 177960 178996 180098 181237 181777 181667 181835
52089 181835 182892 184281 185339 186488 188579 191592 194746 197463 199523 200785 201543 202857 205597 209249
52075 209249 212341 213955 214273 213923 213484 213509 214212 215129 215702 216178 217348 219362 221393 222566 222751 222392 222050
52058 222050 222195 222948 223889 224447 224638 225129 226457 228394 230153 231061 231060 230676 230502 230651 230826 230860 230836 230575 229525
52039 229525 227491 225148 223418 222582 222296 222104 221518 220000 217480 214763 212888 212084 211723 211155 210222 209099
52023 209099 208042 207273 206739 206087 205164 204412 204486 205571 207331 209337 211246 212778 213829 214502 214844 214784 214477
52006 214477 214355 214593 214929 215313 216179 217611 218741 218678 217703 216864 216524 215953 214256 211191 207126 202687 198385
51989 198385 194237 189842 185117 180625 176794 173186 169035 164180 158959 153533 148039 143119 139487 136972
51975 136972 134605 131588 127757 123379 119134 115934 113945 111998 108829 104809 101578 100013 99449 98854 97800
51960 97800 96131 93741 91077 89012 87815 86937 86070 85601 85624 85481 84799 84178 84064 83683 82042 79576 77816
51943 77816 77562 78162 78535 78140 76875 74822 72475 70743 70272 70843 71690 72308 72808 73559 74607 75483 75522 74393
51925 74393 72388 70316 69119 69446 71352 74302 77512 80305 82252 83198 83322 83047 82696 82258 81632 80925
51909 80925 80247 79311 77649 75302 73033 71666 71408 71944 72946 74217 75441 76102 75872 75016 74269 74227 74900
51892 74900 75812 76433 76503 76125 75684 75483 75299 74511 72921 71265 70475 70576 70799 70719 70685 71064 71688 72283 72870
51873 72870 73409 73570 73195 72609 72194 72065 72392 73398 74642 74979 73888 72338 71674 72031 72521 72580 72346 71966
51855 71966 71418 70957 71017 71573 72211 72829 73719 74959 76231 77229 77829 77951 77800 78099 79452 81510 83331 84575
51837 84575 85754 87309 89033 90463 91253 91148 90202 89198 89237 90648 92707 94554 95930 96918 97547 97954
51821 97954 98512 99500 100881 102582 104713 107347 110337 113481 116689 119986 123643 128233 134214 141411 149218
51806 149218 157239 165277 172747 178636 182190 183283 182044 178661 173720 168263 163152 158595 154447 150671
51792 150671 147298 144196 141121 137938 134653 131361 128273 125699 123930 123058 122838 122770 122534 122410 122900 123862
51776 123862 124480 124354 124070 124261 124620 124472 123866 123343 122932 122218 121241 120465 119869 118902 117480 116293 115901 116107
51758 116107 116373 116299 115623 114360 113023 112184 111696 110958 109947 109309 109385 109854 110549 111770 113440 114685 114843
51741 114843 114423 114521 115574 117004 117877 117668 116629 115621 115325 115566 115651 115301 114781 114230 113526 112911 113013 114034
51723 114034 115560 117451 120231 124080 127994 130554 131284 130859 130219 129846 129768 129939 130550 131904 133780 135103
51707 135103 134671 132214 128410 124054 119797 116512 114967 114895 115131 114906 114366 113657 112386 110457 108619 107522
51691 107522 106785 105580 103727 101629 99590 97757 96470 96068 96503 97464 98738 100151 101511 102830 104286
51676 104286 105717 106516 106302 105343 104132 103041 102531 103004 103997 104193 102855 100849 99613 99526 99873 100056 100145
51659 100145 100451 101193 102531 104453 106724 109275 112431 116323 120297 123403 125319 126338 126622 125968 124344
51644 124344 122172 119982 118065 116520 115436 114871 114662 114237 112864 110464 108099 107187 108121 110057 112051
51629 112051 113808 115203 115891 115867 115765 116093 116661 117206 117996 119164 120045 119984 119421 119315 119773 120065 119901 119781
51611 119781 120020 120269 120244 120290 120830 121715 122482 122987 123477 124182 125064 125915 126555 126881 126773 126042 124614 122753 120940
51592 120940 119516 118608 118291 118444 118407 117298 114938 112141 109841 108194 106810 105533 104656 104458 104767 104962
51576 104962 104428 103202 102089 101770 101917 101707 101083 100777 100995 101030 100552 100361 101255 102851 104230 105126 105731 105907
51558 105907 105464 104908 104988 105704 106450 106972 107427 107664 107257 106279 105356 104900 104800 104888 105186 105699 106438 107583 109174
51539 109174 110692 111517 111786 112291 113493 115173 117054 119205 121653 124069 126054 127511 128607 129537 130446
51524 130446 131408 132509 134014 136262 139185 142086 144213 145454 146300 147323 148853 150836 152716 153839 154323
51509 154323 155196 157235 159968 162265 163585 164105 163963 163125 161842 160551 159238 157489 155171 152616 150148
51494 150148 147920 146129 144846 143576 141540 138522 135060 131781 128960 126746 125301 124508 123929 123270 122691
51479 122691 122503 122722 122986 122847 122155 121231 120550 120249 120174 120406 121234 122420 123045 122522 121304 120139 119098 117861
51461 117861 116478 115099 113350 110804 107883 105526 104062 103144 102584 102391 102014 100552 97994 95516 94182
51446 94182 93893 93855 93577 93111 92661 92279 91789 91024 90342 90656 92488 95139 97320 98479 98975 99155 99053 98939
51428 98939 99258 99816 99757 98654 97016 95483 94207 93255 92936 93216 93420 92986 92156 91529 91339 91562 92378 93978
51410 93978 96139 98325 100131 101395 102113 102448 102578 102335 101295 99516 97880 97327 97878 98760 99408 100061 101354
51393 101354 103568 106291 108676 109978 110006 109206 108400 108271 108907 109719 109978 109502 108684 107827 106806 105525 104279
51376 104279 103288 102181 100421 98081 95747 93845 92474 91841 92277 93760 95689 97220 97664 96757 94814
51361 94814 92469 89992 87094 83716 80609 78667 77919 77662 77288 76496 75065 73221 71981 72343 74103 76072
51345 76072 77325 77689 77316 76655 76618 77774 79391 80163 79919 79576 79427 78695 77097 75652 75335 75918 76716 77584
51327 77584 78471 78851 78439 77870 77814 77900 77289 75906 74396 73226 72542 72596 73493 74652 75259 75249 75270 75654 75980
51308 75980 75762 75104 74550 74568 75273 76466 77809 79008 79849 80100 79618 78634 77715 77264 77163 76930 76118 74630
51290 74630 72928 71825 71680 71850 71414 70468 70128 71120 72933 74556 75460 75546 74774 73435 72351 72235 72961
51273 72961 73871 74614 75358 76320 77442 78447 79032 79141 79115 79367 79845 80085 79793 79017 77746 75963 74220 73494
51255 73494 74033 74854 74809 73724 72180 70705 69692 69605 70564 71983 73175 74123 75166 76210 76850 77097 77368
51238 77368 77807 78172 78375 78584 78725 78434 77669 76953 76767 76944 76947 76576 76171 76120 76395 76672 76809 76956 77148 77071
51218 77071 76495 75736 75339 75478 76064 77216 79035 80916 81800 81393 80612 80543 81378 82547 83374 83324 82263 80910
51200 80910 80491 81387 82487 82441 81224 79882 79034 78383 77625 77126 77346 77997 78177 77344 76032 75445 76217 77723
51182 77723 78792 78981 78741 78488 78177 77849 77888 78382 78861 79089 79501 80376 81110 80997 80283 79803 79818 79877 79612 79028
51162 79028 78154 77095 76353 76454 77226 77958 78296 78490 78760 78989 79207 79818 81057 82525 83523 83730 83353 82749
51144 82749 82064 81240 80301 79546 79350 79763 80490 81309 82325 83675 85190 86497 87345 87790 88238 89238 90904
51127 90904 92517 93153 92775 92229 91998 91656 90916 90525 91409 93291 94904 95391 94884 93844 92509 91025 89614
51110 89614 88450 87673 87495 87986 88757 89234 89265 89240 89608 90460 91481 92138 92117 91778 91925 92826 93686 93425 91757
51091 91757 89194 86358 83790 82135 81791 82316 82780 82779 82677 82826 83084 83237 83427 83879 84498 85051 85506 85974
51073 85974 86364 86387 85919 85331 85317 86259 87760 88939 89249 88870 88286 87782 87481 87555 88072 88754 89127 88869 87926
51054 87926 86513 85139 84400 84570 85604 87562 90592 94242 97305 98789 98848 98347 97899 97749 98231 99557
51038 99557 101196 102149 102076 101749 102175 103546 105255 106718 107917 109136 110328 110987 110775 110135 109969 110715 112020
51021 112020 113297 114206 114537 114140 113140 111894 110612 109439 108908 109588 111067 112061 111966 111633 112056 113014 113672
51004 113672 113903 114191 114699 115266 115951 116730 117007 116344 115352 114941 114914 114398 113509 113380 114393 115540 115953 116014 116415
50985 116415 117047 117574 118438 120400 123318 126061 127622 127892 127471 127078 127106 127428 127610 127450 127295 127688 128757
50968 128757 129993 130664 130415 129578 128965 129349 131127 134273 138364 142676 146661 150470 154608 158971 162736
50953 162736 165523 168045 171088 174364 177155 179688 182940 187211 191867 196622 202107 208774 216039 223088
50939 223088 230063 237810 246735 256383 266025 275172 283497 290686 296676 301888 306890 311647 315269 316794
50925 316794 316211 314387 311980 308828 304576 299374 293590 287183 279936 272231 265124 259556 255627 252582
50911 252582 249408 245703 242150 239916 239523 240640 242969 246672 251582 256679 260961 264343 267217 269716
50897 269716 272118 275365 280258 286415 292849 299231 305705 311809 316642 320116 322995 325647 327691 329063
50883 329063 330476 332494 334790 336655 337676 337766 337105 336200 335472 334590 332770 329800 326192 322242 317647 312311
50867 312311 306944 302476 299164 296430 293303 289067 283896 278873 274978 272179 269847 267740 265959 264274
50853 264274 262390 260792 260429 261546 263652 266549 270428 274902 279055 282667 286394 290452 294265 297824
50839 297824 302253 308261 315002 321334 327504 334672 343303 352942 363258 374530 387121 401016 415837
50826 415837 431138 446888 463820 482859 503948 525932 547887 570124 593589 618789 645579
50815 645579 673272 700440 725183 746302 763950 778682 790312 798201 802230 802820 800242 794563 786204
50802 786204 776105 765374 755037 745922 738492 732982 729854 729785 732995 739042 747666 759409 774992
50789 774992 794500 817725 845005 877060 914054 955238 999450 1045636 1092910 1140369 1186802
50778 1186802 1230523 1269790 1303678 1332396 1356590 1376570 1392325 1403883 1411366 1414951 1414912 1411388
50766 1411388 1403826 1391076 1372403 1348235 1319678 1287591 1252335 1214151 1173559 1131661 1090155
50755 1090155 1050611 1013451 978036 943958 911780 882252 855368 830744 808425 788798 772013
50744 772013 758090 747356 740165 736226 734670 734853 736829 741080 748037 757784 770038 784439 800903
50731 800903 819550 840273 862608 885950 909440 931656 951001 966678 978822 987457 991927 991715
50719 991715 987405 980360 971792 962494 953054 943856 935073 926972 919962 914186 909512 906249 905359 907533
50705 907533 912398 919002 926621 934711 942587 949814 956626 963349 969635 974809 978748 981791 983933 984757
50691 984757 984189 982842 981445 980315 979534 979419 980653 984009 989949 998511 1009587 1023197 1039314 1057580
50677 1057580 1077596 1099488 1123855 1151264 1182253 1217808 1259334 1308099 1365079 1431071 1506163
50666 1506163 1589046 1677625 1770283 1865621 1960881 2051884 2135215 2209737 2275663 2333278 2383211
50655 2383211 2426869 2465467 2499101 2527456 2550683 2568816 2581021 2586480 2585480 2578841 2566890 2550015
50643 2550015 2529795 2508547 2488018 2469375 2453973 2443092 2437088 2435758 2439254 2447688 2460077 2474675
50631 2474675 2490269 2506165 2521071 2533101 2541029 2544639 2543674 2537300 2524884 2506710 2483821 2457731
50619 2457731 2430342 2403538 2378716 2357111 2340446 2330597 2328570 2334230 2346867 2365444 2388424 2413940
50607 2413940 2440098 2464742 2485337 2499819 2507284 2507090 2497698 2477326 2445566 2403374 2351647 2290978
50595 2290978 2222835 2149739 2073754 1995594 1915550 1834534 1753873 1674750 1598201 1525128 1456027
50584 1456027 1391145 1330970 1275942 1225697 1179394 1136997 1099492 1067511 1040407 1017022 996785
50573 996785 979741 966062 955923 949410 946150 945359 946420 949153 953501 959433 967198 977099 988901
50560 988901 1001945 1015991 1031492 1049075 1069341 1093152 1121393 1154308 1191801 1234489 1283693
50549 1283693 1340115 1403263 1472382 1546990 1626020 1707290 1788485 1868117 1944980 2017494 2084580
50538 2084580 2146838 2206063 2263755 2320778 2378211 2437574 2499872 2564883 2631621 2699289 2767652
50527 2767652 2836847 2907233 2979523 3054887 3134522 3218900 3307489 3399363 3493827 3590134 3686880
50516 3686880 3782181 3874175 3960627 4037996 4101738 4148002 4174710 4180890 4165747 4128942 4071400
50505 4071400 3995269 3903182 3797838 3682172 3559650 3434456 3311448 3195606 3091277 3001891
50495 3001891 2930134 2877765 2845032 2830683 2832759 2849096 2876917 2912349 2950609 2986472 3014482
50484 3014482 3029360 3026836 3004248 2960431 2895579 2811569 2712070 2601696 2484758 2364629 2243905
50473 2243905 2124725 2008910 1897862 1792400 1692703 1598695 1510492 1428362 1352331 1282193
50463 1282193 1217967 1160003 1108489 1063101 1023206 988209 957623 931017 908028 888200 870852
50452 870852 855378 841664 829942 820248 812389 806486 803025 802151 803230 805376 808227 812080 817517 825062
50438 825062 834965 847051 860878 876179 893118 912117 933583 957780 984761 1014393 1046607 1081587
50426 1081587 1119586 1160630 1204557 1251256 1300640 1352441 1406205 1461353 1517062 1572463 1627393
50415 1627393 1682782 1739822 1798858 1859479 1921501 1985216 2050710 2117479 2184768 2251779 2317473
50404 2317473 2380651 2440346 2495778 2545986 2590032 2627686 2659347 2685025 2703743 2713999 2714427 2703909
50392 2703909 2681504 2646549 2598736 2538156 2465599 2382881 2292623 2197787 2101578 2007377 1918040
50381 1918040 1835288 1760199 1694076 1638157 1592601 1556617 1529739 1512226 1503986 1503780 1509678 1519596
50369 1519596 1530958 1540529 1545216 1542933 1532490 1513099 1484433 1447132 1403026 1354791 1305024 1255209
50357 1255209 1205566 1156166 1107975 1062358 1019867 980166 942990 908372 875996 845227 816008
50346 816008 789048 764906 743502 724651 708403 694627 682877 672848 664430 657199 650521 644268
50334 644268 638800 634196 630218 627046 625130 624128 622970 621266 619814 619327 619574 620134 621088 622448 623822
50319 623822 625333 628084 633021 639884 647865 656579 665863 675353 685058 695777 708204 722046 736662
50306 736662 752080 768848 787344 807791 830306 854271 878150 900651 921562 940800 957266
50295 957266 969550 977477 982178 984953 986711 987976 988350 986127 979420 967766 951968 932509 909008
50282 909008 881414 851037 820051 790258 762448 736646 712788 691157 672098 655359 640173
50271 640173 626174 613786 603390 594572 586625 579367 572902 566941 560928 554651 548209 541512 534307
50258 534307 526665 519066 512072 506097 501299 497461 494195 491422 489325 487675 485710 483043 480245 478069
50244 478069 476460 474804 472893 471178 470170 469927 470043 469965 469485 468963 468834 468958 468856 468398 467662 466312 464052
50227 464052 461657 460393 460154 459380 457317 455106 453902 453105 451502 449198 447239 446020 445157 444375 443460 441888
50211 441888 439591 437638 437021 437125 436435 434523 432325 430767 430071 430158 430718 431098 431043 431334 432787 434896 436434
50194 436434 437170 438033 439786 442543 446300 450863 455366 458986 462103 465739 469936 473825 477287 481316 486488
50179 486488 492155 497506 502460 507191 511631 515851 520223 524903 529751 534934 540876 547455 553996 560306
50165 560306 567015 574620 582887 591493 600569 610271 620365 630609 641214 652696 665583 680324 697038
50152 697038 715346 734856 755823 778856 804108 831400 861194 894830 933631 978166 1028437
50141 1028437 1084416 1146464 1215570 1292833 1378087 1469189 1563157 1657532 1749906 1836707 1913895
50130 1913895 1979107 2032412 2075245 2109773 2139134 2166660 2193937 2220181 2243603 2262328 2273626
50119 2273626 2273426 2257649 2223831 2171492 2101911 2018117 1924335 1824617 1722119 1619779 1520963
50108 1520963 1428873 1345535 1271511 1206199 1148362 1096931 1051591 1012254 978143 948141 921949
50097 921949 900015 882150 867131 853930 842432 832636 824045 816357 809876 804661 799965 795160 790613
50084 790613 787022 784416 782328 780535 779039 777720 776498 775563 775103 775087 775454 776122 776707 776882 777189 778752
50068 778752 781854 785543 789050 792829 797620 803235 808962 814597 820347 826188 832076 838455 845834 854016
50054 854016 862342 870576 879110 888468 898943 910469 922525 934484 946363 958854 972298 986135
50042 986135 999772 1013572 1028445 1044895 1062974 1082824 1104635 1128348 1154001 1182179 1213673
50031 1213673 1248904 1288228 1332608 1383424 1441778 1508508 1584777 1672087 1771659 1884160 2009825
50020 2009825 2148180 2297294 2453494 2611899 2767265 2914742 3050638 3173147 3282669
50011 3282669 3381526 3473099 3560473 3645124 3726480 3802498 3870306 3926130 3964959 3980927 3968724
50000 3968724 3925409 3851559 3750907 3628587 3489444 3337672 3177296 3012167 2845346 2679103
49990 2679103 2515654 2357481 2206705 2064612 1931949 1809262 1696759 1594268 1501679 1419070
49980 1419070 1346155 1281841 1224596 1173157 1126857 1085542 1049204 1017433 989187 963330 939256
49969 939256 916694 895252 874736 855620 838275 821849 804893 787205 770110 754676 740621
49958 740621 727313 714786 703129 691834 680563 669873 660426 651969 643861 636122 629290 623598 618928
49945 618928 615188 612123 609126 605878 602899 600982 600370 600891 602383 604452 606378 607958 609982 613142 616852
49930 616852 619965 622326 624754 627726 631021 634682 639364 645447 652464 659723 667154 675314 684815 695834
49916 695834 708041 721007 734876 750546 769028 790786 815786 843876 874960 909282 947887
49905 947887 992415 1043953 1102449 1167648 1240213 1321357 1411566 1510002 1614625 1722120 1827946
49894 1827946 1927377 2016871 2094470 2159469 2212517 2255934 2293086 2327017 2359647 2391707 2422527
49883 2422527 2449577 2468643 2474726 2462981 2429612 2372960 2294171 2196563 2084410 1962506 1836355
49872 1836355 1711670 1593010 1482964 1382561 1292064 1211276 1139594 1076229 1020468 971717
49862 971717 929426 892979 861658 834768 811821 792466 776190 762376 750698 741149 733464 726828
49850 726828 720377 713781 707152 700747 694987 690362 686909 683976 680838 677301 673528 669560 665390 661172
49836 661172 657064 653029 649068 645356 641896 638362 634588 630889 627606 624722 622203 620283 619008 617873
49822 617873 616318 614272 611946 609484 607120 605131 603291 600983 598304 596357 595880 596335 597064 598481 601094
49807 601094 604034 605891 606689 607712 609495 611278 612472 613420 614379 614955 615078 615587 617175 619406 621393 622970
49791 622970 624649 626732 628979 630947 632365 633151 633232 632354 630302 627473 624935 623470 622733 621838 620518 619080
49775 619080 617485 615312 612746 610701 609651 609030 608088 606808 605573 604507 603568 602902 602566 602137 601011 599048
49759 599048 596743 594774 593432 592359 590800 588316 585328 582802 581412 581095 581282 581272 580525 578948 576905
49744 576905 574755 572546 570425 569017 568778 569123 568884 567668 566159 565037 564225 563417 562640 561944 561064 559853
49728 559853 558755 558422 559065 560423 562154 563986 565705 567272 568804 570204 571002 570823 569872 568728 567736 566899
49712 566899 566276 566186 566873 568213 569911 571825 573790 575223 575410 574502 573843 574757 577130 579693 581620 583167
49696 583167 584666 585811 586390 587055 588634 591079 593746 596355 599030 601609 603717 605489 607541 610133 612868
49681 612868 615344 617632 620035 622726 625746 629052 632498 635973 639573 643461 647660 652150 656985 662085
49667 662085 667114 671858 676510 681293 686089 690718 695237 699583 703296 706138 708685 711736 715375 719153
49653 719153 722930 726898 731008 735106 739521 744857 751181 757983 764830 771532 777900 784006 790527 798010
49639 798010 805870 812938 819027 825096 831760 838486 844514 849765 854508 858837 862939 867291 872102 876977
49625 876977 881521 885948 890748 895995 901257 906094 910550 915374 921637 929697 938607 947048 954896 963251
49611 963251 972823 982907 992260 1000407 1007693 1014548 1021213 1028005 1035328 1043367 1051930 1060687 1069629 1079294
49597 1079294 1090411 1103101 1116626 1130126 1143367 1156513 1169521 1182331 1195378 1209292 1224143
49586 1224143 1239560 1255471 1272054 1289061 1305877 1322395 1339215 1356867 1375361 1394488 1413955
49575 1413955 1433233 1451926 1470439 1489664 1509901 1530695 1551690 1572886 1593938 1614199 1633740
49564 1633740 1653499 1673934 1694354 1714227 1734338 1755809 1778402 1800713 1821874 1842225 1862257
49553 1862257 1881589 1899315 1914985 1928912 1941625 1953371 1964210 1974363 1984117 1993352 2001553 2008471
49541 2008471 2014444 2019784 2024209 2027323 2029338 2030870 2032189 2033224 2034071 2034964 2035863 2036640 2037520 2038794 2040297
49526 2040297 2041778 2043605 2046348 2049814 2053310 2056811 2061055 2066386 2072282 2078136 2083810 2089364 2095015 2101452
49512 2101452 2109331 2118216 2126747 2134092 2140631 2147042 2153414 2159397 2164478 2167891 2169059 2168346 2166647 2164017
49498 2164017 2159488 2152445 2143404 2133164 2122092 2110498 2098799 2086808 2073731 2059405 2044717 2030300
49486 2030300 2015615 1999947 1983479 1966627 1949036 1930152 1910321 1890499 1871139 1852036 1833019
49475 1833019 1814150 1795436 1776840 1758476 1740468 1722800 1705536 1688854 1672698 1656756 1641013
49464 1641013 1625855 1611482 1597741 1584747 1572987 1562490 1552529 1542561 1532857 1523754 1514854 1505486
49452 1505486 1495505 1485224 1475054 1465606 1457603 1451125 1445370 1439598 1433926 1428796 1424139 1419539 1414862
49439 1414862 1410272 1405907 1401877 1398306 1395185 1392508 1390589 1389752 1389641 1389486 1389134 1389122 1389634 1390242 1390885 1392239
49423 1392239 1394865 1398809 1404235 1411561 1420903 1432568 1448108 1468893 1492617 1512808 1523434 1523401 1515915
49410 1515915 1504811 1492888 1482478 1475286 1471520 1470369 1471324 1474246 1478635 1483987 1490500 1498438 1507157
49397 1507157 1515741 1524179 1532907 1541636 1549826 1557937 1566954 1576821 1586468 1595241 1603300 1610787 1617745 1624770
49383 1624770 1632626 1641189 1649699 1658011 1666579 1675337 1683637 1691340 1698912 1706388 1713320 1719951 1727376 1736232
49369 1736232 1745990 1755909 1766010 1776810 1788670 1801561 1815044 1828443 1841519 1854837 1868935 1883429
49357 1883429 1897726 1912437 1929032 1948073 1968668 1989815 2011445 2033918 2057312 2081510 2106449
49346 2106449 2132054 2158368 2185803 2214697 2244648 2274799 2304804 2334963 2365488 2396303 2427494
49335 2427494 2459251 2491347 2523290 2555050 2587007 2619239 2651481 2683706 2716033 2748194 2779890
49324 2779890 2811581 2843989 2876670 2908012 2936926 2963834 2989747 3015127 3039951 3064212 3087862
49313 3087862 3110611 3132059 3151815 3169581 3185529 3200430 3214847 3228397 3240443 3251237 3261484
49302 3261484 3270911 3278429 3283825 3288203 3292404 3296023 3298502 3300266 3302013 3303547 3304121 3303625 3302830 3302640 3303437
49287 3303437 3304927 3306370 3307255 3307946 3309362 3311833 3314648 3316964 3318757 3320642 3323076 3326040 3329248 3332355
49273 3332355 3334988 3336671 3336821 3335017 3331437 3326744 3321210 3314243 3305177 3294206 3281929 3268271 3252572
49260 3252572 3234643 3214929 3193647 3170521 3145570 3119510 3093130 3066679 3039935 3012441 2983739
49249 2983739 2953904 2923846 2894499 2865764 2836776 2807169 2777398 2747835 2718258 2688310 2657863
49238 2657863 2626925 2595844 2565564 2536845 2509132 2480925 2451392 2420932 2390122 2359070 2328068
49227 2328068 2297996 2269506 2242300 2215523 2188512 2161111 2133874 2107975 2084176 2061730 2039116
49216 2039116 2016055 1993952 1974029 1955868 1938144 1920045 1901542 1883071 1865521 1849843 1836011
49205 1836011 1822835 1809231 1795207 1781219 1767224 1752975 1738699 1724733 1710818 1696393 1681444
49194 1681444 1666538 1652064 1637831 1623381 1608501 1593492 1578946 1565156 1551816 1538534 1525503
49183 1525503 1513296 1502237 1492432 1484124 1477195 1470542 1462931 1454590 1446973 1440795 1435319 1429868 1424900
49170 1424900 1420935 1417461 1413845 1410680 1409294 1410176 1412472 1414747 1415725 1414694 1411856 1408206 1404767 1402063
49156 1402063 1400326 1399585 1399328 1398705 1397514 1396475 1396216 1396634 1397632 1399724 1403253 1407708 1412557 1418208 1425192
49141 1425192 1432708 1438898 1442622 1444339 1445265 1446240 1447466 1448836 1450284 1451953 1454042 1456494 1458984 1461321
49127 1461321 1463624 1466034 1468564 1471348 1474616 1478268 1481873 1485301 1488919 1492973 1497203 1501312 1505397 1509655
49113 1509655 1514076 1518726 1523858 1529515 1535435 1541600 1548355 1555664 1562819 1569327 1575624 1582436 1589857 1597513
49099 1597513 1605242 1613073 1620766 1627879 1634181 1639688 1644408 1648310 1651381 1653572 1654874 1655465 1655461 1654595 1652637
49084 1652637 1650141 1648115 1646740 1645109 1642490 1639234 1636104 1633361 1630844 1628321 1625303 1621147 1615846 1610242
49070 1610242 1605065 1600181 1595202 1590202 1585409 1580727 1576049 1571533 1567101 1562215 1556646 1550954 1545754 1541067
49056 1541067 1536895 1533730 1531791 1530289 1528245 1525684 1523400 1521875 1521082 1521057 1521949 1523710 1526246 1529642 1533794
49041 1533794 1538131 1542217 1546367 1551277 1557326 1564576 1572999 1582294 1591873 1601460 1611325 1621625 1632134
49028 1632134 1643016 1655160 1669131 1684334 1699824 1715363 1731107 1746916 1762713 1778950 1795975
49017 1795975 1813505 1831456 1850588 1871469 1893445 1915745 1939019 1964544 1992271 2020955 2050092
49006 2050092 2080433 2112447 2145365 2178092 2210238 2241989 2273631 2305443 2337610 2370159 2403281
48995 2403281 2437497 2472977 2508980 2544625 2579897 2615181 2650044 2683367 2714548 2743781 2771253
48984 2771253 2796905 2820884 2843346 2863758 2881235 2895659 2907781 2918264 2927374 2935469 2942764 2948552
48972 2948552 2951657 2951941 2950446 2947741 2943072 2935669 2926120 2915781 2905362 2894683 2883517 2872093 2860899
48959 2860899 2850333 2840511 2831263 2822413 2814070 2806466 2799643 2793641 2788863 2785770 2784240 2783670 2783784 2784893
48945 2784893 2787328 2790978 2795528 2800772 2806640 2813258 2821058 2830551 2841959 2855247 2870384 2887229 2905414
48932 2905414 2924751 2945650 2968608 2993444 3019494 3046556 3075067 3105369 3137287 3170542 3205095
48921 3205095 3241039 3278498 3317668 3358577 3400797 3443712 3487067 3530948 3575412 3620620 3667207
48910 3667207 3715954 3766973 3819610 3873205 3927640 3983135 4039865 4097819 4156829 4216723 4277621
48899 4277621 4339821 4403270 4467450 4532019 4597137 4662788 4728297 4793021 4856949 4920016 4981392
48888 4981392 5040260 5096827 5151590 5203972 5252735 5297503 5338755 5376470 5410001 5439350 5465262
48877 5465262 5487637 5504962 5515824 5520144 5518410 5510618 5496594 5476674 5451366 5420823 5385173 5344969
48865 5344969 5300799 5252829 5201118 5146018 5087900 5026855 4963038 4896901 4828663 4757935 4684460
48854 4684460 4609141 4533922 4460604 4389875 4321326 4254195 4188154 4123501 4060654 3999698 3940702
48843 3940702 3884230 3831029 3781302 3734776 3691542 3652238 3617222 3586045 3558001 3532829 3510701
48832 3510701 3491907 3476796 3465706 3458684 3455521 3456164 3460757 3469112 3480478 3494159 3510139 3528815
48820 3528815 3550245 3573968 3599561 3627190 3657485 3690807 3726691 3764177 3802736 3842692 3884641
48809 3884641 3928697 3974382 4020958 4067713 4114290 4160992 4208437 4256691 4305204 4353803 4403077
48798 4403077 4453267 4503463 4552765 4601741 4651785 4703344 4755750 4808650 4862454 4917304 4972623
48787 4972623 5028000 5083713 5139985 5196436 5252706 5309115 5366283 5424336 5482744 5540672 5597383
48776 5597383 5652521 5705933 5756983 5804288 5846651 5884104 5917443 5946802 5971267 5989883 6002425
48765 6002425 6009165 6010583 6007449 6000604 5990378 5976539 5958821 5937176 5911556 5881893 5848184 5810147
48753 5810147 5766935 5717769 5662774 5602706 5538042 5468908 5395729 5319329 5240559 5160543 5081030
48742 5081030 5003685 4929009 4856642 4786563 4719244 4654886 4593425 4535211 4480657 4429286 4380146
48731 4380146 4333233 4289536 4249565 4212854 4178970 4147927 4119456 4093006 4068767 4047582 4029447
48720 4029447 4013167 3997948 3984240 3972542 3962419 3953343 3945541 3939242 3933902 3928932 3924498 3920893 3917743
48707 3917743 3914491 3911159 3908013 3904988 3901976 3899227 3896899 3894634 3892012 3889084 3886139 3883443 3881390 3880302
48693 3880302 3879835 3879232 3878376 3877832 3877591 3876752 3874948 3873161 3872477 3872809 3873574 3874940 3877583 3881735 3887097 3893270
48677 3893270 3899724 3905917 3912017 3919034 3927684 3937553 3947850 3958397 3969395 3980826 3992612 4004721
48665 4004721 4016553 4026935 4035423 4043037 4050876 4058451 4064133 4066878 4066789 4064265 4059284 4051449 4040267 4025567
48651 4025567 4007824 3987745 3965388 3940314 3912797 3883970 3854340 3822983 3788912 3752471 3714673
48640 3714673 3675891 3636131 3596013 3556539 3518173 3480871 3444646 3409427 3374780 3340497 3307101
48629 3307101 3275122 3244260 3213934 3184246 3155661 3128128 3101276 3075218 3050506 3027509 3006439
48618 3006439 2987612 2971058 2956135 2942128 2929012 2917216 2907010 2898589 2892253 2887934 2884941 2882757
48606 2882757 2881672 2882207 2884506 2888815 2895800 2905647 2917418 2930036 2943376 2957735 2972880 2988477 3004871
48593 3004871 3022584 3041578 3061798 3083667 3107039 3130383 3152235 3173010 3194189 3216238 3238538
48582 3238538 3260902 3283749 3306986 3330086 3353201 3376936 3401106 3424923 3448307 3471735 3494847
48571 3494847 3516742 3537787 3559682 3583285 3607682 3631882 3656102 3680720 3705130 3728535 3750994
48560 3750994 3772727 3793017 3810713 3825507 3838022 3848937 3858651 3867637 3876486 3885510 3894569 3903303
48548 3903303 3911447 3918944 3925803 3931815 3936622 3940203 3943066 3945619 3947615 3948595 3948621 3948073 3946862 3944491 3940865
48533 3940865 3936448 3931540 3925776 3918499 3909399 3898865 3887835 3877004 3865938 3853354 3838659 3822711
48521 3822711 3806581 3790136 3772592 3753980 3735107 3716341 3697312 3677675 3657306 3635876 3613116
48510 3613116 3589440 3565472 3541101 3515835 3490003 3464609 3439911 3415055 3389246 3362515 3335313
48499 3335313 3308161 3281748 3256375 3231285 3205445 3179120 3153670 3129622 3106079 3082314 3058752
48488 3058752 3035838 3013102 2990165 2967823 2947182 2928341 2910671 2893845 2877741 2861794 2845396
48477 2845396 2828752 2812571 2796941 2781163 2764710 2747857 2731231 2715143 2699484 2684019 2668684
48466 2668684 2653628 2638987 2624597 2610066 2595142 2579832 2564081 2547632 2530360 2512638 2495152
48455 2495152 2478267 2461615 2444326 2425809 2406324 2386613 2366937 2346801 2325823 2304494 2283700
48444 2283700 2263751 2244353 2225310 2206765 2188799 2171174 2153474 2135256 2116236 2096639 2077145
48433 2077145 2058187 2039514 2020764 2002104 1983849 1965851 1947838 1930048 1912846 1896019 1879147
48422 1879147 1862478 1846651 1831759 1817433 1803784 1791342 1779991 1768796 1757215 1745821 1735529
48411 1735529 1726550 1718364 1710321 1702069 1693669 1685434 1677595 1670283 1663902 1659033 1655533 1652251 1648285 1644101
48397 1644101 1640712 1638220 1636113 1634580 1634304 1634977 1635289 1634691 1634257 1635391 1638421 1642757 1647732 1652973 1658505
48382 1658505 1664727 1671812 1678999 1685038 1689419 1692647 1695259 1697163 1698025 1697682 1696114 1693557 1690712 1688344
48368 1688344 1686701 1685756 1685802 1687090 1689106 1690982 1692550 1694241 1696141 1698052 1700346 1703765 1708278 1713023 1717410
48353 1717410 1721475 1725252 1728786 1732675 1737522 1742892 1747935 1752968 1759167 1766584 1773882 1780273 1786263 1792077
48339 1792077 1796832 1799993 1802341 1804719 1806911 1808501 1809731 1810680 1810629 1809142 1806888 1804554 1801800 1798088 1793616
48324 1793616 1788499 1781910 1773126 1762788 1752129 1741459 1730338 1718757 1707222 1696020 1685096 1674298
48312 1674298 1663120 1650759 1637158 1623449 1610640 1598353 1585584 1572166 1558685 1545503 1532781
48301 1532781 1521004 1510490 1500609 1490429 1479978 1470098 1461126 1452508 1443691 1434746 1426018 1417718 1409926
48288 1409926 1402690 1396025 1389919 1384209 1378479 1372471 1366588 1361468 1356949 1352184 1347004 1342386 1339141 1336870
48274 1336870 1334747 1332555 1330387 1328049 1325510 1323333 1321873 1320521 1318494 1315998 1313933 1312745 1312177 1311808
48260 1311808 1311232 1309964 1307734 1304650 1300838 1296279 1291193 1286033 1280842 1275309 1269718 1264931 1261020 1256885
48246 1256885 1251785 1246192 1240389 1233478 1224880 1215871 1208229 1202039 1196106 1189954 1184063 1178486 1172661 1166536
48232 1166536 1160715 1155499 1150642 1145986 1141423 1136382 1130265 1123213 1115672 1107551 1098687 1089778 1081721 1074207
48218 1074207 1066040 1056775 1047000 1037099 1026826 1016250 1006067 996742 988095 979889 972182 965023 958406
48205 958406 952511 947408 942655 937792 932999 928617 924376 919850 915368 911579 908416 905410 902675 900622
48191 900622 898986 897265 895825 895488 896369 898406 902720 910936 923278 938930 958235 982863 1013811
48178 1013811 1051273 1096913 1154379 1227170 1318319 1432262 1571904 1728489 1875075 1975499
48168 1975499 2004386 1960489 1862834 1736592 1602017 1471743 1352738 1248357 1159495 1085367
48158 1085367 1024074 973010 929504 891699 858915 831072 807787 788161 771277 756616 743861
48147 743861 732684 722905 714613 707753 701717 695619 688995 682045 675312 669267 663986 659032 653870 648690
48133 648690 644463 641842 640261 638562 636264 633733 631368 629252 627524 626453 626033 625936 625967 626205 626774 627752
48117 627752 629182 630840 632273 633471 635139 637671 640228 641645 642057 642698 644109 645521 646160 646172 645872 644917
48101 644917 642831 639863 636813 634367 632919 632612 633196 634148 635206 636479 637879 638871 639075 638772 638558 638790
48085 638790 639524 640668 641978 643161 644131 644869 644972 643760 640978 637013 632302 626973 621242 615642 610461
48070 610461 605377 600040 594718 589979 585961 582275 578477 574332 569809 565180 560968 557431 554179 550602
48056 550602 546670 542951 539673 536100 531172 524787 518106 512406 507832 503537 498878 494070 489687 486021
48042 486021 483112 480927 479214 477544 475838 474505 473697 472827 471329 469596 468597 468708 469424 470190 471045 472402
48026 472402 474533 477291 480145 482609 484758 487105 489807 492448 494846 497541 500970 504654 507851 510535
48012 510535 512981 514720 514854 513390 511471 510256 510151 511024 512453 513753 514429 514652 514817 514729 513891 512474
47996 512474 511293 510779 510649 510508 510108 509014 506868 504036 501283 498621 495246 490747 485706 480858 476257
47981 476257 471600 466852 462271 458089 454287 450421 445859 440638 435790 432186 429229 425474 420347 414435
47967 414435 408298 402029 395985 390689 385755 380007 373175 366534 361334 357431 353895 350235 346457 342619
47953 342619 338890 335538 332423 329029 325326 321955 319205 316515 313414 310254 307526 305143 302970 301376
47939 301376 300575 299943 298732 297144 296049 295876 296241 296481 296134 295119 293749 292434 291285 290261 289633 289701
47923 289701 290067 289938 289330 289145 289746 290393 290508 290604 291300 292236 292754 293016 293582 294418 295084 295569 296180 296928 297673
47904 297673 298522 299474 300080 300176 300609 302428 305582 309046 312003 314231 315632 316219 316512 317185 318245 319173 319877
47887 319877 320980 323028 325872 328919 331687 334122 336611 339662 343426 347678 352325 357456 362653 366845
47873 366845 369445 371217 373320 375825 377914 379404 381207 384138 387875 391344 393748 395122 396202 397781
47859 397781 399905 401668 402101 401238 399963 398898 397818 396243 394167 392046 390317 389132 388414 387986 387664
47844 387664 387263 386583 385453 383900 382208 380751 379759 379109 378239 376440 373534 370228 367531 365820 364723
47829 364723 363760 362667 361243 359506 357997 357340 357341 357155 356499 356032 356270 356779 356874 356526 356108 355779 355581 355698
47811 355698 356122 356429 356358 356175 356085 355760 354982 354231 354003 353983 353639 353278 353670 354833 356004 356831 357818 359417 361293
47792 361293 362777 363646 364173 364656 365103 365354 365415 365612 366266 367258 368158 368851 369648 370680 371590 372108 372530 373313
47774 373313 374528 376021 377810 379883 381791 382865 382762 381700 380274 379101 378345 377557 376357 375193 374773
47759 374773 374710 373637 371034 367995 365633 363591 360990 358093 355888 354463 352882 350619 348151 346112 344660
47744 344660 343769 343393 343238 342926 342524 342448 342818 343387 344111 345308 347180 349517 351984 354419 356845 359337 361780
47727 361780 363622 364208 363539 362336 361036 359152 356109 352245 348384 344705 340677 335859 330247 324117 318135
47712 318135 313343 310288 308350 306557 304797 303510 302434 300735 298427 296685 296409 297172 297925 298139 297910
47697 297910 297492 297155 297258 298095 299725 301930 304190 305782 306313 306209 306368 307302 308843 310571 312150 313350
47681 313350 314170 315023 316449 318623 321382 324636 328406 332518 336673 340794 345010 349337 353735 358394 363547
47666 363547 369027 374331 379134 383449 387288 390507 392922 394347 394587 393664 391944 389799 387309 384539 381797
47651 381797 379248 376537 373270 369669 366275 363173 360030 356820 353950 351703 349961 348513 347226 345945
47637 345945 344667 343798 343906 345083 346737 348086 348841 349578 351383 354754 358868 362466 365502 369065 373426
47622 373426 377263 379519 381020 383133 385648 387280 387664 387347 386016 382385 376096 368388 360553 352799 344995
47607 344995 337439 330380 323717 317679 312985 309752 307009 303886 300636 297966 295959 294213 292531 290881
47593 290881 289080 287065 285168 283671 282349 280809 279035 277211 275309 273150 270666 267868 264850 262092
47579 262092 260385 260084 260624 261047 260816 259907 258360 256105 253159 249776 246355 243293 240796 238806 237163
47564 237163 235811 234698 233650 232595 231837 231731 232154 232591 232713 232554 232177 231535 230711 229973 229521 229426 229716 230248
47546 230248 230596 230478 230204 230333 230958 231659 232111 232344 232523 232850 233594 234817 236236 237698 239462 241532 243097
47529 243097 243374 242793 242585 243339 244807 246995 250391 254936 259765 264310 268900 273877 278827 283105 286590
47514 286590 289603 292591 296092 300379 304768 307854 308845 308216 306856 305136 303118 300977 298735 296063 292908
47499 292908 289939 287882 286655 285557 284029 281969 279546 277102 275025 273487 272401 271696 271311 270878 269892
47484 269892 268445 267344 267215 267857 268671 269369 269950 270304 270230 269740 269155 268959 269547 270865 272332 273428 274316
47467 274316 275508 277024 278401 279496 280651 282005 283199 283964 284417 284612 284450 284238 284697 286047 287621 288800
47451 288800 289859 291439 293584 295746 297464 298642 299338 299620 299550 299153 298464 297619 296700 295567 294144 292721
47435 292721 291580 290474 289003 287392 286230 285488 284489 282909 281085 279246 277205 275000 273090 271671 270487
47420 270487 269528 269152 269239 269008 268060 266933 266250 266036 266227 267036 268342 269471 270114 270819 272057 273530 274926
47403 274926 276637 279046 281720 283953 285509 286284 285977 284847 284087 284471 285155 284750 283206 281674 280813 280191
47387 280191 279197 277624 275400 272558 269508 266672 263878 260683 257239 254242 252076 250571 249480 248603 247587
47372 247587 246240 245006 244511 244653 244738 244507 244368 244555 244700 244498 244195 244111 244048 243562 242671 241976 242072 242916 243826
47353 243826 244147 243916 243741 244026 244573 245021 245376 245900 246777 248040 249518 250675 250889 250211 249452 249148 248806 247700
47335 247700 246022 244661 243931 243166 241587 239144 236424 234103 232562 231723 231087 230072 228421 226335 224328
47320 224328 222951 222410 222268 221750 220512 218977 217810 217266 217146 217126 216984 216671 216358 216263 216441 216892 217744 218986
47302 218986 220155 220819 221269 222062 222885 222724 221383 220024 219700 220073 220101 219334 218000 216356 214650 213231 212044
47285 212044 210411 207927 205202 203087 201542 199976 198392 197370 197029 196779 196179 195453 195026 194968 194927 194367 192949
47268 192949 190945 189197 188390 188481 188968 189468 189799 189900 190011 190587 191671 192686 193185 193395 193597 193430 192437 191018
47250 191018 190141 190192 190629 190696 190100 189090 188263 188195 188937 189974 190851 191590 192247 192472 191904 190731 189498 188572
47232 188572 188059 187895 187744 187247 186678 186934 188448 190573 192444 193967 195515 197168 198800 200428 201857 202458
47216 202458 201991 201271 201310 202110 202933 203423 203729 203824 203525 203066 203010 203657 205037 207241 210174 213270 216039 218686
47198 218686 221621 224667 227366 229750 232048 233937 234903 235189 235590 236307 236763 236578 236063 235700 235632 235645 235282
47181 235282 234127 232398 230974 230379 230095 229460 228763 228652 228818 228230 226572 224567 222912 221722 220951 220577
47165 220577 220277 219690 219103 219167 219930 220797 221548 222606 224153 225661 226565 226966 227392 228238 229535 230993 232274
47148 232274 233460 235088 237415 239941 242054 243833 245663 247340 248144 247635 245857 243104 239995 237412 235647
47133 235647 233976 231758 229554 228361 228120 227989 227764 227946 228529 228856 228742 228719 229031 229291 229296 229371 229663 229844 229654
47114 229654 229157 228395 227412 226630 226507 226945 227649 228775 230409 231657 231416 229992 228842 228617 228554 227974 227247
47097 227247 226911 226809 226589 226316 226137 225954 225741 225690 225877 226201 226521 226356 224841 221853 218799 217165 216563 215532
47079 215532 214002 213278 213498 213013 210933 208640 207806 208240 208709 208732 208419 207514 205773 203696 201897 200242 198416
47062 198416 196789 195920 195723 195821 196196 196768 196934 196290 195343 194747 194328 193613 192842 192618 192912 193206 193411 193883 194718
47043 194718 195658 196556 197353 197782 197646 197299 197329 197854 198507 199066 199738 200936 202971 205773 208704 210934 212295
47026 212295 213548 215607 218646 222079 225090 227069 227964 228430 229325 230918 232884 234978 237145 238893 239400
47011 239400 238629 237789 238185 239937 242109 243662 244049 243336 242124 241068 240302 239598 239044 239043 239559 240009 240038 239815
46993 239815 239416 238623 237530 236685 236366 236356 236570 237183 237984 238440 238693 239547 241140 242538 243122 243420 243971 244333
46975 244333 243988 243423 243424 243941 244525 245297 246583 247989 248772 248957 249326 250363 251795 253087 253983 254623 255405 256548
46957 256548 257706 258396 258863 259949 261928 264102 265711 266552 266523 265497 264059 263386 263820 264338 264039 263290 262787
46940 262787 262442 262029 262066 262964 263956 263899 262713 261164 259701 258404 257594 257531 257809 257866 257782 257808 257570 256588 255238
46921 255238 254340 254084 254112 254334 254782 255075 254913 254848 255618 256990 258121 258857 259704 260653 261018 260538 259828 259568 259827
46902 259827 260255 260420 259992 259016 257951 257153 256559 256177 256350 257004 257225 256301 254768 253638 253005 252201 250931
46885 250931 249412 247751 246086 245078 245195 245722 245441 244257 243238 243096 243564 244249 245187 246361 247530 248750
46869 248750 250434 252701 255165 257403 259066 259664 258917 257362 255988 255279 255154 255672 257013 258796 260153
46854 260153 260700 260844 261143 261884 263214 264983 266458 266888 266490 266288 266856 267789 268523 269134 270129 271833 274070
46837 274070 276131 277157 276917 276175 275940 276543 277792 279659 282182 284981 287555 289922 292322 294532 296196
46822 296196 297701 299859 302692 305306 307100 308455 310049 312042 314088 315751 316858 317740 319033 320867
46808 320867 322517 323377 323901 324964 326556 327877 328538 328862 329076 329058 328916 329073 329665 330520 331714 333493 335648
46791 335648 337683 339628 341978 344731 347181 348810 349836 350822 352261 354513 357495 360385 362206 362803 362804
46776 362804 362794 363056 363851 365170 366335 366631 366299 366180 366508 366859 367166 367808 368714 369389 369953 371146 373051 374756
46758 374756 375595 375906 376308 377028 378207 380009 382057 383574 384462 385529 387271 389183 390667 391897 393294
46743 393294 394881 396670 399082 402352 405950 409130 411763 414300 417244 420942 425462 430339 434818 438664
46729 438664 442416 446618 451210 455836 460271 464332 467801 470722 473431 476083 478534 480791 483108 485422
46715 485422 487189 488002 488035 487761 487647 488162 489495 491055 491862 491780 491920 493447 496308 499382 501597 502713 503228
46698 503228 503676 503915 503232 501413 499343 498003 497135 495638 493155 490411 488009 485735 483220 480381 477037
46683 477037 472898 468317 464239 461038 458036 454500 450481 446247 441687 436757 431982 427951 424703 421964
46669 421964 419535 417105 414155 410533 406755 403423 400594 397991 395480 393150 391208 389907 389301 389006 388572
46654 388572 387969 387301 386235 384458 382535 381440 381198 380898 380155 379570 379525 379522 379160 378817 378850 378928 378665 378150 377386
46635 377386 375996 374039 372356 371527 371173 370796 370516 370321 369403 367113 364038 361361 359566 358450 357919 357996
46619 357996 358450 359123 360269 361938 363363 363707 363210 363015 363991 366164 369060 372077 374747 377107 379676 382808
46603 382808 386291 389768 393179 396511 399522 402011 403956 405248 405863 406551 408561 412170 416111 418961 420552
46588 420552 421531 422328 423171 424456 426228 427778 428529 428983 430094 432050 434294 436375 438178 439721 441349
46573 441349 443642 446486 448699 449332 448923 448728 449190 449971 450961 452191 453030 452593 450974 449155 447728 446528
46557 446528 445459 444742 444246 443383 441898 440098 438146 435762 432818 429648 426612 423782 421204 418979 416984
46542 416984 414968 413004 411432 410293 409224 408025 406896 405986 405060 403756 401985 400057 398552 397949 398180
46527 398180 398746 399501 400934 403295 405806 407413 408143 409048 410851 413322 416003 418861 421972 425069 427777
46512 427777 430075 432329 435032 438546 442852 447482 451877 455828 459490 463177 467370 472695 479359 486688
46498 486688 493631 499765 505459 511108 516692 522094 527364 532430 536957 540792 544300 547962 551749 555174
46484 555174 557889 560002 561735 563034 563702 563856 563975 564409 565011 565371 565204 564384 562886 561044 559665 559385
46468 559385 559915 560238 559561 557790 555270 552524 550159 548482 547146 545566 543608 541443 538959 536023 533154
46453 533154 530988 529072 526187 522144 518324 516014 515070 514694 514613 514852 515139 515386 516169 517977 520452 522996
46437 522996 525649 528704 531977 535129 538242 541423 544360 546986 550058 554128 558354 561353 563027 564553
46423 564553 566611 568598 569757 570237 570618 570918 570501 568832 566157 563382 561183 559227 556667 553479 550705
46408 550705 549056 547904 546186 543770 541270 538953 536605 534284 532478 531555 531462 531809 531902 531057 529391 527975
46392 527975 527696 528330 529209 530319 532058 534340 536780 539523 543124 547651 552595 557605 562730 568082 573750
46377 573750 579900 586487 593029 599140 605049 611057 616853 621943 626505 631102 635737 639793 642773 644599
46363 644599 645409 645593 645804 646368 646892 646873 646382 645699 644742 643440 642219 641470 640934 640291 639870 640113 640786 641485
46345 641485 642418 643834 645226 646065 646947 648964 652262 656174 660378 664880 669251 673021 676567 680477 684387
46330 684387 687745 691348 696607 703344 709846 715208 720121 725089 729449 732708 735421 738002 739846 740417
46316 740417 740228 739984 739530 738389 736618 734450 731705 728152 723983 719425 714432 709118 703989 699352 695061
46301 695061 691201 688397 687053 686761 686811 686912 687146 687790 689355 692237 696050 699874 703403 707295 712167 717871
46285 717871 723976 730318 736807 743272 749796 756684 763892 771106 778522 786840 796244 806006 815400 824377
46271 824377 833167 841927 851002 860687 870340 878478 884206 888005 890739 892600 893439 893508 893306 893072 892776 892209
46255 892209 890962 888843 886370 884151 881775 878208 873471 868846 865142 861902 858850 856844 856533 857082 857317
46240 857317 857404 858245 859823 861311 862546 864304 867196 871065 875455 879964 884265 888374 892852 898244 904457
46225 904457 911093 918099 925572 933150 940212 946574 952541 958438 964486 970905 977612 984033 989689 994913
46211 994913 1000546 1006983 1013806 1020254 1025788 1030388 1034575 1038955 1043568 1047987 1052187 1056829 1062305 1068030
46197 1068030 1073211 1077923 1082836 1088149 1093519 1098866 1104579 1110788 1116976 1122551 1127527 1132463 1137845 1143631
46183 1143631 1149363 1154694 1159724 1164693 1169551 1174138 1178709 1183687 1188858 1193405 1196987 1200283 1204171 1208847
46169 1208847 1214122 1220029 1226632 1233557 1240341 1247061 1254182 1261893 1269981 1278258 1286720 1295346 1304045 1312798
46155 1312798 1321601 1330334 1338848 1347207 1355743 1364882 1374828 1385299 1395645 1405475 1415040 1424763 1434582
46142 1434582 1444221 1453959 1464486 1475916 1487610 1499137 1510839 1523233 1536422 1550263 1564530 1578581
46130 1578581 1591496 1603018 1613945 1625192 1636845 1648503 1660118 1672054 1684608 1697824 1711552
46119 1711552 1725415 1738961 1752075 1764996 1777827 1790443 1802985 1815983 1829788 1844293 1859317
46108 1859317 1874744 1890138 1904941 1919354 1934331 1950314 1966557 1982196 1997377 2012729 2028266
46097 2028266 2043475 2058169 2072629 2087056 2101370 2115417 2129022 2142048 2154677 2167332 2180053
46086 2180053 2192312 2203748 2214727 2225781 2236868 2247586 2257878 2268093 2278534 2289195 2299852
46075 2299852 2310226 2320260 2330243 2340398 2350387 2359744 2368750 2378198 2388104 2397359 2405032 2411459 2417761
46062 2417761 2424835 2433030 2442087 2451091 2459172 2466686 2474965 2484565 2494534 2503971 2513510 2524506 2537374
46049 2537374 2551467 2566083 2580851 2595569 2610389 2625853 2642123 2658505 2674214 2689193 2703661
46038 2703661 2717403 2730149 2742164 2753710 2764320 2773344 2781016 2788367 2796238 2804786 2813662 2822164 2829578
46025 2829578 2835835 2841617 2847544 2853734 2860402 2868134 2877084 2886526 2895789 2904964 2914171 2922949 2931118 2939465
46011 2939465 2948670 2958182 2967040 2975206 2983181 2990941 2998342 3006040 3014830 3024363 3033610 3042387 3051425 3061142
45997 3061142 3071305 3081753 3092582 3103792 3115578 3128591 3143084 3158200 3173153 3188660 3206033
45986 3206033 3225136 3244495 3263235 3281528 3299229 3315608 3330733 3345713 3361073 3375942 3389336
45975 3389336 3401269 3412085 3421592 3429434 3435699 3440645 3444353 3446983 3448821 3449862 3449923 3449367 3449120 3449724 3450882
45960 3450882 3452105 3453222 3454157 3454882 3455799 3457473 3459721 3461529 3462138 3461637 3460260 3457730 3453642 3448041 3441263
45945 3441263 3433665 3425702 3417869 3410255 3402479 3394251 3385684 3377004 3368386 3360145 3352685 3346118 3340305 3335316
45931 3335316 3331398 3328376 3325516 3322166 3318234 3313969 3309587 3305105 3300256 3294618 3288131 3281333 3274765 3268403
45917 3268403 3262046 3255822 3249606 3242391 3233325 3223275 3214310 3207365 3201373 3195012 3188422 3182624 3177981 3173937
45903 3173937 3169936 3165982 3162419 3159530 3157350 3155757 3154783 3154758 3155939 3158120 3160890 3164163 3168012 3172161 3176165
45888 3176165 3180056 3184352 3189376 3194998 3200967 3207059 3212988 3218669 3224485 3230875 3237773 3244969 3252757 3261534
45874 3261534 3270915 3280034 3288717 3297532 3306683 3315739 3324608 3333854 3343606 3352845 3360323 3365732 3369631 3372606
45860 3372606 3374884 3376475 3377292 3377220 3376123 3373691 3369503 3363607 3356913 3350489 3344501 3338323 3331570 3324455 3317203
45845 3317203 3309817 3302555 3295982 3290302 3285067 3279733 3274131 3268307 3262230 3255767 3248645 3240467 3230997 3220340
45831 3220340 3208654 3196051 3182979 3170175 3157708 3144635 3130183 3114598 3098032 3079486 3058109
45820 3058109 3034966 3011990 2989491 2966239 2941856 2917349 2893040 2867807 2841073 2814119 2788576
$$ [...]
##END NTUPLES=NMR SPECTRUM
##END=
