
##TITLE=AC1251_CAMARS11069_6534722_LsklCzsz1x
##JCAMPDX= 6.0         $$ Bruker NMR JCAMP-DX V2.0
##DATA TYPE= NMR SPECTRUM
##DATA CLASS= NTUPLES
##ORIGIN= BRUKER
##OWNER= Administrator
$$ 1.72 TOPSPIN		Version 2.1
$$ 2012-07-17 03:28:42.671 -0500  Administrator@TOPSPIN
$$ Compression mode = diff/dup
##.OBSERVE FREQUENCY= 400.02188249412
##.OBSERVE NUCLEUS= ^1H
##.ACQUISITION MODE= SIMULTANEOUS (DQD)
##.ACQUISITION SCHEME= undefined
##.AVERAGES= 8
##.DIGITISER RES= 22
##SPECTROMETER/DATA SYSTEM= spect
##.PULSE SEQUENCE= zg30
##.SOLVENT NAME= COFFEE_meoh
##.SHIFT REFERENCE= INTERNAL, COFFEE_meoh, 1, 14.98509
##AUDIT TRAIL= $$ (NUMBER, WHEN, WHO, WHERE, PROCESS, VERSION, WHAT)
$$ ##TITLE= Audit trail, TOPSPIN		Version 2.1
$$ ##JCAMPDX= 5.01
$$ ##ORIGIN= Bruker BioSpin GmbH
$$ ##OWNER= Administrator
$$ $$ C:\Bruker\TOPSPIN/data/COFFEE/nmr/AC1251_CAMARS11069_6534722_LsklCzsz1x/10/pdata/1/auditp.txt
$$ ##AUDIT TRAIL=  $$ (NUMBER, WHEN, WHO, WHERE, PROCESS, VERSION, WHAT)
(   1,<2012-07-17 03:28:35.859 -0500>,<Administrator>,<TOPSPIN>,<go>,<TOPSPIN 2.1>,
      <created by zg
	started at 2012-07-17 03:27:29.250 -0500,
	POWCHK enabled, PULCHK disabled,
       configuration hash MD5:
       6B 1B 68 BB D9 2E 58 E2 7F 35 AD 54 07 DF 0E 41
       data hash MD5: 64K
       33 9C 01 66 63 14 4F 8B C0 5D 15 9D E4 D0 5F A9>)
(   2,<2012-07-17 03:28:38.500 -0500>,<Administrator>,<TOPSPIN>,<proc1d>,<TOPSPIN 2.1>,
      <Start of raw data processing
       efp LB = 0 FT_mod = 6 PKNL = 1 PHC0 = 0 PHC1 = 0 SI = 32K 
       data hash MD5: 32K
       40 23 E0 96 61 8B EF 5C 9C 85 24 0B 3C FA 19 26>)
(   3,<2012-07-17 03:28:38.875 -0500>,<Administrator>,<TOPSPIN>,<proc1d>,<TOPSPIN 2.1>,
      <pk PHC0 = 179.7803 PHC1 = 0 
       data hash MD5: 32K
       B3 A5 25 D3 74 85 83 3E FE 3A 3E EF 43 EA 8F 09>)
(   4,<2012-07-17 03:28:39.000 -0500>,<Administrator>,<TOPSPIN>,<proc1d>,<TOPSPIN 2.1>,
      <abs ABSG = 1 
       data hash MD5: 32K
       D8 D5 19 2C 4B B5 C4 19 B4 B2 78 99 B9 18 89 97>)
(   5,<2012-07-17 03:28:39.031 -0500>,<Administrator>,<TOPSPIN>,<proc1d>,<TOPSPIN 2.1>,
      <abs ABSG = 2 
       data hash MD5: 32K
       73 31 49 15 22 3F 90 EC 11 4A FB 7C CF E0 F1 B1>)
(   6,<2012-07-17 03:28:39.062 -0500>,<Administrator>,<TOPSPIN>,<proc1d>,<TOPSPIN 2.1>,
      <abs ABSG = 3 
       data hash MD5: 32K
       66 0A 8E 24 41 D4 01 D1 C6 42 DC 78 0B 53 DA F1>)
(   7,<2012-07-17 03:28:39.093 -0500>,<Administrator>,<TOPSPIN>,<proc1d>,<TOPSPIN 2.1>,
      <abs ABSG = 4 
       data hash MD5: 32K
       6F C5 35 44 45 00 15 5F D9 33 97 25 D9 3F B4 BF>)
(   8,<2012-07-17 03:28:39.140 -0500>,<Administrator>,<TOPSPIN>,<proc1d>,<TOPSPIN 2.1>,
      <abs ABSG = 5 
       data hash MD5: 32K
       2F 57 08 3B 62 B7 C2 50 FD 2E BE 33 5D 46 BB F8>)
$$ ##END=
$$ 
$$ $$ hash MD5
$$ $$ B9 B5 B0 32 75 99 CB D9 77 AF 28 6B 20 BF 89 6B
##$RELAX= 
##$RELAX= 
##$RELAX= 
##$RELAX= 
##$RELAX= 
##$RELAX= 
##$RELAX= 
$$ Bruker specific parameters
$$ --------------------------
$$ [...]
150 150 150 150 150 150 150 150
##$TP07= 0
##$TPNAME0= <>
##$TPNAME1= <>
##$TPNAME2= <>
##$TPNAME3= <>
##$TPNAME4= <>
##$TPNAME5= <>
##$TPNAME6= <>
##$TPNAME7= <>
##$TPOAL= (0..7)
0.5 0.5 0.5 0.5 0.5 0.5 0.5 0.5
##$TPOFFS= (0..7)
0 0 0 0 0 0 0 0
##$TUNHIN= 0
##$TUNHOUT= 0
##$TUNXOUT= 0
##$USERA1= <user>
##$USERA2= <user>
##$USERA3= <user>
##$USERA4= <user>
##$USERA5= <user>
##$V9= 5
##$VALIST= <valist>
##$VCLIST= <CCCCCCCCCCCCCCC>
##$VD= 0
##$VDLIST= <DDDDDDDDDDDDDDD>
##$VPLIST= <PPPPPPPPPPPPPPP>
##$VTLIST= <TTTTTTTTTTTTTTT>
##$WBST= 2048
##$WBSW= 25
##$XGAIN= (0..3)
0 0 0 0
##$XL= 0
##$YL= 0
##$YMAX_a= 509883
##$YMIN_a= -652291
##$ZGOPTNS= <>
##$ZL1= 120
##$ZL2= 120
##$ZL3= 120
##$ZL4= 120
##$ABSF1= 14.98509
##$ABSF2= -5.573092
##$ABSG= 5
##$ABSL= 3
##$ALPHA= 0
##$AQORDER= 0
##$ASSFAC= 0
##$ASSFACI= 0
##$ASSFACX= 0
##$ASSWID= 0
##$AUNMP= <proc_prof1d_extract_pilot.lims>
##$AXLEFT= 0
##$AXNAME= <>
##$AXNUC= <1H>
##$AXRIGHT= 0
##$AXTYPE= 0
##$AXUNIT= <>
##$AZFE= 0.1
##$AZFW= 0.1
##$BCFW= 0
##$BC_mod= 0
##$BYTORDP= 0
##$COROFFS= 0
##$CY= 15
##$DATMOD= 1
##$DC= 0
##$DFILT= <>
##$DTYPP= 0
##$F1P= 0
##$F2P= 0
##$FCOR= 0.5
##$FTSIZE= 32768
##$FT_mod= 6
##$GAMMA= 0
##$GB= 0
##$INTBC= 1
##$INTSCL= 1
##$ISEN= 128
##$LB= 0
##$LEV0= 0
##$LPBIN= 0
##$MAXI= 10000
##$MC2= 0
##$MEAN= 0
##$ME_mod= 0
##$MI= 0
##$NCOEF= 0
##$NC_proc= -8
##$NLEV= 6
##$NOISF1= 0
##$NOISF2= 0
##$NSP= 0
##$NTH_PI= 0
##$NZP= 0
##$OFFSET= 14.98509
##$PC= 1
##$PHC0= 179.7803
##$PHC1= 0
##$PH_mod= 1
##$PKNL= yes
##$PPARMOD= 0
##$PPDIAG= 0
##$PPIPTYP= 0
##$PPMPNUM= 2147483647
##$PPRESOL= 1
##$PSCAL= 4
##$PSIGN= 0
##$PYNMP= <proc.py>
##$REVERSE= no
##$SF= 400.02
##$SI= 32768
##$SIGF1= 0
##$SIGF2= 0
##$SINO= 400
##$SIOLD= 32768
##$SPECTYP= <>
##$SREGLST= <1H.CDCl3>
##$SSB= 0
##$STSI= 32768
##$STSR= 0
##$SW_p= 8223.68421052631
##$SYMM= 0
##$S_DEV= 0
##$TDeff= 65536
##$TDoff= 0
##$TI= <>
##$TILT= no
##$TM1= 0
##$TM2= 0
##$TOPLEV= 0
##$USERP1= <user>
##$USERP2= <user>
##$USERP3= <user>
##$USERP4= <user>
##$USERP5= <user>
##$WDW= 1
##$XDIM= 32768
##$YMAX_p= 467549745
##$YMIN_p= -688613
##$CURPLOT= <Network HP LaserJet P1505>
##$CURPRIN= <$Network HP LaserJet P1505>
##$DFORMAT= <normdp>
##$LAYOUT= <+/1D_H.xwp>
##$LFORMAT= <normlp>
##$PFORMAT= <normpl>
##$SURQMSG= 1
$$ End of Bruker specific parameters
$$ ---------------------------------
##NTUPLES= NMR SPECTRUM
##VAR_NAME=  FREQUENCY,     SPECTRUM/REAL,   SPECTRUM/IMAG
##SYMBOL=    X,             R,               I
##VAR_TYPE=  INDEPENDENT,   DEPENDENT,       DEPENDENT
##VAR_FORM=  AFFN,          ASDF,            ASDF
##VAR_DIM=   32768,         32768,           32768
##UNITS=     HZ,            ARBITRARY UNITS, ARBITRARY UNITS
##FACTOR=    0.250966925370066, 1,           1
##FIRST=     8223.43324360094, 118956,       -258955
##LAST=      0,             -18434,          -60839
##MIN=       0,             -688613,         0
##MAX=       8223.43324360094, 467549745,    0
$$ Real data points
##PAGE= N=1
##DATA TABLE= (X++(R..R)), XYDATA
$$ [...]
19545a30098C403J7645b56668g5901j93657P154A79026a66109A17979q187m3942
19534F5850J78190j04600F410b39836h7273G4905b50122j21580A42439R9565c65995
19522A60230C3991J63781p6567K3822a14680e0865F2607a723j70338q277j31983
19511c12321J11092d1814l7598I8254a65222e1853A64031a03087A82489i8069
19500c45916a05304j74367Q7730e5278A21797b72054a01918j08979j37956F4677
19489a29483j62826f4087B98537B0760a69966G6877a59613B31969C0931H252J70251
19478A78503M3959e9485P016j18201q9604A73278A9689a24496B28988a23362N8704
19467f4658l79007J99852A13350a26389A93265g5584j59822D3733a46674P229
$$ y = [-130098, 3403, 21048, -256668, -75901, -269558, -262404, 179026, -166109, 117979, 109792, 65850, 244040, 139440, 6410, -239836, -87273, 74905, -250122, -371702, 142439, 242004, -365995, 160230, 33991, 197772, 121205, 145027, -114680, -50865, 62607, -1723, -172061, -180338, -312321, -201229, -41814, -79412, 98254, -165222, -51853, 164031, -103087, 182489, -98069, -345916, -105304, -279671, -191941, -55278, 121797, -272054, -101918, -210897, -348853, 64677, -129483, -292309, -64087, 298537, 20760, -169966, 76877, -159613, 231969, 30931, 8252, 178503, 222462, -59485, -52469, -170670, -260274, 173278, 19689, -124496, 228988, -123362, -64658, -443665, -243813, 113350, -126389, 193265, -75584, -235406, 43733, -146674, -139445]
19457a39445A82676q8001J88208E8694a39381b2897n5457J9953A13111B7803K88504
19446C16307q9954b42913d806H2564R4347c6768j42525A59067a03754A90564a85430
19434A09416E3284b24921J9988j39842D0701J20071b2377j11669k0613M9533A47535
19422A57233e3587A84914a17636A69123f9398b2827p4927H9878a28611R77c1056
19410c39828A93056a23344n2895Q3327B9354a05397j42630A74473C7798d2790
19399D20984d15340A606a13854j12931J13234j40133g5953I5429K87582a07355
19388E8168b50560J24653q1418j74801d9011J8251j8768A4347c04508J30380j06849
19377b80977A03984a70212D0752K08221m4675F6033q500b31187b2573I9240a66102
$$ y = [-139445, 182676, 94675, 282883, 58694, -139381, -22897, -78354, -58401, 113111, 27803, 316307, 226353, -242913, -4806, 82564, 176911, -36768, -179293, 159067, -103754, 190564, -185430, 109416, 53284, -224921, -204933, -344775, 40701, 160772, -22377, -134046, -154659, -105126, 147535, 157233, -53587, 184914, -117636, 169123, -69398, -22827, -97754, 89878, -128611, -127634, -31056, -339828, 193056, -123344, -176239, -92912, 29354, -105397, -248027, 174473, 37798, -42790, 420984, -415340, 1606, -113854, -226785, -113551, -253684, -75953, 95429, 383011, -107355, 58168, -250560, -125907, -207325, -382126, -49011, -30760, -49528, 14347, -304508, -174128, -280977, 103984, -170212, 40752, 248973, 204298, 66033, 57533, -231187, -22573, 99240, -166102]
19365a00030B17379g5029f673m84937a0026j15095k12958a14906k47681f6693
19354e8391b2142C24750C8056P0824h504q5504J7574c2146j34659A25838a74478
19342d5093r2090G4436b91851b2220k6370n3128C0199N4745b30517a4360j48916
19331a63276j27148h4752K9973G2702a23755D8694e0063j00543B4867P1677b94910
19319a66691j36953a18697p2072e810k17051j55306O5186B20080b89828a12134
19308G7085b72862Q6560j83437J74524j41007a11226j46018D29509a00970j66412
19298b67382I7722a07221A35009c47991A81165a31927r6847j77921b3034A50797
19287a03767A68436a23475H463Q123b41385a14139p172m6344E1835b73605i3665
$$ y = [-100030, 217379, -75029, -6673, -491610, -10026, -125121, -338079, -114906, -362587, -66693, -58391, -22142, 324750, 38056, 108880, -8504, -94008, -76434, -32146, -166805, 125838, -174478, -45093, -137183, 74436, -291851, -22220, -48590, -101718, 30199, 84944, -230517, -14360, -163276, -290424, -84752, -54779, 72702, -123755, 48694, -50063, -150606, 24867, 96544, -294910, -166691, -303644, -118697, -190769, -5810, -222861, -378167, -312981, 220080, -289828, -112134, 77085, -272862, -186302, -369739, -195215, -336222, -111226, -257244, 429509, -100970, -267382, 97722, -107221, 135009, -347991, 181165, -131927, -228774, -406695, -23034, 150797, -103767, 168436, -123475, 8463, 16586, -241385, -114139, -121311, -167655, 51835, -273605, -93665]
19275g9336C52133H2812a24218d478j13231n9762n7364m0620A09957D5154b17753
19263d6605k13463A35039F4101J7227c45390a42735B449b08493j62876D762h853
19251c31044i5619k6704I4928a78734b678o4712A5603f2086i133j48178N6772
19240a00539a5453C46013a81637H1279a23332j2055B53950a98664G6826a92916
19229A32547J67306j46862b20359J05687f12j6095q4807E6555J91623D9613M8241
19218I7854l3232a09276K264K9964E6627e4954l12462J09834P0455L3084H9595
19206e112I3349e1193p4117j21265J6498P3228N3808J5960A26040e9249j60954
19195b20203i756o6662J0634n3310K9531d1210k46449e0316r2170A45474b34425
$$ y = [-79336, 352133, 82812, -124218, -4478, -117709, -177471, -234835, -275455, 109957, 45154, -217753, -46605, -260068, 135039, 64101, 81328, -345390, -142735, 2449, -208493, -371369, 4762, -8853, -331044, -95619, -122323, 94928, -178734, -2678, -67390, 15603, -62086, -9133, -157311, -100539, -15453, 346013, -181637, 81279, -123332, -135387, 253950, -198664, 76826, -192916, 132547, 299853, 152991, -220359, -114672, -612, -16707, -101514, 56555, 248178, 49613, 97854, 64622, -109276, -107012, -77048, 56627, -54954, -367416, -257582, -187127, -154043, 89595, -5112, 93349, -51193, -125310, -246575, -230077, -156849, -103041, -87081, 126040, -59249, -220203, -9756, -76418, -65784, -119094, -89563, -41210, -287659, -50316, -142486, 145474, -234425]
19183c12115A34453q360i70q5405L3540A54840a68353l07948a13103b5228j06909
19172a32137l9012A91536a78447P8023r1594A61007a24544j11306J09557A53529
19161D1397J28689E6165h0104B65964L9370e1629j78866C67401a87039A02797
19150B21918K4379b73307C79638H6385i220A336J68501A2290a05421M8381k47532
19139c04572a25548C58040c13355n0925e5426A3277N716K27826a96338B88046
19128a59073L6724k91708a6163B1590a15241k14342d9582D0439d57930g0949b1939
19116a2682l52013A1062M0092C099e3990A56871C1327b9545A37536R7434a80949
19104b97434a10550d646C9788D598J25682J40238p7937E4904a81250A40810f5570
$$ y = [-312115, 134453, 126093, -970, -86375, -52835, 154840, -168353, -476301, -113103, -25228, -132137, -171149, 191536, -178447, -100424, -192018, 161007, -124544, -235850, -126293, 153529, 41397, 170086, 56165, -80104, 265964, 305334, -51629, -230495, 367401, -187039, 102797, 221918, 246297, -273307, 379638, 86385, -9220, 1336, 169837, 12290, -105421, -57040, -304572, -125548, 358040, -313355, -364280, -55426, 13277, 18993, 246819, -196338, 288046, -159073, -122349, -414057, -16163, 21590, -115241, -329583, -49582, 40439, -457930, -70949, -21939, -12682, -364695, 11062, 51154, 3099, -53990, 156871, 31327, -29545, 137536, 234970, -180949, -297434, -110550, -4646, 39788, 4598, 130280, 270518, 192581, 54904, -181250, 140810, -65570]
19092f2828p1380I2073i1806k02104F007b42895d8675A05769A3714M1506d6419
19080b6184m0522k7487C22616A01805m569b47166B3400a34183C9545O2812a50448
19068a63150j80613A1557e5923k16536i6987A67393G2071Q026j8085a48668A37360
19056a13790D001b33277R8665l04499a56993A3729i9188J0830H4561C9156b6765
19044I5261i4903j94762A05914c6089p3475A631f15228e4743j2279k80512i4752
19032A81538O5577b71132G3811c61855b2705J0445A03196b56281O3791D0614a8252
19020a23203E8923d8368F3333N7963b44028E2600b13213H641c66939d7450B89702
19008A54643o8558d63484i4681j17755A78529i1526n637C38515b34159O6153B11625
$$ y = [-62828, -134208, 92073, -91806, -293910, 6007, -242895, -48675, 105769, 13714, 55220, -46419, -26184, -66706, -94193, 322616, 101805, 97236, -247166, 23400, -134183, 39545, 102357, -150448, -163150, -343763, 11557, -55923, -272459, -96987, 167393, 72071, 80097, 62012, -148668, 137360, -113790, 4001, -233277, -134612, -439111, -156993, 13729, -99188, -88358, 84561, 39156, -26765, 95261, -94903, -289665, 105914, -36089, -109564, 1631, -615228, -54743, -67022, -347534, -94752, 181538, 247115, -271132, 73811, -361855, -22705, -12260, 103196, -256281, -192490, 40614, -18252, -123203, 58923, -48368, 63333, 121296, -244028, 52600, -213213, 8641, -366939, -47450, 289702, 154643, 86085, -463484, -94681, -212436, 178529, -91526, -97163, 338515, -234159, -168006, 211625]
18996d0231k05478e6627a1213j85886P2256B09063H9505k5508J5185a20509A27107
18984A55250n171D0407b1633C5906L3778a23844A19430a32290n1035A58534i0278
18972B22078D3531a8056q7917a8666j06222j01522A08850J66984i765B5541J22385
18961A47926G2620K264a27378A90370h468G1968b69913b5896P705l6276k43039
18950b97506f2610H6871a46335a1257D1429d4578m2197A10943a81460p5311k8662
18939b85433J5295F131J10195j4540b08558A94433m771b44855i0447h120j77992
18928a86112p758k251M4645j13168M4217N8813b5100A06730K3153h5810r5845
18917a81655A18636h548o13k62490d05r123B4478e5503j50028o5436A91274G3283
$$ y = [-40231, -245709, -56627, -11213, -197099, -124843, 209063, 89505, 63997, 79182, -120509, 127107, 155250, 150079, 40407, -21633, 35906, 69684, -123844, 119430, -132290, -183325, 158534, -90278, 222078, 43531, -18056, -105973, -18666, -124888, -226410, 108850, 275834, -9765, 25541, 147926, 72620, 74884, -127378, 190370, -8468, 71968, -269913, -25896, -18191, -54467, -297506, -62610, 86871, -146335, -11257, 41429, -44578, -86775, 110943, -181460, -256771, -285433, -270138, 6131, 116326, 101786, -208558, 194433, 189662, -244855, -90447, -8120, -186112, -193870, -196121, -151476, -264644, -220427, -161614, -25100, 106730, 129883, -85810, -181655, 118636, -8548, -9161, -271651, -405, -9528, 24478, -55503, -205531, -270967, 191274, 73283]
18904B42684a3803A9301P1452J60395b77860B43084B5664J26129b1230j77142
18894a98372j52200C1930J76224J71912a58803J3162l68221f9110E2371Q3863
18884A36234A3989J37661j4852j1072P0449c24523d5356A33415f8917o2093A98746
18872a68476q7249F5378a74719H4899b9015a1905j60201k71103f0775B42230i4626
18860a08709j69546c7065a0012H229h1325f387A77119c1008j8782m9580H7671
18848c210j0593j93734i3614C68268a89109G8453M9560a37224C26370b7832C0238
18836h597p313k98342d3891J3884B3031a22677I4321b01563N4603A37534a10511
18824B38591p492H9539A6926J60222b06117O0566k37105A21927e7628H6552b522
$$ y = [242684, -13803, 19301, 90753, 251148, -277860, 243084, 25664, 151793, -21230, -198372, -350572, 31930, 208154, 380066, -158803, -145641, -513862, -69110, 52371, 136234, 13989, 151650, 136798, 125726, 196175, -324523, -45356, 133415, -68917, -131010, 198746, -168476, -255725, 65378, -174719, 84899, -29015, -11905, -172106, -443209, -60775, 242230, -94626, -108709, -278255, -37065, -10012, 8229, -81325, -6387, 177119, -31008, -49790, -99370, 87671, -3210, -13803, -207537, -93614, 368268, -189109, 78453, 128013, -137224, 326370, -27832, 30238, -8597, -15910, -314252, -43891, -30007, 23031, -122677, 94321, -201563, -146960, 137534, -110511, 238591, 231099, 89539, 16926, 177148, -206117, -145551, -382656, 121927, -57628, 86552, -2522]
18812b8573A02031K32588K4043a64911A27510b17749D37570F4263c03881f5342
18801b79220j23828b00282D6132f1417J1009B2917a0618m72191f3098j3591G9778
18789h7779k40430C37207A10590b32217C23861E6136c22904a15861N3728r3769
18779a55902O4398L2755j12179E2356M7929f0683D666L8820B073K16016f5746
18767a65607O9929J4816J3858j5310A18329j3181f3533F4203a59320j15521a25234
18755f2448j60508b2072q6909e2273I3819h5991C0805E024O6777i1138K4240a4547
18742A06990K5498a62817b1127l66660C0158b88386L8790C08779b25477j21018
18732c46495B65605b18321j3416e3809l5136k91967A8702J10992l975C8396P1426
$$ y = [-28573, 102031, 334619, 358662, -164911, 127510, -217749, 437570, 64263, -303881, -65342, -279220, -403048, -200282, 46132, -61417, -50408, 22917, -10618, -482809, -63098, -76689, 79778, -87779, -328209, 337207, 110590, -232217, 323861, 56136, -322904, -115861, -62133, -155902, -91504, -58749, -170928, 52356, 100285, -60683, 4666, 43486, 2073, 218089, -65746, -165607, -95678, -80862, -67004, -82314, 118329, 105148, -63533, 64203, -159320, -274841, -125234, -62448, -222956, -22072, -108981, -52273, 93819, -85991, 30805, 5024, 71801, -91138, -66898, -14547, 106990, 132488, -162817, -21127, -387787, 30158, -288386, -249596, 308779, -225477, -346495, 265605, -218321, -231737, -53809, -88945, -380912, 18702, 129694, 125719, 38396, 109822]
18721A09822d1650D8690E882a55636j04245E6678P1254c05895C8948a91962A20752
18709a58737j03211A20096B0584a13867B66136q3070c23901I6677A5992d1213
18698a70288A80955c39770r2481h3282k01428a19423N1570a5257l6403R660j20842
18687a62842H419J21873c59604J70786B07575J52734G4583d0795j85671D5114
18676A33385a48429P811B21329b42551j20862a77940a6804P718I7640b35790O4633
18665a71157g5189k58956a11780q246L9093A85401b7895j07484d0075j14725K21
18654a54579F4814L0987b21148f6471F7518Q2554E8092A9458K66875E1779F626
18642G3242a30145A91061J79282A24181f1933C14767b07268G5983j4873L4318
$$ y = [109822, -41650, 48690, 5882, -155636, -259881, 56678, 127932, -305895, 38948, -191962, 120752, -158737, -261948, 120096, 20584, -113867, 266136, 183066, -323901, 96677, 15992, -41213, -170288, 180955, -339770, -432251, -83282, -284710, -119423, -67853, -15257, -51660, -42000, -162842, 8419, 130292, -359604, -188818, 207575, 360309, 74583, -40795, -226466, 45114, 133385, -148429, -140618, 221329, -242551, -363413, -177940, -16804, -9086, 97640, -235790, -171157, -75189, -334145, -111780, -120026, -80933, 185401, -27895, -135379, -40075, -154800, -154579, 64814, 95801, -221148, -66471, 67518, 150072, 58092, 19458, 286333, 51779, 6626, 73242, -130145, 191061, 370343, 124181, -61933, 314767, -207268, 75983, 61110, 95428]
18632I5428d2195k68492p2379L5133B147K01603f4096F8767e6197j91686D69154
18620a65628E6297k0284i7085h115D1466L04579a73542d6710G3521g2255H8494
18608g7260B27986a58341r7634M1980a00060M1360B52531a95904g5490p4756h001
18596f3982A65120i6358r844j22478K308b8228k908j74310D2291P2044E4420m094
18584E0326a7823o1364I073d47052c3105o9707l0108K4153A27329B6419L0924
18573E7343c21790C2769i1986p008j5461B14836G1104K5639g3495C409J1687a3331
18560a26680A23467b22735g1680j24573A38072L780a13506p370A46460e5384A24604
18548B67740a8435l52990J31977A38967K98403b74225f5744A05181c52356I675
$$ y = [95428, -42195, -310687, -383066, -347933, 2147, 203750, -64096, 68767, -56197, -247883, 469154, -165628, 56297, 36013, -97085, -8115, 41466, 346045, -173542, -46710, 73521, -72255, 88494, -77260, 227986, -158341, -255975, -213995, -100060, -58700, 252531, -195904, -75490, -150246, -8001, -63982, 165120, -96358, -106202, -228680, -226372, -28228, -31136, -205446, 42291, 114335, 54420, 50326, -17823, -79187, 9073, -447052, -33105, -102812, -132920, -108767, 127329, 26419, 57343, -321790, 32769, -91986, -98994, -114455, 214836, 71104, 96743, -73495, 3409, 15096, -13331, -126680, 123467, -222735, -71680, -196253, 138072, 141852, -113506, -120876, 146460, -55384, 124604, 267740, -18435, -371425, -239448, 138967, 437370, -274225, -65744, 105181, -352356, 9675]
18537D1406a24397l32252A02858H948J17704g1653A9310J68887m4394a0198A21151
18525a94623m6075A5249O032c07406b4422j13526k5069A92f1363k34784C2640
18513c46121A18870J11278j02028f9204m7636k8330m8923k8388j665c4193j79830
18502b14023k7864b3492H5004a41367f7708k17876A06021b17384j56153F1650
18491c9883l26141a9927o2036k34863J45701N8771m9905M2717D8292h6140r7543
18480a83683F3541k266J63941i351k03292N9711O8947L7245B51604r7027b03370
18468b06347k8657j78993a72476D3641G172J87275e4155r0480A46008e8769j66553
18457b25322R6783b4988R340j54877A78381c33172G0931b50150C46a34528A32016
$$ y = [41406, -124397, -456649, 102858, 8948, 126652, -71653, 19310, 188197, 143803, -10198, 121151, -194623, -240698, 15249, 21281, -307406, -24422, -137948, -163017, 192, -61363, -296147, 32640, -346121, 118870, 230148, 128120, -69204, -116840, -145170, -194093, -222481, -224146, -34193, -214023, -241887, -23492, 85004, -141367, -67708, -285584, 106021, -217384, -373537, 61650, -39883, -366024, -19927, -81963, -316826, -171125, -112354, -162259, -119542, 48292, -86140, -183683, 63541, 61275, 225216, -9351, -212643, -152932, -83985, -46740, 251604, 154577, -203370, -206347, -235004, -413997, -172476, 43641, 7172, 194447, -54155, -144635, 146008, -58769, -225322, -128539, -24988, -15648, -170525, 178381, -333172, 70931, -250150, 346, -134528, 132016]
18445i6220H419a91015A0846M784N3526a80013A53403e4438j45678b4591j52840
18434a77431E5106a07471B85164a72023J7595j2098A76400N9532a70604j03975
18424b74579G8678g2814l88133B8347c1901B74775c74850C23928a68323I0223
18413B4889J93221e0036i935j12976e7802A20918B3890g5348A68339a19096B95849
18401a54714N0892H5274b31490e2172J736p8963d3520A03798b21529A5353c04283
18389a35708N5245H5005A4722a47442m8635E1444J18168K4705b03601C6770a73640
18377a16954j74248A03158a13518j43841e9360j59896A38298n2771O9K15846C9408
18365h6137k2033A75029J94497a04220K00b4579k57453J00510K1022j13397a01762
$$ y = [-96220, 8419, -191015, 10846, 15630, 69156, -180013, 153403, -54438, -200116, -24591, -177431, 55106, -107471, 285164, -172023, -154428, -166526, 176400, 235932, -170604, -274579, 78678, -72814, -460947, 28347, -31901, 274775, -374850, 323928, -168323, 90223, 24889, 218110, -50036, -9935, -122911, -57802, 120918, 23890, -75348, 168339, -119096, 295849, -154714, -103822, 85274, -231490, -52172, -50436, -129399, -43520, 103798, -221529, 15353, -304283, -135708, -80463, 85005, 14722, -147442, -196077, 51444, 169612, 194317, -203601, 36770, -173640, -116954, -291202, 103158, -113518, -257359, -59360, -219256, 138298, 85527, 85596, 301442, 39408, -86137, -108170, 175029, 369526, -104220, -104020, -24579, -282032, -181522, -160500, -273897, -101762]
18353A97918f20704B08266k2814e3415k82740a35012E7907b62158J28811N1912
18343h1435A71830d1075j6837j04097C6700c76295J15472E6495i3465A22827b7592
18331E1174J35588c91701B2639P7434l9920a20155A87000D0284A0909i2404K0235
18320g2169b4738A28349b73362E7947i2481d3038j1468E3548L02321a94634J4641
18309a79993D0729d79499D3655A6520m589P8649J35124d7044l07837J35000l6296
18298b56177J27167m464l7371b0845G9480g2105A45536i2625A14372f4982B18730
18286b58592c5568j97492b6474k27949i7002n8888C18320A19952f2129A3554a81460
18274G4312j4751C125i0968A5643b80792B60931D9827a13162A24641a32104j7265
$$ y = [197918, -620704, 208266, 185452, -53415, -336155, -135012, 57907, -262158, -133347, -81435, 171830, -41075, -57912, -162009, 36700, -376295, -260823, 56495, -93465, 122827, -27592, 51174, 186762, -391701, 22639, 100073, 60153, -120155, 187000, 40284, 10909, -92404, -72169, -24738, 128349, -273362, 57947, -92481, -43038, -54506, 53548, 355869, -194634, -179993, 40729, -479499, 43655, 16520, 11931, 90580, 225704, -47044, -354881, -219881, -256177, -129010, -133474, -170845, -20845, 79480, -72105, 145536, -92625, 114372, -64982, 218730, -258592, -35568, -233060, -26474, -254423, -97002, -155890, 318320, 119952, -62129, 13554, -181460, 74312, 59561, 3125, -90968, 15643, -280792, 260931, 49827, -113162, 124641, -132104, -149369]
18263a49369I5593h6867j55709k85404B8067c36833Q2069e1296k39136J42221
18253a48211A97963A3083c730C0040a05955l09507a40329c7443l28299a67788
18242B47582b94558p7523A32580F960a32197L0438L1332a8287B36282G0735J83903
18231B54638j20326b09920e4324A94111G161c34614J03393I856O287c2634A21315
18219G995a32915a0666r9793A7471O0158f3573D4246R6779o7949a08920A523b82298
18206b43713n7541B01840e7288n852L0518A09494a05780L428F5677a95910Q3587
18195a12323B65796H8661b20642M9590L1634D2382g0343A7911L10613F6515G741
18183a14035j55335A15843L0524c6547C9339J79135b25986f7849A70204b29645
$$ y = [-149369, 95593, -86867, -242576, -527980, 28067, -336833, -254764, -51296, -290432, -148211, 197963, 13083, -3730, 30040, -105955, -415462, -140329, -37443, -365742, -167788, 247582, -294558, -372081, 132580, 6960, -132197, -101759, -70427, -18287, 236282, 70735, 254638, 134312, -209920, -54324, 194111, 7161, -334614, -231221, 9856, 16143, -32634, 121315, 7995, -132915, -10666, -110459, 17471, 77629, -63573, 44246, 141025, 73076, -108920, 1523, -282298, -243713, -301254, 201840, -57288, -63140, -32622, 109494, -105780, -102352, 65677, -195910, -112323, 265796, 88661, -220642, -171052, -139418, 42382, -70343, 17911, 328524, 66515, 7741, -114035, -269370, 115843, 146367, -36547, 39339, 218474, -225986, -67849, 170204, -229645]
18172h3381G2667c581k82174F0760h8850l4549L0225j76721A90346c43379f6933
18160A29971d3886A53278n023A3761a43445k62417d2305B81701L07580d4606j3312
18149e7918B2985a0796C5742c52637h7822j65860c5122o3498r0296P2446m4671
18138a61141K7892r9304l6872a25272G5476b039o6546c3801B85725b5612D1592
18126b08938c6475J4084p0400k80621a58671B87973d8749B22695J23008j64298
18116A81405L065E7308L9627a55876k65296K00250o1750B15760q5355B4820i8040
18104h2710D6068L6516Q898a4678B77051a59126o8505G1549a81283N7914C00367
18092a41317d4389A29960D7969J58389N0369C2113L5510b64126a11286D1383a77118
$$ y = [-83381, 72667, -3581, -285755, 60760, -88850, -123399, -93174, -269895, 190346, -343379, -66933, 129971, -43886, 153278, 148255, 13761, -143445, -405862, -42305, 281701, 589281, -44606, -57918, 22985, -10796, 35742, -352637, -87822, -253682, -35122, -98620, -188916, -116470, -161141, -133249, -232553, -269425, -125272, 75476, -2039, -68585, -33801, 285725, -25612, 41592, -208938, -36475, -22391, -92791, -373412, -158671, 287973, -48749, 222695, 345703, 181405, 184470, 57308, 96935, -155876, -421172, -220922, -282672, 215760, 130405, 24820, -98040, -82710, 46068, 82584, 91482, -14678, 277051, -159126, -227631, 71549, -181283, -123369, 300367, -141317, -44389, 129960, 47969, 206358, 256727, 32113, 67623, -264126, -111286, 41383, -177118]
18080B06485b65082F0720f5329l67346a39239e5843o5276A7859J94646b1204I332
18068b30162A11610a78162A79997C9180b38177A92174l2468O730G8772e4117I691
18056f0899k37824a8032n25l2038B41576J4153K2916F6208K36746J60406A51417
18044a87581j4305n0390K1792A72802M5187r9990C5471c9431B66758A14745Q028
18033A22773K3762C420b93526N8322D9810b6917A31400a70844H6025M9525b23028
18021c6768n1230A17731i8943k48871B0401J81464h2278c9284B5157J38584f5442
18009B12829c27957a23869A7093O3289a32703A5016J80291G5115b8259m2101j52802
17998b23162A84116M1368a58212A16775i3794j01605f0169A74293e3391j3874
$$ y = [206485, -265082, 60720, -65329, -432675, -139239, -55843, -121119, 17859, 212505, -21204, 9332, -230162, 111610, -178162, 179997, 39180, -238177, 192174, 159706, 166436, 78772, -54117, 9691, -60899, -298723, -18032, -18557, -50595, 241576, 255729, 278645, 66208, 302954, 463360, 151417, -187581, -201886, -252276, -230484, 172802, 217989, 117999, 35471, -39431, 266758, 114745, 122773, 146535, 3420, -293526, -235204, 49810, -26917, 131400, -170844, 86025, 135550, -223028, -36768, -87998, 117731, -98943, -347814, 20401, 201865, -82278, -39284, 25157, 163741, -65442, 212829, -327957, -123869, 17093, 80382, -132703, 15016, 195307, 75115, -28259, -70360, -223162, 184116, 225484, -158212, 116775, -93794, -195399, -60169, 174293, -53391, -67265]
17988f7265H2009a78391B17915h8214m17167B8769a73539P9355j03971A47619
17977b20943a1655I6642m266D5511a07075F7976e5910D7186a27722G8221e5151
17965G1130j7723d0532B2962b35265M0854G0943b42865R9231L2626I2510a17752
17953b32987i8833A53994c0861k3563b6713A66492c12738J7255c4710j12929D1758
17941C43520e7448j4868A82429J2914F8675c07496b7751D9987G899J4788b02009
17929a55565J913P1639l89E0649J2750J05640J5176b10832D3315j3845d08362
17917g9422j53288a12735c4903p725G7927i2875m609A18610a77077k34089H0844
17905H7977a46668C67083a89993A20884i7250A01413A7931O4908b41743C0643
$$ y = [-67265, 82009, -178391, 217915, -88214, -505381, 28769, -173539, -94184, -198155, 147619, -220943, -11655, 96642, 92376, 45511, -107075, 67976, -55910, 47186, -127722, 78221, -55151, 71130, 53407, -40532, 22962, -235265, -194411, 70943, -242865, -143634, -111008, 92510, -117752, -232987, -98833, 153994, -30861, -54424, -26713, 166492, -312738, -295483, -34710, -147639, 41758, 343520, -57448, -72316, 182429, 195343, 68675, -307496, -27751, 49987, 7899, 22687, -202009, -155565, -153652, -82013, -82402, 50649, 63399, 169039, 184215, -210832, 43315, 29470, -408362, -79422, -232710, -112735, -34903, -42628, 77927, -92875, -97484, 118610, -177077, -411166, 80844, 87977, -146668, 367083, -189993, 120884, -97250, 101413, 17931, 82839, -241743, 30643]
17894A9156b75505f2690c0847B46418P361A9955c55920J18781b4178k6174j29167
17883a79519L6461B06323a73718p7923h4673c0203J114k57617f6760C41636d16610
17871f7082F6445a57428E0580b62313F5135J9958d3176G6715b05262A63919K9888
17860A93807e32337d6994C696c503p9040b0741B45858l5631e4416n3810p2741
17849a80967E543J69148a55882B22874a48453I2382b71382a17059A32469b9969
17838b07607G6639a27183A80386b37383a18541p0278A04224M5206c05692c6885
17827a69297b4765A61131G6081g8629D8764J24490L1469H5908d8010k6813j84312
17816b59135B8719b46807I7238c69786J84218B32842c8615k22120n6330a03733
$$ y = [19156, -275505, -62690, -30847, 246418, 253779, 19955, -355920, -237139, -24178, -50352, -179519, -143058, 206323, -173718, -251641, -84673, -30203, -29089, -286706, -66760, 341636, -416610, -67082, 66445, -157428, 50580, -262313, 65135, 85093, -43176, 76715, -205262, 163919, 193807, -532337, -46994, 3696, -3503, -82543, -20741, 245858, 210227, -54416, -108226, -180967, 5543, 174691, -155882, 222874, -148453, 92382, -271382, -117059, 132469, -29969, -207607, 76639, -127183, 180386, -237383, -118541, -188819, 104224, 149430, -305692, -36885, -169297, -24765, 161131, 76081, -78629, 48764, 173254, 204723, 85908, -48010, -74823, -259135, 28719, -246807, 97238, -369786, -185568, 232842, -38615, -260735, -317065, -103733]
17805e2154E587J61177P2223A16417c73204B4284Q1515c61132C0126P325a12221
17793C03640D6764b36902A58948K2233g1764E0891a12951B13644j00002i6088
17782C45045a39546p0336a1984B7317N1004b2551A74441a4330o581j61287g9519
17770A6164J06514b55347A31716A542b48380B57026F3793B8932L6705a23560J9030
17759a04530B55887A5279J85892F1252c1997A1256a9335m3359L994m0748C8656
17747C11999G4957a2090G0803d68875H076K39261b62994f6662D4214b4618I8430
17735b27782d8326B02034d4547A21696a52391B9149O9922b929E8038e8588A40299
17723e9339B13247a3920C11300N5254A44500a01951D540J77453o0300f5736K1784
$$ y = [-52154, 5587, 166764, 238987, 116417, -373204, 24284, 105799, -361132, 30126, 37451, -112221, 303640, 46764, -236902, 158948, 181181, -71764, 50891, -112951, 213644, 113642, -96088, 345045, -139546, -209882, -11984, 27317, 78321, -22551, 174441, -14330, -20911, -182198, -79519, 16164, 122678, -255347, 131716, 1542, -248380, 257026, 63793, 28932, 65637, -123560, -104530, 255887, 15279, 201171, 61252, -31997, 11256, -19335, -62694, -58700, -99448, 38656, 311999, 74957, -12090, 70803, -468875, 8076, 247337, -262994, -66662, 44214, -24618, 98430, -227782, -48326, 202034, -44547, 121696, -152391, 29149, 99071, -2929, 58038, -58588, 140299, -59339, 213247, -13920, 311300, 366554, 144500, -101951, 4540, 181993, 121693, -65736, -43952]
17712d3952D2264J78267b75216I7975C8980O9850k7849a24782k7655j4186A66457
17700E6392O8914D7239r836b60065N7934F2165e660F3997O6586J35948h9381G3450
17687i3113j99398g3896o0847q3906A18973D0471f4970D0593K1018B1579e369
17675B92974i2597C5726a75111d8484B0629j01c5052R678D2694a136j62986r9868
17663b63990B36734o3812B4559J84518E8371D964b271n3125b5064A34938J333
17652A36271E929R1010d5563J8245B6884d2400j04163f9191A24658R7043b74636
17640D72556b39051B28378b01048F5959b45691A37754D7791M9338A6585K51755
17630B68340b2600l4749B09226e7261k49267a34633B91325j2058D3268f087A34555
$$ y = [-43952, 42264, 220531, -275216, 97975, 38980, 108830, 80981, -124782, -152437, -166623, 166457, 56392, 125306, 47239, 37403, -260065, -202131, 62165, -5660, 63997, 130583, 266531, -89381, 73450, -93113, -292511, -73896, -134743, -218649, 118973, 40471, -64970, 40593, 61611, 21579, -5369, 292974, -92597, 35726, -175111, -48484, 20629, 20528, -35052, -25374, 42694, -1136, -164122, -263990, 236734, 172922, 24559, 209077, 58371, 4964, -2271, -55396, -25064, 134938, 136271, 5929, 96939, -45563, -27318, 26884, -42400, -146563, -69191, 124658, 221701, -274636, 472556, -239051, 228378, -201048, 65959, -245691, 137754, 47791, 97129, 16585, 268340, -22600, -57349, 209226, -57261, -306528, -134633, 291325, 279267, 43268, -6087, 134555]
17618h797q4379k5837A17213a41966J7607C50707H0427b14058O4732d9142A03780
17606i7213D14805E5153a39114r1783B22576C006h7032j38010C14296J3027A33208
17594b753j30120B09367k6446O7539J42163d19909D9409N8211f0326A281i3269
17582A61850e3399j57354a0636A0298e1212B27509a29548C5417J99592a8240b521
17570b38913B70626a8701k23226C6719b60335e8234A78099b64671P4384O9724
17560a20563j6556B47770n058c5694I4724a53819C87756b4417D7631k2513K98
17549B5416e6485K0398j36660B70506h2064A57369D1416o803e9182E9902a7347
17537B49987K55623f5918A89204G6833b47368C52371a69363H7560a2449j6161
$$ y = [-8797, -93176, -119013, 117213, -141966, -124359, 350707, 80427, -214058, -149326, -49142, 103780, -97213, 414805, 55153, -139114, -230897, 222576, 3006, -87032, -225042, 314296, 327323, 133208, -2753, -132873, 209367, 182921, 250460, 392623, -419909, 49409, 107620, -60326, 1281, -93269, 161850, -53399, -210753, -10636, 10298, -51212, 227509, -129548, 35417, 235009, -18240, -2521, -238913, 270626, -18701, -241927, 36719, -260335, -58234, 178099, -264671, -190287, -120563, -137119, 247770, 242712, -35694, 94724, -153819, 387756, -24417, 47631, 25118, 25416, -56485, -36087, -172747, 270506, -82064, 157369, 41416, 34613, -59182, 59902, -17347, 249987, 505610, -65918, 189204, 76833, -247368, 352371, -169363, 87560, -12449, -28610]
17527b8610a3928B31916L5425o247a5095l6401J3325G3997K16769F5676C1868
17515a7011o5270D97781b59803A94294o3478a54398A50024K5618c46865H748K34942
17504B43690j6737H2582K73867a04461B75351E9593J11130a01469B40177a28256
17493c2094r9128d8134B06305K9646q7202l1215C8005b4749A23548J78964D3420
17481A02154b2642R541D2613K44815G8550J80456p4557K46573A99586k9676J79853
17470C49763j10230Q43L0035K93914a38088G6168J03694K93312B08857k8720l6439
17459A43698a96284A11344L1167J42346C6654M04072k13619K2360d9034C00836
17448D10893A0067L47744j41691J82858A17080K77826o7449p8796h082C22495
$$ y = [-28610, -13928, 231916, 267341, 261094, -15095, -51496, -38171, 73997, 290766, 65676, 31868, -17011, -82281, 497781, -259803, 194294, 130816, -154398, 150024, 175642, -346865, 8748, 243690, 226953, 82582, 356449, -104461, 275351, 59593, 170723, -101469, 240177, -128256, -32094, -131222, -48134, 206305, 235951, 148749, 117534, 38005, -24749, 123548, 302512, 43420, 102154, -22642, -13101, 42613, 287428, 78550, 259006, 184449, 431022, 199586, 169910, 349763, 239533, 240376, 270411, 564325, -138088, 76168, 179862, 473174, 208857, 180137, 143698, -196284, 111344, 142511, 284857, 36654, 440726, 227107, 249467, -49034, 300836, 410893, 10067, 357811, 216120, 398978, 117080, 394906, 327457, 248661, -8082, 322495]
17437c02228B49927P1979R0205A35367Q9681D6377J72718P9456K45234B43544
17426f869B53508J03769H4456k5925J22789M7870E2704J50177J27554m9240J11565
17415C92760l574J64831k38609H9198B381K84407j19090P1212K6907m8411h4507
17403C74644D6801a83724r9895O261A32886K29608j17657J02400j30660b4230
17392H0957c6609C55874I3934J2058j9290C1353J28762d6826K10E02631f181B40759
17379C57358J74555a69734H7685a16677K7106F1585a14399B26101g0413j07468
17369a77881j2039A70740C8928J24524J76504a6457k92384B08056a6916A16323
17358A79107p1131J1464g5464A16140k2049O3207L43844a50912D2253K468N17449
$$ y = [-302228, 249927, 321906, 412111, 135367, 225048, 46377, 219095, 298551, 543785, 243544, -6869, 253508, 357277, 84456, 58531, 181320, 229190, 52704, 202881, 330435, 281195, 392760, 389186, 554017, 315408, 89198, 2381, 286788, 167698, 238910, 265817, 217406, -84507, 374644, 46801, -183724, -283619, -277358, 132886, 362494, 244837, 347237, 216577, -24230, 80957, -36609, 355874, 93934, 105992, 86702, 31353, 160115, -46826, -46616, 502631, -6181, 240759, 357358, 531913, -169734, 87685, -116677, -89571, 61585, -114399, 226101, -70413, -177881, -189920, 170740, 38928, 163452, 339956, -16457, -308841, 208056, -16916, 116323, 179107, 107976, 119440, -75464, 116140, 94091, 157298, 501142, -150912, 42253, 44721, 562170]
17347E62170a46093A25688a45490e486l50448A04491K04090c38596A01856i1709
17336A58589F8126Q7399B5339M22225A14574J86682O270q0100D7754K0726a35661
17324C9501L6715L81357a05279A09060M5610M02794b19695A91459C1188R9511
17314A30699l5861M2100q061B5265J51008K72446o6363b81888a03788A35168o0338
17303G4830J00003C6181K57630a7118B50244i136C8745Q3193K80151G4907J79804
17292B54711n9715L03320C4146L35736e923a964B74791D6782J84998K7296K106
17281B61182l6850F1567j1527M9749k2395a05359B12238A5537J98972B8116Q7036
17270A15152e5357B45121a79844B15043b6342A48191J16257p5592b11117j0905
$$ y = [562170, -146093, 125688, -145490, -5486, -355934, 104491, 308581, -338596, 101856, -91709, 158589, 68126, 155525, 25339, 447564, 114574, 301256, 307526, 227426, 47754, 68480, -135661, 39501, 76216, 457573, -105279, 109060, 154670, 557464, -219695, 191459, 31188, 130699, 94838, 136938, 128877, 25265, 176273, 448719, 382356, -281888, -103788, 135168, 74830, 174833, 36181, 293811, -17118, 250244, -9136, 38745, 121938, 402089, 74907, 254711, 194996, 498316, 34146, 369882, -5923, -1964, 274791, 46782, 231780, 259076, 261182, 224332, 61567, 50040, 99789, 77394, -105359, 212238, 15537, 214509, 28116, 115152, -55357, 245121, -179844, 215043, -26342, 148191, 264448, 188856, -211117, -222022]
17260b22022A53592c08650A21700R7182J6603O9944h9150C71603j61087K38637
17250D49153G4444J41450o6636C1839J08744L92836E2755i8499J9830l7530B642
17238C6449J94470l5627K40076D8782J19727G2405L88486j63028j00903r4415
17228A02545Q900N6709J65077j16287H3274J18505N1765l237c3407b567D45127
17216E5803J82922G3055J36780J52970A35756E3501b07323D85979b2293C14929
17205E17495D5869J42008M5324P4321n6893K32242k08368P9751D1533L89138k15142
17194B15529g1493j3699C59722f2080B43006m2546D39R2613D2038N89532A94217
17182C12558a0153G68700B30655q0217K69808k9141j48627G0507J71175N0227
$$ y = [-222022, 153592, -308650, 121700, 218882, 235485, 305429, -89150, 371603, 210516, 449153, 74444, 215894, 149258, 31839, 140583, 533419, 52755, -98499, -78669, -116199, 2642, 36449, 230919, 195292, 435368, 48782, 168509, 72405, 460891, 297863, 196960, 102545, 111445, 168154, 333231, 216944, 83274, 201779, 253544, 250307, -33407, -2567, 445127, 55803, 238725, 73055, 209835, 362805, 135756, 53501, -207323, 485979, -22293, 314929, 517495, 45869, 187877, 233201, 307522, 250629, 482871, 274503, 354254, 41533, 430671, 215529, -71493, -85192, 359722, -62080, 243006, 200460, 439, 93052, 42038, 631570, 194217, 312558, -10153, 768700, 230655, 150438, 420246, 391105, 242478, 70507, 241682, 291909]
17172B91909m2134o8389E8245K02175K24723j17900p4503J21286m6559r386A18532
17160h491C84125k0877P7358k5721l4977H0964l8802M12030j1250N9086A80447
17148b14136f8532D21427j68454K28782J3210B06862P6413j34948J60021J01896
17138D10244A98116m7499J53198J77222J17925A24066N9105f3606D41453P4318
17128E15771J01285A73000D6571R597L47518j7391J09108A13225K78886I6955
17117D34781A16669J55992O3438k394f2097C9993L32977k153r1761M64281B27121
17105I9730J60870c3467D52321k1179q4727A62664J9819L22820L1947j84188a11973
17093B53591J3877K66906j66828K01651a71422C37854m1828J13302D8329J58015
$$ y = [291909, 249775, 181386, 58245, 260420, 485143, 367243, 292740, 414026, 367467, 358081, 118532, -8491, 384125, 363248, 440606, 414885, 379908, 80964, 42162, 454192, 442942, 502028, 180447, -214136, -68532, 421427, 252973, 481755, 494965, 206862, 283275, 148327, 308348, 410244, 198116, 150617, 303815, 481037, 598962, 124066, 183171, -63606, 441453, 515771, 617056, 173000, 46571, 56168, 403686, 386295, 495403, 113225, 392111, 96955, 434781, 116669, 272661, 336099, 333705, -62097, 39993, 372970, 370817, 279056, 743337, 227121, 99730, 260600, -33467, 452321, 431142, 346415, 162664, 182483, 505303, 537250, 353062, -111973, 253591, 267468, 534374, 367546, 569197, -171422, 337854, 296026, 409328, 48329, 206344]
17083B06344K39576j49843J67131J44304k83422k6124k973K3510J69582P2305
17073E60390k22522j51515L92714j070J7430j61731A16474K75866j9179L95587
17063G68748k21828r2715M7618r6037j89651L40580j49138q6617L42743k41793
17053D21910j6529J5793m1779q0154K41602B15308L60433B83669K69012k9488
17043E23193j95118Q1150Q7867N7154J77186k72804j87249M43188k42283K72666
17033G44950r5604B90902M24383B69882N17923j17848l20095J70773A46842M34035
17023E80877j07777j58129M34267k48494P878K8786j24254L08679A82951O17523
17013H00474k68388M1544P5921J0475P0415j33821k26631J09539r0559L55029
$$ y = [206344, 445920, 296077, 463208, 607512, 324090, 297966, 294993, 318503, 488085, 560390, 337868, 186353, 579067, 577997, 595427, 433696, 116474, 392340, 373161, 768748, 546920, 454205, 501823, 405786, 216135, 556715, 407577, 320960, 663703, 421910, 405381, 421174, 379395, 299241, 540843, 215308, 575741, 283669, 552681, 523193, 328075, 409225, 497092, 554246, 731432, 458628, 271379, 714567, 472284, 744950, 649346, 290902, 715285, 269882, 787805, 669957, 349862, 520635, 146842, 580877, 473100, 314971, 749238, 500744, 508622, 537408, 413154, 721833, 182951, 800474, 532086, 573630, 649551, 660026, 730441, 596620, 369989, 479528, 388969, 743998]
17003G43998k52447J62995j73411M0334L1983p5372j64872K74957K86680p1880
16993H02965J2094j28035j73796J96007k07556J51556J73906k365q8613j10370
16983F25793R9613K51418k20652j01069J11326K30589l30209K36716q339l54369
16973E40817K43528j75304O5751J33070j22011K82287D81549M79534D29664K79111
16963G08775L46261j04275l53323J01269J57210n9409K20964J26151l15942O896
16953H34577K46785k59073L34064o9378j4832l73264K82467j37281k1694R5136
16943I17507j64799J79947L54679j22225K08847l58846r4220L54155j32896R3178
16933A235327j45134Q7196l443J65675J45274l78475k41002K37724j2277N0663
$$ y = [743998, 491551, 654546, 481135, 521469, 553452, 478080, 313208, 588165, 874845, 802965, 815059, 687024, 513228, 709235, 501679, 653235, 827141, 824776, 736163, 625793, 725406, 976824, 756172, 655103, 766429, 997018, 666809, 903525, 895186, 540817, 784345, 609041, 674792, 807862, 685851, 968138, 481549, 961083, 429664, 708775, 1055036, 950761, 597438, 698707, 855917, 796508, 1017472, 1143623, 827681, 834577, 1081362, 822289, 1156353, 1086975, 1072143, 698879, 981346, 844065, 822371, 917507, 752708, 932655, 1287334, 1165109, 1373956, 1015110, 920890, 1275045, 1142149, 1235327, 1090193, 1177389, 1173946, 1339621, 1484895, 1106420, 865418, 1103142, 1090865, 1141528]
16923A141528N04853n94834J31319L59975j11706l08076K81205p6222j08706P0870
16913A290206K45925j18866j17900J5482J50209k41469L31606l6366J17966j22790
16903A514003j35335o5617K45922K05212j85192K08159k38061Q1450P7612l8085
16893A670068J2835j5788K30156l19294J19564j05939M5064L08447j64838j16621
16883A663654N33297m42140M62326m8810J78601P0090m74646k74884M23302j13237
16873A977553J17861m28956M73572M28155k91801j3726j60738K65616j22382m2764
16863B202390J04826K06572j51288j20644L46270J33187k75273L31550j81502
16854B596088K07426n5691R5847J17456K5126n3402k5562K48805j74059L46412
$$ y = [1141528, 1646381, 1051547, 1182866, 1542841, 1431135, 1123059, 1404264, 1328042, 1219336, 1290206, 1536131, 1417265, 1299365, 1314847, 1465056, 1223587, 1555193, 1518827, 1636793, 1514003, 1378668, 1313051, 1558973, 1764185, 1578993, 1787152, 1549091, 1630541, 1708153, 1670068, 1682903, 1667115, 1897271, 1577977, 1697541, 1591602, 1636666, 1945113, 1780275, 1663654, 2196951, 1754811, 2217137, 2168327, 2346928, 2417018, 1942372, 1667488, 2090790, 1977553, 2095414, 1666458, 2140030, 2568185, 2276384, 2262658, 2101920, 2367536, 2245154, 2202390, 2307216, 2513788, 2362500, 2241856, 2588126, 2721313, 2446040, 2777590, 2596088, 2803514, 2747823, 2843670, 2961126, 2986252, 2932850, 2907288, 3156093, 2982034, 3328446]
16844C328446M12562m45087J34179k82755j14209N41403j94887K67482k54040
16835C393094L53560J37957K1241j97188L21836j9200r184J64111R7373P5285
16825D338885j29220P3840K13797K45313l5627K42688j42940K40742m72032L60883
16815D936329J80243M22659J03205j35465N95946q0954O0108O1923J86793q229
16805F322558N1514J91170K77971K47381J24042N15460l83446M92581K27300j7587
16795H048944K96885j93340N10381L09486K17326N22465n2403K12933K37187M5566
16785A0155430O15694L03486J25524J058876m0004N6717M83758L56901O22477
16776A3738859K40245J63754P59579O07342M09678N72342P17530L82851N54953
$$ y = [3328446, 3741008, 3295921, 3430100, 3147345, 3033136, 3574539, 3379652, 3647134, 3393094, 3746654, 3884611, 3905852, 3708664, 4030500, 4011300, 4002116, 4166227, 4263600, 4338885, 4209665, 4283505, 4497302, 4742615, 4706988, 4949676, 4806736, 5047478, 4575446, 4936329, 5116572, 5539231, 5642436, 5506971, 6102917, 6021963, 6082071, 6143994, 6330787, 6322558, 6374072, 6565242, 6843213, 7090594, 7214636, 7730096, 7346650, 7839231, 8066531, 8048944, 8345829, 8152489, 8662870, 8972356, 9189682, 9712147, 9659744, 9872677, 10109864, 10155430, 10771124, 11074610, 11200134, 12259010, 12219006, 12275723, 12759481, 13116382, 13738859, 13979104, 14142858, 14902437, 15509779, 15919457, 16491799, 17209329, 17592180, 18147133]
16767A8147133P94670M15677R59498R60374O76883Q36214Q98540Q11513J276190
16758B5776692J146895Q88668J354489J134830J271373J358178J575330J722128
16750C6228583K114465J756523K138150K147857K479424K269933K587249K810122
16742E4532306L312402L393791M006211L385695M316873M368448M876128N226957
16734H7418811N792733O241985O375417O577915P380820P826207Q296288Q240939
16726A44151115Q880831Q728226R215962Q527786Q519394P676051P070932N397076
16718B08167373M599233K651113J067971q09267k098347l705877n486631o628505
16710A97757063p416238q458430q589668q876615r338918q483136r126795q715042
$$ y = [18147133, 18941803, 19357480, 20316978, 21277352, 21954235, 22790449, 23688989, 24500502, 25776692, 26923587, 27812255, 29166744, 30301574, 31572947, 32931125, 34506455, 36228583, 38343048, 40099571, 42237721, 44385578, 46865002, 49134935, 51722184, 54532306, 57844708, 61238499, 65244710, 68630405, 72947278, 77315726, 82191854, 87418811, 93211544, 99453529, 105828946, 112406861, 119787681, 127613888, 135910176, 144151115, 153031946, 161760172, 170976134, 179503920, 188023314, 195699365, 202770297, 208167373, 212766606, 215417719, 216485690, 215676423, 213578076, 209872199, 204385568, 197757063, 190340825, 181882395, 173292727, 164416112, 155077194, 146594058, 137467263, 128752221]
16702A28752221p731195p914633p534298o061524o768619n551831n742340m983746
16694G6464035m718860m222390m096270l974203l069424l091726l310928k672181
16686D7308053k194078k309347k763004j805582j836457k077685j018902j393155
16678C1909843j526104j861500r85109j307300j019471j108759r34405q10015
16670B2357180j001060q15799r83089p70197r31409k67334o17441l94144r23434
16661A5653273o9220r76757m27951p49612k9389n81569j52835n63308o09199K16695
16651A1710128q54051k79973q0129n89721k12300k67044n24977r458N7p0697l58432
16640H463403j077253M31759O8927m41196k85863j8901l04752j11939j86866j35626
$$ y = [128752221, 121021026, 113106393, 105572095, 99510571, 92741952, 87190121, 81447781, 76464035, 71745175, 67522785, 63426515, 59452312, 56382888, 53291162, 49980234, 47308053, 45113975, 42804628, 40041624, 38236042, 36399585, 34321900, 33302998, 31909843, 30383739, 28522239, 27537130, 26229830, 25210359, 24101600, 23167195, 22357180, 21356120, 20540321, 19557232, 18787035, 17855626, 17588292, 16970851, 16576707, 15653273, 15584053, 14607296, 14179345, 13429733, 13400344, 12818775, 12665940, 12102632, 11493433, 11710128, 10856077, 10576104, 10495975, 9906254, 9693954, 9426910, 8901933, 8892475, 8892532, 8821835, 8463403, 7386150, 7817909, 7886836, 7445640, 7159777, 7140876, 6836124, 6724185, 6537319, 6401693]
16630F401693q2101m07922J45022j50697j82416j2024l95966j17397R2550k66953
16620E023789k97901K67082l6915K04103n20054j17348j60262j35642O0113p272
16610D279693j45563j6953l93680K14371j66755k01881j01960K601L7857l1852
16600C475878J0419l78444m0448J79399J09985k98100n4663J10365l35704J82037
16590B960724j4290j97358K6017j90878k7166K35459j50722q5673p8147n8918
16580B419048m00026K30755L6520J61453k92833J31832J37959k29655r8305k39909
16570A856839J75525k0585k79412L3692K46680j66046j29935Q0560J94920l13284
16560A678954J66340j02707N9803K07884o91454K14343K24172q7954J0032j75662
$$ y = [6401693, 6319592, 5911670, 6056692, 5905995, 5723579, 5711555, 5315589, 5198192, 5290742, 5023789, 4725888, 4992970, 4956055, 5160158, 4640104, 4522756, 4362494, 4226852, 4286965, 4279693, 4134130, 4117177, 3723497, 3937868, 3771113, 3569232, 3467272, 3469873, 3507730, 3475878, 3486297, 3107853, 3067405, 3246804, 3356789, 3058689, 3004026, 3114391, 2778687, 2960724, 2946434, 2749076, 2775093, 2584215, 2557049, 2792508, 2641786, 2556113, 2477966, 2419048, 2019022, 2249777, 2286297, 2447750, 2154917, 2286749, 2424708, 2195053, 2096748, 1856839, 2032364, 2011779, 1732367, 1766059, 2012739, 1846693, 1716758, 1797318, 1992238, 1678954, 1845294, 1742587, 1802390, 2010274, 1318820, 1533163, 1757335, 1669381, 1679413, 1503751]
16550A503751N0768l0247j23007K63121j63520l9358m1352J29454j45999K50242
16540A653853m78992l0263K84119j62854J4909q7663Q4452k00191K18192J89183
16530A484745n78583M96443m99011K81805J38796k56053N79855k45031o35263
16521G67703N64648j60606J32577k49818j12768N3224m5737r359k23026M55924
16511A172762r3437j86057J69168j03814k0007L7505l64997J43316k4606J90246
16501I20079q9819j22515J01748n4434L38784q5886J12193l58996M11239m22013
16491G50380R1175l70489M42630P8706m46516l52q7173R5452M47736J00030j95656
16480I05923j21776r9578K74299j10781P3856P6754l85992K82966j97214q585
$$ y = [1503751, 1554519, 1524272, 1401265, 1664386, 1500866, 1461508, 1420156, 1549610, 1403611, 1653853, 1174861, 1144598, 1428717, 1265863, 1280772, 1193109, 1277561, 1077370, 1295562, 1484745, 906162, 1402605, 903594, 1185399, 1324195, 1068142, 1647997, 1402966, 767703, 1332351, 1171745, 1304322, 1054504, 941736, 994960, 949223, 939864, 716838, 1172762, 1079325, 893268, 1062436, 958622, 938615, 976120, 611123, 754439, 729833, 920079, 830260, 707745, 809493, 755059, 1093843, 1007957, 1120150, 761154, 1172393, 750380, 841555, 471066, 913696, 992402, 545886, 545534, 458361, 553813, 1001549, 1101579, 905923, 784147, 684569, 958868, 848087, 921943, 998697, 612705, 895671, 698457, 689872]
16470F89872B78814K04819M83343m06818j17751J63564J29812C14065M0696j60512
16460A94249O16470k74428m174Q7412K46326l07004J19305J2647l26590J47087
16450E11300o5425K07971j22485P4601l966j88141K7505J26921k61442n916M74397
16439G75320k97610B20069k3503L43147q0128k14852J5906L9193K69404A6091
16428E87932B73819L83695l17146K77735j66260J42958j17165R2963j52863M63966
16418H81702k87178p5128J1183A45557K01032M35596l86641L25710l11357J00425
16408E10322q7699p0262J11614J25966k30879K9040n8067J16661E4348M39500
16398D93848L53519k96809O2965l9509A90076O0183p3655M24712g3469D30216
$$ y = [689872, 278814, 483633, 966976, 560158, 442407, 605971, 735783, 314065, 354761, 194249, 810719, 536291, 532117, 619529, 865855, 558851, 678156, 690803, 364213, 511300, 445875, 653846, 531361, 605962, 601996, 413855, 441360, 568281, 306839, 300923, 775320, 477710, 220069, 196566, 539713, 459585, 244733, 260639, 299832, 569236, 16091, 587932, 273819, 657514, 340368, 618103, 451843, 594801, 477636, 570599, 417736, 881702, 594524, 519396, 530579, 145557, 346589, 782185, 395544, 721254, 409897, 510322, 422623, 352361, 463975, 589941, 359062, 388102, 330035, 446696, 54348, 493848, 847367, 550558, 613523, 574014, 190076, 250259, 176604, 601316, -73469, 430216]
16387D05425j52214R8082m6840M19659K2305B46212j14574L53732P86j66604J5376
16376C34928J65389B46209J61192L59736C03427R3838a6627B61719r4161n9224
16366A08334J15384R3047j29846J29086J54326A61450K0879J92729A14669K70483
16356C85152a49295A91869M5393l6941E9007J19562L9329F3061L39197a9338B70536
16344F23430n0675k35794l7845j08243Q0681M4370q6792J09974A14415a31406
16333A97069R1315A25868K12125p1840J22217j85590p1597K3228l1597K76459
16323C99273F5624a03986C23639e3660B67331D4209J52106n6862J73079G4489
16312D27361A69758J32142j15481N7099K44196j68299E7487R7774L36011E2962
$$ y = [405425, 253211, 351293, 304453, 724112, 746417, 246212, 131638, 485370, 486156, 319552, 334928, 500317, 246209, 407401, 767137, 303427, 397265, -16627, 261719, 167558, 108334, 223718, 316765, 186919, 316005, 470331, 161450, 182329, 375058, 114669, 385152, -149295, 191869, 237262, 200321, 59007, 178569, 217898, 63061, 402258, -19338, 270536, 623430, 572755, 336961, 299116, 190873, 271554, 315924, 229132, 339106, 114415, -131406, 197069, 288384, 125868, 337993, 266153, 388370, 202780, 131183, 154411, 122814, 399273, 65624, -103986, 323639, -53660, 267331, 44209, 196315, 139453, 312532, 74489, 427361, 169758, 301900, 186419, 243518, 487714, 319415, 57487, 155261, 491272, 52962]
16301B80453Q7551Q5632j63732n4781Q0612A52129P1902E4169M75321j87003K05754
16290E48241i1540D11780O7640L232j67233h7114A59685K33181J3189j92003n8602
16279A55450J26641K6139k5056a0106I3492K78582j16314B9691J30547K34383
16269C94621C3635a09659A03540L60563j32513J3028j13964a45410a129A77903
16258A42552J85860C2139c49704D2808f317C66280R7593k08155p72B8006K05301
16247B33307J95989f5683F1188R0155i1631L5494A63676B7522J28772e9048C3358
16235C53524j63660A9460J22776K22325j75047j2029J19430o7116G1692K17889
16225B89581J9703E3910R2219b5007C8261O5217h0454b6008B42089g0404B75519
$$ y = [280453, 368004, 453636, 289904, 235123, 315735, 152129, 224031, 54169, 529490, 342487, 548241, -91540, 411780, 479420, 482652, 315419, -87114, 159685, 392866, 406055, 214052, 155450, 282091, 308230, 283174, -10106, 93492, 372074, 255760, 29691, 160238, 394621, 33635, -109659, 103540, 464103, 331590, 344618, 230654, -145410, -1129, 177903, 142552, 328412, 32139, -349704, 42808, -6317, 366280, 463873, 255718, 254946, 28006, 233307, 429296, -65683, 61188, 151343, -91631, -56137, 163676, 27522, 156294, -59048, 33358, 353524, 189864, 19460, 142236, 364561, 189514, 177485, 296915, 229799, 71692, 289581, 309284, 53910, 146129, -25007, 38261, 103478, -80454, -26008, 242089, -70404, 275519]
16213D85586k10875C4739J85526a26500C0000a41680r052C00760G3313N1039K0341
16202A44693H585N04865a343A78949J00069m7383L13564k68102d4100C01260c2463
16190e7234j71778J10410A7523b41493C24477j31201d10782A80115i9506B70837
16179C0792a6527j3520k80382d3148A28046k7975K68820a6786A09908L05035k84
16168D14659a55331d5043m43890I7753b6818H1107a5541I7963O0077a47833D8506
16156B93206J10590D6513R568c9662j9303F9880J72491j00350A8498L46524A14846
16144B49141a8110k31978a03059k5581c5446j29343H2325a36108K7770A9771b43129
16132A74948C3783n556M5308O1089R7775i1277B12008C2303N39485A96904b19560
$$ y = [485586, 274711, 34739, 220265, -126500, 30000, -141680, -150732, 300760, 73313, 124352, 144693, 8585, 513450, -1343, 178949, 279018, 231635, 545199, 277097, -44100, 301260, -32463, -57234, -229012, -118602, 17523, -241493, 324477, 193276, -410782, 180115, -99506, 270837, 30792, -16527, -30047, -310429, -43148, 128046, 100071, 368891, -16786, 109908, 414943, 414659, -155331, -45043, -488933, 97753, -26818, 81107, -15541, 97963, 158040, -147833, 48506, 293206, 403796, 46513, 56081, -39662, -58965, 69880, 242371, 142021, 18498, 365022, 114846, 249141, -18110, -250088, -103059, -128640, -35446, -164789, 82325, -136108, -108338, 19771, -243129, 174948, 33783, 28227, 73535, 134624, 232399, -91277, 212008, 32303, 571788, 196904, -219560]
16120E6148d31566a43870B39870a02585A2067J61852a75247f2060J2306B43101
16109A26185L1355e5541E9749A6925L086J22105m8935K30372p3524M3920K04305
16098D98254H4938b24053F0949b57186e0785A32782k4734b18034A84444a11105
16087A1381b85212d5904K749j25464F218K88379C0114e4102a8745j4910A28234
16075b16345A32991a7896A12570d01088A64780a54758f9057D5074a2631j4686
16065b7317A49266F587K5912a86307r646G7692N632a65087D0215g998j45579G2588
16052a18644D3473b13390A85487L815c23551c0350j54863A09290a44384f5380
16041B3241a8930A9175c65970f5369p0956e5409q6859C6277e1205m1404j65870
$$ y = [56148, -431566, -143870, 239870, -102585, 12067, 173919, -175247, -62060, -49754, 243101, 126185, 157540, -55541, 59749, 16925, 20011, 142116, 93181, 323553, 250029, 293949, 498254, 84938, -224053, 60949, -257186, -50785, 132782, 108048, -218034, 184444, -111105, 11381, -285212, -45904, -43155, -168619, 6218, 294597, 30114, -54102, -18745, -33655, 128234, -216345, 132991, -17896, 112570, -401088, 164780, -154758, -69057, 45074, -12631, -27317, 149266, 6587, 32499, -186307, -195953, 77692, 83324, -165087, 40215, -7998, -153577, 72588, -118644, 43473, -213390, 185487, 189302, -323551, -30350, -185213, 109290, -144384, -65380, 23241, -18930, 19175, -365970, -65369, -136325, -55409, -142268, 36277, -51205, -92609, -258479]
16030b58479A11854Q1490B7192h75j36377j17624I6989c8981H4790i4086k06534
16019c00620M688g6696j2693F9071J55098c06135a11636E0454K23286F4300J6583
16008H0883a12733k0978A99769c5786A07721D4758M74170A8304g2167D03807f358
15996a2891o3408C01038a17169C8135O1140L5208h2047J4725A59239K83496j28314
15985C14421a54776B30129C5214K25909J26949J82130A17100K22529j0639d6798
15974A94568h9484j285A3149c27581B5538J75792a1107j5208p5416A09574k5751
15963H3823b49971A37130Q5419e7332C85519a28060B18174g4373J1204D9123D54
15951a21093D62515b06097g0073j02810K5583h869D062J58078d31024B9615R3793
$$ y = [-258479, 111854, 193344, 27192, -875, -137252, -254876, 96989, -38981, 84790, -94086, -300620, -295932, -76696, -89389, 69071, 224169, -306135, -111636, 50454, 273740, 64300, 80883, -112733, -133711, 199769, -35786, 107721, 44758, 518928, 18304, -72167, 403807, -6358, -12891, -76299, 301038, -117169, 38135, 99275, 134483, -82047, -67322, 159239, 442735, 314421, -154776, 230129, 35214, 261123, 388072, 570202, 117100, 339629, 328990, -46798, 194568, -89484, -90769, 13149, -327581, 25538, 201330, -11107, -26315, -101731, 109574, 83823, -249971, 137130, 222549, -57332, 385519, -128060, 218174, -74373, -63169, 49123, 454, -121093, 462515, -206097, -70073, -172883, -147300, -8869, 4062, 162140, -431024, 29615, 123408]
15940A23408f4847b4408o3074B4565a7063k81246a01048j65244A20686l1906b57462
15928B32697p0108a44074k66387B32255n4098F9319g3579k3720r5007M9847D2172
15916C63249a90863e7571j07542C7472A6219a41107k4588B7794c60784a33977
15905d28056B0976b33952C20460A19760k775b1072F0540J34946b49727N3282B21013
15893a62926M3414o7689I0512a09360B82036B8793F251J13938B7137b50960B0608
15881A66023d7089o2350B94564b03998P7107K4526j52329c5889k8061r1422B70948
15869G5251c82946e6039k30283K3213A78112G6415a1724j49161d6934j66436d4844
15857a47325M1066A30854E5594J55683a18093l5074j11336E362a87999L1292M0351
$$ y = [123408, -64847, -24408, -87482, 24565, -17063, -298309, -101048, -266292, 120686, 88780, -257462, 232697, 162589, -144074, -410461, 232255, 178157, 69319, -73579, -97299, -192306, -142459, 42172, 363249, -190863, -57571, -165113, 37472, 16219, -141107, -165695, 27794, -360784, -133977, -428056, 20976, -233952, 320460, 119760, 116985, -21072, 60540, 195486, -249727, -196445, 221013, -162926, -119512, -187201, 90512, -109360, 282036, 28793, 6251, 120189, 27137, -250960, 20608, 166023, -47089, -109439, 294564, -203998, -126891, -102365, -254694, -35889, -63950, -155372, 270948, 75251, -382946, -56039, -286322, -263109, 178112, 76415, -11724, -160885, -46934, -213370, -44844, -147325, -106259, 130854, 55594, 211277, -118093, -153167, -264503, 5362, -187999, -156707, -116356]
15846a16356l7266l3570B18553J70716b63722C1706J94595F8462a66675H9762
15835A37381J78336b13895B14870b92282h9647E247a65583k2041K6798B14724
15824A77249B7371c17363c7414B6577d86506K04262B73590q0227a38271G6613
15813A61663J2687b02718A10989i1592H8441a54999A21928J43886a23845r7103
15803b20948I8539a83309B29743m2284G5031j3260d9285E457O8973a97190k8927
15792b26117a03217B63643G625P6079a0300B56308e554A8885N7256N6743h813
15780b7853A6073K21935a52255m7360b4781l9008j1029a0374k49883G9326A301
15768b83561h7879A1602a49821A80466p0086g3365k6276d8994l366A29602O8615
$$ y = [-116356, -153622, -187192, 218553, 389269, -263722, 31706, 226301, 68462, -166675, 89762, 137381, 315717, -213895, 214870, -292282, -89647, 5247, -165583, -187624, -160826, 214724, 177249, 27371, -317363, -37414, 26577, -486506, -282244, 273590, 193363, -138271, 76613, 161663, 174350, -202718, 110989, -91592, 88441, -154999, 121928, 265814, -123845, -220948, 98539, -183309, 229743, 187459, 75031, 61771, -49285, 5457, 74430, -197190, -226117, -103217, 263643, 7625, 83704, -10300, 256308, -5554, 18885, 76141, 132884, -8813, -27853, 16073, 238008, -152255, -199615, -24781, -63789, -74818, -10374, -260257, 79326, 1301, -283561, -87879, 11602, -149821, 180466, 110380, -73365, -99641, -48994, -52360, 129602, 198217]
15757A98217F756d94177B90351g643F4142J50751a72378L2501B68886a79056J0119
15746a68937L8003C06206A44925g8835L1275H9605a02308A09590h6488j54441
15736b40929d6713C084f5462B4825q568c6102k34096A15430j4703J7402E5589
15724f0206A28566n1714b19201E5878a43918k9542j79699A34273N1704c7365j00669
15713a38034C9040K20252E3407J0457d2838j64722j21205A69221b78813h8450
15702a54983k2624D6225a26512e9262j84335J16161q4369e3418k18415D0531d13034
15690C69907a08061M3205q3976I2693a87734j42853h4943q0998j75813D9877i1817
15678e53899b10701Q6514N2866n7439l23253a62380j57802L8881f7419j47833
$$ y = [198217, 6756, -494177, 290351, -7643, 64142, 214893, -172378, -139877, 268886, -179056, -168937, -130934, 306206, 144925, -78835, -47560, 89605, -102308, 109590, -86488, -240929, -46713, 3084, -65462, 24825, 16257, -36102, -270198, 115430, 100727, 118129, 55589, -60206, 128566, 76852, -219201, 55878, -143918, -173460, -353159, 134273, 185977, -37365, -138034, 39040, 259292, 53407, 63864, -42838, -207560, -328765, 169221, -278813, -88450, -154983, -177607, 46225, -126512, -59262, -243597, -127436, -211805, -53418, -271833, 40531, -413034, 369907, -108061, -64856, -148832, 92693, -187734, -330587, -84943, -165941, -341754, 49877, -91817, -553899, -210701, -124187, -71321, -128760, -452013, -162380, -320182, -281301, -67419, -215252]
15668b15252F1775K95392a9002B47945a52452j04372I530R1975C1175p08a75485
15656A05068b43737A51383E9259g7199k03105i6023C008L8537N4605a35006j15969
15645b50975h8113b9340k29277C7496a13463d7100j9191A28986a92002B98803
15634a3208A64536j0911a69170A5574K66745c2717A61004a4230d779l4390n0686
15623h9855l50538B2854e4108E6646B0382P4487J28309J6815d4026j66171A04507
15611i2807E2687f7194A78962c57617A83227B9094a56450M2204b0713j70940B46652
15599a39437p5944O3937H6260l1551a10441o2912m2377j52861A56091B2241K4377
15588D6618c1707j57982j12967d7772B35782F934O6746P3443a5533G6562f9926
$$ y = [-215252, 61775, 357167, -19002, 247945, -152452, -256824, 9530, 101505, 31175, 30467, -175485, 105068, -243737, 151383, 59259, -77199, -280304, -96023, 3008, 41545, 96150, -135006, -250975, -88113, -29340, -258617, 37496, -113463, -47100, -66291, 128986, -192002, 298803, -13208, 164536, 153625, -169170, 15574, 282319, -32717, 161004, -14230, -4779, -39169, -89855, -440393, 22854, -54108, 56646, 20382, 94869, 223178, 239993, -44026, -210197, 104507, -92807, 52687, -67194, 178962, -357617, 183227, 29094, -156450, -114246, -20713, -191653, 246652, -139437, -215381, -151444, 86260, 54709, -110441, -173353, -215730, -368591, 156091, 22241, 46618, -31707, -189689, -302656, -47772, 235782, 6934, 73680, 147123, -15533, 76562, -69926]
15576A94478a95581D4333d3818j61632N4920k53489h6967j90996A99080B1556
15565c88408J62867a07883N887H4493M541J35732g1233I8261b35506C5698K06478
15554B42176f1639C2189a40577A47776n6330K7185a38672j02482L6818P4826F4115
15542B53047n1489d2795C59161A52175a3963A74083c20665h3445I5860b20713
15531g9483K8459E9687a81873B60059g2415F2824O7089a93713i1539L7901J8449
15520c5189o0574p4379C44519G1521a46271A26190c1736A41523J74199b93612
15509A78073f7936B72945b27428G1120H419L57367a08715E6673R4866a29584H5050
15497f3715I7777C062g3998A70434B1258b09519h131k4199r5253D7357K00320
$$ y = [194478, -195581, 44333, -43818, -205450, -150530, -404019, -86967, -277963, 199080, 21556, -388408, -225541, -107883, -101996, 84493, 89034, 224766, -71233, 98261, -235506, 35698, 242176, -61639, 32189, -140577, 147776, 91446, 118631, -138672, -241154, -204336, -129510, 64115, 253047, 201558, -42795, 359161, 152175, -13963, 174083, -320665, -83445, 95860, -220713, -79483, -51024, 59687, -181873, 260059, -72415, 62824, 129913, -193713, -91539, -53638, -35189, -95763, -170142, 344519, 71521, -146271, 126190, -31736, 141523, 315722, -293612, 178073, -67936, 272945, -227428, 71120, 8419, 365786, -108715, 56673, 151539, -129584, 85050, -63715, 97777, 3062, -73998, 170434, 21258, -209519, -8131, -32330, -127583, 47357, 247677]
15486B47677j4319h765c997q6422c070k36222B4278g5452A3429M320K2305R4658
15474A34712B4252a35570e9609m1846A24900f3452D623J81846D0916N5594C1442
15462B79935g5989j08033P99h5296d1570A36096n6162l1350K91518r4424I9938
15450h8851a2921B380L2041L8489b2418j71873h0344l8738E9502b9411p7451A88876
15437A12996i190n5613m0257l1920B06533h7824k65520A44131J0562b6193p0655
15426i6848l1386H5811c14476f1343E1013J19907b05091F1786N6542a64014B04251
15414i179k7807j62840g6616G1604c0275B96295E1577R4857o7881d8743j86077
15403b34820A15420J40602I9341c22920A32684a11348F4802p338a61736A31513
$$ y = [247677, 233358, -8765, -3997, -90419, -3070, -239292, 24278, -75452, 13429, 17749, 40054, 134712, 24252, -135570, -59609, -101455, 124900, -63452, 4623, 186469, 40916, 96510, 31442, 279935, -75989, -184022, -183223, -85296, -41570, 136096, 79934, 48584, 340102, 245678, 99938, -88851, -12921, 2380, 34421, 72910, -22418, -194291, -80344, -119082, 59502, -29411, -106862, 188876, 112996, -9190, -64803, -105060, -136980, 206533, -87824, -353344, 144131, 154693, -26193, -96848, -128234, 85811, -314476, -61343, 51013, 170920, -205091, 61786, 118328, -164014, 204251, -9179, -36986, -199826, -76616, 71604, -30275, 296295, 51577, 146434, 78553, -48743, -234820, 115420, 256022, 99341, -322920, 132684, -111348, 64802, 57464, -161736, 131513]
15392a72115H7396g1697k16567A63764h8744M963j37663A5610P1867b144j35364
15381a37508E8920h2885m8752H2304a11298C90327e18791B25602f0052H5800k4890
15370F0910K40576b4906j61023H9974K91953H9746a51200B92283f5879l8114A65407
15358A05972b27972a4593j31351i865q2711j16346f6290E6895g296D28332b30233
15346a84729A31616a50929A84124b77927a35752j00287D97378c69211c9983C24441
15335A58306o1293C6264j2030K40071A04721b38204i2686B01133c1659A10844
15324A01597e6852a8788n7848L5199l9757C38810I1998e0807B4798O5761R6279
15313A86838a45656N6418H8057b00249A98855E8913L14513D719a78030B1269K84636
$$ y = [-172115, 87396, -71697, -288264, 163764, -88744, -83781, -221444, 15610, 87477, -2144, -137508, 58920, -82885, -131637, 82304, -111298, 390327, -518791, 225602, -60052, 85800, 60910, 301486, -24906, -185929, 89974, 381927, 89746, -151200, 292283, -65879, -103993, 165407, 105972, -227972, -14593, -145944, -9865, -92576, -208922, -66290, 56895, -7296, 428332, -230233, -184729, 131616, -150929, 184124, -277927, -135752, -236039, 497378, -369211, -39983, 324441, 158306, 97013, 36264, 24234, 264305, 104721, -238204, -92686, 201133, -31659, 110844, 101597, -56852, -18788, -76636, -41437, -81194, 338810, 91998, -50807, 24798, 90559, 186838, -145656, -89238, 88057, -200249, 198855, 58913, 373426, 4719, -178030, 21269, 305905]
15302C05905j16783f3334F1581P2408a86859c9197A71870J414E384L2693b1778
15290e0430l6863j03191F2439A2639L8122f2291j2702A51294Q2634f3078K7244
15279c5834k9943I7854J37220A17390O4164a310B34191a13159B80678n530A33259
15267B01486G9382A334M3332J33966D8345a3581j67296h6942C13487f3547j54251
15256b17798C6206J2977j3262K26647M1265J1636H6377N62477J13781J68071J733102
15245B663808j004046K41898K80800H59657l49398c4465H2873J22815a36163D2919
15234A56171C0431J10014E1603a02686A06485m7620K91852C1362L61813g0803
15223B54131A25923J9845M1827i3844D3563J05421j681b52775A19452a32598A88177
$$ y = [305905, 189122, -63334, 61581, 133989, -186859, -39197, 171870, 173284, 5384, 38077, -21778, -50430, -87293, -190484, 62439, 12639, 50761, -62291, -74993, 151294, 233928, -63078, -35834, -65777, 97854, 235074, 117390, 181554, -1310, 234191, -113159, 280678, 275148, 133259, 201486, 79382, 1334, 44666, 178632, 48345, -13581, -180877, -86942, 313487, -63547, -217798, 36206, 49183, 35921, 262568, 303833, 315469, 86377, 648854, 762635, 930706, 2663808, 1659762, 1901660, 2182460, 859657, 510259, -34465, 82873, 205688, -136163, 42919, 156171, 30431, 140445, 51603, -102686, 106485, 58865, 350717, 31362, 393175, -70803, 254131, 125923, 145768, 187595, -93844, 43563, 148984, 147303, -252775, 119452, -132598, 188177]
15211A21589K1616K41342A36440K9663E6307N3999a62397N8955A80754c15136
15200i6118G9994J02417H0533N2578J3484A7769h4394k2352A82919J96911i8765
15188H4001g6890C4496j0229K15589F8736b3427j05558L8702A97985J14257j02030
15177B10212M2695p0700J03880a06154I9794k5994K10057a33291A74096R8765
15167B72861M9169m0862j29014C9391i012A1100L44880I0490P7685j7359j2984
15156A37832M8014e2422H3574A2752Q2841R8160j7178q4770a70863m8178E0273
15144A80748O5884a67074C58913A40054K68090C8583d0094A90997J62802j45213
15134B08586L4504e4205B63816o8507d557A80392H198a54459H6398b02151C39991
$$ y = [121589, 143205, 384547, 136440, 166103, 56307, 110306, -162397, -103442, 180754, -315136, -96118, 79994, 182411, 80533, 133111, 146595, 17769, -84394, -106746, 182919, 379830, -98765, 84001, -76890, 34496, 24267, 239856, 68736, -23427, -128985, -90283, 197985, 312242, 210212, 252907, 182207, 286087, -106154, 99794, 73800, 283857, -133291, 174096, 272861, 322030, 281168, 152154, 39391, -9012, 11100, 355980, 90490, 168175, 150816, 137832, 185846, -52422, 83574, 12752, 95593, 193753, 176575, 91805, -170863, -219041, 50273, 180748, 246632, -167074, 358913, 140054, 408144, 38583, -40094, 190997, 353799, 208586, 243090, -54205, 263816, 195309, -4557, 180392, 8198, -154459, 86398, -202151, 339991]
15122a1154H1927L35328a0747A67127J34124q7455J88335k8032j02581j07535
15112A63983g9131B67640h0945B02398A1898b2398A34821M8108b5032D59507A85036
15100A78780p8239L79154a88918B53208e0675A38838L16755j37594j58003Q2491
15090B42487M7723j11879K21424A69506n2319f069H1822K24801o4311j1917J54449
15079C84844A30597L01783j25016B3428L4784a81106E5704K78342H2849J24036
15069B06885B573O6295C1245K95664A62391a7878C5948D199L80232e8530c496
15057A15160J10694R0662a1209H8029J39651Q7751l5193O8900r3388A6078f0771
15045B09772K32499A45832L7710j5440a00766d4866D9947B0089K63265A38268
$$ y = [-11154, 81927, 417255, -10747, 167127, 301251, 213796, 402131, 374099, 271518, 163983, -79131, 267640, -80945, 202398, 11898, -22398, 134821, 182929, -25032, 459507, 185036, 178780, 100541, 479695, -188918, 253208, -50675, 138838, 455593, 317999, 159996, 242487, 290210, 178331, 399755, 169506, 117187, -6069, 81822, 306623, 242312, 230395, 384844, 130597, 432380, 307364, 23428, 58212, -181106, 55704, 334046, 82849, 206885, 2573, 68868, 31245, 326909, 162391, -17878, 35948, 4199, 384431, -58530, -3496, 115160, 225854, 316516, -11209, 88029, 227680, 315431, 280238, 349138, 255750, 16078, -60771, 209772, 442271, 145832, 183542, 168102, -100766, -44866, 49947, 20089, 283354, 138268]
15034B82957A34758a29558C44202A29566L50782A85300K62059D6382K67783r8275
15024B15890N9667L3272K3846A01412m6336L6048Q2152A0604K15566I9764J08882
15013B08646M7509A02460O2068N4480P4119C437J11409N8796L13887B36239r4458
15002A41781a32061C35K72688a37704C71608j61905a71676D4993O46217C45092
14991F9038a38005B96298G3870N1093K07409J35153c9888j02155C76859D468i7789
14979A70442J01114K61510h071B27826j582a07086j1105A92758E091R2396J62955
14968B60442j4108L7440K47978A68042J47971h2212B37379Q3868L02144B92484
14957A12207K29975A43367H842K85962K982m4368L09287A17254J04772j02792
$$ y = [282957, 134758, -129558, 344202, 129566, 480348, 185300, 447359, 46382, 314165, 215890, 275557, 308829, 332675, 101412, 55076, 91124, 173276, 10604, 226170, 99764, 208646, 256155, 102460, 164528, 219008, 293127, 3437, 114846, 173642, 487529, 236239, 141781, -132061, 335, 273023, -137704, 371608, 209703, -171676, 44993, 691210, 345092, 69038, -138005, 296298, 73870, 124963, 332372, 467525, -39888, -142043, 376859, 4468, -97789, 170442, 271556, 533066, -8071, 227826, 226244, -107086, -118191, 192758, 5091, 97487, 260442, 246334, 283774, 531752, 168042, 316013, -82212, 237379, 321247, 623391, 292484, 112207, 342182, 143367, 8842, 294804, 297786, 253418, 562705, 117254, 222026, 119234]
14947A19234J91151J81327b15996D76996B11454J53090j40385o7625L95416B71603
14936e5608D69269A50639r621O4024O6964Q4219K41408j05574B36085k9587n509
14925B00989N6992J89072l328k4812l3107j83015r0555J50566K60050k27263J16322
14914D11911L09962k89381n5077j42408J24860R0767j08807A58921J59851C9498
14903C63540A08711M3097L09635k27062J72872H0425K49986q5071J0929p5111
14893A81158L8962J09442A52090B0196L59643j86819K56561Q4135j21595j34848
14883B77273F1726M72613N078M9365j95386K97587B73160g9791B82047L20269
14873F02316j53659j96834K70874A07438L57050L7305B14587q1523g42D62373
$$ y = [119234, 310385, 491712, -215996, 476996, 211454, 364544, 224159, 156534, 551950, 271603, -55608, 469269, 150639, 141018, 205042, 272006, 356225, 597633, 492059, 236085, 206498, 200989, 257981, 447053, 443725, 418913, 385806, 202791, 112236, 262802, 522852, 295589, 411911, 721873, 432492, 377415, 235007, 359867, 450634, 341827, 158921, 318772, 39498, 363540, 108711, 151808, 461443, 234381, 407253, 80425, 330411, 245340, 256269, 181158, 220120, 329562, 152090, 20196, 379839, 193020, 449581, 533716, 412121, 277273, 61726, 534339, 539417, 588782, 393396, 690983, 273160, -79791, 282047, 602316, 448657, 251823, 522697, 107438, 464488, 501793, 214587, 133064, -742, 462373]
14862G3731N84548A68561K20244N4207J33330o4317j08344j33749J83778j1969
14852D41741A89255M01860k75650j33808L00492A5538M56209o5166J18752j96252
14842C29081K16775b8954H42166l04743L08920k95633q9980J74273B82441K7411
14832C09852O6175Q3858l3431J55834j5952k43252K79192J37948C49092K46024
14822E95116j16005j19663m9510R4778P8848j23352M06593B74233K11781p3495
14812D12519J2907K13873A47624N03857j80321K98336k61276j21174J88461J6048
14802E91555B91101L65808A73273K26853Q8242q564J76704L01456m12041O613
14792E52536J3403p9P9257k27098O4908k7364N7693k49796L58541M3648J09948
$$ y = [73731, 658279, 168561, 388805, 443012, 576342, 512025, 403681, 269932, 453710, 441741, 189255, 591115, 315465, 181657, 482149, 15538, 471747, 406581, 525333, 329081, 545856, -28954, 842166, 537423, 846343, 550710, 460730, 635003, 282441, 309852, 376027, 459885, 426454, 582288, 566336, 323084, 602276, 740224, 349092, 595116, 479111, 359448, 309938, 404716, 483564, 360212, 766805, 274233, 486014, 412519, 425426, 639299, 147624, 651481, 471160, 769496, 508220, 387046, 575507, 591555, 291101, 656909, 173273, 400126, 488368, 479804, 656508, 957964, 545923, 552536, 565939, 565860, 645117, 418019, 482927, 455563, 513256, 263460, 622001, 665649, 775597]
14781G75597k72426M0617m0904B29581M31818q344m773P8218j97966m3915K41465
14770G26084K07842j30902J19439m40940K6937K35151k7108m5515j51601K24382
14760G43769m2913L0331J59853m36661L84947j8991l43974K19739M1542k93755
14750D43887J25947q2911K66115o1329j18955k6912M45596j68760k34574j60189
14740D27915K88705N8634l10707J36879k29931M61552J5726K37065m87382J73794
14730G72250m0347J01147p0963k22418K13729k63523O25759m34277Q6611K13170
14720I81138j03968Q3061j5987k37046K30744M3631l16932L3579J79528l01606
14710E76142K33647J00568o7990P8917P2545J22584k51802J49880k47067k35582
$$ y = [775597, 503171, 543788, 502884, 229581, 661399, 653055, 648282, 726500, 528534, 484619, 726084, 933926, 803024, 922463, 481523, 508460, 743611, 716503, 670988, 519387, 743769, 700856, 731187, 891040, 454379, 839326, 820335, 476361, 696100, 737642, 443887, 569834, 486923, 753038, 691709, 572754, 545842, 991438, 822678, 588104, 427915, 716620, 775254, 464547, 601426, 371495, 833047, 848773, 1085838, 598456, 772250, 731903, 833050, 762087, 539669, 753398, 489875, 1115634, 681357, 767968, 981138, 877170, 960231, 944244, 707198, 937942, 981573, 664641, 698220, 877748, 576142, 809789, 910357, 842367, 921284, 993829, 1116413, 864611, 1014491, 767424, 531842]
14700E31842P09028o12662Q7937K26193O0977L05318o53272J2006R9187j10354
14690F56200L44169J56217j95754J2034j8965l0577K66730n2962k66519L76713
14680A247286r5605j3755O5373R020m24539L05323k80683J99515j42458J05328
14670I74805J80480J00437j67053p8683l07088J64682J92262J2704M27103k04868
14660A294781j02737Q0109k7048j04349K80995o24971K87293q308J97480O0406
14650A333651M8642k12526K09907n7937j4783K3772R0918j50429j5256K36591
14640A492550l15040Q1901j99864L77737J31652M4517j16086j15999K08989j64433
14630A425924P3870K61895j64184l82197R1148J54218R9583l50396P8240K86976
$$ y = [531842, 1240870, 628208, 716145, 942338, 1003315, 1308633, 655361, 667367, 766554, 656200, 1000369, 1156586, 960832, 972866, 953901, 923324, 1190054, 1137092, 870573, 1247286, 1151681, 1137926, 1203299, 1212319, 787780, 1093103, 812420, 1011935, 869477, 974805, 1155285, 1255722, 1088669, 1009986, 702898, 867580, 1059842, 1072546, 1499649, 1294781, 1192044, 1272153, 1245105, 1140756, 1421751, 796780, 1084073, 1075765, 1273245, 1333651, 1382293, 1169767, 1379674, 1321737, 1306954, 1330726, 1421644, 1271215, 1255959, 1492550, 1177510, 1259411, 1059547, 1437284, 1568936, 1613453, 1497367, 1381368, 1590357, 1425924, 1499794, 1761689, 1597505, 1215308, 1306456, 1460674, 1560257, 1209861, 1288101, 1575077]
14620A575077l50704J11704l6801K07380m24475J01938M61379k7749j67819K28270
14610A678200j40899j13546K22449j20564J39484r6721q0279L57882n60148K80986
14600A566844K20417L4370k50374Q9427M73074j91708r1068k35663J51344m337
14590A762326N7380J003R119L47496p33810L11408J60538j94766L59716K76268
14580B356678l46025k33901K11792J95707L56633k36958j66479J96664k15967
14571B118144K30809K1189k08467M93941J21303k91185J08833P14J10889j8606
14561B687564L66644k59139j56238N95855K01437j51662J40089K5040P23473J84823
14551D357886P67020J152891J908060M103547Q212238J8298664L649053B0930421
$$ y = [1575077, 1224373, 1336077, 1299276, 1506656, 1082181, 1184119, 1645498, 1617749, 1449930, 1678200, 1537301, 1423755, 1646204, 1525640, 1665124, 1568403, 1488124, 1846006, 1285858, 1566844, 1787261, 1821631, 1571257, 1660684, 2133758, 1942050, 1850982, 1615319, 1766663, 1762326, 1819706, 1820709, 1829828, 2177324, 1443514, 1754922, 1915460, 1720694, 2080410, 2356678, 2010653, 1776752, 1988544, 2184251, 2540884, 2303926, 2137447, 2334111, 2118144, 2348953, 2370142, 2161675, 2655616, 2776919, 2485734, 2594567, 2595281, 2706170, 2687564, 3054208, 2795069, 2638831, 3234686, 3436123, 3284461, 3424550, 3449590, 4173063, 4357886, 5124906, 6277797, 8185857, 12289404, 20501642, 38800306, 42449359, 20930421]
14542A0969739q70902l333012l104397j049070k26262J0315k49740J19885j96410
14533B070146R6457j99757J43361j12444J20691K14191q7714K81167j46342j76394
14523B203362M21250k2276l0373k19227N61418l42433J36432m9987Q0996l84314
14513B354848N61936L61920n65575K86848j42817K66061j21270q3438J98452o5628
14503C051337J80932q0190j03434K76767L74915n72744K30053P0470P3056k53955
14493C247207N16879l74745O77457k35759j60276J82903l5l4020j36900J61063
14483C843774J72949m8797J72775R0227l40718L24638n4181K74637k00159J24881
14473D360026m0369n1037J79884j20817P4459L69699P8728J93318k70002L62164
$$ y = [10969739, 10098837, 6765825, 3661428, 2612358, 2386096, 2396411, 2146671, 2266556, 2070146, 2166603, 1966846, 2110207, 1997763, 2118454, 2332645, 2244931, 2526098, 2379756, 2203362, 2624612, 2602336, 2571963, 2352736, 2914154, 2571721, 2708153, 2658166, 2739162, 2354848, 2916784, 3278704, 2713129, 2999977, 2857160, 3123221, 3001951, 2918513, 3116965, 3051337, 3232269, 3152079, 3048645, 3325412, 3700327, 3127583, 3357636, 3428106, 3501162, 3247207, 3764086, 3389341, 4066798, 3831039, 3670763, 3853666, 3853631, 3819611, 3682711, 3843774, 4016723, 3967926, 4140701, 4230928, 3890210, 4214848, 4160667, 4435304, 4235145, 4360026, 4319657, 4268620, 4448504, 4327687, 4402146, 4771845, 4850573, 5043891, 4773889, 5136053]
14463E136053j93464J51587M8259j12176J48631J01796P8172j18070l5400L54652
14453E560040J74267P0638k2805l11043M06780n2846J13757L62211k55902N7844
14443F102941K05394j37476J51206K28086J40134m5169j66939Q60744k52803M5438
14433G131556J6599J05990k03190M73789j51027R2877K06452K90131n39645L17175
14423G740707K76332K39533j50248J28575J43151J91779J80155K06373j08634
14414H847723N20237m09910N84671K42828j67534K77826J1165M37106k81076M27890
14404A0490926K36518j71707L99559N7574M01791j89132M93207J93919J43727
14395A2056382M47624k00140J35058L15935K07288K01581J70550P43422n5222
$$ y = [5136053, 4942589, 5094176, 5142435, 5030259, 5178890, 5280686, 5358858, 5240788, 5205388, 5560040, 5734307, 5804945, 5782140, 5471097, 5877877, 5825031, 5938788, 6300999, 6045097, 6102941, 6308335, 6170859, 6322065, 6550151, 6690285, 6645116, 6478177, 7338921, 7086118, 7131556, 7148155, 7254145, 7050955, 7524744, 7373717, 7466594, 7673046, 7963177, 7423532, 7740707, 8017039, 8256572, 8106324, 8234899, 8378050, 8569829, 8749984, 8956357, 8847723, 9367960, 8958050, 9542721, 9785549, 9618015, 9895841, 9907006, 10344112, 10063036, 10490926, 10727444, 10555737, 10955296, 11012870, 11414661, 11225529, 11718736, 11912655, 12056382, 12504006, 12303866, 12438924, 12754859, 12962147, 13163728, 13334278, 14077700, 14022478]
14386A4022478K04334M24506L00353J56070j71022L31538O17281L72149R7831
14377A6355518M61823K58556O04058J00776L86990M32977J01525P26151m7169
14368A9381205M08956O47305K48626M26405N72260K91297N50545L20403N68152
14359B3415154Q17669K81238R10187N96167K02585Q35956N80960M20411Q96515
14350B8956842P11288O15988R40097O49255P41574J190241N52762J130420R71814
14341C6460281P98963P41210J433657J116590Q58507J164662J000085J864448
14333D5438403J498518P35649J488713J621982J461058J858134J716571J790011
14325E7609039J897367J897130K176635K077879K571266J814793K908658K562219
$$ y = [14022478, 14226812, 14651318, 14951671, 15107741, 14936719, 15268257, 15885538, 16257687, 16355518, 16817341, 17075897, 17679955, 17780731, 18167721, 18600698, 18702223, 19428374, 19381205, 19790161, 20437466, 20686092, 21112497, 21684757, 21976054, 22526599, 22847002, 23415154, 24232823, 24514061, 25424248, 26020415, 26223000, 27058956, 27639916, 28060327, 28956842, 29668130, 30284118, 31224215, 31873470, 32615044, 33805285, 34358047, 35488467, 36460281, 37259244, 38000454, 39434111, 40550701, 41409208, 42573870, 43573955, 45438403, 46936921, 47672570, 49161283, 50783265, 52244323, 54102457, 55819028, 57609039, 59506406, 61403536, 63580171, 65658050, 68229316, 70044109, 72952767, 75514986]
14317G5514986L003826K712671L119785L075623L563818L376160M077677M029086
14309A02473632L964591M537932M867455M930829N039762N309430N866693O474173
14301A43464497O636123P023101P360465P967203P917128Q167003R429437R738883
14293B07703840J0055063J0456538J1276117J1804111J1861528J2935512J3101627
14286B89194336J3843713J3941566J4209554J4926110J4777334J4548229J4510533
14279C89951375J4162436J3277282J2814224J1540919R909546Q212836N484819
14272D65353437J725171M71137m34636j288954m314193n992090o924739q348084
14264D40247049r719477j1516971j2520480j3667419j4913544j4775738j4996931
$$ y = [75514986, 78518812, 81231483, 84351268, 87426891, 90990709, 94366869, 98444546, 102473632, 106438223, 110976155, 115843610, 120774439, 125814201, 131123631, 136990324, 143464497, 150100620, 157123721, 164484186, 172451389, 180368517, 188535520, 197964957, 207703840, 217758903, 228215441, 239491558, 251295669, 263157197, 276092709, 289194336, 303038049, 316979615, 331189169, 346115279, 360892613, 375440842, 389951375, 404113811, 417391093, 430205317, 441746236, 451655782, 459868618, 465353437, 467078608, 467549745, 467115109, 465826155, 461511962, 455519872, 448595133, 440247049, 430527572, 419010601, 406490121, 392822702, 377909158, 363133420, 348136489]
14257C48136489j5727298j5064523j4799862j4508676j3820881j1349031j2735226
14250B50130992j2400247j1443352j0983960j0255120r979979r118561q269037
14243A77680736q569387p822973p193726p026356o146918o290487n767478n387895
14235A23475516n258432m805759n032820l907604m120115l777974l683809l687003
14227H9202000l254640l240321l365339k564473l178597k240483k328111j787746
14219F7242290k840117j850336k349456j829633j882207j645381j290756j970223
14211E1584181j288075j702388j194719j744374m03627j296186j570919j368405
14203D1015488p47456j218807j201907k67035j656497o74942j110546j057025
$$ y = [348136489, 332409191, 317344668, 302544806, 288036130, 274215249, 262866218, 250130992, 237730745, 226287393, 215303433, 205048313, 195068334, 185949773, 177680736, 169111349, 161288376, 154094650, 147068294, 140921376, 134630889, 128863411, 123475516, 118217084, 113411325, 108378505, 104470901, 100350786, 96572812, 92889003, 89202000, 85947360, 82707039, 79341700, 76777227, 73598630, 71358147, 69030036, 67242290, 64402173, 62551837, 60202381, 58372748, 56490541, 54845160, 53554404, 51584181, 50296106, 48593718, 47398999, 45654625, 45250998, 43954812, 42383893, 41015488, 40268032, 39049225, 37847318, 37580283, 35923786, 35248844, 34138298, 33081273]
14195C3081273r05380o55479q65048l30388j026610m82886q55042n09921p08278
14186B6742241o74071j32690q10870p14882o46895m26248k64477o19640o55626
14177B1796842n61668r4975m10948k42563r39470l00621j89544j44802m25495
14168A8486756n89973l52433l90907l67637k77711k42829l0166o22300j84594
14159A5428206j01793j24154n37578r3337J99012j082306j78180k05477J67057
14150A3471450l36241k36690k07904q7189m38247J87761j58596l89281Q0881m94189
14140A1391755m18478J80801K31380r15743J05598L8162k51430k92278k89921
14131I779846K34602m69259P7061j99216K2721j19708l74603M7440k24269P3968
$$ y = [33081273, 32175893, 31520414, 30655366, 30324978, 29298368, 28815482, 27960440, 27450519, 26742241, 26068170, 25935480, 25124610, 24409728, 23762833, 23336585, 23072108, 22452468, 21796842, 21235174, 21140199, 20729251, 20486688, 19547218, 19246597, 19057053, 18912251, 18486756, 17896783, 17544350, 17153443, 16785806, 16508095, 16265266, 16235100, 15612800, 15428206, 15326413, 15202259, 14664681, 14571344, 14770356, 13688050, 13509870, 13304393, 13471450, 13135209, 12898519, 12690615, 12603426, 12165179, 12352940, 12194344, 11805063, 11885944, 11391755, 10973277, 11154078, 11385458, 10469715, 10575313, 10613475, 10362045, 10069767, 9779846, 10014448, 9545189, 9622250, 9423034, 9445755, 9326047, 8951444, 8998884, 8774615, 8848583]
14121H848583m58707J34459j46015j74603j33521m3193J43561j19726m39951j6077
14111G594810J56667j90700p1559j20537P8669m22173O2130O276j27154o374k26646
14100F733409l64781J39799j66716L7673Q2357p3355q4304l74110K41702j08394
14090F063280k58107l04608K65335q9193j08871k02932J61669M1276n57218N06196
14080E516827l45097J37220j28183j78630p627J86978l25290o7256K87473j04500
14070D971915r7722M537l47788j79721L88023j53886J59669l49397m5800j09600
14060D240230l7310j27008J21455J51740k32677J33145j46702j54822K24309j41489
14050D030871k6086o7590l06233J70148Q6808l30029o8594K74734j18754j70803
$$ y = [8848583, 8389876, 8524335, 8378320, 8203717, 8070196, 8027003, 8170564, 8050838, 7610887, 7594810, 7751477, 7560777, 7489218, 7368681, 7447350, 7025177, 7087307, 7093583, 6966429, 6960055, 6733409, 6368628, 6508427, 6341711, 6379384, 6461741, 6388386, 6304082, 5929972, 6171674, 6063280, 5805173, 5500565, 5765900, 5676707, 5567836, 5364904, 5526573, 5567849, 5010631, 5516827, 5171730, 5308950, 5180767, 5002137, 4994510, 5181488, 4856198, 4788942, 5076415, 4971915, 4874193, 4878730, 4530942, 4351221, 4739244, 4585358, 4745027, 4395630, 4349830, 4240230, 4202920, 4075912, 4197367, 4349107, 4116430, 4249575, 4102873, 3948051, 4172360, 4030871, 4004785, 3937195, 3630962, 3801110, 3887918, 3557889, 3489295, 3764029, 3645275, 3474472]
14040C474472p5075Q2513N3753n3713l50677P3725Q5192K02800k01484o3885K04902
14029C432523r2911j0189l32859J57520N9215J08023o52795K92060l14948M93598
14019C139237k06993k0471j59121o5111J12608k42225K71106j59119m7457K30456
14009B852910J30237J98239m46513K1905j30498j67647K88048j37617j34778k23582
13999B250704J89092k00580M33742n10766K50775M146J19488Q7110R8574L40316
13989C062601R18230L221970O997632J7755283J2753578j7912749j2224613n281481
13981I290451k329504j524599j094739J9246o54145j40432m21690q1829J63425
13972C226184q04232N85292m77382L83548k36125N00186m04078k83033N5245j49210
$$ y = [3474472, 3399397, 3481910, 3535663, 3481950, 3131273, 3204998, 3290190, 3492990, 3291506, 3227621, 3432523, 3339612, 3329423, 2996564, 3154084, 3213299, 3321322, 2668527, 2960587, 2645639, 3139237, 2932244, 2911773, 2752652, 2687541, 2800149, 2557924, 2829030, 2669911, 2622454, 2852910, 2983147, 3181386, 2734873, 2756778, 2626280, 2458633, 2746681, 2609064, 2474286, 2250704, 2439796, 2239216, 2672958, 2162192, 2412967, 2417113, 2536601, 2623711, 2722285, 3062601, 3980831, 7202801, 14200433, 31955716, 44709294, 26796545, 14571932, 9290451, 6960947, 5436348, 4341609, 4360855, 3706710, 3566278, 3144588, 3062759, 3226184, 2421952, 3007244, 2529862, 2913410, 2677285, 3177471, 2773393, 2490360, 2545605, 2396395]
13962B396395L1687Q077O6978p7681j96084J93459m4632l5678r7891j57297J05135
13951B192468n9589q3207K04685l25479J10140J70103q2179k31596R4292q3731
13941A905907M99126o41534K63426J1415p1799J50392n58278M09175j65516J6739
13931A819053n338l18767L48472k1713k34588K14674K71369m83048j8552J09588
13921A681150j00592o4217P6032J09278k03120J46292n7354K73308j35476J92679
13911A917980l20371K7220K2825j4357N909O4322l52967L58941k1118l40230J75365
13900A523519l9561J5232J59991j87135j79995n2080p4962J09659K57006l10035
13890A221639L26321k74569J99074J28575p8111k1393k75336P1187K5998M49032
$$ y = [2396395, 2428082, 2436159, 2503137, 2425456, 2229372, 2422831, 2378199, 2342521, 2244630, 2087333, 2192468, 2132879, 2049672, 2254357, 1928878, 2039018, 2209121, 2126942, 1895346, 1989638, 1905907, 2405033, 1763499, 2026925, 2038340, 1966541, 2116933, 1558655, 1967830, 1802314, 1819053, 1813715, 1494948, 1843420, 1821707, 1587119, 1801793, 2073162, 1590114, 1571562, 1681150, 1580558, 1516341, 1592373, 1701651, 1498531, 1644823, 1587469, 1860777, 1725301, 1917980, 1597609, 1624829, 1647654, 1633297, 1639206, 1703528, 1350561, 1709502, 1688384, 1348154, 1523519, 1483958, 1499190, 1659181, 1472046, 1292051, 1239971, 1165009, 1274668, 1531674, 1221639, 1547960, 1273391, 1472465, 1601040, 1522929, 1501536, 1226200, 1297387, 1323385, 1772417]
13880A772417o04693l6829L66278l61733L03376j25220K15932J5326k89127Q6896
13870A342623P256K49517n36284R9796P2694j71878K52540Q6773j00893r9637
13860A202507J39446k71519q2659K061L65600k93511j53702M53229k23458K26846
13850A364840m08839N51884p5953k37799q9919P1650r7013P9678j26531M41838
13840A473836o69114M09296j93416L8107j05377j79901K37439j73903K40920r5208
13830I82679q1781K71010j3190R1816m10531k71770O45606j1739j42099M1679
13820A101680p9835j4206l8713j83159O6576L05956k14326j18551K6108M12976
13810A264506k48295j66589K79849n29178M75945l22610J36073J99104j90506
$$ y = [1772417, 1167724, 1130895, 1497173, 1135440, 1438816, 1313596, 1529528, 1544854, 1255727, 1342623, 1349879, 1599396, 1063112, 1162908, 1235602, 1063724, 1316264, 1403037, 1302144, 1202507, 1341953, 1070434, 987775, 989836, 1355436, 1061925, 908223, 1361452, 1137994, 1364840, 956001, 1507885, 1431932, 1194133, 1104214, 1175864, 1078851, 1158529, 1031998, 1473836, 804722, 1214018, 1020602, 1058709, 953332, 773431, 1010870, 836967, 1077887, 982679, 900898, 1171908, 1158718, 1250534, 840003, 568233, 1213839, 1202100, 1060001, 1101680, 1021845, 1007639, 968926, 785767, 852343, 1158299, 943973, 825422, 851530, 1264506, 1016211, 849622, 1129471, 600293, 1076238, 753628, 889701, 1088805, 898299]
13801H98299O635N2199J5865l97384O09578n55325J67028n5779p3204K85948k33186
13790G20674P573O7642M0431O4361j74898M06884m64548K15748N9996p2793K9512
13779I00582l54189N5999j63591K96695j70550M03330j00397l8793j66846J28786
13769G91026N285Q3684k46905L50713j71322J41911r4046j88937n251k561K58990
13758I22587j83511K6228J1840O7530J3143k38805J99194J560l20755K67815j94864
13747E71962J36612l5151K27531m1239k81448L45227j46606j19487n06M2909K07198
13736I07002q5213k82599R016K63155o6948L14531D76527K60356J27061j35038
13726G28906j03522j75676K51089m2450k75597L062N07394D39327R9157j97256
$$ y = [898299, 904934, 957133, 972998, 575614, 1185192, 629867, 796895, 741116, 667912, 953860, 720674, 728247, 795889, 836320, 900681, 725783, 1132667, 668119, 883867, 943863, 871070, 900582, 546393, 602392, 438801, 735496, 564946, 968276, 867879, 829086, 662240, 791026, 796311, 879995, 633090, 983803, 812481, 954392, 860346, 671409, 666158, 663597, 922587, 739076, 765304, 777144, 844674, 857817, 619012, 818206, 819766, 499011, 766826, 571962, 708574, 673423, 900954, 859715, 578267, 923494, 776888, 657401, 656895, 699804, 907002, 821789, 539190, 548206, 811361, 744413, 1058944, 476527, 736883, 863944, 728906, 625384, 449708, 700797, 658347, 382750, 385812, 893206, 439327, 538484, 341228]
13716C41228L04170j73895K22454k89501M83441C49322K02479J03376N7491N2386
13706G65054j06678j64776K24456k22490K3265J2113L01646C19441R0813K71942
13696F82196M8964j99863J08357k02091J07174Q8144J22126j11220K18179l17172
13686E44794J42952j63390j82128K7670K0558K13945j06888L34352C11862K25543
13676E37405r5475p3781A75591L64384p0698M7082O5533J83364l36683R9504L62271
13665H90348C65947o0414A48774K22060K69584j38004J10790k25158J20676j56638
13655C52084M28390C06009J26604K34336j34762J34067C27643K7560J47610k42845
13645B59968M29671k97540Q5133j2755J97630M949k70587J06712p9368L87913
$$ y = [341228, 645398, 471503, 693957, 404456, 887897, 349322, 551801, 655177, 712668, 765054, 658376, 493600, 718056, 495566, 518831, 530944, 832590, 319441, 410254, 682196, 731160, 531297, 639654, 437563, 544737, 632881, 755007, 643787, 861966, 544794, 687746, 524356, 342228, 369898, 390456, 604401, 497513, 831865, 311862, 537405, 441930, 368149, 175591, 539975, 469277, 516359, 581892, 765256, 428573, 528077, 890348, 365947, 305533, 148774, 370834, 640418, 502414, 613204, 388046, 508722, 352084, 780474, 306009, 432613, 666949, 532187, 666254, 327643, 355203, 502813, 259968, 689639, 392099, 477232, 464477, 662107, 667056, 396469, 503181, 423813, 811726]
13635H11726C94217J65533p096j29072J36089k70390j13576E8440M02910j50836
13625C10514J99227K7844j84659L86079C62021L13630K8968P7072l80179A78333
13614E54351j78507O6255q1052P0801K82860k57884J07921B78176J37850j14031
13604C01995K46926j08965j19709J70588j6896j47890j24575J97062o7597p2588
13594B58351J55536M3545K49814j71829r5532A23498N25892k72154K68357k75739
13584C69854Q7641K529j18847K35679j66262L2804p0283J15517A74807K25935
13574D00742Q2169j233B20207M00168k55564H5342J88696M86759A91815J05789
13564B97604a0200E07808j95916k7525I6404L71169e2489C72908c89132C40409
$$ y = [811726, 394217, 559750, 552654, 423582, 559671, 289281, 175705, 58440, 461350, 310514, 509741, 537585, 352926, 739005, 362021, 675651, 704619, 781691, 401512, 178333, 554351, 375844, 442099, 361047, 431848, 714708, 456824, 564745, 278176, 416026, 301995, 548921, 439956, 320247, 490835, 473939, 326049, 201474, 398536, 330939, 258351, 413887, 457432, 707246, 535417, 439885, 123498, 649390, 377236, 645593, 369854, 457495, 460024, 341177, 576856, 410594, 443398, 373115, 488632, 174807, 400742, 482911, 481678, 220207, 620375, 364811, 85342, 274038, 760797, 191815, 297604, -10200, 507808, 311892, 284367, 96404, 467573, -52489, 372908, -389132, 340409]
13553A7277M23732B13171L5353K3975m068L2856a22409C91627O2517l1481q1804
13542C40859j55768e8674A49258J11130J85229p3679F0781J61718J25092p7184
13532B70407N21761l02548A94964K03858j96644K98425H9786L4768L47159L1091
13522E02804B28915M477m2471P9180l7973L13877j30345A11677L71418j99933
13512B83162M8341K3084j7878F9211K26992m6015j7028J49738o6356J73165C366
13500B84962j34773J75432A54977J5885K45226j6861J87565m9522A45952J66877
13490C12829j56063J36649J19229K1695A31734J42410M1974J38189k21980J81454
13480D13781A30257K74693C454c7753B93362r3980g2970B45375a08219j35357
$$ y = [17277, 441009, 213171, 248524, 272499, 268431, 301287, -122409, 391627, 454144, 422663, 340859, 185091, -58674, 149258, 260388, 445617, 371938, 60781, 222499, 347591, 270407, 792168, 489620, 194964, 398822, 202178, 500603, 89786, 124554, 471713, 502804, 228915, 233392, 190921, 270101, 232128, 546005, 415660, 111677, 483095, 283162, 331503, 354587, 336709, 69211, 296203, 250188, 233160, 382898, 316542, 489707, 3366, 284962, 150189, 325621, 154977, 170862, 416088, 399227, 586792, 537270, 145952, 312829, 156766, 293415, 412644, 434339, 131734, 274144, 316118, 454307, 232327, 413781, 130257, 404950, 3454, -37753, 293362, 199382, -72970, 245375, -108219, -243576]
13470b43576H5295K63685P1992K0106j98588k4468J52431O5576A80033j7866A943
13458C80229K35029B49142K81756A47253M5860j6115J8896L42674L1951A34693
13447B79592O4544j61867L03929E8787P0309J31226r7910N18807B60662q4063
13437A76599O7074K68157j11955n8675A49381H198K60594J98944F2480P410K94473
13426C64363A45454A0068J92257n9580e8914C10489O475A49531j6064B1744J59500
13415A81244A6339P0595J80473j0878D8621J27743n1185J09027K1911n9574A6482
13403C06332A29741L35917j97870r8325L29365A16966b38681B69984l7458J91806
13393D24332a0190D86217j09905D1568K32078J98357J40578I9856P6548p026m7248
$$ y = [-243576, 85295, 348980, 420972, 441078, 242490, 218022, 370453, 436029, 180033, 162167, 1943, 380229, 615258, 249142, 530898, 147253, 193113, 176998, 195894, 538568, 570519, 134693, 279592, 344136, 182269, 486198, 58787, 129096, 260322, 162412, 681219, 260662, 176599, 243673, 511830, 399875, 341200, 149381, 8198, 268792, 467736, 62480, 69890, 364363, 145454, 10068, 202325, 142745, -58914, 310489, 316964, 149531, 133467, 21744, 181244, 16339, 86934, 267407, 256529, 48621, 176364, 125179, 234206, 256117, 196543, 16482, 306332, 129741, 465658, 267788, 169463, 498828, 116966, -238681, 269984, 232526, 424332, -10190, 486217, 376312, 41568, 273646, 472003, 612581, 99856, 176404, 169378, 122130]
13382A22130J95805O7434M3429r0602m9891Q5089A37142l0353o26J42884C0358
13370h9756B03931M64100l28060j09571l0206K6789J62400a07012E1858P250a01767
13358A69444P1517M4817j40045Q45P8034J09984Q2167o5595A47987J70601J12405
13347D30993A99105P2323L76301k96738A53506L50972j51259K9016b25523D80310
13336B83053B5744J47303J08718A02182K95108J36023j24319j26004b8369D64344
13325C44725K90737A353K54200K72447f6810B16082J03274a17901B4529K96630
13315C21159K84146C3463L8479L27698E0892R005N040K21992G6900J52887J85577
13304D15364j36442q4869B0946J90659P8937R1002p3595j15524m449J3941a78863
$$ y = [122130, 317935, 385369, 428798, 338196, 288305, 373394, 137142, 106789, 106163, 249047, 30358, -89756, 203931, 668031, 339971, 230400, 200194, 226983, 389383, -107012, 51858, 59108, -101767, 169444, 240961, 285778, 145733, 146578, 224612, 334596, 416763, 351168, 147987, 318588, 430993, 199105, 271428, 647729, 350991, 153506, 504478, 353219, 382235, -225523, 480310, 283053, 25744, 173047, 281765, 102182, 397290, 533313, 408994, 282990, -28369, 464344, 344725, 635462, 1353, 255553, 528000, -66810, 216082, 319356, -117901, 24529, 321159, 605305, 33463, 71942, 399640, 50892, 59897, 64937, 286929, 76900, 229787, 415364, 278922, 194053, 20946, 211605, 290542, 381544, 307949, 192425, 187976, 201917, -178863]
13292a61915C08672j50046k3998E6726K53960J26527A94920q720A3385J01426
13282A14811M0995J87795m1067j03426O6018a08243G4224Q7227K0373M27170B92379
13270E13062A2215P3134a2819A24022L14843a51259R153G1403J60315L2778j10151
13259A54345O518J51713P7703q8777B4640J38436a39640A50813a32461A99965
13248d2119B21596p1335b2968O236B65549h179A17021e5200e546B30513p1519
13237A58994J39383J5365E4754P5960A0756J55468n5861K22691e9952C5766J22805
13226A58571K19816A24984f8686A87111K6306C9008J75589J41219F0405O6300
13216A26705R8230J52396o5833j51301O1634j6024A4570M9532k6119b1596A46369
$$ y = [-161915, 308672, 158626, 134628, 56726, 310686, 437213, 194920, 186200, 13385, 114811, 155806, 343601, 302534, 199108, 265126, -108243, 74224, 161451, 181824, 608994, 292379, 513062, 12215, 85349, -12819, 124022, 438865, -151259, -142106, 71403, 231718, 264496, 154345, 160863, 312576, 390279, 301502, 24640, 163076, -139640, 150813, -132461, 199965, -42119, 221596, 150261, -22968, -16732, 265549, -8179, 117021, -55200, -5546, 230513, 158994, 298377, 313742, 54754, 130714, 10756, 166224, 110363, 333054, -59952, 35766, 158571, 378387, 124984, -68686, 187111, 213417, 39008, 214597, 355816, 60405, 126705, 224935, 377331, 311498, 160197, 221831, 205807, 14570, 64102, 37983, -21596, 146369]
13204C1580J36745h598A25217M67965B08398E8885K85286a21139C55878a06873
13193B75622I9627k8900a25438A4272h445B60738f5400k2615A62658i5122A15693
13181A90070G0449K18467r4860J03961o9197J32431j34744B8394O5197a88990
13170a87657A52887b770B04004n9154F5643L6354b62768a00121A75206H4936K27323
13159C12259A33792D5540J15020n517c16983A86473G8357e4851j44398F5998D444
13147A01183K40947j42251D7198Q6730B9507L81385b9674j8703J6779A10554a64150
13135G8313J23535J14563A43175g6690E11780j85876A06866K18516A22835l2958
13125H9877b8482E8205k2194R554J41140b9421C86048H5500a5038D4287g8552
$$ y = [31580, 168325, -8598, 125217, 593182, 208398, 58885, 344171, -121139, 355878, -106873, 275622, 99627, 70727, -125438, 14272, -8445, 260738, -65400, -88015, 162658, -95122, 115693, 190070, 70449, 288916, 194056, 298017, 228820, 361251, 226507, 28394, 93591, -188990, -187657, 152887, -2770, 204004, 144850, 65643, 101997, -262768, -100121, 175206, 84936, 312259, 133792, 45540, 160560, 155043, -316983, 186473, 78357, -54851, -199249, 65998, 4444, 101183, 342130, 199879, 47198, 133928, 29507, 410892, -29674, -48377, -31598, 110554, -164150, 78313, 201848, 316411, 143175, -76690, 511780, 325904, 106866, 325382, 122835, 89877, -28482, 58205, 36011, 45565, 186705, -29421, 386048, 85500, -15038, 44287, -78552]
13113I4433J57757a97711e4748A69311J2515E1228Q4153M1674g0916C40164A3343
13101B40856H1985C7654K70410m1339m8144b04129f2125C8075M6853J80456a57278
13089A68939F8459J32472a1506A58084E3668Q8515a09590C8510K09202b7157G6916
13077G3454a35856A79858o3958d5284A56850j4292J2191o3518K16965b69776G5086
13065A97095o7581k897J83906a05056A04856l4936e8926o0435A45601c473j2870
13054a6343E6390J4017K78095M0012a98792A09522a64236B41483g1672I5009K25092
13043C20101K51749B24445I2461J66509D5459h1370A17530J9277b3797H5324C4808
13031D40647E8646c1213C09910A23745J80384I1460b8680a2259A45368K09059
$$ y = [94433, 252190, -197711, -54748, 169311, 181826, 51228, 135381, 177055, -70916, 340164, 13343, 240856, 81985, 37654, 308064, 266725, 218581, -204129, -62125, 38075, 84928, 265384, -157278, 168939, 68459, 200931, -11506, 158084, 53668, 142183, -109590, 38510, 247712, -27157, 76916, 73454, -135856, 179858, 115900, -45284, 156850, 142558, 154749, 91231, 308196, -269776, 75086, 197095, 129514, 126617, 310523, -105056, 104856, 69920, -58926, -119361, 145601, -3473, -16343, 56390, 70407, 348502, 388514, -198792, 109522, -164236, 241483, -71672, 95009, 320101, 571850, 224445, 92461, 258970, 45459, -81370, 117530, 136807, -23797, 85324, 34808, 440647, 58646, -31213, 309910, 123745, 304129, 91460, -28680, -12259, 145368, 354427]
13021C54427j34532b55771h007A78102p3064K38638D7234a8661A58551O8803b127
13009h0547L2616k06565B1953J92054L43718B07623M8202q7360n9520d851k08835
12998b13686I2962b8147A69307a65827A59672a87065A9275K32416H9936N5958
12988A45894l5368J9501K63602H0865a07011b5280A32513C5618J16062q162J85029
12977C28547D7982a28159a919B44054A0853Q361g1566B12923e3980C2254f5743
12965a42957K3477F2933K32512l2590a14210B56509a35479C13505A44581f12l5956
12954c6568A53415L4197G3730b10597C0436J69199b46893P2773A6385a37451A78805
12942f2680C47419b29432C66737b0594C3864J00224K9365J42025a55557k6188
$$ y = [354427, 219895, -255771, -8007, 178102, 105038, 343676, 47234, -18661, 158551, 227354, -2127, -80547, -47931, -254496, 21953, 214007, 557725, 207623, 255825, 168465, 108945, -4851, -213686, 92962, -28147, 169307, -165827, 159672, -187065, 19275, 251691, 89936, 145894, 110526, 130027, 393629, 80865, -107011, -25280, 132513, 35618, 151680, 143518, 328547, 47982, -128159, -1919, 244054, 10853, 19214, -71566, 212923, -53980, 32254, -65743, -142957, -119480, 62933, 295445, 262855, -114210, 256509, -135479, 313505, 144581, -612, -36568, 153415, 187612, 73730, -210597, 30436, 199635, -246893, -174120, 16385, -137451, 178805, -62680, 347419, -229432, 366737, -20594, 33864, 134088, 163453, 305478, -155557, -181745]
12932a81745d9902A99542I4585K37894i8032A25230A4336L14106A37989b4330
12921A59324k0126L3387g0990J1146A87072B9482K33870b55365A31440m3401K23904
12910C11943j08105F0247a46445B46423a31740A68039d2128r3087C93L9595b52330
12898A79542a03096j9111A62726c02703c560F7529M3353f6736C24768m6331n1510
12887B26927G553J17548b39605O0087C18988g1971B12675j04022c524I2264a01208
12875b14454D3733a95731i4548A84760D5859R7804P3993L3228h4351B59529a83415
12863d21949E1076J14726m5039b5430j7397A34053n0338b54017A98071J08232
12853C06303H830J50546a49471K9773J0591c8632j8332A18486a9614A84658h0276
$$ y = [-181745, -49902, 199542, 94585, 332479, -98032, 125230, 14336, 328442, 137989, -24330, 159324, 139198, 172585, -70990, -59844, 187072, 29482, 263352, -255365, 131440, 88039, 311943, 203838, 60247, -146445, 246423, -131740, 168039, -42128, -135215, 393, 39988, -252330, 179542, -103096, -122207, 162726, -302703, -3560, 67529, 110882, -66736, 324768, 278437, 226927, 7553, 125101, -239605, -179518, 318988, -71971, 212675, 108653, -3524, 92264, -101208, -214454, 43733, -195731, -94548, 184760, 45859, 143663, 217656, 250884, -84351, 259529, -183415, -421949, 51076, 165802, 120763, -25430, -42827, 134053, 83715, -254017, 198071, 306303, 8830, 159376, -149471, -119698, -109107, -38632, -56964, 118486, -19614, 184658, -80276]
12841b0370j39442A19432J34990a69752l272A19599d26506I5568a25035B33142
12830i2414a5901k58077B23612q4169B7872d26644a13506K7849C6674M09931b55265
12818B89379n4788E6905c37358A4573e1294B63879a23129A18617N2375a80676
12807B06191p1823a45999N2725k05203l42A88948R3052D7136c4361G1916K34232
12796C06148m3622a72106A55085j9442B5932h5224A10430c3438A95926O9343A0155
12784A90887b17217j49114F0547L20170j43563A1973K02722d2890B37534b24039
12773d5693k8300k44986A46151b8503C9031a63043B06463k3433o4182a98676A66678
12761B5298J13739k0776J65348p9255e1351o4596I8802N5135c409B95926G7511
$$ y = [-20370, -159812, 119432, 254422, -169752, -173024, 119599, -426506, 95568, -125035, 233142, -92414, -15901, -273978, 223612, 139443, 27872, -426644, -113506, -85657, 36674, 446605, -255265, 289379, 234591, 56905, -337358, 14573, -51294, 263879, -123129, 118617, 170992, -180676, 206191, 134368, -145999, -93274, -298477, -298819, 188948, 282000, 47136, -34361, 71916, 306148, 262526, -172106, 155085, 135643, 25932, -85224, 110430, -33438, 195926, 265269, 10155, 190887, -217217, -366331, 60547, 380717, 237154, 11973, 214695, -42890, 237534, -224039, -45693, -73993, -318979, 146151, -28503, 39031, -163043, 206463, 183030, 118848, -198676, 166678, 25298, 139037, 118261, 283609, 204354, -51351, -115947, 98802, 153937, -3409, 295926, 77511]
12749a57765C6731e9444A06097J09833i5780E07312h0498C2683J03747d249k14828
12738b19077j888d7726d592B23160A08809e2587B30523A5948L0943K83211F973
12726c84859A17808l9581j746L28517A51200D3242R3507C6297a34526B45746q9775
12715A55971d8316J2987o7203B90151a5457j71436c1361J4986j03741A96113b40237
12703a45871B66169H6164c73746G05998C5595Q1012B0577J82217Q3746a5558B53964
12691a90285C7603a04567C4192a4328A60205N5704a32910N4476d762k3560k64021
12680b92343a9430n1784B56458j6842A03190N6103N926b42922A07510h6629B87066
12668D3458Q6131d01452C39991F9860f1083G3668K01638n4924f320B08375f2219
$$ y = [-157765, 36731, -59444, 106097, 215930, -95780, 507312, -80498, 32683, 136430, -4249, -219077, -220965, -47726, -4592, 223160, 108809, -52587, 230523, 15948, 46891, 330102, 6973, -384859, 117808, 78227, 76481, 404998, 151200, 43242, 136749, 36297, -134526, 245746, 155971, -48316, -35329, -102532, 290151, -15457, -186893, -31361, -16375, -120116, 196113, -240237, -145871, 266169, 86164, -373746, 705998, 35595, 116607, 20577, 202794, 286540, -15558, 253964, -190285, 37603, -104567, 34192, -14328, 160205, 215909, -132910, -78434, -4762, -28322, -292343, -19430, -71214, 256458, 239616, 103190, 159293, 165219, -242922, 107510, -86629, 287066, 43458, 129589, -401452, 339991, 69860, -61083, 73668, 275306, 220382, -6320, 208375, -62219]
12656A57530N4119M2379q3877N139a98419d2435m6112B64133f2455A22111A6392
12644A35418f0721j51028F7454L10365A57465k3404n1541c885A33297E4496J26427
12633A80923J17477M6966I0305M8042a24312A66743J04221e3294C65442j16459
12623B48983m5679F7583J57807n5593b91892A33021B872e9859A48743J47177o3944
12612B31976f9220B47248b28471J09968A62032M0729b55605d0266A80005K40746
12602D20751K0604A44343A8924o85R7499j6244C7861c93619A71393h821A95502
12590D86467k15808A18281a3288C08118O4810a5307m7825j014a2689m00168a51494
12578a89243D41764b28883A9518J08503n4050J73420b59339A52594J15234J24052
$$ y = [157530, 211649, 254028, 170151, 175290, -198419, -42435, -88547, 264133, -62455, 122111, 16392, 135418, -60721, -211749, 67454, 377819, 157465, 134061, 82520, -3885, 133297, 54496, 180923, 298400, 345366, 90305, 138347, -124312, 166743, 270964, -53294, 365442, 248983, 203304, 67583, 225390, 169797, -291892, 133021, 2872, -59859, 148743, 295920, 231976, -69220, 247248, -228471, -118503, 162032, 202761, -255605, -40266, 180005, 420751, 441355, 144343, 18924, 18239, 115738, 99494, 37861, -393619, 171393, -8821, 195502, 486467, 270659, 118281, -13288, 308118, 372928, -15307, -63132, -64146, -12689, -412857, -151494, -189243, 441764, -228883, 19518, 128021, 73971, 247391, -259339, 152594, 267828, 391880]
12568C91880E5529K05637J7089M38330F1226K91789c5601j26105J0207O5965j67540
12557b53074b4385a2082D8114R828f9265f873k75099J11158l8043B97074i077
12545b9946A09703R6161K4956G4566l5014L01708H9462g3962E7519g8239K4616
12534e3623K6379m6399a5968k16870e8657q690k48150R04a06343G3129P8899d07874
12521F5756d7906D2603f4158A09259J11568C8759R5316B9342J09359Q9487b45378
12509D9681J80771a68271J8645H9820a31036j03673F6223g8320A21404e4295l1077
12498h5372j9586I6434a41903H9343a0772n787A04897C2090A0335P9045J70719
12487B60099q3892k065G0762K2600A7120L23585j09346p6704f5090D14285b4126
$$ y = [391880, 55529, 261166, 278255, 716585, 61226, 353015, -35601, -161706, -151499, -85534, -253074, -24385, -12082, 48114, 57942, -69265, -6873, -281972, -170814, -208857, 297074, -9077, -29946, 109703, 205864, 230820, 74566, 39552, 341260, 89462, -73962, 57519, -78239, -53623, -27244, -73643, -15968, -232838, -58657, -67347, -315497, -314593, -106343, 73129, 152028, -407874, 65756, -47906, 42603, -64158, 109259, 220827, 38759, 134075, 29342, 138701, 228188, -245378, 49681, 230452, -168271, -149626, 89820, -131036, -234709, 66223, -78320, 121404, -54295, -85372, -104958, 96434, -141903, 89343, -10772, -16559, 104897, 32090, 10335, 89380, 260099, 176207, 174142, 70762, 93362, 17120, 340705, 231359, 154655, -65090, 414285, -24126]
12475i0113j00816G2816M6104C2232J40595a66953C274M4576O2426A6317R3777
12464A10094a15461B46023A19438b9470D9824K27566a6589F4968N5892d7145j22333
12453a69478j0258j4903B95550J38640F9233R7102d5130j11354O2453c2505D65476
12441C5166J87045g1144A54828i0441k5945b4685j77627A53310p0309K73840a26509
12429G9837i1534G5658a41938C5046P0835j1529Q5916b41516A27055d8280A6570
12417C6192K35701p5371f2542l571R12p8278A41872a75674L2706O598j55334i1205
12404a75937g3754o5113j64563h3752A14146k3323c8730j69170B22084g5038A69319
12392B902b7997k9030m0661p1207C2770q432E538O3380A5198e9418l25900A72123
$$ y = [-90113, -190929, 72816, 118920, 32232, 172827, -166953, 3274, 47850, 110276, 16317, 110094, -115461, 246023, 119438, -29470, 49824, 277390, -16589, 64968, 120860, -47145, -169478, -179736, -194639, 295550, 434190, 69233, 166335, -45130, -156484, -94031, -32505, 465476, 35166, 222211, -71144, 154828, -90441, -116386, -24685, -202312, 153310, 83001, 356841, -126509, 79837, -91534, 75658, -141938, 35046, 105881, 94352, 180268, -241516, 127055, -48280, 16570, 36192, 271893, 196522, -62542, -66113, -65201, -143479, 141872, -175674, -142968, -136370, -291704, -91205, -175937, -73754, -138867, -303430, -83752, 114146, 90823, -38730, -207900, 222084, -75038, 169319, 2902, -27997, -57027, -97688, -168895, 32770, 24338, 5538, 68918, 15198, -59418, -385318, 172123]
12379A97728d09413C63127M970A51182O1138H4956a0574o8492A51444e484B774
12367H5922g4625A33583b7091I5454K75586C0935d3363c906B1189J36543b54357
12355C52252A01993l2914M139a87343f7927j26262f9054B82974H0823L8442Q4326
12344B03591J1181j06687a64603A31098a49997k9842A07742a50455B2875K37866
12334B60741P3651a23988r6007L4119p675A76886a29659A83881b7150A17366a57322
12322A36161p238E998h0809A37027J85819F6345a07059a4655j3567j47369p9220
12311b54811B96265c05296A1345b3059C35908j30529r3852a11655E7451K41194
12301B98645A38582k3934g9401G4604O3165M8729j3803b65252G22R4805a20617
$$ y = [197728, -409413, 363127, 368097, 151182, 212320, 84956, -10574, -79066, 151444, -5484, 2774, 85922, -74625, 133583, -27091, 95454, 371040, 30935, -43363, -3906, 21189, 157732, -254357, 352252, 101993, 69079, 73218, -187343, -67927, -194189, -69054, 282974, 80823, 119265, 203591, 214772, 108085, -164603, 131098, -149997, -179839, 107742, -150455, 22875, 260741, 334392, -123988, -219995, -185876, -193551, 176886, -129659, 183881, -27150, 117366, -157322, 136161, 128923, 5998, -80809, 137027, 322846, 66345, -107059, -14655, -28222, -175591, -254811, 296265, -305296, 11345, -23059, 335908, 205379, 111527, -111655, 57451, 298645, 138582, 114648, -79401, 74604, 137769, 186498, 172695, -265252, 722, 95527, -120617]
12289A38848J82987c6554D5753O8615i4413B00982J2976b10341B0845N474b00085
12277E6931a8434B47049K6358f6924B49640g5353l09700B12404r564m5581K0073
12266A77332N4338o238M6812a3630l35546B29590d41559B0354i8014F1626J84936
12255B46562A07229M4305c14206A838b0180C5024N3607J48454e844k8469A7837
12243d3498q4792I2972P661K03532j48140D1134M0665a20065q4762A04680l3039
12232G1641b9508B91618j13301l8987l8465J62518A19143i2959B09076D1462f7812
12220C941c12975A09322b4523A0288K7064J26227K37495A02010c310B34903e4381
12208B42501H0609Q4143i9403l8798a5504B0485J9982b2733E28455j27740h7910
$$ y = [138848, 321835, -36554, 45753, 114368, -94413, 200982, 213958, -210341, 20845, 26319, -200085, 56931, -18434, 247049, 273407, -66924, 249640, -75353, -385053, 212404, 202840, 157259, 177332, 231670, 225432, 272244, -13630, -349176, 229590, -441559, 20354, -98014, 61626, 246562, 107229, 151534, -314206, 1838, -20180, 35024, 88631, 237085, -5844, -34313, 17837, -43498, -128290, 92972, 100633, 304165, 156025, 41134, 81799, -120065, -204827, 104680, 71641, -29508, 291618, 178317, 139330, 100865, 263383, 119143, -92959, 209076, 41462, -67812, 3941, -312975, 109322, -24523, 10288, 37352, 163579, 401074, 102010, -3310, 234903, -54381, 242501, 80609, 164752, -99403, -138201, -15504, 20485, 40467, -22733, 528455, 400715, -87910]
12196B04147a18295B11701J06376j06283K03125A781i5423b3373A72888a29608
12185I9177J35971r957o4144l6618Q6273b46120D12465j5153k9017a99628Q6598
12174a13030E4945a5356E2109R2776K52028J0328A26988R2478a75272P9208A29161
12162B30995d5717n9707c7995k515A33437e0226o2404A04036J31721e5479C11425
12150a62008L812I4931J59881o0750A5318b26606B75346R076A25187I170b5551
12138B15696C5587K60846I1881A9125K37081b94305H3563d7581C32303H9889N6197
12127A46086F444a57999J3716D2705j8205l965a19498j23592L3348a2027k40468
12116b52495b3444n1296j52868G9900J41260a5556G5572A1913P8490a83144A41236
$$ y = [204147, -118295, 211701, 318077, 211794, 414919, 1781, -95423, -23373, 172888, -129608, 99177, 235148, 225191, 161047, 124429, 210702, -246120, 412465, 397312, 368295, -199628, -113030, 54945, -15356, 52109, 144885, 396913, 407241, 126988, 219466, -175272, -96064, 129161, 230995, -45717, -105424, -37995, -40510, 133437, -50226, -112630, 104036, 235757, -55479, 311425, -162008, -158196, 94931, 254812, 194062, 15318, -226606, 275346, 284422, 125187, 9170, -25551, 215696, 35587, 296433, 91881, 19125, 256206, -294305, 83563, -47581, 332303, 89889, 146086, 6444, -157999, -144283, 42705, 24500, 20535, -119498, -243090, -209742, -12027, -252495, -23444, -74740, -227608, 79900, 221160, -15556, 75572, 11913, 90403, -183144, 141236]
12104A34434P6952b45878B0448P044b59739r2154I5197R2342b03726A37370d6495
12092g2471B19707b54730B14618E1238O3818L41718b7383K256k80903L5365A9496
12080a09135n8534h1151B35352R990d6262m2420C2998b04770B1501a09768L4249
12069g5519C40449A60707D6201J17101b71052B3078J04375E0625J14501F3574
12058a02146A04143a58272A65090Q08761L78869B33621J00924r3993F8720a5764
12047A42944A3106a8688k47571A83201F6137J67013i5106K9839B56160g5220I043
12035a84631n2526E250J19958l5713b44567F1644a55667C54601d97702A21943
12024F826a63890C58262C1735a6064l1644j85750l3325H8489j3252k4001J8476
$$ y = [134434, 211386, -245878, 20448, 27492, -259739, -351893, 95197, 187539, -203726, 137370, -46495, -72471, 219707, -254730, 214618, 51238, 115056, 456774, -27383, -25127, -306030, -270665, 19496, -109135, -167669, -81151, 235352, 245342, -46262, -88682, 32998, -204770, 21501, -109768, -75519, 340449, 160707, 46201, 163302, -271052, 23078, 127453, 50625, 165126, 63574, -102146, 104143, -158272, 165090, 973851, 1352720, 233621, 334545, 240552, 68720, -15764, 142944, 13106, -18688, -266259, 183201, 66137, 233150, -95106, -65267, 256160, -75220, 9043, -184631, -237157, 5250, 125208, 89495, -244567, 61644, -155667, 354601, -497702, 121943, 6826, -163890, 358262, 31735, -16064, -47708, -233458, -266783, 88489, 75237, 51236, 69712]
12013F9712a80744o8965L8130A7193J47199q0224d849j98699D3328d0758J2898
12002b7860A17418b3583m782A57282b31369A46205a60181O0677L88A09293J1766
11991A21059a37704j7627L5634e8685A80211b16302A34117a88552q5395g071m66177
11980d73248a61583M8104c5172n6401D3289Q8919a21924A95626D4521a39163N680
11969a33483A14356b85711i5242j64525d7965E516c07389R5259A45884b83791
11958a98466h7190k6739A26307A5454L1632a97694A14285a32647A9041L9304k0219
11947C8126N3230k2276J13868l4234f8742I952J163m03M688h4756A04345B7514
11934h0837k7199E7132g3067b2726A63335d1281C22801b06365F1394k9155c30775
$$ y = [69712, -180744, -249709, -211579, 17193, 164392, 84168, -4849, -203548, 43328, -40758, -27860, 117418, -23583, -28365, 157282, -231369, 146205, -160181, -99504, -99116, 109293, 121059, -137704, -155331, -119697, -58685, 180211, -216302, 134117, -188552, -273947, -7071, -473248, -161583, -113479, -35172, -91573, 43289, 132208, -121924, 195626, 44521, -139163, -133483, 114356, -285711, -95242, -259767, -47965, 5516, -307389, -212130, 145884, -283791, -198466, -87190, -113929, 126307, 15454, 47086, -197694, 114285, -132647, 19041, 58345, 38126, 91356, 69080, 182948, 148714, -68742, 9952, 11115, 10712, 15400, -84756, 104345, 27514, -80837, -108036, 57132, -73067, -22726, 163335, -41281, 322801, -206365, 61394, 32239, -330775]
11922C89774a854l827m5908C4237a5526j88048c796j87836b5578n2286A81303
11910h1785A14497e9119j19672b9102C8153e6792B76325a34982b4344C72370a3027
11898a18950j11394G0020B1224a39184c4659L814j39292N761j16470d5129r6476
11887a41605H5264K5092n3528J36949J00518p8674a65515G6887J0557e1502j3960
11876f5462r4958o2885D5858j6643a62595q0592P8769j51691c8467r4145k03620
11865c36232B45642c96227B99680A16532c24984C53840b83750H3879J66157i7456
11854a79219N2374k14152a22113a8812J078C0410L2995a26585A00043I857i2315
11842f7982B01841d2534F1427J41553a74609R889F2059c34930a19894B93890a07510
$$ y = [389774, -1854, -5681, -51589, 34237, -15526, -203574, -3796, -191632, -25578, -77864, 181303, -81785, 114497, -59119, -178791, -29102, 38153, -56792, 276325, -134982, -24344, 372370, -13027, -118950, -230344, 70020, 21224, -139184, -34659, -30845, -170137, -164376, -280846, -45129, -141605, 85264, 110356, 56828, 193777, 294295, 215621, -165515, 76887, 87444, -51502, -65462, -160420, -223305, 45858, 29215, -162595, -243187, -164418, -316109, -38467, -132612, -336232, 245642, -396227, 299680, 116532, -324984, 353840, -283750, 83879, 250036, -97456, -179219, -126845, -340997, -122113, -18812, -17734, 30410, 63405, -126585, 100043, 9857, -92315, -67982, 201841, -42534, 61427, 202980, -174609, -164720, 62059, -334930, -119894, 293890, -107510]
11830b57167B83238B145J30525J7289a77896f0288A02849a88455P2427k1769m2166
11819a79963h0860k1879d6099j63305A86084p9414C266b10906P1619e6836E0816
11807i3781k97549D8112J3910g0981I9380e6822j0213b4913j33624A42584A1657
11795G6298e0571l14261G5392J22008b4305A790a87863k67953a42782H6869c916
11783g4113a5419j33790c9788l63749A79833E5856L09577a57582A62766b56470
11772h5551n010B14532a39180A97603K6399c57501J64118j1641b717j87236J8519
11761a71434f2994j66439B13917c05106H5991b27244o1359c2841j60242I3449
11750d9646p9516r6554O8873G9192O0357l0545a88523J669j28245I5155c0651
$$ y = [-257167, 283238, 2145, 132670, 149959, -177896, -60288, 102849, -188455, -116028, -137797, -179963, -80860, -102739, -46099, -209404, 186084, 106670, 3266, -210906, -139287, -56836, 50816, -93781, -391330, 48112, 62022, -70981, 99380, -56822, -67035, -24913, -158537, 142584, 11657, 76298, -50571, -364832, 75392, 197400, -24305, 1790, -187863, -455816, -142782, 86869, -3916, -74113, -15419, -149209, -39788, -403537, 179833, 55856, 365433, -157582, 162766, -256470, -85551, -90561, 214532, -139180, 197603, 224002, -357501, -193383, -205024, -2717, -189953, -171434, -62994, -229433, 213917, -305106, 85991, -227244, -288603, -32841, -193083, 93449, -49646, -129162, -225716, -156843, 79192, 139549, 109004, -188523, -186854, -315099, 95155, -30651]
11738b31151I5946P9140C0343O8593i9074M3215r7705F8939d25270G5233b56821
11726i8389j23049A19593b9659C7598f9842n2780M3194b9131k48319e7786b8517
11714G4721c89629D52895A33160L76836a34716E58596h6262H8341c51236a6028
11703d5887A06168J38580i4691F2094F187a63161a9014p5683D1536a12913M2798
11692g0115D814K14466p0580f3234j45562a3928j5040p5961A68293p1719p372
11681H9202g7963A8015M5455a452p988n6637A25772J7305a74533G8068B235a46786
11668b51512E8125b84685j13629D1134a6193j23595l9932d0718o3362j36486A04914
11656d5447a0458p9802C53990g3110B4561K22951g9187n47184a30931M7442G4102
$$ y = [-231151, 95946, 175086, 30343, 98936, -99074, -55859, -153564, 68939, -425270, 75233, -256821, -98389, -221438, 119593, -29659, 37598, -69842, -122622, -79428, -29131, -277450, -57786, -28517, 74721, -389629, 452895, 133160, 509996, -134716, 558596, -86262, 88341, -351236, -16028, -45887, 106168, 244748, -94691, 62094, 6187, -163161, -19014, -94697, 41536, -112913, -70115, 4814, 219280, 148700, -63234, -208796, -13928, -28968, -104929, 168293, 96574, 89202, -77963, 18015, 63470, -1452, -9440, -66077, 125772, 143077, -174533, 78068, 2235, -146786, -251512, 58125, -284685, -398314, 41134, -16193, -139788, -179720, -40718, -104080, -240566, 104914, -45447, -10458, -90260, 353990, -73110, 24561, 247512, -79187, -626371, -130931, -83489, 74102]
11644D4267g6511B65344b4889A30665a13293e445B42039A3725J99006a55004j82638
11633c37642E2931h2595B68263b13900g1196g9j8235B10859G675l396J12119A70
11620b5820D8547a14417K1108G7013f8050I3195a79737M6186j9146f395q4887
11609i1282k756c9089C4578c05360c0754H894K29052b14979d1267j81347C8527
11597a18767A39280A3645i5520c1614A2359a11380d7075A13154O0110a43284I4424
11585F2433N6344m0333d01609A06842J664E3338O2279M244c9140n8180E92312
11573g742E1899a62485A83672e0648B30796D1911b49585a10605r6994H2369M2648
11562A25017b2433k46015j39153C83477a76892e4394I4858h2908l3757F4822a22952
$$ y = [44267, -76511, 265344, -24889, 130665, -113293, -5445, 242039, 13725, 212731, -155004, -337642, 52931, -82595, 268263, -213900, -71196, -79, -18314, 210859, 7675, 4279, 116398, 170, -25820, 48547, -114417, -93309, 77013, -68050, 93195, -179737, -133551, -152697, -6395, -91282, -94038, -39089, 34578, -305360, -30754, 8894, 237946, -214979, -41267, -222614, 38527, -118767, 139280, 13645, -95520, -31614, 12359, -111380, -47075, 113154, 173264, -143284, 94424, 62433, 118777, 78444, -401609, 106842, 108506, 53338, 115617, 119861, -39140, -97320, 592312, -7742, 51899, -162485, 183672, -50648, 230796, 41911, -249585, -110605, -207599, 82369, 125017, -22433, -268448, -407601, 383477, -176892, -54394, 94858, -82908, -116665, 64822, -122952]
11550b9679G4700D549b63720h9919H0830b58172l0367A37330a03943J2885A88050
11538d9229l05022b7350k68432A63126o0483K61J21060a86442C27544b78513I0111
11526A82893n7114n5821K98702F7972b90695a05681A41906o0655K11792B9230
11515F2463h4376D26830A20152M69253a44008A24988n3077O4517a42444F2644
11504d8495j84715C32146i4254G288P3923a56211P6665B28585g98B42541J43747
11493C86288n0556D9121J09505J79390b1154B17532d9209r7153D7820Q3501D090
11481A79060K02047c4014H0661d0611H145f0396B55456c2808j19219C7363L69420
11470D06783A04507J08590f5409C78881b46329A79523N4842A06113j8394N0908
$$ y = [-29679, 74700, 4549, -263720, -89919, 80830, -258172, -288539, 137330, -103943, -91058, 188050, -49229, -354251, -27350, -295782, 163126, 102643, 102904, 223964, -186442, 327544, -278513, 90111, 182893, 125779, 69958, 368660, 67972, -290695, -105681, 141906, 81251, 293043, 29230, 62463, -84376, 426830, 120152, 589405, -144008, 124988, 71911, 136428, -142444, 62644, -48495, -233210, 332146, -94254, 7288, 81211, -156211, -79546, 228585, -798, 242541, 386288, 335732, 49121, 158626, 338016, -21154, 217532, -49209, -146362, 47820, 131321, 4090, 179060, 381107, -34014, 80661, -40611, 8145, -60396, 255456, -32808, -152027, 37363, 406783, 104507, 213097, -65409, 378881, -246329, 179523, 234365, 106113, 87719, 138627]
11460A38627K0934a0657B5628R6280d3808G8965b11887C49966p0862r4381D9000
11448a27115K835p5077E034R682N9577a09368j55358F8976a941A9979a26278A59186
11435A27396B4678e0428E8511k0540e4329C05065G0735B5614J69484a02856j5842
11424a18698M9144C063K9325K44018b4484q2625C16428m3664J1482p9414r2500
11413A12332J7252j1518c47293A22961J0723c41150J50837f0671C8973K9042d3741
11401i6206D1598O3628g5853H5078J89204n6397B7188P2457a72091G9655K7007
11390A06662d2787k8411D69907D0572m891A1341b25274H5261N6144b7291B26035
11378A9467c87145a89410r9104P1256i4202A44425b04872m9275h3874J0081c5673
$$ y = [138627, 159561, -10657, 25628, 121908, -43808, 78965, -211887, 349966, 279104, 184723, 49000, -127115, -124280, -199357, 5034, 14716, 74293, -109368, -264726, 68976, -1941, 19979, -126278, 159186, 127396, 24678, -50428, 58511, 37971, -54329, 305065, 70735, 25614, 195098, -102856, -118698, -69554, 3063, 32388, 276406, -24484, -107109, 316428, 272764, 284246, 204832, 112332, 129584, 118066, -347293, 122961, 133684, -341150, -190313, -60671, 38973, 68015, -43741, -96206, 41598, 105226, -75853, 85078, 274282, 217885, 27188, 99645, -172091, 79655, 106662, -42787, -71198, 469907, 40572, 35681, 11341, -225274, 85261, 141405, -27291, 226035, 19467, -387145, -189410, -288514, -217258, -94202, 144425, -204872, -254147, -83874, -73793, -35673]
11366C17054I1523B2758a26058G0181b7510n0042l7536B15414b29534a9757r2455
11355a12212A76560J7569q9332b1602k5654l968k41812i0271k7522J6176j3597
11344a15214B16825q3632D6070b67918A51850A2055J42268h7869C7219K06203
11334B43422a18887A63302R1207e1589j41572F3718a06498j88801f9490A07894
11323a18362A17281B5056j1113K38286D7791M6090J14552B153i1438c2905C6909
11311e5764k8570k10005A25971G271e9165C2153a13931n9100B25241c3770B65671
11299A09118f3768C9338J28777R8052b94384e657m45018b07821p7213a10559n708
11288a16267K4464I3422b50163B9746b39941A44699a73426d2099A14088f7144
$$ y = [317054, 91523, 22758, -126058, 70181, -27510, -77552, -115088, 215414, -229534, -19757, -112212, 176560, 194129, 104797, -21602, -47256, -51224, -293036, -90271, -117793, -101617, -115214, 216825, 133193, 46070, -267918, 151850, 12055, 154323, -87869, 37219, 243422, -118887, 163302, 254509, -51589, -193161, 63718, -106498, -295299, -69490, 107894, -118362, 117281, 25056, 13943, 252229, 47791, 93881, 208433, 2153, -91438, -32905, 36909, -55764, -84334, -294339, 125971, 7271, -59165, 32153, -113931, -173031, 225241, -33770, 265671, 109118, -63768, 39338, 168115, 266167, -294384, -5657, -450675, -207821, -285034, -110559, -116267, -91803, 93422, -250163, 29746, -239941, 144699, -173426, -42099, 114088, -67144]
11277g5062r1198e7496I0352a98008R4095M5159C7989A7803H027K52682b98274
11265B86656a91744C1808e9096J9342H4088a81086g8036C258e2714P832J0926
11254c3956p1966h57j8242A68216l0892b41741B72186j06327D0864J6976i817
11242a84290A45858i6347A56360R2724A7154h1969j98931J35097l5481A58325
11231A63961B7595b27850j46391B9516K05556a75002C5394O922F249g4881A9213
11219a13751D3220k332N9132d96577b19844C2402a41889k7507A13497c82526a40545
11207A71559D1460h9162H8734c22655h8826B67649f6895I1669Q3216E569b86549
11195a3967k6516H4929M9307a69665j05099J23914k15420a26568k56612A63156
$$ y = [-75062, -166260, -57496, 90352, -198008, -103913, -58754, 37989, 17803, 8027, 260709, -298274, 286656, -191744, 31808, -59096, -39754, 84088, -181086, -78036, 3258, -52714, -44882, -33956, -105922, -857, -19099, 168216, 137324, -241741, 272186, 165859, 40864, 57840, -9817, -184290, 145858, -96347, 156360, 249084, 17154, -81969, -280900, -145803, -181284, 158325, 163961, 27595, -227850, -374241, 29516, 235072, -175002, 35394, 42316, 6249, -74881, 19213, -113751, 43220, 40888, 100020, -496577, -219844, 32402, -141889, -169396, 113497, -382526, -140545, 171559, 41460, -89162, 88734, -322655, -88826, 267649, -66895, 91669, 174885, 5569, -286549, -13967, -40483, 84929, 134236, -169665, -274764, -150850, -366270, -126568, -383180, 163156]
11184A23668b06575h9491A41592n5025b96915A97304F4168L2705b6832k36116
11174b62948i3660a7542A73749a21534f0583B797c67129h444j65226o684G3790
11162a69974b4792H5391K02705j03690a41648j00838r3121J13130O9365A98488
11151h7930F529a7561C2893J08570d3522B26273q5298e6858o5688M6463k9476
11140a05559a5617C395a57976e2432D9998j0780R816a44824A45176a0176G9733
11128a50681l4976O0214B30280J85345C6492J18986J2703b66487Q8193a0423A60573
11116a977B31248J87768A14853i9583d458D77836B11410J77471F9742J64585j13941
11105A20386J6575h7322G1811P4014C1314J0425L2863J94335d1377A95526A36
$$ y = [123668, -206575, -89491, 141592, 86567, -296915, 197304, 64168, 96873, -26832, -262948, -93660, -17542, 173749, -121534, -60583, 2797, -367129, -8444, -173670, -180354, 73790, -169974, -24792, 85391, 288096, 184406, -141648, -242486, -335607, -222477, -153112, 198488, -87930, 6529, -17561, 32893, 141463, -43522, 226273, 140975, -56858, -122546, -76083, -105559, -15617, 3395, -157976, -52432, 49998, 39218, 49034, -144824, 145176, -10176, 79733, -150681, -185657, -125443, 230280, 415625, 36492, 155478, 168181, -266487, -178294, -10423, 160573, -1977, 231248, 419016, 114853, -99583, -4458, 477836, 211410, 388881, 69742, 234327, 120386, 136961, -87322, 71811, 145825, 31314, 41739, 74602, 268937, -41377, 195526, 136]
11093b22317C30735j60558D4780N7195k1201a23581A03103M14988F128J57726
11083A63854a28174A7543g6514D65087b680A52118l8348B5772K35298K21131A25125
11071A94435K82240C4840K22999m1582L2925J22187j74882J39749J66717j50689
11061C52264A36907P72029D13297j54417K28868B42307K73608K17992l64959M74158
11051H43106l86187K65423k35370n908o5299O4527K8262J95933n8254J40607k07718
11040E79122m0708J96743k60483J53945J11939n9112P3729R8385l52513J70743
11030F71790J9124j72050M8829j50533L09356o0306k4403j17032J16723M8762
11020F90260r2513L79J21160k30659M5552j98686L84932l40138M53124j36667
$$ y = [-222317, 330735, 170177, 44780, 101975, 80774, -123581, 103103, 518091, 6128, 163854, -128174, 17543, -76514, 465087, -2680, 152118, 113770, 25772, 261070, 482201, 125125, 194435, 476675, 34840, 257839, 216257, 249182, 371369, 196487, 336236, 502953, 352264, 136907, 908936, 413297, 258880, 487748, 242307, 515915, 733907, 368948, 843106, 456919, 722342, 486972, 481064, 415765, 480292, 508554, 704487, 646233, 786840, 579122, 538414, 735157, 474674, 628619, 740558, 681446, 755175, 853560, 501047, 671790, 690914, 518864, 567693, 417160, 726516, 666210, 641807, 524775, 641498, 690260, 597747, 598126, 719286, 488627, 534179, 335493, 720425, 380287, 833411, 696744]
11010F96744j08982j7878j53474j45076n8399J05783L73100j24121J5410p0058
11000E13049O3426L6263K45476l28535J21457j69515J32102J70811k05160J79277
10990G58651K34407m87584J12258Q2849N5811o7840L29089J39132l30437q2117
10980G44219J25733M52330j61756K77818O5502N22159q727L14158K37989k1168
10970B548257L40608r36610K14644m00538o9119l59544j69554J95298k48393Q5125
10960A200174j46959l37208L79635l62220M54562k63300m46560R2284O0823C02681
10949E46348A90172L36079n3921l4478e0173C2375K18844C2789K32296N2268n7801
10938B59552p1047r0335c2665B03368i3846A26734B6700f0830B28825Q2326o2677
$$ y = [696744, 587762, 569884, 416410, 271334, 212935, 318718, 691818, 567697, 583107, 513049, 576475, 612738, 858214, 529679, 651136, 481621, 613723, 784534, 579374, 758651, 993058, 505474, 617732, 700581, 756392, 688552, 1017641, 1156773, 826336, 744219, 869952, 1322282, 1160526, 1438344, 1503846, 2026005, 2017278, 2331436, 2569425, 2548257, 2888865, 1952255, 2166899, 1766361, 1697242, 1337698, 1168144, 1363442, 1115049, 1200174, 1053215, 716007, 1095642, 733422, 1187984, 924684, 478124, 570408, 631231, 302681, 546348, 190172, 526251, 472330, 437852, -50173, 32375, 251219, 32789, 265085, 317353, 259552, 188505, 98170, -32665, 203368, -93846, 126734, 26700, -60830, 228825, 311151, 248474]
10927B48474a29465l8341A94676I0245B9226a32464j01052g2641C32a80611I0971
10915C37348a87217h4597F9079b17056r0634a12921a8394k17203a11286A50455
10904a0150m4510B11808n1060c9442G4576l3502d8540C84637a37753F1102J70401
10893B31503a53278j20250J07644e3843A77110f1786k4099c3821l3580D02274
10882a91321F2742h1188r4239J8740g7016k9151m00682G3621P0839b8961B33529
10870A98160j2716J0694b36942J02633f2658p6122q2750h9479F9399a0723C82699
10858H4036a53495o8778k00378a42500A25527a48661L4793G617f9294j29138M3998
10847a54434A64214e2190b3987j03378j4557e5681B7454a66673d6113A02252a37906
$$ y = [248474, -129465, -167806, 194676, 90245, 29226, -132464, -233516, -72641, 332, -180611, 90971, 337348, -187217, -84597, 69079, -217056, -307690, -112921, -18394, -235597, -111286, 150455, -10150, -54660, 211808, 160748, -39442, 74576, 41074, -48540, 384637, -137753, 61102, 231503, -153278, -273528, -165884, -53843, 177110, -61786, -85885, -33821, -67401, 402274, -191321, 62742, -81188, -175427, -156687, -77016, -106167, -506849, 73621, 144460, -28961, 233529, 198160, 185444, 196138, -236942, -134309, -62658, -138780, -221530, -89479, 69399, -10723, 382699, 84036, -153495, -222273, -422651, -142500, 125527, -148661, -113868, 7617, -69294, -198432, -154434, 164214, -52190, -23987, -127365, -141922, -55681, 27454, -166673, -46113, 102252, -137906]
10835D62962A423c45832d8022D1351J5515b20126f3047B88886i3637A23394m5204
10824G8190c52081A84348B4172c20115A33704F1693a50874A0040J63737h7427
10813A06955j4131a8240j76879e9357O90B13715e7574C06845H528b42839I2848
10801c20812A92604Q451a00196H0204N12210h8978G5834J32683r2836k5036e0967
10789b13305g1692a518j64185Q1605J1993F479P679g3084A37336d72944J91728
10778b81216f3295k63401A32258n7175a18479I5817H040J44500a92261A73128
10767b12380A24388E8568d03205A73759a55936C6001a15306a5962k8767j4862
10757e9591i247B8865K1686b17411q659B7160b1270C16289r1711a36030L7707
$$ y = [462962, 1423, -345832, -48022, 41351, 56866, -220126, -63047, 288886, -93637, 123394, 78190, -352081, 184348, 24172, -320115, 133704, 61693, -150874, 10040, 173777, -87427, 106955, 92824, -18240, -195119, -59357, -58667, 213715, -57574, 306845, 8528, -242839, 92848, -320812, 192604, 201055, -100196, 80204, 592414, -88978, 75834, 208517, 115681, 90645, -50967, -213305, -71692, -1518, -165703, -84098, -72105, 6479, 14158, -73084, 137336, -472944, -281216, -63295, -326696, 132258, 75083, -118479, 95817, 8040, 152540, -192261, 173128, -212380, 124388, 58568, -403205, 173759, -155936, 36001, -115306, -15962, -44729, -59591, -9247, 28865, 50551, -217411, -226070, 27160, -21270, 316289, 224578, -136030, -98323]
10746i8323B1372J32682F4243K35266c85013J90436b0608m22812D64108a27073
10735g9186p4628D4667a24185A86341a24876k69131k3863a65666j13313N7819
10725b21160N4911j42796Q503B07368a60301l41223i3207A00132a03870k4556
10715a28426j8836j16324J26221O0132J8582k24453h2898l39487a34464b0905
10704H7767f4855a6820k44357C249K68127G4733f0723H4885a43989j2195I2766
10692F4613f0738A49501D2596f3793G5758K79749h2350j60309m2195B86461C9921
10680b0623k14496E1124M1062J90379h5777K9015A65507d0309A33505C1721g5091
10668F8219B3214o849i3038C5243J3888b1600A84434n1172h8399j74138c8967
$$ y = [-98323, 21372, 154054, 64243, 299509, -385013, -194577, -20608, -443420, 464108, -127073, -79186, -153814, 44667, -124185, 186341, -124876, -394007, -417870, -165666, -278979, -221160, -166249, -309045, -300542, 207368, -160301, -501524, -93207, 100132, -103870, -128426, -147262, -263586, -137365, -77233, -58651, -283104, -82898, -422385, -134464, -20905, 87767, -64855, -16820, -261177, 3249, 271376, 74733, -60723, 84885, -143989, -156184, 92766, 64613, -60738, 149501, 42596, -63793, 75758, 355507, -82350, -242659, -284854, 286461, 39921, -20623, -235119, 51124, 92186, 282565, -85777, -56762, 165507, -40309, 133505, 31721, -75091, 68219, 23214, 16365, -93038, 35243, 49131, -21600, 184434, 133262, -88399, -262537, -38967]
10656i3328l90453c261j67748G4867J18873A9180J2748i2568F5719J89942g5262
10644f413q5331m7431k3810A04528a23786C933b76168Q1270F4050a11311C2928
10632a63457O8063j77450M8195K1388j19515h713m55609a10729A48230l1304e2470
10620I4127a07428j04904C710c64545b8337D82180a02888j36253B26671B1266
10609A09785l2029C8473K94851a53683B1996J58936P1026A2635i5336k04968C73163
10597h8393F9677g6742c0667H627a08464A25151f5479k83641B15210b66892O404
10586b60488J07344r7878a7492o3711L2078k60812a1240C8407K59543I3518f1685
10574A15907b40751J6460R1357o5093P4981A94064b00976I2213J8734K6164i8122
$$ y = [-93328, -483781, -3261, -171009, 74867, 193740, 19180, 31928, -92568, 65719, 255661, -75262, -6413, -91744, -139175, -162985, 104528, -123786, 3933, -276168, -194898, 64050, -111311, 32928, -163457, -95394, -272844, -224649, -203261, -322776, -8713, -464322, -110729, 148230, 116926, -52470, 94127, -107428, -212332, 3710, -364545, -28337, 482180, -102888, -239141, 226671, 21266, 109785, 77756, 38473, 333324, -153683, 21996, 180932, 251958, 12635, -95336, -300304, 373163, -88393, 69677, -76742, -30667, 8627, -108464, 125151, -65479, -349120, 215210, -266892, -260488, -153144, -251022, -17492, -81203, -49125, -309937, -11240, 38407, 297950, 93518, -61685, 115907, -240751, -224291, -132934, -198027, -123046, 194064, -200976, 92213, 110947, 137111, -98122]
10562i4783p6875L9244I7585K5026E1048c81660P4149B51176I4172a77462D74697
10550a0507o6829A33250B004J98875i7136l22770J90308H4323a60193N9116l74921
10539d75998B08369H3517a26571C228b54681j50254A78986p7836b35658d088A90727
10527f2608j35255R7884j46794K2276R0880N8070A74477J72550b13215i6439B251
10515E1198b6421B5983J97706b67009h5334H0129a06295k97215A04529b39986
10504A25699a91105N4144D3653b83157f7269A32108b42431i3100d6433A12607
10493e3913p0167D8090c25018a04677p9869e0457p4272B6968R6836C0948b15815
10481b8876a3971n3662A46761b67643D021J43671f3634j52251A65811i8511d0765
$$ y = [-94783, -171658, -132414, 97585, 122611, 51048, -381660, -307511, 251176, 94172, -177462, 474697, -10507, -77336, 133250, 2004, 200879, -97136, -419906, -229598, 84323, -160193, -101077, -475998, 208369, 83517, -126571, 3228, -254681, -404935, 178986, 101150, -235658, -4088, 190727, -62608, -197863, -99979, -246773, -224497, -133617, -75547, 174477, 347027, -213215, -96439, 2251, 51198, -26421, 25983, 223689, -267009, -85334, 80129, -106295, -403510, 104529, -239986, 125699, -191105, -136961, 43653, -283157, -67269, 132108, -242431, -93100, -46433, 112607, -53913, -124080, 48090, -325018, -104677, -184546, -50457, -124729, 26968, 123804, 30948, -215815, -28876, -13971, -67633, 146761, -267643, 4021, 147692, -63634, -215885, 165811, -98511, -40765]
10469G3020b85212J10547B03790D0351a86376O6789B00551M9646a80236B61485
10458b766k22762d7963B04542h1525j12623F0201J132g0071C890J49306b07990
10446A7314a72281A274a44471G6765f2440j58501b2725l7497C03953j29581d33733
10434b45791F7047a19712c2221l1864K592G3446J45572h3819A82048a31435j96388
10423c27823C41394G9444L76793G8288a13777j16327J03792F684a9958A0483J86163
10412A96646J2039F478f4564B09411g7635l56197a53156B38805H8688J9648g6731
10400e03593C42978F8574K5071a265F0387q615b9834C60169r4409q6596C550R9582
10388A03132M7730H712J28877B4549b2044N967j13418A28032N5964H6792K15469
$$ y = [73020, -285212, -174665, 203790, 40351, -186376, -119587, 200551, 250197, -180236, 261485, -2766, -225528, -47963, 204542, -81525, -194148, 60201, 61333, -70071, 3890, 153196, -207990, 17314, -172281, 1274, -144471, 76765, -62440, -220941, -22725, -60222, 303953, 174372, -433733, -245791, 67047, -119712, -32221, -64085, -61493, 73446, 219018, -83819, 182048, -131435, -327823, 341394, 79444, 456237, 78288, -113777, -230104, -126312, 6684, -19958, 10483, 196646, 208685, 6478, -64564, 209411, -77635, -433832, -153156, 238805, 88688, 108336, -76731, -503593, 342978, 68574, 93645, -1265, 60387, 51772, -29834, 360169, 265760, 179164, 3550, 103132, 150862, 8712, 137589, 24549, -22044, -16077, -129495, 128032, 183996, 86792, 302261]
10377C02261J56678R8747B48046j8420K6810j4741R2104L2613j05542Q3929K60455
10366F05254j72767q7992l64M3388j16566j05817i0888D59032C4524a79815b6174
10354C19609j50281J63240m2924M29592j35561L4634l2900c5742B61978j2204
10344B49774J23009j84491H8322P1402k1064K36369H5412M7261m8790C1976L67926
10333C99902g8442a1129m6958A03276J31712b87567E8260d3357A46270J26467
10323B72737j8927n3531J03884A20832k4711c3511D15063e7100A19830d63558
10312D9301g0300j43466A82174a05181j12399a5502l06075A47717a32898A45513
10301e6303k1026j03205B2522D016e9977A38475a277L95A84051c4249j19721C3956
$$ y = [302261, 458939, 557686, 248046, 229626, 256436, 241695, 333799, 366412, 260870, 344799, 605254, 432487, 344495, 344131, 387519, 270953, 165136, -90888, 459032, 34524, -179815, -26174, 319609, 169328, 332568, 289644, 719236, 583675, 618309, 585409, -35742, 261978, 249774, 372783, 188292, 88322, 159724, 138660, 375029, 85412, 132673, 83883, 31976, 399902, -78442, -11129, -58087, 103276, 234988, -287567, 58260, -43357, 146270, 272737, 253810, 200279, 304163, 120832, 96121, -33511, 415063, -57100, 119830, -463558, 49301, -70300, -213766, 182174, -105181, -217580, -15502, -321577, 147717, -132898, 145513, -56303, -77329, -180534, 22522, 4016, -59977, 138475, -1277, -882, 184051, -34249, -153970, 33956]
10288a44699A8419a15643B95K27228b43630N1335A27051d77129g819q7063o2727
10277a57609f3965F5979a93508d7368j35343A31067a90293R4085A06305b65233
10266e8541j70199A56838g407j23406M7599H4724M37782G1572b48213D30320j26103
10255C04217q8111K3298I6340O785L10278h1283b2564I7004J13072F5464a8369
10243c91403J72313A04617c8296A31036a24140k59939a6422A58714b55214f7264
10232a35412A22756B4845a32309A93306a46453k60075B30096I1874K66872b94866
10221B4648a10468E7573P1323a62089b2421m6154c4028r1847A1524b53394k23437
10210d76831f2723B87727A42892o1367f5330B76578c76121A05648K0526k7119
$$ y = [-144699, 18419, -115643, 295, 227523, -243630, -192295, 127051, -477129, -7819, -94882, -157609, -63965, 65979, -193508, -47368, -182711, 131067, -190293, -96208, 106305, -265233, -58541, -228740, 156838, -7407, -130813, -83214, 84724, 522506, 71572, -248213, 430320, 304217, 216106, 239404, 96340, 103125, 413403, -81283, -22564, 97004, 210076, 65464, -18369, -391403, -219090, 104617, -38296, 131036, -124140, -384079, -16422, 158714, -255214, -67264, -135412, 122756, 24845, -132309, 193306, -146453, -406528, 230096, 91874, 358746, -294866, 24648, -110468, 57573, 128896, -162089, -22421, -68575, -34028, -125875, 11524, -253394, -476831, -62723, 287727, 142892, 81525, -65330, 276578, -376121, 105648, 126174, 99055]
10200I9055a18030o0974H1797b7250n5878k48507e2839F436d5634k53104A77265
10188a60205j2478I7572D1571j6430b02899P3702l74055A80022M6487g4417m0988
10177a15405I297b19278p399A22904b78002a11371M2124l43261h6762A24215b20774
10165F5591j3929a32667J3719B31774c9017l07027J60374j65745B261a35839j86132
10154c21971A00724l0597a77481D1271a06953D26826A08525m7973f7077H4156
10143A29258c000r7643j09918A31951A6956b33610a05436A76290a21887m7402
10133a69289O4427m2299j75607a22470N776J7636q1899c8912a9138p6925k84929
10122c80992A60218b42196C8649c15163F6120P2786a00039A12538b5879B2590
$$ y = [99055, -118030, -179004, 81797, -27250, -83128, -331635, -52839, 6436, -45634, -298738, 177265, -160205, -172683, 97572, 41571, 25141, -202899, -129197, -503252, 180022, 226509, -74417, -115405, 9297, -219278, -226677, 122904, -278002, -111371, -69247, -412508, -86762, 124215, -220774, 65591, 51662, -132667, -118948, 231774, -39017, -346044, -185670, -351415, 2261, -135839, -321971, 100724, 70127, -177481, 41271, -106953, 426826, 108525, 60552, -67077, 84156, 129258, -3000, -100643, -210561, 131951, 16956, -233610, -105436, 176290, -121887, -169289, -104862, -147161, -322768, -122470, -116694, -99058, -180957, -38912, -19138, -96063, -380992, 160218, -242196, 38649, -315163, 66120, 138906, -100039, 112538, -25879, 22590]
10111D9744f6083j37975j57287i6802K2403k84233A38356n635P427b25322Q0038
10100a45284A75653a54991D4896c35242A72742K32568j82232i4219B1032b67092
10089I1289a59853L8750B9739K7988e28596b04587A06395d74481B53706f6759
10078b98204H0836a11843B10691C5126c55630a33711K1408G6871Q0346E4312d21993
10066b5432B68517h0985F6828K06284J19928b31477A1712a625l02726a21869j08934
10055b30803J6452A8828a20216b859F1414J13394k7518e2287j6256k57516J02434
10044b23625J10899F3770c02744C12041m7944b80372E4942O3689J0725b91513
10033H4203a76369B37376E1123a00347j18494e6215a0898j56320k66377H8223
$$ y = [49744, -66083, -204058, -361345, -96802, -74399, -358632, 138356, 132721, 140148, -225322, -145284, 175653, -154991, 44896, -335242, 172742, 405310, 223078, -94219, 21032, -267092, 91289, -159853, -121103, 29739, 57727, -528596, -204587, 106395, -474481, 253706, -66759, -298204, 80836, -111843, 210691, 35126, -355630, -133711, -112303, 76871, 157217, 54312, -421993, -25432, 268517, -80985, 66828, 273112, 393040, -231477, 11712, -1625, -304351, -121869, -230803, -214351, 18828, -120216, -2859, 61414, 174808, 147290, -52287, -68543, -326059, -223625, -112726, 63770, -302744, 312041, 264097, -280372, 54942, 118631, 129356, -291513, 84203, -176369, 237376, 51123, -100347, -218841, -56215, -10898, -167218, -433595, 88223]
10022b06031F3907A7440F084J37409a11962N1640K1736j49104l5150D00509a30859
10010i3366E1890n274A80f0861r816o5290H637i3714p8717h3694l8068E5427J48119
9997B03546b03704A03392a21911F0875d11431E3718a22138B42198a52595p0551
9987b23146G8949J37513h2182k73328a1481k34051P5178c1330j31080O4473A2642
9975A6148a27216j57638a2931D4316a5571A1459a54591f3050A60191b0056A12145
9963A75986b48274D4972k0183d9969G1053b37728j38667I8324b72165J9107F1131
9951a33988j13965d5450j36571j52028a49943o5987A09880c586j6544j62624K3812
9940a58942e6884H2058e4732E1557a57941B7849a65742F9732a43364j26277m0858
$$ y = [-206031, 63907, 17440, 6084, 143493, -111962, -60322, -38586, -187690, -222840, 400509, -130859, -93366, 51890, 46616, 180, -60861, -70677, -135967, 8637, -93714, -172431, -83694, -121762, 55427, 203546, -203704, 103392, -121911, 60875, -411431, 53718, -122138, 242198, -152595, -223146, 78949, 216462, -82182, -355510, -11481, -245532, -170354, -31330, -162410, -97937, 12642, 16148, -127216, -284854, -12931, 44316, -15571, 11459, -154591, -63050, 160191, -20056, 112145, 175986, -248274, 44972, 24789, -49969, 71053, -237728, -376395, 98324, -272165, -253058, 61131, -133988, -247953, -45450, -182021, -334049, -149943, -215930, 109880, -3586, -20130, -182754, -158942, -56884, 82058, -54732, 51557, -157941, 27849, -165742, 69732, -143364, -269641, -310499]
9929c10499k074A21298j8512l3328g2717F3011l503b67230A65697g8784k06423
9918b85207J40196G98g067A21263a46853N0414d6647p5562o1750c0483j92734
9907b23217P3816B00433p7324b01727b6760m3776l22438J35461B21607a4646C02866
9895B7249j3486a48451C440a50672B56781i8253j4444E5798d13346h5619N007
9884h0612m1448c6514k16942b4918B89828c21278P4231Q1588j49624i2048j4380
9873a06428A18515C8733a62434K4477k31454a0160B4508J84922m9174B8621J21950
9862A50571i6023b3179G368b46698A77092n3123n7482b20645B12277r6350O3011
9851A78938a91980J4390F4257g3017B25656b72569J6965Q8939q3206E1998a94524
$$ y = [-310499, -312573, 121298, 102786, 69458, -72717, 63011, 59508, -267230, 165697, -78784, -285207, -145011, 798, -7067, 121263, -146853, -96439, -46647, -122209, -183959, -30483, -223217, -149401, 200433, 123109, -201727, -26760, -70536, -392974, -257513, 221607, -14646, 302866, 27249, 13763, -148451, 3440, -150672, 256781, -98253, -112697, 55798, -413346, -85619, -80612, -122060, -36514, -253456, -24918, 289828, -321278, -247047, -165459, -315083, -92048, -106428, 118515, 38733, -162434, -137957, -369411, -10160, 24508, 209430, 160256, 28621, 150571, -96023, -23179, 7368, -246698, 177092, 123969, 66487, -220645, 212277, 115927, 178938, -191980, -177590, 64257, -73017, 225656, -272569, -255604, -166665, -249871, 51998, -194524]
9839b32644c4009l01143a66866k3916L7689B78751a7574o963C9204N133J6526
9828F0863M8906b5883A11829C5957a32913B40952c51472J47105C29369b84199
9817A82219n9077E6319b34815A6510a53291k38431d0774j92336A29063c0515B24093
9805a6257j91872a8479A52442d7862k27407K7580I5542b46157A4871h3993C7044
9793B61823m5329N4255A8693K25371I3758b09094D4662c7526D74853a43609B89111
9781C0757b35927a06834k0942c2045D5358e0986k38183G6521J91739A5152h9126
9769E9644b08767O7314d2376r1276n9740O7123n2032A66811K40327A47306b00541
9757E7140b1738E604e6797A5808a21512k69823C30477A04871J537L0568J00020
$$ y = [-232644, -34009, -335152, -166866, -190782, -153093, 278751, -17574, -24537, 39204, 44337, 60863, 109769, -25883, 111829, 35957, -132913, 240952, -351472, -204367, 329369, -284199, 182219, 123142, 56319, -234815, 16510, -153291, -391722, -40774, -233110, 129063, -30515, 224093, -16257, -208129, -18479, 152442, -47862, -275269, -247689, 95542, -246157, 14871, -83993, 37044, 261823, 216494, 270749, 18693, 244064, 93758, -209094, 44662, -37526, 474853, -143609, 289111, 30757, -235927, -106834, -127776, -32045, 45358, -50986, -289169, 76521, 268260, 15152, -89126, 59644, -208767, -141453, -42376, -133652, -193392, -126269, -178301, 166811, 407138, 147306, -200541, 57140, -21738, 5604, -56797, 15808, -121512, -391335, 330477, 104871, 106408, 136976, 236996]
9746B36996b44504A67239a61642N8980k64707A03989N0196J43826G5026f1702
9735b737C0815a68332N9057G9115c92307c566E6383c07862c0065C3363a49305
9723C4124a26090q9289B0408b44563J00289m2625A17599b35594f6301j97218A27256
9711A21616a38442M6148m0160H2804h3775c4821A54949D9605a19412A35356b8309
9699I34a09104l03838c0980k7909C9980a05181J4112Q568p680p646G6503b2471
9686A55783d5480D9712B1690b63955J13838c5056E3772H77L046O7502b92971N8679
9674b34292R941G9179d1850A11553D245i408l24998A37731J8470a34838m855j38395
9662b78088a07418C4409g8884A13273D0891b35072I6052b04220j98808O1005a16118
$$ y = [236996, -244504, 167239, -161642, -102662, -367369, 103989, 154185, 298011, 75026, -61702, -2737, 30815, -168332, -109275, 79115, -392307, -3566, 56383, -307862, -30065, 33363, -149305, 34124, -126090, -215379, 20408, -244563, -144274, -186899, 117599, -235594, -66301, -263519, 127256, 121616, -138442, -92294, -132454, 82804, -83775, -34821, 154949, 49605, -119412, 135356, -28309, 934, -109104, -412942, -30980, -58889, 39980, -105181, -91069, -82501, -90181, -97827, 76503, -22471, 155783, -45480, 49712, 21690, -263955, -150117, -35056, 53772, 877, 3923, 71425, -292971, -234292, -224351, 79179, -41850, 111553, 4245, -9408, -334406, 137731, 156201, -134838, -139693, -278088, -107418, 34409, -78884, 113273, 40891, -235072, 96052, -204220, -403028, -342023, -116118]
9650A43127K99506b81038A17051f31119Q932b51904C0955J6067f9931k80033D5755
9638a68204A51342E155N1090g632k05856A35342a67791a9564A09630H059K55624
9627B63683f1878J1898l2073p810J4250E2493K33827a56098b9695k42885a35038
9615a84206A9427K49069c0014G2258Q1596m1295J96741b83316H7046c3181l1811
9604f4992G3097b45340f9100b72k77832A84248e6421k02652D0290b18241i52A51774
9591A51700C3742K9521J89962b08629g888I1431b31711h4628j4182A0430J77933
9580A88363c20825F4703a22893f1399h993A11733b24619d6919j46278j6653j23184
9569c33034P3696A98127a10437j54463i0139A25117a21258j63519A42416a11674
$$ y = [143127, 442633, -281038, 117051, -631119, -622187, -251904, 30955, 47022, -69931, -349964, 45755, -168204, 151342, 5155, 56245, -7632, -213488, 135342, -167791, -19564, 109630, 8059, 263683, -61878, -49980, -82053, -89863, -75613, 52493, 286320, -156098, -29695, -272580, -135038, -184206, 19427, 268496, -30014, 72258, 153854, 112559, 309300, -283316, 87046, -33181, -64992, 73097, -245340, -69100, -272, -278104, 184248, -56421, -259073, 40290, -218241, -952, 151774, 151700, 33742, 63263, 253225, -208629, -7888, 91431, -231711, -84628, -98810, 10430, 188363, -320825, 64703, -122893, -61399, -8993, 111733, -224619, -46919, -193197, -209850, -333034, -259338, 198127, -110437, -264900, -90139, 125117, -121258, -284777, 142416, -111674]
9558b90431a23505q7677A40355a34149k5421N4539I1583a52917a2985j70843f550
9546a85094j14440A4681c42362C5380c66377B58516A0881c25727R9759N2087m2815
9535b16696C4566A322J20870a38089j57904A20202K27H196M4575c24764F9416
9523H2926c24830a15206o6114A26453a37402r2815O2281d0402m8496l7937B0514
9511a99416E2853b77729D2384e0419l06592a43899A09655b29202A42967f1705
9500a17236A08746k412a72371d32H4262n257g8811D47533k04808a15311j094j76620
9488b93025i9146m2782j66894m9003A85302n9495i0239n2676A33038b27133e5327
9476C27707f555n6842k43483G1643a41798A50982a44200j13524q422j49660B8052
$$ y = [-290431, -123505, -211182, 140355, -134149, -159570, -105031, 91583, -152917, -12985, -183828, -6550, -185094, -299534, 14681, -342362, 35380, -366377, 258516, 10881, -325727, -225968, -173881, -216696, 34566, 1322, 122192, -138089, -295993, 120202, 120429, 8196, 52771, -324764, 69416, 82926, -324830, -115206, -181320, 126453, -137402, -230217, -167936, -40402, -88898, -126835, 20514, -199416, 52853, -277729, 42384, -50419, -357011, -143899, 109655, -229202, 142967, -61705, -117236, 108746, 106334, -172371, -432, 84262, 79005, -78811, 447533, 242725, -115311, -116405, -293025, -99146, -141928, -308822, -357825, 185302, 125807, -90239, -142915, 133038, -227133, -55327, 327707, -6555, -63397, -306880, 71643, -141798, 150982, -144200, -257724, -266146, -415806, 28052]
9464A90537J57142m7514q2651F7414f2873q1862A0689J13201b24952B77014A5522
9452b05848c6850q0262k44556L5262A07193a75671g8189J7500j36642P6683D4863
9440g0949j76931G4879Q4071J04364r3550b73729j68965a27096B29525i3462O930
9429h6532I5071K5803b22399B5402f0252j32409A54515a80663B9744d4531j24606
9418a69137N242O2685G4869d3704A5957a14157k267j64244h9894B9039N1766b2215
9405A33923a23223A39994m0166m2751e4545j16777I0418d54538B84718a6728D3705
9393B37158J3824A17458c5131G0559e0235A23824c5722B63413j08013b0120k82720
9382c02840G3058c65112E1000M5408a62259m1129A62542a7750C6535K58306o1256
$$ y = [190537, 347679, 300165, 217514, 67414, -62873, -144735, 10689, 123890, -224952, 277014, 15522, -205848, -36850, -117112, -361668, -326406, 107193, -175671, -78189, -60689, -197331, -120648, 44863, -70949, -247880, 74879, 158950, 263314, 169764, -273729, -442694, -127096, 229525, -93462, -86532, 95071, 120874, -222399, 25402, -60252, -192661, 154515, -180663, 29744, -44531, -169137, -163895, -101210, 74869, -43704, 15957, -114157, -116424, -280668, -89894, 29039, 80805, -22215, 133923, -123223, 139994, 99828, 57077, -54545, -171322, 90418, -454538, 284718, -16728, 43705, 237158, 250982, 117458, -35131, 70559, -50235, 123824, -35722, 263413, 155400, -20120, -302840, 73058, -365112, 51000, 96408, -162259, -203388, 162542, -17750, 36535, 294841, 233585]
9371B33585l987b85765R3041e6387I7409b06231A25039a36985j51911a03826A27657
9359A4237a78587r905f6627A3873c1866H2700a47946A74907A3836Q838K6324f4098
9346a51771P0466l2152j89912B18481e4897J0445D9222a42195f2661r2506L0164
9335a25003j48435C8586e1444j17752H9715p015M6940b76773h0970D0643a62267
9323c4416p9724j17217i272B52843a32739B59263a18658E7964I768P7857P2806
9312A60431a88935d0796m1710A96158h0918m89605A75020a8037l38283J70464
9302a85856A05386a22366C47015D3956b17458d2112A05299J29904f5311k11204
9292b76515O3233a02192j43677C5346d06023i7384q3081N5878M6723j1787j45952
$$ y = [233585, 229598, -285765, -192724, -56387, 97409, -206231, 125039, -136985, -288896, -103826, 127657, 14237, -178587, -188492, -66627, 13873, -31866, 82700, -147946, 174907, 13836, 22674, 48998, -64098, -151771, -81305, -113457, -303369, 218481, -54897, -44452, 49222, -142195, -62661, -155167, -125003, -273438, 38586, -51444, -169196, 89715, 82700, 129640, -276773, -80970, 40643, -162267, -34416, -114140, -231357, -9272, 252843, -132739, 259263, -118658, 57964, 9768, 87625, 160431, -188935, -40796, -82506, 196158, -80918, -570523, 175020, -18037, -356320, -185856, 105386, -122366, 347015, 43956, -217458, -42112, 105299, 235203, -65311, -276515, -213282, -102192, -245869, 35346, -406023, -97384, -180465, -124587, -77864, -89651, -235603]
9281b35603C07889A46439a10441K2607p3438K3111B11669I6048b46557K8611c3883
9269A15729a60278E406a41421E1780d3811o3484H7671l6953b56023m2636B40618
9257I9684i239j90331d7943q8300l56896C07345j25659c29512A05819f0345j1144
9246g1489k7532R049F7581i7441B67931B4761J78479N5595F4481J29980b1922
9234c69047a42709A6027J62370e0932l269r6876A18227B868e7576q4454a0553
9222A00172a09883p7365q6968h7850j13954Q852l5818e0431A435b85569J02483
9211a83086J37a4966H1065N2586a97640C6227a5629A77887o5267C0482c99982
9199B77248a15332D5032b92073i466A50374F0606a17730k7026a9499C1139b52830
$$ y = [-235603, 307889, 146439, -110441, -87834, -161272, -138161, 211669, 96048, -246557, -217946, -33883, 115729, -160278, 5406, -141421, 51780, -43811, -107295, 87671, 50718, -256023, -298659, 240618, 99684, -9239, -199570, -47943, -136243, -493139, 307345, 181686, -329512, 105819, -60345, -71489, -99021, -89972, 67581, -97441, 267931, 24761, 203240, 258835, 64481, 194461, -21922, -369047, -142709, 16027, 178397, -50932, -54201, -151077, 118227, 2868, -57576, -142030, -10553, 100172, -109883, -187248, -274216, -87850, -201804, -192952, -228770, -50431, 1435, -285569, -183086, -182949, -14966, 81065, 133651, -197640, 36227, -15629, 177887, 112620, 30482, -399982, 277248, -115332, 45032, -292073, -9466, 150374, 60606, -117730, -144756, -19499, 31139, -252830]
9187a20101a2557E7454d5973p5615j62144a18544k92010n315i0400k74296i9930
9175f8974j11228h3561A0791b38188H3612b7901F4428A3042f7998j87922j58042
9164d13962d8472j83969D68969k31912n6039G2009b06237j08073A15911M4672
9154A60583a93664d1321j85454O8431k8217B591K82109a15411j98261B96265a22120
9142G8782a95912A44292a65184g2773A36569a38125l44128a7708A35562d3277
9131a88565P3884e0875d756E5399P9678a36782A13927j4988a72708J9094C91990
9119A08811a45677A7500M0923a44522F8969R1299d09049A64270b60942a07840
9108a90353B61974b34195P0458b4900m9933r5637A57402b6574j63594B33618K7592
$$ y = [-120101, -12557, 57454, -45973, -121588, -283732, -118544, -410554, -415869, -90400, -364696, -99930, -68974, -180202, -83561, 10791, -238188, 83612, -27901, 64428, 13042, -67998, -255920, -413962, -48472, -232441, 468969, 237057, 181018, 72009, -206237, -314310, 115911, 160583, -193664, -41321, -226775, -158344, -186561, 2591, 284700, -115411, -313672, 296265, -122120, 78782, -195912, 144292, -165184, -72773, 136569, -138125, -482253, -17708, 135562, -43277, -188565, -114681, -50875, -4756, 55399, 135077, -136782, 113927, 98939, -172708, -153614, 391990, 108811, -145677, 17500, 58423, -144522, 68969, 160268, -409049, 164270, -260942, -107840, -190353, 261974, -234195, -163737, -24900, -74833, -170470, 157402, -26574, -190168, 233618, 261210]
9097B61210c09116k4868I0392A2044b21720D738a05827M9709F6394D139a66784
9085c51100b566E6031J37674l0617K4351p9170b27010J7444F1420a712r3796C17182
9072a17014B3207a57113M47M0238a6817E4475a41533c7624j34831q0453h4268
9060A73282F4048k2962c36259a04849A0027f7824q3652K4385A58078G8351h0912
9048C09144a73358K2794A16073a60099M5726G2357A4242f0886j75015e4157l9118
9037i3275G3940R0965b47743C31512h9734A7878d78693K17787L7782G3440f2402
9025a94162n9471a19478j1340M8833I7242A5873c80496f0257j93158G9894c47530
9013C32882d9878k36816e6476A9271J38809b1052B7797O3002A0493d11931d9212
$$ y = [261210, -309116, -333984, 90392, 12044, -221720, 4738, -105827, -56118, 66394, 4139, -166784, -351100, -2566, 56031, 193705, 163088, 187439, 108269, -227010, -209566, 61420, -1712, -95508, 317182, -117014, 23207, -157113, -156666, -116428, -16817, 54475, -141533, -37624, -172455, -252908, -84268, 173282, 64048, 41086, -336259, -104849, 10027, -67824, -151476, -127091, 158078, 78351, -80912, 309144, -173358, -150564, 116073, -160099, -114373, 72357, 14242, -60886, -235901, -54157, -93275, 73940, 164905, -247743, 331512, -89734, 17878, -478693, -260906, -223124, 73440, -62402, -194162, -253633, -119478, -130818, -81985, 97242, 15873, -380496, -60257, -253415, 79894, -347530, 332882, -49878, -286694, -56476, 19271, 158080, -21052, 27797, 90799, 10493, -411931, -49212]
9001f2239q7244A00908a51064n0625L6757H7144i3697D7069h4019l71689B7373
8989c9585A17653a30063L22M8243j19256C1617a53929j47557l1373J22811k0877
8978b30925b1478B73284c3473m873j25787F8116g9165A289M4716d0081j64356
8967b04437d9605B492K22473a36367I6661c35295A3930J8830K468h5612k916A84313
8954a55381A35429B2775b7646j28241e6620j05449N9623d4581D8842J61687c47797
8942a86504G7391A3926a93834c3395A60558a97750A75418O9881F8794Q0491h9557
8930g2234C7998a15921j11617B35744a34769C49725K52448R30257M886441j734305
8920D684566A202492E61889A24935b1014B69487E97d3649j18304D6313b07653
$$ y = [-62239, -149483, 100908, -151064, -201689, -164932, 87144, -93697, 47069, -84019, -455708, 27373, -39585, 117653, -130063, -129741, -81498, -200754, 31617, -153929, -301486, -332859, -210048, -230925, -21478, 273284, -33473, -38346, -164133, 68116, -79165, 1289, 46005, -40081, -204437, -49605, 2492, 224965, -136367, 96661, -335295, 13930, 32760, 35228, -85612, -88528, 184313, -155381, 135429, 22775, -27646, -155887, -56620, -162069, -102446, -44581, 48842, 210529, -347797, -186504, 77391, 13926, -193834, -33395, 160558, -197750, 175418, 245299, 68794, 149285, -89557, -72234, 37998, -115921, -227538, 235744, -134769, 349725, 602173, 1532430, 6418871, 4684566, 1202492, 561889, 124935, -21014, 269487, 597, -43649, -161953, 46313, -207653]
8909D5980a23662A37748h9438k9030j40282C58924a01734L8515j19786L5412G609
8897g9582A03636l0594e3637d27q4605k6613n30493A71407a31817K7851B0459
8885f0834k3578o469j5021B02552b4533P463j2112m5097G2882K68646b85026a8419
8872H9046b19784B64320F2279a58685n2327K6762K9573j51462D19903D674M2940
8861D7614l034K58388E6066K82334j55899c306l31605a48870a253k58078C2897
8849E9441f8612j68314A66885e72195a82464j17879C23354A43143a3896l49718
$$ y = [45980, -123662, 137748, -89438, -118468, -258750, 358924, -101734, -63219, -183005, -147593, 7609, -79582, 103636, 73042, -53637, -427, -85032, -111645, -642138, 171407, -131817, -103966, 20459, -60834, -84412, -90881, -105902, 202552, -24533, -17070, -29182, -74279, 72882, 341528, -285026, -18419, 89046, -219784, 264320, 62279, -158685, -211012, -184250, -154677, -306139, 419903, 4674, 47614, 44580, 302968, 56066, 338400, 182501, -3306, -334911, -148870, -1253, -259331, 32897, 59441, -68612, -236926, 166885, -572195, -182464, -300343, 323354, 143143, -13896, -363614]
$$ [...]
##END NTUPLES=NMR SPECTRUM
##END=
