
##TITLE=AC1252_TOGORS11070_6642121_2JXIggf4cC
##JCAMPDX= 6.0         $$ Bruker NMR JCAMP-DX V2.0
##DATA TYPE= NMR SPECTRUM
##DATA CLASS= NTUPLES
##ORIGIN= BRUKER
##OWNER= Administrator
$$ 1.72 TOPSPIN		Version 2.1
$$ 2012-08-08 17:06:36.031 -0500  Administrator@TOPSPIN
$$ Compression mode = diff/dup
##.OBSERVE FREQUENCY= 400.02188249412
##.OBSERVE NUCLEUS= ^1H
##.ACQUISITION MODE= SIMULTANEOUS (DQD)
##.ACQUISITION SCHEME= undefined
##.AVERAGES= 64
##.DIGITISER RES= 22
##SPECTROMETER/DATA SYSTEM= spect
##.PULSE SEQUENCE= noesygpps1d.comp
##.SOLVENT NAME= COFFEE_meoh
##.SHIFT REFERENCE= INTERNAL, COFFEE_meoh, 1, 14.96257
##AUDIT TRAIL= $$ (NUMBER, WHEN, WHO, WHERE, PROCESS, VERSION, WHAT)
$$ ##TITLE= Audit trail, TOPSPIN		Version 2.1
$$ ##JCAMPDX= 5.01
$$ ##ORIGIN= Bruker BioSpin GmbH
$$ ##OWNER= Administrator
$$ $$ C:\Bruker\TOPSPIN/data/COFFEE/nmr/AC1252_TOGORS11070_6642121_2JXIggf4cC/12/pdata/1/auditp.txt
$$ ##AUDIT TRAIL=  $$ (NUMBER, WHEN, WHO, WHERE, PROCESS, VERSION, WHAT)
(   1,<2012-08-08 17:06:30.906 -0500>,<Administrator>,<TOPSPIN>,<go>,<TOPSPIN 2.1>,
      <created by zg
	started at 2012-08-08 16:54:56.562 -0500,
	POWCHK enabled, PULCHK disabled,
       configuration hash MD5:
       6B 1B 68 BB D9 2E 58 E2 7F 35 AD 54 07 DF 0E 41
       data hash MD5: 64K
       0A 6D F0 DE 9B 1D 7B 05 F1 4F AD D4 4E 07 61 FD>)
(   2,<2012-08-08 17:06:33.843 -0500>,<Administrator>,<TOPSPIN>,<proc1d>,<TOPSPIN 2.1>,
      <Start of raw data processing
       efp LB = 0.3 FT_mod = 6 PKNL = 1 PHC0 = 0 PHC1 = 0 SI = 128K 
       data hash MD5: 128K
       54 22 B9 24 27 E7 3B B9 5E EA 6A 72 6B 3B 33 00>)
(   3,<2012-08-08 17:06:35.078 -0500>,<Administrator>,<TOPSPIN>,<proc1d>,<TOPSPIN 2.1>,
      <pk PHC0 = -0.6866455 PHC1 = 0 
       data hash MD5: 128K
       6B 00 BC F5 D7 68 98 DF C1 81 E4 6F 57 04 58 3C>)
(   4,<2012-08-08 17:06:35.687 -0500>,<Administrator>,<TOPSPIN>,<proc1d>,<TOPSPIN 2.1>,
      <abs ABSG = 1 
       data hash MD5: 128K
       B3 37 12 7D BC 69 57 AD 11 1C B5 E1 1F A8 CA 6C>)
(   5,<2012-08-08 17:06:35.765 -0500>,<Administrator>,<TOPSPIN>,<proc1d>,<TOPSPIN 2.1>,
      <abs ABSG = 2 
       data hash MD5: 128K
       0D 78 80 F9 35 9F FC 66 EF E3 13 58 BD 11 F5 2E>)
(   6,<2012-08-08 17:06:35.828 -0500>,<Administrator>,<TOPSPIN>,<proc1d>,<TOPSPIN 2.1>,
      <abs ABSG = 3 
       data hash MD5: 128K
       8E 4B 78 0A A5 FC DD 20 13 7C 34 E3 60 56 71 AF>)
(   7,<2012-08-08 17:06:35.906 -0500>,<Administrator>,<TOPSPIN>,<proc1d>,<TOPSPIN 2.1>,
      <abs ABSG = 4 
       data hash MD5: 128K
       17 A9 1D 95 DE 69 FE 4D 1D 51 FD B6 AB 39 01 E8>)
(   8,<2012-08-08 17:06:35.953 -0500>,<Administrator>,<TOPSPIN>,<proc1d>,<TOPSPIN 2.1>,
      <abs ABSG = 5 
       data hash MD5: 128K
       6E 3C F2 1D C7 B5 79 1F BB 04 5C 16 40 58 EA 87>)
$$ ##END=
$$ 
$$ $$ hash MD5
$$ $$ A6 DF 51 80 17 2F 37 59 5D BD 93 A6 CC DD 31 DB
##$RELAX= 
##$RELAX= 
##$RELAX= 
##$RELAX= 
##$RELAX= 
##$RELAX= 
##$RELAX= 
##$RELAX= 
$$ Bruker specific parameters
$$ [...]
##$TP07= 0
##$TPNAME0= <>
##$TPNAME1= <>
##$TPNAME2= <>
##$TPNAME3= <>
##$TPNAME4= <>
##$TPNAME5= <>
##$TPNAME6= <>
##$TPNAME7= <>
##$TPOAL= (0..7)
0.5 0.5 0.5 0.5 0.5 0.5 0.5 0.5
##$TPOFFS= (0..7)
0 0 0 0 0 0 0 0
##$TUNHIN= 0
##$TUNHOUT= 0
##$TUNXOUT= 0
##$USERA1= <user>
##$USERA2= <user>
##$USERA3= <user>
##$USERA4= <user>
##$USERA5= <user>
##$V9= 5
##$VALIST= <valist>
##$VCLIST= <CCCCCCCCCCCCCCC>
##$VD= 0
##$VDLIST= <DDDDDDDDDDDDDDD>
##$VPLIST= <PPPPPPPPPPPPPPP>
##$VTLIST= <TTTTTTTTTTTTTTT>
##$WBST= 1024
##$WBSW= 4
##$XGAIN= (0..3)
0 0 0 0
##$XL= 0
##$YL= 0
##$YMAX_a= 15948217
##$YMIN_a= -8964813
##$ZGOPTNS= <>
##$ZL1= 120
##$ZL2= 120
##$ZL3= 120
##$ZL4= 120
##$ABSF1= 14.96257
##$ABSF2= -5.595612
##$ABSG= 5
##$ABSL= 3
##$ALPHA= 0
##$AQORDER= 0
##$ASSFAC= 0
##$ASSFACI= 0
##$ASSFACX= 0
##$ASSWID= 0
##$AUNMP= <proc_prof1d_extract.lims>
##$AXLEFT= 0
##$AXNAME= <>
##$AXNUC= <1H>
##$AXRIGHT= 0
##$AXTYPE= 0
##$AXUNIT= <>
##$AZFE= 0.1
##$AZFW= 0.1
##$BCFW= 0
##$BC_mod= 0
##$BYTORDP= 0
##$COROFFS= 0
##$CY= 15
##$DATMOD= 1
##$DC= 0
##$DFILT= <>
##$DTYPP= 0
##$F1P= 0
##$F2P= 0
##$FCOR= 0.5
##$FTSIZE= 131072
##$FT_mod= 6
##$GAMMA= 0
##$GB= 0
##$INTBC= 1
##$INTSCL= 1
##$ISEN= 128
##$LB= 0.3
##$LEV0= 0
##$LPBIN= 0
##$MAXI= 10000
##$MC2= 0
##$MEAN= 0
##$ME_mod= 0
##$MI= 0
##$NCOEF= 0
##$NC_proc= -2
##$NLEV= 6
##$NOISF1= 0
##$NOISF2= 0
##$NSP= 0
##$NTH_PI= 0
##$NZP= 0
##$OFFSET= 14.96257
##$PC= 1
##$PHC0= -0.6866455
##$PHC1= 0
##$PH_mod= 1
##$PKNL= yes
##$PPARMOD= 0
##$PPDIAG= 0
##$PPIPTYP= 0
##$PPMPNUM= 2147483647
##$PPRESOL= 1
##$PSCAL= 4
##$PSIGN= 0
##$PYNMP= <proc.py>
##$REVERSE= no
##$SF= 400.020009010787
##$SI= 131072
##$SIGF1= 0
##$SIGF2= 0
##$SINO= 400
##$SIOLD= 131072
##$SPECTYP= <>
##$SREGLST= <1H.CDCl3>
##$SSB= 0
##$STSI= 131072
##$STSR= 0
##$SW_p= 8223.68421052631
##$SYMM= 0
##$S_DEV= 0
##$TDeff= 65536
##$TDoff= 0
##$TI= <>
##$TILT= no
##$TM1= 0
##$TM2= 0
##$TOPLEV= 0
##$USERP1= <user>
##$USERP2= <user>
##$USERP3= <user>
##$USERP4= <user>
##$USERP5= <user>
##$WDW= 1
##$XDIM= 131072
##$YMAX_p= 283228746
##$YMIN_p= -154510
##$CURPLOT= <Network HP LaserJet P1505>
##$CURPRIN= <$Network HP LaserJet P1505>
##$DFORMAT= <normdp>
##$LAYOUT= <+/1D_H.xwp>
##$LFORMAT= <normlp>
##$PFORMAT= <normpl>
##$SURQMSG= 1
$$ End of Bruker specific parameters
$$ ---------------------------------
##NTUPLES= NMR SPECTRUM
##VAR_NAME=  FREQUENCY,     SPECTRUM/REAL,   SPECTRUM/IMAG
##SYMBOL=    X,             R,               I
##VAR_TYPE=  INDEPENDENT,   DEPENDENT,       DEPENDENT
##VAR_FORM=  AFFN,          ASDF,            ASDF
##VAR_DIM=   131072,        131072,          131072
##UNITS=     HZ,            ARBITRARY UNITS, ARBITRARY UNITS
##FACTOR=    0.0627417313425164, 1,          1
##FIRST=     8223.62146879497, 609,          -51863
##LAST=      0,             2078,            -52447
##MIN=       0,             -154510,         0
##MAX=       8223.62146879497, 283228746,    0
$$ Real data points
##PAGE= N=1
##DATA TABLE= (X++(R..R)), XYDATA
$$ [...]
$$ plain form
60969 2481744 2541075 2603543 2670109 2741603 2818335 2900431 2988424 3083127 3184934 3293728 3409562
60958 3409562 3533219 3666120 3810035 3967055 4139649 4330676 4543422 4781642 5049565
60949 5049565 5352196 5695893 6088751 6540708 7063922 7673333 8386563 9223382 10205721
60940 10205721 11356979 12697895 14241115 15991529 17953582 20134799 22537087 25145907
60932 25145907 27933651 30869673 33907085 36939769 39775538 42180931 43988579 45185791
60924 45185791 45911630 46373014 46752624 47159050 47608282 48009578 48166804 47829993 46796244
60915 46796244 45004715 42564681 39705398 36687239 33722897 30935478 28357927 25964395
60907 25964395 23713320 21577818 19551545 17638919 15846458 14181542 12652913 11267991
$$ packed form
60969B481744N9331O2468O6566P1494P6732Q2096Q7993R4703J01807J08794J15834
60958C409562J23657J32901J43915J57020J72594J91027K12746K38220K67923
60949E049565L02631L43697L92858M51957N23214O09411P13230Q36819R82339
60940A0205721J151258J340916J543220J750414J962053K181217K402288K608820
60932B5145907K787744K936022L037412L032684K835769K405393J807648J197212
60924D5185791P25839M61384L79610M06426M49232M01296J57226l36811j033749
60915D6796244j791529k440034k859283l018159k964342k787419k577551k393532
60907B5964395k251075k135502k026273j912626j792461j664916j528629j384922
$$ plain form
60899 11267991 10029238 8933285 7972401 7135990 6411587 5785959 5246090 4779788 4376203
60890 4376203 4026178 3721840 3455875 3221650 3013969 2828904 2662619 2510948 2370439
60881 2370439 2239217 2116518 2001877 1895130 1796526 1706158 1623457 1547543 1477745 1413467
60871 1413467 1353995 1298850 1248021 1201439 1158599 1119106 1083118 1050705 1021155 993586 968005
60860 968005 945113 925128 907377 890982 875466 860770 847201 835332 825409 816876 808871 801136
60848 801136 794008 787702 782121 777290 773278 769712 765983 762031 758314 754933 751412 747495 743418 739152
60834 739152 734122 728117 721886 716252 711109 705826 700241 694691 689370 684243 679430 675131 671298 667840
60820 667840 665041 663309 662508 662024 661471 660965 660654 660369 659889 659330 659150 659904 661948 665233 669386 674119 679438
$$ packed form
60899A1267991j238753j095953r60884q36411p24403o25628n39869m66302m03585
60890D376203l50025l04338k65965k34225k07681j85065j66285j51671j40509
60881B370439j31222j22699j14641j06747r8604r0368q2701p5914o9798o4278
60871A413467n9472n5145n0829m6582m2840l9493l5988l2413k9550k7569k5581
60860I68005k2892j9985j7751j6395j5516j4696j3569j1869r923q533q005p735
60848H01136p128o306n581m831m012l566l729l952l717l381l521l917m077m266
60834G39152n030o005o231n634n143n283n585n550n321n127m813m299l833l458
60820F67840k799j732q01m84n53n06l11k85m80n59j80P54K044L285M153M733N319
$$ plain form
60803 679438 685381 691797 698601 705984 713984 722053 729509 736342 743128 750112 756811 762604 767283 770859
60789 770859 773214 774217 773950 772604 770321 767271 763721 759923 756079 752456 749227 746062 742219 737357
60775 737357 732065 727294 723358 719807 716179 712493 708932 705403 701692 697917 694576 692116 690583 689706
60761 689706 689123 688445 687271 685437 683281 681500 680602 680512 680748 680887 680865 680999 681823 683744 686700 690229 693986
60744 693986 698109 702964 708597 714514 719888 723934 726260 727109 727102 726593 725367 723061 719670 715384 710169
60729 710169 703895 696786 689341 681832 674203 666410 658547 650634 642673 634949 627888 621556 615636 609890
60715 609890 604177 597998 590686 582419 574477 567961 562603 557329 551700 546176 541111 536195 530963 525305
60701 525305 519298 513006 506741 501148 496659 492980 489394 485498 481450 477630 474360 471904 470401 469684
$$ packed form
60803F79438N943O416O804P383Q000Q069P456O833O786O984O699N793M679L576
60789G70859K355J003k67j346k283l050l550l798l844l623l229l165l843m862
60775G37357n292m771l936l551l628l686l561l529l711l775l341k460j533q77
60761F89706n83o78j174j834k156j781q98r0K36J39k2J34Q24J921K956L529L757
60744F93986M123M855N633N917N374M046K326Q49pn09j226k306l391m286n215
60729G10169o274p109p445p509p629p793p863p913p961p724p061o332n920n746
60715F09890n713o179p312q267p942o516n358n274n629n524n065m916n232n658
60701E25305o007o292o265n593m489l679l586l896m048l820l270k456j503p17
$$ plain form
60687 469684 469345 469172 469381 470266 471753 473537 475610 478354 482037 486446 491078 495452 499149 501982 504473
60672 504473 507801 512740 518731 524476 529432 534234 539607 545499 551569 557986 565204 573147 581104 588440
60658 588440 595209 602104 609930 618993 628820 638610 648047 657541 667594 678239 689271 700695 712550
60645 712550 724443 735675 745798 754839 763045 770711 778119 785323 791891 797097 800445 801947 801976 800971
60631 800971 799135 796240 791824 785791 778679 771166 763506 755702 747942 740484 733228 725833 718264 710938
60617 710938 704370 699005 695184 692798 691023 688948 686562 684645 683735 683767 684804 687338 691439 696231 700836
60602 700836 705466 711048 718098 726622 736851 749213 763473 778577 793730 809179 825676 843561
60590 843561 862679 882809 903578 924006 942719 958839 972427 983839 992881 998851 1001416 1001139
$$ packed form
60687D69684l39j73K09Q85J487J784K073K744L683M409M632M374L697K833K491
60672E04473L328M939N991N745M956M802N373N892O070O417P218P943P957P336
60658E88440O769O895P826R063R827R790R437R494J0053J0645J1032J1424J1855
60645G12550J1893J1232J0123R041Q206P666P408P204O568N206L348J502K9j005
60631H00971j836k895m416o033p112p513p660p804p760p458p256p395p569p326
60617G10938o568n365l821k386j775k075k386j917r10L2J037K534M101M792M605
60602G00836M630N582P050Q524J0229J2362J4260J5104J5153J5449J6497J7885
60590H43561J9118K0130K0769K0428J8713J6120J3588J1412R042N970K565k77
$$ plain form
60578 1001139 999053 995766 991111 984605 976164 966291 955582 944129 931614 918012 904030 890593
60566 890593 878009 865849 853638 841339 829197 817506 806712 797361 789580 782855 776650 771119
60554 771119 766904 764310 762998 762357 761924 761582 761773 763364 766880 771850 777322 782946 789027 795586 802040
60539 802040 808140 814611 822421 831787 842312 853788 866439 880640 896918 916108 938937 965377
60527 965377 994806 1027074 1063211 1104925 1153448 1208844 1270284 1336865 1408172 1484099 1564192
60516 1564192 1647289 1731682 1815412 1896314 1972028 2040188 2098735 2146326 2182923 2210146 2230660
60505 2230660 2246839 2259966 2270606 2279215 2286021 2290636 2292190 2289772 2282557 2269872 2251680 2228959
60493 2228959 2203285 2176087 2148644 2122628 2100056 2082538 2070853 2065350 2066504 2075008 2091537 2116476
$$ packed form
60578A001139k086l287m655o506q441r873j0709j1453j2515j3602j3982j3437
60566H90593j2584j2160j2211j2299j2142j1691j0794r351p781o725o205n531
60554G71119m215k594j312o41m33l42J91J591L516M970N472N624O081O559O454
60539H02040O100O471P810R366J0525J1476J2651J4201J6278J9190K2829K6440
60527I65377K9429L2268L6137M1714M8523N5396O1440O6581P1307P5927Q0093
60516A564192Q3097Q4393Q3730Q0902P5714O8160N8547M7591L6597K7223K0514
60505B230660J6179J3127J0640Q609O806M615J554k418p215j2685j8192k2721
60493B228959k5674k7198k7443k6016k2572j7518j1685n503J154Q504J6529K4939
$$ plain form
60481 2116476 2149682 2190599 2238807 2294422 2357601 2427638 2502837 2581336 2661874 2743999 2828154
60470 2828154 2915807 3009248 3111263 3225344 3356180 3509249 3689494 3900580 4145519 4427295
60460 4427295 4748204 5108822 5508048 5943830 6412954 6909671 7424527 7944280 8452393
60451 8452393 8929452 9353900 9703733 9959226 10105916 10136820 10053117 9863414 9582278 9228330
60441 9228330 8821675 8380853 7920601 7451480 6980876 6514083 6055032 5607106 5173868
60432 5173868 4759122 4366330 3998270 3657153 3344573 3061106 2806246 2578920 2377767
60423 2377767 2200773 2045094 1907791 1786661 1680045 1586028 1502391 1427440 1360419 1300863
60413 1300863 1247817 1199988 1156458 1116891 1081057 1048432 1018360 990498 964936 941879 921219
$$ packed form
60481B116476L3206M0917M8208N5615O3179P0037P5199P8499Q0538Q2125Q4155
60470B828154Q7653R3441J02015J14081J30836J53069J80245K11086K44939K81776
60460D427295L20909L60618L99226M35782M69124M96717N14856N19753N08113
60451H452393M77059M24448L49833K55493J46690L0904q3703j89703k81136l53948
60441I228330m06655m40822m60252m69121m70604m66793m59051m47926m33238
60432E173868m14746l92792l68060l41117l12580k83467k54860k27326k01153
60423B377767j76994j55679j37303j21130j06616r4017q3637p4951o7021n9556
60413A300863n3046m7829m3530l9567l5834l2625l0072k7862k5562k3057k0660
$$ plain form
60402 921219 902413 884783 867936 851910 836971 823324 810972 799712 789247 779401 770252 761892
60390 761892 754043 746166 738064 730181 723046 716582 710218 703559 696583 689292 681652 673926 666541 659417
60376 659417 651894 643712 635705 629039 623983 619916 616357 613360 610868 608414 605768 603393 601803 600730
60362 600730 599404 597518 595549 594127 593445 593270 593258 593188 593106 593352 594211 595440 596290 596162 595130 593785 592660
60345 592660 591931 591541 591460 591845 593055 595393 598659 602038 604658 606390 607954 610179 613284 616957 620952
60330 620952 625394 630558 636531 643096 649875 656600 663348 670474 678138 685986 693525 700832 708605 717337
60316 717337 726653 735686 743965 751670 759093 766109 772209 776837 779517 779803 777376 772360 765524 757995
60302 757995 750522 743014 734961 726413 718333 711789 706995 703375 700443 698303 697326 697688 699311 701952 705225
$$ packed form
60402I21219j8806j7630j6847j6026j4939j3647j2352j1260j0465r846r149q360
60390G61892p849p877q102p883p135o464o364o659o976p291p640p726p385p124
60376F59417p523q182q007o666n056m067l559k997k492k454k646k375j590j073
60362F00730j326j886j969j422o82j75j2p0q2K46Q59J229Q50j28j032j345j125
60345E92660p29l90q1L85J210K338L266L379K620J732J564K225L105L673L995
60330F20952M442N164N973O565O779O725O748P126P664P848P539P307P773Q732
60316G17337R316R033Q279P705P423P016O100M628K680K86k427n016o836p529
60302G57995p473p508q053q548q080o544m794l620k932k140r77L62J623K641L273
$$ plain form
60287 705225 708809 712783 717483 722842 728114 732546 736174 739632 743310 747040 750577 754011 757555 761256
60273 761256 765087 769104 773232 777065 780206 782839 785701 789419 794058 799441 805623 812786 820853 829555
60259 829555 838978 849701 862148 875977 890465 905533 922220 942029 965838 993374 1023621 1055662
60247 1055662 1089302 1125012 1163420 1204838 1249169 1295951 1344386 1393477 1442450 1491045 1539266
60236 1539266 1586843 1633050 1676938 1717561 1754082 1786007 1813369 1836451 1855266 1869531 1879164
60225 1879164 1884446 1885605 1882656 1875945 1866617 1856194 1845776 1835867 1826739 1818695 1812169 1807945 1807181 1810811
60211 1810811 1818869 1830720 1845984 1864979 1888300 1916302 1948995 1985950 2026098 2068003 2110615
60200 2110615 2153518 2196196 2237390 2275597 2309997 2340451 2366673 2387876 2403317 2412761 2416298 2414024
$$ packed form
60287G05225L584L974M700N359N272M432L628L458L678L730L537L434L544L701
60273G61256L831M017M128L833L141K633K862L718M639N383O182P163Q067Q702
60259H29555R423J0723J2447J3829J4488J5068J6687J9809K3809K7536L0247L2041
60247A055662L3640L5710L8408M1418M4331M6782M8435M9091M8973M8595M8221
60236A539266M7577M6207M3888M0623L6521L1925K7362K3082J8815J4265R633
60225A879164N282J159k949o711r328j0423j0418r909r128q044o526m224p64L630
60211A810811Q058J1851J5264J8995K3321K8002L2693L6955M0148M1905M2612
60200B110615M2903M2678M1194L8207L4400L0454K6222K1203J5441R444L537k274
$$ plain form
60188 2414024 2406165 2393237 2375874 2354669 2330414 2304328 2277765 2251796 2227337 2205491 2187373
60177 2187373 2173580 2164254 2159799 2161192 2169341 2184399 2205960 2233739 2267688 2307544 2352581 2401841
60165 2401841 2454376 2509244 2565492 2622202 2678412 2733069 2785250 2834374 2879906 2920814 2955726
60154 2955726 2983692 3004555 3018417 3025193 3024963 3018570 3007588 2993922 2979709 2967280 2958631 2954804
60142 2954804 2956096 2962957 2976425 2997686 3027517 3066290 3114359 3172341 3241069 3321220 3412768 3514796
60130 3514796 3625957 3745108 3871272 4003115 4138767 4276099 4412840 4546432 4674222
60121 4674222 4794011 4904147 5003003 5088740 5159743 5214893 5253246 5273902 5276591 5261940 5230725
60110 5230725 5183216 5119902 5042649 4954441 4857959 4755060 4647614 4538007 4428429 4320238
$$ packed form
60188B414024p859j2928j7363k1205k4255k6086k6563k5969k4459k1846j8118
60177B187373j3793r326m455J393Q149J5058K1561K7779L3949L9856M5037M9260
60165B401841N2535N4868N6248N6710N6210N4657N2181M9124M5532M0908L4912
60154B955726K7966K0863J3862O776k30o393j0982j3666j4213j2429q649l827
60142B954804J292O861J3468K1261K9831L8773M8069N7982O8728Q0151R1548J02028
60130C514796J11161J19151J26164J31843J35652J37332J36741J33592J27790
60121D674222J19789J10136R8856Q5737P1003N5150L8353K0656K689j4651l1215
60110E230725m7509o3314p7253q8208r6482j02899j07446j09607j09578j08191
$$ plain form
60100 4320238 4214615 4113565 4019844 3936003 3863730 3803770 3756047 3720028 3695373 3682137 3680030
60089 3680030 3687680 3703071 3724626 3751397 3782186 3815052 3847860 3878871 3906600 3929590 3946802
60078 3946802 3958072 3963791 3964253 3959546 3949948 3936042 3918449 3897768 3874765 3850291 3824913 3798896
60066 3798896 3772705 3747295 3723709 3702464 3683415 3665996 3649460 3633057 3616396 3599742 3583766
60055 3583766 3568946 3555332 3542987 3532526 3525014 3521278 3521393 3524733 3530379 3537492 3545501 3554085 3562823
60042 3562823 3570642 3575723 3576333 3571929 3563180 3550691 3533902 3511569 3483201 3449537 3411485 3369076
60030 3369076 3321896 3270322 3215829 3159972 3103399 3046060 2988177 2930809 2875595 2824101 2777394
60019 2777394 2736016 2700212 2670174 2646147 2628442 2617416 2613381 2616375 2626135 2642514 2665979 2697313
$$ packed form
60100D320238j05623j01050r3721q3841p2273n9960m7723l6019k4655j3236k107
60089C680030P650J5391K1555K6771L0789L2866L2808L1011K7729K2990J7212
60078C946802J1270N719M62m707r598j3906j7593k0681k3003k4474k5378k6017
60066C798896k6191k5410k3586k1245j9049j7419j6536j6403j6661j6654j5976
60055C583766j4820j3614j2345j0461p512l736J15L340N646P113Q009Q584Q738
60042C562823P819N081O10m404q749j2489j6789k2333k8368l3664l8052m2409
60030C369076m7180n1574n4493n5857n6573n7339n7883n7368n5214n1494m6707
60019B777394m1378l5804l0038k4027j7705j1026m035K994R760J6379K3465L1334
$$ plain form
60007 2697313 2736523 2782182 2832177 2885032 2940195 2997121 3054502 3110551 3163587 3212092 3254558
59996 3254558 3289768 3317073 3336038 3345962 3346265 3337342 3320427 3296389 3265143 3226664 3182310 3134621
59984 3134621 3085860 3037134 2989020 2942622 2899658 2861588 2828910 2801426 2779085 2762432 2752217
59973 2752217 2748816 2752232 2762517 2779766 2803483 2832261 2864370 2898703 2935054 2973565 3013872 3054614
59961 3054614 3093695 3129342 3161149 3189861 3215957 3238797 3257487 3272238 3284335 3294975 3304714
59950 3304714 3313991 3323538 3334247 3347286 3364524 3388194 3419822 3460031 3509701 3570595 3644242 3730678
59938 3730678 3829040 3939060 4061143 4194996 4338908 4490406 4646791 4804710 4959799 5107287
59928 5107287 5242757 5362078 5461051 5535722 5583207 5602140 5592617 5556083 5495164 5413108 5313090
$$ packed form
60007B697313L9210M5659M9995N2855N5163N6926N7381N6049N3036M8505M2466
59996C254558L5210K7305J8965R924L03q923j6915k4038l1246l8479m4354m7689
59984C134621m8761m8726m8114m6398m2964l8070l2678k7484k2341j6653j0215
59973B752217l401L416J0285J7249K3717K8778L2109L4333L6351L8511M0307M0742
59961C054614L9081L5647L1807K8712K6096K2840J8690J4751J2097J0640R739
59950C304714R277R547J0709J3039J7238K3670L1628M0209M9670O0894P3647Q6436
59938C730678R8362J10020J22083J33853J43912J51498J56385J57919J55089J47488
59928E107287J35470J19321R8973P4671M7485J8933r523l6534o0919q2056j00018
$$ plain form
59917 5313090 5198031 5070977 4935386 4794819 4652435 4510877 4372511 4239516 4113679
59908 4113679 3996342 3888790 3792670 3709764 3641349 3587857 3549149 3524907 3514737 3518130 3534384
59897 3534384 3562279 3599675 3643724 3691832 3742237 3793394 3842955 3887717 3924485 3950699 3964408
59886 3964408 3964194 3949350 3919831 3875850 3817744 3746338 3663239 3570627 3470918 3366521 3259524
59875 3259524 3151318 3042705 2934575 2828317 2725369 2626572 2532213 2442648 2358691 2281296
59865 2281296 2210971 2147528 2090420 2039395 1994761 1956830 1925099 1898195 1874746 1854125 1836266
59854 1836266 1820981 1807689 1795714 1784709 1774762 1766206 1759267 1753922 1750192 1748420 1748868 1750905 1752973
59841 1752973 1753681 1752739 1750609 1747474 1742867 1736113 1726712 1714397 1699265 1681945 1663364 1644262 1625101
$$ packed form
59917E313090j15059j27054j35591j40567j42384j41558j38366j32995j25837
59908D113679j17337j07552r6120q2906o8415n3492l8708k4242j0170L393J6254
59897C534384K7895L7396M4049M8108N0405N1157M9561M4762L6768K6214J3709
59886C964408k14j4844k9519m3981n8106p1406q3099r2612r9709j04397j06997
59875C259524j08206j08613j08130j06258j02948r8797r4359q9565q3957p7395
59865B281296p0325o3443n7108n1025m4634l7931l1731k6904k3449k0621j7859
59854A836266j5285j3292j1975j1005r947q556o939n345l730j772M48K037K068
59841A752973P08r42k130l135m607o754r401j2315j5132j7320j8581j9102j9161
$$ plain form
59828 1625101 1606376 1588642 1572234 1557292 1544077 1532926 1523824 1516474 1511040 1508429 1509390 1513617 1520177
59815 1520177 1528692 1539663 1553623 1570476 1589853 1611640 1635796 1661812 1688742 1715692 1742103
59804 1742103 1767602 1791900 1814809 1836120 1855470 1872713 1888529 1904288 1920948 1938230 1955227
59793 1955227 1971830 1989319 2009629 2034243 2063731 2098057 2137321 2182428 2235033 2296609 2367565
59782 2367565 2447579 2536688 2635488 2744046 2861098 2984743 3113539 3246424 3381680 3516464
59772 3516464 3647220 3769988 3880064 3971819 4039372 4077952 4085317 4062686 4014651 3947758 3868499
59761 3868499 3781964 3691678 3600027 3508651 3418790 3331704 3248850 3171691 3101443 3039047 2985233
59750 2985233 2940449 2904845 2878488 2861661 2854900 2858701 2873137 2897711 2931675 2974552 3026362 3087296
$$ packed form
59828A625101j8725j7734j6408j4942j3215j1151r102p350n434k611R61M227O560
59815A520177Q515J0971J3960J6853J9377K1787K4156K6016K6930K6950K6411
59804A742103K5499K4298K2909K1311J9350J7243J5816J5759J6660J7282J6997
59793A955227J6603J7489K0310K4614K9488L4326L9264M5107N2605O1576P0956
59782B367565Q0014Q9109R8800J08558J17052J23645J28796J32885J35256J34784
59772C516464J30756J22768J10076R1755O7553L8580P365k2631m8035o6893p9259
59761C868499q6535r0286r1651r1376q9861q7086q2854p7159p0248o2396n3814
59750B985233m4784l5604k6357j6827o761L801J4436K4574L3964M2877N1810O0934
$$ plain form
59738 3087296 3157348 3236442 3324819 3423031 3531582 3650933 3781902 3925665 4083022 4253808
59728 4253808 4437375 4633523 4842588 5064557 5298500 5543040 5797020 6059198 6327365
59719 6327365 6598280 6868758 7136541 7399993 7657463 7907711 8151029 8389394 8625276
59710 8625276 8860604 9096914 9335787 9578462 9825166 10075153 10327105 10578940 10827322
59701 10827322 11067904 11296214 11508051 11699215 11865541 12003601 12111318 12188070 12234728 12253732
59691 12253732 12248719 12223754 12183080 12131515 12074572 12017842 11966495 11925473 11899720 11893912 11912205
59680 11912205 11958433 12036026 12147210 12292521 12471650 12684561 12931094 13209117 13513270 13835539
59670 13835539 14166696 14496992 14815816 15111247 15370401 15580553 15730381 15810951 15816575 15745602
$$ packed form
59738C087296P0052P9094Q8377R8212J08551J19351J30969J43763J57357J70786
59728D253808J83567J96148K09065K21969K33943K44540K53980K62178K68167
59719F327365K70915K70478K67783K63452K57470K50248K43318K38365K35882
59710H625276K35328K36310K38873K42675K46704K49987K51952K51835K48382
59701A0827322K40582K28310K11837J91164J66326J38060J07717P6752M6658J9004
59691A2253732n013k4965m0674n1565n6943n6730n1347m1022k5753n808J8293
59680A1912205M6228P7593J11184J45311J79129K12911K46533K78023L04153L22269
59670A3835539L31157L30296L18824K95431K59154K10152J49828Q0570N624p0973
$$ plain form
59660 15745602 15600631 15387804 15115733 14794812 14436549 14052128 13650785 13239483 12823804
59651 12823804 12408298 11995759 11587035 11182138 10781036 10382781 9984651 9583398 9177594
59642 9177594 8768486 8359025 7952989 7554830 7169103 6799261 6447053 6112968 5796773
59633 5796773 5497772 5215373 4949753 4701492 4470524 4256036 4057502 3875115 3708930
59624 3708930 3558270 3422310 3300569 3192291 3095934 3009848 2933151 2865494 2806338 2754838
59614 2754838 2710003 2670427 2634316 2600393 2568428 2538300 2508952 2478971 2447896 2416105 2383625
59603 2383625 2349965 2315141 2279909 2244707 2209113 2172801 2136432 2101173 2067694 2035936 2005572
59592 2005572 1976410 1948646 1922976 1900180 1880438 1863319 1848522 1836216 1826517 1819160 1813983 1811298
$$ packed form
59660A5745602j44971k12827k72071l20921l58263l84421m01343m11302m15679
59651A2823804m15506m12539m08724m04897m01102l98255l98130m01253m05804
59642I177594m09108m09461m06036l98159l85727l69842l52208l34085l16195
59633E796773k99001k82399k65620k48261k30968k14488j98534j82387j66185
59624C708930j50660j35960j21741j08278r6357q6086p6697o7657n9156n1500
59614B754838m4835l9576l6111l3923l1965l0128k9348k9981l1075l1791l2480
59603B383625l3660l4824l5232l5202l5594l6312l6369l5259l3479l1758l0364
59592B005572k9162k7764k5670k2796j9742j7119j4797j2306r699p357n177k685
$$ plain form
59580 1811298 1811363 1813845 1818162 1823983 1830988 1838510 1846063 1854006 1863137 1873719 1885484 1898505 1913433
59567 1913433 1930719 1950091 1971051 1993547 2018025 2045122 2075424 2109205 2146339 2186767 2231130
59556 2231130 2280579 2335810 2396759 2463375 2536177 2615653 2701519 2793107 2890208 2993010 3101330
59545 3101330 3214485 3331865 3452997 3576927 3702063 3826878 3950362 4071556 4189073
59536 4189073 4301516 4408120 4508668 4602991 4691003 4773015 4849482 4920296 4984681 5041947 5092205
59525 5092205 5136403 5176058 5213142 5249877 5288150 5328825 5371451 5414477 5455741 5492995 5524141
59514 5524141 5547058 5559312 5558270 5541599 5507579 5455083 5383599 5293457 5185847 5062483 4925405
59503 4925405 4777063 4620251 4457642 4291488 4123950 3957498 3794676 3637505 3487215
$$ packed form
59580A811298O5K482M317N821P005P522P553P943R131J0582J1765J3021J4928
59567A913433J7286J9372K0960K2496K4478K7097L0302L3781L7134M0428M4363
59556B231130M9449N5231O0949O6616P2802P9476Q5866R1588R7101J02802J08320
59545C101330J13155J17380J21132J23930J25136J24815J23484J21194J17517
59536D189073J12443J06604J00548R4323Q8012Q2012P6467P0814O4385N7266N0258
59525E092205M4198L9655L7084L6735L8273M0675M2626M3026M1264L7254L1146
59514E524141K2917J2254j042j6671l4020n2496p1484r0142j07610j23364j37078
59503D925405j48342j56812j62609j66154j67538j66452j62822j57171j50290
$$ plain form
59494 3487215 3344466 3209686 3083408 2966434 2859495 2762619 2675214 2597149 2529346 2472767
59484 2472767 2426962 2390296 2361586 2340821 2328283 2323777 2327155 2338849 2359229 2387816 2423802 2467137
59472 2467137 2518424 2577830 2644725 2718480 2799014 2886215 2979159 3076177 3175452 3275227 3373564
59461 3373564 3468170 3556540 3636108 3704350 3758996 3798392 3821684 3828617 3819128 3793238 3751320 3694427
59449 3694427 3624249 3542826 3452379 3355277 3253822 3149889 3044811 2939643 2835382 2732913
59439 2732913 2632991 2536437 2444270 2357553 2277071 2203137 2135515 2073571 2016735 1964890 1918164
59428 1918164 1876355 1838985 1806020 1778108 1755778 1738691 1726000 1717092 1711536 1708607 1707489 1708045
59416 1708045 1710866 1716490 1724912 1735926 1749568 1765976 1785036 1806285 1829125 1853176 1878569 1905693
$$ packed form
59494C487215j42749j34780j26278j16974j06939r6876q7405p8065o7803n6579
59484B472767m5805l6666k8710k0765j2538m506L378J1694K0380K8587L5986M3335
59472B467137N1287N9406O6895P3755Q0534Q7201R2944R7018R9275R9775R8337
59461C373564R4606Q8370P9568O8242N4646L9396K3292O933r489k5890m1918n6893
59449C694427p0178q1423r0447r7102j01455j03933j05078j05168j04261j02469
59439B732913r9922r6554r2167q6717q0482p3934o7622o1944n6836n1845m6726
59428A918164m1809l7370l2965k7912k2330j7087j2691q908n556k929j118N56
59416A708045K821N624Q422J1014J3642J6408J9060K1249K2840K4051K5393K7124
$$ plain form
59404 1905693 1934355 1963343 1991283 2018051 2045041 2074130 2106752 2143796 2185695 2232324 2283248
59393 2283248 2338358 2397914 2461841 2529563 2600993 2677402 2761017 2854055 2958365 3075408 3205953
59382 3205953 3350016 3507603 3679453 3866485 4068587 4284347 4511860 4749253 4994335
59373 4994335 5244224 5495633 5745321 5990231 6227568 6455023 6670901 6873969 7063318
59364 7063318 7238332 7398558 7543495 7672641 7785687 7882457 7962520 8024992 8068832 8093319
59354 8093319 8098333 8084342 8052256 8003331 7939291 7862478 7775550 7680817 7579898 7474076 7364608
59343 7364608 7252269 7136856 7017745 6895147 6770455 6645204 6519990 6394669 6269489
59334 6269489 6145800 6025656 5910662 5801024 5695594 5592923 5492345 5394096 5298629 5206048
$$ packed form
59404A905693K8662K8988K7940K6768K6990K9089L2622L7044M1899M6629N0924
59393B283248N5110N9556O3927O7722P1430P6409Q3615R3038J04310J17043J30545
59382C205953J44063J57587J71850J87032K02102K15760K27513K37393K45082
59373D994335K49889K51409K49688K44910K37337K27455K15878K03068J89349
59364G063318J75014J60226J44937J29146J13046R6770Q0063O2472M3840K4487
59354H093319N014j3991l2086m8925o4040p6813q6928r4733j00919j05822j09468
59343G364608j12339j15413j19111j22598j24692j25251j25214j25321j25180
59334F269489j23689j20144j14994j09638j05430j02671j00578r8249r5467r2581
$$ plain form
59324 5206048 5116040 5027919 4940651 4853166 4764871 4675812 4586383 4497129 4408858 4322560 4238924
59313 4238924 4158013 4079554 4003522 3930466 3861390 3797202 3738025 3683076 3631613 3584006 3541524
59302 3541524 3504952 3473833 3447298 3425215 3408184 3396642 3390366 3388756 3391376 3398377 3410569 3428828
59290 3428828 3453188 3482702 3516497 3554738 3598258 3647522 3702394 3762662 3828062 3897703 3970040
59279 3970040 4043727 4118209 4193161 4267612 4339897 4408366 4471862 4529479 4580060 4622019 4653711
59268 4653711 4673930 4681906 4676862 4657776 4623834 4575089 4512569 4437898 4352906 4259394 4158889
59257 4158889 4052684 3942346 3830054 3718032 3607675 3499589 3394468 3293487 3197732 3107774
59247 3107774 3024007 2947027 2877369 2815259 2760985 2715239 2678626 2651014 2631820 2620921 2618974
$$ packed form
59324E206048r0008q8121q7268q7485q8295q9059q9429q9254q8271q6298q3636
59313D238924q0911p8459p6032p3056o9076o4188n9177n4949n1463m7607m2482
59302C541524l6572l1119k6535k2083j7031j1542o276j610K620P001J2192J8259
59290C428828K4360K9514L3795L8241M3520M9264N4872O0268O5400O9641P2337
59279C970040P3687P4482P4952P4451P2285O8469O3496N7617N0581M1959L1692
59268D653711K0219P976n044j9086l3942m8745o2520p4671q4992r3512j00505
59257D158889j06205j10338j12292j12022j10357j08086j05121j00981r5755q9958
59247C107774q3767p6980o9658o2110n4274m5746l6613k7612j9194j0899j947
$$ plain form
59236 2618974 2626885 2645343 2674928 2716337 2770267 2837131 2916903 3009178 3113495 3229695 3357743
59225 3357743 3496773 3644328 3796938 3951724 4107355 4263444 4419248 4572972 4721816
59216 4721816 4862141 4989564 5099351 5187232 5250166 5286620 5296329 5279964 5238967 5175508 5092258
59205 5092258 4992075 4877985 4753513 4622659 4489151 4355690 4224142 4096286 3973960
59196 3973960 3858442 3750173 3649346 3556490 3472337 3397486 3332417 3277386 3231894 3194605 3164388
59185 3164388 3141341 3126270 3119209 3119023 3124507 3135251 3151144 3171539 3195327 3221538 3249464 3278407
59173 3278407 3307644 3336520 3364250 3389712 3411735 3429442 3442060 3448573 3448051 3440455 3426778 3408263
59161 3408263 3385636 3359066 3328613 3294596 3257777 3219304 3180279 3141314 3102655 3064748 3028373
$$ packed form
59236B618974P911J8458K9585M1409N3930O6864P9772R2275J04317J16200J28048
59225C357743J39030J47555J52610J54786J55631J56089J55804J53724J48844
59216D721816J40325J27423J09787Q7881O2934L6454R709j6365m0997o3459q3250
59205E092258j00183j14090j24472j30854j33508j33461j31548j27856j22326
59196C973960j15518j08269j00827r2856q4153p4851o5069n5031m5492l7289l0217
59185C164388k3047j5071p061j86N484J0744J5893K0395K3788K6211K7926K8943
59173C278407K9237K8876K7730K5462K2023J7707J2618O513n22p596j3677j8515
59161C408263k2627k6570l0453l4017l6819l8473l9025l8965l8659l7907l6375
$$ plain form
59150 3028373 2994179 2962450 2933617 2908652 2888474 2873012 2861306 2852597 2847092 2845489 2848004 2854079
59138 2854079 2862933 2874255 2888442 2906343 2928821 2956371 2988925 3025932 3066772 3111266 3159812
59127 3159812 3212839 3270100 3330681 3393741 3459015 3526359 3595023 3663718 3731347 3797306 3861061
59116 3861061 3921900 3979348 4033519 4084618 4132224 4175427 4213715 4247413 4277150 4303144 4325096
59105 4325096 4342470 4354558 4360393 4358870 4349014 4329953 4300665 4259984 4207038 4141617 4064115 3975247
59093 3975247 3875969 3767543 3651511 3529482 3402956 3273296 3141761 3009567 2877966 2748277
59083 2748277 2621736 2499249 2381323 2268308 2160741 2059382 1964829 1877108 1795772 1720434
59073 1720434 1651137 1587963 1530356 1477124 1427373 1381293 1339733 1302987 1270204 1240075 1211892
$$ packed form
59150C028373l4194l1729k8833k4965k0178j5462j1706q709n505j603K515O075
59138B854079Q854J1322J4187J7901K2478K7550L2554L7007M0840M4494M8546
59127C159812N3027N7261O0581O3060O5274O7344O8664O8695O7629O5959O3755
59116C861061O0839N7448N4171N1099M7606M3203L8288L3698K9737K5994K1952
59105D325096J7374J2088N835j523r856j9061k9288m0681n2946o5421p7502q8868
59093C975247r9278j08426j16032j22029j26526j29660j31535j32194j31601j29689
59083B748277j26541j22487j17926j13015j07567j01359r4553q7721q1336p5338
59073A720434o9297o3174n7607n3232m9751m6080m1560l6746l2783l0129k8183
$$ plain form
59062 1211892 1185772 1162037 1140703 1121593 1104626 1089690 1076333 1063939 1052330 1041926 1033077
59051 1033077 1025357 1017853 1010100 1002416 995321 989062 983944 980708 980084 982071 986010 991351 998057 1006279
59037 1006279 1015981 1026928 1038715 1050785 1062734 1074777 1087602 1101608 1116415 1131189 1145249
59026 1145249 1158342 1170696 1182877 1195141 1206646 1215730 1221436 1224431 1226052 1226766 1226214 1224561 1222907
59013 1222907 1222151 1222132 1222302 1222708 1223793 1225567 1227693 1230300 1234101 1239367 1245142 1249689 1251600 1250317 1245914
58998 1245914 1238827 1229809 1219696 1208859 1197053 1184070 1170502 1157519 1145816 1135086 1124715 1114711
58986 1114711 1105692 1098144 1092164 1087900 1085831 1086314 1089012 1093053 1097752 1103121 1109695 1117989 1128149 1140097
58972 1140097 1153835 1169415 1186578 1204646 1223003 1241554 1260467 1279528 1298065 1315591 1332224
$$ packed form
59062A211892k6120k3735k1334j9110j6967j4936j3357j2394j1609j0404q849
59051A033077p720p504p753p684p095o259n118l236o24J987L939N341O706Q222
59037A006279R702J0947J1787J2070J1949J2043J2825J4006J4807J4774J4060
59026A145249J3093J2354J2181J2264J1505R084N706K995J621P14n52j653j654
59013A222907p56j9J70M06J085J774K126K607L801N266N775M547J911j283m403
58998A245914p087r018j0113j0837j1806j2983j3568j2983j1703j0730j0371j0004
58986A114711r019p548n980m264k069M83K698M041M699N369O574Q294J0160J1948
58972A140097J3738J5580J7163J8068J8357J8551J8913J9061J8537J7526J6633
$$ plain form
58961 1332224 1348376 1364285 1380050 1395920 1412213 1428949 1445778 1462380 1478893 1495965 1514390
58950 1514390 1534616 1556511 1579621 1603707 1629024 1656076 1685222 1716591 1750333 1786804 1826475
58939 1826475 1869669 1916415 1966619 2020398 2078155 2140207 2206498 2276899 2351753 2431869 2518055
58928 2518055 2611084 2712227 2823246 2945417 3078857 3223276 3379218 3548113 3731300 3929563
58918 3929563 4143538 4373769 4620055 4881210 5155780 5442459 5739285 6042753 6348238
58909 6348238 6651083 6946685 7229675 7493652 7731944 7938327 8107210 8233932 8315452 8350532
58899 8350532 8339180 8282407 8182850 8045102 7874639 7676382 7454593 7213938 6959871 6697678
58889 6697678 6431419 6164000 5897916 5635650 5379498 5131306 4892319 4663200 4444317
$$ packed form
58961A332224J6152J5909J5765J5870J6293J6736J6829J6602J6513J7072J8425
58950A514390K0226K1895K3110K4086K5317K7052K9146L1369L3742L6471L9671
58939A826475M3194M6746N0204N3779N7757O2052O6291P0401P4854Q0116Q6186
58928B518055R3029J01143J11019J22171J33440J44419J55942J68895J83187J98263
58918C929563K13975K30231K46286K61155K74570K86679K96826L03468L05485
58909F348238L02845K95602K82990K63977K38292K06383J68883J26722Q1520L5080
58899H350532j1352n6773r9557j37748j70463j98257k21789k40655k54067k62193
58889F697678k66259k67419k66084k62266k56152k48192k38987k29119k18883
$$ plain form
58880 4444317 4236222 4039840 3856070 3685166 3526495 3378876 3241140 3112595 2993078
58871 2993078 2882582 2780766 2686846 2599977 2519667 2445801 2378298 2316760 2260419 2208460 2160511
58860 2160511 2116761 2077442 2042239 2010329 1981043 1954296 1930394 1909651 1892221 1878105 1867222
58849 1867222 1859580 1855353 1854530 1856526 1860527 1866424 1875084 1887506 1903912 1923884 1947110 1973775 2004394
58836 2004394 2039488 2079302 2123696 2172518 2226159 2285389 2350519 2421246 2497634 2580755 2671809
58825 2671809 2771036 2878174 2993763 3119315 3256230 3405139 3566287 3740011 3926851 4127685
58815 4127685 4343582 4574911 4820600 5078831 5348265 5627711 5914520 6204148 6491471
58806 6491471 6771661 7039555 7289172 7514502 7710079 7870411 7989888 8064327 8092329 8074576
$$ packed form
58880D444317k08095j96382j83770j70904j58671j47619j37736j28545j19517
58871B993078j10496j01816r3920q6869q0310p3866o7503o1538n6341n1959m7949
58860B160511m3750l9319l5203l1910k9286k6747k3902k0743j7430j4116j0883
58849A867222p642m227q23J996M001N897Q660J2422J6406J9972K3226K6665L0619
58836B004394L5094L9814M4394M8822N3641N9230O5130P0727P6388Q3121R1054
58825B671809R9227J07138J15589J25552J36915J48909J61148J73724J86840K00834
58815D127685K15897K31329K45689K58231K69434K79446K86809K89628K87323
58806F491471K80190K67894K49617K25330J95577J60332J19477P4439K8002j7753
$$ plain form
58796 8074576 8012442 7908027 7764872 7587554 7380713 7149243 6898985 6636033 6365137 6089532
58786 6089532 5812152 5536076 5263775 4997004 4737828 4488864 4251988 4027526 3815217
58777 3815217 3615434 3428858 3255402 3094128 2944054 2804555 2675136 2555205 2444045
58768 2444045 2340715 2244153 2153751 2069767 1992871 1923209 1860051 1802333 1749415 1701308 1658245
58757 1658245 1620101 1586345 1556671 1531501 1511549 1496796 1486214 1478645 1473688 1471502 1471950 1474241
58745 1474241 1477448 1481221 1485931 1492084 1499603 1507683 1515307 1521703 1526176 1527869 1526124 1521058 1513391 1503710
58731 1503710 1492273 1479430 1465615 1450670 1433604 1413374 1389712 1363080 1334182 1303811 1272800
58720 1272800 1241711 1210639 1179525 1148476 1117658 1087157 1057212 1028315 1000829 974776 950274
$$ packed form
58796H074576o2134j04415j43155j77318k06841k31470k50258k62952k70896k75605
58786F089532k77380k76076k72301k66771k59176k48964k36876k24462k12309
58777C815217j99783j86576j73456j61274j50074j39499j29419j19931j11160
58768B444045j03330r6562r0402q3984p6896o9662o3158n7718n2918m8107m3063
58757A658245l8144l3756k9674k5170j9952j4753j0582p569m957k186M48K291
58745A474241L207L773M710O153P519Q080P624O396M473J693j745n066p667r681
58731A503710j1437j2843j3815j4945j7066k0230k3662k6632k8898l0371l1011
58720A272800l1089l1072l1114l1049l0818l0501k9945k8897k7486k6053k4502
$$ plain form
58709 950274 927852 907862 889725 872239 854709 837546 821789 808227 796875 786971 777501 767970
58697 767970 758731 750471 743444 737314 731586 726053 720986 717008 714565 713311 712288 710958 709773 709438
58683 709438 709886 710470 710951 711716 713034 714601 715910 716699 717063 717504 718883 721865 726240 731092 735650 739642
58667 739642 742848 744854 745523 745323 744916 744668 744687 744963 745192 744715 742980 739979 736094 731705 727146 722795
58651 722795 718935 715613 712813 710673 709395 709017 709419 710510 712309 714965 718734 723810 730143 737631 746469
58636 746469 757038 769394 783159 798146 814803 833832 855542 879718 905922 933736 963038
58625 963038 994400 1029089 1068346 1112677 1161925 1215801 1274151 1336901 1404172 1476347 1553677
58614 1553677 1635710 1721253 1808811 1896838 1983627 2067193 2145348 2215847 2276582 2325831 2362302
$$ packed form
58709I50274k2422j9990j8137j7486j7530j7163j5757j3562j1352r904r470r531
58697G67970r239q260p027o130n728n533n067l978k443j254j023j330j185l35
58683G09438M48N84M81P65J318J567J309P89L64M41J379K982M375M852M558L992
58667G39642L206K006O69k00m07k48J9K76K29m77j735l001l885m389m559m351
58651G22795l860l322k800k140j278l78M02J091J799K656L769N076O333P488Q838
58636G46469J0569J2356J3765J4987J6657J9029K1710K4176K6204K7814K9302
58625I63038L1362L4689L9257M4331M9248N3876N8350O2750O7271P2175P7330
58614A553677Q2033Q5543Q7558Q8027Q6789Q3566P8155P0499O0735M9249L6471
$$ plain form
58603 2362302 2384966 2393114 2386857 2367431 2336754 2296775 2249251 2195848 2138029 2076967 2013846 1950068
58591 1950068 1886859 1824856 1764462 1706393 1651458 1600034 1552375 1509285 1471747 1439822 1412594
58580 1412594 1389358 1370138 1354733 1342006 1330760 1320817 1312670 1306409 1301647 1298161 1295942 1294653 1293753
58567 1293753 1293185 1293278 1293689 1292928 1289317 1282205 1272008 1259223 1243659 1224598 1201554 1174815 1145347
58554 1145347 1114255 1082477 1050859 1020150 990663 962175 934480 907925 883087 860033 838337
58543 838337 817799 798634 780884 764165 748352 734138 722420 713270 705832 699205 693125 687828
58531 687828 683567 680358 677903 675627 672935 669663 666256 663356 661185 659344 657244 654690 652029 649759
58517 649759 648135 647193 647019 647784 649571 652339 656058 660616 665494 669837 673208 676196 679954 685054 690988
$$ packed form
58603B362302K2664Q148o257j9426l0677l9979m7524n3403n7819o1062o3121o3778
58591A950068o3209o2003o0394n8069n4935n1424m7659m3090l7538l1925k7228
58580A412594k3236j9220j5405j2727j1246r943q147o261m762l486k219j289r00
58567A293753n68R3M11p61l611p112j0197j2785j5564j9061k3044k6739k9468
58554A145347l1092l1778l1618l0709k9487k8488k7695k6555k4838k3054k1696
58543H38337k0538j9165j7750j6719j5813j4214j1718r150p438o627o080n297
58531F87828m261l209k455k276k692l272l407k900k171j841k100k554k661k270
58517F49759j624r42j74P65J787K768L719M558M878M343L371K988L758N100N934
$$ plain form
58502 690988 696872 702454 708314 715180 723250 732172 741544 751316 761696 772754 784213 795666 806866
58489 806866 817726 828091 837647 846019 852837 857741 860522 861364 860803 859301 856885 853260 848207 841823
58475 841823 834483 826654 818691 810690 802583 794457 786698 779683 773426 767698 762468 758004 754565 752227
58461 752227 751031 751015 751951 753291 754731 756681 759901 764570 769920 774889 779083 783060 787748 793633 800476
58446 800476 807736 815199 823137 831903 841541 851815 862460 873247 883978 894535 904885 914831 923877
58433 923877 931487 937411 941569 943853 944374 943791 942876 941609 939203 935315 930890 927382 925335 924140 923185
58418 923185 922763 923682 926278 930088 934472 939373 945363 953046 962499 973270 984732 996302 1007510 1018178
58404 1018178 1028533 1038819 1048677 1057247 1064051 1069469 1074085 1077802 1080035 1080653 1080354 1080090 1080400 1081268 1082372
$$ packed form
58502F90988N884N582N860O866Q070Q922R372R772J0380J1058J1459J1453J1200
58489H06866J0860J0365R556Q372O818M904K781Q42n61j502k416l625n053o384
58475H41823p340p829p963q001q107q126p759p015o257n728n230m464l439k338
58461G52227j196j6R36J340J440J950L220M669N350M969M194L977M688N885O843
58446H00476P260P463P938Q766R638J0274J0645J0787J0731J0557J0350R946R046
58433I23877P610N924M158K284N21n83r15j267k406l888m425l508k047j195r55
58418I23185m22R19K596L810M384M901N990P683R453J0771J1462J1570J1208J0668
58404A018178J0355J0286R858Q570O804N418M616L717K233O18k99k64L10Q68J104
$$ plain form
58389 1082372 1083432 1084608 1086503 1089558 1093439 1097427 1101428 1106130 1111958 1118296 1124153 1129341 1134588 1140653
58375 1140653 1147733 1155737 1164655 1174451 1184863 1195599 1206680 1218438 1231202 1245018 1259602 1274429
58363 1274429 1288952 1302941 1316734 1331102 1346730 1363690 1381401 1399132 1416615 1434196 1452343
58352 1452343 1471037 1489726 1507972 1525933 1543980 1561830 1578451 1593015 1605722 1617388 1628442
58341 1628442 1638734 1648268 1657639 1667593 1678477 1690295 1702961 1716272 1729927 1743891 1758584 1774432
58329 1774432 1791433 1809434 1828629 1849437 1872016 1896221 1921962 1949163 1977447 2006312 2035735
58318 2035735 2066216 2098083 2131011 2164374 2197773 2230998 2263786 2295955 2327658 2359104 2389968
58307 2389968 2419427 2447075 2473716 2500914 2529598 2559298 2588917 2618067 2647350 2677499 2708799
$$ packed form
58389A082372J060J176J895L055L881L988M001M702N828O338N857N188N247O065
58375A140653P080Q004Q918R796J0412J0736J1081J1758J2764J3816J4584J4827
58363A274429J4523J3989J3793J4368J5628J6960J7711J7731J7483J7581J8147
58352A452343J8694J8689J8246J7961J8047J7850J6621J4564J2707J1666J1054
58341A628442J0292R534R371R954J0884J1818J2666J3311J3655J3964J4693J5848
58329A774432J7001J8001J9195K0808K2579K4205K5741K7201K8284K8865K9423
58318B035735L0481L1867L2928L3363L3399L3225L2788L2169L1703L1446L0864
58307B389968K9459K7648K6641K7198K8684K9700K9619K9150K9283L0149L1300
$$ plain form
58296 2708799 2741409 2775706 2811887 2849665 2888790 2929644 2972862 3018592 3066601 3116939 3169931
58285 3169931 3225550 3283344 3343091 3405102 3469694 3536770 3606068 3677477 3750856 3825794 3901825
58274 3901825 3978788 4056809 4135862 4215369 4294266 4371668 4447612 4522960 4598411 4673793 4748603
58263 4748603 4823031 4898180 4975410 5055734 5139568 5226717 5316740 5409728 5506556 5608047 5714173
58252 5714173 5824523 5939340 6059518 6185767 6318254 6456893 6601390 6751110 6905468
58243 6905468 7064422 7228272 7397339 7572376 7754907 7946330 8146903 8356252 8574591
58234 8574591 8802734 9041357 9291237 9553898 9830932 10122842 10429594 10752071 11091896
58225 11091896 11450085 11827198 12224823 12645676 13092202 13566220 14070030 14607032 15181606
$$ packed form
58296B708799L2610L4297L6181L7778L9125M0854M3218M5730M8009N0338N2992
58285C169931N5619N7794N9747O2011O4592O7076O9298P1409P3379P4938P6031
58274C901825P6963P8021P9053P9507P8897P7402P5944P5348P5451P5382P4810
58263D748603P4428P5149P7230Q0324Q3834Q7149R0023R2988R6828J01491J06126
58252E714173J10350J14817J20178J26249J32487J38639J44497J49720J54358
58243F905468J58954J63850J69067J75037J82531J91423K00573K09349K18339
58234H574591K28143K38623K49880K62661K77034K91910L06752L22477L39825
58225A1091896L58189L77113L97625M20853M46526M74018N03810N37002N74574
$$ plain form
58216 15181606 15799572 16468465 17196389 17991392 18863419 19826063 20895263 22088193 23426297
58207 23426297 24938945 26663180 28643822 30938906 33624189 36788872 40529501 44953133
58199 44953133 50184359 56364839 63649779 72206051 82192357 93711087 106777392 121354762
58191 121354762 137407987 154865981 173506183 192919388 212616317 232070820 250483849
58184 250483849 266443671 277977438 283228746 281363544 273024348 260030433 244605006
58177 244605006 228625452 213203900 198651786 184742583 171100297 157496816 143929844
58170 143929844 130537900 117502566 105012519 93254883 82391699 72532613 63727415
58163 63727415 55973519 49224676 43402397 38412542 34157754 30540324 27464108 24841560
$$ packed form
58216A5181606O17966O68893P27924P95003Q72027R62644J069200J192930J338104
58207B3426297J512648J724235J980642K295084K685283L164683L740629M423632
58199D4953133N231226O180480P284940Q556272R986306J1518730J3066305J4577370
58191A21354762J6053225J7457994J8640202J9413205J9696929J9454503J8413029
58184B50483849J5959822J1533767N251308j865202q339196j2993915j5425427
58177B44605006j5979554j5421552j4552114j3909203j3642286j3603481j3566972
58170A43929844j3391944j3035334j2490047j1757636j0863184r859086q805198
58163F3727415p753896o748843n822279m989855m254788l617430l076216k622548
$$ plain form
58155 24841560 22598848 20673501 19011131 17566987 16307304 15205419 14237559 13383588
58147 13383588 12629037 11963362 11376944 10861085 10409138 10015697 9675569 9384703 9140769
58138 9140769 8941517 8783893 8665840 8587466 8549110 8549662 8587992 8664666 8781478 8941850 9154180
58127 9154180 9433770 9800127 10274022 10878390 11639426 12584923 13744582 15153321 16846922
58118 16846922 18846076 21147611 23739131 26616567 29770438 33151565 36667771 40222196
58110 40222196 43726726 47036293 49864082 51804774 52501557 51838341 50004556 47397306
58102 47397306 44450426 41495654 38701282 36085554 33582794 31122805 28677182 26255942
58094 26255942 23881881 21577730 19370247 17292844 15378370 13650538 12120903 10788971
$$ packed form
58155B4841560k242712j925347j662370j444144j259683j101885r67860q53971
58147A3383588p54551o65675n86418n15859m51947l93441l40128k90866k43934
58138I140769j99252j57624j18053p8374l8356N52L8330P6674J16812J60372K12330
58127I154180K79590L66357M73895O04368P61036R45497J159659J408739J693601
58118A6846922J999154K301535K591520K877436L153871L381127L516206L554425
58110D0222196L504530L309567K827789J940692O96783o63216j833785k607250
58102D7397306k946880k954772k794372k615728k502760k459989k445623k421240
58094B6255942k374061k304151k207483k077403j914474j727832j529635j331932
$$ plain form
58086 10788971 9642989 8663232 7827454 7114477 6504591 5979666 5524245 5125922 4774679
58077 4774679 4462900 4185764 3940083 3722162 3527396 3351587 3191380 3043356 2903983
58068 2903983 2770876 2643229 2520873 2403880 2293210 2190501 2096545 2010614 1931636 1859200
58058 1859200 1792953 1731716 1673964 1618867 1566493 1517299 1471758 1430125 1392198 1357381 1325076
58047 1325076 1294852 1266301 1239170 1213672 1190233 1168794 1148770 1129754 1111804 1094873 1078532
58036 1078532 1062562 1047392 1033533 1020831 1008575 996165 983443 970601 958090 946471 936085
58025 936085 926824 918256 909894 901312 892259 882900 873853 865848 859287 854124 850008 846570 843692 841581
58011 841581 840473 840265 840563 841062 841705 842486 843288 843988 844559 845001 845330 845680 846196 846718 846674 845457 842916 839328
$$ packed form
58086A0788971j145982r79757q35778p12977o09886n24925m55421l98323l51243
58077D774679l11779k77136k45681k17921j94766j75809j60207j48024j39373
58068B903983j33107j27647j22356j16993j10670j02709r3956q5931p8978p2436
58058A859200o6247o1237n7752n5097n2374m9194m5541m1633l7927l4817l2305
58047A325076l0224k8551k7131k5498k3439k1439k0024j9016j7950j6931j6341
58036A078532j5970j5170j3859j2702j2256j2410j2722j2842j2511j1619j0386
58025I36085r261q568q362q582r053r359r047q005o561n163m116l438k878k111
58011H41581j108k08K98M99O43P81Q02P00N71M42L29L50N16N22m4j217k541l588
$$ plain form
57993 839328 834932 829604 823196 816124 809356 803549 798353 792836 786585 780044 773779 767863 762126 756573
57979 756573 751224 745897 740569 735665 731545 727869 724006 720055 716968 715521 715484 715913 716020 715621 714986 714484
57963 714484 714355 714660 715341 716207 716958 717449 717958 718871 719972 720348 719243 716749 713421 709555 705238 700779
57947 700779 696498 692238 687616 682769 678316 674564 671331 668710 667405 667893 669629 671563 673342 675558
57933 675558 678780 682723 686503 689441 691404 692543 693195 694117 696346 700366 705529 710713 715510 720363 725656
57918 725656 731270 737164 743773 751442 759882 768548 777129 785246 792032 796567 798619 798579 796891 793965 790344
57903 790344 786432 782135 777194 771761 766314 761177 756505 752557 749447 746772 743951 740839 737662 734535
57889 734535 731524 728981 727284 726387 726139 726872 729037 732327 735768 738707 741184 743455 745751 748436 751671
$$ packed form
57993H39328m396n328o408p072o768n807n196n517o251o541o265n916n737n553
57979G56573n349n327n328m904m120l676l863l951l087j447l7M29J07l99o35n02
57963G14484j29L05O81Q66P51M91N09R13J101L76j105k494l328l866m317m459
57947G00779m281m260m622m847m453l752l233k621j305M88J736J934J779K216
57933F75558L222L943L780K938J963J139O52R22K229M020N163N184M797M853N293
57918G25656N614N894O609P669Q440Q666Q581Q117O786M535K052m0j688k926l621
57903G90344l912m297m941n433n447n137m672l948l110k675k821l112l177l127
57889G34535l011k543j697q97k48P33K165L290L441K939K477K271K296K685L235
$$ plain form
57874 751671 754911 757419 759316 761432 764051 766594 768663 770563 772456 773836 774286 774145 773943 773740 773419
57859 773419 773086 772699 771865 770528 769390 769136 769644 770409 771331 772569 774078 775930 778780 783304 789338 796127
57843 796127 803229 810619 818128 825483 832885 840862 849354 857470 864418 870359 876101 882120 888005 892711
57829 892711 895307 895678 894547 892766 890589 887725 883973 879597 875114 870929 867245 864128 861512 859164
57815 859164 856822 854529 852829 852406 853340 854929 856435 857901 859923 862768 866120 869567 872844 875615 877567
57800 877567 878855 879974 880970 881282 880561 879197 877796 876621 875748 875244 874887 874330 873882 874518 876542 878896
57784 878896 880565 882128 884996 889404 894187 898497 902727 907501 912631 917548 922185 926988 932433 938882
57770 938882 946653 955834 966211 977534 989705 1002549 1015677 1028773 1041886 1055249 1068948 1082838
$$ packed form
57874G51671L240K508J897K116K619K543K069J900J893J380M50j41k02k03l21
57859G73419l33l87q34j337j138k54N08P65R22J238J509J852K850M524O034O789
57843G96127P102P390P509P355P402P977Q492Q116O948N941N742O019N885M706
57829H92711K596L71j131j781k177k864l752m376m483m185l684l117k616k348
57815H59164k342k293j700m23R34J589J506J466K022K845L352L447L277K771J952
57800H77567J288J119R96L12p21j364j401j175q73n04l57n57m48O36K024K354
57784H78896J669J563K868M408M783M310M230M774N130M917M637M803N445O449
57770I38882P771R181J0377J1323J2171J2844J3128J3096J3113J3363J3699J3890
$$ plain form
57758 1082838 1096597 1109715 1121599 1131839 1140356 1147276 1152826 1157340 1161142 1164236 1166308 1167219 1167373
57745 1167373 1167384 1167469 1167382 1166969 1166535 1166545 1167122 1168081 1169381 1171202 1173523 1175925 1178131 1180557 1184014 1188930 1195148
57728 1195148 1202368 1210319 1218491 1226243 1233483 1240878 1249145 1258385 1268382 1279177 1290978 1303709 1317063
57715 1317063 1330894 1345271 1360260 1375973 1392700 1410704 1429952 1450336 1472107 1495774 1521614
57704 1521614 1549553 1579553 1611864 1646843 1684688 1725410 1768952 1815293 1864408 1915989 1969210
57693 1969210 2022941 2076276 2128612 2179178 2226949 2271464 2313643 2355559 2399488 2447195 2499674
57682 2499674 2557127 2619306 2686101 2757627 2833632 2913247 2995542 3079770 3164493 3247098 3325035
57671 3325035 3397345 3464128 3524790 3577926 3623086 3661510 3694566 3722324 3744319 3760801 3771908
$$ packed form
57758A082838J3759J3118J1884J0240Q517O920N550M514L802L094K072R11J54
57745A167373J1Q5q7m13m34J0N77R59J300J821K321K402K206K426L457M916O218
57728A195148P220P951Q172P752P240P395Q267R240R997J0795J1801J2731J3354
57715A317063J3831J4377J4989J5713J6727J8004J9248K0384K1771K3667K5840
57704A521614K7939L0000L2311L4979L7845M0722M3542M6341M9115N1581N3221
57693A969210N3731N3335N2336N0566M7771M4515M2179M1916M3929M7707N2479
57682B499674N7453O2179O6795P1526P6005P9615Q2295Q4228Q4723Q2605P7937
57671C325035P2310O6783O0662N3136M5160L8424L3056K7758K1995J6482J1107
$$ plain form
57660 3771908 3775426 3766193 3738238 3687877 3615530 3525718 3425649 3322939 3223366 3129760 3042460
57649 3042460 2960699 2883742 2811337 2743644 2681091 2624213 2573473 2529214 2491782 2461475 2438066
57638 2438066 2420492 2407530 2398994 2395877 2399047 2408201 2422502 2441822 2466713 2497286 2532773 2572350
57626 2572350 2615861 2663653 2716174 2773907 2837299 2906359 2980447 3058463 3139014 3220420 3300983
57615 3300983 3379440 3454845 3525845 3590344 3645992 3690786 3723197 3742261 3747889 3740842 3722193 3693148
57603 3693148 3655566 3612083 3565021 3515258 3462645 3407509 3351326 3295830 3241965 3189979 3140258
57592 3140258 3093640 3050830 3011831 2976255 2944117 2915959 2892072 2871928 2854797 2840665 2830015
57581 2830015 2822684 2817592 2813873 2811729 2811768 2813892 2817435 2822132 2828250 2835757 2844020 2852575 2861762 2872305
$$ packed form
57660C771908L518r233k7955n0361p2347q9812j00069j02710r9573r3606q7300
57649C042460q1761p6957p2405o7693o2553n6878n0740m4259l7432l0307k3409
57638B438066j7574j2962q536l117L170R154J4301J9320K4891L0573L5487L9577
57626B572350M3511M7792N2521N7733O3392O9060P4088P8016Q0551Q1406Q0563
57615C300983P8457P5405P1000O4499N5648M4794L2411J9064N628p047j8649k9045
57603C693148l7582m3483m7062m9763n2613n5136n6183n5496n3865n1986m9721
57592C140258m6618m2810l8999l5576l2138k8158k3887k0144j7131j4132j0650
57581B830015p331n092l719k144L9K124L543M697O118P507Q263Q555R187J0543
$$ plain form
57567 2872305 2884585 2898532 2913899 2930251 2946984 2963862 2981470 3000673 3021571 3043374 3065442
57556 3065442 3088047 3111915 3137353 3164134 3191947 3220555 3249693 3279246 3309516 3340992 3373917
57545 3373917 3408369 3444596 3482783 3522566 3563339 3605166 3648828 3694823 3742897 3792790 3844813
57534 3844813 3899225 3955707 4014145 4075502 4141051 4210928 4284230 4360451 4439896 4522487 4606989
57523 4606989 4691905 4776525 4860589 4943247 5022922 5097994 5167062 5228569 5280778 5322547 5354030
57512 5354030 5376378 5390731 5397709 5397952 5392852 5384351 5373947 5362177 5349234 5335829 5323226 5312579
57500 5312579 5304399 5298500 5294330 5291650 5291179 5294365 5302251 5314751 5331209 5351211 5374446 5400210 5427817
57487 5427817 5457428 5489850 5525494 5564035 5605073 5648505 5694167 5741775 5791443 5843749 5899005
$$ packed form
57567B872305J2280J3947J5367J6352J6733J6878J7608J9203K0898K1803K2068
57556C065442K2605K3868K5438K6781K7813K8608K9138K9553L0270L1476L2925
57545C373917L4452L6227L8187L9783M0773M1827M3662M5995M8074M9893N2023
57534C844813N4412N6482N8438O1357O5549O9877P3302P6221P9445Q2591Q4502
57523D606989Q4916Q4620Q4064Q2658P9675P5072O9068O1507N2209M1769L1483
57512E354030K2348J4353O978K43n100q501j0404j1770j2943j3405j2603j0647
57500E312579q180n899m170k680m71L186P886J2500J6458K0002K3235K5764K7607
57487E427817K9611L2422L5644L8541M1038M3432M5662M7608M9668N2306N5256
$$ plain form
57476 5899005 5956891 6017064 6079730 6145368 6214250 6286493 6362242 6441526 6524274 6610744 6701569
57465 6701569 6796998 6896315 6998305 7102050 7206864 7311656 7414794 7514633 7609843 7699139
57455 7699139 7780943 7853502 7915469 7966517 8007549 8040316 8066701 8088324 8106595 8122866 8138280
57444 8138280 8153498 8168693 8183938 8199758 8217307 8237758 8261417 8287638 8315850 8346402 8380154
57433 8380154 8417463 8458027 8501583 8548249 8598180 8651298 8707408 8766154 8826773 8888254 8949894
57422 8949894 9011501 9073124 9134885 9197061 9259899 9323323 9387172 9451673 9517267 9583987 9651496
57411 9651496 9719769 9789288 9860495 9933544 10008600 10085780 10164713 10244788 10326008 10409003 10494038
57400 10494038 10580634 10668393 10757459 10847820 10938910 11030428 11122856 11216549 11310883 11405027 11499031
$$ packed form
57476E899005N7886O0173O2666O5638O8882P2243P5749P9284Q2748Q6470R0825
57465F701569R5429R9317J01990J03745J04814J04792J03138R9839R5210Q9296
57455G699139Q1804P2559O1967N1048M1032L2767K6385K1623J8271J6271J5414
57444H138280J5218J5195J5245J5820J7549K0451K3659K6221K8212L0552L3752
57433H380154L7309M0564M3556M6666M9931N3118N6110N8746O0619O1481O1640
57422H949894O1607O1623O1761O2176O2838O3424O3849O4501O5594O6720O7509
57411I651496O8273O9519P1207P3049P5056P7180P8933Q0075Q1220Q2995Q5035
57400A0494038Q6596Q7759Q9066R0361R1090R1518R2428R3693R4334R4144R4004
$$ plain form
57389 11499031 11593307 11687406 11780309 11871905 11963322 12055497 12148020 12239647 12329654 12418434 12507031
57378 12507031 12596250 12686167 12776406 12866816 12957654 13049089 13140895 13232927 13325656 13419899 13516080
57367 13516080 13613929 13712739 13811785 13910754 14010025 14110305 14211721 14313394 14414145 14513401
57357 14513401 14611263 14707942 14803474 14897789 14990782 15082438 15173054 15263190 15353209 15443098 15532854
57346 15532854 15622798 15713412 15805279 15899286 15996359 16096622 16199284 16303704 16410043 16518376
57336 16518376 16627670 16736353 16843570 16949220 17053014 17154282 17252635 17348112 17440625 17529883
57326 17529883 17615923 17699253 17780424 17860030 17939231 18019716 18102857 18189179 18278684 18371353 18467191
57315 18467191 18566161 18668222 18773108 18880009 18987787 19095605 19202971 19309044 19412275
$$ packed form
57389A1499031R4276R4099R2903R1596R1417R2175R2523R1627R0007Q8780Q8597
57378A2507031Q9219Q9917R0239R0410R0838R1435R1806R2032R2729R4243R6181
57367A3516080R7849R8810R9046R8969R9271J00280J01416J01673J00751R9256
57357A4513401R7862R6679R5532R4315R2993R1656R0616R0136R0019Q9889Q9756
57346A5532854Q9944R0614R1867R4007R7073J00263J02662J04420J06339J08333
57336A6518376J09294J08683J07217J05650J03794J01268R8353R5477R2513Q9258
57326A7529883Q6040Q3330Q1171P9606P9201Q0485Q3141Q6322Q9505R2669R5838
57315A8467191R8970J02061J04886J06901J07778J07818J07366J06073J03231
$$ plain form
57306 19412275 19511054 19604394 19691754 19772552 19846382 19913624 19975343 20032410 20085089 20133677 20179224
57295 20179224 20223314 20267385 20312638 20360368 20411729 20467142 20526589 20590664 20660596 20736862 20818529
57284 20818529 20904554 20994948 21089719 21187353 21285667 21383915 21482690 21581672 21678862 21772418 21861984
57273 21861984 21947676 22028883 22104783 22175101 22239494 22296913 22346306 22387337 22419800 22443006 22456449
57262 22456449 22460465 22455660 22442472 22422026 22396683 22368770 22339239 22308295 22276745 22245900 22216790
57251 22216790 22190388 22167976 22150351 22137161 22128046 22123883 22125870 22133887 22146922 22164597 22186902 22212726
57239 22212726 22240099 22268003 22296719 22326272 22355682 22383877 22410288 22434208 22454317 22469002 22476497
57228 22476497 22474904 22462997 22441073 22410179 22370673 22322464 22266408 22204196 22136752 22063982 21986256
$$ packed form
57306A9412275R8779R3340Q7360Q0798P3830O7242O1719N7067N2679M8588M5547
57295B0179224M4090M4071M5253M7730N1361N5413N9447O4075O9932P6266Q1667
57284B0818529Q6025R0394R4771R7634R8314R8248R8775R8982R7190R3556Q9566
57273B1861984Q5692Q1207P5900P0318O4393N7419M9393M1031L2463K3206J3443
57262B2456449M016m805j3188k0446k5343k7913k9531l0944l1550l0845k9110
57251B2216790k6402k2412j7625j3190r115m163J987Q017J3035J7675K2305K5824
57239B2212726K7373K7904K8716K9553K9410K8195K6411K3920K0109J4685P495
57228B2476497j593j1907k1924l0894l9506m8209n6056o2212o7444p2770p7726
$$ plain form
57217 21986256 21904880 21820705 21733390 21642557 21548690 21452378 21353597 21252344 21149240 21044901
57207 21044901 20939337 20832589 20725597 20620045 20517702 20420119 20328499 20243715 20166874 20099865
57197 20099865 20044707 20002248 19972076 19953724 19947197 19952180 19967479 19991547 20023009 20060521 20102626
57186 20102626 20147677 20193400 20236630 20274328 20304662 20326240 20336284 20330618 20305526 20258584 20187619
57175 20187619 20090171 19964546 19810591 19629082 19421356 19190041 18939385 18674415 18400526
57166 18400526 18124229 17853448 17596363 17360192 17150919 16973147 16829580 16720927 16646243
57157 16646243 16602532 16583883 16581802 16586682 16588601 16577184 16542206 16474911 16368485 16218052 16022073
57146 16022073 15784316 15513517 15220905 14918768 14620606 14339986 14087688 13870287 13691041
$$ packed form
57217B1986256q1376q4175q7315r0833r3867r6312r8781j01253j03104j04339
57207B1044901j05564j06748j06992j05552j02343r7583r1620q4784p6841o7009
57197B0099865n5158m2459l0172j8352o527M983J5299K4068L1462L7512M2105
57186B0102626M5051M5723M3230L7698L0334K1578J0044n666k5092m6942p0965
57175B0187619r7448j25625j53955j81509k07726k31315k50656k64970k73889
57166A8400526k76297k70781k57085k36171k09273j77772j43567j08653p4684
57157A6646243m3711j8649k081M880J919j1417l4978o7295j06426j50433j95979
57146A6022073k37757k70799k92612l02137k98162k80620k52298k17401j79246
$$ plain form
57137 13691041 13550166 13443267 13360674 13289093 13213548 13118747 12991644 12824942 12618422 12377576
57127 12377576 12112587 11838145 11571087 11325759 11111295 10931969 10787022 10669070 10565087
57118 10565087 10461094 10345963 10212152 10056807 9884444 9706831 9538525 9392849 9280929
57109 9280929 9210106 9180430 9184304 9211372 9253296 9305331 9368641 9454307 9582620 9775919 10052993
57098 10052993 10429372 10917345 11522944 12247620 13096840 14083998 15223415 16523552 17988415
57089 17988415 19617158 21395781 23295560 25285838 27339991 29422034 31487844 33534160
57081 33534160 35651971 37995517 40655571 43542685 46387513 48848000 50628028 51544939
57073 51544939 51555632 50760998 49374609 47642598 45747138 43754115 41637415 39354072
$$ packed form
57137A3691041j40875j06899q2593p1581p5545r4801j27103j66702k06520k40846
57127A2377576k64989k74442k67058k45328k14464j79326j44947j17952j03983
57118A0565087j03993j15131j33811j55345j72363j77613j68306j45676j11920
57109I280929p0823k9676L874K7068M1924N2035O3310Q5666J28313J93299K77074
57098A0052993L76379M87973O05599P24676Q49220R87158J139417J300137J464863
57089A7988415J628743J778623J899779J990278K054153K082043K065810K046316
57081C3534160K117811K343546K660054K887114K844828K460487J780028R16911
57073E1544939J0693p94634j386389j732011j895460j993023k116700k283343
$$ plain form
57065 39354072 36908743 34361819 31788087 29233969 26711759 24224649 21789631 19440054
57057 19440054 17215745 15153176 13278447 11603237 10126267 8838858 7728400 6778082
57049 6778082 5967638 5276865 4687777 4183544 3747993 3367450 3031670 2732187 2461202
57040 2461202 2212679 1983054 1770096 1572196 1389083 1221620 1069990 932949 809210
57031 809210 698274 599385 510924 431439 360329 297006 240355 189478 144057 103566 67111
57020 67111 34373 5714 -19092 -41264 -61659 -80067 -96239 -110643 -123598 -134529 -142741 -148330
57008 -148330 -151857 -153747 -154453 -154510 -154005 -152581 -150334 -148072 -146351 -144894 -143230 -141209 -138531 -134626 -129498
56993 -129498 -123960 -118488 -112368 -104464 -94321 -82101 -68062 -52561 -35993 -18200 1508 23224
$$ packed form
57065C9354072k445329k546924k573732k554118k522210k487110k435018k349577
57057A9440054k224309k062569j874729j675210j476970j287409j110458r50318
57049F778082q10444o90773n89088n04233m35551l80543l35780k99483k70985
57040B461202k48523k29625k12958j97900j83113j67463j51630j37041j23739
57031H09210j10936r8889q8461p9485p1110o3323n6651n0877m5421m0491l6455
57020F7111l2738E714a9092k2172k0395j8408j6172j4404j2955j0931q212n589
57008a48330l527j890p06n7N05J424K247K262J721J457J664K021K678L905N128
56993a29498N538N472O120P904J0143J2220J4039J5501J6568J7793A508K1716
$$ plain form
56981 23224 45824 68158 90310 113137 137113 162486 190300 222488 261131 308435 367373 441452
56969 441452 533651 646144 781142 941065 1127415 1340195 1578890 1842835 2129164 2430995
56959 2430995 2739643 3048489 3351075 3632230 3862717 4007988 4046638 3982144 3838545 3646953
56949 3646953 3434959 3222187 3018505 2824149 2633666 2441773 2246202 2046874 1845330
56940 1845330 1645747 1454713 1278557 1121143 984091 867624 770464 690001 623550 569108
56930 569108 524627 487400 454664 424134 393676 361406 326760 290783 254858 219766 186329
56919 186329 155835 128863 104353 80761 57731 35788 14960 -5269 -24855 -43021 -59281 -73830
56907 -73830 -86801 -97776 -106334 -112744 -117885 -122630 -127272 -131319 -133802 -133979 -131849 -128045 -123292 -117875
$$ packed form
56981B3224K2600K2334K2152K2827K3976K5373K7814L2188L8643M7304N8938P4079
56969D41452R2199J12493J34998J59923J86350K12780K38695K63945K86329L01831
56959B430995L08648L08846L02586K81155K30487J45271L8650o4494j43599j91592
56949C646953k11994k12772k03682j94356j90483j91893j95571j99328k01544
56940A845330j99583j91034j76156j57414j37052j16467r7160q0463o6451n4442
56930E69108m4481l7227l2736l0530l0458l2270l4646l5977l5925l5092l3437
56919A86329l0494k6972k4510k3592k3030k1943A4960e269j9586j8166j6260j4549
56907g3830j2971j0975q558o410n141m745m642m047k483j77K130L804M753N417
$$ plain form
56893 -117875 -111379 -103011 -92414 -80093 -66724 -52169 -35740 -17394 1953 21291 39832 56396
56881 56396 69435 78325 84037 88021 91084 93855 97453 102672 108989 115487 122563 131767 143970 158653
56867 158653 175087 193327 213794 236675 262159 290614 321991 355333 389262 422532 453554
56856 453554 479534 496851 502916 497926 484902 468029 450743 434897 421125 409573 400271 393284
56844 393284 388934 387994 391626 401011 416932 439503 468266 502612 542100 586232 634012 683832
56832 683832 733520 779961 818742 844934 854985 848181 826659 794549 756940 718540 682199 648489
56820 648489 616887 587221 559937 535586 514663 497867 486016 479723 479437 485619 498475 517455
56808 517455 541247 568186 596339 623230 645718 660332 664018 655254 635035 606691 574248 540708
$$ packed form
56893a17875O496Q368J0597J2321J3369J4555J6429a7394A953J9338J8541J6564
56881E6396J3039Q890N712L984L063K771L598N219O317O498P076R204J2203J4683
56867A58653J6434J8240K0467K2881K5484K8455L1377L3342L3929L3270L1022
56856D53554K5980J7317O065m990j3024j6873j7286j5846j3772j1552r302o987
56844C93284m350r40L632R385J5921K2571K8763L4346L9488M4132M7780M9820
56832F83832M9688M6441L8781K6192J0051o804k1522l2110l7609l8400l6341l3710
56820F48489l1602k9666k7284k4351k0923j6796j1851o293k86O182J2856J8980
56808E17455K3792K6939K8153K6891K2488J4614L686q764k0219k8344l2443l3540
$$ plain form
56796 540708 507647 475857 445775 417422 390596 365406 342454 322470 305993 293354 284750 280277
56784 280277 279967 283665 290736 300070 310568 321358 331214 338003 339294 333687 321381 303651 282223
56771 282223 259051 235977 214063 193301 173125 153079 133055 113164 93613 74620 56346
56760 56346 39004 23040 9028 -2661 -12103 -19733 -26129 -31758 -36771 -41067 -44672 -47959 -51328 -54763
56746 -54763 -57904 -60516 -62618 -64262 -65463 -66354 -67128 -67791 -68231 -68543 -68993 -69626 -70238 -70829 -71713 -72939 -73911
56729 -73911 -74000 -73426 -73145 -73777 -74927 -75728 -75819 -75549 -75310 -75022 -74435 -73641 -72989 -72590 -72286 -72088 -72259 -72778 -73080
56710 -73080 -72676 -71801 -71102 -70791 -70459 -69728 -68749 -67916 -67362 -66872 -66254 -65664 -65534 -66080 -66907 -67293 -66949 -66293 -65785
56691 -65785 -65305 -64504 -63570 -63126 -63332 -63566 -63154 -62094 -60874 -59842 -59038 -58422 -57963 -57573 -57121 -56561 -55939 -55305
$$ packed form
56796E40708l3061l1790l0082k8353k6826k5190k2952j9984j6477j2639q604m473
56784B80277l10L698P071R334J0498J0790R856O789J291n607j2306j7730k1428
56771B82223k3172k3074k1914k0762k0176k0046k0024j9891j9551j8993j8274
56760E6346j7342j5964I028b661r442p630o396n629n013m296l605l287l369l435
56746e4763l141k612k102j644j201q91p74o63m40l12m50o33o12n91q84j226r72
56729g3911q9N74K81o32j150q01r1K70K39K88N87P94O52L99L04J98j71n19l02
56710g3080M04Q75O99L11L32P31R79Q33N54M90O18N90J30n46q27l86L44O56N08
56691f5785M80Q01R34M44k06k34M12J060J220J032Q04O16M59L90M52N60O22O34
$$ plain form
56673 -55305 -54682 -54081 -53470 -52800 -52100 -51436 -50704 -49591 -47900 -45857 -43919 -42208 -40366 -38101 -35805 -34382
56657 -34382 -34364 -35319 -36268 -36595 -36439 -36281 -36341 -36452 -36359 -36053 -35843 -36033 -36483 -36649 -36227 -35636 -35506 -35782 -35745 -35022
56637 -35022 -34108 -33733 -34102 -35035 -36396 -38004 -39417 -40350 -41140 -42331 -43921 -45354 -46173 -46266 -45608 -44242 -42539
56620 -42539 -41031 -39911 -39035 -38377 -38041 -37761 -36914 -35237 -33194 -31429 -30119 -29072 -28148 -27398 -26929 -26791 -26851
56603 -26851 -26728 -26042 -24698 -22777 -20263 -17317 -14705 -13327 -13046 -12557 -10786 -8028 -5320 -3105 -1044
56587 1135 3243 5044 6587 8002 9334 10649 12047 13507 14948 16401 17920 19416 20858 22596 25090
56572 25090 28279 31564 34538 37424 40641 44191 47726 50970 53833 56250 58258 60241 62822 66341
56558 66341 70577 75079 79693 84649 90217 96474 103442 111172 119482 127801 135655 143352 151769 161242
$$ packed form
56673e5305O23O01O11O70P00O64P32J113J691K043J938J711J842K265K296J423
56657c4382J8r55r49l27J56J58o0j11R3L06K10j90m50j66M22N91J30k76L7P23
56637c5022R14L75l69r33j361j608j413r33p90j191j590j433q19r3O58J366J703
56620d2539J508J120Q76O58L36K80Q47J677K043J765J310J047R24P50M69J38o0
56603b6851J23O86J344J921K514K946K612J378K81M89J771K758K708K215a044
56587A135K108J801J543J415J332J315J398J460J441J453J519J496J442J738K494
56572B5090L189L285K974K886L217L550L535L244K863K417K008J983K581L519
56558F6341M236M502M614M956N568O257O968P730Q310Q319P854P697Q417R473
$$ plain form
56544 161242 170930 179574 186725 192953 198988 205023 210808 215989 220256 223392 225405 226462 226650 225955 224450
56529 224450 222248 219169 214813 209115 202564 195659 188485 181119 174105 168003 162542 156744 149989 142552
56515 142552 135033 127674 120477 113591 107231 101369 95849 90698 86077 81993 78310 74979 72046 69439
56501 69439 67016 64793 62895 61250 59586 57827 56303 55442 55350 55708 55941 55507 54258 52676 51586 51475
56485 51475 52169 53122 53866 54176 54149 54298 55235 56920 58430 58892 58535 58412 59116 60304 61568 63163 65441
56468 65441 67996 70073 71717 73871 77058 80537 83166 84816 86439 88815 91752 94591 97082 99523
56454 99523 102293 105564 109268 113101 116657 119814 122939 126451 130306 134230 138351 143127 148597 154146
56440 154146 159300 164352 169847 175738 181523 187042 192587 198162 203119 206812 209335 211390 213584 216064
$$ packed form
56544A61242R688Q644P151O228O035O035N785N181M267L136K013J057J88o95j505
56529B24450k202l079m356n698o551o905p174p366p014o102n461n798o755p437
56515A42552p519p359p197o886o360n862n520n151m621m084l683l331k933k607
56501F9439k423k223j898j645j664j759j524q61r2L58K33m34j249j582j090j11
56485E1475O94R53P44L10k7J49R37J685J510M62l57j23P04J188J264J595K278
56468F5441K555K077J644K154L187L479K629J650J623K376K937K839K491K441
56454I9523K770L271L704L833L556L157L125L512L855L924M121M776N470N549
56440A54146N154N052N495N891N785N519N545N575M957L693K523K055K194K480
$$ plain form
56426 216064 218593 220694 221815 221748 220977 220350 220243 220222 219634 218277 216256 213477 209767 205461 201338 197743
56410 197743 194131 189819 184871 179882 175125 170403 165629 161010 156584 152033 147137 142035 136852 131496
56396 131496 126119 121409 118053 115989 114550 113206 111900 110812 110058 109626 109322 108853 108143 107478 107186 107263
56380 107263 107566 108201 109402 111078 112859 114600 116534 118842 121351 123785 126049 128125 129879 131187 132155
56365 132155 133064 134132 135466 137183 139446 142258 145293 148032 150147 151761 153228 154715 156151 157549
56351 157549 159116 160962 162950 165081 167769 171400 175739 180107 184091 187748 191155 194181 196871 199723
56337 199723 203242 207298 211136 214071 216146 218095 220668 223991 227702 231723 236542 242496 248971 254781
56323 254781 259383 263357 267641 272624 278091 283762 289644 296070 303510 312102 321223 329803 337271 343985
$$ packed form
56426B16064K529K101J121o7p71o27j07k1n88j357k021k779l710m306m123l595
56410A97743l612m312m948m989m757m722m774m619m426m551m896n102n183n356
56396A31496n377m710l356k064j439j344j306j088p54m32l04m69p10o65k92P7
56380A07263L03O35J201J676J781J741J934K308K509K434K264K076J754J308R68
56365A32155R09J068J334J717K263K812L035K739K115J614J467J487J436J398
56351A57549J567J846J988K131K688L631M339M368L984L657L407L026K690K852
56337A99723L519M056L838K935K075J949K573L323L711M021M819N954O475N810
56323B54781M602L974M284M983N467N671N882O426P440Q592R121Q580P468O714
$$ plain form
56309 343985 350560 357058 363161 368883 374639 380574 386243 391044 394778 397703 400278 402918 405753 408460
56295 408460 410412 411106 410415 408532 405951 403496 401975 401457 401073 399842 397651 395215 393197 391706 390640
56280 390640 390027 389868 389970 390284 391193 393136 396042 399470 403195 407362 412120 417505 423722 431097 439535
56265 439535 448355 456970 465585 474956 485630 497704 511186 526252 543031 561366 581021 602068
56253 602068 624920 649914 676938 705608 735828 767966 802359 838764 876482 914853 953419
56242 953419 991775 1029622 1066914 1103540 1138808 1171614 1201127 1227044 1249250 1267761 1283022
56231 1283022 1295671 1305768 1312842 1316945 1319095 1320315 1320803 1320467 1319652 1318741 1317536 1315695 1313401 1310870
56217 1310870 1307625 1303028 1297232 1290704 1282995 1272991 1260426 1246206 1231055 1214723 1196796 1177434
$$ packed form
56309C43985O575O498O103N722N756N935N669M801L734K925K575K640K835K707
56295D08460J952O94o91j883k581k455j521n18l84j231k191k436k018j491j066
56280C90640o13j59J02L14R09J943K906L428L725M167M758N385O217P375Q438
56265D39535Q820Q615Q615R371J0674J2074J3482J5066J6779J8335J9655K1047
56253F02068K2852K4994K7024K8670L0220L2138L4393L6405L7718L8371L8566
56242I53419L8356L7847L7292L6626L5268L2806K9513K5917K2206J8511J5261
56231A283022J2649J0097P074M103K150J220M88l36q15r11j205j841k294k531
56217A310870l245m597n796o528p709j0004j2565j4220j5151j6332j7927j9362
$$ plain form
56205 1177434 1156910 1135158 1112282 1088962 1065852 1043047 1020535 998663 977655 957107 936587
56194 936587 916419 897308 879441 862521 846607 832331 820221 810174 801574 793584 785444 777033
56182 777033 769254 763390 759811 757632 755954 755095 756082 759050 762797 766167 769328 773230 778225 783913 790123
56167 790123 797062 804338 810845 816171 821386 827739 835128 842637 849962 857330 864413 870497 875639 880555
56153 880555 885337 889445 893176 897946 904539 912098 919477 926753 934672 943306 952183 961339 971401 982803
56139 982803 995539 1009525 1024684 1040797 1057695 1075412 1093885 1112881 1132675 1154394 1179101
56128 1179101 1206750 1236607 1268513 1303207 1341583 1384303 1432165 1486275 1547601 1616665 1693804
56117 1693804 1779468 1874242 1978774 2093749 2219649 2356352 2502823 2657138 2816804 2979141
$$ packed form
56205A177434k0524k1752k2876k3320k3110k2805k2512k1872k1008k0548k0520
56194I36587k0168j9111j7867j6920j5914j4276j2110j0047q600p990q140q411
56182G77033p779n864l579k179j678q59R87K968L747L370L161L902M995N688O210
56167G90123O939P276O507N326N215O353P389P509P325P368P083O084N142M916
56153H80555M782M108L731M770O593P559P379P276P919Q634Q877R156J0062J1402
56139I82803J2736J3986J5159J6113J6898J7717J8473J8996J9794K1719K4707
56128A179101K7649K9857L1906L4694L8376M2720M7862N4110O1326O9064P7139
56117A693804Q5664R4774J04532J14975J25900J36703J46471J54315J59666J62337
$$ plain form
56107 2979141 3141365 3300265 3452182 3593989 3724405 3844111 3954487 4056434 4150085 4234741
56097 4234741 4308493 4368438 4411948 4437912 4446864 4440379 4420404 4388376 4344281 4286761 4214392 4126657
56085 4126657 4023807 3906855 3778552 3643812 3508187 3375772 3248833 3128871 3017109
56076 3017109 2914067 2819491 2733042 2654709 2584583 2522617 2468702 2422710 2384460 2353774 2330440
56065 2330440 2313980 2303691 2299038 2299698 2304999 2313790 2325215 2339214 2355938 2375171 2396797 2421290
56053 2421290 2449011 2479399 2511580 2545555 2581988 2620973 2661791 2703954 2747709 2793359 2840614
56042 2840614 2888942 2938154 2988426 3039967 3092858 3147122 3202808 3260003 3318638 3378380 3438961
56031 3438961 3500657 3564156 3629892 3697915 3768412 3841796 3918082 3996843 4078095 4162609 4250917
$$ packed form
56107B979141J62224J58900J51917J41807J30416J19706J10376J01947R3651Q4656
56097D234741P3752N9945M3510K5964Q952o485j9975l2028m4095n7520p2369q7735
56085D126657j02850j16952j28303j34740j35625j32415j26939j19962j11762
56076C017109j03042r4576q6449p8333p0126o1966n3915m5992l8250l0686k3334
56065B330440j6460j0289m653O60N301Q791J1425J3999J6724J9233K1626K4493
56053B421290K7721L0388L2181L3975L6433L8985M0818M2163M3755M5650M7255
56042B840614M8328M9212N0272N1541N2891N4264N5686N7195N8635N9742O0581
56031C438961O1696O3499O5736O8023P0497P3384P6286P8761Q1252Q4514Q8308
$$ plain form
56020 4250917 4342601 4437010 4534135 4634237 4737228 4843035 4952066 5064674 5180647 5299850
56010 5299850 5423008 5551168 5684734 5823504 5967198 6115385 6267409 6423104 6583305
56001 6583305 6749215 6921670 7101434 7289521 7486613 7692675 7907680 8132115 8366274
55992 8366274 8609867 8863053 9127249 9404354 9695824 10003065 10327827 10671575 11035282
55983 11035282 11420449 11829408 12264158 12726020 13217054 13740712 14300770 14901253 15548092
55974 15548092 16249312 17013037 17847253 18762335 19772164 20892809 22143444 23550167 25147498
55965 25147498 26977657 29093987 31566952 34482805 37935980 42028827 46880364 52629670
55957 52629670 59431139 67452920 76868754 87817691 100353002 114447321 130055662
$$ packed form
56020D250917R1684R4409R7125J00102J02991J05807J09031J12608J15973J19203
56010E299850J23158J28160J33566J38770J43694J48187J52024J55695J60201
56001F583305J65910J72455J79764J88087J97092K06062K15005K24435K34159
55992H366274K43593K53186K64196K77105K91470L07241L24762L43748L63707
55983A1035282L85167M08959M34750M61862M91034N23658N60058O00483O46839
55974A5548092P01220P63725Q34216R15082J009829J120645J250635J406723J597331
55965B5147498J830159K116330K472965K915853L453175M092847M851537N749306
55957E2629670O801469Q021781R415834J0948937J2535311J4094319J5608341
$$ plain form
55950 130055662 147128579 165511618 184849567 204642356 224355649 243318249 260391227
55943 260391227 273818892 281660558 282649779 276853604 265654469 251138661 235333553
55936 235333553 219663306 204756833 190587445 176822762 163173653 149555780 136051537
55929 136051537 122811274 110006436 97824731 86452059 76036067 66662748 58356328
55922 58356328 51088980 44793439 39379556 34749032 30801779 27438635 24567276 22107867
55914 22107867 19992699 18163192 16569989 15173994 13944073 12853852 11881540 11010622
55906 11010622 10228059 9522092 8882723 8302729 7776339 7297499 6860513 6461243 6096314
55897 6096314 5761893 5454333 5171177 4910410 4669396 4445556 4237447 4044238 3864707
$$ packed form
55950A30055662J7072917J8383039J9337949J9792789J9713293J8962600J7072978
55943B60391227J3427665P841666R89221n796175j1199135j4515808j5805108
55936B35333553j5670247j4906473j4169388j3764683j3649109j3617873j3504243
55929A36051537j3240263j2804838j2181705j1372672j0415992r373319q306420
55922E8356328p267348o295541n413883m630524l947253l363144k871359k459409
55914B2107867k115168j829507j593203j395995j229921j090221r72312q70918
55906A1010622p82563p05967o39369n79994n26390m78840m36986l99270l64929
55897F096314l34421l07560k83156k60767k41014k23840k08109j93209j79531
$$ plain form
55888 3864707 3697539 3541974 3397346 3262535 3136530 3018958 2909404 2806810 2710203 2619448
55878 2619448 2534627 2455230 2380647 2310837 2245819 2184950 2127442 2073241 2022758 1976067 1932989
55867 1932989 1893626 1858202 1826575 1798380 1773364 1750995 1730011 1708964 1687085 1664194 1639938
55856 1639938 1613703 1585284 1555210 1524288 1493091 1461918 1431068 1401055 1372482 1345580 1319959
55845 1319959 1295160 1271466 1249776 1230538 1213209 1196957 1181458 1166777 1152912 1139871 1127817
55834 1127817 1116631 1105568 1093796 1081190 1068277 1055623 1043656 1032871 1023625 1015668 1008351 1001499
55822 1001499 995778 992079 990834 992056 995710 1001613 1009098 1017116 1024727 1031119 1034966 1034147 1026750 1012590
55808 1012590 993575 972508 951727 932741 916409 902883 891582 881823 873455 866579 860804 855319
$$ packed form
55888C864707j67168j55565j44628j34811j26005j17572j09554j02594r6607r0755
55878B619448q4821p9397p4583o9810o5018o0869n7508n4201n0483m6691m3078
55867A932989l9363l5424l1627k8195k5016k2369k0984k1047k1879k2891k4256
55856A639938k6235k8419l0074l0922l1197l1173l0850l0013k8573k6902k5621
55845A319959k4799k3694k1690j9238j7329j6252j5499j4681j3865j3041j2054
55834A127817j1186j1063j1772j2606j2913j2654j1967j0785r246p957p317o852
55822A001499n721l699j245J222L654N903P485Q018P611O392L847q19p397j4160
55808A012590j9015k1067k0781j8986j6332j3526j1301r759q368o876n775n485
$$ plain form
55796 855319 849724 844270 839188 834277 829429 825082 821770 819455 817676 816192 815123 814469 813827 812731 811163
55781 811163 809657 808921 809339 810847 813260 816584 820928 826091 831344 835540 837405 835853 830288 820720 807615
55766 807615 791715 774028 755677 737346 718832 699322 678217 655661 632460 609706 588305
55755 588305 568466 549581 530834 511968 493413 475846 459801 445510 432753 421004 410106
55744 410106 400641 393186 387315 381843 376017 369903 363602 356834 349522 342120 334989 327977 321005 314522
55730 314522 308866 303630 298246 292890 288130 283876 279354 274121 268532 263138 258143 253565 249419 245526
55716 245526 241550 237490 233873 231172 229220 227410 225309 222912 220503 218496 217327 217250 218156 219695 221548
55701 221548 223505 225397 227103 228612 229997 231397 233103 235482 238500 241364 243024 243276 243049 243287 243765
$$ packed form
55796H55319n595n454n082m911m848m347l312k315j779j484j069o54o42j096j568
55781H11163j506p36M18J508K413L324M344N163N253M196J865j552n565r568j3105
55766H07615j5900j7687j8351j8331j8514j9510k1105k2556k3201k2754k1401
55755E88305j9839j8885j8747j8866j8555j7567j6045j4291j2757j1749j0898
55744D10106r465p455n871n472n826o114o301o768p312p402p131p012o972o483
55730C14522n656n236n384n356m760m254m522n233n589n394m995m578m146l893
55716B45526l976m060l617k701j952j810k101k397k409k007j169p7R06J539J853
55701B21548J957J892J706J509J385J400J706K379L018K864J660K52k27K38M78
$$ plain form
55686 243765 243418 241765 239495 237517 235902 234062 231555 228235 223899 218484 212637 207521 203665 200305
55672 200305 196136 190585 184106 177416 170867 164621 159029 154437 150634 146874 142720 138664 135534 133339
55658 133339 131226 128761 126719 126088 126662 127272 127320 127341 127924 128754 129171 129127 128984 128606 127335 124963 122250 120194
55640 120194 119014 118064 116610 114445 111791 108930 106196 104134 103195 103085 102728 101231 98782 96344 94616
55625 94616 93646 93241 93231 93234 92794 92023 91664 92190 93177 93951 94536 95477 96899 98225 98862 98823 98622 98826 99704 101046
55605 101046 102298 103101 103720 104711 106163 107565 108516 109267 110332 111737 112920 113396 113394 113726 115045 117302 119967
55588 119967 122691 125598 128988 133049 137979 144081 151389 159364 167426 175846 185718 197960 212604 229228
55574 229228 247703 268272 291226 317010 346465 380447 418985 461158 505937 552805 601363
$$ packed form
55686B43765l47j653k270j978j615j840k507l320m336n415n847n116l856l360
55672B00305m169n551o479o690o549o246n592m592l803l760m154m056l130k195
55658A33339k113k465k042o31N74O10M8K1N83Q30M17m4j43l78j271k372k713k056
55640A20194j180r50j454k165k654k861k734k062r39j10l57j497k449k438j728
55625I4616r70m05j0Lm40p71l59N26R87P74N85R41J422J326O37l9k01K04Q78J342
55605A01046J252Q03O19R91J452J402R51P51J065J405J183M76kL32J319K257K665
55588A19967K724K907L390M061M930O102P308P975Q062Q420R872J2242J4644J6624
55574B29228J8475K0569K2954K5784K9455L3982L8538M2173M4779M6868M8558
$$ plain form
55563 601363 650636 699103 745101 786778 821777 847627 862721 866712 860024 843499 818652 787659
55551 787659 752539 714565 674754 634478 594936 556258 517826 479562 442382 407260 374389
55540 374389 343424 314086 286343 260432 236917 216261 198160 181763 166819 154020 143785
55529 143785 135223 126986 118780 111327 105018 99387 93960 88897 84494 80600 76898 73458 70636 68566
55515 68566 67017 65724 64707 64183 64147 64078 63272 61651 59992 59076 58764 58269 57190 55827 54534 53331 52299
55498 52299 51775 51855 52077 51920 51325 50478 49366 47878 46073 44043 41767 39405 37426 36014 34605 32567
55482 32567 30153 28203 26981 25946 24739 23674 22929 21963 20280 18319 16940 16277 15711 14911 14253 14114
55466 14114 14375 14816 15498 16375 16868 16292 14641 12670 11269 10937 11698 13185 14797 15984 16546 16627 16509
$$ packed form
55563F01363M9273M8467M5998M1677L4999K5850J5094L991o688j6525k4847l0993
55551G87659l5120l7974l9811m0276l9542l8678l8432l8264l7180l5122l2871
55540C74389l0965k9338k7743k5911k3515k0656j8101j6397j4944j2799j0235
55529A43785q562q237q206p453o309n631n427n063m403l894l702l440k822k070
55515F8566j549j293j017n24l6o9q06j621j659r16l12m95j079j363j293j203j032
55498E2299n24Q0K22j57n95q47j112j488j805k030k276k362j979j412j409k038
55482C2567k414j950j222j035j207j065p45r66j683j961j379o63n66q00o58j39
55466A4114K61M41O82Q77M93n76j651j971j401l32P61J487J612J187N62Q1j18
$$ plain form
55449 16509 16476 16640 16766 16436 15573 14566 13699 12784 11735 11154 11730 13194 14570 15471 16416 17678 18620 18637
55431 18637 18111 17808 17781 17601 17356 17623 18472 19189 19209 18809 18734 19445 20917 22850 24874 26677 28086 29013
55413 29013 29463 29731 30370 31655 33235 34661 36083 37960 40177 42062 43375 44706 46650 49030 51292
55398 51292 53305 55363 57523 59276 59886 59024 57145 55202 53765 52436 50416 47597 44657 42076 39639
55383 39639 37107 34783 32991 31449 29674 27764 26300 25654 25736 26220 26656 26597 26030 25421 24973 24176 22631
55366 22631 20914 19858 19223 17964 15850 13824 12564 11583 10301 9173 9011 9726 10493 10870 11057 11246
55350 11246 11376 11468 11540 11248 10247 8943 8240 8364 8587 8395 8256 8745 9455 9539 9053 8966 9748 10678 10833 10250
55330 10250 9731 9852 10635 11905 13441 14756 15274 14928 14297 13955 13927 13980 14111 14408 14582 14111 12940 11699
$$ packed form
55449A6509l3J64J26l30q63j007q67r15j049n81N76J464J376R01R45J262R42J7
55431A8637n26l03k7j80k45K67Q49P17K0m00p5P11J472J933K024J803J409R27
55413B9013M50K68O39J285J580J426J422J877K217J885J313J331J944K380K262
55398E1292K013K058K160J753O10q62j879j943j437j329k020k819k940k581k437
55383C9639k532k324j792j542j775j910j464o46Q2M84M36n9n67o09m48p97j545
55366B2631j717j056o35j259k114k026j260r81j282j128j62P15P67L77J87J89
55350A1246J30R2P2k92j001j304p03J24K23j92j39M89P10Q4m86q7P82R30J55n83
55330A0250n19J21P83J270J536J315N18l46o31l42k8N3J31K97J74m71j171j241
$$ plain form
55312 11699 11092 11309 12137 13355 14705 15681 15785 15055 14100 13489 13280 13254 13388 13917 14972 16331 17513 18012
55294 18012 17583 16508 15506 15152 15317 15342 14845 14105 13591 13375 13266 13245 13377 13353 12629 11216 9957 9703 10396
55275 10396 11247 11711 11895 12023 11952 11491 10978 11115 12117 13309 13775 13352 12765 12714 13042 12990 12176 11054 10312
55256 10312 10091 9999 9743 9435 9255 9081 8675 8125 7849 8109 8663 8998 8820 8245 7585 7124 7026 7213 7272 6784
55236 6784 5966 5744 6823 8744 10250 10591 10135 9645 9448 9487 9776 10298 10756 10946 11263 12326 14001 15296
55218 15296 15411 14536 13468 12738 12438 12569 13142 13945 14597 14903 15002 15129 15430 15987 16797 17627 18160 18443 18937
55199 18937 19866 20721 20787 20161 19797 20318 21211 21557 21306 21267 21905 22694 22872 22387 21745 21264 20859 20417 19949 19412
55179 19412 18709 17958 17456 17323 17299 16998 16227 15094 13937 13147 12889 12968 13008 12775 12279 11698 11343 11536 12288
$$ packed form
55312A1699o07K17Q28J218J350R76J04p30r55o11k09k6J34N29J055J359J182M99
55294A8012m29j075j002l54J65K5m97p40n14k16j09k1J32k4p24j413j259k54O93
55275A0396Q51M64J84J28p1m61n13J37J002J192M66m23n87n1L28n2q14j122p42
55256A0312k21r2k56l08j80j74m06n50k76K60N54L35j78n75o60m61r8J87N9m88
55236F784q18k22J079J921J506L41m56m90j97L9K89N22M58J90L17J063J675J295
55218A5296J15q75j068p30l00J31N73Q03O52L06R9J27L01N57Q10Q30N33K83M94
55199A8937R29Q55O6o26l64N21Q93L46k51l9O38P89J78m85o42m81m05m42m68n37
55179A9412p03p51n02j33k4l01p71j133j157p90k58P9M0k33m96n81l55J93P52
$$ plain form
55160 12288 13164 13592 13273 12183 10457 8555 7277 7146 7858 8715 9500 10454 11492 12057 11838 11077 10000
55143 10000 8626 7370 7171 8489 10573 12258 13142 13522 13568 13214 12694 12504 12768 13145 13371 13471 13422 13104
55125 13104 12695 12722 13519 14896 16436 17873 19108 20143 21093 22078 23041 23854 24626 25680 27177 28893 30372
55108 30372 31148 30964 30067 29196 28933 29118 29219 29194 29509 30296 31086 31539 31917 32515 33083 33184 32794 32133 31227
55089 31227 30128 29371 29605 30758 32010 32708 32921 32945 32643 31681 30281 29323 29487 30467 31240 31139 30452 29924
55071 29924 29943 30382 31048 31922 32989 34170 35445 36750 37703 37772 36892 35620 34495 33504 32344 30992 29765
55054 29765 28961 28645 28667 28724 28612 28565 29147 30575 32322 33590 33985 33526 32330 30703 29357 29008 29731 30995
55036 30995 32337 33621 34709 35366 35687 36213 37327 38761 39941 40651 41094 41429 41588 41585 41732 42386 43558
$$ packed form
55160A2288Q76M28l19j090j726j902j278j31P12Q57P85R54J038N65k19p61j077
55143A0000j374j256j99J318K084J685Q84L80M6l54n20j90K64L77K26J00m9l18
55125A3104m09K7P97J377J540J437J235J035R50R85R63Q13P72J054J497J716J479
55108C0372P76j84q97q71k63J85J01k5L15P87P90M53L78N98N68J01l90o61r06
55089C1227j099p57K34J153J252O98K13K4l02r62j400r58J64R80P73j01o87n28
55071B9924J9M39O66Q74J067J181J275J305R53O9q80j272j125r91j160j352j227
55054B9765q04l16K2N7j12m7N82J428J747J268L95m59j196j627j346l49P23J264
55036C0995J342J284J088O57L21N26J114J434J180P10M43L35J59lJ47O54J172
$$ plain form
55019 43558 44956 46399 48039 50108 52520 54858 56698 57858 58389 58563 58916 60027 61998 64132 65285
55004 65285 64658 62417 59633 57535 56533 55969 54975 53532 52336 51604 50579 48502 45683 43134 41411
54989 41411 40268 39325 38537 37951 37482 37086 36871 36887 37018 37169 37438 38037 39178 40930 42979 44593 45169 44885
54971 44885 44592 44996 46099 47476 48765 49777 50373 50465 50196 50043 50673 52544 55489 58830 62054 65279
54955 65279 68929 73167 77914 83165 88841 94476 99629 104685 110690 118185 126589 134937 142831 150382
54941 150382 157602 164285 170392 176184 181888 187287 191557 193556 192601 189088 184173 178690 172619 165708
54927 165708 158271 151052 144463 138288 132067 125606 119091 112891 107250 102135 97440 93305 90029 87615
54913 87615 85615 83577 81525 79886 79100 79373 80639 82675 85368 88948 93729 99595 106006 112565 119274
$$ packed form
55019D3558J398J443J640K069K412K338J840J160N31J74L53J111J971K134J153
55004F5285o27k241k784k098j002n64r94j443j196p32j025k077k819k549j723
54989D1411j143r43p88n86m69l96k15J6J31J51K69N99J141J752K049J614N76k84
54971D4885k93M04J103J377J289J012N96R2k69j53O30J871K945L341L224L225
54955F5279L650M238M747N251N676N635N153N056O005P495Q404Q348P894P551
54941A50382P220O683O107N792N704N399M270J999r55l513m915n483o071o911
54927A65708p437p219o589o175o221o461o515o200n641n115m695m135l276k414
54913H7615k000k038k052j639p86K73J266K036K693L580M781N866O411O559O709
$$ plain form
54898 119274 126112 132777 139051 145040 150633 155054 157465 157944 157402 156509 155052 152414 148400 143425 138054
54883 138054 132555 126877 121033 115352 110237 105712 101435 97178 93077 89377 86205 83663 81779 80261
54869 80261 78654 77030 76053 76026 76223 75675 74383 73240 72903 73252 73917 74761 75752 76735 77531 78056 78315 78531
54851 78531 79164 80484 82131 83468 84403 85502 87207 89283 91144 92412 92993 92853 91944 90257 87884 85115
54835 85115 82419 80101 77938 75402 72238 68633 64865 61081 57479 54401 52098 50554 49614 49059 48544
54820 48544 47765 46812 46107 45888 45924 45806 45315 44497 43655 43385 44237 46105 48183 49726 50693 51439 52103 52644
54802 52644 53308 54613 56791 59555 62526 65698 69405 73968 79497 85893 92929 100397 108259 116663 125717
54787 125717 135275 145024 154708 164125 172908 180566 186824 191710 195121 196601 195878 193486 190389 187032
$$ packed form
54898A19274O838O665O274N989N593M421K411M79n42q93j457k638m014m975n371
54883A38054n499n678n844n681n115m525m277m257m101l700l172k542j884j518
54869H0261j607j624r77k7J97n48j292j143l37L49O65Q44R91R83P96N25K59K16
54851G8531O33J320J647J337R35J099J705K076J861J268N81j40r09j687k373k769
54835H5115k696k318k163k536l164l605l768l784l602l078k303j544r40n55n15
54820D8544p79r53p05k19L6j18m91q18q42k70Q52J868K078J543R67P46O64N41
54802E2644O64J305K178K764K971L172L707M563N529O396P036P468P862Q404R054
54787A25717R558R749R684R417Q783P658O258M886L411J480p23k392l097l357
$$ plain form
54773 187032 183167 178637 173737 168684 163323 157735 152562 148279 144565 140970 137808 135760 134875 134721 135326
54758 135326 137219 140526 144810 149912 156179 163553 171158 178254 185182 192884 201723 211119 220176 228383
54744 228383 235841 242961 249811 255715 259741 261538 261419 259617 255992 250555 243769 235990 227079 216955
54730 216955 206213 195750 185971 176672 167506 158262 148780 139010 129218 119990 111950 105383 100017 95213
54716 95213 90612 86527 83386 80881 78162 74956 71966 69933 68767 67879 66961 66031 65063 63977 62806
54701 62806 61596 60353 59340 59102 59914 61477 63347 65317 67124 68249 68485 68348 68471 68857 69194 69534
54685 69534 70127 70825 71352 71999 73428 75740 78315 80641 82845 85277 87983 90739 93337 95745 98183
54670 98183 101039 104456 108076 111451 114641 118130 122198 126637 131068 135280 139272 143098 146654 149610
$$ packed form
54773A87032l865m530m900n053n361n588n173m283l714l595l162k048q85j54O05
54758A35326J893L307M284N102O267P374P605P096O928P702Q839R396R057Q207
54744B28383P458P120O850N904M026J797j19j802l625n437o786p779q911j0124
54730B16955j0742j0463r779r299r166r244r482r770r792r228q040o567n366m804
54716I5213m601m085l141k505k719l206k990k033j166q88r18r30r68j086j171
54701F2806j210j243j013k38Q12J563J870J970J807J125K36j37J23L86L37L40
54685F9534N93O98N27O47J429K312K575K326K204K432K706K756K598K408K438
54670I8183K856L417L620L375L190L489M068M439M431M212L992L826L556K956
$$ plain form
54656 149610 151798 153758 156482 160314 164505 168231 171753 176137 182192 190089 199648 210364 221492 232733
54642 232733 244657 257823 271742 285330 298016 309530 318907 324843 327120 326682 324171 319434 312621
54629 312621 304581 295629 285024 272497 259515 248047 238496 229613 220164 209993 199762 190366 182485
54616 182485 176126 170606 165329 160423 156302 152890 149727 146675 143969 141699 139628 137458 134961 131992
54602 131992 128692 125542 122900 120632 118446 116387 114610 112909 110892 108486 105928 103361 100850 98667
54588 98667 97144 96263 95660 94984 94011 92619 90988 89677 89087 88952 88716 88222 87605 86743 85428 84042 83343
54571 83343 83408 83379 82548 81226 80200 79710 79396 79023 78854 79309 80543 82325 84184 85630 86395 86542 86398 86385
54553 86385 86852 87869 89250 90823 92698 95076 97894 100789 103450 105874 108285 110971 114180 117990 122302
$$ packed form
54656A49610K188J960K724L832M191L726L522M384O055P897R559J0716J1128J1241
54642B32733J1924J3166J3919J3588J2686J1514R377N936K277m38k511m737o813
54629C12621q040q952j0605j2527j2982j1468r551q883r449j0171j0231r396p881
54616A82485o359n520n277m906m121l412l163l052k706k270k071k170k497k969
54602A31992l300l150k642k268k186k059j777j701k017k406k558k567k511k183
54588I8667j523q81o03o76r73j392j631j311n90j35k36m94o17q62j315j386o99
54571H3343O5k9q31j322j026m90l14l73j69M55J234J782J859J446P65J47j44j3
54553H6385M67J017J381J573J875K378K818K895K661K424K411K686L209L810M312
$$ plain form
54538 122302 127021 132206 137863 143783 149824 156215 163183 170359 176959 182608 187548 191943 195490 197907
54524 197907 199355 199981 199429 197319 194003 190316 186628 182560 177677 172035 165981 159808 153820 148395 143739
54509 143739 139706 136044 132637 129351 125883 122072 118248 114981 112492 110548 108901 107554 106585 106010 105897
54494 105897 106329 107091 107678 107822 107767 107829 107989 108286 109278 111512 114551 117153 118638 119666 121340 123914 126701
54477 126701 128968 130533 131619 132629 134121 136578 139945 143473 146205 147679 148181 148360 148659 149110 149620
54462 149620 150237 150949 151406 151200 150449 149736 149340 148819 147612 145800 144016 142786 142211 142111 142187 142099 141655 140848
54444 140848 139581 137599 134956 132341 130481 129317 128154 126609 124973 123641 122655 121936 121518 121316 120967
54429 120967 120192 119067 117754 116227 114551 113264 113010 113805 114884 115453 115468 115595 116440 117895 119275 120059
$$ packed form
54538A22302M719N185N657N920O041O391O968P176O600N649M940M395L547K417
54524A97907J448O26n52k110l316l687l688m068m883n642o054o173n988n425m656
54509A43739m033l662l407l286l468l811l824l267k489j944j647j347r69n75j13
54494A05897M32P62N87J44n5O2J60K97R92K234L039K602J485J028J674K574K787
54477A26701K267J565J086J010J492K457L367L528K732J474N02J79K99M51N10
54462A49620O17P12M57k06p51p13l96n21j207j812j784j230n75j00P6q8m44q07
54444A40848j267j982k643k615j860j164j163j545j636j332r86p19m18k02l49
54429A20967p75j125j313j527j676j287k54P95J079N69J5J27Q45J455J380P84
$$ plain form
54413 120059 120329 120505 120904 121772 123502 126333 129840 133147 135798 138117 140586 143269 146086 149253 152972
54398 152972 156885 160305 162951 165071 166833 168048 168613 168820 168947 168828 168173 167228 166735 167139 168014 168387 167583
54381 167583 165702 163358 161061 158919 156826 154821 153092 151667 150277 148605 146565 144185 141392 138167
54367 138167 134951 132594 131683 132039 132976 133912 134552 134701 134328 133822 133875 134883 136583 138324 139556 140037 139850
54350 139850 139420 139349 140054 141583 143800 146570 149651 152646 155257 157474 159330 160616 161122 161062 160949 161002 160864
54333 160864 160011 158340 156288 154424 152946 151578 149954 147966 145620 142654 138721 134008 129275 125048
54319 125048 121116 117152 113436 110486 108209 105990 103572 101225 99009 96400 92932 88859 84948 81862
54305 81862 79824 78568 77447 75927 74167 72883 72463 72494 72346 71879 71298 70547 69261 67285 64966 62885
$$ packed form
54413A20059K70J76L99Q68J730K831L507L307K651K319K469K683K817L167L719
54398A52972L913L420K646K120J762J215N65K07J27j19o55r45m93M04Q75L73q04
54381A67583j881k344k297k142k093k005j729j425j390j672k040k380k793l225
54367A38167l216k357r11L56R37R36O40J49l73n06N3J008J700J741J232M81j87
54350A39850m30p1P05J529K217K770L081K995K611K217J856J286N06o0j13N3j38
54333A60864q53j671k052j864j478j368j624j988k346k966l933m713m733m227
54319A25048l932l964l716k950k277k219k418k347k216k609l468m073l911l086
54305H1862k038j256j121j520j760j284m20L1j48m67n81p51j286j976k319k081
$$ plain form
54289 62885 61437 60591 59954 59098 57951 56807 55928 55255 54544 53602 52326 50679 48809 47048 45674 44790
54273 44790 44460 44779 45642 46634 47314 47502 47269 46839 46577 46787 47360 47867 48159 48588 49391 50233 50731 51181 52269
54254 52269 54100 55967 57061 57129 56446 55629 55526 56837 59449 62338 64314 64894 64447 63688 63148 62944 62897
54237 62897 62886 63070 63711 64780 65905 66715 67066 66881 65984 64275 62022 59847 58370 57755 57564 57081 55963
54220 55963 54507 53188 52002 50509 48551 46613 45309 44714 44436 44185 43982 43850 43552 42787 41482 39817
54204 39817 38090 36654 35823 35655 35850 36024 36106 36349 36851 37230 36926 35818 34449 33578 33539 34041 34523 34713
54186 34713 34802 35109 35609 35927 35771 35207 34474 33723 33046 32559 32227 31803 31184 30701 30727 31090 31208 30794 30057 29250
54166 29250 28398 27547 26804 26055 25106 24306 24454 25739 27229 27915 27958 28349 29592 31278 32827 34034 34831
$$ packed form
54289F2885j448q46o37q56j147j144q79o73p11r42j276j647j870j761j374q84
54273D4790l30L19Q63R92O80J88k33m30k62K10N73N07K92M29Q03Q42M98M50J088
54254E2269J831J867J094O8o83q17j03J311K612K889J976N80m47p59n40k04m7
54237F2897j1J84O41J069J125Q10L51j85q97j709k253k175j477o15j91m83j118
54220E5963j456j319j186j493j958j938j304n95k78k51k03j32k98p65j305j665
54204C9817j727j436q31j68J95J74Q2K43N02L79l04j108j369q71l9N02M82J90
54186C4713Q9L07N00L18j56n64p33p51o77m87l32m24o19m83K6L63J18m14p37q07
54166B9250q52q51p43p49r49q00J48J285J490O86M3L91J243J686J549J207P97
$$ plain form
54149 34831 35100 34934 34744 34923 35613 36820 38477 40297 41867 42956 43557 43636 43159 42413 41921 41875 41884 41450 40498
54130 40498 39332 38342 37886 38200 39164 40290 41102 41476 41513 41297 40948 40790 41184 42166 43381 44380 44966 45243
54112 45243 45384 45384 45102 44568 44092 43972 44222 44720 45491 46563 47660 48325 48387 48035 47526 47096 47099 47770 48799 49499
54092 49499 49595 49482 49586 49828 49968 50089 50410 50862 51172 51227 51105 50884 50618 50363 50061 49586 49078 48965 49438 50178
54072 50178 50829 51436 52120 52659 52865 53100 53894 55129 56124 56502 56506 56458 56418 56473 56920 57942 59373 60859 61983
54053 61983 62275 61574 60549 60354 61466 63202 64618 65550 66389 67228 67715 67635 67149 66484 65808 65466 65937 67355
54035 67355 69287 71125 72563 73625 74443 75171 75975 76925 78030 79504 81875 85530 90176 95036 99630
54020 99630 104041 108275 111776 114071 115749 118165 121957 126274 129832 132362 134618 137194 139909 142394
$$ packed form
54149C4831K69j66j90J79O90J207J657J820J570J089O01P9m77p46m92m6Rm34r52
54130D0498j166r90m56L14R64J126Q12L74L7k16l49j58L94R82J215R99N86K77
54112D5243J41%k82n34m76j20K50M98P71J072J097O65O2l52n09m30LO71J029P00
54092D9499R6j13J04K42J40J21L21M52L10N5j22k21k66k55l02m75n08j13M73P40
54072E0178O51O07O84N39K06K35P94J235R95L78Mm8m0N5M47J022J431J486J124
54053F1983K92p01j025j95J112J736J416R32Q39Q39M87q0m86o65o76l42M71J418
54035F7355J932J838J438J062Q18P28Q04R50J105J474K371L655M646M860M594
54020I9630M411M234L501K295J678K416L792M317L558K530K256K576K715K485
$$ plain form
54006 142394 144716 147182 149814 152299 154241 155282 155138 153803 151678 149358 147275 145626 144520 143977 143719
53991 143719 143121 141569 138996 136045 133511 131552 129575 127048 124269 122039 120683 119772 118769 117500 115884
53976 115884 113725 111098 108610 106843 105726 104776 103830 103109 102679 102211 101309 99796 97721 95421 93551 92626
53960 92626 92450 92339 92045 92094 93015 94557 96022 97131 98183 99487 101029 102710 104571 106557 108329 109565
53944 109565 110420 111449 113031 115022 117127 119460 122458 126174 129940 132973 135185 137164 139414 141872
53930 141872 144191 146144 147718 149051 150418 152030 153651 154647 154646 154021 153514 153539 154024 154759 155543 156135 156408
53913 156408 156655 157382 158753 160488 162390 164650 167459 170620 173802 177014 180496 184236 187868 191103 194022
53898 194022 196960 200271 204211 208769 213488 217685 221005 223602 225640 226865 227036 226626 226633 227477 228413 228233
$$ packed form
54006A42394K322K466K632K485J942J041j44j335k125k320k083j649j106n43k58
53991A43719n98j552k573k951k534j959j977k527k779k230j356r11j003j269j616
53976A15884k159k627k488j767j117r50r46p21m30m68r02j513k075k300j870r25
53960I2626j76j11k94M9R21J542J465J109J052J304J542J681J861J986J772J236
53944A09565Q55J029J582J991K105K333K998L716L766L033K212J979K250K458
53930A41872K319J953J574J333J367J612J621R96jo25n07K5M85P35P84N92K73
53913A56408K47P27J371J735J902K260K809L161L182L212L482L740L632L235K919
53898A94022K938L311L940M558M719M197L320K597K038J225J71m10PQ44R36j80
$$ plain form
53882 228233 226434 223518 220420 217872 216113 214789 213124 210487 206964 203175 199558 196054 192490 188931
53868 188931 185455 181891 178057 174123 170496 167376 164608 161873 158919 155667 152241 148793 145254 141439
53854 141439 137534 134201 131865 130065 127906 125139 122427 120423 118938 117249 115045 112782 111097 110018
53840 110018 108867 106975 104454 102130 100689 100056 99662 99046 98029 96568 94833 93300 92409 92142 92239 92699
53824 92699 93648 94767 95362 95180 94689 94410 94360 94388 94611 95200 96032 96853 97519 97807 97370 96329 95589 96021 97382
53805 97382 98549 98865 98823 99315 100570 102033 103072 103563 103893 104577 105922 107971 110590 113453 116115 118405
53789 118405 120838 124215 128628 133205 137137 140661 144598 149200 153883 157960 161157 163501 165248 166943
53775 166943 169063 171498 173775 175803 177935 180164 181813 182319 181956 181468 181271 181335 181551 181854 182046 181842 181086
$$ packed form
53882B28233j799k916l098k548j759j324j665k637l523l789l617l504l564l559
53868A88931l476l564l834l934l627l120k768k735k954l252l426l448l539l815
53854A41439l905l333k336j800k159k767k712k004j485j689k204k263j685j079
53840A10018j151j892k521k324j441o33l94o16j017j461j735j533q91k67R7M60
53824I2699R49J119N95j82m91k79n0K8K23N89Q32Q21O66K88m37j041p40M32J361
53805I7382J167L16m2M92J255J463J039M91L30O84J345K049K619K863K662K290
53789A18405K433L377M413M577L932L524L937M602M683M077L197K344J747J695
53775A66943K120K435K277K028K132K229J649N06l63m88j97O4K16L03J92k04p56
$$ plain form
53758 181086 179861 178386 176891 175422 173794 171929 170234 169322 169225 169237 168738 167923 167450 167623 168173 168627 168609
53741 168609 167948 166789 165459 163989 162006 159410 156939 155566 155399 155586 155291 154393 153178 151826 150422
53726 150422 149186 148358 147960 147805 147651 147288 146543 145322 143607 141495 139305 137573 136693 136567 136767 137026 137270
53709 137270 137262 136627 135392 134100 133086 131962 130241 128276 127125 127416 128700 130019 130757 130808 130214 129053
53693 129053 127627 126494 126100 126425 127042 127594 128194 129290 131061 133068 134638 135582 136307 137243 138466 139924
53677 139924 141696 143656 145153 145516 144910 144328 144610 145740 147170 148459 149451 150166 150900 152276 154775 158159
53661 158159 161556 164226 166118 167695 169275 170624 171219 170912 170203 169664 169221 168382 167202 166478 166730 167420
53645 167420 167680 167434 167223 167144 166700 165699 164592 163700 162719 161362 160027 159402 159672 160483 161484 162550 163564
$$ packed form
53758A81086j225j475j495j469j628j865j695r12r7J2m99q15m73J73N50M54j8
53741A68609o61j159j330j470j983k596k471j373j67J87k95q98j215j352j404
53726A50422j236q28l98j55j54l63p45j221j715k112k190j732q80j26K00K59K44
53709A37270qo35j235j292j014j124j721j965j151K91J284J319P38N1n94j161
53693A29053j426j133l94L25O17N52O00J096J771K007J570R44P25R36J223J458
53677A39924J772J960J497L63o06n82K82J130J430J289R92P15P34J376K499L384
53661A58159L397K670J892J577J580J349N95l07p09n39m43q39j180p24K52O90
53645A67420K60k46k11p9m44j001j107q92r81j357j335o25K70Q11J001J066J014
$$ plain form
53628 163564 164363 164877 165162 165289 165301 165252 165194 165220 165483 166067 166830 167630 168715 170583 173304 176249 178693 180501
53610 180501 182063 183794 185832 188057 190215 192230 194474 197473 201208 205002 208282 211125 213849 216428
53596 216428 218659 220582 222437 224435 226897 230260 234450 238495 241344 243001 244431 246469 249247 252512
53582 252512 255906 258874 260926 262216 263535 265641 268808 272946 277613 281899 284857 286391 287353 288533
53568 288533 289848 290709 290846 290459 289747 288716 287459 286399 286111 286778 287850 288415 288091 287455 287336 287828 288292
53551 288292 288170 287414 286171 284612 283162 282452 282801 284037 285892 288221 290750 293052 295019 296982 299187
53536 299187 301480 303726 306114 308757 311385 313797 316303 319342 322915 326813 331197 336490 342724 349414
53522 349414 356084 362648 369271 376142 383416 391173 399357 407766 416129 424305 432598 441866 452935 465737
$$ packed form
53628A63564P99N14K85J27J2m9n8K6K63N84P63Q00J085J868K721K945K444J808
53610A80501J562J731K038K225K158K015K244K999L735L794L280K843K724K579
53596B16428K231J923J855J998K462L363M190M045K849J657J430K038K778L265
53582B52512L394K968K052J290J319K106L167M138M667M286K958J534R62J180
53568B88533J315Q61J37l87p12j031j257j060k88O67J072N65l24o36j19M92M64
53551B88292j22p56j243j559j450p10L49J236J855K329K529K302J967J963K205
53536B99187K293K246K388K643K628K412K506L039L573L898M384N293O234O690
53522C49414O670O564O623O871P274P757Q184Q409Q363Q176Q293R268J1069J2802
$$ plain form
53508 465737 479351 493096 507203 522160 537860 553906 570459 588105 606972 626584 646594
53497 646594 667115 688213 709586 731023 752766 775078 797725 820260 842698 865609 889469
53486 889469 914039 938462 962037 984928 1008037 1032090 1056964 1082042 1107029 1132072 1157118
53475 1157118 1181620 1205115 1227866 1250647 1273927 1297336 1319849 1340429 1358640 1374852 1389912
53464 1389912 1404511 1418760 1432207 1444180 1454258 1462640 1469989 1476789 1482875 1487735 1491139 1493146 1493593
53451 1493593 1492032 1488369 1483119 1476784 1469207 1459846 1448493 1435368 1420660 1404367 1386616 1367760
53439 1367760 1348077 1327584 1306303 1284467 1262337 1239957 1217237 1194207 1171110 1148384 1126569
53428 1126569 1105969 1086184 1066209 1045381 1024182 1003858 985262 968333 952646 938075 924834
$$ packed form
53508D65737J3614J3745J4107J4957J5700J6046J6553J7646J8867J9612K0010
53497F46594K0521K1098K1373K1437K1743K2312K2647K2535K2438K2911K3860
53486H89469K4570K4423K3575K2891K3109K4053K4874K5078K4987K5043K5046
53475A157118K4502K3495K2751K2781K3280K3409K2513K0580J8211J6212J5060
53464A389912J4599J4249J3447J1973J0078Q382P349O800O086M860L404K007M47
53451A493593j561l663n250o335p577r361j1353j3125j4708j6293j7751j8856
53439A367760j9683k0493k1281k1836k2130k2380k2720k3030k3097k2726k1815
53428A126569k0600j9785j9975k0828k1199k0324j8596j6929j5687j4571j3241
$$ plain form
53417 924834 913271 903813 896760 891850 888313 885677 884365 885181 888424 893857 901380 911250 923677 938601
53403 938601 955873 975309 996581 1019409 1043854 1070016 1097542 1125929 1155375 1186735 1220435
53392 1220435 1255966 1292681 1330556 1369864 1410620 1452840 1496861 1542896 1590618 1639719 1690530
53381 1690530 1743489 1798256 1853960 1910160 1966902 2023977 2080862 2137443 2194072 2250716 2306641
53370 2306641 2361148 2414113 2465553 2515183 2562671 2607861 2650376 2689437 2724551 2756073 2784639
53359 2784639 2810225 2832241 2850407 2865053 2876519 2884690 2889204 2889750 2886005 2877535 2864089 2845863
53347 2845863 2823280 2796518 2765438 2729897 2689888 2645285 2595802 2541578 2483691 2423711 2362605
53336 2362605 2300357 2236720 2172070 2107255 2042898 1979145 1915986 1853537 1792017 1731661 1672559
$$ packed form
53417I24834j1563r458p053m910l537k636j312Q16L243N433P523R870J2427J4924
53403I38601J7272J9436K1272K2828K4445K6162K7526K8387K9446L1360L3700
53392A220435L5531L6715L7875L9308M0756M2220M4021M6035M7722M9101N0811
53381A690530N2959N4767N5704N6200N6742N7075N6885N6581N6629N6644N5925
53370B306641N4507N2965N1440M9630M7488M5190M2515L9061L5114L1522K8566
53359B784639K5586K2016J8166J4646J1466Q171M514N46l745q470j3446j8226
53347B845863k2583k6762l1080l5541m0009m4603m9483n4224n7887n9980o1106
53336B362605o2248o3637o4650o4815o4357o3753o3159o2449o1520o0356n9102
$$ plain form
53325 1672559 1614459 1556891 1499744 1443593 1389283 1337327 1287944 1241382 1197788 1156962 1118721
53314 1118721 1083375 1051369 1022523 996186 972158 950932 932866 917655 904768 893960 885114
53303 885114 878043 872719 869366 868087 868730 871235 875705 881894 889102 896964 905939 916661 929099 942721
53289 942721 957175 972422 988520 1005730 1024550 1045085 1066575 1088089 1109695 1132459 1157255
53278 1157255 1183912 1211583 1239543 1267507 1295399 1322936 1349457 1374288 1397416 1419562 1441364
53267 1441364 1462696 1483079 1502413 1520801 1537876 1552987 1566007 1577411 1587479 1595958 1602659 1607816
53255 1607816 1611603 1613736 1613818 1611669 1607036 1599453 1588834 1575783 1560813 1543475 1522839 1498767 1472111
53242 1472111 1443621 1413220 1380655 1346361 1311205 1275562 1239112 1201639 1163640 1125975 1089117
$$ packed form
53325A672559n8100n7568n7147n6151n4310n1956m9383m6562m3594m0826l8241
53314A118721l5346l2006k8846k6337k4028k1226j8066j5211j2887j0808q846
53303H85114p071n324l353j279O43K505M470O189P208P862Q975J0722J2438J3622
53289I42721J4454J5247J6098J7210J8820K0535K1490K1514K1606K2764K4796
53278A157255K6657K7671K7960K7964K7892K7537K6521K4831K3128K2146K1802
53267A441364K1332K0383J9334J8388J7075J5111J3020J1404J0068Q479O701N157
53255A607816L787K133Q2k149m633p583j0619j3051j4970j7338k0636k4072k6656
53242A472111k8490l0401l2565l4294l5156l5643l6450l7473l7999l7665l6858
$$ plain form
53231 1089117 1052960 1017261 982005 947328 913348 880223 848246 817597 787940 758448 728441
53220 728441 698096 668418 640328 613778 587954 562442 537887 515244 494549 474914 455741
53209 455741 437474 420950 406422 393510 381717 370555 359506 348466 338158 329520 322515 315980
53197 315980 308843 301184 293914 287710 282474 277626 272612 267238 261700 256274 250928 245421 239862 234909
53183 234909 231126 228246 225389 222000 218304 214777 211446 207944 204113 200315 197069 194542 192463 190399
53169 190399 188017 185167 181918 178578 175543 173009 170819 168627 166195 163549 160906 158509 156495 154906
53155 154906 153733 152842 151851 150320 148338 146719 146239 146632 146675 145433 143111 140633 138730 137661 137373 137511
53139 137511 137491 137028 136515 136544 137102 137585 137534 137020 136360 135835 135755 136413 137808 139586 141371 142959 144199 144949
$$ packed form
53231A089117l6157l5699l5256l4677l3980l3125l1977l0649k9657k9492l0007
53220G28441l0345k9678k8090k6550k5824k5512k4555k2643k0695j9635j9173
53209D55741j8267j6524j4528j2912j1793j1162j1049j1040j0308q638p005o535
53197C15980p137p659p270o204n236m848n014n374n538n426n346n507n559m953
53183B34909l783k880k857l389l696l527l331l502l831l798l246k527k079k064
53169A90399k382k850l249l340l035k534k190k192k432k646k643k397k014j589
53155A54906j173q91r91j531j982j619m80L93M3j242k322k478j903j069k88J38
53139A37511k0m63n13K9N58M83n1n14o60n25q0O58J395J778J785J588J240P50
$$ plain form
53121 144949 145247 145390 145762 146642 148100 150020 152286 155071 158762 163427 168594 173750 178752 183392 187007
53106 187007 189168 190470 191868 193298 193807 193113 192092 191410 190594 188965 186670 184075 180797 176280 170996
53091 170996 166147 162324 159155 156177 153305 150430 147308 144026 140985 138229 135286 131833 128067 124298
53077 124298 120648 117356 114831 113106 111654 110095 108740 108025 107718 107143 105994 104474 102760 100916 99355
53062 99355 98773 99307 100088 100067 99116 97989 97233 96568 95407 93681 91892 90547 89786 89461 89294 88962 88278 87365
53044 87365 86509 85883 85564 85683 86185 86465 85727 83968 82211 81444 81583 81777 81454 80707 79864 79175 78840 78887 78985
53025 78985 78683 77904 76933 75945 74902 73903 73194 72738 72121 71082 69816 68604 67453 66384 65749 65896 66593
53008 66593 67125 67022 66447 65809 65194 64361 63271 62376 62220 62784 63513 64016 64490 65241 66071 66492 66338 65838 65231
$$ packed form
53121A44949K98J43L72Q80J458J920K266K785L691M665N167N156N002M640L615
53106A87007K161J302J398J430N09o94j021o82q16j629k295k595l278m517n284
53091A70996m849l823l169k978k872k875l122l282l041k756k943l453l766l769
53077A24298l650l292k525j725j452j559j355p15l07n75j149j520j714j844j561
53062I9355n82N34P81k1r51j127p56o65j161j726j789j345p61l25j67l32o84r13
53044H7365q56o26l19J19N02K80p38j759j757p67J39J94l23p47q43o89l35M7R8
53025G8985l02p79r71r88j043r99p09m56o17j039j266j212j151j069o35J47O97
53008F6593N32j03n75o38o15q33j090q95j56N64P29N03M74P51Q30M21j54n00o07
$$ plain form
52989 65231 64732 64766 65650 66992 67944 68246 68548 69483 70909 72312 73427 74085 74025 73414 73219 74378 76791 79645
52971 79645 82582 85911 89760 93673 97132 99928 101911 102977 103544 104609 106977 110606 114778 118619 121415
52956 121415 122898 123473 123821 124071 123666 122221 120090 117837 115617 113373 111213 109077 106496 103298 100310
52941 100310 98617 98107 97381 95216 91706 87875 84694 82552 81170 79737 77518 74619 71953 70297 69616
52926 69616 69333 68890 67958 66541 65109 64200 63689 62902 61715 60950 61176 61666 61190 59581 57791 56647 56229
52909 56229 56308 56582 56463 55395 53587 51788 50207 48419 46542 45619 46325 47892 48936 48904 48172 47184 46163
52892 46163 45364 44917 44481 43639 42522 41671 41435 41938 43325 45406 47242 47853 47379 46946 47290 48120 48917 49715
52874 49715 50843 52359 54025 55470 56255 56214 55833 55816 56146 56145 55587 55057 54915 54649 53818 53030 53199 54238 55244
$$ packed form
52989F5231m99L4Q84J342R52L02L02R35J426J403J115O58o0o11j95J159K413K854
52971G9645K937L329L849L913L459K796J983J066N67J065K368L629M172L841K796
52956A21415J483N75L48K50m05j445k131k253k220k244k160k136k581l198k988
52941A00310j693n10p26k165l510l831l181k142j382j433k219k899k666j656o81
52926F9616k83m43r32j417j432r09n11p87j187p65K26M90m76j609j790j144m18
52909E6229P9K74j19j068j808j799j581j788j877r23P06J567J044l2p32r88j021
52892D6163p99m47m36q42j117q51k36N03J387K081J836O11m74m33L44Q30P97P98
52874D9715J128J516J666J445P85m1l81j7L30jn58n30j42k66q31p88J69J039J006
$$ plain form
52855 55244 55765 56148 56764 57658 59005 61212 64306 67719 70896 73759 76432 78909 81222 83623 86314
52840 86314 89167 91852 94112 95851 97087 97976 98797 99887 101543 103746 105860 106863 106268 104709 103266
52825 103266 102347 101619 100839 100167 99634 98938 97929 96760 95402 93493 90879 87832 84515 80870 77299 74683
52809 74683 73180 71705 69388 67031 66113 66628 66965 65944 63961 61892 59909 57951 56493 55979 55826 54784
52793 54784 52311 49167 46670 45660 46060 47083 47860 48135 48358 48986 49853 50411 50382 49930 49392 49123 49415 50154
52775 50154 50748 50810 50805 51494 52770 53704 53829 53749 54142 54777 55046 55013 55260 55874 56238 55867 54936 53895 53065 52764
52755 52764 53288 54421 55279 55123 54254 53703 54044 54769 54979 54461 53879 53924 54479 54765 54193 52909 51469 50207
52737 50207 49110 48157 47468 47078 46793 46344 45612 44665 43729 43078 42791 42616 42300 42002 42111 42592 42885 42648 42235
$$ packed form
52855E5244N21L83O16Q94J347K207L094L413L177K863K673K477K313K401K691
52840H6314K853K685K260J739J236Q89Q21J090J656K203K114J003n95j559j443
52825A03266r19p28p80o72n33o96j009j169j358j909k614l047l317l645l571k616
52809G4683j503j475k317k357r18N15L37j021j983k069j983j958j458n14j53j042
52793E4784k473l144k497j010M00J023P77K75K23O28Q67N58k9m52n38k69K92P39
52775E0154N94O2nO89J276R34J25q0L93O35K69l3K47O14L64l71r31j041q30l01
52755E2764N24J133Q58j56q69n51L41P25K10n18n82M5N55K86n72j284j440j262
52737E0207j097r53o89l90k85m49p32r47r36o51k87j75l16k98J09M81K93k37m13
$$ plain form
52718 42235 42217 42727 43603 44869 46574 48285 49327 49621 49866 50704 52066 53537 55072 57051 59700 62720
52702 62720 65502 67683 69506 71650 74572 77939 80836 82558 83166 83339 83853 85117 86887 88365 88936
52687 88936 88984 89703 91851 94840 97295 98342 98074 96965 95284 93142 90736 88297 85908 83543 81185
52672 81185 78799 76302 73727 71406 69779 68856 67987 66392 64029 61743 60314 59474 58164 55784 52870
52657 52870 50373 48577 47025 45404 44128 43906 44905 46463 47627 47948 47725 47458 47215 46713 45935 45305 45125
52640 45125 45168 45135 45230 45918 47232 48697 49927 50910 51691 52114 52088 51857 51853 52359 53393 54811 56407 58029 59600
52621 59600 61032 62098 62543 62289 61432 60109 58529 57030 55847 54787 53428 51642 49781 48349 47742
52606 47742 48182 49496 50891 51396 50729 49466 48183 46845 45242 43644 42579 42163 42087 42141 42317 42447 42150
$$ packed form
52718D2235j8N10Q76J266J705J711J042K94K45Q38J362J471J535J979K649L020
52702F2720K782K181J823K144K922L367K897J722O08J73N14J264J770J478N71
52687H8936M8P19K148K989K455J047k68j109j681k142k406k439k389k365k358
52672H1185k386k497k575k321j627r23q69j595k363k286j429q40j310k380k914
52657E2870k497j796j552j621j276k22R99J558J164L21k23k67k43n02p78o30j80
52640D5125M3l3R5O88J314J465J230R83P81M23k6k31mN06J034J418J596J622J571
52621E9600J432J066M45k54q57j323j580j499j183j060j359j786j861j432o07
52606D7742M40J314J395N05o67j263j283j338j603j598j065m16p6N4J76J30k97
$$ plain form
52589 42150 41327 40468 40245 40841 41676 41894 41271 40630 41097 42797 44575 45254 44870 44404 44556 45250 46092 46755
52571 46755 46924 46455 45716 45365 45599 45976 46106 46114 46233 46319 46139 45877 45990 46623 47419 47846 47597 46763 45776 45141
52551 45141 45037 45242 45451 45613 45930 46637 47767 48939 49421 48794 47616 47090 47883 49579 51437 53180 54674
52534 54674 55333 54598 52894 51404 50828 50854 50971 51182 51634 52104 52311 52459 52941 53653 54108 54209 54473 55311 56420
52515 56420 57104 57004 56289 55311 54427 54116 54833 56490 58271 59266 59313 59027 59063 59572 60351 61188 61875 62164 62049
52496 62049 62021 62724 64232 65836 66673 66545 66121 66351 67627 69431 70831 71372 71436 71695 72309 72807 72669 71838
52478 71838 70680 69659 69082 69014 69240 69364 69086 68465 67862 67546 67333 66718 65508 64200 63523 63650 64114 64539
52460 64539 65002 65449 65209 63691 61432 59861 59875 61036 62329 63353 64451 65960 67651 68915 69290 68823
$$ packed form
52589D2150q23q59k23N96Q35K18o23o41M67J700J778O79l84m66J52O94Q42O63
52571D6755J69m69p39l51K34L77J30QJ19Q6j80k62J13O33P96M27k49q34r87o35
52551D5141j04K05K09J62L17P07J130J172M82o27j178n26P93J696J858J743J494
52534E4674O59p35j704j490n76K6J17K11M52M70K07J48M82P12M55J01K64Q38J109
52515E6420O84j00p15r78q84l11P17J657J781R95M7k86L6N09P79Q37O87K89j15
52496F2049k8P03J508J604Q37j28m24K30J276J804J400N41O4K59O14M98j38q31
52478G1838j158j021n77o8K26J24k78o21o03l16k13o15j210j308o77J27M64M25
52460F4539M63M47k40j518k259j571J4J161J293J024J098J509J691J264L75m67
$$ plain form
52444 68823 68012 67393 67168 67258 67611 68262 69088 69735 69934 69729 69318 68856 68536 68630 69261 70153 70834 71070 71055 71141
52424 71141 71439 71718 71741 71658 71858 72364 72643 72316 71803 71771 72036 71644 70224 68646 67971 68187 68534 68738 69314
52405 69314 70616 72137 72942 72627 71718 71194 71546 72275 72479 71988 71637 72196 73382 74319 74637 74611 74431 74003
52387 74003 73515 73523 74203 74994 75337 75447 75981 77174 78582 79597 79933 79726 79384 79304 79540 79741 79515 78844 78098
52368 78098 77673 77721 78147 78792 79604 80636 81899 83191 84159 84543 84380 84046 84064 84731 85794 86663 87073 87422
52350 87422 88273 89650 91101 92304 93343 94380 95320 95838 95580 94475 93084 92471 93349 95338 97394 98867
52334 98867 99778 100265 100423 100714 101780 103521 104936 105275 104911 104671 104788 104946 105016 105180 105521 105947 106362 106591
52316 106591 106359 105700 105161 105188 105545 105658 105298 104496 103200 101565 100300 99996 100248 100151 99602 99360 99767 100190
$$ packed form
52444F8823q11o19k25R0L53O51Q26O47J99k05m11m62l20R4O31Q92O81K36j5Q6
52424G1141K98K79K3q3K00N06K79l27n13l2K65l92j420j578o75K16L47K04N76
52405F9314J302J521Q05l15r09n24L52P29K04m91l51N59J186R37L18k6j80m28
52387G4003m88QO80P91L43J10N34J193J408J015L36k07l42q0K36K01k26o71p46
52368G8098m25M8M26O45Q12J032J263J292R68L84j63l34J8O67J063Q69M10L49
52350H7422Q51J377J451J203J039J037R40N18k58j105j391o13Q78J989K056J473
52334I8867R11M87J58K91J066J741J415L39l64k40J17J58P0J64L41M26M15K29
52316A06591k32o59n39K7L57J13l60q02j296j635j265l04K52r7n49k42M07M23
$$ plain form
52298 100190 99945 99156 98388 97998 98148 98936 100111 101055 101374 101220 100838 100202 99371 98750 98647 98944 99503 100460
52280 100460 101674 102405 102149 101480 101430 102181 102998 103352 103443 103558 103564 103291 102961 102870 102910 102721 102211 101766 101948 103040
52260 103040 104776 106488 107616 108085 108127 107833 107105 106016 104954 104320 104211 104460 104862 105327 105858 106405 106700
52243 106700 106412 105592 104850 104828 105502 106251 106621 106804 107299 108283 109456 110425 111126 111851 112870 114054 115058 115828
52225 115828 116732 118007 119351 120306 120891 121538 122573 124070 126082 128544 130967 132695 133532 133754 133506 132688
52209 132688 131563 130879 131034 131565 131875 132121 132832 133903 134611 134624 134482 134938 136150 137678 138961 139589 139386
52192 139386 138500 137418 136701 136635 137109 137790 138404 138897 139374 139909 140447 140919 141400 142060 142966 143949 144680 144902 144696
52173 144696 144520 144876 145867 147106 148022 148182 147436 145984 144397 143340 143079 143294 143477 143426 143333 143509 144036 144602
$$ packed form
52298A00190k45p89p68l90J50P88J175R44L19j54l82o36q31o21j03K97N59R57
52280A00460J214P31k56o69n0P51Q17L54R1J15Ok73l30r1M0j89n10m45J82J092
52260A03040J736J712J128M69M2k94p28j089j062o34j09K49M02M65N31N47K95
52243A06700k88q20p42k2O74P49L70J83M95R84J173R69P01P25J019J184J004P70
52225A15828R04J275J344R55N85O47J035J497K012K462K423J728Q37K22k48q18
52209A32688j125o84J55N31L10K46P11J071P08J3j42M56J212J528J283O28k03
52192A39386q86j082p17o6M74O81O14M93M77N35N38M72M81O60R06R83P31K22k06
52173A44696j76L56R91J239R16J60p46j452j587j057k61K15J83n1r3J76N27N66
$$ plain form
52155 144602 144695 144187 143633 143712 144351 144817 144746 144532 144480 144155 143054 141492 140183 139238 138223 137060 136192 135881
52137 135881 135947 136168 136401 136312 135675 135012 135232 136432 137656 138065 137697 136837 135409 133517 131869 130996 130478 129685
52119 129685 128892 128893 129738 130575 130696 130056 128804 127013 125021 123530 123139 124010 125852 127810 128575 127339 124796
52102 124796 122617 121795 121940 122244 122500 122941 123724 124954 126673 128386 129057 128136 126322 124890 124465 124815 125549
52085 125549 126511 127611 128722 129747 130495 130659 130179 129508 129149 129105 129129 129292 129845 130698 131541 132477 133945 135900
52067 135900 137596 138430 138639 138918 139630 140626 141618 142498 143331 144161 144824 145043 144910 145123 146358 148376 150116
52050 150116 150825 150739 150568 150687 151059 151574 152082 152339 152248 152021 151852 151574 150930 150044 149382 149260 149572 149841 149487
52031 149487 148234 146527 145214 144563 143864 142411 140586 139429 139321 139707 140054 140366 140583 140223 139031 137421
$$ packed form
52155A44602R3n08n54P9O39M66p1k14n2l25j101j562j309r45j015j163q68l11
52137A35881O6K21K33q9o37o63K20J200J224M09l68q60j428j892j648q73n18p93
52119A29685p93JQ45Q37J21o40j252j791j992j491l91Q71J842J958P65j236k543
52102A24796k179q22J45L04K56M41P83J230J719J713O71r21j814j432m25L50P34
52085A25549R62J100J111J025P48J64m80o71l59m4K4J63N53Q53Q43R36J468J955
52067A35900J696Q34K09K79P12R96R92Q80Q33Q30O63K19j33K13J235K018J740
52050A50116P09q6j71J19L72N15N08K57r1k27j69k78o44q86o62j22L12K69l54
52031A49487j253j707j313o51o99j453j825j157j08L86L47L12K17l60j192j610
$$ plain form
52015 137421 135786 133791 131047 128205 126667 127114 128871 130843 132543 133963 134935 135217 135030 134969 135277 135566
51999 135566 135487 135348 135767 136832 138015 138895 139534 139976 139786 138529 136560 134882 134156 134191 134418 134499 134341 133846
51981 133846 132982 131957 131089 130515 130084 129365 127786 125082 121769 118939 117316 116643 116163 115388 114223 112677
51965 112677 110889 109205 107756 106118 103941 101778 100622 100506 100248 98870 96668 94488 92504 90400 88415
51950 88415 87384 87638 88466 88959 88988 89060 89420 89642 89126 87830 86418 85653 85641 85669 84849 82973 80783 79401
51932 79401 79385 80246 80933 80919 80701 81055 81976 82699 82709 82206 81492 80561 79661 79645 81065 83212 84776 85344 85578
51913 85578 86014 86447 86580 86517 86347 85906 85323 85178 85649 86061 85891 85713 86469 88043 89304 89486 88874 88113 87493
51894 87493 87013 86584 85979 85003 83946 83465 83790 84404 84746 84902 85297 85966 86578 87023 87567 88371 89156 89488 89269
$$ packed form
52015A37421j635j995k744k842j538M47J757J972J700J420R72K82j87o1L08K89
51999A35566p9j39M19J065J183Q80O39M42j90j257j969j678p26L5K27Q1j58m95
51981A33846q64j025q68n74m31p19j579k704l313k830j623o73m80p75j165j546
51965A12677j788j684j449j638k177k163j156j16k58j378k202k180j984k104j985
51950H8415j031K54Q28M93K9P2L60K22n16j296j412p65j2K8q20j876k190j382
51932G9401j6Q61O87j4k18L54R21P23J0n03p14r31r00j6J420K147J564N68K34
51913H5578M36M33J33o3j70m41n83j45M71M12j70j78P56J574J261J82o12p61o20
51894H7493m80m29o05r76j057m81L25O14L42J56L95O69O12M45N44Q04P85L32k19
$$ plain form
51875 89269 88851 88693 88948 89314 89314 88775 88107 88053 89097 91011 92949 94056 94078 93388 92493 91681 91135 91088 91629
51856 91629 92544 93612 94942 96651 98355 99431 99853 100335 101426 102842 103933 104464 104686 104885 105271 106135
51840 106135 107691 109725 111674 113121 114039 114565 114786 114749 114548 114313 114193 114374 114980 115969 117136 118212 118884
51823 118884 118809 117858 116427 115402 115657 117372 119802 121774 122643 122765 122979 123687 124668 125656 126662 127628 128202
51806 128202 128172 127818 127547 127448 127558 128246 129827 131915 133689 134872 136011 137730 140035 142454 144550 146250
51790 146250 147944 150363 154014 158615 163335 167658 171754 175888 179771 182704 184234 184612 184743 185636 187565
51775 187565 189670 190757 190587 190039 189824 189446 187822 184707 181149 178558 177497 177262 176483 174272 170989 167784
51759 167784 165379 163496 161561 159546 157819 156528 155532 154720 153944 152809 151082 149269 148276 148315 148562 148109
$$ packed form
51875H9269m18j58K55L66%n39o68n4J044J914J938J107K2o90q95q12n46m7N41
51856I1629R15J068J330J709J704J076M22M82J091J416J091N31K22J99L86Q64
51840A06135J556K034J949J447R18N26K21l7k01k35j20J81O06R89J167J076O72
51823A18884p5r51j431j025K55J715K430J972Q69J22K14P08R81R88J006R66N74
51806A28202l0l54k71r9J10O88J581K088J774J183J139J719K305K419K096J700
51790A46250J694K419L651M601M720M323M096M134L883K933J530L78J31Q93J929
51775A87565K105J087j70n48k15l78j624l115l558k591j061k35p79k211l283l205
51759A67784k405j883j935k015j727j291r96q12p76j135j727j813r93L9K47m53
$$ plain form
51743 148109 146964 145896 145509 145698 145891 145572 144584 143155 141719 140623 139865 139064 137816 136146 134568 133577
51727 133577 133232 133370 134001 135133 136303 136851 136751 136634 136790 136718 136032 135200 134811 134678 134382 134289 135093 136535
51709 136535 137567 137815 137917 138261 138398 138141 138303 139638 141698 143455 144579 145386 145917 145881 145318 144655 144144
51692 144144 143795 143679 143730 143336 141825 139400 137036 135386 134326 133634 133406 133545 133402 132425 130853 129437 128654
51675 128654 128376 128106 127353 126059 124797 124284 124465 124477 123746 122747 122281 122389 122487 122329 122234 122441 122859 123472 124458
51656 124458 125696 126653 126982 126908 126841 126960 127381 128346 129906 131702 133373 134898 136232 136953 136781 136224 136007
51639 136007 135954 135087 133016 130680 129393 129535 130473 131372 131791 131754 131622 131767 132100 132129 131656 131151 131171 131707 132403
51620 132403 133124 133836 134232 134051 133646 133691 134325 135140 135946 136933 138041 138872 139432 140312 141825 143511 144837 145859
$$ packed form
51743A48109j145j068l87J89J93l19r88j429j436j096p58q01j248j670j578r91
51727A33577l45J38O31J132J170N48j00j17J56p2o86q32l89j33k96r3Q04J442
51709A36535J032K48J02L44J37k57J62J335K060J757J124Q07N31l6n63o63n11
51692A44144l49j16N1l94j511k425k364j650j060o92k28J39j43r77j572j416p83
51675A28654k78k70p53j294j262n13J81J2p31r99m66J08R8j58r5K07M18O13R86
51656A24458J238R57L29p4o7J19M21R65J560J796J671J525J334P21j72n57k17
51639A36007n3q67k071k336j287J42R38Q99M19l7j32J45L33K9m73n05K0N36O96
51620A32403P21P12L96j81m05M5O34Q15Q06R87J108Q31N60Q80J513J686J326J022
$$ plain form
51602 145859 146749 147266 147271 147285 147825 148485 148432 147636 146870 146566 146452 146428 147027 148614 150680 152383 153448 154142 154601
51583 154601 154627 154129 153473 153322 154185 156078 158554 161076 163335 165195 166554 167491 168425 169738 171261 172437
51567 172437 173018 173196 173104 172681 172168 172164 172838 173535 173597 173204 172874 172384 170904 168211 165197 162979 161874 161481
51549 161481 161373 161373 161305 160837 159734 158150 156617 155630 155244 155129 155061 155176 155537 155692 155054 153786 152886 153151 154305
51530 154305 155450 156226 157141 158735 160788 162530 163456 163729 163861 164220 164880 165773 166797 167789 168505 168790 168832
51513 168832 169167 170237 171838 173125 173403 172883 172419 172493 172712 172484 171883 171438 171216 170632 169384 168142 167924
51496 167924 168918 170334 171380 172013 172593 173169 173520 173802 174691 176624 179073 180898 181397 180870 180123 179692 179632
51479 179632 179834 180235 180727 181094 181087 180562 179566 178371 177315 176510 175747 174794 173699 172662 171732 170767 169591 167976
$$ packed form
51602A45859Q90N17NJ4N40O60n3p96p66l04j14k4N99J587K066J703J065O94M59
51583A54601K6m98o56j51Q63J893K476K522K259J860J359R37R34J313J523J176
51567A72437N81J78r2m23n13mO74O97O2l93l30m90j480k693l014k218j105l93
51549A61481j08%o8m68j103j584j533r87l86j15o8J15L61J55o38j268r00K65J154
51530A54305J145P76R15J594K053J742R26K73J32L59O60Q93J024R92P16K85M2
51513A68832L35J070J601J287K78n20m64P4K19k28o01m45k22n84j248j242k18
51496A67924R94J416J046O33N80N76L51K82Q89J933K449J825M99n27p47m31o0
51479A79632K02M01M92L67pn25r96j195j056q05p63r53j095j037r30r65j176j615
$$ plain form
51461 167976 165654 162673 159668 157387 155857 154363 152339 150043 148219 147354 147363 147734 147834 147311 146372 145483
51445 145483 144801 144191 143795 144076 145040 145931 146058 145559 144925 144110 142730 140876 139114 137698 136350 134861 133372
51428 133372 131990 130599 129275 128410 128211 128355 128349 127937 127031 125589 123896 122640 122357 122883 123541 123751 123270
51411 123270 122081 120425 118875 117984 117749 117596 117016 116059 115146 114542 114159 113838 113584 113436 113246 112774 112024 111303
51393 111303 110881 110707 110515 110064 109271 108335 107811 108184 109134 109552 108688 107053 105731 105064 104564 104028 103963 104711
51375 104711 105821 106635 107018 107150 107055 106766 106667 107158 108126 109087 109751 110171 110509 110914 111460 111914 111785 110867 109568
51356 109568 108399 107434 106599 106148 106320 106784 107084 107507 108739 110597 111866 111699 110522 109148 107660 105764
51340 105764 103768 102336 101381 100046 98051 96366 96031 96647 96645 95079 92654 90772 89948 89499 88635 87385
$$ packed form
51461A67976k322k981l005k281j530j494k024k296j824q65RL71J00n23r39q89
51445A45483o82o10l96K81R64Q91J27m99o34q15j380j854j762j416j348j489j489
51428A33372j382j391j324q65j99J44om12r06j442j693j256k83N26O58K10m81
51411A23270j189j656j550q91k35j53n80r57r13o04l83l21k54j48j90m72p50p21
51393A11303m22j74j92m51p93r36n24L73R50M18q64j635j322o67n00n36o5P48
51375A04711J110Q14L83J32r5k89r9M91R68R61O64M20L38M05N46M54j29r18j299
51356A09568j169r65q35m51J72M64L00M23J232J858J269j67j177j374j488j896
51340A05764j996j432r55j335j995j685l35O16kj566k425j882q24m49q64j250
$$ plain form
51324 87385 86365 86012 86252 86710 87023 87027 86809 86512 86052 85204 84071 83147 82701 82388 81774 80990 80462 80273 80268 80596
51304 80596 81501 82643 83323 83489 83809 84584 85261 85387 85324 85524 85707 85439 85013 84982 85121 84757 83973 83588 83863
51285 83863 84071 83623 82911 82651 82970 83558 84188 84641 84534 83796 82948 82416 81845 80667 79162 78257 78247 78395 77982
51266 77982 77247 76949 77394 78253 79140 79942 80626 80963 80547 79119 76993 75098 74281 74429 74545 73876 72758 72081
51248 72081 72198 72687 73071 73273 73322 73013 72144 70905 69858 69565 70226 71505 72688 73188 73018 72699 72697 73110 73818
51229 73818 74600 75078 74940 74468 74485 75474 76938 78016 78520 78886 79231 79044 78066 76970 76737 77516 78475 78803
51211 78803 78552 78410 78842 79683 80498 81063 81359 81275 80701 79970 79851 80791 82305 83477 83945 84097 84320 84487 84348
51192 84348 84042 83963 84349 85214 86465 87812 88706 88726 88038 87239 86786 86738 86962 87277 87374 86940 85988 84848 83725
$$ packed form
51324H7385j020l53K40M58L13Mk18k97m60q48j133r24m46l13o14p84n28j89nL28
51304H0596R05J142O80J66L20P75O77J26o3K00J83k68m26l1J39l64p84l85K75
51285H3863K08m48p12k60L19N88O30M53j07p38q48n32n71j178j505r05j0J48m13
51266G7982p35k98M45Q59Q87Q02O84L37m16j428k126j895q17J48J16o69j118o77
51248G2081J17M89L84K02M9l09q69j239j047k93O61J279J183N00j70l19kM13P08
51229G3818P82M78j38m72J7R89J464J078N04L66L45j87r78j096k33P79R59L28
51211G8803k51j42M32Q41Q15N65K96q4n74p31j19R40J514J172M68J52K23J67j39
51192H4348l06p9L86Q65J251J347Q94K0o88p99m53m8K24L15R7m34r52j140j123
$$ plain form
51173 83725 82506 81149 80016 79569 79826 80379 80896 81363 81864 82377 82854 83237 83254 82466 80794 78886 77665
51156 77665 77509 78054 78786 79543 80321 80901 80924 80284 79254 78252 77560 77175 76832 76285 75729 75754 76664 77977 78889
51137 78889 79135 79026 78721 77962 76714 75594 75284 75782 76536 77109 77380 77338 77099 77044 77451 77990 78039 77616 77547 78449
51117 78449 79913 81017 81355 81224 81011 80880 81005 81571 82398 82957 83000 82927 83280 84092 85026 85923 86808 87498 87711
51098 87711 87699 88221 89554 90869 91029 89889 88434 87753 88233 89665 91565 93208 93858 93411 92607 92234 92272
51081 92272 92131 91610 91193 91330 91863 92368 92785 93396 94231 94836 94714 93857 92756 91963 91766 92130 92705 92854 91978
51062 91978 90167 88374 87672 88261 89415 90347 90823 90898 90568 90001 89750 90196 90946 91248 91051 91083 91800 92733 93186
51043 93186 93171 93221 93568 94010 94551 95556 97079 98449 98952 98754 98747 99515 100805 102132 103524 105285 107172 108245
$$ packed form
51173H3725j219j357j133m47K57N53N17M67N01N13M77L83J7p88j672j908j221
51156G7665j56N45P32P57P78N80K3o40j030j002o92l85l43n47n56K5R10J313R12
51137G8889K46j09l05p59j248j120l10M98P54N73K71m2k39n5M07N39M9m23o9R02
51117G8449J464J104L38j31k13j31J25N66Q27N59M3p3L53Q12R34Q97Q85O90K13
51098H7711j2N22J333J315J60j140j455o81M80J432J900J643O50m47q04l73L8
51081I2272j41n21m17J37N33N05M17O11Q35O05j22q57j101p93j97L64N75J49q76
51062I1978j811j793p02N89J154R32M76P5l30n67k51M46P50L02j97L2P17R33M53
51043I3186j5N0L47M42N41J005J523J370N03j98pP68J290J327J392J761J887J073
$$ plain form
51025 108245 107760 106014 104110 102971 102732 103004 103420 103851 104267 104644 105015 105421 105717 105533 104610 103201 101999
51008 101999 101582 101963 102661 103064 102734 101675 100547 100340 101441 103033 103809 103319 102311 101743 101920 102640 103694
50991 103694 104780 105368 105184 104668 104561 105074 105798 106357 106815 107505 108742 110666 113046 115328 117184 118893
50975 118893 120870 122930 124477 125316 125832 126406 127192 128446 130370 132443 133582 133365 132582 132218 132470 133183
50959 133183 134593 136856 139232 140689 141290 142154 143907 145916 147304 148082 148867 149973 151330 153044 155501
50944 155501 158859 162767 166639 170074 173061 175966 179227 182831 186129 188441 189955 191797 194947 199143
50930 199143 203103 205895 207913 210361 213882 217966 221664 224501 226537 227878 228570 228883 229227 229676 229935
50915 229935 229942 230154 230949 232018 232794 233310 234130 235439 236770 237846 239114 240978 242991 244524 246102 249189
$$ packed form
51025A08245m85j746j904j139k39K72M16M31M16L77L71M06K96j84r23j409j202
51008A01999m17L81O98M03l30j059j128k07J101J592P76m90j008n68J77P20J054
50991A03694J086N88j84n16j07N13P24N59M58O90J237J924K380K282J856J709
50975A18893J977K060J547Q39N16N74P86J254J924K073J139k17p83l64K52P13
50959A33183J410K263K376J457O01Q64J753K009J388P78P85J106J357J714K457
50944A55501L358L908L872L435K987K905L261L604L298K312J514J842L150M196
50930A99143L960K792K018K448L521M084L698K837K036J341O92L13L44M49K59
50915B29935PK12P95J069P76N16Q20J309J331J076J268J864K013J533J578L087
$$ plain form
50899 249189 254427 260723 266479 271125 275049 278676 282408 287080 293400 300850 307909 313656 318501 323206
50885 323206 327866 332202 336101 339347 341434 342390 343320 345334 348159 350582 352101 353285 354451 354897 353825
50870 353825 351363 348181 344551 340325 335591 330825 326415 322377 318528 314766 311188 308012 305340 302927
50856 302927 300305 297225 293934 290917 288555 287047 286436 286488 286654 286362 285456 284312 283548 283561 284217 285019 285699
50839 285699 286620 288409 291255 294803 298666 302641 306410 309562 312214 315224 319402 324748 330783 337334
50825 337334 344547 352348 360410 368663 377365 386631 396314 406324 416642 426934 436715 446110 455959
50812 455959 466753 477817 487994 496901 505072 513083 521099 529190 537478 545737 553399 560357 567535
50799 567535 576240 587042 599530 613103 627695 643723 661615 681489 703204 726621 751783 778749
$$ packed form
50899B49189N238O296N756M646L924L627L732M672O320P450P059N747M845M705
50885C23206M660M336L899L246K087R56R30K014K825K423J519J184J166M46j072
50870C53825k462l182l630m226m734m766m410m038l849l762l578l176k672k413
50856C02927k622l080l291l017k362j508o11N2J66k92r06j144p64J3O56Q02O80
50839B85699R21J789K846L548L863L975L769L152K652L010M178N346O035O551
50825C37334P213P801Q062Q253Q702R266R683J0010J0318J0292R781R395R849
50812D55959J0794J1064J0177Q907Q171Q011Q016Q091Q288Q259P662O958P178
50799E67535Q705J0802J2488J3573J4592J6028J7892J9874K1715K3417K5162K6966
$$ plain form
50787 778749 807219 836568 866442 897167 929234 962493 996223 1029973 1063840 1097780 1131139
50776 1131139 1163197 1193842 1223281 1251297 1277208 1300452 1320804 1338065 1351929 1362232 1368994
50765 1368994 1372145 1371481 1367007 1359156 1348491 1335260 1319206 1299807 1276893 1251209 1224143 1196645
50753 1196645 1168585 1139564 1110093 1081406 1054159 1028003 1002508 977851 954433 932527 912655
50742 912655 895623 881642 869907 859661 851166 844995 840857 838008 836571 837444 840898 846169 852603
50729 852603 860312 869368 879055 888401 896879 904213 910040 914305 917483 919826 920720 919429 916189 911924
50715 911924 907012 901040 893800 885846 877872 870000 861935 853473 844701 836056 828376 822546 818800 816619
50701 816619 815478 815468 816990 820136 824702 830577 837756 846086 855357 865594 876980 889516 903039 917518
$$ packed form
50787G78749K8470K9349K9874L0725L2067L3259L3730L3750L3867L3940L3359
50776A131139L2058L0645K9439K8016K5911K3244K0352J7261J3864J0303O762
50765A368994L151o64m474p851j0665j3231j6054j9399k2914k5684k7066k7498
50753A196645k8060k9021k9471k8687k7247k6156k5495k4657k3418k1906j9872
50742I12655j7032j3981j1735j0246q495o171m138k849j437Q73L454N271O434
50729H52603P709R056R687R346Q478P334N827M265L178K343Q94j291l240m265
50715I11924m912n972p240p954p974p872q065q462q772q645p680n830l746k181
50701H16619j141j0J522L146M566N875P179Q330R271J0237J1386J2536J3523J4479
$$ plain form
50687 917518 933015 949383 966323 983779 1001962 1020903 1040323 1060098 1080535 1101969 1124351
50676 1124351 1147507 1171628 1197228 1224723 1254352 1286396 1321267 1359377 1401096 1446749 1496404
50665 1496404 1549725 1606236 1665734 1728224 1793441 1860514 1928006 1994192 2057602 2117745 2175269
50654 2175269 2231032 2284926 2335908 2383127 2426539 2466329 2502256 2533913 2561294 2584636 2603966
50643 2603966 2619185 2630596 2639014 2645364 2650376 2654587 2658389 2662095 2666143 2671166 2677610 2685252 2693329
50630 2693329 2701139 2708384 2714923 2720395 2724144 2725432 2723733 2718945 2711327 2701170 2688636 2673980 2657706
50617 2657706 2640271 2621845 2602739 2584044 2567320 2553488 2542336 2533272 2526127 2520841 2516595 2511873
50605 2511873 2505484 2497175 2487043 2474569 2458491 2437609 2411526 2380634 2345534 2306504 2263476 2216398
$$ packed form
50687I17518J5497J6368J6940J7456J8183J8941J9420J9775K0437K1434K2382
50676A124351K3156K4121K5600K7495K9629L2044L4871L8110M1719M5653M9655
50665A496404N3321N6511N9498O2490O5217O7073O7492O6186O3410O0143N7524
50654B175269N5763N3894N0982M7219M3412L9790L5927L1657K7381K3342J9330
50643B603966J5219J1411Q418O350N012M211L802L706M048N023O444P642Q077
50630B693329P810P245O539N472L749J288j699m788p618j0157j2534j4656j6274
50617B657706j7435j8426j9106j8695j6724j3832j1152r064p145n286m246m722
50605B511873o389q309j0132j2474j6078k0882k6083l0892l5100l9030m3028m7078
$$ plain form
50593 2216398 2165664 2112144 2056786 2000180 1942653 1884722 1827271 1771138 1716703 1664092 1613689
50582 1613689 1566236 1522411 1482479 1446267 1413268 1382824 1354559 1328750 1305996 1286393 1269303
50571 1269303 1254094 1240812 1229848 1221146 1214097 1208221 1203654 1200892 1200193 1201261 1203503 1206646 1211145
50558 1211145 1217842 1227169 1238870 1252615 1268705 1287950 1311029 1338212 1369529 1404888 1444075 1486915
50546 1486915 1533508 1584120 1638767 1696993 1758044 1821177 1885920 1952143 2019854 2088871 2158811
50535 2158811 2229490 2301116 2374042 2448425 2524258 2601475 2679881 2759255 2839671 2921453 3004657
50524 3004657 3088966 3174329 3261204 3349747 3439176 3528449 3617180 3705186 3791467 3874391 3952737
50513 3952737 4025740 4092209 4150397 4198781 4236147 4260904 4271367 4267175 4249588 4219932 4178436
$$ packed form
50593B216398n0734n3520n5358n6606n7527n7931n7451n6133n4435n2611n0403
50582A613689m7453m3825l9932l6212l2999l0444k8265k5809k2754j9603j7090
50571A269303j5209j3282j0964q702p049n876m567k762o99J068K242L143M499
50558A211145O697R327J1701J3745J6090J9245K3079K7183L1317L5359L9187M2840
50546A486915M6593N0612N4647N8226O1051O3133O4743O6223O7711O9017O9940
50535B158811P0679P1626P2926P4383P5833P7217P8406P9374Q0416Q1782Q3204
50524C004657Q4309Q5363Q6875Q8543Q9429Q9273Q8731Q8006Q6281Q2924P8346
50513C952737P3003O6469N8188M8384L7366K4757J0463m192j7587k9656m1496
$$ plain form
50502 4178436 4125182 4061549 3990066 3913256 3833217 3751999 3671721 3594371 3521787 3455488 3396144
50491 3396144 3343468 3296995 3256692 3222413 3193074 3166829 3141754 3115990 3087539 3054469 3015280
50480 3015280 2968896 2914745 2853285 2786030 2714386 2638587 2558240 2473708 2386440 2298153 2210127
50469 2210127 2123092 2037193 1952269 1868653 1787534 1710044 1636295 1566012 1499786 1438769 1383116
50458 1383116 1331677 1283427 1238484 1197498 1160758 1128156 1099341 1073588 1050168 1029221 1011670
50447 1011670 997803 986496 976375 967324 960269 955814 953732 953598 955313 958867 964021 970366 977564
50434 977564 985569 994767 1005846 1019351 1035421 1053918 1074697 1097685 1122957 1150860 1181857 1216089
50422 1216089 1253319 1293386 1336370 1382153 1430241 1480340 1532806 1588012 1645488 1704217 1763774
$$ packed form
50502D178436n3254o3633p1483p6810q0039q1218q0278p7350p2584o6299n9344
50491C396144n2676m6473m0303l4279k9339k6245k5075k5764k8451l3070l9189
50480C015280m6384n4151o1460o7255p1644p5799q0347q4532q7268q8287q8026
50469B210127q7035q5899q4924q3616q1119p7490p3749p0283o6226o1017n5653
50458A383116n1439m8250m4943m0986l6740l2602k8815k5753k3420k0947j7551
50447A011670j3867j1307j0121r051p055m455k082j34J715L554N154O345P198
50434I77564Q005R198J1079J3505J6070J8497K0779K2988K5272K7903L0997L4232
50422A216089L7230M0067M2984M5783M8088N0099N2466N5206N7476N8729N9557
$$ plain form
50411 1763774 1824673 1887475 1952017 2017733 2084344 2151786 2219508 2286280 2350866 2412717 2471809
50400 2471809 2527923 2580312 2627974 2669946 2705336 2733466 2754257 2768188 2775496 2775532 2767114 2749365
50388 2749365 2721921 2684711 2638192 2583817 2523772 2460108 2394372 2327959 2262240 2198286 2136904
50377 2136904 2078972 2025215 1975583 1929527 1887108 1849257 1816623 1788730 1764506 1742984 1723032
50366 1723032 1703104 1681933 1659065 1634164 1606402 1575293 1541710 1507080 1471762 1435058 1396720
50355 1396720 1357516 1318229 1279000 1239895 1201331 1163586 1126543 1090324 1055582 1022768 991641
50344 991641 961952 934158 908923 886247 865676 847117 830804 816506 803410 791026 779819
50333 779819 770673 763878 758864 754817 751369 748620 746659 745343 744634 744858 746281 748433 750325 751502 752577
$$ packed form
50411A763774O0899O2802O4542O5716O6611O7442O7722O6772O4586O1851N9092
50400B471809N6114N2389M7662M1972L5390K8130K0791J3931P308L6q418j7749
50388B749365k7444l7210m6519n4375o0045o3664o5736o6413o5719o3954o1382
50377B136904n7932n3757m9632m6056m2419l7851l2634k7893k4224k1522j9952
50366A723032j9928k1171k2868k4901k7762l1109l3583l4630l5318l6704l8338
50355A396720l9204l9287l9229l9105l8564l7745l7043l6219l4742l2814l1127
50344I91641k9689k7794k5235k2676k0571j8559j6313j4298j3096j2384j1207
50333G79819r146o795n014m047l448k749j961j316p09K24J423K152J892J177J075
$$ plain form
50318 752577 754436 757179 760217 763219 766445 770130 774008 777805 781855 786835 792949 799768 806914 814556
50304 814556 822998 832084 841490 851453 862710 875454 888710 901085 912005 921943 931599 941159 950281
50291 950281 958391 964875 969280 971542 971913 970549 967290 961886 954291 944611 932887 919056 903128 885391
50277 885391 866500 847385 828891 811378 794671 778401 762335 746352 730320 714235 698439
50266 698439 683456 669425 655829 642074 628366 615701 604785 595159 585732 576060 566629 557947
50254 557947 549883 542157 534914 528420 522531 516972 511798 507050 502193 496561 490316 484351 479227 474832
50240 474832 471119 468408 466628 464920 462481 459398 456146 452745 448987 445269 442459 440917 440088 439116 437532
50225 437532 435375 433053 431147 429965 429174 428109 426525 424732 422953 420935 418435 415764 413491 411737
$$ packed form
50318G52577J859K743L038L002L226L685L878L797M050M980O114O819P146P642
50304H14556Q442R086R406R963J1257J2744J3256J2375J0920R938R656R560R122
50291I50281Q110O484M405K262L71j364l259n404p595r680j1724j3831j5928j7737
50277H85391j8891j9115j8494j7513j6707j6270j6066j5983j6032j6085j5796
50266F98439j4983j4031j3596j3755j3708j2665j0916r626r427r672r431q682
50254E57947q064p726p243o494n889n559n174m748m857n632o245n965n124m395
50240D74832l713k711j780j708k439l083l252l401l758l718k810j542q29r72j584
50225D37532k157k322j906j182p91j065j584j793j779k018k500k671k273j754
$$ plain form
50211 411737 410115 408359 406735 405654 405065 404420 403223 401498 399706 398309 397473 397022 396586 395880 395034 394587
50195 394587 394945 395864 396739 397464 398710 401140 404572 408167 411292 413933 416377 418839 421417 424141 427000
50180 427000 430110 433843 438518 443839 448904 452992 456230 459350 462934 467043 471418 475807 480086 484256
50166 484256 488332 492174 495479 498165 500772 504185 508798 514090 519288 524317 529837 536333 543512 550746
50152 550746 557862 565198 572996 581010 588798 596195 603388 610655 618109 625684 633312 641092 649192 657529
50138 657529 665695 673327 680444 687204 693462 698911 703626 708116 712736 717404 722081 727058 732420 737596
50124 737596 741929 745588 749403 753843 758643 763532 768825 774990 782010 789587 797802 807145 817841 829523
50110 829523 841812 855089 870421 888649 909699 932975 958301 986226 1017366 1051828 1089617
$$ packed form
50211D11737j622j756j624j081n89o45j197j725j792j397q36m51m36p06q46m47
50195C94587L58R19Q75P25J246K430L432L595L125K641K444K462K578K724K859
50180D27000L110L733M675N321N065M088L238L120L584M109M375M389M279M170
50166D84256M076L842L305K686K607L413M613N292N198N029N520O496P179P234
50152E50746P116P336P798Q014P788P397P193P267P454P575P628P780Q100Q337
50138F57529Q166P632P117O760O258N449M715M490M620M668M677M977N362N176
50124G37596M333L659L815M440M800M889N293O165P020P577Q215R343J0696J1682
50110H29523J2289J3277J5332J8228K1050K3276K5326K7925L1140L4462L7789
$$ plain form
50099 1089617 1131334 1177963 1229815 1286016 1345181 1406364 1469228 1533508 1598521 1662987 1725130
50088 1725130 1783184 1836157 1884177 1928003 1968187 2004770 2037457 2065707 2088705 2105580 2115794
50077 2115794 2119092 2115054 2102923 2082020 2052200 2013950 1968330 1916969 1861804 1804489 1746025 1686960
50065 1686960 1627816 1569117 1511270 1454714 1400156 1348389 1299779 1254109 1211041 1170637 1133340
50054 1133340 1099497 1069013 1041550 1017028 995719 977597 961731 946712 931846 917657 904983
50043 904983 893975 884283 875832 868783 862862 857421 852266 847896 844668 842200 839806 837133 834192 831267
50029 831267 829027 828196 828634 829233 829254 829376 830842 833870 837616 841493 845722 850619 856074 861916 868081 874238
50013 874238 879866 885042 890572 896996 903936 910784 917651 925136 933494 942468 951727 961077 970385 979774
$$ packed form
50099A089617M1717M6629N1852N6201N9165O1183O2864O4280O5013O4466O2143
50088A725130N8054N2973M8020M3826M0184L6583L2687K8250K2998J6875J0214
50077B115794L298m038j2131k0903k9820l8250m5620n1361n5165n7315n8464n9065
50065A686960n9144n8699n7847n6556n4558n1767m8610m5670m3068m0404l7297
50054A133340l3843l0484k7463k4522k1309j8122j5866j5019j4866j4189j2674
50043I04983j1008r692q451p049n921n441n155m370l228k468k394k673k941k925
50029H31267k240q31M38N99K1J22J466L028L746L877M229M897N455N842O165O157
50013H74238N628N176N530O424O940O848O867P485Q358Q974R259R350R308R389
$$ plain form
49999 979774 989835 1001312 1014591 1029688 1046572 1065188 1085311 1106757 1129845 1155407 1184343
49988 1184343 1217249 1254390 1295873 1341939 1393263 1450806 1515114 1585902 1662569 1744975 1833221
49977 1833221 1926644 2023417 2121391 2219165 2316168 2411840 2504978 2594068 2678194 2757457 2832334
49966 2832334 2902711 2967782 3026637 3078407 3121652 3154179 3173976 3180071 3172135 3149668 3112239 3060495
49954 3060495 2996375 2922288 2840404 2752551 2660095 2563721 2463809 2361246 2257590 2154325 2052389
49943 2052389 1952595 1856042 1763787 1676407 1594162 1517300 1445870 1379499 1317765 1260683 1208486
49932 1208486 1161035 1117744 1078135 1042125 1009689 980476 953937 929794 908187 889266 872639
49921 872639 857331 842389 827474 812792 798646 785288 773142 762697 753967 746259 738736 731161
$$ packed form
49999I79774J0061J1477J3279J5097J6884J8616K0123K1446K3088K5562K8936
49988A184343L2906L7141M1483M6066N1324N7543O4308P0788P6667Q2406Q8246
49977A833221R3423R6773R7974R7774R7003R5672R3138Q9090Q4126P9263P4877
49966B832334P0377O5071N8855N1770M3245L2527J9797O095p936k2467l7429n1744
49954C060495o4120p4087q1884q7853r2456r6374r9912j02563j03656j03265j01936
49943B052389r9794r6553r2255q7380q2245p6862p1430o6371o1734n7082n2197
49932A208486m7451m3291l9609l6010l2436k9213k6539k4143k1607j8921j6627
49921H72639j5308j4942j4915j4682j4146j3358j2146j0445q730p708p523p575
$$ plain form
49909 731161 723938 717527 711974 707000 702428 698400 695110 692396 689820 687308 685444 684785 684999 685087 684503
49894 684503 683611 682994 682834 683192 684360 686424 688820 690915 692940 695896 700474 706381 712720 718765 724374
49879 724374 730006 736429 744173 753116 762703 772536 782680 793534 805728 820078 837257 857407 880275
49866 880275 905839 934522 966744 1002600 1042220 1086130 1134943 1188720 1246883 1308705 1373711
49855 1373711 1441555 1511631 1582718 1652930 1720218 1783235 1841805 1896387 1947101 1993488 2035133
49844 2035133 2072147 2104778 2132800 2155503 2172077 2181647 2183038 2174960 2156604 2127945 2089470 2041959
49832 2041959 1986649 1925263 1859570 1791045 1721069 1651156 1582630 1516187 1452147 1391110 1333981
49821 1333981 1281229 1232372 1186419 1142748 1101578 1063718 1029900 1000233 974200 951143 930652
$$ packed form
49909G31161p223o411n553m974m572m028l290k714k576k512j864o59K14Q8n84
49894F84503q92o17j60L58J168K064K396K095K025K956M578N907O339O045N609
49879G24374N632O423P744Q943R587R833J0144J0854J2194J4350J7179K0150K2868
49866H80275K5564K8683L2222L5856L9620M3910M8813N3777N8163O1822O5006
49855A373711O7844P0076P1087P0212O7288O3017N8570N4582N0714M6387M1645
49844B035133L7014L2631K8022K2703J6574R570J391q078j8356k8659l8475m7511
49832B041959n5310o1386o5693o8525o9976o9913o8526o6443o4040o1037n7129
49821A333981n2752m8857m5953m3671m1170l7860l3818k9667k6033k3057k0491
$$ plain form
49810 930652 912462 896203 881547 868467 857068 847177 838371 830391 823241 816859 811028 805654 800822
49797 800822 796514 792538 788830 785485 782386 779127 775520 771905 768767 766254 764211 762407 760551 758396
49783 758396 756015 753751 751670 749361 746462 743132 739817 736861 734537 733028 732018 730768 729111 727968
49769 727968 728218 729313 729858 729513 729518 731087 733900 736609 738348 739290 740013 740858 741922 743280 745019 747147
49753 747147 749582 752295 755384 758840 762210 764744 766098 766691 767148 767567 767712 767768 768403 770028 772396 775028
49737 775028 777601 779740 780885 780817 780164 780034 781095 783103 785218 786653 787133 786923 786487 786027 785303 783876
49721 783876 781554 778664 775901 773757 771979 769734 766477 762592 759059 756618 755308 754651 754019 753016 751702
49706 751702 750376 748971 746988 744253 741345 738852 736663 734627 733473 734032 735614 736344 735428 734114 733813
$$ packed form
49810I30652j8190j6259j4656j3080j1399r891q806p980p150o382n831n374m832
49797H00822m308l976l708l345l099l259l607l615l138k513k043j804j856k155
49783G58396k381k264k081k309k899l330l315k956k324j509j010j250j657j143
49769G27968K50J095N45l45NJ569K813K709J739R42P23Q45J064J358J739K128
49753G47147K435K713L089L456L370K534J354N93M57M19J45N6O35J625K368K632
49737G75028K573K139J145o8o53j30J061K008K115J435M80k10m36m60p24j427
49721G83876k322k890k763k144j778k245l257l885l533k441j310o57o32j003j314
49706G51702j326j405j983k735k908k493k189k036j154N59J582P30r16j314l01
$$ plain form
49691 733813 734189 733886 732483 730717 729118 727443 725508 723768 722803 722676 722978 723200 723046 722635 722450 722858 723719
49674 723719 724753 726058 727863 729847 731193 731502 731288 731422 732250 733413 734389 735128 736182 738192 741152 744316
49658 744316 746954 748963 750570 751751 752406 752929 754056 756059 758524 761002 763518 766303 769446 773046 777371
49643 777371 782533 788125 793409 797899 801728 805590 810343 816462 823782 831806 840234 848968 857692 865845
49629 865845 873207 880244 887617 895559 903999 913090 923214 934382 945972 957263 968117 978958 990137
49616 990137 1001573 1013045 1024620 1036548 1048826 1061118 1073169 1085030 1096799 1108476 1120238
49605 1120238 1132557 1145695 1159266 1172726 1186224 1200497 1215900 1231950 1248042 1264204 1280908
49594 1280908 1298364 1316377 1334737 1353449 1372538 1391920 1411587 1431786 1452883 1475072 1498314
$$ packed form
49691G33813L76l03j403j766j599j675j935j740r65j27L02K22j54m11j85M08Q61
49674G23719J034J305J805J984J346L09k14J34Q28J163R76P39J054K010K960L164
49658G44316K638K009J607J181O55N23J127K003K465K478K516K785L143L600M325
49643G77371N162N592N284M490L829L862M753O119P320Q024Q428Q734Q724Q153
49629H65845P362P037P373P942Q440R091J0124J1168J1590J1291J0854J0841J1179
49616I90137J1436J1472J1575J1928J2278J2292J2051J1861J1769J1677J1762
49605A120238J2319J3138J3571J3460J3498J4273J5403J6050J6092J6162J6704
49594A280908J7456J8013J8360J8712J9089J9382J9667K0199K1097K2189K3242
$$ plain form
49583 1498314 1522483 1547414 1572787 1598224 1623768 1650129 1678070 1707526 1737666 1767933 1798619
49572 1798619 1830157 1862267 1894209 1925614 1956636 1987474 2018235 2049161 2080427 2111736 2142537
49561 2142537 2172654 2202256 2231214 2259017 2285381 2310465 2334351 2356778 2377502 2396456 2413438
49550 2413438 2428209 2441080 2452805 2463628 2472998 2480595 2486925 2492368 2496190 2497298 2495669 2492360 2488299
49537 2488299 2483737 2478707 2473323 2467599 2461593 2455811 2451010 2447508 2445086 2443480 2442543 2442043 2441952 2442892 2445596
49522 2445596 2449763 2454116 2457880 2461661 2466497 2472581 2479295 2486046 2492583 2498814 2504785 2510662 2516274 2520855
49508 2520855 2523608 2524367 2523395 2520775 2516410 2510426 2503000 2493796 2482092 2467562 2450582 2431696 2411148
49495 2411148 2389013 2365369 2340164 2313274 2284966 2255993 2226925 2197544 2167194 2135602 2103163
$$ packed form
49583A498314K4169K4931K5373K5437K5544K6361K7941K9456L0140L0267L0686
49572A798619L1538L2110L1942L1405L1022L0838L0761L0926L1266L1309L0801
49561B142537L0117K9602K8958K7803K6364K5084K3886K2427K0724J8954J6982
49550B413438J4771J2871J1725J0823R370P597O330N443L822J108j629l309m061
49537B488299m562n030n384n724o006n782m801l502k422j606r37n00r1R40K704
49522B445596M167M353L764L781M836O084O714O751O537O231N971N877N612M581
49508B520855K753P59r72k620m365n984p426r204j1704j4530j6980j8886k0548
49495B411148k2135k3644k5205k6890k8308k8973k9068k9381l0350l1592l2439
$$ plain form
49484 2103163 2070651 2038931 2008812 1980621 1953892 1927776 1901907 1876635 1852405 1829294 1807315
49473 1807315 1786741 1767737 1749827 1732165 1714357 1696729 1679837 1663944 1649018 1634991 1621939
49462 1621939 1610161 1600063 1591723 1584613 1578069 1572098 1567342 1564093 1561748 1559514 1557328 1555637 1554498
$$ packed form
49484B103163l2512l1720l0119k8191k6729k6116k5869k5272k4230k3111k1979
49473A807315k0574j9004j7910j7662j7808j7628j6892j5893j4926j4027j3052
49462A621939j1778j0098q340p110o544n971m756l249k345k234k186j691j139
$$ [...]
##END NTUPLES=NMR SPECTRUM
##END=
