
##TITLE=AC1252_TOGORS11070_6534220_CZ6qINh3ny
##JCAMPDX= 6.0         $$ Bruker NMR JCAMP-DX V2.0
##DATA TYPE= NMR SPECTRUM
##DATA CLASS= NTUPLES
##ORIGIN= BRUKER
##OWNER= Administrator
$$ 1.72 TOPSPIN		Version 2.1
$$ 2012-07-16 22:38:26.546 -0500  Administrator@TOPSPIN
$$ Compression mode = diff/dup
##.OBSERVE FREQUENCY= 400.02188249412
##.OBSERVE NUCLEUS= ^1H
##.ACQUISITION MODE= SIMULTANEOUS (DQD)
##.ACQUISITION SCHEME= undefined
##.AVERAGES= 8
##.DIGITISER RES= 22
##SPECTROMETER/DATA SYSTEM= spect
##.PULSE SEQUENCE= zg30
##.SOLVENT NAME= COFFEE_meoh
##.SHIFT REFERENCE= INTERNAL, COFFEE_meoh, 1, 14.98509
##AUDIT TRAIL= $$ (NUMBER, WHEN, WHO, WHERE, PROCESS, VERSION, WHAT)
$$ ##TITLE= Audit trail, TOPSPIN		Version 2.1
$$ ##JCAMPDX= 5.01
$$ ##ORIGIN= Bruker BioSpin GmbH
$$ ##OWNER= Administrator
$$ $$ C:\Bruker\TOPSPIN/data/COFFEE/nmr/AC1252_TOGORS11070_6534220_CZ6qINh3ny/10/pdata/1/auditp.txt
$$ ##AUDIT TRAIL=  $$ (NUMBER, WHEN, WHO, WHERE, PROCESS, VERSION, WHAT)
(   1,<2012-07-16 22:38:18.671 -0500>,<Administrator>,<TOPSPIN>,<go>,<TOPSPIN 2.1>,
      <created by zg
	started at 2012-07-16 22:37:11.750 -0500,
	POWCHK enabled, PULCHK disabled,
       configuration hash MD5:
       6B 1B 68 BB D9 2E 58 E2 7F 35 AD 54 07 DF 0E 41
       data hash MD5: 64K
       2A D2 14 1B 5F 09 EC 4A 97 28 89 BC E1 58 8E 72>)
(   2,<2012-07-16 22:38:22.031 -0500>,<Administrator>,<TOPSPIN>,<proc1d>,<TOPSPIN 2.1>,
      <Start of raw data processing
       efp LB = 0 FT_mod = 6 PKNL = 1 PHC0 = 0 PHC1 = 0 SI = 32K 
       data hash MD5: 32K
       38 43 08 23 59 F7 9B 6B D3 5A 1C 79 3C BC CA B3>)
(   3,<2012-07-16 22:38:22.453 -0500>,<Administrator>,<TOPSPIN>,<proc1d>,<TOPSPIN 2.1>,
      <pk PHC0 = 178.0664 PHC1 = 0 
       data hash MD5: 32K
       73 65 BC D6 1C CD C6 23 DF C6 39 37 F3 8D 98 63>)
(   4,<2012-07-16 22:38:22.515 -0500>,<Administrator>,<TOPSPIN>,<proc1d>,<TOPSPIN 2.1>,
      <abs ABSG = 1 
       data hash MD5: 32K
       8C F4 C2 3B C2 37 73 B7 CF D9 F5 73 DE 29 01 B8>)
(   5,<2012-07-16 22:38:22.546 -0500>,<Administrator>,<TOPSPIN>,<proc1d>,<TOPSPIN 2.1>,
      <abs ABSG = 2 
       data hash MD5: 32K
       8A D4 AE C5 38 12 FD 58 A9 70 7B 1C 81 5B F3 76>)
(   6,<2012-07-16 22:38:22.578 -0500>,<Administrator>,<TOPSPIN>,<proc1d>,<TOPSPIN 2.1>,
      <abs ABSG = 3 
       data hash MD5: 32K
       9C 68 89 8A F9 5E B8 9C A2 6A 46 37 55 6D 95 FB>)
(   7,<2012-07-16 22:38:22.609 -0500>,<Administrator>,<TOPSPIN>,<proc1d>,<TOPSPIN 2.1>,
      <abs ABSG = 4 
       data hash MD5: 32K
       31 D2 99 5F 2B BB 1F 29 4B B6 4F 7E 4C D4 45 94>)
(   8,<2012-07-16 22:38:22.640 -0500>,<Administrator>,<TOPSPIN>,<proc1d>,<TOPSPIN 2.1>,
      <abs ABSG = 5 
       data hash MD5: 32K
       2A 3F 5D FF 2A 2E 60 31 53 9C E8 33 CF 94 D0 D2>)
$$ ##END=
$$ 
$$ $$ hash MD5
$$ $$ BE D6 3D 0E 83 AE 07 CD 66 29 B2 19 F9 3C D5 DB
##$RELAX= 
##$RELAX= 
##$RELAX= 
##$RELAX= 
##$RELAX= 
##$RELAX= 
##$RELAX= 
$$ Bruker specific parameters
$$ --------------------------
$$ [...]
150 150 150 150 150 150 150 150
##$TP07= 0
##$TPNAME0= <>
##$TPNAME1= <>
##$TPNAME2= <>
##$TPNAME3= <>
##$TPNAME4= <>
##$TPNAME5= <>
##$TPNAME6= <>
##$TPNAME7= <>
##$TPOAL= (0..7)
0.5 0.5 0.5 0.5 0.5 0.5 0.5 0.5
##$TPOFFS= (0..7)
0 0 0 0 0 0 0 0
##$TUNHIN= 0
##$TUNHOUT= 0
##$TUNXOUT= 0
##$USERA1= <user>
##$USERA2= <user>
##$USERA3= <user>
##$USERA4= <user>
##$USERA5= <user>
##$V9= 5
##$VALIST= <valist>
##$VCLIST= <CCCCCCCCCCCCCCC>
##$VD= 0
##$VDLIST= <DDDDDDDDDDDDDDD>
##$VPLIST= <PPPPPPPPPPPPPPP>
##$VTLIST= <TTTTTTTTTTTTTTT>
##$WBST= 2048
##$WBSW= 25
##$XGAIN= (0..3)
0 0 0 0
##$XL= 0
##$YL= 0
##$YMAX_a= 499160
##$YMIN_a= -637403
##$ZGOPTNS= <>
##$ZL1= 120
##$ZL2= 120
##$ZL3= 120
##$ZL4= 120
##$ABSF1= 14.98509
##$ABSF2= -5.573092
##$ABSG= 5
##$ABSL= 3
##$ALPHA= 0
##$AQORDER= 0
##$ASSFAC= 0
##$ASSFACI= 0
##$ASSFACX= 0
##$ASSWID= 0
##$AUNMP= <proc_prof1d_extract_pilot.lims>
##$AXLEFT= 0
##$AXNAME= <>
##$AXNUC= <1H>
##$AXRIGHT= 0
##$AXTYPE= 0
##$AXUNIT= <>
##$AZFE= 0.1
##$AZFW= 0.1
##$BCFW= 0
##$BC_mod= 0
##$BYTORDP= 0
##$COROFFS= 0
##$CY= 15
##$DATMOD= 1
##$DC= 0
##$DFILT= <>
##$DTYPP= 0
##$F1P= 0
##$F2P= 0
##$FCOR= 0.5
##$FTSIZE= 32768
##$FT_mod= 6
##$GAMMA= 0
##$GB= 0
##$INTBC= 1
##$INTSCL= 1
##$ISEN= 128
##$LB= 0
##$LEV0= 0
##$LPBIN= 0
##$MAXI= 10000
##$MC2= 0
##$MEAN= 0
##$ME_mod= 0
##$MI= 0
##$NCOEF= 0
##$NC_proc= -8
##$NLEV= 6
##$NOISF1= 0
##$NOISF2= 0
##$NSP= 0
##$NTH_PI= 0
##$NZP= 0
##$OFFSET= 14.98509
##$PC= 1
##$PHC0= 178.0664
##$PHC1= 0
##$PH_mod= 1
##$PKNL= yes
##$PPARMOD= 0
##$PPDIAG= 0
##$PPIPTYP= 0
##$PPMPNUM= 2147483647
##$PPRESOL= 1
##$PSCAL= 4
##$PSIGN= 0
##$PYNMP= <proc.py>
##$REVERSE= no
##$SF= 400.02
##$SI= 32768
##$SIGF1= 0
##$SIGF2= 0
##$SINO= 400
##$SIOLD= 32768
##$SPECTYP= <>
##$SREGLST= <1H.CDCl3>
##$SSB= 0
##$STSI= 32768
##$STSR= 0
##$SW_p= 8223.68421052631
##$SYMM= 0
##$S_DEV= 0
##$TDeff= 65536
##$TDoff= 0
##$TI= <>
##$TILT= no
##$TM1= 0
##$TM2= 0
##$TOPLEV= 0
##$USERP1= <user>
##$USERP2= <user>
##$USERP3= <user>
##$USERP4= <user>
##$USERP5= <user>
##$WDW= 1
##$XDIM= 32768
##$YMAX_p= 465790664
##$YMIN_p= -655961
##$CURPLOT= <Network HP LaserJet P1505>
##$CURPRIN= <$Network HP LaserJet P1505>
##$DFORMAT= <normdp>
##$LAYOUT= <+/1D_H.xwp>
##$LFORMAT= <normlp>
##$PFORMAT= <normpl>
##$SURQMSG= 1
$$ End of Bruker specific parameters
$$ ---------------------------------
##NTUPLES= NMR SPECTRUM
##VAR_NAME=  FREQUENCY,     SPECTRUM/REAL,   SPECTRUM/IMAG
##SYMBOL=    X,             R,               I
##VAR_TYPE=  INDEPENDENT,   DEPENDENT,       DEPENDENT
##VAR_FORM=  AFFN,          ASDF,            ASDF
##VAR_DIM=   32768,         32768,           32768
##UNITS=     HZ,            ARBITRARY UNITS, ARBITRARY UNITS
##FACTOR=    0.250966925370066, 1,           1
##FIRST=     8223.43324360094, 159219,       -170029
##LAST=      0,             104436,          -224844
##MIN=       0,             -655961,         0
##MAX=       8223.43324360094, 465790664,    0
$$ Real data points
##PAGE= N=1
##DATA TABLE= (X++(R..R)), XYDATA
$$ [...]
23861 103825 9430 -257137 143265 -165150 13888 -157044 -52226 132010 -79377 50421 -20847
23849 30834 54389 147799 -31152 -346135 -123283 -120355 204322 -64852 -253487 -36816 74490
23837 -144074 403087 -25645 -207834 69797 -127820 127862 -305051 -176571 77529 127999
23827 127999 57332 193067 47186 -162684 -5484 106691 163408 -214057 146701 368289
23817 368289 190398 143566 55162 237307 178320 -371649 42682 73152 -114462 -132861 -286817
23806 -286817 -124473 19577 92718 -215551 -111750 40720 -34175 -100164 52049 -258061 -3141
23794 -52014 -127151 -77107 29058 -119068 -151610 31903 22238 -103991 156132 476235 -45583
23782 -121030 41931 -141357 154403 210613 -73150 -33404 128767 46850 -28738 -27169 118953
23770 135554 254977 126028 -677 235815 61176 -85639 126648 -52449 26822 103975 116544
23759 116544 -140089 93541 19793 -43539 -46885 -52571 100039 61553 1239 133405 79708
23748 79708 -12205 59599 -471569 -73337 286024 -85482 -210271 -62664 192859 390051 -887
23736 170571 54824 -12128 -382151 93918 281366 225802 -35230 -108011 198046 22342 162758
23725 162758 145420 119894 -233922 40435 126714 -158191 -9709 93815 30187 -62927 -269246
23714 -269246 71179 43462 -221505 -99623 -244774 34495 61102 51678 128363 -216906 -71121
23702 77186 298451 -301939 227947 128296 -74160 -250880 127999 -182507 -126112 61177
23691 -1991 -198924 -98483 -124170 -339631 -90293 -254122 -13022 101471 159927 -40397 -305494
23680 -305494 -162773 266950 -94151 -336829 351253 -175348 -103109 180955 -3775 -343880
23670 -343880 -174443 24437 47062 268758 35974 71437 -285042 88326 251726 29948 196476
23659 196476 -23443 -97774 2939 -215805 -176915 -8885 -46244 -221447 -221243 -40350 -373085 -122818
23646 -123240 23903 -108413 60216 50443 186557 -139379 -26170 -57354 111695 31096 -15097
23634 -38262 -51062 -158136 -335867 -293437 -289952 -2181 17341 -74460 238614 -119326 250895
23622 38434 12049 -174147 -20495 149331 120045 16663 -26399 65069 12819 155313 180334
23611 180334 387471 302131 243030 53737 -149308 61727 -164590 62976 54570 -67241 -404651
23600 -404651 124967 26474 122020 -147217 81694 -229457 99977 -317401 -168693 378090
23589 340714 162546 -33043 -37898 78135 -138121 378724 -123272 225135 34272 113974 174360
23578 174360 -113154 -414397 -262848 29623 -58941 -157474 -246412 -31877 353988 116307
23567 115570 -132560 4977 -387918 -244031 8599 27063 -177668 -374418 -250421 82244 228702
23556 228702 25983 -29813 6968 93738 49443 -174164 -48778 231627 -136463 316526 -180009
23544 -17695 -132859 162925 76277 44419 -37619 194292 191771 282368 -138396 7762 -366965
23532 -160058 -182680 46125 127422 -70215 -299470 -345341 -161405 -48860 -26901 -5505 174583
23520 15649 241176 17330 -134855 -73014 138408 -32803 -235428 -88074 -179663 48511 16672
23508 111238 132404 347749 95424 -166953 -61959 143879 -184780 -1482 -26775 24229 181994
23497 181994 -44855 -192490 338008 131496 -55771 -9127 152931 -45861 181534 358719
23487 358719 -63290 145200 -35391 -188974 -30953 209165 -128925 45595 121527 179021 -189534
23475 -61902 67135 -104282 -38816 154871 -98200 -53364 -28515 -322724 145731 46200 -52860
23463 -22969 288989 -1643 -9100 -293723 333279 -269641 598521 -134452 -120824 95416 135568
23452 135568 59666 7473 -21135 -224540 -117929 135247 -178710 -40052 71974 -820 -31868
23441 -31868 -159762 -230059 -244219 -146293 -17540 -103182 -48068 132608 345716 -21853 8870
23429 -115725 34055 -276187 -9066 94730 -50693 -54332 199405 157906 -329978 179608 -157251
23417 92430 206723 -62414 -10303 -380103 360098 96100 9412 110624 -166580 71843 65358
23406 65358 13908 6534 423611 16583 -48438 -244365 -134768 -179094 -41145 45574 138264
23395 138264 132003 -79669 -161392 8197 67215 -40628 -121047 -101252 -169042 -210353 -177157 234928
23382 20283 218309 6265 -60158 -195027 -67820 -119091 -355615 419224 -252712 68312 193097
23371 193097 136275 -47003 121582 113312 103368 116541 88964 40867 -3461 334033 370295 -22412
23358 -97972 75872 -158356 -201592 122948 57394 5224 -77401 -21351 -316308 150040 50018
23346 173194 -387232 194381 19249 -366564 -10359 -77127 -263769 -318460 226934 38526
23335 -154437 -36133 140658 183557 133927 32209 383363 13377 -18184 -100969 244742 -62654
23323 -147794 85701 36431 283953 -277068 -351193 81070 -56712 -202993 169395 36174 -266026
23311 -133329 70666 279599 176000 -19783 198720 128694 -50913 -50612 134535 7010 -80910
23299 216609 -227359 -14471 -58935 -59292 -93657 -196186 -172919 -38782 189974 -204257 312991
23287 -170031 106756 134523 76431 -260109 145694 -192364 -39169 -313073 91825 -227208
23276 102486 -75576 182822 249114 -196913 230733 219264 -122469 133371 -25323 -210834
23266 -210834 -59856 -87115 -9483 -265378 -84659 -32189 -256308 -139299 144844 17227 296835
23255 296835 151677 -94012 -70340 -124979 139391 -74855 -259959 188581 125041 169707 -117919
23243 -400810 -218980 -419343 -7647 -161262 -21178 -164841 -39771 -546753 240531 30634
23232 -169868 -137040 -148981 -96216 112735 -170100 -80624 -52917 -207410 78282 74457 -92329
23220 -327780 -61870 139786 141229 -335830 453718 63092 24022 255850 33922 127411 142809
23209 142809 -16248 68880 127531 -182630 -120051 -204776 -241488 -97544 -24232 254817 -276914
23197 161028 -44223 266920 35047 -60374 -147822 -69288 184136 278216 222916 80356 43772
23186 43772 -57860 -307188 93571 -150731 207541 -403018 -33891 -87421 76046 -77415 66907
23174 -146809 -28477 264229 -555940 -199097 368975 152017 -15803 245334 -269204 29817
23163 -58367 184216 -187011 117189 48416 -202564 -331561 -151573 -102041 206757 -107919
23152 191077 203063 70692 288463 -76292 -56054 -34562 80353 -34338 -86188 103482 -180408
23140 -155910 221225 -198897 -208362 349148 -422200 -88110 38741 -166082 -249798 104633
23129 2790 10499 188844 83293 -52587 -167819 210010 275160 -45369 85390 -101771 380373
23117 -71740 40573 190810 -214622 179786 394068 -332529 56103 56675 166557 -20583 -60853
23106 -60853 -106069 113534 110894 -28147 -1072 -201047 98694 -223385 287869 261678 299356
23095 299356 109432 291030 187734 -109949 -85096 170708 -25458 -22021 -291381 -13855
23084 254559 26297 -344119 68380 184479 83479 39236 -239870 -64274 -197578 -132397 44129
23072 -386077 188487 -82745 -242719 79701 -18107 31197 -141363 -123509 -200961 209503 -121647
23060 88175 217893 162938 -70017 310864 56042 -130505 136080 -53922 124504 -478915
23049 -133102 -252184 -276355 92203 -10610 239681 193982 -474352 21907 -190259 -281103 88702
23037 -168350 144599 243672 -145194 -172287 -187330 -169836 218095 99714 -11589 -81396 -105951
23026 -105951 39048 -80800 -81656 -75580 -52523 129571 -485641 85552 -115399 66576 162166
23015 162166 113255 173177 -194373 -94218 -54701 -42534 182218 -221375 -259245 28088 312745
23004 312745 -147023 335679 -190565 233876 275032 130087 -189302 -96083 133759 -168394
22993 55693 14353 -216344 59580 -224398 178894 -32737 -318074 -324922 16176 -69185 -89396
22982 -89396 37442 45783 485582 -50866 -78903 417845 202690 64819 73736 -225222 16919
22970 -59036 -100616 -254076 -13915 -185601 -416311 98278 72969 -403555 -151285 16316 -7134
22958 -83412 279825 -127585 12413 -87043 -180944 -41469 -279254 -58292 89392 -336787 -272334
22947 -272334 -8894 -138140 95528 21066 -350347 -88413 18006 -73565 29862 -34982 110347
22935 -146042 60431 -115892 -141615 185636 -34471 369092 -124162 -236321 -115897 31243
22924 -57284 -473782 -126715 102074 -32710 -68120 -267267 105027 19503 -47029 253146
22913 -129647 -481446 -20997 -75909 -28752 -2325 -202372 -55668 16264 -80984 122437 -211552
22901 -58040 -153178 55445 -155986 -283700 224125 -188775 61626 -21607 83246 480391 149674
22889 10893 -204717 105763 -141214 239025 -25879 -73297 123777 -100586 81715 234957
22879 234957 62379 107107 -394296 -122083 65117 86444 -157151 -279911 200709 -28048
22868 36256 -140071 -226347 97368 -125755 300514 -118925 -3681 87830 -15944 -3290 -85984
22857 -85984 74027 -134576 -38883 350675 -215118 -346823 208733 49281 -255213 -436449
22847 -436449 -263679 -4572 101308 -354949 -102510 -86393 30208 99043 -10827 -446631 121401
22835 -121806 -154894 -211519 -301907 116610 -46465 -42773 -13604 -17240 435257 -163525 232458
22823 78958 -120760 5856 106000 205900 -97786 -375789 126525 120230 -23495 134306 84374
22812 84374 -1199 -42241 -220958 -242530 -40567 -14938 65194 -279438 -109404 110129 -3386
22800 116330 26226 77526 -57919 -121989 -21213 197969 -84872 -76121 125435 -269786 75046
22788 -292996 84588 90570 -283396 147329 -189266 -217234 -224380 -186596 -104359 -5514 236993
22776 48110 114524 -143177 186065 36777 -77864 -22717 23933 -153456 -82017 31607 -105935
22764 10274 14263 -160820 -126477 -208569 241236 294105 -9178 246619 53514 172543 167252
22753 167252 -209196 -213788 323904 -138846 164407 -146135 137635 87787 -93662 -198474
22743 -198474 366136 22539 81876 -176180 166757 4218 156389 177747 -140327 109112
22732 -184381 -68355 -132391 -91568 145658 -4341 80958 -277777 -176042 -216584 148021 26407
22720 462487 200189 62079 -23851 35580 80098 126580 12039 236962 32680 -79100 -430552
22709 -430552 177807 -60876 60952 -89607 277176 -193362 464095 178358 664 -66714 2175
22697 71661 68263 -41920 114854 -245749 -198752 -176988 -82599 -124577 -44606 -130526 92059
22685 113293 32273 -19345 -5762 -85364 85630 204965 -298139 -104293 -54255 161779 -16808
22673 -40983 -230165 240935 12398 -99646 -9382 -131825 -47695 -42324 -36940 236478 -54185
22661 -145944 34073 -303852 26318 282329 -8762 -128866 33634 -202961 -205117 216291 101384
22649 -11121 125976 -331866 -44983 -36733 153920 23832 400107 -200373 107367 -130872
22638 -282949 68152 64265 106437 -62216 -163355 -61862 130794 142261 -39072 -393318 -15663
22626 -352038 -100373 369546 -31157 38286 -19695 -277707 -296675 254423 -364445 -292422
22616 -292422 105773 72621 -62556 240834 -70334 -1158 -124239 -196393 117099 -75625 -192989
22605 -192989 59910 -9745 -155211 -181641 -214215 -158337 186606 -272948 -99936 261943 67128
22593 127445 -238847 -150561 90425 -150735 -228292 142080 -89197 18620 -2959 138146 -9104
22581 -26706 113223 -59827 93385 -171308 48382 -424418 92965 -91377 -35883 -99644 -13600
22569 -92836 356687 -5520 43552 31651 -55992 -367618 15111 20066 79145 -71386 136906
22557 249949 -359033 233040 -168971 95979 -158106 -36508 10321 -59354 -47701 -22147 -36278
22546 -36278 -344836 101621 -180408 -142355 -329598 215679 304748 -32665 -132974 95014
22535 -220757 173414 -320154 -173518 59269 -144949 324520 -71736 189463 9067 -99878
22524 91275 -222291 339849 284800 -133078 91305 246371 4611 3402 -244526 28448 -55621
22512 243259 -161021 1132 -171417 -186117 67461 174087 -40206 188698 27077 -108385 52849
22500 21203 -106906 -322374 -23519 -107157 137209 -149702 -189907 28115 123891 -384147 91973
22488 3021 -110016 -215496 -52309 324722 16349 -121898 -144517 72370 -214748 -100913 42633
22476 32149 45091 -220440 -113071 -157151 -262384 263101 -184124 80064 -282433 266029
22465 -145880 201417 -3046 -30143 82823 -184652 -123504 -67947 -258633 -61150 -259401 238326
22453 -132028 142311 49394 226650 -318368 -55726 -295155 -156816 -208110 -100576 97853
22442 -113001 84152 147660 -246904 -110991 -26907 -151169 -298276 24182 279653 239764
22432 239764 -441478 -106855 -195742 229386 165492 -29086 102673 -6094 566706 248318
22421 -199183 387082 227789 -72867 -74733 -305015 162781 106975 71187 47707 -17517 -161914
22410 -161914 -56470 -204664 141462 -336396 -339415 194248 -36261 -46654 98879 -262604 -245506
22399 -245506 105763 -320137 -262757 -238236 -57853 -238920 12607 -38986 305343 30517 139572
22388 139572 24011 -316308 -77258 -14483 18999 -219229 -7767 -118240 248658 88472 58805
22377 58805 121850 -22580 -46405 -187688 -110942 -475578 -25008 87092 10084 -4948 -194003
22366 -194003 -9155 -160204 164758 -147706 -166793 319858 237268 -127396 69417 -474596
22355 257154 -170768 85117 8203 348762 -197336 -3485 -150868 25834 113760 -149646 116724
22343 -76384 81476 -524251 -147561 -233052 -65851 23352 78397 125893 127310 -228078 123340
22331 286242 -29309 -75881 -76682 40436 39101 -129238 -24771 80984 -333480 -2208 28790 192043
22319 192043 -130551 -72064 -295659 -70216 180686 -9934 -342404 -206833 22143 -162644
22308 313581 -155817 149163 -219852 -49563 126638 70599 4760 174100 -97725 -99758 -382738
22297 -382738 76221 -26532 38102 -344840 -11735 -171600 -461884 -20689 -266987 227763
22286 -26493 -76289 -83781 -232475 286412 80341 -228049 84276 -108826 126779 -9373 -84951
22275 -84951 11846 -306492 120786 -81971 -117605 291069 97278 115242 83047 80371 276789
22264 276789 -3670 -135807 89739 -194076 236960 -242674 194238 43713 -44429 27305 12356
22252 -170977 -49902 235803 -15053 -259916 122175 -76374 -173277 -39263 -41860 -17299 -11594
22241 -11594 -27859 59287 -42234 -29767 -197341 182646 161627 -100445 -139742 404736 -34634
22229 -305008 -168065 -219320 26269 -105105 -206199 18216 220105 -313186 -223957 142341
22218 -174844 132948 -107633 261235 246409 288770 31944 49662 -70839 85043 104457 84365
22207 84365 440344 -294074 78918 -287510 1326 -284311 104144 52332 -96176 -156406 177207
22195 -228596 -25495 17075 -60202 122677 34956 -27429 -84105 106631 -262436 -86878 152100
22183 -81321 -106944 270426 77924 -65651 -198799 8427 -208937 179766 280985 202084 -129704
22171 3555 92691 -191443 -227697 104602 184388 -69961 57213 -219551 201600 -168438 -382707
22160 -382707 2076 -6641 231938 226042 216007 153506 -341156 107224 -75792 -241088 -53285
22148 98010 -36465 -52341 -179756 -451164 31932 -202445 -197035 111151 -85160 -32539 105898
22136 53303 -187240 -222443 31778 -158635 41259 -62597 195207 31404 170779 -331280 -268216
22125 -268216 -38775 93170 290913 -126763 216552 5100 86693 -259971 206678 -162676
22114 -303297 -65325 43187 95169 -257087 -51182 -8065 -38737 -445 149732 -151224 -33872
22102 28280 230283 2477 -264856 81950 -49874 98005 19291 299391 7499 107375 -40389
22090 -381817 2618 161556 -115146 -115964 87068 183158 109320 115169 -195892 -201500 -361625 -400655
22078 -400655 -128756 -169116 -121892 38321 -69372 -16582 325673 49061 -267464 233637 -55211
22066 -285025 -220163 -180638 96005 -98629 -111257 -160291 -78955 -211016 183713 26174 85384
22055 85384 -243572 -126317 120781 98508 24925 23308 -191582 -233470 -30781 -90499 147161
22043 203728 -275821 -213047 337765 -116991 -110520 56191 -166236 -115316 98176 76909 199934
22032 199934 -71949 119891 -6328 -132075 -291598 -36662 99060 117935 2411 -234092 49322
22020 -219806 -206320 -26735 68207 -184433 -79313 4573 -218220 48052 -123218 -210155 82907
22008 213583 -174909 -137710 -40845 -78947 -62492 70922 -116082 -87984 -68926 152039 384222
21997 384222 -11600 -123204 30655 -199898 -152238 -331761 16173 -151806 184341 315560
21987 315560 274574 -56535 303249 -255229 -234622 -196066 4309 -17569 -173966 85274 -280763
21975 -14836 -22453 -74849 -17250 -173435 -128048 -151501 44258 388740 297771 -31210 169966
21963 -158709 66768 28860 144228 -48866 -419518 195465 286707 2338 -168376 73013 235051
21952 235051 -100768 -180933 -147625 47878 -179256 29162 -210005 -81103 -309553 38829 -68755
21940 176378 138824 -60851 -47882 1822 136058 -39173 -110577 131203 -119212 -300577 117970
21928 140974 -220066 32408 12323 -296634 149874 86571 -85032 -138876 -14470 109257 382283
21917 382283 107348 -39242 200472 -296372 -107316 -90508 -23312 -166550 -151528 99773
21906 -283621 32981 -189048 -84257 -153146 310546 -52056 -209984 -261291 82439 -177638 -58247
21894 -241297 -98984 -191153 -165427 21279 -3949 71012 -92546 -84682 -99666 -86727 129841 366260
21882 366260 -19118 -98978 -55687 -243766 10499 -289239 -72301 67948 -139959 83607 104513
21871 104513 -51704 -368441 70323 227643 -199566 -92152 240956 109261 -302743 -20437
21860 75272 134638 -86916 220922 4530 194538 -77646 -121383 99091 -222575 37916 -46514
21848 -140213 361589 -216863 -178508 -72402 -196332 -183655 130067 93799 -41246 65728 68028
21837 68028 -125002 -465884 128560 230232 77283 -126622 -283846 -93696 -57481 -19751
21826 -30547 160286 -379742 173041 -95274 59023 -38636 14769 -48741 60821 -36092 -194798
21815 -194798 -104698 -115195 173807 -273467 -219855 -187046 -126792 193850 117511 35058 -423572
21803 -66981 -231474 -106688 -185536 -132498 -319939 -193186 -150447 14910 -21487 55977 61770
21792 61770 99195 -34221 -159701 -2940 39122 6805 -134348 94604 172972 232906 -237128
21780 -97518 -7462 -323962 -44313 -5940 -183107 1579 -116162 151035 -7565 115072 -233097
21768 -166963 -8527 25564 -266418 83025 1730 164300 237636 -26112 43747 -375837 244286
21756 -173549 -373501 -64943 -119303 -96528 67725 134467 -232309 12611 -125998 -106029 190417
21744 -283887 -286083 111244 -127996 -232248 -241018 244639 -48309 -89069 222856 -42212 222091
21732 206469 35350 -208404 -358682 -221397 176131 -220222 -44783 -35529 -168326 208523
21721 -243921 -56027 -136161 221710 120260 -104705 117620 166824 -288865 59404 121294
21711 121294 -105691 -93397 -140959 -166016 -115163 -55974 179563 162790 79869 -261452 268986
21699 -325735 -259165 -240952 60116 -402546 -334833 98922 89729 -78076 100234 28797 -224295
21687 223273 -101274 -328572 74480 -15685 226942 -109044 -210972 28468 326745 -229396
21676 -198049 -218925 -159423 -236481 27678 -50657 -113912 107019 -308013 154088 157130 -53772
21664 -229244 166420 -140672 -302483 -296057 52618 37074 175062 -94387 356758 -118803
21653 103679 -72318 -130902 5380 127805 -262176 -237459 -319259 200465 -67169 7023 -9035
21641 -181089 33673 -174533 -52204 141909 -230746 -222228 104081 127902 -58001 308124 -153496
21629 212086 102686 -104767 -530879 -191386 -71962 98274 39552 -15416 -225631 -154254
21619 -154254 -216339 -321904 -36965 125291 -98696 57311 246458 -18645 -6280 -101698 275405
21607 -384170 35763 -17627 185604 268501 -123228 4957 -44518 90077 105514 78564 -152349
21595 -52883 -50203 218894 -116739 -309873 33682 -133404 149452 -173953 -118153 71881 68927
21584 68927 -273857 23360 -165681 -72650 121559 -314291 -107096 -105564 -335847 -223157
21574 -223157 -524899 -50037 -102171 -260623 -165920 -209987 70584 -119217 -257448 261628
21563 37507 -20256 42419 -363720 -58690 203341 -91960 171894 3362 -41206 89441 55815
21552 55815 -204483 -92393 162306 161898 87167 138938 74533 51550 -167092 262178 -204002
21540 -122261 47869 109641 18849 8483 -179075 -90455 -239442 60283 -321310 27540 -358615
21528 -171524 109307 26798 -5009 55366 -306650 5271 109902 -44637 -83459 -343578 -86601
21516 43820 268684 -321541 -70351 31583 -13403 -89889 130538 -143593 -129210 199670 -178558
21504 -18510 -55714 -29291 71186 255019 119449 -45831 194171 -136286 55124 253664 -229988
21492 -38956 131599 -227202 -53157 9838 104304 -193705 -214179 -80647 105305 -28586 19816
21480 -25150 -51743 -57968 -123759 -243255 117259 -303441 207424 81091 -402412 -161286 -109511
21469 -109511 70028 -52495 -110084 -74697 -363165 -59407 361175 -234020 -292587 -270325 -136108
21458 -136108 -81952 -59252 173861 -64704 -24890 453057 168469 43030 -168279 -532641
21448 -532641 -191909 -331095 -303862 185007 248832 162701 217652 109720 101315 -147634 134295
21436 112583 427077 478778 261026 615932 578441 240577 380638 112038 -46721 -143006
21426 -143006 230445 -18072 367 15507 -25218 208577 35531 -71958 -42481 271183 -240598
21414 -273641 64006 -98944 -117538 -80561 74199 118027 -70477 -71976 282406 -58274 163480
21402 176908 13869 155051 -223987 -239360 42732 -94360 127987 -144377 117879 -392087
21391 122557 -93709 -13371 123229 31708 176569 39454 35899 -174803 30910 -11409 -140430
21380 -140430 -169809 -112391 -216954 97581 102587 84457 -329822 113232 34243 -153920 -235587
21369 -235587 156880 113811 -283909 -313461 237204 -111828 -249353 -88688 -76543 95758
21358 62496 14267 140539 -390741 -115540 31796 -68677 233076 -159271 180697 -241551
21347 -84133 -170540 -429833 -274018 57872 32529 -405893 -169124 57581 211405 -123516
21336 121920 -302211 190530 105572 -8543 1750 13525 -16705 19831 5039 -65502 274006
21324 -112867 -43907 -379662 -256859 57094 -44528 88899 19062 50862 -229650 -96628 -65617
21313 -65617 267333 128911 90734 168186 -64542 -24090 -292402 132734 -194903 -19483 71447
21301 -183816 64930 -455306 -261171 -361 -131201 27527 151292 87987 -188957 -43256 -59938
21290 -59938 -189245 102791 186026 112023 -178916 -128816 23663 -123384 -70043 -139524 53307
21278 -112363 -152643 153174 -116810 -189464 131677 206665 -65789 29837 -2838 -176316 -111920
21267 -111920 -52487 -134884 -138628 116344 24525 51593 -75810 -56928 -402582 -291523 350387
21255 211007 -146707 -183152 -2678 45550 -67263 158321 -26929 -391618 169981 -36157 -374268
21244 -374268 -34430 -43958 60295 -115917 -106836 -87513 154362 -196694 -26220 -563503 122099
21232 -158024 -393214 71716 -18205 40095 -217550 61752 -79499 -277482 91615 -222557 95911
21220 -72625 -137011 129334 309874 -47453 -190196 200537 142519 163744 -66240 221454 -62117
21208 -168 -397541 -428787 -74207 187185 -64681 -270509 49684 3503 -232900 42162 -101272
21196 3999 -117366 -74360 -321009 85695 -29848 -155954 88716 319600 -29561 -144987 -117613
21185 -117613 -413163 141963 207095 -27725 44855 239127 50889 166956 -18047 290492
21174 143748 37633 -189769 71244 -5156 57202 54192 124361 -190901 -275131 54732 38832
21163 38832 72629 -188972 -140368 137476 -54718 -34916 83944 -262694 -21332 38344 -12421
21151 -195145 434412 52917 -7978 -324871 38231 -382664 312759 -36186 20303 76437 -11435
21139 -107669 5332 -26535 -305473 244825 -155695 230599 -28942 -61471 -14538 -312147 -125099
21127 -178361 -73404 121521 126088 -173646 -41107 -267061 8404 11144 -159230 -213869 27801
21115 248195 245351 -307206 -31382 -124211 -373414 -89581 -36380 210201 149143 -138804 -385085
21104 -385085 -316279 -74092 269944 246976 14624 -15311 -232785 -116261 -356071 -77222 25117
21092 -94449 218232 -79810 372837 252846 -50871 -86968 414875 -115238 -147851 12024 297505
21081 297505 -330497 -214605 17926 -256907 -52175 -206647 -171010 33145 -72663 3269 -231165
21069 -238375 -105167 -134325 32648 42482 20945 105920 -46982 16263 -7762 -107748 -103198 15082
21056 -92912 135011 -72096 -382299 100925 111022 -156899 48012 16852 196942 -149289
21045 -28631 168286 15815 23669 23420 -59888 -29088 15065 -321804 -12187 -161249 -82386 -192375
21033 -192375 -295941 57288 -98039 -36452 -3626 -105179 -132978 -88590 -80896 -117569 313474
21021 170708 -47226 400539 -269302 -287331 65845 -93177 -23025 -272137 177283 -55254 -86658
21010 -86658 -25005 27438 83736 -43822 187692 -115093 10755 -215918 3242 17795 -271842
20998 100143 135306 -177831 361766 50705 278110 6637 -19690 -102337 -40089 -224899 -206058
20987 -206058 -226828 -21141 61180 129738 -281483 99795 -164517 -122116 -38711 -332733 53721
20975 116872 -101158 -196429 185416 -54668 -74527 -48066 18595 -256443 -131085 253715
20964 4963 141398 -212493 13043 -77796 -328759 -44843 -289194 -159278 -181172 -75195 -53961
20953 -53961 81367 239338 256770 178006 92639 9428 38532 -88366 -184844 -67473 105954
20941 -45133 195765 -315190 -229734 -22993 80410 -40793 81131 27651 -107008 -173363 22109
20929 -167308 86025 -118659 51405 105215 23829 -250475 -151870 -70353 -28433 -225823 -251917
20918 -251917 -212604 -167181 -67135 -219599 -149815 74739 -12329 221698 -150712 -323326 -126624
20906 -212021 286379 92165 -162892 46207 -136012 -276047 -38392 -40996 130524 -45161 -175405
20895 -175405 -207336 77714 -305540 -323650 -243050 -44637 38549 100856 -17711 117608 -252197
20883 -89262 -109369 -327064 -244623 304129 -81857 -5389 -515342 -200065 -1198 170653 36918
20871 -76018 -256124 42447 -209887 316162 -120481 -15432 87836 260235 -78946 -200784
20861 -200784 53071 106875 -108395 -180934 -164630 299980 85605 -37160 21289 -364592 -376387
20850 -376387 169333 31100 -88423 -196907 105947 -20649 147256 -12829 -206379 -118144
20840 -118144 29643 -32253 -107002 -147345 -168046 -178066 -239110 117317 252267 -488116 -24301
20828 -122089 -102008 -123415 -453912 -27034 -129386 -161312 -401517 98403 271208 -129311
20817 -182287 126269 -276691 123770 -135003 -85601 327760 -64475 40073 -45700 -164352
20807 -164352 -145437 -225458 -169651 866 244876 4742 -217586 6732 67226 -169676 -72198 -354732
20795 -354732 363113 -55232 -139587 -55273 137164 43045 -105228 330288 -156605 28633
20784 131890 -128334 163955 -27555 -38208 -11344 62247 -112559 -325467 179901 159586
20774 159586 -314048 30996 -20756 -40047 357559 49678 160783 -325461 -11043 -131366
20764 -131366 -187737 37508 -55835 76628 -229133 -525936 -141683 96995 -98019 74318 -40131
20752 -183076 -199036 -43909 74424 277606 -66571 -168290 -120999 100118 -100371 -139827 -97591
20741 -97591 -92099 26898 -214117 -199021 41723 -129213 47868 -231675 231036 -116269 118375
20729 -199869 -23917 22256 -61037 208367 297489 -174926 126464 43996 -248513 161995
20718 32137 -254984 -39283 -111395 -178767 -301860 -236975 -53434 180404 -280825 -57705 17975
20706 167069 -108621 -172725 -10290 54409 172912 -14315 199085 103054 -366342 -264087
20696 -264087 177088 -179212 114148 -191544 142911 -72873 -402948 -374096 626 -233269
20685 -222769 -83719 -238285 -130078 25863 -175577 -116376 111092 -46656 6804 23028 222899
20674 222899 171799 -4056 77620 -92058 48241 -110202 101545 -49845 -137746 67953 -147296
20662 -51018 251742 80398 -126891 78777 -88186 -69662 171190 18663 -46568 19910 141663
20651 141663 -225981 -279143 -85378 -81411 -399289 149364 -127490 16549 -139596 -256268
20641 -256268 -309617 25775 -111654 -173801 23522 -307740 -399881 -8468 -298048 -117471 -383563
20630 -383563 -184580 21027 -211221 12512 -106656 -86921 79112 118633 -248566 -37568 4789
20618 -33915 -65584 128844 135078 -593562 -141117 18521 -109619 -64597 35320 -11727 131633
20606 169424 -76699 -29694 -183739 -70258 -406280 15353 -114343 172174 190335 -222796
20595 -157002 -76545 -16567 -168162 267440 -250337 38404 101680 -200208 43753 -129651
20584 -61687 -108834 -99166 78221 22622 78786 -79095 -196542 -134222 155463 319859 30186
20572 181872 298105 -203584 382908 -90263 -189061 255835 237097 284855 -25963 170486
20561 -17674 199485 -58075 34620 60255 -13 -60785 -360954 220086 79103 39149 -58702 -85709
20549 -85709 -102365 -185227 25005 4530 -68567 -8276 276099 103882 -225075 264500 -80928
20537 209876 -102578 -491244 74331 -257279 -25596 -148370 -152295 -180613 -314856 -69316 245837
20525 -48263 -71177 -6014 -32498 -11457 -13046 -316139 268471 -161315 -78434 -428970 18627
20513 -141351 -407349 -1913 -33076 -218487 64953 173635 -84727 -230460 -120274 -139454 21174
20501 189546 -159073 124567 39425 -121718 124417 -4625 -222381 -498918 -59132 -231763
20491 -231763 -43729 -180674 -395461 -260512 -53695 -42628 152265 -53490 18873 85971 119453
20480 119453 -76260 -32633 73163 -89513 -4775 -187063 -955 88650 62882 70065 -26182 -64187
20468 -64187 -57211 -212176 -35276 -195331 -316308 -23770 -57976 206032 111037 -42967 -90093
20457 -90093 -102922 24683 -212441 432981 21483 -163358 244903 -81483 -200459 -207867 50596
20445 -28406 -208180 -85805 -127538 -237264 -205733 198197 -146404 -99674 -124912 -20863 11511
20433 86125 -93082 -52185 -80124 -104429 -293868 -22109 -13832 52980 59832 -143252 -98689 41133
20420 -110365 16956 73375 -180117 67631 -155598 1634 -252491 -113870 -111333 -112734 -4383
20408 342519 -154107 79091 183742 -58538 278969 -276496 -14183 225487 -303005 110040
20397 85134 51136 -123907 -169914 -275395 146426 -261425 -376391 -256162 -152929 -35313
20386 -172865 29748 -101092 -109421 242761 -361939 113620 -12877 -88045 15334 245607 67497
20374 -27617 -216902 -223410 -39204 81417 94112 -173394 237433 -184145 -5331 245407 -47721
20362 -151641 -66039 205499 110328 315222 95422 374808 -153030 -223995 48631 -151960
20351 76732 105765 260065 155402 -85278 -121112 -32147 111694 175881 -235119 -376722 159031
20339 68205 -108042 -60653 15228 -129031 191271 -342555 -89372 -302802 -115607 74885
20328 40639 -39238 -153305 -189012 -91607 21024 -282443 -33516 245380 290716 114520 -85956
20316 -235468 -86513 -169675 -191630 -196222 -214072 -12726 23260 91309 -29690 134590 193440
20305 193440 -1831 -162240 -81714 53722 -33683 171671 -79583 -81921 -132166 -91073 75978
20293 -363139 -407674 -126504 172185 -493608 -416655 65832 -160380 108136 -49529 -20187
20282 -391665 152859 139441 225993 -198155 173063 -207028 81949 -122026 -166961 -224555
20272 -224555 -278497 148355 -106125 311572 -187423 -458445 -391651 110804 253960 -86952
20261 -220492 -316570 -87652 -152827 45572 140030 -208898 133854 286658 173959 76514 -195938
20249 -16731 174474 -7903 281503 -261454 -112203 -179120 -138787 -130586 -106908 -467756 92446
20237 -330121 -64164 71190 -118497 2787 127087 -55158 -146849 -1827 -107956 58688 -196269
20225 -241256 -63967 68558 -385396 224709 -11323 -54725 -146665 -255274 -4830 -42478 47482
20213 210224 157806 -67967 196395 -199609 25758 -309603 213205 -177273 80601 -115197
20202 -70759 -50716 -181200 6871 332640 171534 -1014 79883 129251 -42420 150460 -33243
20190 -48349 -96540 -88861 -61241 125081 -290343 -197581 125145 22808 84235 -46758 -171016
20179 -171016 -107537 118649 -56520 332678 -102689 -14443 -211278 -322152 -160584 90777
20168 -177449 -473006 -19849 132381 30959 78134 -144139 -11082 -87001 -1185 173433 14852
20156 -147376 43771 168433 -303229 197813 -103247 22966 -36481 29021 -82510 -377858
20146 -377858 38146 29243 85547 28644 147125 -175994 -116556 -237844 14608 -55165 80158
20134 -277163 -133093 41427 165702 -94069 7595 26765 447925 -96093 -55463 88882 -86622
20122 109741 -97936 177294 -122542 -144998 188778 -270189 -8464 -49013 -245421 240072
20111 -157143 -227747 -57840 203537 259251 -107468 100151 -395934 -49280 -78640 51500 -462542
20099 -132945 -151559 96190 -180087 -194128 -77969 -24145 -38036 -51172 -139891 -103310 -168542
20088 -168542 -134651 -83435 -197486 -68907 111866 -178911 -165365 -166273 136146 -298631 106668
20076 -165733 -151746 -130726 -77684 -211418 -76797 -115034 -192592 -17637 -122939 302803 -122118
20064 215107 -463710 -81780 -180810 -122568 -90319 259771 -7803 94441 81392 27001 -56116
20052 114886 29028 -174149 17452 120889 148436 -266625 -236779 148762 -107227 -126855
20042 -126855 -6050 -88054 212928 159418 30318 24920 -64070 -103368 8596 -61948 225788 -49481
20029 187472 -278442 -173675 -36783 118242 -100770 -243119 -36891 -252568 53963 -82196
20018 -140962 85869 -61304 -75083 -124556 203933 -262906 -423648 180613 -120373 -331927
20008 -331927 -23677 -109238 -168965 -109195 -372953 -321724 -265122 262691 -248690 -60849 -153171
19997 -153171 76949 -91704 -5304 -129944 207595 -46778 137361 150612 137574 -203536 94186
19985 -170161 191623 -88306 -456918 -35114 66170 77922 150926 -208171 -8971 -75103 119033
19973 108491 -11966 -18205 45403 -332720 -85814 -141832 -112534 -152224 -89941 35473 -87578
19961 -210725 -235109 50281 325745 -6430 -112834 259992 -13584 -243089 -244855 34369 -436396
19949 31570 144908 -7376 -310753 -409080 69809 60421 -207248 -179411 151898 -40732 48660
19937 -176373 86720 -114453 162951 23254 -128381 277696 -42118 -125544 -103146 242321
19926 327262 113064 -65440 232993 -58676 248302 249415 7796 -154923 83066 46593 -67402
19914 88580 -120627 -54179 -110851 -455991 80389 -315640 55780 7297 89206 32068 -84374
19902 35194 48537 -187414 -82753 -176192 127882 -163050 114236 -198556 190786 77196
19891 -123169 -82424 84068 -71293 -248885 106994 -177498 -366438 -161025 130980 87975
19881 87975 -13555 181081 -254488 -95210 -23474 -109261 -103707 -59583 -49483 37025 56175
19870 56175 -129440 -76699 -111423 -63610 -326730 -192036 -19094 -124107 -258813 12447 -161393
19858 53926 -78186 77173 -62088 288132 -182464 66363 -92444 352358 58325 35010 -304028
19846 -165910 -276898 -149897 -228413 187704 -192547 -45226 -147268 -193217 -99146 96547
19835 -106117 42302 -138314 -302960 -6373 -55746 249973 9670 -19809 -115223 38046 244144
19824 244144 -430914 369 -105474 -136618 114936 -8912 113377 -115274 -208715 91199 179016
19813 179016 -80663 107603 -286994 61129 -299567 101527 -14107 -341842 8204 -117307
19802 -235535 -147032 -265146 -138028 -112517 -132057 180398 57397 19879 181181 149163 -51985
19790 -226770 -495456 -346947 -25112 -213681 71301 73751 -183658 -35760 315401 -16979 -151331
19779 -151331 84424 -160712 -228813 -169602 -99957 104050 55139 264648 -89332 26869 -96001
19767 -464709 -355687 -222416 221706 -217688 -17175 -348218 -110170 -44773 -325847 -172272
19757 -172272 -20586 222347 96756 257092 -300433 20784 132979 -201247 136031 -37571
19746 -191660 -23637 -273134 -142337 -37296 -67684 80689 -98072 -95993 108510 -270098 217675
19734 -38389 402517 -86708 51196 -114203 -202603 157801 -438966 -82298 -343503 -84865 90388
19722 -48776 173441 95535 -177911 -179496 -79663 -90315 -324781 -74422 -293572 145659 -82454
19710 -12213 -143333 8057 -166286 -139262 139540 -36162 -129605 -214993 32541 21848 139992
19699 139992 55471 118014 104896 -239427 219487 -258089 35323 72440 -40263 107746 138678
19688 138678 163626 164613 -200417 191262 -87558 -175038 -254808 -90007 -37435 185215 -206990
19676 282346 123614 9860 29574 204919 42884 121657 -68968 100071 -100143 -218692 86221
19664 244122 19329 -74205 47166 -114497 -131920 205804 -95412 -23193 -81944 -39395 288580
19652 47461 204137 32949 -273332 -133358 -8123 231736 -263864 -111383 -222121 -256035
19642 -256035 -180142 -33030 -97254 -171417 -64313 22320 110067 105728 2601 137574 -95214 -41913
19629 172236 -17888 -95115 -51182 47269 238636 -256934 1590 -238282 112605 -116523 -169203
19618 -169203 351191 -54939 -216860 150743 14118 -99829 -71141 413641 -61493 -123779 103888
19606 -323626 178106 -316967 -327824 -134932 -49548 -397586 82051 -38033 -117875 66635 75976
19595 75976 -82477 -189033 18894 42941 39682 7572 -130600 -356756 -324160 -292426 122892
19583 69288 -65039 182691 -237899 39055 -262223 -27312 152076 -116515 -44740 -24812 109291
19571 56833 311194 -363832 -105283 -249402 -115281 -50793 23509 -466555 77008 -181381
19560 -149898 -220928 113472 -207959 -107033 -19987 148699 247680 229344 -100275 293306
19549 -158418 113074 5244 184333 -209195 -154349 261465 -132309 9011 -377636 -78826 -43434
19538 -43434 -83430 -498528 -142246 -571 -343281 -59433 231126 -214449 -175263 208714 67020
19526 -15597 -196212 -4674 -337018 57254 -420612 -116230 -141290 155417 258943 6971 -249479
19514 -72857 317950 77358 -20138 -193818 -152533 45037 282336 -367819 30167 45089 -124144
19502 8903 -52594 26490 52960 -78535 -389243 -203788 12094 141074 86103 -73310 -320679
19491 -320679 134490 -326641 -309273 -80755 326930 -291726 -8984 259395 -340247 59302
19480 21698 -191773 56046 -40749 -35714 -170403 124150 88927 70128 93591 -96590 102808
19468 -22907 24527 -257551 94390 -200198 -18128 -9395 -6639 -22184 -102215 -224575 172728
19456 239319 122933 -218884 316958 -88630 -68650 -53610 -259899 215922 271205 153778
19446 153778 -134516 -316070 2468 -30113 -216771 -170295 -205285 -35218 -460843 99765 -6807
19434 -80814 -206200 -28163 66979 51422 -328950 -41092 -6907 132748 -390649 -118231 -116670
19423 -116670 -194204 188992 53682 29489 76258 -89277 121302 -155904 -86340 7329 131171
19412 131171 -278006 -78823 -214653 154173 -285150 -231741 -55288 155139 286671 -94690
19401 133626 43095 -127823 -141437 -134280 -215499 -32705 170562 -327060 -160272 -27876 -50903
19390 -50903 -320628 278357 114837 167535 68476 28476 -165710 274395 -268870 -57255
19379 210141 -34874 -3878 -228531 -202768 -396362 47367 208056 -68434 3945 -221789 193001
19367 -103989 140427 60628 -13043 121113 -513825 85768 -130711 -96851 -91325 -8600 4218
19355 -152197 -17815 -14816 -6047 -93493 33675 -141019 -18192 -252198 -104661 -44375 -167217
19344 -167217 -111248 224830 -137084 -145911 -109380 123148 45136 147735 61434 -95860 -144206
19333 -144206 -281003 -123375 106987 287987 205513 407271 -32098 -218146 100720 -387692
19322 128999 -82153 47424 22295 -107488 130117 -64043 -48400 -30061 -759 -211782 48865
19310 115167 -11884 -310974 -69904 -88833 -24690 7528 -76383 -180900 122026 167454 -108251
19298 42986 -52586 -126996 80174 -60734 -202904 -1286 -124233 -241668 129939 -13906 -189695
19287 -189695 -101382 202786 4020 -16653 145399 36662 168146 -260509 62545 -52327 -167847
19276 -167847 -44261 185365 -292852 -78209 259035 700 -16788 -194300 -367154 -200861 32519
19264 -40018 -261272 -21285 -201093 191108 -16255 25406 -396851 383759 -59304 2738 64167
19253 64167 -55984 110748 163575 -69358 54200 -412336 162328 59240 -97314 86751 -122141
19241 -141740 216281 -144071 111852 -46692 -52965 -380398 93588 -221159 -99199 -389183
19231 -389183 73735 -256753 241101 -123547 -210563 101900 142323 -287897 -54753 7683 185099
19220 185099 209295 -80730 -124253 57712 180603 -9215 -45740 -343038 -230150 295237 2107
19208 -158062 345361 385 27302 -68069 290419 -5517 -253419 -138447 -187243 -381065 -144559
19196 -134514 -345950 -141934 11891 -394292 -132691 -324841 -9112 -360985 6412 -49183 -226232
19185 -226232 70437 -131261 -240892 -179808 9442 -3218 563616 -301839 -47578 7183 -99088
19173 -216908 50960 103166 -51681 -8597 83534 81837 -67244 -40941 75144 205862 -179140
19161 -91013 365102 336031 264766 27811 -90182 -316455 4142 20884 -130992 -370915 26438
19149 51682 -63094 -108900 264753 -253962 142199 -50197 -43896 -267927 -56760 -303587 -225433
19138 -225433 -4527 -362004 -304197 -86282 -352316 -87568 2303 -18279 -69057 -9844 55745 112033
19126 112033 -242781 52796 -257706 -198600 -153395 -50271 395047 -265985 -183084 -54608 -411794
19115 -411794 289043 -98349 -128245 10904 36231 -50253 129102 140904 -135263 -68516 265836
19103 -19957 166538 -88214 -117059 109902 2498 -324251 -383808 -61124 -72589 34958 -365260
19091 -322647 -324747 -15003 -275306 339245 -109683 -136916 -190859 -41263 -140149 -293205 -288824
19080 -288824 516817 -247541 -13168 -54840 -109619 -238395 11104 -234510 39992 -160111
19069 209912 -154530 201781 -204198 20831 -399700 -129799 77653 -316513 -27770 -270788
19059 -270788 -126600 -76361 -90022 57659 111504 56959 -89287 -202423 54253 164420 -104063
19047 19960 -3360 -22068 -176990 14886 -117408 -39102 -170300 -131567 146539 -151797 26578
19035 -66492 -6792 24528 96382 -8663 43991 -88866 71815 99589 315840 -296418 -103612
19023 387806 46387 -373733 -45198 -272622 188180 -142298 -174965 2219 26208 144395 -347264
19011 -73406 -196250 120229 -140793 -213874 -12728 126034 -274579 -81914 -294849 123765
19000 8722 -242773 -94448 104298 128908 266921 57524 -173808 -6411 77917 -631 -390065
18989 -390065 -92130 182020 172715 -31802 -73895 340776 98155 -37742 154090 -192039 -163118
18978 -163118 -233158 -2169 84168 -127226 -55161 77999 611378 -44304 354900 102823 -220484
18966 -130174 -22716 -60662 -83036 -81289 65897 -43614 -563622 -287363 -196925 146037 -336032
18954 27862 228728 19460 35968 -8095 -193862 -11746 339053 -192998 258483 122056 395520
18943 395520 -189617 -157561 -31854 193497 -244125 -105864 135285 -22928 -32552 -297117
18933 -297117 -162913 -30428 -42327 -104072 217068 -3471 10959 114940 -170033 -127023 -93270
18922 -93270 127961 16446 -162250 -195993 -88941 -189997 -320452 -183520 117353 352099
18912 352099 -117785 -212953 -215994 46523 -123225 -408722 -237675 104000 37201 -232511
18901 -166852 -181764 43245 233633 -72685 -24241 -164003 -302097 -47068 -87379 232756 -34240
18889 -246772 -327434 87466 -272208 -46779 -222833 -39184 -37260 -117938 -319006 -273081 86337
18877 -229235 -454986 -144398 -52182 -254315 -218937 -75185 -89136 67476 -184300 47201 -281105
18865 8229 6408 -126307 -377619 181089 -45943 178980 3601 -228198 -40108 -86591 -90634
18854 -90634 -107647 -115219 -29070 203300 -180865 -107054 -6407 -59227 -151682 288518 48386
18842 -63669 139523 -175181 -128580 252616 235927 -150576 -50680 59651 -99005 131169 -157493
18830 -263587 -217568 -331177 -112875 -40681 -37514 109217 77616 86938 -124777 -127073 -302807
18819 -302807 -32074 -73306 -160188 -76214 14669 -111918 90982 15012 -117879 -40208 -25050
18808 -25050 238396 -63101 50581 -94988 98143 -193647 -178377 -53571 -7077 47830 -294139
18796 -55444 -241549 -53458 16111 122962 -119454 41534 237180 8446 43336 311479 59441
18784 139250 -134152 159230 -385910 89568 -169000 -332069 -66847 119599 29907 -44466
18773 -96859 134100 79749 29021 -212169 -105115 -140726 -158718 -94303 81213 -66498 144695
18761 -163242 -71686 -145830 -187023 -244055 -137753 -506471 -281917 94364 -222044 237949
18750 -114245 -36170 -181553 -266803 125860 -377294 -26073 -286563 -142545 -455911 -172257
18739 -75497 -330105 -37808 286817 -79530 -123475 -127799 -142733 -262279 76511 124523 76133
18728 76133 205202 -46439 -117634 -200034 -240237 -182882 54362 92050 -142957 -56536 -19388
18716 -308795 20375 -170122 11492 -54565 -104543 -212582 -46826 338541 -251563 30448 -191212
18704 -137695 133814 -22536 -26895 -12117 -147224 -72499 -90075 -327996 -284457 -99259 -334408
18693 -334408 3649 -106979 -66349 -95422 -190059 -3178 -21885 112539 -354069 59454 109060
18682 109060 -102797 29230 329119 108173 40832 37078 42370 -238426 -43594 -113861 -172340
18671 -172340 -66671 -120433 -202997 -72274 -129599 36519 -86145 -16391 -47797 -218157 29194
18659 -124274 -67791 -387889 -305415 52622 -451847 272757 -337484 136716 -14729 -11489 -234270
18648 -234270 -230592 87924 -153311 168192 279424 -124573 -97817 306 -1145 -75245 7651 -242299
18635 -126278 78109 228594 123591 -259198 544099 163303 -86665 -364599 -307581 251894
18624 -44760 -219674 -17777 180566 127699 40458 -156323 -306329 -228193 -154486 -89567 309273
18612 241930 -106844 -258999 281885 -229300 -45330 -97521 20581 -41825 154300 -19555
18601 -69812 7263 198911 -232780 -140264 -143774 -100978 -274251 54874 -136813 -145608 126272
18589 -128820 203314 -6293 116880 -64441 -178357 190854 192622 171249 -151879 -259410 -48334
18577 -174989 -14324 147905 243678 -137821 -162480 -10952 -241989 30275 -270149 136649
18566 80548 13856 -340258 -12195 229787 -223966 -2143 -89056 155240 -19808 140800 158188
18555 158188 -445560 -66382 -12799 45652 -125348 -165816 -18067 138050 274828 -133763
18544 217098 -28174 100200 93736 394503 10880 -348688 50551 113287 -36508 71175 -91878
18532 -219256 84694 -129288 222556 165594 -52526 -295695 64351 -55639 -91296 -173680 35096
18520 -70894 -294695 -9389 -254099 -158356 80667 -256693 -246397 31973 -226529 65523 65191
18509 65191 -367394 -54353 -242851 -109640 -122740 10455 137081 27263 432 52098 9701
18497 -225718 -303545 -110038 -204316 30795 -189718 -289715 -337104 43905 21029 15970 -90026
18485 233108 76885 -31185 66988 -288937 -122853 -226562 182764 13190 -325077 44814
18474 -91022 124030 -80314 -234344 126732 -31487 -124672 43258 59342 96721 -400522 -41627
18462 262609 -203255 -373842 -45985 -64349 -186665 68733 -42258 -167142 -155029 32334 -102780
18450 -126992 172227 -396886 -163828 -284740 54632 -111118 142202 -376197 -247783 59341
18439 100654 -114423 266836 -141748 -12974 -196284 -92854 66487 64000 99319 243260 75803
18427 66959 109154 207672 -211949 -283677 -82856 88392 -311362 -122439 127844 -97491 -322304
18416 -322304 -89150 -554036 -200303 141815 -82125 -276930 -270877 155000 -155855 -62113
18405 -282462 -56168 6396 227544 35087 -167814 -13392 113059 46478 -13836 37646 25084
18394 25084 -247846 -122624 91046 33757 33143 -55520 157231 -191079 -393025 -67873 -186003
18383 -186003 -288878 -89232 -48835 -8516 -203595 167508 -92214 -198551 -276 -192878 -172165
18372 -172165 187111 -3433 -213525 -63833 150717 310850 43540 29200 19675 131355 -1478
18360 141807 46628 12101 -247137 -259801 -205685 -23447 -139530 -214721 -197271 -333905 143372
18348 131100 -77588 -283166 -244446 -48754 122943 -19047 -72006 -227686 -86145 12832 -235519
18336 -25893 -433730 103117 143175 -285939 -137057 244230 -172113 239958 278296 -56889
18325 -94792 -265103 -294106 -91860 -140088 -271603 34924 251721 -240160 71488 118563 15062
18313 12222 -212228 -279037 5274 -148725 -62983 -144601 -136787 -191110 163508 -63820 -399398
18302 -399398 4101 67380 84186 60133 -163921 75084 -105569 -222437 389643 -148163 149998
18290 -62932 -242136 -139456 137274 -463998 -21989 53596 -207176 -17296 -194867 318695
18279 190339 -16465 -111565 124559 -96260 -97645 -40461 27537 -173751 141377 224253 53063
18267 18409 220236 -36050 -70321 -94050 -202480 -1365 -115868 -275701 -221237 -104720 -78215
18256 -78215 -231379 -315038 21813 183966 -376903 -269761 -182088 54982 -68400 -310841 358645
18244 -48469 160323 147829 -95369 181712 -50035 -174006 71702 288948 -136737 495566
18233 4000 -159075 94852 360906 197055 1194 -4686 -54264 -204 58786 266654 -427331 18396
18220 -47451 -314401 -164063 116894 -410887 570 43432 160245 -29202 -188309 -117334 -36310
18208 182085 -221367 141483 -163404 -299940 355183 248312 -12775 167661 219537 105444
18197 -215792 -145860 -422593 -195845 -338556 206937 66436 137990 -73762 -33735 56329 -57546
18185 -8265 -148206 -135511 -100929 18152 327765 83733 -235799 -106165 67745 97730 -278898
18173 129579 254165 119465 -159134 288161 30875 188378 -265830 -127038 -63311 -108925
18163 -108925 -18596 102701 -148136 -76743 -150730 73780 61302 -45445 25961 -60886 63428
18151 91555 -21772 122437 -39638 -44871 -75954 -279750 61553 -332580 198383 -173666 107122
18139 -45081 103502 77197 -3107 353178 247271 189559 -63965 141394 183466 94558 57468
18128 57468 -227709 -39324 335686 -452671 -406510 182321 48853 92145 -63950 125431 167013
18117 167013 142686 100102 -497466 -65054 -156189 -107850 -105656 -53234 -72595 -65631 -303073
18106 -303073 -95059 -221757 157392 -481342 244828 91006 -244366 84382 -209217 23589
18095 -81058 -258581 -85082 -323610 167036 -51903 49150 -392000 -73653 -21100 209240 91675
18083 264070 -264082 152092 84281 -141365 290132 -211960 -178689 15271 314563 49797
18072 -176983 -165212 -98188 -222052 -164065 -192631 -213395 -434 294616 -111351 135189 105863
18061 105863 40089 164070 -6404 -296418 70273 -119579 -257709 16754 117579 -310287
18050 333528 61661 -131553 84065 297297 -28064 -6229 -30519 110995 244565 -224436 -117949
18039 -117949 -7249 -49813 238982 -108404 122557 7818 152937 180726 -322193 -146224 210823
18027 -30953 -45029 191770 64500 50992 78077 -159378 -231468 463527 364717 -209668 -197479
18016 -197479 88748 91210 -155748 -196944 31509 -91647 140698 -210333 91511 16553 146188
18005 146188 -106384 26067 -203989 348454 196563 20855 -176405 -54041 -33321 -32735 -1483
17993 -205552 -63357 -321358 155882 -18557 -99127 -69462 24119 -341745 126293 -288363
17982 -97438 -214085 83388 196232 318093 386784 -91086 -468430 88804 147410 -132307 -149022
17971 -149022 -98186 -26627 -213115 -142499 167321 10405 97276 -227276 13016 -86647 172260
17959 11424 -137807 -181188 142218 -100844 -198250 110055 17676 39495 138272 81148 156240
17948 156240 -222591 -15931 30958 70024 -101284 49435 -29593 -302652 79827 223646 -150257
17936 386739 -277360 -242999 189927 -242458 11041 59521 238311 372179 7334 -28708 247035
17924 301099 300078 29448 -82678 -57784 -303683 -291675 380452 14425 -147445 -71232 -62984
17913 -62984 184081 -116705 -215695 47626 2051 30810 76667 -190506 55964 -28956 49698
17901 234619 423870 -184101 -22424 85631 -136544 160982 -140269 205130 165924 28438
17890 -182162 -216983 259314 -79136 -162434 17991 -78058 -228905 1373 166908 -159710 -21636
17878 220275 177305 7470 297148 -204271 -237474 146308 -146335 270877 97620 140576 79704
17867 79704 -81577 -14642 -65402 -72938 -230293 -180009 186827 24557 31216 -52580 3390 -52896
17854 -145582 274983 63437 -156204 265817 -90590 -231255 -43025 152379 -270469 -91095
17843 355376 -94841 7650 -245348 93883 -182735 -345068 -161835 -221085 -103739 -89944 166656
17831 -42079 105466 244099 -251581 -124008 76017 -241539 -454035 88004 -37493 -12456
17820 -220162 326580 265332 -129583 239024 138335 -38135 -64467 204136 -11666 -6562 19763
17808 -144273 -168654 -96996 -84757 -285786 29417 132738 125916 24289 -123112 56627 -149478
17796 26404 62149 49061 325363 -95573 70078 104445 46359 19838 260974 82756 32493
17784 153841 68079 -245465 338219 -206653 -119937 13243 -59258 1259 -329970 -403483 55004
17772 7429 -46408 113033 -270799 168060 211847 -55917 -2816 288519 -228329 52531 -55181
17760 -191837 -8671 37374 325506 262996 -186407 7991 -29597 -18522 -175231 34000 242017
17749 242017 47651 -61335 41864 92895 284881 143557 419577 -146472 195418 285827
17739 285827 177342 -21919 255971 110198 -237525 13350 360074 347035 180635 217951
17729 217951 -55764 201340 -86941 -488085 -100020 8213 30190 -52970 128481 -303131 -57296
17717 65908 -38564 -136706 57633 31711 381840 -117640 177239 -93825 -264927 26120 -307244
17705 522819 113416 56760 200762 -241300 -99113 97494 13802 222805 20224 -264472
17694 55586 39171 -147689 -251257 -119019 -71245 -76563 -140715 -110616 -93186 16837 135610
17683 135610 -59021 -146191 34905 39142 65323 28429 -84679 249813 205570 -199789 305477
17671 -60559 -124053 -436054 -289128 72210 -9604 -9062 221569 147203 145289 -65299 -15303 -208405
17659 -208405 29694 210623 -154934 -493396 -5906 -177837 145891 160736 102170 140926 -13452
17647 -86188 -116247 -24869 -175872 59554 14887 -160357 -114001 -62473 -100867 327210 -118393
17635 214348 -81108 94053 -137884 -22710 -206416 -37676 -19704 118671 -116592 -38195 -192454
17624 -192454 30797 384714 -121309 -253842 -1962 -73100 47252 127461 -92562 -4993 37287
17612 -226002 96236 131877 517596 181362 -271164 301837 138157 -41126 136532 -126850
17601 291420 284305 75640 59893 -123858 54927 -301926 -242916 98390 -70604 -184438 312892
17589 -173757 240931 203918 314326 363687 174761 61931 99586 55745 -86264 18845 215908
17578 215908 118113 235203 19978 -10638 211933 -136112 23601 -174795 71812 61059 -154296
17566 118734 -419832 254715 327055 31427 299704 -79272 188367 169722 -91216 -53041 -97998
17555 -97998 165310 37400 100753 -41659 80286 -173240 -110591 -115472 66688 113864 29698
17543 -156198 199085 424067 58255 -223544 165950 -195397 59584 -90566 234839 33917
17532 323576 33074 87975 2195 285348 -119375 -21851 -3158 22517 139164 168342 162743
17521 162743 81761 205152 51085 54690 322925 -37662 11417 -23070 169334 230194 50810
17509 -6188 152256 -82456 -6959 106118 98810 218282 324840 260479 55609 62384 37343 -221607
17496 132672 163481 -139363 153796 228130 -17426 -341536 74892 103910 -13615 -114502 305440
17484 113167 78033 -179048 249276 -37155 78534 81560 144373 -67729 75262 106787 394206
17473 394206 -40041 269309 -148192 149959 204967 212550 18636 36286 167640 -164898 -121489
17462 -121489 93528 -100085 141970 227607 124920 124812 96604 264375 289654 447766 191375
17450 164326 48090 323122 165943 400154 133506 160499 67714 16587 -110222 -24565
17439 -127606 -107777 347095 197156 248160 270090 112600 87225 346645 197159 337672
17429 337672 342619 221675 658840 209687 53544 286074 -8456 -15919 158542 264439 86056
17417 49832 213298 320295 215922 139300 -81233 290336 -36950 1652 89438 282369 -158815
17405 -205373 -135310 112292 -213456 -80974 6358 112361 313968 229910 200465 125151 3361
17393 -136278 192620 -90789 170188 67517 -267417 300029 184905 533968 300215 -56525
17382 205124 157860 39546 221190 320342 84349 196642 2063 13272 76898 66008 295040
17371 295040 269016 -181849 8348 61578 33875 130783 58681 200530 -37371 210327 88398
17359 415664 184245 96276 318658 -83300 -89967 162493 70700 124927 209020 323162 136190
17347 87464 99820 186556 59252 83017 184426 404916 146807 375361 197097 164922 -69330
17335 359678 -131206 13195 137390 317871 65493 401327 -60978 227708 351105 263045
17325 263045 -66649 376658 325367 -46994 30506 237092 441167 304496 322838 365252 -129885
17313 -52423 136982 -120364 392234 132546 168090 265612 -69297 211869 -34616 180510
17302 30188 -167402 173277 295356 55644 377048 298078 -49708 163274 400583 348028
17292 348028 222465 332781 268097 155160 313593 106531 173693 119452 126190 -9361 186079
17280 556789 176409 262685 501355 290820 288030 188080 88454 -49533 235228 -173381 127550
17268 -130489 99584 -29513 123048 121430 168614 171912 173669 -17467 124150 493804 231224
17256 109226 255189 185308 415631 208205 295999 -28293 310038 118908 -164893 188921
17245 342901 323204 419419 103093 -117198 95550 128760 404414 -117317 269770 89442
17234 -163830 81414 64438 53884 256466 133046 84533 357687 91403 39335 23921 447701
17223 447701 98250 442900 497021 -102792 188177 67494 184714 284489 273983 145491
17213 145491 266019 214493 -217199 225892 63771 366365 8101 271614 -26692 381511
17202 227124 428701 118387 467356 477782 427891 412123 124501 70647 40266 345760
17192 345760 144016 102522 99880 366549 -171231 112164 346343 46764 202462 328177
17182 328177 390153 369605 245091 72812 -230133 326297 -304969 10317 359149 37564
17171 211464 573782 -12561 552225 -228076 93385 146124 -50963 252472 392042 456697
17161 456697 210810 223150 311676 505705 412941 513482 149568 179524 -267297 67434
17150 541843 317627 195690 -112624 17525 271087 269397 348027 507123 194383 546376
17140 546376 186615 11008 474370 284855 73826 143892 605221 356196 418199 193821
17129 380953 248566 266943 -60119 276311 80943 531877 166219 150178 323259 139416
17118 333220 317473 235492 250349 70100 685940 355020 523159 -71871 259159 269077 510492
17107 510492 77945 339520 75375 426706 106209 352681 58627 184563 308228 235546
17097 235546 449794 449312 405872 211333 500192 441556 247292 88458 469278 383361 313284
17086 313284 284496 15498 240188 535157 365936 487381 440709 495460 396561 244838
17076 244838 63635 307217 243255 485646 312951 268905 255004 235610 -26746 355044 680760
17065 680760 441095 462298 625262 320096 431137 31430 257749 470914 281993 253208
17055 253208 461761 342190 675486 959467 275637 631895 519459 245512 343797 352114
17045 352114 346905 321718 798172 509934 495640 684797 386071 548018 471245 239902
17035 239902 382673 660618 589838 689177 93811 634814 791636 343472 786671 456039
17025 456039 340975 207890 629751 717507 398123 605564 662090 121875 588627 504663
17015 504663 790111 757720 725355 620985 665401 682006 438886 586361 770717 697611
17005 697611 692991 383863 494924 497833 509473 213987 876399 357612 423428 514771 493631
16994 493631 550367 859768 648347 699645 448075 816830 573818 971575 617384 411445
16984 411445 595173 799974 714602 841281 452218 557146 837126 729238 531263 838272
16974 838272 650241 901003 499667 792679 652038 1244736 830901 947808 870096 550004
16964 550004 790531 794144 653851 1123937 857760 815551 823703 955541 573916 928287
16954 928287 805212 823806 673348 831743 1096677 969473 653556 1254187 864086 830234
16944 830234 896585 1073816 758163 1088281 867643 1034706 1195412 978308 1076071 1375259
16934 1375259 1004951 1097058 1205983 1328527 1222482 746333 699309 860406 1346641 1307976
16924 1307976 888705 1030994 1100236 1075996 1137898 881323 1203482 1334380 1590134 1522792
16914 1522792 1433448 1708904 1116467 1383658 1077652 1554534 1404066 1404670 1670353 1439568
16904 1439568 1154816 1511645 1582005 1546202 1512430 1644566 1323443 1460510 1396601 1670626
16894 1670626 1505854 1645587 1355433 1667339 1804257 1633655 1816702 1558058 1676791
16885 1676791 1993090 1997862 1981124 1823222 1733217 1913480 1959365 2057920 1973890 2012897 2016268
16874 2016268 1697756 2196370 1875581 2105783 1932287 1858071 2309519 2121829 2217098 2068633
16864 2068633 2496734 2111676 2692809 2568158 2324896 2526935 2473459 2880255 2611087 2577456
16854 2577456 2448753 2714625 2838850 2840211 2361653 2673089 2792541 2728539 2683739 3047287
16844 3047287 2827828 3132049 3345699 3230462 3411368 2977264 3673929 3251968 3165355 3463517
16834 3463517 3459076 3270411 3614864 3715849 3751568 3519640 3925554 3773617 4006606 4170434
16824 4170434 4164569 4333916 4239939 4520171 4578741 4649747 4341836 5046859 4856490 5192626
16814 5192626 4946836 5033051 5278526 5737467 5324792 5564676 5516744 6097289 6082778 6279585
16804 6279585 6098926 6161747 6725763 6700241 6607826 6719435 7307007 7288092 7601088 7768590
16794 7768590 7579561 8010439 8321501 8380111 8614826 9074731 9053802 9072181 9352094 9567969
16784 9567969 9955759 10306569 10706617 11115572 11236760 11538863 11912171 12572660 12427943
16775 12427943 13043145 13295347 13839276 14424793 14871317 15143721 15800578 16302002 16949688
16766 16949688 17627286 18382258 19147092 19628307 20327133 21474122 22228193 22922338 23660759
16757 23660759 24814863 25956122 27204201 28304547 29381121 30759431 32019866 33797950
16749 33797950 35478923 37341559 39058314 41345517 43051468 45516686 48106098 50697333
16741 50697333 53646877 56866474 60006952 63656956 67754858 71854090 76706196 81304265
16733 81304265 86863366 92286069 98776604 105360186 112272746 120309057 128379143 137007885
16725 137007885 146075201 155453733 165181726 174839521 184446068 193364650 201984356 209751486
16717 209751486 215834007 220637493 223437294 224082480 223373638 220414739 215294562 209231239
16709 209231239 201339809 192750460 183428281 173689969 163560434 153310216 143822365 134647552
16701 134647552 125210972 117023369 108920539 101773774 94638352 88337374 82869327 77470444
16693 77470444 72338516 67558672 63544131 59477137 56295610 52828452 49581668 47014909
16685 47014909 44290757 41689098 39602265 37400282 35820286 34061270 32123922 30584553
16677 30584553 28891325 28082133 26558279 25424866 24326596 23125401 22177294 21280196
16669 21280196 20504560 19745952 18472587 18118027 17120094 16996304 15936941 15572579 14882205
16660 14882205 14311288 13979017 13371957 12452486 12647831 11957416 11817184 11207373 10823351
16651 10823351 10606307 10628589 10116928 9812111 9112112 9024192 8581675 8352078 8188289 8265622
16641 8265622 7694910 7506730 7377139 7584933 7250149 6732228 6835090 6767160 6252248 6150914
16631 6150914 5908748 5800792 5659513 5835521 5781179 5643319 5178359 5053703 4680650 4831725
16621 4831725 4675632 4538125 4780816 4741325 4334683 4351994 4238340 4279475 4197791 3892632
16611 3892632 3858985 3781075 3807124 3669886 3905224 3639480 3367926 3548365 2990258 2941304
16601 2941304 3417423 3025802 3078785 3042136 3060157 2900886 3062576 2722280 2423304 2848772
16591 2848772 2626470 2770333 2735421 2307280 2476706 2248672 2085754 2074628 2128254 2234975
16581 2234975 2186385 2077613 2398126 2293424 2255935 1901532 2043454 2017274 2054535 1649809
16571 1649809 1800326 2063454 2029254 1670345 2024944 1985861 2114092 1737804 1858649 1865182
16561 1865182 1297658 1962771 1501047 1694916 1547881 1513969 1958946 1338357 1987832 1681185
16551 1681185 1430781 1619419 1235052 1609420 1435209 1381460 1103211 1277630 1228473 1109378
16541 1109378 1392836 1316574 1327362 1184255 1191924 974911 1012167 1178093 1077423 1516222
16531 1516222 1372161 903388 1056761 1154009 1306833 1181987 626379 1182393 875693 1253076
16521 1253076 1130412 921854 1011207 1019005 1040909 804320 891988 813942 919602 751373
16511 751373 908285 1038980 738843 537161 590584 780570 812327 727109 789493 943167
16501 943167 794311 760202 831584 980465 696447 283891 746113 823291 680339 674433
16491 674433 593044 754803 627348 588566 779936 325160 771736 570781 854189 554164
16481 554164 557195 393502 568705 883210 735577 787394 374109 633345 691823 381627
16471 381627 631174 452568 720785 629098 652032 504752 377830 345267 583632 576923
16461 576923 747119 618539 566795 363811 691216 278068 159283 633130 436635 794219
16451 794219 540149 409913 291669 678557 194123 454321 591164 763611 250851 345150
16441 345150 471798 158232 643953 600317 390163 460665 325992 266995 521448 735128
16431 735128 626479 322392 264832 463903 713340 366855 -41036 311345 85757 235896
16421 235896 166622 221461 584347 527822 362361 16049 284984 197658 430218 482194 449134
16410 449134 350970 297180 354756 305761 79538 526664 347357 -21476 176235 114282 643148
16399 643148 387228 281615 281569 -84881 346545 276756 257422 202892 487741 222162 218446
16388 218446 162107 378155 526945 286431 602752 175282 486095 65321 136064 279074
16378 279074 384252 185212 351303 456915 405414 177354 169371 149011 92690 157760 378621
16367 378621 319370 227302 519694 183812 -63650 351731 441768 253981 292975 370326 237025
16356 237025 206405 197049 67968 298080 -49259 84401 -31549 391256 161111 461337 -114802
16344 -78955 328351 141480 250295 65235 318109 350473 430492 187463 231194 138258 157773
16333 157773 83175 395129 388174 288370 152584 121142 -53137 376459 21159 394144 -7332
16321 -85144 -40393 314462 397323 152045 160952 644172 197573 -109837 271745 393607
16311 393607 357218 124684 -103385 170118 140141 143768 -16355 275842 -52775 435448 126525
16299 -389880 28504 167769 184628 28742 199937 359524 130491 137915 247270 308039 -95973
16287 -11679 272080 231932 -40975 -49063 -73989 75641 -83505 249388 256222 11129 65663 82318
16275 82318 240320 -230164 122162 187512 196535 259887 60716 141411 236085 442311 179880
16263 353259 332116 -147488 131035 -17474 7122 -25962 111898 402924 15089 114004 226712
16252 226712 136982 -208064 250904 -60493 70292 547847 -34221 73819 -39499 117709 -189028
16240 -85183 204782 -21873 78686 -56639 -222897 -191555 200111 22818 -170576 -73646 -12935
16228 195009 -174462 74463 202295 235942 304419 174684 -64389 134092 -142917 -97571
16218 -97571 -16721 -45011 201142 -62221 124450 32381 -2593 36409 -126539 -24322 -58283
16207 -58283 88294 27172 108923 315675 -3457 142270 419112 21979 111612 509930 192434
16195 206111 205257 -90390 -86342 221933 -1555 313197 -103916 180200 -52538 282122 88449
16183 262826 162563 -53661 168373 227017 41342 82624 -58719 -76547 -153348 -11094 95321
16171 -215145 212035 -136610 9213 -72232 85840 253182 -199042 365178 421136 93685 -57933
16159 70995 -107830 66443 227692 108451 64953 -55219 -71081 171690 -187086 -88920 30758
16147 -318130 65761 -141395 -188445 45118 151042 12385 254645 -1760 47489 -128459 205046
16135 -110319 -102129 85866 122928 -105337 404861 -9978 -181238 -58720 -120292 14785 52436
16124 52436 -386670 83700 -310716 -233041 -4493 -6794 128670 66055 -25974 55498 339240
16113 339240 -85239 170500 -8720 -9964 -182974 36716 188787 193120 -105749 -99471 -175810
16102 -175810 54858 168717 86789 -146646 284491 98284 -89495 -117951 93590 172629 -39133
16090 -134689 -62847 311677 -167600 29473 -297909 -44705 -11075 410318 245368 -20866
16079 -233379 -46491 26963 106391 146578 -244397 48176 82852 120629 53053 -132080 58072
16067 283775 -197611 -467414 -131357 -84486 316019 -67261 135542 -117426 -66144 -123620
16057 -123620 -114905 -179309 117823 -263979 -16882 83584 202643 -129551 -377422 -67079 -101080
16046 -101080 -120357 129178 302280 195125 153841 -7512 -5141 19587 -71731 76147 -108923
16034 -240381 -327182 -41840 -416216 -181539 -29388 -233240 -265070 -245742 220622 11115 -400328
16022 -248364 -259987 98734 238488 -314687 -306937 -198384 213709 -348986 -126807 -220225
16012 -220225 -124841 -355586 -389432 -109412 -268393 67587 -218825 181650 -121384 -116148
16002 -116148 -19718 143274 52998 -25463 -436750 -172667 85720 88494 165282 -28449 151523
15990 -170271 -78947 295989 -340914 -13225 -83458 -237153 -96365 109259 -203748 246116
15979 120157 163690 106850 -103254 -231048 -167659 -139649 172407 -122073 -53395 66488 55305
15968 55305 -185184 135485 -446558 -194096 285302 -249674 14576 165653 -125709 112006
15957 81531 -256444 75950 123238 63424 24397 -180251 185010 -35508 -72188 -14175 -393495
15946 -393495 -222900 -87538 54642 28336 -104451 241449 -425545 3424 -73111 39641 -90482
15934 59887 -145489 139328 401957 227962 165034 195198 29691 -321069 -223015 210203
15923 -320471 110765 -164375 -214723 -147018 -80474 -191974 16242 -179384 12433 112853
15913 112853 -214517 272742 27876 -172004 -175636 95609 143788 -145710 111569 -143248
15902 -103268 -223548 -115217 -56964 86435 -77453 168922 123957 -76410 -3305 29705 -55268
15890 -190307 130941 -244848 -41648 190111 74314 -198200 494905 108255 83026 308324
15880 308324 102121 465235 -267444 -189847 204538 -342854 125027 -5873 93898 -109818
15869 16901 36907 43510 115033 -253482 -179819 -225266 37273 -89414 63337 -192512 34454
15857 253374 135500 -315807 53212 -332493 -162961 -68833 -184272 43203 -41109 183506
15846 -59527 -114946 26093 219169 40240 54350 -55123 113540 -32088 107913 23344 -33525
15834 6487 -323378 225788 106143 -113448 -98878 -115166 11545 80755 -45900 200483 -3224
15822 -410740 -126845 102295 -180760 -184264 -88088 43852 -423910 -256514 -370134 -142647
15811 -199539 81643 -61942 61940 166900 -41985 231329 -98934 -240580 137127 193880 -5520
15799 188947 -184540 -296473 -145882 16543 1041 -68765 166106 159284 -51333 -99069 -142809
15788 -142809 88689 81658 211039 -215802 54806 246171 90200 5201 -81822 10849 65963
15777 65963 -189192 -168939 254573 30459 -59634 34730 241619 239512 -234280 -141031 -118010
15766 -118010 -66341 -356741 -66180 102858 -122985 -211794 22231 -314290 -184191 -61218
15755 103268 -453964 -1721 -368766 -48077 -5199 -30259 -128814 -95167 -148459 -107074 -30001
15743 60668 -39444 -58199 15706 108518 317516 -85761 60663 -127807 -268283 -77587 6260
15731 134302 261542 -171676 195464 -289151 -100292 -113604 -125555 -328134 -61212 -54661
15721 -54661 -312314 271170 -132501 173749 29121 206317 -59383 -282742 -258193 -58598
15710 -410707 -200696 -183718 -225182 160635 -210572 -229867 -43809 -298863 -159968 -103265
15700 -103265 -55150 189320 -110842 -63596 -124961 -55761 -57118 -95491 93176 123602 129841
15689 129841 255430 -153384 -193870 -14127 305551 -220647 42331 135739 -23802 -92600 120017
15677 31988 -181366 112014 286737 -43894 3606 -255616 -317124 407104 76876 280398 -146752
15665 -220582 160567 -153882 179133 -134400 -113963 -109499 -236565 -266537 336717 -249165
15654 141482 -247944 170399 194096 126663 -271961 -124185 -214242 -230855 64201 42600 -31184
15642 -33284 23049 84973 -438951 -81038 -77508 -227475 -138555 -78872 1026 103002 -320264
15630 -304782 249056 -94909 74594 -100130 -21497 -251316 -24809 -210707 190160 153435
15620 153435 -25411 28708 -147144 513 -16151 -8698 -39531 -66989 -117857 -49666 110841 -11398
15607 -204249 -98050 171761 93516 415986 102950 -71804 66784 -181927 105405 -199508
15596 -88283 106736 286050 110970 -38854 65743 -60160 200867 -325686 -54659 -64693 -89088
15585 -89088 42298 117519 33399 -23554 58960 -14083 423659 113528 213563 -57815 -186236
15574 -186236 -285185 -156170 22745 150435 383317 127044 198338 -296496 -53763 -178627
15564 -178627 -75819 99102 -114532 -133310 173506 -82108 45772 63570 -419309 -238510 389
15552 -20947 19446 152146 -385813 40869 74275 -345005 -244665 86311 -52610 -253832 259304
15540 5669 -133269 -42307 -68813 -130727 -149320 78691 11977 50916 50329 79068 -168137 15368
15527 -26842 -10229 -37572 -393 50858 107672 153077 -155788 -52166 -64330 50374 171723 -113268
15514 -30795 -184796 -19339 139129 -2427 -146490 -3643 29879 -136095 -81276 268536 -94674
15502 167947 -349393 -169513 -5273 -81969 113493 29177 170978 -150016 101209 205915
15492 205915 -53912 2471 -176485 -115053 34049 8424 -34771 -14883 84763 -61288 -92726 50653
15479 72868 406861 -85182 161579 190342 102818 58793 -277189 -34051 115552 153100 40948
15467 254518 206989 19952 -277749 -67136 352849 76093 -38355 -187845 -166254 -50487 -230139
15456 -230139 194924 -11098 -208382 52813 79688 21813 -185086 124374 -70660 -22765 30262
15444 83618 -431928 -325008 87904 205651 51647 295440 311850 -91646 96277 13027 34851
15433 34851 339688 394690 -53659 -73957 -24615 -296193 211257 -14855 -249974 -12788 20956
15421 -323350 123950 -116854 2456 73010 245381 -269894 -187437 -64425 163209 168912 -101876
15409 63395 225255 170131 -293955 152433 100568 113965 -82906 -182353 -315058 194680 23077
15397 148219 -72657 -188919 73260 -143344 -26878 2524 -29518 -237367 -227912 -53653 8915
15385 119775 61970 -201009 -26701 236706 80209 -251597 121900 26261 172128 31120
15374 222140 136133 96663 353550 -343778 304170 -289878 138334 -69796 -215060 274227
15363 41084 341859 155437 207834 94201 -29181 245400 -238099 243068 -21878 218892
15352 -284251 146883 -7739 112887 -128109 305705 115590 180863 65955 -25489 173377
15341 134716 12316 -77139 -74991 318995 -114954 -106865 159106 -54954 -103246 2582 -393541
15329 -191036 -5500 -103841 135479 -36832 105445 -109729 169815 101066 -170466 316631
15318 30755 -5746 -235846 -30995 93079 -180887 16631 52520 22320 2380 245575 362584
15307 362584 91604 285191 -33686 -60632 78756 -168398 -91771 -192933 -63371 303100 -12557
15295 161531 -114685 -443579 113357 -21724 -12803 39382 -88179 -287891 231643 166333 362902
15284 362902 -269209 -71540 190370 363186 -157536 -205995 1556 61388 -80937 65478 288991
15273 288991 358395 122247 235138 -64170 -84773 197906 -218101 -208817 304883 226737 29386
15261 -165109 48054 -34363 -82657 70996 171958 -93318 361596 34986 197585 209277 123632
15250 123632 443640 608727 564136 899831 2269005 2139954 2084709 2566672 1212553 398259
15239 111314 67806 180780 392779 315465 -345018 122732 110876 -269732 -139440 66415
15228 166506 283907 234666 45385 -81316 115420 135672 -57670 124455 184733 26027 72873
15217 72873 339111 43675 76246 117908 87605 -148908 195741 312325 258161 -138467 364917
15205 257125 281748 120847 -20608 -23927 -184633 122751 39347 130422 -185154 433881 184194
15193 297994 -105255 396245 119841 130320 279450 124142 -100736 143708 159873 52368
15182 113020 63077 -270834 1049 28675 130047 191251 103578 119249 18865 179169 203662
15171 203662 114809 53682 245279 189191 399578 209257 512667 -104903 358051 62466
15160 121948 11431 198908 -289654 -59814 -29627 261434 20365 137154 -129588 -285825
15150 -285825 -63133 -56498 68672 200966 147378 237070 -167116 57295 432425 255500 41205
15138 404627 451896 18026 259343 245912 241517 -257306 131954 422162 394426 326487 39610
15126 73692 461966 -88943 424793 -114079 239910 156104 299379 -150060 28999 125932
15116 125932 7241 196512 237274 -23218 -331350 211688 77906 174964 -108219 127156 -49131
15104 85573 34522 -3900 121149 167995 2042 227110 77967 81899 67044 5808 172378 44116
15091 550939 -258515 168348 -321322 -145817 82392 161649 41 -22201 70927 46869 217044
15080 217044 344359 115378 34767 166061 1750 70490 141442 67233 122886 -32754 19953
15068 -4209 228839 117283 133614 97526 202489 -56822 255643 102624 165825 159678 170258
15057 170258 73734 -279 316729 66420 297943 -29073 304618 74781 -114718 250973 107967
15045 519805 496018 -75089 216529 -84694 269900 628176 266353 107448 -35663 106341
15034 -155002 293664 -83343 -17610 185973 220017 345028 -71199 -69586 -322371 300808 136101
15022 196508 211724 138218 423823 331967 408018 242227 69093 166247 321054 269858 208776
15011 208776 427431 131178 118619 561577 5855 317892 147962 160740 110887 28925 391736
15000 391736 287340 231543 413893 46800 435903 48563 71834 372128 113274 84879
14990 84879 234480 84849 408768 206026 207264 238791 -151497 390224 -191860 61255 155035
14979 155035 178106 49825 467821 103263 131724 -29805 308482 230465 267593 -84123 321131
14967 481831 199151 -96033 216883 260683 501234 99976 291630 407315 221308 185515
14957 185515 3346 421892 376471 148064 335890 231154 513367 58381 326406 380663
14947 380663 292608 -35069 316891 456957 223418 243184 70482 711211 175874 276249
14937 276249 -172696 186332 273080 471855 25827 461352 463123 374647 358081 293104 211524
14926 211524 -84964 157973 112152 150867 350361 275900 175915 82040 533554 417584 70563
14914 421640 479169 408431 337417 521144 411441 165062 606504 248136 201144 333426
14904 333426 396511 158434 -15815 377086 302788 408121 325651 261774 357387 605351 321419
14893 321419 52479 319459 495701 422931 634982 334702 430851 -126488 242803 331249
14883 331249 57821 364797 539176 271646 450099 496928 405188 317471 631701 220416
14872 484859 681692 183238 489562 489358 154391 258938 13416 52722 588231 424617
14862 424617 92511 824396 623798 245652 430358 403006 572713 569868 191799 409202
14852 409202 233571 586113 813067 688766 372517 451180 453813 625955 338457 566392
14842 566392 665285 573273 355035 415973 413008 293807 696887 173396 378118 426260 568763
14831 568763 469000 787615 403354 393144 16416 33687 332265 447336 931846 308114
14820 489805 503170 505700 416069 451214 467541 624619 469793 516931 453726 503076 441460
14809 441460 387925 517822 356942 553310 638941 276696 252200 474148 313394 1087201
14799 1087201 349493 423131 649036 817313 508310 606449 484171 658016 632852 503039
14789 503039 585347 569361 479387 460282 629570 186372 559612 1001409 511149 645787
14779 645787 659194 420300 575162 528018 704749 685467 559283 735157 583187 825315
14769 825315 338880 579032 675860 664268 561691 448860 789193 832481 669505 465266
14759 465266 707623 711948 611279 774242 580816 859776 754544 503099 669794 654145
14749 654145 741932 754820 460055 732997 696712 598242 364952 707763 1039173 778969
14739 778969 865018 591031 652032 863729 457986 683702 727916 719349 798707 707614 930229
14728 930229 726255 661909 728552 942862 946818 659825 1046662 879022 545122 766714
14718 766714 629074 652320 676075 966985 982842 553297 989709 638133 876201 832775
14708 832775 851368 840700 1023971 913644 920040 926178 885878 898411 751031 791931 1080473
14697 1080473 1145524 955418 986735 1013187 1133940 1036729 1022979 715243 991248 1048953
14687 1048953 908901 801299 1247076 983976 991288 958825 1294983 955778 1256559 1131432
14677 1131432 1118211 1088053 1289290 924475 1078202 1192304 1117725 1504395 1014585 1166792
14667 1166792 895429 793386 929821 1327235 1022485 961944 789968 1157155 1216557 1245861
14657 1245861 1154379 931338 1221870 1150602 1324307 1246588 1316910 1199126 1175012 1344310
14647 1344310 1309838 993275 1055977 1333176 1141675 971034 1272967 1489425 1512860 1102300
14637 1102300 1198757 1794875 1239426 1374294 1146583 1396188 1176984 1146484 1309127 1219538
14627 1219538 1381278 1211800 1459502 1345036 1295240 1693381 1461595 1346859 1430199 1437251
14617 1437251 1537119 1389235 1747006 1848357 1390896 1276146 2001878 1607051 1404507 1470233
14607 1470233 1784911 1630271 1700450 1657817 1979691 1659953 1778210 1520415 1417438 1659308
14597 1659308 1772663 1657620 1755727 1831788 1755017 1868697 1737314 1791811 1872535 2174406
14587 2174406 1967584 1797264 1755819 2130839 2007753 2216181 1741971 2020952 2325717 2216606
14577 2216606 2122991 2283274 1960551 1818622 2115177 2118601 2497379 2482428 2250197 2341074
14567 2341074 2344713 2679825 2531524 2563238 2907068 2780774 2565782 2771477 2797576 2761447
14557 2761447 3313941 3116500 3322251 3815103 3831479 4238537 5045334 5603428 7675024
14548 7675024 11469691 20338543 37479434 42909166 22101186 10841476 7929988 8467762
14540 8467762 4127529 2697345 2194368 2153568 1948694 1870434 1954111 2465986 2134616 1948831
14530 1948831 2594215 1751214 2193693 2716741 2459517 2285328 2415137 2492895 2449541 2717553
14520 2717553 2583364 2853862 2498124 2512139 3024921 2930153 3074424 2958799 3222138 2532654
14510 2532654 2798467 2817824 2879526 2947435 3080612 3210815 3126840 3221102 3092691 3294421
14500 3294421 3043250 3427298 3285705 3261730 3359246 3451714 3659354 3468895 3451079 3750697
14490 3750697 3433144 3688068 3909104 3759010 3755906 3761250 3582375 4118955 3991963 4001139
14480 4001139 4056358 4364140 4136752 4100448 4100433 4148761 4443833 3979404 4397134 4006722 4662609
14469 4662609 4671328 4712873 4568606 4461188 4589777 4572771 5096928 4705313 5167785 5258120
14459 5258120 4955828 5467987 5264144 5021358 5454820 5236256 5573328 5476035 5562280 5736274
14449 5736274 5663540 5724159 5820632 5628228 5846312 5913539 5995369 6074097 6398054 6106183
14439 6106183 6434853 6472127 6483358 6912763 6689757 6740104 6923625 7315326 6921219 7144398
14429 7144398 7282260 7472555 7803496 7666964 8000732 7758135 8121917 7951614 8391682
14420 8391682 8261000 8311373 8328611 8771367 8575513 8935125 9012893 9049743 9379157 9431614
14410 9431614 9554396 9821134 9910111 9987807 9912752 10391121 10446387 10505922 10596337 10817031
14400 10817031 10956618 11180864 11277149 11672711 11849294 12174099 12226862 12361600 12776386 12799193
14390 12799193 13282613 13169671 13415333 13815549 13823754 14584381 14588566 14810842 15425184 15415322
14380 15415322 15715983 15897379 16409372 16480286 16941094 17315858 17625101 17973145 18098749
14371 18098749 18506468 18873373 19296699 19725425 20051281 20678408 20715293 21585161 21857149
14362 21857149 22262036 22754537 23418640 23798500 24319666 24877763 25446114 26330071 26817053
14353 26817053 27075085 28038531 28730929 29411789 30164526 30779373 31796813 32399854 33094811
14344 33094811 34127151 34888964 35576007 36758381 38035247 39191611 40055621 41082079
14336 41082079 42068876 43594782 45007089 46207795 47417844 48973240 50780863 51956443
14328 51956443 54070758 55443881 57388504 59399721 61004304 63360081 65590086 67619435
14320 67619435 70385373 72807143 75604558 78541384 81260080 84415096 87540652 91083022
14312 91083022 94705667 98554636 102222525 106669069 110825853 115432490 120395475 125920292
14304 125920292 131345343 137171199 143079597 149721055 156916585 164258479 172052981 180353880
14296 180353880 188695251 197769544 207644637 217575241 227862117 239166682 250771153
14289 250771153 263201062 275511665 288415228 302283805 316371571 330449051 344663065
14282 344663065 358805305 373155344 387653887 401251950 414703568 426914637 438268560
14275 438268560 448346054 456381454 462861288 465790664 465191767 462681598 459987405 455546686
14267 455546686 451394433 445675221 436945204 426045505 413718804 400277168 385684305
14260 385684305 370232075 354884459 339368003 324100105 309449551 294559800 280417024
14253 280417024 266254102 255059642 243110696 231046852 219692998 209059350 198963422
14246 198963422 189243948 180049708 172255819 164007986 156438744 149366723 142669672 136459053
14238 136459053 130873602 125075670 119807438 114646887 109869941 105227993 100950995 97358017
14230 97358017 93545576 90019128 86521982 82886455 80074322 77151888 74321753 71445061
14222 71445061 69067183 66846400 64899542 62583181 60228577 58540105 56642030 54513663
14214 54513663 53273869 51996031 50503586 48412382 47226678 45915812 44257810 43761892
14206 43761892 42475847 40951913 39630424 38747692 37618679 36744501 36116234 35320898 33830034
14197 33830034 33112249 32294979 31583709 31029583 30150148 29438275 28349684 27930074 27165705
14188 27165705 26299297 26029153 25447680 24827249 24056997 23752015 23277963 22598152 21994238
14179 21994238 21803576 21759649 21039123 20580894 20154685 19569813 19166269 18967372 18605431
14170 18605431 18375046 17549483 17324358 17386030 16614578 16301161 16473174 15881978 15724530
14161 15724530 15560285 14762741 14933161 14633630 14378549 13790061 13877931 13465502 13834415
14152 13834415 13417430 12751461 13131322 12326680 12393540 12212981 12107278 11713406 11369437
14143 11369437 11230480 11215187 11298583 11059312 10726462 10706872 10649487 10376027 9940778 10078757
14133 10078757 9780044 9763703 9741578 9293139 9258926 9245165 8898927 8822680 8710777 9272599
14123 9272599 8709868 8579159 8634413 8102882 7949502 8340223 7884655 7799468 8010624 7629902
14113 7629902 7510723 7176019 7073212 7486505 7367889 7084290 7490684 6916142 7014510 6731925
14103 6731925 6986847 6818222 6774476 6525905 6187908 6204608 6061830 6608004 6018608 5836397
14093 5836397 6113400 5768463 5775555 5808498 5582620 5527189 5593284 5120977 5380999 5483274
14083 5483274 4913870 5201714 5115900 4919808 5395168 4931666 5020581 4775354 5104622 5046229
14073 5046229 4749073 4702321 4658068 4822944 4847919 4661729 4266139 4470580 4506989 4158521
14063 4158521 4159561 4155610 4176292 4193769 4325532 4152528 4207395 4251648 3970729 4206963 4026307
14052 4026307 4077241 3811582 3649749 3722569 3800856 3711888 3329840 3538599 3508854 3428656
14042 3428656 3739247 3372701 3847037 3305629 3526227 3268925 3104516 3454059 3185169
14033 3185169 3464415 3175984 3333606 3462858 3386536 3289651 3195736 3223455 3484821 3018282
14023 3018282 2824259 3087587 3211523 2958913 3131776 2715498 3028497 2729644 2735136 2750956
14013 2750956 2477454 2723450 2634997 2308226 2559158 2493584 2467836 2647242 2839049 2241826
14003 2241826 2807700 2249638 2563735 2280939 2526112 2394082 2285923 2503531 2388481
13994 2388481 2594037 2578999 2579884 2947786 2924676 3776092 6322428 13881505 31180270 44485930
13984 44485930 27105019 15121146 9154611 6669460 4961401 4461717 3923329 3612937
13976 3612937 3588944 3375778 2845429 2915072 3070287 2449309 3000760 2889482 2523867 2745026
13966 2745026 2391948 2528636 2480199 2444090 2479857 2336787 2113697 2704272 2316941 2147766
13956 2147766 2259310 1977027 1818412 2392029 1932366 2094053 2015761 2025673 2114408 2001973
13946 2001973 2160279 1773473 1899124 1953462 2044569 1941826 2269774 2118827 1992451 1966331
13936 1966331 1765142 1772309 1945925 1718546 1485352 1606848 1734924 1684296 1811523 1482782
13926 1482782 1285258 1707604 1426767 1838542 1670681 1699027 1604156 1572212 1757747 1604396
13916 1604396 1610171 1402623 1688620 2035582 1581142 1639542 1604740 1587685 1564677 1261803
13906 1261803 1624022 1794927 1659956 1543715 1517992 1551226 1584057 1433761 1664957 1427807
13896 1427807 1217170 1569843 1284633 1173409 1247739 1294576 1032924 1486096 1406493 1352003
13886 1352003 1538615 1451531 1196181 1132232 1377306 1226379 934150 1516062 1384414 1119372
13876 1119372 1383320 1216263 1553008 1364267 1359214 1492067 1390638 1099236 1280080 1097110
13866 1097110 1048280 1355117 887285 879948 877650 1074854 1105375 1047645 1190136 1493158 1117146
13855 1117146 1168611 1033478 1070287 1126077 1029764 1007703 1173205 821846 996881 1100786
13845 1100786 909439 749347 907715 988287 1112719 1117178 1352735 875594 891355 1136212
13835 1136212 1124958 1040182 877323 1173267 983490 1134573 1051100 955060 1122614 877244
13825 877244 1040276 1048291 818592 1439278 1004592 1183415 1102148 967016 1172515 791078
13815 791078 1174654 950741 1016656 908930 966804 960981 663216 878927 1151096 1005033
13805 1005033 724653 968538 970995 1001250 917862 796544 824376 706906 820369 773659
13795 773659 898616 963835 961864 812870 788679 663249 1091613 824918 1108157 900292
13785 900292 1296120 611188 826460 920399 921101 1177891 493561 724495 1178244 1037282
13775 1037282 921376 1117271 695004 1006068 852464 801597 894861 835121 663042 716871
13765 716871 391029 594656 689986 689144 760969 858445 466832 848955 623311 807317 810831
13754 810831 595702 532994 630625 513023 538393 824818 666695 447686 633898 853356
13744 853356 901000 758530 1028253 966961 579963 665045 153855 562260 747095 630702
13734 630702 680194 534974 451825 464176 639476 389517 395802 521723 434547 722850 679368
13723 679368 538354 592959 709482 338402 693237 813902 466482 760112 747405 1021570
13713 1021570 289004 928371 497064 392183 945154 935293 827226 541959 511414 649692
13703 649692 520952 379743 680470 308090 357506 747459 960876 692461 586627 272406
13692 442072 577357 612104 632036 769312 584609 465075 378408 492094 765889 308338
13681 531300 329098 684449 343164 578932 524055 556338 507116 411733 470652 359164
13671 359164 532747 170924 527717 449350 377594 373391 369688 446886 722685 479431 662944
13660 662944 465411 541439 861426 639472 600269 331249 378204 193476 485886 404323
13650 404323 310784 672848 551229 583331 275318 565027 65532 389542 546205 225999
13639 424242 450329 416213 682963 430006 529491 317590 490282 389222 425807 411815
13629 411815 251294 352536 410403 123830 662946 543677 311325 265431 435940 529494
13619 529494 347477 331326 523963 460791 326135 913837 434050 501287 306326 369283
13609 369283 165101 631901 419897 491209 473527 138470 547617 442136 586907 471237
13599 471237 144641 570268 121818 705479 308021 353256 415152 521487 529477 232948
13588 189938 373838 490347 257790 371661 181269 434637 156716 600240 499468 310667
13578 310667 230034 481660 66606 466569 802624 165429 399678 309752 444004 166579
13567 483506 341406 535999 351429 249916 592814 368021 482200 -26382 372516 551156
13557 551156 198253 398525 474672 135021 427199 400147 323559 404030 225232 309680
13547 309680 397292 288216 551383 313719 436515 370211 250970 338683 464915 200323
13536 545713 604776 666919 281582 574576 300222 449509 133766 85471 222706 500764
13526 500764 218253 387196 525723 341355 197286 379386 225204 -25289 135152 612631
13516 612631 302820 413083 403822 374321 476629 437010 58960 127547 401813 261768 497046
13505 497046 534651 -26734 422253 429024 379211 378790 542726 673189 387647 134537 347172
13494 347172 334134 265945 410185 227591 235856 623837 11125 243344 519711 53056 572270
13483 572270 266204 403374 510240 314550 36917 377346 199299 362394 82532 49685
13473 49685 622994 341986 419668 181522 30710 108554 9448 560497 55767 186424 484255
13462 484255 270743 162884 621268 233281 454218 564581 422549 231495 90636 382230
13452 382230 358905 418785 496037 363921 351217 486838 347118 183881 464434 -21524
13441 310270 289261 193672 305314 93774 349535 146278 111373 308047 273532 180530 173180
13430 173180 116018 -29133 96635 403025 346566 129926 239454 279202 267672 -279755 -180591
13419 -180591 96196 330269 313438 273979 -77103 171942 504641 331392 458467 -139997
13408 180667 354229 -64566 425847 83200 262171 -118110 402697 292157 386976 112644
13397 415485 433922 148526 262038 213067 197953 148069 134249 191114 75964 171129 220893
13386 220893 354127 302830 107025 109823 121952 110414 -71112 376163 258359 -21506 200152
13374 175254 96758 41614 84109 367694 281022 629507 439745 -125144 88081 362107
13364 362107 -172340 118746 449518 459055 -13349 125932 326734 196589 199870 81594 140821
13353 140821 560754 -9316 147302 51485 304181 257653 186722 366350 740942 436901
13343 436901 650613 398381 419898 602378 312510 96588 306381 417805 356593 388405
13333 388405 300434 230454 382734 253457 34145 487054 115972 13008 344289 191057
13323 191057 158794 6119 393334 611499 172325 43717 241334 -39977 -74778 -30537 289146
13311 410050 125259 122374 365218 244792 468022 284805 91697 298526 -34258 222306
13300 -15427 331825 1639 -30923 216463 268090 44546 57016 231955 125819 103320 108714
13289 108714 52637 -46073 -226963 64466 157463 -85286 82273 5031 214321 40181 231300
13278 231300 -190243 366833 131227 123763 43889 73866 309442 403454 239773 311089 -44507
13266 97795 327087 -234539 245727 174550 143341 118635 250257 173837 436925 282894
13256 282894 -23932 56040 209825 131614 110071 279973 -117061 313688 126610 324852
13246 324852 75848 -114328 62554 541783 152779 388292 -15353 293274 96341 -4917 386628
13234 104519 153654 300775 -88550 65224 142614 227311 -84327 -39065 120421 123457 -117176
13222 219918 482053 -147756 324045 156066 408125 237980 -44982 248686 295577 215298
13212 215298 190288 46649 69328 130639 321448 122399 241465 330409 93264 179164 165646
13201 165646 11012 134997 -127709 470421 133543 81655 215637 -214758 117246 138035
13191 138035 230837 48485 366702 -96829 323926 142374 317594 -11838 -411944 90082
13180 400549 222880 158862 165088 396120 12120 32864 72178 367416 1742 113676 95149
13169 95149 -59373 200092 146000 375548 73476 96730 14986 163377 145817 198808 106946
13158 106946 107902 103454 -39869 109249 6343 47625 -10630 235916 78431 50685 -60148 -314030
13146 -314030 122892 -268314 -120730 164765 -64291 158378 266496 48221 228272 290202
13136 290202 2429 23865 155225 190988 -41419 132706 195763 51763 -44180 227192 -5323
13124 -64982 204494 230096 93565 146881 -34003 153775 -227167 167498 66653 146346 -90066
13112 13217 239018 1646 15043 353484 6969 41343 197706 46689 348029 -194863 -299827
13101 -299827 155226 64997 37046 184943 -25280 -153326 159420 142169 94517 -199638
13090 301075 158551 324074 363870 201546 -73037 317333 61314 191920 89485 54727
13080 54727 40043 310838 -78757 93481 -29950 -70696 386845 -103744 137067 300551 -2400
13068 85032 11946 201881 156189 92944 285206 214746 -3764 298713 -32593 130252 -119198
13056 48022 -60087 300288 395027 -90649 115620 -88997 296085 99307 -230694 43093 38199
13045 38199 372949 15601 167711 174788 -43617 -214584 -113484 174175 184950 -74295 431001
13033 198204 163799 -169636 260755 507285 -76831 131216 -50205 222036 -105015 128466
13022 -158012 188596 119029 118974 103327 -180670 -98465 -192953 87084 93500 57042 326025 344039
13010 344039 57371 28053 128217 426148 412497 284976 186213 -200981 11530 163096
13000 163096 195506 216685 231037 165163 198686 -69874 -159086 243525 65005 85501 -203302
12988 -10944 19383 81033 181914 -19604 -230512 -58908 175010 248666 381568 -25615 52627
12976 -6331 3294 202020 211694 188206 -154991 65221 38232 -189798 293945 268354 -77879
12964 -145939 42175 83683 124757 129638 418185 -22329 -165805 -121821 87349 -22062 36956
12952 169554 -107338 112962 129777 181299 450 36344 118026 65191 -107965 143847 123570
12941 123570 -224600 43714 129638 -3342 -179785 -50834 -83941 83322 -54935 71748 207 58912
12929 58912 163013 -139485 -127345 -350594 -8358 -42830 21653 -6686 68239 253694 -47663
12917 213015 142983 242204 227074 190369 83461 77055 -25954 251372 -91741 98000 -73263
12905 259355 401444 -29180 214439 313971 -35569 -155323 -136971 -85308 -183627 83692 269635
12894 269635 107202 120343 207586 319628 368774 55000 -61652 -74644 43551 43013 108985
12883 108985 80120 144114 -102648 239737 -216961 202517 193031 278766 187792 -1742 76072
12871 -452899 266335 -31967 20139 -68359 82585 -80941 -19885 -41838 104329 -106977 271657
12859 251474 -142425 205055 32654 -133359 254790 103507 160927 17072 131523 -86021
12848 -80047 425065 140755 246214 439360 -26296 18557 91943 18589 57831 105624 6472
12836 141351 161070 187484 -26580 258767 232786 -357697 51147 -126414 70434 -119906 15469
12824 320424 198595 -222495 23163 81792 -249871 -23775 338012 -55560 290548 -146345
12813 223998 -62384 64042 -10283 175018 74254 158287 15805 -45226 102011 20325 188299
12802 188299 57684 -236712 20333 -20274 166700 135491 40927 -49618 91460 203120 55009
12790 -116553 -45400 -94576 63335 55131 -190749 334698 -159011 -66015 -560544 22338 102807
12779 102807 305913 186703 -254964 -38267 -10015 214376 -85887 -115157 85264 -115838
12768 -37104 104075 -110672 -114306 -159984 -336138 71614 47775 -32464 -66533 179583 9486
12756 -310286 247961 172598 104762 -169923 75216 -32546 74873 43123 216875 -30405 6270
12744 -4574 -147354 411206 -67975 244204 -142692 21095 34402 -211137 105968 71258 -26123
12732 -216443 281290 186764 149569 -111563 -30828 55595 81912 245432 129821 265910
12722 265910 -36581 172166 441329 138738 329665 -10144 -56063 49600 -357674 279562
12711 139931 36841 -152780 143729 -55528 -77155 92397 255145 -192015 32357 -21304 103970
12699 203942 471124 205963 -42406 -96954 -11264 -99929 408056 28820 -203269 -17547 -9948
12688 -9948 549742 2719 89869 15503 -118785 -487469 -388250 233686 69521 74898 166331
12677 166331 -69431 212463 385419 21366 -53942 13084 198680 35530 76652 296368 156989
12666 156989 155861 36488 111397 245758 -24451 404200 79572 180608 183667 264041 277976
12655 277976 -222814 141598 -67093 -124 193389 118489 -208075 274788 341726 -97237 -52872
12644 -52872 -58883 222347 -181453 311767 261544 -200888 235931 -62388 -65321 60714 -82204
12632 288397 -72352 278236 -357781 117799 248223 399394 509639 91302 111667 -177875
12621 -4322 -2847 21117 -180176 75208 383183 -133189 104417 124051 278404 -160105 -305604
12610 -305604 -261389 72939 4958 171353 446512 143155 119847 -186315 -118436 100228 -409329
12598 179343 181678 66007 30632 -22414 112115 188746 199535 318215 220741 -51964 -18718
12586 150729 -207169 364031 64720 124899 6584 37009 -22215 100241 102011 233735 65086
12574 252152 -236645 326850 -121235 41730 -42181 95898 -136591 135923 162310 82147
12564 82147 -87258 211850 -277015 -68739 168707 83192 88964 160750 -12528 -55357 267496
12552 126091 249870 185943 18852 79388 -33461 114223 -142752 -125220 80865 -162174 -86636
12541 -86636 -102814 -95093 -19349 177250 -239539 -233699 65690 394729 -171858 37269 381548
12530 381548 28296 128948 188240 -107713 238694 -29667 -57423 121632 -106223 -232333
12520 -232333 76808 58446 318499 257113 133712 169386 14025 261043 29485 545276 75392
12508 17830 -104292 18009 271483 215657 -132645 -313484 75034 21712 -27462 29154 258466
12497 258466 -102516 31274 18351 360994 161141 -208536 -48472 -225412 -273078 -19758
12486 -74109 -144707 -136348 -21223 56880 62156 228147 188107 -256970 -51190 -116576 54146 -28684
12473 110904 -219848 -2731 -317461 14245 -111543 -130430 26587 -70047 -84128 -80328 9986
12461 -88941 -52568 53130 310892 89715 67262 -21518 70348 -227650 59687 -24708 87235
12449 5120 99080 182663 139623 263080 11380 105086 -67178 -56411 188311 -336223 306543
12437 13688 -292393 -202569 182141 -78118 295408 -146860 -80581 365250 46110 122544 -22653
12425 16683 98479 303160 -51709 80106 -194664 67117 193335 177464 311175 11449 -232986
12413 -319284 -24371 -99048 2838 238443 -79921 116774 -257808 238463 -109080 98234 -149528
12401 128775 117087 156439 145584 114152 3381 -283080 -205418 36734 -144101 153698 48268
12389 -156351 111494 83604 252552 19739 -229992 -46080 53963 101924 -52775 -193335 -43504
12377 -136146 271599 98502 -52129 -37631 -328116 -54713 177243 -112850 98270 44159 -266448
12365 141580 42534 -123259 184995 57047 306096 167561 -80707 111891 -11636 194304
12354 -150609 -80053 -289305 112116 -37916 7702 171039 122786 183824 338113 -122593 -36835
12342 -15010 -63547 111761 417835 -170073 -163367 135792 60079 60831 -84876 31709 -72284
12330 -113148 -33216 -80144 -71431 274260 -49125 -31918 222851 60753 -380378 -363358 -65861
12318 98949 -124022 171230 399057 415566 84699 -35667 140749 -163216 101467 163422
12308 163422 203803 9915 176750 258504 165286 29493 371283 24777 -109288 102163 -9961
12296 161930 259577 38033 109488 98243 382912 -54303 240223 -73264 34320 -70342 -222829
12285 -222829 -114257 -4302 -48373 34131 191163 -125548 89593 418120 -84892 59621 331852
12274 331852 -13217 -136482 -97775 375175 121158 72414 -67579 227084 -14166 232750
12263 -238992 102280 -19399 -283300 156934 -250807 -107507 -114131 -99922 167758 19507
12252 -81009 84614 100789 25961 290450 94076 218480 -265340 295553 24622 78058 256610
12241 256610 255884 117288 23044 83919 141833 340156 215988 260159 80374 -179977 39455
12229 87588 19627 -282602 123367 92123 251894 591018 180994 148094 96025 9346 60683
12218 60683 12887 24915 394078 -230736 143774 180123 133945 23276 -130173 250639 362205
12207 362205 -158966 193649 46212 -16291 -86847 -25779 31787 190961 8478 295338 140012
12195 34870 225241 101124 77379 123218 422319 70489 273976 -16589 254316 21403 -18882
12183 137568 5997 128701 30967 573989 -328642 214427 192381 -266225 216069 43635
12172 68275 87236 -21881 -21483 248749 -111789 334134 95650 192800 -208198 -13264 41712
12160 -229590 -55521 60457 244495 168056 43084 478391 -137765 77064 138582 -145350 265814
12148 -191768 -528389 -260080 101398 -134097 8383 283921 -11616 -276648 147840 77432
12138 77432 323661 283792 -163048 -215036 574208 -191218 297756 98151 -157334 107967
12127 -65137 -194037 17709 -131710 -317391 505418 100903 178230 62865 134819 -115649
12116 17212 77194 -127827 253910 78658 136162 -43281 169502 -17762 227493 281087 279533
12105 279533 -67266 164061 192575 -112478 -171031 218257 -195157 65816 430201 94113
12094 -7177 -303572 -145470 -115843 67110 137673 -325185 167066 -25510 60900 167153 248556
12083 248556 -21685 103026 234139 -379111 83058 113030 229415 138561 -55057 243862
12072 -134379 -64852 -276246 -67570 -133158 -76276 101653 -81110 -153720 57527 340827 99959
12060 -65208 57731 87003 217788 130696 884730 1432739 622676 89823 -74553 16868 -30794
12048 -78569 -211318 170954 -141845 -60243 156724 289388 -163661 63051 -137575 91686
12037 199966 30400 -106871 -220596 -38213 -153321 -219076 -118777 41840 -84508 -42924 132669
12025 -47156 -284423 -124388 -233950 203134 -114894 -410513 256404 -191741 28323 -109453
12014 86468 -74484 265000 82507 -28527 -340113 -90329 54278 282830 69062 46869 10142
12002 -280580 49116 -247506 -186366 -188711 -61082 -71736 -149005 -218271 49186 38474 140364
11991 140364 -45916 175250 111205 82200 12734 34400 -242502 -155105 134118 -237352 36715
11979 -124227 315226 58203 -37164 50836 -180431 179728 78495 146564 -280660 -129084
11968 123351 -242711 80356 -116616 170459 -46562 -68266 -128894 74346 38554 -93436 284757
11956 226980 158335 -26228 281400 260959 -41401 297680 -253004 -27165 81505 187073 -38258
11944 -260949 157777 142182 -36243 187721 82129 109922 -114117 -228129 -156940 -86994 -236523
11933 -236523 45707 105535 -371861 32000 -157065 -100128 157861 -108572 32651 -266377
11922 -136138 -135761 9233 224759 -97333 -103295 -24635 -44675 -195570 -84688 41724 -259501 98385
11909 45084 181251 225005 -129565 -52784 47221 -292524 4456 -99804 25768 -245623 -67289
11897 -41975 -14770 69194 -112401 267110 114318 52672 -6157 -47788 -4967 26462 24516 78567
11885 78567 181618 -57966 29471 -29854 234047 317324 328818 16513 -210087 6541 -268141
11873 -158034 -241290 181340 32118 243074 -324617 -89624 -90640 -35985 111831 107340 148403
11862 148403 91376 -58520 354572 -251078 174570 -172657 242224 95938 55050 238812
11852 238812 -279442 45229 -57655 78346 63571 328369 50268 -81616 -7025 -283792 89703
11840 240796 166954 215832 -25848 11145 -3282 -61887 -164353 12648 73671 -188262 -99361
11829 -99361 8775 -28415 -212200 -398525 121967 -141354 153838 -287821 52100 142920 -144291
11817 2776 -113098 45929 -327650 -127846 77192 74568 -157467 -82686 -272157 167651 -89609
11805 33845 -338467 -335843 99808 -9074 -330474 6967 -193765 -121623 53019 -47281 5631 -123122
11792 -133242 540884 63224 85821 -262600 214084 -65090 87120 -35955 -209789 -259858 149737
11780 -66953 -19965 -173840 -30125 -147885 -294279 -99052 148485 96043 26655 121906 -2779
11768 -94732 -108467 -26004 314214 -139832 165129 109078 -216968 -82399 -58016 445787 -81327
11756 -38745 -161445 155128 -41171 137424 127633 110021 -189415 -156483 -262788 23132 -278263
11744 193975 -136841 -79618 121679 -26906 -55414 -184267 -28616 -193963 -242189 27680 -28445
11732 12773 182598 139349 -200166 88605 -142578 104108 9790 -176304 -171905 387836 657116
11721 657116 190643 -287346 100601 144368 -92290 -96541 -58560 197678 -102478 133890
11710 344511 -316353 74397 36140 213660 -14209 -57411 -70456 -128198 -202415 144731 43584
11698 -178348 38619 184823 -112751 10710 127469 -230584 36751 -15960 -111052 -228325
11688 -228325 91539 -255992 -204606 284227 -14504 1207 142826 257826 -133717 -178674 -23034
11676 -169403 95296 82245 -180663 -119092 60242 -58270 25883 -108955 -104079 -138752 39159
11664 38772 -227158 -255032 -70493 -255381 -308227 16824 227130 -112530 130792 106926 113208
11653 113208 -338771 -233679 154453 83158 69164 -47238 -140096 6329 267264 -312724 -10690
11641 305687 -138797 -41311 354999 -201814 131284 -202490 -150381 55000 121481 -202277
11630 138967 -257435 284264 130350 -42587 5643 205119 139853 164673 -52506 91397 78770
11619 78770 -96260 -12224 -223853 117367 -79899 -231658 -200009 232108 465562 -57777 134909
11607 -118779 -220501 -186130 279856 -150710 -177367 -105370 183620 240923 160358 92270 23648
11595 23675 -185658 221709 -108676 -35775 155700 -95802 88197 -170240 151772 -39414
11584 -19868 147002 27211 65010 -134333 -78396 121869 12364 -3923 -268259 -44350 -71683
11573 -71683 -164466 128520 235197 125445 69948 159829 50800 -338624 -96900 99515 144256
11562 144256 236842 228684 16709 75807 -155970 8804 -255117 -286377 -177361 -438518 -101489
11550 -302707 -131379 -6900 341273 -50471 1008 -76457 1825 -210398 -18839 129611 -243126
11538 330150 57317 248015 -45680 188667 23295 -95644 -100274 -108825 169282 -44597 -36298
11527 -36298 30306 -64809 -232261 166254 70548 218303 27902 15717 -165269 356798 -405793
11515 176699 -58799 32566 -22114 158952 230540 -184418 84364 295286 229138 -29839 93942
11503 244845 241690 -34914 159463 189866 208087 -94387 42619 39268 404079 47578 -102617
11491 -127158 -40236 8098 -122608 -63881 62392 151522 140275 -50583 -7111 546231 69371
11479 -8948 138563 31580 310483 329897 -295135 -429321 -17578 288062 176012 119858 177511
11468 177511 -98829 81644 230823 -15384 -86485 476137 274996 -138398 -202419 -112640 -74203
11457 -74203 219108 -154 -158167 210532 277726 85079 -147050 -126346 -129496 1523 -100561
11445 9099 112090 226602 -4040 172306 3905 -261466 -62716 -314 253328 -171226 181682
11433 39250 310501 142633 -94482 -47692 -4640 106618 -71991 -378615 144556 -69408 285863
11421 -254091 -85707 -38798 -148010 49148 29126 -124182 -64252 -125208 -69063 40770 77093
11410 77093 -172531 50601 152 -149241 -189698 -119982 78324 -254456 364768 -129554 61177
11398 -132679 -9593 222478 392214 251663 -266272 -169495 -27517 -51677 49847 86922 -87206
11386 141800 269645 374004 329474 421579 62389 233202 239257 -210732 154507 -197593
11375 -137647 -165966 227585 251873 82832 331443 -55042 231878 -133415 184040 -204852
11364 -278139 195192 -182362 171544 -226228 78716 -324206 20363 -308168 32455 -236615
11353 -151957 -169783 76095 -174527 -122203 153315 313311 105602 97425 15177 156694 -54316
11341 -102603 123172 -273381 -128634 71035 121167 -209490 -189346 192343 4720 -41265 223185
11329 -92073 240120 65475 -34178 216765 297239 -252533 -311042 -38357 -255695 100004 -119454
11317 -84111 -180283 -127413 429880 101793 -76644 -77644 -374502 26019 -170405 -92993 150137
11305 -532186 88056 -186448 -160179 -160891 49228 -49003 -171961 -240519 231619 -141463 -61980
11293 -105610 -281731 -15495 -29750 -181460 257908 -157957 -412355 79462 -191951 -102169
11283 -102169 37981 -146637 68289 -30068 168318 -143257 -179421 149594 -19946 -53716 56925
11271 -294585 -41971 -75946 450217 -233082 -414028 -43149 192527 -225023 -152343 -22350
11260 273581 -51713 114937 152908 93507 -136961 -148643 170155 -131749 -268732 -288519
11250 -288519 -145558 155364 -2992 161790 -33838 12467 225370 19308 -183229 -23878 -59847
11239 -59847 126935 -289193 -283591 -491839 324037 -311729 366626 -106540 72495 8118 47700
11228 47700 23373 -120109 -5382 -89421 340155 -85500 -125860 65274 -172296 108314 241538
11217 241538 197902 -136545 -154790 9642 -273688 79710 -527506 -26456 36508 -309780 -337504
11206 -337504 85163 168002 -124375 -37636 62731 170064 21473 188064 -106808 171351
11195 202181 190184 -42043 10169 -74299 204828 9460 112732 -2464 -18718 -114407 -28398
11183 -232866 -13837 111500 -424018 -63996 -25274 -365066 -130579 78524 37990 -44587 -248591
11172 -248591 -11801 -309534 235199 -52391 -16669 69408 192523 -223983 -122771 28395
11161 312989 -32840 259685 -108807 226623 -77253 70739 -87474 247304 -70897 -271552
11151 -271552 95484 126822 -135840 148360 51614 121617 120283 210369 -454935 -193724 -41466
11139 191067 -172665 190086 81507 57688 -115709 229688 194958 453130 -80098 -57252
11129 -57252 244227 -64742 380153 -284985 48583 71183 75529 199602 274281 -14573 505731
11117 289278 -137704 152671 346952 75834 23309 18381 2314 -21574 168864 134758 94045
11106 94045 665849 203665 -174406 354415 -70084 113680 117882 -79169 13855 141886 -139593
11094 362044 145418 -200978 -137637 98149 -100435 124720 207771 403346 -37631 92654
11083 76333 54157 -33787 -8379 150692 -24155 125240 282796 -38654 254457 17229 358258
11072 358258 62233 409681 214528 5873 175479 237478 177589 332497 337730 422734 6217
11060 128323 423482 354761 298974 488354 727248 731027 477952 523161 680198 759181 594147
11049 594147 617207 552029 625303 683950 710946 617742 396081 707401 380367 281889 628490
11038 628490 858964 402325 678023 360140 809892 284880 107207 782402 694673 516410
11028 516410 636277 633540 981143 929308 393263 691675 534734 605167 403553 441400
11018 441400 391469 802035 461525 501317 430000 698630 446194 639752 302356 501303
11008 501303 379500 268844 830385 661051 580756 585737 654584 532533 620733 950495
10998 950495 548801 664241 565973 453829 621948 583867 727780 242123 597882 277112
10987 878920 712878 878904 536640 881640 777748 914297 1104766 1082149 862505 1434570
10977 1434570 1411944 1492291 1716762 2473619 2506566 2947851 2622834 2341507 2427205 1969073
10967 1969073 1761994 1456821 1075299 855712 1173439 1064695 775417 878880 946463 998965
10957 998965 901934 683275 751771 640131 549490 305618 420402 419225 415116 38826 -148575
10945 201119 -62402 33215 154390 69301 394365 256764 -54723 -112032 71933 133431 -344727
10933 -188584 258992 -96805 132881 42386 116079 87997 30295 -44027 20481 283403 43114
10921 74504 -271429 339223 211408 -212577 68512 -241400 155297 45803 -124414 -274410
10911 -274410 131484 32645 270372 8390 -8995 94820 -204890 309522 89491 -292502 -61599
10899 52058 -160089 5920 -45454 -82926 -298176 65042 50525 85534 172819 49693 -74519
10887 23656 -324231 -360291 -240648 52424 272123 -54584 42291 -327483 163696 -9932 -31375
10876 -31375 -6336 -119938 183836 57758 147245 -45504 -114979 -118759 322470 -91890 -291272
10865 -291272 -26188 107108 -175192 -50997 123891 326303 -344515 83514 -265213 -92891
10854 -87468 -103752 359115 -173083 147782 -69288 71558 22165 91392 -29806 -74687 -49554
10843 -49554 338191 -363478 -38280 15527 -259667 -47193 -217114 3199 -49624 48215 50991
10832 50991 -27148 -183803 21887 -143531 203561 -189420 -58461 -143801 -81949 210650 248907
10821 248907 149728 -226777 -37101 -224486 137503 -12955 -78360 -132455 312385 45083 69665
10810 69665 -173237 -207344 -161000 -99732 -86800 -35445 -31750 -59798 164712 279653 -269965
10798 197213 5617 -152519 68474 89173 368022 -89245 -169608 -275091 275369 -16037 -52634
10787 -52634 67324 36479 -57188 -37469 -90304 8907 -118287 15493 -111778 -130798 -100460
10776 -100460 93869 -18959 66302 -141009 -151705 279918 258841 293687 -229320 132661 -15151
10764 83710 360003 -147835 200041 -250899 -137058 249666 6172 2774 -208869 -29548 66853
10752 -146404 -49898 -36632 -360612 -90422 253464 -282003 -374782 338366 -5402 -13583 34088
10740 341462 21518 -336769 -14869 -84904 -79392 -443686 419661 -221179 -26779 385960 105182
10728 -15656 103345 -431562 54308 -260367 161307 13392 129459 -231519 -297089 -12993
10717 301386 27709 41610 -102850 -118935 -161354 -385118 391051 -178985 -106366 -36096 -59992
10706 -59992 -117546 -321506 -155840 17501 18483 -43542 -139668 187156 19909 -31369 -118883
10695 -118883 -14807 -405495 -28406 -183294 552201 31760 5401 -78227 -201721 -233893 -269225
10684 -269225 -276204 178193 97498 66215 23301 -138481 -122144 -172479 187853 64848 -62135
10672 83201 -150326 -373689 107204 40384 140257 -124307 216367 166553 -90449 55855 130466
10661 130466 64835 -16344 16573 212238 -74357 -216706 -192669 11363 -272306 -152426 116975
10649 -71503 -36292 -135727 21198 -104612 95529 -67419 91383 -474774 -19245 57667 -36595
10637 43748 21902 -203701 78011 -54088 33390 159401 147028 68903 -12851 -211624 4149
10625 -125603 -288375 -152896 -147211 202331 -236903 64116 117712 126361 -153355 -10514 28653
10613 -320778 175392 210887 124769 117484 -175047 -210633 121670 -168683 -238735 -71090 80997
10601 -206617 -121093 -225090 158190 210619 -79261 240156 -264686 -56660 -10476 59376 107116
10590 107116 -212037 -64498 -3304 -372332 -91896 -20039 -12561 -142107 123274 -223851 -245361
10579 -245361 106753 -69840 75161 191488 31237 -340222 286809 -261811 -225218 47252
10568 7476 184260 -290419 -268882 -236161 -266636 -165015 -142203 -150951 -45080 -152355 -189084
10557 -189084 -64036 60303 -155151 219193 70080 -135660 -105164 -491950 -23311 -126359
10547 -126359 119122 -178995 55765 41751 -153476 -351079 -433530 -265918 -121373 133677
10536 58634 26995 -345394 5736 40137 -101536 -162128 -90723 309660 -83757 121006 -48912
10524 47008 -356336 30619 -71769 43439 133402 8127 -262877 -602529 52037 -42270 164959
10512 92701 -249183 -316344 -156152 -191239 -113939 -243901 -113435 115565 46666 -310664
10501 -212541 -74141 66667 -71046 -19805 -257818 164640 -137469 -83129 38823 42705 67985
10490 67985 -59543 73828 -180171 67123 80460 -293110 148219 106849 -183558 -546387 -160534
10478 -44771 -79525 -386742 -286485 225332 -167427 73614 -365756 355349 -193055 -427769
10468 -427769 124491 -64500 455577 26372 -206152 46593 212911 136351 -136335 11085
10457 -128446 -706 -194273 153790 161757 119262 65585 12246 -217464 -103208 340294 66408
10445 164219 -175226 -377168 -93864 -46208 45260 57518 64166 173884 -248290 68907 106732
10434 106732 -1426 54337 91745 4172 -19053 -206984 80568 -55644 -99167 -138604 126566
10422 -44346 -43546 168323 -44188 -7859 91384 -6202 105964 53798 72821 -337030 -212207 -27696
10409 -3058 10760 -146719 80431 -134793 112982 -24891 95682 181484 -179209 243144 -56138
10397 78811 53254 -48466 23378 34777 66211 156896 -218248 242884 210811 233238 -109798
10385 15607 187521 281978 210786 153720 102325 54932 126044 -129902 281337 -16482 222163
10373 386258 237157 551624 136131 325368 518447 404009 332557 589002 -5179 197392
10362 25951 339223 239822 210587 -130490 117772 -238817 183519 130182 82711 307631
10352 307631 376859 269685 521955 424176 387426 408296 26773 368854 14432 -149511 280302
10340 149303 -97923 127883 251863 143102 -17127 384195 44671 75625 182151 -124139
10329 262072 45087 365925 -205000 301016 252796 112040 -388461 316294 179384 13784
10318 -168168 164071 54894 16653 241772 -77411 238738 -199138 154980 -73440 8853 479269
10307 479269 22007 59133 -77412 -35291 -197721 -294583 -149493 246336 -44195 46421 -197905
10295 14340 25133 94437 89756 -8028 -20115 -71188 -273329 145100 60246 -227728 -55229
10283 -48492 161929 -82441 -72698 33857 -142395 -26104 4888 143672 -85849 147058 20235
10271 41906 -2830 -231660 253944 -284464 281526 24135 134409 88890 -144135 -20619 6398
10259 -20913 116364 383417 -139733 147844 427189 -174842 51679 216830 -216724 -61632
10248 -163071 31050 247032 -128920 -203330 255433 33067 -64547 230001 -129404 -189908
10238 -189908 -344236 -13892 -15344 33604 67572 -165873 138707 -130598 -487369 72768 52337
10227 52337 -194785 53012 59999 -26331 26509 -54615 -76845 59516 -25612 93514 -296853
10215 -336262 -201476 -475337 -51086 -35773 -280402 183519 -4989 79523 363159 -120061
10204 -65359 -251176 88692 55441 27576 17975 -20032 -44716 -212523 -264059 162038 -107843
10192 202656 -112320 85530 12336 87513 125068 -70365 -255165 -243490 49996 101166 9368
10180 129045 -107191 30252 -397077 -297925 215993 163648 136488 -5873 -86693 -57827 125676
10168 27834 127717 53527 -144749 -190848 -283277 -485745 -61300 160479 -146112 -424117 205288
10156 51266 -127667 -271755 -112715 -242559 -22132 42581 -252776 -85757 -80918 115373 -61164
10144 207733 -208461 176185 -85299 -107134 61634 -32528 -94827 -109926 -63356 183365 -127335
10132 -27460 123922 -142337 117963 3238 111025 40293 68697 -158179 -384732 271051
10121 108 -353215 -62176 17060 157511 -39338 -205174 14217 -90261 116725 -69562 46673
10109 -64989 -170648 -243431 16291 -140976 -99726 59973 -2839 4272 118988 8156 -168106
10097 48765 -314176 131236 -187122 -45202 16995 -22441 39984 -70999 -87557 -359478 -184491
10086 -184491 -76716 103466 7355 -148184 -19686 -73459 -101778 -68351 -315865 221779 -184494
10074 -28268 -190360 34191 215759 -58903 -210275 -140946 176330 -37502 24563 -171771 -281888
10063 -281888 -205650 -191499 27326 104180 -176281 82952 -349523 112631 -163551 -84590 -57552
10052 -57552 -249084 83489 170392 35167 -89449 -148737 -132906 130558 241497 25982 -3549
10040 -468259 125425 156467 -108863 -397896 275998 -112695 83408 -142137 257725 -299482
10029 -21264 173131 -197101 -28735 -318560 -211429 235012 -393008 -319012 -167266 81635
10018 -128398 -161650 -333905 -311150 66146 -295265 -216213 -315351 54462 398490 -142160 46692
10006 -143718 -129947 -173510 -330765 315733 -93627 -70238 339756 -185426 -112816 -466456
9996 -466456 -109839 36596 -184615 43518 235936 -41459 334366 -173265 81499 -54591 138285
9984 -435887 -23104 -54463 -430334 -16843 -245143 64058 214200 104134 140795 -10453 -70969
9973 -70969 52056 170714 -60419 134102 29025 -203880 -309767 -258341 -228500 69575 -98588
9961 -53143 -280380 94088 -117740 -233291 -322659 40950 9495 -79623 -224087 -37611 41588
9949 -139507 -135389 175403 -74075 -168144 -127089 336061 -207591 -248771 -191878 -43527 42573
9937 -219673 -49683 70073 205615 94204 118847 -25072 165338 173341 369911 -15009 -309874
9926 -309874 -203561 -68685 318206 -196248 45613 -293562 241628 -123611 49185 -271661
9915 -259088 -317238 168780 -181014 13202 119547 -231316 -17820 -245244 -221254 -320712 -80464
9903 -392710 -124341 -19121 -258136 -97740 156779 205704 96148 -30930 -144967 82885 -175299
9891 -141939 212455 194844 -426087 85281 -125904 38139 -458629 -134175 -174417 287399
9880 -162092 -42015 173787 -134722 303806 -452441 -27982 -6286 -162042 -187450 212438 -377987
9868 -126916 274657 -27565 -511405 -187550 198661 44992 348062 -40688 100726 -132622
9857 -179612 -170931 -341041 18250 6464 -330750 -98357 -125053 -173586 20735 47062 -330520
9845 -190433 60598 182219 58261 -335161 -66152 -190645 51436 -256548 147063 -256471
9834 -43794 154478 -101089 -69267 -142127 41849 -403263 189999 -232022 77064 -25710 -51818
9823 -51818 -204609 49505 -566989 74668 -294602 -355775 -9760 14726 -92526 -139447 -10668
9811 33953 -542057 -63011 -23571 -66223 -78306 -47869 27049 -21147 -192047 -142581 -74369
9800 -74369 54167 162839 -98473 -196140 124120 -23678 -73887 -386729 -172661 389459 20313
9788 136247 182031 -752 -88583 134924 -387963 -268302 -120224 86971 -119035 -214186 175565
9776 -112240 -186741 86123 133024 199895 -148185 -135569 -89278 53637 180518 -80915 -344902
9765 -344902 -145454 -39873 168812 6129 320918 -116755 157630 61104 81531 78297 -36329
9753 -107118 30234 -10814 3310 151320 12834 57541 -337476 -209183 272633 312235 146675
9741 51112 -103131 -17549 -243187 -200386 -113238 -22541 -475462 24524 -125219 -84646 -184090
9730 -184090 -230566 -163702 -171000 -203650 56677 -94879 14358 -392617 35848 216510 -152152
9718 -56177 83723 135334 -300631 -366269 -224910 26452 -172900 17667 370504 -93807 -87299
9707 -87299 195502 82656 489 80671 -22984 292814 -85529 -135419 15005 -222662 -155048 -112596
9695 -112596 -63573 -159613 -19005 -39764 -188428 100425 53899 -144939 -45724 -41930 -50927
9684 -50927 6677 -38318 73858 -293491 103076 20018 320537 189443 5448 31976 157123
9673 157123 57138 -207336 -38277 -225183 -78709 409570 -364494 -117010 -150977 -30664 -259098
9662 -259098 -20673 -2484 -153944 -164330 -137240 174782 -460904 -52169 -86394 368158 88724
9650 -225409 -7571 -113057 -41309 47386 -114176 81503 356468 -12761 -6068 -5433 -262770 -147774
9638 -147774 -121994 -64782 -107747 -184531 -284596 -87908 207838 51459 -94192 -222188 -66679
9626 -30601 22545 163997 -34833 -331942 -198608 -187006 -152643 193794 -253059 -45580 69713
9614 -38446 263213 320800 83086 -72148 -323757 155526 6639 -186768 70459 62745 49284
9603 49284 -148162 -81544 -113521 158480 -189452 -14613 -171059 -4893 -115928 -112426 -148954
9592 -148954 -180372 95481 83511 -176415 -372104 -74036 45110 -261912 170324 -235745 -294785
9581 -294785 183076 151960 213555 27368 -181136 259440 -345201 -328096 -61716 -321052 -36940
9569 -1697 101210 -130428 16846 -127567 54541 -105511 205131 -150194 -65896 -42098 57930
9557 -70450 -381340 53415 27368 188597 3634 -57345 -308847 -407603 1997 16087 -35585 -137172
9545 -137172 -78908 -176615 -152385 -152180 -203668 -10542 193215 -80888 -192914 -62761 -114620 -327189
9533 -327189 -118072 -89437 -46245 -353746 -22962 110491 -313350 -169706 -377129 -92784
9522 226246 -260750 -308399 -23999 -35634 -147538 59948 24948 -120762 -230122 -45917 -170561
9511 -170561 -145499 -178950 -139246 -38086 16485 -64716 198087 -15917 -152965 283975 -147291
9499 -51436 -254496 -248035 -20174 47564 -297558 333956 91701 -29718 54111 -100362 -154279
9488 -154279 -11615 -12627 -131285 277396 -53605 195773 -97839 -91681 60304 34583 39188 37623
9476 37623 406696 -207388 -250296 -3352 -350256 -151087 -278105 -273942 -188276 180732 160731
9465 160731 -20712 -245746 244881 -181981 -278395 -64695 12329 -251990 -183440 -25120 -70040
9454 -70040 -368313 58984 -120623 -12974 -62363 7452 -96402 280654 30352 128157 227809
9443 227809 -115526 -260481 -19135 -208499 -241977 170554 56400 -163596 -32023 238837
9432 114077 168608 216897 -367552 148319 -89156 -116139 -349102 -399782 -87123 96112 -23256
9420 40767 2389 272983 -84991 -232718 -297358 -34943 126555 -66552 154721 399975 -336452
9408 123147 57774 194777 -37985 -187852 -36398 -94798 -187652 -71519 -74089 -455717 52402
9396 -197449 -315411 25827 142431 -16916 109171 -114111 -246376 -49935 -328010 26781
9385 140 -11934 211340 -185629 -55188 108031 195746 -345702 -188203 38313 19546 104194
9374 104194 -18711 -65568 136716 6490 -136085 -116246 152647 -229477 107081 112077 181123
9363 181123 59640 -161702 -104206 -103577 -245744 -433 -101987 -384251 -196601 -71401 288897
9351 -159866 -149426 78280 -157872 208171 92898 16621 232498 -109369 -81133 -301041 135008
9339 -54842 57567 -59308 -152487 39551 -313065 -6027 -60892 304900 13354 -100412 -112309
9328 -112309 14089 -207494 6387 -139678 -23484 10773 -122708 -40597 -52699 -243281 -210740
9317 -210740 75017 236410 18221 -196178 -105556 191322 -50222 -185421 88471 188710 98762
9306 98762 -137129 -197045 -69898 -105690 -94699 227789 -272415 154408 131712 -270370 -219886
9295 -219886 -333810 -99188 9417 10918 15367 -198122 -71945 -381819 91517 38270 -143286
9283 -81014 -44376 -2790 121955 327166 13940 -89881 -22365 52406 107642 2991 -38234 -276972
9271 -276972 199663 -240175 51225 -371095 -204619 -370724 -63871 -112740 -60792 63024 120377
9260 120377 292648 -120164 -343097 3494 376476 -304207 -13200 14159 -39639 206703 37428
9248 384704 227234 -81332 -41594 125025 -304535 -127295 -180773 28751 67299 -1124 281593
9236 -45039 -47413 154831 -40402 120768 -317753 -26093 -194082 -25061 -41363 -108229 206404
9224 -75733 -26631 351465 117204 121983 -62008 98826 -64655 -156544 -111010 50481 -156801
9212 -401761 277744 -149435 -2648 75151 245501 -294124 -176030 84113 -236153 149184
9201 -52054 170600 -10855 -110977 214346 144167 137055 126866 -156453 -32323 -95176 -24347
9189 33720 -93847 -1345 -26355 -123212 369029 92666 -178627 -58293 -120451 42913 -327567
9177 -333810 -231591 -16728 -42691 -157239 -283531 149182 -67135 -123525 -192296 -141860 -159733
9166 -159733 -21945 -160055 -239617 119899 99991 61681 -111446 107923 201041 -209694 -89791
9154 85817 112366 8883 215979 -77527 -379761 268102 44605 -22093 189820 -50624 96807
9142 -226732 141170 -344236 104936 -169047 -129966 -41848 -250768 -246051 311151 69967 57740
9131 57740 -250820 -125605 -406487 57712 57364 -22816 -314952 -278925 -11249 -158958 82031
9119 -394599 120323 -144333 -66719 261118 -457013 -205974 -140220 17114 -57365 -76858 78612
9107 137148 131804 92491 -254368 -256687 -343823 45637 -51503 -497451 193175 -78341 -243237
9096 -243237 125587 -83496 -5908 -110516 -196346 -117498 180684 6272 -49122 -223102 -202204
9085 -202204 -219623 -230492 -298925 -287167 -285607 -33989 -274079 -24842 -209747 -319309 46748
9073 -317076 73916 -36815 -77645 -12668 12522 -35798 -262368 -343738 -55306 217208 -271577
9061 359140 -135129 97569 -147935 -361213 -170696 -198530 -28931 -26350 -128238 -278248 1715
9049 153600 364548 4057 -428373 -217169 37802 -61219 21423 -9908 -31234 164008 -68762
9037 -402988 14713 -153101 -153244 25276 -36030 353401 104791 -84754 67091 -55628 -33514
9026 -33514 180899 148606 258455 -137638 -24398 108486 116018 -214812 371962 302918 -390235
9014 82245 196352 -5574 155258 -125545 -221455 46023 -184891 -161072 -146709 -179587 -236078
9003 -236078 -49396 39220 59884 -97247 51192 118226 -167691 59116 -53965 -318556 64462
8991 268381 -289876 -165338 -105638 -141172 196194 102515 -60585 -220862 -298459 -246059 -196103
8980 -196103 43068 -312809 -163527 -93295 -273356 -11798 -85273 -427892 41134 -27883 -174551
8969 -174551 43528 201936 153312 51367 -181392 -113685 -23940 -164610 -393468 -521617 -6805
8957 -23418 -179257 147387 166304 72954 24742 184120 22620 34989 -292619 165466 -208840
8945 218768 -1047 -72452 -218649 -166068 -731 -24659 16617 21985 -342908 -251237 11422 -143277
8932 40612 304445 307659 2144 153188 143149 99661 429723 -58218 633392 2319648 8216199
8921 8216199 5484786 1689760 909373 468896 246389 -190755 -62124 33613 -366490 -152614
8910 -168377 -328619 78262 76333 325930 95635 351735 -109525 -88973 -93651 -82843 69640
8898 1655 -42729 -18061 101308 1771 182763 -194633 -142384 -45732 108693 213944 96800
8886 -208020 -43762 -138497 97289 210204 -30344 -18392 -24813 171479 57184 179204 -280614
8874 -222205 -154638 -51881 2294 -391194 45594 117639 -143127 -301705 108631 -18305 90395
8862 -271169 158848 -61946 -232002 -112065 -77367 185425 225617 78511 318415 213053
8852 213053 175542 11962 -455665 -71156 -105442 384207 -43623 -99445 -152950 -199574 163551
8840 -159085 152747 251690 73467 -68613 30372 -11071 -37534 -107933 -238443 -355941 203152
8828 85751 -15920 3851 -105276 -83729 -73110 72589 103013 -312049 -412080 -33377 89012
8816 -115264 -218396 6732 103478 39968 131479 -38913 -108556 -337788 -168516 313976 137919
8804 -345801 -219347 -122995 75134 7003 127110 -111195 -15214 -226904 -170763 -54017 -351962
8793 -351962 -137592 -11708 243119 -53804 -200334 -80586 151705 -243978 -219949 -115869
8783 -115869 -95657 -137983 -57966 203933 -192307 484 115724 43492 186238 -53934 -190565
8772 -190565 -25480 -73352 141546 99590 -285793 -98121 -54832 140994 77221 -105496 80896
8760 -127090 -288443 -228379 -359560 -236617 192937 -411402 90446 68580 61362 -246924 -111141
8748 -143013 208790 -100936 -381146 66812 53189 -116859 175233 -305296 -114337 88310
8737 101073 -226800 -304010 -243451 -178491 -258402 -192217 201267 -240424 269186 -83156 -152607
8726 -152607 60357 -280368 -447453 -46493 202836 149274 -100806 -50130 -216845 297166
8715 201953 -100906 -16569 -59505 -86698 113731 242869 -90755 243622 -318469 -30616 -258522
8704 -258522 -38556 61887 126185 -79240 -29058 -283407 -7945 161777 -100398 -19540 -48847
8693 -48847 -269988 -294041 -253737 102323 86647 141326 -60272 -70608 67054 134124 -105255
8681 -194517 -59795 -189398 8333 -261711 137782 -134573 319427 72318 118921 5593 -50916
8669 -2509 -300391 17555 11486 -119357 -189018 -185931 142522 36142 337957 191423 -43749
8657 -389255 -37528 -121831 -114561 -309815 19768 186366 -374678 -199799 262441 53807 186245
8646 186245 -182991 236170 110469 -296633 -193360 -292681 -76013 -257754 -136549 26707
8635 326988 -192963 -264507 -197233 94019 394603 56429 93583 213078 114824 -16617 19886
8623 -177839 220873 -41242 -245846 -222952 -41699 -202292 132130 -323694 -165849 -143035
8613 -143035 -209470 -1383 -8855 -21395 201027 -2946 -47270 -291102 -133992 -12915 -117204
8602 -117204 123841 -139206 121453 22426 -49631 162981 151323 -103118 118727 -200138
8591 34073 60001 124265 -202127 -155054 -139705 -53455 32016 224978 -456655 283986 -73356
8579 -79670 -331657 -177664 -3785 -404933 80103 117948 -354766 -286825 -378571 -301778 -278896
8568 -278896 23414 -107415 -9180 154704 379833 126468 -155960 172398 105296 -15757 -137374
8557 -137374 -126259 -371421 -17114 117006 -344444 -153002 -50847 48310 -79917 -388211 42422
8545 -46310 6611 4062 -135722 178001 -65930 78608 239625 -28360 -103751 137433 -49530
8533 193741 -36949 22428 112462 -275835 -114223 250498 -86840 -118713 -353149 -82407 411567
8521 -50378 102737 -59076 -97220 -141590 -212369 -89042 -111733 -192631 149163 -287776 -31861
8509 103920 -110495 -148782 42191 -37889 32076 -237101 -207464 -193074 229388 -37851 183399
8497 101073 256 -121553 165331 -224703 106668 -7399 -99102 -98065 -57574 14093 13208 55195
8485 55195 -279798 -238470 -414628 260239 -155187 158324 -83253 -108143 -144847 104779 24503
8473 -73164 7624 57220 -34322 -57338 -235849 -430313 -92339 49158 -115204 114724 -9667
8461 -254438 -172335 -229150 -84329 -5316 -15905 158676 -107504 -211017 -210134 -46551 -138948 -141007
8449 -141007 -73068 -17037 269427 -158302 6671 252181 -43707 -274627 11238 117801 138038
8438 138038 47549 -46046 268202 -259268 109164 213754 -62519 31014 -106164 -267836
8428 -267836 -41665 -182719 -177509 333315 66750 -540300 120788 -72218 -101703 67302 159965
8417 159965 -21515 -10110 -191415 -248051 -286077 -3952 -75263 -54883 -25791 -18281 143695 -44809
8404 -193768 197481 67351 -39621 47295 22439 -348114 -186625 378675 279915 206081 185017
8393 185017 -287178 -22936 -66426 -233635 -365426 -496007 -25558 -166402 -176568 -220053 -13634
8381 3692 -10872 -198421 186064 77088 -312241 -140480 289825 -1484 -175513 -45674 17281
8369 -101376 -427603 -160341 -155021 10848 -2621 209415 -281623 89808 96885 -81282 -175001
8358 -175001 -163318 189338 -36545 -79687 113506 -13556 -57022 24081 63616 135248 54668
8346 -172178 -88640 -134123 -41503 125557 -365516 36018 -225327 22446 -157430 202291 40031
8334 -32297 -180890 175101 -65525 -97126 172977 179650 -67305 95317 -129706 -47426 310399
8322 -179127 30022 -46804 60563 -93899 -29893 185290 46142 -239304 84870 -234103 374231
8310 175038 296625 267035 -171294 50691 -151274 -92210 -315545 103780 -290293 -214424
8300 -214424 -80064 14276 24703 -320122 -156707 319382 -199581 402530 218864 -67995
8289 -398319 -40818 -228046 -40803 -198547 -183322 -82323 354326 -22326 11880 -88338 11813
8277 -50886 -134485 -69720 80784 -109526 -334725 -46997 -191974 -11419 -131157 -323276 -168857
8266 -168857 7401 -153926 -208469 -142408 -59455 -382933 -108874 223322 244181 -312976 -36245
8254 260752 27480 -182635 101785 -109098 86559 -102669 227006 -23876 -255326 259055
8243 -40109 45248 -129763 -310876 193168 -70245 159751 -305075 -5309 132022 -19804 -203168
8232 -203168 -64172 54352 69360 -199603 13053 -65995 89532 -86354 131319 -20089 -342846
8221 -342846 -194051 -191517 311799 -218333 -126617 -270196 -309456 20684 5380 -57290 -25330
8209 -193344 -54210 -44018 98441 -16309 -503063 -576318 76471 -170496 58697 329113 7867
8197 51172 -98514 -277453 433159 -259163 -64916 174477 -93280 -126728 36885 -212203 86189
8185 23782 123216 -343159 -250438 -2170 -16039 -242020 70302 -111563 -117638 104147 128576
8174 128576 124213 114516 131903 33531 -334355 -230044 70889 320029 -78722 8772 130129
8163 130129 -251477 16191 18284 -19194 -8940 99389 218706 170593 16982 -225181 -236769
8152 -236769 154661 315584 19503 -181107 -144365 254925 -35174 -280932 -398406 74551
8141 185810 -59313 -146816 -77744 -179114 274862 -124682 -100283 -197538 -312851 -155099 -138006
8130 -138006 -235768 -223165 -452347 -140789 -463909 230478 -305428 -157714 68456 -34900
8119 33501 -107885 50349 189528 -123164 28733 24149 192948 149243 -30107 -86016 151874
8107 -74577 127358 -435902 123153 -112939 -205990 -245358 -22432 8039 -144633 -157061 -43602
8095 141603 65457 15770 -283320 194638 -77224 252218 422225 -167603 -181344 39480 1509
8083 -278234 -26888 -108054 77942 -64843 11973 84336 -41583 -274479 22619 249842 -366949
8071 287561 221044 -22911 333220 -154762 205240 -137427 189521 -102529 89575 -21574
8060 -268837 14375 -125540 183217 -156841 -272211 -139980 115011 289238 -115910 -6764
8049 -245114 -122825 20483 -148689 340736 -191487 -205688 63079 -33685 66171 -162298 -177751
8038 -177751 -5308 -207184 -110502 190075 181791 -97508 -86167 -152048 -159195 6695 -72904 -163091
8026 -163091 -21804 -38852 -170926 2480 -74359 143617 -198022 -123379 -33971 -71662 100522
8014 -96582 -96745 -277307 -287337 74627 -93082 -131602 -37320 -235010 -119636 -178265 450257
8002 -17888 -73229 55438 111806 168887 -42923 104851 -189513 94573 154980 -445632 -37344
7990 57658 177205 -129284 68505 -333978 108836 -123637 8544 51486 129482 -135733 -120557
7979 -120557 -235154 -161891 -141832 -478478 -41538 -185657 -104588 -235492 -133016 -242110
7969 -242110 -258616 -126198 -44574 95153 123876 296371 46882 232097 -178147 -293193 -53368
7957 32136 121580 -22181 -249205 138997 -279990 163617 99996 -174652 -246021 4860 -278259
7945 -201546 47598 -77913 -39946 56411 -48097 -104032 49993 -130070 -66492 125303 85460
7934 85460 -315063 45314 414368 -43954 -30777 -76338 -238843 26384 5722 -117250 -285753
7923 -285753 83566 -48334 -410563 -92744 34729 -29207 -182118 247330 241318 -7502 -41755
7912 -41755 108633 -74159 209794 -119765 -39971 48075 101869 -11312 214447 11517 255207
7901 255207 -450197 -220526 71449 -76980 159300 -217698 308739 -174346 -61568 73799
7890 -136602 333643 243972 36413 -207867 -52068 -235773 -182397 72079 -18365 -5476 148078
7878 4939 -211487 -253612 129471 126609 81274 -143718 30113 -231710 -36719 228190 -31446
7866 84921 -167334 -150277 -157671 -51802 231285 227772 29823 -217108 -319321 -80519 -333470
7855 -333470 215397 -75884 -48062 100407 -259692 201641 -45038 -227672 144519 -234368
7844 319938 -45889 297286 -219909 292008 4691 422211 191735 108915 -173449 -148843 -312486
7833 -312486 145915 49276 -174841 -361416 -121678 -154115 55741 -278627 70292 251772
7823 251772 67070 32782 -136895 21642 140301 -169099 260219 191912 -204191 -403491
7813 -403491 329237 -266761 106948 135177 -92564 82326 -103733 -344136 -115466 240473
7802 -371888 42658 467527 -214178 66937 41910 -213620 63747 -172065 96843 -54347 -39549
7791 -39549 -324843 -132458 -222431 -322030 34135 105411 -6222 -12809 -258096 -163307 -260923 -17879
7778 207423 264983 58533 113434 47051 -288005 -192876 59618 -130907 8122 104854 216244
7767 216244 -89479 -138228 91894 125840 100658 103093 -421512 291164 -59364 104711 -32803
7755 -37533 -127127 -46396 -38945 34109 36051 123311 63987 -249895 -316446 119785 57193 -102921
7742 -553686 -134047 -150751 -54449 -218810 -353619 -154297 103208 110238 -162721 -27714 60582
7730 183572 17344 -69788 384324 -123302 216672 242581 102961 425867 -289316 57174
7719 128404 236607 290006 334427 85311 450496 -393584 165429 279404 -11484 -71600 -69449
7708 -69449 238224 98383 245069 -154769 -283077 24006 398620 99217 -27185 -95925 -95353
7697 -95353 91172 -4150 -399297 -315282 -145021 -44986 106268 -27784 -73350 108046 -158918
7685 -116258 23057 151301 -168898 18150 136394 -251437 -113367 73549 154790 -49665 -74808
7674 -74808 18693 38221 -66480 -116319 -96336 -70824 -356493 -65131 -56748 -101591 -64851 27703
7661 -428528 -142066 -91434 -237930 96914 14760 277315 -77971 -1916 -48713 -223738 -182919
7650 -182919 -227142 -113504 154556 -223322 -28777 -32620 -190806 -45323 94898 227581 -29034
7638 -158818 25386 -74778 -245039 72142 -491720 -232302 25849 -49582 -114054 -174154 44243
7626 -86367 -120294 154957 -85723 -95831 110231 322227 -49191 -18473 -655961 -91683 -245232
7615 -245232 -223494 -95445 12289 -104458 -244064 -5144 -6374 119850 59654 -177927 319441
7603 193312 134309 180187 -179614 37726 -197604 -199163 -41178 -343168 -356071 -15850 -4560
7591 86921 57701 87553 -65577 -44694 -60341 21973 113746 -309402 39677 -219466 -19117
7579 234421 -6593 -458971 -293457 206338 24632 90893 392993 -60350 -217793 -199571 19028
7567 205655 -109282 -123052 -55135 313102 267493 19986 -172205 -314738 89337 -120581 -489895
7556 -489895 -36607 126313 -242916 18581 251052 100790 535920 -166485 -319494 20140
7545 228164 94364 4559 59238 -183197 -320996 -95873 -82949 195717 -108635 465917 -66966
7533 -187718 175759 -119163 15436 -97668 44274 173791 -195952 31434 146137 -91410 74082
7521 167633 -197524 29075 161417 -122656 34236 -171918 19283 180383 -114559 -150669
7511 -150669 -229297 -272539 63310 -13361 -133732 24364 -149665 -110651 -15999 -305417 144826
7499 -205542 117219 -49872 95594 89495 -130891 170436 43710 -232925 -174617 106298 6856
7487 -191519 94382 -5193 -28648 107149 -35947 248789 31699 -106480 -381236 113141 213103
7476 213103 -137296 -136064 214600 58404 146738 95595 -188985 141480 201760 215314 204110
7465 204110 26259 -21321 -107263 -3975 -69872 -453240 -118065 -9933 14028 -62063 17021 -69539
7452 -13375 -32663 -224196 39375 -32790 -59896 -49593 -159140 -220578 -296679 -349200 -184560
7441 -184560 -30009 -181079 -152774 -90188 487308 47078 164617 -3705 -255075 -172448 66170
7429 -212535 -67526 -120520 288758 42531 -453577 -34715 -21536 143010 92796 -293196 124991
7417 -58752 -80367 209520 -185377 -89714 -99577 20770 -87906 126110 109429 -161601 -229957
7406 -229957 -2278 -68108 -82242 18348 -374919 32696 128642 -121925 -34126 59249 228785
7395 228785 245644 -173059 -198522 42264 7347 191806 -220087 -259688 94222 57129 -410792
7383 101566 -99632 121986 -24060 -285221 -62522 -271650 123989 126838 -96479 -174723 124270
7371 -146986 169508 -224913 82255 95547 -254494 -253185 5111 2183 -234080 -112086 -80630
7360 -80630 -326184 -140041 2306 154630 171269 333010 -145079 300995 91432 -250293 259882
7348 -70311 33650 -130739 102643 88121 199496 -459546 -77395 -110325 -162893 104434 189258
7337 189258 4756 -73977 3238 53163 136306 -238252 -72363 -36127 -29610 -10898 338466 -150873
7324 420520 17742 93064 17241 -123864 -80420 -91845 259562 259004 143234 220947 153362
7313 153362 105645 191292 -130962 -475897 -54891 82319 -39355 -267125 100616 -217417 240378
7301 8747 65606 -9766 -220534 -229325 -79144 56778 -53164 -21885 60872 112080 -90886 169102
7288 -421430 305435 216138 -294319 107138 -225177 38249 146023 -41169 -86388 -39086 46084
7276 -5200 76437 216944 -27924 22372 -204855 165294 -246342 -82938 -2422 -435285 -92341
7264 67860 -272324 24270 -70344 6994 51096 -46120 -361792 -93627 83081 -94484 -6509 -22848
7252 -22848 -32884 -35380 26574 -49359 84472 23729 -165876 -2577 -138213 21620 76834 95394
7240 95394 170182 200818 -56006 79099 -117975 -491067 -182628 -57926 -170567 206455 -208467
7228 -207246 129492 -76024 -174542 45761 -30372 -145555 -251611 123531 93260 -112359 -65566
7217 -65566 -86698 172656 223736 244 158343 -163175 105348 96434 94407 608082 129831
7205 21936 337869 -305447 40955 -12867 137049 117732 -139708 81315 158065 -135861 77194
7193 -194091 -293976 233405 -431928 -30237 22267 58055 -65012 -42982 74244 -359294 191951
7181 7904 357071 -152837 -80695 -40711 62976 36847 -72186 442445 29432 -13415 159613
7169 105655 -318450 -18388 -4511 -397351 82689 -14553 126791 -234682 -112690 -79825 -122674
7158 -122674 71314 -256845 101840 -134101 -55158 -149701 -334040 31841 13 29337 -7431 -251884
7146 -251884 -37358 -93150 258604 -83260 -67767 -158420 -267802 232391 14643 -149665 80177
7134 193623 -61742 43425 -423184 131693 29671 195218 -187170 -128233 -48171 99808 -101590
7122 -51996 34401 -138522 49336 -231706 -65954 -206206 149831 258867 66874 358205 38142
7110 109200 83039 147619 -55053 51815 156682 208461 170909 104440 -367123 42675 -181237
7098 -42376 413056 -63164 205730 -124351 249333 203078 174357 -114765 -344530 -409791 174962
7086 -187285 159864 204064 67753 -328013 -220873 -278848 184279 -88247 150112 222031 -45581
7074 -56547 -143826 118618 82343 -214588 -64985 36872 64942 -3139 191834 64716 -27062
7062 -106192 57146 -61326 -115809 25855 -25415 -263952 -104055 -70312 59511 -135056 -43872
7050 198793 -146920 -133158 281010 -33062 -180523 61548 -155996 -10868 -1460 -117652 -113556
7039 -113556 -125941 198345 -295885 -209523 108741 207960 -74209 -420288 150835 150426 36945
7027 -181247 19771 65704 258016 -8691 -237348 -385750 -81761 -295803 -198308 217194 -73714
7015 -314800 -138490 -71940 2450 340572 -47246 -48957 -140269 141133 -276161 -333683 102176
7003 222409 256401 -139252 -261687 179872 -83967 177342 -396514 318593 -14255 39362
6992 -121406 -333422 -172004 29483 -346844 116306 142168 -143677 -8861 -320958 -16027 193136
6980 85298 -61300 -160728 -42925 -104936 -355191 -142139 -70461 -62340 60115 34606 293793
6969 293793 222846 163921 -78281 189849 25221 186901 -42315 -55102 -31320 62618 134035
6958 134035 -95405 -115489 -104232 -8082 -9958 -83677 -121910 12645 119515 -137645 -22999 250106
6945 -243948 -143834 -135699 202134 142163 363960 -75204 23180 -95563 94211 -67235 -337866
6934 -337866 443 206186 125265 48273 -301292 92127 -169953 -63315 301143 178012 -244402
6922 -43482 -219713 -106181 -233998 -41556 -141993 -234146 378062 70169 62921 45205 196361
6911 196361 99277 71413 21641 -188429 72701 209037 -148767 -30119 -214247 -88741 153437
6899 -147567 168693 -28572 217889 61441 3424 22857 82296 -13255 277287 -117546 -39133
6887 154972 79945 -93643 -88552 -201395 25598 -21377 -10421 -19035 520203 -154131 120102
6875 11787 -31672 198430 -229943 186974 145689 -167907 -38703 150508 79838 129775 -239626
6863 2738 92462 168040 -151417 -205171 -116530 147957 78108 -195757 112306 301119 334139
6852 334139 57577 -61651 -132243 -94412 -227280 -73396 377063 -180235 -1543 224886 74024
6840 -35443 -34011 28801 -173592 177394 154 -274664 -42818 185548 -141568 20070 9699 -264580
6827 -268267 -48512 126742 8294 -173962 379719 365444 -45209 -202274 425285 -132397 69746
6815 -346405 -106516 -177607 -33410 -50032 149083 -90862 -45267 321158 -229973 -441614 -6148
6803 -399937 -437719 -158494 -18172 210393 -31433 -207445 151605 105552 385336 206847
6793 206847 374120 189201 5940 233652 32868 -58260 128374 3907 -435981 -35855 175912
6781 308810 -259147 31499 -485435 -76528 196850 -281795 -83272 205031 -253825 -216344
6771 -216344 105291 -109686 -9721 238934 52401 99622 15099 145850 -191816 -118194 -138473
6760 -138473 254028 157280 -240330 55823 75839 46447 62571 146995 201764 -378800 -185030
6748 175895 -13180 252005 -58834 -224997 -45008 -94102 -203442 -62853 114400 51209 -167402
6736 131832 -249903 81542 -61931 15459 89019 -75197 -181906 -966 -156872 -58487 -303521
6725 -303521 145871 -352881 -116482 -138854 -39428 259888 56206 111953 26818 -210181 -93689
6713 34717 -70040 47756 210338 -86255 -32809 -259164 84786 -29535 -89086 26296 25802 117653
6701 117653 -361729 -9320 -376874 -150494 2952 361035 -262925 152487 79048 136297 380441
6690 380441 -78039 118481 -116230 -60185 -119912 51654 -297061 -190631 40878 -91193 -334904
6679 -334904 -60279 273846 -160202 -75697 -54819 -261914 -166562 11003 58905 -99925 169083
6667 -81837 -14551 -20513 -73999 92503 -110903 -78009 337850 -70885 152103 -144186 -56115
6655 80191 86581 -376845 127409 -34554 -85975 -329833 110876 163905 275844 102720 -31635
6643 -118047 -269390 -135804 -135379 21042 -198973 -142625 238751 -225945 -10244 -129486 -328252
6632 -328252 177072 133114 -29621 -15779 -20562 -139582 -299172 -59366 -147011 -129490 314307
6620 192219 124976 26706 -164219 22715 169073 -250047 269220 -263781 -18703 118575
6609 -121174 -70344 52313 73661 60033 46559 -44335 -222101 127332 -78972 335449 56074
6597 -44754 120296 -242616 30179 -294838 -269318 74402 13140 -318188 460917 171267 -98772
6585 80262 142544 63752 90370 144020 133793 214600 168768 -293872 32116 237068 94520
6573 -11107 236851 69047 -218357 -362275 175072 161870 -66575 21589 330294 139520 190258
6562 190258 -59858 147955 153014 55733 -71537 57682 299870 -417098 370470 -350261 38072
6550 -136451 75389 -502696 -53948 -38955 221805 73341 46927 93072 -129742 149031 127124
6539 127124 80187 -171385 -210203 113735 225946 268654 156123 139987 -197584 57190 13330
6527 146693 35420 -70792 -349578 -41214 -29027 201370 -277682 23142 -630 131922 -81267
6515 56747 44083 38631 -125759 -204866 23471 93473 -256583 -179009 -215777 -292969 -52091 6210
6502 20653 -238881 342937 -349246 -95983 -300711 -98394 -142564 148250 337 12731 -90600
6490 15250 73944 -80322 -8962 169500 -241070 -132638 -140698 320615 31545 238400 -371185
6478 321787 -246404 110504 -127290 300593 106007 -195663 47705 -37993 -83809 172935
6467 47225 130987 -345305 -313381 22924 355696 7422 9200 169024 203405 -20377 42065 -240578
6454 279506 109828 -217267 -39674 46038 -168788 -1381 -44490 11872 212026 -120462 -209283
6443 -209283 139954 119347 74616 81048 30729 -368415 134743 -154402 114897 -144000 -224704
6432 -224704 -158005 -51582 -66899 -337438 -171312 -94510 44627 87586 53183 -84019 -70199
6421 -70199 -171029 -64426 270074 174583 -2432 107644 -204023 127341 95511 -153777 -143983
6410 -143983 -158391 -20932 150042 278492 -48072 -91772 203768 -18480 119726 -95166 32471
6398 -207980 -153288 -135907 -29136 -65071 86767 -202936 -215091 -272985 229569 -151882 -100237
6387 -100237 -124059 135429 292879 90835 -325467 74217 -243559 33457 -91290 88180 50219
6376 50219 -79497 -334855 -120837 -75180 40428 188573 -177632 -17588 -105626 32191 -83053
6364 76369 152678 -187960 44702 227748 38644 273276 -198857 48978 -323174 67841 -151323
6352 -251232 83226 -263470 109908 175314 -25203 425697 -29447 -216480 23061 230627 -180994
6340 459805 -228964 178708 43860 26477 161340 338097 -473012 34801 -142282 217796
6329 125930 -149159 51380 -203567 -89457 -183747 -42531 -80997 -160622 -116168 72733 149911
6318 149911 175535 -187172 -136249 -9056 -348774 2908 -88590 -261643 -111102 314462 -35849
6306 49275 73013 297459 75559 48890 73465 138576 -293685 81341 -277231 -36238 252869
6294 -45306 83324 79659 -220481 123196 -133028 -276811 85941 18053 -349899 -322243 179464
6282 -4545 160705 -292333 159417 16684 -10500 -385551 55586 -141526 -249298 5193 -439032
6270 198587 -172484 -295920 -220190 59365 -22979 73430 -212058 -184764 -114968 105564 301857
6259 301857 71531 366936 -54632 -39763 -112607 -213676 143603 13368 -134321 -135348 16067
6247 100646 18849 -7191 48459 -232413 -32013 -226615 214932 -20778 -195037 66940 87327
6236 87327 -42498 103833 49719 149584 427795 -88420 -148345 -345110 37935 232477 -311372
6224 -145982 52716 -161872 -256915 -73021 -74155 98987 -12800 -186314 97871 33652 115646
6213 115646 -84857 -143799 -174933 -177908 271894 238340 25043 161534 189062 -140743 336987
6201 -282356 174306 263967 88316 192364 -57853 3683 -49861 -8837 87340 192801 -39013
6189 -239776 -227363 225264 -20968 -116542 -223296 284889 -36270 -142682 110999 288842
6179 288842 125774 297060 -49475 -56 51595 12933 -51334 -113211 28500 133616 -145322
6167 78975 51607 -31350 249701 36185 104628 -20236 44420 222778 -138391 201738 -102708
6155 -199994 180293 -428489 -74896 180485 -167588 -190567 -111900 339891 32683 -112095
6144 34320 81913 23129 46072 171202 76517 -357307 -209936 -136635 -196111 52462 -21833
6132 156656 197517 -325412 67316 -121748 -61445 -44788 -128183 491002 142122 189113 -51599
6120 7213 41418 103500 -258284 -111798 -96139 -261841 315272 494958 -23006 62308 128516
6109 128516 -27636 -109318 22782 287672 -195252 101699 -288 -111215 174381 -20873 207547
6097 67580 -89358 132427 170998 -72903 6530 -119166 61955 217966 56426 259923 65858
6085 -235551 7470 57224 -86707 75020 -10003 -236132 -44442 351674 144690 -42573 26660
6073 81129 303548 141732 -372971 -38122 192272 -211031 -79724 102957 194361 -19595 -14011
6062 -14011 -166778 -45022 37920 136331 -501730 -135098 -374617 175850 231954 -128111 -125558
6051 -125558 -80254 100346 -72824 -147666 19270 361226 -8010 113736 -83694 -49694 41995
6039 -340577 146171 -612248 66780 -128587 -19671 173910 86854 -41914 113842 -15962 -48114
6028 -48114 -47916 -72506 -40505 -70357 -159129 -213441 -102872 -456540 -186024 96565 208299
6017 208299 -20729 75185 101240 62085 -476537 -8 69656 -17696 241925 68155 -90290 -126415
6005 -126415 351208 -58094 85373 186499 162193 32806 183515 31434 -51776 -335598 -99533
5993 66730 -12722 -472747 -137852 19857 -30539 419548 -65319 261135 131388 -369226 -193689
5982 -193689 -238808 73087 -278678 -55157 10974 -91828 200493 289653 85250 -316411 -130581
5970 -114289 9595 354201 -133455 109283 -136401 -206571 64288 -361907 -44414 -114246 217900
5958 -72939 -244652 -132237 518639 78354 -197596 104881 -3000 -120440 98658 -65939 -189687
5947 -189687 105037 107374 -95483 -2210 12525 16936 -221851 -250125 150888 -39383 116942
5935 123893 -204828 -357143 85595 7225 72393 -183342 -811 -57596 -386683 -263545 202429
5923 -182852 -369383 -102497 -181278 260624 103830 14188 -98040 270912 -372799 22032
5912 -264133 234043 258879 243024 24031 161342 220382 -215989 -22135 -272621 169699 45552
5900 202562 126155 99168 53469 121083 199715 -68139 -27653 -371591 -16174 55051 432628
5889 432628 -403901 400285 -101489 -7025 202554 -7093 111748 -24053 -6090 -24737 -47318
5878 -47318 -156848 -217030 92934 -303530 106544 -36184 -225970 -115317 -130738 155343 -137018
5866 21454 183717 -9499 58107 -236145 -133377 11540 158770 -193850 119841 -69660 -401564
5855 -401564 -156891 -183426 304034 -186502 131345 -81686 -103639 144819 -78654 41986 -187962
5843 -209607 -295854 46641 57891 243440 14051 -57925 392140 39479 41489 -231889 157684
5831 43106 -315987 -215671 -19510 -133924 -11679 -96393 -354467 192179 -117674 233597
5820 -10679 248988 369131 142071 -149848 -200868 -206455 49938 79843 -119538 -347511 218064
5808 246980 -108590 154688 -95851 80938 169298 -259880 -302391 337154 -40605 -256969 -157804
5797 -157804 309026 295877 89974 127605 -368296 157146 192028 -129527 152799 -60270 -19770
5785 -262180 -149174 -69296 -326940 -26754 -147005 -90363 -76543 324538 84886 123618 227949
5774 227949 -107838 -70685 48255 -11992 -433 -365779 146495 -274495 64669 -306051 -301903
5763 -301903 -156849 111256 173019 108130 110214 291101 168143 48252 -163595 182550 88536
5751 149362 -71302 -139080 74412 58582 96198 328545 177385 -261691 116269 -138045 13426
5739 116969 -217290 -131420 -55447 -186052 -173662 268215 -203668 -137388 158117 -5842 -67826
5728 -67826 293930 -132601 -253354 166883 177808 157399 -365928 -9155 -68874 -18375 -112358
5717 -112358 235921 -80502 155466 234191 -149437 -161140 -68470 68194 -15990 90714 23384
5705 9750 247317 234708 -88628 -117826 -43497 -82767 -16293 77032 20833 -221147 -22926 272350
5692 -53904 114199 -108023 144992 268632 48173 -127578 179166 115746 390807 54770
5681 150152 21832 21182 74158 83285 -66411 90053 -126646 -311137 78017 84383 -235240 -115299
5668 54539 -24599 198513 -82898 -22385 -114779 76243 121428 292527 85083 -89125 -272090
5657 -272090 6348 -61907 60856 -32264 -99922 32141 -393865 -452 -127655 159402 203713 207983
5645 207983 -21325 -136038 -43581 -246650 -51364 121568 -255276 105057 402124 -136735
5634 210834 371553 -277157 52087 -27679 153527 -116992 39433 -159004 -33016 -81251 -198104
5623 -198104 81253 140068 197608 169068 230045 158429 91088 -66906 -136102 208170 418013
5612 418013 -93982 76994 -36841 -3410 205675 -161849 -55245 219097 182530 113863 -208797
5600 -48958 235914 -6535 100115 -191417 25343 -24261 -128089 -265267 63316 -114101 102062
5588 -42028 -135832 -65970 202725 -93026 64179 239057 -62118 7658 169044 -232268 -35501
5576 266665 -266044 111439 -198635 -101508 71664 37197 -35548 -113023 -246695 -166204 -38388
5564 -58037 56192 -255858 -205284 -198882 257038 -93703 -322590 206713 -86296 160693 -83315
5552 131455 -170252 233489 75158 17411 5992 14683 -12236 -214257 122966 -30547 -103957
5541 -103957 18657 -271967 -180884 -272360 128101 97477 -168208 66925 -1639 -7127 223686
5529 174994 -18583 111998 -14458 215448 24311 164567 80114 60331 -54520 138521 -37406
5517 55303 143579 -232257 -279732 -42101 -164463 135516 -184803 199141 189455 136917 -165940
5505 142804 249819 -14196 123962 157844 -314472 10265 -36270 119756 -78114 92729 -143119
5493 30987 -77025 -226365 -70436 -12489 -37369 -14140 -114248 6595 -25777 -142454 132527
5481 -346010 6553 123453 1921 10807 170539 373665 122850 -12846 131768 -20920 48025
5469 149813 -210095 -160876 35782 -73367 320526 89523 -252669 198147 302122 -9407 5514
5457 127375 294551 12931 -229116 -291999 -98710 -49560 -91297 -160047 214025 40225 281875
5446 281875 120295 -9566 130151 -66624 63836 -224968 -100930 -217922 220464 -216077
5435 -157458 205425 -122335 -38813 -130255 12658 -82197 5990 384528 -73010 84910 -320509
5423 -509684 -124903 132153 565287 -31210 -318023 27764 115627 43994 -55669 118457 -17301
5411 -36237 480196 -33824 316091 -2782 248556 171097 140564 195521 52979 -95189 131130
5399 -237332 105355 -10292 172334 94897 238612 54690 233108 -89564 119858 432185
5389 432185 19405 -116063 -163420 -74991 58718 42502 -390199 387884 -129931 21219 80097
5378 80097 378878 -286823 -220897 239325 -82843 34083 -350331 76487 -292753 5301 -209558
5366 -105205 215 -211776 136866 -139898 93987 339862 101291 -49413 -30851 132059 79632
5355 79632 -18130 17180 -143910 35419 -72671 251949 -57041 -197757 148922 139725 -158987
5343 -297793 226486 -321947 -124151 -421148 -129561 75979 -58021 118451 306553 140345
5332 27569 272889 -275957 -189514 532750 62659 -123921 126716 194155 168296 -118206 -203713
5321 -203713 62621 -44952 119279 38372 -88042 -97815 73944 -41970 -34474 -116226 -86567 -188075
5309 -188075 34457 -66528 -283325 234513 192803 -20073 -313578 -48743 282898 -77667 -65660
5298 -65660 -57356 7736 25170 -52960 193820 -108607 69497 176759 -28544 -36045 31745 366017
5286 366017 -27846 39087 345067 -73640 -94247 -11782 -190176 -260041 -150314 55884 55113
5275 55113 -27208 115497 -104433 161601 -36079 78898 -82798 -332768 -404958 84772 -210335
5263 -12123 162092 -88009 37774 -117901 -179607 232465 -148170 109973 -4138 11549 66539
5252 66539 -171908 286335 -6845 496727 147167 20138 -40211 109804 -55784 17832 -406691
5240 -273956 -11084 -131671 59596 20070 85593 -5649 423736 -29712 -100074 -298984 140273
5228 -151343 31687 188675 -191164 -239373 103058 85312 53463 -44703 300172 -180608 -175794
5217 -175794 152715 -248645 -252945 38901 -221010 92873 46899 -7567 118017 -160103 73808
5205 275413 207831 -181654 -55293 129152 137518 -197275 45584 38179 -3144 75945 -270567
5193 -28341 175781 -2994 133516 89429 84320 -229208 -351147 -172226 101308 151775 54964
5181 -49928 100051 -36720 -191643 -59128 -329219 -33859 -133537 35378 -158516 -47184 253876
5169 -160011 183647 51723 103445 80823 36070 -39988 -37722 119218 138442 152614 60457
5157 -34630 -83928 204195 -143154 -119006 -135301 -77621 -215359 -115278 276185 104249 -2311
5145 -178839 131713 -207072 50002 -302223 -43552 -147182 253399 134088 -163664 -116243
5135 -116243 -119839 62822 -301307 -32231 42228 124004 -82567 238437 35022 236880 290342
5124 290342 63440 309317 312770 -843 -38236 175051 56838 -121225 120028 216249 -83908
5112 -65256 90198 -215257 55728 -122180 -75366 -206091 -87900 -169888 -10094 17391 -14239
5100 -24088 123242 39156 -80586 -434231 87791 4061 -204662 -277325 87636 -163091 86123
5088 317700 214886 -181668 344728 74787 31277 -144976 5393 71647 -166552 314681 -74172
5076 -179421 -391834 18621 138846 66300 -279655 -104930 271265 383087 -291334 298487
5065 -250605 85047 64898 -283829 -91610 151535 49607 147191 157119 -139762 -54572 247865
5053 -272650 -181555 -238005 -216559 -6205 78396 159614 -135966 -241137 -93177 235030 55292
5041 206935 122024 -227766 -289376 41208 48434 -28973 -136604 318254 187045 -172539 -339563
5030 -339563 -31867 104379 302032 16318 118101 127432 132704 -24760 65119 16498 188405
5019 188405 51762 42614 -377989 103058 25997 -108174 -96771 25336 -165552 55235 -16861
5007 -361267 300710 -288930 -105914 -41352 203961 118843 181670 126378 -159011 -44906 -126688
4996 -126688 5524 55011 -32750 45725 229786 1974 -104722 65201 116442 -30873 -51174 211822
4983 -29685 -32460 49424 -59165 135279 -238902 51376 -18914 57016 107910 -31307 431858
4971 156102 -113332 188042 -76221 238548 -106866 -15074 -270283 -30306 -169630 -41123
4960 120554 161116 -13981 40558 4793 204085 -318299 55182 -37064 173873 -296238 31687
4948 328383 27243 -69488 101683 123173 -145900 -180589 148702 -51223 54861 -52043 -19105
4936 317803 104222 239299 178672 -23387 229506 224285 63945 244050 -244125 208165 313659
4925 313659 -36982 184367 364463 14322 -161593 -4807 -9040 7753 -233522 133773 -93960
4913 -116540 42333 242628 -144360 279669 -4598 -180119 173818 458457 19269 -40207 136421
4901 63086 211284 73313 207720 355694 139010 -23565 258364 -21435 -73067 73606 -12006
4889 -158726 -100353 -50501 -47468 -10019 161461 -37987 339842 94753 -403329 -64671 280283
4877 -63507 85868 -71571 -125134 114665 12288 -203675 -60646 -5426 68707 -6850 197077 -137120
4864 37122 235176 88935 -42099 215280 -236101 90239 -201030 415428 -168781 -224861 33248
4852 138386 96591 336919 -308093 15601 258525 -86374 203972 237002 -62222 270517 398107
4841 398107 48865 252928 217889 -12395 -246234 -236685 -178049 15220 -101082 68512 9932
4829 -12141 309585 284045 44015 -163903 -226782 -196488 155633 -13369 -196915 -116109 185591
4817 -92240 -59745 88600 -331332 18409 -129872 127013 -98877 194152 132858 145375 -95475
4805 -146740 210053 108457 -92707 106052 -247791 -105840 -336372 -80734 644240 67958
4794 -46911 -116887 -432783 84332 133008 -265403 134766 -354610 -364809 -385357 73095 -87171
4782 103030 -128208 48163 -3744 145283 -253447 114101 15997 -65851 -153288 86175 56101
4771 56101 175037 86787 -76244 -13181 35020 -257200 37956 -21454 -151574 -316722 -47222
4759 301778 -397864 -392640 -98821 -77629 180555 -9622 113361 12535 -355089 -155913 -128119
4748 -128119 -193731 -96205 135794 72886 7231 -6864 36340 -230959 133843 118266 -40919
4736 -75721 14488 107177 -64445 -18314 -162554 82805 -129284 -75011 14690 50873 170401
4725 170401 -24793 68144 -112097 144689 -207736 129891 79653 140255 166038 -44146 168366
4713 39583 -163740 129766 -55849 38473 74214 158062 44498 -30492 56571 140989 -88040
4701 -37775 -18449 104651 83851 -24301 -29630 129462 62161 -165748 -107991 213693 -18473
4689 57178 -264808 57914 -115156 98052 -28166 143344 -177666 -182313 -189349 -349748 145317
4677 -322927 -252389 -78401 169229 115141 -223268 211547 -36694 4269 -131861 60708 -75084
4665 -142226 147129 249018 -321403 350630 140305 91775 -142830 70825 -248467 58610
4654 184019 321525 -26437 195879 -116436 -73261 218963 194535 -89982 21697 68220 255845
4643 255845 -27844 10259 -98008 -368513 -49299 155887 -30961 60742 -177179 125086 -153674
4631 -48447 -209855 -23027 42622 148272 -47129 -236630 -183756 376166 255282 -233851 -26041
4619 -24158 108853 92495 21568 98504 -10049 -197626 -211842 148959 -153556 -133237 102725
4607 169001 -79458 95995 345131 159399 372535 134582 183122 -33834 -129071 -25609 171596
4595 -124047 -177152 -72754 -103845 250427 -272581 120883 56683 10392 227252 107139 -362095
4583 28910 -130407 -134172 -241913 -265586 172610 -125456 -364475 110300 -268901 199296
4572 -18877 58534 64669 -3769 228676 124304 270738 61418 -43433 -259599 42709 -185033
4560 -73515 154913 95097 87702 -262309 -141672 315015 100743 129691 125116 60977 381207
4549 381207 -26646 67180 -38415 -246505 232942 33626 29396 -216545 53522 155978 182196
4538 182196 -260807 327546 -7257 -167994 -180926 328879 -201412 -442460 -144168 -138243 196273
4526 -7575 -17232 -80241 246413 263420 121261 -168880 60110 145252 -132059 345106 285858
4515 285858 -143993 -63376 92562 -44099 292320 139730 280421 -80984 -65265 87511 18410
4503 -79123 181768 27286 -73385 146541 -225637 -130242 -129545 -180257 -258454 122444 -110780
4491 209055 158683 -405841 347198 288294 319041 247071 -32987 -40814 -169486 118375 67843
$$ [...]
##END NTUPLES=NMR SPECTRUM
##END=
